##TITLE=Analysis number 324011
Compound Code cc 13010
Book Reference c
Project Code adrs
Chemist Name ian speare
##JCAMPDX= 6.0         $$ Bruker NMR JCAMP-DX V2.0
##DATA TYPE= NMR SPECTRUM
##DATA CLASS= NTUPLES
##ORIGIN= Bruker BioSpin GmbH
##OWNER= nmr
$$ XWIN-NMR		Version 3.5
$$ Fri Nov 10 16:17:41 2006 GMT Standard Time (UT+0h)  MAYBRIDGE\nmr@NMR_250MHZ
##.OBSERVE FREQUENCY= 250.131544655141
##.OBSERVE NUCLEUS= ^1H
##.ACQUISITION MODE= SIMULTANEOUS (DQD)
##.ACQUISITION SCHEME= undefined
##.AVERAGES= 16
##.DIGITISER RES= 18
##SPECTROMETER/DATA SYSTEM= dpx250
##.PULSE SEQUENCE= zg30
##.SOLVENT NAME= CDCl3
##.SHIFT REFERENCE= (INTERNAL, CDCl3, 0, 16.522)
##AUDIT TRAIL= $$ (NUMBER, WHEN, WHO, WHERE, WHAT)
$$ ##TITLE= Audit trail, XWIN-NMR		Version 3.5
$$ ##JCAMPDX= 5.01
$$ ##ORIGIN= Bruker BioSpin GmbH
$$ ##OWNER= nmr
$$ C:\u/data/dgb/nmr/ADRS/2690/pdata/1/auditp.txt
$$ ##AUDIT TRAIL=  $$ (NUMBER, WHEN, WHO, WHERE, WHAT)
(   1,<2006-11-10 16:17:16.90 +000>,<MAYBRIDGE\nmr>,<NMR_250MHZ>,
      <created by zg, POWCHK disabled, PULCHK disabled
       configuration hash MD5:
       49 4B E0 1D 92 C2 6B 37 9F E6 65 BC 52 41 86 1D
       data hash MD5: 64K
       49 28 40 69 28 80 4D 43 E9 22 CC D0 C8 AA 40 97>)
(   2,<2006-11-10 16:17:30.98 +000>,<MAYBRIDGE\nmr>,<NMR_250MHZ>,
      <Start of raw data processing
       ef LB = 0.3 FT_mod = 6 PKNL = 1 SI = 32K 
       data hash MD5: 32K
       B9 97 DB 19 A9 12 89 79 45 85 96 C7 C2 AA 8E EB>)
(   3,<2006-11-10 16:17:32.65 +000>,<MAYBRIDGE\nmr>,<NMR_250MHZ>,
      <apk 
       data hash MD5: 32K
       68 75 4F 29 0B BA 4E FC CE 91 FB 63 37 0F DE 49>)
(   4,<2006-11-10 16:17:33.39 +000>,<MAYBRIDGE\nmr>,<NMR_250MHZ>,
      <abs ABSG = 5 
       data hash MD5: 32K
       AB D7 BF 72 46 1E C9 C1 2B 0B B2 A0 ED B0 F9 9C>)
$$ ##END=
$$ 
$$ hash MD5
$$ 75 DB 62 44 43 99 88 CF 79 01 9E 1F 1A FE 0F D6
##$RELAX= 
##$RELAX= 
##$RELAX= 
##$RELAX= 
##$RELAX= 
##$RELAX= 
##$RELAX= 
$$ Bruker specific parameters
$$ --------------------------
##$DU= <C:\u>
##$EXPNO= 2690
##$NAME= <ADRS>
##$PROCNO= 1
##$TYPE= <nmr>
##$USER= <dgb>
##$AMP= (0..31)
100 100 100 100 100 100 100 100 100 100 100 100 100 100 100 100 100 100 
100 100 100 100 100 100 100 100 100 100 100 100 100 100 
##$AQSEQ= 0
##$AQ_mod= 3
##$AUNM= <au_zg>
##$AUTOPOS= <53 >
##$BF1= 250.13
##$BF2= 250.13
##$BF3= 250.13
##$BF4= 250.13
##$BF5= 500.13
##$BF6= 500.13
##$BF7= 500.13
##$BF8= 500.13
##$BYTORDA= 1
##$CFDGTYP= 0
##$CFRGTYP= 5
##$CHEMSTR= <none>
##$CNST= (0..31)
1 1 145 1 1 1 1 1 1 1 1 1 1 1 1 1 1 1 1 1 1 1 1 1 1 1 1 1 1 1 1 1 
##$CPDPRG= <>
##$CPDPRG1= <>
##$CPDPRG2= <>
##$CPDPRG3= <>
##$CPDPRG4= <mlev>
##$CPDPRG5= <mlev>
##$CPDPRG6= <mlev>
##$CPDPRG7= <mlev>
##$CPDPRG8= <mlev>
##$CPDPRGB= <>
##$CPDPRGT= <>
##$D= (0..31)
0 1 0 0 0 0 0 0 0 0.06 0 0 0 0 0 0 0.0002 0 0 0 0 0 0 0 0 0 0 0 0 0 0 
0 
##$DATE= 1163175435
##$DBL= (0..7)
120 120 120 120 120 120 120 120 
##$DBP= (0..7)
150 150 150 150 150 150 150 150 
##$DBP07= 0
##$DBPNAM0= <>
##$DBPNAM1= <>
$$ [...]
##$SUBNAM7= <"">
##$SUBNAM8= <"">
##$SUBNAM9= <"">
##$SW= 20.6930455092707
##$SWIBOX= (0..15)
0 0 3 0 0 0 0 0 0 0 0 0 0 0 0 0 
##$SW_h= 5175.983436853
##$TD= 65536
##$TD0= 1
##$TE= 683.16
##$TE2= 300
##$TE3= 300
##$TEG= 300
##$TL= (0..7)
0 120 120 120 120 120 120 120 
##$TP= (0..7)
150 150 150 150 150 150 150 150 
##$TP07= 0
##$TPNAME0= <>
##$TPNAME1= <>
##$TPNAME2= <>
##$TPNAME3= <>
##$TPNAME4= <>
##$TPNAME5= <>
##$TPNAME6= <>
##$TPNAME7= <>
##$TPOAL= (0..7)
0.5 0.5 0.5 0.5 0.5 0.5 0.5 0.5 
##$TPOFFS= (0..7)
0 0 0 0 0 0 0 0 
##$TUNHIN= 0
##$TUNHOUT= 0
##$TUNXOUT= 0
##$USERA1= <user>
##$USERA2= <user>
##$USERA3= <user>
##$USERA4= <user>
##$USERA5= <user>
##$V9= 5
##$VALIST= <valist>
##$VCLIST= <CCCCCCCCCCCCCCC>
##$VD= 0
##$VDLIST= <DDDDDDDDDDDDDDD>
##$VPLIST= <PPPPPPPPPPPPPPP>
##$VTLIST= <TTTTTTTTTTTTTTT>
##$WBST= 1024
##$WBSW= 4
##$XGAIN= (0..3)
0 0 0 0 
##$XL= 0
##$YL= 0
##$YMAX_a= 636659
##$YMIN_a= -503349
##$ZGOPTNS= <>
##$ZL1= 120
##$ZL2= 120
##$ZL3= 120
##$ZL4= 120
##$ABSF1= 16.522
##$ABSF2= -4.171173
##$ABSG= 5
##$ABSL= 3
##$ALPHA= 0
##$AQORDER= 0
##$ASSFAC= 0
##$ASSFACI= 0
##$ASSFACX= 0
##$ASSWID= 0
##$AUNMP= <proc_1d>
##$AZFE= 0.1
##$AZFW= 0.1
##$BCFW= 0
##$BC_mod= 0
##$BYTORDP= 0
##$COROFFS= 0
##$CY= 12.5
##$DATMOD= 1
##$DC= 0
##$DFILT= <>
##$DTYPP= 0
##$F1P= 14.0000005364418
##$F2P= -0.99999901652339
##$FCOR= 0.5
##$FTSIZE= 32768
##$FT_mod= 6
##$GAMMA= 0
##$GB= 0
##$INTBC= 1
##$INTSCL= 1
##$ISEN= 128
##$LB= 0.3
##$LEV0= 0
##$LPBIN= 0
##$MAXI= 10000
##$MC2= 0
##$MEAN= 0
##$ME_mod= 0
##$MI= 0
##$NCOEF= 0
##$NC_proc= -4
##$NLEV= 6
##$NOISF1= 0
##$NOISF2= 0
##$NSP= 0
##$NTH_PI= 0
##$NZP= 0
##$OFFSET= 16.522
##$PC= 1
##$PHC0= -41.26694
##$PHC1= 2.429129
##$PH_mod= 1
##$PKNL= yes
##$PPARMOD= 0
##$PSCAL= 4
##$PSIGN= 0
##$REVERSE= no
##$SF= 250.13
##$SI= 32768
##$SIGF1= 0
##$SIGF2= 0
##$SINO= 400
##$SIOLD= 32768
##$SREGLST= <1H.CDCl3>
##$SSB= 0
##$STSI= 32768
##$STSR= 0
##$SW_p= 5175.98343685301
##$SYMM= 0
##$S_DEV= 0
##$TDeff= 65536
##$TDoff= 0
##$TI= <Analysis number 999999
Compound Code 99
Book Reference 9
Project Code 9>
##$TILT= no
##$TM1= 0
##$TM2= 0
##$TOPLEV= 0
##$USERP1= <user>
##$USERP2= <user>
##$USERP3= <user>
##$USERP4= <user>
##$USERP5= <user>
##$WDW= 1
##$XDIM= 32768
##$YMAX_p= 394193709
##$YMIN_p= -318150
$$ End of Bruker specific parameters
$$ ---------------------------------
##NTUPLES= NMR SPECTRUM
##VAR_NAME=  FREQUENCY,     SPECTRUM/REAL,   SPECTRUM/IMAG
##SYMBOL=    X,             R,               I
##VAR_TYPE=  INDEPENDENT,   DEPENDENT,       DEPENDENT
##VAR_FORM=  AFFN,          ASDF,            ASDF
##VAR_DIM=   32768,         32768,           32768
##UNITS=     HZ,            ARBITRARY UNITS, ARBITRARY UNITS
##FACTOR=    0.157963299565203, 1,           1
##FIRST=     4132.6476996994, 0,             0
##LAST=      -1043.33573715361, 0,           0
##MIN=       -1043.33573715361, -318150,     0
##MAX=       4132.6476996994, 394193709,     0
$$ Real data points
##PAGE= N=1
##DATA TABLE= (X++(R..R)), XYDATA
$$ [...]
23308F7995n8586r458n5523j4379k2627J3892l9504J8406J6165k970K4769L1417
23296c0403J7338J9832o6145p6265m727Q2457J7241j2346m3240M6063M7160j7305
23284b0340k9884J2049q0122p255O4008J8009L636l0983k1008P150O1026j12026
23272a35740m0665N3837Q462L0824K1980N9213K571K3908P064R407J6832q946
23260D8747n0492J410n572K8956K0142N9639M5302k4542o3076p6482M5030J7646
23248D6708p020j70143m3137M1278K3030L4575l7212M1803O2988L332K498K2321
23236B1021J9476o5545J3948n015M0248Q6474O472j4633j08806j2969J9153m795
23224d971J1089J2013o7875k3887m38N5970M4593j6789q6799L0881m762M7424
$$ y = [67995, 9409, -49, -55572, -69951, -92578, -78686, -118190, -99784, -83619, -86589, -61820, -30403, -13065, 6767, -59378, -135643, -140370, -57913, -40672, -53018, -96258, -50195, -3035, -20340, -50224, -38175, -118297, -125552, -61544, -43535, -39899, -70882, -91890, -84740, -23714, -135740, -176405, -122568, -114106, -83282, -61302, -2089, 482, 24390, 31454, 40861, 57693, 48747, -1745, -335, -5907, 23049, 43191, 102830, 148132, 123590, 60514, -15968, 29062, 46708, 39688, -130455, -173592, -132314, -109284, -74709, -111921, -70118, -7130, -3798, -1300, 21021, 40497, -25048, -11100, -16115, 24133, 110607, 117079, 102446, -6360, -19329, -176, -4971, 6118, 18131, -49744, -73631, -74069, -18099, 26494, 9705, -77094, -46213, -50975, -3551]
23212c551N3020K8920l5381k2323M9443k3400o4364j3726O414o2147J4402n5384
23200a28077l771J12623R7689o5526o4805L7351J1753m3015o3642q40J40509M7302
23188G7551P6424O1914k5703n3667o6613j10973R592N6900Q4494k9260m7035L2825
23176F6449m3111m5977M3699j3734L9278l2818j2296M2560j1665m7993R5523K2441
23164A02356n8831l6392n8510m7796R996j6879P3721K6561l2754m3129J2711P5610
23152F664J2065J4655m8539o2238j377n090M006k902M2746P2238J1101J8279O8938
23139A30546K2137k2253j8366j29159p0305J4936P7566O9122P9351J0796n8034
23128A06337n6992O6568J4553j47126q8074R2632M4613K984P6809n9115o0715
$$ y = [-3551, 49469, 78389, 43008, 20685, 70128, 46728, -17636, -31362, -24948, -87095, -72693, -128077, -131848, -19225, 78464, 12938, -51867, -14516, -2763, -45778, -109420, -110260, 30249, 77551, 153975, 215889, 190186, 136519, 69906, -41067, -31475, 25425, 109919, 80659, 33624, 66449, 23338, -22639, 21060, 7326, 46604, 13786, 1490, 44050, 32385, -15608, 79915, 102356, 43525, 7133, -51377, -99173, -89177, -106056, -32335, -5774, -38528, -81657, -68946, 6664, 18729, 33384, -15155, -77393, -78770, -83860, -79854, -82756, -40010, 32228, 43329, 61608, 130546, 152683, 130430, 112064, -17095, -87400, -72464, 5102, 74224, 153575, 164371, 106337, 49345, 115913, 130466, -16660, -104734, -12102, 32511, 35495, 112304, 53189, -7526]
23117g526l3751M0850K7192n4645J5432K3880J01789n7559l2732j0849l5650n6301
23105g9870L1405J25730K7597m1799P8529L8966k4101j1854N9716r62j21040j4895
23093F7422J6982j2963j2654j14226m7465O274J2708L2301M1485N7939M5858n0653
23081D3008K7209n2180n5760j09849K9395J04340J15702J6473K1119l0527k0216
23070H8714n644o4629m4402P1890m2991n3423J7676Q7704N4627r001o7616k7661
23058E244L929N5705M338j20300l4161k6737M1079R6830Q2296l4981m7701m6831
23046b1290j3428o7958j0288R5743K2656L9398J7910j2772m6721l0560N425k8506
23034e0391j3432J5043N8083N7832j600l8751O266P6435M9680N161r2769m4808
$$ y = [-7526, -41277, -427, 26765, -27880, -12448, 11432, 113221, 55662, 22930, 12081, -23569, -79870, -48465, 77265, 104862, 63063, 141592, 180558, 156457, 144603, 204319, 203357, 82317, 67422, 84404, 71441, 58787, -55439, -102904, -96630, -83922, -51621, -10136, 47803, 93661, 43008, 70217, 18037, -37723, -147572, -118177, -13837, 101865, 118338, 139457, 108930, 88714, 83070, 18441, -25961, 45929, 2938, -50485, -32809, 54895, 109522, 100521, 32905, 5244, 9173, 64878, 69216, -51084, -85245, -111982, -70903, 25927, 108223, 73242, 25541, -21290, -34718, -102676, -112964, -17221, 5435, 44833, 62743, 49971, 3250, -27310, -21885, -50391, -63823, -48780, 9303, 67135, 65535, 26784, 33050, 109485, 159165, 164326, 71557, 26749]
23022B6749n9404n8943M5332K0464M978Q7591M2648m5280N0591l9670k2955J3141
23010F5242k594j0379Q418R3454n81n4152j3249o4156n249k9918L3925l6238j352
22997a6829M4074J7965K1071M5000J7996n1539K846Q439j25484j3710O6387k5573
22985i357m339R599n3559K5115P0733n5360k5106K9676K076q467l6137l3962R0710
22972A622Q1664Q5015l2309n9178M017k5321k6668k3733J1079o0746j5483R980
22960e0061l2667k0105j2114k1325L7191J1425m4598M6641P1880J416J8774M5326
22948E1783j3354n4928m2449J3034j1045r9267k6774J34432J00336m1694l9081
22937b9007O5622O3257q9995r5991K4717O4200M3260r3664N323P4920N1817j1343
$$ y = [26749, -32655, -91598, -46266, -25802, -20824, 66767, 109415, 64135, 114726, 75056, 52101, 65242, 62648, 52269, 60687, 154141, 153560, 99408, 86159, 22003, 16754, -13164, 20761, -15477, -16829, 27245, 45210, 66281, 111281, 129277, 77738, 80584, 89023, -36461, -50171, 16216, -9357, -13696, -4097, -57656, -32541, 38192, -17168, -42274, -12598, -10522, -18989, -55126, -89088, 1622, 83286, 168301, 135992, 76814, 80831, 55510, 28842, 5109, 16188, -44558, -60041, -50061, -82728, -102833, -114947, -136272, -99081, -87656, -132254, -85613, -13733, -12317, 6457, 51783, 38429, -16499, -58948, -45914, -56959, -156226, -183000, -48568, 51768, 10074, -29007, 36615, 99872, 9877, -86114, -61397, 2803, 46063, -47601, -42278, 32642, 84459, 73116]
22925G3116m0252j2337K2865k9071J264J1644J9917M597n7577k3765j2897j7033
22913e9529P819K9395M4623k6730K2046L7363L3457k1855k0124K2026R130q4642
22901g021l6615M8418K9019J142K736n2323K1415j0015O4074P7687n5913k8263
22889E4341k2783n9713j1320n835j8491k1976N1248j252j0251r4453l2727N5525
22877a17687O8298Q6703P2725q5137l5357J1791K7709o9103m2856J559O3493J12142
22865I4280p3178o0653j7370J6844Q5850L5254k2592o9737m4832p0635m4595P256
22853a64108J33768O3709J7461j8331j9537K1421M406n7360p7974j8473L6326
22842g8692J04906O8669r7168o1576j1875N4975P5612L1809j7062k8763n3267
$$ y = [73116, 32864, 20527, 43392, 14321, 15585, 27229, 47146, 51743, -5834, -29599, -42496, -59529, -51710, -22315, 22308, -4422, 17624, 54987, 88444, 66589, 46465, 68491, 77621, -7021, -43636, 4782, 33801, 34943, 37679, -14644, 6771, -3244, 60830, 138517, 82604, 54341, 31558, -28155, -39475, -45310, -63801, -85777, -34529, -35781, -46032, -140485, -173212, -117687, -49389, 37314, 110039, 24902, -10455, 1336, 29045, -40058, -82914, -81355, -17862, 94280, 21102, -39551, -56921, -40077, 45773, 81027, 58435, -11302, -56134, -126769, -171364, -164108, -30340, 33369, 50830, 32499, 12962, 34383, 38789, -18571, -96545, -115018, -78692, 26214, 94883, -2285, -63861, -75736, -20761, 54851, 86660, 69598, 40835, -12432]
22831a2432q134k1822o6811J5845l0174k5960l1984L2613R9320j7614l0819P4404
22819b3568J5926j0367R294j2264J6497j3494L187k180m8271p1489L3986L8376
22807f4367k143M0859M4311j3379q0878o2249j000M8440n2939Q2331m971r176
22795g5161m2957p6280k1753O2761J6577Q755P6052P627k9469Q2579P1259Q219
22783H8209j09412k1037P099o351l5577J14958N506n3123o0990k5006l2100j4172
22771a41996K6295l3392M0907L8401m2668N988J7481K9785k8116l2792O037K618
22759a11452J13J1278R2263J2122l2188N461n4471N3449R3673j3242n9560n1572
22747e4126m84o116J8201k7375K551R508J7251k895n496N837L198K319n8518O869
$$ y = [-12432, -20566, -42388, -109199, -93354, -123528, -149488, -181472, -148859, -49539, -67153, -97972, -23568, -7642, -18009, -8715, -20979, -4482, -17976, -14789, -16969, -65240, -136729, -102743, -64367, -66510, -25651, 18660, 5281, -75597, -137846, -138846, -90406, -143345, -61014, -65985, -75161, -118118, -194398, -216151, -153390, -136813, -128058, -52006, -44379, -73848, 8731, 79990, 88209, -21203, -42240, -35141, -41492, -77069, 37889, 43395, -9728, -70718, -95724, -127824, -141996, -115701, -149093, -108186, -69785, -112453, -106465, -88984, -59199, -87315, -120107, -114070, -111452, -111339, -100061, -7798, 4324, -27864, -22403, -76874, -23425, 70248, 57006, -2554, -54126, -54610, -60726, -42525, -69900, -67349, -57841, -40590, -43485, -48981, -43144, -39946, -37627, -96145, -89276]
22733h9276J12862L995m1276L4708L4337R655r9318k1732J36686O4452m4513p2155
22721B8425J2756L4816l2971L2381O7876O4561K144j80661l4313Q0368k506j2225
22709F0651l8337l4529r572K2510K2765j2232j6578k2681k3911R5070R832j27363
22697g4375J2655J9860M8545m0873K3442l3531p8167K5475K6914P2396k741k0539
22685b0939k715L9401m5430l7885N9594P6817Q1926m9623r3526J1662Q7967K6023
22673A33272j6953j3272n5190m3982J4868J5453k8234o2263K3351M5948O3616
22662G6614n3744l24M7107o3344L8322N723o1985j09566l0456O1263K2697M8970
22650a8723k97L2938K3977N853l0243k7940J9366L6396l2429n5729J01790k9405
$$ y = [-89276, 23586, 27581, -13695, 21013, 55350, 65005, -34313, -56045, 80641, 145093, 100580, 28425, 41181, 75997, 43026, 75407, 143283, 207844, 209988, 29327, -4986, 75382, 72876, 60651, 22314, -12215, -21787, 723, 23488, 11256, -5322, -28003, -51914, 43156, 52988, -74375, -61720, -41860, 6685, -34188, -10746, -44277, -122444, -96969, -70055, 2341, -400, -20939, -23654, 15747, -29683, -67568, -7974, 68843, 150769, 101146, 7620, 19282, 107249, 133272, 116319, 103047, 47857, 3875, 18743, 34196, 5962, -56301, -32950, 12998, 76614, 22870, 22546, 69653, 6309, 44631, 50354, -11631, -121197, -151653, -90390, -67693, -18723, -19020, 13918, 37895, 43748, 13505, -14435, 4931, 41327, 8898, -46831, 54959, 25554]
22638B5554q8143M763R933K7187k0475n9105k2962J4352M1529L6391K7622M3395
22626D0041k9820K5844j1572m1469j2452m0663P0648M4914l0937j08672K0260
22615g3878J2078k2782L1111l1297l4521q0671n4609J24638N7397J01562J04771
22604A33799m6298j21623o1282L629k2674L7503R3636J9129j8796j87l9548j198
22592b3910m1183j3167N2897q3569m4841P1254L5791j01121k8618J3640P228L2172
22580a23427M6469M4461N4888k3536k8986J3684l7643M2293J02375J2153j1327
22569I1404m9236J1555n4953K5749K8942J9398p1108p8042k1619N0673j8729k1028
22557h6994K4644J6034R788M6507J28098n2150j41780k5287n157L8125R2455o010
$$ y = [25554, -62589, -57826, -47893, -20706, -41181, -100286, -123248, -108896, -67367, -30976, -3354, 40041, 10221, 36065, 24493, -16976, -29428, -70091, 557, 45471, 14534, -94138, -73878, -61800, -84582, -53471, -84768, -119289, -199960, -254569, -129931, -72534, 29028, 133799, 87501, -34122, -95404, -91775, -114449, -76946, 16690, 35819, 17023, 16836, -22712, -23910, -65093, -78260, -25363, -108932, -153773, -82519, -46728, -147849, -176467, -162827, -155599, -123427, -76958, -32497, 22391, -1145, -30131, -16447, -54090, -11797, 90578, 102731, 91404, 42168, 53723, -1230, 24519, 53461, 72859, 1751, -76291, -97910, -47237, -65966, -86994, -62350, -46316, -36528, 9979, 138077, 85927, -55853, -81140, -86297, -48172, 44283, 38273]
22545C8273k155O224k6748j2842p0101L1121J26938j5913q3851q9338R999m9571
22533a37964J8237P9709M2611N3952Q9563K2117n8149j09357n4493j0471J37580
22522G3335K9950l9867K9464K1422o549M6692l6884r72o5902q4779o888Q6585
22510D5607j01766r857J01883K793j4649O2513q3332p7052k8507J6674m1655L1264
22498i6084j571j8542R0234K8808Q3705N1092r6695r4447J7525J1841j3813J3369
22486b4578M3082m031l4098K5733P74k8895m0012L923m6452M1059O0296O2497
22474E9298P0632q822n0070p7014q898m1981K2299m2676k0219m2733K5704P3005
22462d1475M8347K2372l5710L4851P2358j6734k3147J1958k502m5535j03374J854
$$ y = [38273, 36118, 42342, 15594, 2752, -67349, -36228, 90710, 74797, -9054, -98392, -88393, -137964, -119727, -40018, 2593, 56545, 146108, 168225, 110076, 719, -53774, -64245, 73335, 103285, 63418, 92882, 114304, 107755, 154447, 117563, 116591, 50689, -34090, -40978, 45607, -56159, -66016, 35867, 38660, 24011, 86524, 3192, -73860, -102367, -85693, -127348, -96084, -97655, -116197, -25963, 2845, 86550, 137642, 40947, -53500, -35975, -24134, -37947, -24578, 18504, 14473, -19625, 6108, 6882, -22013, -62025, -58102, -104554, -63495, -3199, 59298, 129930, 121108, 71038, -5976, -14874, -56855, -34556, -77232, -97451, -140184, -114480, -41475, 6872, 29244, -6466, 28385, 100743, 84009, 60862, 72820, 70318, 24783, -78591, -76737]
22450g6737J0619J5698L1365q22M2267p4962m0249m8308k8479J3648Q7548Q2126
22438A3714O6261l6727J6650k6328P3206J1873r647p3691l7971m6554L9596n0380
22426e9998o8968N2244j7449J3295P241l451J6962q510p9024k5715M8575O2967
22414f1831L6276J03338j217o7923o0600k6073M4426O9154k9496o4362L6063L0178
22402G933l508l7582l2186q9736O8499P7637j1139j7445K4287K1678Q3915j5450
22390G6903m7842n1704k3204L0486N0669J2331P7726N1235o4410q04j2629n1867
22378D6890M0030R0219m7011j13189J9598O3363o3825m8945k166L8000Q0210Q6125
22366A89299k6765n3338P927k5642j9665L9172l7291m0438N5411j4877q540N142
$$ y = [-76737, -66118, -50420, -19055, -19877, 22390, -52572, -92821, -141129, -169608, -155960, -68412, 13714, 79975, 43248, 59898, 33570, 106776, 118649, 109002, 35311, -2660, -49214, -9618, -59998, -128966, -76722, -94171, -80876, -73635, -77086, -60124, -68634, -147658, -173373, -124798, -61831, -25555, 77783, 76566, 8643, -51957, -78030, -33604, 35550, 6054, -58308, -22245, 7933, 4425, -33157, -65343, -155079, -86580, -8943, -20082, -37527, -13240, 8438, 92353, 76903, 29061, -22643, -45847, -15361, 35308, 47639, 125365, 176600, 112190, 111386, 98757, 46890, 86920, 177139, 130128, 16939, 36537, 99900, 36075, -12870, -15036, 22964, 103174, 189299, 162534, 109196, 117123, 91481, 71816, 110988, 73697, 33259, 88670, 73793, 65253, 70395]
22354G0395K0730k2649l0214j741j389P7208l517r5963k8972m8446q1964k7757
22342a74279K8410P6425L3450J1123K5739L0601L6841R839J8257j19308j31487
22331a54389l7362J30786N3893l6932j5544o0090k8112J6795R754N4567L9892
22320b6742k9169o6059p407J12571L0808j5485L2582K4196K6123l170n0545J8553
22308D6256k4096j1345m4143J19423L3197K299q4716m4916J2396j19090q7668
22297b02403K1683R8516M9701J2938n824k6868m3039l2273M0894N002j04865K3094
22285a63444O2217N3440j8660K1110l7140o2978J3452J3148l4509M4951J26919
22274A8506J6089K3710r0930r0924J9249L3730k3761l9722Q0521J6421o4683M8436
$$ y = [70395, 91125, 68476, 38262, 36521, 35132, 112340, 108823, 12860, -16112, -64558, -146522, -174279, -145869, -69444, -35994, -24871, 868, 31469, 68310, 78149, 96406, -22902, -154389, -191751, -60965, -7072, -44004, -59548, -119638, -147750, -130955, -121201, -66634, -26742, -55911, -121970, -129377, -16806, 14002, -1483, 31099, 55295, 81418, 78248, 27703, 46256, 22160, 10815, -33328, 86095, 119292, 121591, 36875, -8041, 4355, -114735, -202403, -180720, -82204, -32503, -19565, -25389, -52257, -95296, -127569, -86675, -81673, -186538, -163444, -101227, -47787, -66447, -45337, -82477, -145455, -132003, -118855, -153364, -108413, 18506, 34595, 58305, -32625, -123549, -104300, -70570, -94331, -134053, -53532, -37111, -101794, -53358]
22262e3358K23l3365J6434j5032K3504q4538P214O439L8414M8091Q1954R9223
22250A35203L036o7510j28942n7885P181K3653L2760L6369P7905m3566j6987l0128
22238b8911O65o4890q4643L6821R4456M4442L9876L5625N0737n53n5374J5627
22226H3878k4959M921n4269o4018l4244j9736O9523N5688n1466l6389m5325l75
22214a16771p329O148J14159J39453n9810l5937k0727l1396O008N0453m0439o7960
22202f4148M2243K4047M5315L7045j3695L5672j7124k4699K8888l2744k7927l1801
22190A072L8887l6594K2217m0985p0056q6592m3934J0789P1196P6667q736p6367
22178a42436R637L9348J2021l2854L1081L3002R9546l6000o4703k4939L1263N5440
$$ y = [-53358, -53135, -86500, -70066, -85098, -61594, -146132, -138918, -132479, -94065, -45974, 35980, 135203, 138239, 70729, -58213, -116098, -108917, -85264, -52504, -16135, 61770, 18204, 1217, -28911, -28246, -93136, -177779, -140958, -46502, -2060, 37816, 73441, 124178, 123625, 68251, 83878, 58919, 63840, 9571, -54447, -88691, -108427, -38904, 16784, -34682, -71071, -116396, -116771, -124100, -117952, -3793, 135660, 75850, 39913, 19186, -12210, -6202, 44251, 3812, -64148, -21905, 2142, 47457, 84502, 70807, 106479, 89355, 64656, 93544, 60800, 32873, 1072, 39959, 3365, 25582, -15403, -85459, -172051, -215985, -205196, -134000, -57333, -66069, -142436, -132799, -93451, -81430, -114284, -83203, -50201, 49345, 13345, -51358, -76297, -45034, 10406]
22166A0406K7224n241j6998O82l1035J2111p8353N567Q5803O0913l7817L0674
22154F3936j8027O4624K7204j63015m0914M3802j7722j7457L7667L1389k714n0957
22142d2184Q3471L7416j308K3889O9562j33791j881J5245j03298j6907j848M988
22130f6646l7458K9215O9717K9359l8196o3474k0068M1218j00562M152k495N853
22118a49385M201O8067K3348p194P9805J66239M194p8351j54817j06628M3116
22107a07405L4347l160N8630Q0924L0147L1941q396o0210J0322r6131m7318K5338
22095e0971o13n1646j6028K1940O5014J009l237j150J4559m5208J5646K5859l233
22082b8059j7518J4047N426L3088n19l5437N7071M0431J4124l5692j41984j4382
$$ y = [10406, 37630, 32389, 15391, 16073, -14962, -2851, -81204, -75637, 10166, 71079, 33262, 63936, 45909, 110533, 137737, -25278, -66192, -22390, -40112, -57569, -19902, 11487, 8773, -42184, 41287, 78703, 77395, 101284, 170846, 37055, 35174, 50419, -52879, -69786, -71634, -66646, -104104, -74889, -5172, 24187, -14009, -77483, -97551, -56333, -156895, -152743, -155238, -149385, -145184, -77117, -53769, -60963, 18842, 185081, 189275, 110924, -43893, -150521, -107405, -73058, -76218, -17588, 63336, 93483, 125424, 117028, 56818, 67140, -28991, -76309, -50971, -51584, -103230, -119258, -97318, -32304, -31295, -34532, -35682, -21123, -66331, -50685, -24826, -28059, -45577, -31530, -26104, 6984, 6465, -28972, 28099, 68530, 82654, 46962, -95022, -109404]
22070a09404K12M6865R0622K8417m4808l7561q584l2875l968J3786J2133R273
22058c5892O9736k5933n2945L9052J0129R8476j2983r957K2749J6830m5951K7580
22046A00891O894k1292l5297l8935J345k6709L5576L7024k8192m6291j0353N0548
22034B5209J9340K0627J3948j1594l657k1725k0912M1317O644l5155j08365N5408
22022a8915J31927N7095r3075j09551J8481O4365O020m9018o3575q0827M195j6349
22010a49227l0118J4121K2694j901J8728o3283L3190Q0037K7480M7804o4523o0954
21998a25952N7526K3469K1038p765J6974Q786q567L0637R0827n9873k7700J8710
21986C8110J5305J7285J9369o9815l4642J1129q9677k721M231R1704O142m544
$$ y = [-109404, -109192, -62327, 28295, 56712, 11904, -25657, -34241, -67116, -71084, -57298, -45165, -35892, 33844, 7911, -45034, -5982, 4147, 102623, 89640, 79683, 102432, 119262, 73311, 100891, 107785, 86493, 51196, 12261, 13606, -13103, 22473, 59497, 31305, -14986, -25339, 25209, 44549, 65176, 79124, 67530, 63873, 42148, 21236, 62553, 69197, 34042, -74323, -18915, 113012, 170107, 77032, -32519, -14038, 50327, 56347, 7329, -56246, -137073, -132878, -149227, -179345, -165224, -142530, -144431, -125703, -188986, -155796, -75759, -48279, -475, -64998, -125952, -68426, -44957, -23919, -31684, -14710, -5924, -14491, 16146, 106973, 47100, 19400, 38110, 53415, 70700, 90069, 20254, -14388, -3259, -92936, -95657, -91426, 278, 6420, 1876]
21974A876k6596M7385n2143J2976P0379K4556j33829k454J2296l8857K3591O0739
21962h1Q881l2613m0661N2025M3429K0598K0368l3024P2776l1848q4888n5152
21950f0190p149k9393k0479K7497K0120l2576J04542l46O515j1374n5676n3778
21938a12287p053N0238N4941l174O7045K7457P1151M0993j40625p7022j06188
21927a34524K0800J28762K7131j9884k1065m5255m6323R812l4064L6029J11176
21916C2595J1719p659M1268k5436K139O208p8145m0632J9038l0620p2556l3880
21904a75961l5727J9920R8949O3926O0656j7812M9101O5731k7425j19194l2520
21893e0356l5527q2083m2487Q6829J36207N8818J8894o858k2387j6409j12164
$$ y = [1876, -24720, 22665, -29478, -16502, 53877, 78433, -55396, -57850, -45554, -84411, -60820, -81, 8800, -23813, -64474, -12449, 30980, 51578, 71946, 38922, 111698, 79850, -5038, -60190, -67339, -96732, -117211, -89714, -69594, -102170, 2372, 2026, 8541, -2833, -58509, -112287, -119340, -69102, -14161, -17335, 49710, 77167, 148318, 189311, 48686, -28336, -134524, -113724, 15038, 42169, 22285, 1220, -44035, -90358, -80546, -114610, -78581, 32595, 44314, 36655, 77923, 52487, 54626, 60834, -17311, -57943, -38905, -69525, -142081, -175961, -211688, -191768, -92819, -28893, 31763, 13951, 63052, 128783, 101358, -17836, -50356, -85883, -167966, -210453, -123624, 12583, 71401, 90295, 83437, 61050, 44641, -67523]
21882f7523l124L048K1770n5939j2298M3074k1575N8780J5718M234m9884m5983
21870a09702m8010M2143J31889J2724L9119j5762n5901j4572p6379N33k3207K3016
21858i4109O8836j0430q1213N7977Q78N8155j06647l0949L072K019J20573l8100
21846d9938J8591R6717N5831k8806n2059l7045J5776j8336l9796K1132M3997J6597
21834D2661o3726L5302j4723k7265J7809j2493j0065L2397n438L1677j3786k8470
21822a6120k9550l1015K989M221l6523O7551M4007P4447l4368p0890l3740l4205
21810i3196k704J2290j2843Q2070K0574q8735K201k4964m9750L0000J21681j8435
21798b1811k7379n2941K7443n27p0807J8128Q318m889N1194O9913K3672R8947
$$ y = [-67523, -70647, -67599, -45829, -101768, -114066, -70992, -92567, -33787, -18069, -13835, -63719, -109702, -157712, -115569, 16320, 29044, 68163, 52401, -3500, -18072, -94451, -93918, -117125, -94109, -25273, -35703, -116916, -58939, -58061, 94, -106553, -137502, -134430, -132411, -11838, -49938, -31347, 65370, 121201, 92395, 40336, 3291, 19067, 731, -39065, -17933, 26064, 42661, -21065, 14237, -486, -27751, -9942, -22435, -32500, -103, -5541, 26136, 12350, -16120, -45670, -76685, -73696, -69475, -105998, -38447, 5560, 80007, 45639, -25251, -58991, -93196, -95900, -83610, -96453, -14383, 6191, -82544, -80343, -105307, -155057, -125057, -3376, -21811, -49190, -102131, -74688, -75215, -146022, -127894, -119576, -124465, -73271, -3358, 20314, 119261]
21786A19261K1230p1898m2918l4330o9540J5131k940J2167N9022N5263P9931J868
21774A42247O759l5578p2557n5273K2296P1180Q2863l5234J2062p0290j73440
21763a04965j09954N9837O7151P2310J7876J317j6399q5227M0906P4067L699j12926
21751i2308m2524L6N3315P180J5386L3174J28838l0746l1929j07068m979J8555
21739e3070K748J0600P7675J3316o1322M4564l2266j43333j0747J8234L3293J03760
21727C452J09412J3446m0094p6044j52645n1443N7008M4700m9267N9537L3558
21716d8380j7277K551K530k3206n5231j1301j593R3767L5524M8557L7195m0372
21704B2764L5452j1506k6785r411n462n695M7730J8475K8287p278M530j18172
$$ y = [119261, 140491, 68593, 25675, -8655, -78195, -63064, -66004, -53837, 5185, 60448, 140379, 142247, 149006, 113428, 40871, -14402, 7894, 79074, 161937, 126703, 138765, 68475, -104965, -214919, -155082, -87931, -15621, 2255, 3572, -12827, -98054, -57148, 16919, 20618, -92308, -134832, -134796, -81481, -74301, -58915, -25741, 103097, 72351, 40422, -66646, -71625, -53070, -50322, -39722, 37953, 51269, -10053, 34511, 2245, -141088, -151835, -133601, -100308, 3452, 112864, 126310, 86216, 10172, -142473, -193916, -136908, -92208, -141475, -81938, -48380, -65657, -63106, -60576, -83782, -139013, -150314, -151907, -58140, -22616, 25941, 63136, 22764, 58216, 46710, 19925, 10514, 5052, -643, 47087, 65562, 93849, 86571, 91101, -27071]
21692b7071k2807O8654O8393N9442l4381p4823o6232k3699o0898L2283M4813Q639
21680b7687O1107j2140q612k6985o4431P820J6031k9912m0684M6683R0341r360
21668B171k5189N268Q4234k8538j03636n4863R12l769k5799Q0312L5833k8957
21656f2021K4255J2359k2749J2602L7913r248o2650L7513J07176l3664j47864
21645a06378j26589q927J20508Q8250m0503o7674O4110O7856L6899q509l4829
21634a5786o8978k9549J25424M2098k0866n5166n6948k3891P407O5662J7320P966
21622e307q8773M7894O8647m0734N2328O8052m5753k9613j8599J5793k1646M2337
21610D4626l4851n5592n5702j5777N8693J8668P103M2864J8022l8255r1783N7001
$$ y = [-27071, -49878, 18776, 87169, 146611, 112230, 37407, -28825, -52524, -113422, -81139, -36326, -27687, 33420, 21280, 12668, -14317, -78748, -70928, -54897, -84809, -125493, -78810, 11531, 2171, -23018, -17750, 66484, 37946, -65690, -120553, -119641, -123410, -149209, -68897, -33064, -62021, -37766, -25407, -48156, -35554, 2359, -6889, -69539, -32026, 75150, 41486, -106378, -232967, -241894, -121386, -33136, -73639, -141313, -77203, -9347, 27552, 19043, -15786, -84764, -114313, 11111, 53209, 32343, -22823, -79771, -103662, -96255, -30593, -13273, -5307, -94080, -46186, 22461, -18273, 34055, 102107, 56354, 26741, 8142, 23935, 2289, 44626, 9775, -45817, -101519, -117296, -58603, -39935, -32832, 10032, 28054, -10201, -101984, -44983]
21598d4983J18599J2645j7474j7041K4961K7925j00081J1519p5874o9857O3749
21587f5912j4947k9674M5323r911L5417K5338q346K6534O9641J1026p8245J7573
21575B3817P7611o686M4188j6269N591p6597q7246j9465j0146K4991J3745j6330
21563d2796l6325L1719P7924L2589O2976M569r5903m9584k5254j5458Q5498N0920
21551H0875o0942l6721M2655m3411r268J2385O624k4840l1295m5892P6032O6800
21539C3002o0306r3117P467J12881L956k2195L1268K2490K2717J9185q749K324
21527G0923j55617j00548R4823J46842M7120l7564l7161q0591k3548k5317j8281
21516a18919j0634k0316r383q980M6820j2703R2612Q4848R4865q0707o8994n1710
$$ y = [-44983, 73616, 86261, 68787, 51746, 76707, 104632, 4551, 16070, -59804, -129661, -65912, -80859, -110533, -65210, -75121, -39704, -14366, -22712, 3822, 73463, 84489, 6244, 23817, 101428, 94742, 138930, 122661, 128252, 51655, -35591, -55056, -65202, -40211, -26466, -42796, -79121, -47402, 30522, 63111, 126087, 130656, 34753, -14831, -40085, -55543, 29955, 80875, 19933, -16788, 25867, -17544, -26812, -14427, -7803, -32643, -63938, -109830, -33798, 33002, -27304, -120421, -112954, -73, 3883, -18312, 12956, 35446, 58163, 77348, 68599, 70923, -84694, -185242, -90419, 56423, 103543, 65979, 28818, -51773, -75321, -100638, -118919, -129553, -149869, -159252, -168232, -121412, -134115, -41503, 43345, 138210, 57503, -11491, -63201]
21504f3201J7363Q2040j2218k2066R8529M0521j32623m0350k7619j2678K8673
21493d3629M2050j5082J2103N5101p4757n5687P91N5362P168L2622J7051q309
21481B4784l2302J0730n683O1895K2879j7322j23625j0658P6835q4806L1833P3933
21469B8493p5594J6157K0257J8878M2527k5346j1976J6275O1433O6811j4901J8054
21457A61068L9574k1490q291k9499M1389j7174o7047J7233J9363r6289j12119
21446g3282q029M2787j4912j7668K3003J0894Q17M819K4468M5638O040O5137k2649
21433H7063l1797m3183j01755l3063j5398k394J2740J37279q05L0481P9021p1301
21421D6888p9822j1188o1483j3187Q7451K0980K0229Q931L6851j7922q0040K1611
$$ y = [-63201, -45838, 36202, 23984, 1918, 100447, 140968, 8345, -32005, -59624, -72302, -43629, -1579, -16661, -4558, 50543, -24214, -79901, -79110, -23748, -16580, 16042, 33093, 24784, -7518, 3212, -2471, 59424, 82303, 64981, -58644, -69302, 7533, -77273, -45440, 28493, -47101, -30944, -10687, 8191, 50718, 25372, 13396, 29671, 91104, 157915, 143014, 161068, 200642, 179152, 170861, 141362, 182751, 165577, 98530, 115763, 135126, 38837, -73282, -81311, -38524, -53436, -71104, -48101, -37207, -36390, -31571, -7103, 38535, 44575, 109712, 87063, 55266, 12083, -89672, -122735, -138133, -140527, -127787, 9492, 8687, 39168, 118189, 46888, -32934, -44122, -105605, -118792, -31341, -10361, 9868, 18799, 55650, 37728, -42312, -20701]
21409b0701o46l2340J5156J9444Q152J1366p2502L040K04N2836L7538m1991K775
21396a7669n9991J08262K0491m5109N466P4492L6966r0217j30346k1568K323n9910
21384a76810M7233N5102L9481N1132m851J298k354r0866k3445P3414P1430k0222
21372B0542J812L145J0166l1188M7882j0420j3941k9681j46224J9766J3366m0949
21360a55724M9975L7333p7348l1684Q3924O7861J03350N8654n9611n200L5918
21349A07448j51720K5089M3483L4808M3023k6080q4048K5034M5876N16R812j02679
21337b9438o7937K447J02975j6019q3562J4483J4268p8774k42O9439N1944j4972
21325c5388l418L8351K8106N2380J6004L5076n1699j44763o8478K3216L8114K4130
$$ y = [-20701, -21347, -53687, -38531, -19087, -10935, 431, -72071, -69031, -68827, -15991, 21547, -20444, -17669, -77660, 30602, 51093, 5984, 11450, 85942, 122908, 32691, -97655, -119223, -116900, -176810, -129577, -74475, -34994, 16138, 11287, 12585, 10231, -80635, -104080, -30666, 40764, 20542, 22354, 25499, 35665, 4477, 52359, 41939, 27998, -1683, -147907, -128141, -114775, -155724, -105749, -68416, -145764, -177448, -93524, -25663, 77687, 136341, 76730, 71530, 107448, -44272, -19183, 24300, 59108, 102131, 76051, -7997, 17037, 62913, 63429, 73241, -29438, -97375, -94928, 8047, -7972, -91534, -77051, -62783, -141557, -141799, -72360, -20416, -35388, -38806, -455, 27651, 80031, 96035, 131111, 79412, -65351, -133829, -110613, -72499, -48369]
21313d8369m690o6838n4227k2920L1988m1607k050J08742M7741N537k210j04438
21301a53341N8919N5141k8992K3417l1807r157l9728K7462L0950j2552M3686L5570
21289d32J3480l3757p6636k4754L4502O0845n2111m5461L4583L5020P8095N1957
21277G5331o3004p9380P5965M4392l3680l9339k8770N0792M4560J2403m0750l5633
21265a7113M1863M0466J2050j1941o1680J9290k0332j0966k7001J9929Q2693M722
21253G1980J8556m9917k8337L3081L5216k8660m3621l3187r0304O400P8585P917
21241b2291j2767j2403k2122J2391k8391m0908O36j01331N7619M7370P0241J7519
21229c4437R843J4139l5541j03089N1313O3215O759m9023O5801J22911J0070R007
$$ y = [-48369, -53059, -119897, -174124, -197044, -165056, -206663, -208713, -99971, -52230, -46693, -48903, -153341, -94422, -39281, -68273, -44856, -76663, -85820, -125548, -98086, -67136, -79688, -36002, -432, 13048, -20709, -97345, -122099, -87597, -26752, -78863, -124324, -89741, -54721, 23374, 75331, 12327, -67053, 8912, 53304, 19624, -19715, -48485, 2307, 46867, 59270, 18520, -17113, 24750, 65216, 77266, 65325, 3645, 22935, 2603, -8363, -35364, -15435, 67258, 71980, 90536, 40619, 12282, 45363, 80579, 51919, 8298, -24889, -115193, -108793, -30208, -22291, -35058, -47461, -69583, -57192, -85583, -126491, -125855, -227186, -169567, -122197, -51956, -34437, -24594, -10455, -45996, -149085, -97772, -34557, -27798, -76821, -11020, 111891, 121961, 130968]
21217A30968k9836n810L8361J873r1084r3656n6150Q5124P1787j8372j5029J10035
21205A28211J06399p4447j20414o2475m3801k1344R0813M0560k2406K475L2762
21194E6333J671k1392m0679O1797J9976n7285m2617p718k7797o73K5575j4052
21182d6861l7248K6875N897l0976N7655m5868m7631k8739k5745L3820M3262L8721
21170e6838J6126J1818M2084M5586J4367j5784l4674L1019m2151m8923k1731N5160
21158c941Q7532L8973K1414m6354M2022j9291o5974k9380j00820l0148J1158N4580
21146d0229j3471q5614n765O6641M8890m0372K22L2223K7524K8441n0270m5811
21134g7591k6786M1410J0940L7629N2952N4231p3246p3468O4078q792o4589j4303
$$ y = [130968, 101132, 95322, 133683, 135556, 44472, -49184, -105334, -20210, 51577, 33205, 18176, 128211, 234610, 160163, 39749, -22726, -66527, -87871, 2942, 43502, 21096, 23571, 56333, 58004, 36612, -4067, 57730, 77706, 20421, -22196, -29914, -57711, -58384, -32809, -46861, -84109, -57234, -51337, -82313, -24658, -70526, -118157, -146896, -172641, -138821, -95559, -56838, -40712, -28894, 13190, 58776, 73143, 57359, 22685, 53704, 11553, -37370, -59101, -3941, 83591, 122564, 143978, 97624, 139646, 120355, 54381, 25001, -75819, -105967, -94809, -40229, -53700, -139314, -145079, -78438, -29548, -69920, -69698, -37475, -9951, 18490, -31780, -77591, -104377, -62967, -52027, -14398, 38554, 92785, 19539, -53929, 10149, 1357, -63232, -77535]
21122g7535J5486L9395n0073k3418L1138n365L005J9859J8718o4560J6103j4529
21110i1776q0124M0809N1950O0142P984k3663L2059J07482M6788l3221j16001
21099B429j4871K8084M8637r3004o2311k0602M9354J66705P564K7353j0161J873
21087A31050l9985q8377l8353J5355O5539k363l7390r1253R225r675J8640O9660
21075B073N433L9142m5860m0115J8864j7463O612M2892J20997Q5649l3906m7592
21063A36726j24679K9155L7718o734j4989k437m1764R085j5037j6494K7473j5327
21051B696m0685J6776K7148R764j1934L4295k0266J2618J995o594K888r8452K9482
21038d0269O8848j4312J9915k2596j33737Q7590N9164J036n5128J7339O6996Q677
$$ y = [-77535, -62049, -22654, -72727, -96145, -65007, -70372, -67367, -47508, -28790, -93350, -77247, -91776, -171900, -131091, -79141, -18999, -11015, -34678, -2619, 104863, 151651, 118430, 2429, -12442, 15642, 64279, -28725, -91036, -111638, -62284, 104421, 111985, 139338, 129177, 131050, 91065, 2688, -35665, -20310, 45229, 42866, 5476, -85777, -76552, -86227, -67587, 2073, 7506, 46648, 788, -39327, -20463, -37926, -31314, 11578, 132575, 218224, 184318, 136726, 12047, 41202, 78920, 72186, 57197, 54760, 12996, 22081, 7044, -9450, 18023, 2696, -37989, -21213, 5935, 15699, 3765, 38060, 17794, 30412, 32407, 25813, 28701, -69751, -40269, 28579, 14267, 34182, 11586, -122151, -34561, 24603, 25639, -29489, -12150, 54846, 63523]
21026F3523M1758n3294m7479n8749p8282J5050N5906K273K4295O6830J922K3448
21014E7201Q087j11018m3911l4165o7196J9096R6899P0997L9632J2758l3638N8725
21002G3467k0222o7229q2818Q236l520L6674j5441r796m6043j8817R2236P1623
20990A8350L6534j7733p2509o5908O1416Q9878P9027L144m0605m4742M3443p4350
20978A5945o7720O0783J1206p3576p8213r155O6329M6308Q570N2715J2262p7003
20966c1549m064K83l6121k1805l1632n766M6334O4123N0806o5937J2393N9459
20954C6524N1369o4814J381M2198m1598J1766k5452o5453M2101J4566q2403r4399
20942a74214l0757O4886J02305K0859K8549M061n923N2893k96p8926J7435L6249
$$ y = [63523, 105281, 51987, 4508, -54241, -132523, -117473, -61567, -59294, -34999, 31831, 33753, 57201, 65288, -45730, -89641, -123806, -191002, -171906, -75007, -4010, 35622, 48380, 14742, 73467, 53245, -13984, -96802, -88566, -92086, -55412, -70853, -80649, -126692, -145509, -53273, 18350, 54884, 37151, -35358, -101266, -39850, 50028, 129055, 132199, 91594, 46852, 90295, 15945, -51775, 9008, 20214, -53362, -131575, -140730, -74401, -28093, -19523, 33192, 45454, -31549, -35613, -35330, -71451, -93256, -124888, -130654, -84320, -20197, 30609, -35328, -22935, 36524, 87893, 23079, 24460, 66658, 25060, 36826, 11374, -54079, -11978, 2588, -79815, -174214, -204971, -140085, -37780, -16921, 11628, 15689, 9766, 62659, 62363, -16563, 872, 37121]
20930C7121j9074Q1394J1139k5687J324n0609m4479l810o3770n7948o0738M9960
20918a45177M9208k2095l513J9186J4053M8980N3627k1953K66m480Q922l746Q0107
20905G3385o229l5484n8935J8369j1454k6643M2896Q0139J6448j1502r1495j15607
20893a26112o7686K9744P1405Q81N7715M989K501L1740J09630k2821j2875N3304
20881A32415K141j7968j6103m922m7271q0089R146m3550p9110M5800O2883K9224
20869g404K1776m8065l5070j6913P271N0680R9025J846L4400k4321n2115p9969
20857d8859l6692K55m2054k3767L3841P4017k1136k5654n3757P1012J993M8104
20845b2697J19665n4643l3476L9538m318m1642L128l1589k6278N2773M2678m4300
$$ y = [37121, 18047, 99441, 110580, 84893, 86217, 35608, -8871, -12681, -76451, -134399, -195137, -145177, -95969, -118064, -121577, -102391, -88338, -39358, 14269, -7684, -7418, -11898, -2976, -6722, 73385, 67156, 31672, -27263, -8894, -20348, -46991, -4095, 76044, 92492, 80990, -10505, -126112, -193798, -164054, -92649, -91768, -34053, -29064, -26563, 5177, 114807, 91986, 79111, 132415, 134556, 116588, 100485, 95563, 48292, -31797, -22651, -66201, -145311, -99511, -36628, -7404, 14372, -33693, -68763, -85676, -78405, -27725, 71300, 73146, 107546, 83225, 31110, -48859, -85551, -85296, -127350, -151117, -117276, -43259, -64395, -90049, -143806, -72794, -70801, -22697, 96968, 42325, 8849, 48387, 44069, 2427, 5555, -26034, -52312, 461, 43139, -1161]
20833a161n5123M3373R7009N6551m0325K6063J2988j35574r4101K9924J528k6593
20821h5441k7033O1327Q4548Q0881M4984l9461p7643j36280m2839j1447L8831
20810a09573L7004L6926k8625m0319k0389M2613K6437j2839j1086O7491P0762
20799E8402m4128J8214Q9606m3948l6362p1896k8036N9223R967k4095j05081j21924
20787b40058L5044M4600N1402M720J1585L1507P3373k7564m8397j1776R8086R4839
20775A17361j12099n4553L675J0400m9855K1830J8854M5728K7441j9424k5683
20764a6325j9762l6042n3935J11940L1340L978q7701m4262K4667L3099M1606L6548
20752B5151L1772m4927p8520K2143L1639J7305j7964n2624j08856M414N1300Q954
$$ y = [-1161, -56284, -12911, 84098, 140649, 100324, 126387, 139375, 3801, -90300, -60376, -58848, -85441, -112474, -51147, 33401, 114282, 159266, 119805, 42162, -94118, -136957, -148404, -109573, -72569, -35643, -64268, -104587, -124976, -82363, -55926, -68765, -79851, -12360, 58402, 14274, 32488, 122094, 78146, 41784, -30112, -58148, 1075, 11042, -13053, -118134, -240058, -205014, -160414, -109012, -104292, -92707, -61200, 12173, -15391, -63788, -75564, 22522, 117361, 5262, -49291, -45616, -35216, -85071, -63241, -44387, 1341, 28782, 9358, -16325, -36087, -72129, -126064, -14124, 17216, 21194, -66507, -110769, -86102, -53003, -11397, 25151, 56923, 11996, -66524, -44381, -12742, 4563, -13401, -66025, -174881, -170467, -119167, -110213]
20740a10213k7097M3062k2546k456L7929j1992l7672J9214M3693J714J0057o6194
20728a22501Q08M2604j702O5321n0461q4121k3668N8433L1305M7603N9709L7988
20716F1318j1265q7073O5903k8828o7420m1138Q4294L4433n5252J3368K5134K5211
20704A8685J3680L4390n4122K8698R9588K7472p5889m6846m9287k5278M992J9175
20692d742J9689n5266j34423M5185Q0899J6915q425k6281k3579l2561K1716L3709
20680f7164m2921J2368J3312M1850J11942l651l1491l2708j7633p4027j22011
20669b12134n3644Q4874K1752k305N2622L6897J22830M1356j14549j0269P845
20658b4725k2087m1096K0379j3157J2007l1527o4619j689K6571N4049o2864l5691
$$ y = [-110213, -137310, -94248, -116794, -119250, -81321, -93313, -130985, -111771, -68078, -66364, -56307, -122501, -121693, -79089, -80791, -15470, -65931, -150052, -173720, -115287, -83982, -36379, 23330, 61318, 50053, -37020, 28883, 55, -67365, -108503, -24209, 10224, -45028, -31660, -6526, 18685, 32365, 66755, 12633, 41331, 140919, 168391, 92502, 45656, -3631, -28909, -23917, -4742, 14947, -40319, -174742, -129557, -48658, -31743, -40168, -66449, -90028, -122589, -100873, -67164, -110085, -97717, -84405, -42555, 69387, 65736, 34245, 1537, -16096, -90123, -212134, -265778, -180904, -159152, -161457, -108835, -71938, 50892, 92248, -22301, -32570, -24725, -46812, -87908, -67529, -80686, -68679, -100206, -164825, -166514, -139943, -85894, -148758, -184449]
20646a84449M8711M9026R622O9697Q8825M3299R402k8085q8128P547L4227r1679
20634c1985n4111M521N6476l8358n3940j5827j2619J10952P3376n6914l645r410
20622c1484j0756j8001k3543K6591k6337M7839M0555O2497J1236n6440l0243l3594
20610d1680r104k6019l2904M384j0723K1470O2761O354L1596N0052l2199j11026
20598h7038k3141J43291K0716j8780J6891k6847p4875P492J9207q6582K8248N7747
20586b3671l8362r07K5735M403L7012L3951J08510O5371p2798j12541J8534L3270
20574G8507m3099M808K2470o1390q6167O5543Q0600Q404m9390m3148p159m826
20562c4847J5697J6686K5879O2050O307r796k393k8030o6027l2041j4246J0157
$$ y = [-184449, -135738, -86712, -77090, -7393, 81432, 124731, 134133, 106048, 17920, 25467, 59694, -31985, -86096, -81575, -25099, -63457, -117397, -133224, -145843, -34891, 38485, -18429, -22074, -31484, -42240, -60241, -83784, -57193, -83530, -35691, 4864, 67361, 78597, 22157, -8086, -41680, -50784, -76803, -109707, -105323, -116046, -94576, -31815, -25461, 6135, 56187, 23988, -87038, -110179, 33112, 53828, 35048, 51939, 25092, -49783, -42291, -23084, -109666, -81418, -23671, -62033, -62940, -37205, -32802, 4210, 38161, 146671, 212042, 139244, 26703, 45237, 78507, 35408, 40216, 62686, 1296, -84871, -19328, 61272, 69676, 20286, -22862, -30021, -34847, -19150, -2464, 23415, 85465, 91772, 81976, 79583, 51553, -14474, -46515, -60761, -50604]
20550e0604l4365J1182k1566K1300J376J3401o4631L1673P39L436R7811N5774
20538F5526L7449j8679k2378j4222N0247J0851M2765l0659m5471k9558r7224p4676
20526a26029J5007P01P5763K1807k6669M0639o6322n4653q027M6625M5847J8733
20514a6578p3751n5209N1886l6997R587J21297p3166q0311j30658Q1497J11120
20503i1283l6698K1722l941J05074N239p609R500j5308l4292J5939J837O6135
20491C6315M5587j11848K5047L4908q8902n3832O8654J556J9875Q3329N3118R743
20479A23550k4026l298m2962m9606o61Q3590k554M537m9776k8123j9355N2441
20467D3757K3235o3594K4636J1205L4842o737o4521j6767J6115K0573K9201L9754
$$ y = [-50604, -84969, -73787, -95353, -74053, -72677, -59276, -123907, -92234, -91495, -88059, 9752, 65526, 102975, 84296, 61918, 47696, 97943, 108794, 151559, 120900, 75429, 45871, -51353, -126029, -111022, -110321, -34558, -12751, -39420, 1219, -65103, -119756, -127783, -81158, -35311, -16578, -90329, -145538, -93652, -130649, -121062, 235, -72931, -153242, -283900, -202403, -91283, -127981, -106259, -110200, -5126, 113, -7496, 2004, -13304, -47596, -31657, -29820, 36315, 81902, -29946, -4899, 30009, -58893, -112725, -44071, -42515, -22640, 60689, 113807, 123550, 99524, 96226, 53264, 3658, 2997, 86587, 84033, 88570, 38794, 10671, -8684, 43757, 66992, 3398, 28034, 39239, 74081, 67344, 2823, -13944, 2171, 22744, 51945, 91699]
20455I1699k1243L9031J648l1327j12007k4671J8879M7324k6178l2868l1096L3078
20443d7731N1935n0649r455k4340Q309N0535o766L8792n753j200Q6449P2699m7380
20430A15445o4897p0127p8412k3276K9600O1825M1043L0870K0955k3375m7426
20419g775P599N1919P8331K6767n5923l9502m4255m4895j0075J3966l8913q8974
20407a51730J8006J22654R0660l9726p8130n9955j963Q0771N0995J8497n275j3997
20395C0807j7894q574P0999j7157k1293l1529N5381k8555n1424j8816K3106m8340
20383f3289j4800k1838j5979P264J885R277M0827N4839n3003n8444Q4807J04403
20371G5949L1642j37844o3013O3975o4692n743N6627Q3674l6368n2729P6361M6695
$$ y = [91699, 70456, 109487, 111135, 79808, -32199, -56870, -37991, 9333, -16845, -49713, -80809, -47731, 4204, -46445, -55900, -80240, -71931, -21396, -28162, 10630, 4877, 3677, 90126, 162825, 115445, 50548, -19579, -97991, -121267, -91667, -29842, 11201, 42071, 63026, 39651, -7775, -176, 51743, 130074, 156841, 100918, 61416, 17161, -27734, -37809, -23843, -62756, -151730, -133724, -11070, 79590, 39864, -38266, -98221, -100184, -19413, 31582, 50079, 44804, 30807, 12913, 4339, 75338, 58181, 36888, 5359, 60740, 32185, -19239, -38055, -14949, -63289, -78089, -99927, -115906, -108642, -106757, -97480, -56653, -1814, -54817, -113261, -28454, 75949, 107591, -30253, -93266, -29291, -93983, -99726, -43099, 40575, 4207, -48522, 27839, 74534]
20359G4534o5416m3660m2108k0754j9302J13474M4273n4946M506Q361p7647o2418
20347a41103o947K8200K8490j7137O2936J4259N7570r277K1723J3925l2482m7569
20335b7412k244k133k7705K082O7746Q4064N476l2398K089j04088L4117l3319
20323c3725n8313M5674L0203o6778Q714L3368k9047K533M349r7490j0350n5757
20311b26619K4243J28238N0483q66N0225J051L6673K13o6478p992k5549o681K5647
20298a7412N8893M5923J8683O8019q613j41645o6601K7049L4089O6343l672P435
20286H8491l8874q2213R8939l3690o3135k41R6686J2816m3554k0709O9198n7835
20274B5879n2132K5505K3735L3026k6570K5186q057l2815q3435R0057O5674J9562
$$ y = [74534, 9118, -34542, -76650, -97404, -116706, -3232, 41041, -13905, -9399, -1038, -78685, -141103, -148050, -119850, -91360, -108497, -45561, -31302, 26268, 16991, 38714, 52639, 20157, -27412, -29656, -31789, -59494, -57412, 10334, 94398, 99874, 67476, 69565, -34523, -406, -33725, -92038, -46364, -16161, -82939, -74225, -40857, -69904, -67371, -63022, -160512, -170862, -226619, -202376, -74138, -23655, -24521, 25704, 26755, 63428, 63641, -2837, -10829, -36378, -43059, -17412, 41481, 87404, 106087, 174106, 165493, 23848, -42753, -15704, 18385, 84728, 81056, 88491, 49617, -32596, 66343, 32653, -30482, -30723, 65963, 78779, 35225, 14516, 83714, 25879, -26253, -748, 22987, 56013, 29443, 54629, 46572, 13757, -69678, 20379, 86053, 105615]
20262A05615k0641l0959n9608n0991M2184J10582R687J4038k1760p8503l2361
20251a2717K344K2966m4856p8235O3151P3067O156r803l6254M6807K751j8325
20239A7052k8035M4980n5254K5346R2459k7353n2048j6200p436k4705K6324m1574
20227d6444p065j4502j6955n6567J4542k3571L4192K2636L8472m0625k850j7994
20215a16731p069M1945K4062k9905k3473J3321L1094Q0324j1617l4292K0136K6039
20203A3834m916L6311m3634p7497r3697N7743P0380q178L8429R7546O56j04899
20191a7922m4031J2541L3296n7350k25J2986Q1203n42p6056o306L0644L1837n5896
20178e5821n7620j6998J14190J5220j231o1122k4199k1354M3950P8222J8544o2635
$$ y = [105615, 84974, 54015, -5593, -56584, -14400, 96182, 105869, 119907, 98147, 19644, -12717, -10373, 12593, -32263, -110498, -47347, 25720, 31876, 22073, -14181, 32626, 35377, 17052, -10983, 33997, -21257, 4089, 96548, 69195, 17147, 947, -6489, -31194, -4870, -46444, -53509, -68011, -84966, -141533, -126991, -150562, -116370, -93734, -55262, -95887, -98737, -116731, -123800, -81855, -57793, -87698, -111171, -97850, -66756, 13568, 1951, -32341, -12205, 13834, 8918, 45229, 1595, -75902, -169599, -111856, -41476, -49654, -11225, 86321, 86977, -17922, -61953, -49412, -16116, -73466, -73691, -60705, 20498, 19956, -56100, -62406, -31762, 75, -55821, -113441, -130439, -16249, -1029, -2260, -63382, -87581, -108935, -64985, 13237, 31781, -30854]
20166c0854J4931L0004j5614j11992J23632N0701n7060q4679R534m1293O0413
20155e2277M3847L6945K9058P744l6835L5631m3421p0319N0357j2864n7302N016
20143f4420K7007R3709M5334k1780m9982l1410j035k201j6719J03980N6506j15680
20131B3309k8595J0858J1004J0178N518M332J9601l9754l7686m7953L888J19525
20119E4225l5205o0063k0344j9290L1460o78J1319R3259M7232m4187K9758J7386
20107A04872p353k9557o9666l1452k3155O0943O6851j0689J283k5349m7805p7503
20095h8580l1142M9486l5710j1831J8861J6932K6793J47429M3870j40432l5999
20084d0323O3774L7587l353q8945M0915N7911L5975J8204j07880n6420J4826P5785
$$ y = [-30854, -15923, 14081, -1533, -113525, 10107, 60808, 3748, -80931, -71397, -112690, -52277, -8430, 28515, 57573, 65317, 28482, 64113, 20692, -49627, 730, -12134, -69436, -64420, -37413, 56296, 101630, 79850, 29868, -1542, -2577, -4778, -21497, 82483, 138989, 23309, -5286, 5572, 16576, 26754, 32272, 36604, 56205, 16451, -21235, -69188, -65300, 54225, 19020, -41043, -61387, -80677, -49217, -49895, -38576, 54683, 101915, 57728, 87486, 104872, 97519, 67962, -1704, -33156, -56311, 4632, 71483, 60794, 62077, 36728, -11077, -88580, -119722, -70236, -105946, -117777, -98916, -81984, -55191, 92238, 136108, -4324, -40323, 23451, 61038, 57685, -31260, 9655, 67566, 103541, 121745, 13865, -42555, -27729, 48056]
20072D8056J5479q7931j9095M2905J04764M3038m7872K5962M7330q436m4243P0639
20060A90596L2824r3213j14019j13977l3419j0601K7955J14796P174m2149q6924
20049a20957J5253Q5613m725j16407j0074R3183R4934M8936k6630K2753R6081
20038A77960N605j03787n3175n553J943N808l3813j03073R0108Q312N2274kl7739
20025D868k5406J1331O2616L6500o3833k7055k1033l0030p202n3263j716k328
20013a16551J744j0715M491L0344J1056o0068J3664R675P6470M6916j9109K990
20001i093J0395j852p5785j5230L6949k1367p8279J8242J29235p147m545N7436
19989C8959l1081l4451j3192l6743j3408N8461P148p570Q725j6366k1478N3302
$$ y = [48056, 63535, -24396, -43491, -586, 104178, 147216, 99344, 125306, 172636, 164200, 119957, 190596, 223420, 130207, 16188, -97789, -131208, -141809, -113854, 942, 8116, -34033, -120957, -105704, -20091, -24816, -141223, -151297, -58114, 36820, 85756, 59126, 81879, 177960, 183565, 79778, 26603, 21050, 22993, 28801, -5012, -108085, -17977, -9665, 42609, 42607, 4868, -20538, -9207, 53409, 89909, 26076, -979, -22012, -52042, -59244, -112507, -114223, -116551, -114807, -125522, -121031, -90687, -79631, -139699, -126035, -116360, -39890, 7026, -12083, -9093, 1302, -550, -76335, -91565, -54616, -75983, -154262, -136020, -6785, -13932, -18477, 38959, 7878, -26573, -39765, -76508, -89916, -31455, -24307, -31877, -23152, -39518, -60996, -7694]
19977g694L0220N708K6619J237N6222L721m5898m9188K5078M1606k1910J7343
19965H3064P012o287l1199l9169k5014P4274R0384m0356k5855r7298r1831N6236
19953d6039O8956K2963N1681j8567r0758L1447q2554k7640O2694R4311k8249M96
19941C8741o1454p346j0716M1737P110o2645P1316L6326n725m7123o0516j2065
19929g2360M9059K490k670M177N6577O9144j6235n4701P1187K7040L6634j2755
19917A57587l3405n482J6274L1171m7197k0724j04307n3694l2625j096P8123o3600
19905g8975k4421J8495m5191l8260K2283m5620k2540Q170J08286K4636l088K6842
19893d9383n4969r021N4670P7691k5641n6805P5408n361P4872j4893m7875L4062
$$ y = [-7694, 22526, 28234, 54853, 56090, 112312, 116033, 70135, 20947, 46025, 87631, 65721, 83064, 90076, 83789, 52590, 13421, -11593, 62681, 153065, 112709, 86854, -10444, -102275, -46039, 22917, 45880, 97561, 78994, -11764, 19683, -62871, -90511, -27817, 66494, 38245, 38741, -22713, -30059, -40775, 962, 8072, -54573, 16743, 53069, 47344, 221, -60295, -72360, -23301, -20811, -23481, -19304, 37273, 106417, 90182, 35481, 106668, 133708, 170342, 157587, 124182, 118700, 134974, 166145, 118948, 98224, -6083, -59777, -92402, -93498, -15375, -78975, -103396, -84901, -130092, -168352, -146069, -191689, -214229, -206059, -97773, -73137, -76225, -49383, -104352, -113373, -58703, 18988, -6653, -63458, 11950, 6589, 81461, 66568, 18693, 52755]
19881E2755m2331q8221J3248K3157J077l164R705K5531J14295N8724k7310o289
19869A31177j3437J4132k4220m2465l9202l3609j14015J3532O5772K2940l4126
19858e3521k9651j286J1700L5309K581L1342k7947n2737j6225Q4949K9450O4001
19846G7965J5327l7980j0437j2079m045l2801q4549j6752M6982J4367m7326l8381
19834a29709J45889k273o4821M2761N5498P868K4183q3775j5200N3156K1305N0729
19822A05611M0175q9458j1369m1513K3895o0520l1768L9006K4175j4492j7385
19811c3643M6944N582n0683l5322M7838O0084L9896J798k8372O3269K1295P355
19799A46041k1271l8335m194q5097o4749J02369K4601o0768N4540m0787l6438
$$ y = [52755, 10424, -77797, -64549, -41392, -40315, -43479, -33774, -8243, 106052, 164776, 137466, 131177, 117740, 131872, 107652, 65187, 25985, -7624, -121639, -108107, -42335, -19395, -53521, -83172, -84458, -72758, -37449, -34868, -3526, -31473, -84210, -100435, -15486, 13964, 77965, 93292, 55312, 44875, 32796, 28751, -4050, -88599, -105351, -58369, -44002, -91328, -129709, 16180, 13907, -50914, -8153, 47345, 55213, 79396, -4379, -19579, 33577, 54882, 105611, 145786, 56328, 44959, 3446, 27341, -33179, -64947, -25941, -1766, -16258, -33643, 13301, 18883, -31800, -67122, -19284, 40800, 80696, 82494, 54122, 117391, 138686, 146041, 124770, 86435, 82241, -2856, -67605, 34764, 59365, -1403, 53137, 12350, -24088]
19788b4088j04269M6255L2822k144P6061R095r2557j1292K5600N720k363J2441
19776b8719j2683K5878M3289Q9416K8952o843p1023j8259l4712o9647p126m2234
19764a03711j1442j6386o6170L4610R2598k6897J7685N0704M1748Q757n6134j05164
19752a39802k3843n7533M1198Q0290j9700L41J40188R6032l751K977m7427r8582
19740b9612Q695q24M646r7769n6367M08J00964N5143r2187l4650J53996N1771
19728F4214l3476m3075R182J2668l7332o1314K9597L4117l7545M6682N2503r1511
19716e5290n4568o4081n2132J5050O8547P0115N5273L1627j1620r9601K818L1657
19704f2205o544n40J2109j3593l9824L0326L0997p6714o009J20024j1542O2761
$$ y = [-24088, -128357, -82102, -49280, -51424, 24637, 33732, -58825, -70117, -44517, -38797, -41160, -28719, -41402, -15524, 27765, 117181, 146133, 139290, 68267, 50008, 15296, -54351, -61477, -103711, -115153, -131539, -197709, -163099, -70501, -97398, -79713, -29009, 12739, 21496, -34638, -139802, -163645, -221178, -179980, -99690, -119390, -119049, 21139, 117171, 113420, 116397, 68970, -29612, -20917, -21741, -17095, -114864, -171231, -170823, -69859, -14716, -106903, -141553, 12443, 64214, 30738, -12337, -3155, 9513, -27819, -89133, -59536, -25419, -62964, -16282, 36221, -55290, -109858, -173939, -226071, -211021, -142474, -72359, -17086, 14541, 2921, -96680, -93862, -62205, -68749, -69289, -57180, -70773, -110597, -80271, -49274, -125988, -131997, -11973, -23515, 39246]
19692C9246P8040j14514p4672q929J1094L3084K9609Q4590L8054o4458J6334k5699
19680D1779J734l5721K4872L1059m4601n6278P3669r0840K7630P021m6724K573
19668f3827J2655K7325j5740J6168j0666J9083O781R1797K9155q7943J8827R6467
19656A40082m2352j6164j2179k3436J2012k066j15360k1014O4267J2715K0882
19645A7387j2512R4436r7905k1546L7306j6724O984q3607k3524n286Q9169J7931
19633B109P9919p458j9413l9312m8623j0202P3385j8826l5714M893l6022n0425
19621a05689O0026k0400j2490P5736R1447K2501o4134n2119N4957m5309j41975
19610a37449R0926K5170K1035N7969o507n4174R710R684L5350P0189p585p6752
$$ y = [39246, 117286, 2772, -71900, -80829, -69735, -36651, -7042, 77548, 115602, 51144, 67478, 41779, 43513, 7792, 32664, 63723, 19122, -37156, 36513, -54327, -26697, -19676, -66400, -63827, -51172, -23847, -39587, -23419, -34085, -15002, -8221, 83576, 112731, 24788, 43615, 140082, 97730, 81566, 69387, 45951, 57963, 55897, -59463, -80477, -16210, -3495, 17387, 4875, 99311, 1406, -20140, 17166, 442, 7426, -76181, -99705, -104991, -15822, 2109, 82028, 74570, 55157, 15845, -32778, -42980, 30405, 11579, -24135, -19242, -55264, -105689, -45663, -66063, -78553, -2817, 88630, 111131, 46997, -5122, 49835, 4526, -137449, -46523, -21353, -318, 57651, 51144, -3030, 6680, 16364, 51714, 121903, 114318, 37566]
19598C7566K61n8746j8296Q2212K1821n0471j8371Q8149P1941l9114k4464J8799
19586A11287m3959o3219L4992M2321k0982M399L947n2728M8986O7170o8188N46
19574F4572J0221O7272o7896m3458N453j5426l7938L9726l605N5748P9005p8926
19562G4748m5522K4557n8679k0466q8790k9828P6649K4293p49l8969k9529O261
19550a06024O288K2228P867P1185J04261M0090n5389j0913k6522l8182q1616M876
19538f1851L3323l0755n1638m8664M7979Q0662J3289k0617k6938L426J7477J5080
19526b9227J0945l9142N2783P2055J7856k9779o538L3496o5078m2494l7008Q6209
19514B4078K2465j3442J2111M2202K6044P601m6006J3910N338j0284l0724L7452
$$ y = [37566, 37827, -20919, -39215, 42997, 64818, 14347, -4024, 84125, 156066, 116952, 92488, 111287, 67328, 4109, 39101, 81422, 60440, 64839, 68786, 16058, 65044, 132214, 64026, 64572, 74793, 142065, 74169, 30711, 36164, 20738, -17200, 22526, 18921, 74669, 153674, 74748, 29226, 53783, -4896, -25362, -114152, -143980, -67331, -43038, -43787, -82756, -112285, -106024, -99736, -77508, -69641, 1544, 105805, 145895, 90506, 79593, 53071, 14889, -66727, -61851, -28528, -59283, -110921, -159585, -111606, -30944, -17655, -38272, -65210, -61784, -44307, -29227, -18282, -57424, -4641, 67414, 85270, 55491, 48953, 82449, 17371, -25123, -62131, 24078, 46543, 33101, 45212, 87414, 113458, 121059, 75053, 88963, 94301, 84017, 53293, 90745]
19502I0745n5229L1006R561j1226o7781J2438j3034L4624o8943K0841P0346j6697
19490C6651K8254l2717o3626m0007N7588L1164J06932j054r6735o6163j4798M3353
19478a1158K5591o044j339M1722m1410j745K5097L6827m476o7754r5236j4962
19466a14887O247J358M5529L3199J10440L2501l3062o1939k1099q6830q6030M9544
19454a25029P4517N8318K4363j3687M9190K7893k768J6111n3997q5426p764m6955
19442h5234l4771J01034o766k2060J07318L2171o8935p9011J17564J8754k1792
19431E8272o0399L4163n904K1277k3873j1387j9280P1254N6982n2464l4332J8608
19419E2917K8999o9091o5905K9670N0333Q4964q906j12247o0991J0828K0923J6048
$$ y = [90745, 35516, 66522, 76083, 64857, -2924, 9514, -3520, 31104, -37839, -16998, 53348, 36651, 64905, 32188, -31438, -71445, -13857, 17307, 124239, 123185, 26450, -39713, -54511, -11158, 14433, 8389, 7050, 48772, 7362, 5617, 30714, 67541, 63065, -4689, -99925, -114887, -108640, -107282, -61753, -28554, 81886, 114387, 81325, 19386, -1713, -88543, -174573, -125029, -50512, 7806, 32169, 18482, 67672, 95565, 92797, 108908, 54911, -30515, -38279, -85234, -120005, -18971, -25737, -47797, 59521, 91692, 22757, -56254, 61310, 80064, 58272, -2127, 32036, 26132, 47409, 23536, 12149, -7131, 64123, 121105, 68641, 34309, 52917, 81916, 12825, -53080, -23410, 26923, 111887, 102981, -9266, -70257, -59429, -38506, -22458]
19407b2458l0412j3229J7877P3861n3993n977J06897L1407J7912p2578j13033
19396f3726Q4331P4412L6937p5569M51R5685k3375r1012p1681J3765j6330O102
19384c0010M2197J5387j1450J1448J6863p2246m1325M9673J09760J0318q730n078
19372H6807p8517m8906q730K7849M5316J0857j6699n2547Q0215K9454n5145l4380
19360a4426L006J8508m8177o2152L8652l731P4543N1273m0083m8327L3295J3274
19348A5655l7840k5557n3340K8136J4696M1517Q3585K0363m6568O168l36k1845
19336B4634j1984l6561k2685N1005O2807j1800N5120M2150p4792j2301m090l6751
19324B4752q626m9597k7404k3515J234L424O48O0568k5768k2668J253n2916p974
$$ y = [-22458, -52870, -66099, -48222, 25639, -28354, -34331, 72566, 103973, 121885, 49307, -63726, 20605, 95017, 131954, 56385, 56836, 152521, 129146, 38134, -33547, -19782, -36112, -30010, 12187, 27574, 16124, 27572, 44435, -27811, -69136, -19463, 90297, 100615, 91885, 86807, 8290, -40616, -49346, -21497, 23819, 34676, 17977, -34570, 45645, 75099, 19954, -14426, -11420, 7088, -41089, -103241, -64589, -68320, 6223, 57496, 17413, -30914, 2381, 15655, -22185, -47742, -101082, -72946, -58250, -16733, 66852, 87215, 40647, 46815, 46479, 24634, 12650, -23911, -46596, 4409, 67216, 55416, 110536, 152686, 77894, 65593, 61503, 24752, 16126, -33471, -60875, -84390, -83156, -79732, -79084, -18516, -44284, -66952, -65699, -118615, -126589]
19311a26589L1606J7852L9674J37779Q2400j00927j9574l2274j9371r5352k2524
19300a07300j4311J33898R8017q5179n881M6966k7231j4171L0730k7823K0732
19289D8447K6003N746K2222j460m8824L2107l8789j12701K0767k5555J1615j9330
19277g9752K7360J05501m039J5130L942M1148K9982j7804r0354K2868n173q0122
19265c1313L8433L0138m5426L1302L2704R714p977m0014o1528k4032Q6053J05474
19253A23528k75o1717p9470l9029k5643L017L3015P7998K6172l9123l5177o7594
19241h4298k5929R3873J05064K040k7608N9582n870l3326j7866p376o3286N6157
19229E1157J840J3288m5292j8529o0110k9545M5303K1080j85m5821N2426N0938
$$ y = [-126589, -94983, -77131, -37457, 100322, 182722, 81795, 62221, 29947, 10576, -84776, -107300, -121611, 12287, 110304, 25125, 19244, 66210, 38979, 24808, 55538, 27715, 48447, 74450, 80196, 102418, 100958, 52134, 84241, 45452, -67249, -46482, -72037, -60422, -79752, -52392, 53109, 49070, 64200, 68142, 109290, 139272, 121468, 31114, 53982, 48809, -31313, 7120, 37258, -8168, 23134, 55838, 65552, 57575, 17561, -43967, -67999, 18054, 123528, 123253, 61536, -17934, -56963, -82606, -79589, -46574, 31424, 57596, 18473, -16704, -84298, -110227, -16354, 88710, 90750, 63142, 122724, 116854, 83528, 65662, 58286, -5000, 51157, 52997, 66285, 20993, 2464, -57646, -87191, -41888, -20808, -20993, -66814, -14388, 36550]
19217C6550J1185J5051K6828n8988p3015l3160L4476P4484O9395l68n084j03487
19205f133o194J0509J7509Q104m8696K349J48162J37340l1055o1054m4727k2924
19193A03190j7955O786J4102o4020o6929m6814M1725J19688j6n144R7159L9577
19181B21349L7193q7782j87357m9363M9457J07465j3358q1598k6931n0031J37530
19170E6574O5180P1701P855j19955j2997k2277l856M3274R912l6443J6345j01346
19158b6033k4840M1136K9129Q8242m935R2211k4470j81125j15456O5234O4328
19147C421r428l0083m1877j4O8956L3931L8798l8713l0101K1130l72l2250o8125
19134h4727L4464J3729m9003q24J2501l6093k4952M6314l8496j4199k2475K2666
$$ y = [36550, 47735, 62786, 89614, 30626, -42389, -75549, -41073, 33411, 102806, 102438, 97354, -6133, -12327, -1818, 15691, 23795, -24901, -22552, 125610, 262950, 231895, 170841, 126114, 103190, 85235, 92021, 106123, 42103, -24826, -71640, -29915, 89773, 89757, 84613, 181772, 221349, 258542, 170760, -16597, -65960, -16503, 90962, 77604, -3994, -30925, -80956, 56574, 121754, 193455, 201310, 81355, 68358, 46081, 42225, 85499, 95411, 58968, 75313, -26033, -50873, -9737, 19392, 107634, 102699, 194910, 170440, -10685, -126141, -60907, 3421, -6007, -36090, -77967, -77981, -9025, 24906, 63704, 24991, -5110, 16020, 15648, -16602, -84727, -50263, -36534, -85537, -86361, -73860, -109953, -134905, -88591, -127087, -141286, -163761, -141095]
19122a41095N1596N1977J8670l859j357P670J87K0027M3201O6938N1240k8719
19110A36476q5650o9266k4720L2041j17173m8365M9200N4567M4707J2305K8538
19099A2660O3780O0691K0869m5227r4591Q197M926k2337k7304K8662N9784O367
19087G6477N1977k1259j7121n24k9686K4391l6131L2735l0910Q8489Q1673j8718
19075B01393o2341l4638l6701k6457m0402M3260o9695J5020O587J15445j0466
19064A01005j8446j1098k7530o7230O5278l2682j0794O8527N5931L4575K6617
19053A84153p8775n6875K9355L3124p816j8070J1290m5379L9301M6478j9115l5727
19041H1944n5621O2369J2273n2325j0215K4241K0869j8839j251K2576P4846o817
$$ y = [-141095, -89499, -37522, -18852, -22711, -24068, -16398, -16211, 3816, 47017, 113955, 165195, 136476, 50826, -18440, -43160, -11119, -128292, -176657, -127457, -72890, -28183, -15878, 12660, 76440, 137131, 158000, 112773, 18182, 26379, 31305, 8968, -18336, 10326, 70110, 76477, 128454, 107195, 90074, 89550, 59864, 84255, 48124, 80859, 49949, 138438, 220111, 201393, 139052, 104414, 67713, 41256, 854, 44114, -25581, -10561, -3974, 111471, 101005, 82559, 71461, 43931, -23299, 41979, 9297, -1497, 67030, 122961, 157536, 184153, 105378, 48503, 77858, 110982, 103166, 85096, 96386, 51007, 90308, 136786, 117671, 81944, 26323, 88692, 100965, 48640, 38425, 62666, 83535, 64696, 63445, 86021, 160867, 154050]
19029A54050r6147p1398p9616n1209N927J8290R620K0836P9057O8626K8975q6587
19017D24p5900j2913N103N0839R1055l14K329M0497L3337j35857k2065J4830K6402
19004A7767L1193M0236R8903O31l0187j6897p530k5982j10787k9971m1515O089
18992f8050r810m1621K7556j102k1932N2378K0334m7645K0516P2150J5623N2478
18980G0875k0863m534o1430j2854l1356M5419K6092O5697k9109p6821J8926M8426
18968C8468P326j4367m6200L2036Q3945l2797o3745l4832K1799K2150n84k0885
18956g686L8017p916N2169J174J456m5482Q1785N1690k071K9498j22352j08570
18944c8288M2909N3848P108j1391p3620N0764J3095m565J7753M5769L812L6736
$$ y = [154050, 57903, -13495, -93111, -144320, -138393, -120103, -110483, -89647, -10590, 58036, 87011, 424, -75476, -88389, -83286, -32447, 58608, 58294, 60623, 101120, 134457, -1400, -23465, -8635, 17767, 48960, 89196, 188099, 188730, 158543, 141646, 134116, 108134, -2653, -32624, -74139, -68050, -77860, -119481, -91925, -93027, -114959, -62581, -42247, -89892, -69376, 2774, 18397, 70875, 50012, 45478, -15952, -28806, -60162, -14743, 11349, 77046, 47937, -28884, -9958, 38468, 45794, 31427, -14773, 17263, 101208, 68411, 4666, -30166, -8367, 13783, 13199, -7686, 30331, 22415, 74584, 75758, 77214, 31732, 113517, 165207, 163136, 192634, 70282, -38288, 4621, 58469, 65577, 54186, -19434, 31330, 44425, 39860, 57613, 103382, 107194, 143930]
18932A43930j1338o2872j31552K7972M2291l228N5314k1319k4295M4177k1209
18921C7871J0858K4547K0355p0893q2115k6591n47k2664j1021M8182K7216n6815
18909a01617J978Q8176M1901j1721n3483q5164J7484O9749Q3025O8189o285j58206
18897d5974m2105K4379J4386L9120j51N9093j1786N12N0642J0554j1021l8135
18885D9514o5164M7877K8165l0086J6722n5600m6481N441L9408O6466k8008m2159
18873a3905k7311J02328L3366k3893m0684r5568J0259M5186Q5710q7339o476L3991
18861A5664j3942M8905L741j13537n3415M5783K4880J1089M7274n950M5841r2770
18849c6437j9347J12598k2457P6674P3916p7375q6847j1296r727Q693n9352N971
$$ y = [143930, 132592, 69720, -61832, -33860, 8431, 5203, 60517, 39198, 14903, 59080, 37871, 48729, 73276, 93631, 22738, -59377, -85968, -86515, -109179, -120200, -72018, -44802, -101617, -99639, -11463, 30438, 18717, -34766, -119930, -102446, -32697, 50328, 118517, 112232, -45974, -88079, -63700, -49314, -10194, -10345, 48748, 36962, 37474, 88116, 98670, 87649, 49514, -15650, 32227, 60392, 30306, 47028, -8572, -55053, -49612, -10204, 56262, 28254, -13905, -41216, 61112, 94478, 70585, 29901, -65667, -55408, -10222, 75488, -11851, -18327, 15664, 1722, 50627, 54368, -59169, -112584, -66801, -41921, -30832, 16442, 10492, 56333, -36437, -55784, 56814, 34357, 111031, 184947, 107572, 20725, 9429, -298, 8395, -50957, -44986]
18837d4986l9124N532M7466J06794N1357l7782j37219m8173O1964K5784J4729
18826F342j606j4342r786L9364m2176n3964L1561R480M0258k0695P3688J21485
18814A79609p290m4476r1069n5138n0072J3365M1080o4753K6887k4949Q6167m982
18802D379o4289Q3785O6548M3792k5979m5221J0027l0644R406P0680K9303p1501
18790H0286k187J7213N2525k221r4756o9304J4705R0263r200O0163Q1691p0547
18778A48631j19803J3015K6270L5034R7458J3842q094J16032P2389P1677J48074
18767F14525l0298j26480j59341j27803p0047L1305P4930k0061m2836p0918q5224
18756a2248o258L4589m3374J1739M1591k656K0904J7366J8160J10962M9130o7249
$$ y = [-44986, -84110, -78578, -31112, 75682, 127039, 89257, -47962, -96135, -34171, -8387, 6342, 4736, -9606, -19392, 19972, -22204, -76168, -44607, -35127, 5131, -15564, 58124, 179609, 172319, 127843, 36774, -18364, -68436, -55071, -13991, -78744, -51857, -76806, 9361, 4379, -59910, 23875, 90423, 134215, 108236, 63015, 73042, 42398, 51804, 122484, 151787, 80286, 78099, 95312, 147837, 145616, 50860, -18444, -3739, 86524, 77324, 137487, 219178, 148631, 28828, 41843, 68113, 103147, 200605, 214447, 206353, 322385, 394774, 466451, 614525, 584227, 457747, 298406, 170603, 100556, 131861, 206791, 186730, 143894, 72976, -12248, -18506, 16083, -27291, -15552, 26039, 23383, 44287, 61653, 79813, 190775, 239905, 172656]
18744A72656p5725k9528k7234m5532N1308Q7228N2153N242J9187l7665j7504J10053
18732B64639M038m8712J4804o0125o0148k2965P3040n30o2678p7979k4287K0532
18720A9629j2630N4037J6545R5169M6307o4875l7972P9783j2456o975R2687J5570
18708B84819r695n4471q172M609k339K5775J4234N9841O0828o3040p0571o4300
18696A77518L0692J1749R605K5927O2329R2092L7951J14136J37181J67365L27739
18685A194284L57676L55117q0835k60629k57393j09111J3025J01515J69992K36864
18675A720505K02001j67644l03853k50054j99227k18339k01210q5360q0230j8414
18665C98175k2108n535j1204m2365K6313O1278J03352n3451q9717N9629J16284
$$ y = [172656, 96931, 67403, 40169, -5363, 45945, 133173, 185326, 190568, 209755, 172090, 154586, 264639, 268677, 219965, 234769, 174644, 114496, 91531, 164571, 164041, 101363, 23384, -903, 19629, 6999, 61036, 77581, 172750, 219057, 154182, 116210, 195993, 183537, 176562, 269249, 284819, 275124, 220653, 212481, 217090, 214751, 240526, 254760, 314601, 375429, 312389, 241818, 177518, 208210, 219959, 229564, 255491, 317820, 409912, 447863, 561999, 699180, 866545, 1194284, 1551960, 1907077, 1826242, 1565613, 1308220, 1199109, 1212134, 1313649, 1483641, 1720505, 1922506, 1754862, 1451009, 1200955, 1001728, 783389, 582179, 496819, 416589, 398175, 376067, 370532, 359328, 316963, 343276, 404554, 507906, 454455, 364738, 424367, 540651]
18654E40651N7843J42474K02052J89555L73999M41090J09934k69597k54808j48584
18644A384609p1317L6495J41821K75613L62609k5005m72067l83913k53394k10427
18634G85024j65146j38576j84880q7006J1787l2235k4404l8788K107K588j4665
18623A15806M1266K3280J8812M2088Q4612m8833j15106r1717K7383j7710K274
18612H2155l749k7207O5468M4164N1205L1479k4697j8055l3465m7630J8326K1339
18600A59333M149r8503N1207O640l797N856O9651M9106k8020l2956J0844j5920
18588A77590k4540j08871r8982j1273L8555R2892L5131m3376J9704K2810M4060
18577A43700K2691m108k7172l5415l0759m4210k9845K4513k094l6959N0587O8566
$$ y = [540651, 598494, 740968, 943020, 1132575, 1506574, 1947664, 2057598, 1788001, 1533193, 1384609, 1313292, 1349787, 1491608, 1767221, 2129830, 2104825, 1632758, 1248845, 995451, 785024, 619878, 481302, 296422, 209416, 221203, 188968, 164564, 125776, 127883, 130471, 115806, 157072, 180352, 199164, 241252, 325864, 277031, 161925, 70208, 97591, 79881, 82155, 78406, 51199, 116667, 160831, 212036, 243515, 218818, 200763, 167298, 119668, 137994, 159333, 163482, 64979, 116186, 122826, 119029, 124885, 194536, 243642, 215622, 182666, 193510, 177590, 153050, 44179, -54803, -66076, -27521, 65371, 100502, 57126, 76830, 99640, 143700, 166391, 162283, 135111, 99696, 68937, 24727, -5118, 19395, 17301, -19658, 30929, 99495]
18565I9495M9151R2628J8685q2329M524L0598o7070k2437j8323k8364n8549n1322
18553c3313K787L0489p3930R5003O8818l031l1741J2438J8414K3173P2328k2496
18541A58939k600J7935m5674k5144l9272P68J17833j7412K915K9166P0954k5558
18529B42850r4226O4699P3496o9907j31430N2915p966K5443N4747o2810o2458
18518H5353R9887R5868K7717o9138p9484m8052K9102j5324R6934O3249R253L3998
18506C29363k6543n3621o7261l2201P179n5493J1659L383l6925R461J6543J5430
18494A20974m3335K3606L0777k0728K1794J58087J2084j3158j12577j98822K480
18483a8818R0628O732n1484R2522O4234K5010K3617J0256k3405n5486o0733l6991
$$ y = [99495, 148646, 241274, 259959, 177630, 182154, 212752, 145682, 123245, 104922, 76558, 18009, -33313, -30526, -37, -73967, 21036, 89854, 86823, 55082, 67520, 85934, 109107, 181435, 158939, 156339, 174274, 128600, 103456, 64184, 64952, 182785, 165373, 168288, 197454, 268408, 242850, 148624, 213323, 286819, 216912, 85482, 138397, 130431, 155874, 210621, 147811, 85353, 185240, 281108, 308825, 239687, 160203, 112151, 141253, 125929, 222863, 286112, 295365, 329363, 302820, 249199, 181938, 149737, 156916, 101423, 113082, 116465, 79540, 89001, 105544, 120974, 77639, 101245, 132022, 111294, 133088, 291175, 303259, 290101, 177524, -21298, -18818, 71810, 78542, 27058, 119580, 183814, 208824, 232441, 242697, 219292, 163806, 103073, 66082]
18471F6082K7448Q3470o535n819K8400M9312j07954q2953M026O7859K9681M3454
18459A96471p819m9410n86j80l8507j1963L1175N9429K3056O98n2850l9378j8104
18446I2032P4J5281N516K6302j1534l9517k3709l0383p346N1092K9480j3542R168
18433A02914j6886j4340P9327K2792M1224O059n301l8209O6761J4906j6838r4710
18421A47699N2607J9612j3442m6255o5330l5683J2598Q2907Q8064O4881j2771
18410B94887p9131n9405q398P0468j8256o0895j1130j1604L5437K4825o6428j4286
18398I6084m2208M1941l3720J0761k1458J7812J7235j8982N7893K6624L1133Q325
18386A91440Q084K0021n2190R6Q3161l207j5062Q6249l3870m8626N9947R6011
$$ y = [66082, 93530, 177000, 170465, 164646, 193046, 242358, 134404, 51451, 55477, 123336, 153017, 196471, 188652, 139242, 138656, 138476, 99969, 88006, 119181, 178610, 201666, 202364, 149514, 110136, 92032, 92106, 107387, 112903, 139205, 127671, 88154, 64445, 34062, 26716, 77808, 107288, 93746, 102914, 86028, 71688, 151015, 173807, 215031, 221090, 215789, 177580, 244341, 259247, 242409, 147699, 200306, 219918, 206476, 160221, 94891, 59208, 71806, 154713, 242777, 307658, 294887, 215756, 156351, 147953, 218421, 200165, 139270, 128140, 116536, 151973, 176798, 110370, 96084, 53876, 95817, 62097, 72858, 51400, 69212, 86447, 67465, 125358, 151982, 183115, 191440, 199524, 219545, 167355, 167451, 250612, 247405, 232343, 318592, 284722, 236096, 296043, 392054]
18374C92054J5178j06171o5269k4071j0414o6616N7532L8233k0275P57Q0411P8726
18362C70075N6037m6547l6292m2247K9160J21918R0473K46994L04180K02412K45339
18351A541502L71797L49752O4687j43641k45023k64889j53379L8739K13459L76572
18341B149576L45976n50k42579m96035m36474j65404p7402r9578K9421j4306N7744
18330A050389J22060J96612L01223M62850K06445k28715k74502p0283m9941J627
18320A717765J95255K84222L46666J2859l21295k89773j86581j43827k44639l12519
18310A058133j35452l9465L5931K0098j06926j4954J15953j16699j19343j12662
18300E84614r8761m0945J5550J8593L9392L4625p3720K6511R1913R478J976q0109
$$ y = [392054, 407232, 301061, 235792, 211721, 201307, 134691, 192223, 230456, 210181, 210938, 291349, 370075, 426112, 379565, 343273, 301026, 330186, 452104, 542577, 789571, 1093751, 1296163, 1541502, 1913299, 2263051, 2327738, 2184097, 1939074, 1674185, 1520806, 1559545, 1773004, 2149576, 2495552, 2495002, 2252423, 1756388, 1319914, 1154510, 1077108, 977530, 1006951, 992645, 1050389, 1172449, 1369061, 1670284, 2133134, 2339579, 2110864, 1836362, 1766079, 1716138, 1717765, 1913020, 2197242, 2543908, 2556767, 2235472, 1945699, 1759118, 1615291, 1370652, 1058133, 922681, 883216, 919147, 939245, 832319, 817365, 933318, 816619, 697276, 584614, 485853, 444908, 460458, 479051, 518443, 553068, 479348, 505859, 597772, 607250, 609226, 529117]
18288E29117k4148P3171J2153p8197p5321j31255J4505J18814L5398K206k0964
18277D55479l1267K1417m0891j9676L9272M8655K0110n1380k9241K144n6938l0126
18265C27558L2085m175J4172L8549o6866O2528J18328M5270L7666o6578J9829
18254E58366L4635n3369l2274q553K8081M4047R867J4314P1832n8133p2049q4299
18242D52465j6890P8434M5101K761M1293J4370P7120N9442O3956m5551l4030q301
18230G30170K857N020M486O5231N2164r2356k2790J5025o308M2201J17017J37319
18218A050036O9601m1594j8282m031l2022J7996k1362N9087O6935J9094l4540
18207A130918q9071j8200N661R4948p8484j39127j3646k0619L6294R0598M1657
$$ y = [529117, 504969, 578140, 590293, 512096, 436775, 305520, 320025, 438839, 474237, 476443, 455479, 424212, 445629, 404738, 385062, 424334, 472989, 493099, 441719, 412478, 414622, 357684, 327558, 359643, 355468, 369640, 408189, 341323, 403851, 522179, 567449, 605115, 538537, 558366, 593001, 539632, 507358, 498805, 526886, 570933, 580800, 595114, 666946, 608813, 536764, 452465, 435575, 514009, 559110, 561871, 603164, 617534, 694654, 754096, 818052, 772501, 738471, 730170, 733027, 738047, 742533, 807764, 859928, 767572, 744782, 759807, 753499, 795700, 912717, 1050036, 1119637, 1078043, 1059761, 1055730, 1023708, 1041704, 1020342, 1079429, 1146364, 1165458, 1130918, 1041847, 1023647, 1029308, 1124256, 1045772, 906645, 892999, 872380, 908674, 999272, 1040929]
18196A040929N2706N4746j5782J6161J885n9268J3616O7787N3024N262J9330J56572
18184A406968J59764P8549K3548r6776o3749k1746q9985L7894Q1771R3231P9518
18173A688987K3110L2328N0344k197l6111k3457R351J9884k1195M6435N1072m157
18161A834394n3496l5535L9811R3414Q8722M4504K1396J1785P6070J75036K49581
18150B545682K59091J63843r8490q681M2985J01663O4896P9745O8683J62390J72546
18139C554353J28340J56757J32184J40872K60937K59738J34663K13559K12328
18130E193731J55005K93249L67705N18058O08849P17406P74265R85236J251834
18121A0865338J683928J979728K112851K545795L552208M828770O372697Q231830
$$ y = [1040929, 1093635, 1148381, 1132599, 1148760, 1150645, 1091377, 1104993, 1172780, 1225804, 1231066, 1250396, 1406968, 1566732, 1645281, 1668829, 1572053, 1508304, 1486558, 1396573, 1434467, 1516238, 1609469, 1688987, 1712097, 1744425, 1794769, 1792572, 1756461, 1733004, 1742355, 1762239, 1741044, 1787479, 1838551, 1834394, 1780898, 1745363, 1785174, 1878588, 1967310, 2011814, 2033210, 2044995, 2121065, 2296101, 2545682, 2804773, 2968616, 2870126, 2861445, 2904430, 3006093, 3070989, 3150734, 3219417, 3381807, 3554353, 3682693, 3839450, 3971634, 4112506, 4373443, 4633181, 4767844, 4981403, 5193731, 5348736, 5641985, 6009690, 6527748, 7136597, 7854003, 8628268, 9613504, 10865338, 12549266, 14528994, 16641845, 19187640, 22739848, 27568618, 33941315, 42173145]
18113D2173145J0285721J3373380J9771814K5235739Q834271j7849950j9870932
18106H1953188j5246699j0939667o120193j844235J970133N661835R850290J4959649
18098H0244301K0058751K5141873L2031166M6143350O5212946M7283781k2465416
18091B93650752m3299302k9463279j5024619n4371J6068964L8257951N7790337
18084C17926433K2838277n0522017o2066442n0335674m0043943k9020246j9615461
18077H9160927j2887512q289762n425575l405856k463956k301649k050212j232183
18069E1104222J82741J859429M197598P096917J0582820J5497663K1040549K6460092
18061A38022031L3040368M5213141O6948832O8810405R69345m9612930m0401999
$$ y = [42173145, 52458866, 65832246, 85604060, 110839799, 119674070, 101824120, 81953188, 66706489, 55766822, 49646629, 47802394, 49772527, 55434362, 65284652, 80244301, 100303052, 125444925, 157476091, 203619441, 268832387, 316116168, 293650752, 250351450, 220888171, 205863552, 205809181, 221878145, 260136096, 317926433, 340764710, 290242693, 228176251, 177840577, 137796634, 108776388, 89160927, 76273415, 67983653, 62558078, 59152222, 56688266, 54386617, 52336405, 51104222, 51286963, 53146392, 57343990, 64440907, 75023727, 90521390, 111561939, 138022031, 171062399, 216275540, 283224372, 352034777, 353004122, 303391192, 262989193]
18054B62989193k3641726p086379J0249922L2008783N8613236M8247406l3526482
18047C47853953p2879650o2337755n0160165l7966246k6547450j7983188j2452882
18040F7526617q619561n990868m438851l606514l671896l943718l514602l161404
18032C0579203k801537j939822j863307j865051j514577j144232p09652m60407
18024A8280618p64540q70382q60181j174345j199091j014854q46911p11105n36690
18015A0302519m37346m26668m57700m06551l71940l14660l25559k80048j30114
18006G151933n1671j48177j22972j37253j01803q5758l86290m03885k69185k15360
17996E229579j87589l20977j87619j37664n0233j08402p7764l4275j47384k56414
$$ y = [262989193, 239347467, 232261088, 242511010, 274519793, 333133029, 381380435, 347853953, 274974303, 212636548, 162476383, 124510137, 97962687, 79979499, 67526617, 58907056, 52916188, 48477337, 44870823, 41198927, 37255209, 33740607, 30579203, 27777666, 25837844, 23974537, 22109486, 20594909, 19450677, 18741025, 18280618, 17516078, 16645696, 15785515, 14611170, 13412079, 12397225, 11550314, 10839209, 10302519, 9865173, 9438505, 8980805, 8574254, 8202314, 7887654, 7562095, 7282047, 7151933, 7100262, 6952085, 6829113, 6691860, 6590057, 6504299, 6118009, 5714124, 5444939, 5229579, 5041990, 4721013, 4533394, 4395730, 4345497, 4237095, 4159331, 4125056, 3977672, 3721258]
17986C721258j23563K654l816r721n9674m8786r9180j52908j47656j62412j84008
17975B732188m0503m1168j30704n0367N376j5544J0086Q7386L9996J0618m2616
17964B564748j24640m3121k9793k0331n9980m5126P3700M0896q1931j59715k1236
17953B093471o4472m141r676m3534L4982l6678p2030p6783K0894k5805n1783L0184
17941A794629N7602l075J37624N6621n5763l0276M1315J14457O0245N8454K3898
17930B255731P461p5435j17055M708K9103N6486j0490P8306J6595j40529k27490
17919A877391l5820M7269m9148p9690L2757O1524p9007r9417L1608J48256J35177
17908A990900J04978n1886j73015K6977M1954O9288M8824J29189o88j10227j75860
$$ y = [3721258, 3597695, 3600349, 3596533, 3586812, 3527138, 3478352, 3379172, 3226264, 3078608, 2916196, 2732188, 2691685, 2650517, 2519813, 2469446, 2474822, 2459278, 2469364, 2556750, 2596746, 2607364, 2564748, 2440108, 2396987, 2367194, 2346863, 2286883, 2241757, 2315457, 2356353, 2274422, 2114707, 2093471, 2028999, 2024858, 2015182, 1971648, 2006630, 1969952, 1897922, 1821139, 1842033, 1816228, 1764445, 1794629, 1852231, 1849156, 1986780, 2043401, 1987638, 1957362, 1998677, 2113134, 2173379, 2231833, 2255731, 2263192, 2187757, 2070702, 2075410, 2104513, 2160999, 2150509, 2228815, 2245410, 2104881, 1877391, 1841571, 1888840, 1839692, 1760002, 1792759, 1854283, 1775276, 1675859, 1707467, 1855723, 1990900, 2095878, 2043992, 1870977, 1897954, 1939908, 2009196, 2058020, 2187209, 2186521, 2076294, 1900434]
17897A900434r3171j10929m9294L2827K5396m7183k1592K3830k1716k1819Q0721
17886A697504J22154L6957j8117L2418J88269J38758M545k9696j0164P415O1200
17875B231243k1272L609K9441J3897N2752Q2989K0217n1723o6191k9984M2184
17864B307162M3431Q3705J23036Q6515k8641k0057J20685Q3510P9724J69518J9199
17853C067787P8771J11097J81138J76005J96486K51806K05064K72498K06143L32753
17843E079548L72055M28547N02370K09948p0932J7469K03886L46757O02239N13444
17833H205331N61493M23837J79664Q3964K21535M19104O49718Q21605J101216
17824A2667467J395008J448725J696465K247304K515082K744653L600721M529890
$$ y = [1900434, 1807263, 1696334, 1647040, 1679867, 1705263, 1658080, 1636488, 1660318, 1638602, 1616783, 1697504, 1819658, 1856615, 1838498, 1870916, 2059185, 2197943, 2202488, 2172792, 2162628, 2170043, 2231243, 2209971, 2213580, 2243021, 2256918, 2309670, 2392659, 2412876, 2361153, 2294962, 2264978, 2307162, 2350593, 2434298, 2557334, 2643849, 2615208, 2595151, 2715836, 2799346, 2879070, 3048588, 3067787, 3146558, 3257655, 3438793, 3614798, 3811284, 4063090, 4268154, 4540652, 4746795, 5079548, 5451603, 5880150, 6382520, 6592468, 6521536, 6539005, 6742891, 7089648, 7691887, 8205331, 8766824, 9190661, 9370325, 9454289, 9675824, 10094928, 10744646, 11566251, 12667467, 14062475, 15511200, 17207665, 19454969, 21970051, 24714704, 28315425, 32845315]
17816C2845315O079877Q718503J2583621J7452545K2490941K7750843L4793209
17809A62714854M9278192O8278120M6880088k5914626m5181430l0882486j6842745
17802B08329967j841726J4497235L6430833N4788781J9793547m8475583n6562327
17795B26960727m4320770l2899653k0403530q972213Q91237R908995J7730247
17788A48895040K4794188L2392573M6364196P0797072P0950640n959861n7487148
17781C30746700m6274107k9170478j1952335O341153K8752694N4855271M2372334
17774C75671232l7141572p0860722o0123559m8366868l6103197k4949168j6809465
17767H1316681j1684493q738270o858394n657189m781475m007508l271421k622107
$$ y = [32845315, 38925192, 47643695, 60227316, 77679861, 100170802, 127921645, 162714854, 211993046, 280271166, 327151254, 301236628, 256055198, 225172712, 208329967, 206488241, 220985476, 257416309, 312205090, 331998637, 283523054, 226960727, 182639957, 149740304, 129336774, 120364561, 121255798, 131164793, 148895040, 173689228, 206081801, 252445997, 323243069, 394193709, 388233848, 330746700, 284472593, 255302115, 243349780, 249690933, 278443627, 333298898, 375671232, 338529660, 267668938, 207545379, 159178511, 123075314, 98126146, 81316681, 69632188, 60893918, 54035524, 48378335, 43596860, 39589352, 36317931, 33695824]
17759C3695824k398134k351974k183173j794454j914370k003208j648197j425428
17751A7976886j121838r16911q38489p97818p09431n79833l82222k58031j53582
17742A2218731J78k23697o92447p67963o78005n13776m42045l48176l25679k94368
17732G932753l25123l65655l03712k45186j95794l9545q3066q3758l21435l61942
17722E607537j52595k09572k75662k23127j44177j11691j79256j91155j59615
17713C960687j09616j13165r1948j11329k10087j50335j24482J5983P3932j12790
17703C026850j13965j02438n7652K1548m6173l6066m3985o4581l0371j51964r6362
17692B304841k79O586m1593m624n5140r2291m2110L8917L204q2025J5391n2450
$$ y = [33695824, 31297690, 28945716, 26762543, 24968089, 23053719, 21050511, 19402314, 17976886, 16855048, 15938137, 15099648, 14301830, 13592399, 13012566, 12630344, 12372313, 12218731, 12218909, 11995212, 11302765, 10534802, 9856797, 9343021, 8900976, 8552800, 8227121, 7932753, 7607630, 7241975, 6938263, 6693077, 6497283, 6457738, 6374672, 6290914, 5969479, 5607537, 5454942, 5245370, 4969708, 4746581, 4602404, 4490713, 4311457, 4120302, 3960687, 3851071, 3737906, 3645958, 3534629, 3324542, 3174207, 3049725, 3065708, 3139640, 3026850, 2912885, 2810447, 2752795, 2774343, 2728170, 2692104, 2648119, 2583538, 2553167, 2401203, 2304841, 2304562, 2311148, 2269555, 2264931, 2209791, 2117500, 2075390, 2114307, 2117511, 2035486, 2050877, 1998427]
17680A998427j3091Q4216q8829j9639k5678p3179P1688K6895l059O7654M2723
17669B068128o2218j73439p7415K7123o5834O301l8500n7583L3491J04938O5485
17658A830477q9842k232J32591Q3852k7498j1163j24816o6163j9715p9658k2557
17647A603276P611N9392n2110o9893L8107m1812j13478L944J4407p8417n3289
17636A317738Q693M014j6426P5908J41338J41312J2228k6026r4631p8783j8502
17625A466863k6523P6122N8892P1880P7125K5008m8913L0147J8623j13559j38360
17614A497305J3064N4194J0925o4415n3710n7402K5712L6169M1479O0962J20956
17603A685239J0148l5654M3134N3346P9348R1721J33821Q9250P9736r286L167
$$ y = [1998427, 1985336, 2069552, 1980723, 1961084, 1935406, 1862227, 1933915, 1960810, 1957751, 2025405, 2068128, 2005910, 1832471, 1755056, 1782179, 1716345, 1722646, 1684146, 1626563, 1660054, 1764992, 1830477, 1740635, 1738403, 1870994, 1954846, 1927348, 1916185, 1791369, 1725206, 1705491, 1625833, 1603276, 1610887, 1670279, 1618169, 1548276, 1586383, 1544571, 1431093, 1435037, 1449444, 1371027, 1317738, 1326431, 1330445, 1314019, 1389927, 1531265, 1672577, 1684805, 1658779, 1564148, 1485365, 1466863, 1440340, 1516462, 1575354, 1647234, 1724359, 1749367, 1700454, 1730601, 1749224, 1635665, 1497305, 1510369, 1564563, 1575488, 1511073, 1457363, 1399961, 1425673, 1461842, 1503321, 1564283, 1685239, 1695387, 1659733, 1702867, 1756213, 1835561, 1927282, 2061103, 2150353, 2230089, 2220803, 2223970]
17592B223970j06631k3102L7922l6662L9021R2948J24302P1763M4256J04151J10685
17581B682623K6293K16563J70272J26650K35093L33447M05032M30224L2595l01838
17571D356954k20984j31381J7950P5241M4450J29310J42199J50763M9392J8765
17561D632659J76268K23875L08057L34364M57535N11265M95499O57550P40903
17552H537975Q93408J220668J183427R91153J028710Q08812N59509N26032R01884
17543A6651578J417732J995668K610202L666872N356961P244307R889266J4211125
17535F3043711K0052066K6043505L2148893M0609693N8747881P9101972M2017784
17528C61765505m8542576o9318854n6763049m4692090l2063191k1752565j4508224
$$ y = [2223970, 2117339, 2094237, 2132159, 2095497, 2134518, 2227466, 2351768, 2423531, 2467787, 2571938, 2682623, 2708916, 2925479, 3095751, 3222401, 3457494, 3790941, 4195973, 4626197, 4658792, 4356954, 4135970, 4004589, 4022539, 4097780, 4142230, 4271540, 4413739, 4564502, 4613894, 4632659, 4808927, 5032802, 5340859, 5675223, 6132758, 6644023, 7139522, 7797072, 8537975, 9431383, 10652051, 11835478, 12826631, 13855341, 14664153, 15223662, 15749694, 16651578, 18069310, 20064978, 22675180, 26342052, 31699013, 38943320, 48832586, 63043711, 83095777, 109139282, 141288175, 181897868, 240645749, 319747721, 361765505, 313222929, 243904075, 187141026, 142448936, 110385745, 88633180, 74124956]
17521G4124956r587531n967706l467861j902610m76329J292005L406431O059045
17513F3480400R720920J4598627J9689439K4193196L0264080M2608938O2782276
17506B67337876N5746081j7572071n7662110m8038252l5049895k0851411o214284
17499A37695934O345754J6220077K5268813L9508167O1377486N4972467k1135779
17492C20252919o4696293n6297034m4719102l3069638k2512000j5164581j0081560
17485G3712711o327996m505934l731403k379272j226457k41686K086708N284386
17477F2671057R664076J4794980J9381601K3985198L2263446M9017453N7614528
17470B69392339Q812147m9879628n0671322m0492515l2464949k4036980j6412719
$$ y = [74124956, 64537425, 58569719, 55101858, 53199248, 52722919, 54014924, 57421355, 63480400, 73201320, 87799947, 107489386, 131682582, 161946662, 204555600, 267337876, 323083957, 305511886, 247849776, 199811524, 164761629, 143910218, 137695934, 144041688, 160261765, 185530578, 225038745, 286416231, 341388698, 320252919, 255556626, 199259592, 154540490, 121470852, 98958852, 83794271, 73712711, 67384715, 62878781, 59147378, 56768106, 55541649, 55299963, 57386671, 62671057, 72335133, 87130113, 106511714, 130496912, 162760358, 211777811, 269392339, 278204486, 228324858, 177653536, 137161021, 104696072, 80659092, 64246373]
17463F4246373j1199320p711560n555184m493321l827157l262796k888435k434054
17455B2874546k029996j507236r58194q69619q43088p77468r05649j139538j099653
17446A2744105r54348q73486n98243n08251o45623m92070m22932m88027l71519
17437G389606l08596k81644l05353j31808j54871j87587q3707r0215M1787J28128
17427F015740J80628L0312l48054m87066n10947l31171k96289k86174j60166o4108
17417C742705j38876k16225p7190l348k2445o8942l8455r0930j39588j19327p5292
17406B752087K64o6661n9370n3655q1336j9402p9547j45152p3819j15972j39080
17395A918357k9988m6875m4316k1689p5106r004j2511o0328j6037N789J277m9199
$$ y = [64246373, 53047053, 45335493, 39780309, 35286988, 31459831, 28197035, 25308600, 22874546, 20844550, 19337314, 18379120, 17509501, 16666413, 15888945, 14983296, 13843758, 12744105, 11789757, 10916271, 10318028, 9809777, 9164154, 8672084, 8249152, 7761125, 7389606, 7081010, 6799366, 6494013, 6362205, 6207334, 6019747, 5936040, 5845825, 5887612, 6015740, 6196368, 6226680, 5878626, 5391560, 4880613, 4549442, 4253153, 3966979, 3806813, 3742705, 3603829, 3387604, 3310414, 3307066, 3284621, 3215679, 3177224, 3086294, 2946706, 2827379, 2752087, 2752351, 2685690, 2626320, 2572665, 2491329, 2471927, 2392380, 2247228, 2173409, 2057437, 1918357, 1888369, 1841494, 1797178, 1775489, 1700383, 1691379, 1678868, 1618540, 1602503, 1608292, 1609569, 1560370]
17383A560370l5668p098m5461q4243q4806q440K2611N1964j9584j13883m2454
17372A193308m0941p8J06856o2462o2669K6794n5037m8478O6602J5855p5504j72986
17360H91260m6457k1244p9864j03147o7670l3838J43871Q7262l1179n4750L226
17349F87470n2471n4607N5230O7801Q2619J898N837P8616P9567j42287j53684
17338F55989j03220o9194o1913J00452J9532n3860p0274p6577K0059j338N8329
17327D17985M8018R3452j323p5819m5536m3495L0793N906J3676Q7173J6671n2483
17315D95018q3160j8647j1926Q361K5496J1257J4303l9996J1526L4796o460l5921
17303D04647Q537l7889q899k2299K1769J3403l5333k8438J640k4048l1918L19
$$ y = [1560370, 1524702, 1517604, 1472143, 1387900, 1303094, 1294654, 1317265, 1369229, 1349645, 1235762, 1193308, 1152367, 1152289, 1259145, 1196683, 1134014, 1160808, 1105771, 1057293, 1123895, 1139750, 1064246, 891260, 844803, 823559, 743695, 640548, 572878, 539040, 682911, 770173, 738994, 684244, 687470, 634999, 580392, 635622, 703423, 786042, 787940, 793777, 872393, 951960, 809673, 655989, 552769, 483575, 421662, 522114, 541646, 487786, 417512, 340935, 360994, 359656, 417985, 466003, 559455, 558132, 482313, 436777, 393282, 424075, 429981, 443657, 530830, 547501, 495018, 411858, 393211, 381285, 389646, 415142, 426399, 440702, 400706, 412232, 447028, 440568, 404647, 413184, 375295, 366396, 344097, 365866, 379269, 343936, 315498, 317138, 293090, 261172, 261491]
17291B61491K6069O169J9937M6700L3000r703J6720R2692L086m3212j19991k4964
17279C07994P755k0661r983p4431M0738O0139J1111L0897J5009n7080r3288n787
17267B12413P9355J59103M1507N2079Q9475Q9246J46288J66558K63320K99744
17257A599088M53495J26801k68382j92715j12414p7143J2085J51314L40859J97535
17247B230523j22410l93401l24766k61040j56794r1065r8837n0956Q2757J48307
17237I62318J23254J70310K12482K98283J68085j73291k08546j59630j31470K3550
17227A285345P7104J59052L29259J13399k52449k77221k66798k09418j82039q1484
17217F94750p3513j61106K2270l2982q5582j17587m056J3580L6720j440p2452
$$ y = [261491, 287560, 293729, 313666, 360366, 393366, 383663, 400383, 493075, 496161, 452949, 332958, 307994, 315749, 295088, 285105, 210674, 251412, 311551, 322662, 353559, 368568, 311488, 218200, 212413, 291768, 450871, 492378, 544457, 633932, 723178, 869466, 1036024, 1299344, 1599088, 2052583, 2179384, 1911002, 1718287, 1605873, 1528730, 1540815, 1692129, 2032988, 2230523, 2108113, 1714712, 1389946, 1128906, 972112, 881047, 782210, 731254, 814011, 962318, 1085572, 1255882, 1468364, 1766647, 1934732, 1761441, 1552895, 1393265, 1261795, 1285345, 1362449, 1521501, 1850760, 1964159, 1711710, 1434489, 1167691, 958273, 776234, 694750, 621237, 460131, 482401, 449419, 363837, 246250, 242194, 255774, 292494, 291054, 218602]
17206B18602L4889k8412M7321l6516j9991l4682O8410N7145J36333O2991j63043
17195C43047m0284L1253l9774k0097L6190K2301n2805j49434k2018Q9911J1660
17184B09950l4188m8023k8852L363l1289j7875l5501J07842J30242r2415r3534
17173F9720p3959L3477O6450q5360K8063J0525k8698O114R4069J51564j6264j4709
17161B40992J154r8404K8030Q5767j9940o5962j3314r2985r9385O9278O4292J7648
17149A17171m1430O1884J21323k0673j00959N083r384o1637K9042K1784j9477
17138A02727l1887j7340L2674L7142M743k908J0235M4310m1971m6144k9204n114
17126E7263L0306k2649m3126R1672O3604m1045j7902o178J07539O8524k5628q9305
$$ y = [218602, 253491, 225079, 272400, 235884, 215893, 181211, 249621, 306766, 443099, 506090, 343047, 302763, 334016, 294242, 274145, 310335, 332636, 279831, 130397, 108379, 198290, 209950, 175762, 127739, 98887, 102250, 70961, 53086, 17585, 125427, 255669, 163254, 69720, -4239, 29238, 95688, 10328, 38391, 48916, 20218, 26332, 120401, 271965, 255701, 240992, 242146, 143742, 171772, 257539, 237599, 171637, 158323, 65338, -34047, 35231, 99523, 117171, 75741, 137625, 258948, 238275, 137316, 142399, 133015, 71378, 100420, 122204, 102727, 70840, 53500, 86174, 123316, 128059, 125151, 135386, 179696, 137725, 91581, 62377, 57263, 87569, 64920, 21794, 113466, 177070, 136025, 118123, 111945, 219484, 288008, 262380, 173075]
17114A73075p4459J2620M8061q268N8290J28916m2961k18583m6491J28204M9408
17103B07812j2239l2185m5888J473p8537n0501l2484J9739R5897j0428k7517m0923
17091e781p16L3994J25082k478j08673n0787m688k6903N470M590j4152O6382M69
17078B1809J2154k0062o4626J1124M1078O444K3022q084L9162j4657j9270J5184
17066D3278M0397M2416M004L0273m5805O880l2630j101m7423q7680R4714k3286
17054B4037j09010q5125k8854j614P7252O6198O7992O4100l0551J8746M6982K0906
17042A31059q719q809k6544L9554q223p4428k9908J4990j2396j0028j7663K9393
17030A8278J2823Q4138K2898n3331k0438J5916J1137Q514j8650o7856l7264L6572
$$ y = [173075, 98616, 111236, 159297, 151029, 209319, 338235, 295274, 76691, 30200, 158404, 207812, 195573, 163388, 117500, 118973, 40436, -10065, -42549, -22810, 73087, 62659, 35142, -5781, -6497, 27497, 152579, 150101, 41428, -9359, -14047, -40950, -35480, -30890, -45042, 21340, 21809, 33963, 13901, -50725, -39601, 1477, 7921, 30943, 22859, 62021, 47364, 28094, 43278, 83675, 126091, 130095, 160368, 114563, 121443, 88813, 87712, 40289, -47391, 47323, 24037, -84973, -170098, -198952, -200566, -123314, -57116, 10876, 74976, 44425, 63171, 110153, 131059, 122340, 113531, 86987, 126541, 118318, 43890, 13982, 28972, 16576, 6548, -11115, 18278, 31101, 115239, 138137, 84806, 64368, 80284, 91421, 99935, 81285, 13429, -23835, 12737]
17018A2737J0665L8027q842l9756p6151N9574J56050J30129m4365j61229l9586
17007C7253j9540M7647J16753m3914J2168J12218l3424l1268n4651K7073L6023
16996B06338O6800P7091J73409J70038J19498J08466K45134L36521K07000j41125
16986A569170l28620k45730k51532j62981p8358n4920n3066l9013J9508J5753
16976C90211n7018l4803l7722Q8173J07896P1635O1374J56099J63458K16500L16105
16965A441908K94352o1357k68831j82160j11530j80524q9330l6802J04598R7969
16955A008293J27626L79302L62782p4516l89535l58860k23295j57990j91701j03079
16945C79027k5542n9742K2457m3652o2302K9011K4286O7125P0556L8657J58480
$$ y = [12737, 23402, 61429, 52587, 12831, -63320, -3746, 152304, 282433, 238068, 76839, 37253, 17713, 65360, 182113, 138199, 150367, 262585, 229161, 197893, 143242, 170315, 206338, 273138, 350229, 523638, 693676, 813174, 921640, 1166774, 1503295, 1710295, 1569170, 1240550, 994820, 743288, 580307, 501949, 447029, 393963, 354950, 374458, 390211, 333193, 298390, 260668, 348841, 456737, 528372, 589746, 745845, 909303, 1125803, 1441908, 1736260, 1674903, 1406072, 1223912, 1112382, 931858, 842528, 805726, 910324, 1008293, 1135919, 1515221, 1878003, 1803487, 1413952, 1055092, 831797, 673807, 482106, 379027, 353485, 293743, 316200, 272548, 210246, 239257, 263543, 330668, 401224, 439881, 598361]
16934E98361K2108P8372K78507L41249L36345P6953k51688l51519k65356n5664
16924H07668j47333r4105o6412o9842j52689j25362J141R2793j3002l9625J5201
16913B08433k0962j0058l0886j3285M594q432K6631m7066n127L6303P2909o8026
16901A45028o0442n8814P0770L6634j0784r6406J288Q8817K0321N2152k9490o7457
16889I1617k3263o114n3391o1P6896O6752l2766M069N3699q092p2002J7293L9081
16876A53718J1485k6856n1576L3241k901j15307r056O3672m962n9828r2673J3917
16864h7126R0012j7481M2463K7979p1971M8993L2106n1597J7686P633K3867N9593
16852A22157l3305P5276J5007j22692o8187K658J377J8900K4902J4167L7852K0696
$$ y = [598361, 620469, 698841, 977348, 1318597, 1654942, 1731895, 1480207, 1128688, 863332, 807668, 660335, 566230, 499818, 429976, 277287, 151925, 153066, 245859, 232857, 193232, 208433, 187471, 177413, 146527, 133242, 137836, 129404, 156035, 108969, 103842, 140145, 213054, 145028, 84586, 25772, 96542, 133176, 122392, 25986, 27274, 116091, 136412, 188564, 159074, 91617, 68354, 62240, 8849, 8788, 85684, 152436, 119670, 123739, 177438, 169346, 97344, 114637, 153718, 165203, 138347, 86771, 120012, 117111, 1804, -7252, 56420, 51458, -8370, -101043, -87126, 2886, -14595, 27868, 55847, -16124, 32869, 64975, 13378, 31064, 38697, 62564, 122157, 88852, 164128, 179135, 56443, -11744, -9086, -7709, 11191, 36093, 50260, 88112, 108808]
16840A08808p7800p8208k9288M823P0257J5883O2651J6987l3536K4084j3271l3662
16828C7728m2229j1510L764L5723R5112k7127p6646j7552p763L1345k5370j2081
16816a6606J10236J60794L5794j07875o6259n4767r829L5619J7485J5338l986
16805A15944m5971k6216j8856P391L1164K106K4018N0722l2577l2527K1768K354
16793I9320O713j1049l5294n870K0122K3596O8779j9486r7497k1179n0364Q8336
16781F6127o1548k3753k2936k7715O0807R2098m1490K7550N3373l8681K9491R139
16769A22462o3314j07452N9672J06196l0303k9728j6591J6765M7053j9215j3322
16758G2223k2330o9025k613J1131N6920L125m9756j995M9702Q9069k7811j9K781
$$ y = [108808, 31008, -47200, -76488, -71665, -1408, 14475, 77126, 94113, 60577, 84661, 71390, 37728, -4501, -16011, -12247, 23476, 118588, 91461, 14815, -2737, -10500, 20845, -4525, -16606, 93630, 254424, 290218, 182343, 116084, 61317, 51488, 87107, 104592, 119930, 115944, 69973, 43757, 24901, 32292, 63456, 65562, 89580, 140302, 107725, 75198, 96966, 99320, 106033, 94984, 59690, 53820, 73942, 97538, 166317, 146831, 49334, 28155, -22209, 66127, 4579, -19174, -42110, -69825, -9018, 83080, 41590, 69140, 122513, 83832, 113323, 122462, 59148, -48304, 11368, 117564, 87261, 57533, 40942, 57707, 104760, 85545, 72223, 49893, -19132, -21745, -10614, 46306, 49431, -325, -2320, 47382, 136451, 108640, 108621, 111402]
16745A11402j2051j3023j9437j782l906j06688q5790M1434j385p3423K6477J17915
16733b0257Q7225q018k6246r4047L4060Q6639K7940n3268k5959M6758O5869K3947
16721A44643K9682L2810K6141m4479r8718r760O2058J5646j18595p6821l1303
16710f8696K3145r1096O5215J03683J676p8318J3404J06012n333K727L4424P183
16698A14026m3630j05794m1837J337P0147j4083l1047N0757L0974N2393m250q5188
16686f195K5798K9860L3526l0728N723l7313o2364l4335m1990Q8690R4509J5999
16674H1180j05578l4604J359N044n0141N1686M1301o5754J0580L4753k013J0228
16662b1959M7033K2380n8331l698N0756l0309O411K9075j0195m206j8702l2200
$$ y = [111402, 99351, 86328, 66891, 65109, 61203, -45485, -131275, -89841, -91226, -164649, -138172, -20257, 66968, 58950, 32704, -61343, -27283, 59356, 87296, 34028, 8069, 54827, 120696, 144643, 174325, 207135, 233276, 188797, 90079, 80319, 142377, 158023, 39428, -37393, -68696, -45551, -136647, -71432, 32251, 33927, -44391, -30987, 75025, 69692, 72419, 106843, 114026, 70396, -35398, -77235, -75898, -5751, -19834, -50881, -124, 30850, 83243, 78993, -6195, 19603, 49463, 82989, 52261, 57984, 20671, -41693, -76028, -118018, -29328, 65181, 81180, -24398, -59002, -57643, -52599, -102740, -51054, -9753, -75507, -64927, -30174, -32187, -21959, 25074, 47454, -10877, -14575, 36181, 5872, 12283, 41358, 31163, 26957, 8255, -23945]
16650b3945R0856j564q2368j7677O0045J13866N5815n2759m4754r910J7589j7458
16638H7736k973J8915o1678K1573J1420r1683q1953O3399O7323L2479p3851N2378
16626D3085J23308l2118j36560K4323R0620l0725p797N8812N766l1667o1658p7777
16614c2388O7398K7404k7065l8169n5649k5596k3233j6189L5835J30752J3387
16603E6487L6985N2125r1314p9656o6771q4557R845M3350P3810L9208N683K8744
16591B3939K1730K869j9105r437j8213Q682N9984k213l9040j0821l6715N0492
16579C2152k2922m7379K0903l7459J5824Q9280K7775j8804J6198O7646Q439k0156
16567A31497l9530L8606j4796l7509o3450o0210N099P1993N6186j4386l5451n7422
$$ y = [-23945, 66911, 65347, -17021, -34698, 25347, 139213, 195028, 142269, 97515, 87605, 105194, 87736, 84763, 103678, 42000, 63573, 74993, -16690, -98643, -35244, 32079, 64558, -9293, 43085, 166393, 134275, -2285, 22038, 112658, 81933, 74136, 132948, 138714, 107047, 45389, -32388, 35010, 62414, 35349, -2820, -58469, -84065, -107298, -123487, -87652, 43100, 56487, 93472, 145597, 54283, -25373, -92144, -176701, -166856, -123506, -49696, -10488, -4805, 23939, 45669, 48538, 29433, 19996, 1783, 10465, 70449, 68236, 29196, 18375, -18340, 32152, 9230, -38149, -17246, -54705, -38881, 50399, 78174, 59370, 75568, 143214, 151653, 131497, 91967, 130573, 115777, 78268, 14818, -45392, -40293, 31700, 87886, 73500, 38049, -19373]
16555a9373j6480m4611J00051J15102l7314k1130l3116j09932n4147j2264O3205
16544g0009J6878N222N475L6021m182j9142M0141P6711k7751q3668o5307m6193
16532a35804O1768k0667l5497N220L5371k3259m61Q3024L3019l6716k5887l4327
16520i4216l07J9393j6196L2794L7597m3446p2236N1667L9805m813K0761M6958
16508A7761n5182L8644J5887k7879N013M8315K5074k3158j02569n5964O758j5364
16496a22664m3936K6377j1660O1127N0903j0278L4368M7896Q3530n5450o9896
16485i683k1020o1069k1960Q138L2093l5933l5201j2447P8508O8785l3379l1332
16473g4500R5603J00241N9644N4930r1346j53362p6472K2039r40L5313O654j2507
$$ y = [-19373, -35853, -80464, 19587, 134689, 97375, 76245, 43129, -66803, -120950, -133214, -70009, -53131, -47909, -42434, -6413, -10595, -29737, 10404, 87115, 59364, -24304, -89611, -135804, -74036, -94703, -130200, -124980, -89609, -112868, -113329, -30305, 2714, -34002, -59889, -94216, -94523, -75130, -91326, -58532, -20935, -64381, -136617, -84950, -45145, -49958, -29197, 17761, -37421, 1223, 17110, -10769, -5756, 42559, 67633, 44475, -58094, -114058, -107300, -122664, -166600, -140223, -151883, -90756, -39853, -50131, -15763, 32133, 115663, 60213, -9683, -30703, -91772, -113732, -105594, -73501, -109434, -144635, -157082, -78574, -9789, -43168, -74500, 21103, 121344, 180988, 235918, 144572, -8790, -85262, -63223, -64163, -28850, -22196, -34703]
16461c4703P7524k1553p0291J1023L0977j3545J8078J8437J6210N0J7010K6545
16449G5762l8963q7381M1001K4324o125Q0644j497j10558J019Q606Q4529Q6097
16437A57458N5351k6604j29390k9275J04192k4807M713j7581p9715o4310J03156
16426E3188R0939P1661p705n2083j126j5928j19201m8380k0298L3673K2973L1085
16414C8798N0021J5800p1163j537o427p7073n3231O2840K3938p870n5120O8O199
16401g4757N1576k5602m8623N0158Q4755p414O0468l437j9021l7792o1598p6323
16389a07610R4627L5133M0143k5102k3908n7432j24664o314R3544M2642L1055
16378g886j549N8209m7185l1757K0416M2969l6237m4368P8879Q3333q5657j05197
$$ y = [-34703, 42821, 21268, -49023, -38000, -7023, -20568, -2490, 15947, 32157, 32207, 49217, 75762, 36799, -50582, -9581, 14743, 8618, 89262, 87765, -22793, -21774, -13168, 71361, 157458, 212809, 186205, 56815, 27540, 131732, 106925, 111638, 94057, 14342, -49968, 53188, 144127, 215788, 208083, 156000, 154874, 138946, 19745, -28635, -48933, -15260, 7713, 38798, 88819, 104619, 33456, 31919, 25492, -51581, -104812, -41972, -18034, -25904, -81024, -80956, -74757, -23181, -48783, -97406, -47248, 37507, 30093, 90561, 87124, 68103, 30311, -31287, -107610, -12983, 22150, 62293, 37191, 13283, -44149, -168813, -175127, -81583, -38941, -7886, -9435, 48774, 1589, -30168, -9752, 33217, -3020, -47388, 31491, 114824, 29167, -76030]
16366g6030j2226M0343N2977M9603M8725j32130k9970M084O4590k0561k8154p070
16354d5819N8035M614L7085L4849n1234j13411J2792R1209M0022o3347p2337m7258
16342a14800n3198M6652N302O3682N8055K4057J9837o6730j2948K4052O9370M915
16330F8246m3232M8976R4348L2069j10122m5514k9045k3456K6053j8784k32j5013
16318a5706m3581K2618k6306K9013M2776K8390q9168j3986J06421J9247n6003
16307C715K629j3501k1224o8610K4663L1184K7801M9467k4659L5397L4946j9282
16295F2526o3257n0489J02489m1166p0192P2419K2428j9376l0000l465J1906n4262
16283f0439Q351N4298J18173M8057q1032j15369o7588N108N4458r53j03977R4204
$$ y = [-76030, -88256, -47913, 5064, 54667, 103392, -28738, -58708, -54624, 9966, -10595, -38749, -45819, 12216, 16830, 53915, 88764, 37530, -75881, -63089, 28120, 68142, 4795, -67542, -114800, -167998, -121346, -116044, -52362, 5693, 29750, 49587, -17143, -30091, -6039, 63331, 68246, 25014, 73990, 168338, 200407, 90285, 44771, 15726, -7730, 18323, -461, -693, -15706, -59287, -36669, -62975, -33962, 8814, 37204, -51964, -65950, 40471, 59718, 3715, 6344, -7157, -28381, -96991, -72328, -41144, -13343, 36124, 11465, 46862, 81808, 62526, -731, -51220, 51269, 10103, -60089, 12330, 34758, 15382, -14618, -18083, -6177, -60439, -52088, 2210, 120383, 168440, 87408, -27961, -95549, -90441, -35983, -36936, -140913, -46709]
16271d6709J07175J936j0890M6367j34281n9836K457L4206P1430Q3661k4170l9738
16259C1608p679k0992J0691K8732o521O001q869l706p701M248n592N6532M9700
16246A26452M1282p070m9707l1462j29026l6881j3390K4718P4667J6031j0182
16235E432k3692l3880j5800N2923N7394k1755P8565K4315p0804j4840L8315p340
16223F8833k0792N3208L2350m1609j1745l4142n9441q282J3296q0329j8798L8624
16211f8827R133L9687O9664M753L0140O251j4874J9157o5037j03651L1546P2971
16199C0913l0639m9960R781O6931j8350m2968k3072P7268O0810M3946n8450k8822
16187C7388K751j0852Q0628N1951p0552j9246l9333m5051m2913k8718k2647O8093
$$ y = [-46709, 60466, 62402, 51512, 97879, -36402, -96238, -93781, -59575, 11855, 95516, 71346, 31608, 23929, 2937, 13628, 42360, 35839, 41840, 32971, 29265, 21564, 25812, 20220, 76752, 126452, 167734, 160664, 110957, 79495, -49531, -86412, -99802, -75084, -417, 15614, 5432, -18260, -52140, -67940, -15017, 42377, 20622, 99187, 123502, 52698, 37858, 76173, 68833, 48041, 101249, 133599, 91990, 80245, 46103, -13338, -21620, -8324, -88653, -107451, -68827, -59694, -20007, 49657, 54410, 84550, 90801, 75927, 95084, 30047, -73604, -42058, 30913, 274, -49686, -39905, 27026, 8676, -34292, -57364, 19904, 80714, 124660, 66210, 37388, 40139, 29287, 109915, 161866, 91314, 72068, 32735, -12316, -55229, -83947, -106594, -38501]
16175c8501J1353J8495J9783O6332K5381l9499n0101n4028l1896j5354M7281L6340
16163d414P486K9733k0031K7607J3614m0040J4981N6914M3459J5340K2673m3960
16151A23362r1279o3098n0611l8433O7050m5503L721R4554Q0170l8746n4586m0735
16139e4134o4463o770M9359m4322k8537R2234J10269p9m3224k7207M6754N4693
16127H4573m7939q014n5704j6102M1832k1016j49O4057J7059L4129J2388j00627
16115D487m4447L218p0370n2412J464K522n4781n132L9294O3492K7985m3376k3621
16102a51677p447J7882J06065P7737N3535j2003j11357m3076K7270L1025j2788
16091b4834P0839L2406m6331j6690L8529K1774o4175n4407p1421P5018J6913q295
$$ y = [-38501, -27148, -8653, 11130, 77462, 102843, 63344, 13243, -40785, -72681, -88035, -40754, -4414, 3072, 32805, 12774, 40381, 53995, 13955, 28936, 85850, 129309, 144649, 167322, 123362, 32083, -31015, -81626, -120059, -53009, -98512, -94791, -237, 79933, 41187, -13399, -54134, -118597, -125367, -76008, -120330, -148867, -56633, 53636, 53557, 10333, -16874, 29880, 84573, 36634, 28620, -27084, -43186, -1354, -22370, -22519, 41538, 58597, 92726, 105114, 4487, -39960, -36742, -107112, -159524, -158060, -155538, -210319, -215451, -176157, -112665, -84680, -128056, -151677, -159124, -141242, -35177, 42560, 96095, 84092, -27265, -70341, -43071, -12046, -24834, 46005, 78411, 32080, 15390, 53919, 75693, 11518, -42889, -114310, -39292, -22379, -30674]
16079c0674k5549k108N3149p5690p0713o8878M0J39898j005K2768P1647K77j5049
16066a887k8149J4248K2197n9777L5879Q0891K8074j1104J5661l767p2849q842
16054A0575m4901j69j4070M6158M5137J07704R242q5941r0936M8912o4306l0009
16042f2604L7706K2344J13134L1728j72988l6670O0413L0527j0976P6632J2787
16031A02033o9806m6252O2058n2978L4028M9825o9627n2147J6703M545j4347O884
16019b9081m4705l0100k9054J13205Q3644l5638j788Q3987M696M5912n8189k5107
16007G7782j8843p379K2954n0148m8498l772K6744k0398l3695J0250N0341J82243
15995A87581P9113n9809p0479m1606J2394m4449o6461k5785K1835j7172O7967
$$ y = [-30674, -56223, -58331, -5182, -80872, -151585, -220463, -220423, -80525, -81530, -58762, 12885, 13162, -1887, -30036, -15788, 6409, -53368, -17489, 63402, 91476, 80372, 96033, 92266, 19417, 10575, -34326, -34495, -48565, -2407, 42730, 150434, 159676, 73735, -17201, 31711, -32595, -62604, -24898, -2554, 110580, 142308, -30680, -67350, -6937, 23590, 12614, 89246, 102033, 32227, -14025, 48033, -4945, 29083, 78908, 9281, -42866, -26163, -21618, -35965, -29081, -73786, -103886, -132940, -19735, 63909, 28271, 26483, 110470, 115166, 161078, 102889, 77782, 58939, 51560, 74514, 24366, -24132, -27904, -1160, -21558, -55253, -45003, 5338, 187581, 266694, 206885, 136406, 94800, 107194, 62745, -3716, -29501, -7666, -24838, 43129]
15984D3129k6572P2019Q6327o6571o6189k7257J9445N4072k0558q027p1317q7669
15972i9168M4804R6964M9228m213m992k6231k4803j716q0433k4965K8207P5856
15960B8538l8185j3901N2980j2201o5596J3202L5846M9754L1074P728J4470l4724
15948F8985o7268K6527n420O3894M4568n7402o8015m2619Q557M0231J3623p9835
15936e4174J5470L6050K7780L239k482J30419J1237p89o4910o2130K9770m3652
15924B5828K3912J5410o7571J09571K940K1695k4046n2153P780k3636J9469j393
15912E7806J0745m0936M8965o7918p8553p6693N6943J13315R396J8484K6107J930
15900G9591n4437m3416Q3768M7272j2503J013K2716K370m4003j6964J9856n3575
$$ y = [43129, 16557, 88576, 174903, 108332, 42143, 14886, 34331, 88403, 67845, 59818, -11499, -99168, -54364, 42600, 91828, 87615, 82623, 56392, 31589, 29873, -50560, -75525, -47318, 28538, -9647, -23548, 29432, 17231, -48365, -35163, 683, 50437, 81511, 89239, 103709, 68985, 1717, 28244, 22824, 86718, 131286, 73884, 5869, -36750, -28193, 12038, 25661, -54174, -38704, -2654, 25126, 28365, 25883, 156302, 167539, 166750, 101840, 39710, 69480, 25828, 49740, 65150, -2421, 107150, 110090, 131785, 107739, 55586, 63366, 39730, 59199, 57806, 68551, 27615, 76580, 8662, -69891, -146584, -89641, 23674, 33070, 51554, 77661, 79591, 25154, -18262, 65506, 112778, 100275, 101288, 124004, 126374, 82371, 65407, 85263, 31688]
15888C1688n9792m864O4693K5848n1053l8497j4994l4969k1035J4443J24583M997
15876D1048m6587l2430k237R6814l2707J906O29k7793M4510K3787J5015M4713
15864A26668j8574j3041q6330l2589M6462p5888K9951Q0788j4850q3839o2885
15853a04127o717N3356R8835N8640k2222L5083k855o5358p3084K594N2524K0796
15841D7465l3706m4321o6163M4219q210j2967j5236O8499L5125o3400N3761L8343
15829D3409k8425m4350n7890P4924J00182j03331j8271K2536n143l869M0863r1111
15817g0476J52603K3639p2654n9255n2010J3971O0804j1507l0037J9665q682L9218
15805E279P2189P2938q9352k6413l4762M2750O6248l042n6144j119l4803K99k5356
$$ y = [31688, -28104, -32968, 31725, 57573, 6520, -31977, -46971, -81940, -102975, -88532, 36051, 41048, -5539, -37969, -40206, 56608, 23901, 25807, 26436, -1357, 43153, 66940, 81955, 126668, 108094, 95053, 8723, -23866, 22596, -53292, -23341, 57447, 42597, -41242, -104127, -110844, -57488, 41347, 99987, 77765, 112848, 109993, 44635, -28449, -25855, 26669, 47465, 13759, -30562, -96725, -52506, -60716, -73683, -88919, -20420, 14705, -48695, 5066, 43409, 14984, -29366, -87256, -12332, 87850, -15481, -33752, -11216, -16359, -20228, 20635, -70476, 82127, 105766, 33112, -26143, -78153, -64182, -3378, -14885, -44922, -25257, -33939, 5279, 77468, 150406, 61054, 34641, -121, 42629, 108877, 105835, 49691, 48572, 13769, 14068, -11288]
15792a1288j5461k6638j692Q3334L9488o8927k006k1641n8143K6463M4609J6677
15780D775J9695k7963j07743K395Q7598M766l5465m8882p2107P9671M6241N311
15768d1708j1762J7388O1784p5471q1399l8361O8766K6553M4638N1888n2925p5696
15756a06305K1348N9039J14870O968n0645o8989l7654O9548K7650j6948o1065
15745d2183K5965P7474R9727Q0627l3604j5903j4238m0856p3018M582L2588K7726
15733A28887j30554j16621q599O0835k8282K9913N0617n1748j1734L5628J6641
15722b5017k6021n353K5698M5136l8869j3317J15712N0561L3622R255l4637k0260
15710A16510P8608k2340o0671J1820r7491j20040m2905M9337N18M1873N9085k5990
$$ y = [-11288, -26749, -53387, -55079, 28255, 67743, -1184, -3190, -24831, -82974, -56511, -11902, 4775, 24470, -3493, -111236, -108841, -21243, -16477, -51942, -100824, -172931, -93260, -47019, -41708, -53470, -36082, 25702, -49769, -131168, -169529, -100763, -74210, -29572, 22316, -30609, -106305, -84957, -25918, 88952, 95920, 45275, -23714, -61368, 8180, 35830, 18882, -42183, -16218, 61256, 160983, 241610, 208006, 192103, 177865, 137009, 63991, 68573, 101161, 128887, -1667, -118288, -126887, -66052, -94334, -64421, -13804, -65552, -77286, -41658, -25017, -51038, -56391, -30693, 14443, -24426, -37743, 77969, 128530, 162152, 171407, 136770, 116510, 195118, 172778, 112107, 123927, 26436, -93604, -136509, -87172, -86654, -44781, 14304, -11686]
15698a1686M0708M6068k2635l1756n2453k5137m8683o3654K4114J14051R802K7131
15686E870o4l8208j4467l439m0887K29N0242N2700J0625n1391l7442o0802m9671
15673a76705J07770M7387L0777K5352l3960Q6934O6590k9692M6413M1002l6347
15662A75521j09556l2601K5386O498j1712o2544k9899L601K6521M6604m359M3953
15650G7413q6657n6927N7735M1399j5450K5212J2577J0158p625l1824l6377N8503
15638D8137K9396o7622m8520q2245L4258l1563m397K3004M2022Q3766l8080n5722
15626f7566J3926L7076q810N4857M1687P410r0566p4602K3444k9303j0735r05
15614a04087j3181l1383j5434N4224R064N8293P3909J9545q942O119l6142o4006
$$ y = [-11686, 29022, 75090, 52455, 20699, -31754, -56891, -105574, -169228, -145114, -31063, -21261, 5870, 5806, -32402, -46869, -50308, -91195, -90966, -40724, 11976, 22601, -28790, -66232, -127034, -176705, -68935, -21548, 9229, 34581, 621, 87555, 154145, 124453, 170866, 211868, 175521, 65965, 33364, 58750, 65248, 53536, -9008, -38907, -35306, -8785, 37819, 33460, 77413, -9244, -66171, -8436, 32963, 17513, 42725, 55302, 65460, 57835, 26011, -10366, 48137, 77533, 9911, -38609, -120854, -86596, -118159, -122556, -99552, -57530, 26236, -11844, -67566, -53640, -16564, -25374, 29483, 71170, 78580, -11986, -86588, -63144, -92447, -103182, -104087, -117268, -148651, -164085, -109861, -100797, -42504, 31405, 50950, 42008, 48127, 11985, -52021]
15602e2021n1273r695P5263J7005Q932l0620j06428o900n604n5098J5010M4890
15590a56539Q2359O532L3120K8897O1958J5572L8424o3203l0787l238k2166M9598
15578D0527o2761m4367j5330M7296J24530n7621M6194N0696m4547l2519p0296
15567a8198m2854M8025k9984L741L0123J5734N9131L2857q424l7087l6647L8199
15555E4616O792q0578j7341K393J0040n796K7782L8925O7757M3510j07111n3726
15543a2737N762n234K4917m6728j358m8547K6811l7414N0949j4012K963P3805
15531A9177P4195q3246j34379m4372m6415M878M0731R9210L3896K0158n6967l7095
15519a10229Q9384N3040K5670r9938p0532L2665L1584J9657J0803O8622O6306
$$ y = [-52021, -103294, -112989, -37726, -20721, -11789, -42409, -148837, -155737, -161341, -216439, -201429, -156539, -74180, -67648, -34528, -5631, 56327, 71899, 110323, 47120, 16333, 13095, -9071, 40527, -22234, -66601, -81931, -34635, 89895, 32274, 78468, 129164, 84617, 52098, -18198, -61052, -13027, -43011, -39270, -9147, 6587, 65718, 98575, 90151, 53064, 16417, 54616, 61408, -19170, -36511, -34118, -24078, -29874, -2092, 36833, 104590, 148100, 40989, -12737, -6975, -12209, 12708, -34020, -35378, -83925, -57114, -94528, -43579, -57591, -54628, 19177, 93372, 10126, -124253, -168625, -215040, -210162, -169431, -70221, -36325, -16167, -73134, -110229, -20845, 32195, 57865, -42073, -112605, -79940, -48356, -28699, -17896, 50726, 117032]
15508A17032K9531r5295j41780L9736N9291L811n8197k1737J695k0530K0399L4186
15496c1858n7997n1396M2208K0448N3778q215j443j3870p6496n487J07499j5582
15484c8411k0960o0620o9714q0O3059J5444n5990l2246P4569L5368m6004k0394
15472a55979O7855K6162P6973L9306q4160n6425K7578q416m4252p180K5607J3445
15460g9486l4715R400O027l892k2458M5041N6174k9019J6867L9325o2004K9269
15448b9471P201j6865R606p971l8581q8829M5920M1237J3388P8923k0122m0984
15436d6548l9638N9217K1229n4385M7552m9976o520m4895M2438P8365p6408j13217
15424a82786M6464O6896k9524j4593o0657J0976K9695O2988N0530l5906k3383
$$ y = [117032, 146563, 51268, -90512, -50776, 8515, 12326, -45871, -67608, -65913, -86443, -66044, -31858, -89855, -141251, -99043, -78595, -24817, -33032, -34475, -48345, -124841, -130328, -22829, -38411, -59371, -119991, -189705, -189785, -126726, -111282, -167272, -199518, -124949, -89581, -135585, -155979, -88124, -61962, 15011, 54317, -29843, -86268, -58690, -67106, -111358, -118538, -92931, -79486, -114201, -104801, -98774, -102666, -125124, -80083, -23909, -52928, -36061, 3264, -58740, -29471, -22270, -39135, -29529, -37500, -76081, -164910, -118990, -77753, -64365, 14558, -5564, -46548, -86186, -26969, -5740, -60125, -12573, -62549, -69069, -113964, -71526, 6839, -69569, -182786, -136322, -69426, -98950, -113543, -174200, -163224, -133529, -70541, -20011, -55917, -79300]
15413g9300K668M8716K5863R718n6089m874l818N8282M9580L3973m2332J6822
15401E9209j5825l1451r8853q3998L7483L9874J9238N6640M317P7039k151l8810
15389B2712n1563o6457n7959K7035O8435N1242M6802q105O039J2946p7791N425
15377b1239N7314M2577J1889K3407j1440n7623k2130J489n7006j1857N2045m0066
15365c2640r036K5340J0823p390j2945p8909M5060J03879M7059k5175k1033j7980
15353B7053m557L628K4084L8882p0560l9148k1883O0536k5511J4179l2762N6168
15341C0109l5531L4064k8297j30568P4656J58570N5480l0367J0745P2896j7065
15330A94692j00011r5080j2934m6531o9422L8735J02172J772n2375j3065l2857
$$ y = [-79300, -76632, -27916, -2053, 7665, -48424, -53298, -57116, 1166, 50746, 84719, 42387, 59209, 43384, 11933, -86920, -170918, -133435, -93561, -74323, -17683, -13366, 63673, 61522, 22712, -28851, -95308, -153267, -126232, -57797, -6555, 40247, 32142, 38181, 51127, -26664, -21239, 36075, 78652, 90541, 113948, 102508, 44885, 22755, 24244, -32762, -44619, 7426, -32640, -41676, -16336, -5513, -12903, -25848, -104757, -59697, 44182, 91241, 66066, 45033, 27053, 22496, 26124, 50208, 89090, 18530, -20618, -42501, 18035, -7476, 6703, -26059, 30109, -5422, 28642, 345, -130223, -55567, 103003, 158483, 128116, 138861, 211757, 194692, 94681, -399, -13333, -59864, -129286, -90551, 11621, 13393, -38982, -52047, -84904]
15319h4904p2467J0006K8717O5119P9310M5412q437k8376m7137n0273q4552n5244
15307b02826m5459R5151L5716q262J29447O4323M2860J3615l0859l5525l3287
15296B4894o6773j8834k0230J8216n060Q3233J02036L1821K1081j08898r0252
15285b8766Q531l844k2549m6015m6092k9000J24383M0596K1843K3238l3423p9083
15273g0181k0113N9211k3245m566O7516J1055P80m6647j8574k9867k8290P3768
15261b9153Q8559l4287K1140l8352L9708P1552J8388l9791n3756j24107o8741
15250a48840M2255N3260L6005l6894O135J2177O6322N5979J5237m0780k942l5565
15238B2349j8070L2175J15672O7067l195k9643n2308m5694m168L7030k8935m0291
$$ y = [-84904, -157371, -147365, -118648, -53529, 25781, 71193, 62756, 34380, -12757, -63030, -147582, -202826, -248285, -153134, -117418, -125680, 3767, 68090, 110950, 124565, 93706, 58181, 24894, -41879, -60713, -80943, -62727, -67787, 15446, 117482, 149303, 170384, 61486, -28766, -20235, -24079, -46628, -92643, -138735, -167735, -43352, -2756, 19087, 42325, 8902, -70181, -90294, -31083, -54328, -58894, 8622, 19677, 20457, -26190, -44764, -74631, -102921, -29153, 59406, 25119, 46259, 7907, 47615, 119167, 137555, 97764, 44008, -80099, -148840, -106585, -53325, -17320, -54214, -48079, -35902, 30420, 86399, 101636, 60856, 57914, 22349, 4279, 36454, 152126, 219193, 215998, 186355, 134047, 88353, 84185, 121215, 92280, 51989]
15226E1989J5157P119j03890n3435J26232O8291o5248p1547r157j4540Q6220L1044
15214F8235m901n0960p7723L223Q7139K953M935m0288j5733k8957k4069K5944
15202e0202J8046L6650N5741J8398j4538N914O3179j4724o2386l7786o8336l3543
15190h3587M1784l9221j6576P6635P7040M54J22669j9946o8512o261n9800L1702
15178E6381K3961p5523O0899O4311K7461j401L8345l8594r3778j5915m7638j8705
15166b0196J1985J14673j476j44656N0658P7187j3622k9369l1323k5432N387j1145
15154a7329M2231q471o9275N937J2495N2087L8745J7824K2731l2902o3052j0218
15142i197l4697k7107K1413l2978J0885m292k7315L0603N3071M9782m5472p7287
$$ y = [51989, 67146, 74265, -29625, -83060, 43172, 111463, 46215, -25332, -34489, -49029, 37191, 68235, 63334, 12374, -65349, -62126, 25013, 27966, 32901, -7387, -23120, -52077, -76146, -50202, -32156, 4494, 60235, 78633, 64095, 70009, 133188, 118464, 56078, 18292, -50044, -83587, -41803, -81024, -97600, -20965, 56075, 56529, 179198, 159252, 90740, 84479, 24679, 56381, 80342, 4819, 65718, 130029, 157490, 156089, 194434, 155840, 62062, 46147, -1491, -20196, -8211, 106462, 104986, -39670, 10988, 88175, 74553, 45184, 13861, -11571, -6184, -17329, 24902, 16431, -52844, -46907, -34412, 17675, 56420, 74244, 96975, 64073, 1021, -9197, -43894, -71001, -49588, -82566, -71681, -75973, -103288, -72685, -19614, 30168, -15304, -92591]
15130i2591O3856M836p0686J4028m6361p1113K1013P5878Q2223J4168J5067J9156
15118B9474K7622j7703p1888n5019J4858L3888N5001k5007K579J8553M9870M3843
15106A06071n1976p766k6006n2893k0572j7513k4953K9174n527M8387l2907L48
15094e6133J0906N4420L1924k1306o916k7331K6918P383p7327M6715Q901p8622
15082h0468n0168l1534K6549M7210R8391O1951L1013P8119K5431o8905n8939j4054
15070F4596m6637o4283l0258m247N4784O6716K1066R974n683k3083n5648p3679
15058h6382J2992L2296K5358K5499J10876j16860k1609k5407K5247J4240n4444
15047e8194m3062J2964j3346J4267K3766Q9563M3117J0668K4269J9198q2382r2024
$$ y = [-92591, -28735, -23899, -94585, -80557, -126918, -198031, -177018, -101140, -18917, -4749, 10318, 29474, 57096, 39393, -32495, -87514, -72656, -38768, 16233, -8774, -6195, 12358, 62228, 106071, 54095, 46329, 20323, -32570, -53142, -70655, -95608, -66434, -71961, -23574, -56481, -56133, -45227, 9193, 41117, 19811, 12895, -14436, 12482, 19865, -57462, -10747, -1846, -80468, -130636, -162170, -135621, -88411, 9980, 71931, 102944, 181063, 206494, 137589, 78650, 64596, 17959, -46324, -76582, -80829, -26045, 40671, 61737, 71711, 66028, 42945, -12703, -86382, -73390, -41094, -15736, 9763, 120639, 3779, -17830, -43237, -17990, -3750, -58194, -101256, -88292, -101638, -87371, -63605, 25958, 69075, 79743, 104012, 123210, 40828, -51196]
15035e1196L2098m7903J5923K848K3947o0446M6954R7831J1202k3072o7203j385
15023b0402r725n2997L1242M9186l9368o785N108O710K4047l2837j5787L7505
15011b4103N2433Q7489l5327p4229p0703q5489p7311M4448M3962O7063L2129k7655
14999f7293m5057M2149J07402M0046L1583K2363L4906M1718l190o1954l5784n5330
14987E1559p5919l9493O9828P7937p0750j7637p769q178o0173O7374J07370m0890
14975E3259n4509K7567L9574J3631m3230m7428J2211o9856N8934K8753k0202n1103
14963e2399Q85Q6988J22672o1128l5356j9321M0857R4817k3585j32786k3424p276
14951i056l1048K4514N8521L211O3494j5014M0094m3240j16195K3197P0564l1667
$$ y = [-51196, -19098, -67001, -51078, -48230, -24283, -84729, -37775, 60056, 71258, 48186, -19017, -20402, -30127, -83124, -51882, -2696, -42064, -48849, -43741, -37031, -12984, -45821, -61608, -24103, 28330, 115819, 80492, 6263, -64440, -149929, -227240, -182792, -138830, -71767, -39638, -67293, -112350, -70201, 37201, 77247, 108830, 131193, 166099, 207817, 204627, 142673, 106889, 51559, -24360, -63853, 5975, 83912, 13162, -4475, -12244, -20422, -80595, -13221, 94149, 53259, -1250, 26317, 65891, 79522, 36292, -11136, 1075, -68781, -9847, 18906, -1296, -52399, -51514, 35474, 158146, 97018, 61662, 42341, 83198, 178015, 154430, 21644, -1780, -9056, -40104, -15590, 42931, 46142, 109636, 94622, 134716, 91476, -24719, -1522, 69042, 37375]
14939C7375O244k2059n8953n7425k151M6917J46289L1181K8090Q1131M001k0792
14927B19848k6189j12931o1147j3442Q7500O2640p2662J0024K443q7331k5010
14916a6257J0819O903m7206q5119M8499O490l321L4734m5341K3349N7298O7932
14904E8780L3953P9044J4619l965K9399n5754j3574j2857j9035l9567m7582m4431
14892b0970M4993J177J907O4847p241j36p7819p2665j7376K7873L6666L9728Q890
14879B9874m1364N505q369o5553j1345k4521Q213j0991J7167K9363P1413m1991
14867d2599o7262n2380Q4121O4099l9319k2653N699L0296j6933Q333K3694n638
14855c0542k0014o6169P9001N4359l8343j3134Q7975N8178K7187K0856r7350L774
$$ y = [37375, 43619, 21560, -37393, -94818, -96969, -50052, 96237, 127418, 155508, 236639, 240640, 219848, 193659, 80728, 19581, 6139, 93639, 156279, 83617, 93641, 96084, 8753, -16257, -5438, 1465, -45741, -130860, -82361, -75871, -79192, -44458, -89799, -66450, -9152, 58780, 92733, 171777, 186396, 182431, 211830, 156076, 142502, 129645, 110610, 71043, 23461, -20970, 24023, 25200, 27107, 91954, 84713, 84577, 6758, -65907, -83283, -55410, -18744, 20984, 29874, -11490, -5985, -14354, -79907, -91252, -115773, -107560, -118551, -101384, -72021, -608, -42599, -109861, -162241, -78120, -14021, -53340, -75993, -70294, -39998, -56931, -48598, -24904, -30542, -50556, -116725, -37724, 16635, -21708, -34842, 53133, 111311, 138498, 159354, 62004, 65778]
14843F5778m9009m7920k6400P4740L16p613k5410l7147K7776R7365J9905j05261
14831a2880k9618K9560J7819n2095j0845J4386o070N6203n9091l1992K3772Q9673
14819B8822j9207j236N4681J73K051N9644L4763m3119N750l9095l5290l9340J0340
14806A8937o409k6093P4734O8483k5837k9766M4982k1017j7718k0181l9880k3922
14794c687N149m8797O0075R8208n602k4855k9n3286K7394N1403l1362l9214O8856
14781A04253K1383n5557P14l3614j4403L1249o3180m7981k0323P0194m8994j15678
14769a71937k14J20507L8783m6424j08658K8354J06917L5711o1343K404M238l1093
14757h2755m1541L6600O4429L4983j36409J4907J09329N0491q2806p4703P9851
$$ y = [65778, 16769, -31151, -57551, 17189, 17505, 9892, -15518, -52665, -24889, 72476, 92381, -12880, -42498, -12938, 4881, -47214, -58059, -43673, -49743, 6460, -52631, -84623, -60851, 28822, 9615, 8379, 63060, 63233, 65284, 124928, 159691, 116572, 122322, 83227, 47937, 8597, 18937, 12528, -13565, 61169, 129652, 103815, 74049, 119031, 98014, 80296, 60115, 20235, -3687, 1462, -47335, 12740, 110948, 105346, 80491, 80462, 27176, 54570, 105973, 74611, 35397, 104253, 125636, 70079, 70793, 37179, 22776, 54025, -9155, -57136, -77459, -7265, -56259, -171937, -172151, -51644, -12861, -59285, -167943, -139589, -32672, 3039, -58304, -55900, -51662, -82755, -124296, -87696, -23267, 11716, -124693, -109786, -457, 50034, -32772, -107475, -27624]
14746b7624J9751K8698J01707n1006k7127K7818n6716k6558R0400K2733J2068
14735A14144r380o7745r2023L497K9998j7491J3936K8435m6469l3657J02691K7965
14723E3901j12579k0454o063P3800M1404M4638p8790R376N8687k0430R1598m3128
14711I1960l7285j3783q1741m3232l8917p0582N7148R1692O5630m1505M4585M1048
14699F5018m9253p2656k9172K3688n1079N2848P642J7044N8264p0539q395L6374
14687b0216K8351K173p1378J2947O1631P0294J09841j1178o5061l5776p1358K5992
14675C6262M900K7550J8551m456K535n6139l4092q3083n8519O0377J14376n2026
14663b3764n568l6507p7717l9599P4084r148O5P2136J75964L8272p0474m0233
$$ y = [-27624, -7873, 20825, 122532, 71526, 44399, 72217, 15501, -11057, 79343, 102076, 114144, 104764, 37019, -55004, -51507, -21509, -39000, -25064, 3371, -43098, -76755, 25936, 53901, -58678, -79132, -85195, -11395, 30009, 74647, -4143, 5233, 63920, 43490, 135088, 91960, 54675, 40892, -40849, -84081, -122998, -193580, -136432, -44740, 20890, -20615, 23970, 65018, 15765, -56891, -86063, -62375, -113454, -60606, -52964, -35920, 22344, -48195, -56590, -20216, 8135, 10308, -61070, -48123, 13508, 83802, 193643, 182465, 117404, 81628, 10270, 36262, 41162, 68712, 87263, 82807, 85342, 29203, -4889, -87972, -146491, -86114, 28262, -23764, -29332, -65839, -143556, -183155, -109071, -118219, -118154, -46018, 129946, 168218, 97744, 57511]
14651E7511n3389L006L3605O9815P5311k4057j09539k4157M2627R705k6933j0121
14639D3384l0847L244n8852j4874J8046L7887o547k1141J7618K3832o2950r7204
14627a48404J2482M9362j5341M4973N6724R151Q4523n332o8405j5193m0279j1824
14615d7563k4589m8113q8803J0968K9279M0254N8533K8627M599j8023M3720L5179
14603B4068k905m1675m5456k402m8442K9826K7647N4433P8170n5560n1757m840
14591c8893K7479N7494Q7336J5425p536m6980l7061K6184K7953l998m4656q7461
14579b4714o2940j7266R8849L1789o4951p6049R2425M6258n4269J1319J25141
14568A05592J2387m5263M9089J6353k6867J5390n7242m5478q5380k3908k5532
$$ y = [57511, 4122, 7128, 40733, 110548, 185859, 161802, 52263, 28106, 70733, 80438, 53505, 43384, 12537, 15781, -43071, -57945, -39899, -2012, -8559, -29700, -12082, 11750, -51200, -148404, -135922, -86560, -101901, -56928, -204, 8947, 93470, 88138, 19733, 4540, -35739, -47563, -72152, -120265, -209068, -198100, -168821, -128567, -70034, -41407, -36808, -54831, -11111, 24068, 21163, -20512, -65968, -68370, -116812, -86986, -59339, -4906, 73264, 17704, -34053, -38893, -11414, 46080, 133416, 148841, 141305, 94325, 57264, 83448, 111401, 107403, 62747, -24714, -87654, -104920, -6071, 25718, -39233, -115282, -22857, 23401, -30868, -19549, 105592, 117979, 72716, 121805, 138158, 111291, 126681, 69439, 23961, -61419, -85327, -110859]
14557a10859j8272n608P1662j1073N6789R6853l803J3963k9192m8720m7780P2344
14545C6304k4442n0160L0205N7368O2158l6751l5021p7735j6766M8976L1102K1735
14533D6973L7974l8438o9329l9389L1878J3218N156M848j1518j066L7439m0917
14521b3171r076L9498L3889O9134j6648m7262j2896k2399J8206K8725k4534m1071
14509g605K9310m7818K5363J7661L193o089m2045N0659r1975j00565J7935q043
14497a60019J9302K4822O9244R6005J8867M2884m0511k2749o533J1071l8685J635
14485A5333o3382l5061k2839N799R5880O0854l0845O3641l3819j6924O0226J5720
14473A14583n8370p0964O5244O1236q5060o3154n9308l7381o8081M3126N9556
$$ y = [-110859, -129131, -134739, -63077, -74150, -17361, 79492, 75689, 89652, 60460, 11740, -36040, 36304, 11862, -38298, -8093, 49275, 111433, 74682, 39661, -38074, -54840, -5864, 25238, 46973, 84947, 46509, -22820, -62209, -30331, -17113, -11957, -7109, -18627, -19693, 17746, -23171, -32247, 7251, 41140, 110274, 93626, 46364, 33468, 11069, 29275, 58000, 33466, -7605, 21705, -26113, -750, 16911, 20104, 14015, -28030, 22629, -69346, -169911, -151976, -160019, -140717, -115895, -46651, 49354, 68221, 111105, 70594, 47845, 41312, 52383, 13698, 15333, -48049, -83110, -105949, -100150, -4270, 56584, 25739, 89380, 55561, 38637, 98863, 114583, 56213, -14751, 50493, 111729, 26669, -36485, -95793, -133174, -201255, -158129, -98573]
14462i8573j8430l3029K320L7189Q6465L1756L8117r376k2764o4563k3090J0183
14450f3795J6523M9098M9531k6828m1903k2954q630n7264l2294o8282N7177J14763
14438c4858J8508n891K8197K5729l8907o3238q6282Q1292M2691m160Q8548M9209
14426A00838o4702n3649k2540l3008o679K1791N4602l9427j6598N0921K2191o2228
14414d8488L2972P4171K0002K1739L936L5432p0827j7888l4158M7251J3272m0468
14402C6946O81m829j8181m7866Q7139j3173n9237j6445Q1475r891n016K057m8899
14389a5239L9719J5829L2823o6788M1544j7080j58570j11523O899K7766O3553
14378a41067N5879L0778M4143O9141N9431l8393n9526o5507j823J7149o1623M8380
$$ y = [-98573, -117003, -150032, -147712, -110523, -24058, 7698, 45815, 36439, 13675, -50888, -73978, -63795, -47272, 1826, 51357, 24529, -17374, -40328, -48958, -106222, -138516, -206798, -149621, -34858, -16350, -22241, 5956, 31685, -7222, -70460, -156742, -75450, -32759, -36919, 51629, 100838, 36136, -17513, -40053, -73061, -79740, -57949, -3347, -42774, -59372, -8451, 13740, -48488, -15516, 58655, 78657, 100396, 104332, 139764, 68937, 51049, 16891, 64142, 77414, 36946, 37627, 32798, 14617, -33249, 53890, 40717, -18520, -34965, 46510, 36619, 31603, 33660, -15239, 24480, 40309, 73132, 6344, 47888, 30808, -127762, -239285, -232386, -204620, -141067, -85188, -54410, -10267, 58874, 118305, 79912, 20386, -45121, -46944, -29795, -91418, -43038]
14366d3038L7574n7412m9503m999K0442O099K3801O1814l1564p934m024J6245
14354c2499k1139q6976L3988L0980l828j8633J11460N2533o6630N169K9680m6672
14342a2567j8689K6255K261m6264l206k5137L2400P4711O6008j9861n1378p4417
14330d9884r876p568m7104Q77J2935k3737j1887J12189L3248l0482k1884J5024
14318b8149J06108l8047k1529q5136p5962N0555O1487K2024p3132P7023K1258
14307A6500L2955o235j738O9342J0830M626m3803j00614n5981J12983P4585j1603
14295A01847q5722k9671j3747N1029k9480k178p790l9140k8244L0320N7427P626
14283A2277k3210m3187L0397r208k1376O8042P4614L5263j39968l0363K5632m8637
$$ y = [-43038, -5464, -62876, -112379, -117378, -96936, -90837, -67036, -5222, -36786, -44720, -48744, -32499, -53638, -140614, -106626, -75646, -79474, -98107, 13353, 65886, -744, 4425, 34105, -12567, -31256, -5001, -2740, -49004, -52210, -77347, -44947, 29764, 95772, 75911, 24533, -49884, -59760, -67328, -114432, -113555, -100620, -124357, -136244, -24055, 9193, -21289, -43173, -28149, 77959, 39912, 18383, -66753, -142715, -92160, -30673, -8649, -81781, -4758, 16500, 49455, 43220, 41482, 110824, 121654, 126280, 82477, -18137, -74118, 38865, 113450, 101847, 16125, -13546, -27293, 23736, -5744, -7922, -15712, -54852, -83096, -52776, 4651, 12277, -10933, -54120, -23723, -32931, -54307, 13735, 88349, 123612, -16356, -46719, -21087, -69724]
14271f9724p1763K3603P9773K7808l5107R8741k0465R996M486m3829K7032l0935
14259c84q5668n1141N3213Q3765k8830l1154P4368N9545J3832r10M2719N8080
14247A87435m0931j9374j28273n3561L5215R61o9071K577O6156j3916k7687L9184
14235b1285L0417r353M7665P907n862n0771k1524K2042L3806J2614j4804o4956
14223c4104M1865L0033l8211j5994O3422k9677k7672k0512n1003K2832J2820L1693
14211a4508l9253m4642k2670M6253l4164K5252P4582j0196l0914M1240k1864p936
14199c8820M1579o2113l7722R7532J2749m9225O4441Q8098N0372n2751q5155j34543
14187a05558m057J04138K4626l2041O111l219j5902q9241j1367l3809K5656O3578
$$ y = [-69724, -141487, -117884, -38111, -10303, -45410, 53331, 32866, 42862, 47348, 3519, 30551, -384, -86052, -137193, -83980, -215, -29045, -60199, 14169, 73714, 87546, 86636, 129355, 187435, 146504, 127130, -1143, -54704, -19489, -18528, -87599, -85022, -18866, -32782, -60469, -21285, 9132, -221, 47444, 55351, 49489, -1282, -22806, -764, 33042, 45656, 30852, -34104, 7761, 37794, -417, -16411, 47011, 17334, -10338, -30850, -81853, -59021, -46201, -14508, -53761, -98403, -121073, -74820, -108984, -83732, -9150, -19346, -50260, -9020, -30884, -38820, 2759, -59354, -97076, 456, 13205, -36020, 28421, 116519, 166891, 114140, 28985, -105558, -109615, -5477, 19149, -12892, -6781, -10000, -25902, -115143, -126510, -160319, -134663, -71085]
14175g1085J1418Q1650K8831n5467j0381N5032n900k5200P127M04p5076p9900
14163a38547j1626J6847J9104M4163P6697r342P8411j6327o9567K9992j10418
14152i0613j05175K5896O528n3675k1687J01769R8984J4373J1190N9616M3786
14141I0992p0515k8009o8352O3024k9615j4028O047K8732J11203J9431k6176o0875
14129B1859j2741j306M566m4936m1813J1861M5912O1417o1708K0812p295k6076
14117b9448m4853k7422N7634o6693J1652M4992J10665N2010j3743n8825P758n8837
14105a5110J5356j4087M8916N1521p807m208m0205q6026K4499N3607k3063K5943
14093B9336J4244k0824p4149J8085o5542P3840J38732J00136r2243j36131m4367
$$ y = [-71085, -59667, 21983, 50814, -4653, -15034, 39998, 34098, 8898, 16025, 16429, -58647, -138547, -150173, -133326, -114222, -70059, 6638, -2704, 75707, 59380, -10187, 19805, -90613, -195788, -169892, -163364, -217039, -238726, -136957, -37973, -23600, -12410, 47206, 90992, 20477, -7532, -75884, -12860, -42475, -56503, -50456, -21724, 89479, 108910, 82734, 21859, 9118, 7812, 12378, -32558, -74371, -62510, -16598, 44819, -16889, 3923, -3372, -29448, -74301, -101723, -44089, -110782, -99130, -54138, 56527, 108537, 94794, 35969, 43727, -15110, 246, -13841, 35075, 86596, 78789, 74581, 34376, -51650, -27151, 26456, 3393, 29336, 43580, 22756, -51393, -33308, -98850, -25010, 113722, 213858, 121615, -14516, -58883]
14082e8883m943J06791R054K8854m9670p0764K5804M1263J15531J4322j14568
14071D2791j665K825J6405m2483j01856k8054P8099l757k1944R3736Q4009q1079
14059C7027n4808k4075j5420k7895Q456M9178J30593k0881j06249n7436P9501
14048b009J6524L8330o9562j09464k4776M6203P4116j4367l4965p024P0176p673
14036b4491L2222j8045j08254q0869L4729K7866k3466J7795j0913L5676L7487
14025h0263l254K2580r74K5999K955j6346j26187k2115R5243R2544P1327J07049
14013A68558P640m9753o4593j70K6134M4951q4968j1909j6220N0790Q2949m3264
14001A10145j09252K3891L6609p057K6133R04N1746n5674m2033J0159j4527J7442
$$ y = [-58883, -63826, 42965, 52019, 80873, 31203, -39561, -13757, 27506, 143037, 157359, 42791, 41126, 43951, 60356, 17873, -83983, -112037, -33938, -37695, -59639, 34097, 118106, 37027, -17781, -41856, -57276, -85171, -76715, -27537, 103056, 82175, -24074, -81510, -2009, 14515, 52845, -16717, -126181, -150957, -104754, -30638, -45005, -79970, -86994, -16818, -24491, 7731, -10314, -118568, -199437, -164708, -136842, -160308, -142513, -153426, -117750, -80263, -83517, -60937, -61911, -35912, -32957, -49303, -175490, -197605, -102362, -9818, 61509, 168558, 176198, 126445, 61852, 61682, 87816, 132767, 47799, 35890, 19670, 70460, 153409, 110145, 893, 24784, 61393, 54336, 80469, 81373, 133119, 77445, 35412, 45571, 31044, 48486]
13989D8486M095j12238n5802J3718Q6245j7938N9730M177M0817L6029o9527m0286
13977b494N388K7462j4790J6611m797r6468k9990J7678l7355J00852K9737N894
13965A7728M3332l6254m0993m025m224N439M521k2791M311J9289R041O3545M154
13952F3073M2065j5695k91m5446o3376J4933r511r2151K3575L2723M4894J06488
13940A01281P882m1011j4314k5436j574k9758R2603K5679r6738n7550n8071K7671
13928f9336O2815L1065O4329j1098k7897j6317J5227L9310L154k6949q903M1451
13916I6851m2130q2535l5230l4595M2350N5120J13469P0042K9879n2307n3806
13905A07108l0903l3404j3947M9172L3266j9676n2848J10386Q5793j00986o3581
$$ y = [48486, 52581, -59657, -115459, -101741, -15496, -33434, 26296, 30473, 71290, 107319, 37792, -2494, 2894, 30356, 15566, 32177, 27380, -69088, -99078, -81400, -118755, -17903, 11834, 17728, 61060, 24806, -16187, -20212, -24436, -18997, -14476, -37267, -32956, -13667, -4626, 58919, 63073, 105138, 89443, 89152, 43706, -19670, -4737, -14248, -106399, -82824, -50101, -5207, 101281, 109163, 68152, 53838, 28402, 26828, -2930, 89673, 115352, 18614, -38936, -97007, -69336, -6521, 24544, 88873, 77775, 49878, 33561, 48788, 88098, 91252, 64303, 55400, 96851, 54721, -27814, -63044, -97639, -55289, -169, 113300, 183342, 213221, 160914, 107108, 76205, 42801, 28854, 78026, 111292, 91616, 38768, 149154, 234947, 133961, 70380]
13894G0380n4511k6306K363j5019K4327k3596j623k5496P7807o5875j77991k0109
13882b35649M8142J6849K6147R0987j3361o6515k3554L5986Q2245j8651j39580
13871a96954N8286R9562N5258R447P539N306k3359Q1280P0047p2816k5747l9014
13859B8835R043j3181K1741M7176J3959n9157p4307r009o0382q0868P5847J21835
13847B1532k4691M3674j509l9669m1596L1484j1558M030o36L8407O6735o9841
13835A6362q4973L0748R5464L1710m0756l0851j19838L5638j7565L8004P5231
13824B9174L0118k6396P68N6000L8478O7691m3021j08533l0119J066M6968O4009
13812A26203N8043k3504o5794n649m6586P470m87n9615l7519O7963l1597o6387
$$ y = [70380, 15869, -10437, -8074, -23093, 1234, -22362, -23985, -49481, 28326, -37549, -215540, -235649, -187507, -170658, -144511, -53524, -66885, -133400, -156954, -120968, -38723, -57374, -196954, -138668, -39106, 16152, 25599, 33138, 38444, 15085, 96365, 166412, 93596, 67849, 28835, 37878, 24697, 46438, 93614, 107573, 48416, -25891, -34900, -95282, -176150, -100303, 21532, -3159, 40515, 39006, -663, -42259, -10775, -22333, -18303, -18939, 19468, 86203, 16362, -68611, -37863, 57601, 89311, 48555, 17704, -102134, -66496, -84061, -46057, 29174, 59292, 32896, 33664, 89664, 128142, 195833, 152812, 44279, 14160, 15226, 62194, 126203, 184246, 160742, 94948, 89299, 42713, 50183, 49696, -9919, -47438, 20525, -11072, -77459]
13800g7459O1614P7996O0557j5170q0286k8K3289j6829k106J0499m6799r8951
13788a03673k1654j1951M8706M6618K6529p8417N921k1015N0825J860m437O236
13776e4452k6788l1201O6658O2078Q712o0577O9485M0178L68o7494m6703j8376
13764e8112O155k8907M5785J7277R578q443p1926j6951J02078J964o5253N5358
13752a1397K5724n2570n2862l082j4723K6758M1005O9797N5383j6825J7212j17189
13740c2769q0712k334J2962R103L3540N5684j0244m9910j1349N7646O3745J13991
13728A59353L3019r1919p1479K555L8279K3220J3929o5705K915J28650K7524n3559
13716A46782j60638o7720L4543J8603m5833k0242N0486N524k3515N6845L4057
$$ y = [-77459, -15845, 62151, 122708, 107538, 27252, 27224, 50513, 33684, 31578, 42077, -4722, -103673, -125327, -137278, -88572, -41954, -15425, -93842, -87921, -108936, -58111, -56251, -60688, -54452, -81240, -112441, -45783, 16295, 25007, -35570, 33915, 74093, 74461, 6967, -39736, -58112, -51957, -80864, -35079, -17802, -8224, -16667, -88593, -105544, -3466, -1502, -66755, -11397, 14327, -38243, -91105, -94187, -108910, -82152, -41147, 28650, 84033, 67208, 84420, -32769, -113481, -115815, -102853, -93750, -60210, -4526, -14770, -64680, -76029, -18383, 45362, 159353, 192372, 100453, 28974, 31529, 69808, 93028, 106957, 41252, 44167, 172817, 200341, 146782, -13856, -81576, -47033, -28430, -74263, -94505, -44019, -38495, -62010, -5165, 28892]
13705B8892J3759p0830j9128K7683l5149o010J6091O6332P71K056j5093L0344
13693C9718R146q8940n9593m4576m8130K6911J01233j7812K4115O6161J06479
13682A14712M8190j04396j63764k509L9089J9882N0487k718J7720r804o4755K5455
13670c2411Q1293P9765K0128n0404l8296M3228L2399j09289k7661q866k9279j6793
13658e6186N5570P1538o3783o2136L9862K7467K6389K5950q1119p6818N2908n6383
13646i6741k1210M4537J22057o6968o8001M7767N1664k0365P39j6659K409R652
13634a1119P6488K6207m9203m7322q998j0341p012J7702k2371k6895O4327J0157
13622A1620q580N2582N1660k8040m0286l9545k2954m4537n4787l9526K8943P1817
$$ y = [28892, 42651, -28179, -47307, -19624, -54773, -60783, -44692, 21640, 22411, 24467, 9374, 39718, 48864, -40076, -99669, -144245, -192375, -165464, -64231, -82043, -57928, 8233, 114712, 162902, 58506, -105258, -107767, -68678, -48796, 1691, -1027, 16693, 6889, -57866, -32411, 48882, 128647, 148775, 98371, 60075, 103303, 135702, 26413, -1248, -10114, -39393, -56186, -616, 70922, 7139, -54997, -15135, 12332, 38721, 64671, -16448, -93266, -40358, -96741, -117951, -73414, 48643, -18325, -86326, -38559, 13105, -7260, -6521, -23180, -20771, -11119, 65369, 91576, 42373, -4949, -13947, -24288, -31300, -13598, -35969, -62864, 1463, 11620, 3040, 55622, 107282, 79242, 38956, -589, -23543, -68080, -122867, -162393, -133450, -61633]
13610f1633J0199j3396M7131M5405j7977n1436o5440M6256L5106R9628n2203l0477
13598h837P0568m4229J5972R3912Q4521N104j44775q8951j1844K8996p0950L3333
13586c7180M9115M933m5630M6973Q234j4248l848m3453L3009M7592N4999m0605
13574E9891l3549K6994l4061L7911P2866m1262p5953k3261l7193L5560N0570M1593
13562H0106K6640j20182l4800J272k5006j0752K9421N1885k2922n1827j784q350
13550h6299O5328M0842P6317m6395q6057r264k3344M1739O1015J1091l8174M7249
13538E4048L0717K2723o2337p1084j10212q889K1852J8360L2495k8977q8858n6978
13526b47140J27626N4926K9374Q2974R2833j25883j49355J2248N3070N20l8019
$$ y = [-61633, -51434, -64830, -17699, 27706, 9729, -41707, -107147, -60891, -25785, 73843, 21640, -8837, 61731, 17502, 33474, 127386, 211907, 217011, 72236, -16715, -28559, 437, -70513, -37180, 11935, 16868, -28762, 18211, 26445, 12197, 8349, -35104, -2095, 45497, 100496, 59891, 26342, 53336, 19275, 57186, 130052, 88790, 12837, -10424, -47617, -12057, 38513, 80106, 106746, -13436, -48236, -46964, -71970, -82722, -53301, -1416, -24338, -76165, -77949, -86299, -20971, 19871, 96188, 49793, -36264, -45528, -68872, -27133, 33882, 44973, 6799, 54048, 84765, 107488, 45151, -25933, -136145, -145034, -123182, -104822, -72327, -101304, -190162, -247140, -119514, -64588, -35214, 47760, 140593, 14710, -134645, -122397, -69327, -68807, -106826]
13515a06826q60M22J0671R1200p250L2614p82R7150o088p6649p841l273l1288
13502h800l603L5845J0495r348K0531J4215n0938j5595Q3900Q7677n8857p8215
13490B7307r7158n6617J00448O0459m8416m3364J01761j6412k8651O1789P3148
13479A34294q7234o4799M1007K0765k3384J7897J2242J8792m8842k3499Q1703
13468G8942j8032o0880n994n3993K675Q4739N8843j56n9461k2918m784r337j2707
13455b3063l196J494O7360m035n374Q460l5334l7751N3643N0569n7334J0329M7878
13442G3646L6267l0209l0062j04447k8768j9046j2373J19580J4301k8414k1754
13431c1279q3381m1050n434K9891J10760R5787o6158L1477M8662l0854j7656j03883
$$ y = [-106826, -107686, -107264, -96593, -5393, -12643, 19971, 19189, 116339, 110251, 33602, 25761, 22488, -8800, -12403, 23442, 33937, 24589, 45120, 59335, 8397, -7198, 76702, 164379, 105522, 27307, -69851, -126468, -26020, 34439, -13977, -57341, 44420, 28008, -643, 61146, 134294, 47060, -17739, 23268, 44033, 20649, 38546, 50788, 69580, 20738, -2761, 78942, 60910, 30, -5964, -59957, -57282, 27457, 86300, 86144, 26683, 3765, -1019, -10356, -23063, -26259, -24765, 42595, 38560, 33186, 41646, 6312, -31439, 22204, 72773, 15439, 25768, 73646, 109913, 79704, 49642, -54805, -83573, -102619, -114992, 4588, 18889, -9525, -31279, -114660, -155710, -161144, -131253, -20493, 75294, 9136, 40613, 89275, 58421, 40765, -63118]
13419f3118M5765M7676M7776o7858j2312Q9293N5883k0946q6375N6396l3506n8642
13407C2j7450R5908k659n3468N6233J13613O2875k8600p6551p9222J7706l2946
13395E5471m0810R7545n3034l0431q6924q4016k3566J10739P3865j7462N3121
13384E4498k3303M9419k7086l5255j936k8401j0029K7416m7069J2878P8141Q153
13372E7426K1256L6801n9023k2202j47726r9839N0498J26801p5188o1077l3559
13361b05832J20230Q9587j1430r8961M968p026K545Q3998Q9567p904J24Q549m1503
13348B6912L4456l5906j1865J5096J6464o6765m5682k1495k6176l8135Q8591P2174
13336G669p124l3334K6868Q4060k3982k7211M3369M3354n5876n1991L5181k7444
$$ y = [-63118, -17353, 30323, 78099, 10241, -2071, 87222, 143105, 122159, 35784, 92180, 58674, 32, -17418, 78490, 75831, 22363, 78596, 192209, 255084, 226484, 149933, 70711, 88417, 55471, 14661, 112206, 59172, 28741, -58183, -142199, -165765, -55026, 18839, 1377, 54498, 31195, 80614, 53528, 18273, 16337, -12064, -22093, 5323, -41746, -28868, 49273, 57426, 78682, 115483, 56460, 34258, -113468, -213307, -162809, -36008, -111196, -172273, -205832, -85602, 3985, -7445, -106406, -101438, -108464, -105919, -21921, 67646, 59742, 59866, 68415, 26912, 61368, 25462, 13597, 28693, 45157, -21608, -67290, -88785, -114961, -153096, -64505, 7669, 545, -32789, -5921, 78139, 54157, 26946, 70315, 113669, 57793, 5802, 40983, 13539]
13324A3539k6384m6386k3838Q99k3936K9371K539k0304Q8457p215q090N3070J4056
13311D5778o7182n4695k3830L28j6519L869O4725O1673k1538K9157n7997q9996
13299a26227J8907p4541j23811L7953J43634Q0313N2894k4249Q950L4077n3694
13288b5794j4368j3183J0829j246L0370l7433L8787K3509M4976J3344q1154K8999
13276A7636O9165Q5095M3938k3208j39832m9651L0466m7822r9885L1435N4089
13265b8574k7215M4224M6376J5807n2389k9867N0276J1794l496m2123L273J9534
13253G620Q4041P2650r9146j05389M2616J4414k7035l7961R5771R6354j1732o3013
13241F9190l0991r430l3571M5434j4858O2046q2212l6812o1617k2556j7846P4684
$$ y = [13539, -12845, -59231, -83069, -82170, -106106, -76735, -74196, -94500, -6043, -13258, -21348, 31722, 45778, -21404, -76099, -99929, -99601, -116120, -112251, -47526, 14147, -7391, 21766, -36231, -126227, -107320, -181861, -305672, -267719, -124085, -43772, 9122, -15127, -6177, 27900, -25794, -40162, -53345, -42516, -43762, -13392, -50825, -12038, 11471, 56447, 69791, -11363, 17636, 86801, 171896, 215834, 192626, 52794, 3143, 33609, -14213, -114098, -82663, -28574, -55789, -11565, 34811, 50618, -1771, -31638, 18638, 30432, 26936, -15187, -11914, 7620, 91661, 164311, 65165, -40224, 2392, 16806, -10229, -48190, 47581, 143935, 132203, 69190, 38199, 28769, -4802, 40632, 25774, 87820, 5608, -31204, -92821, -115377, -133223, -58539]
13229e8539O0091O938l536j08123l1880M9513J04697m3615J543L1765N7762n0234
13217A6382r8941L1958p52n8306n010j101m9941r87N6209R5180m628l4225J8240
13204c5922K852j1242j057K6290P505L381N410p1554k7862L6805m0550R808R8089
13191A953N7533k6033k550M5623K3102l7754p9719k5185p9899n5404J02467M7239
13179b8627k3426M0172M12m0007K7655O247K1418k2192J814L9969K5018j3729
13167C4724l2905M6293L8418J2849k8663l7958n480k3728j5681J0630K5121N4058
13155G7678O694j33744l9476L0060J463P1711R3633J2467q6097n615Q3257j5036
13143I6995p5216j7131M7843L4810n1223q2089L2954N9066j5802m1011k9473l313
$$ y = [-58539, 1552, 8490, 4954, -103169, -135049, -85536, 19161, -24454, -22911, 8854, 66616, 16382, -82559, -50601, -51353, -109659, -114669, -115770, -165711, -166698, -110489, -15309, -19937, -54162, -35922, -33070, -44312, -45369, -19079, -11574, -8193, -2783, -74337, -102199, -65394, -105944, -96136, 1953, 59486, 33453, 30903, 76526, 99628, 61874, -17845, -43030, -122929, -178333, -75866, -28627, -52053, -11881, -11469, -51476, -23821, -17574, 3844, -18348, -16534, 23435, 48453, 34724, 1819, 48112, 86530, 99379, 70716, 32758, 27278, 3550, -12131, -1501, 23620, 77678, 84372, -49372, -88848, -58788, -57325, 14386, 108019, 120486, 34389, 28774, 112031, 96995, 21779, 4648, 52491, 87301, 36078, -46011, -13057, 46009, 30207, -10804, -40277, -43590]
13131d3590k4479k1266P3397N8974J0092J0648q0318r693P880o3667L3983R9579
13119E1540R4422J2924j08625l5641m0422k0255m1669m1865P9356J04299m7264
13108F800p3797M0060O5693l3026n2442R7368J1969K1987K376N3604k4k9574l9246
13095G1748j00028n086P6195l9914m2990K6626O1974K8161p0810M2365J7288n4149
13083A1380j8592M4769L0877l399l7091O096j7210q9511j2313l0377j6626p79
13071a32776L1274K9525Q973O3779J20569K7824K8569J1150l6666l6919q0778
13060C4524R70Q069j11202q9329l5396N1480R4566j9158k8678K9919K5224L9645
13048F34J06324O1155o0023o5639o0064J54m2782J9165J3358m5922Q8122p5765
$$ y = [-43590, -68069, -89335, -15938, 43036, 53128, 63776, -16542, -26235, -18355, -82022, -48039, 51540, 145962, 158886, 50261, 14620, -25802, -46057, -87726, -129591, -50235, 54064, 6800, -66997, -26937, 38756, 5730, -46712, 50656, 62625, 84612, 86988, 140592, 140568, 110994, 71748, -28280, -33366, 42829, 2915, -40075, -13449, 48525, 76686, 5876, 48241, 65529, 11380, -7212, 37557, 68434, 65035, 27944, 34040, 16830, -72681, -84994, -115371, -131997, -132776, -101502, -71977, -63004, 775, 121344, 149168, 177737, 188887, 152221, 115302, 34524, 35494, 43563, -67639, -156968, -192364, -140884, -46318, -65476, -94154, -64235, -39011, 634, 106958, 168113, 108090, 42451, -17613, -17459, -60241, -41076, -27718, -73640, 14482, -61283]
13036f1283n5275K0882K9473M4269K0624N5686k7983r3564l2824P2085M882J3861
13024i167R0557n4675l2536J8470m41R4614O753l4991p7975O0320L0772n4008
13012C7693q9362l2574o952m928J3808m4591N1186J8840J4583L5063j1901L1506
13000A2371n4295p2612k868j4862N446n0204L9713R0562N8392j5125J3464J1063
12988B1045J2130j35309k5891Q8477M2216Q017K4976n0065q6557k4379L7111P9702
12976h527O1454j4266j6973j8268K011n3898m0227K3496n3616m2435N2322R6971
12964a1956k0577k4953l4652j4193R7932R1678M5201j2414k9459j8916l3870m9647
12952a5826N1458q4676j15332J04890M6848N812n424K3107o6038Q9458N3557M4288
$$ y = [-61283, -116558, -95676, -66203, -21934, -1310, 54376, 26393, -67171, -99995, -27910, -23028, -9167, 81390, 26715, -5821, 12649, 12208, 106822, 113575, 78584, 609, 60929, 91701, 37693, -51669, -84243, -91195, -96123, -82315, -126906, -75720, -56880, -42297, -7234, -19135, 12371, -41924, -114536, -117404, -132266, -126820, -177024, -137311, -46749, 11643, -3482, 9982, 21045, 33175, -102134, -128025, -39548, 2668, 10685, 35661, -14404, -100961, -125340, -88229, -8527, 52927, 38661, 21688, 3420, 5431, -48467, -88694, -65198, -118814, -161249, -108927, -11956, -32533, -57486, -92138, -106331, -8399, 83279, 128480, 116066, 86607, 67691, 33821, -15826, 35632, -49044, -164376, -59486, -12638, -6826, -12250, 10857, -55181, 34277, 87834, 132122]
12940A32122n412O6532j02918Q826l3314o9752J6686j9958m1473J6601k9032r963
12928g1055N5946L171r393k9218o3809J6918O2294J9760J6377J9361k3662j35863
12916a39173p1716J7446J4098J0956Q9685M2381k6809k5287O3379Q4612q3688
12905b4116o5428N4058N1294n0652k1311o271O064R0056J8619j0986O849k4100
12893B4076l9288K4264j8436k8304j0987m2005j12K3022N7913P6829j6295J5075
12881F5752n9563l6225l2180J5451O3839J9670k8332m1867Q169K5993m5483n917
12869e0693L0322l2314m424k2553J7982K8555n0888K3750L5896m2941l6927m6876
12857a51111K9311J28817O7584o4565j6915j4268l576j0871L5642M2516P176m6282
$$ y = [132122, 126710, 193242, 90324, 99150, 65836, -3916, 12770, -7188, -48661, -32060, -61092, -71055, -15109, -11938, -21331, -50549, -114358, -97440, -35146, -15386, 991, 20352, -3310, -139173, -210889, -193443, -179345, -168389, -78704, -36323, -63132, -88419, -25040, 59572, -24116, -89544, -35486, 15808, -34844, -56155, -62426, -56362, 33694, 52313, 41327, 48176, 24076, -15212, 9052, -9384, -37688, -48675, -90680, -90792, -67770, -9857, 66972, 50677, 65752, 6189, -30036, -62216, -46765, 17074, 36744, 8412, -33455, -25286, 707, -44776, -50693, -20371, -52685, -57109, -79662, -61680, -33125, -84013, -60263, -24367, -67308, -104235, -151111, -121800, 7017, 74601, 10036, -6879, -21147, -24723, -35594, 48, 42564, 49740, 3458]
12845C458k8718n4711k8144J0365K5370Q0997n8700j7673l8694J1928J31004j329
12833C5153J844l7374p6321N933P8845K163m8137P532M3641O0965K5397m4289
12821E5352o0780M2240M7956J7563m6566k9119j4596k8568j3565p7973R2794J09787
12809I4525L3875Q305o2261p5759m9681K9873m934k8329j6334K6324l8510l5191
12797a18097Q1631L8411q2220p2386l6831J331O5033L7304K5290q122n7734k3269
12785a49659j9768L496M5243l6531N7099J06800q859J6384q2014l6362L5742O0613
12773g816K7674J9690J7269r813m515N8847j9777j08948p5064k0680L6466k2611
12761a09278L6998J08070l0726o9307J6389J30127M8642j55165j163M2220J16160
$$ y = [3458, -25260, -79971, -108115, -97750, -72380, 8617, -50083, -67756, -106450, -94522, 36482, 35153, 36997, -377, -76698, -70765, 8080, 10243, -37894, -30362, 13279, 74244, 99641, 55352, -5428, 36812, 84768, 102331, 55765, 26646, 12050, -16518, -30083, -108056, -15262, 94525, 128400, 136705, 74444, -1315, -50996, -21123, -26057, -54386, -70720, -44396, -82906, -118097, -36466, 1945, -80275, -152661, -189492, -188161, -123128, -85824, -60534, -68656, -126390, -149659, -169427, -165931, -120688, -157219, -100120, 6680, -2179, 14205, -67809, -104171, -68429, -7816, 19858, 39548, 56817, 47004, 42489, 101336, 81559, -27389, -102453, -123133, -86667, -109278, -72280, 35790, 5064, -64243, -47854, 82273, 130915, -24250, -25413, 16807, 132967]
12750A32967j3565q0814N8949J6558j8062j39440P720O4762J5892R0103J2252
12739A47322m8564q1579K0137j5833j5683L9929k7478J1155m8534k811L21l2713
12727e4331J6854J703K4848m79K8432k8536j2192Q4717p932j3140J4092j4079
12715C9957m9982m2237L9546N7485m0557k8427l8860r63j5922O4029K9971L4022
12703D8062O4337L2149n6847o9984o1202r3996m3126L8702L4655K882K5882K1072
12691e7414k6574r0031j469K2395J2495N8059N1685m8155q9335j1367M6749M5435
12679h7527l9790o9454M5457K6465M081J1138l7188j8908P1787L0964k0560J7459
12667f6076J653n9238l9861Q5424N460k1250k0525M4390M3367N492J17355N0857
$$ y = [132967, 119402, 38588, 97537, 114095, 96033, -43407, -35687, 29075, 44967, 135070, 147322, 98758, 17179, 37316, 21483, 5800, 45729, 18251, 29406, -19128, -21939, -21618, -54331, -37477, -35774, -10926, -11405, 17027, -11509, -23701, 61016, 53084, 39944, 54036, 39957, -10025, -52262, -12716, 44769, 4212, -24215, -63075, -64038, -79960, -15931, 14040, 48062, 112399, 144548, 87701, 17717, -43485, -137481, -180607, -141905, -107250, -104368, -78486, -57414, -83988, -174019, -175488, -153093, -140598, -82539, -30854, -79009, -168344, -179711, -132962, -87527, -127317, -196771, -151314, -124849, -120768, -109630, -146818, -165726, -93939, -62975, -83535, -66076, -64423, -123661, -163522, -78098, -72638, -93888, -114413, -70023, -26656, -21164, 96191, 147048]
12655A47048r6775q685J2900r6127K9980K6614M1828J5761l0631N341N4870L5921
12643A38045K9443Q8309n9426p9617j09256K3732K7194p4809J4743K9368N752
12632C3478p5261k4840N1101R2849j4659l4440p494l4166r955n5k2216m5506l6619
12619a27783J9386N4192M1558j379j3201j7942n8456O173N3385J0395o0145l2803
12607a26620k4715K4966J00215P0659K1419j8033K0724N1369j09072q4268J1195
12596f2161J34258j4820l3799J0720j31655n1461L7809J1155m8360P9330M5229
12585b3755j9021K6151j6665N181o2079J6139M9099L2554q509q430M3239L7520
12573G1424P1158r8124r2009p4458P686J3683O4969J5509k1710P149J03392j0320
$$ y = [147048, 50273, 41588, 54488, -41639, -11659, 14955, 56783, 72544, 41913, 47254, 102124, 138045, 167488, 255797, 196371, 116754, 7498, 31230, 58424, -16385, -1642, 27726, 33478, -41783, -66623, -15522, 77327, 62668, 28228, 20734, -13432, -23387, -23442, -45658, -91164, -127783, -108397, -54205, -12647, -14026, -27227, -45169, -103625, -97452, -44067, -33672, -93817, -126620, -151335, -126369, -26154, 44505, 65924, 47891, 68615, 119984, 10912, -73356, -62161, 72097, 57277, 23478, 34198, -97457, -148918, -111109, -99954, -148314, -68984, -23755, -42776, -16625, -33290, -28109, -90188, -74049, -24950, 7604, -905, -9335, 33904, 71424, 142582, 44458, -47551, -122009, -114323, -100640, -35671, -20162, -41872, -34723, 68669, 58349]
12561E8349l3776r940K2666J2784o3563r6830R694M7919Q0790O5305p672o4192
12549B1534p1244L4752J2262K1936k043J8744J6256m8822J3535O6536J6944M9872
12537A50262K7416r6232q6495L8248l6235l7478J9827P311K6663j3840k5993Q783
12525a7763j3646P8542J17902n9317j7522J9886l1415p5426k2691j2505M1586
12514G631N3376N9715o4192m8024k3634m186K9458r1965l6372O1371P871J0064
12502c8887O0720L4587n1515K2481j3527o85K655N5773j8286K8024J7481n0091
12490D8730O906J4202m1799m804O4000p02o7455q0547j9130J09373R0800j6696
12478A02878n3033j6692M8975m6015j04176J4476M0585J39803Q356m4176L0881
$$ y = [58349, 24573, 14633, 37299, 50083, -13480, -110310, -100616, -52697, 28093, 93398, 85726, 21534, -49710, -14958, -2696, 19240, 17197, 35941, 52197, 3375, 16910, 83446, 100390, 150262, 177678, 81446, -5049, 33199, -3036, -40514, -20687, -13376, 13287, -553, -26546, -17763, -31409, 47133, 165035, 105718, 88196, 108082, 76667, 1241, -21450, -33955, 7631, 61007, 120722, 56530, 8506, -15128, -19314, 10144, -81821, -118193, -56822, -48951, -38887, 21833, 56420, 4905, 27386, 13859, 13174, 15829, 71602, 53316, 81340, 98821, 48730, 55636, 69838, 28039, 23235, 87235, 86533, 19078, -61469, -80599, 28774, 119574, 102878, 49845, 33153, 82128, 36113, -68063, -53587, -13002, 126801, 135157, 90981, 121862]
12467A21862p1930o9648M568M1757O1626K6027p435N3667p897K2086J15o9783
12455A05015j63544n0689L1014L4748L3378k9000J8151K0160o514J1416O5817
12444F9952m23k8977q2091N9870P087l1967m1956M8264J06727l7118o9360j7080
12432a7072k2884J08481j6446J4079j4834j01651p0139q9955k6097M8400J10672
12421g7446N2325L1705j0861j436n7398j9285k7219o7875m3277J21261O7960J3867
12409a7679o646m3609r2838j0480O2838n1786K6184M6539Q6634K9163N0901L7420
12397A16641l737m1064o8207m9620j0305k4049L5562K5503q705J9776N1286K5151
12385F8232m7571K8872J4287L281O4008j0160n4551j12497J5429r62K9660j759
$$ y = [121862, 49932, -19716, -15148, 26609, 88235, 114262, 106827, 160494, 152597, 174683, 174798, 105015, -58529, -109218, -78204, -43456, -10078, -39078, -20927, -767, -7281, 4135, 69952, 69529, 40552, -41539, 18331, 25418, -6549, -48505, -241, 106486, 69368, 8, -17072, -39956, 68525, 52079, 66158, 51324, -50327, -120466, -210421, -236518, -188118, -77446, -25121, 6584, -4277, -5713, -63111, -82396, -109615, -177490, -220767, -99506, -31546, -17679, -24325, -67934, -160772, -171252, -108414, -160200, -134016, -87477, -843, 28320, 79221, 116641, 112904, 71840, 3633, -45987, -56292, -80341, -44779, -19276, -27981, -8205, 43081, 68232, 20661, 49533, 63820, 67101, 131109, 120949, 66398, -46099, -30670, -31632, -1972, -3731]
12373c731r670K7891L5781P595l2179l0302k8435K1855k0409n4553J8491M6919
12361b0747Q8520p1885j10437J4819N2507O6830R1075o3278j0855N1719m4748
12350D3520l0622J7902j2515m6284P1568M0720J3662j026m6427o2585O6745K2975
12338G7633P580M878J4942M0859n2016k5304L6914l507l8134j1926j8901l6081
12326c063J9443R776L5419o8545l4974j5246P0266J4023m8139q005n051O0080
12314B5984k4389N642K0695j422k6680j1020P5311J6295K5823l6698j09303O589
12302c3173L9430Q7993N6797l6114j8971P9278q0994n0838J0358k3211Q6211J5298
12290A32064p6256p5574l2677j4159Q811L7368L9681l6588l996n55j4755J3126
$$ y = [-3731, -13401, 14490, 50271, 57866, 25687, -4615, -33050, -11195, -31604, -86157, -67666, -20747, 67773, -4112, -114549, -99730, -47223, 19607, 110682, 47404, 36549, 88268, 43520, 12898, 30800, 18285, -27999, 43569, 84289, 97951, 96925, 50498, -12087, 54658, 77633, 85213, 90091, 105033, 145892, 93876, 68572, 105486, 101979, 63845, 51919, 33018, -3063, 16380, 26156, 61575, -6970, -41944, -57190, 13076, 27099, -21040, -29045, -34096, 25984, 1595, 7237, 27932, 26510, -170, -11190, 64121, 80416, 106239, 69541, -39762, -33173, 6257, 94250, 151047, 114933, 95962, 175240, 94246, 43408, 53766, 30555, 116766, 132064, 55808, -19766, -52443, -66602, -57791, -20423, 19258, -17330, -21326, -21881, -36636, -23510]
12278b3510m7642o8195n0444L5530J00491O8944j3879R103K0099L4135k0639n2057
12266h064N369o294J7056j0835L7945k8834Q2261Q0447n7377o4076m52J27379
12254A74525J6766o9252m2564k8889m4537J5009N4692N4722n5619m1860N0184
12243H3177Q792j5277o7153n2372J4480J0098L4450O1071l3195m1997p3332k5383
12231i6641k2938P4882J05854L8214m7545k2942L9992O2298k2081n9045r2927
12220d2879K8553N9695N7393j3454p2773m4543o4420K9539P0192m4405N0905O9514
$$ y = [-23510, -71152, -139347, -189791, -154261, -53770, 15174, 1295, 10398, 30497, 64632, 43993, -8064, -2695, -8989, 8067, -2768, 35177, 6343, 88604, 169051, 111674, 47598, 47146, 174525, 191291, 122039, 79475, 50586, 6049, 21058, 75750, 130472, 74853, 32993, 83177, 91969, 76692, 9539, -42833, -28353, -18255, 16195, 77266, 44071, 2074, -71258, -96641, -119579, -44697, 61157, 99371, 51826, 28884, 68876, 131174, 109093, 50048, -42879, -14326, 45369, 102762, 89308, 16535, -28008, -92428, -62889, 7303, -37102, 13803, 83317]
$$ [...]
##END NTUPLES=NMR SPECTRUM
##END=
