##TITLE=Analysis number 323680
Compound Code cc 14701
Project Code adrs
Chemist Name endeavour speciality chemicals
##JCAMPDX= 6.0         $$ Bruker NMR JCAMP-DX V2.0
##DATA TYPE= NMR SPECTRUM
##DATA CLASS= NTUPLES
##ORIGIN= Bruker BioSpin GmbH
##OWNER= nmr
$$ XWIN-NMR		Version 3.5
$$ Thu Nov  2 17:53:43 2006 GMT Standard Time (UT+0h)  MAYBRIDGE\nmr@NMR_250MHZ
##.OBSERVE FREQUENCY= 250.131544655141
##.OBSERVE NUCLEUS= ^1H
##.ACQUISITION MODE= SIMULTANEOUS (DQD)
##.ACQUISITION SCHEME= undefined
##.AVERAGES= 16
##.DIGITISER RES= 18
##SPECTROMETER/DATA SYSTEM= dpx250
##.PULSE SEQUENCE= zg30
##.SOLVENT NAME= DMSO
##.SHIFT REFERENCE= (INTERNAL, DMSO, 0, 16.522)
##AUDIT TRAIL= $$ (NUMBER, WHEN, WHO, WHERE, WHAT)
$$ ##TITLE= Audit trail, XWIN-NMR		Version 3.5
$$ ##JCAMPDX= 5.01
$$ ##ORIGIN= Bruker BioSpin GmbH
$$ ##OWNER= nmr
$$ C:\u/data/dgb/nmr/ADRS/2120/pdata/1/auditp.txt
$$ ##AUDIT TRAIL=  $$ (NUMBER, WHEN, WHO, WHERE, WHAT)
(   1,<2006-11-02 17:52:59.31 +000>,<MAYBRIDGE\nmr>,<NMR_250MHZ>,
      <created by zg, POWCHK disabled, PULCHK disabled
       configuration hash MD5:
       49 4B E0 1D 92 C2 6B 37 9F E6 65 BC 52 41 86 1D
       data hash MD5: 64K
       6A 80 CF B2 3A 6E 0A 1A 2B 3B 12 9C C7 48 3E 4C>)
(   2,<2006-11-02 17:53:19.47 +000>,<MAYBRIDGE\nmr>,<NMR_250MHZ>,
      <Start of raw data processing
       ef LB = 0.3 FT_mod = 6 PKNL = 1 SI = 32K 
       data hash MD5: 32K
       4A 54 24 4E 75 E6 96 CE 62 30 B6 33 84 9E A8 45>)
(   3,<2006-11-02 17:53:21.37 +000>,<MAYBRIDGE\nmr>,<NMR_250MHZ>,
      <apk 
       data hash MD5: 32K
       70 14 18 02 88 4C 6A DE E3 1B F1 0E AF A8 C2 3D>)
(   4,<2006-11-02 17:53:22.43 +000>,<MAYBRIDGE\nmr>,<NMR_250MHZ>,
      <abs ABSG = 5 
       data hash MD5: 32K
       58 EF 17 5A DC AE 55 C8 B9 13 96 94 EE B6 68 56>)
$$ ##END=
$$ 
$$ hash MD5
$$ 2E CF BA AE FC C0 CE 5E 27 71 1C 25 FE 41 84 F3
##$RELAX= 
##$RELAX= 
##$RELAX= 
##$RELAX= 
##$RELAX= 
##$RELAX= 
##$RELAX= 
$$ Bruker specific parameters
$$ --------------------------
##$DU= <C:\u>
##$EXPNO= 2120
##$NAME= <ADRS>
##$PROCNO= 1
##$TYPE= <nmr>
##$USER= <dgb>
##$AMP= (0..31)
100 100 100 100 100 100 100 100 100 100 100 100 100 100 100 100 100 100 
100 100 100 100 100 100 100 100 100 100 100 100 100 100 
##$AQSEQ= 0
##$AQ_mod= 3
##$AUNM= <au_zg>
##$AUTOPOS= <46 >
##$BF1= 250.13
##$BF2= 250.13
##$BF3= 250.13
##$BF4= 250.13
##$BF5= 500.13
##$BF6= 500.13
##$BF7= 500.13
##$BF8= 500.13
##$BYTORDA= 1
##$CFDGTYP= 0
##$CFRGTYP= 5
##$CHEMSTR= <none>
##$CNST= (0..31)
1 1 145 1 1 1 1 1 1 1 1 1 1 1 1 1 1 1 1 1 1 1 1 1 1 1 1 1 1 1 1 1 
##$CPDPRG= <>
##$CPDPRG1= <>
##$CPDPRG2= <>
##$CPDPRG3= <>
##$CPDPRG4= <mlev>
##$CPDPRG5= <mlev>
##$CPDPRG6= <mlev>
##$CPDPRG7= <mlev>
##$CPDPRG8= <mlev>
##$CPDPRGB= <>
##$CPDPRGT= <>
##$D= (0..31)
0 1 0 0 0 0 0 0 0 0.06 0 0 0 0 0 0 0.0002 0 0 0 0 0 0 0 0 0 0 0 0 0 0 
0 
##$DATE= 1162489976
##$DBL= (0..7)
120 120 120 120 120 120 120 120 
##$DBP= (0..7)
150 150 150 150 150 150 150 150 
##$DBP07= 0
##$DBPNAM0= <>
##$DBPNAM1= <>
$$ [...]
##$SUBNAM7= <"">
##$SUBNAM8= <"">
##$SUBNAM9= <"">
##$SW= 20.6930455092707
##$SWIBOX= (0..15)
0 0 3 0 0 0 0 0 0 0 0 0 0 0 0 0 
##$SW_h= 5175.983436853
##$TD= 65536
##$TD0= 1
##$TE= 683.16
##$TE2= 300
##$TE3= 300
##$TEG= 300
##$TL= (0..7)
0 120 120 120 120 120 120 120 
##$TP= (0..7)
150 150 150 150 150 150 150 150 
##$TP07= 0
##$TPNAME0= <>
##$TPNAME1= <>
##$TPNAME2= <>
##$TPNAME3= <>
##$TPNAME4= <>
##$TPNAME5= <>
##$TPNAME6= <>
##$TPNAME7= <>
##$TPOAL= (0..7)
0.5 0.5 0.5 0.5 0.5 0.5 0.5 0.5 
##$TPOFFS= (0..7)
0 0 0 0 0 0 0 0 
##$TUNHIN= 0
##$TUNHOUT= 0
##$TUNXOUT= 0
##$USERA1= <user>
##$USERA2= <user>
##$USERA3= <user>
##$USERA4= <user>
##$USERA5= <user>
##$V9= 5
##$VALIST= <valist>
##$VCLIST= <CCCCCCCCCCCCCCC>
##$VD= 0
##$VDLIST= <DDDDDDDDDDDDDDD>
##$VPLIST= <PPPPPPPPPPPPPPP>
##$VTLIST= <TTTTTTTTTTTTTTT>
##$WBST= 1024
##$WBSW= 4
##$XGAIN= (0..3)
0 0 0 0 
##$XL= 0
##$YL= 0
##$YMAX_a= 301259
##$YMIN_a= -385930
##$ZGOPTNS= <>
##$ZL1= 120
##$ZL2= 120
##$ZL3= 120
##$ZL4= 120
##$ABSF1= 16.522
##$ABSF2= -4.171173
##$ABSG= 5
##$ABSL= 3
##$ALPHA= 0
##$AQORDER= 0
##$ASSFAC= 0
##$ASSFACI= 0
##$ASSFACX= 0
##$ASSWID= 0
##$AUNMP= <proc_1d>
##$AZFE= 0.1
##$AZFW= 0.1
##$BCFW= 0
##$BC_mod= 0
##$BYTORDP= 0
##$COROFFS= 0
##$CY= 12.5
##$DATMOD= 1
##$DC= 0
##$DFILT= <>
##$DTYPP= 0
##$F1P= 14.0000005364418
##$F2P= -0.99999901652339
##$FCOR= 0.5
##$FTSIZE= 32768
##$FT_mod= 6
##$GAMMA= 0
##$GB= 0
##$INTBC= 1
##$INTSCL= 1
##$ISEN= 128
##$LB= 0.3
##$LEV0= 0
##$LPBIN= 0
##$MAXI= 10000
##$MC2= 0
##$MEAN= 0
##$ME_mod= 0
##$MI= 0
##$NCOEF= 0
##$NC_proc= -4
##$NLEV= 6
##$NOISF1= 0
##$NOISF2= 0
##$NSP= 0
##$NTH_PI= 0
##$NZP= 0
##$OFFSET= 16.522
##$PC= 1
##$PHC0= -49.83991
##$PHC1= 16.40713
##$PH_mod= 1
##$PKNL= yes
##$PPARMOD= 0
##$PSCAL= 4
##$PSIGN= 0
##$REVERSE= no
##$SF= 250.13
##$SI= 32768
##$SIGF1= 0
##$SIGF2= 0
##$SINO= 400
##$SIOLD= 32768
##$SREGLST= <1H.DMSO>
##$SSB= 0
##$STSI= 32768
##$STSR= 0
##$SW_p= 5175.98343685301
##$SYMM= 0
##$S_DEV= 0
##$TDeff= 65536
##$TDoff= 0
##$TI= <Analysis number 999999
Compound Code 99
Book Reference 9
Project Code 9>
##$TILT= no
##$TM1= 0
##$TM2= 0
##$TOPLEV= 0
##$USERP1= <user>
##$USERP2= <user>
##$USERP3= <user>
##$USERP4= <user>
##$USERP5= <user>
##$WDW= 1
##$XDIM= 32768
##$YMAX_p= 361013097
##$YMIN_p= -475950
$$ End of Bruker specific parameters
$$ ---------------------------------
##NTUPLES= NMR SPECTRUM
##VAR_NAME=  FREQUENCY,     SPECTRUM/REAL,   SPECTRUM/IMAG
##SYMBOL=    X,             R,               I
##VAR_TYPE=  INDEPENDENT,   DEPENDENT,       DEPENDENT
##VAR_FORM=  AFFN,          ASDF,            ASDF
##VAR_DIM=   32768,         32768,           32768
##UNITS=     HZ,            ARBITRARY UNITS, ARBITRARY UNITS
##FACTOR=    0.157963299565203, 1,           1
##FIRST=     4132.6476996994, 0,             0
##LAST=      -1043.33573715361, 0,           0
##MIN=       -1043.33573715361, -475950,     0
##MAX=       4132.6476996994, 361013097,     0
$$ Real data points
##PAGE= N=1
##DATA TABLE= (X++(R..R)), XYDATA
$$ [...]
19820 -232 -74282 -76358 -169151 -280857 -165761 -2707 -99107 -62775 27973 -18469 -81027 12292
19808 12292 -33343 -38518 14827 -1645 -122218 -163212 -147987 -3697 18349 -18949 5021
19797 5021 -29155 -20135 -25158 -87873 -119261 1958 54552 13108 -32058 -81099 63306 117812
19785 117812 77063 -107819 -226247 -56068 102849 112929 210637 178363 119483 2351
19775 2351 -181502 -222104 -121037 -137355 -71443 -119364 -180278 -105774 -106402 -90746 -108676 -107681
19763 -107681 -60963 -73896 -147134 -135493 -162734 -229355 -26759 32141 -80499 -117175 -79207
19752 -79207 -86049 -1419 65549 -47887 -125594 -89106 -92566 -99894 -104556 -80671 -33907 -68678
19740 -68678 -117683 -54178 67169 123944 113912 124449 58383 40596 79963 -25959 18047
19729 18047 18970 80682 52365 62671 169913 163178 111913 97644 76991 -48754 -58812 -38619
19717 -38619 -78163 -55109 109552 181725 181230 191077 173918 115897 -28355 -20747 44887 41259
19705 41259 50172 -59595 -48907 -29407 -115005 -84772 -116270 -248840 -175342 24878 -5400
19694 -5400 20958 -4930 -103967 -219847 -113402 -85945 -63791 -64288 -46644 -1606 -36663 -109521
19682 -109521 -148181 -129685 -138313 -204327 -149417 -87661 -54919 71484 163235 74234 68852 118650
19670 118650 76435 25267 -20729 102690 81451 17214 410 -114 22248 -66617 -159860 -18292
19658 -18292 48460 -29794 4566 74040 50764 -10716 -41260 90960 151696 133991 36017
19647 36017 20265 16170 -29485 -150234 -60317 -45477 -164863 -250413 -243060 -127272 -179921
19636 -179921 -160438 -36185 -19558 -47314 -91303 -32160 -7140 -27315 -21910 -70207 -186814
19625 -186814 -272186 -254093 -68966 -39729 10454 -5081 45020 30366 46185 -78042 -91143
19614 -91143 63610 80238 -107344 -195724 -168242 -232087 -259309 -354859 -428894 -361254 -218890
19603 -218890 -144643 -134584 16207 -13530 -49001 41200 79590 25925 8757 -65466 -89231
19592 -89231 -77864 -66031 -49221 -8101 -74005 -105781 -157045 -54629 -4873 -45111 -19146
19581 -19146 -31662 9305 42448 -95642 -89237 -22033 77720 164949 244676 155308 52075
19570 52075 -18823 -58938 -173945 -84793 -8842 -40851 10591 18414 -35859 11644 38955 37331
19558 37331 -51555 -13628 95200 -94263 -173753 -173359 -137962 -139590 -178171 -141113 -40929 -157443
19546 -157443 -176051 -115832 -99464 -210526 -173257 -108846 -82219 -114532 -89093 -126928 -100729
19535 -100729 -131253 -129867 15167 64003 108436 131575 224770 181182 101935 85562 -29132
19524 -29132 -41203 -82535 -20403 99465 97424 -11581 -124192 -16898 48544 32957 48717
19513 48717 82223 92650 193657 153478 24783 -16389 -61968 -124166 -120621 -131492 -155061
19502 -155061 -190493 -1826 27958 20976 119162 100589 -11682 -11842 4521 95624 205400
19491 205400 90971 39888 -30126 -66703 -111988 -40850 -43615 -1119 -64321 17146 86392
19480 86392 103533 184398 146379 20849 -26901 -64509 -65988 24440 81628 128936 37216 1974
19468 1974 -62408 -129248 -131013 9644 31103 -4921 -40095 -6613 9528 -19860 40612 3730
19456 3730 -70947 7413 34749 -27354 25719 88254 156311 66966 86313 119902 94869 31432
19444 31432 -17825 -24836 -67513 -48473 4622 -8203 -28058 19177 92273 78228 -14069 -97870
19432 -97870 -57732 -54635 -94034 -118125 -60027 33247 -23389 -53656 -79145 -78294 -11450 -30998
19420 -30998 -139539 -72503 -126291 -163092 -289065 -225384 -91195 6788 70760 -1638 -82791
19409 -82791 -111649 -8564 20960 105867 37689 -26478 43839 157371 187772 -50098 -196299
19398 -196299 -96452 -88511 -68405 -33783 -6300 74267 8552 -107809 -180545 -141862 -52801
19387 -52801 -9909 49655 29637 -66695 -18409 122396 -30703 -69812 45465 -1526 48517
19376 48517 45540 -37677 75695 147972 144608 94763 -48508 -93550 -174368 -114147 16406
19365 16406 -22534 -16297 14354 25944 94030 187804 131763 151923 215611 215589 112186 6182
19353 6182 -52283 -81034 -36211 -30795 5540 -36804 -176849 -205204 -156039 -102251 -175454 -144449
19341 -144449 -80749 -79863 -102441 -99119 -9021 95178 84364 21237 16438 39567 55915 -52581
19329 -52581 -178354 -324801 -298532 -237168 -190592 -174665 -226215 -105536 -31984 -9584 60426
19318 60426 111903 39658 -121591 -40885 22480 134634 886 -104139 -17492 -7934 -72773
19307 -72773 30643 32550 71605 20294 -147730 -167225 -168257 -124894 -132883 -214579 -372934 -366840
19295 -366840 -229124 -139396 -145858 -119282 -26693 24962 -1735 -64021 -74496 -27145 -169946
19284 -169946 -187230 -88299 -86489 -57855 -18915 -112268 -118070 22849 143973 68582 34306
19273 34306 93088 80607 -77493 -158808 -86255 -2377 23297 -27799 -119924 -60022 34948
19262 34948 24179 -88490 -167893 -218184 -215722 -174131 -152899 -239996 -115528 10747 27897
19251 27897 55895 93032 117665 124456 161295 152026 128272 -48778 -164867 -137924 -64388 -35628
19239 -35628 95824 73615 -30189 -26853 -74380 -160710 -238358 -217530 -119210 -97318 -34350
19228 -34350 86714 266297 211333 27982 -86208 -6105 56019 59749 41492 122262 159090
19217 159090 82345 87455 136697 116610 12546 -6011 -26373 -4505 35719 -15882 -126799
19206 -126799 -202054 -277222 -163944 -57305 120475 131003 165794 -31505 -130250 -86678 -8221
19195 -8221 120284 98727 -23607 -30915 15012 -7561 -35115 -111459 -219735 -100774 -79428
19184 -79428 -6843 -82417 -234673 -132004 -68532 -156473 -203139 -196225 -90302 -135990 -234392
19173 -234392 -169815 -181480 -139649 -118087 -55189 -109435 -100653 -35739 -153946 -281294 -270716
19162 -270716 -291858 -278238 -237094 -136948 -130287 -132092 -22900 2247 23380 196806 118076
19151 118076 41486 27547 57175 166215 256230 143546 107798 103222 62273 116498 99153
19140 99153 30013 -22900 304 -56571 -64048 -91389 -130363 -141843 -129036 -74492 -4134 30507
19128 30507 84714 -1555 50373 108575 15295 -52406 -15578 21129 30236 -17048 -99730 -204292
19116 -204292 -289125 -296394 -282265 -383534 -339164 -93743 -108349 -151495 -111554 -195909 -155936
19105 -155936 -44951 -29565 -22800 39952 110295 103032 -65872 -19296 33436 -63880 -184958
19094 -184958 13642 7033 22938 -37201 -141895 -147181 -157201 -112229 -135755 -207456 -222266
19083 -222266 33094 79621 58551 -32829 -46261 40807 8080 92468 54743 -53025 -14674
19072 -14674 -96912 -107317 -2312 -57205 -71071 -160000 -159483 -182371 -142218 -59453 26155 185340
19060 185340 170096 102124 42511 72805 188847 172847 7271 -16712 55492 6952 -60224
19049 -60224 -109383 -99106 -78389 -98631 -139325 -117002 -240255 -213900 -126691 -10626 -12598
19038 -12598 -116393 -250239 -173054 -82015 55812 66907 19375 -20489 22066 -71254 -70604
19027 -70604 14546 80767 76054 30596 -46438 -441 -54651 -93698 -48436 -146512 -322967 -272097
19015 -272097 -161247 -143732 -167223 -188493 -165466 -124331 -50548 -41350 11648 37493 -77601
19004 -77601 -172676 -143378 -15276 83262 24395 -63796 -70864 -180 23683 19485 3486 -84658
18992 -84658 -91463 -47202 -43984 57540 -23916 -135922 -235924 -258913 -221895 -234726 -175285
18981 -175285 -118869 -41818 -32601 -104192 -78810 -64083 54150 12166 -77298 -68108 40212
18970 40212 108262 -7961 -147038 -186818 -152245 -79163 -4590 29546 -120629 -228058 -211636
18959 -211636 -152501 12140 107218 96328 -25638 38471 34741 -22117 -19415 99245 203271
18948 203271 61208 -71398 22595 9484 -97520 -160324 -87414 -81350 -49528 12145 20906
18937 20906 -76583 -130345 -41402 -31981 -24840 41702 115144 107828 -47840 -140922 -310321 -290263
18925 -290263 -128339 -63744 -13724 32688 107566 124395 44186 5 13409 148585 276219
18914 276219 314135 256955 168676 66268 16737 175588 101281 16379 -7741 -74803 -88126
18903 -88126 -57902 -41460 -72583 -61826 -37766 -203 42287 97298 75357 137211 38315 -32762
18891 -32762 14925 96215 -3872 -49295 -5602 33328 -16637 -142629 -182366 -244688 -276019
18880 -276019 -169165 -154721 -135333 -45951 -92829 -143732 -58334 61791 121472 41631 26421
18869 26421 -2938 67212 42287 32572 27182 33059 125884 188084 187910 174081 218337 271138 141781
18856 141781 84202 88745 15649 -1372 91046 143521 176981 188533 97293 101756 61796 39158
18844 39158 84900 59100 92055 55751 9564 -92670 -148226 -158160 -161872 -152358 -16295 34933
18832 34933 44057 90630 189038 122439 64010 135944 155235 268724 233956 154178 79585 74833
18820 74833 72493 -10717 -94160 -79251 -56946 -74248 -53958 -69856 -165270 -209236 -295915 -290258
18808 -290258 -180824 -60289 -54439 121373 120630 -25433 -24862 -25030 8434 110666 18580 -132990
18796 -132990 -139668 -270237 -186881 -15902 -100087 -104137 -73448 -110065 -177250 -192404 -176299
18785 -176299 -107058 -56921 -2912 -43536 -58037 29960 123182 191207 111734 47310 35332
18774 35332 109309 45977 14875 -60284 -243182 -167019 -54709 86074 182719 105066 87698
18763 87698 67476 99140 52034 10893 -13465 97658 54200 -159052 -34081 79232 86745
18752 86745 -6929 -580 -48204 -65051 -19946 -17817 -6830 -39583 -9250 28910 92604 101623
18740 101623 117835 170270 133391 -94 13489 3531 -14600 -126465 -167364 -110349 -34082
18729 -34082 -89141 -176364 -144156 -69987 28684 31155 71999 143528 82337 85653 65937 143800
18717 143800 -3458 -56810 -36216 -10440 -18145 -70572 -49250 -46005 -75837 -134907 -133720 -187177
18705 -187177 -233446 -102733 -54392 -18877 -60321 -5281 -16183 -2865 1071 -38335 10287
18694 10287 44242 -10048 -109038 -4338 -19335 -11726 -4267 -15467 -97288 -124134 -268316 -301797
18682 -301797 -180536 -109973 -87286 -120389 -142723 -131148 -69529 -21013 -139563 -231658 -111844
18671 -111844 -11706 -80272 -195296 -166686 -190318 -214285 -231635 -91957 22352 18285 -84124
18660 -84124 -174749 -80878 -130544 -174445 -130259 -137030 -210041 -208696 -140475 -68597 113444 41405
18648 41405 -97521 33466 105638 105122 184998 39470 -45748 -84508 -72794 -82835 -105326
18637 -105326 -41476 -17878 -107745 -194859 -239079 -107081 90873 140784 48290 53762 102841
18626 102841 155609 117332 95507 185971 188187 208536 128770 143706 149196 123437 109181 -12833
18614 -12833 -10904 22694 48961 -67100 -115474 11028 47145 7332 -71701 -60874 -6972
18603 -6972 -41553 -35161 59261 59806 -32463 -124689 -96653 -44676 -118005 -94080 -45176 -92306
18591 -92306 -115244 -122263 -43089 56831 66302 -11065 -108109 -90661 -223441 -327844 -194492
18580 -194492 -89651 12285 38039 109483 137369 15505 -75057 85828 175549 80424 -15479
18569 -15479 -22637 -72859 -535 -21588 -27235 -80312 -156995 -70187 13004 -2673 -82767 -223616
18557 -223616 -322406 -217807 -68528 80401 98120 109841 184512 176628 86162 -30404 -36911
18546 -36911 29923 -64812 49549 112260 8145 82492 42819 -51878 -171507 -127048 -93174
18535 -93174 -58639 -8572 38613 126638 55343 -70413 -176222 -202762 -89801 31203 -13566
18524 -13566 -108178 -103371 -117850 -140798 -120025 -257602 -357388 -361779 -272504 -220085 -67337 56170
18512 56170 88124 54423 -43651 -128124 -39870 -31239 -92876 4686 30833 9425 55799 95346
18500 95346 -2523 -36601 -132178 -46142 261273 238148 39166 -28270 -9468 11127 -5782
18489 -5782 -131370 -210695 -169105 -126884 -203017 -230445 -98966 -89049 742 -25109 -68475 31331
18477 31331 -2251 -28273 43189 93646 -31097 -184726 -288887 -367302 -312171 -232520 -195720
18466 -195720 -149023 -54160 -1127 -37954 1508 -12842 -3507 -146774 -205938 -34524 47245
18455 47245 -72101 -131767 -103543 -63662 -10743 -22854 -54504 59994 132603 144819 99520
18444 99520 -11314 -150409 -229800 -160116 -214295 -123981 -32763 -34269 21370 26363 63342 61858
18432 61858 17712 -137618 -62621 60835 1554 -129748 -144535 -57994 -122600 -13371 -50664
18421 -50664 -66749 101464 26142 -80162 -66981 -30038 -42313 -32704 -123738 -122421 -112861 -119924
18409 -119924 -183143 -120167 -49806 -107694 -56981 22443 48779 -16793 60483 -11627 -22435
18398 -22435 -21403 -112976 -40539 154574 139920 64540 106076 41374 50886 -51678 -77197 52512
18386 52512 58291 105027 -8428 -71555 -177218 -129812 -103430 -97297 -70842 -148937 -145729 -97209
18374 -97209 -123741 -50355 96707 74591 -132254 -133521 5683 -1511 -40000 35276 -69732
18363 -69732 -19650 -66646 -63904 -72284 -81925 15291 -67934 -44680 -16914 -5461 -33814 19550
18351 19550 -33172 -96558 -55928 75824 12484 -84263 -114343 -72368 18101 131410 240955
18340 240955 122522 11023 -103795 -88162 -41372 56017 89544 19432 26304 53140 214485
18329 214485 72044 -6416 30183 55774 77006 119574 34769 -98736 -156229 -127377 -51500
18318 -51500 -54938 -9493 44500 12283 -77157 -163783 -102755 46255 -11227 -103400 -145681 -245056
18306 -245056 -129289 68835 159477 156992 122783 49375 23387 16031 -26717 -27684 -105569 -149306
18294 -149306 -47087 -81431 -82082 -9297 -25824 -87594 -145307 -110547 -48334 -148600 -113899
18283 -113899 -157136 -177229 -159604 -176929 -229268 -180102 -163481 -192380 -168887 -101437 -124455
18272 -124455 -153805 -73831 -11185 6698 -52830 -100905 -228247 -262137 -213857 -182091 -234873
18261 -234873 -131798 -113076 -194500 -183111 -173491 -97945 -6285 75531 112739 141563 95825
18250 95825 -102648 -208412 -170349 -105567 -69969 40743 51720 -114180 -117936 -68172 -15749
18239 -15749 67503 21882 -64651 -96708 -93169 -34841 25867 -19228 -79214 -66372 -29438 85027
18227 85027 77731 -56371 -95653 20262 69080 -15490 -53476 -72411 -48605 -84551 -67382
18216 -67382 -76438 -33583 -20555 72619 48512 -34124 -22542 -37576 -97760 -13977 74130 -18212
18204 -18212 -90041 -71456 -121719 -137488 -89950 -125763 -124393 -68509 -98976 26943 119493 91954
18192 91954 21371 22181 21448 -36441 11027 70408 77850 43090 64072 138850 102550 103738 128258
18179 128258 53541 -22162 -61561 -66105 -115670 -32824 -84047 -93387 -114388 -87405 -103958 -68952
18167 -68952 -90972 -116096 -209891 -297837 -221495 -136440 -100622 -140226 -114538 -130800 -105998 -26626
18155 -26626 -5119 -30148 -28052 80810 107290 20072 -88204 -158938 -124656 -109005 -155657
18144 -155657 -113696 -51785 -1270 76474 41973 11262 -77218 -270741 -285054 -149409 14768
18133 14768 138811 205552 202033 60121 37176 -79099 -206637 -228962 -23726 36044 -17048
18122 -17048 -114050 -160756 -68160 -20883 25904 -110119 -136149 -85277 -101911 23867 141703
18111 141703 105610 -15712 -2305 -39016 -56380 17782 89632 99104 172837 223654 63584
18100 63584 -27860 -121240 -100303 -22374 104412 187591 88856 -39954 -97235 -88305 -38545
18089 -38545 119705 171074 194423 147060 -26200 -4168 -4271 -35282 -66153 -9256 -42405 -32839
18077 -32839 17161 -62218 -134871 -43078 4480 -8091 -117891 -169436 -181631 -95051 -154660
18066 -154660 -255408 -145853 -101267 -80235 -194645 -253575 -214890 -189123 -141214 -204816 -279152
18055 -279152 -184057 -173363 -158881 -206117 -186015 -206371 -169306 -177311 -149451 -53571 -40183 -50004
18043 -50004 14724 -15521 3335 -25553 -128542 -108935 20056 5235 25762 -48905 -142675
18032 -142675 -58031 -89540 -42758 -45597 -2095 156262 157092 -64398 -100257 -3614 6355 -45547
18020 -45547 36891 114212 56648 -21428 -7771 -73826 -100764 -79107 73455 69451 -2697 5709
18008 5709 27604 -23370 -31823 72658 16241 117428 160449 184449 174957 94599 89198 228993
17996 228993 196967 90475 15802 -30844 -79769 -60349 -62483 -15273 -40544 2305 -42643
17985 -42643 -137741 -84850 -102009 -50368 -6952 -111378 -194858 -43601 -33375 -44440 7536
17974 7536 93172 119959 148031 2764 -146590 -217467 -174992 -180287 -175900 -80686 68164 189299
17962 189299 101653 52738 -12480 -63842 -76874 23657 80455 57778 69129 -4415 18889
17951 18889 64196 112569 3382 -35166 11342 -15404 127484 159984 157223 93443 12501
17940 12501 -56416 -27885 24140 110889 139221 47394 26312 114537 150235 37183 -73250
17929 -73250 -62477 -5937 21471 69719 132702 105831 111283 73791 142770 187360 -65512 -220016
17917 -220016 -53107 -53180 -203428 -106788 -127962 -127715 -24738 89477 104614 15226 50807 50196
17905 50196 -22521 -107728 -94376 -97945 -118170 -137438 -215464 -171249 -74564 -67934 -153101 -159439
17893 -159439 -133478 -39809 3078 5893 -25681 -119747 -139789 -156213 -99473 -31884 31262 66185
17881 66185 152255 -49017 -141153 -178328 -208273 -153961 -117725 -7790 56994 8149 15496
17870 15496 100305 -11895 9158 45374 41792 86806 54641 102316 188575 119602 -40948
17859 -40948 -145338 -228744 -46936 121202 95961 -26172 -80867 -24564 -94856 -58127 -15440
17848 -15440 -28216 -23321 -44782 -56005 -17561 33994 111686 147677 199573 55884 -17495 17534
17836 17534 25380 5276 32299 -42257 -99022 -158640 -147488 -75954 28942 114967 125766 -12931
17824 -12931 -27627 26557 -5092 -73102 -66284 -42326 -106995 -100648 -38615 -151614 -179777 -223890
17812 -223890 -181362 -76938 -73132 -101441 -62003 -65302 19725 92545 39215 -3608 -1364 -57487
17800 -57487 -74471 -92388 -9917 104994 110245 142419 175078 207433 55102 37764 100446
17789 100446 73181 145370 166098 43971 -30130 -87216 -61381 -14195 -55956 -80618 -9505
17778 -9505 42699 46337 46014 7013 47702 129027 52167 108199 154649 73358 -10278 -103906
17766 -103906 -171708 -76952 15769 -27987 -4102 30555 2678 31102 39695 88088 77352 80236
17754 80236 137567 87788 -92021 -195945 -244064 -201065 -187038 -150011 -181078 -231069 -271753
17743 -271753 -288994 -307919 -196733 -125064 -75019 -77536 -119768 -106880 -140331 -156520 -230286
17732 -230286 -179489 -47859 56217 170900 126005 -44964 -148723 -180350 -47943 22413
17722 22413 49173 45128 -65363 -157572 -205973 -142249 5762 113465 -39998 -105233 -108263
17711 -108263 -82246 17962 159423 136176 -18223 53456 16023 -12234 -21197 -142630 -153473
17700 -153473 -190535 -156358 -139096 -77167 20592 -78834 -172286 -221201 -326149 -336729 -305191
17689 -305191 -227138 -159079 -109993 -55218 -77386 -285075 -259569 -179239 -109114 -106371 2171
17678 2171 -25589 -118433 -224854 -214825 -81396 47869 22954 -41616 -178269 -112987 40404
17667 40404 76771 -77422 -154511 -68567 -83338 -99675 -22339 -108319 -10786 73359 -88996
17656 -88996 -114634 -127011 -69346 -83339 -189585 -151464 -29440 67160 83295 -21301 -71306
17645 -71306 -138763 -146104 960 -43210 -7221 -39406 -107055 -42075 12311 78294 82631 47828
17633 47828 63803 -88384 -177628 -154313 -230380 -197872 -114036 3706 150813 175113 86969
17622 86969 -12027 108107 201072 77203 -82440 -117319 -54477 -45649 -25908 -20976 74592
17611 74592 145542 245680 167322 126724 161108 166422 64413 -73609 -115831 -146384 -153221
17600 -153221 -203108 -77582 -108947 -58016 24401 -44301 -6806 55823 76143 4987 29114
17589 29114 -59162 -156254 -205607 -212944 -166257 -120713 -169495 -163626 -84884 -25127 -36697 -66935
17577 -66935 -179537 -74895 -153155 -177467 -101882 -49819 -169614 -160515 -94841 -11656 82914
17566 82914 -75836 5395 55051 23038 47645 70037 25869 -14553 -19063 78487 160909 188547
17554 188547 42242 -16801 -23321 -170980 -97063 28467 23778 -37682 83971 118075 36566
17543 36566 72173 26129 -7487 78164 82484 188911 240273 48523 -84033 -139873 -126663
17532 -126663 -54845 -117652 -176651 -96383 -116534 -142576 -24829 114056 40473 -54741 -12756
17521 -12756 110947 120587 134711 211735 84283 -6679 -64118 -154804 -117253 -26214 -42684
17510 -42684 -76815 -179446 -161366 -78287 -60358 -6051 -46930 -117002 -3341 26406 51428
17499 51428 13479 -58970 -157800 -132596 -21257 207164 189022 -7519 -44052 -87600 -56012
17488 -56012 21139 29323 30661 -67881 -69248 -92852 -32232 -17491 -49753 -79368 -51721 -23879
17476 -23879 -70826 97305 101786 59190 -56318 -184203 -16862 104942 190144 219475 248272
17465 248272 149643 83572 39659 -28570 11702 -45163 -33362 -160954 -151418 -113826 -48330
17454 -48330 -32949 -140049 -44785 -20837 -75711 -138642 -123483 -219079 -142195 -48239 -60542
17443 -60542 -80176 -10859 -712 -37387 -101766 -45844 34566 -121880 -135257 -93775 -25536
17432 -25536 -51747 -42475 -34277 10801 54050 79441 20183 1229 56395 17937 8650 36412
17420 36412 -27568 -9169 -34633 -32052 -10343 1898 -40496 -145130 -187800 -171848 -175093 -177846
17408 -177846 -74323 -12342 -125033 -148279 -13571 41244 71622 93256 73250 260537 286815
17397 286815 196039 164069 146819 105233 143290 64363 -98004 -51148 25623 177039 114373
17386 114373 -30025 -123075 -59756 7972 122853 71575 86041 91238 10392 -123813 -37631
17375 -37631 -11946 -209781 -221450 -45081 6136 -81764 -94614 -217644 -252996 -208499 -194004
17364 -194004 -128757 -209056 -296823 -247021 -175642 -254281 -212018 -228221 -183658 -169678 -139242
17353 -139242 -163461 -131943 -78821 -138487 -219423 -267323 -198359 -119814 -109845 -210907 -100908
17342 -100908 30160 -115786 -199547 -228264 -254805 -140601 59627 -41457 -167113 -185874
17332 -185874 -148607 -157165 -125570 -103893 -150717 -108593 33369 7603 -72332 -14758 96236
17321 96236 165184 104092 109357 79541 1086 -35014 -70283 -203106 -194374 -69555 41214
17310 41214 -79080 -117660 -74867 -272153 -214794 -140614 -26715 -23527 27513 10420 -68064
17299 -68064 -135690 -280863 -271777 -95186 -18545 -2047 6451 -65572 -152764 -211542 -242892 -95251
17287 -95251 -167988 -109571 -77968 -20636 -96902 -27416 96434 63663 148895 104867 59467
17276 59467 140785 206970 224263 101572 -46799 -85004 -157872 -255664 -282149 -208687 -160793
17265 -160793 -31821 7159 -104924 -58811 77177 119643 73120 -79919 -105612 -26966 -67931
17254 -67931 -94579 -22143 13121 -107177 -229211 -237063 -178696 -80364 71908 105432 74840
17243 74840 16258 -6343 112362 262144 161732 130108 142671 221172 139539 -218 -65695
17232 -65695 -55486 -31980 38379 19650 31288 110627 135093 104112 162527 67189 -32777 61551
17220 61551 111050 98689 161975 129157 59241 39179 95695 108519 -72028 -36869 51818
17209 51818 18786 69366 121587 105710 22563 21416 59744 51687 235811 304283 225135 197049
17197 197049 277907 254764 59946 -106794 -236961 -223842 -140556 -187399 -216450 -156249 -250105
17186 -250105 -259180 -131514 -110628 19105 129364 60817 40230 209063 230329 78305 132350
17175 132350 175795 177610 146228 106577 100863 132238 155433 184038 91149 -44773 -41289 19921
17163 19921 -19041 57339 73175 -75963 -181833 -242600 -156788 -73777 -63079 -67113 2898
17152 2898 87479 95984 168344 21409 -173046 -212886 -279382 -212446 -32463 -74001 -76294 -82905
17140 -82905 -197294 -235634 -326246 -325645 -198575 -100391 -60366 -43936 2721 -71555 -128533 -126867
17128 -126867 -105891 -57742 -57032 -20798 77654 -15663 -76544 -109323 -132259 -87354 -33925 -48625
17116 -48625 -153800 -200296 -217135 -202592 -88113 -82516 -29414 47633 81551 25175 45911
17105 45911 85367 202362 -35104 -96123 -50989 9256 -38387 61235 60940 12856 -3165 29085
17093 29085 38279 8755 7954 -30980 17604 28059 4281 -94235 -170737 -196311 -35175 52863
17081 52863 3722 -46472 -33091 -75625 -1658 -87361 -128669 -128761 -42418 -41780 -5804 147729
17069 147729 67703 -3281 -62705 -102860 -177783 -160945 -73546 -64669 57807 -12555 -21217 38803
17057 38803 6026 94232 139442 45911 -21812 94661 -18448 -105962 -49702 -29889 -15208
17046 -15208 -23689 -34116 -38888 -152358 -168267 -186091 -91931 -78343 -180797 -169592 -60757
17035 -60757 2995 -25757 2968 81181 127502 120585 46131 13007 30831 -22639 -34186 -110675
17023 -110675 -36424 -90491 -84778 -84460 40893 167690 112492 102266 136992 219822 148209 63622
17011 63622 -38886 -93300 -270785 -152537 -5367 26914 19426 -44756 -49144 -69089 -76224
17000 -76224 -29488 -26746 90288 140768 2923 -8355 92968 8406 -22683 85055 167837
16989 167837 103363 168994 138179 175707 181475 165226 95816 -38173 -102312 -195090 -154631
16978 -154631 -157978 -132976 -65536 -128172 -92150 -55691 32310 128160 82365 14141 14613 5291
16966 5291 78948 -28158 -81039 -23153 17991 -81102 -78599 -2048 68655 82685 61002 -50929
16954 -50929 -93740 -158119 -117313 -99667 -79833 -38482 30080 2210 -87209 -51581 -61983 -101217
16942 -101217 -153345 -144953 -179935 -234833 -206194 -16160 20113 21770 49610 132213 115876 -32103
16930 -32103 -72673 45706 25697 -32176 -97241 -55185 66333 59388 -39067 23777 64853
16919 64853 32780 -20584 28378 23169 50116 87837 129885 160703 111365 -15732 -80693 -46373
16907 -46373 37796 31920 -43758 -127461 -89644 -67827 -17017 40214 25791 17739 23357 -9837
16895 -9837 55481 100570 150157 132869 239086 300681 203831 45710 20951 48587 77478
16884 77478 112668 192251 18389 -97454 -89829 -30091 64517 139690 39974 -88894 -68900
16873 -68900 -74175 -19911 4715 68538 210860 160005 63420 -35496 -165609 -55875 64085
16862 64085 61250 7809 68710 91556 27963 27566 111189 158516 94794 63572 73654 131042
16850 131042 147156 158195 90293 2625 -135796 -144434 -84340 -117658 -40185 -75606 -110087
16839 -110087 -137422 -72704 -42017 20821 73527 78407 109438 116960 24029 -38714 -74156 2935
16827 2935 95508 14023 8437 -142269 -102664 -41884 -10763 -55729 57762 160181 191014
16816 191014 129979 88405 137982 56518 55591 83935 49589 -52626 -106924 -30771 -24093 -40683
16804 -40683 -95995 -113229 -58741 -31816 -92051 -48858 24128 19338 6885 -60494 -86575 -100617
16792 -100617 -20947 -35466 -242946 -265355 -202079 51127 273067 173846 66868 -46504
16782 -46504 -133273 -92700 -8599 74785 162250 83108 -78842 -174370 -112832 -98429 -134849
16771 -134849 -169923 -150485 -118393 -30448 89144 84085 57195 -55386 -5097 62815 -11892
16760 -11892 -98108 -81287 86188 31914 -80728 7749 156331 135978 52945 37999 61776
16749 61776 -5942 -26541 -77564 -59440 40475 85663 -19776 3545 110114 115523 146648
16738 146648 146052 129801 56037 -5182 -186092 -218545 -132319 44215 171180 87083 16912
16727 16912 100584 115713 55836 101865 186507 50001 -76948 -58153 -100660 -86275 -33955
16716 -33955 -27964 -5397 -2240 -34941 -63949 -13645 60829 26010 14702 55421 74504 -51338
16704 -51338 -43259 114987 137464 105896 55286 90030 30315 -36750 -61208 -52731 -12670 -20757
16692 -20757 -64272 -60462 348 24854 -52409 -57799 -130995 -146366 -15473 195134 174301 286461
16680 286461 287580 147255 -17940 -84013 -44407 -56045 -85291 -108619 -42696 113432 47300
16669 47300 -3866 4852 -115865 -219595 -231435 -268260 -179425 -66184 -29498 -6272 -22417
16658 -22417 -113965 -167297 -25124 -107353 -179093 -63704 72914 149778 71018 44088 11466
16647 11466 108912 37197 69466 52837 61181 65083 95374 95713 97547 87143 51191 24828 -180
16634 -180 -85561 21662 125499 110832 79069 66084 -7096 -55310 -93139 -22419 -16101 13820
16622 13820 -44814 -48089 -59770 -180191 -153761 -49986 37256 16730 28846 23685 19112 -34219
16610 -34219 -49009 -65250 -103228 -65038 -127503 -187060 -247770 -178731 36642 124260 42241
16599 42241 -74779 -108038 -43535 -71604 -55478 24502 7806 -103414 -150256 -130732 -12985
16588 -12985 85360 -72459 -151644 -143383 -159809 -131585 -145750 -163297 -115015 -104672 -36397 -82278
16576 -82278 -82091 -92517 -131634 -125477 -136291 -155426 -103895 -41996 -72320 -122998 -94603 -45203
16564 -45203 7253 48878 -33134 -106576 27856 149850 168182 100396 14679 12675 -61380
16553 -61380 -72226 -12276 99286 122350 92640 16875 39948 42813 35326 -134 -16018 -100467
16541 -100467 -150517 -42518 15347 35496 -24368 -74214 -34215 85991 54202 -66651 -119180
16530 -119180 -201864 -191711 -89640 4684 -20434 -37091 103265 187958 81531 -15756 112488
16519 112488 95457 18989 -26391 -131707 -161367 -25611 92231 -151750 -182456 -163394 -146639
16508 -146639 -161701 -165079 -198611 -229583 -144667 -131742 -154775 -132817 -87389 42082 -12325
16497 -12325 -102982 -55521 440 14200 -2577 -40001 -30595 -15718 -18473 -1296 73703 10057
16485 10057 -95630 -59794 71595 97423 -37700 12696 22954 75044 22555 -120903 -75120
16474 -75120 84413 87771 123 -70568 -63617 48985 -12849 -100313 -113685 -140433 -283221
16463 -283221 -371650 -173154 -182872 -257893 -125007 -9287 34349 70487 76428 30436 -1462
16452 -1462 54246 123418 33646 77651 149037 141308 121529 65883 -4999 -43691 -95290 -78759
16440 -78759 -159067 -215404 -122041 -73644 84619 19964 -35273 -41848 -37830 -71686 -122400 -105742
16428 -105742 -38484 -44245 -9188 65360 98515 128967 72338 -80593 -64809 -8995 36853
16417 36853 86275 91495 -62709 -113086 -102518 -79296 -44522 98870 29348 -98927 -118991
16406 -118991 -42974 -88209 -37604 -12549 -87177 -127936 -139953 -113123 -103226 -24166 80552
16395 80552 57792 -1942 74471 65943 99485 -8757 -61274 -61595 890 39953 84838 33452
16383 33452 18989 39074 -38763 -134617 -207715 -185896 -196031 -249547 -218225 -186040 -95467 -48928
16371 -48928 -62755 -116623 -141040 -109497 -114026 -133153 -63334 39969 63072 7264 -107836
16360 -107836 -138486 -90163 -70285 -10304 9505 88995 146012 168686 188075 146982 143750 220589
16348 220589 116105 18156 -1926 611 -11249 47851 -33956 18462 21671 55705 -6140 10883
16336 10883 159196 222510 103364 45958 13667 -91547 -79719 -116721 -167641 -130274 27760
16325 27760 248876 321586 257592 137979 44722 17036 -67014 -13229 63221 164834 144186
16314 144186 146282 96656 98929 45975 -47411 -48054 -113735 -23182 102017 30959 -49970 -40912
16302 -40912 24113 43843 -42088 -93015 -61798 -160977 -176639 -6674 129293 181741 151811
16291 151811 139968 135739 22896 -22452 -31887 92028 176980 212467 166932 84066 205222
16280 205222 305554 288387 152192 95390 -87220 -203505 -123839 -57819 -38763 -33199 -23926
16269 -23926 53833 -15590 -106205 -92448 -81221 -19051 52862 40086 -24888 2758 -53901 -140386
16257 -140386 -220003 -219927 -144889 -166490 -111659 -113975 -72092 -10779 43071 96883 143395 139762
16245 139762 124783 65025 -72984 -68954 4496 14357 -57681 -28140 24781 148476 170417
16234 170417 125455 97346 87908 12750 -40153 112244 31583 -40410 -141194 -182165 -77849
16223 -77849 -452 26133 -110480 -164720 -261926 -248054 -185710 -38911 45030 -3714 -41939
16212 -41939 -60181 -127135 -121410 11043 66410 65350 96325 124354 123590 48353 40743 131016
16200 131016 62804 -65070 -186899 -95364 88261 13525 130113 180741 90007 122980 137955
16189 137955 81831 -17640 -65655 -35990 -78275 -118614 -76602 94658 -94313 -91480 -19469
16178 -19469 -53309 -133743 -103870 -217616 -239448 -142347 -55838 -60234 -99999 -126473 -2531
16167 -2531 -59278 -62878 -84735 -102758 -49789 -2942 32018 65091 106039 128354 124361 69036
16155 69036 63354 -2962 106911 309945 339187 341659 263669 151152 198380 130836 45826
16144 45826 19832 7198 -86969 -189065 -302178 -176325 -66689 76344 -31746 -104274
16134 -104274 -112851 -40271 1458 78581 69378 222594 256381 224585 228452 277959 287584 141786
16122 141786 75166 88851 97012 43994 56202 10213 -123618 -213186 -206902 -74351 147724
16111 147724 259820 121962 8043 22675 -30566 24837 86875 36773 47861 -59395 -53906
16100 -53906 65778 27352 -77540 16074 139387 130959 107143 100829 53392 24809 10961
16089 10961 -63309 -105981 -83354 -41314 -105161 -90943 -22439 -132389 -180980 -198065 -127061
16078 -127061 1875 47113 -44991 -23608 -57023 -27375 58994 6329 84222 101883 136642
16067 136642 183551 153125 175079 152460 47595 107331 234252 62526 -101812 -183204 -170579
16056 -170579 -71946 78200 83007 -46709 32790 122894 89863 -46999 -21270 19908 49526
16045 49526 45699 38912 -59610 -50014 -73239 -34200 -56582 -61282 -140913 -134151 -116486 -153068 -123984
16032 -123984 -88654 -105137 -152441 -11965 28285 20102 51355 69007 8870 -21816 29131
16021 29131 10155 -79964 -142608 -101580 -98636 -148945 -147360 -63717 3962 14615 18053 -68366
16009 -68366 7809 90284 64464 67571 103164 112171 42635 49620 -2173 -59214 -94622 -145657
15997 -145657 -121528 -31229 70529 127578 30128 -68010 48704 30779 19534 17027 90264
15986 90264 20464 -7817 -27057 31634 74467 103413 105060 -13274 -39440 -19938 57177 -754
15974 -754 -78995 -41512 -78312 -88841 -86496 -95722 -74017 -28391 47061 86481 96680 229447
15962 229447 364808 318887 232133 255697 201995 23684 -162503 -172294 -122951 5213 -9417
15951 -9417 -104472 -209894 -68738 59003 -35337 -112911 -149080 -81674 -16416 66130 138782
15940 138782 87730 13667 -91881 -123840 -190762 -59655 -26670 -148789 -187117 -162254 -4891
15929 -4891 87262 121125 114242 79493 -12862 -46936 99260 178484 198797 195674 35555 30007
15917 30007 59123 -85895 -41483 90397 128775 -33502 -77568 -78053 -5788 -78746 -299007
15906 -299007 -262767 -89813 -26276 -1681 54008 91526 6057 -34384 -20474 5937 43556
15895 43556 161815 187507 74691 -37948 -49003 -3388 -20796 -40084 53735 16286 -27332
15884 -27332 -9580 -44895 -40588 -4680 37564 56946 22663 16183 169998 154145 126429 169842
15872 169842 179158 117298 111943 119288 152285 113401 11468 -48635 2054 -28139 -159842 -61607
15860 -61607 -31647 -54048 -73934 47342 23403 33952 47610 26759 -2967 -27385 -26176 -35249
15848 -35249 -59578 -142792 -132158 -139935 -81553 16093 47491 64388 -9379 -72447 43355 -49394
15836 -49394 -13772 72481 -52773 -78643 29449 -20018 53407 150446 122998 -5846 -81531
15825 -81531 -75228 -26959 15866 -59787 -269829 -328139 -205968 -93871 -85084 -9330 103699
15814 103699 124788 17091 -143278 -127073 -158042 -161631 -17321 90822 80169 34731 -42412
15803 -42412 28930 143394 200676 183399 38611 -39182 -25044 -84626 -124581 -83643 59436
15792 59436 167334 151315 78947 167147 206441 57517 15042 112295 28889 -109237 -156683
15781 -156683 -92485 -18150 23452 -41226 -89644 -60182 5549 154733 98942 81297 104075
15770 104075 57576 28219 86062 38285 -42805 -41424 43237 129555 163928 75262 -56609
15759 -56609 -28718 -34476 23962 21311 -2063 -115231 -131906 -67523 -5707 12934 46290 57105
15747 57105 68338 137641 108088 -10091 41356 133280 115780 -37103 -79699 -10586 1822
15736 1822 36129 43715 -18664 -4439 -67990 -187943 -229159 -126769 -47487 -134793 -141114 -166760
15724 -166760 -268543 -190157 -169599 -50379 105201 96017 22862 38014 170622 46910 -26747
15713 -26747 14333 83865 116 3736 -95823 -115090 35638 123651 163743 151484 124842 50331
15701 50331 -46775 -83584 120961 175547 -101061 -184330 -108548 67006 178417 104939 -5993
15690 -5993 -3383 65842 81638 129851 109717 72293 12399 25083 -38444 -54383 -28365 169774
15678 169774 172304 148472 218808 184290 44864 -86395 -29396 -63572 -89933 -104035 -113814
15667 -113814 -53060 -60327 -137975 -144042 -21656 85794 70569 229754 277653 244192 312315
15656 312315 268372 210632 207272 220270 205587 234755 261499 197999 290739 367755 294078 143830
15644 143830 76290 65895 88222 123346 129469 123053 116827 166539 64110 57330 118435 77006
15632 77006 58511 111018 92151 70712 -56101 -79808 54589 80316 51226 -4693 -10880
15621 -10880 -58211 -78612 57087 210264 128834 2054 -15855 -91768 -158812 -196245 -143181
15610 -143181 -69439 5104 138729 210282 65665 -112267 -137582 -125774 -102032 -3027 72256
15599 72256 36685 -3309 -15758 23224 -49662 -73219 -86584 -198429 -234552 -155163 -24617
15588 -24617 -79976 -53671 40356 -53918 -133009 -105779 -52231 -147063 -97364 -145079 -162068 -119466
15576 -119466 -190215 -167732 25091 -11148 -122300 -156221 -98256 23523 137612 153208 -7013
15565 -7013 -62486 -66715 -70005 59591 200596 170299 -29921 -31270 -16912 -18768 15296 85514
15553 85514 110469 131278 34486 -126255 -82169 -120830 -38446 137772 188638 216987 -80469
15542 -80469 -152689 -34528 -51696 -102950 -36444 -60566 27625 59779 81054 88862 130898 203515
15530 203515 217205 234901 146247 84800 37645 -15238 -10021 17029 10564 96972 183760 185682
15518 185682 266363 338396 230071 76995 64386 31065 21527 112877 57064 16311 -71914
15507 -71914 -236494 -201352 -127262 -92145 -87848 -42173 648 -5909 -87222 -66583 -68178 -68849
15495 -68849 64080 3404 -84300 -108924 -14752 15360 -101470 -51935 -22020 8813 -20449
15484 -20449 -19586 -47904 21093 146989 -8156 -185216 -105784 -139797 -175825 -121354 6522
15473 6522 -90026 -157827 -208497 -153343 -129314 -53245 3089 68245 99603 -19543 -77251 -190404
15461 -190404 -157565 -154255 -82555 -105363 -35044 41648 -8716 -105159 -114118 -190783 -60112 -38216
15449 -38216 -149954 -93067 -31815 -23157 -76572 -77338 -10762 -5168 24954 70134 173386 191273
15437 191273 -16377 -197430 -207894 -54676 43797 895 1855 -18289 -141188 -105522 -46470
15426 -46470 -105285 5029 -40995 -55123 90438 207586 225623 42961 -32838 -129477 -183588
15415 -183588 -143325 -145590 -17896 143134 179610 294403 259236 144173 2706 24948 62374
15404 62374 117960 166691 79743 19055 12239 68574 53145 -72247 -3948 20321 -35541 -19600
15392 -19600 117232 144417 91445 2205 -48492 56133 170418 239288 283012 173802 146649
15381 146649 17440 -11734 -48976 85176 117704 99987 102771 74238 96853 117403 107545
15370 107545 66133 64173 65849 158950 123995 119623 158612 176146 160228 115220 110442 164907
15358 164907 256993 269303 210205 112640 182558 145111 -123155 -246710 -169951 -131923 -170183
15347 -170183 -134956 41137 18766 32901 109511 5882 3518 -1359 45595 40845 40176 49693
15335 49693 -45127 -125994 -37485 -20016 -17434 65286 121803 7240 -47461 3079 13879 -54187
15323 -54187 -74484 -59179 -68173 -74697 -34160 14647 28748 89088 167266 259675 143733 -48569
15311 -48569 -134358 -208698 -263040 -286876 -309649 -207608 -194954 -265727 -310926 -284964 -288598 -101594
15299 -101594 -105791 11834 142561 189616 112837 53494 32659 -4357 14318 114000 60998
15288 60998 -46812 -78271 -177710 -23467 38404 13242 -53758 -206081 -126109 -161429 -80486
15277 -80486 101424 121316 -43233 34336 67241 70548 148757 114181 120582 157737 189617 158918
15265 158918 50876 -120717 -108525 113082 162944 135623 76218 60480 -11223 14420 27008
15254 27008 -1115 -70480 -13997 82729 5407 -8026 -48342 -94910 -56755 67471 21724
15243 21724 -89134 -100990 -55122 -24454 -58535 132391 394787 312929 253068 171942 96166
15232 96166 18663 -15454 76080 160052 176942 281407 230257 123949 85339 66534 209101
15221 209101 151071 -48506 -41901 -96731 -94227 -12512 15722 -62203 -61798 -31145 39022 68392
15209 68392 93242 84844 86357 159413 91245 3621 -140208 -156534 -96679 -113317 -147168 -123336
15197 -123336 -71757 -96228 -60100 -68912 -39789 -61528 -98804 -81671 -187188 -103662 -44762
15186 -44762 56979 119919 9499 -35136 -49357 -48677 17751 -40127 -89950 -92101 -56553 -66270
15174 -66270 -128765 -116484 -56746 68001 6178 6476 56083 118387 28462 -83469 -118019 -99625
15162 -99625 -64441 36446 61303 36328 -18151 -36686 -8898 28590 -23115 -49097 -3877
15151 -3877 -351 -5883 -38676 14163 -24020 -47703 -154504 -275904 -304365 -223109 -267518 -263809
15139 -263809 -142369 -106582 -75038 -94886 -131023 -161094 -216850 -306811 -258295 -145397 -24729
15128 -24729 145950 224736 226089 98866 -120345 -220044 -250462 -136949 -76440 90989 185225
15117 185225 235540 164467 44216 21765 66288 98340 107799 -77978 -118693 -75265 93604
15106 93604 206069 214247 178395 30337 42482 150010 189590 232305 152598 49247 4879
15095 4879 -30752 -148460 -167337 -6323 140293 -7687 -163824 -168481 -185787 -169366 -57811
15084 -57811 105113 206998 143107 20905 -105151 -35784 -50360 -15974 -13890 79200 103628
15073 103628 151120 117648 37191 -1426 53342 12327 -1477 -21791 -26450 -84636 -143979 -184970
15061 -184970 -45862 16779 75216 41305 102343 64296 -9328 1065 41197 36584 23176
15050 23176 31726 -8004 -159918 -168762 -9939 68182 84969 67949 77766 170133 170585 102150
15038 102150 21318 -39453 42152 21603 65074 -3986 -87630 -153342 -97048 43446 65763
15027 65763 -37498 42418 145015 164683 154160 126908 217117 134239 21358 -28919 -36425
15016 -36425 -193124 -120818 58622 79089 52185 -35136 2153 42549 95896 42948 2831
15005 2831 5321 21252 159858 229921 179884 161772 72258 12029 56698 36327 79924 90360
14993 90360 -32088 -129119 -121002 -143312 -240403 -234262 -96128 33961 28089 141054 135338 22576
14981 22576 -20541 -142843 -144881 -165487 -199124 -182613 -88305 -45570 -144213 -141598 -203217 -207339
14969 -207339 -45636 158363 181677 128784 492 -48428 -45958 -64144 -106337 -153618 -117906
14958 -117906 8230 2511 -80886 -65362 -140124 -199776 -82922 -57218 -115518 -133435 -65318
14947 -65318 -59362 -47852 -177464 -144001 -68359 11750 -63965 -84511 34875 112549 -67158
14936 -67158 -229919 -154249 38822 83058 62114 112520 194711 278204 235970 119205 104776
14925 104776 59513 57130 144229 119217 64659 37099 145113 134880 98594 63625 70438 181250
14913 181250 136126 85499 109012 129425 158182 134499 56582 9161 -47908 -101260 15858
14902 15858 83264 162115 346623 308003 225649 90154 40016 51284 117940 151782 149417
14891 149417 47604 14094 -33843 7718 17825 56848 105638 112557 173942 267498 327778
14880 327778 154881 60956 -89150 -155129 -116602 -94059 -134106 -132815 -44344 56330 69457
14869 69457 11354 -31179 -42007 -15716 32451 -16240 -125882 -101530 -78172 -85447 -48871 37282
14857 37282 88353 205083 188486 125126 42342 -69003 -108967 -30985 -38424 16956 49040
14846 49040 40528 45993 98941 45860 -36944 -172528 -196999 -16385 -94104 -161346 -130785 -88301
14834 -88301 -86216 60190 109469 79161 -54937 -63286 9647 60361 26492 8528 11355 -55358
14822 -55358 18355 89694 121343 52539 -114424 -16861 56433 89805 77465 -10351 -24311
14811 -24311 57268 176438 267038 199630 276830 300814 278025 362850 327266 146093 108586
14800 108586 37397 -43719 -20270 23854 91096 84704 91350 -57145 -81175 -35428 -77885 -78020
14788 -78020 26432 111746 18525 -18382 78988 77714 65257 52536 41180 56931 67512 102525
14776 102525 74133 -48435 -107649 -107506 -70393 -103765 -188225 -134474 -159939 26341 114383
14765 114383 139139 149780 194949 246596 255644 100316 8039 28361 93170 75503 -31522
14754 -31522 -110032 -47801 -104528 -58159 8933 16262 41334 78406 5741 -118249 -123464 -56523
14742 -56523 5239 80508 77928 21165 -141975 -99316 -49062 26150 131842 10940 -22206
14731 -22206 69108 -12090 -71927 -169829 -158055 -159671 -136061 -55610 -70889 56743 -2007 -65468
14719 -65468 -66828 -32343 -9599 -11423 72569 37325 -53110 -32087 -22637 -66668 -165495 -124241
14707 -124241 -102453 -184754 -272291 -165191 -78175 -22867 -9227 -69588 -126936 -142425 -34618
14696 -34618 6693 61282 44494 91552 101261 203048 275280 203882 69305 -100355 -176980
14685 -176980 -95684 -93134 -2957 60381 25844 77438 31248 -137510 -97765 -13295 -82686
14674 -82686 -23448 25263 67689 4878 -13058 62335 43324 44452 71293 -18088 -44532 -33420
14662 -33420 38613 157969 178583 123905 103132 126108 34746 12316 47500 16999 147555
14651 147555 87486 3996 -34186 -83733 -130046 -76943 130020 127625 37117 -5644 95814
14640 95814 172649 225031 182463 123843 75031 106115 83247 117397 66004 38235 -122343
14629 -122343 -116820 -66811 -14090 72739 70247 72171 -19377 -50282 45384 82564 162883 283877
14617 283877 188334 180615 185751 180207 215359 220023 199030 115162 98700 122804 37126 -32141
14605 -32141 18174 205949 281171 195297 90084 34058 -552 -875 12004 120564 71582
14594 71582 34413 -83764 -185573 -200593 -167991 -73400 -97478 -56602 34710 31403 -21001
14583 -21001 20934 234972 339193 230817 207045 256148 214025 258438 152334 -20945 -35241
14572 -35241 -25508 -77557 -119410 -19979 68612 85164 97660 72186 5182 2622 136684 140078
14560 140078 171331 198421 90434 44508 7778 -64848 -112946 -154346 -164141 -130942 -51653
14549 -51653 3157 22625 -51893 -51586 130293 100644 44468 99626 157640 129433 -20794 -102812
14537 -102812 -6814 -34084 -101869 -56391 -6880 -23698 -61130 -21321 -54998 48756 176677
14526 176677 154850 115082 114142 164934 119117 -7589 -111948 -129443 -129136 -55186 -85521 -104186
14514 -104186 106921 220141 255912 273878 129389 20740 120875 237759 138519 49693
14504 49693 59246 137245 222303 77196 34414 87944 118521 203211 154894 80630 51111 2060
14492 2060 -62008 -10549 72610 33323 -4862 -77673 -99204 -7706 31397 18280 -2085 43786
14480 43786 153973 140715 120539 66623 49909 49048 16000 25086 133114 10831 -118033
14469 -118033 -16603 -51240 -129623 -94349 -40264 18284 26870 -709 69065 209313 178495
14458 178495 43913 -89490 -29630 -9817 33310 44547 95194 240833 158173 269161 299115
14447 299115 85632 -11184 45564 124321 137397 234427 195556 27182 -83559 -170180 -229045
14436 -229045 -230111 -160669 -38784 -28064 84587 127508 86033 42296 48723 30752 -54386
14425 -54386 -36317 87528 -13645 30601 191582 102129 199966 171329 175978 229328 271515
14414 271515 78276 76599 88671 -65926 -127403 81806 154540 105382 34903 17163 -27996
14403 -27996 5022 -11842 44495 165065 129082 124288 198348 206092 190792 116023 131117 243218
14391 243218 151271 130309 123515 -9495 -12542 9525 62785 212095 244058 174598 89268
14380 89268 -71703 -56999 14120 -34112 25060 79351 173815 218185 212328 272906 346682 242685
14368 242685 176595 206852 274490 199762 128267 115534 220430 334096 349762 310098 185227
14357 185227 57921 40686 137683 145321 176432 175527 89821 27591 35396 108374 1223 -56042
14345 -56042 -47341 -100807 -92385 -49405 17502 27942 31130 8431 66667 91711 69993 129241
14333 129241 193646 85253 -28884 86525 237479 153954 61814 -23278 -24882 20589 2562
14322 2562 -65798 -57978 32068 75754 -40740 -112515 -121049 -243319 -198424 -34472 -2108 -69797
14310 -69797 -76594 -76877 -20728 -88095 -180648 -156651 -75695 51511 153864 197437 10234 -115060
14298 -115060 -1593 193383 314713 284683 239032 247868 250150 197081 275112 133751 116954
14287 116954 270094 230817 177855 78800 35916 -17391 -105631 -5413 121502 139916 141821
14276 141821 88062 146318 32512 -19971 -73390 -110810 -38458 27569 21321 -17127 28445
14265 28445 118742 132739 19873 12825 1377 73464 49173 62506 85529 29909 -42895 -64496
14253 -64496 -36137 -8404 -6331 -108882 -113677 13702 90983 -8753 -44790 51250 105352 77940
14241 77940 49690 74992 151471 113223 109369 124708 170210 56539 -91078 -169201 -155053
14230 -155053 28695 -45747 -59527 -65310 99708 184604 161559 238515 181518 122880 188734
14219 188734 270771 310539 281894 267298 236216 294454 303222 321122 259756 88211 63139
14208 63139 102512 -26359 -25346 50648 71752 60973 75303 50342 2144 -69982 -94833 51551
14196 51551 130763 110146 75900 172090 266290 162484 -8740 646 50993 32316 -22055
14185 -22055 102326 228263 179322 33096 8078 186345 254924 164389 56087 51871 50457
14174 50457 17888 29436 4551 -36997 -8644 -16666 -34886 4022 10702 92997 145451 233209
14162 233209 299141 234358 77638 -12641 44263 141635 216088 246173 149432 143857 131534
14151 131534 69038 -40031 -96335 -46061 -52774 78676 106714 164693 155589 153932 74744 3858
14139 3858 44535 10904 -34470 -56868 45022 51185 -41089 -76040 -68517 25910 144489 75241
14127 75241 30429 91056 227545 367796 442274 258088 191465 178902 153265 36432 7069
14116 7069 -57541 -41435 20213 92251 73395 132007 152712 -9665 -159484 -175566 -125722
14105 -125722 -36594 17117 15703 72182 24342 123798 238778 340834 348024 186582 110954
14094 110954 96138 71733 153145 75931 -54999 -165233 -106998 -16001 95276 165717 61048
14083 61048 -16939 40794 31195 20439 25014 26119 192801 238717 148009 133501 154411 91194
14071 91194 58124 97902 193630 253581 295076 250576 154088 128313 107464 28184 -12217 98795
14059 98795 229508 205341 100702 83123 126843 161669 144847 131153 246658 321813 316895
14048 316895 202092 93746 123549 270966 366690 278068 227066 176109 279001 223171 86645
14037 86645 83751 68665 -12901 30923 69115 43333 -57144 -40492 -30667 -11495 -13716 111708
14025 111708 178465 295991 312351 236380 96042 157388 256750 325290 239558 95352 -101594
14014 -101594 -130802 -25241 45194 89492 31143 -89150 -162179 -271268 -166095 -114571 -202932
14003 -202932 -72159 12833 94774 -25403 -19273 -44950 -58280 15490 35703 143008 181337
13992 181337 129475 4226 224 53069 60831 28716 85907 142914 29734 6661 18084
13981 18084 -3604 -50670 -101228 -166452 -81254 -98032 -140807 -238836 -139556 46511 136035
13970 136035 144739 136783 100981 175728 197218 192500 106537 140806 87948 99694 191408 266051
13958 266051 241636 148166 98859 65962 23619 49744 70355 63798 18940 8539 13873 48926
13946 48926 134336 46734 -98555 -66351 21572 85906 97133 81777 79651 75989 47328 100556
13934 100556 143723 75339 -83773 -254292 -240448 -114653 -64859 -74394 1075 77934 61546
13923 61546 139684 314479 208073 112465 46186 49893 51803 26623 14257 86719 83134 145506
13911 145506 203894 201528 125271 76612 152134 79282 99751 91383 117935 78180 -77520 -60871
13899 -60871 86736 182209 210682 143489 234231 311167 392192 233955 28280 91674 87007
13888 87007 38893 -33706 38877 250215 243827 241750 263302 224374 300334 251920 274984 260410
13876 260410 106988 109973 153426 74123 38999 132521 164353 206275 294309 212212 86582
13865 86582 181328 172191 108429 95412 89330 92964 13887 35153 165336 234439 170297 71903
13853 71903 141936 254137 183559 146159 139818 53775 73738 146043 152430 173103 163980 56161
13841 56161 74442 115765 79744 37155 78260 311755 359531 243400 141860 162651 219962
13830 219962 235667 170323 136821 23603 -111441 -162870 -140579 -72332 24572 122618 104097
13819 104097 118321 143101 184029 174159 107858 180346 207896 181511 225004 76365 125878
13808 125878 210304 230352 271909 186158 213218 276119 305284 392670 398766 434125 398062 248074
13796 248074 199093 130936 193351 178759 108280 68372 -18213 -33155 -37547 65011 178340
13785 178340 205717 149005 152345 165821 97569 90183 169869 230620 219676 101795 98720 68636
13773 68636 121738 147731 32720 122173 291260 378246 295015 326712 364263 357843 257890
13762 257890 248882 347255 306086 209713 233763 204225 152251 240273 366238 265789 111315
13751 111315 72848 97673 89178 37922 38434 81698 167719 273644 230289 176881 74395 82829
13739 82829 132795 92893 16380 90502 163403 163473 137901 167668 139454 141065 72271 59749
13727 59749 -20139 -110208 -26208 83559 85344 55537 176760 146760 119307 -30278 23940
13716 23940 126565 129507 305001 370978 344458 201360 25836 -76628 -18645 99880 75949
13705 75949 63798 60488 117633 115814 108346 206233 295201 246692 103309 34518 75546 39533
13693 39533 99017 127183 153968 193809 139236 101017 88382 17912 13285 -29021 -72365 -17549
13681 -17549 -127676 -153353 -229703 -138698 -3298 -42802 -8832 -11778 56099 44591 60649
13670 60649 105025 136539 126656 -10823 -94922 -178375 -64813 35147 50301 129162 90371
13659 90371 116802 227167 230738 197828 123677 102380 120526 -6371 -49896 -36287 119512
13648 119512 229132 307011 212270 235667 150305 71830 16022 48075 129523 147181 169190
13637 169190 256873 398716 370923 336020 215930 201741 287185 307227 161060 87652 81396
13626 81396 284380 341983 267073 151728 154303 148343 205309 94172 -36705 126844 285514
13615 285514 293768 131738 125499 245283 279292 357988 324240 183419 179024 231247 300738
13604 300738 183408 130348 188745 238959 196445 191333 182060 134541 164020 135891 82607 178409
13592 178409 257181 203115 20907 -85175 -20851 -40394 -66587 31346 -11304 87040 126980
13581 126980 99287 97723 94650 169334 41765 147979 240409 144376 135096 187785 223782 186423
13569 186423 110273 138298 126881 118656 91600 119627 109381 134736 75130 10934 29390 127572
13557 127572 223403 139553 132879 209344 274477 162348 5092 22546 157876 63858 165073
13546 165073 193623 135944 174690 190108 124854 192135 163895 17914 38598 64756 35017
13535 35017 66386 92383 94329 108296 29001 -26200 31679 59405 22670 39754 169156 346005
13523 346005 331326 314754 305789 353510 207788 241999 311283 382841 397041 360399 336021
13512 336021 320495 258041 217087 212963 221185 157896 163754 89942 33798 42602 106803 94601
13500 94601 179429 218099 237610 348502 311647 216571 120608 46287 97020 106984 41728 57070
13488 57070 85635 88215 44178 12024 -38791 -51321 -62698 -7998 105002 212861 148347
13477 148347 108181 96985 202098 328602 405580 454721 416843 393305 504458 533210 391374
13466 391374 313681 198948 108121 83356 139310 180333 18832 -25228 -73289 27216 142750
13455 142750 181979 145801 143647 148992 162367 218233 252904 375589 387165 215831 167616
13444 167616 124387 34014 -50651 38056 169222 208439 197900 226387 198233 185628 188733
13433 188733 167734 168200 260100 201449 196460 220991 203871 173143 265199 365033 281455 264880
13421 264880 82636 47098 148348 175418 179599 208546 137332 185827 184702 91676 66984
13410 66984 219680 281421 239999 181747 174754 194013 296809 391412 397256 351447 299698 263450
13398 263450 302527 289671 241010 251922 305697 316675 325629 330494 246279 178033 81355 132831
13386 132831 174047 184635 239190 250567 252144 196374 157457 258745 274869 229718 233095 186690
13374 186690 209455 379836 349817 246693 164901 96168 42911 30358 -41773 -55859 -46957
13363 -46957 54334 36753 179926 142916 190844 268962 153447 -34241 -52427 27171 148963
13352 148963 171615 134337 127566 88732 258816 298768 315159 238107 203794 163844 60455
13341 60455 -37997 7603 76003 161811 176502 263921 332910 371861 287632 335984 446923
13330 446923 424276 363172 295476 392141 411496 308428 227964 31347 -27072 3018 96144
13319 96144 181140 79475 -122097 -39088 81569 213738 227926 290404 174279 9730
13309 9730 149692 277130 223124 331409 370796 222005 165839 198792 295632 313283 291216
13298 291216 283401 222979 251498 339480 314108 248946 387161 454628 252359 80056 33783
13287 33783 32485 133717 280359 240786 125838 165007 172763 151997 226308 139306 165747
13276 165747 172199 268005 292841 228624 94345 21879 26324 87384 212925 222013 207673 200900
13264 200900 149717 167111 353905 402588 284427 187134 77040 84398 101812 107018 120729
13253 120729 116458 159910 150450 162316 131597 113247 131505 169396 161613 103667 73236 -6872
13241 -6872 32909 153302 215784 172294 226718 376679 427386 462932 372173 249151 253841
13230 253841 298935 377256 318758 291773 332976 364301 365226 352564 431423 344908 369415 453222
13218 453222 384231 353850 280952 288168 316901 353505 335750 388263 350028 405795 345158 242582
13206 242582 269323 332718 243360 165990 87452 178781 225980 214420 230015 206184 223268
13195 223268 201872 198395 323589 410312 355049 223856 199722 285160 342116 429396 399733
13184 399733 439859 346380 201372 280367 351212 416261 439702 317088 207820 241213 231713
13173 231713 313071 327984 234840 121537 84194 139855 206050 189211 107537 83647 125156
13162 125156 200179 160004 244374 359600 447752 429282 471781 397569 349952 422453 260647
13151 260647 153845 159246 230529 186719 178057 205498 256476 346553 277313 267837 285234 342946
13139 342946 354368 300126 239222 284019 195893 180306 286236 238754 231334 261315 228784
13128 228784 203368 171496 146958 264736 293437 378688 486230 466371 442492 433609 438042
13117 438042 569164 600566 441162 375556 353086 294800 224238 268797 254833 259814 161746
13106 161746 187130 230957 337882 358838 370038 347807 287662 358538 371302 299545 249510
13095 249510 275883 238201 187564 298605 424943 375373 343129 309130 289769 355730 367977
13084 367977 424503 440642 446810 361038 261592 350265 419839 418406 323589 378970 388687 408026
13072 408026 470980 448736 439077 381792 378928 331778 425171 371761 272611 275144 185434 167637
13060 167637 219234 146592 188633 322712 379048 341534 263033 288932 292368 269309 223478
13049 223478 204046 139811 153845 347501 529777 635040 561350 471335 408201 447257 424101
13038 424101 447036 423272 545585 578821 481842 419649 457222 583733 645384 617896 558672
13027 558672 469310 436314 412177 451450 505656 454566 414453 337873 311590 409155 395529
13016 395529 394856 363279 269341 286779 343626 245247 123443 105402 182798 399225 623187
13005 623187 618792 443613 367636 273544 227312 229484 253661 241487 332899 403237 431715 425433
12993 425433 320206 410507 402030 269663 410489 541760 495925 388460 404446 523796
12983 523796 527254 333687 362601 428617 458304 504648 438370 407216 485004 648688 565703
12972 565703 593457 529417 502084 468358 420165 452860 452362 359251 340997 317721 404313 569307
12960 569307 693981 734706 707793 640391 532421 546639 451904 376612 432951 536624 608792
12949 608792 633724 652361 591243 596060 622071 578175 498583 485460 440985 358479 279731 359099
12937 359099 442563 468007 409330 497620 473324 482715 445383 456156 551792 624604 613835 642392
12925 642392 663056 590534 570942 727235 731600 663747 645034 708809 707948 683515 631088 584325
12913 584325 613476 547822 538432 435894 528715 421989 424592 499322 499490 443729 475368 518865
12901 518865 422741 526478 636591 612081 599499 603944 546877 575805 512084 551049 540931
12890 540931 646515 531266 506635 481880 513692 458795 436953 497374 555781 638541 634895
12879 634895 632390 667268 706524 725198 753650 757289 769459 845629 911744 866967 1039050 1234730
12867 1234730 1380375 1586203 1807128 2023726 2216133 2220694 2122863 1972033 1979211 1801330
12857 1801330 1461970 1214788 1147755 1097046 965013 728986 575289 549982 611219 676315
12847 676315 746854 770049 721351 607813 687398 625606 560725 600512 716479 697383 685580
12836 685580 781909 772881 735660 778119 801347 738968 838746 915362 839917 684131 624236
12825 624236 635826 575515 514473 588829 693690 729876 747055 796674 722006 655847 634450
12814 634450 763633 796623 914670 840604 859833 919887 874890 811036 740812 702018 698670
12803 698670 748844 715932 592765 452756 371588 467640 565631 641228 643260 698104 654075
12792 654075 580883 582399 732380 719006 663473 748216 715212 647600 574840 645613 746338
12781 746338 818834 841088 820884 729879 668229 601710 618856 658819 753258 814803 829958
12770 829958 823026 782838 799966 764815 831387 835495 889066 853816 785857 788506 705882 841618
12758 841618 853893 816754 757869 717635 683003 696069 658666 711423 824892 817538 792979
12747 792979 777970 866760 899253 804632 876492 898888 827842 795543 941424 923833 844904
12736 844904 858949 940078 1045436 1096771 995831 918956 970107 972023 912505 776347 762456
12725 762456 737943 695198 759859 662112 583201 701469 793456 880301 990980 1015283 1008271
12714 1008271 933383 948822 952747 874730 835882 881947 912035 852052 867661 948309 854999
12703 854999 820346 859061 867581 853580 998842 1050707 1078420 1093744 1128083 1138858 1113897
12692 1113897 996041 877438 818130 826869 817126 801134 861270 824253 821909 956376 1073050
12681 1073050 1202634 1185645 1307822 1387666 1506739 1435693 1377775 1424110 1489186 1486500 1362331
12670 1362331 1205619 1224316 1270708 1290440 1206963 1155907 1103695 1042878 975456 931375 1029368
12659 1029368 1149519 1142900 1235426 1326524 1344325 1293740 1142438 969399 933885 1087652 1158251
12648 1158251 1151527 1122331 1047893 1022613 942099 920329 965803 929945 1000628 1049383 1058486 1040201
12636 1040201 1033988 1028351 1042364 1090665 1154644 1082550 1054347 1017279 1063917 1037756 1055680 1155969
12624 1155969 1263034 1314908 1236583 1173889 1249114 1278208 1175899 1149703 1260684 1295616 1329421
12613 1329421 1387321 1350848 1376733 1354871 1277478 1099008 969706 1045443 1085518 1067403 1243597
12602 1243597 1238233 1194538 1275615 1362940 1393397 1382538 1309513 1309135 1445895 1528174 1547392 1527913
12590 1527913 1624899 1689089 1683435 1541860 1419011 1354762 1393599 1448061 1464131 1423861 1302664
12579 1302664 1287529 1371376 1416323 1486794 1688596 1846877 1871195 1776011 1754790 1634702 1589407
12568 1589407 1709401 1678489 1695498 1726290 1727620 1760147 1842489 1825724 1778183 1692990 1670472
12557 1670472 1657191 1663151 1813846 1913463 1895215 1815322 1867777 1946682 1912096 1971434 2009766
12546 2009766 2068115 2099854 2102071 2027673 2046203 1982708 1947060 1987282 2004947 1888562 1979394
12535 1979394 2112431 2165272 2063144 2008617 2069091 2138795 2136935 2094591 2101594 2194232 2231837
12524 2231837 2149720 2097364 2089800 2208675 2211923 2164929 2336893 2423590 2413464 2442492 2477787
12513 2477787 2508300 2347597 2201894 2282032 2319778 2326928 2272209 2355055 2502370 2642524 2646644
12502 2646644 2685465 2678671 2737149 2845140 2738940 2657035 2697589 2862350 2887623 2778754 2879443
12491 2879443 2937602 2926393 2915349 2887055 2940390 3122175 3145770 3248648 3163727 3081305 3120706
12480 3120706 3227444 3359806 3410658 3449733 3469057 3573396 3671465 3779827 3854666 3840258
12470 3840258 4031724 4085579 4158428 4354323 4449319 4530049 4577388 4511660 4754699 4911562
12460 4911562 4976961 5261857 5498528 5540400 5705378 6081919 6348699 6539884 6815046 7192084
12450 7192084 7632870 7999747 8488346 8913047 9384948 10077952 10748724 11481626 12413141
12441 12413141 13528502 14816703 16370122 18195490 20516898 23486328 27296186 32153765
12433 32153765 38363660 46775504 58137356 73457089 94175286 121171445 154621950
12426 154621950 193190732 233771726 272035685 303030372 322102981 325117528 309785745
12419 309785745 277685871 234871675 189270427 148200942 115318854 90872461 73248829
12412 73248829 60396272 50736551 43185132 37344885 32781130 29153765 26170691 23645752
12404 23645752 21481089 19687684 18070148 16710748 15515439 14624497 13942568 13244146
12396 13244146 12596165 12165177 11580203 11004217 10513684 10116021 9891708 9609822 9222611
12387 9222611 8910833 8639081 8425612 8029668 7745604 7647646 7617425 7520924 7294634 7173984
12377 7173984 7089313 6891152 6724420 6645908 6631079 6588309 6413127 6298413 6260763 6222650
12367 6222650 6155723 6103559 6044246 6093458 6086765 6001241 5949982 5784529 5714329 5725813 5761473
12356 5761473 5762092 5671810 5665691 5698721 5584843 5429822 5328495 5290239 5325868 5387793 5342771
12345 5342771 5260426 5175773 5200498 5246292 5256094 5324115 5294914 5247112 5229589 5208795 5244864
12334 5244864 5176996 5201062 5190332 5124798 5129427 5134312 5048484 4985643 5019356 5081147 5116008 5308156
12322 5308156 5376764 5384256 5337880 5374946 5493842 5478346 5385074 5328139 5305995 5362066 5359267
12311 5359267 5420170 5561441 5700769 5580546 5488951 5535209 5579496 5679036 5683244 5666387 5732306
12300 5732306 5773800 5794503 5836274 5906963 6038113 5979057 5998381 6044689 6052946 6085109 6120960
12289 6120960 6152056 6078177 5973945 6140192 6338421 6255425 6137529 6187716 6257256 6291518
12279 6291518 6338028 6266276 6323001 6441790 6516726 6508411 6461557 6482399 6559184 6498518 6564714
12268 6564714 6651520 6814049 6842261 6825227 6868031 6849543 6906690 7070646 7090480 7052243 7120750
12257 7120750 7238942 7272001 7311360 7523957 7720038 7766210 7818550 7901698 7942262 7922453 7888564
12246 7888564 7891835 7948987 7995404 8091298 8156595 8158379 8204698 8303041 8403683 8374958 8457782
12235 8457782 8401386 8420200 8486575 8551960 8701881 8857909 8831432 8940656 9072885 9255536
12225 9255536 9369749 9445600 9529397 9529661 9600229 9715427 9835762 9968228 9974595 9976669 9999032
12214 9999032 10038052 10161691 10299507 10380702 10452563 10520101 10615288 10738616 10864371 10951784
12204 10951784 11086506 11256017 11211401 11324231 11402448 11493428 11659783 11865029 12178013 12185257
12194 12185257 12086635 12143818 12227514 12349681 12505673 12627552 12729523 12804761 12880939 13061722
12184 13061722 13207538 13236948 13315680 13515484 13693634 13738914 13853349 13909380 13977596 14010595
12174 14010595 14251938 14496784 14696066 14867676 14811752 14862488 15006658 15234685 15360829 15490695
12164 15490695 15618971 15841694 15939901 16120712 16283406 16517381 16535079 16721853 16864422 17023805
12154 17023805 17131459 17201857 17219236 17344503 17623159 17735545 17795287 17972281 18147835 18296383
12144 18296383 18363659 18431658 18586628 18706315 18882430 19088254 19227899 19403053 19533719 19626055
12134 19626055 19779172 19882313 20118459 20326477 20371276 20500631 20737921 20842540 20880822 21006230
12124 21006230 21180931 21412765 21528721 21651242 21934976 22191653 22389750 22506920 22564398
12115 22564398 22610548 22787477 22913223 23015983 23044149 23240030 23470384 23590191 23625283 23672461
12105 23672461 23876386 24133061 24187797 24112381 24291951 24405787 24591563 24715152 24708402 24736604
12095 24736604 24778861 24796247 24962691 25169523 25282148 25369581 25363279 25388474 25420866 25465453 25567828
12084 25567828 25677568 25844026 25981116 26107311 26011978 26057241 26070715 25962565 25961667 26035664
12074 26035664 26138793 26190746 26212201 26171443 26050335 26117553 26127652 26086945 26142437 26143801 26146348
12063 26146348 26118112 26102082 26112695 26084048 25899059 25845000 25847224 25704830 25694906 25737426 25689744
12052 25689744 25567373 25413313 25414798 25373096 25210173 25144914 25028243 25001186 24847075 24659230
12042 24659230 24528763 24437349 24306500 24131812 23976448 23893933 23853583 23809707 23771734 23609051
12032 23609051 23462828 23326078 23116713 23052691 22906312 22860510 22790970 22552899 22313264 22172407
12022 22172407 22079680 22071916 21845258 21637070 21508783 21527865 21408909 21234968 21098467 20957657
12012 20957657 20748627 20572659 20473895 20229017 20108166 20150613 20083852 19918934 19698175 19424739
12002 19424739 19209485 19098866 18991049 18760203 18658736 18482993 18374800 18255674 18147590
11993 18147590 18103897 17976990 17836732 17660563 17419745 17333291 17175149 17022857 17065582 17065421
11983 17065421 16890841 16715520 16788780 16828434 16879970 16960483 17038429 17020503 16845729 16611637
11973 16611637 16486566 16148380 15819897 15425848 15232436 15094349 14811858 14564368 14412748
11964 14412748 14231312 14067733 13803588 13628231 13493449 13319768 13191916 13092292 12948035
11955 12948035 12749296 12534929 12486554 12534524 12529205 12344684 12222798 12133737 12013045 11945985
11945 11945985 11837626 11818387 11752821 11585098 11414677 11323800 11219703 11160253 10940048 10784791
11935 10784791 10758462 10609556 10496345 10492268 10389426 10248137 10142598 10063921 10111147 10042641
11925 10042641 9890171 9791267 9797702 9614988 9520695 9445636 9435516 9414583 9238984 9022645
11915 9022645 8915538 8860989 8867706 8711215 8621583 8682107 8589396 8543379 8581676 8424504 8321489
11904 8321489 8221797 8118928 8158115 8241331 8133872 7988155 7926918 7929096 7943174 7871358 7785590
11893 7785590 7665879 7635915 7512550 7398855 7361235 7275655 7199408 7146506 7083149 7068334 7046507
11882 7046507 6995702 6824864 6602319 6569784 6526832 6622454 6626899 6476142 6353716 6367275 6267233
11871 6267233 6176936 6152741 6214551 6147534 6143697 6057435 6068224 6049379 6040325 5960806 5741283
11860 5741283 5586127 5634021 5661528 5631743 5621234 5603240 5556926 5557584 5624422 5659879 5567292
11849 5567292 5455948 5310419 5278848 5176471 5064472 4967048 4942791 4926058 4879499 4869090
11839 4869090 4946462 5062140 5066764 5083913 4935065 4951202 4889604 4647547 4683739 4748012 4745604
11828 4745604 4622755 4519871 4517833 4455466 4359034 4433988 4533092 4509122 4304364 4245907 4288539
11817 4288539 4221395 4168657 3993986 4034708 4135053 4124305 4214989 4275285 4183841 4164425 3995803
11806 3995803 3945559 3924679 3849934 3836802 3847876 3777394 3626661 3540403 3565792 3685744 3729094
11795 3729094 3693619 3665200 3682600 3669017 3630943 3528732 3428252 3452011 3427584 3319429 3279100
11784 3279100 3434665 3488929 3479159 3303930 3261027 3338524 3290434 3247775 3289638 3361545 3471674
11773 3471674 3481131 3591133 3527619 3407267 3303816 3315388 3313129 3173260 3086975 3034700 2887871
11762 2887871 2929038 3085090 3224735 3204051 3121429 3210581 3103965 2978490 2988560 3012828
11752 3012828 2931107 2973809 2965309 2897543 2848686 2794712 2703910 2613218 2531872 2500087 2603542
11741 2603542 2655469 2556409 2483614 2362545 2404246 2397248 2383985 2509799 2440352 2470028 2649515
11730 2649515 2659918 2530599 2503450 2373966 2430340 2540346 2417177 2362526 2379794 2477293
11720 2477293 2416723 2244700 2256618 2230569 2315745 2265352 2173223 2183697 2223275 2266749 2240142
11709 2240142 2074398 1962772 1992457 2082018 2101402 2063680 2124103 2183581 2080464 2065791 1989509
11698 1989509 2004174 2116718 1954657 1855492 1890249 2026373 2101127 2007353 1835918 1877806
11688 1877806 1935268 1845123 1765944 1752638 1778572 1917284 2024802 1866473 1738495 1643733
11678 1643733 1704241 1744429 1794103 1761146 1782455 1987336 1992122 1999939 1970308 1915335 1976901
11667 1976901 1970891 1849992 1930947 1905946 1892427 1920999 1869430 1830484 2009034 1836382 1648951
11656 1648951 1597115 1510267 1574276 1533633 1475752 1465939 1491681 1507928 1705696 1748955 1596383
11645 1596383 1583206 1703848 1676028 1606471 1635153 1557547 1434589 1466093 1555966 1569516 1568391
11634 1568391 1646465 1492230 1463510 1376162 1328292 1452843 1483263 1484939 1559143 1532977 1520696
11623 1520696 1407133 1242956 1300917 1394170 1328842 1353206 1490210 1464788 1439810 1568946
11613 1568946 1633215 1574219 1484756 1411616 1420621 1511193 1644745 1643824 1511055 1361727 1368317
11602 1368317 1377883 1356353 1178771 1107413 1220018 1230495 1239230 1264713 1460254 1650771 1516726
11591 1516726 1451571 1448391 1410398 1323104 1216879 1248632 1242834 1271479 1422705 1452416 1385303
11580 1385303 1341173 1296785 1366468 1276619 1283726 1330606 1175323 1138217 1075017 921379 919485
11569 919485 928861 1061891 1096258 1020190 1018696 1017351 954982 1054374 1180133 1218311 1160364 1129143
11557 1129143 1168901 1147320 1161587 1167618 1142273 1015261 1067515 1066352 1092720 1173897 1080779
11546 1080779 918191 926436 1013191 1080465 1154216 1190523 1256765 1146480 910858 732533 803083
11535 803083 867183 858068 857832 838580 1007394 1131524 1114126 1107408 1121421 1243081 1172955 1045193
11523 1045193 1071751 1024009 936055 1026694 968677 923164 911355 875443 811899 802884 830061
11512 830061 685657 797472 985649 1129549 1126570 989154 822886 901585 995203 907564
11502 907564 940478 892027 944669 1015091 984147 914506 792634 807605 823792 780844 803132
11491 803132 789151 727150 688782 864195 1012613 928447 869808 761124 628031 653154 727958
11480 727958 833555 932953 1002693 893229 846753 935541 905738 826157 846783 787175 643772
11469 643772 703326 851332 923028 865946 769021 814440 785188 731576 784726 859515 841243
11458 841243 822480 799166 785977 702119 721043 753172 903298 830231 728342 825662 788296
11447 788296 586994 503304 625094 662426 683481 644816 569339 635662 713633 829885 726405
11436 726405 626411 568878 605289 720579 829813 804626 749975 773093 700640 676111 704660
11425 704660 733799 688625 726299 775505 721933 714022 651971 535450 495994 547026 595441
11414 595441 518480 496228 584454 637726 731546 698123 617159 553202 505708 489514 496358 517580
11402 517580 403708 464485 555887 476248 372260 476294 526982 664700 682495 585376 568534
11391 568534 723587 741063 618607 509818 577466 649895 499933 496025 578816 615165 594423
11380 594423 523500 530871 515613 603690 603694 600174 599826 650235 717747 771986 830981 785449 698424
11367 698424 688252 696498 599712 459544 463742 489875 483471 398430 242175 245115 334514 477148
11355 477148 474717 486400 513404 574560 658287 583516 442535 452821 478645 485586 582508 469041
11343 469041 437569 494243 515847 496563 599732 607820 444775 370782 393464 556737 518642
11332 518642 513281 440328 381138 328168 325840 372144 353824 263372 344485 438608 551654 473482
11320 473482 403136 506169 463320 417711 493236 489763 617600 792407 681421 584818 569356
11309 569356 488058 518307 588075 626144 621481 545753 618219 652991 716361 688201 685191 619863
11297 619863 546380 528538 569045 589264 601038 496474 374697 338765 287066 207868 188856
11286 188856 146330 212270 267956 331310 384928 476139 558428 418073 245481 404752 367248
11275 367248 227425 246311 246327 228888 243801 240032 197830 209370 312423 295601 263503 271776
11263 271776 322993 321043 357067 450564 438654 396778 304740 225172 241651 310498 304331 289105
11251 289105 375180 360316 334320 370045 224370 286478 376987 390388 509472 486799 493662
11240 493662 353575 328928 319449 351123 369824 347019 427523 535843 602704 567557 466582
11229 466582 450682 519963 589155 593955 463416 333630 285052 338957 308339 279646 296287
11218 296287 412917 458754 429301 469844 506022 601245 624191 584985 606032 531155 560830
11207 560830 622642 558379 370054 319746 365450 449547 442467 329803 327898 413701 334097
11196 334097 317256 316884 327861 334809 381871 358550 354852 306713 283628 217824 175791 267601
11184 267601 334465 204658 145601 201964 337290 398835 308541 234837 239284 168546 284021
11173 284021 273923 249525 330919 423138 434888 397790 388980 382237 295471 357473 471332 565712
11161 565712 556165 434526 460640 474410 460790 394470 328831 291311 362045 381019 375592 449361
11149 449361 431389 403718 292345 285388 344663 359932 234161 223363 266952 260809 247192
11138 247192 287386 271947 349710 395889 331225 328763 250354 307439 293122 230750 240695 278601
11126 278601 370157 418248 335780 369226 353911 321126 247097 241218 321002 214742 91479
11115 91479 107834 159310 231845 256311 217563 147761 200373 250231 285398 319321 219683 100942
11103 100942 195622 324569 343473 166150 210183 275720 238633 237827 338683 402790 420186
11092 420186 493830 480427 411860 413594 370627 283651 351856 361130 183618 176606 244623 348775
11080 348775 372635 324427 339934 373990 372811 375610 435554 416613 342573 330074 344391 369858
11068 369858 330901 442148 417339 398721 396580 391666 392500 393605 299948 293568 241705 190620
11056 190620 253753 380314 384794 370625 465804 502151 515793 592216 535219 541186 600206 641351
11044 641351 587171 597155 529513 600971 754603 833122 879681 896672 945307 866417 806827
11033 806827 702531 584129 593485 663132 753806 826859 865895 816805 858314 931039 954119
11022 954119 964287 885977 862959 791390 684214 672664 665886 723807 845177 860297 859815 811814
11010 811814 779446 788642 793547 690850 547029 571856 574786 634326 753651 684122 587097
10999 587097 619168 574635 507756 454371 430604 493963 498578 470084 351745 201135 56931
10988 56931 -456 -8278 121953 314288 264884 256647 254512 280021 284169 347547 249447 162901
10976 162901 285559 461940 447075 322766 214590 186434 230698 217310 178575 141589 169541
10965 169541 127023 140339 282328 258069 151639 149536 234942 251126 206071 191813 298580
10954 298580 222745 161890 237021 133770 145119 260765 277835 226295 126761 139538 233224
10943 233224 261959 136273 -18323 -25623 -3827 38774 141521 141252 209220 211915 229016 283147
10931 283147 230049 187352 227814 295890 341408 397305 343596 168965 64173 -15230 139656
10920 139656 377914 475913 363607 266138 156013 111450 102367 40084 56508 225443 192185
10909 192185 166636 137419 181768 217618 205243 253791 175925 185317 237160 196012 288772 248678
10897 248678 194848 232408 180204 215296 228610 128667 156427 270536 296152 198870 87093
10886 87093 104952 140875 171840 307622 258138 325740 370919 402380 570745 693884 818477
10875 818477 847391 895463 1036896 1307708 1593625 1876589 1957096 1987091 2144973 1926225
10865 1926225 1541562 1330119 1180172 978283 749681 540123 505306 622243 710639 659224
10855 659224 430643 350478 382374 507581 546627 494327 375541 339165 295702 314895 388060
10844 388060 381256 357153 324141 297335 285696 192235 289735 304106 188482 89776 125045
10833 125045 241707 373416 417367 330528 313506 182259 99237 180395 125802 176194 221699
10822 221699 116177 72084 54038 15099 41097 142224 115195 84716 103025 60818 59162
10811 59162 91562 114371 128771 248460 164020 218907 281287 243518 262554 325280 301754
10800 301754 158602 66805 86467 287782 418220 455455 416816 229315 36201 -7510
10790 -7510 1625 126417 202432 222652 229191 234381 145866 68045 87360 167996 142440 52345
10778 52345 76710 -72436 -46309 56367 137180 212120 52905 -64615 47762 71687 83966
10767 83966 67978 98835 17881 60770 159452 115552 87295 26259 169274 305160 329082
10756 329082 313560 347279 420538 349810 315635 332535 260318 47370 -45760 66957 202567
10745 202567 234464 298066 352717 302993 290861 307056 224678 216497 232618 211270 168767 185479
10733 185479 198382 111011 115907 251390 343633 376772 464767 479180 500440 462239 599241
10722 599241 705058 703746 822016 1003474 1055305 1089712 1124828 1032412 1032695 1108707 1150706
10711 1150706 992282 751963 460076 281497 201716 235852 416542 556970 493439 473488
10701 473488 423385 442282 436854 352474 329751 423839 431254 403104 344667 409140 539947 635287
10689 635287 514230 447162 469701 531820 483860 503051 496079 609411 608921 595147 515346 523247
10677 523247 578680 472540 452903 493598 512327 406467 471676 493507 463206 459513 527336
10666 527336 456805 432815 551048 656490 694588 713860 777181 805898 791146 935406 971146
10655 971146 942826 1022015 1125984 1418004 1474855 1481922 1425152 1437987 1530946 1602145 1676236
10644 1676236 1598669 1578455 1741400 1894543 2055126 2231049 2651994 2890322 3128401 3383174
10634 3383174 3677397 4107394 4682812 5089116 5626079 6379026 7276474 8578427 10303299
10625 10303299 12597193 15696514 19757444 24711704 30072997 35659928 41127987 45954406
10617 45954406 49747414 52302988 53657631 54279081 55261673 57717829 62651884 69854671
10609 69854671 78817595 88598008 97869429 105481337 110451022 112050867 110168708 106225381
10601 106225381 102854781 102254651 105878231 113416728 123538243 134401258 144151857 151058653
10593 151058653 153458249 150249244 141833725 130189323 118544070 110034411 105813425 105412949
10585 105412949 107642567 110770161 113267474 113889209 111707967 105839713 96689509 85794641
10577 85794641 75503839 67447967 62323764 59472932 58050757 57376338 56510107 54850154
10569 54850154 51953139 47635762 42092364 35911680 29841844 24532820 20410021 17458595
10561 17458595 15113837 13334583 11914572 10807325 9877262 9030525 8223246 7664083 7313079
10552 7313079 6982151 6604055 6387868 6032031 5508044 5223509 5041343 4874429 4659312
10543 4659312 4521324 4354261 4313152 4328414 4239667 4127154 4003158 3908875 3777579 3643798
10533 3643798 3522958 3395516 3256403 3228940 3184510 3120339 3021148 2841976 2835188 2946312
10523 2946312 2946265 2933089 2753879 2713334 2688484 2738936 2618195 2620688 2785659 2835210 2916121
10512 2916121 2866336 2854555 2800022 2727309 2814288 2889383 2907756 2939019 2875099 3032821 3259291
10501 3259291 3272295 3344148 3385700 3537595 3735377 3850262 3952727 4122589 4342739 4529086
10491 4529086 4724362 5076428 5521472 5989259 6430444 7040934 7780871 8495101 9289721
10482 9289721 10033865 10788213 11662729 12608316 13834992 15364500 17280862 19781518 23235077
10473 23235077 27851556 33832631 42362688 54362308 71302617 94866139 126433360
10466 126433360 165932471 210989718 257358769 299627905 331892988 348463816 344224815
10459 344224815 317224414 271622171 217723427 166458736 125299698 95618505 74961343
10452 74961343 60508477 50117342 42413928 36408511 31724342 27891786 24849679 22431472
10444 22431472 20479521 18971668 17682965 16573081 15529853 14595426 13771666 12852251
10436 12852251 11890271 10833856 9936522 9203994 8478795 7972078 7689663 7330115 6913914
10427 6913914 6576425 6246152 5896523 5702240 5529269 5240347 5049975 4840231 4626372
10418 4626372 4476274 4348230 4227216 4178914 3991464 3749880 3527938 3363128 3265647 3185441
10408 3185441 3086574 3057963 3030120 2947667 2827136 2720357 2772678 2669384 2558009 2540097
10398 2540097 2568951 2588093 2586888 2565482 2267845 2072984 1917353 1898212 2047630 2042828 2105200
10387 2105200 2064934 1821475 1651549 1735255 1765406 1656343 1597242 1590146 1574440 1590833 1656349
10376 1656349 1668647 1697073 1648139 1463864 1361423 1392915 1315638 1098015 1087847 1145468 1157690
10365 1157690 1121380 1037795 1041645 1098095 1034686 1035719 1006364 989649 974835 1030932 1091984 1065642
10353 1065642 1091951 1047522 1097163 1091540 1027093 947743 891179 950652 996229 1008743 787678
10342 787678 747370 744190 864120 923262 948940 1118112 1231239 1194447 1056027 1080159 1173049
10331 1173049 1182386 1090304 850447 845405 858558 791374 893365 895884 864937 834536 869652
10320 869652 863700 862364 852155 983316 945704 1017750 1063848 941720 918115 955463 967569
10309 967569 978154 857856 798391 706999 689785 784453 805306 783588 747604 707528 720964
10298 720964 779873 853651 834350 921159 1101930 1198213 1203315 1067153 1038598 1080388 1039492
10287 1039492 872484 772683 716235 575246 572082 648181 649857 684637 699143 774040 824327
10276 824327 814886 752313 781694 790819 860377 730069 816322 855715 711197 770954 854138
10265 854138 839231 797803 671845 646710 726016 800100 796529 732450 629162 822016 955633
10254 955633 1022429 1104971 1055296 976526 1040384 1129923 1146417 1196769 1185840 1140664 1263194
10243 1263194 1340784 1348698 1342669 1365529 1412201 1503026 1614800 1661220 1766499 1862094 1892906
10232 1892906 1915473 2039439 2132168 2239184 2284349 2395373 2533939 2524408 2605448 2856095
10222 2856095 2996225 3124855 3378188 3625760 4023831 4324359 4648580 5003833 5400668
10213 5400668 6084299 6753037 7443105 8101833 8743663 9649265 10603137 11505019 12433724
10204 12433724 13624295 15370339 17422713 20282928 24072214 29130801 35963987 45585892
10196 45585892 59128994 78867747 106840258 144110071 189520237 238676380 286237451
10189 286237451 326758383 353927975 361013097 343229693 300406635 241639646 182675837
10182 182675837 135044885 101344067 78580791 63071956 52165015 44006754 37608742
10175 37608742 32542375 28572612 25376686 22810639 20716339 19035461 17630044 16665909
10167 16665909 15754799 14912979 14203256 13404279 12535372 11676621 10821972 10021992 9349758
10158 9349758 8724516 8180792 7760802 7386965 6994111 6603474 6282068 6152652 5837844
10149 5837844 5577823 5347117 5370664 5320966 5210010 4892509 4595658 4373408 4198362 4048124
10139 4048124 3841184 3745012 3630436 3495691 3472267 3317357 3237785 3059919 2917709 2836369
10129 2836369 2764722 2740698 2683968 2494679 2318406 2162143 2119146 2081202 2032214 2010279 1995310
10118 1995310 1993227 1964038 2011224 2038625 1972845 1940949 1889047 1750799 1606740 1456361 1458041
10107 1458041 1509481 1562438 1536922 1436750 1331319 1270985 1245027 1186041 991925 1117279
10097 1117279 1141271 1072772 1008044 999726 899836 899421 909864 1030006 1122148 1095162 975449
10086 975449 991299 1095517 1114130 1221726 1220812 1113629 1170463 1173864 1185115 1173371 1053371
10075 1053371 947328 963233 946548 935903 942188 947489 964125 966063 957950 904323 853995 915591
10063 915591 998888 998684 938073 921479 950203 1023787 1046632 1107801 1216328 1445104 1669976
10052 1669976 1858489 2038614 2287426 2356155 2264824 2213673 2144143 1830480 1541906 1261407
10042 1261407 1066067 861022 728291 583440 595694 653191 517913 556597 433536 397627
10032 397627 452969 465376 463020 468411 520860 496502 401039 324454 301834 379818 356027 342215
10020 342215 438731 540737 562770 549003 502189 511570 656044 689320 636865 405382 331642
10009 331642 416617 460226 403675 339976 346948 297374 271297 264040 252573 184077 130151 99769
9997 99769 57432 226074 451572 422986 272593 189818 268042 353004 331007 346499 307987
9986 307987 319303 357115 359072 377129 341212 284230 343660 402769 258338 168591 202383 177400
9974 177400 129325 92366 40794 131005 245290 403504 500952 405004 356219 360568 282695
9963 282695 161854 197801 215569 175335 170521 178442 219406 194511 226296 224841 184171 249066
9951 249066 286309 296531 319058 246266 315818 472145 370169 203034 98332 114652 199789
9940 199789 229029 201641 180025 198504 305916 316695 316844 418942 355883 262148 55450
9929 55450 17497 18531 30560 135275 158043 131397 147520 129642 152491 183462 175428 189417
9917 189417 173780 165070 158061 312782 344155 431098 424596 475290 505704 511035 610752 621988
9905 621988 599540 535820 401297 276602 304714 259319 149130 106991 73850 5626 -25090
9894 -25090 40418 85337 78329 172694 167929 130759 131248 133304 100875 132356 133305 250848 419807
9881 419807 378203 148039 105841 91866 56336 77703 54922 58167 24979 48166 107418 -34458
9869 -34458 -194603 -308692 -99175 51692 106521 160118 92324 -4374 -5904 22383 111313
9858 111313 191278 184457 97094 21457 10890 182777 299827 253515 146251 22354 -44134
9847 -44134 131786 267591 330513 338306 259366 219419 234129 287528 279210 242617 209971 196697
9835 196697 193951 141182 30036 -2585 26831 148319 246107 276994 329856 328801 206288
9824 206288 147207 162920 139270 66701 55678 43677 153821 362864 320990 156851 110717
9813 110717 89204 137401 207069 196875 225840 129759 100008 129807 77765 132394 166712 223635
9801 223635 242256 162675 155507 142178 145788 200859 295726 374665 265582 92363 -14626
9790 -14626 60525 264386 476397 619757 701052 882211 1200277 1572526 1754676 1876958
9780 1876958 2086636 2056296 1904168 1526931 1159559 906342 839424 738450 561349 438486
9770 438486 386063 264474 281243 367831 271141 240074 230223 229712 241312 244822 189035 128707
9758 128707 183188 257416 285179 265078 146500 166534 42957 14835 69566 69094 148620 178367
9746 178367 77631 53210 83154 81474 42386 236577 283155 300099 208583 52844 60492
9735 60492 151307 250811 290163 267800 209770 219209 154221 118301 71707 56215 48129 161836
9723 161836 194923 237706 289177 271014 124972 73589 70313 21720 61127 20621 -64901 -89873
9711 -89873 -30280 -35231 -133307 -105047 -174805 -94261 52202 136080 147833 36461 -10907 47557
9699 47557 152085 171318 142400 134622 197318 279469 309792 282210 189555 17429 -103518
9688 -103518 26355 101576 135502 197468 213514 120680 149574 56883 48142 68075 64263 90225
9676 90225 65915 110490 155403 274052 246003 153125 181373 172147 48200 56085 65845 106240
9664 106240 144235 159534 271773 354503 401690 416399 366166 367308 465478 506881 573435 600663
9652 600663 513222 398836 290858 202673 118496 -41064 -95692 77787 203633 205541 127063
9641 127063 -31100 29008 46316 154746 157539 180598 158445 147787 180329 151267 181828
9630 181828 200754 143697 124268 75778 58562 125505 141472 227121 247125 144056 100299
9619 100299 -7803 -93224 -26996 89441 152040 95909 14057 77100 59792 12759 -128237
9608 -128237 -121471 -60984 31153 38276 6687 43995 46556 122635 157034 136448 66216 89978
9596 89978 163584 359404 351173 199978 229984 232873 85800 78188 75313 32907 32145 36516 -46522
9583 -46522 -86670 43999 10214 46523 -45104 -60660 20397 75543 78588 22318 -39476 3782
9571 3782 6952 -127116 -41577 110016 175201 236203 269534 270788 112712 36037 56237 119012
9559 119012 130024 137392 58953 38232 -27016 -116199 -66501 -45529 -11485 -129600 -80195 129046
9547 129046 208243 208363 93374 20730 5516 119284 108833 201952 158295 170170 130903 154096
9535 154096 25386 -81548 -30190 -30726 -95470 -101278 -95483 -113750 -4520 20323 -32194 -183953
9523 -183953 -209728 -156471 48759 225779 166828 185713 235269 233718 201629 176902 153990
9512 153990 141557 177487 197269 79393 -33870 -71460 123618 94104 72457 150788 230735
9501 230735 223664 102445 37866 -11083 8163 134929 163679 97224 55144 44972 15017
9490 15017 -12732 31024 4567 62226 187589 97574 -8944 -80690 -10766 98187 66076
9479 66076 5472 -2431 84372 126140 -4241 -59515 -29513 6408 4697 -53680 8430 55354
9467 55354 130867 110797 -16609 -10182 43676 46822 -75080 -8118 51895 63256 107069 -62855
9455 -62855 -87121 -89683 -59514 -1880 -939 -28444 31694 147182 95288 78961 60427 5693
9443 5693 11012 30487 3057 -14224 15775 -20183 -10875 -17426 -45305 33090 -6177 -38569 -56294
9430 -56294 -11211 58106 82555 82388 126926 56650 10458 89928 10125 16154 57465 -3166
9418 -3166 -106815 -107136 16886 112608 188677 110669 183869 113350 -10384 13822 107076 147630
9406 147630 172281 178002 9694 -10418 -48272 -60777 -75292 -25893 -27542 -14403 36954 38998
9394 38998 22148 18612 15035 165394 152287 -10282 -50857 91809 58903 47707 52697 78026
9382 78026 92235 34191 -99400 -88356 -34841 47970 74161 39603 -8499 54562 51935 145130
9370 145130 103714 85280 127928 209132 246553 146461 39704 10606 -4220 -36430 -88613
9359 -88613 -158348 -163857 29483 140718 130004 91770 72785 213321 170469 45396 133079
9348 133079 214780 168358 27954 -67883 11801 127677 116584 160537 198362 88318 53483
9337 53483 123786 85593 56788 29050 -14559 -13951 35448 80030 129725 28594 99415 73058
9325 73058 -66393 55281 207770 245560 155856 21493 -62322 17564 149946 142798 69995
9314 69995 69184 67372 -25651 -150233 -155145 -37338 103579 58563 37082 136743 140534 32242
9302 32242 148186 80409 -36348 -69144 32571 112226 -38916 -1305 116118 104106 61062
9291 61062 62016 132174 27454 -54000 6044 132935 114596 223237 218710 211720 135027 114385
9279 114385 164759 219070 228932 95297 -23281 -28803 43554 171276 239529 135274 81908
9268 81908 61204 81930 56055 62368 156407 112011 140883 151264 124939 105971 338 -12421
9256 -12421 -33379 7250 78472 163349 257809 320201 208062 80841 -72875 -56612 -8526
9245 -8526 40415 119334 182735 180964 199943 127582 -21967 -101884 -55819 61015 63003 -49854
9233 -49854 -29796 9639 -35616 -72202 -148153 -132723 -49738 -2250 -16154 128324 188820 12269
9221 12269 2114 12812 63671 16723 97986 115493 142171 150279 68742 -17147 -47896 56278
9209 56278 146059 157095 118500 107244 97978 46994 -33856 -63920 -82286 -88142 -27238 -3749
9197 -3749 -16844 28099 -19956 -148985 -213471 -247999 -152761 -83836 -137753 -166710 -157556 -19395
9185 -19395 62880 91410 88566 30069 -24983 -88833 -1776 -20368 -17779 -58850 -35168 53168
9173 53168 20826 -61854 -48148 -5799 56960 102348 161192 181512 57317 -9526 122395
9162 122395 206755 77619 94391 249771 326910 156150 55623 26289 6196 -145829 -79545
9151 -79545 16616 62037 40397 43133 55375 -40053 -121703 -196082 -139684 -112343 -128310 -35607
9139 -35607 -97045 -147978 -128565 20411 51292 32828 54061 43517 38569 47965 96386 143538
9127 143538 181289 148017 142187 120439 20645 89177 34791 95356 68607 -55907 -56813 67176
9115 67176 279107 306890 133482 -16192 -66883 -65515 -11635 -90486 -133639 -166087 -99440
9104 -99440 120983 195934 252892 289804 215327 78655 27530 179227 112303 -8116 -70689
9093 -70689 -145464 -99821 -10872 -34674 -21389 54296 156945 117468 58447 -79289 -197749
9082 -197749 -16873 83191 93730 72816 -14701 33922 55273 76117 -1885 118344 117345
9071 117345 118726 130688 -67025 -196957 -137918 -78763 74670 178231 137675 122369 75087
9060 75087 -44105 -81434 6080 138291 176796 78231 -74812 -20865 26685 43430 73059
9049 73059 120673 148554 233840 216834 49750 30153 150993 103611 -62959 -55096 12363
9038 12363 69318 40685 -72311 -168215 -258677 -260879 -231000 -124345 -3307 57878 103835
9027 103835 -4589 -42873 -74314 -46251 -115141 -183652 -153915 -39211 85382 93920 170559
9016 170559 218967 210048 9104 43014 175955 221790 347559 272182 144771 85886 39828
9005 39828 -52916 -16061 24365 -13434 51533 -38309 -244494 -234397 -151482 -191046 -172008 -150901
8993 -150901 -117154 -1392 71709 41656 -31688 89621 76645 114045 126720 130259 127025 70213
8981 70213 -41912 -26574 -1702 -20010 -53887 -83189 -162503 -157180 -72665 49185 55376 391
8969 391 14288 82533 93687 27720 73450 32838 44495 19251 8105 -18012 -22837 1372
8957 1372 -225942 -190191 14183 -33091 -48457 -38593 -20919 -68404 11366 185171 168883 179606
8945 179606 116407 67705 96023 154370 231565 226215 195060 28424 58267 197910 206505 158418
8933 158418 161371 84516 70596 118894 22189 -52587 18575 24242 -24752 -88312 -30403 23270
8921 23270 227124 300393 173767 119418 57969 -93273 -111672 -181171 -197616 -113322 -24175
8910 -24175 38538 162875 160935 93441 88093 222648 217489 100593 -53240 -106841 -34933 -31741
8898 -31741 -2412 -66368 3811 81881 62300 71027 121726 22224 -70843 -65196 -37900 20103
8886 20103 43930 -12451 82451 50418 153112 174868 157505 19565 60596 166974 290259
8875 290259 284865 191205 105575 82391 73878 32374 -292 -83664 40489 132229 102006 158466
8863 158466 -144 -99047 -60526 25437 -11808 -51071 -86878 -81591 -59700 -133286 -164014 -147997
8851 -147997 -74159 28480 23328 -23346 -173382 -186639 -80772 -48703 61064 148256 124492
8840 124492 97802 55808 6544 36515 155586 152290 52825 93789 110433 53185 55758 127835
8828 127835 145610 100183 125522 74830 44363 53547 -41189 -125769 -65371 46822 -20886 -166096
8816 -166096 -190483 -138155 -53980 34050 -55049 -84809 -78672 -120572 -127292 -101109 -103657 -3815
8804 -3815 17070 -14033 83197 49423 -587 64332 72426 -34424 61938 46305 -42858 -39063
8792 -39063 -64832 -107754 -141777 -82818 12035 -7056 -145510 -185176 -182867 -127317 -113686 -179807
8780 -179807 -143430 -141209 -185922 -111422 -78292 -175794 -223704 -66684 -47826 -170131 -111703
8769 -111703 -6037 33102 15292 111096 162952 171685 137542 12648 -135584 -134652 -122083 -83447
8757 -83447 -50606 -69338 -139229 -33027 -110217 -98704 -30905 -112778 23819 84754 61763
8746 61763 -31291 -39888 46444 100121 22402 19552 2640 -61390 13104 18852 -7529 -161 26884
8733 26884 54556 59708 129425 67740 -41008 -45368 -18533 -151502 -106395 73615 23118 39369
8721 39369 48129 75029 83000 -87684 -194215 -78675 3001 29120 171435 162706 41452
8710 41452 44015 77300 125608 23750 -143378 -164534 -94625 48759 76387 34969 116981
8699 116981 195528 158041 118788 58630 6079 -148707 -129929 25907 114644 73008 50304
8688 50304 -29038 -47666 46530 73143 -39806 -48651 79525 154268 155926 55170 -22298 9413
8676 9413 5217 -107946 -84837 -72586 2072 -40269 -67875 -108365 -37173 -35933 -98551 -114623
8664 -114623 -10059 792 53590 94845 32267 3752 13600 -7202 34998 88381 96657 84354
8652 84354 84578 156685 98966 -3609 -42891 7353 22340 -202811 -194218 -67539 -121606 -134404
8640 -134404 -133676 -68632 -69734 -108502 -110986 -92029 -125592 -64598 32743 96395 13897 -111026
8628 -111026 -120041 -71388 29282 80531 185505 251911 65408 -38389 -27026 -80956 -71831
8617 -71831 41718 147199 91089 30855 -6757 -29678 -17221 31255 38993 177762 183195 203527
8605 203527 137404 89840 13744 -20321 77270 125813 29393 -41825 2926 34746 150140
8594 150140 35614 11688 112083 212180 209762 251753 249203 261816 326838 307107 290412
8583 290412 193899 89091 14526 -55628 -125068 27326 160468 231009 118543 69321 63640
8572 63640 5701 -3676 -42888 -66096 -64681 -118778 -7491 161791 84869 23605 69681 102572
8560 102572 153684 168809 81255 -34274 -31073 61951 61427 -44358 -94284 -156638 -180704 -122445
8548 -122445 -73051 30670 66150 53424 182254 205654 174488 134902 39097 49521 58859
8537 58859 -12851 -100680 13093 84103 17526 1481 51124 9658 32266 -46248 -116651 -40871
8525 -40871 -48767 -53710 -59446 -118 25271 529 -32464 7238 42679 46186 80611 34844 61546
8512 61546 78866 24101 60337 45827 -10368 -33170 -63835 -67849 3113 55157 74678 -36973
8500 -36973 -69566 -112376 -42583 36598 4801 -8755 55416 -14233 -33154 -7764 66497 99677
8488 99677 103775 40331 16366 1079 -76484 -105830 -108457 45429 95489 46916 103911 122360
8476 122360 -2837 -43622 24861 1149 -16241 -89298 -72574 9119 3041 40176 65332 49441
8464 49441 9247 -49852 -88827 -123853 -159305 -226414 -36132 53969 109577 205307 136607 183491
8452 183491 109008 122179 240514 290430 266691 256082 203603 297651 347428 349396 247244
8441 247244 228497 136747 161955 213213 231784 231573 177716 114726 207415 212758 150012 107047
8429 107047 11418 12962 -89493 -117959 -104132 -31049 84447 199078 206035 143127 48504
8418 48504 12841 -24511 -76889 -96540 -83508 14437 -67440 -74787 36368 45181 -35378 -114086
8406 -114086 -77899 23594 -57932 -40851 -135681 -171853 -88214 -25954 -64781 1537 147128
8395 147128 94497 51045 -14981 -73026 -93191 -66423 60817 98077 -33341 31112 91842
8384 91842 94180 -36813 15665 159327 54911 -164274 -156529 -109628 -26017 -27129 -16752 -29028
8372 -29028 -72410 23441 63335 -26731 -71903 -72577 -102110 -52824 -51447 20272 137151 185337
8360 185337 161596 182241 204266 76448 50948 77916 30520 85238 -22099 -98718 -100091
8349 -100091 -110224 -91991 -5239 121973 127913 145449 174591 185901 100531 35347 29889 13086
8337 13086 -51737 2778 -55376 -80223 -3810 88856 33584 -150739 -176722 -187061 -151215 -109494
8325 -109494 -7773 26616 -2753 -26313 -90218 -130506 -21799 -986 107593 142512 80451
8314 80451 25351 -63146 -74567 -32133 -6967 30674 86433 179457 281867 130842 -88602
8303 -88602 -218326 -212959 -227260 -209618 -152062 -82884 -43361 -24682 -38483 -44586 -36884 -72632
8291 -72632 -27680 -97867 -100048 -73699 -69408 -158151 -206381 -250047 -259577 -241248 -232546 -291326 -157809
8278 -157809 -79736 15422 -22262 35404 75292 8007 2172 -12608 34539 3044 -56042 -32527
8266 -32527 65408 197752 209674 89034 99183 44854 -80999 -144729 -179091 -109190 -72492
8255 -72492 -100933 -76064 -150024 -50234 29494 13803 -16288 37498 62160 45417 108061 56802
8243 56802 -39145 -117954 -101850 -268 -12558 56923 28730 -26726 13700 -470 -66325 -60057
8231 -60057 50133 96268 113116 224490 328924 224940 116601 63816 55701 40578 -8938
8220 -8938 -22334 68293 -11551 -68663 27777 8182 -35997 -44990 -90265 -147236 -14033 42880
8208 42880 -13710 -151856 -106432 22164 -21309 -33290 -163943 -176046 -85810 -89392 14572
8197 14572 -33227 -119139 -89262 -18951 -53838 -136714 -137213 -114750 -80954 -101300 -122944 -155096
8185 -155096 -264847 -349790 -164899 13154 38311 -31713 -112266 -14704 5591 187857 220438
8174 220438 232839 147557 188875 151434 196114 52175 -103454 -49882 78631 -12309 -41786
8163 -41786 -29336 -7437 -90860 -37036 -2222 41856 38359 160091 119308 46096 72471 -13016
8151 -13016 -181942 -244772 -233604 -172415 -73067 -67236 -202622 -95794 -98835 -96766 -138694 -65825
8139 -65825 22874 2491 48935 127463 -34451 -26808 660 8143 -19102 134011 165536 39200
8127 39200 -77540 -83074 -140352 -119214 -37267 -98740 -111015 13549 18178 10516 -88495 -34910
8115 -34910 64749 67666 59356 13147 -1553 -34630 122991 222441 59301 16351 62093 79621
8103 79621 44481 96675 133959 122018 63684 -56566 -64958 -14663 -34346 32522 104655 106113
8091 106113 86233 9317 -21248 -47391 -42216 -25384 -48587 -11986 -11206 -12302 -8033 52831 24072
8078 24072 75764 57484 52356 80808 56284 115381 201913 77425 417 138814 177242 88820
8066 88820 5602 47929 -37846 -80249 -73081 -52855 -15215 -52463 -139031 -217997 -115002 -62670
8054 -62670 -38297 40929 58466 -65693 -251667 -171463 -213654 -250388 -288149 -227321 -98710
8043 -98710 -39416 -25101 -48200 -97370 -114013 -235825 -242929 -149399 -78095 39712 77270 24392
8031 24392 -109868 -59779 31602 5331 -3121 16952 25694 79839 81471 21718 61929 136189
8019 136189 68266 40936 92405 44534 74829 -76899 -188161 -112957 -89260 -184761 -205872
8008 -205872 -95428 -43267 17040 50901 128430 58626 136696 168492 60723 -25988 3289
7997 3289 35457 89461 137259 -319 -104023 -104625 -70561 -44548 -20603 40668 11646 -6526
7985 -6526 21971 50237 80047 66458 12603 -78724 -100354 -52069 -172491 -262291 -241453 -190593
7973 -190593 -121631 -90541 -118026 -46299 92270 125242 110107 64256 158651 59299 -74527
7962 -74527 -133255 -145444 8608 78908 12460 -30390 -137941 -137482 -52383 7896 -47308 49029
7950 49029 83340 59467 35619 43752 45725 125673 225929 202681 88383 66516 22767 -26632
7938 -26632 -127583 -179326 -119348 23107 -21113 -183698 -127336 4847 -10303 -92029 -57839
7927 -57839 -55729 -27540 -79974 -79889 -56723 -2525 92981 199026 256893 180574 66592 133789
7915 133789 117477 27949 101668 -2926 130911 162810 103225 100761 142474 73008 -155242
7904 -155242 -197111 39529 153341 146338 184172 168962 49266 -24090 -129929 -130556 -25096
7893 -25096 -35030 -90811 -56055 36701 16508 5051 -14072 -28111 -52115 -128744 -131597 -54126
7881 -54126 16152 103679 132235 164754 208335 371564 438433 411115 343414 229114 126768
7870 126768 105651 16692 -6256 -25047 -8309 -89637 -138581 -161270 -45954 -21300 -68481
7859 -68481 16514 129513 124114 167672 33360 15005 131738 153669 10943 -61883 -156134
7848 -156134 -74508 39841 16508 4636 106453 143757 50710 113460 140336 17776 -10531
7837 -10531 86636 -16883 -21013 -2115 23116 -104948 -20735 53707 -46872 -6423 40766
7826 40766 -36821 -24049 84860 178768 131836 26717 18202 -14792 28734 27768 99831 75161
7814 75161 -38092 -27168 -2096 77377 3828 30394 -85235 -159696 -167716 -238201 -310757 -275348
7802 -275348 -190867 -12528 -55258 -127166 -113767 -18025 -2861 -33614 36428 33013 13359 -34709
7790 -34709 -104487 -188427 -147577 47051 102955 65170 14353 57040 29351 -6401 71213 143462
7778 143462 50595 -45391 -56380 29244 56707 -19231 -150288 -171700 -209340 -202403 -58306
7767 -58306 -152079 -269660 -175656 -650 40134 44737 -13926 -35650 -23933 -118169 -331683
7756 -331683 -327555 -429122 -359534 -202561 -200705 -126213 -115969 -197458 -193428 -58715 -131820 -186476
7744 -186476 81569 193383 191724 157245 107656 903 -126496 -73954 26453 34643 -87027
7733 -87027 -131686 -151755 -134738 -158168 -102908 -46364 43171 -42453 -39244 -11521 2819 -119350
7721 -119350 -152468 -92970 -51399 -44242 -84586 -133993 -212051 -164092 -37265 -53971 -59055 -71652
7709 -71652 -48349 41315 100799 167344 224738 213545 218951 160149 -12194 -34310 -30916 -15874
7697 -15874 50171 98673 146750 238330 152375 174056 133636 96796 29049 -2619 -98122 -109627
7685 -109627 -40914 -66761 -66583 -83521 -129098 -120898 -69903 1377 -13693 -77162 -66867 25292
7673 25292 16806 -3726 -67833 -93285 -122848 -80129 -61874 -67680 -107476 -57477 -7583 -19672
7661 -19672 -35705 -24748 133982 268522 226196 31305 -115332 -91613 -69614 -45667 -25584
7650 -25584 -40441 -74714 -88014 -19450 -69118 -67977 525 37058 49401 70249 61198 21543
7638 21543 68540 112886 142671 206948 245202 234598 138182 149243 21178 75296 48964 11023
7626 11023 -44007 -93800 -49651 -27208 -27867 -34587 -129267 -196303 -69476 -97868 -143800 -213746
7614 -213746 -230594 -164852 -99713 31864 64020 20355 -117278 -160805 -102974 -48614 491
7603 491 16325 5270 15408 52369 -70118 -173817 -181771 -177420 -66384 -4658 -79789 -184503
7591 -184503 -97669 -134962 -244891 -181540 -182778 -178137 -242328 -229922 -56694 -32685 -21061 -52293
7579 -52293 -98932 -67633 -79609 -41500 42267 113362 115924 -71 -37683 -154209 -214029 -99956
7567 -99956 49858 148896 1748 -127594 -48932 64787 99726 23071 -113529 -8263 -93397
7556 -93397 -93430 27545 171583 113388 87290 117509 25248 -142890 -104701 -33253 24971 34247
7544 34247 25796 21299 -35048 -138093 -50728 -10099 -155220 -193801 -137809 -164208 -276037 -161974
7532 -161974 -148012 -216450 -283096 -260479 -275589 -286254 -270818 -210073 -155620 -202478 -152453 -62067
7520 -62067 -16188 -73786 -30178 -129634 -173567 -65908 -96503 -145052 -115078 -109499 -160240 -107927
7508 -107927 -110867 -197509 -219461 -175002 -105625 -6614 -76992 -173206 -187934 -191827 -84193 -65819
7496 -65819 52882 49140 -8522 121224 162232 135729 -14319 -68343 -62009 28194 115420 69493
7484 69493 -41044 -31198 -12002 -4731 40257 34665 88135 115632 11072 -142778 -134074 -102500
7472 -102500 -69395 -53987 -83842 -24031 31412 -13883 28224 68792 133212 881 -92655
7461 -92655 -60301 -9474 -56467 -76457 -98159 -93010 29010 124403 164886 275434 130142
7450 130142 -38905 -34163 25233 124114 142902 51868 3871 -109759 -165653 -65850 -29190
7439 -29190 32374 59309 106762 9186 -151741 -247035 -171330 -74511 39164 -627 -12002
7428 -12002 77620 41271 -56756 -152063 -148580 -122229 -102769 -8191 163981 147949 -29066 -163735
7416 -163735 -214983 -140911 -79941 -80060 -17601 -10427 -121472 -109280 -132272 -118705 16838 32160
7404 32160 7211 71036 102780 -28397 -21887 -131815 -154017 -177686 -96807 -13099 -9800 1077
7392 1077 -57271 -41732 -58487 31406 49429 26871 46864 77994 -5517 -43204 -59154 -1950
7380 -1950 -21297 -145913 -141293 -198413 -190563 -59524 65054 136392 -17169 -145534 -207508
7369 -207508 -188788 -198224 -207032 -214870 -308956 -162816 -59376 -86925 -90128 -78326 -89788 -58542
7357 -58542 -21726 -168238 -198167 -205872 -33065 4077 61634 55458 119862 95343 40085 118266
7345 118266 155993 53356 121397 137892 97778 157947 183420 188148 167583 123610 78923 100958
7333 100958 52840 -16555 -92897 -98875 -200409 -173678 -23054 110655 117846 58042 -7733
7322 -7733 -61030 -79328 -90686 -212772 -252613 -308178 -312270 -211489 -155661 -163764 -165603 -83669
7310 -83669 -156033 -164711 -109427 -14058 23344 4901 -106665 -144808 -51517 56781 197163
7299 197163 188946 218146 97191 -22374 23459 16238 12861 -16471 -107121 -160429 -28556 143862
7287 143862 233273 113522 -94774 -102164 -69242 29568 -25779 -73874 -169057 -188993 -56800
7276 -56800 -41596 2422 27438 -95782 -132735 -133385 -59244 -128681 -79657 16125 -15180 2707
7264 2707 67529 57161 -69445 -103202 -48772 28779 -78341 -101442 -117327 -134973 -152920 -123474
7252 -123474 -186941 -227546 -106866 -80900 -129218 -26985 52160 92163 97335 77366 86512 13366
7240 13366 -203470 -317718 -320502 -224238 -38076 -21640 -80654 -25252 25668 81559 208894
7229 208894 119318 -19596 -23020 62997 64308 75551 112450 149332 172901 -5824 -131202
7218 -131202 -149503 -81609 -146141 -47715 63635 122621 118463 168689 63303 19808 -551
7207 -551 -29946 -75031 -42252 -15143 -37111 -192940 -177436 -50292 25280 15962 35673 -33911
7195 -33911 -106360 -100688 -118121 -187077 -154123 -289914 -252434 -126745 952 46706 -16288
7184 -16288 83104 144886 161970 171605 20932 17488 -32528 -17274 96711 179951 74399 48128
7172 48128 -89616 -147843 -210902 -200370 -160032 -167511 -245948 -163814 -40025 29260 105262 82067
7160 82067 60940 128530 184710 54106 -16619 -26922 -145952 -99626 50825 21594 -111687
7149 -111687 -136346 -92099 -120623 -68212 -65402 -56733 38728 41799 27560 59329 -1997 -123453
7137 -123453 -217298 -213214 -172160 -132082 -142554 6404 153349 247408 171112 -46746 -175556
7126 -175556 -172491 -62517 -52746 -41234 14132 -34212 -11400 142900 176374 103709 28938 28174
7114 28174 -23041 -143192 -222346 -262418 -196203 -134505 -616 88724 3720 -76336 -88283
7103 -88283 74243 158891 182942 121859 25468 9825 68891 112342 231952 87207 -23617
7092 -23617 -80381 -15286 -29813 -122379 -62966 -70088 -85451 -155449 -171540 -257515 -152130 77872
7080 77872 228279 130815 -18340 -27353 -62832 -926 133341 137973 105825 11799 -30714 -9612
7068 -9612 65855 119160 124835 79573 -6135 -8099 842 39738 36937 106751 133866 124436 -13906
7055 -13906 -15526 -82255 -51891 115661 201146 140694 66631 -6396 -93630 -73699 -20786 -154837
7043 -154837 -218587 -97076 -118938 -215885 -85333 -58045 -58245 -30048 -110063 -117584 -10772 76509
7031 76509 148001 193952 95192 -27398 76044 44960 -72787 -206045 -108705 -91269 -195861
7020 -195861 -314837 -235554 -135531 -63193 -124020 -170249 -38188 -46751 -132913 -26272 73079
7009 73079 103840 199085 232392 192876 41089 14908 9153 15952 63058 -8083 97145 136391
6997 136391 146815 13133 -142148 -128803 -62459 31190 174627 202996 226287 173678 -37299
6986 -37299 -106456 -120955 -70418 -68610 -96755 -122233 -102537 -56971 -107718 -41996 -93292 -51075
6974 -51075 -48427 -199650 -59704 11587 81964 133953 96847 154112 212549 139873 -19112
6963 -19112 84920 200222 108198 -9928 -101536 -198395 -124330 -65430 1897 -58965 -64177
6952 -64177 -30696 84047 168147 247292 280351 313433 280214 199389 157191 97009 -105472
6941 -105472 -140636 1995 165714 107978 105688 208940 137631 145218 95666 76137 -29185
6930 -29185 -73007 -4401 -21298 52564 46430 -4455 28920 106304 143848 90805 82286 4578
6918 4578 -52620 -45504 -61850 -108393 -113391 -45745 8934 -43952 -41879 -148110 -124614 -125583 -150704
6905 -150704 -152370 -193839 -107225 -24780 -66641 -46956 107030 149445 74183 47320 -135913
6894 -135913 -282379 -161450 -103724 -196726 -253609 -179044 -71458 -85600 -77695 -99375 -102241
6883 -102241 -52620 -39010 51185 46006 -30220 -48824 -4360 -75793 -96910 -34334 -24430 -46201
6871 -46201 -99019 -96634 -127706 -174376 -63929 -72154 -129835 -79609 119061 117517 -99813 -162887
6859 -162887 -53053 104090 122283 19565 -57405 -114762 -120233 -189729 -190135 -190840 -80607 15793
6847 15793 26099 36108 40291 182987 147713 123580 120996 112828 9875 -147964 -235093 -190254
6835 -190254 -145682 -191156 -225110 -185648 -162198 -41510 -11053 -16487 95335 130612 -12028
6824 -12028 -118960 -105487 -124536 -187987 -63224 13461 10146 13173 1493 -62434 -103029 31418
6812 31418 107085 72019 44748 -34920 -117622 -78393 -19601 -29666 64092 -5479 31940 73134
6800 73134 14971 -6471 107857 69870 48500 37154 110995 58390 -62683 -164178 -63709
6789 -63709 -54865 -100227 -134855 -138848 -91020 -124529 -27703 54934 59683 27145 96485 60732
6777 60732 11153 -93341 -196382 -184593 -128716 -78542 -27455 -21620 9274 19900 88839 132042
6765 132042 91867 25411 54632 48448 -44984 -168251 -270358 -402876 -235226 -100537 -87972
6754 -87972 -126165 -99505 -38507 -2746 11854 -388 -58239 -73096 -20989 -57069 -30887 60879
6742 60879 -38396 -233621 -248990 -161962 -78695 -34649 56574 -6414 10036 -49795 -440 101167
6730 101167 77608 93740 126663 233583 333047 289178 110622 23548 -21378 -109121 -92180
6719 -92180 -130351 -77561 -54616 12127 31258 -74908 -119189 -160663 -150344 -236740 -167672 -141351
6707 -141351 -153362 -120455 -102666 3442 98611 213998 159885 65965 132371 -1805 -102491
6696 -102491 -40206 -156210 -162729 -23554 43438 83233 -14181 -51477 -56610 -28819 27301 -141064
6684 -141064 -137095 -196590 -219440 -268369 -226399 -133070 -174425 -235802 -184166 -208487 -138754 -121461
6672 -121461 -30511 28829 3051 -117655 -47321 -87659 -135135 -144000 -197697 -76238 -51773
6661 -51773 -37006 -45500 117280 270039 282969 291452 192473 179803 174362 93499 -57703 -126136
6649 -126136 -101809 -6368 -21016 -36916 9766 13279 388 -9353 -134875 -202383 -112523 -149612
6637 -149612 -145334 -87743 17056 101586 77785 -13514 44020 173026 168666 35020 49392
6626 49392 -2259 -25469 -187947 -144786 -64360 60020 -60572 -39784 7665 -114077 -40526
6615 -40526 -15028 57949 136397 239178 194829 195196 125153 98808 23342 -84840 -193300 -218450
6603 -218450 -121842 19460 14416 -73895 -52722 23792 -12556 -121218 -64040 38466 -40328
6592 -40328 35035 101088 94605 39934 -136170 -168621 -104302 -23280 27976 -60690 -40720 20361
6580 20361 -54160 -184703 -174425 -231694 -254821 -176493 -78490 20488 7063 53052 39307 -39146
6568 -39146 54314 75258 -49391 -119938 -144510 -83257 -2953 -77075 -130566 -106894 -38494 2885
6556 2885 -134892 17208 138913 107419 37582 -82089 -76587 -66832 43082 117560 36931
6545 36931 -89157 -23219 -63621 -157037 -155239 -52923 9131 50836 611 -76011 -175518 -139206
6533 -139206 -85501 -16745 63886 99793 74221 -25392 -62469 48049 -75056 -28458 -30580
6522 -30580 5033 37809 -44632 -75305 -152214 -117746 -121705 -126402 -60046 58687 110853 7498
6510 7498 -29507 113605 62199 10656 71026 44771 -40727 -29769 3312 40332 62608 81618
6498 81618 108253 45548 28933 69534 113650 125203 -9378 33270 -22471 -39962 12275 9486
6486 9486 -81996 -80217 -64457 -53036 72902 76614 -1124 -65416 -57260 41367 67647 -21022
6474 -21022 -22137 87770 149111 95559 -30246 -70475 -171862 -211579 -207459 -218814 -189057 -203215
6462 -203215 -103782 77563 214552 201087 187842 160827 114473 61969 -42997 -79543 -102128
6451 -102128 -90164 -19731 69683 102947 -129488 -146544 -119470 -125207 -99464 -71064 50770
6440 50770 -45661 -84664 -39312 -86092 4674 98903 46353 -63024 -124323 -154821 -101611 97523
6428 97523 71025 68885 139504 15566 -162875 -226317 -7265 22684 -96505 -110738 -72087
6417 -72087 -92626 -95580 -116956 -104698 -108168 -192428 -161957 -179006 -136249 -2707 129385 94590
6405 94590 -5897 -34322 -37647 -91566 -44858 64593 68223 14258 -91582 -159225 -115673 -117608
6393 -117608 -27669 -168541 -120435 -159995 -231062 -178464 -139112 -113905 -9264 63089 -81493
6382 -81493 -24525 -70805 -91470 -71630 -216012 -197535 -190781 -126220 -45139 -30744 23253 95249
6370 95249 -43112 -178806 -209966 -184442 -168878 -92185 -104990 -2393 116859 75493 11852
6359 11852 57572 107836 17546 -112719 -53488 12569 15045 12122 -33246 -50324 63741 118967
6347 118967 82522 -86107 -153707 -21616 -82645 -15893 -25977 68708 77374 -16621 -47922
6336 -47922 -25645 -10100 -11895 -50580 22416 -6072 -60222 -45534 -125008 -234504 -206512 -100909
6324 -100909 16271 179141 136486 96613 23717 108141 82443 110941 81458 -4065 9485
6313 9485 -40595 -85287 -99808 -91173 -50260 15310 76508 125494 129766 75194 154495 234372
6301 234372 201280 229541 146949 71784 3460 -80460 -36285 8839 47436 64637 85494 66700
6289 66700 -85572 -167578 -68057 -36088 49589 -9672 -5638 -39922 -131949 -177510 -176091 -96680
6277 -96680 -55196 -50367 2662 -84964 -12861 58282 28984 -59765 6886 -72062 -86462 -24413
6265 -24413 53438 7338 -20912 -14099 -90112 -124397 -113394 -121962 -114151 -92616 -79687 -185041
6253 -185041 -335706 -277355 -124524 -102417 -118702 -1507 99258 122697 105586 28328 -8910
6242 -8910 -50487 -117214 -38579 -12376 -12153 -86109 -234224 -217478 -80678 -94894 -18376 -37370
6230 -37370 -209569 -263533 -223343 -134808 -153310 -250151 -209646 -214190 -369180 -402109 -237090
6219 -237090 -194560 -165942 -88411 -122549 -21335 65914 3757 -25554 -87874 -98822 55043
6208 55043 4046 18279 172714 222629 165960 178489 118252 18406 -45151 -13136 16925 15336
6196 15336 53353 67181 -141 -24659 -17209 81145 116017 74596 99723 76013 5643 -194124
6184 -194124 -298830 -232824 -176679 -214329 -221611 -209744 -113589 -91614 -139375 -89953 -71466 -57821
6172 -57821 73394 182651 260168 243047 11018 -60486 41747 49235 1261 -78409 -200590
6161 -200590 -195858 -134535 -193645 -293269 -244103 -97563 78711 85764 110440 57825 -55523
6150 -55523 -100955 -163722 -152155 -145595 -80902 -90804 -64419 -60335 -124367 -151084 -94402 -74838
6138 -74838 -9448 -101002 -87320 -80563 -145292 -105288 -48872 -47489 -63580 -481 -109033 -166383
6126 -166383 -59322 -166882 -64499 69740 77974 92986 105061 1995 -77480 -150625 -145343
6115 -145343 -173719 -185312 -58274 -32591 -77574 -107416 -123029 -157663 -228710 -234450 -182658 -91127
6103 -91127 -185175 -122632 -238280 -312185 -304563 -301079 -281511 -116791 -15599 -36912 327 37162
6091 37162 -19552 -34541 51223 136450 125538 86815 -54195 -111898 -107752 -45864 99 44433
6079 44433 -12370 172429 181116 55665 108976 155117 79619 21774 -179850 -173676 -144107 -233092
6067 -233092 -193547 -92315 -69038 -42620 -45056 -128538 -196785 -150074 -34522 -29373 -11864 37517
6055 37517 -120946 -144164 -275490 -288572 -308742 -199009 -59899 -88688 -138473 -219899 -260660
6044 -260660 -189792 -112156 -89212 24412 9863 19388 -42319 -55895 23352 131926 112753
6033 112753 37810 77081 -36470 -29870 -30207 115276 97379 26907 48714 -38130 111321 92972
6021 92972 54219 91333 103863 -3354 -80331 -92512 -94956 -31086 -13496 85733 132838 38672
6009 38672 34418 49938 22128 -32176 -95089 -112245 -53956 -37726 105557 48691 59530 144923
5997 144923 251492 136632 140453 161669 74856 43785 9243 6598 -34770 23602 101487 99165
5985 99165 41736 -15353 -40013 -104100 -162092 -163663 -65468 -42572 -73973 -77384 -153334 -250847
5973 -250847 -144917 -117878 -71601 16492 5153 -17399 -40684 -160447 -260461 -286718 -277569
5962 -277569 -194401 -119081 -172985 -244090 -112907 -72617 -146549 -211677 -112248 -115852 -84571 -39084
5950 -39084 -100333 -98598 -73164 -35321 108962 41195 7449 63567 28774 82803 195290 129173
5938 129173 22890 -9869 -78474 -85564 23262 74555 -31009 -97687 -9116 -15312 41663
5927 41663 78920 68227 -30045 -74336 -102005 -70239 -154239 -143852 -104615 -39786 -72909 -16769
5915 -16769 -29558 25127 -63365 -184036 -81408 11103 -25048 -74161 94004 126978 33569
5904 33569 8340 36393 14639 -112584 -181231 -242533 -285198 -176189 -128384 -73379 -53049
5893 -53049 -30377 -78712 -61840 -13724 60682 16557 -101805 -226457 -110212 39700 66059
5882 66059 123348 21700 -53283 -140441 -221069 -179395 -249627 -271030 -306951 -254210 -114436
5871 -114436 -16788 8598 19934 87301 163536 175019 167456 76203 170305 248264 133316 92522
5859 92522 55443 9966 -10351 -2920 -23970 126880 213862 135535 99508 67814 -4932 -84313
5847 -84313 -88325 104846 151869 159825 143817 83954 -2555 10346 56891 41800 93958 56560
5835 56560 20534 31211 23991 91144 148652 104866 61331 6846 -61283 -97262 -137695 -171786
5823 -171786 -142504 -30093 50182 46246 85615 68311 -62524 -74379 -55837 33452 39884 -68885
5811 -68885 -158143 -176376 -154824 -30495 -47432 -158335 -161666 -65004 -51635 -81247 -59776 24002
5799 24002 36499 48115 77124 -102742 -189315 -145487 -37413 -83391 -115261 -92467 -156519
5788 -156519 -203650 -235553 -147417 -107944 -71618 -53701 58010 197474 131224 101538 59671
5777 59671 35842 58494 -48048 -224055 -167003 -190291 -260150 -202087 -30093 54146 66730
5766 66730 69869 100799 38630 17229 75090 157071 21819 -32892 -25819 21622 133861 185199
5754 185199 204814 38673 -49467 -168058 -52702 -27787 -98688 -19940 -33056 -53797 -105673
5743 -105673 -131669 -226957 -256297 -178559 -108218 -93107 -128501 16157 -5132 -1521 -50656 -70311
5731 -70311 -26609 48119 15767 -41054 3573 17391 45474 102271 49070 80158 145400 102242
5719 102242 146691 185238 81773 38125 18585 37617 95142 49094 -93360 -104265 -148068
5708 -148068 -65010 51002 166368 197833 -24425 -63515 -8574 161164 119854 14072 10402
5697 10402 -11797 -12636 101410 16548 -180399 -273032 -206883 -139790 -226855 -252334 -164260 -121028
5685 -121028 -221678 -199225 -95271 -6967 98322 202684 144622 180563 219565 18658 41804
5674 41804 11831 13402 18686 61784 18462 62805 104339 114911 9512 -176523 -208204 -150453
5662 -150453 -50836 53473 117344 72149 5000 -1453 93633 74185 -63584 -121295 -85199
5651 -85199 -134304 -100931 -186253 -187797 -152359 -219292 -261725 -200303 -149510 -22460 -6298 -128066
5639 -128066 -81447 -8882 27261 -62698 -67463 -46827 -21880 -87346 -88588 -84737 -107114 -144966
5627 -144966 -184298 -188458 -83558 6584 -21381 -38666 23927 96143 32927 31684 144182 69591
5615 69591 -117181 -134470 -123433 -132530 74473 57497 -40236 -97897 -18222 42300 142735
5604 142735 183818 172270 104990 46234 -53549 -48812 64624 89023 121244 87834 106428 116160
5592 116160 75676 108927 137299 130562 28407 69361 115505 142861 290365 232739 117539
5581 117539 25408 -88338 -14753 -8565 4773 104243 159611 152413 52142 -92606 -78796
5570 -78796 27178 -41608 -13550 41482 23360 65636 28524 -46637 -116535 -108482 -14792 51020
5558 51020 85044 98580 148851 270249 302872 175085 76724 160054 195981 209735 191508
5547 191508 140237 30845 -93594 38614 169149 198464 50101 -84261 -135211 -6714
5537 -6714 75408 -66957 -77368 -21050 -32056 50059 61700 -116648 -202186 -225768 -202372 -276431
5525 -276431 -216163 -41241 95429 41650 -24237 -112902 -131867 -72719 14792 84507 85803
5514 85803 194096 148412 -31273 -55891 -10458 -42909 49274 126618 50997 187936 228148
5503 228148 38149 67338 94949 108463 -2613 -80414 -74606 -53109 -29427 8156 50699
5492 50699 53076 9610 56246 76712 3527 -141917 -228009 -373859 -402978 -321840 -209648
5481 -209648 -270629 -232552 -72190 48246 63788 14154 72841 67953 18583 -27531 86035
5470 86035 214259 112281 85406 28416 -55098 -1109 -53204 -197494 -230474 -306831 -373128
5459 -373128 -335558 -179658 -162852 -238043 -207953 -2228 47919 -70662 -109350 -59288 -112480
5448 -112480 -13803 -47500 -92860 -81054 43169 116993 135467 58250 -27573 -36663 -13477 91600
5436 91600 104515 61405 -1937 -6045 -19816 49766 -104500 -243002 -242224 -202704 -141773 -45585
5424 -45585 -114538 -118235 -74148 -27504 -218530 -189108 -95346 -2488 -26994 -45718 -25900 -28515
5412 -28515 45675 19061 -13649 -108552 -75276 -56824 -150199 -206823 -124007 -139137 -53973 -49663
5400 -49663 -34794 -23479 -108778 13278 166761 77381 14268 70421 194659 273214 225267
5389 225267 292124 234634 90958 73155 101957 -127441 -277698 -176475 -114416 -154510 -38710
5378 -38710 17727 -4447 57902 116656 88132 103920 21007 -4679 -75359 -46660 -64025 -19134
5366 -19134 129281 301474 127397 -126656 -239274 -203621 -101172 -52651 23162 68992 64240
5355 64240 -21796 -77901 -59821 -66275 -60130 -34621 -58245 -39593 -15858 -24048 -138528 -146301
5343 -146301 -66723 5226 121163 137105 -1996 11281 -72178 -95743 -119051 -140764 -35704
5332 -35704 3036 -18325 -48336 -52966 -94221 -13263 -27460 -74460 -153264 -182027 -134717 -42318
5320 -42318 -58534 -129757 -113900 -71697 -55830 98366 165951 86659 -60201 -126101 -86297
5309 -86297 8743 37574 -3293 -39397 -2319 -615 -17106 -8330 183003 293407 229288 115387
5297 115387 -28128 -35940 -73003 -124087 -82096 -89547 -61940 -93371 62616 53801 -20351 35694
5285 35694 -45773 -55543 62430 114990 26903 -19073 89277 44362 -22450 -116193 -73310 2988
5273 2988 42302 71235 52520 -133596 -74901 20649 65452 178916 135826 80180 39733 -3006
5261 -3006 -111157 -119261 -84554 -160479 -115572 -177744 -206404 -183298 -256037 -227460 -112458 5763
5249 5763 20977 -22850 286 23764 53643 -89084 -136844 -186220 -142170 -35555 -75475 22757
5237 22757 31966 -23888 -148136 -202434 -263088 -291069 -156970 -56523 -103121 -84489 -38881
5226 -38881 -182517 -221200 -125165 -5171 -24040 -50284 -96982 -17886 -40467 -140029 -186314
5215 -186314 -283848 -263542 -184655 -134443 -144200 -32887 103599 150876 149920 116542 -7975 -56294
5203 -56294 -74419 -18840 15377 59063 90208 37537 37860 21010 -91370 -53418 18456 121830
5191 121830 166000 56517 -13398 -14780 18790 24936 108461 157336 162315 162556 270826 359896
5179 359896 251529 132842 105755 79167 73940 71066 -36426 -116583 -38426 11465 -95669
5168 -95669 -169931 -153935 -173685 -170123 -173330 -61705 -37639 40592 22723 -3795 20601 -173112
5156 -173112 -155374 -31628 35756 143267 228706 192378 136406 27190 74868 124001 57075
5145 57075 102166 49894 -1105 -44671 -51568 -18179 45790 -64026 -119328 12819 14688 -46984
5133 -46984 -41993 8699 68811 53084 31744 -19147 20726 -94075 -68147 -73676 -176265 -125110
5121 -125110 -82589 -69865 -144308 -108097 -148818 -129709 -78722 -105932 -162163 -106794 -26343 -101860
5109 -101860 -138148 -141825 -198326 -84753 -64341 -80952 -140418 -201439 -169076 -34603 115431
5098 115431 77429 -18183 -123418 -208415 -187120 -58301 -72664 -86155 -177237 -245887 -209083
5087 -209083 -186299 -171135 -219368 -162070 -223205 -242295 -164288 -173656 -44139 14826 -8422 -25448
5075 -25448 -117341 -122367 31025 100185 75434 34669 -10394 -188560 -152184 -92628 -93736 41543
5063 41543 94271 133037 31762 41760 108484 59514 34329 -32568 -84710 -145166 -152442 -167639
5051 -167639 -183125 -172029 -179538 -130837 -102849 -104007 50820 72951 85267 192284 263407 158310
5039 158310 59056 128165 124199 39720 8088 -56369 -74985 -40075 34282 97878 25112 27072
5027 27072 -28753 31794 59748 -8979 -36027 -58683 -65221 18228 83489 107580 124196 143003
5015 143003 179404 239359 135290 148667 153634 78218 -44532 -125829 -143161 -7097 100578
5004 100578 10835 12344 54285 174547 223644 56140 -37301 -118146 -207281 -129426 83053
4993 83053 148975 72917 110909 150655 132451 112952 44591 -63070 -100688 -299515 -202095
4982 -202095 -173778 -164229 -167945 -107152 39226 69723 99629 -57419 -145287 -73300 -2170 10283
4970 10283 219 49367 -16784 -128627 -95174 -92421 -21597 -110952 -105841 -145537 -101960 -26916
4958 -26916 32453 79087 141062 155865 172243 80022 -14724 190789 270118 227131 79694
4947 79694 -34947 -93806 -52634 24869 117791 104249 57844 124870 226968 136236 87344
4936 87344 -21821 -171009 -189519 -195410 -202980 -210005 -196158 -146859 -17532 -90450 -67038 -41165
4924 -41165 -66231 -163481 -123333 -26410 -13404 24450 197910 218489 61411 -23118 -55009
4913 -55009 -254792 -196458 -60041 -43070 -16216 -148655 -213503 -128852 -53215 -98059 13495
4902 13495 -53218 -78143 32268 10557 -35287 -10116 -57976 16464 91898 -25425 11059
4891 11059 82165 5411 57250 -5387 -117638 -112499 41418 75455 4784 100457 116054 76918
4879 76918 14669 -90614 -138111 -86080 -111824 -117382 -187477 -207032 -160245 -68334 -10314 83470
4867 83470 59857 32112 -40631 -87448 40415 111911 72163 65032 66128 79126 115957 -8736
4855 -8736 -97166 -73161 -35701 54905 7310 -46457 44478 77294 -21354 33468 4920 147648
4843 147648 224992 216218 206945 116330 -23764 -223516 -244738 -171194 -62275 13779 66735
4832 66735 64701 38826 -44923 -248192 -266409 -102413 -46056 -21882 -92735 -208349 -148178
4821 -148178 -109945 -118617 -73480 -55578 166304 163504 194386 188335 71887 8833 -3641 36277
4809 36277 40567 96407 67538 57836 55164 87680 123911 162215 18759 90917 155923 80548
4797 80548 -27994 -187918 -274655 -199288 -114713 -168928 -149091 -62492 -18032 15572 -7251
4786 -7251 -77791 -84010 -91519 -58701 112584 31389 -141746 -136374 33863 86626 30004 -159863
4774 -159863 -138396 -69342 -138641 -241460 -161125 -23976 50704 -49234 -28285 -108837 -177676
4763 -177676 -77855 -27382 -59493 -207642 -238034 -183763 16141 84389 -86584 -51532 18622
4752 18622 -13724 72621 186915 160839 94379 13545 13668 70068 157352 252681 259495 179038
4740 179038 105564 -3339 -43498 -106308 -123376 -23581 22507 17110 -11293 -52805 -84447 -54822
4728 -54822 -26391 -104530 -24795 98942 98287 140092 197853 185781 123974 73301 3790 -69468
4716 -69468 -18538 -4381 -6582 97448 28420 -75440 -145148 -164275 -198238 -68933 -47336
4705 -47336 -15883 51584 36841 5430 -47875 -2599 85306 92269 -19396 -58058 -20599 53475
4693 53475 -27325 -16796 -35301 -151587 -154451 -96308 -48848 -64914 -46289 -67659 41330 102254
4681 102254 -33462 -92682 -102748 -237327 -128766 -18821 81423 125832 115553 73991 57843
4670 57843 -54076 2020 146134 93780 -23580 -124843 -179184 -133457 27973 -46 -55428
4659 -55428 33652 24092 -132974 -171450 -103632 -65726 -116083 -225858 -220464 -193758 -215113 -203403
4647 -203403 -172058 -109545 30113 -10040 -96918 -119967 -126011 -87169 -619 31098 20700 -81032
4635 -81032 -134931 -111505 -187894 -284155 -257674 515 182887 148631 -20578 -90762 -162339
4624 -162339 -139371 -117740 -117222 -14512 4284 -14032 30297 -39431 -118695 -186725 -319424 -348105
4612 -348105 -215903 -99468 -109237 -116125 -128215 -139586 -168731 -175145 -141448 -36566 10571 -92796
4600 -92796 -102087 -78825 -13891 -80057 -86802 -115381 755 16836 62389 27833 21955 86002
4588 86002 120671 78600 128132 61163 120235 147369 171543 112518 8505 28861 95061 111081
4576 111081 132593 135824 104205 180293 43261 -144697 -194670 -94230 -36277 39063 175398
4565 175398 216109 174690 177606 119984 -1859 75329 243180 207663 60781 13086 -67911
4554 -67911 -290110 -269225 -157007 -88097 -11360 38765 82220 162242 222743 249753 299209
4543 299209 233192 151679 -50330 -79237 -23544 -18758 61335 47038 -11578 40220 -705 106805
4531 106805 198888 103260 -36852 -68975 -50337 79153 119366 81964 -14381 -82114 -61870
4520 -61870 -17350 -5207 -24095 -78583 -99332 -36776 36122 110942 137836 30993 -86003
4509 -86003 -99884 -115682 -109848 -45978 12525 -143935 -138727 -89997 -45252 20970 -99815 -178780
4497 -178780 -162383 -40862 -38593 -81168 -11624 126000 118517 58158 15521 13261 534 -63076
4485 -63076 -17803 -94429 -88809 83592 14201 -75352 -19261 -173109 -170027 -134441 -38487 -51727
4473 -51727 -103581 -72313 18961 66315 77816 71245 66627 111186 125491 137539 146279 165147
4461 165147 101780 24663 -128894 -51379 129468 113139 71113 71294 4565 -172155 -49308
4450 -49308 19205 32377 24556 169547 168561 177670 131260 77483 79786 117233 44797 -21096 -113420
4437 -113420 -129728 -101746 -111079 -166664 -143706 -47341 18336 -6208 -33062 -97817 -139530 -142496
4425 -142496 -121863 -137259 -87124 23063 9749 13042 24185 -48289 -83642 -110633 7518
4414 7518 214785 322306 221763 -15094 -198386 -193165 -179072 -143302 -124288 -119962 -58369
4403 -58369 -37786 -43612 -163999 -144516 -28127 32063 -77313 -76023 -52694 -73548 -112416 -80054
4391 -80054 89367 179524 55518 55523 57860 102046 16034 -118460 -208804 -198502 -215953 -188850
4379 -188850 -180214 -203976 -219292 -182677 -203336 -52765 39075 118528 45373 66929 161992 55998
4367 55998 -52723 -59632 -141597 -257808 -269554 -184523 -153134 -86545 -227652 -193253 -117165
4356 -117165 -128234 -146205 -219648 -123823 66117 146351 169202 123256 122753 67702 31751 74844
4344 74844 46431 -2151 -11279 -66383 -142020 -294082 -317409 -224103 -34685 146201 95719
4333 95719 7091 20847 5177 -77736 -118620 -14673 19496 -8068 -190737 -172380 -112282
4322 -112282 -154604 -120524 -116155 -111219 -192680 -208739 -207213 -149040 54599 127757 109358 32143
4310 32143 -54890 13363 -25277 -182027 -92274 33493 90958 118729 77270 -44630 -192584
4299 -192584 -225217 -138077 -93080 35551 63229 -30093 -9134 -72174 12428 40266 -46475
4288 -46475 -151260 -129631 -57048 -31832 -89867 -99984 -177980 -170990 -11947 92630 78480
4277 78480 22617 -127060 -103743 -53434 -40073 -51038 -7351 73059 187758 185050 98813 17764
4265 17764 -51863 34840 114522 71772 -7521 -36166 -43381 -330 107565 185296 45090 -143758
4253 -143758 -75004 59704 110425 -21298 -79081 -7043 -99111 -107565 -50143 -92802 -164350
4242 -164350 -128752 -222965 -279712 -321102 -204754 -45336 -61691 -27106 8548 -10928 -92780
4231 -92780 -49670 -173987 -224814 -264553 -315940 -238794 -133635 -23047 55935 178977 189263
4220 189263 49114 -78628 -89431 -136992 -95101 -5245 64452 223613 229297 270629 228379
4209 228379 62620 37631 16402 -66322 -29414 -64460 -82802 -44938 43862 -32495 -100116
4198 -100116 -52917 -106745 -92487 -164275 -112307 -54747 -56301 -67828 -31388 -79665 -127771 -85486
4186 -85486 45674 14006 -98898 -127856 -128491 -18903 71751 170553 172377 45486 161974
4175 161974 204782 135582 5027 -105426 -59128 -95688 -165228 -124511 -68027 75224 221125
4164 221125 253182 182186 113211 34114 11550 95895 161231 155605 162443 163481 122207 139818
4152 139818 144631 90803 -58843 -72613 28254 73388 23187 18326 -36271 -84526 -139136 -139608
4140 -139608 -168706 -234326 -170629 -108594 -149385 -195889 -161465 29784 204060 208450 37948
4129 37948 -26880 54698 93482 94567 44623 39451 41158 -170607 -215492 -107121 -51637 81848
4117 81848 93430 -12080 -3627 -15207 -68053 -77954 -68396 18627 33678 133904 120836 -55039
4105 -55039 -163637 -133587 -10962 28569 -35563 -55758 -49317 -100120 -60153 -12971 27995 59555
4093 59555 -53111 -177006 -283950 -214706 -280312 -210293 -127025 -25738 -79967 -48857 -62103
4082 -62103 -151759 -149067 -1507 155540 155614 23068 -79948 -44982 -1384 3544 -22989 -84136
4070 -84136 -81800 -17366 56412 -19345 51815 179522 141914 179407 210087 203075 261377 146590
4058 146590 123336 50695 27333 105627 140491 112546 122686 82725 123606 85834 124612 95688
4046 95688 25511 -15457 -21014 91873 97586 19329 18531 -90325 -190791 -204992 -150228 -135518
4034 -135518 -114399 -136717 -140969 -74059 -45410 -4699 88846 -22995 39311 38614 4428 73474
4022 73474 128168 135595 39671 -14672 75192 125127 135407 163151 160924 113196 99220 -6863
4010 -6863 -84902 -4393 17607 -35703 -100953 -64230 32152 5010 -20966 -93743 -72847 -63052
3998 -63052 -39600 15660 -39132 -14154 91631 49742 -145750 -141958 37302 30497 -76443
3987 -76443 835 -10627 -75912 -17549 -9863 -33311 10988 149571 192327 87400 47314 85973
3975 85973 -7210 7570 35096 -53442 -107209 -122903 -171679 -209731 -112020 10752 -6843 -47765
3963 -47765 -76223 6436 -21463 124876 128724 69943 37201 81036 99143 108757 109049 -19848
3951 -19848 -82057 1145 75548 71866 -25793 -103011 -173180 -168149 -131379 -863 14653 -79165
3939 -79165 -185467 -190111 -75617 -38035 -113997 -49156 59979 -30841 53882 -41470 -90317
3928 -90317 -25817 117444 67154 -40675 -147917 -105023 -104709 -104007 -112989 -101350 -74331 22605
3916 22605 13626 11060 -91269 -118096 -56625 10227 51135 -38051 -71516 -128523 -116210 -186022
3904 -186022 -216645 -230225 -131342 -70171 -153783 -31117 72113 -26249 -113644 -149527 -85481
3893 -85481 -151214 -224388 -191073 -103492 -41217 -50352 -38897 29702 9475 -56293 -92201 64119
3881 64119 140981 144507 99029 126324 25149 76303 117672 168445 168109 150570 139629 25335
3869 25335 12299 -9594 50890 77594 13809 6427 66960 101937 -5977 19609 123458 -21310
3857 -21310 -105521 51608 134860 123187 190911 68105 -91561 -89325 -16201 -56652 -82171
3846 -82171 -112927 -155493 -86381 -71704 -34352 -69138 -45294 -41750 -66477 -65441 -27239 -15293
3834 -15293 -84404 -44142 -18937 67392 45275 114014 195512 194179 137517 188093 159423 125995
3822 125995 11505 -60997 -99279 13654 138689 188346 151657 62169 -25645 -19159 25942
3811 25942 128999 107973 113747 117708 161445 -34934 -243526 -210294 -157488 -125193 -54963 78606
3799 78606 78525 -72611 -69126 22767 193742 224736 239287 106918 -23250 -7018 -39476 -112192
3787 -112192 -29956 49600 3550 -57655 -75854 -41615 -105709 -166074 -305257 -178632 -22104
3776 -22104 -38455 -24490 42513 -36601 5910 36759 -119659 -123205 -79500 -32856 -48377 -188665
3764 -188665 -188174 -57405 13748 -28798 -90733 -23564 44455 143950 163581 165463 265977 278319
3752 278319 231277 112280 95923 73350 151409 216232 112279 79635 36281 82785 41861
3741 41861 3955 -66954 -29252 36654 13498 12448 5918 -203902 -194145 -81538 61078 26772
3729 26772 -24225 62640 111569 114285 157860 190277 258331 176477 30522 -123130 -280733
3718 -280733 -272200 -136215 -22125 -16705 44220 -77038 -23378 20188 4543 31147 -26787
3707 -26787 -60973 -105442 6201 90132 184735 129760 86538 122768 174335 122320 53278 68992
3695 68992 50717 48031 30211 130073 70036 -21104 -52004 -77792 -11614 5337 36513 -13654
3683 -13654 -8882 -67825 -108508 -136247 -218783 -231284 -136349 -31465 -23664 22974 53192 -99189
3671 -99189 -83537 12382 -39121 -44224 27481 72304 125576 133145 132565 185586 114321 116958 8618
3658 8618 -32696 -39659 42711 24142 -57563 44231 52558 64733 35430 16446 144043 128465
3646 128465 -83814 -247493 -251701 -165075 -31896 58346 163210 162561 94190 71685 76145 89107
3634 89107 59617 27571 -63907 -211506 -246563 -147789 -509 -33413 -200375 -329073 -248657
3623 -248657 -140260 -62631 -37634 3297 -51934 -51544 -98124 -94492 -29681 -175770 -246862 -130455
3611 -130455 -96895 -25417 86415 82052 67676 -37908 -33652 28342 103965 142329 134232 85343
3599 85343 35835 3053 -51114 -148040 -80828 -28631 60530 100098 25891 -102840 5345
3588 5345 -29420 -19163 82755 -20324 -169563 -66320 153614 228913 145514 146824 171643
3577 171643 233229 163384 183924 241756 203412 155453 27491 -83455 -50704 57116 -5611
3566 -5611 -94099 -9805 -17294 -92047 -65619 6645 -32125 -138013 -234466 -168749 -210854 -150311
3554 -150311 -106521 -139225 -96203 -16377 -102035 -156961 -157008 -169842 -216386 -164534 -29903 -105558
3542 -105558 -218071 -217956 -193507 -195614 -171772 -77011 -76239 -130327 -97930 -92531 -94932 -16606 37722
3529 37722 -24509 11728 97382 127075 34552 62977 156039 200690 150967 46765 31492 73590
3517 73590 -2814 -73421 -112133 -121490 -164137 -79506 39959 81698 119981 109178 82763 -38022
3505 -38022 -60995 -169136 -91449 -75370 -7873 -36271 -43528 -65471 -163040 -195335 -114274 -121155
3493 -121155 -107303 -2803 160975 146616 28051 -35040 15649 40919 -57209 -108021 -46665
3482 -46665 -73171 -88449 -72125 -167989 -239762 -233508 -336616 -376004 -389304 -196653 -87293
3471 -87293 -131734 -39959 -58542 -123346 -166853 -141031 -186603 -98663 -64353 -168006 -214931 -316511
3459 -316511 -285958 -348327 -248370 -108675 39509 -100092 -140422 -38842 75282 144427 179932
3448 179932 136011 -130720 -222548 -151568 -131007 -21613 -72112 -125098 -170070 -87546 -128338
3437 -128338 -201751 -73695 -25292 -46115 -172629 -156248 -147232 -93103 -51201 -120388 -143633
3426 -143633 -201842 -54228 72783 42853 8090 -1995 -83482 -65506 -4651 86632 -11570
3415 -11570 -52936 -80671 -78209 -58340 -64026 -120934 -81408 37510 75281 465 -73166 -126504
3403 -126504 -110149 2442 -10316 12514 27916 -55714 -30398 51510 131515 228067 177062
3392 177062 105247 -35978 -154932 -98426 -48799 -29708 -85464 -44876 -26841 -25944 16679 12404
3380 12404 89729 75953 -36192 -46373 -25216 63802 119728 162623 209048 148726 85626 126431
3368 126431 106363 69570 27770 93009 77901 39717 -37280 -109680 -93710 -40193 -34080 -46896
3356 -46896 -58768 7604 -61427 -89386 -22931 398 140408 134267 42540 15404 -53215 -143524
3344 -143524 -127215 -2329 28889 3623 14487 12755 90149 5797 14294 46579 48040 -15717
3332 -15717 -105954 -66243 3486 24360 88913 68246 13906 -26226 8245 5568 -89213 -265033
3320 -265033 -247196 -104919 -77642 -112795 -151162 -78050 -43472 -117584 -129947 -52758 78212
3309 78212 142177 89554 -46878 -26925 58715 49090 65767 -11252 -94944 -100902 -127777 -81621
3297 -81621 -22100 94104 173947 231752 129961 -16248 -103483 -128215 -31193 27852 85218
3286 85218 141876 108601 160845 205738 81670 -29339 -21517 167472 282896 171430 68789
3275 68789 -14928 -134335 -178070 -140452 -196253 -163221 -107303 -129444 -106006 -67774 -110376 -30794
3263 -30794 59077 170576 110152 84279 66942 104798 31643 -76223 -12356 87189 106306
3252 106306 25249 -26668 -15966 18402 -75304 -74028 68437 161302 59979 -67168 -28957
3241 -28957 -48685 -95226 -152948 -43987 44444 30882 74403 97170 21641 79167 163733 79832
3229 79832 -107427 -119044 -37337 -118815 -136951 -157966 -128174 -77666 -80488 10348 64810 -38836
3217 -38836 -21729 53953 133589 27285 -31606 -5584 28607 53432 -43685 -13258 96648
3206 96648 73508 58187 59203 42271 -37393 -166329 -221254 -178951 -195506 -101468 -11805 100545
3194 100545 94650 -14815 63378 150399 174972 118163 77269 95879 62221 58771 -11977 80246
3182 80246 141132 188389 132806 36128 -5616 -36076 53575 3581 -62462 -14318 88597 -33980
3170 -33980 -129284 -7404 63837 -6672 -44129 4632 85387 67254 -100867 -198703 -123924
3159 -123924 -115885 463 140999 121505 63044 87739 -3275 22018 138088 21675 25786
3148 25786 155200 106601 124435 150133 26350 -70178 -93336 68091 57443 -35476 8309
3137 8309 47692 8554 10818 -45247 -90599 -38077 -21347 8676 88110 168629 177325 167744 187218
3124 187218 193638 82809 59345 53466 65261 54668 -18141 -34560 -90938 -19496 4147 -52356
3112 -52356 12446 95564 -2978 -21538 -104594 -114432 16626 -36612 -81760 -62227 -38305 -37956
3100 -37956 -62447 -127482 1799 -83148 -232032 -278426 -303320 -392575 -366675 -238401 -136102
3089 -136102 -62227 -11033 -15131 -158983 -160023 -169065 -181000 -141952 -124848 -90540 -977 111233
3077 111233 177748 149453 -11060 -48442 14284 26955 5873 -95663 -83321 -401 -92404
3066 -92404 -151044 -98533 -61714 -90148 -54848 3295 -123379 -122749 -169325 -94169 -44271 -31478
3054 -31478 -57835 -102417 -186564 -179492 -82514 -42387 -56651 -57220 -52158 -44161 -160925 -244583 -209517
3041 -209517 -62956 18554 19319 -43013 -63743 -35680 -105044 -165965 -223891 -169991 -158934 -210307
3029 -210307 -137609 -7784 2529 71437 162834 116403 38096 28465 -38225 -64626 10751 80095
3017 80095 2128 -91984 -94419 -169899 -214037 -163151 80282 124152 153363 146255 82563 66374
3005 66374 -42216 -152798 -145977 -42110 20395 80857 86577 67478 64650 77862 -47566 -115568
2993 -115568 -87823 -104935 -145196 -25543 -13410 -57602 -100337 -61570 89968 163563 78952
2982 78952 -49062 -53364 -107596 -133946 -74569 -91681 -62838 23152 167033 143556 133963 113326
2970 113326 -47738 -126933 -83464 -7707 -20795 63371 61175 50011 -22493 -42382 -66709 -74723
2958 -74723 56590 57082 -91759 -35770 -28416 106465 140626 80464 -11677 -62972 -57373 32234
2946 32234 41401 -9405 -22541 -6908 9697 -70321 -160639 -9995 37898 -27408 -3137 -14957
2934 -14957 -985 -63746 -30543 -65549 -51023 -3715 36044 928 -91519 -221952 -68956
2923 -68956 71221 94516 134574 37768 -37444 -30704 15292 105461 132784 222141 172695 109034
2911 109034 167142 68744 83547 129903 191797 107588 100761 114948 106376 240331 95018 137361
2899 137361 264458 258722 113245 -2845 -61899 -174106 -159573 -137543 -124159 -95265 -100423
2888 -100423 -104713 30517 138834 124589 127066 195552 180476 149860 21986 -51931 -15281
2877 -15281 24581 -1512 -29078 -60565 -59402 -82560 -125393 -113036 -70671 16055 -37300 -154344
2865 -154344 -108966 -71123 -159180 -198781 -165750 -117493 -85733 47973 210884 108154 -161123
2854 -161123 -245064 -214257 -201322 -242379 -207261 -74200 -30800 -35672 -25607 -9543 79931 53247
2842 53247 -121462 -30213 -377 -171415 -242743 -101943 -33374 59676 80668 142482 77967
2831 77967 22443 -97852 -156423 -127711 -105137 -204542 -191712 -91169 -87375 -14283 -20462 -41787
2819 -41787 -54834 -126052 -107651 -42300 -88218 -80074 -121732 -89703 -37689 19995 115799 142257
2807 142257 85558 6333 44765 154435 148919 77835 24477 -15881 -128969 -126510 -98104 -162312
2795 -162312 -55488 58283 79838 76968 7823 -84688 -20863 103336 100276 31916 -10365
2784 -10365 39215 56149 15348 -26710 -10849 -71 -48087 -110014 -72735 -7539 28739 59557
2772 59557 83163 22227 114568 117443 53859 13592 59001 30657 -81500 -115912 -178836 -122324
2760 -122324 -7556 -53426 -53283 -85659 -110086 -45997 48118 7378 -139271 -292542 -293957 -100886
2748 -100886 -37236 -95626 -120240 -30474 -68262 -99978 -60067 -146432 -25874 49579 -17896
2737 -17896 -84354 -165127 -189948 -57188 70133 224872 69823 -121478 -212199 -235121 -207892
2726 -207892 -97961 -4136 -41133 -25147 -66463 -110672 -38916 -36038 -91099 -94730 -74872 -36834
2714 -36834 -2091 99932 171229 199501 141954 119282 104591 90437 183837 163081 113256 13546
2702 13546 -61207 -73362 63874 165634 47227 -33766 -19688 -82355 -12486 159516 200372
2691 200372 194874 226273 161205 -22368 -69033 -27832 -37291 -13986 56801 125965 35727 -55109
2679 -55109 -151397 -160252 -174605 -197644 -145025 -61571 -45872 -84066 -10612 42758 143042 84463
2667 84463 -36419 -133543 -88304 -146495 -279734 -312533 -211704 -47998 39427 -13074 -109241
2656 -109241 -105480 -202998 -184734 -121561 -72251 36354 90842 130171 105866 92726 42551 49195
2644 49195 38398 50032 150600 140255 34905 -28261 -108002 -71742 -56204 -68583 1046
2633 1046 50730 765 -33286 -35107 -157929 -245295 -220172 -25188 99013 42015 -30998 51109
2621 51109 89548 64032 -37065 -110665 -111770 -156977 -139341 -52114 23203 -13848 -27690 72137
2609 72137 134001 123947 41836 100840 41841 -135444 -250803 -277212 -294247 -303199 -209094 -120071
2597 -120071 -124460 -198960 -166978 -88836 3235 89819 22707 -33055 -93359 -79565 -80660 -86845
2585 -86845 -458 102525 101471 11869 38756 53134 49677 102722 55842 63869 54202 110555
2573 110555 129254 134682 115217 -27089 14853 148277 138704 154894 108042 28512 61375 84652
2561 84652 56839 109824 142945 142117 190827 218993 197402 168972 90212 40397 35385 -22699
2549 -22699 -16589 -51828 -292821 -314119 -210413 -93176 -8607 65514 103803 60845 21671
2538 21671 -27009 31860 107819 178837 137865 -20896 3546 -15207 47684 50932 -10035 14874
2526 14874 34406 102116 118727 26321 29831 21931 135305 216244 103230 130465 308786 184784
2514 184784 95602 -32040 -88859 -19957 -26601 -71810 27882 42200 92926 47784 92977 119366
2502 119366 79910 103405 96472 -5100 -23879 108921 145158 182273 159469 23164 -68717
2491 -68717 -80975 -113290 -92907 -120593 -124255 -45539 -6043 -34976 -104117 -57252 19863 19933 37478
2478 37478 152773 120639 -4120 -42963 -142922 -65291 -105092 -206376 -171314 -98301 -74979
2467 -74979 -163993 -88201 91453 16528 -41395 -102271 312 21983 68460 -17419 -95451
2456 -95451 -51640 10837 -28663 -111926 -142820 -146880 -170626 -244208 -276689 -205683 -73770 92464
2444 92464 164953 126283 -14247 -134057 -57602 17223 138647 155594 46156 -8554 -115967
2433 -115967 -132756 -91289 19376 3350 -112437 -108875 90755 -6916 -117642 -38857 -177191
2422 -177191 -282092 -100371 -50778 -46385 -80418 7669 145637 84464 -24532 4558 66867
2411 66867 61424 23213 59254 77284 73575 184529 59394 -2467 22135 34021 30054 5076
2399 5076 -78569 -73780 -39901 -156008 -85452 -98511 -103571 -50646 -24158 -19570 43431 24591
2387 24591 14337 119057 90842 -13669 -17374 -15033 46847 37768 40808 99255 93149 29114
2375 29114 -93368 -144743 -39880 -15947 96562 181335 123556 118451 91231 15225 7065 -90930
2363 -90930 44359 51884 -53591 -154155 -300300 -167241 -83553 -26196 -46967 -118342 -184230
2352 -184230 -127374 -83411 9617 18071 13811 55838 73935 36474 -84945 -132886 -90357 -48062
2340 -48062 -28772 8675 -24184 32235 95305 -72599 -191956 35055 121705 -4952 -79251
2329 -79251 -172613 -127314 93333 92507 117446 231491 144240 51251 -26945 -59189 -8959 27855
2317 27855 -67776 -52714 -36717 -120663 -199356 -255827 -184572 -124137 -38648 21106 60745 52446
2305 52446 17042 21606 27744 53930 83536 38891 939 -29857 -22897 -13623 61020 67765 97694
2292 97694 12701 40896 -19700 18085 40770 -46691 -102326 -48741 -53566 -8018 60495 130473
2280 130473 115651 102169 9655 67943 -15505 -17743 71923 175036 138005 -7763 11071
2269 11071 10859 -38385 -50850 -49372 -67358 -28447 -81164 -86320 -123702 -52381 -1545 -143426
2257 -143426 -200217 -210717 -26802 75833 38871 -12611 -11182 138756 255423 119862 206869
2246 206869 266469 201867 117850 84024 89687 -54677 -112370 -111981 -28337 14272 4608 -101856
2234 -101856 -99426 -96827 -204249 -168865 -52097 -138277 -243497 -165398 -88669 16041 37194
2223 37194 45626 103750 -13955 -94524 -51176 -102636 -62692 -75589 -115496 -41818 42175 -27856
2211 -27856 -116328 -59607 111570 190968 202470 112704 43774 81705 179013 90243 22658 -9537
2199 -9537 5659 -48622 16353 43051 180402 190824 86081 8430 -115320 -88564 -48854
2188 -48854 13859 70892 83241 -40839 -17600 23839 -11328 -103820 -60507 21304 53660 94150
2176 94150 56626 9591 44824 106143 74004 85978 124238 128805 41919 -12742 8597 161470
2164 161470 79866 44924 751 743 -20748 -23591 35881 34562 67535 99288 87523 28751 84949
2151 84949 156533 274 -4299 -5153 525 27245 879 -63047 -154176 -79876 -139952 -141644 -111033
2138 -111033 -134021 -147799 -154189 -130765 -130449 -90130 -85125 -23073 9150 -125693 -167804 -195276
2126 -195276 -57786 105208 84939 19014 98871 -14527 -59504 -3744 -92859 -132301 -51501
2115 -51501 -94511 -111132 -145933 -161853 -125576 -62518 -11552 25208 80174 61945 44474 100116
2103 100116 96523 57643 41717 2044 -61729 -127254 -102295 -10011 14272 -26813 -19366 4805
2091 4805 5929 29220 23669 59851 114507 129393 24052 -37964 -58234 -88890 -183641 -196315
2079 -196315 -64938 65977 99331 -35241 -6448 -14980 -34424 -85586 -173882 -133462 -1789
2068 -1789 71252 34031 34500 -28599 -85519 -34130 106648 10354 -155918 -204869 -140216 -113173
2056 -113173 -151199 -3526 62139 -34025 -96869 -40484 -84753 -42866 22035 54913 49481 87575
2044 87575 21897 -19578 -18393 -115329 -61334 45518 123602 183922 137452 125598 139671 148755
2032 148755 25254 -75691 -86338 27897 20500 68265 132061 -96240 -210804 -203570 -60079
2021 -60079 94154 73220 -58554 -138830 -158739 -118036 -58089 -69750 -196861 -202279 -138731
2010 -138731 -77545 -47405 -69789 -73443 -110604 -15021 32153 -47491 -140969 -69754 84634 158725
1998 158725 166583 126557 75641 102261 39713 -45485 -35748 -47329 -64759 42340 32616 -37087
1986 -37087 -88071 -73539 105983 222205 222487 148831 98979 115058 124813 157028 194638 152397
1974 152397 189421 122709 106699 116447 169098 86066 16746 -1507 74791 94867 139704 -12576
1962 -12576 -28099 73761 22462 42707 7449 5009 13308 4469 -4329 89778 116934 77198
1950 77198 57422 71494 163754 190124 81367 2739 27996 -4479 -38879 15894 -1045 50111
1938 50111 36686 95153 95816 124485 183548 33222 -102455 -64868 37021 56393 -15470 -115963
1926 -115963 -164600 -177016 -112266 -72095 -97910 -91035 -111506 3571 -2656 -1893 -16521 -15352
1914 -15352 -33647 -162438 -110472 -85932 -88146 -8208 19991 137437 153972 79471 -11786 -22898
1902 -22898 -13377 45169 82425 217780 209481 138165 18339 -25794 13371 100580 39189 148893
1890 148893 177531 40074 -62249 -56401 42132 67267 126219 45692 -108257 41602 164992
1879 164992 54775 -620 85936 -11459 38312 -21655 -11894 -109134 -171432 -92610 -6593 156385
1867 156385 235832 70520 4307 -114172 -146965 -62978 -19109 -43600 -52167 88688 62517
1856 62517 88416 147773 85709 137739 171166 -11281 -78797 62337 88403 98293 93041 75422
1844 75422 15062 4376 -40079 -64648 -67162 -84023 19291 66908 21028 3274 65846 158607
1832 158607 195562 58448 54367 26044 98672 215529 84095 -80330 -150839 -255562 -273450
1821 -273450 -222724 -93704 -38457 -37396 -49217 44790 74723 88550 64300 -27149 -172002
1810 -172002 -129601 -86478 39659 126231 123087 140338 131985 162159 122947 96895 40010 7168
1798 7168 11175 -51593 24289 99939 100807 -3241 76588 -40489 -216512 -273810 -279339 -214822
1786 -214822 -265407 -107254 91859 152214 107517 -127168 -155297 -179880 -84660 -9927 -105727
1775 -105727 -123954 -46487 65400 -62029 -115334 -179765 -184953 -32510 34862 127220 36472
1764 36472 26242 158569 144137 -5649 -25773 -25872 -51900 21765 40121 -19098 95112 18702
1752 18702 -28305 -61069 -41112 -55406 17071 235038 233514 83436 37414 1340 -11195 23016
1740 23016 -30867 -11132 67060 64972 137705 184377 140373 -20572 -148368 -257406 -264098 -128041
1728 -128041 -53669 -69124 74362 -23342 -131436 -59306 -64429 -62734 -98884 -67813 -32118 4095
1716 4095 55967 481 63108 20785 -88202 -21519 19980 -57228 -74301 -52694 -145817 -135912
1704 -135912 -56664 11682 -6188 -38881 -22281 50887 105160 201631 47623 -41348 23762
1693 23762 52220 44901 11204 -51441 88672 154740 8052 -39233 66056 137085 159944
1682 159944 77663 53906 -44153 -78003 -43429 -81063 -18325 109726 211408 295550 253194
1671 253194 180621 199867 303024 335305 268219 105803 181755 300272 243030 210178 192229
1660 192229 199926 251277 239799 177669 144375 218386 162691 130237 39888 67822 -9 16615
1648 16615 117835 139282 67178 91821 60993 57228 -8081 -148872 -13071 96675 193413
1637 193413 289046 151705 145960 168279 69063 161877 218325 111097 92750 58956 103802
1626 103802 21934 -13223 27632 -36575 -42030 58690 60385 14175 91606 46877 -75621 -173016
1614 -173016 -172623 -110855 -12992 -6530 -38189 -88507 -80631 -85996 1457 52035 144515 172839 103625
1601 103625 -52334 -122090 -203943 -245181 -166777 -149693 -38940 2857 62207 73749 -39828
1590 -39828 -35538 -9796 60725 85453 56548 66795 47833 -65481 -130772 -82990 -139908 -306404
1578 -306404 -337851 -246241 -170225 31233 131850 -104159 -231279 -213290 -123214 -7784 71258
1567 71258 101115 -1931 26780 5567 7481 110305 118808 166288 100216 33254 81664 28295
1555 28295 -65747 -77443 -123741 -61215 -39248 -50173 -23186 74120 171633 200713 108735 -564
1543 -564 88260 41672 15446 97138 -3767 -78743 -17464 77570 142535 68861 -66960 -55383
1531 -55383 78037 121640 17719 -79074 16837 136975 147776 100294 94533 -20936 -120752
1520 -120752 -205114 -112391 -62281 -21495 98691 122967 -1018 -42938 5620 182244 202062
1509 202062 97586 110497 162470 118872 4738 -140997 -98286 23021 27330 101516 85861
1498 85861 132985 144975 83735 119977 36776 78167 73500 71455 4947 -48758 -61723 -16892
1486 -16892 12342 30816 28197 -28610 -30388 152022 344128 350947 283866 223527 108893 -26442
1474 -26442 101887 55126 126041 84748 27058 -87289 -126918 -114351 -113916 -13659 -118649
1463 -118649 -99337 -41522 -57830 -35545 23066 84858 123026 210755 155377 119709 90185 53666
1451 53666 -31531 10447 114961 250334 270467 98216 -49714 -95370 -14335 42601 32261
1440 32261 43842 95493 10740 -90025 -123080 -78547 46343 3369 -27303 56612 8352
1429 8352 -184012 -203837 -61902 -12929 -55181 -37833 -11029 27794 -7407 130 20295 -5237
1417 -5237 -133734 -83772 41582 72958 -1855 -89346 -79274 -28843 -31171 -125717 -190320 -108526
1405 -108526 -25045 -57484 -42579 8326 62606 106946 54058 11919 89504 198942 143609
1394 143609 -45171 9132 50351 73205 111852 -9414 -48891 31128 6072 -204 -2628 79998
1382 79998 157218 221553 160901 193379 203204 157585 27401 -152287 -93634 -90754 -148682 -143075
1370 -143075 -47701 2315 -1978 24593 36712 35721 -114112 -127190 -50750 -174154 -97259 -51637
1358 -51637 -51879 -152769 -168760 -104962 -61525 35593 24310 -32993 116761 115286 107927 203710
1346 203710 210311 58074 -60799 127657 259305 299185 329975 245609 167296 204937 225891
1335 225891 155597 175747 221493 239165 294478 393179 373272 292376 178635 134726 21218
1324 21218 10032 12304 51741 -12107 -25939 -17960 70751 28118 113515 63621 -13438 -43015
1312 -43015 -69384 -55855 -74248 -3125 135832 268654 277201 204365 82163 107706 51045
1301 51045 37797 65758 -3973 -22221 -81953 -101089 18986 119197 29796 -57415 -114121
1290 -114121 -45494 -69766 -166454 -145493 -102850 -144581 -122350 -9756 97381 49907 9698
1279 9698 -30408 52126 29590 -32036 -80693 -46967 -26584 -92770 -36925 145064 197193 97609
1267 97609 117047 30886 -24438 48569 122101 194302 176496 41080 -21082 54744 184002
1256 184002 175640 39333 39742 -44285 -62507 -45989 -20377 38658 78201 168089 140022 143976
1244 143976 80785 133662 17696 -105744 -91695 -44808 19194 184408 236095 3039 -171811
1233 -171811 -140864 120603 307589 250768 160815 127443 52483 -19715 -34684 28407 -27506
1222 -27506 -57241 -105238 -45278 -73657 -78591 60821 58007 74727 168205 144503 -38140 -47964
1210 -47964 74004 118958 58983 -25374 -61485 -24758 37727 56269 118434 84703 57771 68096
1198 68096 190714 293887 226530 121806 52301 99442 55500 83757 132791 9485 -94866
1187 -94866 -56501 -33276 56317 179831 114095 -6182 -87601 37705 130757 35476 -92994
1176 -92994 -112479 11806 153069 189777 172770 121774 143948 164913 119585 25555 87752
1165 87752 64398 104810 7408 9372 9070 38924 85873 26957 26973 -19276 -398 95046 66717
1152 66717 -458 -60948 -47485 51632 39411 16675 188598 261388 98591 31337 -7471
1141 -7471 -46114 36638 89934 40138 38785 32396 36379 -78739 -114765 -57625 -122640 -9581
1129 -9581 99348 171387 199216 194362 82892 35711 40816 32010 77435 198187 318033 338638
1117 338638 253861 83953 -89746 -94653 -68020 -78799 -87378 -16904 5661 36884 44470 -3978
1105 -3978 9147 11826 158682 189954 137428 10940 4715 50646 85091 77071 86040 105435
1093 105435 70748 143854 163635 115368 53940 198902 300865 211747 143704 160238 163913
1082 163913 58644 99437 164890 43387 118851 86713 119818 780 -30184 -30601 8958
1071 8958 87136 124959 14547 -75590 -61552 -77649 -66686 77443 194449 116630 27089
1060 27089 49016 119976 75803 191424 144601 123585 193510 130943 47157 -76166 -72711 34046
1048 34046 43584 -78910 956 162599 165223 210768 134393 151029 60913 139268 188898 160336
1036 160336 185736 130754 49158 145171 100674 82962 172746 232828 306115 295842 164318
1025 164318 197164 271189 162904 154465 52498 -94659 -89224 -54317 62847 58792 78202
1014 78202 66792 121519 85462 147760 52573 16379 -15417 43037 128258 211559 234454 288719
1002 288719 204706 96694 25456 -119721 -183024 -130346 -142164 -74226 49597 161604 161510
991 161510 150767 117480 -49355 -51100 -17577 -93194 -20191 -8113 36468 32559 -2005 -25907
979 -25907 -111664 -16384 45797 148298 97287 73883 86219 115084 80963 42725 144488 278904
967 278904 223842 108652 -25657 -70110 57381 119865 6898 21201 -14949 -13803 90924
956 90924 120373 130161 19812 13637 1062 -27771 33257 -7048 30599 76546 124667 48744
944 48744 33810 -336 71552 71073 134933 134445 29257 -42498 5561 77515 227429 192398
932 192398 116492 122410 155128 112220 97199 181200 237092 224128 83459 125126 170282 155494
920 155494 231802 224252 124702 53360 -14108 32834 -40072 -82699 17396 70519 98809 119773
908 119773 -26594 36918 147771 69735 39216 96865 169274 175040 193873 221756 191549 137015
896 137015 173076 110572 -16706 -32515 -10005 84153 3141 -99511 -149070 -71699 -24336
885 -24336 -72981 -232720 -196597 -66641 12809 62390 -38167 -89793 -128115 -113117 17602
874 17602 16187 68926 46112 10609 36562 21032 27268 21468 -105485 -208880 -248182 -144015
862 -144015 -119766 -151158 -94461 -244098 -118319 -15313 15608 -4416 25128 46778 -22884
851 -22884 -152794 -125467 -160547 -103838 -6594 63104 144567 130339 -21835 -162237 3550
840 3550 157276 104463 85949 103908 36695 -111189 -44341 151694 257268 117008 -71646
829 -71646 -48332 -24156 -80868 -41863 -50611 4553 -23721 -26948 105264 142765 151201 178547
817 178547 85943 43770 -18818 -50717 -51977 9200 -88627 -190115 -89809 -93901 -122268 -80236
805 -80236 -10649 84349 45065 27089 106491 113821 15153 153487 181587 108205 224099 159123
793 159123 -34689 -56677 38824 54428 86052 143653 -6247 -47041 42649 15530 -2678
782 -2678 12786 108175 110531 75102 -34921 -138052 -72675 -24199 -55897 68401 185768 203628
$$ [...]
##END NTUPLES=NMR SPECTRUM
##END=
