##TITLE=Analysis number 324640
Compound Code cc 14711
Project Code adrs
Chemist Name stores
##JCAMPDX= 6.0         $$ Bruker NMR JCAMP-DX V2.0
##DATA TYPE= NMR SPECTRUM
##DATA CLASS= NTUPLES
##ORIGIN= Bruker BioSpin GmbH
##OWNER= nmr
$$ XWIN-NMR		Version 3.5
$$ Tue Nov 28 12:30:43 2006 GMT Standard Time (UT+0h)  MAYBRIDGE\nmr@NMR_250MHZ
##.OBSERVE FREQUENCY= 250.131544655141
##.OBSERVE NUCLEUS= ^1H
##.ACQUISITION MODE= SIMULTANEOUS (DQD)
##.ACQUISITION SCHEME= undefined
##.AVERAGES= 16
##.DIGITISER RES= 18
##SPECTROMETER/DATA SYSTEM= dpx250
##.PULSE SEQUENCE= zg30
##.SOLVENT NAME= CDCl3
##.SHIFT REFERENCE= (INTERNAL, CDCl3, 0, 16.459)
##AUDIT TRAIL= $$ (NUMBER, WHEN, WHO, WHERE, WHAT)
$$ ##TITLE= Audit trail, XWIN-NMR		Version 3.5
$$ ##JCAMPDX= 5.01
$$ ##ORIGIN= Bruker BioSpin GmbH
$$ ##OWNER= nmr
$$ C:\u/data/dgb/nmr/ADRS/1310/pdata/1/auditp.txt
$$ ##AUDIT TRAIL=  $$ (NUMBER, WHEN, WHO, WHERE, WHAT)
(   1,<2006-11-28 12:30:18.78 +000>,<MAYBRIDGE\nmr>,<NMR_250MHZ>,
      <created by zg, POWCHK disabled, PULCHK disabled
       configuration hash MD5:
       49 4B E0 1D 92 C2 6B 37 9F E6 65 BC 52 41 86 1D
       data hash MD5: 64K
       13 90 59 B0 32 E6 78 09 65 AB BB 0B DD 0D BC 36>)
(   2,<2006-11-28 12:30:31.95 +000>,<MAYBRIDGE\nmr>,<NMR_250MHZ>,
      <Start of raw data processing
       ef LB = 0.3 FT_mod = 6 PKNL = 1 SI = 32K 
       data hash MD5: 32K
       A4 54 A1 59 5D 5F 3F 05 68 AB 29 24 92 09 70 7D>)
(   3,<2006-11-28 12:30:34.33 +000>,<MAYBRIDGE\nmr>,<NMR_250MHZ>,
      <apk 
       data hash MD5: 32K
       C0 D9 48 68 AB F8 6E E4 E2 FB 6F 15 C4 B0 AB FC>)
(   4,<2006-11-28 12:30:35.08 +000>,<MAYBRIDGE\nmr>,<NMR_250MHZ>,
      <abs ABSG = 5 
       data hash MD5: 32K
       69 46 D0 2A 8F 56 20 E3 65 9F ED F0 75 0A 71 69>)
$$ ##END=
$$ 
$$ hash MD5
$$ 57 24 3E 5B 20 40 CF 30 22 8E F0 1D 67 54 B5 CA
##$RELAX= 
##$RELAX= 
##$RELAX= 
##$RELAX= 
##$RELAX= 
##$RELAX= 
##$RELAX= 
$$ Bruker specific parameters
$$ --------------------------
##$DU= <C:\u>
##$EXPNO= 1310
##$NAME= <ADRS>
##$PROCNO= 1
##$TYPE= <nmr>
##$USER= <dgb>
##$AMP= (0..31)
100 100 100 100 100 100 100 100 100 100 100 100 100 100 100 100 100 100 
100 100 100 100 100 100 100 100 100 100 100 100 100 100 
##$AQSEQ= 0
##$AQ_mod= 3
##$AUNM= <au_zg>
##$AUTOPOS= <35 >
##$BF1= 250.13
##$BF2= 250.13
##$BF3= 250.13
##$BF4= 250.13
##$BF5= 500.13
##$BF6= 500.13
##$BF7= 500.13
##$BF8= 500.13
##$BYTORDA= 1
##$CFDGTYP= 0
##$CFRGTYP= 5
##$CHEMSTR= <none>
##$CNST= (0..31)
1 1 145 1 1 1 1 1 1 1 1 1 1 1 1 1 1 1 1 1 1 1 1 1 1 1 1 1 1 1 1 1 
##$CPDPRG= <>
##$CPDPRG1= <>
##$CPDPRG2= <>
##$CPDPRG3= <>
##$CPDPRG4= <mlev>
##$CPDPRG5= <mlev>
##$CPDPRG6= <mlev>
##$CPDPRG7= <mlev>
##$CPDPRG8= <mlev>
##$CPDPRGB= <>
##$CPDPRGT= <>
##$D= (0..31)
0 1 0 0 0 0 0 0 0 0.06 0 0 0 0 0 0 0.0002 0 0 0 0 0 0 0 0 0 0 0 0 0 0 
0 
##$DATE= 1164717017
##$DBL= (0..7)
120 120 120 120 120 120 120 120 
##$DBP= (0..7)
150 150 150 150 150 150 150 150 
##$DBP07= 0
##$DBPNAM0= <>
##$DBPNAM1= <>
##$DBPNAM2= <>
$$ [...]
##$SUBNAM7= <"">
##$SUBNAM8= <"">
##$SUBNAM9= <"">
##$SW= 20.6930455092707
##$SWIBOX= (0..15)
0 0 3 0 0 0 0 0 0 0 0 0 0 0 0 0 
##$SW_h= 5175.983436853
##$TD= 65536
##$TD0= 1
##$TE= 294.16
##$TE2= 300
##$TE3= 300
##$TEG= 300
##$TL= (0..7)
0 120 120 120 120 120 120 120 
##$TP= (0..7)
150 150 150 150 150 150 150 150 
##$TP07= 0
##$TPNAME0= <>
##$TPNAME1= <>
##$TPNAME2= <>
##$TPNAME3= <>
##$TPNAME4= <>
##$TPNAME5= <>
##$TPNAME6= <>
##$TPNAME7= <>
##$TPOAL= (0..7)
0.5 0.5 0.5 0.5 0.5 0.5 0.5 0.5 
##$TPOFFS= (0..7)
0 0 0 0 0 0 0 0 
##$TUNHIN= 0
##$TUNHOUT= 0
##$TUNXOUT= 0
##$USERA1= <user>
##$USERA2= <user>
##$USERA3= <user>
##$USERA4= <user>
##$USERA5= <user>
##$V9= 5
##$VALIST= <valist>
##$VCLIST= <CCCCCCCCCCCCCCC>
##$VD= 0
##$VDLIST= <DDDDDDDDDDDDDDD>
##$VPLIST= <PPPPPPPPPPPPPPP>
##$VTLIST= <TTTTTTTTTTTTTTT>
##$WBST= 1024
##$WBSW= 4
##$XGAIN= (0..3)
0 0 0 0 
##$XL= 0
##$YL= 0
##$YMAX_a= 517201
##$YMIN_a= -489145
##$ZGOPTNS= <>
##$ZL1= 120
##$ZL2= 120
##$ZL3= 120
##$ZL4= 120
##$ABSF1= 16.45902
##$ABSF2= -4.234152
##$ABSG= 5
##$ABSL= 3
##$ALPHA= 0
##$AQORDER= 0
##$ASSFAC= 0
##$ASSFACI= 0
##$ASSFACX= 0
##$ASSWID= 0
##$AUNMP= <proc_1d>
##$AZFE= 0.1
##$AZFW= 0.1
##$BCFW= 0
##$BC_mod= 0
##$BYTORDP= 0
##$COROFFS= 0
##$CY= 12.5
##$DATMOD= 1
##$DC= 0
##$DFILT= <>
##$DTYPP= 0
##$F1P= 14.0000005364418
##$F2P= -0.99999901652339
##$FCOR= 0.5
##$FTSIZE= 32768
##$FT_mod= 6
##$GAMMA= 0
##$GB= 0
##$INTBC= 1
##$INTSCL= 1
##$ISEN= 128
##$LB= 0.3
##$LEV0= 0
##$LPBIN= 0
##$MAXI= 10000
##$MC2= 0
##$MEAN= 0
##$ME_mod= 0
##$MI= 0
##$NCOEF= 0
##$NC_proc= -3
##$NLEV= 6
##$NOISF1= 0
##$NOISF2= 0
##$NSP= 0
##$NTH_PI= 0
##$NZP= 0
##$OFFSET= 16.45902
##$PC= 1
##$PHC0= 219.2746
##$PHC1= 10.27126
##$PH_mod= 1
##$PKNL= yes
##$PPARMOD= 0
##$PSCAL= 4
##$PSIGN= 0
##$REVERSE= no
##$SF= 250.130015751154
##$SI= 32768
##$SIGF1= 0
##$SIGF2= 0
##$SINO= 400
##$SIOLD= 32768
##$SREGLST= <1H.CDCl3>
##$SSB= 0
##$STSI= 32768
##$STSR= 0
##$SW_p= 5175.98343685301
##$SYMM= 0
##$S_DEV= 0
##$TDeff= 65536
##$TDoff= 0
##$TI= <Analysis number 999999
Compound Code 99
Book Reference 9
Project Code 9>
##$TILT= no
##$TM1= 0
##$TM2= 0
##$TOPLEV= 0
##$USERP1= <user>
##$USERP2= <user>
##$USERP3= <user>
##$USERP4= <user>
##$USERP5= <user>
##$WDW= 1
##$XDIM= 32768
##$YMAX_p= 568285627
##$YMIN_p= -97505
$$ End of Bruker specific parameters
$$ ---------------------------------
##NTUPLES= NMR SPECTRUM
##VAR_NAME=  FREQUENCY,     SPECTRUM/REAL,   SPECTRUM/IMAG
##SYMBOL=    X,             R,               I
##VAR_TYPE=  INDEPENDENT,   DEPENDENT,       DEPENDENT
##VAR_FORM=  AFFN,          ASDF,            ASDF
##VAR_DIM=   32768,         32768,           32768
##UNITS=     HZ,            ARBITRARY UNITS, ARBITRARY UNITS
##FACTOR=    0.157963299565203, 1,           1
##FIRST=     4116.89508558448, 0,            0
##LAST=      -1059.08835126854, 0,           0
##MIN=       -1059.08835126854, -97505,      0
##MAX=       4116.89508558448, 568285627,    0
$$ Real data points
##PAGE= N=1
##DATA TABLE= (X++(R..R)), XYDATA
$$ [...]
16488D816o07j5548q629J2228L552q965Q87J864q53J4797k314j4613j797n584
16474b0766k426J1309J4780J765j0458J4501M645l00P918p851o979j190J1826
16461A6774o439p372O878P588R204M488J022m148q475K11n171Q759p672j7490
16447a843o715o929K333M793J0246k1134k095M359L257Q559K246q46P932n088
16433i25p966p684J99K507M315J529p450P313R387j1762j986m541q826p724K245
16418c1369J9670k102R534r24n140N838J0440j3394l419O808Q180L17m578j6038
16404a6177j3326m534L477P094K486k739N179k832j966o54J2484O020N740J009
16390A261j663m298M162q88J0943k587O652J716j101j2697j2849k269M641J2494
$$ plain form
16488 4816 4209 -11339 -19968 -7740 -4188 -13153 -12266 -10402 -11255 3542 1228 -13385 -15182 -20766
16474 -20766 -23192 -11883 2897 4662 -5796 8705 13350 13050 20968 13117 6138 4948 16774
16461 16774 10335 2963 9841 17429 26633 31121 32143 27995 19520 19731 14560 23319 15647 -1843
16447 -1843 -8558 -15487 -13154 -8361 1885 -19249 -21344 -16985 -13728 -5169 -2923 -3769 4163 -925
16433 -925 -8891 -16575 -16376 -13869 -9554 -8025 -15475 -8162 1225 -10537 -12523 -17064 -25890 -33614 -31369
16418 -31369 -11699 -13801 -4267 -5191 -10331 -4493 5947 -7447 -10866 -4058 4122 4439 -139 -16177
16404 -16177 -29503 -34037 -30560 -23466 -20980 -23719 -18540 -21372 -23338 -23992 -11508 -5488 252 1261
16390 1261 -402 -4700 -538 -1426 9517 6930 13582 15298 14197 1500 -11349 -13618 -8977 3517
16376C517n955m973j076J1775P138j0971O445l52m131L594j5843p349j0854j1327
16362d0362J1582J8315P854o394P487M941k400Q969K019j1630m367Q11Q293P941
16348A3059k521m563J790P15j2365o784J0909Q649j435k385l468m530n642l113
16334a1684j1617k418L782J2718M214Q70q255J0134K2418o063j4908j1942O626
16321f125J1765M071q766r496L420N663L136p591M244J760O337P251K746J876
16307B0291o653j4844q244r6P444K734L68n74K625K502M016J4166p89j0926n532
16292F488o605j6757r457R015K1457n616j0462J0657J1747n136K48n534j2343
16279a2298N720Q816K0227l765l312k798o751P461p359j3329Q36K736j1968m499
$$ plain form
16376 3517 -2438 -7411 -8487 3288 10426 -545 5900 5548 1417 5011 -10832 -18181 -29035 -40362
16362 -40362 -28780 -10465 -2611 -9005 -1518 3423 1023 9992 12011 381 -3986 -3175 5118 13059
16348 13059 10538 5975 7765 8480 -3885 -10669 240 8889 7454 5069 1601 -2929 -8571 -11684
16334 -11684 -23301 -25719 -21937 -9219 -5005 -4135 -12390 -2256 20162 14099 -809 -12751 -6125
16321 -6125 5640 9711 945 -8551 -5131 532 3668 -3923 321 2081 8418 15669 18415 20291
16307 20291 13638 -1206 -9450 -9546 -2102 632 1000 426 3051 5553 9569 23735 22946 12020 6488
16292 6488 -117 -16874 -26331 -17316 4141 -1475 -11937 -1280 10467 5331 5579 45 -12298
16279 -12298 -6578 2238 22465 18700 15388 12590 5839 13300 5941 -7388 -6552 -3816 -15784 -20283
16265b0283L49o508J4090P550n847J844N80r977M405J1231P371j2158J046l611
16251i918J1479O252L915N364J752k637j419M00o652p834P567J3791N898j4731
16237A3227j6383K189J605j4116j3992l414M037J2610P00p637k938L124J6893
16224d095J3598p324O58K3422J150q663j6320o637k014q906k528J2071k879r88
16210i455l454r794M326k25k481N727M760L944K878j52m992r05R663K583O992
16195I415j0360J0957J747r01m72O683l753J313p78K568J4836n917m373k289k1200
16180b524q6L960L353k022r239L333O289Q303r80o723P958j852r606R364p220
16165B308j2330K530K88j979J7256O850M849j3607j9314n656J0503k132n799J1199
$$ plain form
16265 -20283 -19934 -26442 -12352 -4802 -10649 -8805 -8225 -18202 -13797 -2566 4805 -7353 -6307 -9918
16251 -9918 1561 7813 11728 17092 18844 16207 14788 15188 8536 702 8269 22060 27958 13227
16237 13227 -3156 -967 638 -13478 -27470 -30884 -26847 -14237 -13537 -21174 -24112 -20988 -4095
16224 -4095 9503 2179 2837 26259 27409 18746 2426 -4211 -6225 -15131 -17659 -5588 -8467 -9455
16210 -9455 -12909 -22703 -18377 -18602 -21083 -15356 -10596 -6652 -3774 -3926 -8918 -9823 -160 2423 9415
16195 9415 -945 10012 11759 10858 10386 17069 13316 14629 13851 16419 31255 25338 20965 18676 -2524
16180 -2524 -2610 1350 4703 2681 -6558 -3225 3064 11367 10387 3664 11622 9770 164 9528 2308
16165 2308 -10022 -7492 -7204 -9183 8073 14923 19772 6165 -13149 -18805 -8302 -10434 -16233 -5034
16151e034k220m379j175L012J481P594O361n212j2339J704P270J112l117m328
16137i270J0296n659o143j644l377l799q116M339M872N283J6497m457k1881J571
16123b1488q835L549l869m867O820J8006P103J1343j280j3236p552p074K736k593
16109b1237P667P996R400p496j1789J2485R979o36n891k017j0311n487J1544o873
16095a2666j614n299o301N231P543R601P811N664p279o240j832N179P645m556
16081B887j4646l270M842m908J2243P331R233o316L485L363l773q314q168O159
16067A48O977L663L068o165n240M344l784q904M579m351p760M864J1719j467J4357
16052A6048m111j1338M69o424J557l115l878J4533n425j9867N791Q102P634P881
$$ plain form
16151 -5034 -7254 -11633 -12808 -9796 -8315 -721 5640 428 -11911 -10207 -2937 -1825 -4942 -9270
16137 -9270 1026 -4633 -10776 -12420 -15797 -19596 -27712 -23373 -18501 -13218 3279 -1178 -23059 -21488
16123 -21488 -30323 -26774 -30643 -35510 -28690 -10684 -3581 7762 6482 -6754 -14306 -21380 -18644 -21237
16109 -21237 -13570 -5574 3826 -3670 -15459 -2974 7005 6369 478 -1539 -11850 -17337 -5793 -12666
16095 -12666 -14280 -19579 -25880 -20649 -13106 -3505 4306 9970 2691 -3549 -5381 -202 7443 2887
16081 2887 -11759 -15029 -10187 -15095 -2852 4479 13712 7396 10881 14244 10471 2157 -6011 148
16067 148 7125 10788 13856 7691 2451 6795 3011 -5893 -1314 -5665 -13425 -8561 3158 1691 16048
16052 16048 11937 599 1068 -5356 -3799 -6914 -10792 3741 -1684 -21551 -15760 -7658 -24 7857
16038G857k005O907q73L731o161j1351M975J0277j5224r768p524m627J2205k831
16024a4412j6482J1139J3603K94J335J1402J671M540k388r517N732n042N046Q065
16010A4986o004o133L769R071M610M214l626j0602j3724L919J476K376N824J3391
15996B3547M459l203q181j2093m532J0426K853j631M015p779J2636M78J512r571
15982A2936j3377J0646l086q471j631l565j1924p548J1469J0420L820n718j1145
15969a7174m093P59j519N78K103m863J0830J6147L656m110j776J0293J4208R707
15955C4746j5771k4413J442J4151J794J993k148m355l286j2433M452O247n995
15942c576j452p702k725J0684J7m696L866Q671L366p4j27k429L856O449P452n180
$$ plain form
16038 7857 5852 12759 11886 15617 9456 -1895 3080 13357 -1867 -11635 -19159 -23786 -11581 -14412
16024 -14412 -30894 -19755 -6152 -5858 -4523 6879 8550 13090 10702 1185 6917 1875 6921 14986
16010 14986 8982 2849 6618 15689 20299 24513 20887 10285 -3439 480 1956 4332 10156 23547
15996 23547 28006 24803 16622 4529 -3 10423 13276 11645 15660 7881 20517 20995 22507 12936
15982 12936 -441 10205 7119 -1352 -2983 -6548 -18472 -26020 -14551 -4131 -311 -6029 -17174
15969 -17174 -21267 -20508 -22027 -21449 -19346 -24209 -13379 2768 6424 2314 538 10831 25039 34746
15955 34746 18975 -5438 -3996 10155 11949 13942 11794 7439 4153 -8280 -3828 2419 -3576
15942 -3576 -5028 -12730 -15455 -4771 -4754 -9450 -5584 3087 6453 6379 6252 3823 7679 14128 21580 16400
15926A6400k505j0963J48k21q973j6294j657K0554N242l804J295M390n655k645
15912d688R617n310j9183K356M143P060l590J580J4960p85j4314k971o19p940
15898a9684m459M472Q818P588j101o287r418O546L370P862q641j2436m888J2915
15884a5343J6506O486Q396M637q22l025p565j2097j3177o78M533m943k330j241
15870b0663J2163K0960L242p574p79k760p964o499P610m359N295J1574J0445k190
15856A8501j0357L447J9058J1077p9m829j3158k1988j7042M456o151p157K3647
15843e75Q765K866O196O680k0806j248M813j2492L590L358K409q461l558R876
15829A413J7292J026p642j778N341n463n667M246j179m228p344l539j412J5515
$$ plain form
15926 16400 13895 2932 3080 2859 -6114 -22408 -24065 -3511 1731 -2073 -778 3612 -2043 -4688
15912 -4688 4929 -381 -19564 -17208 -13065 -6005 -9595 -8015 6945 6160 -8154 -11125 -11744 -19684
15898 -19684 -24143 -19671 -10853 -3265 -4366 -10653 -20071 -13525 -10155 -2293 -10934 -23370 -28258 -15343
15884 -15343 1163 7649 16045 20682 19860 16835 9270 -2827 -16004 -16682 -12149 -17092 -19422 -20663
15870 -20663 -8500 12460 15702 8128 7349 4589 -3375 -9874 -2264 -6623 -1328 10246 20691 18501
15856 18501 8144 11591 30649 41726 41647 36818 23660 1672 -15370 -10914 -17065 -24222 -575
15843 -575 8190 11056 17252 23932 3126 1878 6691 -5801 -2211 1147 3556 -4905 -8463 1413
15829 1413 18705 19731 12089 10311 15652 10189 4522 8768 7589 3361 -3983 -7522 -8934 6581
15815F581K935k414J8077P00r124k1389j1589J6862J2110O504l540n941L342j4621
15801a507L373J4380l784l973k434j7308p376L247P318L589P961k659k560r13
15787b646o692J2262N221J606L535m345r291M811J0270J672o349J090Q976R46
15773B1066q368N791P669J9046K892j2177L689j904M996N809O228K6099K8787
15760A09623J8337J5240J8907L5806N4805L4801K7511L5585L3367J0724J0417
15749D05123K265j1970k8854k4184k4778k5756l3513m2168l1364l7079r832j6400
15737A21490k3043k8982k0142r532j897Q308L963J556q50k0351q800o320m837
15724A0563J0363l348j5023L272P772q541k104M055l718m171N764l130P94p163
$$ plain form
15815 6581 9516 7102 25179 25879 16755 -4634 -16223 639 12749 19253 15713 9772 13114 -1507
15801 -1507 1866 16246 12462 8489 6055 -11253 -18629 -15382 -8064 -4475 3486 827 -1733 -2646
15787 -2646 -9338 2924 8145 9751 13286 8941 -350 4461 14731 16403 10054 11144 20120 21066
15773 21066 12698 18489 26158 45204 48096 35919 39608 37704 42700 48509 54737 80836 109623
15760 109623 127960 143200 162107 197913 252718 287519 315030 350615 383982 394706 405123
15749 405123 407388 395418 366564 342380 317602 291846 258333 216165 184801 147722 137890 121490
15737 121490 98447 69465 49323 39791 37894 46202 50165 51721 50871 30520 21720 15400 10563
15724 10563 20926 17578 2555 5827 13599 5058 2954 7009 3291 -880 4884 1754 2548 -4615
15710d615K788J0616K019J288L874l52J936l082J1355k053k1161j1144R418J3168
15696A4055K198l371Q866j0199j1350q48J3263J594j2242j416N222m38j5858o662
15682a7186J2752J0729P67R72J3330k287j1439O96j2716q593J95l481p989J3830
15668a0420L342J1511l30M87L271K365j3845J0605j1758r743M807M533m40J2789
15654G174O264k599L446K34m967j2524R746m782K454Q657p458j1348J733Q181
15640D211j601j953k528r061O747O468k427Q322k188k2261K624O093J4869o909
15626D06L009J687r159P122J2788J319m48n541L720Q08K981k67L00n454j0215
15611C056p356J588K153j197J643m694L660p687j6064j3267J5669K1040J0790
$$ plain form
15710 -4615 -1827 8789 10808 12096 15970 15618 17554 14472 25827 23774 2613 -8531 887 14055
15696 14055 16253 12882 21748 11549 199 -649 12614 14208 1966 550 5772 5334 -10524 -17186
15682 -17186 -4434 6295 7062 8034 21364 19077 7638 8334 -4382 -12975 -12780 -16261 -24250 -10420
15668 -10420 -7078 4433 4103 4590 7861 10226 -3619 6986 -4772 -14515 -9708 -5175 -5615 7174
15654 7174 13438 10839 14285 14519 9552 -2972 6774 1992 4446 13103 5645 -5703 -3970 4211
15640 4211 2610 657 -1871 -10932 -4185 2283 -144 8178 5990 -16271 -13647 -7554 7315 406
15626 406 3415 5102 -4057 3065 15853 17172 16724 11183 14903 15711 18692 18425 18725 13271 3056
15611 3056 -4300 -2712 -559 -1756 -113 -4807 -1147 -8834 -24898 -38165 -22496 -1456 9334
15598I334n55N129m245O871K376j4459o812Q96M465J1057L987l922j134n207J0076
15583A7857m316N695m423n629k047r364k123k160L476J058M459p971n205K109
15569h584k249J138J0582J4468J6784N535m709j7563k3755P028Q10l114l460n488
15555a2577p061J6311N722J0161k113j5159O081j885k536l456j1690J235J813
15542a5154J9709l138p558K919l081L187K2958O991O073n543j3336K253p323j136
15528G821R940n017K175Q101J429j4130j2431n670n304k265R229J8400L616k2705
15514f811o145Q040R49m30K7365k029j3628J61r65J052J1279q590p471Q527k592
15499H712p397J926P402r2m524n84j2413R94N554K278j2515l606Q436K200o060
$$ plain form
15598 9334 8779 13908 9663 16534 18910 4451 -2361 -1465 3000 14057 18044 14122 12988 7781 17857
15583 17857 13541 19236 14813 9184 7137 -2227 -4350 -6510 -3034 -1976 2483 -5488 -10693 -8584
15569 -8584 -10833 -9695 887 15355 32139 37674 32965 15402 -8353 -1325 -515 -3629 -7089 -12577
15555 -12577 -19638 -3327 2395 12556 10443 -4716 1365 -520 -3056 -6512 -18202 -16967 -15154
15542 -15154 4555 1417 -6141 -3222 -6303 -3116 19842 26833 32906 27363 14027 16280 8957 7821
15528 7821 17761 12744 14919 23020 24449 10319 -2112 -7782 -13086 -15351 -6122 12278 15894 -6811
15514 -6811 -12956 -4916 -3967 -4397 22968 20939 7311 7472 6507 7559 18838 10248 2777 11304 8712
15499 8712 1315 3241 10643 10551 6027 5443 -6970 -5976 -422 1856 -10659 -14265 -5829 -3629 -9689
15484i689N98P515J6842r271q86J8092L863m431q087q175r8K653p588M198L487
15469I023p362j190o49J5448J0856l58j8211n887L777J0007R311k594m582j1734
15455E855q485n200m718p620N542M073J3871m608j3591m628J2072K311j956N229
15441a853P074l019j8045Q22P464M699K934n304j0838R015k926p489k193J1213
15427h446P697o185p635k489L209J2631j010O55J1189j1900o964R117N591p679
15413b219J0584J3994Q13m628q512j9862j4199o94Q782N236J9631N38k19j4962
15399e717p507Q824K659J3606Q677O009l805j6404N518n332j3146L722O510J836
15385E450K369M608r076L687J894p878l223r120m841k556K951K495J6413M447
$$ plain form
15484 -9689 -9091 -1576 15266 5995 5109 23201 27064 22633 14546 6371 6273 8926 1338 5536 9023
15469 9023 1661 471 -178 15270 26126 25768 7557 1670 5447 15454 24765 22171 17589 5855
15455 5855 -2630 -7830 -12548 -20168 -14626 -10553 3318 -1290 -14881 -19509 -7437 -5126 -7082 -1853
15441 -1853 5221 2202 -15843 -15021 -7557 -2858 76 -5228 -16066 -7051 -9977 -17466 -19659 -8446
15427 -8446 -749 -6934 -14569 -17058 -13849 -1218 -2228 -1573 9616 -2284 -9248 -131 5460 -2219
15413 -2219 8365 22359 23172 18544 10032 -9830 -24029 -24723 -15941 -10705 8926 9464 9245 -5717
15399 -5717 -13224 -4400 -1741 11865 20542 26551 22746 6342 11860 6528 -6618 -2896 3614 5450
15385 5450 7819 12427 3351 7038 8932 1054 -2169 -11289 -16130 -18686 -15735 -13240 3173 7620
15371G620R16J712J0850k031o698j6837L520J2143N749m143q985j0399j0852L774
15357a3661M284q595N426J3450J215j3054N381J4289Q2j4291m038J0896N369M551
15343A1304p370l688j810j1279M5M660M475m387o792j699O382J3049K760p837
15329b187o100L19Q253L217J825k02Q289n060l272J4843l185J212k132k1718j4663
15314b0561J3106J2246l600r71o80n712n205J3897N000m144n900N543J087j1470
15300g364r289R657J185J325J532N85J4642r911n582J1716L740M81Q426j890l647
15285A5606J979O557q182P136O847o376l228p501j4100M923k289J0378l139J4
15271H625k431K606J2603j3488P537P478K957r913j3329o368m95K579Q964N030
$$ plain form
15371 7620 8536 10248 21098 19067 12369 -4468 -948 11195 16944 12801 3816 -6583 -17435 -13661
15357 -13661 -9377 -17972 -12546 904 2119 -10935 -5554 8735 8817 -5474 -9512 1384 6753 11304
15343 11304 3934 246 -1564 -12843 -12798 -8138 -3663 -8050 -14842 -16541 -10159 2890 5650 -2187
15329 -2187 -8287 -7968 285 3502 5327 5125 13414 8354 5082 19925 16740 17952 15820 -5898 -20561
15314 -20561 -7455 4791 1191 220 -460 -6172 -11377 2520 7520 3376 -2524 3019 4106 -7364
15300 -7364 -16653 -6996 -5811 -4486 -2954 -2369 12273 2362 -3220 8496 12236 12717 21143 19253 15606
15285 15606 17585 24142 15960 23096 29943 23567 20339 12838 -1262 3661 1372 11750 8611 8625
15271 8625 6194 8800 21403 7915 15452 22930 25887 15974 2645 -3723 -4218 -1639 7325 12355
15257A2355m659M4p127j4168r924J6767P807n370k199m552M834m83M165J0325
15243G815L234N17Q379R802P31j0556n841m346J629K158j50l229j978J8014M080
15228C0259m730n179N828q110j2282q845j549O132K648j907m495J2406j419j8241
15214i484j1022P95J2093R79J3026O433r036J163J328j0967j570K710Q887O786
15200A2121L78j3189k069N746J1075M372j0360l980Q964L440o543j5781L3L185
15186b608N066r175j1822P244p61o350j7046m550O709J4537O680P728M918j536
15172i66k517R105R698p831j261M384K994r688p653j054l58L676L824p012N448
15157G89J5604q879L761J089j9785j2919R366J0414Q162J7j1508j0854M921M214
$$ plain form
15257 12355 7696 7740 613 -13555 -23479 -6712 1095 -4275 -6474 -11026 -6192 -6675 -2510 7815
15243 7815 11049 11566 19945 29747 30478 19922 14081 9735 11364 13522 13372 10143 8165 26179 30259
15228 30259 25529 20350 26178 18068 5786 -3059 -4608 1524 4172 2265 -2230 10176 8757 -9484
15214 -9484 -20506 -19711 -7618 -6639 6387 12820 3784 4947 6275 -4692 -6262 -3552 5335 12121
15200 12121 12499 -690 -2759 2987 14062 18434 8074 4094 13058 16498 9955 -5826 -5793 -2608
15186 -2608 2458 -6717 -18539 -11295 -12056 -18406 -35452 -40002 -33293 -18756 -12076 -4348 570 -966
15172 -966 -3483 5622 15320 7489 6228 10612 13606 3918 -3735 -4789 -5147 -1471 2353 -4659 789
15157 789 16393 7514 11275 12364 -7421 -20340 -10974 -560 7602 7619 -3889 -14743 -9822 -5608
15143e608J6048L825J152k587m49l148J2262j002p456r393J634J026O385P795
15129B0484L183k540Q863J2428j227q686j5130q665o854p933o530m285J0377J4723
15115H208J4266m357K502j760n609j1910Q445K72j841k396n782n350r973P46J6743
15100B204J1395M072l217n47l73j0945q393m245j1641n209L681J5653J4090K73
15086F798N606k2433p160J0781l878J664R911J3432J443q741M993K847l353j4442
15072b532r20J7910J2636j2205q832O654m787n907J1013O354j770J137M582Q979
15058C2312j6247j3082l361K945k04J953N783k839j4121m266J2275J2491q534
15045E105J00r373q787M993M905N454P920Q922j1742j298M948o788O75J092N113
$$ plain form
15143 -5608 10440 14265 15417 12830 12381 9233 21495 20493 13037 3644 5278 6304 12689 20484
15129 20484 23667 21127 29990 42418 41191 32505 17375 8710 1856 -6077 -12607 -16892 -6515 8208
15115 8208 22474 18117 20619 18859 13250 1340 9785 10057 8216 5820 38 -5312 -15285 -14539 2204
15100 2204 13599 17671 14454 13907 13534 2589 -5804 -10049 -21690 -26899 -23218 -7565 6525 6798
15086 6798 12404 -10029 -17189 -6408 -10286 -8622 1289 14721 16164 7423 12416 15263 11910 -2532
15072 -2532 -3452 14458 27094 14889 6057 12711 7924 2017 13030 19384 17614 18751 23333 32312
15058 32312 16065 2983 -378 2567 2363 4316 10099 7260 -6861 -11127 1148 13639 5105
15045 5105 5205 -4168 -12955 -7962 -3057 2397 10317 19239 7497 6199 11147 4359 5034 6126 11239
15030A1239L52j5923j0093l26R822K0192k470j3870R514N345O021J0246n274j525
15016B3250q425o487n557L464M712J167j2454p070P299M042M486p708q427J7366
15002I658K3346j634R042n732o370q148j8081j7670Q78p942R267R632n223M116
14988d861l50K1015J3732J8149K6117Q504j1093j1689r757k2384p825K51R287
14975B9096j535r925j0764m539j338K727N893j1083J556M759L748j956n169k026
14961e56O038J0592j0024l559M587l9L068k979q38n152J916J294R787j1844O26
14946B917N657j4455r392J1161o764p132M578M499P042J4684O913m070r975k491
14932C172p857l893P497J4044J1906r270J24M445R962J761j4011k2318j0321r55
$$ plain form
15030 11239 11591 -4332 -14425 -14751 -4929 15263 12793 -1077 8437 13782 19803 30049 24775 23250
15016 23250 14825 8338 2781 6245 10957 12124 -330 -7400 -101 3941 8427 719 -7708 9658
15002 9658 33004 31370 40412 34680 28310 20162 2081 -15589 -14711 -22653 -13386 -3754 -8977 -4861
14988 -4861 -5211 15804 29536 47685 73802 82306 71213 59524 49767 27383 19558 19809 29096
14975 29096 27561 17636 6872 2333 995 3722 9615 -1468 88 4847 8595 6639 1470 -556
14961 -556 5482 16074 6050 2491 7078 7039 10107 7128 6290 1138 3054 4348 14135 2291 2917
14946 2917 8574 -5881 -15273 -4112 -10876 -18008 -13430 -8931 -1889 12795 19708 15638 5663 3172
14932 3172 -4685 -8578 -1081 12963 24869 15599 15723 20168 30130 31891 17880 -4438 -14759 -15714
14918a5714P040L278K1093L0214N553j4499j8239p229j5370q639l036O337J0237
14905A026J3922j4427o235j001N921J5205J3755l891j4854j2291j2889m123K460
14892a7422J1214M230M068l152N969J8781rn902R60O110l570O347M723l638q432
14877B0277o990N50j0659j618r37j676N394k432J516L27j7q498Q676r81J588o543
14861b023K265R18J533q4j4061K324J2890J0208Q138j0847m9N996P779M553j8963
14846A0577j1778L125O0j829j2736M213K207J2146K349J1270k299M359j917o107
14832A3640j176J0029J0806l843k188O946N751j2082O682j247n580P795O65L262
14818C9460q073j6332j4825r367J132O257p200r091J2797M271l52J9947k288q080
$$ plain form
14918 -15714 -8674 -5396 15697 45911 51464 36965 18726 11497 -3873 -12512 -15548 -9211 1026
14905 1026 14948 521 -5714 -6715 -794 14411 28166 24275 9421 -2870 -15759 -19882 -17422
14892 -17422 -6208 -1978 2090 -1062 4907 23688 23679 17777 18737 24847 21277 27624 32347 28709 20277
14877 20277 13287 13837 3178 1560 623 -1053 4341 1909 3425 3752 3735 -4763 3913 2932 4520 -2023
14861 -2023 242 1160 2693 2609 -11452 -9128 3762 13970 22108 11261 11212 17208 24987 29540 10577
14846 10577 -1201 1924 1984 155 -12581 -8368 -6161 5985 8334 19604 17305 21664 19747 13640
14832 13640 12464 22493 33299 29456 27268 34214 39965 27883 34565 33318 27738 35533 36198 39460
14818 39460 31387 15055 230 -9137 -8005 -1748 -8948 -18039 -5242 -971 -1323 18624 16336 8256
14804H256l126n264o786o286j7k461n32o372P338J8310P016j1613r746O96k835
14789a3422o828O789K3196J0361J190p887r688n20O896J368J0113m777j1352o86
14775D753J3475J17k1017M610J2679Q586R631j581j7105P82Q32j571J1082L388
14761B8661j4831j5838R248J1562L815q832P016N131j2834j172K428r579J2017
14748A6792O536O56P84O975q06q961P245N410j0385o938J627P814p645n303J529
14733A5330k0j7303j780M794J8121N752O40j9187J077J5555L921R42o194p442
14719A4206k623K877p861N922K512o972J8125J155n882J273l451j4895j1327N348
14705a593K73L024J3488m659n242P715k611k619m515n328p234k285L230J2201
$$ plain form
14804 8256 5130 -134 -6920 -13206 -13223 -15684 -16216 -22588 -15250 3060 10076 -1537 -11283 -10587 -13422
14789 -13422 -20250 -13461 9735 20096 21286 13399 3711 3191 10087 11455 21568 16791 5439 4753
14775 4753 18228 18345 -2672 1938 14617 23203 32834 31253 14148 14930 15762 14191 25273 28661
14761 28661 13830 -2008 7240 18802 22617 13785 20801 25932 13098 11926 14354 4775 16792
14748 16792 23328 23984 24768 31743 30937 21976 29221 34631 24246 17308 18935 26749 19104 13801 15330
14733 15330 15310 -1993 -3773 1021 19142 24894 25534 6347 7424 22979 26900 27842 21648 14206
14719 14206 11583 14460 6599 12521 15033 8061 26186 27341 21459 22732 19281 4386 -6941 -1593
14705 -1593 -1320 1704 15192 10533 5291 13006 10395 7776 3261 -2067 -9301 -11586 -8356 3845
14691C845P464o570j867m993o249L258j003K539P488K341J867m488l566r050R737
14676G53K349L377J0820J691n155O69J785n459N211M811m703q407n586R819K1176
14661C3151m669k1044r708j898j3O051n736j26R937j793M141J1287Q903N594j8286
14646A5791k8494L792R988q39o80k396J354J7250K805R551m46p704j2702j8574
14632a1304P862k290P142P096K998j446M604j261k132n898K770M769l948p247
14618A715p818j334P218J7309O81J0223j6642n756k579J0243o66l654M728j670
14604A1998R37J1000o51R381j99q436n24r505q235Q646Q256q308L993L492o60
14589B1185j377M701j4233j679Q12R20n799K879n585l749K821J4704J1525O64
$$ plain form
14691 3845 11309 4739 2872 -2121 -8370 -5112 -6115 -3576 3912 6253 8120 3632 66 -8984 753
14676 753 3102 6479 17299 18990 13835 14504 16289 10830 16041 20852 16149 7742 2156 11975 33151
14661 33151 28482 7438 -2270 -4168 -4181 1870 -3866 -3992 5945 4152 8293 19580 28483 34077 15791
14646 15791 -12703 -8911 1077 238 -442 -2838 -1484 15766 18571 28122 27676 19972 7270 -11304
14632 -11304 -3442 -5732 1410 8506 11504 10058 14662 13401 11269 5371 8141 12910 8962 1715
14618 1715 -6103 -7437 -219 17090 17771 27994 11352 5596 3017 13260 12594 8940 13668 11998
14604 11998 12935 23935 23284 32665 32466 24030 23506 14001 5766 14412 22668 14360 18353 21845 21185
14589 21185 19808 24509 10276 8597 9409 10329 4530 7409 1824 -1925 896 15600 27125 27789
14575B7789N297k664m052L941m39l841r626k348M669O00O42J3893J018p589r387
14560A7903j5372l830n898N697J1664R267J425p279q444k806J2156Q832J2604
14547C5919j394l917q714M79j3748k812k10J2941R097n074O840j0953m281p485
14533F688j0650r245r349J4094J6788J1956n123q517l697N444J9258M779k2468
14520I958j3530J60J1087Q596p981j5874k382P669k591p123M973J0650p227O211
14506B596J321P43P326P42j0827r62N254J0467O670M82J781k548O673N900m190
14491C1428j0879j369L846n382o210l698J671K804N555M33m565J1479K543j9869
14477G787M56N751J931L95O660K098o307o602Q543J711K351N151r193n820N892
$$ plain form
14575 27789 33086 30422 26370 30311 29872 26031 16405 14057 18726 19326 19968 33861 34879 27290 17903
14560 17903 2531 -1299 -7197 -1500 10164 19431 20856 13577 5133 2327 14483 23315 35919
14547 35919 34525 30608 21894 22373 8625 5813 5603 18544 27641 22567 29407 18454 14173 6688
14533 6688 -3962 -13207 -22556 -8462 8326 20282 15159 6642 2945 8389 27647 32426 9958
14520 9958 -3572 -3412 7675 16271 8290 -7584 -9966 -2297 -4888 -12011 -7038 3612 -3615 2596
14506 2596 3917 4660 11986 12728 1901 939 6193 16660 23330 23812 25593 23045 29718 35618 31428
14491 31428 20549 19180 23026 17644 11434 7736 9407 12211 17766 18199 13634 25113 27656 7787
14477 7787 8243 13994 15925 16320 22980 25078 18771 12169 20712 22423 24774 29925 20732 14912 20804
14462B0804m436q502M615P04n034L43J0229J2326m617j4703R623Q005J1044r989
14448C0412k0502p80p85m256N438M468l798j0093j1261P234J1264J2602J5810
14435C5753J470p180k0468k178J43L424N602j1722K691o005j1583j9960J3501
14422a6512J6675j017J1014m363n114J2862N410J316N884k729N279j02J153p136
14408B2620j425k059m337J2365J696o479j7527k794L860k91J1142k372L681j2925
14394E155o219J7094J0399j2156o192j3977j170K0399N905m121J037p809J681
14381A0026J1272N71j2207m485k846j0888P817J6083r737k4038q778P201M033
14368a5976K001R702J7213m515k316o933L118o698N037K497p572m792J3499P556
$$ plain form
14462 20804 16368 7866 12481 13185 8151 8494 18723 31049 26432 11729 21352 29357 40401 30412
14448 30412 9910 9130 8345 4089 9527 13995 10197 104 -11157 -3923 7341 19943 35753
14435 35753 37223 30043 9575 7397 7540 10964 16566 4844 7535 1530 -10053 -30013 -16512
14422 -16512 163 -854 10160 5797 683 13545 18955 20271 26155 23426 28705 28603 29756 22620
14408 22620 21195 19136 14799 27164 28860 22381 4854 2060 5920 5629 16771 14399 18080 5155
14394 5155 -1064 16030 26429 14273 8081 -5896 -7066 13333 19238 15117 16154 8345 10026
14381 10026 21298 21869 9662 5177 2331 -8557 -740 15343 5606 -18432 -27210 -20009 -15976
14368 -15976 -13975 -4273 12940 8425 6109 -824 2294 -4404 633 3130 -4442 -9234 4265 11821
14354A1821J2946K761j0461Q18M663n575O401L299r774o158k54PM119q863j766
14339C984k683P508k404m665O695N477N202j649J150l674j4581m579n008J0057
14325H30k115k087k008K231M242O847Q489q962j093R293P742j1797j2536M145
14311C221J8229Q784N090r927P482J612p091k417p895o241l305P065l603n383
14297E621k520q452j0038J706Q16M079J0193l094o716M452J5245j886L684P432
14283B0522m122J4068O913j3504j2531o661j3331R099K605Q708N45J775M978j4129
14269D935L494J3169J638N64M352l051P536N650L74L305j546J530l224k674j2469
14254B3583M645L968j6075q472N367n57p992N794k679l356L923m955P897O378
$$ plain form
14354 11821 24767 27528 17067 17885 22548 16973 23374 26673 16899 10741 10487 10494 14613 5750 3984
14339 3984 1301 8809 6405 1740 8435 13912 19114 17465 18615 14941 360 -4219 -9227 830
14325 830 -1285 -3372 -5380 -3149 1093 7940 16429 7467 6374 15667 23409 11612 -924 3221
14311 3221 21450 30234 35324 25397 32879 34491 27400 24983 17088 10847 7542 14607 11004 5621
14297 5621 3101 -5351 -15389 -13683 -12867 -8788 1405 -1689 -8405 -3953 11292 9406 13090 20522
14283 20522 16400 30468 37381 23877 11346 4685 -8646 453 3058 11766 12311 14086 19064 4935
14269 4935 8429 21598 23236 23800 28152 25101 32637 38287 38661 41966 40420 41950 38726 36052 23583
14254 23583 28228 32196 16121 7649 13016 12459 4467 10261 7582 4226 8149 3194 11091 17469
14240A7469o73Q908m164Q92j3578N108J2374j0581m844O224J3105J219p686n175
14226A8598J1702L513L687J23j2969m455k464j0492L458L371j0271J765o131r007
14212i572J0730J3081p93j0302p034k288K480N16J2154M389o051J1785Pj3103
14198E999l614O705R527J5837K123k891o928n107p081p450M990O851k275M006
14184B0692O958k708j4619r472Q796Q228j796j3382o41J1496J1669K48J0714p981
14170B8202o803l345m146P416J5379p797O483o534O50N570k711q460j2682j333
14156I889O884p108l416J238j704q570J737M788o24M293N799J025m582p250r195
14141f796N104N771k271r017j109j0908l005N148J6555J0695P606n549m287Q974
$$ plain form
14240 17469 16796 25704 21540 22432 8854 13962 26336 15755 10911 17135 30240 31459 23773 18598
14226 18598 30300 33813 37500 37623 24654 20199 17735 7243 10701 14072 3801 5566 -565 -9572
14212 -9572 1158 14239 13446 3144 -3890 -6178 -3698 -3182 8972 13361 7310 19095 19102 5999
14198 5999 2385 9090 18617 34454 36577 33686 26758 21651 14570 7120 12110 18961 16686 20692
14184 20692 27650 24942 10323 851 9647 17875 16079 2697 2056 13552 25221 25469 36183 28202
14170 28202 21399 18054 13908 21324 36703 28906 35389 28855 29505 35075 32364 23904 11222 9889
14156 9889 16773 9665 6249 7487 5783 -2787 -1050 3738 3114 7407 13206 14231 9649 2399 -6796
14141 -6796 -1692 4079 1808 -7209 -8318 -19226 -22231 -17083 -528 10167 17773 12224 7937 16911
14127A6911k556J0682k73k543n622p969O08N237k902o465p603m037J1674L41O944
14112A2427N296l352j182J1581J6844N379k285r881n658p109q978N907j2839j0403
14098d253Q201K158K169K2350p1l920p749k883j1610n659l078O061J8300n506
14084A4510m251J3827r90N617r432o447R151K460J4767j2343j1028O453q997m880
14070H417k411Q643k597o593N026K3870j552j2715o126o501l205K0206N377j0528
14056A9311n48P299J864j518l388k0091j4292j725Q408J2571J608N311J2000Q021
14042C4831k938n795L800j4506j6489j1116J3310R428J0045j3919N041J6040j607
14029B6125k554o567r65J118n345m896l728J1756J753J863J7969M865j5576Q991
$$ plain form
14127 16911 14355 25037 24764 22221 16599 8630 9238 14475 11573 5108 -2495 -6532 5142 5483 12427
14112 12427 17723 14371 13189 24770 41614 46993 44708 34827 29169 22060 13082 18989 6150 -4253
14098 -4253 3948 6106 8275 30625 30554 26634 18885 16002 4392 -1267 -4345 1716 20016 14510
14084 14510 10259 24086 23096 28713 19281 12834 21985 24445 39212 26869 15841 22294 13297 8417
14070 8417 6006 14649 12052 5459 10485 34355 32803 20088 13962 7461 4256 24462 29839 19311
14056 19311 18763 26062 27926 26408 23020 2929 -11363 -13088 -4680 7891 9499 14810 26810 34831
14042 34831 31893 26098 29898 15392 -1097 -12213 1097 10525 20570 6651 11692 27732 26125
14029 26125 23571 17004 16039 17157 11812 6916 3188 14944 16697 18560 36529 41394 25818 34809
14015C4809K559j1347j026j808j9740q57n643k582J6358J4469J477N781j417k1121
14001I912r081K527K14K010n226r538R47n559Q128K0575N965m3L288M141P64k261
13985B6763J890L999n610Q133R382j7921k8290n935J8926P143J213Q2j123q890
13971I762l113j1438L309M907J1817J0868L8j1367q375j639Q608r890p619O191
13957B059M956M148p033l270o182m504j693Q558k816J5848M248K497L868j276
13943A9408j371Q352L480m254o543k126k777n232p411L198L956O722J444m621
13929A2225j344l133M32K603j991n368J0796J4687M171n762j5815n4n078p531
13915a162J6804J215k880Q130m064l044O353O599r640P930P358p363J2554P101
$$ plain form
14015 34809 37368 26021 24995 23187 3447 2590 -3053 -5635 10723 25192 26669 32450 31033 9912
14001 9912 831 3358 3572 5582 356 -9182 -8235 -13794 -5666 14909 20874 20831 24119 28260 29024 26763
13985 26763 28653 32652 27042 35175 44557 26636 -1654 -7589 11337 18480 19693 19775 18652 9762
13971 9762 6649 -4789 -1480 3427 15244 26112 26150 14783 6408 4769 13377 3487 -4132 2059
13957 2059 7015 11163 4130 860 -5322 -9826 -11519 -2961 -5777 10071 14319 16816 20684 19408
13943 19408 18037 26389 29869 25615 19072 16946 14169 8937 1526 4724 8680 15402 16846 12225
13929 12225 10881 7748 8180 10783 8792 3424 14220 28907 33078 27316 11501 11447 6369 -1162
13915 -1162 15642 16857 13977 22107 18043 14999 21352 27951 18311 26241 33599 26236 38790 45891
13901D5891j0317k1093j3804Q914K6544M161j1289p893m087L948J0514k748J447
13888C0188j5163l990J2309N557k52P870q414r96n557j4166j6859J2483O173K373
13874A1556R69J1323q339j371k06L001O346R280J0865p606k570k0712O369K5101
13860D4006R338j2499m351N155m80j2421p86R313j508j5607j3716m722q250M690
13846a838P286m813j4289J1180L854j6920K419K788P033K1178J2945p405K501
13833B5919j1390p892m68Q230M618K487o776p194M06M183O24J2751L599o464n227
13818A7406q474M045R638J3629q249j887m87p742n439J3343P532R964j3775j0228
13804A9276j7107M190J1864L443L999L486m91M866p637q076J79J3889o496j2889
$$ plain form
13901 45891 35574 14481 677 9591 36135 40296 29007 21114 17027 20975 31489 28741 30188
13888 30188 15025 11035 23344 28901 28649 36519 28105 27109 21552 7386 -9473 3010 9183 11556
13874 11556 12525 23848 15509 14138 13932 16933 23279 32559 43424 35818 33248 12536 18905 44006
13860 44006 53344 40845 36494 41649 41169 28748 27962 37275 35767 20160 6444 1722 -6528 -1838
13846 -1838 5448 635 -13654 -2474 1380 -15540 -13121 -10333 -3300 17878 30823 23418 25919
13833 25919 14529 6637 6169 14399 19017 21504 14728 7534 7940 12123 12747 25498 29097 22633 17406
13818 17406 8932 12977 22615 36244 27995 26108 25621 17879 12440 25783 33315 43279 29504 19276
13804 19276 2169 6359 18223 21666 25665 29151 28660 33526 25889 17813 17992 31881 25385 12496
13790A2496Q041K44P922q854j8445p954R044K0225K379k022j782o640j5026m544
13776d916k052J1601J6499M651Q28n927r362J0577J5720M07k495P120j962j5956
13762B4733N772J0934j865N744n926p70o110r734k999n654p943l054N938N789
13748A4855j1368q777J3891N36R0J4852J0991r388o448n817q435r486L7J817J5059
13733A2409J6124N130m211j4642j2801L564O093P989n782j1971K366Q600l363
13720I505N219j2702N299Q633J1743k583O176p366k94K867m31L011j1740j2593
13706D744j111K02Q771J1712k186j440o856L859O118J3119n782l786O807O657
13692D0828K714K106k360k428j1714p496m108j123m381n31L631p18j681M647Q134
$$ plain form
13790 12496 20537 20781 28703 19849 1404 -6550 2494 22719 25098 23076 21294 14654 -372 -4916
13776 -4916 -6968 4633 21132 25783 26611 20684 11322 21899 37619 38026 35531 42651 40689 24733
13762 24733 30505 41439 39574 45318 39392 38622 32512 22778 19779 14125 6182 3128 9066 14855
13748 14855 3487 -5290 8601 9137 9227 24079 35070 25682 19234 13417 4982 -4504 -4467 -2650 12409
13733 12409 28533 33663 29452 14810 2009 5573 11666 19655 13873 1902 4268 12868 9505
13720 9505 14724 2022 7321 15954 27697 25114 31290 23924 23630 26497 26066 29077 17337 4744
13706 4744 3633 3835 12606 24318 22132 20692 13836 17695 23813 36932 31150 27364 34171 40828
13692 40828 43542 45648 43288 40860 29146 21650 17542 16419 12038 11507 15138 14420 12739 17386 25520
13677B5520j36j6729o600P848k208L714o927k440o07J1172P399L842L358n382
13663B1824j9420j43J1360L793K034M409N672p512o756J0895J3282r166Q24n128
13649B5968K010Q103l01J523k099N111M646L078p712m565j030o092j3322r119
13635F199J2406R837R182j203n746J0358K120J130m513j9982K759R843N488k800
13621C5078r196r80J0209P77o087m55K2819M358K812m174m903j0510j8221J1847
13607C3374p475r605M002l989j0473K846J472N638J3045M943j415J910m671L712
13593C3314P670n273o284o913n877K124J351M007k023j800o40p09n07j399J2082
13578B9123K2511m39j1018j1389j157J263K519M423L093j666p616j3555n789R333
$$ plain form
13677 25520 25384 8655 2055 9903 7695 11409 4482 2042 1435 12607 20006 23848 27206 21824
13663 21824 2404 2261 13621 17414 19448 23857 29529 22017 15261 26156 39438 30272 31096 25968
13649 25968 27978 36081 35780 37303 35204 40315 44961 48039 40327 35762 34732 28640 15318 6199
13635 6199 18605 28442 37624 36421 30675 41033 43153 44283 39770 19788 22547 32390 37878 35078
13621 35078 25882 24902 35111 35888 29801 29346 52165 56523 59335 55161 50258 39748 21527 33374
13607 33374 25899 16294 20296 16307 5834 8680 10152 15790 28835 33778 32363 34273 29602 33314
13593 33314 40984 35711 29427 22514 16637 18761 20112 24119 22096 20296 19656 18947 18440 17041 29123
13578 29123 51634 51195 40177 28788 27631 28894 31413 35836 38929 37263 29647 16092 10303 19636
13564A9636k997K862J1527J4268R992J592n220k247j0157j0064K385R514k1k0568
13550B0502j9627N340J2052p605o121M836P22j0283J3261Q949n470k168J3293
13537B7681q16J357j5430j3438J2657m915N41N725O97l370J8371K1344J453j930
13523D9927n427l156M032j7468O457P354q56k2921j2771J4000K110l683Q434j549
13509B4483R89J2091k316m310Q579j0670j288J1373J0822M73M736J128j4439j1055
13495C0596L915L196j1830j3755J5345O350m199q213R919P002K350k930P566M433
13481D9745q041j993P949j2363R20R61j920q20N550p775j7063n741R505J1251
13467C0165J477J4982m455j1473m891K964J1511N234j0830j076N382J1844J6785
$$ plain form
13564 19636 16639 19501 31028 45296 55288 56880 51660 49413 39256 29192 31577 41091 41070 20502
13550 20502 875 6215 18267 10662 4541 9377 10099 -184 13077 22026 16556 14388 27681
13537 27681 26865 28222 12792 -646 12011 7096 7637 13362 14059 10689 29060 50404 51857 49927
13523 49927 44500 41344 45376 27908 34365 41719 40863 17942 5171 19171 21281 17598 26032 24483
13509 24483 25472 37563 35247 30937 39516 28846 27558 38931 49753 50226 54962 56090 41651 30596
13495 30596 34511 37707 25877 12122 27467 33817 29618 21405 31324 38326 40676 37746 45312 49745
13481 49745 41704 39711 47660 35297 36217 37178 35258 34438 39988 32213 15150 9409 18914 30165
13467 30165 31642 46624 42169 30696 25805 28769 40280 45514 34684 33608 38990 50834 67619
13454F7619r216j0786M847J930j3765O248J630j5241l468P51j1451k652M005j087
13440A9364K273N719K1213J2735j2279j2305J2507K97j1179j8683K77K7694Q230
13427E5863l87n650R237p295j2589L369o995q270p93K2416K781O976Q156J1180
13413G7999m30k3390k5799k078o940L588J4968K06j0703J055M202j776N64l808
13399B7658J467J566J1504q275o074j3844J257j173J5016J3764j499q970p056
13386B5341l084M752L259O590m831m974l466L911J589K900m712J2778J1635J0632
13372F2320q817j5081J121J2509Q404n57j3671o953j132J4249N970j309q651q386
13358D0016J1633K4267P18j7728l332j4621J024K443j3912J7502J1333j1682j3041
$$ plain form
13454 67619 58403 47617 52464 54394 40629 46877 48507 33266 29798 30549 19098 16446 20451 19364
13440 19364 21637 27356 48569 61304 49025 36720 49227 49524 38345 19662 19939 47633 55863
13427 55863 55476 49826 59063 51768 39179 42548 35553 27283 26490 48906 51687 58663 66819 77999
13413 77999 77569 54179 28380 26302 19362 22950 37918 38124 27421 28476 32678 30902 31466 27658
13399 27658 29125 30691 42195 33920 27846 14002 15259 14086 29102 42866 41367 32397 25341
13386 25341 22257 27009 30268 36858 32027 27053 23587 27498 29087 31987 27275 40053 51688 62320
13372 62320 53503 38422 39543 52052 60456 59899 46228 39275 38143 52392 58362 57053 48402 40016
13358 40016 51649 75916 76634 58906 55574 40953 41977 44420 30508 48010 59343 47661 34620
13345C4620J434J2105j917K795R494p776j1532m589p84j5547q01K0988N876o036
13331C8330l786k812O546J3332O2L83l783k3113j6754J1136J0869j0484q032K32
13317A2126P215m854K0715J4395p546J266J6057K465N346J069r718j4332j9535
13304B4669N12J3335N708m646o79k669N932J1360k0386r856q161K646J6520O953
13290D1238J23P666L489K450O507q680l502J2649M708j3426j0393p078L823J2781
13276E2355K636M283m726j5320P916J0687J3469K389m725j0924k3533O58k550
13263C2615J063M35j2650N313J0968M614k783j0078k444J7445K582n238J480J932
13249D5254K291k262p943M69J3483J0918L353m136q879j118l57m134q53K298j151
$$ plain form
13345 34620 36054 48159 46242 49037 58531 50755 39223 34634 33850 18303 17502 38490 44366 38330
13331 38330 34544 31732 38278 51610 51672 52055 48272 25159 8405 19541 30410 19926 11894 12126
13317 12126 19341 14487 35202 49597 42051 43317 59374 61839 67185 68254 58536 44204 24669
13304 24669 25181 38516 44224 39578 38899 36230 42162 53522 33136 23280 15119 17765 34285 41238
13290 41238 41361 49027 52516 54966 61473 52793 49291 61940 66648 53222 42829 35751 39574 52355
13276 52355 54991 59274 54548 39228 47144 57831 71300 73689 68964 58040 34507 35165 32615
13263 32615 33678 34113 21463 26776 37744 42358 39575 29497 27053 44498 47080 41842 43322 45254
13249 45254 47545 45283 37340 37809 51292 62210 65563 61427 52548 51430 51073 46939 46086 48384 47233
13234D7233Q47N278p722q472K130N298l570J29m799M278l3m320P218L1O590N856
13218E5972R768J985j3166p532m707J5494j020p522k750q068j430n859O502O94
13204C8361k650R878J983j786j73k020l514J4945J6856J0162q062n545l255j4049
13190E1131P70k301k196j318j690j891j1982J998O969j2697o222P045P775j36
13176C5255J325N668O91o40J1419n895P739m677n972Q104M289n030q553R8J3320
13161E7141j388m948j562l477J1843j5903j5516n42J5778J5135J1480r048k5806
13148C3187j769Q579O940N43L354P290q734j036O753J0860M793j6028q01q353
13134D5578r524Q019l119p310j4323M093J8509J0610R209K480j5050p763j790
$$ plain form
13234 47233 48080 53358 45636 37164 39294 44592 41022 41151 36352 40630 40597 36277 43495 43526 50116 55972
13218 55972 65740 67725 54559 47027 42320 57814 56794 49272 46522 38454 37024 31165 37667 38361
13204 38361 35711 45589 47572 45786 45613 43593 40079 55024 71880 82042 73980 68435 65180 51131
13190 51131 51901 49600 47404 46086 44396 42505 30523 32521 39490 26793 20571 27616 35391 35255
13176 35255 36580 42248 42939 42299 53718 47823 55562 50885 44913 53017 57306 52276 43723 43821 57141
13161 57141 55753 50805 49243 45766 57609 41706 26190 25648 41426 56561 68041 58993 33187
13148 33187 31418 39997 46937 47480 50834 58124 49390 48354 55107 65967 70760 54732 53931 45578
13134 45578 36054 44073 40954 33644 19321 23414 41923 52533 61742 64222 49172 41409 39619
13121C9619N512M767m73M746k686l400k102o970j0404L471M16K5314M549K097
13107F4456M065J125J7953l656k1595r593J2458O506N189J1082J9902J1971N123
13094A24986N27J341j9361j2343k0136j8578j2213j4886J9406J6292j2723Q549
13082F0861K078k663j1952L932q420N624K2332q231p948O346j0119q614k534P282
13068D7974R985j0948j5295J930k031j585O831P661n997O182N933L553o962J7815
13054F5046n939k4096j3265L92J4513K1522K4306J6965K9542K6673O916P556n87
13041A69544O248J7082J0733O109K2631L4890L6688L5356O1273Q3192Q8183J26566
13029F98495J99517K89804M04043M84951M87667L37406O0116k32357m65888n43097
$$ plain form
13121 39619 45131 49898 49425 54171 51485 48085 45983 39013 28609 32080 32496 57810 62359 64456
13107 64456 68521 69646 87599 83943 62348 52755 65213 71719 76908 87990 107892 119863 124986
13094 124986 125513 126854 107493 95150 75014 56436 44223 29337 48743 65035 52312 60861
13082 60861 62939 60276 48324 52256 43836 49460 71792 63561 55613 61959 51840 43226 40692 47974
13068 47974 57959 47011 31716 33646 31615 30030 36861 44522 38525 44707 50640 54193 47231 65046
13054 65046 59107 35011 21746 22138 36651 58173 82479 99444 128986 155659 162575 170131 169544
13041 169544 175792 192874 203607 209716 232347 267237 303925 339281 400554 483746 571929 698495
13029 698495 898012 1187816 1591859 2076810 2564477 2901883 2961999 2729642 2263754 1720657
13019A720657n00285l64366k17393j36677r1886o7608n3157k3193j0199k7831
13009B28062k6734q347p593j8219k3826J602j0222j1213L0690M701j0258J252
12997A49895n406o819n009m456P984Q108m795k1839j5605L466J314m636k6j524
12983A00652M869P544N023l778j2695j0031j49l828j2781J2767K0651J0331j0682
12970A07893m019L278k065l846o569o313j2606J990N886R385J6402k1150k2785
12957F5481Q120J4112J1196R622m064k350J785K950p037N951K2728n539k93O182
12943A28844k620r725j0425j7436j633l031q725K692N42J4500O987L984n534r321
12929H9099Q266K932O214p303M31L430M110K586l489P274J8255j6651r235k045
$$ plain form
13019 1720657 1220372 856006 638613 501936 410050 342442 289285 266092 255893 228062
13009 228062 201328 192981 185388 167169 143343 144945 134723 123510 154200 158901 148643 149895
12997 149895 144489 137670 132661 128205 136189 144297 139502 117663 102058 105524 106838 102202 102176 100652
12983 100652 105521 113065 118088 114310 101615 91584 91435 87607 74826 87593 108244 118575 107893
12970 107893 103874 107152 105087 101241 94672 88359 75753 77743 83629 93014 109416 88266 65481
12957 65481 73601 87713 98909 108531 104467 102117 103902 106852 99815 105766 128494 122955 122662 128844
12943 128844 126224 116499 106074 88638 87005 83974 75249 77941 78483 92983 99970 103954 98420 89099
12929 89099 97365 100297 106511 99208 99639 103069 107179 109765 106276 113550 131805 115154 105919 103874
12915A03874O507J8306K3314J3258j9816o972j1067q675q50M507R843r69J972
12902A33232l324j316J7316p850p933J5876N204K008J0809J3259n913j2004P787
12889A67151K495O180J3565K964L212q661j8965k1579l488N910N661J4374J7258
12876A86077o284j3335o665L561m231J251Q670K931r30Q557O410j0761j1056j4353
12862A49842J212R219P485R656J2012L711j1437p830q442n612R468J9718L966
12849A92968j316J5263J2303P473J4667K0939L5341N7018P4772Q6241N3808L556
12837E73033l8462o9196q7450p2917n6445j6369o761j0549j618j0886l3088k8720
12825A40572m248J018K0860J6349m430k882N094M027m808L108J938k0358j1811
$$ plain form
12915 103874 110381 128687 152001 165259 145443 138471 127404 118729 117879 122386 132229 131260 133232
12902 133232 129908 128592 145908 138058 130125 146001 151205 153213 164022 177281 171368 159364 167151
12889 167151 169646 175826 189391 192355 195567 186906 167941 146362 142874 148784 154445 168819 186077
12876 186077 179793 166458 159793 163354 159123 160374 169044 171975 171045 179602 186012 175251 164195 149842
12862 149842 151054 160273 167758 177414 189426 193137 181700 173870 165428 159816 169284 189002 192968
12849 192968 191652 206915 219218 226691 241358 262297 297638 354656 429428 515669 569477 573033
12837 573033 534571 465375 377925 305008 248563 232194 225433 214884 213266 202380 169292 140572
12825 140572 136324 137342 158202 174551 170121 167239 172333 176360 171552 174660 176598 156240 144429
12812A44429P700k0497j2368N720J0662J0995J7834O850o59J5988R041j896p740
12799A86059o731j8732K53J7777K1580K889n739P268Q968J5005K1909J4516N370
12786B70392K2001L0073N111J217m898m189o211j562R963R373p095j3065j2231
12773B98879j0526M879n426k6275n5861l7506j3595p362J070K031J4456K7405
12761A92169K9423J5555R652R844P193K1940J4168m60J3286K6733M014j502J7821
12748C59836J6647K6976J5786J5403J5635Q803M88j5787k7100j4016K656R356
12736D14683L135m716j6696j0222K506P268Q203J191l717K3418K3858K9268N8315
12723E36494M6417L0324N0786N4848M6271K6795K3966N5561N2262q915r1463j65239
$$ plain form
12812 144429 152129 131632 119264 124984 135646 146641 164475 171325 170666 186654 195695 193799 186059
12799 186059 179328 160596 160849 178626 200206 203095 197356 204624 213592 228597 250506 265022 270392
12786 270392 292393 322466 327577 328794 323896 319707 313496 311934 321897 331270 324175 311110 298879
12773 298879 288353 293232 287806 261531 205670 168164 154569 147207 148277 150308 164764 192169
12761 192169 221592 237147 246799 256643 263836 285776 299944 299484 312770 339503 343517 342015 359836
12748 359836 376483 403459 419245 434648 450283 459086 459574 443787 416687 402671 405327 414683
12736 414683 417818 413102 396406 386184 388690 395958 404161 405352 401635 425053 448911 478179 536494
12723 536494 582911 613235 664021 718869 765140 791935 815901 871462 923724 914809 823346 658107
12711F58107j82157j63977j12479n6318k1876K74L7094L5208K9553L1485J8756
12700B73670Q830m834l182J4656L2089L0023K8581K6591K2736J4969l437m839
12688D35853K067q854J319J3285N595J4678j3295q935N947P376L3010K9978J7453
12675E35477R705m546k3419j7220j83O889L4490L2621K5126L2343K7101L5709
12663F94093L4828L7347L5681K0881J2274M414J9894K1371K1577J9560K6042R491
12651I57453J3057J1569K346J5685J9062K6145M1030M7963N4893N5489L8939M5353
12639A328984M0234N7336N7705O0158O4487M9659M1089K6324L1674M1592O3585
12628A862827J04807J38344J52115J66874J84641J83163K01920J70117J67971
$$ plain form
12711 658107 475950 311973 199494 143176 121300 121574 158668 193876 223429 254914 273670
12700 273670 282500 277666 274484 289140 321229 351252 379833 406424 429160 444129 440692 435853
12688 435853 437920 429066 430385 443670 449265 463943 450648 441713 447660 455036 488046 518024 535477
12675 535477 545182 540636 517217 499997 499814 506703 541193 573814 598940 631283 658384 694093
12663 694093 728921 766268 801949 822830 835104 839518 859412 880783 902360 921920 947962 957453
12651 957453 970510 982079 984425 1000110 1019172 1045317 1086347 1134310 1189203 1244692 1283631 1328984
12639 1328984 1369218 1426554 1484259 1544417 1608904 1658563 1699652 1725976 1757650 1799242 1862827
12628 1862827 1967634 2105978 2258093 2424967 2609608 2792771 2994691 3164808 3332779
12619C332779J68760J80804J85150K32290K73319L02849L73264M12440M57604
12610E919259N02056N80236O45526P30603Q51480J000424J224906J515642J886335
12601A4856467K398755L062418L960183N200707O870812Q950359J1387567J4294350
12593G0981618J8155034K4241530L4460347N0458306P0921202Q8641422R1256067
12586D49115526O8557999K2049401l4022359p9405861r9558865r3176360p1112033
12579A62447448m7366995k9778532j9175822j3239233r694816p305394n589575
12572C0297081m337091l429435k806105k358875j991451j674500j413950j219255
12564A1066419j071440r28943q18658p26095o42937n68717m99166m37952l98393
$$ plain form
12619 3332779 3501539 3682343 3867493 4099783 4373102 4675951 5049215 5461655 5919259
12610 5919259 6421315 7001551 7647077 8377680 9229160 10229584 11454490 12970132 14856467
12601 14856467 17255222 20317640 24277823 29478530 36349342 45299701 56687268 70981618
12593 70981618 89136652 113378182 147838529 198296835 269218037 357859459 449115526
12586 449115526 517673525 539722926 505700567 426294706 326735841 233559481 162447448
12579 162447448 115080453 85301921 66126099 52886866 43192050 35886656 30297081
12572 30297081 25959990 22530555 19724450 17365575 15374124 13699624 12285674 11066419
12564 11066419 9994979 9066036 8247378 7521283 6878346 6309629 5810463 5372511 4974118
12555D974118l54785l30662l14401k92251k72772k26855k01847j86833j41492
12546B652220j10709r1946q8554r3842q5600j15723j31016j42786j29801j04115
12536A558128r5729q3911p2435n8744m9159m3645l8918l0353l8823k6579l9996
12525I79836m1395l2611l1548l6939k8864l2627m5151l4706l2781k4288m4478
12514E94448k8502k6291j9622p190j1481j8269n220J036L222j842m098o776j7692
12501D51723j0988r699K0330M1817K3579J3209j3012k4102l2075n2018m2308k6223
12489C40233O907J1737N148k3011k7724k4084l825M068n568L6N831Q643J9082
12476C17473J1641J4881J6341J9637R916Q537K4123K4472L5803L9755K7542K7080
$$ plain form
12555 4974118 4619333 4288671 3974270 3682019 3409247 3182392 2980545 2793712 2652220
12546 2652220 2541511 2449565 2361011 2267169 2181569 2065846 1934830 1792044 1662243 1558128
12536 1558128 1462399 1378488 1306053 1247309 1198150 1154505 1115587 1085234 1046411 1019832 979836
12525 979836 938441 905830 874282 837343 808479 775852 730701 695995 663214 638926 594448
12514 594448 565946 539655 520033 512843 501362 483093 477873 478909 482131 480289 476191 469415 451723
12501 451723 440735 431036 451366 493183 516762 529971 516959 492857 460782 408764 366456 340233
12489 340233 347140 358877 364025 341014 313290 289206 285381 289449 283881 283917 289748 298391 317473
12476 317473 329114 343995 360336 379973 389889 398426 422549 447021 482824 522579 550121 577201
12464E77201R130J0650R775n6m4434q1448r6215p1400L295R6710K13634L26740
12452I53582M03574M17293L08450Q8199j43926l33299m18663l84438k87058j86861
12442D16853j07986p0096m8430j5312k8536l7465k0292r130j8378k9925j6700
12431A4603j9385l0807k3259k7484n616J4050J3887M294J2107L1157Q101M344
12419d008K832J0452J3433N711k190J0418K4946K2098j51J382n662k027l671N042
12405G8605J9983J1875n229j6779k2704m1368k5546n678m540p593j5724j2983
12393d7681k7095k2128o01J0682K1646Q796Q387j832m738K617Q727L3687K8160
12380A8627R851Q384K4698M444M942J504m259k6440k7453r738J7562J7294O018
$$ plain form
12464 577201 586331 596981 606756 606700 562266 480818 384603 313203 316498 413208 626842 953582
12452 953582 1357156 1774449 2082899 2171098 2027172 1693873 1275210 890772 603714 416853
12442 416853 308867 238771 190341 175029 146493 109028 88736 79606 61228 31303 14603
12431 14603 -4782 -35589 -58848 -86332 -91948 -77898 -64011 -59717 -47610 -16453 -8352 -4008
12419 -4008 -1176 9276 22709 28420 26230 36648 61594 83692 83541 84923 79261 77234 73563 78605
12405 78605 98588 110463 105234 88455 65751 24383 -1163 -6841 -11381 -18974 -34698 -47681
12393 -47681 -74776 -96904 -97505 -86823 -65177 -56381 -47994 -49826 -54564 -51947 -43220 -9533 18627
12380 18627 28478 36862 61560 66004 70946 72450 68191 41751 14298 4560 22122 39416 45434
12367D5434K65m452Q268Q986M844J8108q419n939k5756m066N863k766q642J932
12353C3660m571p905J3403N127J1286m054J7374O922L30O870j2009j4737j9141
12340C2555r739K122j1305n374K1382L0127J8212K636p867p696k536J437L600
12327F7554N283l332j4583j3822j7515n516m384R2L053K834p948K678M22j748
12313A3068q220j7379r52R272N699q728n86l659j9773q229J1339M252O423k326
12299a9799j6680j4395J519P949N098m650O756M319J4806k687k635L770j2157
12286b8786m348m286L488j1048j2900m051O866J1029J2272l617k989J3156R872
12273a5342J7841j981j128N229j448r837O193n811M252lr869j4566k003m48J2897
$$ plain form
12367 45434 45699 41247 49515 58501 63345 81453 73034 67095 41339 37273 43136 40370 31728 33660
12353 33660 29089 21184 34587 39714 51000 46946 64320 71242 71572 78442 66433 51696 32555
12340 32555 22816 24938 13633 8259 29641 59768 77980 80616 72749 65053 62517 63954 67554
12327 67554 72837 69505 54922 41100 23585 18069 13685 13777 16830 19664 11716 14394 14816 13068
12313 13068 4848 -12531 -13483 -4211 1488 -7240 -7826 -11485 -31258 -39487 -28148 -23896 -17473 -19799
12299 -19799 -36479 -50874 -49355 -41406 -36308 -40958 -34202 -29883 -15077 -17764 -20399 -16629 -28786
12286 -28786 -33134 -37420 -33932 -44980 -57880 -61931 -55065 -44036 -31764 -35381 -38370 -25214 -15342
12273 -15342 2499 518 -610 4619 3171 -6666 -473 -6284 -2032 -2035 -11904 -26470 -28473 -28921 -16024
12258a6024R311Q544J0016r630m53L218q216o346o865P452J196J6095O511r100
12244E709j4585j5009L216O528O749P796R876j3458J100K6883N292j3148k1386
12231d437m556L342j8579j5033o978R81J4888J8379O507L686J3241L483j3419
12218A505j0448K371l762J1556K537j1640J581j0441O602J7095L272L62K58j0466
12204C82n560Q334O139K200j1071q971J25j5089j3390m292J3455Q448M843O856
12190g591J5190J7000j0375j6332j7347N237J10J409P48o811L800J820j0714r933
12176c3789q306J34N004J3731J9616l744j221M709n101o335Q139M871j1101J2887
12162e06K5185O775R254Q467J6876Q395J943J3354J8999K1547J3677M6332P2802
$$ plain form
12258 -16024 -6713 1831 11847 2217 1764 4982 -3234 -9580 -16445 -8993 -7797 8298 14809 5709
12244 5709 -8876 -23885 -20669 -14141 -7392 404 10280 -3178 -2078 24805 30097 16949 -4437
12231 -4437 -8993 -5651 -24230 -39263 -46241 -45260 -30372 -11993 -5486 -1800 11441 14924 1505
12218 1505 -8943 -6572 -10334 1222 3759 -7881 -6300 -16741 -10139 6956 10228 10590 10848 382
12204 382 -5178 3156 9295 11495 424 -8547 -8422 -23511 -36901 -41193 -27738 -19290 -14447 -7591
12190 -7591 7599 24599 14224 -2108 -19455 -14218 -14108 -12699 -11951 -18762 -14962 -13142 -23856 -33789
12176 -33789 -42095 -41961 -36957 -23226 -3610 -7354 -8575 -3866 -8967 -15302 -7163 -2292 -13393 -506
12162 -506 24679 31454 40708 49175 66051 74446 76389 89743 108742 130289 143966 190298 263100
12149B63100P8084R1551J29024J88232K65209L69625M64116N07170L90133J49050
12139B895294j67711m22749n45259n09387l99484k70273j57551r7963o3478n7617
12129B03822n2188k8202l0864k4047k425K0938J4025K462J1121M878j5738o260
12117I7522l191q030j0805k8760j8915q660q812O835J0806J1509k15K418j0971
12104C0731j618J6635L802j1717l057m933q990M514R660j363l756J373Q471J285
12090D1037j6183p222J221m13j2343n222K466j4229P235J3030M405l783p93o434
12076B772r367K711J76J032j5015K214P226L574r558L213j585J1998J0650o386
12062C655m988O570j0761m264J279J734P157O331l553q904J432R37J0811Q005
$$ plain form
12149 263100 341184 432735 561759 749991 1015200 1384825 1848941 2356111 2746244 2895294
12139 2895294 2727583 2304834 1759575 1250188 850704 580431 422880 324917 261439 203822
12129 203822 151634 123432 92568 68521 66096 87034 101059 103521 114642 119520 103782 97522
12117 97522 94331 86301 75496 46736 27821 19161 10349 17184 27990 39499 39284 41702 30731
12104 30731 29113 45748 49550 37833 34776 29843 20853 25367 35027 33664 29908 31281 39752 41037
12090 41037 24854 17632 18853 18440 6097 875 3341 -10888 -3653 9377 13782 9999 9206 2772
12076 2772 -6595 -3884 -3708 -2676 -17691 -15477 -8251 -4677 -14235 -11022 -12607 -609 10041 3655
12062 3655 -1333 5237 -5524 -9788 -8509 -6775 382 6713 3160 -5744 -4312 -3375 7436 15441
12048A5441j5214J569P126J081j3757M741R437k3221M212P03n644L038R645N924
12034E081k002j0667o482j3112J2010J2838J2321J1281K6691R868l499k284q939
12021D3105j3446j079n627Q27p37j3206P806n422l703o741j7J2191J5885k834
12007B7002n351k0457j7872j836J1930R984N25j0103j219p528m795J3918L651
11994b151J0044K085o143M776p999q203J467k472K483p117j2414j1669J944L515
11980c1854P499L255J3826j875m453j8735j4432J816P209n352m052R304m855J3084
11966b9615Q974J2167L795j3295j331k822J353R928J77N10p651q89Q669J2324
11952B294J499J2267k004l002j1440r06q477j1214M838l343q746J383J2625L909
$$ plain form
12048 15441 227 1796 8922 10003 -3754 987 10424 -12797 -8585 -7882 -13526 -10488 -843 5081
12034 5081 3079 -7588 -14070 -27182 -15172 -2334 9987 21268 47959 57827 54328 52044 43105
12021 43105 29659 28580 22953 23780 23043 9837 17643 12221 8518 1777 1760 13951 29836 27002
12007 27002 21651 1194 -16678 -18514 -6584 3400 3925 -6178 -7397 -14925 -19720 -5802 -2151
11994 -2151 7893 9978 3835 8611 612 -7591 -6124 -8596 -6113 -13230 -25644 -37313 -35369 -31854
11980 -31854 -24355 -21100 -7274 -9149 -13602 -32337 -46769 -44953 -37744 -43096 -47148 -37844 -42699 -29615
11966 -29615 -20641 -8474 -4679 -17974 -19305 -22127 -20774 -10846 -10669 -10159 -17810 -18699 -10030 2294
11952 2294 3793 16060 14056 11054 -386 -1292 -9769 -20983 -16145 -19488 -28234 -26851 -14226 -10317
11938a0317j453M27J3090O93P059n95j4780l051O961Q999j864o646J984j614p254
11923h361J3641J3777p847J462o303p380J931J2793j085j1798r403o87L270p468
11909a3458j7540R401J5054J8937J0805m037m852j0146Q795P133j2013m641J27
11896C565m586L984l586j0805L764Q607Q468Q11j1320r749J152J543Q012k009
11882b149p727j1980o337K442k249J107J432J3094R856K13l366n539J220k605
11868a2588J597J5116J2286o472j4712o602K263j0954N924k0P792J507l116K637
11854e342r179P237Q868L097r091j8406q05J2009Q486J0307j2052q088J0397q419
11840a0981n929J3726p131l275J7615R8N678O292m501j2468O097n584j1312r766
$$ plain form
11938 -10317 -11770 -11343 1747 2440 9499 8904 -5876 -8927 -1966 7033 5169 -1477 507 -1107 -8361
11923 -8361 5280 19057 11210 12672 6369 -1011 920 13713 12628 830 -8573 -9260 -5990 -13458
11909 -13458 -30998 -21597 -6543 12394 23199 19162 14310 4164 12959 20092 8079 3438 3565
11896 3565 -1021 2963 -623 -11428 -7664 943 9411 10222 -1098 -10847 -9695 -8152 -140 -2149
11882 -2149 -9876 -21856 -28193 -25751 -28000 -26893 -25461 -12367 -2511 -2298 -5664 -11203 -9983 -12588
11868 -12588 -10991 4125 16411 9939 -4773 -11375 -9112 -20066 -14142 -14162 -6370 -4863 -7979 -5342
11854 -5342 -14521 -7284 1584 4681 -4410 -22816 -23621 -11612 -3126 7181 -4871 -12959 -2562 -10981
11840 -10981 -16910 -3184 -10315 -13590 4025 4123 9801 16093 11592 -876 5221 -363 -11675 -21441
11826b1441J620N868K3849J1523q201p082k472p093o187p365N822m625j0470R567
11812a6687K4491O490o732p763j0106J76r825L995O502M259J935O005m956j3931
11798a6147j4723N562J4076j704Q182J134K982j497n499p103l74P417M49j272
11784h517K145K813O008m516p334L20Q76j791K936L085j629P729m34K606J2650
11769A6947K485j4884j6722P706m415N202J3098J530j746o745K783Q691L512p083
11755A0359Q687J054j750L146N29m891j2689J2217o598q704P9n039j1031K161
11741a2470P14Q665J562j2545q117J0574q71N093R655m895j611o133j1756j6979
11727c9114J5167J7563o136p969J8708J0125j975o575n220K603K784Q230O617
$$ plain form
11826 -21441 -19821 -13953 9896 21419 13218 6136 3664 -3429 -9616 -16981 -11159 -15784 -26254 -16687
11812 -16687 7804 14294 7562 -201 -10307 -10131 -19956 -15961 -9459 -5200 -3265 2740 -2216 -16147
11798 -16147 -30870 -25308 -11232 -12936 -4754 -3620 -638 -2135 -7634 -14737 -15111 -7694 -7245 -8517
11784 -8517 -6372 -3559 2449 -2067 -9401 -9081 -8205 -9996 -7060 -3975 -5604 2125 1691 4297 16947
11769 16947 19432 4548 -12174 -4468 -8883 -3681 9417 10947 9201 2456 5239 13930 17442 10359
11755 10359 19046 20100 18350 21496 22025 17134 4445 16662 10064 1360 1439 -3600 -14631 -12470
11741 -12470 -11756 -3091 -1529 -14074 -22191 -11617 -12488 -7395 2260 -2635 -4246 -10379 -22135 -39114
11727 -39114 -23947 -6384 -12520 -20489 -1781 8344 6369 -206 -5426 -2823 -39 8191 14808
11714A4808R002p772p893P196J179j214P083j7704m002P338m871K565R403j1748
11700C370J638J1381q362L167J2432L535j8190L688J0081J9264Q53j5227j2255
11687A5375r177o487K1954N291j2316q029K422n438j79k619j289m96j2353P423
11673e918Q093L169k784N058M560n173R051l945n918o20N164L670J423j693n238
11658H899N850n174Q46P85j5518N287N119J0286J07j878r582j5482M047J623p487
11643a2272r41N264O451P386R011m416P418j139j4869l046L548J631n575p260
11629h809J1230l424l521j184j4228j1050J628Q529R680M780o736o175L305J7525
11615A550J0267K724N326J0802l799j7543p030n850l411k555p30J658k694j0701
$$ plain form
11714 14808 23810 16038 8145 15341 16520 15306 22389 4685 683 8021 3150 5715 15118 3370
11700 3370 5008 16389 8027 11194 23626 27161 8971 12659 22740 42004 42857 27630 15375
11687 15375 6198 -289 21665 26956 14640 6611 9033 3595 3416 797 -492 -988 -13341 -5918
11673 -5918 2175 5344 2560 7618 12178 7005 16056 12111 6193 5573 10737 14407 15830 14137 8899
11658 8899 14749 9575 10421 11206 -4312 975 6094 16380 16487 14609 5027 -10455 -6408 -4785 -12272
11643 -12272 -13213 -7949 -1498 5888 14899 10483 17901 16762 1893 -1153 2395 4026 -1549 -8809
11629 -8809 2421 -1003 -4524 -5708 -19936 -30986 -29358 -20829 -11149 -6369 -13105 -19280 -15975 1550
11615 1550 11817 14541 19867 30669 26870 9327 2297 -3553 -6964 -9519 -10249 -8591 -11285 -21986
11601b1986J7695k479j1354L334J565J431o436k798Q606J2693l37j976K684O290
11587F932K14O491m674N051p203j2073j2720o450Q138N112R514m45Q971L806l036
11572G628O984o49k045M14l217n013J0799j1987l826O661K909J0286R222q270
11558A9896j1324L516k415p205J4270O369o198j0799q567p43J139J166o987Q718
11544H36p1K825j2106M71p368n517P253N410O879n613N66O80J506J187J663q968
11528a0367M751J6349L659K84K366j079m913o27j4321o598J6376K755l969R052
11514A3718N371r72o648O621n736n722L591M904P278m163j3904L255k906j349
11500C338Q430K231o752K531m351n155j9506j021J1658o62K253m567N860J0347
$$ plain form
11601 -21986 -4291 -6770 -18124 -14790 -13225 -11794 -18230 -21028 -12422 271 -66 -2042 642 6932
11587 6932 7146 13637 8963 14014 6811 -5262 -17982 -24432 -16294 -11182 -1668 -2113 6858 10664 7628
11572 7628 14612 13963 11918 12332 9115 4102 14901 2914 -912 5749 8658 18944 28166 19896
11558 19896 8572 12088 9673 2468 16738 23107 16909 6110 -2457 -3200 -2061 -895 -7882 836
11544 836 765 3590 -8516 -8045 -15413 -20930 -13677 -8267 -1388 -7001 -6435 -5755 -4249 -3062 -1399 -10367
11528 -10367 -5616 10733 14392 14676 17042 15963 11050 10423 -3898 -10496 5880 8635 4666 13718
11514 13718 19089 18117 11469 18090 12354 6632 10223 15127 22405 18242 4338 7593 4687 3338
11500 3338 11768 13999 7247 9778 5427 272 -19234 -20255 -8597 -9259 -7006 -11573 -5713 4634
11486D634p120l079J8416J7106j9823j8020j4149J913O180J630J6188L662p975
11473d37K498J52M40o622J6752O532M165n99k293q153j0961O229M413R407J26
11458B1649J775j7791N424J3695n032p718o654l667j879k57P547K3302l862j5639
11444A0893n56j3085r93m457L985L400N470N198o850N73J189J6774J0337o828
11430B5050j4318q065k017J498K730L88L035j197O452l215j3767q867M965J3035
11416E707J7967J3577q935j8333j0494Q292M887o483j0051K33J6897Q339O425
11403B8028j8241j6975p56M383j0810N469Q957R04O3Q905Q43n690q96J1123J055
11388A6362K43m667q846j5722J528R667j642N452r74L141j795j2951J271P668
$$ plain form
11486 4634 -2486 -5565 12851 29957 10134 -7886 -22035 -20122 -13942 -12312 3876 7538 -437
11473 -437 2061 2213 2653 -3969 12783 19315 23480 22881 20588 12435 1474 7703 12116 21523 21649
11458 21649 23424 5633 11057 24752 19720 12002 5348 1681 -198 -455 7092 30394 26532 10893
11444 10893 10337 -2748 -3741 -8198 -4213 -813 4657 9855 3005 3578 4767 21541 31878 25050
11430 25050 10732 2667 650 2148 4878 5266 8301 7104 13556 10341 -3426 -12293 -7328 5707
11416 5707 23674 37251 28316 9983 -511 7781 12668 6185 -3866 -3633 13264 21603 28028
11403 28028 9787 -7188 -7944 -3561 -14371 -8902 55 959 1022 9927 10770 5080 4184 15307 16362
11388 16362 16605 11938 3092 -12630 -11102 -1435 -3077 2375 1401 4542 2747 -10204 -8933 -1265
11374a265Q287j2094J895k013M065K1011q68j0219q072k840p309k053J0197l68
11360a646p446J445l337J3830J4346K135l325l182J333l626o724L618K273j0180
11346d86n058J1466q950r24M076L838k217P375J290O140l413K368J3285K630j5496
11331A5924j1689J3188l289j311J29r327R424J5694m005j2725j252k357l37O460
11317A4527L959M634k68j4027j9989m393Q889K688J4159J7553J833O207q20l948
11303C1004l497k0080k706p696k877L428J013J48o969J7798J3986j0926k2655
11290a0029l183N143L69P768R813o361q07o642J9145M884k767m710j0534n214
11276c125J1978R057o726Q5j5986n943J2425J6214N809m172q923l061K99l283
$$ plain form
11374 -1265 7022 -5072 -3177 -5190 -1125 19886 19018 8799 727 -2113 -9422 -11475 -1278 -1646
11360 -1646 -9092 -7647 -10984 2846 17192 19327 16002 12820 14153 10527 3803 7421 9694 -486
11346 -486 -5544 5922 -3028 -3952 124 3962 1745 9120 10410 16550 13137 15505 28790 31420 15924
11331 15924 4235 17423 14134 12823 12952 3625 13049 28743 24738 12013 10761 8404 8067 14527
11317 14527 18486 23120 22852 8825 -11164 -15557 -6668 -3980 10179 27732 29565 35772 34952 31004
11303 31004 27507 7427 4721 -2975 -5852 -2424 -1411 -1263 -8232 9566 23552 12626 -10029
11290 -10029 -13212 -8069 -7700 68 9881 3520 2713 -3929 15216 20100 17333 12623 2089 -3125
11276 -3125 8853 17910 11184 11269 -4717 -10660 1765 17979 23788 19616 10693 7632 7931 4648
11262D648k047L146k523N082O295Q832K402j2802J022J0616J724M815j8131m241
11248H838l488k122k161p925O329P372R294K173L538P554k120l059m879q999J4389
11233B4734J1794J302L197j6910k1094j243O444j300J6059K629j193J827n453
11220B0793j220L039r709O04o889l754M107j073m78M032m390K292j251j0695L534
11205a058J401l117P278M315j0742j497j712O769M296o73j621J5801J9576o517
11191C2499j9039j1870J347j5649J7236N036M187j626J7131O422n105M632k495
11178C2706q155r678j5927o649j948J745P908R621O246k380n126q313P10K0843
11164B1603q60j3569O069O282J4300J2921j3094q81j481j875j1965k744N438O801
$$ plain form
11262 4648 2601 5747 3224 8306 14601 23433 25835 13033 14055 24671 26395 31210 13079 8838
11248 8838 5350 3228 1067 -6858 -529 6843 16137 18310 21848 29402 27282 24223 19344 10345 24734
11233 24734 36528 37830 41027 24117 3023 1780 8224 6924 22983 25612 24419 26246 20793
11220 20793 19573 22612 12903 13507 6618 2864 6971 5898 5420 9452 5062 7354 6103 -4592 -1058
11205 -1058 343 -2774 4504 8819 -1923 -3420 -5132 1637 5933 5260 3639 19440 39016 32499
11191 32499 13460 1590 2937 -12712 4524 9560 13747 12121 29252 35674 30569 35201 32706
11178 32706 24551 14873 -1054 -7703 -9651 -7906 2 9623 15869 13489 8363 50 760 21603
11164 21603 20743 7174 13243 19525 33825 46746 33652 32771 31290 29415 17450 14706 20144 26945
11150B6945R103j514j4613j3335J518k370j3354o855m287M153J2132j2295R181
11137e591J1720J0809J0226j1535j0218R203M739K898j4401p890O92k5J5827L725
11123B0179Q261K135M333j1871j371j2389k694L274j405K341M36J172L530j0297
11109E634j0943j5709r596J7945J5611L047K487k134M909M122o741k089K111K373
11095A1027L802J1080mJ1836j1763p764j1361J4140P321m276j241R959r551j2257
11081A0948m440j2109j454P289N102P404N83J2219j4068O069N213j313j7253k346
11067A844o297P609J1125j225l640J5369N014j6376J4603k057J34P491k07N395
11053C8782n910o329P362j917r817L065R244j081l026q269K216M494p859q302
$$ plain form
11150 26945 36048 34534 19921 6586 8104 5734 -7620 -14475 -18762 -14609 -2477 -14772 -5591
11137 -5591 6129 16938 27164 15629 5411 14614 19353 22251 7850 -40 652 627 16454 20179
11123 20179 28440 30575 34908 23037 21666 9277 6583 9857 8452 10793 11229 12401 15931 5634
11109 5634 -5309 -21018 -30614 -12669 2942 5989 8476 6342 11251 15373 8632 6543 8654 11027
11095 11027 14829 25909 25905 37741 25978 18214 6853 20993 28314 24038 22797 32756 23205 10948
11081 10948 6508 -5601 -7055 234 5336 12740 13323 25542 11474 17543 22756 21443 4190 1844
11067 1844 -4453 3156 14281 13056 9416 24785 29799 13423 28026 25969 26103 33594 33387 38782
11053 38782 32872 26543 33905 31988 22171 25236 34480 33399 30373 22104 24320 28814 20955 12653
11039A2653N03l550L989M980j8829M2O952N217P603R023Q723P331K174j6176o195
11024B4440P935N827j0093j2929m090K362P805l22N69J1236P688K733j6924m357
11010B1880O439n43n838M228r645l469Q786R643j4p117r445j1089O393M637J145
10995A5991r351m078M281j951q723R674P992o846j684O290J9955Q380k36l526
10981C6168l464j443N963J0429j0648m922J1970j303p643L611n738N154M62L354
10967D1950k158o524r265p829J1135P902j922K769q899O176J0388p414j5089n955
10953A5265J8184Q861R31j2001R59o485o293p42L755M459K497R488j0656o590
10939B1632q194r668R368M8r65m193Q354J3292J0568o066N753K486j0511j2520
$$ plain form
11039 12653 13156 9606 13595 18575 -254 -212 6740 11957 19560 28583 37306 44637 46811 30635 24440
11024 24440 32375 38202 28109 15180 11090 13452 21257 20935 21504 32740 40428 43161 26237 21880
11010 21880 28319 27776 21938 26166 16521 13052 21838 31481 31467 24350 14905 3816 10209 14846 15991
10995 15991 6640 2562 6843 4892 -3831 5843 13835 6989 5305 11595 31550 39930 39694 36168
10981 36168 32704 31261 37224 47653 37005 32083 44053 42750 35107 38718 32980 38134 38596 41950
10967 41950 39792 33268 24003 16174 27309 35211 33289 36058 27159 33335 43723 36309 21220 15265
10953 15265 33449 42310 43241 31240 32199 25714 19421 18679 22434 26893 29390 38878 28222 21632
10939 21632 13438 3770 13138 13186 12221 8028 16382 29674 40242 34176 39929 42415 31904 19384
10925A9384p332J6337P81p338N996P718j1890N811J5182M276P857k489j2284j4581
10911B7428K115K354N165o058j7179o731J2219R144m89J1266o347k7482j4892
10898i487K357J8231M851J824P178J1598K17k756p373j921Q076P631j0675R769
10884C9520N411k456q052q998k282Q560p605N22P901J4478p74j724n042r706l123
10869B6630N150p404J413J490m173o306K821K753m050J1260K24o036K341J7415
10855D3528O140n97l708L071k431L652o460j8485j3105j0356J5425J6460N170
10842C8304l143n638P526O391q885N923j0000o692J82l053L508J4273J3398j1215
10828D0879q77Q099j165P95K873j0171n783N272R951O535j544n067m387l008m826
$$ plain form
10925 19384 12052 28389 29170 21832 27828 35546 23656 29467 44649 48925 56782 54293 42009 27428
10911 27428 29543 31897 37062 31004 13825 7094 19313 28457 27968 39234 32887 5405 -9487
10898 -9487 -7130 11101 15952 17776 24954 36552 36769 34013 26640 24719 32795 40426 29751 39520
10884 39520 44931 42475 34423 25425 23143 31703 24098 24620 32521 46999 46225 44501 39459 29753 26630
10869 26630 31780 24376 25789 27279 23106 16800 19621 22374 18324 29584 29808 23772 26113 43528
10855 43528 49668 49071 45363 48434 46003 49655 43195 24710 11605 1249 16674 33134 38304
10842 38304 35161 29523 37049 43440 34555 40478 30478 23786 23968 20915 24423 38696 52094 40879
10828 40879 40002 48101 46936 47731 50604 40433 34650 39922 49873 56408 54864 49797 45410 42402 37576
10813C7576P099N609j3722j4607M895J6856K382r967j2478N124M531o543J8013
10800D4768J7239k198N311n865P718O613j4807j2648l607J2626j149k4143P851
10787C7709k671j2982M892M791J1628n718q894q621R168K3213k643r949O060p12
10773D5271M195r673j3241Q011N116J603m458j352J6433M806k32j963k627j4465
10759C7424k0963l53N937J1944R025L859n260m93J2576L910p36L428L023J578
10745F4899k5570k360Q548l196J423k119P020P400l847j2497j5262M573J0870
10732C9882O897k417n832J2181O507M54j0234k688J697m956M599M795j114J677
10718E1448l251J0474P855j9933m568O289O301P044o873J3301J0357j6955j6205
$$ plain form
10813 37576 44675 50284 36562 21955 26850 43706 46088 36121 23643 28767 33298 26755 44768
10800 44768 62007 59809 65120 59255 66973 73586 58779 46131 42524 55150 54001 29858 37709
10787 37709 35038 22056 26948 31739 43367 37649 28755 20134 29302 52515 49872 39923 45983 45271
10773 45271 49466 39793 26552 34563 39679 41282 36824 35472 51905 56711 56479 54516 51889 37424
10759 37424 16461 16108 22045 33989 43014 46873 41613 41120 53696 57606 56870 60298 63321 64899
10745 64899 39329 36969 45517 42321 43744 41625 48645 56045 52198 39701 24439 29012 39882
10732 39882 46779 44362 38530 50711 57218 57672 47438 44750 46447 41491 46090 50885 49771 51448
10718 51448 48197 58671 66526 46593 42025 48314 54615 61659 54786 68087 78444 61489 45284
10705D5284j374j848J3612J2236J3867O828j9717l601N367m044r931q112o539
10692D2028m750J8503K3074J550J685J490k610q195M510p28J2205O542n500N864
10678I5668l774l170o525j0806j6709q148q485k394j509O070Q45l279N663n168
10664C8279l089r406J0783N433J4175K108j3370j5939j1525Q882l534N744l181
10651B5360o639J0655R738j3243j2937J3843L644O896K186Q172j2357j8526o306
10638A0486q699j734J8429J2108Q284K2341M2238M431J257m925q078O423j0908
10625I1653J400p62P426P157q584R16J0594J9062N732j4523Q097R522L407j0833
10611A30264o849L944o584M535R274j6774o590K229L353J1089J1000M391p696
$$ plain form
10705 45284 43910 42062 55674 67910 81777 88605 68888 65287 70654 66610 56679 48567 42028
10692 42028 37278 55781 78855 80405 82090 83580 80970 72775 77285 76557 88762 95304 89804 95668
10678 95668 91894 88724 82199 71393 54684 46536 38051 35657 34148 40218 41063 37784 43447 38279
10664 38279 35190 25784 36567 42000 56175 58283 44913 28974 17449 26331 22797 28541 25360
10651 25360 18721 29376 39114 25871 12934 26777 30421 37317 39503 47675 35318 16792 10486
10638 10486 1787 53 18482 30590 38874 61215 103453 107884 109141 104216 96138 102561 91653
10625 91653 93053 92291 99717 106874 98290 99206 109800 128862 134594 120071 128168 137690 141097 130264
10611 130264 123415 127359 120775 125310 134584 117810 111220 113449 116802 127891 138891 143282 135586
10598A35586J0102O10O429K2480J6154L621K511J2628J5525K7071M8072M6457
10586C47246M5035N7271N4530Q7901J47298K12576L13801M57302N83237N81130
10576B887327L39356o3795m50609o41023o18190m51217k87750j90153j15540p6819
10566C31587m8745k0157k8667k4377j5174j6892j3665p427m796j4750o336N330
10554A35931L241j0523j3714j9177k5276k7981j8779P692K8434K0174K3221J0192
10542A13435K5041L0069K0963N297p459q535k762L463j3165k3841N059O558q233
10529A45890Q550J543j0684o407p732k312Q028J091r225p993o042L322J5917O869
10515A40815k641k239K95O789J0815K122P856q801J1274J0021P739L682P867J4308
$$ plain form
10598 135586 145688 146298 152727 175207 191361 194982 197493 210121 225646 252717 300789 347246
10586 347246 392281 449552 504082 591983 739281 951857 1265658 1722960 2306197 2887327
10576 2887327 3226683 3162888 2712279 2071256 1453066 1001849 714099 523946 408406 331587
10566 331587 282842 262685 234018 209641 194467 177575 163910 156483 151687 136937 130601 135931
10554 135931 139172 128649 114935 95758 70482 42501 23722 31414 59848 80022 103243 113435
10542 113435 138476 168545 189508 194805 187346 178811 176049 179512 166347 142506 147565 154123 145890
10529 145890 154440 155983 145299 138892 131160 128848 136876 137967 128742 120749 114707 118029 133946 140815
10515 140815 138174 135935 136230 143019 153834 155956 163812 155011 166285 176306 184045 187727 195594 209902
10501B09902P048L132k47K3904K8920L0501L5909M4849L9568M4161O2663Q1392
10489F11702J16076J68728K52847L58155M66681N12976M30034J80534j34422l97078
10479B566233n31941n07383m13599k81324j80282j01177n7918n5423m5283l6977
10469C54926j7511l0121l2298k5199j844M152P990O064q910k2739j4727j5232
10457B04551m283R823J1306K037o690L115O738j8748N99j473l616M670Q605j324
10443B15310r039J5723l753q344l321N646J4540J1587P593m73j4531j1462p458
10430B12018O458K0760O1758P3417J04704J03374N3095m091p6697j09207q4370
10419C61219m9406m0787l3309l3466j2347j9553j3875j847K458k776J8480J7856
$$ plain form
10501 209902 216950 220082 219835 243739 272659 303160 339069 383918 423486 467647 530310 611702
10489 611702 727778 896506 1149353 1507508 1974189 2487165 2917199 3097733 2963311 2566233
10479 2566233 2034292 1526909 1113310 831986 651704 550527 492609 437186 391903 354926
10469 354926 337415 307294 274996 249797 247953 252105 260095 266159 257249 234510 219783 204551
10457 204551 200268 210091 221397 223434 216744 219859 226597 207849 208448 206975 203359 208029 216634 215310
10443 215310 206271 221994 218241 209897 206576 212222 226762 238349 245942 245469 230938 219476 212018
10430 212018 218476 239236 300994 374411 479115 582489 635584 631493 554796 445589 361219
10419 361219 311813 271026 237717 204251 191904 172351 158476 156629 159087 156311 174791 192647
10407A92647N690J3037Q228L788r664p121j1181m84P297j8743k3539n351J99r
10393A54794J3941M558K3090K7511L4867P868m590O860J1784m580k8900n461P36
10380B42478j1172q429m11J1788J3350J5166K1864L6677L2902K6952J274j4731
10368C67708P107J493J0887R21J719k017k4469j9781O354O27r498P661l880l3787
10354C11045l6898k0923o684m025k784R26P838J9913J5713J7323J4177M223O286
10341C26130J7833L5978N8321N8965Q4714R6976R0312O4146N818k1064m6642n3765
10329G17722m8831m2726m6798m9236o0267m0448n627k173Q893K2560j0667j4396
10317D28006N538N900R008J8709J7904L0862K7725J6020K5671L8185L2584L7677
$$ plain form
10407 192647 198337 211374 219602 223390 213726 206605 195424 194940 202237 183494 159955 154604 154803 154794
10393 154794 168735 173293 196383 223894 258761 266629 262039 268899 280683 276103 247203 241742 242478
10380 242478 231306 222877 222466 234254 247604 262770 284634 321311 354213 381165 382439 367708
10368 367708 374815 376308 387195 388116 389835 387818 363349 343568 349922 350549 341051 348712 344832 311045
10354 311045 274147 253224 246540 242515 239731 240657 248495 268408 284121 301444 315621 319844 326130
10341 326130 343963 379941 438262 497227 581941 678917 769229 833375 839193 818129 771487 717722
10329 717722 668891 626165 579367 530131 469864 429416 423789 421616 430509 453069 442402 428006
10317 428006 433544 439444 448452 467161 485065 515927 543652 559672 585343 623528 656112 693789
10305F93789L6360L6544M4328M3804N5658M9525j0259j23516k02279k01751j56031
10294B66172r0568k4558J0194K994J7998K5764L0757N3109M9112J7717L1966J5581
10282D06238K2407L7459M2906K9087K9607L6110R626n2L816j5440l1013p737N361
10269E68375P158o771k1596k7173k3227j153n913L517K6668J4732r261N446J2878
10256E43680K1364K3783L0036L8002M5916L7871L3109M3664M1106L1956J2062
10245I02549K8033M1622M4019N7889M4099M0215R822J719k642r577j5581j5026
10233A127141J0577M6702O4097N1415N0278M8808L6073L1491N1068P1710P0143
10222A659503P0906R0714Q3471P7966P7710O3266O2579P2009J17412J67115K12587
$$ plain form
10305 693789 730149 766693 811021 854825 910483 960008 949749 826233 623954 422203 266172
10294 266172 175604 151046 161240 164234 182232 207996 238753 291862 340974 358691 390657 406238
10282 406238 428645 466104 509010 538097 567704 603814 613440 613388 617204 601764 570751 563014 568375
10269 568375 575533 568762 547166 519993 496766 495613 489700 493217 519885 534617 525356 530802 543680
10256 543680 565044 588827 618863 656865 702781 740652 773761 817425 858531 890487 902549
10245 902549 930582 972204 1016223 1074112 1118211 1158426 1168248 1169967 1167325 1157748 1142167 1127141
10233 1127141 1137718 1184420 1248517 1299932 1350210 1399018 1435091 1466582 1517650 1589360 1659503
10222 1659503 1730409 1821123 1904594 1982560 2060270 2123536 2186115 2258124 2375536 2542651 2755238
10211B755238K26136K18913J51745P0114J8487R445K8537P8192J45757K24393
10201C926957K95006L75952M41237N18843O15686P32649R14548J133774J321862
10192A0276514J361612J234650R98471R05534J149326J769888K592440L398219
10184B3686654M162903N098887O413447Q335021J0812052J3819766J7890509K4484108
10176A14703347L6006652N5026345Q0885444J04121002J05697070O9844646K001121
10169E68285627o9637675j12882826j14603879q8174096n7040884l4543175k1422037
10162F9981055j4076325r684828o826235m907814l714225l119397k920158k785672
10154B1946401k500360j980411j374311r04356o62455p24030j005771j296976
$$ plain form
10211 2755238 2981374 3200287 3352032 3422146 3440633 3450078 3478615 3556807 3702564 3926957
10201 3926957 4221963 4597915 5039152 5557995 6173681 6906330 7820878 8954652 10276514
10192 10276514 11638126 12872776 13871247 14776781 15926107 17695995 20288435 23686654
10184 23686654 27849557 32948444 39361891 47696912 58508964 72328730 90219239 114703347
10176 114703347 150709999 205736344 286621788 390742790 496439860 566284506 568285627
10169 568285627 498647952 385765126 271161247 182987151 125946267 91403092 69981055
10162 69981055 55904730 46219902 39393667 34485853 30771628 27652231 24732073 21946401
10154 21946401 19446041 17465630 16091319 15186963 14524508 13800478 12794707 11497731
10146A1497731j387356j251177r73705p39627n56088m57907l86149l40810k97078
10137E107834k82848k44312j88293j53151j12380q4313n6332m6848o3109o2872
10127C813376p5833p9279r0418q9992m4565Q237P5580J17741J11471J20554J38211
10116D005083J34129J30981J36607J75139K03786K58304L28156M10872M95178
10107F278235N77356P18147R05182J094552J234662J279884J206753J140273J219846
10098A5654890J472678J939953K587986L374338M287396N339104O608975Q289979
10090D9555299J0559466J3718331J8448189K6092656L8443435N6364433P6855989
10083B90037798R0941304Q6481623N6455404O425072m7345771q6065011r8611741
$$ plain form
10146 11497731 10110375 8859198 7885493 7145866 6589778 6131871 5745722 5404912 5107834
10137 5107834 4824986 4580674 4392381 4239230 4126850 4042537 3986205 3939357 3876248 3813376
10127 3813376 3737543 3658264 3567846 3477854 3433289 3441526 3517106 3634847 3746318 3866872 4005083
10116 4005083 4139212 4270193 4406800 4581939 4785725 5044029 5372185 5783057 6278235
10107 6278235 6855591 7573738 8478920 9573472 10808134 12088018 13294771 14435044 15654890
10098 15654890 17127568 19067521 21655507 25029845 29317241 34656345 41265320 49555299
10090 49555299 60114765 73833096 92281285 118373941 156817376 213181809 290037798
10083 290037798 380979102 467460725 523916129 530341201 482995430 396930419 298318678
10076B98318678q7418829o4465204m2154527k6221759j6572298j1000586p672228
10069D2813247n648130m460599l775175l352126k981142k556487k041237j516374
10061A6481977j066645q13401p67547r02339j100987j224162j192451j042991
10053H371454q25102o56973n24715m42881l91827l62492l49712l56357l49909
10044D111486l79831l62914k81753k00458j17010q0797q2384q8090j09731r6845
10034B311673j24330j30599j29991j06166r7162p6232n7407n2956k9179m2413
10024A465238o0977n3790n3418l8574l5131l1762l6792m8371p0599p3860o2986
10013H98978m6110m1537k3685j8360o296J445Q66j4595R06Q14q754L135J2244
$$ plain form
10076 298318678 210899849 146434645 104280118 78058359 61486061 50485475 42813247
10069 42813247 37165117 32704518 28929343 25577217 22596075 20039588 17998351 16481977
10061 16481977 15415332 14601931 13834384 12932045 11831058 10606896 9414445 8371454
10053 8371454 7546352 6889379 6364664 5921783 5529956 5167464 4817752 4461395 4111486
10044 4111486 3731655 3368741 3086988 2886530 2769520 2688723 2606339 2518249 2408518 2311673
10034 2311673 2187343 2056744 1926753 1820587 1723425 1647193 1589786 1536830 1507651 1465238
10024 1465238 1404261 1350471 1297053 1258479 1223348 1191586 1154794 1106423 1035824 961964 898978
10013 898978 852868 811331 787646 769286 762990 764435 765301 750706 751612 752426 743672 746807 759051
10000G59051q087K596J551j1841j3697j933j057O940N087M09p521j5412k6788
9987F89298m5962o4059m0003l3533k7804q444m495k4386l6297l3347k4413j2530
9975C34025J6476K4537K0432r7Q189R662K4100L1506L0929K5534M1364K2738K8674
9962F18069M2002L1926J6398R452l872j1611n8137j12521j47880j43285j17353
9951A23188o9571j3676L341K6997K9858L4666N599j1124J989m575j0662j756P577
9938A21851J4458K0396K1112Q76j7540M819K661j686J758j3523j1715k2535l2725
9925H8207l6774j6489o443M355J4780K2001L7312K3054Q194J18k704J8193J1808
9912A65612L596J2332L041p967k1869p802m086Q630J5659R049J3071l781m142
$$ plain form
10000 759051 750964 753560 755111 743270 729573 727640 726583 733523 738610 739019 731498 716086 689298
9987 689298 643336 579277 539274 505741 477937 469493 464998 440612 404315 370968 346555 334025
9975 334025 350501 375038 395470 395373 403562 413224 437324 468830 499759 525293 566657 589395 618069
9962 618069 660071 691997 708395 717847 713975 702364 644227 531706 383826 240541 123188
9951 123188 53617 39941 43282 70279 100137 134803 140402 129278 131267 126692 116030 114274 121851
9938 121851 136309 156705 177817 178693 161153 165972 168633 166947 168705 155182 143467 120932 88207
9925 88207 51433 34944 28501 32856 47636 69637 106949 130003 138197 138315 135611 153804 165612
9912 165612 169208 181540 184581 176614 154745 146943 142857 151487 167146 176195 189266 185485 181343
9899A81343j2389k686j3914l1305k5886l1462j5754k97K994j5984j8065q656j4019
9886f080q595M07P146O7j769o164Q951N76J5426R506J9510K3272L0648J1469p681
9871I6689q259K222P306k5195j0263M11n459N853J9207K9277J2209O254L681J9855
9857A53788N833j5564k0250o014o488j2540j0913n945j1873L85P933R049L000
9844I0401N99P723J4476K1306N538j7391j0672J255J748P065k785K705j118P788
9830A28638J1172n636J6488N236j0021k1578j3434J9574P665j085k242j7327j9430
9817I8020k5841k6438J141K155o282j0582q936N91j424J713k0587Q052J567k685
9803A0464j1532J4368J5534L289P318J1686P959n869j2617P280J2765n820N030
$$ plain form
9899 181343 168954 166268 152354 121049 95163 63701 47947 47650 50644 34660 16595 7939 -6080
9886 -6080 -14675 -14268 -7122 -7055 -8824 -14988 -6037 -5461 9965 19471 38981 62253 92901 104370 96689
9871 96689 88430 90652 97958 72763 62500 62911 57452 63305 82512 111789 123998 130252 133933 153788
9857 153788 159621 144057 123807 117793 111305 98765 87852 81907 70034 70419 78352 87401 90401
9844 90401 91000 98723 113199 134505 140043 122652 111980 113235 114983 122048 119263 121968 120850 128638
9830 128638 139810 134174 150662 155898 145877 124299 110865 130439 138104 137019 134777 117450 98020
9817 98020 72179 45741 46882 49037 42755 32173 23237 23828 22404 24117 3530 11582 13149 10464
9803 10464 -1068 13300 28834 32123 39441 51127 59086 53217 40600 47880 60645 54825 59855
9790E9855P202J013k4446j200J2001Q168j0866p30J4094N79m060Q365n847l237
9776F0891R571J1317R433K9627L7735M3905N0903O2793P9201J01814J46999J92690
9764H36879K82700M39449N89596O02125L66087k0235m29485o48468o12145m54247
9754I52256k91417j75911j03308n5205l5915m0241m3562k7484k0104p239j3310
9743A38560j6051p374k1848j494j856l074M284M624n186j7761j3529n124j3287
9730D0884j2097P118J1927j6063q218j4135n153N818m523j1211l914K928L207
9717c432K580L723k61q820j0399j3485R163L4690K9144L1350M0550K6009J1264
9704A52076j7253j4413L194m956j0056l590r405m959O902K3379J5315J4075J4793
$$ plain form
9790 59855 67057 68070 43624 42424 54425 62593 51727 50997 65091 65670 61610 69975 64128 60891
9776 60891 70462 81779 91212 120839 158574 202479 253382 316175 395376 497190 644189 836879
9764 836879 1119579 1559028 2148624 2750749 3116836 3096601 2667116 2018648 1406503 952256
9754 952256 660839 484928 381620 326415 290500 250259 206697 179213 159109 151870 138560
9743 138560 122509 115135 93287 91793 89937 86863 91147 95771 90585 72824 59295 54171 40884
9730 40884 28787 35905 47832 31769 23551 9416 4263 10081 5558 -5653 -9567 -6639 -3432
9717 -3432 -852 2871 2610 -6210 -16609 -30094 -20931 13759 42903 74253 114803 140812 152076
9704 152076 134823 120410 123604 118648 108592 105002 95597 90638 97540 120919 136234 150309 165102
9691A65102l546K148J7110J2418K9153K6196K7712K9191M2341N9964Q1635J19192
9679F08616J80096K83810L92342M72582M91307L87247J29264j73989m30376n37944
9669A802955n03980l90042k66858j64713j02421n5982l5251m3243k5614q037j8465
9658A88349j0822l749o638j1499q169l364k0588j6618J0799K599L487l733J1821
9645A31875q105p670K080O680L815M107j5483L399N727J7594R998K1779K1330
9632A97126K003J6728K2435K1583L9075K7134J7386L8620M1983M3788P2950P8745
9620F19556J16036J42513J68317J92490K33926K66644L11956L69032M43698M82254
9610C346422M81459M30514K55428j2225k86218m79687n62277n39904m56955l56346
$$ plain form
9691 165102 161556 163704 180814 193232 222385 248581 276293 305484 347825 407789 489424 608616
9679 608616 788712 1072522 1464864 1937446 2428753 2816000 2945264 2771275 2340899 1802955
9669 1802955 1298975 908933 642075 477362 374941 318959 283708 240465 214851 206814 188349
9658 188349 177527 173778 167140 155641 147472 144108 123520 106902 117701 120300 123787 120054 131875
9645 131875 123770 116100 118180 124860 128675 132782 117299 120698 126425 144019 154017 175796 197126
9632 197126 199129 215857 238292 259875 298950 326084 343470 382090 424073 467861 540811 619556
9620 619556 735592 878105 1046422 1238912 1472838 1739482 2051438 2420470 2864168 3346422
9610 3346422 3827881 4258395 4513823 4501598 4215380 3735693 3173416 2633512 2176557 1820211
9600A820211k86614k32178j91567j65661j12820q4641p4578p8577o2619n2282
9590D78674n0472m5320k1772j5499k2427k4044k7929j2853k1121l6528k0232k1573
9578A58904k030j813j2121j2874j4929j2221N824j0514j6994j010j6552l254n416
9565E5000J2782J7202m577K10j2380o26K61o676p142o016o348K541J5695K335
9551F2261k632k652k585N549j2761k0727l510K6122J2072m583p855p403m231K394
9537C9459J4556J5446p845m024n730l183j1581j4418O241j4341L084M439p019
9524A5084L392P410l896r680L437P377N769Q950n47j0755j6928J1M393l394J894
9509A2517P524P616L464N475k326K887l246j8295R72n465k475J9404R861k648
$$ plain form
9600 1820211 1533597 1301419 1109852 944191 831371 746730 672152 593575 530956 478674
9590 478674 428202 382882 361110 345611 323184 299140 271211 258358 237237 200709 180477 158904
9578 158904 156874 155061 142940 130066 115137 102916 108740 98226 81232 80222 63670 60416 55000
9565 55000 67782 84984 80407 80617 68237 67611 67872 61196 54054 48038 41690 44231 59926 62261
9551 62261 59629 56977 54392 59941 47180 26453 22943 49065 61137 56554 48699 41296 37065 39459
9537 39459 54015 69461 61616 57592 51862 48679 37098 22680 28921 14580 17664 22103 15084
9524 15084 18476 25886 21990 12310 15747 23124 28893 37843 37296 26541 9613 9624 14017 10623 12517
9509 12517 20041 27657 31121 36596 34270 37157 33911 15616 16588 11123 8648 28052 37913 35265
9495C5265k146m541O370L570j3983j3400K708o88m125q393L500Q446r698o50O500
9480H735M258R75P304q986o098L229J2535r252L5J1419j4025k600R874k78K064
9465A9189L312k841m464m527L176J697J2826J7650j2086j5407j432L775M137M493
9451B9498n929r442q009j1590J015J5689Q324j872p882K346M205k207n894J304
9437I556l256L914r74J7953l082j147Q5j0074k100j059q488N880P119m170n365
9422D792Q358o646L063O481l772l58k348j6412m752J3933J4603j0857R417J2397
9408B7899J520q187j0938m841M36n111j0612o257R537P004j2611K267O982N366
9394B454j8996k042Q699O831O710J201M933k502m645N676j2527o052Q90O306m315
$$ plain form
9495 35265 33119 28578 34948 38518 24535 11135 13843 13155 9030 637 4137 12583 2885 2235 8735
9480 8735 12993 13968 21272 12286 6188 9417 21952 12700 12735 24154 10129 7529 17403 17125 19189
9465 19189 22501 19660 15196 10669 13845 15542 28368 46018 33932 18525 17093 20868 25005 29498
9451 29498 23569 14127 6118 -5472 -4457 11232 19556 17684 9802 12148 16353 14146 8252 9556
9437 9556 6300 10214 9240 27193 24111 22964 23049 12975 10875 9816 1328 7208 14327 10157 4792
9422 4792 13150 6504 9567 16048 12276 11918 9570 -6842 -11594 2339 16942 6085 15502 27899
9408 27899 29419 21232 10294 5453 5889 778 -9834 -16091 -6554 450 -12161 -9894 -2912 2454
9394 2454 -16542 -18584 -9885 -3054 3656 4857 9790 7288 2643 8319 -4208 -10260 -9370 -3064 -7379
9379g379k420m826r71L584j2823R149J6632n236j9431J18K654o593N622J2453
9365i467J0623K715j3322j0132p70J578j7129J0021K3059m93j0320J4750P720
9352H833J0745L507q844l556j406J651J1296p256j0706q697N609m577L180M009
9338C788M732o743q828R906J114l042l268k226K495M339k619k423o191O456p634
9323a0144j891N028N288p902K244m017p498j289j2079j5370P023Q771J6918M491
9309a0427M626p093q355K003N546l569J3238J3137q701j0286j0764N262M868j19
9295a0634O489p560p628Q189r580n460P805J736o637p831p018L964O046J1723
9281a6396K781m303o741J0339R945J814j0157Q43L936k402O531J1446J0279n178
$$ plain form
9379 -7379 -9799 -14625 -15596 -12012 -24835 -15686 946 -4290 -23721 -23603 -20949 -27542 -21920 -9467
9365 -9467 1156 3871 -9451 -19583 -20353 -18775 -35904 -25883 -2824 -3317 -13637 1113 8833
9352 8833 19578 23085 14241 10685 9279 10930 22226 14970 4264 -4433 1176 -3401 -221 3788
9338 3788 8520 1777 -7051 2855 3969 927 -2341 -4567 -2072 2267 -352 -2775 -8966 -2510 -10144
9323 -10144 -12035 -7007 -1719 -9621 -7377 -11394 -18892 -20181 -32260 -47630 -40607 -31836 -14918 -10427
9309 -10427 -5801 -12894 -21249 -19246 -13700 -17269 -4031 9106 405 -9881 -20645 -15383 -10515 -10634
9295 -10634 -4145 -11705 -19333 -11144 -20724 -26184 -18379 -16643 -23280 -31111 -38129 -34165 -28119 -16396
9281 -16396 -13615 -17918 -24659 -14320 -4375 -2561 -12718 -11875 -7939 -10341 -3810 7636 17915 12737
9267A2737j5574j55m299J4855M624j1119K247k790l768J063P526P44M472N277
9253A5840j787p354j4949O908L088j1731q878K527Q464O608R950J163J559J842
9239A3250m481K509l94n467j5571n321j393n657L71J0006L598L210J0373K449
9225G482r829k0661j0588K524J9832J5131M804k6369j2039P475K589J2523j292
9212h418p287J3262J8266k1935j4448J358J6890Q153J3410K17j1182j5607j2950
9199b0271R136J1529O277j1607m804m249j530j7924M037N405J3966P555l790J646
9185d624J1424l312j7550m201q380n520J4706P830L029k094P748M105j5179r554
9171b1572n248O490J4425J0965J2173j3137j6310j0570J060O934L351j5841n512
$$ plain form
9267 12737 -2837 -2992 -7291 7564 12188 1069 3316 526 -3242 -2179 5347 6091 10563 15840
9253 15840 14053 6699 -8250 -1342 1746 -9985 -18863 -16336 -7872 -1264 8686 9849 11408 13250
9239 13250 8769 11278 10884 5417 -10154 -15475 -16868 -22525 -22154 -12148 -8550 -5340 5033 7482
9225 7482 -2347 -23008 -33596 -31072 -11240 3891 8695 -17674 -29713 -22238 -19649 -7126 -8418
9212 -8418 -15705 -2443 15823 -6112 -20560 -19202 -2312 5841 19251 19468 8286 -7321 -20271
9199 -20271 -11135 394 6671 -4936 -9740 -13989 -15519 -33443 -29406 -24001 -10035 -2480 -6270 -4624
9185 -4624 6800 3488 -14062 -18263 -26643 -32163 -17457 -9627 -6598 -8692 -944 3161 -12018 -21572
9171 -21572 -26820 -20330 -5905 5060 17233 4096 -12214 -22784 -21724 -14790 -11439 -27280 -32792
9158c2792P967J9634J7963j2305n655l662l262j2161o947R88l935J0365Q056J8821
9144C075J704j3376j3735L213J2228K472J203m159L65L358k005R66o798j4170
9130b5659j1360N948J6904O818J0097O375k773l710K712j8019j6559n397J8644
9117a5979J4520O657O549m100M732r984j4602m975J607m486K910p538j1929n11
9103c7129J8681J8459j4023n599O992k004J1151J5326m744J2973m094p493m413
9090D083q039p447Q89J1810j592n75Q279o73j3827k2660r510o08K0694J6832l157
9075e501r801j3874J2645R697j1120J5513K023j762K999n330k35k8O457l526J830
9060a3M911J1609O150k0126l611k272J611J6695o509j9613j2850L449Q261M423
$$ plain form
9158 -32792 -24825 -5191 12772 467 -5188 -8850 -12112 -24273 -31220 -30232 -34167 -23802 -15746 3075
9144 3075 4779 -8597 -22332 -19119 -6891 -4419 -3216 -7375 -7010 -3652 -5657 -4691 -11489 -25659
9130 -25659 -37019 -31071 -14167 -7349 2748 9123 6350 2640 5352 -12667 -29226 -34623 -15979
9117 -15979 -1459 5198 11747 7647 12379 2395 -12207 -17182 -15575 -20061 -17151 -24689 -36618 -37129
9103 -37129 -18448 11 -14012 -19611 -12619 -14623 -3472 11854 7110 20083 15989 8496 4083
9090 4083 -3956 -11403 -10514 1296 -296 -871 7408 6735 -7092 -29752 -39262 -39870 -19176 -2344 -5501
9075 -5501 -15302 -29176 -16531 -6834 -17954 -2441 -418 -2180 819 -4511 -4746 -4774 1683 -1843 -13
9060 -13 4898 16507 22657 2531 -1080 -3352 -1741 14954 8445 -11168 -24018 -20569 -12308 -7885
9046g885o94J0387L964o860O356J269J0400Q332j4930k2239J0334L077j707O694
9032F498j5017J108K541Q971j1079j5979j325j1527n173K1107J5489P516m446
9019a316o593J0846Q081K610o510J045J306J389j409o412j6302j88R26q005Q704
9004a1828j19M82N920J2235L525O121O008l578k6832q004J2233l60N010Q77j074
8989F16q337q305r819L086J0860R268J841R922J1556r408m472o66N048o272j3309
8974h391P754l14N970k884p380k26M20o437j57n866N401p830j84N338o056P821
8958a3021J3072j1419P968J295P039q784N29n737L620Q734M118l814r476r388
8944a5264j355L784P014j1313J876N071P953J79j6398l138R99o967n587J4781
$$ plain form
9046 -7885 -8579 1808 5772 -1088 5268 6537 16937 25269 10339 -11900 -1566 1511 -196 6498
9032 6498 -8519 -7411 -4870 4101 -6978 -22957 -24282 -35809 -40982 -19875 -4386 3130 -1316
9019 -1316 -7909 2937 11018 13628 7118 8163 9469 10858 9449 3037 -13265 -13453 -12527 -20532 -11828
9004 -11828 -11947 -11465 -5545 6690 10215 16336 22344 18766 -8066 -16070 -3837 -4197 813 1690 616
8989 616 -7721 -16026 -25845 -22759 -11899 -2631 -790 9132 20688 11280 6808 6142 11190 4918 -8391
8974 -8391 -637 -951 5019 2135 -5245 -5471 -5051 -11488 -11645 -17511 -12110 -19940 -20124 -14786 -20842 -13021
8958 -13021 51 -11368 -3400 -2105 4934 -3850 -3321 -9058 -5438 3296 7414 3600 -5876 -15264
8944 -15264 -16619 -12835 -5821 -17134 -15258 -10187 -2234 -2055 -18453 -21591 -20592 -27559 -33146 -18365
8930a8365J9504J6747k434j4969j064o406N95O376r810j4066L067r821J1780K5436
8916F570N662O5J040j0331N615n797q598m709k567O92K6293J305k0199j7111m315
8901b6385J6529Q394k6807j6238P583J3868J455k210L135k917J0950m405o462
8888b3510j72p54J2006J2650N533m795R356M678j4775n615q606r340M431J0309
8874h604J0125Q35p03m858k000K3434Q22j7809J73p67m36l107q294p166J9281
8859I26n167o239j0755p371J0565R028J258n705J6713J1189M240j684r088K241
8845A0151l269l616L519N087p16j039R981m79q999j1855q969m896m064l828n530
8830b8522l825n535p458J2006K4916J4117j1836j3304o095J2082M664n336J2759
$$ plain form
8930 -18365 1139 17886 15452 483 -581 -6987 -6392 -16 -9826 -23892 -20825 -30646 -18866 6570
8916 6570 12232 12297 13337 3006 8621 2824 -5774 -10483 -13050 -12358 13935 15240 -4959 -22070 -26385
8901 -26385 -9856 -1462 -28269 -44507 -36924 -23056 -21601 -23811 -20676 -23593 -12643 -17048 -23510
8888 -23510 -23682 -24436 -12430 220 5753 958 10314 14992 217 -5398 -14004 -23344 -18913 -8604
8874 -8604 1521 2356 1653 -3205 -5205 18229 19051 1242 1415 648 212 -2895 -11189 -18355 926
8859 926 -4241 -10480 -21235 -28606 -18041 -9013 -7755 -13460 3253 14442 18682 16998 7910 10151
8845 10151 6882 3266 6785 11872 11156 10117 20098 19619 10620 -1235 -10204 -15100 -19164 -22992 -28522
8830 -28522 -32347 -37882 -45340 -33334 -8418 5699 -6137 -19441 -25536 -13454 -8790 -14126 -1367
8817a367P092M558k88l719q228j2712K733Q36k933L624j225J0182Q694l626j0979
8802g358m333P686j6170p900j362j383L907r20m4N604j292q357k787n772J7993
8787b2488j083J791R301k356k903k001J2172K604l549J2801K871j677J2663K189
8773B0335j1278k482N44P755J3576p979K405j08m361k5951N261N597M117J2459
8759A9890j0064M760l280j1642O684O324o519k589M918l867L818L59J1683J3557
8745C4032j3794r907p889n365P367J848p234r413N709O152P388N136O669j0614
8731A0085n110P58L512j405j1972j1116q734p734r52R362J6632K242p105J772
8717i765K832M044k468m316q934j2223O287J415Q228J3566L569J198m510K379
$$ plain form
8817 -1367 5725 10283 9995 6276 -1952 -14664 -11931 -11095 -14028 -10404 -11629 -1447 7247 3621 -7358
8802 -7358 -11691 -4005 -20175 -28075 -29437 -30820 -26913 -27833 -27877 -22273 -23565 -31922 -34709 -40481 -22488
8787 -22488 -23571 -21780 -12479 -14835 -17738 -19739 -7567 -4963 -8512 4289 7160 5483 18146 20335
8773 20335 9057 6575 7119 14874 28450 20471 22876 22768 18407 -7544 -2283 3314 7431 19890
8759 19890 9826 14586 11306 -336 6348 12672 6153 3564 8482 4615 8433 8792 20475 34032
8745 34032 20238 10331 2442 -2923 4444 6292 -942 -10355 -4646 1506 8894 14030 20699 10085
8731 10085 4975 5733 9245 7840 -4132 -15248 -23982 -31716 -32668 -23306 -6674 -4432 -11537 -9765
8717 -9765 -6933 -2889 -5357 -9673 -18607 -30830 -24543 -23128 -14900 -1334 2235 3433 -1077 1302
8703A302O542p52p371r483K007j1498K67o739R729J3959o090j5201m516K514O129
8688a9201R467K979j229j0773j529P412l288j0907J2898P994Q11j350q061n846
8674b0623L378J3235R34m800p480j1305k449N826K1824M986q522m323P972M711
8660C364J675o487j2438L702k72J2870O241p944n827Q462J0217q597M103M44P057
8645A6570R183j3099j4268p42Q050O663j2043m631M215O188J459Q239j4873r265
8631h354J581O357J0830l046k415m514P834r100j3885Q30R108K1946Q789q443
8617A7518N156P95j8081j660R443j1845j8514N845m024q495K053K3260J1219k76
8603A2394N459j1457J8798M483n733j6166l194J1923K4282J4372j6248k6330p441
$$ plain form
8703 1302 7844 7092 -279 -9762 -7755 -19253 -18986 -25725 -15996 -2037 -8127 -23328 -27844 -25330 -19201
8688 -19201 -9734 -6755 -7984 -18757 -20286 -12874 -16162 -27069 -14171 -6177 -5366 -6716 -14777 -20623
8674 -20623 -17245 -4010 -3076 -7876 -15356 -26661 -29110 -23284 -1460 3526 -4996 -9319 -1347 3364
8660 3364 5039 -1448 -13886 -10184 -10456 2414 8655 711 -5116 3346 13563 4966 9069 9513 16570
8645 16570 25753 12654 -1614 -2356 5694 12357 314 -4317 -102 6086 7545 15784 911 -8354
8631 -8354 -6773 -416 10414 7368 4953 439 8273 -827 -14712 -13882 -4774 17172 25961 17518
8617 17518 22674 23469 5388 3728 13171 1326 -17188 -11343 -15367 -23862 -21809 1451 12670 12394
8603 12394 17853 6396 25194 29677 23944 7778 4584 16507 40789 55161 38913 12583 5142
8590E142m413k199j214n46L753n601N73J7583J9827L965n812j4162m603K587m24
8575A4456K814j853p738l061R620M932j283n627m377K023p070o590Q033N871p885
8560B265m601J139l461k131m699K960j426k26J3538j135k477P300o814j0268N280
8545d756J884K091J274o690Q109l099m943J2872Q449l69l308j154L747O071K808
8530B2986K968j6285k5608j2030o7N272k881L717J2537P957m856M168L082J5905
8516A6865P76k126j0759k966K034p419j022n335q868j0686R802J6821J2999l677
8502F439p162M698L207K648n403j2933k196j1797o21R649K1537j883K29K133Q50
8487I395J87k502Q30p143l434J1627O209K430r738m225q476q072K1494p76j1159
$$ plain form
8590 5142 729 -1470 -2684 -3230 523 -5078 -4505 13078 32905 36870 31058 16896 12293 14880 14456
8575 14456 17270 15417 7679 4618 14238 19170 17887 12260 7883 9906 2836 -3754 4279 10150 2265
8560 2265 -2336 -1197 -4658 -6789 -11488 -8528 -9954 -10180 3358 2223 -254 7046 232 -10036 -4756
8545 -4756 -2872 -781 493 -6197 1912 -1187 -6130 6742 15191 14822 11514 10360 14107 20178 22986
8530 22986 25954 9669 -15939 -27969 -28036 -22764 -25645 -21928 -9391 -1434 -6290 -2122 960 16865
8516 16865 17641 15515 4756 1790 3824 -3595 -4617 -9952 -18820 -29506 -19704 -2883 10116 6439
8502 6439 -723 3975 7182 9830 4427 -8506 -10702 -22499 -23120 -13471 8066 6183 6412 8545 9395
8487 9395 9582 7080 7910 767 -2667 8960 15169 17599 7861 3636 -4840 -12912 8582 7806 -3353
8472c353o027R184J5684J0584r37j2292j9583k70O003L864N882k0456L60J202
8458a0155K338P547P127R034o00J10R746O4q303k2869j7934N333l321m794J3656
8443a3021J9139P752R4m947j2781l27n603l071J1442M346k851L234M465J5788
8429B3659p64k2119l2602n384O289N547J6884J5727K459k138P05J25M598j3792
8415h06k965J0421p230j97L495M057k016m17K120m064J1751k336j2410K686J3537
8400A5626L882p465j5401j4290q988R500K3796R014j4805m575N727P573K458j6360
8386d308Q869o076k662k700n135L264J4199J9153j2147j4673l831o053Q487J5741
8372A2128o339p620m166N197J333j3508o625j51P02J2105R468j1798o684m353
$$ plain form
8472 -3353 -9380 -196 15488 26072 25135 12843 -6740 -7010 -1007 2857 8739 -11717 -11357 -10155
8458 -10155 -7817 -270 6857 15891 15291 15401 25147 25211 16908 -5961 -23895 -18562 -21883 -26677 -13021
8443 -13021 6118 13870 13964 9017 -3764 -4091 -9694 -12765 -1323 3023 172 3406 7871 23659
8429 23659 22895 776 -31826 -37210 -30921 -25374 -8490 7237 9696 7558 8263 8388 12986 -806
8415 -806 -3771 6650 -580 -777 2718 6775 4759 4342 6462 2398 14149 11813 -597 2089 15626
8400 15626 19508 12043 -3358 -17648 -26636 -17136 6660 15674 869 -3706 2021 9594 12052 -4308
8386 -4308 4561 -1515 -4177 -6877 -12012 -8748 5451 24604 12457 -2216 -6047 -12100 -3613 12128
8372 12128 5789 -1831 -5997 -800 533 -12975 -19600 -19751 -19049 -6944 2524 -9274 -15958 -20311
8358b0311l859P648O563K784M987j698j888J0869L433K969P740j2003k029J0604
8344A5809N48p095k0551j5002n72Q766J0354Q669N197k522m970o160m179J973
8330i735L910N679Q56l930J0103j0294J1842K460q512R57o768K19r421l725j470
8315a7829K0308M073J04K81j0286J2264q089r128J4778J914q604j1757O484N984
8301D97J849k061P223K212q641m543P116O823n881j2391J084q749P472J4807L468
8286A0285j1282q739J007m490L426k087j3457J2498j483R90j3872p986K7269Q760
8272H39l0171m327L842p732J140K6502R231j3522r805J0193Q635L477J1090J048
8258A0440q410r754m360p655L845o462m694k217m235J3108J5042K068q06m541
$$ plain form
8358 -20311 -24170 -16522 -9959 -7175 -2188 -3886 -5774 5095 8528 11497 19237 7234 5205 15809
8344 15809 16357 9262 -11289 -26291 -26863 -18097 -7743 926 6123 3601 -1369 -7529 -11708 -9735
8330 -9735 -5825 -146 710 -3220 6883 -3411 8431 10891 2379 3336 -3432 -3213 -12634 -16359 -17829
8315 -17829 2479 6552 6656 6937 -3349 8915 826 -8302 6476 8390 -214 -11971 -5487 497
8301 497 2346 285 7508 9720 1079 -3464 3652 10475 4594 -7797 -6713 -15462 -7990 6817 10285
8286 10285 -997 -9736 -8729 -13219 -9793 -11880 -25337 -12839 -14322 -13332 -27204 -35190 -7921 839
8272 839 -29332 -33659 -29817 -37549 -36409 -9907 -676 -14198 -24003 -13810 -5175 -1698 9392 10440
8258 10440 2030 -7724 -12084 -19739 -15894 -22356 -27050 -29267 -33502 -20394 -5352 -3284 -4090 -8631
8244h631P240l677l848K978O967m679o548o985J5679O485O008n12O59o307l627
8229A202L525m876J26L637q840j1221L271J5511L046o70P704m276k5696k726M821
8214a5462j9j0885J4024K2012m084N65o041r238P257R001l837n935q270K295M119
8199d498r843q749o563r474M497J5159M338K2270J2190m53j4061j5102l419j6428
8185c0136n262R275J555m619R908Q691K829j0398O149O863l6Q871j918K455q288
8170d061N493O72l759J592l81o366j0163j004L583p34M374P82j6731j2736N054
8155c4385n374L039Q221P584N670Q168m277j128J5318Q627K835j1997M265p374
8141h08j360j895k510J0520L733J026j5688p53n736j393J5211J3835k623j1911
$$ plain form
8244 -8631 -1391 -5068 -8916 -5938 1029 -3650 -10198 -17183 -1504 4981 10989 10477 11136 4829 1202
8229 1202 4727 -149 -23 3614 -5226 -16447 -13176 2335 5381 4711 12415 8139 -17557 -20283 -15462
8214 -15462 -15481 -26366 -12342 9670 5586 6151 110 -9128 -1871 7130 3293 -2642 -10912 -8617 -4498
8199 -4498 -14341 -23090 -29653 -39127 -34630 -19471 -15133 7137 19327 18874 4813 -10289 -13708 -30136
8185 -30136 -35398 -26123 -24568 -29187 -19279 -10588 -7759 -18157 -12008 -5145 -5181 3690 1772 4227 -4061
8170 -4061 1432 2104 -1655 -63 -444 -6810 -16973 -17977 -14394 -15128 -10754 -9972 -26703 -39439 -34385
8155 -34385 -39759 -36720 -28499 -20915 -15245 -7077 -11354 -12482 2836 11463 14298 2301 6566 -808
8141 -808 -2168 -4063 -6573 3947 7680 8706 -6982 -7735 -13471 -14864 347 14182 11559 -352
8127c52o192N087p19J0159L944j1865o022J198J7613R410M15q516o346j3506M522
8112a170J97M866j2258j3631J5107K2289K702M866q331j2709o791k674R038m492
8098b991K041k405j4510q9o246k439Q727P786J7012M646j5120r390j0137L854
8084a9261N194J410p012N502J0288J7021J2274n497p249r873j205Q222j201p124
8070A489k498n510J233P754N717P547J7458N500n794j7358j0082K828J0285j0313
8056H256j1347N93J6323o308m327j1565j2963R31Q766J1673K966L86P308k939
8042G753j3710j2452j0464J2277J6132R988k370P345N427N120j5275N152J0092
8029B5015N601o313P256J671j0823q42j1114n316J1929m402j3923k957m645o855
$$ plain form
8127 -352 -6544 -1457 -2176 7983 11927 62 -5960 -4762 12851 22261 22676 14160 7814 -5692 -1170
8112 -1170 -973 3893 -8365 -21996 -6889 15400 18102 22968 14637 1928 -4863 -7537 1501 -2991
8098 -2991 -950 -3355 -17865 -17954 -24200 -26639 -17912 -10126 6886 11532 -3588 -12978 -23115 -19261
8084 -19261 -14067 -12657 -19669 -14167 -3879 13142 25416 19919 12670 2797 1592 9814 8613 1489
8070 1489 -1009 -6519 -5286 2468 8185 15732 33190 38690 32896 15538 5456 8284 18569 8256
8056 8256 -3091 -2498 13825 7517 3190 -8375 -21338 -20407 -11641 32 2998 3384 10692 7753
8042 7753 -5957 -18409 -28873 -16596 -464 9524 7154 14499 19926 25046 9771 14923 25015
8029 25015 30616 24303 31559 33230 22407 21565 10451 5135 17064 12662 -1261 -4218 -8863 -15718
8015a5718P477P821o300j229J605k081m023M445N876N027K239o260j0294L094
8001h321N004M404J0420O431k235k759j5083K814J8299N976j0126j87O717k495
7987A8859o469o995r886N72J165R159J2519o805k1661k60N881j0119o05L761J5640
7972D756J7102N361J893r921p214N383P899n964j4293L253M373J183n247j0168
7958a604L759k883L792o85P414J6692M073n833m775n449j5842K327M972M03R234
7943A5595O701n057J360m489R674R083m569M469P84q347r097o182j1211R03O30
7928B47m91N802m569q699j2360n813R501J4195J864k57R09n472r675l170o735
7913b4723K233N063j0737k29J2510P996M739R022l370J3578O653M858K492M272
$$ plain form
8015 -15718 -8241 -420 -6720 -7949 -6344 -8425 -12448 -8003 -2127 2900 5139 -1121 -11415 -8321
8001 -8321 -3317 1087 11507 17938 15703 12944 -2139 675 18974 24950 14824 14637 21354 18859
7987 18859 12390 5395 -4491 -3919 -2754 6405 18924 12119 -9542 -9802 -3921 -14040 -14645 -10884 4756
7972 4756 21858 27219 29112 19191 11977 17360 25259 19295 5002 8255 12628 13811 8564 -1604
7958 -1604 2155 -728 3064 2379 9793 26485 30558 24725 19950 14501 -1341 986 5958 6361 15595
7943 15595 22296 17239 18599 14110 23784 32867 28298 32767 33551 25204 16107 9925 -1286 -383 247
7928 247 -244 5558 989 -7710 -20070 -25883 -16382 -2187 -323 -580 329 -5143 -14818 -17988 -24723
7913 -24723 -22490 -17427 -28164 -28393 -15883 -7887 -3148 5874 2504 16082 22735 27593 30085 34357
7899C4357J281r367j32j0882k142q105j581J1846k601p451p362j600N67l43J568
7884a947J5317k616j1721k706j928n043L893P180l119o111R907J6618o231j0908
7870E85j0376J268j1J254Q958N354k192p682k371j7672J831J3652m37L217j0261
7855a4883J2594P964J262P361j0433j3137p144o570q299j6354J786J3012Q404
7842b4437K2905J9154j113O94j5307N10J6270N947j2635p123j471K619o470j1981
7828a2438p408m118j5213q947J3822J6447N117J8867J4806p020o063j4146j3151
7815a9445K372M580n52K639j620p124N805r435m762R032N610O627J0437N48l695
7800A017J635J267K115n752Q69q925r432O139J1899j3127L318K270J1477r60L743
$$ plain form
7899 34357 35638 26271 26139 15257 13115 5010 3429 15275 12674 5223 -2139 -3739 -3172 -3515 -1947
7884 -1947 13370 10754 -967 -3673 -5601 -10644 -6751 429 -2690 -8801 1106 17724 11493 585
7870 585 -9791 -8523 -8534 -7280 1678 7032 4840 -2842 -5213 -22885 -21054 -7402 -7839 -4622 -14883
7855 -14883 -2289 5675 6937 14298 3865 -9272 -16416 -22986 -31285 -47639 -45853 -32841 -24437
7842 -24437 -1532 17622 16509 17203 1896 2406 18676 24623 11988 4865 3394 6013 -457 -12438
7828 -12438 -19846 -23964 -39177 -48124 -34302 -17855 -12738 6129 20935 13915 7852 -6294 -19445
7815 -19445 -17073 -12493 -13045 -10406 -12026 -19150 -13345 -22780 -27542 -18510 -12900 -6273 4164 4712 1017
7800 1017 2652 3919 6034 282 1151 -7774 -17206 -11067 832 -12295 -8977 -6707 4770 3810 7553
7785G553j4924q450L567O073M121j2063j755J0643J7817K321j9630q1Q935R96
7771E123j3699L771O022k3646m784Q473J6954L755j2616k0881j1923Q61J7504
7758b5086K6934J8287J3075o736r083q582L208p086j157J3437n917j9362j4914
7745b2982J212N220N374j139l010k839M066J3335N110j403N009r690k3114N806
7731a9045K9621N03n454n168P80o358J3007M637M574m689o719M530q964k5109
7717b3854m205K1679P467j0995j276K5627R68j2100p22L96l149r609k532J7016
7703D711m646j2149R214J2406M225o723j209P484L28Q432j2473j0386j1494j0761
7689b3041k568J4043J2870O667O158j490k428j0556l880J7539O543m948p889K37
$$ plain form
7785 7553 -7371 -15821 -12254 -6181 -2060 -14123 -15878 -5235 12582 14903 -4727 -4808 4127 5123
7771 5123 -8576 -4805 1217 -22429 -27213 -18740 -1786 1969 -10647 -31528 -43451 -42590 -25086
7758 -25086 1848 20135 33210 26474 17391 8809 12017 4931 3774 17211 11294 -8068 -22982
7745 -22982 -21770 -16550 -11176 -12315 -15325 -18164 -14098 -763 4347 2944 7953 -1737 -24851 -19045
7731 -19045 10576 11079 5625 457 1237 -5121 7886 12523 17097 12408 5689 10219 1255 -23854
7717 -23854 -28059 -6380 1087 -9908 -11184 14443 15411 3311 2589 2985 -164 -9773 -12305 4711
7703 4711 65 -12084 -2870 9536 13761 7038 5829 13313 13641 22073 9600 -786 -12280 -23041
7689 -23041 -25609 -11566 1304 7971 14129 12639 10211 -345 -4225 13314 19857 14909 7020 7257
7675G257j0799o571J5883O27q101j3397M631K9039K4036J0892o804k2319k5235
7662h61k7450j2240J2860K0615K586l854J069Q00j1294K574J0434L519p975j5026
7648b4243P370R024N365Q815j0687j23m337j0300N751n110o012O443P548K773
7634g723j686q001Q061L1O86p46p471o588N448P518J0910j5570j5232k146j4392
7619d6901L171K0464R068J2770L368j2286q42m370j015P401R124l544j8830j1261
7605c3683M454r41p391K4738J2527n377N266M154q672j1491P74J259j0381m443
7591b9207J791J8604J8051k202j3477j638m609J658o323P933J2355R554l124Q259
7577A7625J475q169L543M184j7795q742N605M541L150l349l994K693j124j700
$$ plain form
7675 7257 -3542 -10113 5770 6397 -1704 -15101 -10470 18569 42605 53497 46693 24374 -861
7662 -861 -28311 -40551 -27691 -7076 -4490 -8344 -7275 -6475 -17769 -15195 -4761 -1242 -9217 -24243
7648 -24243 -16873 -7849 -2484 6331 -4356 -4479 -8816 -19116 -13365 -18475 -24487 -18044 -10496 -7723
7634 -7723 -9409 -17410 -9349 -9318 -8632 -9378 -16849 -23437 -17989 -10471 439 -15131 -30363 -32509 -46901
7619 -46901 -43730 -23266 -14198 -1428 1940 -10346 -11188 -15558 -16573 -9172 -48 -3592 -22422 -33683
7605 -33683 -29229 -30170 -37561 -12823 -296 -5673 -407 3747 -4925 -16416 -15642 -14383 -24764 -29207
7591 -29207 -27416 -8812 9239 7037 -6440 -8078 -12687 -11029 -17352 -9419 2936 12490 9366 17625
7577 17625 19100 10931 14474 18658 863 -7879 -2274 2267 5417 2068 -1926 767 -357 -2057
7563b057Q48R224J1475p307j575j1732l830M575j044M334K317n078L108M376M776
7548A2410R561q384J2093O245j7286o381p005o69n768j4611O506J0060n04L571
7534a62J3020J219j3646q075l791o591J920K348J1014P617j2330o714J124P773
7520e274K215J729n536j06J5732L53j6067k974R375Q629j157p081k8327l283P935
7505b3837o729q93M314o810O406J3061O394j977r475J4674P398P00P852L654k5170
7490a0438r537m665p743r049J0885J539J7292K5950Q03N45N873l470J513o882
7476A2616j257K819J778q9r044O338J1227n008k207o349j999K038j1055J917J718
7461C443j469M14K077m240R899o158r622k689K522J7218L83k696j5869j2102O806
$$ plain form
7563 -2057 -1209 8015 19490 12183 10608 -1124 -4954 -379 -1423 2911 5228 150 3258 7634 12410
7548 12410 21971 13587 25680 31925 14639 8258 1253 584 -5184 -19795 -13289 -3229 -3733 -162
7534 -162 12858 14077 431 -7644 -11435 -18026 -16106 -13758 -2744 4873 -7457 -14171 -13047 -5274
7520 -5274 -3059 -1330 -6866 -6972 8760 9113 -6954 -9928 -553 8076 6919 -162 -28489 -31772 -23837
7505 -23837 -30566 -31459 -27145 -33955 -27549 -14488 -8094 -10071 -19546 -4872 2526 3226 11078 14732 -10438
7490 -10438 -19975 -24640 -32383 -41432 -30547 -29008 -11716 14234 15037 15582 21455 17985 19498 12616
7476 12616 11359 14178 15956 15867 6823 13161 24388 19380 17173 10824 8825 10863 -192 1725 3443
7461 3443 1974 2388 4465 225 10124 3966 -5656 -8345 -5823 11395 11778 9082 -6787 -18889 -12083
7446a2083J7738n78J4415N728p459j3328j1920p682m602K428Q677l706R100j4851
7432a8123j474J1693L648j1582q90o375k672J4737R088R668p773j0092k138L51
7418a1934l368j894Q40l516K160N451N28n804j818R618q447L363r261j793M155
7403b1720M302P728j3474R279M747K895l423Q309l515j6995R139L318J176j5413
7389b3647p355J8867J5170q009K494L357j0559J080Q440K591j1101j1051l061
7376b2784L383Q15J94L761L066J0771N20L365P086K044M8J327q642j52J1502k056
7360A4248j1971M143k33j4009P393p666m225M463k638n096n766O786O754o12L941
7345d488j4470r266J0129J4089J1744p72o067M829J185J0285J3281n900j2543
$$ plain form
7446 -12083 5655 5077 19492 25220 17761 4433 -7487 -15169 -19771 -17343 -8666 -12372 -3272 -18123
7432 -18123 -19597 -7904 -4256 -15838 -16728 -23103 -25775 -11038 -1950 7718 -55 -10147 -12285 -11934
7418 -11934 -15302 -17196 -16356 -19872 -17712 -12261 -11733 -17537 -19355 -9737 -18184 -14821 -24082 -25875 -21720
7403 -21720 -17418 -9690 -23164 -13885 -9138 -6243 -9666 -1357 -4872 -21867 -12728 -9410 -8234 -23647
7389 -23647 -31002 -12135 3035 -4974 -2480 877 -9682 -8602 -162 2429 -8672 -19723 -22784
7376 -22784 -19401 -18586 -18392 -14631 -11565 -794 -274 3091 10177 12221 12269 13596 4954 4802 16304 14248
7360 14248 2277 6420 6187 -7822 -429 -8095 -12320 -7857 -10495 -15591 -21357 -14571 -7817 -8429 -4488
7345 -4488 -18958 -28224 -18095 -4006 7738 6966 899 5728 6913 17198 30479 24579 12036
7332A2036j5680j0906M550n987J0789J5987j2337j4589L61p103p34J6906P64k780
7318h723j582R051R032n046m261p19M782k371o488j0071p234n548M750N448J6785
7303b195Q296j2990J143m580M27Q66m989k750l145R876N456J4422J712q965r023
7288f439m394o068P603M250p5J4475J4682N144p682j6071j5480n828J0777R308
7274D202P758k3554l003Q098M282m69L534J4208o142j417j4295q820N563J605
7260h450m715j4403p576K3783J9170l543R234L038p084k101p150m362K003j2938
7246a5094j9904N844J7457M165k809O00K415j4780l824Q985O368m810k964J3794
7232d557M684j49j0504L599j3314j0031J583J2909M402o330j706J3604J4330j930
$$ plain form
7332 12036 -3644 -14550 -10000 -15987 -5198 10789 -1548 -16137 -15776 -22879 -23613 -6707 -5943 -8723
7318 -8723 -10305 -1254 7778 2732 -1529 -2248 2534 163 -6325 -16396 -23630 -29178 -24428 -18980 -2195
7303 -2195 6101 -6889 -5746 -10326 -9899 -9033 -14022 -16772 -19917 -10041 -4585 9837 11549 2584 -6439
7288 -6439 -10833 -16901 -9298 -5048 -5123 9352 24034 29178 21496 5425 -10055 -15883 -5106 4202
7274 4202 11960 -11594 -14597 -6499 -2217 -2686 848 15056 8914 7497 -6798 -15618 -10055 -8450
7260 -8450 -13165 -27568 -35144 -11361 7809 4266 13500 16538 9454 7353 203 -4159 -2156 -15094
7246 -15094 -34998 -29154 -11697 -7532 -10341 -9741 -7326 -22106 -25930 -16945 -10577 -15387 -18351 -4557
7232 -4557 127 -22 -10526 -6927 -20241 -30272 -28689 -15780 -11378 -17708 -19414 -5810 8520 6590
7218F590r779m600J3879K730M667k0989j8806J0957J1827M536J059P05M687M330
7204A1793m24M754j1870l157m904O378L64k23K994o604n520k464J3972j077m813
7189h01m200L375l477N346O680J167o218P889q071O51N297l702J072L037J3907
7174B1952l752j3660O11o599P230J1645j3329j754K364j0624m683M672K55P059
7160A387J454p601j5966N284J3437q37q855k4775J637J1876L283R023J0194L478
7146C019Q365j2046j0597J445k018o85R112O374q814k902l273K891R797k429j154
7131b915q146p587r862R517J242K496k189J1276J5222k60j5645j7098l457J9172
7117h234L882j0751o589J3110J04J151j2120r091Q062O634J30j6768j843K898
$$ plain form
7218 6590 -3189 -7789 6090 8820 13487 -7502 -26308 -15351 -3524 1012 2071 2776 7463 11793
7204 11793 11369 16123 4253 1096 -3808 2570 2934 2711 5705 -899 -6419 -8883 5089 4012 -801
7189 -801 -5001 -1626 -5103 243 6923 8090 1872 9761 1690 2341 7638 3936 5008 8045 21952
7174 21952 18200 4540 5151 -1448 5782 17427 4098 2344 4708 -5916 -10599 -5927 -5672 1387
7160 1387 2841 -4760 -20726 -15442 -2005 -2842 -11697 -36472 -34835 -22959 -19676 -10653 -459 3019
7146 3019 11384 -662 -11259 -9814 -11832 -12517 -3405 2969 -5845 -8747 -12020 -9129 668 -1761 -2915
7131 -2915 -11061 -18648 -28510 -18993 -17751 -15255 -17444 -6168 9054 8794 -6851 -23949 -27406 -8234
7117 -8234 -4352 -15103 -21692 -8582 -8478 -7327 -19447 -28538 -20476 -13842 -13712 -30480 -32323 -29425
7103b9425R075J2398J1423k393r532q096J715P456k5N120l245J617j3320J510
7089a5722J3620M610j628q328j1474J077Q751J05L817O993q158K833j477M572
7075d09R104K547j7111K071K6721p014j6981J5651L936n713p968o085J3221j3741
7061a771q689m043L8J3946J1813K647n940p798O117k725j0079k348m757L268Q433
7046a888J9744M142j5073j0830m193j0919j642J1181M908n735q051J349R341m551
7032a2217R83J1279J851J2317k274n859o835R523O08j691L068n441r353q210K003
7017a0248L343J2830R604l396r613m313M249Q749j2744j5028P850p073J0157R619
7003C986k602j969m528j555R054K196m842o115L926p44o891P296J4584M152k0705
$$ plain form
7103 -29425 -20350 -7952 3471 1078 -8454 -16550 -14835 -7379 -7404 -2284 -5529 -3912 -17232 -15722
7089 -15722 -2102 2508 880 -7448 -18922 -17845 -9094 -8989 -5172 1821 -6337 -3504 -4981 -409
7075 -409 8695 11242 -5869 -3798 22923 15909 -1072 14579 18515 12802 4834 -1251 11970 -1771
7061 -1771 -10460 -14503 -14465 -519 11294 13941 8001 203 6320 3595 -6484 -8832 -13589 -10321 -1888
7046 -1888 17856 21998 6925 -3905 -8098 -19017 -20659 -9478 -4570 -10305 -18356 -17007 -7666 -12217
7032 -12217 -11234 45 1896 14213 11939 6080 -755 8768 9376 7685 10753 5312 -4041 -12251 -10248
7017 -10248 -6905 5925 15529 12133 2520 -1793 2456 11205 -1539 -16567 -8717 -15790 -5633 3986
7003 3986 1384 -585 -5113 -6668 2386 4582 -260 -6375 -2449 -3193 -10084 -2788 11796 15948 -4757
6988d757k647O74j1970l300p009j708n510k482J3400P340P532J5748n784n946
6974f419l614J123L617n682l833l396R017J132r186q87J086L301O006Q97R84J555
6958d299J167m043L25k486K850K220o542m627j2519j8885r28M011J0191J0123
6944b3442K019J0264o067N63K518O588J113n357n080M618m376k072n429J2242
6930a1898K0429o776K095L652q298N60J2j2983M153j131J440J234l267n004P708
6915h074K459p609J1138O383j8121q392j449n956K865J3539K1128J0291O35j3736
6901E101j2632J303n59k372J318o388k382L584m206j544O702N27K982R366o01
6886A99k416M400O544j4490Q179O732l826q022m83K782J4147J3711m55j4456k0976
$$ plain form
6988 -4757 -7404 -6730 -18700 -22000 -29009 -30717 -36227 -38709 -25309 -17969 -10437 5311 -473 -6419
6974 -6419 -10033 -8910 -5293 -10975 -14808 -18204 -9187 -8055 -17241 -18128 -17042 -13741 -7735 -6838 -5854 -4299
6958 -4299 -3132 -7175 -6850 -9336 -6486 -4266 -10808 -15435 -27954 -46839 -47767 -43756 -33565 -23442
6944 -23442 -21423 -11159 -17226 -16663 -14145 -7557 -6444 -11801 -16881 -12263 -16639 -18711 -24140 -11898
6930 -11898 8531 1755 3850 7502 -796 -236 -224 -13207 -9054 -10185 -8745 -7511 -10778 -15782 -8074
6915 -8074 -5615 -13224 -2086 4297 -13824 -22216 -23665 -29621 -26756 -13217 7911 18202 18837 5101
6901 5101 -7531 -6228 -6787 -9159 -7841 -14229 -16611 -13027 -17233 -18777 -12075 -11548 -8566 800 199
6886 199 -2217 2183 8727 -5763 2416 9148 5322 -2700 -3183 -401 13746 27457 27002 12546 -8430
6871h430n441k623j783Q254M825j24P123n025o647J0709k777M92q51p033j3083
6856b2414m855N604O493R216k71k307L74l259M845L657J4586M15k928K880N93
6841A2629r305l290K693L769l573M273j737Q180J4395r36j6872k3609m456Q253
6827i586O622O208L704l80k434k223o907j2791p648r975O313q80L633M068N034
6812a7242l684p326o39M451M529r535J9524J5703o248l110L606K212m082p617
6798i458K865L652J1074j245P617L297j0746K039L690o623k907p000J585m47R89
6783a618P39J2158N185q87M874M255j626k069p488p395q982K153J7710m157M074
6768A6926j7339M612R888L894n866k30j53l676J2282K197q936o232j4247j0117
$$ plain form
6871 -8430 -13871 -16494 -18277 -10023 -5198 -5322 1801 -3224 -9871 838 -1939 -1447 -2298 -9331 -22414
6856 -22414 -27269 -21665 -15172 -5956 -6227 -8534 -8160 -11419 -6574 -2917 11669 12084 9156 12036 12629
6841 12629 3324 34 2727 6496 2923 7196 5459 13639 28034 27098 10226 -13383 -17839 -9586
6827 -9586 -2964 3244 6948 6568 4134 1911 -4996 -17787 -25435 -35410 -29097 -29977 -26344 -22276 -17242
6812 -17242 -20926 -28252 -28891 -24440 -19911 -29446 -9922 5781 -467 -3577 29 2241 -1841 -9458
6798 -9458 -6593 -2941 8133 6888 14505 17802 7056 9095 12785 6162 3255 -3745 -2160 -2607 -1618
6783 -1618 -879 11279 16464 15577 20451 24706 23080 21011 13523 6128 -2854 -701 17009 12852 16926
6768 16926 -413 4199 14087 17981 12115 11885 11732 8056 20338 22535 13599 7367 -6880 -16997
6754a6997L356K497l069k968m169Q537P474N455K192J397j6523p00k847J7865
6740A500J8224k334n125J3815m292n692p575j947R587Q521J1527j516J907k065
6726C4535J599r468J689J144j3809j982P00N579j620O623J2436J6345J1853R920
6712G5544J2501L3532M1131N2431Q0577R9694J03076M6567k5059r8877j24815
6701B96302j00777o8746l4515k6638j4234q786n30q201j6634l02k438K025n415
6688A1111m935J0327R40p454J587O159K86L929J8505N83j4132j7617K23J1803
6674B1315j1920j7230J728k922j655Q090P026N238j6755J599J559j3151l473n17
6660b1068J4007M044N220o605p862M142N373o26q311o963J5305P352P86p586p456
$$ plain form
6754 -16997 -13641 -11144 -14213 -17181 -21350 -12813 -5339 116 2308 3705 -12818 -13518 -16365 1500
6740 1500 19724 17390 12265 26080 21788 16096 8521 6574 16161 24682 36209 34693 36600 34535
6726 34535 36134 26666 28355 29499 15690 13708 14408 19987 18367 24990 37426 53771 65624 75544
6712 75544 88045 121577 162708 215139 295716 395410 498486 545053 519994 421117 296302
6701 296302 195525 126779 92264 65626 51392 42606 42076 33875 17241 16939 14501 16526 11111
6688 11111 6176 16503 17443 9989 11576 17735 18021 21950 40455 41038 26906 9289 9512 21315
6674 21315 9395 -7835 -6107 -9029 -10684 -2594 4432 9670 -7085 -5486 -3927 -17078 -20551 -21068
6660 -21068 -7061 -3017 2203 -4402 -12264 -8122 -2749 -3375 -11686 -18649 -3344 4008 4794 -2792 -10248
6645a0248m071R561q297K645J1175O832k279m819l568j6797J1139P036j681O213
6631B841n224j5025J1577J3888Q523j606j9607L902M514L227n140N426M70l435
6617D331K910j1789o35l504q421j0961J776q85J3241N805K851Q067M526r132q901
6602a0721P545j578o675k450N189p344l144J1105J7778o543j102j2823l555j0693
6588b5011M902q37M432K734k991J238J8835M295K447O914p635j6699l634J5963
6574D953L889j5495j5227L167J8388M049l096L783R936p269O458l918p481m055
6560a918O32N712K0399M898k922q500q914j6808j4902J0494J0513J898K976m413
6546h55l641J46K005K892J199j2116k1550J3672O205m666J6329P197p466j0484
$$ plain form
6645 -10248 -14319 -4758 -13055 -10410 765 7597 5318 499 -3069 -19866 -8727 -1691 -3372 2841
6631 2841 -2383 -17408 -5831 8057 16580 14974 -4633 -731 3783 7010 1870 7296 7766 4331
6617 4331 7241 -4548 -5183 -8687 -17108 -28069 -26293 -27178 -13937 -8132 -5281 2786 7312 -1820 -10721
6602 -10721 -3176 -4754 -11429 -13879 -8690 -16034 -19178 -8073 9705 3162 2060 -10763 -14318 -25011
6588 -25011 -20109 -20946 -16514 -13780 -16771 -15533 3302 7597 10044 16958 9323 -7376 -11010 4953
6574 4953 8842 -6653 -21880 -18713 -325 3724 628 4411 14347 7078 13536 9618 2137 -1918
6560 -1918 -1286 4426 24825 29723 26801 18301 9387 -7421 -22323 -11829 -1316 582 3558 -855
6546 -855 -4496 -4350 -2345 547 1746 -10370 -31920 -18248 -12043 -16709 -380 6817 -649 -11133
6532a1133k175R543j4568j3105O055K492N605R396j979k118Q26O34j8664J678
6518b7513J0919J4341J1961j170o580m455R529L796j1835q573J4627J800j6612
6505i765q676Q580M378n919n889R53J8551J1265n084j5021j157J960k109j3859
6491b1792r291j3803l509J6926Q929n237J405J3969J7345J003p998j0231j1171
6478b3455P376R628p936J3347K018j5737J0816J6293o094r663m378r977q364Q47
6464b5279J393p11p728J2665J4719M252Qn835L82l408J0066P219n136m313q628
6449a0334r679J659J2406P509l524M271o479L013P864L732k360o759j2457J5053
6435C915J1242m905l3988m954J7414J1021J497q81j0754N44M457o514P457O355
$$ plain form
6532 -11133 -13308 -3765 -18333 -31438 -25383 -22891 -17286 -7890 -9869 -11987 -11161 -10527 -29191 -27513
6518 -27513 -16594 -2253 9708 8538 1958 -2497 7032 10828 -1007 -9580 5047 6847 -9765
6505 -9765 -18441 -9861 -5483 -11402 -17291 -16338 2213 13478 8394 -6627 -7784 -5824 -7933 -21792
6491 -21792 -31083 -44886 -48395 -31469 -22540 -27777 -26372 -12403 4942 5945 -2053 -12284 -23455
6478 -23455 -16079 -6451 -14387 -1040 978 -14759 -3943 12350 6256 -3407 -7785 -17762 -26126 -25279
6464 -25279 -23886 -24597 -32325 -19660 -4941 -689 -681 -6516 -6134 -9542 524 7743 2607 -1706 -10334
6449 -10334 -20013 -18354 -5948 1561 -1963 2308 -4171 -1158 6706 10438 8078 1319 -11138 3915
6435 3915 15157 10252 -23736 -28690 -11276 -255 1242 361 -10393 -9849 -5392 -11906 -4449 1906
6421A906r98k470J431O174q327j701n927j713n187l370j801O620K0482R491K753
6406A7363o195p962J516N404K467J181q692l418m757J0658l098p264r53J0315
6392F565J301j5j1197R236J4137J124j5500r81K556m740j4400k931K0412k027
6378C540M038K655k2437j390j335J1546Q683J506j272R153j0366j0984J334J7954
6364A2625m549m639n385P84q63J292j425o825p536K000J068R421O60m563N083
6349b852J0320O650j0466j042m303m15R667N756J5160l133k0459q647n775P95
6335h744J7356J5499j132j801k409j0667r785m739o521J571L885k784K15M264
6321e792N098J54p056j1313L195r96Q985n13j2935J0289j3882k955J622J3815
$$ plain form
6421 1906 908 -1562 -131 6043 -2284 -3985 -9912 -11625 -16812 -20182 -21983 -15363 5119 14610 17363
6406 17363 11168 3206 4722 10126 12593 13774 5082 1664 -3093 7565 4467 -2797 -3750 6565
6392 6565 7866 7851 -3346 5890 20027 21151 5651 4670 7226 2486 -11914 -14845 5567 3540
6378 3540 7578 10233 -12204 -13594 -14929 -3383 5300 6806 5534 14687 4321 -6663 -5329 12625
6364 12625 8076 3437 -1948 -1164 -2027 -735 -2160 -8985 -16521 -14521 -13453 -4032 -3372 -7935 -2852
6349 -2852 7468 14118 3652 2610 -1693 -2108 7559 13315 28475 25342 4883 -3764 -9539 -8744
6335 -8744 8612 24111 22979 21178 18769 8102 -1683 -6422 -12943 -11372 -7487 -10271 -10056 -5792
6321 -5792 -694 -540 -7596 -18909 -15714 -16710 -7725 -8238 -21173 -10884 -24766 -27721 -26099 -12284
6307a2284P577N999K479n04L903P303k108n373l750J8848Q247l183p543p63J137
6292A9985j3498j2976j925M028j0967k099M593l871R48J1225L819O598K880M792
6278A3532p941k963RJ2235J795j1789k5115J7001J7932j8139j4920K079N806M543
6264e935r750J1330J0881j2681l207n822K402q033Q893J0483M886j169L994Pn724
6249E55R14m407j642m413q585P513N294o541p286R217J0654j066L095L222k847
6234C677k46n597r242J540J0435N623r301j1771J443Q585J5117Q436M623M843
6220B8165j8362j5432j803J5353K86q531P46k260j638j434K237K93l614J1245
6206E251K730L01j0026j0827m409P940J1351m773l486n074L165J1231K005J389
$$ plain form
6307 -12284 -4707 1292 3771 3267 7170 14473 12365 6992 3242 22090 30337 27154 19611 18848 19985
6292 19985 6487 -6489 -8414 -4386 -15353 -17452 -12859 -16730 -15782 -4557 -738 5860 8740 13532
6278 13532 5591 2628 2637 14872 16667 4878 -20237 -3236 14696 -3443 -18363 -16284 -10478 -5935
6264 -5935 -15685 -4355 6526 -6155 -9362 -15184 -12782 -20815 -11922 -1439 3447 2278 6272 6279 555
6249 555 1469 -2938 -4580 -8993 -17578 -10065 -4771 -11312 -18598 -9381 1273 207 3302 6524 3677
6234 3677 3431 -2166 -11408 -9868 567 6190 -3111 -14882 -13439 -4854 10263 18699 23322 28165
6220 28165 9803 -5629 -7432 7921 8207 -324 422 -1838 -3476 -4910 -2673 -2380 -5994 5251
6206 5251 7981 8282 -1744 -12571 -16980 -9040 2311 -2462 -5948 -11022 -7857 3374 5379 6768
6192F768J516L865j287m528q313O279r065r121j965J2827l866j3277M770q467
6178b3864N512K197o269j40J4044J5877N325N473n443m472l808o405j0944n820
6164a8737J0461J1291m848j1544m003J8405K0337n844J116K572p867j4647N23
6151b785j2067M94J326L639J4805N551N684n773J1119n540J739R73r690o612N444
6136H307n168j4978j814K86p323J68J5677L285j2339R746r4j1004j763j0355J111
6121b6258J4594J3461P101j5369j8284P418P767p17j300l703O189J5033O186k898
6107I220K633j5117j3464Q690J3658O513M619j4925j3109j955J0466J9960J8357
6094C5546K735q478j8501j3410J044k16l569J371P284K772q44l279j2122P377
$$ plain form
6192 6768 8284 12149 10862 6334 -1979 4300 -4765 -13886 -15851 -3024 -6890 -20167 -15397 -23864
6178 -23864 -18352 -16155 -22424 -22564 -8520 7357 12682 18155 12712 8240 4432 -1973 -12917 -18737
6164 -18737 -8276 3015 -1833 -13377 -17380 1025 21362 15518 16634 19206 11339 -3308 -2785
6151 -2785 -14852 -14358 -13032 -9393 5412 10963 16647 10874 21993 16453 18192 19165 9475 2863 8307
6136 8307 3139 -11839 -13653 -13367 -20690 -20522 -4845 -1560 -13899 -4153 -4247 -15251 -17014 -27369 -26258
6121 -26258 -11664 1797 8898 -6471 -24755 -17337 -9570 -10287 -11587 -15290 -9101 5932 12118 9220
6107 9220 11853 -3264 -16728 -8038 5620 12133 16752 1827 -11282 -13237 -2771 17189 35546
6094 35546 38281 29803 11302 -2108 -1064 -1280 -4849 -3478 3806 6578 5734 2455 -9667 -2290
6080b290N594p325k845O742j037o070Q327K435P805J0676L024J2542p775l547
6066B6256k935J38j3496k1207M580K922j4143p522N048J964n317R908N736O644
6052a424j4359L540J4033mq012k264R462Q357L332j5467M172P858N965J4364K994
6037C2547k881k0192r823j5659o66J1441p148J357M750R344J6190M687j698j5883
6023F366p738l17J803R61N771J1573P511o611k9163j3913p584L43P887N136J1807
6008f168o658j122j5978l035J3075J4441L057k366M952L355o314p675p881J861
5994a6456L51M090M535J0149K0432j884r346j942J214j3930j1220m953j472J9651
5980g81J5268n860p613p010L913K107J73J295o119j0230O675O136K032K084n356
$$ plain form
6080 -2290 3304 -4021 -6866 -124 -1161 -7231 1096 3531 11336 22012 25036 37578 29803 26256
6066 26256 23321 23459 9963 -11244 -6664 -3742 -17885 -25407 -20359 -18395 -23712 -13804 -8068 -1424
6052 -1424 -15783 -12243 1790 1786 -6226 -8490 972 9329 12661 -2806 1366 9224 15189 29553 32547
6037 32547 29666 9474 -349 -16008 -16674 -5233 -12381 -11024 -6274 3070 19260 23947 22249 6366
6023 6366 -1372 -1689 114 1075 6846 18419 25930 19319 -9844 -23757 -31341 -30998 -23111 -17975 -6168
6008 -6168 -12826 -13948 -29926 -32961 -19886 -5445 -2388 -4754 198 3553 -2761 -10436 -18317 -16456
5994 -16456 -16105 -12015 -7480 2669 23101 21217 11871 9929 11143 -2787 -14007 -18960 -20432 -781
5980 -781 14487 8627 1014 -5996 -2083 24 197 1492 -4627 -14857 -8182 -2046 -14 2070 -3286
5965c286j5166o898Q925J6918J936m266m87J8384l818M824J418J153M801l702
5951B0736j7467R094L113j5241r084N532k211l156q79R792O458j949p580Q630
5937E788K110j2361q840j061L586K0049J3577k0712K523m739L259L326n250P36
5923A991N895R07j8504j7566P008j2707q80J0309K741J3467M796K401j4113M958
5909i297J634n565n330m28R15R763L136m800Q415m015K58o387q190J017J1037
5894g837j158P39P261Q173p387j5409k508O115J0015l109j5118J930P152k0255
5880c1396l697J3102J2141N728O004L41l445N036j2418p424p854K885J0793o930
5866a7134K441N381K817J7316k73m902m359M012P168P647Q58o971n129m639L1
$$ plain form
5965 -3286 -18452 -25350 -16425 493 2429 -1837 -2324 16060 12242 17066 18484 19637 24438 20736
5951 20736 3269 12363 15476 235 -8849 -3317 -5528 -8684 -9563 229 6687 4738 -2842 5788
5937 5788 7898 -4463 -13303 -14364 -10778 9271 22848 2136 4659 -80 3179 6505 1255 1991
5923 1991 7886 8793 -9711 -27277 -20269 -32976 -33856 -23547 -20806 -7339 -2543 -142 -14255 -9297
5909 -9297 -7663 -13228 -18558 -18986 -18071 -8308 -5172 -9972 -1557 -5572 -5314 -11701 -19891 -18874 -7837
5894 -7837 -8995 -8256 -995 7178 -209 -15618 -18126 -12011 -1996 -5105 -20223 -18293 -11141 -31396
5880 -31396 -35093 -21991 -9850 -4122 1882 2223 -1222 3814 -8604 -16028 -23882 -20997 -10204 -17134
5866 -17134 -14693 -9312 -6495 10821 10548 5646 1287 5299 12467 20114 20972 14001 8872 4233 4264
5851D264q736J896J631K310o071j0689K053r65r12N981P34N123M364L958r904
5836d963k291o103l968l842o961J7064O223l583O305l878M930P201n515j3502
5822a2883P269Q507Q360J582Q848j0695q181J1336q582r081J0239Q39J380N329
5808A4267p944J403m515Q672q918m79j0675j3795o887J5246O217q941p126N959
5794a7516M848O671O233L491j2914k183R060R84k712o324q593J442M468R798q50
5779d097m010j9815O5J7916O766P767P380l38j6998j200N96Q4J3455O053q827
5764D797L422O724J532k4624q381M429j293J1161J734m1l625k667Nm232r460P113
5748a3406K0309O311K892Q522O643j0704j2167M603N411o155k207k040j1561j333
$$ plain form
5851 4264 -4472 -2576 -945 1365 -4706 -15395 -13342 -14307 -15219 -9238 -8504 -3381 983 4941 -4963
5836 -4963 -7254 -13357 -17325 -21167 -28128 -11064 -4841 -8424 -2119 -5997 -1067 6134 619 -12883
5822 -12883 -5614 2893 11253 12835 21683 10988 2807 14143 5561 -3520 6719 7558 8938 14267
5808 14267 6323 7726 3211 11883 2965 2486 -8189 -21984 -28871 -13625 -7408 -16349 -23475 -17516
5794 -17516 -12668 -5997 236 3727 -9187 -11370 -2310 -1326 -4038 -10362 -18955 -17513 -13045 -3247 -4097
5779 -4097 -8107 -27922 -27857 -9941 -3175 4592 11972 11634 -5364 -6564 -5968 -5884 7571 13624 4797
5764 4797 8219 14943 16475 -8149 -16530 -12101 -13394 -2233 -499 -540 -4165 -6832 -6827 -11059 -20519 -13406
5748 -13406 6903 13214 16106 24628 31271 20567 8400 13003 18414 12259 10052 8012 -3549 -4882
5734d882P655l169k56j9077m750K0653J5209k476K108L492m863J2864N792m620
5720B3680k1983j4323N407M146q746k0m287n619O220m780R866J086j7181J2147
5706a4387P603K392K75Q317p541l6P23m258J5216N51r348m745o92n309O841M758
5690C60r63J1853k977M163r519M066j0914J222q594j0862N460M84J1530J7261
5676A2570m12j4456k874o816M318J110j4237M971M953L620j904O937K252P377
5662G409q358j7044l677J6945R597R256K383o902j1218K019J3279N116j7073J3042
5648A4774J2094p372r763p451l740p265M364M458j9152J1282L089P137M768M646
5634A1869j383j0279j9819k808L212J507K866K701J1733P973k891L650N231m707
$$ plain form
5734 -4882 2773 -396 -652 -19729 -24479 -3826 11383 8907 11015 14507 9644 22508 28300 23680
5720 23680 1697 -12626 -7219 -3073 -11819 -11839 -16126 -21745 -15525 -20305 -10439 -9353 -26534 -14387
5706 -14387 -6784 -4392 -4117 4200 -3341 -3377 -2654 -6912 8304 8855 -493 -5238 -5930 -11239 -4398 360
5690 360 -603 11250 8273 12436 2917 6983 -3931 -2709 -11303 -22165 -16705 -16221 -4691 12570
5676 12570 12158 -2298 -5172 -11988 -7670 -6560 -20797 -15826 -10873 -7253 -9157 -2220 32 7409
5662 7409 -949 -17993 -21670 -4725 4872 14128 16511 9609 -1609 410 13689 18805 1732 14774
5648 14774 26868 19496 9733 2282 -1458 -8723 -4359 99 -19053 -7771 -4682 2455 7223 11869
5634 11869 10486 207 -19612 -22420 -19208 -17701 -14835 -12134 -401 7572 4681 8331 13562 8855
5620H855j3419J8905j425j1739K332j816k5q55Q777O306p96J1758o702k6121j4035
5605b0000R17M462P356q600L817P526R819j639K308o452N875J4896J321o850n106
5590I650j5182r290j857j361k291p385L687J2957k267L51R820J2584K925q757
5576C584R82q102l235K534Q854q661j2095P974J3337p291o638q127P376Q592j0953
5561a1869j1356q29R152K4006K4095r389k0485j0361j6346J2506Q442O584M156
5548H306n306J059j8472q196J8243n759j1902J2873k03j1188N604K1982p899m051
5534d909N539R78K444R813j669n460r58o957j5532o45N822J121n24M337k727L734
5518e593J3413M723K457o129M807N469q037j6936k574p832m033j585l406n36M807
$$ plain form
5620 8855 -4564 14341 12916 1177 3509 1693 1668 813 9590 15896 15100 26858 20156 -5965 -20000
5605 -20000 -19083 -14621 -7265 -15865 -12048 -4522 5297 3658 5966 -486 5389 20285 21606 14756 9650
5590 9650 -5532 -14822 -16679 -18040 -20331 -27716 -24029 -11072 -13339 -12988 -3168 9416 12341 3584
5576 3584 4566 -3536 -6771 -4237 4617 -4044 -16139 -8165 5172 -2119 -8757 -16884 -9508 -916 -11869
5561 -11869 -23225 -24054 -14902 9104 33199 23810 3325 -7036 -23382 -10876 -2434 4150 8306
5548 8306 3000 4059 -14413 -22609 -4366 -10125 -22027 -9154 -9357 -20545 -14941 7041 -858 -4909
5534 -4909 630 1608 4052 13865 12196 6736 5778 -1179 -16711 -17356 -11534 -10413 -10937 -6600 -9327 -5593
5518 -5593 7820 12543 15000 8871 13678 19147 11110 -5826 -8400 -16232 -20265 -21850 -25256 -25792 -20985
5503b0985O920M078m769j9967L851K2834J6047j0114n143K562k914p549p880J1214
5489a1815m058O152J693L845L266J5192J0829J76r213l331q4j483P418m64o840
5474A1283j2028N222Q473r52j4481p589N22Q950K154r546j1317L271K330R244
5460d464Q881n287q810j0120m301P984J3068r905J767O832J588o346o386Q867
5446f632R795k332n590o464N469k037J609j891J06M999P282M964M437J655L246
5431A8616m623o577j2001J577j950k862J5293j263j3234R850n517r456j85P782
5417d550j4535n625J1624r679J3150L939p889M89j725L101L867J360K36L5l982
5402a0184J822o038m269N531J4116n298M523J4126n072m780j081j2388j585J137
$$ plain form
5503 -20985 -14065 -9987 -14756 -34723 -30872 -8038 8009 -2105 -7248 -4686 -7600 -15149 -23029 -11815
5489 -11815 -15873 -9721 -8028 -4183 -917 14275 25104 25280 16067 12736 12652 11169 18587 18123 11283
5474 11283 -745 4477 12950 11998 -2483 -10072 -9550 -600 1554 -7992 -19309 -16038 -13708 -4464
5460 -4464 4417 -870 -9680 -19800 -24101 -16117 -3049 -12954 -11187 -4355 -2767 -9113 -15499 -6632
5446 -6632 3163 831 -4759 -11223 -5754 -7791 -6182 -8073 -7967 -2968 4314 9278 13715 15370 18616
5431 18616 13993 7416 -4585 -3008 -4958 -7820 7473 6210 -7024 2826 -2691 -12147 -12332 -4550
5417 -4550 -19085 -24710 -13086 -22765 -9615 -5676 -13565 -13076 -14801 -11700 -7833 -6473 -6237 -6202 -10184
5402 -10184 -8362 -14400 -18669 -13138 978 -4320 203 14329 9257 4477 3396 -8992 -10577 -9440
5388i440R820P885J2677K075l712K979K175k2385J615n219J050K242L485J205
5374F452L860j2896n161n398K951J0097o031n737l340r186L130J380K235L273
5360a4371L046R907J1749k1083j5304P879J6487O271J344p528j4084R078K620
5347c989M81P603O007K404R191J2933r699j0738l442P481o19j2750p888M703L926
5332E604K824O976K156j0734r585n117J0070j5839j4070P348M039j1012k602P003
5318b2939o27K0333J9983j523o574K676K672r14j204R783M321j1106K778j1828
5304E831q099l632L161M626J269N896J5668r142j2294p282q84o530q463q796O362
5289b2309q11J4935J9090k158j2450n38j2060P241Q448R283M878J1106k612j6789
$$ plain form
5388 -9440 380 8265 20942 23017 19305 22284 24459 2074 3689 -1530 -480 1762 5247 6452
5374 6452 10312 -2584 -7745 -13143 -10192 -95 -6126 -11863 -15203 -24389 -21259 -19879 -17644 -14371
5360 -14371 -11325 -1418 10331 -10752 -26056 -18177 -1690 4581 5925 -1603 -15687 -6609 -3989
5347 -3989 -3508 4095 10102 12506 21697 34630 24931 14193 10751 18232 17613 4863 -3025 1678 5604
5332 5604 8428 15404 17560 6826 -2759 -7876 2194 -13645 -27715 -20367 -16328 -27340 -29942 -22939
5318 -22939 -23566 -3233 16750 15227 8653 11329 14001 13087 11883 21666 25987 14881 17659 5831
5304 5831 -2268 -5900 -2739 1887 3156 9052 24720 15578 3284 -3998 -4882 -11412 -19875 -28671 -22309
5289 -22309 -23120 -8185 10905 8747 -3703 -4241 -16301 -9060 -612 8671 13549 24655 22043 5254
5275E254O885n499l022k257O116O336J3265m099l266R271Q93j6148j9423L166
5261b528J0116N768J0180Q178M400J131k9953k4268k0314o893J2407K3335J7914
5248I473L726M006k178o983j5941j0237M22p687P067O586M369J8863N972M075
5234B1533q737J522k712j2316J661J1671m392p782N603l629m242n579Q05n528
5220a2122J0030N589p739R828n820j740m503J635M830p095J131O157O57n531j6837
5205b1530R185o666p452R964P401M89Q309j22R97J0343M522q628j072r58k811
5190A971k726l192L543n131M583R307l919j7834M861J781l255J3625K815r670
5176c241r051J1556k539L899n395L185p49M091L589k427O636P8j4408r301p711
$$ plain form
5275 5254 12139 6640 3618 1361 7477 13813 27078 22979 19713 28984 29877 13729 -5694 -2528
5261 -2528 7588 13356 23536 31714 36114 37245 7292 -16976 -37290 -44183 -31776 -8441 9473
5248 9473 13199 17205 15027 8044 -7897 -18134 -17712 -25399 -18332 -11746 -7377 11486 17458 21533
5234 21533 12796 14318 11606 -710 951 12622 8230 448 6051 2422 -1820 -7399 -6594 -12122
5220 -12122 -2092 3497 -4242 5586 -234 -1974 -6477 -4842 -12 -7107 -5976 181 838 -4693 -21530
5205 -21530 -12345 -19011 -26463 -16499 -9098 -8609 -300 -422 575 10918 15440 6812 5740 4782 1971
5190 1971 -755 -3947 -404 -5535 -952 8355 4436 -13398 -8537 -6756 -10011 3614 6429 -3241
5176 -3241 -12292 -736 -3275 624 -4771 -1586 -2335 1756 5345 2918 9554 9632 -4776 -14077 -21788
5161b1788j3314L841J5062n345q247L715J3932R625l838k441o966m847O81J5107
5147d823q6k947J0853J804j9277N925N595Q60j5768M94L610J1055J1634n308o122
5132b501l303Q928J0115M209j963o43q275l292k628Q841J1821R336j4506j6375
5118b36o643L531n39n16j5165j2588P467J2675M439o731o145K2558J0358l082
5104I383l006k2762m091j2645P494K3486O640q24p901m047K0661L198j51K806
5090A8241j7371j2012q617R690P609L942J0692N442l977r041o503J0278K39N51
5076I163l549n678k462N351J799K794o825j0830k711J1757L644O082n930L255
5062E860k969n645k1261k359J6745M349o092L700j987M421R266j0359n809k142
$$ plain form
5161 -21788 -35102 -31261 -16199 -21544 -29791 -26076 -12144 -2519 -6357 -8798 -15764 -20611 -19930 -4823
5147 -4823 -4909 -7856 2997 4801 -14476 -8551 -2956 -2096 -17864 -17370 -13760 -2705 8929 3621 -2501
5132 -2501 -5804 3124 13239 17448 15485 14842 6567 3275 647 9488 21309 30645 16139 -236
5118 -236 -6879 -3348 -3887 -4403 -19568 -32156 -24689 -12014 -7575 -14306 -20451 2107 12465 9383
5104 9383 6377 -16385 -20476 -33121 -25627 -2141 4499 3675 -4226 -8273 12388 15586 15435 18241
5090 18241 870 -11142 -19759 -10069 -2460 1482 12174 17616 13639 4598 -1905 8373 8612 9163
5076 9163 5614 -64 -2526 2825 4624 7418 593 -10237 -12948 -1191 2453 8535 2605 5860
5062 5860 2891 -2754 -24015 -26374 -9629 -5280 -11372 -7672 -9659 -5238 4028 -6331 -12140 -14282
5048a4282L783k223o422o339L393l982N146K0235N318M843m06m211P351k423L976
5033A3757m505m936J4356q421j9841l641k37j2343m266J1898Q296O915l845j069
5019g882N304j973K855J0250l761Q56O641Q526l908p374j0742j0861l160m058
5005a9287J2174J2163j1834k1842p525J0805J5583J2437J1501Q881j384j4150
4993G522o177r381j3222O096K0070J5119j8152r250q080p962M644J3350J3491
4980H068l902j8667n882J1763J7312M64r754j742O439R188j1548o114K453P455
4966E533o642p931k385l216r063m34Q224J5959J3219j0006k2899o756J2153J8882
4952D638O129n679k3184J49R547M108J1027j320j2789r578O507R27J1037J3504
$$ plain form
5048 -14282 -10499 -12722 -19144 -25483 -22090 -26072 -20926 -691 4627 9470 9064 4853 12204 9781 13757
5033 13757 9252 4316 18672 10251 -9590 -13231 -13468 -25811 -30077 -18179 -9883 -2968 -6813 -7882
5019 -7882 -2578 -4551 -1696 8554 4793 5649 12290 20816 16908 9534 -1208 -12069 -15229 -19287
5005 -19287 -7113 5050 -6784 -28626 -36151 -25346 -9763 2674 14175 23056 21672 7522
4993 7522 1345 -8036 -21258 -15162 4908 20027 1875 -7375 -15455 -23417 -18773 -5423 8068
4980 8068 4166 -14501 -20383 -8620 8692 9156 -598 -2340 4099 13287 1739 -4375 -1922 5533
4966 5533 -1109 -9040 -11425 -14641 -23704 -24138 -15914 45 13264 3258 -19641 -26397 -14244 4638
4952 4638 10767 5088 -18096 -17947 -8400 -4292 6735 5415 -7374 -16952 -10445 -9518 1519 15023
4938A5023p276j202R41j3954r138J4144J7317M843j3508o594J3473n389r24J1561
4924A9317n167j4516j788J2227n407R925r128j280j6710o390O989J8795l225m580
4910i38m66k137o334n665Q526K644J1906m419j361K763k582M211J453N08j6489
4895h380n867L990p202k443M740p400J2495l327j179k285R5J711J0741N168J0577
4880A1434Q263l978j9915N532J894p058M173J1876m33J3497M422j8365q186o22
4866B534P15l06k117M642l995k4328K004l25J5811J1914j3816n208Q211P015J578
4851D329j273j0800K522k991K096K725p7Q613M475l811k268Q667k0397o230n546
4836a9966J3137K2508J0527j0012m417j930k930k837J972p445q374j0919L761
$$ plain form
4938 15023 7747 6545 7486 -6468 -15606 -1462 15855 20698 7190 596 14069 8680 7756 19317
4924 19317 14150 -366 -2154 10073 4666 14591 5463 4183 -12527 -18917 -11928 6867 3642 -938
4910 -938 -1404 -3541 -9875 -15540 -7014 -4370 7536 3117 1756 4519 1937 6148 7601 8109 -8380
4895 -8380 -14247 -10257 -17459 -19902 -15162 -22562 -10067 -13394 -14573 -16858 -16763 -15052 -4311 857 11434
4880 11434 19697 15719 -4196 1336 3230 -3828 345 12221 11788 25285 29707 11342 3156 2534
4866 2534 3249 2943 826 5468 1473 -22855 -20851 -21176 -5365 6549 -7267 -12475 -4264 2751 4329
4851 4329 3056 -7744 -5222 -8213 -6117 -3392 -3469 5144 9619 5808 3540 12207 -8190 -14420 -19966
4836 -19966 -6829 15679 26206 16194 11777 9847 6917 4080 6052 -1393 -9767 -20686 -16925
4823a6925K1061O676j621q27n217j0518l660J020o228r800p788N840O522K216
4809a9249N048Q221R042k698q06P246N876L27J861O10n871p555q536M190J6850
4794A4556J5850k938j4457j3002m011J4346J44J5999n413j4426J467K444Q944
4781A9503M994J354o046k3725j657p442O592N878P565j6866j011L705J0478M993
4767H315k625q663j3453K256K5107O966j2343p810o071m676P696m29N714O908
4753F892p939n871n074o869j118J7966R669L937J0718J4665o604j6134k2156j2964
4739b0882j605J9029M621O339O88M823O501j9134q549P851l87j0396Q10R192l243
4724d342p428O94k082n869j246r721M9J1980j223n019O886K0376J0m585J615k352
$$ plain form
4823 -16925 4136 10812 9191 8364 3147 -7371 -11031 -10011 -16239 -26039 -33827 -27987 -21465 -19249
4809 -19249 -14201 -5980 3062 364 -442 6804 12680 13007 14868 15478 9607 2052 -6484 -2294 14556
4794 14556 30406 27468 13011 9 -4002 10344 10488 26487 21074 6648 8115 10559 19503
4781 19503 24497 25851 19805 -3920 -5577 -13019 -6427 -549 7016 -9850 -10861 -7156 3322 8315
4767 8315 5690 -2973 -16426 -14170 10937 17903 5560 -2250 -8321 -12997 -5301 -5730 -16 6892
4753 6892 -1047 -6918 -11992 -18861 -19979 -2013 7656 11593 22311 36976 30372 14238 -7918 -20882
4739 -20882 -22487 -3458 1163 7502 8190 13013 19514 380 -8169 -318 -705 -11101 -10291 -1099 -4342
4724 -4342 -11770 -11076 -13158 -19027 -20273 -29994 -29945 -17965 -19188 -24207 -17321 3055 3065 -1520 95 -2257
4708b257k200L953R465j951j3286n312J2330J522j479M275J0833j554j1800l322
4694g83j8189q87J17N425k913r9R510l292j4024l071R229K802n626L380J6657
4679a764J603j166o73k144Q699n497j1660q9n367Q665R539M707M393n927j132
4664B187p720j6904P151J2108J7772O070J731j3189q638j1422Q268Q101p462P090
4650E143k134O144O206p046j6538n318j9871P349L635M93N472o23p234R216K8841
4635A3735N706K019O160o159j4753p351M746L256l422l860k526j0864Q44j3539
4621b6008k895Q235q372l238R120J2529M716j1345k048P498J147j842Q334R237
4607E068K531k248r603r480j025M927Q903q89j5063Q6J999J2822L244j0232O142
$$ plain form
4708 -2257 -4457 -504 8961 7010 -6276 -11588 742 2264 785 5060 15893 14339 2539 -783
4694 -783 -18972 -19859 -19742 -14317 -17230 -17329 -7819 -11111 -25135 -28206 -18977 -16175 -21801 -18421 -1764
4679 -1764 -161 -1327 -2000 -4144 4555 -942 -12602 -12691 -18058 -9393 146 4853 9246 3319 2187
4664 2187 -5533 -22437 -15286 -3178 14594 20664 22395 9206 568 -10854 -2586 5515 -1947 5143
4650 5143 3009 9153 15359 8313 -8225 -13543 -33414 -26065 -22430 -21937 -16465 -17088 -24322 -15106 13735
4635 13735 19441 21460 27620 21461 6708 -643 4103 7359 3937 77 -2449 -13313 -12469 -26008
4621 -26008 -28903 -20668 -29040 -32278 -23158 -10629 -5913 -17258 -19306 -11808 -10661 -12503 -4169 5068
4607 5068 7599 5351 -4252 -13732 -14757 -9830 -927 -1816 -16879 -16793 -14794 -1972 1272 -8960 -2818
4592b818M974l382O429m654r900N987J5839J1053m577j4428j8930j9696P078J3343
4578a3682K686m46n65O770J090J0419L065n735O863M681P165j2021m270N388K155
4563A3563r1M974k186o489q341n734j959M760q686l829J269J4544K1534O605m298
4548B5636L798J0748j5016j1236p506M917K293j122j2018Q233J6378N368k248
4535B8225k5913j2960j649m85J880K934J3756J1023m55j2653k943N312J2703l708
4521A5067q696k114M428L273M982p498k588k417k62Q563j0675k2637J2260J1839
4507C525M685m774p430J6215O313L37q201J839o619j530l840j0141o652k259Q187
4492a0345O166M856r383M440M348k762o43l830J3914R590q547q575o080R08J1967
$$ plain form
4592 -2818 2156 -1226 5203 549 -9351 -3364 12475 23528 18951 4523 -14407 -34103 -27025 -13682
4578 -13682 -10996 -11442 -12007 -5237 -4147 6272 9337 3602 10465 15146 22311 10290 6020 11408 13563
4563 13563 13472 18446 16260 9771 1430 -4304 -6263 -1503 -10189 -14018 -12749 1795 23329 29934 25636
4548 25636 29434 40182 25166 13930 6424 11341 13634 12512 494 8727 25105 30473 28225
4535 28225 2312 -10648 -12297 -12782 -10902 -7968 5788 16811 16356 3703 760 6072 18775 15067
4521 15067 6371 4257 8685 11958 16940 9442 6854 4437 4175 12738 2063 -20574 -8314 3525
4507 3525 8210 3436 -3994 12221 18534 18871 10670 12509 5890 4360 520 -9621 -16273 -18532 -10345
4492 -10345 -4179 677 -8706 -4266 82 -2680 -3323 -7153 6761 16351 7804 -771 -6851 -5943 6024
4477F024R8m141N364r81k603K353L675q256m895j0655j579M976J258j891J5292
4462D039O094m704K741J0077N775j4152R40K126M817j0973l371Q885p253l054
4448A987J9611R066O454m542j1833k1155m444J0479L381M255M559N907R586N978
4434C9289j7216j4484O322j575L53n587r139M490O924M122o670j680p761K502
4420a10Q828Q55j1307j3847j329J3292N98k027J1237K420q126k0369P694O183
4406f008O728J5535p284r47J330j3905J6145K95l438j4186R615K489q292J256
4392f67M173n391m382M471M33m35lk048n340M26p764L0310J9208p631q243M61
4376A7578j6725j0825o605J4214Q461Q179l727j5093K786P47q904M698K359K455
$$ plain form
4477 6024 6122 1981 7345 6364 3761 6114 9789 1533 -3362 -14017 -15596 -10620 -9362 -11253 4039
4462 4039 10133 5429 8170 18247 24022 9870 10810 12936 17753 6780 3409 12294 5041 1987
4448 1987 21598 30664 37118 32576 20743 -412 -4856 5623 9004 13259 17818 23725 33311 39289
4434 39289 22073 7589 13911 12336 12689 7102 -2037 2453 9377 13499 6829 5149 -2612 -110
4420 -110 8718 9573 -1734 -15581 -16910 -3618 -3020 -5047 6190 8610 484 -19885 -12191 -6008
4406 -6008 720 16255 8971 8024 9354 -4551 11594 11889 8451 -5735 3880 6369 -1923 -667
4392 -667 3506 -1885 -6267 -1796 -1363 -1798 -1801 -3849 -9189 -8763 -16527 13783 32991 25360 17117 17578
4376 17578 853 -9972 -16577 -2363 6098 14277 10550 -4543 -1757 -1010 -9914 -5216 -2857 -402
4362d02J281k637L830l377N36O859Q065j6001j5592P967J4523L278j862l998J3784
4347A6254M49o481L666M927n623o876M321k087q682M440J602K701o259j995p831
4332g474j1618J214J9805J1862K778j2624m379J1667J3837j1814p959L435k784
4319E946m26R714L794o611o567J0356l924k2397r532J6801Q202j5420j3726q97
4305b4687K8466J043m143N214n654j1949P296J4073L901O68j2110O53l255M621
4291D137m48q976j551L328j033k356L234j3887o359M249J1955O645m031o173j645
4276a2911M452K1448j668K295n035N977j4548j4166R522J2535m332M13J6354p206
4262A3130p207L789m135J4277N759k98j3615P68m65r536r55k789n510N832p131
$$ plain form
4362 -402 879 -1758 2072 -1305 -769 6090 14155 -1846 -17438 -9471 5052 8330 6468 2470 16254
4347 16254 16703 10222 13888 18815 13192 6316 10637 8550 -132 4308 5910 8611 2352 357 -7474
4332 -7474 -19092 -17878 1927 13789 16567 3943 -436 11231 25068 13254 5295 8730 5946
4319 5946 5520 15234 19028 12417 5850 16206 12282 -10115 -19647 -2846 5356 -10064 -23790 -24687
4305 -24687 3779 4822 679 5893 239 -11710 -4414 9659 13560 14228 2118 2771 -484 4137
4291 4137 3689 -5287 -6838 -3510 -4543 -6899 -3665 -17552 -23911 -19662 -7707 -1062 -5093 -11266 -12911
4276 -12911 -8459 12989 11321 13616 8581 14558 10 -14156 -4634 7901 3569 3982 20336 13130
4262 13130 5923 9712 5577 19854 25613 25315 11700 12468 12003 2467 1512 -1277 -6787 -955 -8086
4247h086p42P012O924m603K39o569j48K236L521O642J1274O17j0631j2428j3666
4232a8408m507N181K1777K4734j306l228k0619j4213r412J5888P490m234L686
4219B829J3482j213j2313Q953n840O341N57J997o474j6778R45J1814P049P815
4205A9164j0718m450L856L416L210K008j7336O86J866J4094m408j0610J5680L401
4191A9859L194j146N731j748j4838O006Q2l985n568j6826n484J5584n098q935
4177a3172l14j0626J1036O920J52J371K101L383l394j1153q688n332J0750J6671
4163b95Q253J1623q333j2342l133k126P492J82L89K0048j2945j6212N378P566
4149E545N628l674J5771J974l750j1933j4172r908P878K330N392J3671K209m694
$$ plain form
4247 -8086 -8828 -1816 5108 505 744 -5825 -5973 -3737 -216 6426 17700 18317 7686 -4742 -18408
4232 -18408 -22915 -17734 4043 28777 27471 24243 3624 -10589 -20001 -4113 3377 -857 2829
4219 2829 16311 15098 2785 11738 5898 12239 12796 14793 8319 -8459 -7514 4300 11349 19164
4205 19164 8446 3996 7852 11268 14478 16486 -850 -164 1702 15796 11388 778 16458 19859
4191 19859 23053 21907 27638 25890 11052 17058 17140 13155 7587 -9239 -14723 861 -4237 -13172
4177 -13172 -13486 -24112 -13076 -6156 -6004 -4633 -2532 851 -2543 -13696 -22384 -27716 -16966 -295
4163 -295 7958 19581 11248 -1094 -4227 -6353 1139 1321 1710 21758 8813 -7399 -2021 5545
4149 5545 11173 7499 23270 25244 21494 9561 -4611 -14519 -6641 -4311 1081 14752 16961 12267
4135A2267K738M140j2571J638R20M443l301j1163l776Q155m522R32J5159r2p599
4120G368J2030l644j5126o486L552j838n942m017k662k522j4875K687J6466N693
4106i316r072p12j661M27Q972J1973O479L564j0499J899J943p84m210J736K16
4091I55L195k853M497M387P865p076k276j687O244N631J188j0045o699o649J0226
4076F903O142K31n452K717J512R119j2109j3162o03K2467L988q299M38l394p547
4061B951j3221p854O447J2981L607n640Q529K243j6808J302J1026M031k187J1451
4047A8858p719k0661K347Q537J5732l787p107k408j3525j99J0513m847r791k324
4033a6381M330J5241J542J1712L231j6951K13J312r705Q243N084M088o905j0541
$$ plain form
4135 12267 15005 19145 6574 8212 9132 13575 10274 -889 -4665 3490 -1032 -100 15059 14967 7368
4120 7368 19398 15754 628 -5858 -2306 -4144 -10086 -14103 -16765 -19287 -34162 -31475 -15009 -9316
4106 -9316 -18388 -19100 -20761 -20334 -11362 611 7090 10654 155 2054 3997 3213 -997 739 955
4091 955 4150 1297 5794 10181 18046 10970 8694 7007 13251 18882 20070 10025 3326 -3323 6903
4076 6903 13045 13276 7824 10541 12053 21172 9063 -4099 -4702 17765 21753 13454 13892 10498 2951
4061 2951 -10270 -18124 -11677 1304 4911 -729 7800 10043 -6765 -5463 5563 9594 7407 18858
4047 18858 11139 -9522 -7175 1362 17094 13307 6200 3792 -9733 -9932 581 -4266 -14057 -16381
4033 -16381 -12051 3190 4732 16444 19675 2724 2937 4249 -5456 2787 7871 11959 5054 -5487
4019e487M127N220n34J0350j93r838p148l906q121J1622J3697O389k097n589j2879
4004d387j9807J4882R556m562j1358M142k994l094N827l056J829L217q0L1M822
3989e032J0406j0877j5437L634R399N005p503R577L424J2743R388j1389r353k891
3975A094N828J770m449o223q215j848L793o926j0931O647J4000O850L466n01l158
3960A197j3008J92L457J501J572k969J309L168Q938j25k725j7731J281Q302J0814
3945E173J792j2113M252P120K56m885q688J2961J0756N31m985n19Q155r265j667
3930H874J277l278O796P151j4982n236k097l829r72J790r12j4886J827l439K848
3915a9068l515p03J1043m752k990M474K885J4401k953oJ0208o027p261m969J00
$$ plain form
4019 -5487 -1360 3860 3326 13676 13483 3645 -3503 -7409 -15530 -3908 9789 16178 14081 8492 -4387
4004 -4387 -24194 -9312 244 -4318 -15676 -11534 -14528 -17622 -11795 -14851 -13022 -9805 -9885 -9854 -5032
3989 -5032 5374 -5503 -20940 -17306 -7907 -2902 -10405 -828 2596 15339 24727 13338 3985 1094
3975 1094 6922 8692 4243 -1980 -10195 -12043 -8250 -15176 -26107 -19460 -5460 1390 4856 4355 1197
3960 1197 -11811 -11619 -8162 -6661 -5089 -8058 -6749 -3581 5357 5232 2507 -15224 -13943 -5641 5173
3945 5173 6965 -5148 -896 6224 6480 1595 -7093 5868 16624 17155 12170 11651 19806 10541 8874
3930 8874 10151 6873 13669 20820 5838 602 -1495 -5324 -6296 -4506 -5418 -20304 -18477 -21916 -19068
3915 -19068 -22583 -23286 -12243 -16995 -19985 -15511 -12626 1775 -1178 -1184 9024 2997 -4264 -9233 -9133
3900i133n022J3117K677M13j5388Q551M541N692n45n965O660k455j4363P575r66
3885d611j556O389P318L329J2717l413j8272p558P820J1241k178r200l664N437
3871C799O796k373m642j068L096p002P530o779k369P237n560J054M002j333k256
3856A32K023k906M503k398j0524p076J3146q401j1295j266O441P606L370q651
3842a5296K793Q805p069q762j938L729L312n138P601J4234J1351M490k346p564
3828H202Q29l328K638N598J0361j347j8366l972J4252J0308j2281l0032k343Q453
3814a1028o529p305J3052K878m536q18N225o277O949J3413m21M371M957m558j1543
3799b170M423M045n076j1713n664J1177q427m994L547Q452M017K1828Q794j7820
$$ plain form
3900 -9133 -14155 -1038 1639 2052 -13336 -4785 -244 5448 4903 -1062 5598 3143 -11220 -3645 -4611
3885 -4611 -6167 222 7540 10869 23586 20173 1901 -5657 2163 13404 11226 2026 -1638 3799
3871 3799 10595 8222 3580 2512 5608 -1394 6136 -643 -3012 4225 -1335 -281 3721 2388 132
3856 132 2155 -751 3752 1354 -9170 -16246 -3100 -11501 -22796 -24062 -17621 -10015 -6645 -15296
3842 -15296 -12503 -3698 -10767 -19529 -21467 -17738 -14426 -19564 -11963 2271 13622 18112 15766 8202
3828 8202 9031 5703 8341 13939 24300 22953 4587 615 14867 25175 12894 -17138 -19481 -11028
3814 -11028 -17557 -24862 -11810 -8932 -13468 -14286 -9061 -15338 -8389 5024 4603 8974 13931 9373 -2170
3799 -2170 2253 6298 1222 -10491 -16155 -4978 -13405 -18399 -14852 -6400 -2383 19445 28239 10419
3785A0419k342J2536L858m750L456j590Q765j6345j5754j0005l815J2878J2194
3772I505j6087q873J8422M028o108j391J666p226M287J0051j6844M358Q910M609
3758I307J104p874o660m677L177J1972K518l666q276n485R651J1307J307m884
3744H821N335m781M93K492n46Q113j2061o687M922n472o448J0225K49M049j1754
3729c050l248J3056m442L65n771k849K901R029q850n025P396o832L958J6740K2621
3714C5999J070k6249j1595Q153n605O832J5821q879j7577j1128J4933J4450M833
3701B1058m967m050J253k364J468J31M437p880j3936R400p214j1719J689L185
3687i509j367J0592J0258k202K783J832N286N55n786r453o010j1741K1251Q610
$$ plain form
3785 10419 8077 20613 24471 19721 23177 21587 30352 14007 -1747 -11752 -15567 -2689 9505
3772 9505 -6582 -15455 2967 6995 887 -504 1162 -6064 -1777 8274 -8570 -4212 4698 9307
3758 9307 10411 2537 -4123 -8800 -5623 6349 8867 5201 -3075 -8560 1091 12398 13705 8821
3744 8821 14156 9375 9868 12360 11814 19927 7866 1179 6101 629 -5819 4406 4655 8704 -3050
3729 -3050 -6298 6758 2316 2681 -3090 -5939 -3038 5991 -2859 -7884 -488 -7320 -3362 13378 35999
3714 35999 37069 10820 -775 7378 1773 8605 24426 15547 -2030 -13158 1775 16225 21058
3701 21058 16091 12041 13294 10930 12398 12529 16966 9086 -4850 4550 -2664 -14383 -12694 -9509
3687 -9509 -10876 -284 9974 7772 10555 12387 17673 18228 12442 2989 -3021 -14762 6489 15099
3673A5099Q470L314j145N933k378M281r38j4443p357N225p948K056l121Q451o122
3658I377J916O977P726j814j1657k0519N608M88N491N806n154n904O70K52j611
3643b348l222j800M491P88k427N747o565k0058j0099R351r525Q396R322N996J5920
3628C967J4330q518j3948J394k083j457K813n103n744J4041J1516q580j818J2179
$$ plain form
3673 15099 23569 26883 25738 31671 29293 33574 32636 18193 10836 16061 8113 10169 7048 15499 9377
3658 9377 11293 18270 25996 24182 12525 -7994 -2386 -1898 3593 9399 4245 -1659 -989 -737 -2348
3643 -2348 -5570 -7370 -2879 -2091 -4518 1229 -5336 -25394 -35493 -26142 -35667 -27271 -17949 -11953 3967
3628 3967 18297 9779 -4169 -2775 -4858 -6315 -3502 -8605 -14349 -308 11208 2628 810 12989
$$ [...]
##END NTUPLES=NMR SPECTRUM
##END=
