##TITLE=Analysis number 324395
Compound Code cc 17407
Project Code adrs
Chemist Name fudan
##JCAMPDX= 6.0         $$ Bruker NMR JCAMP-DX V2.0
##DATA TYPE= NMR SPECTRUM
##DATA CLASS= NTUPLES
##ORIGIN= Bruker BioSpin GmbH
##OWNER= nmr
$$ XWIN-NMR		Version 3.5
$$ Mon Nov 20 14:15:31 2006 GMT Standard Time (UT+0h)  MAYBRIDGE\nmr@NMR_250MHZ
##.OBSERVE FREQUENCY= 250.131544655141
##.OBSERVE NUCLEUS= ^1H
##.ACQUISITION MODE= SIMULTANEOUS (DQD)
##.ACQUISITION SCHEME= undefined
##.AVERAGES= 16
##.DIGITISER RES= 18
##SPECTROMETER/DATA SYSTEM= dpx250
##.PULSE SEQUENCE= zg30
##.SOLVENT NAME= CDCl3
##.SHIFT REFERENCE= (INTERNAL, CDCl3, 0, 16.4489)
##AUDIT TRAIL= $$ (NUMBER, WHEN, WHO, WHERE, WHAT)
$$ ##TITLE= Audit trail, XWIN-NMR		Version 3.5
$$ ##JCAMPDX= 5.01
$$ ##ORIGIN= Bruker BioSpin GmbH
$$ ##OWNER= nmr
$$ C:\u/data/dgb/nmr/ADRS/690/pdata/1/auditp.txt
$$ ##AUDIT TRAIL=  $$ (NUMBER, WHEN, WHO, WHERE, WHAT)
(   1,<2006-11-20 14:15:07.75 +000>,<MAYBRIDGE\nmr>,<NMR_250MHZ>,
      <created by zg, POWCHK disabled, PULCHK disabled
       configuration hash MD5:
       49 4B E0 1D 92 C2 6B 37 9F E6 65 BC 52 41 86 1D
       data hash MD5: 64K
       D5 75 BA 54 C3 43 20 62 CE B9 A4 25 BF 6D E8 EE>)
(   2,<2006-11-20 14:15:21.21 +000>,<MAYBRIDGE\nmr>,<NMR_250MHZ>,
      <Start of raw data processing
       ef LB = 0.3 FT_mod = 6 PKNL = 1 SI = 32K 
       data hash MD5: 32K
       30 B6 73 4A EC 0B FA BD 23 E9 64 B1 AC 6F A9 45>)
(   3,<2006-11-20 14:15:22.88 +000>,<MAYBRIDGE\nmr>,<NMR_250MHZ>,
      <apk 
       data hash MD5: 32K
       69 86 55 75 7C 34 8F BD 22 30 81 40 9B 61 FC DA>)
(   4,<2006-11-20 14:15:23.68 +000>,<MAYBRIDGE\nmr>,<NMR_250MHZ>,
      <abs ABSG = 5 
       data hash MD5: 32K
       24 15 E4 2A F9 E2 8F 56 1D 9F 50 C2 C0 6E 65 EE>)
$$ ##END=
$$ 
$$ hash MD5
$$ EB 6F FE C8 A4 4F B9 12 E0 59 99 E8 14 A5 01 89
##$RELAX= 
##$RELAX= 
##$RELAX= 
##$RELAX= 
##$RELAX= 
##$RELAX= 
##$RELAX= 
$$ Bruker specific parameters
$$ --------------------------
##$DU= <C:\u>
##$EXPNO= 690
##$NAME= <ADRS>
##$PROCNO= 1
##$TYPE= <nmr>
##$USER= <dgb>
##$AMP= (0..31)
100 100 100 100 100 100 100 100 100 100 100 100 100 100 100 100 100 100 
100 100 100 100 100 100 100 100 100 100 100 100 100 100 
##$AQSEQ= 0
##$AQ_mod= 3
##$AUNM= <au_zg>
##$AUTOPOS= <22 >
##$BF1= 250.13
##$BF2= 250.13
##$BF3= 250.13
##$BF4= 250.13
##$BF5= 500.13
##$BF6= 500.13
##$BF7= 500.13
##$BF8= 500.13
##$BYTORDA= 1
##$CFDGTYP= 0
##$CFRGTYP= 5
##$CHEMSTR= <none>
##$CNST= (0..31)
1 1 145 1 1 1 1 1 1 1 1 1 1 1 1 1 1 1 1 1 1 1 1 1 1 1 1 1 1 1 1 1 
##$CPDPRG= <>
##$CPDPRG1= <>
##$CPDPRG2= <>
##$CPDPRG3= <>
##$CPDPRG4= <mlev>
##$CPDPRG5= <mlev>
##$CPDPRG6= <mlev>
##$CPDPRG7= <mlev>
##$CPDPRG8= <mlev>
##$CPDPRGB= <>
##$CPDPRGT= <>
##$D= (0..31)
0 1 0 0 0 0 0 0 0 0.06 0 0 0 0 0 0 0.0002 0 0 0 0 0 0 0 0 0 0 0 0 0 0 
0 
##$DATE= 1164032106
##$DBL= (0..7)
120 120 120 120 120 120 120 120 
##$DBP= (0..7)
150 150 150 150 150 150 150 150 
##$DBP07= 0
##$DBPNAM0= <>
##$DBPNAM1= <>
##$DBPNAM2= <>
##$DBPNAM3= <>
$$ [...]
##$SUBNAM7= <"">
##$SUBNAM8= <"">
##$SUBNAM9= <"">
##$SW= 20.6930455092707
##$SWIBOX= (0..15)
0 0 3 0 0 0 0 0 0 0 0 0 0 0 0 0 
##$SW_h= 5175.983436853
##$TD= 65536
##$TD0= 1
##$TE= 683.16
##$TE2= 300
##$TE3= 300
##$TEG= 300
##$TL= (0..7)
0 120 120 120 120 120 120 120 
##$TP= (0..7)
150 150 150 150 150 150 150 150 
##$TP07= 0
##$TPNAME0= <>
##$TPNAME1= <>
##$TPNAME2= <>
##$TPNAME3= <>
##$TPNAME4= <>
##$TPNAME5= <>
##$TPNAME6= <>
##$TPNAME7= <>
##$TPOAL= (0..7)
0.5 0.5 0.5 0.5 0.5 0.5 0.5 0.5 
##$TPOFFS= (0..7)
0 0 0 0 0 0 0 0 
##$TUNHIN= 0
##$TUNHOUT= 0
##$TUNXOUT= 0
##$USERA1= <user>
##$USERA2= <user>
##$USERA3= <user>
##$USERA4= <user>
##$USERA5= <user>
##$V9= 5
##$VALIST= <valist>
##$VCLIST= <CCCCCCCCCCCCCCC>
##$VD= 0
##$VDLIST= <DDDDDDDDDDDDDDD>
##$VPLIST= <PPPPPPPPPPPPPPP>
##$VTLIST= <TTTTTTTTTTTTTTT>
##$WBST= 1024
##$WBSW= 4
##$XGAIN= (0..3)
0 0 0 0 
##$XL= 0
##$YL= 0
##$YMAX_a= 540190
##$YMIN_a= -504167
##$ZGOPTNS= <>
##$ZL1= 120
##$ZL2= 120
##$ZL3= 120
##$ZL4= 120
##$ABSF1= 16.44895
##$ABSF2= -4.244223
##$ABSG= 5
##$ABSL= 3
##$ALPHA= 0
##$AQORDER= 0
##$ASSFAC= 0
##$ASSFACI= 0
##$ASSFACX= 0
##$ASSWID= 0
##$AUNMP= <proc_1d>
##$AZFE= 0.1
##$AZFW= 0.1
##$BCFW= 0
##$BC_mod= 0
##$BYTORDP= 0
##$COROFFS= 0
##$CY= 12.5
##$DATMOD= 1
##$DC= 0
##$DFILT= <>
##$DTYPP= 0
##$F1P= 14.0000005364418
##$F2P= -0.99999901652339
##$FCOR= 0.5
##$FTSIZE= 32768
##$FT_mod= 6
##$GAMMA= 0
##$GB= 0
##$INTBC= 1
##$INTSCL= 1
##$ISEN= 128
##$LB= 0.3
##$LEV0= 0
##$LPBIN= 0
##$MAXI= 10000
##$MC2= 0
##$MEAN= 0
##$ME_mod= 0
##$MI= 0
##$NCOEF= 0
##$NC_proc= -4
##$NLEV= 6
##$NOISF1= 0
##$NOISF2= 0
##$NSP= 0
##$NTH_PI= 0
##$NZP= 0
##$OFFSET= 16.44895
##$PC= 1
##$PHC0= -51.71912
##$PHC1= 4.781789
##$PH_mod= 1
##$PKNL= yes
##$PPARMOD= 0
##$PSCAL= 4
##$PSIGN= 0
##$REVERSE= no
##$SF= 250.13001827016
##$SI= 32768
##$SIGF1= 0
##$SIGF2= 0
##$SINO= 400
##$SIOLD= 32768
##$SREGLST= <1H.CDCl3>
##$SSB= 0
##$STSI= 32768
##$STSR= 0
##$SW_p= 5175.98343685301
##$SYMM= 0
##$S_DEV= 0
##$TDeff= 65536
##$TDoff= 0
##$TI= <Analysis number 999999
Compound Code 99
Book Reference 9
Project Code 9>
##$TILT= no
##$TM1= 0
##$TM2= 0
##$TOPLEV= 0
##$USERP1= <user>
##$USERP2= <user>
##$USERP3= <user>
##$USERP4= <user>
##$USERP5= <user>
##$WDW= 1
##$XDIM= 32768
##$YMAX_p= 266526284
##$YMIN_p= -203738
$$ End of Bruker specific parameters
$$ ---------------------------------
##NTUPLES= NMR SPECTRUM
##VAR_NAME=  FREQUENCY,     SPECTRUM/REAL,   SPECTRUM/IMAG
##SYMBOL=    X,             R,               I
##VAR_TYPE=  INDEPENDENT,   DEPENDENT,       DEPENDENT
##VAR_FORM=  AFFN,          ASDF,            ASDF
##VAR_DIM=   32768,         32768,           32768
##UNITS=     HZ,            ARBITRARY UNITS, ARBITRARY UNITS
##FACTOR=    0.157963299565203, 1,           1
##FIRST=     4114.37611746144, 0,            0
##LAST=      -1061.60731939157, 0,           0
##MIN=       -1061.60731939157, -203738,     0
##MAX=       4114.37611746144, 266526284,    0
$$ Real data points
##PAGE= N=1
##DATA TABLE= (X++(R..R)), XYDATA
$$ [...]
18167E09416L186K2935R4j0534n072P5996J04334J6749J4965K7975n2992l4713
18155F72339l7686m3744P080L7580R5898P3307O3010Q4918J17097K9020m1062
18144A057757j3029J3016L2698m0251M935j7457p918M3476M3579J915K8424M9904
18132A197049M4047M8513P7450J46114J51586R1284J20024J90742K80229L27632
18122B674670M15088M79779O27887Q88348J143293J657127K836844M905325Q376512
18113B4004873J2546453J5036237J4230668R605365k380012r247881j2561091
18106E1234612j2559748j0009632p642087n544784l762071k510939j691405j100942
18098F413004p87268o56947m73050l22774k68040k58490k16871j57836j68477
$$ y = [509416, 512602, 535537, 535631, 525097, 520025, 596021, 700355, 717104, 732069, 760044, 707052, 672339, 634653, 590909, 597989, 635569, 731467, 804774, 867784, 952702, 1069799, 1098819, 1057757, 1044728, 1057744, 1090442, 1050191, 1055126, 1037669, 1029751, 1073227, 1116806, 1118721, 1147145, 1197049, 1241096, 1289609, 1367059, 1513173, 1664759, 1756043, 1876067, 2066809, 2347038, 2674670, 3089758, 3569537, 4197424, 5085772, 6229065, 7886192, 10723036, 15628361, 24004873, 36551326, 51587563, 65818231, 75423596, 73043584, 63795703, 51234612, 38674864, 28665232, 21023145, 15478361, 11716290, 9205351, 7513946, 6413004, 5625736, 4968789, 4495739, 4172965, 3904925, 3646435, 3429564, 3271728, 3103251]
18089C103251j32339j61080j52803j25087p9761j07670j1764L6659O3314J45402
18079B578122P7483n911q5190j19493p7148j11166j19668j10047o3682j25736
18069A837564j10410l9902p707J2847o0083p2305o7022m8652m571j6706p6305
18058A346748l0878l0269n1900n312K5132n28k0252o1145p6154j2694M6575R562
18046A138885l9063l8732K3521L7076N7269k0749K3061K7042L2841K2173M7388
18035A310712M3315K5932l6094j5227m2552N5859J8099J0481K5722J61499K36673
18024A794419K00732K23029J48617O8558K4942p8298j73619j10395p8474j01213
18014A918298j69716q5453n7066r6231j4826L4980M4405M9824K9257L9335N1046
$$ y = [3103251, 2970912, 2809832, 2657029, 2531942, 2452181, 2344511, 2332747, 2369406, 2432720, 2578122, 2655605, 2649694, 2564504, 2445011, 2367863, 2256697, 2137029, 2026982, 1963300, 1837564, 1727154, 1687252, 1679545, 1692392, 1632309, 1560004, 1492982, 1444330, 1439759, 1423053, 1346748, 1315870, 1285601, 1233701, 1228389, 1253521, 1252993, 1232741, 1171596, 1095442, 1082748, 1129323, 1138885, 1099822, 1061090, 1084611, 1121687, 1178956, 1158207, 1181268, 1208310, 1241151, 1263324, 1310712, 1354027, 1379959, 1343865, 1328638, 1286086, 1341945, 1360044, 1370525, 1396247, 1557746, 1794419, 1995151, 2218180, 2366797, 2435355, 2460297, 2381999, 2208380, 2097985, 2019511, 1918298, 1748582, 1663129, 1606063, 1509832, 1495006, 1529986, 1574391, 1624215, 1653472, 1692807, 1743853]
18003A743853O5280L1735J11236Q7908M53J042L3564M9492l274K0790M6277J03432
17991B291788J02278J57548J63159J92077K01102K07052K92891L90395L91503
17982D389793L73578N24229N88759P60774R21805J176448J611758J999275K171482
17973A4517901J879438J096447K1629q01745j193178j112218o90706k68038J96834
17964A3646364P14027J230594J816304K568500L516523N117525P871154J2273559
17956D8754550J8648313K5578224L0001182K9574269K1720799O901864o302048
17949A74877153j5901912k1215164k2234037k0110169j6473688j1926628p286568
17942E9728987k981856O95671L205855M143519K940939l26092m107242o668906
$$ y = [1743853, 1809133, 1840868, 1952104, 2040012, 2040465, 2041507, 2075071, 2124563, 2121289, 2142079, 2188356, 2291788, 2394066, 2551614, 2714773, 2906850, 3107952, 3315004, 3607895, 3998290, 4389793, 4763371, 5287600, 5876359, 6637133, 7558938, 8735386, 10347144, 12346419, 14517901, 16397339, 17493786, 17515415, 16713670, 15520492, 14408274, 13717568, 13449530, 13646364, 14360391, 15590985, 17407289, 19975789, 23492312, 28609837, 36480991, 48754550, 67402863, 92981087, 122982269, 152556538, 174277337, 181179201, 174877153, 158975241, 137760077, 115526040, 95415871, 78942183, 67015555, 59728987, 56747131, 57442802, 60648657, 64792176, 67733115, 67407023, 63299781, 56630875]
17934E6630875p689193p312809o232427m892450l610703k532875j768862j305057
17926B1286499r58035p74779n61688l12295o0226J11968K88268L50055M44581
17917A9814348P50441J237049K113724L435760N241322P224903Q700338Q902918
17909E7420803P280694L660450m21442l107796l964192k909028n71757K867628
17901F0255360P471686J3327589K0181110K7384371L2865479L3077271K6790002
17894B21352868J3383449o841967k4239086l2739853l4147291k9875187k3785038
17887H3107895j7945694j2920365q957880o228511m452384l196307k232068j368716
17879B5805970o21626L82903J285986J842702J780533R31567o32903k132368k947274
$$ y = [56630875, 48941682, 41628873, 35396446, 30503996, 26893293, 24360418, 22591556, 21286499, 20328464, 19553685, 18991997, 18679702, 18619476, 18731444, 19019712, 19369767, 19814348, 20564789, 21801838, 23915562, 27351322, 32592644, 39817547, 48517885, 57420803, 64701497, 68361947, 67940505, 64832709, 60868517, 57959489, 57387732, 60255360, 67727046, 81054635, 101235745, 128620116, 161485595, 194562866, 221352868, 234736317, 227894350, 203655264, 170915411, 136768120, 106892933, 83107895, 65162201, 52241836, 43283956, 37055445, 32603061, 29406754, 27174686, 25805970, 25184344, 25567247, 26853233, 28695935, 30476468, 31408035, 30775132, 28642764, 25695490]
17870B5695490l180342k927728k507379k201046j868796j506149j209701r37087
17862I357262p96427o36587n59139m83480m07257l02034k57372k58271k67295
17853E389400k36270j73577j98939j78116j34458j54850j73587j52773j66819
17844C820011j56379j50387j31823j01773n3520j12076p9715n0378k7324l9753
17834B916883p9034l3647n7946q2147L3957M7711M5319J22929J20260q197p6228
17823B949860j19354j19456j28302q6848j46994j13563j03850j27515k0669l5774
17813A947535m6832q5619n2092o0408r0712p8625q9945n6253k5233k0232o9143
17802A272441q5524m2155l0202m0438o3158k5957m4556m4773k2681j3M6845K7756
$$ y = [25695490, 22515148, 19587420, 17080041, 14878995, 13010199, 11504050, 10294349, 9357262, 8560835, 7924248, 7365109, 6881629, 6474372, 6172338, 5914966, 5656695, 5389400, 5153130, 4979553, 4780614, 4602498, 4468040, 4313190, 4139603, 3986830, 3820011, 3663632, 3513245, 3381422, 3279649, 3226129, 3114053, 3034338, 2983960, 2956636, 2916883, 2837849, 2804202, 2746256, 2664109, 2698066, 2745777, 2791096, 2914025, 3034285, 3026088, 2949860, 2830506, 2711050, 2582748, 2495900, 2348906, 2235343, 2131493, 2003978, 1983309, 1947535, 1900703, 1815084, 1762992, 1702584, 1611872, 1533247, 1443302, 1387049, 1361816, 1341584, 1272441, 1186917, 1144762, 1114560, 1074122, 1010964, 985007, 940451, 895678, 872997, 872984, 919829, 947585]
17790I47585j9097o0577k1363N6711N5918J532j2267M9867K4902J8640p5809n6249
17778I09793o825M5012K1500M6524N7293Q5778J21246K27262J54724J34782J36463
17767A933552N8456j03940j25077j52089j46282j27482j50342q8061r6473r3173
17757I09089q3246n0627k9437q5645L0814L8710o9579K2409Q7566j288l1501q3738
17745F53527k5030J1368l1674k8341L3164J0330n3120p3822m1072p062P412l9936
17733D15744L9799L8993o293N3578J8515k9762p4448o2647K035p39J3652j6804
17721C91623L588M0033o396L8708j7187k0913O3874L2881N0710N6391L9481L7598
17709G10391K3749K8968J0524m163j613j0298p7206r2666k6555j6920R087M0371
$$ y = [947585, 928488, 867911, 846548, 903259, 959177, 960709, 948442, 998309, 1023211, 1041851, 966042, 909793, 902968, 947980, 969480, 1016004, 1073297, 1159075, 1280321, 1507583, 1662307, 1797089, 1933552, 1992008, 1888068, 1762991, 1610902, 1464620, 1337138, 1186796, 1098735, 1002262, 909089, 825843, 775216, 745779, 660134, 690948, 729658, 660079, 682488, 770054, 768766, 737265, 653527, 628497, 639865, 608191, 579850, 613014, 623344, 570224, 496402, 455330, 448268, 455680, 415744, 455543, 494536, 488243, 541821, 560336, 530574, 456126, 393479, 395514, 394775, 408427, 391623, 395211, 435244, 428848, 467556, 450369, 429456, 493330, 526211, 576921, 633312, 672793, 710391, 734140, 763108, 773632, 769469, 767856, 757558, 680352, 587686, 561131, 544211, 553298, 593669]
17697E93669r219L6556M1773n242j4838k1126l9362n1323n1790p5977j8483j1973
17685C72665J130O1835O1574m8949k9320O3903k765K1997J5582o0674n5374o969
17673C94635K9585k1507j7935r663m928m1645K3698l1657O9507J2121j368J8848
17661D19691K0629K3556j9803K5877N9128O5672o070J168m5928n0980o5228m2352
17649C85360k5696m284l769K949L3117J7930K3473L6289R815K6922k7268n2030
17637D22808j4197K8455J2299R73k1630K7371J9920J1564J4890N174j0578q9709
17625D07340j674O5467J1450m563j3079J58P7445j1665k5750m1455L5579M1120
17613E40373r935K8122K1817l613K728r291J2713N5344k3480l1419P5188p550
$$ y = [593669, 584450, 621006, 662779, 657537, 642699, 621573, 582211, 530888, 479098, 403121, 384638, 372665, 373795, 435630, 497204, 448255, 418935, 482838, 480073, 502070, 517652, 456978, 401604, 394635, 424220, 402713, 384778, 375115, 370187, 328542, 352240, 320583, 390090, 402211, 400843, 419691, 440320, 463876, 444073, 469950, 529078, 594750, 588680, 589848, 543920, 492940, 427712, 385360, 359664, 355380, 351611, 354560, 387677, 405607, 429080, 465369, 475184, 502106, 474838, 422808, 408611, 437066, 449365, 450338, 428708, 456079, 475999, 487563, 502453, 507627, 497049, 407340, 405666, 471133, 482583, 478020, 464941, 465099, 542544, 530879, 505129, 463674, 499253, 540373, 530438, 558560, 580377, 576764, 579492, 570201, 582914, 638258, 614778, 583359, 658547, 650997]
17601F50997L3137M0572J1246L750r09L6273K885M5845P4180J08445J59508J67082
17589A333011J84829J55566J05429N9894k2672o0810n2493j25774j17139r4075
17579A365766q0572o1940K5293l0689o1700M184R031N4207P2817J5580n899k1548
17567A284530p2783R552K6513k4013n3191o1568k9977J4373K7162n1907k4839
17556A043852P5070m6995O095L4700K3138r843m0616L8146Q3042L6276j4925K9568
17544A257508O654M9880L4565J2641J8496K4110N4856k189M3423J13220J01762
17533A714926J44079J27907R6259M3887P0343K7585n9292p288m3955k0987k0420
17522B073044m2461m7191k8127K4813J6571K7147N4525Q2647R5154J7558Q6463
$$ y = [650997, 684134, 724706, 735952, 739702, 738793, 775066, 777951, 823796, 897976, 1006421, 1165929, 1333011, 1517840, 1673406, 1778835, 1838729, 1816057, 1755247, 1702754, 1576980, 1459841, 1365766, 1285194, 1223254, 1248547, 1217858, 1156158, 1160342, 1169373, 1223580, 1296397, 1311977, 1306078, 1284530, 1211747, 1221299, 1247812, 1223799, 1170608, 1109040, 1079063, 1093436, 1120598, 1068691, 1043852, 1118922, 1071927, 1078022, 1112722, 1135860, 1126017, 1085401, 1123547, 1206589, 1242865, 1227940, 1257508, 1264162, 1314042, 1348607, 1361248, 1379744, 1403854, 1458710, 1456521, 1499944, 1613164, 1714926, 1859005, 1986912, 2083171, 2127058, 2197401, 2224986, 2165694, 2158406, 2114451, 2093464, 2073044, 2030583, 1983392, 1955265, 1980078, 1996649, 2023796, 2078321, 2160968, 2256122, 2273680, 2360143]
17511B360143Q1001P8198L4023K8924O3920P3022N7226K4714J21435J13145J50031
17500C185782J87089J53473K30050L28515L10820L39967L99290M86804N16426
17491F138216O05588O02215O11559P78910J038600J376771J757504K277574K556346
17482A7743283K430119K056465J389527M74827l31014q36017q81986n97148j76353
17473B1271703L74795J160415K053346L132267M504118O505975R327741J3205410
17465F1535770J8048622K2997018K6654948K7097412K3036734J4556686L516222
17458A97443412p184393j5315954j9944177k1209839j9840665j6795794j2871974
17451H4280616q801537m930142j754814K92483R86601L31379j309919l506380
$$ y = [2360143, 2441144, 2519342, 2553365, 2582289, 2646209, 2719231, 2776457, 2801171, 2922606, 3035751, 3185782, 3372871, 3526344, 3756394, 4084909, 4395729, 4735696, 5134986, 5621790, 6138216, 6743804, 7346019, 7957578, 8736488, 9775088, 11151859, 12909363, 15186937, 17743283, 20173402, 22229867, 23619394, 24094221, 23763207, 22927190, 22045204, 21448056, 21271703, 21646498, 22806913, 24860259, 27992526, 32496644, 39002619, 48330360, 61535770, 79584392, 102581410, 129236358, 156333770, 179370504, 193927190, 197443412, 190259019, 174943065, 154998888, 133789049, 113948384, 97152590, 84280616, 75479079, 70548937, 68794123, 69086606, 70073207, 70404586, 69094667, 65588287]
17443F5588287n371675o419954o630776o223862n327914m310821l322811k603208
17435B5377266j902601j286710q98149o28341l89715j33587j5918J25201K81323
17426B0528769O44962J094699J748296K577512L505708M625838N535198O036767
17418D6297749N785702M638837K789391P94471o84285j082719m19748J336303
17410E9455701L893445P095717J0725923J4268187J6912796J7879280J6223279
17403A46454328J1345318L732663n072497j2947241j8009392j9769872j8823698
17396H6909609j6333068j3258711j0263922p702392n783959m231843l020897k094325
17388B4220492j436763q03729k00887R4212K97617L34962J514o03289j199254
$$ y = [65588287, 60216612, 53796658, 47165882, 40942020, 35614106, 31303285, 27980474, 25377266, 23474665, 22187955, 21289806, 20661465, 20271750, 20138163, 20122245, 20247446, 20528769, 21173731, 22268430, 24016726, 26594238, 30099946, 34725784, 40260982, 46297749, 52083451, 56722288, 59511679, 60306150, 59621865, 58539146, 58119398, 59455701, 63349146, 70444863, 81170786, 95438973, 112351769, 130231049, 146454328, 157799646, 161532309, 156459812, 143512571, 125503179, 105733307, 86909609, 70576541, 57317830, 47053908, 39351516, 33567557, 29335714, 26314817, 24220492, 22783729, 21980000, 21779113, 21873325, 22170942, 22505904, 22507418, 21904129, 20704875]
17379B0704875j612401j853126j779601j595246j413533j135741r38217p68305
17371I608705p21567o48895o14677m80467m18661m13584l46587l12424k28507
17362E423336k57525k91300k87346j94799q2956j60998j60050j23469j35355r4428
17352C635110j40542j60190j13719j00516o1303o1920o4720j29991p1593J6377
17342B746993r2624l6389J9720k5219N4863J33683N5438K0366O4564O4321P956
17331C013672r5985j90562j90610j99569j44751q3766j42617j21368m4995n0630
17321A748819n3219p6734o6029q5064n0942j8202j02398l5048k1498l8038r9187
17310A102460r6114o0106p0116l2175J14o8600J2514K0987n2070n3605J3196L2552
$$ y = [20704875, 19092474, 17239348, 15459747, 13864501, 12450968, 11315227, 10377010, 9608705, 8887138, 8238243, 7623566, 7143099, 6724438, 6310854, 5964267, 5651843, 5423336, 5165811, 4874511, 4587165, 4392366, 4309410, 4148412, 3988362, 3864893, 3729538, 3635110, 3494568, 3334378, 3220659, 3120143, 3058840, 2996920, 2932200, 2802209, 2730616, 2746993, 2654369, 2617980, 2637700, 2612481, 2667344, 2801027, 2856465, 2876831, 2941395, 3005716, 3013672, 2917687, 2727125, 2536515, 2336946, 2192195, 2108429, 1965812, 1844444, 1799449, 1748819, 1695600, 1618866, 1552837, 1467773, 1416831, 1398629, 1296231, 1261183, 1239685, 1201647, 1102460, 1006346, 946240, 876124, 843949, 844063, 775463, 787977, 808964, 756894, 703289, 716485, 749037]
17298G49037J702K4645M8445R456l6843M2233j9240P29O1394L7664l8019o9255
17286H11948k3027l0595M857P0391M8529P3268N4375J17602P0764Q5003K9225
17275A312340K1707p0279n9294j39186j77981r3099o1621j21740p1243p6896q6940
17264C75768q6779p0164j1476O8283K0680o0177L3463J2684L8581l0034n6679
17253B34150j4246m349P388p739j3345J1424J9743l8768R12M812K644K0317r237
17240B13706k6550o688k669m9463k8597O1084k5578N992J7711j3578k1565R4n3356
17227G0543o6479N7968N7921o4031M59M6070M0409P813o942R933k1693l4664l1786
17214F5521k5316k6222m0470J2317K2194r875M1921k7871k5349N3853j1033n0514
$$ y = [749037, 750739, 775384, 823829, 833285, 796442, 838675, 819435, 820164, 881558, 919222, 881203, 811948, 788921, 758326, 763183, 833574, 882103, 955371, 1009746, 1127348, 1198112, 1283115, 1312340, 1334047, 1263768, 1204474, 1065288, 887307, 794208, 732587, 610847, 539604, 462708, 375768, 288989, 218825, 207349, 275632, 296312, 236135, 269598, 282282, 320863, 290829, 234150, 219904, 215555, 222943, 215204, 201859, 213283, 233026, 194258, 195170, 199982, 202626, 222943, 213706, 187156, 180468, 177799, 128336, 99739, 160823, 135245, 141237, 158948, 145370, 123805, 123899, 70543, 4064, 62032, 119953, 55922, 56381, 102451, 142860, 150673, 143731, 153664, 131971, 97307, 65521, 40205, 13983, -26487, -14170, 8024, -1851, 40070, 12199, -13150, 40703, 29670, -20844]
17202b0844L972N672L4249j0310p583o1943K0340L6646j0810r42N104n916P8393
17189F6028P6866j8478n3121K5732l36K016q7690l6129K4844J8556j8545J6281
17177A6024k4899l304r25k496j7314n8563m9838J2057R0896P4467k0042q7037
17165g0974j3164M1084J487Q482n4533p811j8990K41m924J3347L1971M7332L7487
17152A1035K781O442N3142J9869K31J4249m2751o4130m481n7947P76N0200L1671
17139B1087l813k8324K381l3261R446j43k7756r788o772l2444N3059R8097O699
17126D8468m6530j8335n7067n8066K0076L5592J4596N780j2129J0923j214n911
17114f3817J3910k3109n983O0077P065m4466K9743j532l5817l7578k385J9264
$$ y = [-20844, -16872, -11200, 23049, 12739, 5156, -56787, -36447, 199, -10611, -11553, -6449, -12365, 66028, 142894, 124416, 71295, 97027, 96691, 98707, 11017, -25112, -268, 18288, -257, 16024, -8875, -12179, -13104, -15600, -32914, -91477, -141315, -129258, -38362, 36105, 16063, -70974, -84138, -43054, -41567, -33085, -87618, -95429, -114419, -114178, -119102, -105755, -73784, -26452, 11035, 13816, 20258, 73400, 93269, 93500, 107749, 64998, 868, -3613, -61560, -60784, -10584, 21087, 17274, -11050, -8669, -41930, -32484, -32627, -60383, -70171, -76943, -109387, -56328, 41769, 48468, 1938, -16397, -73464, -131530, -111454, -75862, -61266, -55486, -67615, -56692, -57906, -63817, -49907, -73016, -78999, -18922, -11857, -56323, -26580, -28112, -63929, -101507, -103892, -84628]
17102h4628L0501N6556k1200k3497K2678L0702M8932J6127q745j5820j5687L0156
17090F6075L335n818M586k6907m6263O075J0345j7292p380k7521n166J7647j2812
17077d1096k8663L8882K9167n567k423L0273K0608J9875k6092k4573j1500K4248
17065B3139L9645k029L2583k2367p6529l4444j5250K2913L0004L632n8920K2596
17053c5027K6709m018p84M8933M3395J8591j1087k4235j7345k0650m7862l9219
17041f2599L0221J1337l061j1360N8437M342m1578j0500l0304k2772j3359L211
17029h7985j8265l5817J2482M4883N8966M8768j5363l2023o853L7045j7376l5847
17017d7385J0767K5280K8904J4870N41j00j7776l0735K2540k426m7839l0243l070
$$ y = [-84628, -54127, 2429, -18771, -42268, -19590, 11112, 60044, 76171, 67426, 51606, 35919, 66075, 69410, 63592, 68178, 41271, -4992, 1083, 11428, -5864, -13244, -40765, -45931, -28284, -41096, -69759, -30877, -1710, -7277, -9700, 20573, 41181, 61056, 34964, 10391, -1109, 23139, 62784, 60755, 93338, 70971, -5558, -40002, -55252, -32339, -2335, 1297, -57623, -35027, -8318, -12336, -13120, 35813, 79208, 97799, 86712, 62477, 45132, 24482, -23380, -62599, -32378, -21041, -24102, -35462, 22975, 27317, -14261, -24761, -55065, -77837, -91196, -87985, -106250, -142067, -129585, -84702, -25736, 23032, 7669, -24354, -31207, 5838, -11538, -47385, -36618, -11338, 17566, 32436, 32977, 32877, 15101, -15634, 6906, 4480, -43359, -73602, -76672]
17004g6672K5349L5009m3591K294P8635N833k3865j9112k7765L121L2924L5449
16992B7609j3497n3170K3003L836l2519M0438j2196n9683K2348L3454O5367l8860
16980F130j0714M4514P9590N7870j7415l3477l9878J0212M6025K4856K4668K0892
16968B13273L509Q0793J08265Q9479M3501K6737l8716n1428m5062m3428K2670
16957D09593N2275K2002n4933o4912J1840K0086L2019P7192k208q793j7074l539
16945D73548n9423o4951m6700l5370q9420o1682o6479j5339O3155M8168j1354
16934A34153J9452K7811j5917Q530Q825m4461Q617R437M3286p567m5740M1467
16922A87893L8093l2270k5328K9007j321o9217j3089O4690K7984P5756P0308M2685
$$ y = [-76672, -51323, -16314, -59905, -57611, 21024, 26857, 2992, -16120, -43885, -40764, -7840, 27609, 14112, -39058, -16055, -12219, -44738, -4300, -16496, -76179, -53831, -20377, 44990, 6130, -4584, 39930, 119520, 177390, 159975, 126498, 86620, 96832, 142857, 167713, 192381, 213273, 216782, 297575, 405840, 495319, 538820, 565557, 526841, 475413, 430351, 386923, 409593, 461868, 483870, 428937, 364025, 375865, 395951, 427970, 505162, 502954, 494161, 477087, 473548, 414125, 349174, 302474, 267104, 177684, 116002, 49523, 34184, 97339, 145507, 134153, 153605, 181416, 165499, 174029, 182854, 138393, 147010, 156447, 199733, 192166, 146426, 187893, 225986, 193716, 168388, 197395, 196074, 126857, 113768, 178458, 206442, 282198, 352506, 395191]
16910C95191M1311N3032r537k8195K5681L4313M077r517p7223n3886q9447o1491
16898B24309m7034r810N3005R03k0501k5719L3125M4897J11503L9637k3917k8066
16886C52332K6298k5752o8562M690j4268j8445k1725p9854n1559k6141k1086m2243
16874A3685j0671O9589n6766k1884M6758L2439L366K1206l9157j672j15O637k2565
16861D0850n3618J39r577l2569J9798K3942K7158N0280N3969l9710l1480m6470
16849B712Q735K7023L4611n2507j9664k3531k441R191l2124j4008l1431L1057
16837f2377K534N1499l7122n1424k4581J2044J1257J1176L6290q863j8770L0263
16825d8074K0304J4248l6346N449K7408k2174Q226J8087n0513l4634M699J6901
$$ y = [395191, 436502, 489534, 479997, 451802, 477483, 511796, 515873, 506356, 429133, 375247, 285800, 224309, 177275, 167465, 220470, 221373, 200872, 175153, 208278, 253175, 364678, 404315, 380398, 352332, 378630, 352878, 284316, 289006, 274738, 256293, 234568, 154714, 103155, 77014, 55928, 13685, 3014, 72603, 15837, -6047, 40711, 73150, 76516, 97722, 58565, 56893, 56778, 63415, 40850, -12768, -12629, -22206, -54775, -34977, -11035, 16123, 66403, 120372, 80662, 49182, 2712, 11447, 38470, 73081, 20574, 910, -22621, -25062, -15871, -47995, -62003, -93434, -62377, -59843, -8344, -45466, -96890, -121471, -109427, -98170, -86994, -50704, -59567, -78337, -48074, -27770, -13522, -49868, -44419, -17011, -39185, -30959, -12872, -63385, -98019, -93320, -76419]
16813g6419l3964Q8592Q2749l3200L7350N6654N615n7825k2528j0186K3342K3826
16801H4006j2792O153k2431j5025o009r5495l547M2241Q006j2381O2025N8998
16789I3749k1137k1175O2378K6469k8802k4390l1640n6714J1806L0609l0135N001
16777A6019r855j8334L9206K4488l8367o7459p034l095L1509l0437Q637L1547
16765b3175K3666L9459L5577L490l8626o9635m1760L4331j5473L4075L1684K075
16753A5688r938k1873L9389N5191p706l9668K4384m1499l8292M3663J4698L7159
16741G1196k3003n2631m8287K7308N2287P989J4524K3139Q715l1329l3564K9706
16729D6050m351m55l1934M530K1546l4802o512J204j6291L7347Q878m9486J1441
$$ y = [-76419, -110383, -21791, 60958, 27758, 65108, 121762, 127377, 69552, 47024, 36838, 60180, 84006, 71214, 77367, 54936, 39911, 33902, -61593, -65140, -22899, -14893, -27274, 34751, 93749, 72612, 51437, 113815, 140284, 111482, 87092, 55452, -1262, 10544, 41153, 11018, 16019, 6164, -12170, 27036, 51524, 13157, -54302, -61336, -64431, -32922, -63359, -54722, -23175, 491, 39950, 75527, 79017, 40391, -29244, -71004, -36673, -52146, -18071, 13613, 15688, 5750, -16123, 23266, 78457, 70751, 31083, 55467, 13968, -24324, 19339, 34037, 71196, 48193, -4438, -52725, -25417, 26870, 34859, 49383, 72522, 81237, 49908, 16344, 46050, 41699, 41244, 9310, 13840, 35386, 584, -5928, -4724, -21015, 16332, 25210, -24276, -12835]
16716a2835J17608N4523o1507m6161J5459L4178l513o58p844j4867l7100k2564
16704A4719k9190N448m3754N6360J1573M0496L6739j2237m4151o6238J7424J0578
16692b233J2352L7820J2555k1445l2777J688k4147n107l779K770L9568r98K786
16679A9053k6573l4175M5171J8103N027J183k4098K1752j8600o2067j587N5282
16667a529j0146r648j6628j2443P1935r236o2310k1666k9245K7399l654J3220
16655f3951m4637Q558L5096K4495P230J6466K3296k9166q613J1718k4279L0586
16643a3201K8867K6074j73m9565n5768N277M2556N074l2292K0784J7777P809K1438
16630B4657K2121m3628m0001j3804l2947k7328J3290Q692K6699K810L6369Q432
$$ y = [-12835, 104773, 159296, 97789, 51628, 67087, 101265, 97752, 97094, 89250, 74383, 37283, 14719, -14471, -9023, -52777, 3583, 15156, 55652, 92391, 80154, 36003, -30235, -12811, -2233, 10119, 47939, 60494, 39049, 6272, 7960, -16187, -21294, -25073, -22303, 17265, 16267, 19053, -7520, -41695, 3476, 21579, 26606, 27789, 3691, 25443, 6843, -55224, -56811, -1529, -11675, -21323, -37951, -50394, 21541, 12305, -50005, -71671, -100916, -73517, -77171, -63951, -108588, -100030, -64934, -40439, -33209, -16743, 6553, -22613, -31226, -19508, -43787, -13201, 15666, 41740, 41567, -7998, -63766, -58489, -15933, -10859, -43151, -22367, -4590, 3219, 24657, 46778, 3150, -36851, -50655, -83602, -110930, -97640, -88948, -62249, -59439, -23070, -14638]
16618a4638J8459J4234k5922k6561J9019R910p8283L5690M9443k5486l1110o5449
16606a20694k0419k6641M2936O7763R960O9m319k1836k0944l8171N2937P9545
16594A86j6840k671m4914K7424L0926l2823K6732p11Q432L7470K1555k6699l3120
16581e053q475k4969J2581N760j8360l456o82j7640L1901J9275l7888Q458L1268
16568g280l4118O961l4347O658j3826k5814L8206k5594p3292l0467O8516O0442
16556f3955K3939R796m8187j2696M2480j944J9205l5373p885k4101O232M5992
16544d6497J635J1575q942j3301N493j64m3972l4045j1900K3757L7420O3260M5660
16531B9979n925k6771l514N44k1961K9112j2015q700M2049J2048L4441r167p1930
$$ y = [-14638, 3821, 18055, -7867, -34428, -15409, -5499, -83782, -48092, 1351, -24135, -55245, -120694, -141113, -167754, -124818, -57055, -47095, -47026, -51345, -73181, -94125, -132296, -79359, 186, -16654, -19325, -64239, -36815, -5889, -38712, -11980, -12691, -4259, 33211, 54766, 28067, -5053, -13528, -38497, -25916, -20156, -38516, -41972, -42654, -60294, -28393, -9118, -47006, -38548, -7280, -41398, -34437, -68784, -62126, -75952, -101766, -63560, -89154, -162446, -192913, -124397, -63955, -40016, -30220, -78407, -91103, -48623, -50567, -31362, -66735, -74620, -98721, -92489, -46497, -44862, -33287, -42229, -55530, -50037, -50201, -94173, -128218, -140118, -116361, -78941, -15681, 29979, 24054, -2717, -6231, -5687, -27648, 1464, -10551, -19251, 22798, 34846, 69287, 60120, -11810]
16518a1810n3475N4815N2538j5530Q247M0326k0506k7257j7151k835j0183n051
16506g872J2054J6952L474l5054R08m2520p882J8339k3170J5568K0836J2949m2208
16493e7626m2904N4868N2672k191K2l3261K5216K9114k0271j704J8966k3623l4195
16480c4917R208J567l203K383L5833k7766l4026L6965M1329j1997l3116J6116
16468a624K3399K546j4492K508p926j3777J5066j4237n2058O171j1702L932j8180
16455h0374j3602K5223P2738N8313o2515R936k3382J573Q594j3109l7220N4894
16443A069k612q919P064J2584P530j8073j0405N9419R831R843p274k0951k2881
16430A6225l2598k5480o4521j6251M3002K5299L5773j9269o1852k6388K7641O1659
$$ y = [-11810, -65285, -10470, 42068, 26538, 34785, 75111, 54605, 27348, 10197, 7362, -2821, -7872, 4182, 21134, 24608, -10446, -9538, -52058, -59940, -41601, -64771, -49203, -28367, -15418, -57626, -100530, -45662, 7010, 4819, 4841, -28420, -3204, 25910, 5639, 3935, 22901, -722, -34917, -25709, -24142, -27345, -24962, 10871, -16895, -50921, -13956, 27373, 15376, -17740, -1624, 21775, 24321, 9829, 12337, 4411, -9366, 5700, -8537, -60595, -54424, -66126, -62194, -80374, -93976, -68753, 3985, 62298, -217, 9719, -13663, -12090, -3496, -16605, -53825, 1069, -1543, -10462, -3398, 9186, 16716, -1357, -11762, 47657, 57488, 67331, 60057, 39106, 16225, -16373, -41853, -106374, -122625, -79623, -54324, -18551, -37820, -99672, -126060, -98419, -36760]
16418c6760m0962n459L54j7676L3469o926j5910L290j6395L5443M6776J1777j7233
16405b6212J2718O1004K2046J3222k4077r2981n5800j9535K3192J9810L0001R851
16393b6761N336o8568m4360l369K8888L0208L2353N846L7665M773o4717p7209
16381a39915o090k2451k732M1232N1520N1111l0865j6874n556J0193M9664N9947
16369C9184K5984k224q65j0055M850O363n5539m4387l7830r644O7065R759M419
16356b920K6571j493k4701N1725J553r4386m9066L0625N0777l095J7891l802j8329
16343a8650j2858m8711k6309K5185n583L7163K8662R673k5422j7576J3988N5389
16331A4951k4968j7769J2416K007k3098M1164O235N570l7723l7270Q208k0143
$$ y = [-36760, -77722, -83181, -82827, -100503, -67034, -73960, -89870, -86580, -102975, -67532, -20756, -8979, -26212, -13494, 47510, 69556, 82778, 58701, -34280, -90080, -109615, -86423, -66613, -36612, -26761, -21425, -89993, -134353, -137722, -108834, -78626, -46273, -40427, -2762, 2011, -62706, -139915, -146005, -168456, -171188, -129956, -78436, -27325, -58190, -75064, -80620, -70427, -20763, 39184, 65168, 62944, 62079, 52024, 56874, 63237, 7698, -36689, -74519, -84163, -17098, -7339, -2920, 23651, 22158, -2543, 49182, 50735, -43651, -92717, -62092, -11315, -14410, 3481, -321, -18650, -31508, -80219, -106528, -81343, -86926, -49763, -21101, -11428, -36850, -54426, -40438, 14951, -10017, -27786, -15370, -13363, -36461, 4703, 10938, 16508, -21215, -58485, -50277, -70420]
16319g0420M220N5641Q2163k4369q4839m9105L9606k685Q412J3677j241j6881
16307d5821L978k2314O404K9647j7534K495L2247L1790j7443J4470J1616m7835
16295a8300l913L6246l3360l3739q714k3182L06J3128j4612L6708j4386l3271
16283i7089Q952l5333J6170M5333L4556N085j1814p1186j2396m018k5256L5289
16271a11707L4123K0020k6645K0527N9016N544l892N1479P7946m4662o2842l3571
16259a4664Q178M8443J370K1559O1281m1579p6624j4454m0835K3207L2679K3777
16247C2338o053J16n1102j8738n981J4462N8398j9846L0559m0707j02609l041
16235a12204R2383k6371l7107M554J857J3715j6792L7564L8r1016j2811M0425
$$ y = [-70420, -66200, -10559, 71604, 47235, -37604, -86709, -47103, -49788, -41376, -27699, -28940, -45821, -41843, -64157, -57753, -28106, -45640, -43145, -10898, 20892, 3449, 17919, 29535, -18300, -22213, 14033, -19327, -53066, -61780, -84962, -84656, -71528, -86140, -49432, -63818, -97089, -88137, -123470, -107300, -61967, -27411, -22326, -34140, -105326, -117722, -121740, -146996, -111707, -77584, -57564, -84209, -63682, -4666, 878, -3014, 48465, 126411, 81749, 18907, -14664, -6486, 41957, 43327, 64886, 126167, 84588, 7964, -6490, -47325, -24118, 8561, 32338, 26285, 26401, -24701, -43439, -49420, -34958, 23440, 3594, 34153, -6554, -109163, -112204, -19821, -46192, -83299, -78745, -76888, -63173, -79965, -42401, -42363, -133379, -146190, -105765]
16223a05765O2687K6055m319K1042r415Q801J1127Q361j5151l8775R632l8833
16211f4553k8772Q125L8259P1809J4572m1516l9203k5312n1705M0896L0159l2991
16199h0232O7020J4444k4062K6962J4490k0355K5589l5424o2732j4996L2871O859
16187d9566j4708Q534K4855N5862K6179j2636l7871n2054K9914M7089l8477l4708
16175d7587L2733N2961M6935o1115o2837J023M0427J2490M368j0649n6594Q890
16163c8955K4183k9475m0927l2153m2578P6017N8783Q085N4184r886k8036p1587
16151g2345l227M9095k4828j6344p693m904M8425K5181k0265j8823J5529L535
16139b6664r49K33j5405l4796K631P5434J457m8070l6269j9983J9772P1687N5185
$$ y = [-105765, -43078, -17023, -21342, -300, -9715, -914, 10213, 18574, 3423, -35352, -25720, -64553, -93325, -85200, -46941, 24868, 39440, -2076, -41279, -66591, -118296, -77400, -47241, -80232, -13212, 1232, -22830, 4132, 18622, -1733, 23856, -11568, -74300, -89296, -56425, -49566, -64274, -55740, -30885, 24977, 51156, 38520, 649, -51405, -21491, 25598, -12879, -47587, -14854, 38107, 85042, 23927, -38910, -37887, 2540, 15030, 19398, 8749, -47845, -38955, -14772, -44247, -85174, -117327, -159905, -83888, -25105, -17020, 37164, 27278, -758, -72345, -75572, -26477, -51305, -67649, -75342, -80246, -31821, -6640, -26905, -45728, -30199, -26664, -27613, -27380, -42785, -77581, -74950, 484, 1941, -46129, -82398, -102381, -82609, -10922, 44263]
16126D4263l0442j3344m7215O622l3841m4623M572K6727k6025J1969L3110M8419
16114a9808J5776l5310J4282J9297j1624m923k89l4944l4627n905K2887L4335
16102d0853l3159k9799N884j1953J5021L0729J5956j0479M156O4942j2409k8152
16090c0116j0834l8234M8654J1453J0152J9251O102p9255J3168p827m1053L6096
16078f2443R8618N157m6362M0623o5746j8813K1124N3493m1151j2526J1435L2232
16066A5641r848j0797k9179M4953L5289l4184k7037L6551J6906P9384j6423m0492
16054F0764o2141K1850n2287m9151n277L1685M1437l7423k9460j367L2K1045L18
16041e9975m220L901L0207j8682L7607R092M290N5307p946q376m9745R486P728
$$ y = [44263, 13821, 477, -46738, -40116, -73957, -118580, -114008, -87281, -113306, -101337, -68227, -19808, -4032, -39342, -25060, -5763, -17387, -22310, -22599, -57543, -92170, -98075, -75188, -40853, -74012, -103811, -97927, -109880, -94859, -64130, -48174, -58653, -54497, 10445, -1964, -30116, -40950, -79184, -30530, -19077, -8925, 10326, 16428, -62827, -49659, -57486, -98539, -62443, 36175, 41332, -5030, 35593, -30153, -48966, -27842, 25651, -15500, -28026, -16591, 15641, 5793, -5004, -34183, 10770, 46059, 11875, -15162, 21389, 38295, 117679, 101256, 60764, -1377, 20473, -31814, -80965, -86242, -54557, -13120, -50543, -80003, -81370, -81338, -60293, -59975, -64195, -60294, -30087, -48769, -11162, -2070, 2220, 57527, 49581, 41205, -8540, 946, 8674]
16028H674K7508n9618n3039k9743L3399L1168m2230m345M9436K1214j3469l3161
16016f4206k7243L5568j4986l3159k4561N972J8732r477J7354K4918j1437J8009
16004f4516M9172P7164J4266n4470l1508n0578o465K646J1769j500j5541K64M6574
15991b2723l0300j3295L9213M4292p196L312K7856L8142k9093n2888K052K0720
15979B0092K041k4262j4131M6744j1008P66j8627L080L2804m4371Q768P1017j1392
15966F1521o258j7682m5404k9291o535K5981j1945j7851K5469K0104L1300j6508
15954A2901o5029L209R5352J9291k8227J44l0113J4184n0738o9153J0551K0187
15942f7441N9275K317j9932o8187j4884P2662M8393m6840o2023m70N1665J4403
$$ y = [8674, 36182, -23436, -76475, -106218, -72819, -41651, -83881, -88226, -38790, -17576, -31045, -64206, -91449, -55881, -70867, -104026, -128587, -122615, -103883, -113360, -96006, -71088, -82525, -64516, -15344, 61820, 76086, 21616, -9892, -60470, -66935, -64289, -52520, -54020, -69561, -69297, -22723, -53023, -66318, -27105, 17187, 9991, 13303, 41159, 79301, 50208, -2680, -628, 20092, 22133, -2129, -16260, 30484, 19476, 20242, 1615, 4695, 37499, -6872, 1896, 72913, 61521, 55263, 37581, -7823, -37114, -43649, -17668, -29613, -47464, -21995, -1891, 29409, 12901, -52128, -48919, 46433, 65724, 37497, 37641, 7528, 21712, -29026, -98179, -87628, -67441, -8166, -5849, -25781, -93968, -108852, -36190, 12203, -34637, -96660, -97130, -45465, -31062]
15930c1062K6327k4106l1942L4568Q725j4475N64r673q115r794J3909K3848J8996
15917b230l3291j9197J8960J4771Q651J3707K633k6855K0685K72k9641K5391L1525
15904B5381k2078l1374n3959J0957J1831j0143L9537j0008n301K5048P5926j1424
15892D4393k71k9991l1658J8289K4344l3683q8083m5992J03583K4187M2036Q731
15880C5885k7784p7776n7239Q7289L6380k8746j1448K6547J5177j0256m1513n7520
15868a11004k5985j4129L048K137L4206P4113N8210M6302j1461K2026j8896l2348
15856B6219j0528p690j8678l2385M010k0038l1904k6282K2459L2072O1551j9528
15844b0722O0047K8677k5950k7305L938m09p7843k6971j1066L7934N7994j146
$$ y = [-31062, -4735, -28841, -60783, -26215, -17490, -31965, -31401, -41074, -49189, -58983, -45074, -21226, -2230, -35521, -54718, -35758, -20987, -12336, 1371, 4004, -22851, -2166, -1894, -31535, -6144, 25381, 3303, -28071, -82030, -71073, -59242, -69385, -29848, -39856, -45157, -20109, 55817, 44393, 44122, 14131, -17527, 762, 25106, -8577, -96660, -142652, -39069, -14882, 27154, 35885, 8101, -69675, -126914, -39625, -3245, -31991, -43439, -16892, -1715, -11971, -53484, -111004, -136989, -151118, -148070, -145933, -111727, -37614, 20596, 66898, 55437, 77463, 58567, 26219, 15691, 8001, -10677, -43062, -39052, -59090, -90994, -117276, -94817, -62745, -1194, -20722, 39325, 68002, 42052, 14747, 18685, 18276, -59567, -86538, -97604, -59670, -1676, -2822]
15832b822m7574m4633k4686o637L0529M2441M2223j0046j1503j7130k225k425
15820e4488m3097J5329l585k2123M7339o740O982l5124k8666J3882L9533k1372
15808i2130J7816L2182M806j9767L0733p818l3920N0063j15j4584j0422k632k0605
15795f6393N5018L8390j5333q314r856j120k0384J3608L5170j3593R608k6838
15783a0037j1296J9710O3595P584j386r9546o0977K0848L9946N0314M544j3372
15771I927k291K5821O4631l9167q4116N58K9855j8774N2499M1663l6313k4112
15759B0181l912J2800K9605l784j9407o1331P625Q4189m857J6497o2462p6660
15747f1516l1862k6554L1282N3375L6302j6169j3083l6702k3109J8677l2222J2198
$$ y = [-2822, -50396, -95029, -119715, -126352, -95823, -53382, -11159, -21205, -32708, -49838, -52063, -54488, -97585, -82256, -85841, -107964, -60625, -67365, -60383, -95507, -124173, -110291, -70758, -92130, -74314, -42132, -37326, -57093, -26360, -34178, -68098, -18035, -18150, -32734, -43156, -45788, -66393, -11375, 27015, 11682, 3368, -6488, -7608, -27992, -14384, 20786, 7193, 16801, -10037, -21333, -1623, 61972, 69556, 68170, -31376, -92353, -71505, -31559, 18755, 23299, 9927, 7636, 33457, 98088, 58921, -25195, -24637, 5218, -13556, 38943, 80606, 44293, 20181, 16269, 29069, 58674, 54890, 35483, -25848, -18223, 65966, 61109, 77606, 15144, -61516, -93378, -119932, -88650, -35275, 1027, -15142, -28225, -64927, -88036, -69359, -101581, -89383]
15735h9383M0611j7510Q399K2571L290N594l1468j6810J7414K0930L072J6339
15723a6951K9498L4023l792l9724O162o4428l8861N083l0056M082N0743J2346
15711e1875j5347p337L7630N3178k3518k3142l555M2557K0591m7442l0764J4907
15699c4117M9651J5459m6961n6279o0523o793L064O2930J4318k4417L8452N3187
15687G971l472k0859n1079J9708K6691n9266k1491O3685K4231l2664j2091j362
15675e9998k9229J1931J1889J4167p984P876m0350P053M1751L8798J3375L673
15663A2952n5996q2316j2213L0973J1241N6840P5459n5450n7510K25O698J522
15651f7575j2794k2719L6398M4100L4369q965k2321K2009K1771M3962k673p1591
$$ y = [-89383, -48772, -66282, -57883, -35312, -32022, -26428, -57896, -74706, -57292, -36362, -33290, -16951, 12547, 46570, 42778, 3054, 9216, -55212, -94073, -88990, -119046, -114964, -64221, -51875, -67222, -74559, -36929, 16249, -7269, -30411, -33966, 8591, 29182, -18260, -49024, -34117, 15534, 30993, -15968, -72247, -132770, -139563, -136499, -73569, -59251, -83668, -45216, 7971, 4499, -16360, -67439, -47731, -21040, -80306, -101797, -38112, -13881, -46545, -58636, -59998, -89227, -77296, -65407, -51240, -59224, -51348, -91698, -84645, -42894, -4096, 9279, 12952, -43044, -125360, -137573, -106600, -95359, -38519, 36940, -18510, -76020, -75795, -69097, -67575, -80369, -103088, -66690, -22590, 11779, 2814, -19507, 2502, 24273, 68235, 65562, -6029]
15639f029j5514O854M8936O4748o2667p0663M7621J5147j5507J214m2679o905
15627c5444J2142j4127o0438K9602M7047m991k4750j8959j588M4200j9842j961
15615d9109O5840K2434J009j1163n9347m8020P6835K602J2261k3273o3746K0541
15603e3136M1441J2431p2672k5889P9821P8041m2130m4231L455J6694J3858J3618
15591B1301K974k6013L7239J6568j8016N012P772O230m1211j1475k4003L4016
15579A0394k1736k646J6696J7734k2074j2485m0992j3509r734j8466j3139L7064
15567g2893P0928K1873r728J5158k16j0133K2040L4156r253j8831n2232L3262
15555B4131j5982O425K573o699L6664M2627K458m9607n9405m3837j0437M8607
$$ y = [-6029, -21543, -14689, 34247, 98995, 36328, -34335, 13286, 28433, 12926, 14140, -28539, -35444, -23302, -37429, -97867, -68265, -21218, -26209, -50959, -69918, -71506, -27306, -47148, -49109, 16731, 39165, 40174, 29011, -30336, -78356, -1521, 1081, 13342, -9931, -73677, -53136, -11695, 736, -71936, -97825, -18004, 60037, 17907, -26324, -22869, -6175, 7683, 21301, 24275, -1738, 35501, 52069, 34053, 39065, 46837, 53067, 11856, 381, -23622, 10394, -11342, -13988, 2708, 20442, -1632, -14117, -55109, -68618, -78352, -96818, -109957, -72893, -1965, 19908, 10180, 25338, 25122, 14989, 37029, 71185, 61932, 43101, -9131, 24131, 8149, 14574, 17147, 10448, 47112, 89739, 92197, 42590, -16815, -60652, -71089, -22482]
15543b2482R1835L2660n5930m3659o375P311K0905J181m1305m0530j8818p065
15531h2272O0035j7883m2518Q796O2416k4890K415N7235R977j718K6944k1055
15519C7482l8416k2932Q466j3519l3292k3857K884K6817M2712m2446j5323j335
15507g2759N0737O0471M581k9093p3904n6611J0444L3613Q0942O4016m2725m5515
15495a5803k2301l3777k7430L6621R0564J7127n811K4128M037M2343J9983j2123
15483A17558L649m4908j04949m5625M4077N1744O487j8552n5536k1533J87J6388
15471e1013N0587K1283o87k049j5552m0979m620N5738K6353j9633j4297k2731
15459a7600j3309n1947J5638N7229K1919l2558j6499k1452j0836J3860L1231K2832
$$ y = [-22482, 69353, 102013, 46083, 2424, -3951, 3360, 24265, 25446, -15859, -56389, -75207, -82272, -22237, -40120, -82638, -73842, -11426, -36316, -33901, 23334, 33311, 31593, 58537, 37482, -934, -23866, -15400, -28919, -62211, -86068, -83184, -56367, -13655, -56101, -71424, -72759, -22022, 38449, 43030, 13937, -59967, -116578, -106134, -72521, 8421, 72437, 29712, -15803, -38104, -71881, -99311, -62690, 27874, 45001, 39190, 63318, 67355, 109698, 129681, 117558, 121207, 76299, -28650, -74275, -30198, 21546, 28033, 9481, -46055, -67588, -67401, -51013, -426, 20857, 20170, 18121, 2569, -38410, -43030, 12708, 39061, 19428, 5131, -17600, -30909, -82856, -67218, -9989, 11930, -20628, -37127, -58579, -69415, -55555, -24324, -1492]
15447a492K2618k0615r5857l7093O7232L3239j6772l132J9564j8263J2998j776
15435c9349J3152j274k8111K3423l6609J4185M1609M5853j0631M615K0154Q898
15423E5915J7550j1485J8479p0581j4103M9546l0225m4972J9825L4601K1490m0653
15411E387k8778J7627l580K8729N1546q8926m3273N64k7190M3467k814l7372j9641
15398a04254K6468M2454m644J9269K3917n690k6933l4633k8476L1315M2553l1540
15386e0194k6451Q864n3533k313M4147J4054p0434K7432O9041N5366l4592l2982
15374e1595m6966K166J0936o905L264K2084M0824P255L6482j6777l6141K6045
15362i328l3716q2898L271P2295Q2270o065k5936o3908J3929J9023k5229J2408
$$ y = [-1492, 21126, 511, -95346, -132439, -65207, -31968, -48740, -51872, -32308, -50571, -37573, -39349, -26197, -27471, -55582, -32159, -68768, -54583, -12974, 32879, 22248, 26863, 47017, 55915, 73465, 61980, 80459, 9878, -4225, 45321, 15096, -29876, -10051, 24550, 46040, 5387, -23391, -5764, -9344, 19385, 70931, -17995, -61268, -60704, -87894, -44427, -47241, -84613, -104254, -77786, -35332, -39976, -20707, 3210, -2480, -29413, -64046, -92522, -61207, -18654, -50194, -76645, -67781, -121314, -123627, -79480, -65426, -135860, -108428, -39387, 15979, -18613, -51595, -98561, -96395, -85459, -92364, -89100, -67016, -26192, -18937, 17545, 768, -35373, -9328, -43044, -125942, -122671, -50376, 31894, 25829, -107, -64015, -50086, -31063, -56292, -43884]
15350d3884r967j2310N8756N221o553L2384R734l907J0397N068p0023K336L4793
15337A2045j0821n8014j7901l6844J7181j3251O3887O9078l9221j0547K9101J9175
15325B3868j1693o958l7087J1359J6525J3971j8069m905l2714j6947J3402K257
15313d6991N201L7789L1943l3894k1044k7519m58K4095k4805K7674P511j8039
15301c8537j0361L7457k1898K5126N883O902j1394q645j1171J9481K7379j2191
15289H031n1253p0558M4554L5431O1991P398q078k2128L1036p876n4755K182J6950
15276g075K8210n4617m4785L791l4389n452J2652M3749K1126R287k9078k3312
15264g9893r973j4144J1687L0949N1730M5100j5261j1639j826j4913j715M6229
$$ y = [-43884, -53851, -66161, -7405, -2184, -8737, 23647, 33381, 29474, 39871, 44939, -25084, -22748, 12045, 1224, -56790, -74691, -111535, -94354, -107605, -43718, 25360, -13861, -24408, 4693, 23868, 12175, 5217, -31870, -20511, -3986, 9985, -8084, -12989, -45703, -62650, -49248, -46991, -41790, -4001, 27942, -5952, -26996, -54515, -54973, -30878, -55683, -28009, -20498, -38537, -48898, -11441, -33339, -8213, -2330, 4572, -6822, -15467, -26638, -7157, 20222, 8031, -43222, -113780, -69226, -33795, 28196, 35594, 27516, 5388, 36424, 28548, -26207, -24025, -7075, 21135, -33482, -78267, -74476, -108865, -114317, -101665, -57916, -36790, -27503, -56581, -79893, -89866, -104010, -92323, -61374, -9644, 35456, 20195, 8556, 6730, -8183, -9898, 36331]
15252C6331J385J7152n0609L121L810j1849K3107L5888J1804j1909j1766k5635
15240B0830k7903K0187p446L4632k4937j8120J8470K805l866j1990j2387l0900
15228d0625n138P817k2170r402k0122N776J7204k8524r159j2286J5217P803J1116
15215h2493L6477L3156o690m4709n8054j6493R4199m004k2468l8763N797N184
15203i8861J7583m23J03167L03n2361j1551K7369j7252m1292m8628L7512O6326
15191a8108N0351k701o6864J8452r009m213K4803J7418K9388m3069k4685K6084
15179b153J5766q690M9951j8269l8610p681n420K8394k7418l9960N319O2182N0398
15166F3809l177j1904j9973k5130l4733p12L508o46R798L7310N152J3519M010
$$ y = [36331, 37716, 54868, 4259, 7380, 11190, -659, 22448, 58336, 70140, 58231, 46465, 20830, -7073, 13114, 5668, 40300, 15363, -2757, 15713, 18518, 14652, 2662, -9725, -40625, -45763, -37946, -60116, -69518, -89640, -83864, -66660, -95184, -104343, -116629, -101412, -93609, -82493, -46016, -12860, -19550, -64259, -122313, -138806, -44607, -48611, -71079, -109842, -104045, -98861, -81278, -81701, 21466, 21769, -30592, -42143, -14774, -32026, -73318, -121946, -84434, -18108, 32243, 29542, -37322, -18870, -27879, -32092, -7289, 10129, 39517, -3552, -28237, -2153, 13613, 4923, 54874, 36605, -2005, -9686, -15106, 13288, -14130, -54090, -48771, 13411, 63809, 60632, 48728, 28755, 3625, -31108, -31820, -28312, -28958, -19160, 18150, 23302, 36821, 40831]
15153D0831j2091p3025k1779Q742K5984K2355M3583k4224m1620q289K6724J2375
15141d34l2378N646k0094k136N2705j4554j9116L9214J4419k6840k6528j7160
15129d7256N769L8916Q189j1433O3826l4940k6503N0346N2296o1840q7229J4129
15117c5730P3958O8608N583n804j3307k0688l4560o9369k1196j1169m5709m1453
15105a50836K5525P5522M1326m987j2199k7773K3963q767M4890M1099l5606o0213
15093d8056l2011R374K1619M2746M2100L048j1351J9530l9261l4133P805j7437
15081c6027k6754O139J9494k5741l4679K9014N4987J4835J7917n7198j6312j3247
15069f7572Q68j6121m656K7936Q873L203N0339N2579K9283K4619n2774j6468n634
$$ y = [40831, 28740, -44285, -66064, -57322, -31338, -8983, 34600, 10376, -31244, -39533, -12809, -434, -32812, -27166, -47260, -49396, 3309, -11245, -30361, 8853, 23272, -3568, -30096, -47256, -41487, -2571, 5618, -5815, 58011, 23071, -3432, 46914, 99210, 37370, -49859, -35730, 38228, 106836, 112419, 106615, 93308, 72620, 38060, -31309, -52505, -63674, -109383, -150836, -125311, -49789, -8463, -13450, -25649, -53422, -29459, -38226, 6664, 47763, 12157, -48056, -80067, -70693, -49074, -6328, 35772, 38820, 27469, 46999, 7738, -26395, -18590, -36027, -62781, -56642, -37148, -62889, -97568, -68554, -13567, 1268, 19185, -38013, -54325, -67572, -66704, -82825, -87481, -59545, -50672, -47469, 2870, 55449, 84732, 109351, 56577, 40109, 34475]
15056C4475n3989n9734L2535N1751J8266m0034n8414j5934O8412O8752m0350p3076
15044f7340J0091P7850L2995m0820Q449Q866J6115J6146R134K4335n8778j5992
15032B1051L7922k2543p880j8983J3432K6001J3773K6606o50m7974k8784J9505
15020C1476J1482K6043K0919q241q4699J8903K1450M0118N1490M708L7499P7310
15008B48458J17270J93848K71130M84705P52925O84608N68036J34694k69062n36221
14998B650391o23831m75142m59606l53873j86954r5756r6607q8158l1145l8917
14988B00402j4607j0300m2070L137L9461K0570j5494n140j5164n0199l3228m8913
14976B8455M176M0301L8955l5691l7739J0908j2483n8613o1093l3008P3411Q6723
$$ y = [34475, -19514, -79248, -46713, 5038, 23304, -16730, -75144, -91078, -22666, 46086, 5736, -67340, -57249, 20601, 53596, 12776, 21225, 30091, 46206, 62352, 71486, 95821, 37043, 21051, 58973, 36430, 28550, 9567, 22999, 49000, 62773, 89379, 88729, 40755, 11971, 31476, 42958, 69001, 89920, 81679, -3020, 15883, 37333, 77451, 128941, 133649, 171148, 248458, 365728, 559576, 830706, 1315411, 2068336, 2752944, 3320980, 3455674, 3186612, 2650391, 2026560, 1551418, 1091812, 737939, 550985, 455229, 358622, 270464, 239319, 200402, 185795, 175495, 133425, 136562, 176023, 196593, 181099, 175959, 160795, 110596, 77368, 28455, 32631, 72932, 111887, 76196, 38457, 49365, 36882, -21731, -82824, -115832, -42421, 44302]
14964D4302J513l9741p906K6099j8430k2802L7L62k131p310M0684m5373J8270
14951a2426P9273J6941o0479n1861k2855J5014P760M0627K5170l4191J572L0348
14939C4893N3936p253k7788j9721M4216l0828l1358k0319L1512j5201K2104l6410
14927b217n0018J4838L1493L5570J2139j4458j3379r490J04K1959L0632l9833
14915A7340k7899k9203M1276K9618j3142O277J1666k6121m39M1594m6209K088
14903F846L4677J8621l8892l2718q652L6875j509l3894j5331j0889M0445K6364
14891B1943k7567m8268N28L8104k9329k1855j3900j6079L2318P9833M1044J2233
14879F9005K2847R213n7058m5925M9859J8844m729L4608o428p1884n4231J8153
$$ y = [44302, 45815, 6074, -1832, 24267, 5837, -16965, -16928, -16566, -18697, -26007, 14677, -30696, -12426, 66847, 83788, 23309, -28552, -51407, -36393, -28633, 11994, 37164, 2973, 4545, 34893, 88829, 81576, 53788, 34067, 78283, 47455, 16097, -4222, 27290, 12089, 34193, -2217, -52235, -37397, -5904, 29666, 41805, 27347, 13968, 4478, 4582, 26541, 57173, 17340, -10559, -39762, 1514, 31132, 17990, 24267, 35933, 9812, 9373, 50967, 4758, 6846, 41523, 60144, 21252, -11466, -20118, 16757, 15248, -18646, -33977, -44866, -4421, 21943, -5624, -53892, -53364, -15260, -44589, -66444, -80344, -96423, -64105, 15728, 56772, 69005, 91852, 101065, 44007, -1918, 47941, 66785, 62056, 96664, 90236, 18352, -35879, -17726]
14867a7726N1060j7352k7207k8316q3545L8595J0448R303p492L8511J3769p1j6558
14854c6581K234n8350o0506O9331M6009m2401J5728L1393N3342L5733L495J0592
14842G0019l6152l3217j2029M99J4453k3572m6005r528N1474P1966J8612k1126
14830D5394n0449j0642l969Q132R692r845k4245o7795K0060N5157r988j1244m0589
14817i0331j3649R064J4665O6404L2625m2182j2104J3465l8373M1494N3549j39
14805C4488j5201K7674K0995k805m1044j4536K3454J4907M0008l7255j7340j6555
14793A6790o2483N363L8978J5095n1887j6010j0929n7979M1901P698R717O0327
14781c419J426L2727j2385j8118M4558O78j490M5745j3784l1033m7089J7769L3225
$$ y = [-17726, 33334, 15982, -11225, -39541, -123086, -84491, -74043, -64740, -72232, -33721, -19952, -20023, -36581, -34347, -92697, -153203, -83872, -37863, -80264, -64536, -33143, 20199, 55932, 59427, 70019, 33867, 650, -11379, -10880, 3573, -19999, -66004, -75532, -24058, 47908, 66520, 45394, -5055, -15697, -19666, -11534, -1842, -11687, -35932, -103727, -83667, -28510, -38498, -49742, -90331, -103980, -94916, -80251, -13847, 18778, -23404, -35508, -22043, -60416, -18922, 34627, 34488, 19287, 46961, 67956, 65151, 24107, 9571, 33025, 47932, 87940, 50685, 33345, 16790, -45693, -40330, -1352, 13743, -38144, -54154, -65083, -123062, -81161, -73463, -63746, -3419, -1993, 30734, 18349, 231, 44789, 45467, 43977, 89722, 75938, 44905, -2184, 15585, 48810]
14768D8810j9038l0984m1797j346L5003j315r864l1848K6526m655K2157l1286
14756c9637n372l2018o951P156J9991J8559N7966Q0499K0714j1390m5723o0850
14744B944n6306j3974L7360L6512l005J9524L4934l027j193k5711k8091J1630
14732A1597k9062k7697k4307P258j0904O0653K2458q503K9487M9592l478l3326
14720D3768j05k0107k0139k7473J906p115p528M21O28J2187l1254k6225L5592
14707d5444P6565l788o706J9493j4041K4144N387J4377j2637n1110j6439m987
14695a5186M971L5597M225N7692Q923r1363j8806M0417l8279m7100n042k6079
14683i0030p6020J1905R1864K2424n5749m367M9569N3025J1020k1135j8309J7838
$$ y = [48810, 29772, -1212, -43009, -44355, -9352, -10667, -20531, -52379, -25853, -30508, -8351, -39637, -45009, -77027, -83978, -76822, -56831, -38272, 19694, 100193, 120907, 109517, 63794, 2944, -53362, -67336, -29976, 6536, 3531, 23055, 57989, 54962, 53769, 28058, -33, 11597, -17465, -45162, -69469, -62211, -73115, -12462, 9996, 1493, 30980, 80572, 77094, 43768, 43663, 23556, 3417, -24056, -22150, -29265, -36793, -36372, -35744, -23557, -54811, -81036, -45444, 31121, 27333, 20627, 40120, 26079, 50223, 55610, 69987, 57350, 6240, -10199, -15186, -10215, 25382, 29607, 87299, 96222, 4859, -13947, 26470, -11809, -58909, -63951, -90030, -166050, -154145, -62281, -39857, -95606, -99973, -50404, 2621, 13641, -7494, -25803, -7965]
14671g965j5354k1410k0590L7559l9808k8852O5695N9316M5060q848q220m5023
14659A1560M778j7163L6673M9331l8821o6414n5732J762l7845m030L12j0646j4433
14646a40668L3960M6215n1l76O4331N0103k9149k5651l1017K0939o475K1417j2809
14633i231l5413K0297K1005M2495J8419k3905m1659k9032J1150L4213P610K6098
14621D2047j638j1468k7259k4247j8290K841J7476J175M7947J1739J4756l0307
14609B4772j1658L4806J0851n3737k2151K0836J192l3067k8676l48P100K2902
14597b7178K5189N7091J8387j1706k2661p855K1488j5060j7725j8711m9137l589
14585e1467O2134k0505n0196j0490K3662N0828l018K7047n3667N7911L0870l5860
$$ y = [-7965, -23319, -44729, -65319, -27760, -67568, -96420, -30725, 28591, 73651, 64803, 56583, 11560, 16338, -825, 35848, 85179, 46358, -20056, -75788, -74026, -111871, -115901, -115589, -126235, -140668, -106708, -60493, -60544, -60920, 3411, 53514, 24365, -1286, -32303, -11364, -17839, 3578, -9231, -44644, -24347, -3342, 39153, 57572, 33667, -7992, -37024, -25874, 8339, 15949, 42047, 40409, 28941, 1682, -22565, -40855, -38014, -20538, -19363, 28584, 40323, 55079, 24772, 13114, 47920, 58771, 5034, -17117, 3719, 4911, -28156, -56832, -57180, -50080, -27178, -1989, 55102, 73489, 61783, 39122, 31267, 52755, 37695, 19970, 1259, -47878, -51467, 10667, -9838, -60034, -70524, -46862, 3966, 948, 27995, -25672, 32239, 63109, 27249]
14573B7249o5500k464J3819P580n786m5700m6674j6834M8214K5810J4293J6366
14561b9627O6786Q736p1131j1500N9567J0672K4795n0826k3589N2976N4831m0249
14549E1441p1273m7668o350J9039l7407P376J5904l1220M5833N6776M1494K2680
14537F6625l8600m4732j8029p020L5221m737J9548j776J0374N3962o650j5709
14525D8477M7193Q567m2912k6448l343l9195m4844j7664K7193J3796l1372k01
14513f0753k8330l5290K6889L6233M7722L1147k298l1808p731k6010N2786N9840
14501F2397j3884n1749M650K3749m6980l3013k619K1795l3550n247M6891o586
14489c4146K6423R351Q002o463j3373q745M1486O6808l954o0427l3793j948K8610
$$ y = [27249, -38251, -40715, -26896, -19316, -25102, -70802, -117476, -134310, -86096, -60286, -45993, -29627, 37159, 45895, -25236, -36736, 22831, 33503, 58298, 7472, -16117, 36859, 91690, 51441, -19832, -67500, -73850, -54811, -92218, -84842, -68938, -100158, -54325, 2451, 43945, 66625, 28025, -16707, -34736, -41756, -6535, -11272, 8276, 6500, 16874, 70836, 64186, 48477, 95670, 104237, 61325, 34877, 31534, -7661, -52505, -70169, -42976, -29180, -60552, -60753, -89083, -124373, -97484, -61251, -13529, 17618, 15320, -16488, -24219, -50229, 2557, 62397, 48513, -3236, 1414, 25163, -21817, -54830, -57449, -35654, -69204, -74451, -27560, -34146, -7723, 1628, 9630, 3167, -10206, -18951, 22535, 89343, 85389, 24962, -8831, -10779, 17831]
14476A7831L2138m066k7036j7398n380O159J3518m4104K2717J7737k2891o2531
14464g3306o9445M1247M9875q893m7621n840J5906O2173K7680O826l3020m3420
14452g7838j4358J1665j293J4752L4321N2746K0721N018J2024j4875j2991k616
14440B7276n486J9312K7873l9997J0479k4756J239J2510M1138K3106J926p4219
14428B0401k3747J0049j6787j6650j5119M2828o8874J5487K800n930J2760o410
14416d9192O866J6145j0778O5358N6823k3009k9156j860L221Q1368K6411p4572
14404F7625p3689N4K80n4102l8277J3268K0630K3127j4110K2651Q4984m7119m9046
14391d3724j5518p745j8291M2537P5968j8155K3764M6260K2896k6642q176m2310
$$ y = [17831, 49969, 45903, 18867, 1469, -3911, 2248, 15766, -28338, -5621, 12116, -10775, -73306, -142751, -101504, -51629, -60522, -108143, -113983, -98077, -35904, -8224, -1398, -34418, -77838, -92196, -80531, -81824, -67072, -32751, 19995, 40716, 45734, 57758, 42883, 29892, 27276, 21790, 41102, 68975, 28978, 39457, 14701, 15940, 28450, 69588, 92694, 94620, 20401, -3346, 6703, -10084, -26734, -41853, 975, -67899, -52412, -49612, -55542, -42782, -49192, -42326, -26181, -36959, 28399, 85222, 62213, 33057, 31197, 34418, 115786, 142197, 67625, -6064, -6010, -5730, -59832, -98109, -84841, -64211, -41084, -55194, -32543, 52441, 5322, -43724, -59242, -66987, -85278, -42741, 33227, 15072, 38836, 85096, 107992, 81350, 73174, 30864]
14379C0864j8924j6045j4598J5582m973L2769Q294j8573p166O639k8631J3701
14367a061J2745k7762l0509m019K6049M8296n6177M807M7110k1479k3384N711
14355a9673k7767K4157M5632N6650M66m6082R021m6454j769J8092l8918N7065
14343C0420j4108l9359M336l9478k3959j2052J6696N7403L5650P6084o403l8914
14331D6316q887p35J5985k1473j7102j7851p238l608L4565L6386j2895l5185n6948
14318d8670l6515J5472O1036L5038J7008l309r756m2095n0624N027K3509J4551
14306a9328m0403l882J4700Q515J1145k2334P9731J03263J1344o3576j7751k7012
14294C4412J5495L1263j7167n0354L6412K5566j8187k6779l2480j3349J6089K4045
$$ y = [30864, 11940, -4105, -18703, -3121, -8094, 24675, 32969, 14396, 7230, 13869, -14762, -1061, 11684, -16078, -46587, -50606, -24557, 23739, -32438, -27631, 19479, -2000, -25384, -19673, -47440, -23283, 22349, 78999, 79465, 33383, 42404, -4050, -5819, 12273, -26645, 30420, 16312, -23047, -18711, -58189, -82148, -94200, -77504, -20101, 15549, 91633, 85230, 46316, 37429, 36694, 52679, 31206, 14104, -3747, -10985, -14593, 19972, 56358, 43463, 8278, -48670, -85185, -69713, -8677, 26361, 43369, 40060, 30304, -11791, -62415, -57388, -33879, -19328, -59731, -63613, -48913, -40398, -29253, -51587, 28144, 131407, 142751, 79175, 61424, 34412, 49907, 81170, 64003, 13649, 50061, 75627, 57440, 30661, -1819, -15168, 921, 24966]
14282B4966p120J4179J6117M22M7295n013o4766K1160J0756l3067J4748o0895
14270b1218M5185k5858j6155Q226K3983M3875O1268J9099o4815o1712K7001J8614
14258E7493K0908l5380j014k1255o8037K0769O1906J0620M1661L5644R832j9200
14246A13947q4556k0312j3959j0074j9158O080N6981Q3256L0602r8067l8094j8355
14234a1709L767M3778M2280J422o3845l1077M2203o286n440O733P1954m841n1374
14221C7565l2316O3699M6233m4488p8686n1704q46K1291N644L0352j2544k0684
14209c6484K448n512N566P377L6965K0630m9489l5625L9481R1846k5208o5728
14197a3733j2612M6651O7370l6478l8173n4392k1296L3432j3153J1160J1564j3084
$$ y = [24966, 17846, 32025, 48142, 48564, 95859, 90846, 26080, 47240, 57996, 24929, 39677, -21218, 23967, -1891, -18046, -9820, 14163, 58038, 119306, 138405, 73590, 11878, 38879, 57493, 78401, 43021, 42007, 20752, -47285, -26516, 35390, 46010, 87671, 123315, 133147, 113947, 29391, 9079, -4880, -14954, -34112, -28032, 28949, 112205, 142807, 44740, 6646, -11709, -7942, 35836, 78116, 79538, 15693, -15384, 26819, 20533, 15093, 21826, 93780, 88939, 37565, 5249, 68948, 115181, 70693, -7993, -59697, -60543, -39252, -33608, -3256, -15800, -36484, -34036, -39548, -33982, -26605, 10360, 30990, -18499, -54124, -14643, 77203, 51995, -13733, -26345, 20306, 87676, 51198, 13025, -41367, -62663, -29231, -42384, -31224, -19660, -32744]
14185c2744k4623Q451M2806j1621O846K5940K6160k6127m187K0572J5224k4612
14173B2085K2228J8023R018j146o3608J0710O7542l3149k7360l2905P52J8884
14161A1074J07477N6430k3259n8266l8509o3781K7210N6455L8291o696j9028n5449
14149C1949k744L0331m7305J5378O4968J5467J3127m2198l215L506k7913L5909
14137H7260M3974l8962l2481k8365N452M8006L2059M6869m3254l0974k4243K3898
14125H9239l1207k9237p6140K7858L7961M8291K0134K030J9756J5989L443j08296
14113A9821r192M1705J1115L2985J2538R765l38m9517m8065m5378j4071Q2493
14101D3861M7028L4330l7164n5127m9240K2656j4297k3381M8371J0432m6397R569
$$ y = [-32744, -57367, -48916, -6110, -17731, -10885, 15055, 41215, 15088, 10901, 31473, 46697, 22085, 44313, 62336, 71354, 70208, 6600, 17310, 84852, 51703, 24343, -8562, -7810, 11074, 118551, 174981, 151722, 93456, 54947, -8834, 18376, 74831, 113122, 106426, 87398, 31949, 29205, 59536, 12231, 27609, 92577, 108044, 121171, 78973, 75758, 79264, 51351, 87260, 131234, 92272, 59791, 31426, 36878, 84884, 116943, 163812, 120558, 89584, 65341, 89239, 58032, 28795, -47345, -19487, 18474, 66765, 86899, 88929, 108685, 124674, 128117, 19821, 10629, 52334, 63449, 96434, 108972, 118737, 118399, 68882, 20817, -24561, -38632, 43861, 90889, 125219, 88055, 32928, -16312, 6344, -7953, -31334, 17037, 27469, -18928, -9359]
14089i359J2238L1032R766o051M7899N2428m1563q3173m2533L6794j82L9391M6054
14076I2741J7648j8737j9146j4721l1328J2787L3166L5005N045J1832K4197M2084
14064A90573j02534o4075M8618L0014j9351j9658j4841k4017K3152l868J9659
14053F3672j5951l5636J5422l1614o197K8571K5129Q15L4738K9105m7462L5931
14041I6523m1301k9002q574j1680l677n287O180j0430M3070K7871K7019j705q515
14028H0492j0260m313P481J7330J8015Q111j2689o2521k1635M5382K3435L5419
14016A24247K9586n4355l4242o361k6399L6027J2193l3620j5344r028K6856j1572
14004C7988l007l4555L8691l654L1623m512j0389l107J0683j0558K768m5201k3386
$$ y = [-9359, 2879, 33911, 43677, 37626, 85525, 137953, 96390, 13217, -29316, 7478, 7296, 46687, 92741, 110389, 91652, 72506, 57785, 26457, 39244, 72410, 107415, 112460, 124292, 148489, 190573, 88039, 23964, 72582, 102596, 83245, 63587, 48746, 24729, 47881, 44013, 63672, 47721, 12085, 27507, -4107, -10304, 18267, 43396, 44211, 78949, 108054, 60592, 96523, 55222, 26220, 17646, 5966, 2289, -2998, 3182, -7248, 35822, 63693, 90712, 89007, 80492, 70232, 65919, 73400, 90730, 108745, 116856, 104167, 41646, 20011, 65393, 88828, 124247, 153833, 99478, 65236, 58875, 32476, 68503, 80696, 47076, 31732, 22704, 49560, 37988, 34981, 426, 39117, 35463, 67086, 62574, 52185, 49078, 59761, 49203, 51971, 6770, -16616]
13991a6616N0111M20L399M039O5204k9099j2793N021l565O669J578K2686o0757
13978C6297J1488L0689k05n8098m2956P539j4382O079R2187m3694p5215L9083
13966a1188M858l5510j3343O9665k4073k4160K3366O2284N2112J0052k7991j5641
13954G0431m7500R622J0338L9973j5726k332n162J5592p237k3806J2750j8670
13942C8273k786J680K0417N430L7675m217j9950k1243J2041l7159J8534M0519
13930H9214J2679J0973M1888l0504k2555p7262j7793O7999q832j5586j5916K136
13918C6441k0346k6276M1632K9861k7619l2209M146j0310k404J9855J9260K8531
13906F0562M8686L7776k0527n4497M156j3242l7532J3837L5253n0878p2296l565
$$ y = [-16616, 33495, 33915, 37314, 41353, 106557, 77458, 64665, 69686, 66121, 72790, 74368, 97054, 36297, 47785, 78474, 78269, 20171, -22785, -15246, -29628, -23549, 68638, 24944, -50271, -11188, -6330, -41840, -55183, 14482, -9591, -33751, -10385, 51899, 104011, 114063, 86072, 70431, 22931, 32553, 42891, 82864, 67138, 64806, 59644, 75236, 67999, 44193, 56943, 38273, 35487, 37167, 57584, 63014, 100689, 96472, 76522, 55279, 67320, 30161, 48695, 89214, 101893, 112866, 154754, 124250, 101695, 24433, 6640, 74639, 65807, 50221, 34305, 36441, 16095, -10181, 31451, 61312, 33693, 1484, 5630, -4680, -7084, 12771, 32031, 60562, 109248, 147024, 126497, 72000, 76156, 62914, 25382, 39219, 74472, 23594, -48702, -52267]
13894e2267J029M4275J9333M6991N517k1837j8750Q409M5184l3179o8338K8657
13882E024N6564J7266k0403K7579j0511k247j0097k8260J3858k4001k6195J0593
13870I170J3111k6065K9631n608o170k610L37k3441J1396N5481k1836l7025N0284
13857D6655K4533q453J1715o168k8773K7085m8459l3773K0616K4937k711K8250
13845E5454k2686l8762O1984P618J4336K5620P649q327j7476l796n2997o039L3560
13832E6138J652P317m34l3517j0454P358J4522N5899J6781K0148p2958m4419q636
13819I397N902M582n1215O418P1453J2481l3815j8464M6341L3010O736L8920p887
13806A23859l8337M0843L1647k2397m7280n5681j224r808O793L2140L9282M8789
$$ y = [-52267, -51238, -6963, 12370, 59361, 64878, 43041, 24291, 32700, 77884, 44705, -23633, 5024, 61588, 78854, 58451, 86030, 75519, 73272, 63175, 34915, 48773, 24772, -1423, 9170, 22281, -3784, 25847, 20239, 14069, 11459, 11796, -11645, -249, 55232, 33396, -3629, 46655, 71188, 62735, 74450, 68282, 39509, 66594, 18135, -15638, 4978, 29915, 27204, 55454, 32768, -5994, 55990, 63608, 77944, 103564, 111213, 102886, 85410, 81614, 28617, 22578, 56138, 57790, 65107, 64673, 31156, 20702, 28060, 42582, 98481, 115262, 135410, 62452, 18033, 9397, 15299, 19881, -31334, -24916, 46537, 59018, 25203, 6739, 53080, 86090, 92826, 131746, 123859, 85522, 126365, 158012, 135615, 88335, 32654, 31430, 21622, 28415, 60555, 99837, 148626]
13794A48626mk0962j0633l8969j2168m6960j8227K4056L7840L1876K7952l5196
13782H7231l7652N6582j5983l2255J6918M2576n1115n355K4875K4722J2169l9166
13770H3547l919L4233l6220r359m158j8798l3466m7952K0826K5436o644j962l9690
13757c8126J5564L1480K7625L1322k2044L981j1405n6984O1006N2765p4011m35
13745B0738j1559J5937L341K095K2678K1382M0300K8361k0195k2293L1938m1003
13733I1720o5709l523L3708l3027m9354l889L2110L799O5989L3545k6972l5398
13721D2999m1677o462M5769L4819k3963K4226K6561k0633l8203l6228R898M4206
13709F1312J0884r921q4060O555J750L7512J5843n203L7829L4410p352j7776L9016
$$ y = [148626, 148622, 127660, 117027, 78058, 65890, 18930, 703, 24759, 62599, 94475, 122427, 87231, 49579, 106161, 90178, 57923, 74841, 117417, 66302, 60947, 85822, 110544, 122713, 83547, 79628, 113861, 77641, 68282, 64124, 45326, 11860, -36092, -15266, 10170, 3526, 1564, -38126, -22562, 8918, 36543, 67865, 45821, 49802, 38397, -18587, 42419, 95184, 21173, 20738, 9179, 25116, 28457, 30552, 53230, 74612, 114912, 143273, 123078, 100785, 132723, 91720, 26011, 22488, 56196, 23169, -26185, -30074, 2036, 5835, 71824, 105369, 78397, 42999, 1322, -5140, 40629, 75448, 51485, 75711, 102272, 81639, 43436, 7208, 17106, 61312, 72196, 62275, -21785, -15230, -13480, 24032, 39875, 34672, 72501, 106911, 99559, 81783, 120799]
13696A20799k7533J6329L8807j5819o6947Q029M6794r735o0264Q779K0370J5222
13684I4831m1511k2791M80K5097J8426P254j7413J2826P551l3583K7123L2036
13672A10326m3915J944k0866k7151q260M7331O856K7977M7354J303q365j6741
13660A17793l8000l7169k4099l1050Q208M1938O4957M3875j3640k5646p8879j9669
13648H619O618m1759L9274P2162L9285N6024j7761J685n3165k7531J3567l2611
13636F4407j9406R66K1194M9767r354j1782L994k9842K7139M178l6873m3555k953
13623A7880N1877J4765n3730j7305M2030j0731J9906L7993J448l424J7991L7762
13611A56462M6120m9426o9449k6776M4382O40J5791j9352Q5p530l7464k2196L1349
$$ y = [120799, 93266, 109595, 148402, 132583, 65636, 73665, 120459, 110724, 50460, 59239, 79609, 94831, 53320, 30529, 31009, 56106, 74532, 81786, 64373, 77199, 84750, 51167, 78290, 110326, 66411, 68355, 47489, 20338, 12078, 59409, 66265, 94242, 141596, 142899, 134534, 117793, 79793, 42624, 18525, -12525, -4317, 37621, 102578, 146453, 132813, 107167, 28288, 8619, 15237, -26522, 12752, 84914, 124199, 180223, 162462, 164147, 110982, 83451, 97018, 64407, 45001, 45967, 67161, 116928, 107574, 95792, 99786, 69944, 97083, 101261, 64388, 20833, 17880, 69757, 84522, 30792, 13487, 55517, 44786, 64692, 102685, 104133, 100709, 118700, 156462, 202582, 153156, 83707, 56931, 101313, 101953, 117744, 98392, 98477, 90947, 53483, 31287, 62636]
13598F2636J4551j0785Q98N3596N450p901J0386J3059n5606o8196j086L5646j8700
13585C3948k4854o9727J4812P7469O351J6868n1501q523K5871L9795L0401j7378
13573G3532J0972l0106k3832Q780j4973j489L1500K8423K8710K440O666P908j1424
13560A17107L5001P369m9988l2762k7946m3J3100J7823j2899j0534m58R472j5668
13547D9574k4770K8264q038K2953k0898J2302R8268K9675j6412j1149m6811k6462
13535H6496j0870l255l862n3717O2695Q338M563o4244K009J5960n100Q32K9751
13522F9596O6646O429m2666o1872M8689M2404j8547l9422l5752m008K1664L0210
13510H3371P120J3153l2480J1851N3700K0204O526k6056n6498j3276l39K8617
$$ y = [62636, 77187, 66402, 67300, 120896, 126346, 118445, 128831, 141890, 86284, 18088, 17002, 52648, 33948, 9094, -60633, -45821, 31648, 37999, 54867, 3366, -5157, 20714, 60509, 90910, 73532, 84504, 54398, 30566, 39346, 24373, 22884, 54384, 82807, 111517, 113957, 120623, 128531, 117107, 152108, 159477, 109489, 76727, 48781, 48738, 61838, 79661, 66762, 56228, 55770, 65242, 49574, 24804, 53068, 45030, 67983, 47085, 59387, 157655, 187330, 170918, 159769, 112958, 86496, 75626, 72371, 68509, 14792, 77487, 85825, 90388, 26144, 28153, 44113, 39013, 39845, 69596, 136242, 142671, 100005, 38133, 86822, 129226, 110679, 71257, 35505, 31497, 53161, 83371, 90491, 103644, 71164, 83015, 136715, 156919, 163445, 137389, 80891, 67615, 67276, 95893]
13498I5893m8571K1623M8661L0526J1126m5848L1779j4994j8618K2170N0959k5100
13486A59606k2310m3115Q828J4619o309l7236m1520L7609j1525l7866L0435k7716
13474B3500J3809J0084K06p592L0056K8388j1234l6487j6730L3781r513k1957
13462C6311k1957o512q861K3792L3761P030J4990p8440j6082J6203K4305M9436
13450G3976K0031n0924R979O2127J1094k3235n1939k5709L3146M4131j221N95
13438A02051J0598n9407Q228K4680J5966J5579k2257j0462n163O033M6831m3684
13426H8993k9637J4692j9455m0050J8969L9894M1356L9973K4978m2698j1713K4003
13414A49305k516l9282k7654P8186P100l0401J1666o735p295p5781j12M8705P401
$$ y = [95893, 47322, 68945, 117606, 148132, 159258, 113410, 145189, 130195, 111577, 133747, 184706, 159606, 137296, 94181, 103009, 117628, 111319, 74083, 32563, 70172, 58647, 20781, 51216, 23500, 37309, 47393, 47599, 40007, 70063, 98451, 87217, 50730, 34000, 67781, 58268, 36311, 14354, 7842, -1019, 22773, 56534, 63564, 78554, 114, -15968, 235, 24540, 73976, 94007, 43083, 53062, 115189, 126283, 103048, 51109, 25400, 58546, 102677, 101456, 102051, 112649, 53242, 61470, 86150, 102116, 117695, 95438, 84976, 79813, 85846, 132677, 88993, 59356, 74048, 54593, 14543, 33512, 73406, 114762, 154735, 179713, 137015, 125302, 149305, 146789, 107507, 79853, 158039, 165139, 134738, 146404, 139669, 132374, 56593, 56481, 105186, 112587]
13401A12587k0574j0814J8848j2185k7607K8194J5504J2752l1589l250J3849L6688
13389A32403M0025M620o7264k3359q894J5667N1109M8351n8914J494J7502k8514
13377A24226n6623k0023r090J6459N4906j8949l2962J742O8958k1453o629M5647
13365A46209N1970j8826l9382n2402l4165J2445M1060J090o128J504K2116o286
13353A19205k4784p832l8872o873K7587K9351O4450J8870r966K4529k9716p4023
13341I1926l935n7332N7182R1039P4855j3912J456n1145m1600m2774K8423L6562
13329A70745k588K7353l2095j6018R346l666R262M047o41k0366m1597L6030J5777
13316A55589j2836q7774p690K5147L3831L7953L7479K3113k5473k5571N618n6058
$$ y = [112587, 92013, 81199, 100047, 87862, 60255, 88449, 103953, 116705, 85116, 81866, 95715, 132403, 172428, 177048, 109784, 86425, 77531, 93198, 144307, 192658, 133744, 135238, 152740, 124226, 67603, 47580, 38490, 54949, 109855, 90906, 57944, 59686, 128644, 107191, 100562, 146209, 198179, 179353, 139971, 87569, 53404, 65849, 106909, 107999, 101871, 103375, 125491, 119205, 94421, 86589, 47717, 40844, 68431, 97782, 162232, 181102, 171136, 195665, 165949, 91926, 87991, 30659, 87841, 178880, 253735, 239823, 241279, 190134, 148534, 105760, 134183, 170745, 168157, 195510, 163415, 147397, 156743, 153077, 162339, 166386, 165745, 145379, 103782, 139812, 155589, 142753, 54979, 47289, 72436, 106267, 144220, 181699, 204812, 179339, 153768, 159386, 103328]
13304A03328L1514K3789j8243j0814P778M0990n973K2949J2783k8736q4313q3242
13292A1810k7375j8362M4434j3289L1805M1312J6594j5410J4790n419L5698K0656
13280A37244O895k4129j1905L2449N2992M3842R40j8317J2664m5798k023j7140
13268A67714K3251K5668L5098j4442j8258k8780q061j0958J8597K2668l633l3308
13256A75556O405L9534J9544k3026m4684M570K0871j5448k3215j5949Q684q562
13244A44280J939P242m1852k8512O8350Q829n5842O4559N9901L994j4939k483
13232B15466M5774O6111j2426k9033m3030j8289M962K5135K6863m1411q241j0935
13220B20946L7992N3325J9395m0655k7677J0205P4630m923o3206k8142N9813Q5072
$$ y = [103328, 134842, 158631, 140388, 129574, 137352, 178342, 172369, 195318, 208101, 179365, 95052, 11810, -15565, -33927, 10507, -2782, 29023, 70335, 86929, 71519, 86309, 80890, 116588, 137244, 144139, 120010, 108105, 140554, 193546, 237388, 238328, 220011, 232675, 186877, 184854, 167714, 190965, 216633, 251731, 237289, 219031, 190251, 182190, 171232, 189829, 212497, 208864, 175556, 181961, 221495, 241039, 218013, 173329, 177899, 198770, 183322, 160107, 144158, 152842, 144280, 146219, 153461, 111609, 83097, 151447, 160276, 104434, 168993, 228894, 232888, 217949, 215466, 261240, 327351, 314925, 285892, 242862, 224573, 229535, 254670, 281533, 240122, 231881, 220946, 258938, 312263, 331658, 291003, 263326, 273531, 348161, 343238, 280032, 251890, 311703, 396775]
13208C96775L8008l2843q262L9322Q9742Q5144J08870K01754J60448R0324N3966
13197A223248N9390L3863R574r2659q0170q6495j52471r2584q7382p355l1129
13186F95830L193O419R218L4548L4040L6521K6778P4483P4119O6968P0667M6034
13174A178818J160o059R3375J4565J2039P1946O4480L0243L8769L5059R156o5993
13162A477558p7036p1751j04674l8868m3646m4696n7934k2986L6667K6043l4548
13151A044129p5890j4389o2214k1728l1653j7844j7560m3264K0065j5861j1502
13140G52289J18186J61212J43730J35218J56258N9805k111p4840j04487j17254
13130A228006j42460j29199r2221j08997j15551r4727k5837j0904K0264n2445
$$ y = [396775, 434783, 401940, 393678, 433000, 522742, 607886, 716756, 918510, 1078958, 1169282, 1223248, 1282638, 1316501, 1326075, 1233416, 1153246, 1066751, 914280, 821696, 734314, 726959, 695830, 699023, 705442, 714660, 749208, 783248, 819769, 846547, 921030, 995149, 1062117, 1132784, 1178818, 1179978, 1173919, 1267294, 1281859, 1293898, 1365844, 1430324, 1460567, 1499336, 1534395, 1543551, 1477558, 1400522, 1328771, 1224097, 1185229, 1141583, 1096887, 1038953, 1015967, 1052634, 1078677, 1044129, 968239, 953850, 891636, 869908, 838255, 820411, 802851, 759587, 779652, 763791, 752289, 870475, 1031687, 1175417, 1310635, 1466893, 1526698, 1524587, 1449747, 1345260, 1228006, 1085546, 956347, 864126, 755129, 639578, 544851, 519014, 508110, 528374, 475929]
13120D75929r3273q25L2834j4982k4024l7163j8328P571j7073k9934Q295o168
13108B82859r437K5134L883K9380P1473k0427j8623K1827k3188j3147K627m5087
13096C07274p1136n2748L29L0690N8794n210q006J9997M6386l2802n2013j304
13084B40251N5560j768K0592N413k2404n1873J230M5800k4748m0749Q352K6248
13072B61904j736k8150K7626L2434N3992l287N205O03J0877m0309n2701o367K1538
13059B81629N9353N1015j9488p7618k8007k1503p732J1353J0225L4073m90N5924
13047C48734L1457r826K2003j9743m6008K6504N8450J7836l0382k0721n5897K5084
13035C47491L7399M6458L6058k563k5320m2631l9132J8490O224l3032m3490L935
$$ y = [475929, 382656, 381831, 414665, 399683, 375659, 338496, 320168, 327739, 310666, 280732, 289027, 282859, 273422, 298556, 302439, 331819, 403292, 382865, 364242, 386069, 362881, 349734, 352361, 307274, 236138, 183390, 183719, 214409, 273203, 267993, 259987, 279984, 326370, 293568, 241555, 240251, 295811, 294043, 314635, 320048, 297644, 245771, 247001, 292801, 268053, 227304, 235656, 261904, 260168, 232018, 259644, 292078, 346070, 342783, 347988, 348591, 359468, 319159, 266458, 260091, 281629, 340982, 391997, 372509, 294891, 266884, 245381, 237649, 249002, 259227, 293300, 292810, 348734, 380191, 370365, 392368, 372625, 326617, 353121, 411571, 429407, 399025, 378304, 322407, 347491, 384890, 431348, 467406, 464843, 439523, 396892, 357760, 376250, 382474, 349442, 305952, 309887]
13023C09887n934O210M3338K0151j7934O5521J9113N5770p58K7585l6541j5471
13011D70937J4648j2000k7887k4460j5237R2781K7714L47l9278L1933L2479N4836
12999F06813N3962L8114l0812p083n3677j080k1964k3190K3475j8739m936j073
12987E59810K6360K5379j0438k5398J2620M5213N637Q252O1234L8885j1776M6619
12975G82397P6205J100n2157m4973r414j8267N6109O0436p691l7083q386O036
12963H04312L872j9895p145J0060P056L5660N5657l9p3646l8847L9113N183k8262
12950G93079j234J5455l6354o1311p459N2073O3460K2070L5575K578m3387J375
12938H35920Q5251J9105L0655J3938p4579q9414p044L5605j0184n8461m6194p4364
$$ y = [309887, 303953, 310163, 353501, 373652, 355718, 421239, 440352, 496122, 495364, 522949, 486408, 470937, 485585, 473585, 445698, 421238, 406001, 498782, 526496, 526843, 487565, 519498, 551977, 606813, 660775, 698889, 668077, 660994, 607317, 606237, 584273, 561083, 584558, 565819, 560883, 559810, 586170, 611549, 601111, 575713, 588333, 633546, 639183, 647435, 708669, 747554, 735778, 782397, 858602, 859702, 807545, 762572, 753158, 734891, 791000, 851436, 843745, 806662, 798276, 804312, 808184, 788289, 781144, 791204, 798260, 833920, 889577, 889538, 815892, 777045, 816158, 821341, 793079, 791845, 807300, 770946, 709635, 702176, 754249, 817709, 839779, 875354, 877932, 834545, 835920, 921171, 940276, 970931, 984869, 910290, 820876, 813832, 849437, 839253, 780792, 734598, 660234]
12926F60234N706M5088M2914k8817J5599oK9947M3924N5100K4713K0090o2858
12914H51634m7226O403L864N8864M999J918l200l5160k8314k845L0163k426l3208
12901H05466L2022N2930Q4131J5960m7255m4521o05K6087J3545K5865j7027L720
12889I50318k0032M793L0607j955N3355P1378P5245Q2605K3051J8792J25085J48749
12877A561991J58906J89861J60161J49132J28057R3621M6224N2200l87p0596q6390
12866B382780j07055o5383m5501q2354p8844r0027k1023K6150L5507K9340N8078
12855B041668M2119J6925Q316P1376M0966M2018P1108O2190Q8037J52819J86650
12844B824192J30208R4783O4788Q53n28j06989q9141r1967k8198k1989p3260p0165
$$ y = [660234, 665940, 711028, 753942, 725125, 740724, 740718, 770665, 814589, 869689, 894402, 914492, 851634, 804408, 810811, 814675, 873539, 878538, 880456, 877256, 842096, 813782, 810937, 841100, 838674, 805466, 837488, 890418, 974549, 990509, 943254, 898733, 898128, 924215, 937760, 963625, 946598, 950318, 930286, 935079, 965686, 963731, 1017086, 1088464, 1163709, 1246314, 1269365, 1288157, 1413242, 1561991, 1720897, 1910758, 2070919, 2220051, 2348108, 2441729, 2487953, 2540153, 2539766, 2469170, 2382780, 2275725, 2210342, 2164841, 2082487, 2003643, 1913616, 1892593, 1918743, 1954250, 1983590, 2041668, 2083787, 2100712, 2109028, 2180404, 2221370, 2263388, 2334496, 2396686, 2484723, 2637542, 2824192, 2954400, 3049183, 3113971, 3114824, 3114296, 3007307, 2918166, 2826199, 2798001, 2776012, 2702752, 2632587]
12832B632587K200J1791K4433P512j2576J213m1654n9750k6330m243n7127m1406
12820B436650L3233L839J5452Q0604J15946K06641K57218K18121J58463J57577
12810C683744N0444Q074q8324r4962k8219o1699j32175n5227o5093m5989k3755
12799C146819J3716N1175M3271M6875P1657M7793J00757J12509J39890J49335
12789C923797J40557R1873O5928J22009J20106J43074K10124K08636K68550K47605
12779E542259K24302K68970K36386K95295L18541K76816L70958L87191L80725
12770H301443M21134O01006P49512Q44937R43236J048211J170818J298637J379047
12761A6757981J513798J712054J963702K473345L196250M172396N437721P236002
$$ y = [2632587, 2634787, 2646578, 2671011, 2678523, 2665947, 2667160, 2625506, 2565756, 2539426, 2535183, 2478056, 2436650, 2469883, 2473722, 2489174, 2569778, 2685724, 2892365, 3149583, 3367704, 3526167, 3683744, 3734188, 3742262, 3653938, 3558976, 3530757, 3469058, 3336883, 3281656, 3216563, 3170574, 3146819, 3160535, 3211710, 3254981, 3301856, 3373513, 3421306, 3522063, 3634572, 3774462, 3923797, 4064354, 4156227, 4222155, 4344164, 4464270, 4607344, 4817468, 5026104, 5294654, 5542259, 5766561, 6035531, 6271917, 6567212, 6885753, 7162569, 7533527, 7920718, 8301443, 8722577, 9323583, 10073095, 10918032, 11861268, 12909479, 14080297, 15378934, 16757981, 18271779, 19983833, 21947535, 24420880, 27617130, 31789526, 37227247, 44463249]
12753D4463249R891958J3536915J8130415K3414885K8065372L0187838K8103324
12746A95793956K0566862Q532219m625842j5311395k1780342k3817076k2508287
12739A36850095j9390530j5386172j1204929p253516l857236p19640K162872M892095
12731H6093039P472354R815627J1564050J2326101J1858144J0229478Q025296
12724A57384089O054643N068699N562970P686921J1025006J4643081J7275492
12717B24700901J7378878J4024840P154008j499779r513021j4998081j7285949
12710B19961797j6557069j3931529j0410444o667392l608538j606154j021164
12703A66159507k103808m331659p090708r517342j1012408j1189765j0317892
$$ y = [44463249, 54355207, 67892122, 86022537, 109437422, 137502794, 167690632, 195793956, 216360818, 224893037, 220267195, 204955800, 183175458, 159358382, 136850095, 117459565, 102073393, 90868464, 83614948, 79757712, 79038072, 81200944, 86093039, 93565393, 103381020, 114945070, 127271171, 139129315, 149358793, 157384089, 163438732, 168507431, 174070401, 181757322, 192782328, 207425409, 224700901, 242079779, 256104619, 263258627, 261758848, 252245827, 237247746, 219961797, 203404728, 189473199, 179062755, 172395363, 168786825, 167180671, 166159507, 164055699, 159724040, 152633332, 143115990, 132103582, 120913817, 110595925]
12696A10595925q613622o380790l691933p58005K805259P107541J2225534J8091859
12688A31381768K4097253K8666687K9784793K5649311J5985382K170388j2239910
12681B45495672k3257080k9189417l0232370k8044650k4143617j9724397j5544197
12674G5359944j1979073r159946o909790n327005m169608l294290k763525k410292
12666B9346415k143038j938795j812272j611910j457251j380286j219880j127410
12658A6655573j012552r15217p81356p10732n97656n65654n49935n20488m64430
12649A0537553m95544m35590l05408l37462l45611l07010k61748k64958k59967
12640G524255j98730k06818j52443j58286j93722k89878k62411k38167j83986
$$ y = [110595925, 101982303, 95601513, 91909580, 91151575, 93956834, 101064375, 113289909, 131381768, 155479021, 184145708, 213930501, 239579812, 255565194, 257735582, 245495672, 222238592, 193049175, 162816805, 134772155, 110628538, 90904141, 75359944, 63380871, 54220925, 47311135, 41984130, 37814522, 34520232, 31756707, 29346415, 27203377, 25264582, 23452310, 21840400, 20383149, 19002863, 17782983, 16655573, 15643021, 14727804, 13946448, 13235716, 12638060, 12072406, 11522471, 11001983, 10537553, 10042009, 9606419, 9301011, 8963549, 8617938, 8310928, 8049180, 7784222, 7524255, 7325525, 7118707, 6966264, 6807978, 6614256, 6324378, 6061967, 5823800, 5639814]
12631E639814k09223j28227q6313j19675j21611o4530k1210L0285m78L6348L9043
12620D994223M4351m2062r7473k05630k33152k15231j40481k11919j54809j65231
12610C572586j31875j63419j78430j18240r694k3995O547j3319l7377Q4446K3190
12599C010420m8916r8330K4580L3622J1282M3658J3113J2988K0258M2250K794
12588C067719m3226p6402j12478q7217o6414q1490j13885q9376J12o3029n3657
12577B280657j3675n1316j02606o4644l2669l1481l9425j0310O2542M9605Q6076
12566B132754M9700M442N92O857K8391P3129Q9693N3946P7751L0101j03889j55072
12554B288395k24834j79930k05070j89632j49967j78935j23725o6855m8189n4678
$$ y = [5639814, 5430591, 5302364, 5216051, 5096376, 4974765, 4910235, 4889025, 4919310, 4918832, 4955180, 4994223, 5038574, 4996512, 4899039, 4693409, 4460257, 4245026, 4104545, 3892626, 3737817, 3572586, 3440711, 3277292, 3098862, 2980622, 2970928, 2946933, 2953480, 2940161, 2902784, 2987230, 3010420, 2961504, 2863174, 2887754, 2921376, 2932658, 2976316, 2989429, 3002417, 3022675, 3064925, 3067719, 3024493, 2948091, 2835613, 2748396, 2681982, 2600492, 2486607, 2397231, 2397343, 2334314, 2280657, 2266982, 2215666, 2113060, 2048416, 2015747, 1984266, 1944841, 1934531, 1997073, 2046678, 2132754, 2182454, 2186896, 2187488, 2194345, 2222736, 2295865, 2385558, 2439504, 2517255, 2547356, 2443467, 2288395, 2063561, 1883631, 1678561, 1488929, 1338962, 1160027, 1036302, 969447, 921258, 866580]
12544H66580l6462m2403k305o307q0385n5246m2443k4457n1319m7206j8782k1979
12532D37286L5872q914r2752j3635n2044k7197K2625K774J6346L1562J8350K9678
12520C99951m0431o2110k8847K2610N5616q924l878l9973n2577k5083l5316L8616
12508B19654L5291J5659k0495o0400m131m2037K8679j7506M1237M6105N4887J4753
12496C11696k4922k6206l0804p3849O350L1058l275k0007j3645O360k2821N3599
12484A93534o965n1119p8001J8081N6445O7652P274k4302J7341l9744J734K3122
12472A85052l1967k7950O468K5847L3026j1112l1236K4660K9822j4300K8434J965
12460B18709L2131O5669o632p3180n0106o9064M426J2796J3602N123J0541M017
$$ y = [866580, 830118, 787715, 785410, 779103, 698718, 643472, 601029, 576572, 525253, 478047, 459265, 437286, 473158, 464244, 371492, 357857, 305813, 278616, 301241, 304015, 320361, 351923, 370273, 399951, 359520, 297410, 268563, 291173, 346789, 337865, 333987, 294014, 241437, 216354, 181038, 219654, 254945, 270604, 250109, 189709, 185578, 143541, 172220, 154714, 195951, 242056, 296943, 311696, 286774, 260568, 229764, 155915, 162265, 193323, 190048, 170041, 156396, 162756, 139935, 193534, 186569, 135450, 57449, 75530, 131975, 199627, 206901, 182599, 199940, 160196, 161930, 185052, 153085, 125135, 131603, 157450, 190476, 179364, 148128, 172788, 202610, 188310, 216744, 218709, 250840, 316509, 309877, 236697, 186591, 117527, 121953, 134749, 148351, 153474, 164015, 168032]
12448A68032Q429o6391l4331j4954J588J7644M2982k5048q235m1767J1193R1909
12436A51051L7815l1031o613J4152j3223m53n2533k930P456J14L2038M4827j1160
12423A69510L5435m5498j6294k5175l944J6790J899k5077j2984j3887l046K776
12411H0505K0330j4039J3483N371J9899m624n7892P121P8943N712o0813j0852
12399H3144J9390N5223L3873P999j9878m3415o483L4933K4601k5253j646k3120
12387A39368o9844l9557n352l196N2261M6055P0933j1374m0621M0018J9811K0758
12375B19260K2450k9662j1931m4993M263J2557J1839r848K0336j8708r966M5298
12363B10895m3666p2146q95L7719l1812n9924q945L437N3643P6851J650j1927
$$ y = [168032, 176461, 110070, 75739, 60785, 62373, 80017, 122999, 97951, 89716, 47949, 59142, 151051, 188866, 157835, 151222, 165374, 152151, 151698, 99165, 96235, 103691, 103805, 135843, 180670, 169510, 204945, 159447, 143153, 117978, 114034, 130824, 132723, 107646, 94662, 80775, 77729, 80505, 100835, 86796, 100279, 105650, 125549, 120925, 63033, 70154, 149097, 154809, 93996, 83144, 102534, 157757, 191630, 199629, 179751, 136336, 129853, 164786, 189387, 164134, 162488, 139368, 69524, 29967, 24615, 21419, 73680, 119735, 190668, 179294, 138673, 178691, 198502, 219260, 241710, 212048, 200117, 155124, 159387, 171944, 183783, 173935, 194271, 175563, 165597, 210895, 167229, 95083, 94188, 131907, 100095, 40171, 31226, 34663, 88306, 165157, 166807, 154880]
12351A54880k0505j8033O607M0900J0576l5044j0354J9947j3169j5781j0294L2768
12339A42498j0057k1011L2025L0446n477k2667l3500p768m183o559J6648K6588
12327A36983K3790J0689m8096L7149N269k295m7097k0925K5250l3264n1279m6154
12315i980R0854N5973L1133N1160m050j5712j5710q892j5334J8050k4931k7763
12303A24798M9227M5088K5077N236n2379L2530P3162L5954M7874Q9834O9946P3375
12291F19722J48846J64078J00718N9721l5146o901p3318q6717j06597j29192m9097
12280F06117O223j7620q429l3868n3049O41j4853j7147J03441J9504O0022M5915
12268F96897J23847P0939K8231K8501M6205O5597L8378R8240J17580L7262N9447
$$ y = [154880, 134375, 116342, 122949, 163849, 174425, 139381, 129027, 148974, 135805, 120024, 109730, 142498, 132441, 111430, 143455, 173901, 168424, 145757, 112257, 104489, 100306, 93747, 110395, 136983, 160773, 171462, 123366, 160515, 165784, 163489, 116392, 95467, 120717, 87453, 36174, -9980, 80874, 136847, 167980, 219140, 215090, 199378, 183668, 174776, 159442, 177492, 152561, 124798, 174025, 219113, 244190, 249426, 197047, 229577, 302739, 338693, 386567, 476401, 546347, 619722, 768568, 932646, 1033364, 1093085, 1057939, 1051038, 977720, 891003, 784406, 655214, 606117, 612340, 594720, 586291, 552423, 499374, 500015, 485162, 468015, 571456, 590960, 650982, 696897, 820744, 891683, 919914, 948415, 994620, 1060217, 1098595, 1196835, 1314415, 1351677, 1411124]
12257A411124J6484l6611n4319n9564j07107r0330k8667J2805n6441k8421o6799
12246I12154j6365P885q944l8890L189q2234o2975q9002O928p135m0739k5654
12234E58218L3182N4810J03954J03211J65169J02804J42786R3104R0520O232p8803
12223A375187j05714j80179k02135j79242j10644p1747o2917r2720m2331J3063
12213C40621K3488J8771M353o1969j4801l8733m3247k3585M315k0033k9293M0604
12201B00491Q3479L4544k4078q6527k9113M0553n708L0617k6638m3230M83L3724
12189B08597n4988k0879L8426m992n0184K7833J3186n3497q026j1580K0436J3538
12177A17870P1662m2249Q615M3313r406j7498L9062l3245m1923k6087J0527m3138
$$ y = [1411124, 1427608, 1390997, 1336678, 1277114, 1170007, 1079677, 1051010, 1063815, 1007374, 978953, 912154, 895789, 903674, 894730, 855840, 859029, 776795, 713820, 624818, 631746, 624611, 583872, 558218, 591400, 646210, 750164, 853375, 1018544, 1121348, 1264134, 1357238, 1447758, 1453990, 1375187, 1269473, 1089294, 887159, 707917, 597273, 525526, 462609, 369889, 327558, 340621, 364109, 382880, 387233, 325264, 310463, 271730, 228483, 204898, 209213, 189180, 159887, 200491, 283970, 318514, 294436, 207909, 178796, 219349, 213641, 244258, 217620, 174390, 174873, 208597, 153609, 132730, 171156, 166164, 115980, 143813, 156999, 103502, 95476, 83896, 104332, 117870, 189532, 147283, 155898, 199211, 189805, 172307, 211369, 178124, 136201, 110114, 120641, 77503]
12165G7503k8743j9601Q925M7058P257N9095O236n1761K4938M8880j4973J7895
12153A82709r665m4813J5233K4732j624l546m2692K6010J0236R070k8641n1653
12141H5356N4675M8227k1153K2915J4199M1635j1801l7009m1123m5673L8578P1261
12129B20087l199l9746l9761j1573K0957K2965m597k196n1147k0518L6094K0454
12117A47820L3044O8617K9430J1279K0280n117r921k0181l9387k3422l6864l269
12105A72309K4271K420R39K9725l2614J2601J2359L8722J1705L3937P033J6377
12093C29784M2096K6360M8841P6131Q3463P8981J29584J33275J57857J76146J05424
12082A387942N79J9935K782j14490j80047j64183p3185q2934p0693l5494j6341
$$ y = [77503, 48760, 29159, 38084, 85142, 92399, 151494, 157730, 105969, 130907, 179787, 164814, 182709, 173044, 128231, 143464, 168196, 166572, 163026, 120334, 146344, 156580, 165650, 137009, 85356, 140031, 188258, 167105, 190020, 204219, 245854, 234053, 197044, 155921, 110248, 148826, 220087, 216888, 177142, 137381, 125808, 146765, 169730, 165133, 162937, 111790, 91272, 127366, 147820, 180864, 249481, 278911, 290190, 310470, 305353, 295432, 275251, 235864, 212442, 175578, 172309, 196580, 199000, 199939, 229664, 197050, 209651, 222010, 260732, 272437, 306374, 313407, 329784, 371880, 398240, 447081, 523212, 606675, 685656, 815240, 948515, 1106372, 1282518, 1387942, 1388521, 1408456, 1411238, 1296748, 1116701, 952518, 879333, 796399, 725706, 690212, 673871]
12071F73871J1077l6662O0734P3179L5792M7779K3015K6218P0149L7035j2933
12060A009254K571J2809m374j3068P2689Q2680P7783P1865N0323N2269R2652M30
12048A507883j03784p5788m5332m1598o6849l1323j1739l2891j32339j09853j6478
12037H39909l9274p4918l7649L735P80l9890j2978J0795L8296O2267O3422L1313
12025H45808K6716R7981R5764Q5057N8038N8318K401j8406r1934j74253j77869
12014H07621r4651m0487q2097n6888m3542l3661m0257n7613l0477k2302J5389
12003C21035l6006j9984J571N3462K1397P628Q172K4359K4659m3150M7895O891
11991D17929J0065N5754N8819N7929N0005R713K407M6665l5491n3775l1002m9883
$$ y = [673871, 684948, 648286, 709020, 782199, 817991, 865770, 888785, 915003, 985152, 1022187, 1009254, 1011825, 1024634, 1020260, 1007192, 1079881, 1162561, 1240344, 1312209, 1362532, 1414801, 1507453, 1507883, 1404099, 1328311, 1282979, 1241381, 1174532, 1143209, 1131470, 1098579, 966240, 856387, 839909, 800635, 725717, 688068, 691803, 692583, 652693, 639715, 650510, 688806, 751073, 814495, 845808, 872524, 970505, 1066269, 1151326, 1209364, 1267682, 1270083, 1251677, 1159743, 985490, 807621, 712970, 672483, 590386, 533498, 489956, 456295, 416038, 358425, 327948, 305646, 321035, 285029, 265045, 266616, 320078, 341475, 349103, 357275, 381634, 406293, 363143, 411038, 417929, 427994, 483748, 542567, 600496, 650501, 660214, 662621, 709286, 673795, 620020, 589018, 539135]
11979E39135O148n8135j8820l6516o132n399j7846n3211l8519L7066J3485N2251
11967D13507O040L6481k9380k373N0686K4893J7877K0441J1270O3812M7307P3901
11955G34462N1935L7361M205n4290o974k6780k6693n5100k1933L006l7377q8801
11943E13021l2521j0539M0179L9460l4716o0457k5560j4624o2725O0888N2695
11932D65101M0739Q22J511L0594L1604J4580P0342L5183N8760J1914N202K3611
11920G89963k189j5227l2694j7283O119k2783k7067q5037j6312O0254N1221Q853
11908F97818j322m81n009l7994m4124K7859n5263r2875l27Q467J2514J8056Q2058
11895F09377N9803K4069k2034J911P546O3591M9790j423l8381k7882p3853j7960
$$ y = [539135, 545283, 487148, 468328, 431812, 425680, 420281, 402435, 349224, 310705, 347771, 361256, 413507, 419547, 456028, 426648, 424275, 474961, 499854, 517731, 538172, 549442, 613254, 660561, 734462, 786397, 823758, 827963, 773673, 766699, 739919, 713226, 658126, 636193, 639199, 601822, 513021, 480500, 469961, 510140, 549600, 514884, 454427, 428867, 414243, 351518, 412406, 465101, 505840, 506662, 508173, 538767, 570371, 584951, 655293, 690476, 749236, 761150, 766352, 789963, 787774, 772547, 739853, 722570, 728689, 705906, 678839, 593802, 577490, 637744, 688965, 697818, 696496, 696015, 691006, 653012, 608888, 636747, 581484, 488609, 488282, 496749, 509263, 527319, 609377, 669180, 693249, 671215, 673126, 680672, 744263, 794053, 792630, 754249, 726367, 652514, 634554]
11883F34554r916P599K541J9463N7976P9181K9105j6070l6644k553q2198j7742
11871F65296O6677M6046n5123k2532L638L3099L5184k4822j3981n3436j0065K5295
11859F95276l0530m8849L8551m68k0090M9514M3743K1871L0762K8331L9148O0433
11847I07692M2363n570k2076n2206m0403k452n1297K231r086p2719l9681M1854
11835F98650M4362J2259k5553j2485n1633l7998J9684O9026M2819J3848m7957
11824G25022K1212K3552o662j3715n1490K8208k671P206O0165O5760L9839m1100
11812H55326q0823N1647P6724K3965K8852l96j8991o725O350r475J6304K4437
11800I67195M1458L7906M9912L9733O6967J00864M1609P8394K4623J4260J33434
$$ y = [634554, 624638, 632237, 634778, 654241, 712217, 791398, 820503, 804433, 767789, 765236, 683038, 665296, 731973, 778019, 722896, 700364, 704002, 737101, 772285, 747463, 733482, 680046, 669981, 695276, 664746, 615897, 654448, 653980, 633890, 683404, 727147, 749018, 779780, 808111, 847259, 907692, 950055, 944485, 922409, 870203, 829800, 827348, 776051, 778282, 769196, 696477, 656796, 698650, 743012, 755271, 729718, 717233, 665600, 627602, 647286, 716312, 759131, 772979, 725022, 746234, 769786, 763124, 749409, 697919, 726127, 723456, 730662, 790827, 856587, 896426, 855326, 774503, 826150, 902874, 926839, 955691, 955295, 936304, 929579, 935929, 926454, 942758, 967195, 1008653, 1046559, 1096471, 1136204, 1203171, 1304035, 1345644, 1424038, 1448661, 1462921, 1596355]
11789A596355J42145J35220J71527K31975K38827J66703J36055R0773k1912m9465
11779B838203j4653m3750M2293p945n7035j7456p6819r3565p1421m2739J0863
11768B465976m6296m4212R819M5124J1937L1885J1211R486J7550K6293r122J17660
11756B647311J67774J55039J01952J03795R0993N0074k2910p9908p6182j1550
11746C126388Q350j5427q1335j19866J8834n628L0145p2628Q495j8261m3982m8676
11734B786409k6190j0117k6396L3314Q8793J00834N7610N8649J00554O8247J74279
11723C405986J70731J13382R0344J6612m3742o1574K306m4183n2067n2494m2668
11712C502633J7224o7650o0103J07138O9265J36153P1389J7924K1988O3754M3257
$$ y = [1596355, 1738500, 1873720, 2045247, 2277222, 2516049, 2682752, 2818807, 2909580, 2887668, 2838203, 2823550, 2779800, 2822093, 2814148, 2757113, 2739657, 2662838, 2569273, 2497852, 2455113, 2465976, 2419680, 2375468, 2385287, 2430411, 2442348, 2474233, 2485444, 2494930, 2512480, 2538773, 2529651, 2647311, 2815085, 2970124, 3072076, 3175871, 3266864, 3316938, 3294028, 3214120, 3137938, 3126388, 3134738, 3119311, 3037976, 2918110, 2936944, 2931316, 2961461, 2888833, 2897328, 2879067, 2835085, 2786409, 2760219, 2750102, 2723706, 2757020, 2845813, 2946647, 3004257, 3062906, 3163460, 3231707, 3405986, 3576717, 3690099, 3780443, 3797055, 3753313, 3691739, 3694045, 3649862, 3597795, 3545301, 3502633, 3519857, 3452207, 3392104, 3499242, 3568507, 3704660, 3776049, 3793973, 3815961, 3879715, 3922972]
11701C922972Q3326J03327J21416O3939P0268R5897K16455J91452K10843J53210
11691E233105J45687J82278K24936K92542L13160K31934K52686L17791L13348
11682G507467L73712N13429N30250N72783O74637P93735R78518J135944J287053
11673A4367528J515866J879707K163144K542766L100110L788609M819041O198246
11665D0375017Q182812J1098733J5099094K0077254K5664578L0568624L2833862
11658A83899974L0513623K2629262J0299992l501825j5369766k2977543k6104767
11651A79388950k5377591k2251968j7910000j3149457q603423m482217p29616
11644H6884678K723098N809281Q417264J0218655J1015631J0575990R067249O947719
$$ y = [3922972, 4006298, 4109625, 4231041, 4294980, 4365248, 4461145, 4677600, 4869052, 5079895, 5233105, 5378792, 5561070, 5786006, 6078548, 6391708, 6623642, 6876328, 7194119, 7507467, 7881179, 8394608, 8924858, 9497641, 10172278, 10966013, 11944531, 13080475, 14367528, 15883394, 17763101, 19926245, 22469011, 25569121, 29357730, 34176771, 40375017, 48557829, 59656562, 74755656, 94832910, 120497488, 151066112, 183899974, 214413597, 237042859, 247342851, 243841026, 228471260, 205493717, 179388950, 154011359, 131759391, 113849391, 100699934, 92096511, 87614294, 86884678, 89607776, 95417057, 103834321, 114052976, 125068607, 135644597, 144711846, 151659565]
11636A51659565M450410K118646P58380Q22336K787171O706755J1858146J6976350
11628A98137759K0317162K0615309J6998046R775608O82400p910654j4005236
11621B44610394j6497067j5777830j3070410r721844p090280n727531n636106
11614A71089326o580461q189411r970045j1419896j2104143j1727329j0314963
11607A00783078q352719n964843l406673o22548K440008N875292R991713J4731566
11599A15474874J9753305K3923635K5654589K3509754J6517218N358657p135434
11592B23056598j7794587k4526395k6813175k5617137k2524089j8686597j4890832
11585G2203786j1448431q682969o645641n235597m166779l426103k913463k453788
$$ y = [151659565, 156109975, 158228621, 158987001, 159809337, 162596508, 169303263, 181161409, 198137759, 218454921, 239070230, 256068276, 265843884, 266526284, 258615630, 244610394, 228113327, 212335497, 199265087, 189543243, 182452963, 176725432, 171089326, 164508865, 156319454, 146349409, 134929513, 122825370, 111098041, 100783078, 92430359, 86465516, 83058843, 82436295, 84876303, 90751595, 100743308, 115474874, 135228179, 159151814, 184806403, 208316157, 224833375, 230192032, 223056598, 205262011, 180735616, 153922441, 128305304, 105781215, 87094618, 72203786, 60755355, 52072386, 45426745, 40191148, 36024369, 32598266, 29684803, 27231015]
11577B7231015k218330j961983j682173j470210j309968j229563j102430r36077
11569A5320281q74526p95510p31374o62837o14310n22105m65188m97360m43241
11560I713830l96878l81695k97938k48350k94256k43452k77984k30710k59563
11551G083004k57292k31867j66258j43477k03670k52956k42755j41846j22427
11542E320456j27270j81795j74184j40285P318m5154l7052M6512M7413O4812Q4634
11531D865405M3716o0146r1790k18871k30475k02553j83846j48772j92788j62424
11521C417456k31487j62421j09058m0472k7591R435k5111O09P174l4048l5798
11510B768688m4081k2232q209p7771n4662K1769K8217N3028L7169K8441L3634
$$ y = [27231015, 25012685, 23050702, 21368529, 19898319, 18588351, 17358788, 16256358, 15320281, 14445755, 13650245, 12918871, 12256034, 11641724, 11119619, 10654431, 10157071, 9713830, 9316952, 8935257, 8637319, 8388969, 8094713, 7851261, 7573277, 7342567, 7083004, 6825712, 6593845, 6427587, 6284110, 6080440, 5827484, 5584729, 5442883, 5320456, 5193186, 5011391, 4837207, 4696922, 4704240, 4659086, 4622034, 4668546, 4715959, 4780771, 4865405, 4909121, 4848975, 4757185, 4538314, 4307839, 4105286, 3921440, 3772668, 3579880, 3417456, 3185969, 3023548, 2914490, 2874018, 2846427, 2855862, 2830751, 2831360, 2838534, 2804486, 2768688, 2724607, 2702375, 2694166, 2616395, 2561733, 2583502, 2611719, 2664747, 2701916, 2730357, 2763991]
11499B763991M649J8772j0646k5943m4236j67436j34814p0883m1115m3974p2584
11488B175781j38448n5620r7230q4686j00672n3702o0334J0971K400k0185j4987
11477A563288J4858J7411p478O5548K1908J36895J10581L0562P7466J6568q6436
11466A961171j41268m1610j11759j29839j83045k23697j39130o8450p2103o6837
11456G83433m5205j04442m8539n297k6519o6391m8391l9929J1787o406q0751m1980
11444B81370K1884r92l5319J677J3694m7696N381j4531J5440J6038r7502k7734
11432A31710k3270k6654m406L9006P0636l3087l0502m9454m2464K3592K645K6151
11420H3903J9023k5740m1208j6627K2344P0327N1277M2134k126m7889q0792k6688
$$ y = [2763991, 2768640, 2787412, 2776766, 2750823, 2706587, 2539151, 2404337, 2333454, 2292339, 2248365, 2175781, 2037333, 1981713, 1884483, 1799797, 1699125, 1645423, 1585089, 1596060, 1598460, 1578275, 1563288, 1578146, 1595557, 1588079, 1653627, 1675535, 1812430, 1923011, 1953573, 2031039, 2047607, 1961171, 1819903, 1778293, 1666534, 1536695, 1353650, 1129953, 990823, 922373, 850270, 783433, 738228, 633786, 585247, 579950, 553431, 487040, 438649, 398720, 410507, 404101, 323350, 281370, 303254, 302262, 266943, 268620, 282314, 234618, 239999, 225468, 240908, 256946, 159444, 131710, 108440, 81786, 77380, 116386, 187022, 153935, 123433, 73979, 31515, 55107, 57752, 83903, 102926, 77186, 35978, 19351, 41695, 112022, 163299, 205433, 203307, 155418, 74626, 47938]
11408D7938o803M5101R294j2182j2310k3453o9450J5324K2o0064n4097L1849K4924
11395f3907J6258K4624K347k8431Q524J5029K2629m802M486K0627l9715k7096
11383d9427N7146k9061L4909J1979l5793n8310N0340O2827K8348l453M302j8959
11371E4848o6654m5204m6330L9094n005K413J9388N1573j1898L19L5504M770j1844
11358B0974m1048r987l3289j2307K5186K098J3479L7703L683l4205j0779Q1859
11346D3367J3162o925o1441K5019J8400j724m2762m9138P964J2272k0552k0976
11334h3334K0646l3800k5030N4587j2060o4339k0698O914M2613K4130o9790N979
11322a54182M7040J8269m524P3080K8957p835K7058O460l7724q083N3285l9827
$$ y = [47938, 41135, 86236, 95530, 83348, 71038, 47585, -21865, -6541, -6519, -66583, -120680, -88831, -63907, -47649, -23025, -20678, -49109, -40585, -25556, -2927, -7729, -3243, 17384, -22331, -49427, 7719, -21342, 13567, 25546, -10247, -68557, -18217, 44610, 72958, 69505, 73807, 54848, -11806, -57010, -103340, -64246, -69251, -66838, -47450, 4123, -7775, -7456, 28048, 32818, 20974, -20074, -30061, -63350, -75657, -50471, -48373, -34894, 2809, 6492, -27713, -38492, 43367, 56529, 49604, -11837, 13182, 31582, 29858, -12904, -62042, -54078, -41806, -62358, -83334, -62688, -96488, -121518, -66931, -78991, -143330, -164028, -157114, -114501, -90371, -160161, -154182, -107142, -88873, -93397, -20317, 8640, 805, 27863, 34323, -3401, -11484, 41801, 1974]
11310A974m6580L6957J925k5050k5084R767j4414l680J6029N3632j4768l5933
11298d5225o8900k3286L1093J7551J7476l4793M232M1057O4586j1056m5923O2195
11286I007N1798m9031o3323k3400j0667m062J7496k4191O8176J3767j7197j3810
11274d5437L0236q543m0791K5859r397P394P6345N5706J2850j8783o7739k4215
11262f515L2503m045K9051k1500j140r696J4276l6172n6402O20o843L4336M7138
11249A5611j2945K5342j3437K4131k2117m9096l250P9132L0908j4345K2394O600
11237H8928r72J2309L6096L2427K3178L8704J11115R9827J01540J30297Q3520
11226G56969J19198J52890O3017O5935J8531o8353j42276o3437j30538j07991
$$ y = [1974, -44606, -7649, -5724, -30774, -55858, -46091, -60505, -64185, -48156, 5476, -9292, -45225, -114125, -137411, -106318, -88767, -71291, -106084, -101852, -60795, 3791, -7265, -53188, 9007, 60805, 11774, -51549, -74949, -85616, -89678, -72182, -96373, -28197, -14430, -31627, -45437, -15201, -23744, -64535, -38676, -48073, -40679, 35666, 91372, 104222, 85439, 17700, -6515, 25988, 21943, 50994, 29494, 28354, 18658, 32934, -3238, -59640, -59020, -65863, -31527, 15611, 2666, 28008, 14571, 38702, 16585, -32511, -35761, 43371, 74279, 59934, 82328, 88928, 87956, 100265, 136361, 168788, 191966, 230670, 341785, 441612, 543152, 673449, 756969, 876167, 1029057, 1092074, 1158009, 1176540, 1108187, 965911, 902474, 771936, 663945]
11216F63945o0383l5373n8392m6922P998j0430K3594r414M8090Q2585N2074J9099
11204F76471L0975L1310L2044M654K258Q955L6633P6392N4401R6190J02474R8941
11192A251698J0071m0212j4010k7701j2103n5043n3990n5550m3509n0248k4920
11181H84483j725n2744o6248p9970n5677q3020q3151p6954p624L8012Q851K2896
11169D47129R961O6832O1915O5252R0219J57012J83715Q9825l4467j03491p4891
11158I59011j45835j49743r9169n7230q0159j12826j13058p3582k738Q688r857
11147A23502l0953p7762O1498P4822k6282k1951l031o131r915K3969n2911m1874
11135A2981n324j87J9230N009k3163o0346o924K9073K5322N5073m347m5361j0936
$$ y = [663945, 603562, 568189, 509797, 462875, 470873, 460443, 484037, 474623, 522713, 605298, 657372, 676471, 707446, 738756, 770800, 775454, 777712, 786667, 823300, 899692, 954093, 1050283, 1152757, 1251698, 1261769, 1221557, 1207547, 1179846, 1167743, 1112700, 1058710, 1003160, 959651, 909403, 884483, 882758, 830014, 763766, 683796, 628119, 545099, 461948, 384994, 377370, 415382, 424233, 447129, 457090, 523922, 585837, 651089, 741308, 898320, 1082035, 1171860, 1137393, 1033902, 959011, 813176, 663433, 564264, 507034, 426875, 314049, 200991, 127409, 124671, 133359, 123502, 92549, 14787, 76285, 151107, 124825, 102874, 99843, 93712, 83797, 107766, 54855, 12981, 7657, 7470, 26700, 31709, 8546, -51800, -58724, -29651, -4329, 50744, 46397, 1036, -9900]
11122i900J0922k5358j6085P576M8186K3950j6431l9449m0671l3894L4166O2420
11110E432o661n9829l985N069L7013K0488l7167k9193O235O1642J9176k5830K4991
11097A7381L4499L3050o6650j02298k4595M6481N0450K6260k3660n8480L1445
11086c6117L2614k2107m0424K1516J9957j0078j6670k0112L2901L5021L7016M8859
11074H2376l5003j8932j0976p1443k3165q644r590J2394k0810k7504J2252J2934
11062a06111L5663k4636R572J1517L8604N4386j8219o5024q544M0527J4270K7577
11050I582L758k7760n9637K3182J4019O181l7498m9861N191Q1403J1015k0580
11038d1005K8795K7122P299J5263m123m0305k7826L9947j0310o4068R19l387K4557
$$ y = [-9900, 1022, -24336, -40421, -32845, 15341, 39291, 22860, -16589, -57260, -91154, -56988, 5432, -1229, -61058, -65043, -59974, -22961, -2473, -39640, -68833, -62598, -956, 18220, -7610, 17381, 51880, 84930, 18280, -84018, -108613, -62132, -11682, 14578, -9082, -67562, -36117, -3503, -25610, -66034, -44518, -24561, -34639, -51309, -71421, -38520, -3499, 33517, 82376, 47373, 28441, 17465, -53978, -77143, -85787, -95377, -82983, -103793, -131297, -119045, -106111, -70448, -95084, -85512, -73995, -35391, 18995, 776, -64248, -72792, -32265, -17995, 9582, 13340, -14420, -74057, -50875, -36856, -30675, -68173, -118034, -112843, -31440, -20425, -41005, -12210, 14912, 22211, 37474, 33351, -6954, -34780, 5167, -5143, -69211, -68292, -71679, -47122]
11025d7122m359n634k8257K3341q742m669p152J5746M0386l9809K1654J1369j7520
11012e0768J7327l566k3303n1460K9764J6108J5968N857R200J3700O111L592L2616
10999B1146l8515J4166M0749K2573p022M842m9560k834R152K21k2605N8536N1669
10986A02518k0972K5051r5965k5319N9728J0155l0094M468K9773J5399q221K3744
10974I0265J4129n330p5070n3355L4512L8251J2517l2236K156J5844M721K5028
10962G1432L7558k3047l4994n2224k9302J7242J9138J8802k0512l6772k5090M2009
10950a5760l0963m069L0246J1869m6148j8229J4871P549m2899j5696K6693K6491
10938e6045p254p895l08p391K3990O3472K5922l4766n5492J633j0667r360k6049
$$ y = [-47122, -51481, -57115, -85372, -62031, -70773, -75442, -82594, -66848, -26462, -66271, -44617, -33248, -50768, -33441, -37007, -60310, -111770, -82006, -65898, -49930, -44073, -34873, -21173, -15062, -11470, 21146, -17369, -3203, 37546, 60119, 53097, 57939, 8379, 5545, 14697, 14918, -7687, 50849, 102518, 81546, 106597, 10632, -14687, 45041, 55196, 25102, 29570, 59343, 74742, 66521, 90265, 104394, 99064, 23994, -29361, 5151, 43402, 55919, 23683, 25839, 41683, 46404, 71432, 108990, 85943, 50949, -1275, -30577, -13335, 5803, 24605, 4093, -32679, -57769, -15760, -46723, -50792, -20546, -8677, -54825, -73054, -58183, -50634, -93533, -109229, -82536, -56045, -63299, -71194, -71502, -78893, -54903, 8569, 34491, -275, -55767, -54134, -64801, -74161, -100210]
10925a00210k6249J0090K2496K9098K5503j4133l1698j1816K4908m463J9336P312
10913d9826J3764J1961j8570L507N4364j2627m057j252j8245N579K8268K756r671
10900E951m538l6744l3917L2292L3137k8279m9059J1055L3124M271K563m7371
10888g7515k5542K8428L7915n3935l2624Q295o02n7847J0676M6131n350n7214
10876a79184L7042L2682K7633N9846j9467o2020k8680j3227K1447O7748J3887
10865d2293n5511J2962j3915L446n64N703m690K2311K3250L9794K655j74k6920
10852c3946m3908K31k5606l5362O034N8887K8460o16k4592J528J5032K9564N1719
10839B7425m2465k0194K249k1092k9752l0658P5651N7074m9808k2999J3699J1672
$$ y = [-100210, -126459, -116369, -93873, -64775, -39272, -53405, -85103, -96919, -72011, -76474, -57138, -49826, -36062, -24101, -42671, -39164, 15200, 2573, -1484, -2736, -20981, -15402, 12866, 15622, 5951, 1413, -35331, -69248, -36956, -3819, -32098, -81157, -70102, -36978, -32707, -30144, -77515, -103057, -74629, -36714, -90649, -123273, -114978, -115580, -173427, -162751, -116620, -121970, -179184, -142142, -109460, -81827, -21981, -41448, -103468, -132148, -145375, -123928, -56180, -42293, -97804, -84842, -98757, -95311, -95875, -90172, -94862, -72551, -49301, -9507, -6852, -7026, -33946, -77854, -77623, -103229, -138591, -132557, -73670, -45210, -45826, -70418, -68890, -53858, -24294, 27425, -15040, -35234, -32985, -54077, -83829, -114487, -38836, 18238, -31570, -54569, -40870, -29198]
10827b9198M039J2317o1054J5755K8610o4499O9743l8529k8178L397m176J4642
10815g7131O6295J3693l1082k9951k8953m2082m3953o854L9422M2528n60r749
10803a08377r889l054R056K4483Q8802L7448o624m3387L5099n9863r2527l1144
10791a59977M2300L5574K6210m2029k9604j0810L3892j8834M3117K2991K5496
10780c1674J0030K0272l8821O956J00640K9953p7591l5084l574r056J058l9070
10768f5961O309L965p0298l7787K2343M6898M771J4415O2844k0913p3444j0281
10756a17139O6569L2041J9914L1225j3760l7473p1516m1110M4525N3005p834k1216
10744f2769J4683l5003k550N120J4043l1635N535j9777m3292J7799L1992J6034
$$ y = [-29198, -25159, -12842, -73896, -58141, -29531, -94030, -24287, -62816, -90994, -87597, -91773, -77131, -10836, 2857, -28225, -58176, -87129, -129211, -173164, -180018, -140596, -98068, -98628, -108377, -118266, -121320, -112264, -87781, 1021, 38469, 31845, -11542, 23557, -36306, -128833, -159977, -117677, -82103, -55893, -97922, -127526, -138336, -104444, -123278, -80161, -57170, -31674, -21644, -1372, -40193, -33237, 67403, 97356, 19765, -15319, -18893, -27949, -26891, -65961, -59652, -55687, -125985, -163772, -141429, -94531, -89760, -75345, -12501, -33414, -106858, -117139, -50570, -18529, 1385, 32610, 18850, -18623, -90139, -131249, -86724, -33719, -41553, -62769, -48086, -83089, -85639, -80519, -66476, -98111, -92576, -112353, -155645, -137846, -105854, -89820]
10732h9820J7555N8840M8546l4928J1209K9333j4013l5631n273N85k2789n8305
10720i4691k8538M4060L3922j6658L0105r747k3401k3391M595R048K7345O9315
10708B1964k2534J5977j1953j6650j304j5307j4598k8327n186K0784K8038K6912
10696b184n5399l6108J8106L4326M2781L0938J1173J6844l1955m7630M0008n0206
10684b9306n2137j1799m09J7816P714L3608J3612k7846n2846J5050j7137j5332
10672a19012J035j078K2453M4059J7171k3863p062J4333k2227K8320M5060J4274
10660A3463j7044k9883m0728k8071R557K7132k8155O915J8095M7710L1107J5583
10648B5681o7277n0549J5759J6509j519K329P039K9654j4022p703J7363O9614
$$ y = [-89820, -72265, -13425, 35121, 193, 11402, 40735, 26722, -8909, -14182, -13597, -36386, -94691, -123229, -79169, -45247, -61905, -31800, -41547, -64948, -88339, -83744, -74696, -47351, 21964, -570, 15407, 3454, -13196, -14500, -29807, -44405, -72732, -77918, -57134, -29096, -2184, -57583, -93691, -75585, -41259, 1522, 32460, 43633, 60477, 28522, -19108, 20900, -29306, -81443, -93242, -93651, -75835, -68121, -34513, -20901, -48747, -101593, -86543, -103680, -119012, -117977, -119055, -96602, -52543, -35372, -59235, -66297, -51964, -74191, -45871, -811, 13463, -3581, -33464, -74192, -102263, -92706, -65574, -93729, -86814, -68719, -21009, 10098, 25681, -41596, -92145, -76386, -59877, -61396, -59067, -52028, -22374, -36396, -44099, -26736, 42878]
10636D2878j1284p5156J020n19m5176K3191J5410J4822k8093n2710M0084O8239
10624g294j0096o6844o918M3053L8516L8064l7258p3253m7778n831N792k5392
10612a55239R794k9056k9237M8324P7469p651M560L4192M077J4300K7219k7034
10600b8282l2612k7988n845l331K2478j4869k5849N0089k4972m1776l943M5296
10588i1604N2759J7372L9155L2524k7287n8127m0817L056N2867J245n5204J6065
10576e7996n5849j5641M9503J245j437l1554M6381l2005J169k7680M9641L6278
10564c7945j8687Q646J373N616M942m717K3807J3268N5457j2615m9250p8189L193
10551h5101O8996j2359J9155L4256m5152n818J2020k3543L474P3243K9104k1194
$$ y = [42878, 31594, -43562, -42542, -43061, -88237, -65046, -49636, -34814, -62907, -115617, -75533, -7294, -17390, -84234, -91152, -48099, -9583, 28481, -8777, -82030, -129808, -135639, -129847, -155239, -145445, -174501, -203738, -155414, -77945, -85596, -81036, -46844, -42767, -28467, -1248, -28282, -60894, -88882, -94727, -98058, -75580, -90449, -116298, -66209, -91181, -132957, -136900, -91604, -38845, -21473, 17682, 50206, 22919, -35208, -76025, -72969, -20102, -18857, -74061, -57996, -113845, -129486, -79983, -78738, -80175, -111729, -65348, -97353, -96184, -123864, -74223, -37945, -56632, -47986, -46613, -40997, -36055, -40772, -16965, -3697, 51760, 39145, -10105, -88294, -85101, -16105, -28464, -9309, 24947, -20205, -26023, -14003, -37546, -34072, 39171, 68275, 47081]
10539D7081n1029K26O9023J5716N5709M7018o2618n9679m5003M517K8918o0859
10527a0980l3287N953R0790K2486p7303r467L7813l7140j7886q56m7075O2641
10515a4311K7383j5072k0871j4830m064N4946O4659L5209l0128l5382J5201J5619
10503G8359k3721j3415n4750j0858O023l9436j5806k3140L5680p953J5024J7927
10491c6066j1274l881O297j4016R818P377k0049N2063L134J1144n003n990n0346
10478e6792n4620L5535K0857M965K9527M0718j1517l6864k5373p793o8440m1304
10466a71101K7666O0999J9460k7120R866j3286L3229N9207j2101j2309n276R258
10454b1508j8458P938O7943l4549k3255Q091j3520K597N365K152o559l5078J6049
$$ y = [47081, -3948, -3722, 65301, 81017, 136726, 183744, 121126, 61447, 16444, 20961, 49879, -10980, -44267, -38314, 52476, 74962, -2341, -11808, 26005, -11135, -29021, -29877, -76952, -14311, 13072, -2000, -22871, -37701, -41765, 13181, 77840, 113049, 82921, 47539, 62740, 78359, 54638, 41223, -13527, -24385, -18362, -57798, -73604, -96744, -61064, -69017, -53993, -36066, -47340, -51221, -44924, -58940, -49122, -41745, -61794, -9731, -6597, 4547, -456, -6446, -56792, -111412, -75877, -55020, -50055, -20528, 20190, 8673, -28191, -53564, -61357, -129797, -171101, -143435, -82436, -62976, -90096, -80230, -93516, -60287, -1080, -13181, -25490, -30766, -21508, -39966, -32028, 35915, 1366, -21889, -13798, -27318, -24721, -19356, -17204, -23763, -58841, -42792]
10441d2792K386J3787M526k4763M795j2068J9678K5208J4K516l007q428L361j9858
10427c4645p1577j9280M6450M0723j3795m3272j5033M826K9187L2339L028j1614
10415e2663J5137L6804K5866j0718Q851k561k0205k071j4984o3592L2486L4503
10403a3147L5491J9909M813m7571o5127l1625L0090O856m3436l0165j5445Q1707
10391f7650K8277l7569J6683Q3795Q755o0128n9487R424L648R879j3326J1511
10379f6188K5694j7266k0202L768M0898J2647o0648m2299l8464K2317O3039P3810
10367b894N4167J0924O742j1635l0755n485L0183l4081m249J0402r319K4055Q4993
10354A23048L0487n5452m8904j4131k5362l1152K6990j5155j6555M3342K79l3283
$$ y = [-42792, -40406, -26619, -22093, -46856, -42061, -54129, -34451, -9243, -9229, -6713, -9720, -18148, -14787, -34645, -106222, -125502, -79052, -38329, -52124, -95396, -110429, -105603, -76416, -44077, -41049, -52663, -37526, -722, 25144, 14426, 23277, 20716, 511, -1560, -16544, -80136, -47650, -13147, 22344, 42253, 47066, -505, -65632, -97257, -67167, -60311, -103747, -133912, -149357, -67650, -39373, -76942, -60259, 23536, 32291, -27837, -87324, -77900, -74252, -64373, -77699, -66188, -40494, -57760, -77962, -74194, -33296, -20649, -81297, -123596, -162060, -139743, -76704, -2894, 51273, 62197, 68939, 57304, 26549, 21064, 51247, 17166, 12917, 23319, 14000, 38055, 123048, 153535, 98083, 49179, 35048, 9686, -21466, 5524, -9631, -26186, 17156, 17435, -15848]
10342a5848k3716K6915N0748M1901j8044k3831K7163l3652m7193M2657O885L4294
10330F8279K3769k9459K1249J0133r522m4270n4952k7049K0527K167K4546J9452
10318B4870j0715J8721k1327q164l5662L432J7042K946j7257j0061M4838J6310
10306B4973k4305m6834j1200j4559j6200O7545N2136J3680l0681J2810o0992l3678
10294f7305L0037L915p0144l1625N0646K5354L454l0814Q878j240R359k3977K1329
10281g2133L9597L9621L4747o731l9402q98K3929p6490k1839M0182O831j074K6152
10268g508P937L2463k628P0876k1482n9212J720J2909J374k4697J5767M8222m5058
10255C0683k3125O326J5372R60l0428n7094L3447p281k3570o4692J7264M2690
$$ y = [-15848, -39564, -12649, 38099, 80000, 61956, 38125, 65288, 31636, -15557, 27100, 33985, 68279, 92048, 62589, 83838, 93971, 84449, 40179, -14773, -41822, -21295, -19128, 5418, 24870, 14155, 32876, 11549, 3385, -32277, -28845, -11803, -8857, -26114, -36175, 8663, 24973, 668, -46166, -57366, -71925, -88125, -20580, 31556, 45236, 14555, 27365, -33627, -67305, -37268, -33353, -103497, -135122, -84476, -59122, -55668, -86482, -77604, -78844, -69485, -93462, -72133, -32536, 7085, 41832, 35101, -4301, -5199, 18730, -57760, -79599, -39417, -32586, -33660, -7508, 429, 32892, 30264, 101140, 79658, 20446, 22166, 35075, 36449, 11752, 27519, 75741, 30683, 7558, 13884, 29256, 30216, -212, -57306, -23859, -31140, -54710, -119402, -102138, -59448]
10243e9448K65n2820l3340R845N4666R766l1626q616M1331Q142k0399o916M219
10230h4931K9813J6464l2319K9263K5797j9476O0965L1458j8521o6584j8974L304
10218d3741N668j2387q8376L6479Q6386j0114l4610L6509J3569l05J99l5398P722
10205c8399O5416J3178K2606l0084j09486m3674K4256L1474O0819k5824L5936
10194F218L0931l1179o614N791K1802K3729r63n5155m5590R065R48k188J9672
10181b3533K1674j5141K4591k6298k6437M8964K7076J758m4639l4983J1231N0806
10169A5069J8678o449p4660p671P364J1168k973m1547j505m907K1349L3893J7064
10156a5127J5699J4680m1479K6287L3944k6731j0132M902j1143l1613J1900M9005
$$ y = [-59448, -59183, -112003, -145343, -135498, -80832, -71066, -102692, -111308, -69977, -61835, -82234, -89150, -84931, -55118, -38654, -70973, -41710, -15913, -35389, 25576, 57034, 38513, -28071, -47045, -43741, -38073, -50460, -138836, -102357, -15971, -26085, -60695, -24186, -10617, -10922, -10723, -46121, -38399, 27017, 40195, 62801, 32717, -76769, -120443, -96187, -64713, -3894, -29718, 6218, 37149, 5970, -644, 5147, 26949, 50678, 49715, -5440, -51030, -41965, -41017, -43205, -23533, -1859, -17000, 7591, -18707, -45144, 3820, 30896, 32654, -11985, -46968, -35737, 15069, 33747, 27298, -47362, -55033, -47669, -36501, -39474, -81021, -82526, -87433, -66084, -32191, -15127, 572, 15252, -26227, 60, 34004, 7273, -2859, 2043, -9100, -40713, -28813, 20192]
10144B0192J387n4639K5037l0840k7961k0053j7067N1966j6428n1793J1597K957
10132a05645J812J3039L6575L9568j3703k292j098O930L6254j3302R951j5769
10120g680l205Q164p150n8672k2732N601N4666j979N390M3276M5174J12o0459
10107E06m1727j9167K5581P015o602J5504J7322m4272j5666N4456K2905k4951
10095i096P397k5590O506J6916o736k1963k2844k2412M8816J00346J2276m3482
10083D0134l4112L687n890n8861r69J655n0384k9411J6989P084L1899J02435K0722
10070D4978K2549j6494M7054M1151M1174K9878L154k7477l277J9605M1097L2239
10058B75631L5487J18373J34136K38172L79488O40507P23346O42101K95249k58166
$$ y = [20192, 21579, -33060, -8023, -38863, -66824, -86877, -103944, -51978, -68406, -120199, -108602, -105645, -103833, -90794, -54219, -14651, -28354, -30646, -31744, -24814, 11440, -1862, 8089, -7680, -10885, -2721, -9871, -68543, -91275, -85674, -31008, -32987, -27597, 15679, 60853, 60965, 506, -41221, -60388, -34807, -27792, -34394, -18890, -1568, -45840, -61506, -7050, 15855, -9096, -1699, -27289, -20783, -3867, -10603, -32566, -55410, -77822, -29006, 71340, 83616, 40134, 6022, 9709, 3819, -55042, -56011, -54356, -104740, -134151, -117162, -110078, -78179, 24256, 44978, 67527, 51033, 98087, 139238, 180412, 210290, 213444, 185967, 182690, 202295, 243392, 275631, 311118, 429491, 563627, 801799, 1181287, 1821794, 2545140, 3187241, 3482490, 3224324]
10048C224324m96246o18219n60165m45357l05610k00076j46300r8617q1935m3543
10038B28256R721o51K6221m8448r5694m1058n436K1841o1303K9597Q4989l9421
10026A08614k3287o2304Q853M4688p0007L0807K3532K2787k0161K5399J4655q8324
10014A5252q5919k5144K7258K0376L6613K9647L7374k8315l5747K839q408J5997
10002A823j8320Q419K6932N937q495k4678J5845J4918j7423j3443n0184M3544
9990a5125M0664K2386J1061m2033k7233l4672m918J7822N113L130J3878L1381
9978B1454l8675K2829j2791j5773M2581P776l1018m5470k4543j4208Q2247J8825
9966A3234l276m2275k304K4295m4632l9547M8362J073o350M3347k7197l8535L0635
$$ y = [3224324, 2728078, 2109859, 1549694, 1104337, 798727, 598651, 452351, 353734, 271799, 228256, 237977, 237326, 263547, 215099, 119405, 78347, 72911, 94752, 33449, 63046, 148035, 108614, 85327, 23023, 31876, 76564, 6557, 37364, 60896, 83683, 63522, 88921, 103576, 15252, -70667, -95811, -68553, -48177, -11564, 18083, 55457, 27142, -8605, -5766, -14174, 1823, -16497, -8078, 18854, 24791, 16296, -8382, 7463, 22381, 4958, -8485, -58669, -15125, 25539, 47925, 58986, 16953, -10280, -44952, -49870, -32048, -26935, -23805, -9927, 21454, -17221, 5608, -7183, -22956, 19625, 27401, -3617, -49087, -73630, -87838, -5591, 13234, 9958, -32317, -34621, -10326, -54958, -94505, -46143, -45070, -51420, -8073, -35270, -73805, -43170]
9953d3170L9557L6263o9761k6303l8609M1252L0108M8007M4278J2026m8371q271
9941A7006k679l0314k4298n0963N8374N0652O228P384m744m5083J4928O038L3940
9928C6469M800j4349o3301m3793L1870J5812L0477q428k436J401k2105k9124j9239
9915h1946O787L9787M1430O3414O100P411j4841n0794m4006N8163K7374J6337
9903G5216J8716J4556L0040l0973o5938m372J7218L6678L8697J2293k098n4033
9891H6000k8343l7771j3619M72J5198Q706J0224L3226K5066j5326l0593J6129
9879F9369k8290R704j2379k6297q34L312K155J6026j21k6712j7319N1573K8492
9866F8679P244k1964n6469o0679O782K3827j7693J4138l4280M4689N936J0825
$$ y = [-43170, -3613, 32650, -37111, -63414, -102023, -60771, -30663, 17344, 61622, 73648, 25277, 17006, 14327, -15987, -40285, -91248, -32874, 17778, 24006, 31390, 26646, -18437, -3509, 2529, 36469, 41269, 26920, -36381, -80174, -48304, -32492, -2015, -10443, -12879, -11478, -33583, -62707, -81946, -75159, -35372, 6058, 69472, 75572, 82983, 68142, 17348, -26658, 31505, 58879, 75216, 93932, 108488, 138528, 107555, 41617, 37245, 54463, 91141, 129838, 142131, 140033, 86000, 57657, 19886, 6267, 6739, 21937, 30643, 40867, 74093, 99159, 83833, 53240, 69369, 41079, 50783, 38404, 12107, 11273, 14585, 16740, 32766, 32645, 5933, -11386, 40187, 68679, 75923, 53959, -2510, -63189, -56407, -32580, -50273, -36135, -70415, -25726, -19790, -8965]
9854h965j9285K1020M9674M6881L0658N040k3691m5797j4554M3788K5327l3151
9842G6945r9098j5852O7979K933J1027J6358j0336J9305k6684o7302L7638M9906
9830F2819L8188n6264k2509k1280j4796J4794K9869m1362q087M2317L8428m3353
9818A8764k73l3768j7079J5642k4455M872J2334j902j2767k4783O496J3303N2527
9805H911N4429K8352j7004l495k2151j8436q0663k9791M2807P3459M0903m3278
9793C4043J5409L5270O338k4387j1274j56q2893q4188K2022K7093J31026L7654
9781A05957n8958p6235n352J0317j1129k0961j2878l518M6666J7654Q912N5854
9769E6329J4540J6452K4479r0821n5917Q765L4903K2063m7775n5352J6367M8356
$$ y = [-8965, -28250, -7230, 42444, 89325, 119983, 125023, 101332, 55535, 40981, 84769, 110096, 76945, -22153, -38005, 29974, 32907, 43934, 60292, 49956, 69261, 42577, -24725, 12913, 62819, 101007, 44743, 22234, 954, -13842, 952, 30821, -10541, -18628, 23689, 62117, 18764, 18491, -15277, -32356, -16714, -41169, -36297, -23963, -25865, -38632, -63415, -56919, -43616, 8911, 63340, 91692, 74688, 71193, 49042, 30606, -50057, -79848, -37041, 36418, 77321, 34043, 49452, 84722, 91060, 66673, 55399, 55243, -27650, -111838, -89816, -62723, 68303, 105957, 46999, -29236, -34588, -24271, -35400, -56361, -69239, -72757, -26091, -8437, 475, 56329, 70869, 87321, 111800, 20979, -34938, -26173, 8730, 30793, -16982, -72334, -55967, -7611]
9757g611k5280l7780l9092J8157O9416O5679o35K9054k7870n9015O4460J974p1534
9744b0077k6641M8671L9891o268L2282J47O383l6374k1866n6637k3665J4952P1616
9731B2414j2517q538q416p626N4298n842k5929o6989l7178N2316K38k6319J9382
9718e0706J8327M1633N481k6150j3263k0559J0213K4351l692K8165l5465L9608
9706A7943L4515n1657o7879K2983M418L0594K9211J4372m6642j0470M0206N2363
9694F9957K0053o0365l2531M717k3774j1388J7721L3570P0767N121P840j673j6586
9681H3429k1450j8643n5542K948L9372j6132J0919k591l3154K7172K3600n8j1525
9668B8345K3096K7453k1708J4228o7478n9562O2489N1580K914j7275J1556J8341
$$ y = [-7611, -32891, -70671, -109763, -91606, -22190, 43489, 42854, 71908, 44038, -14977, 49483, 51457, -20077, -46718, 1953, 41844, 35576, 67858, 68005, 74388, 38014, 16148, -40489, -64154, -49202, 22414, 9897, 1359, -7057, -14683, 39615, 33773, 7844, -59145, -96323, -44007, -43769, -70088, -50706, -32379, 9254, 14735, -11415, -24678, -45237, -35024, -10673, -14365, 13800, -21665, 17943, 52458, 801, -67078, -44095, -39677, -9083, 20128, 34500, -12142, -22612, 17594, 69957, 90010, 29645, -2886, 1831, -21943, -33331, -15610, 17960, 88727, 93848, 101688, 100015, 83429, 61979, 43336, -12206, -9258, 30114, 13982, 24901, 22310, -10844, 16328, 39928, 39870, 28345, 51441, 78894, 57186, 71414, 3936, -55626, 6863, 58443, 61357, 44082, 55638, 73979]
9656G3979j1708k5091k6980J4864L1962M627P5595J5599J897p7774q0833p5862
9644g9725K3105L4838M0123M230n37n590k8296j2850M8746K860J5645m689M7333
9631H5193n022r276j6236K8840J351m1210m6361M1205P479l9343J4371j9753l9675
9618c8437k9615J5901O9177N1126k0024k3826q495m9263j8083n380k8913O0257
9606b5575K8426L0171J0757r429j7389N6840O950m395k1978L3513m203m9839n6163
9593b2314j1546M1889j0169M6664N5555L4105L8805K552k6561n0104l5756K9591
9581I2711L4862L8550J2324q1959o4584l1276l9971J9866K1623j3904J0936L0016
9569B9194J1512M1205K1027K7570M4819k8577k6104l962j3604j0687L3815M428
$$ y = [73979, 62271, 37180, 10200, 25064, 57026, 61653, 137248, 152847, 154744, 76970, -3863, -79725, -56620, -21782, 18341, 22571, 22034, 16444, -11852, -24702, 24044, 26904, 42549, 37860, 85193, 80171, 70895, 54659, 83499, 84850, 43640, -2721, 38484, 45963, 6620, 20991, 1238, -38437, -68052, -52151, 17026, 68152, 48128, 24302, 15807, -33456, -51539, -56919, -85832, -25575, 2851, 33022, 43779, 34350, 16961, 73801, 80751, 76356, 54378, 87891, 83688, 33849, -22314, -33860, 8029, -2140, 44524, 100079, 134184, 172989, 175541, 148980, 98876, 63120, 92711, 127573, 166123, 178447, 96488, 31904, 628, -39343, -19477, 2146, -11758, -822, 29194, 40706, 81911, 102938, 130508, 175327, 146750, 120646, 116684, 103080, 92393, 126208, 130636]
9557A30636L0186j8012j6570m5688j877J5670j737j219K4293K2126K1107J4649
9545A73564j2661n4904k7118L275K6317j4076K3584j8683k3809L1101L8082k9206
9533A15466J3199j9067m858M026J0858n772p806l4347K9102L5054m0430l5133
9521F0292M9998J1683k4232L6930L3440l2880k7543n837L2309K5007l9263m733
9509A15171J8319j2195j7096j2222k692K249j6359j7238K3168k1927l3386K9459
9497E5251J9954J9692l1825M7435R513J437J3557j8756k4338J0546M9251O5049
9485B16766K57j6758o4759m6381l5130k1829L6877n435M5771M6165O473j5457
9473A46560j6079k5382k2437J2298P239L5214m247k8355L0422j9420q515N225
$$ y = [130636, 160822, 142810, 126240, 80552, 78675, 94345, 92608, 91389, 115682, 137808, 158915, 173564, 160903, 105999, 78881, 82156, 108473, 94397, 117981, 99298, 75489, 106590, 144672, 115466, 128665, 109598, 104740, 108766, 119624, 113852, 106046, 71699, 100801, 135855, 95425, 60292, 110290, 121973, 97741, 134671, 168111, 135231, 107688, 101851, 134160, 159167, 119904, 115171, 133490, 121295, 104199, 91977, 89285, 91534, 75175, 57937, 81105, 59178, 25792, 55251, 75205, 94897, 63072, 110507, 120020, 121457, 135014, 116258, 91920, 102466, 151717, 216766, 217023, 200265, 135506, 89125, 53995, 32166, 69043, 63608, 109379, 155544, 162017, 146560, 130481, 105099, 82662, 94960, 102199, 137413, 133166, 104811, 135233, 115813, 107298, 112523]
9461A12523R006q881J5930J2579K0213K7497k0905o2766o470j8255p1837k1059
9449a2425M3835Q5152N5262J1257l4827m6989K0302k0575m0115J6981J5812J0989
9437A04659N5234k206o2977k0767O6179N7829j9604k6813K9571O6073k4111l3073
9425A89994J3178K4003m3946L283k3054j0644M0986k1093R325n2454m2414Q1787
9413A68951o697M5637K6867j9659n6651j4639N8739k1514m2169j9716l441L2592
9401A48300N5495M1011q185l0966l8755k3325K1935K9982L2403K6915K3020J4219
9389B92049n2690j4888j0893r6668l3543K8813K0031L6043O9471L6759L870j654
9377B76700K305J2755l3667k6474K6246K3654l2890j6904m4291J6044l300q619
$$ y = [112523, 121529, 112648, 128578, 141157, 161370, 188867, 167962, 105196, 98726, 80471, 8634, -12425, 31410, 116562, 171824, 183081, 148254, 101265, 121567, 100992, 60877, 77858, 93670, 104659, 159893, 157687, 94710, 73943, 140122, 197951, 178347, 151534, 181105, 247178, 223067, 189994, 203172, 227175, 183229, 186512, 163458, 152814, 193800, 172707, 182032, 129578, 87164, 168951, 162254, 207891, 234758, 215099, 158448, 143809, 202548, 181034, 138865, 119149, 115708, 148300, 203795, 244806, 236621, 205655, 166900, 143575, 165510, 195492, 227895, 254810, 277830, 292049, 239359, 224471, 213578, 116910, 83367, 112180, 132211, 168254, 237725, 274484, 278354, 276700, 279005, 291760, 258093, 231619, 257865, 281519, 248629, 231725, 187434, 203478, 200178, 191559]
9365A91559K4994L4296k86J9659K4773L7907J9589m3403J4849J6863k1426J0984
9353C30358j6415n4187K852j0530J354M5586M0363r4542j3984M2031L0228j091
9341C02023L1988L3276K1846J8338j6261k0894J762j1339m548L205M120j0708
9329C52808R84J6950m8178l8855J8520Q3795n571m0612l065L39k8433O1988L9091
9316D09761k50j4495K667J1772J9434K5155j3610m6872k9142j5354k7708M8830
9304C70188N4218J5362k5407N902l1034k4419J4587L318l3758l222M8207J6939
9292D10881Q231r62k1323k1231K7798Q720q584L2922K7099j2569k6606M8561l1468
9279D41469r389N4032j5653k0785J8554K9942J4084L5590K9123n6036l2478j9680
$$ y = [191559, 216553, 250849, 250563, 270222, 294995, 332902, 352491, 309088, 323937, 340800, 319374, 330358, 313943, 259756, 262608, 252078, 253432, 299018, 339381, 244839, 230855, 272886, 303114, 302023, 334011, 367287, 389133, 407471, 391210, 370316, 372078, 360739, 356191, 359396, 363516, 352808, 353792, 370742, 322564, 283709, 302229, 386024, 380453, 339841, 336776, 337115, 308682, 370670, 409761, 409511, 395016, 397683, 409455, 428889, 454044, 440434, 393562, 364420, 349066, 321358, 370188, 424406, 439768, 414361, 420263, 389229, 364810, 379397, 382715, 348957, 345735, 393942, 410881, 419112, 418150, 396827, 375596, 403394, 412114, 403530, 436452, 463551, 450982, 424376, 472937, 441469, 432080, 486112, 470459, 449674, 468228, 498170, 512254, 547844, 576967, 520931, 488453, 468773]
9267D68773O3575K6262R494q0848k908O254R42N9133M0574n4723k3655o095M4478
9254E51256j710M434R106K3692O084N29o5691o0872m823O8654n080j2196N2583
9241E65966N5339k2252k4989M3949Q4521m191J4193j6148l6839l6865J3569M938
9229F41191n333M8094K151K3587J4514m7228j0134N2263P501J131l1992m566l2191
9216F58988J2143K4095O779j5249l8582j484p290M7569M6856J2352J4420o6516
9204F94081k7286m296l0113M1174Q6469k6081K3007J3680j6032k207K6634J325
9192G80355J2399L1234j5499L9512n4388M803L9032o82j5981k2541O6600K3645
9180H88489o2071k7883O3414L5091J6242m4325o497o964j9510L9213Q13k8818
$$ y = [468773, 532348, 558610, 568104, 487256, 484348, 490602, 491544, 550677, 591251, 536528, 512873, 506778, 551256, 549546, 553980, 563086, 586778, 592862, 593391, 527700, 466828, 462005, 530659, 525579, 513383, 565966, 621305, 599053, 574064, 618013, 702534, 698343, 712536, 696388, 659549, 622684, 636253, 641191, 635858, 683952, 686103, 709690, 724204, 676976, 666842, 719105, 726606, 727737, 695745, 691179, 658988, 671131, 695226, 702005, 686756, 648174, 646690, 639400, 686969, 733825, 746177, 760597, 694081, 666795, 662499, 632386, 673560, 760029, 733948, 756955, 770635, 754603, 752396, 779030, 780355, 792754, 823988, 808489, 848001, 793613, 798416, 837448, 836766, 820785, 798244, 864844, 888489, 826418, 798535, 861949, 897040, 913282, 868957, 862460, 855496, 835986, 875199, 876012, 847194]
9168H47194J8574L7273l3048o567K2669m245o2273j8686L7974L6283L7168R453
9156I21769m909j2236K0384m596N526k7027L5540L2901k8276m9923j3210R030
9144H84973k0053k7254L022J1880k4492l9853J3804N9263J5779j1272l924k2820
9132H39053K7290K1166j2210K136m4544j5641r358M150J3576J7766q7277k5460
9120G30647Q0021l3756n9400k2892m183K9190O1687K3217j1347j6473k1180J1438
9108G66969o7322l1693N4623J4907J6779k5764m9627j7057k8820L7108J06387
9097G76490M3319k7656n7179o371m0639o9068l5706N0145J2635M1341N8430k001
9085G43740J0405J3342m1392o1805j4982j9236O561M6408M3751j600j2959J4913
$$ y = [847194, 865768, 903041, 869993, 863426, 886095, 881850, 819577, 800891, 838865, 875148, 912316, 921769, 916860, 904624, 925008, 920412, 925938, 898911, 934451, 967352, 939076, 889153, 875943, 884973, 864920, 837666, 840688, 852568, 828076, 788223, 802027, 861290, 877069, 865797, 861873, 839053, 866343, 887509, 875299, 877435, 832891, 817250, 807892, 812042, 825618, 843384, 756107, 730647, 810668, 776912, 717512, 694620, 690437, 719627, 781314, 804531, 793184, 776711, 755531, 766969, 699647, 667954, 722577, 737484, 754263, 728499, 678872, 661815, 632995, 670103, 776490, 819809, 792153, 734974, 728603, 687964, 618896, 583190, 633335, 645970, 687311, 745741, 743740, 754145, 767487, 726095, 664290, 649308, 630072, 636633, 683041, 726792, 725192, 712233, 727146]
9073G27146J9323r004jJ2083j9783j0043n292n8046j8474k9941l3605j05311j2321
9060D56731O2305N1245M6777j8021K5097O169r021k8990j2747J429L870J6045
9048F00889K1678J0427k5325m5882O772m8789L7118K8673n0105k7065l1895L1123
9036E07619Q868o262l0561L7964N7637K3675l2704r6904p2965k8193L1053k0375
9024C78852l452P9528n0009j367j4191L3892l7910j8040o532J2333M0531L1076
9012D44711l6889m2489K2305K6409l9902k3388J7140M4028Q874L7671J4713o1406
9000D11777j03299j5703L8856N5412O643o4173n5330k7566Q177O3724M1380R395
8988C69293k3034K8015k2136j6896K1821M3186j9389m9714J4692l0223l0961l3448
$$ y = [727146, 746469, 737465, 737464, 749547, 729764, 719721, 714429, 656383, 637909, 607968, 574363, 469052, 456731, 519036, 570281, 617058, 599037, 624134, 630303, 621282, 592292, 579545, 580974, 584844, 600889, 622567, 632994, 607669, 561787, 568559, 519770, 556888, 585561, 535456, 508391, 476496, 507619, 516487, 510225, 479664, 517628, 575265, 598940, 566236, 469332, 396367, 368174, 399227, 378852, 375400, 454928, 404919, 403552, 389361, 423253, 385343, 367303, 360771, 373104, 413635, 444711, 407822, 365333, 387638, 414047, 374145, 350757, 367897, 411925, 420799, 458470, 473183, 411777, 308478, 292775, 331631, 387043, 393686, 329513, 274183, 246617, 254794, 318518, 359898, 369293, 346259, 374274, 352138, 335242, 357063, 400249, 380860, 331146, 345838, 315615, 284654, 251206]
8976B51206k0200l5077J559J03512O2455j1718k2771n1730k6322K9397O1171l2311
8964C09171j8916j0390j700O1454M8772j4212j7711N775N927l698l5234o2234
8952B67004l6228m7909M3530L4499l1475L0692K0916O539M181o4431k5310n719
8940A96289J8477j0692K028o723j7050O959L8399O32M841M351k5268k6227L8234
8927B24250m4700q319P8026k127k3982j1055j0666k2860K6152R5341j5888k6025
8915B58147R185L0751J1952m8949k4184L968j6090J2124j2432J0649J7123j1244
8903B41000n8413k8915K0869O2874P957l8862m9476m3489k5897M8927J08303O1644
8891C06522j1793l2036j6997m8142j4575M741J6611k5895R061O1354l1878m3531
$$ y = [251206, 231006, 195929, 197488, 301000, 363455, 351737, 328966, 277236, 250914, 280311, 341482, 309171, 290255, 279865, 278165, 339619, 388391, 374179, 356468, 362243, 368170, 364472, 329238, 267004, 230776, 182867, 226397, 260896, 229421, 260113, 281029, 287568, 291749, 227318, 202008, 196289, 214766, 204074, 206102, 199379, 182329, 189288, 227687, 228319, 233160, 237511, 212243, 186016, 224250, 179550, 171231, 249257, 247130, 223148, 212093, 201427, 178567, 204719, 300060, 284172, 258147, 267332, 298083, 310035, 261086, 236902, 240870, 224780, 236904, 224472, 235121, 252244, 241000, 182587, 153672, 174541, 237415, 245372, 206510, 157034, 113545, 87648, 136575, 244878, 306522, 294729, 262693, 245696, 197554, 182979, 187720, 204331, 178436, 187497, 248851, 216973, 173442]
8879A73442O675O898j6891P038j0663J3623J6576L9927N802M5798k0968p2159
8867A95098K857O3840M230j6472n641j0870o0460j9379M0539J9753p5717j2362
8855A25416L5446J6219k2382k9398J8144L3022P479k1445L7425m5246m0846K4269
8843A38103N1977J9784L439j4825L128j9560l5570N2244P9177m225K867l5235
8831B41304m8807j2177k6741K8631L0390L6955j7919l2750j7993k5792j6181k2392
8819A16528k2998k1593N0060N8418K1981m45l862J3193K1614l4087J4648M6257
8807B59714m6169o9826J6543L7208J5086l3838j6574m0043L1890J318o0464o921
8795H7924J8506Q22N265J480J1281K4845J1627J6613M5802m412o4667k7458K2995
$$ y = [173442, 180117, 187015, 170124, 177162, 166499, 180122, 196698, 236625, 242427, 288225, 267257, 195098, 197955, 261795, 266025, 249553, 243912, 233042, 172582, 153203, 193742, 213495, 137778, 125416, 160862, 177081, 154699, 125301, 143445, 176467, 183946, 162501, 199926, 154680, 113834, 138103, 190080, 209864, 213303, 198478, 201606, 182046, 146476, 198720, 277897, 273672, 276539, 241304, 192497, 180320, 153579, 182210, 212600, 249555, 231636, 198886, 180893, 155101, 138920, 116528, 93530, 71937, 121997, 180415, 202396, 201951, 198089, 211282, 232896, 198809, 213457, 259714, 213545, 143719, 160262, 197470, 212556, 178718, 162144, 122101, 153991, 155309, 94845, 87924, 106430, 107252, 112517, 113997, 125278, 150123, 161750, 178363, 224165, 219753, 155086, 127628, 150623]
8782A50623l1504j6478J6199L1547n126m6259m0630N917J2874m3340k1470j9554
8770g201L6400O9069N7571n9291o4900n3135P2639M6882P710L3399k064R841M2468
8757A89388j420l8507o4060N337K4029L0504j7582J2265O047j8319p5759L5129
8745H7052j2506L6049k0757K4380K4034J2174J2595O928K573K9959q831l9958
8733A53692J7239k4377m3504K4962M0679M8144J5491q516j1816l4625R694M9127
8721B36190K946Q342J2646l26L555m0016l6024K5322K404l0061j8644k5458J5367
8708A56243L1892K2087J2436r17Q087k7851l5087O3757M1257n2707k6887j337
8696A90973k8917J1883K0164J075j4583l9195m6321K5853J0847P349Q448o5833
$$ y = [150623, 119119, 102641, 118840, 150387, 145261, 99002, 58372, 64289, 77163, 33823, 12353, -7201, 29199, 98268, 155839, 96548, 31648, -21487, 51152, 98034, 105744, 139143, 137079, 146920, 189388, 187968, 149461, 85401, 90738, 114767, 145271, 127689, 139954, 146001, 127682, 51923, 87052, 74546, 110595, 89838, 114218, 138252, 150426, 163021, 169949, 172522, 202481, 193650, 153692, 170931, 146554, 103050, 128012, 168691, 216835, 232326, 223810, 211994, 177369, 187063, 236190, 239136, 247478, 260124, 259798, 263353, 223337, 187313, 212635, 215039, 184978, 166334, 140876, 156243, 188135, 210222, 222658, 221741, 229828, 201977, 166890, 230647, 271904, 219197, 192310, 190973, 162056, 173939, 194103, 195178, 180595, 141400, 95079, 120932, 131779, 139128, 147576, 81743]
8684H1743m940M4172K2988L7214M5108O3077L9193J8791k8989l0735k1502m0295
8672B25825m1965M3728j1177k9164o525L477K8387J1939o1899M987L6273L0853
8660B34739j3707k981R85Q731J9914k7862n2066J3364L7181J2369K9595M0478
8648C00740k5492K8411L858j9791L8077K8388N8368L5352l6468J3981J695j9308
8636D07811l0239k7198l5154l4269K8381L9173K0984N1973J2237m9456q652M592
8624C80183K2784K9376M188R546L935P910O1435O0927O833m292k4521O3486P8480
8611G00270L8934R3N4836R0071P0372J05277N2072P7038J14316R7931Q6142J17518
8599A604870J45210J47479J16515J61836J69649R8866Q1034j6840r6091j81359
$$ y = [81743, 76803, 120975, 143963, 181177, 226285, 289362, 328555, 347346, 318357, 287622, 266120, 225825, 183860, 227588, 216411, 187247, 180722, 184199, 212586, 224525, 162626, 167613, 203886, 234739, 221032, 218051, 219036, 227767, 247681, 219819, 167753, 181117, 218298, 230667, 260262, 300740, 275248, 303659, 307517, 287726, 325803, 354191, 412559, 447911, 411443, 425424, 427119, 407811, 377572, 350374, 315220, 280951, 309332, 348505, 369489, 421462, 433699, 384243, 375591, 380183, 402967, 432343, 436531, 446077, 450012, 457922, 519357, 580284, 587117, 582825, 558304, 621790, 700270, 739204, 739297, 794133, 884204, 954576, 1059853, 1111925, 1188963, 1303279, 1401210, 1487352, 1604870, 1750080, 1897559, 2014074, 2175910, 2345559, 2444425, 2525459, 2508619, 2412528, 2231169]
8589B231169j91280j93368k45474k14704j52637j29397j01379j09538q4855j4629
8579G93908l4878j09986k3202l945p9127j20885n8617L9642M3929k1674n5870
8568C69295p271l9725o7297m7208K0132J788j6558N6882K9250k9806L4140K7415
8556C31037m587j8375R393n3512l2474k3222L0515J4323L4542j3157j9772K190
8544B56901P4242r339l1875o1519k9235J6774j2811n5178n6213Q852M0941Q9531
8532B31071R0245J6277n3516n3992l6618k1798p796J3221J3601K6677n7282m0593
8520A19497L1420L212P441J842o9717o7471N1765M4398l1869l70o2288o155R7699
8507A19404M0011K3156l5556j0168m6278m3058K3626O3389P3857Q493k3393k9886
$$ y = [2231169, 2039889, 1846521, 1601047, 1386343, 1233706, 1104309, 1002930, 893392, 808537, 793908, 759030, 649044, 625842, 621897, 542770, 421885, 363268, 402910, 446839, 425165, 369295, 362024, 322299, 255002, 207794, 227926, 229714, 213156, 270038, 299288, 269482, 303622, 331037, 326450, 308075, 317468, 263956, 231482, 208260, 238775, 253098, 287640, 274483, 254711, 256901, 331143, 321804, 289929, 228410, 199175, 215949, 203138, 147960, 91747, 100599, 141540, 231071, 321316, 337593, 284077, 230085, 193467, 171669, 163873, 177094, 190695, 217372, 160090, 119497, 150917, 154129, 161570, 163412, 93695, 26224, 77989, 122387, 90518, 90148, 27860, 21705, 119404, 159415, 182571, 147015, 136847, 90569, 47511, 71137, 134526, 208383, 216876, 193483, 163597]
8495A63597o4147k4313N2149K3152p0604q8385o342O0067N7754L3888j2718o176
8483A17922K7206k5807r5960j1415N9384K1736j1079J0025M9748j101j771m3532
8471I5356l5471M813m484L2777N1079L3748m2589o6559M4357N2059l7264K8568
8459A56390K9383j5650m3038J3756L5801J8936j6623K056k8487j1224K6267J0461
8447A78028L5519L1034L1544L9894P1707J49348J18674J78559J69500R6250O0617
8436A160674k6386l9492j50149j46272j82872o7042n8660p5560k8582k2519l5965
8425C27175k7227k3526L234J8518J8096K9324k0413K0923k5730K377M2562J1939
8413C77252M5216J6883j8071K084j3879q876j5278l1800n7405K022M0587O3405
$$ y = [163597, 99450, 75137, 127286, 150438, 79834, -8551, -14893, 45174, 102928, 136816, 124098, 117922, 145128, 119321, 23361, 11946, 71330, 93066, 81987, 92012, 141760, 140659, 138888, 95356, 59885, 64698, 60214, 92991, 144070, 177818, 135229, 68670, 113027, 165086, 127822, 156390, 185773, 170123, 127085, 140841, 176642, 195578, 178955, 181011, 152524, 141300, 167567, 178028, 213547, 244581, 276125, 316019, 387726, 537074, 655748, 834307, 1003807, 1100057, 1160674, 1134288, 1094796, 944647, 798375, 615503, 548461, 489801, 414241, 385659, 363140, 327175, 299948, 276422, 279656, 298174, 316270, 345594, 325181, 346104, 320374, 322751, 365313, 377252, 422468, 439351, 421280, 423364, 409485, 400609, 385331, 353531, 296126, 298148, 338735, 402140]
8401D02140O2321P7630R5644R5721J61298J18391J22040K5963p3462q9774q5267
8390I12645j32591j77307j10221o6387O293m9415n0009l416O871J0686l0897k8112
8378B88140k8831N8471J9906J8277p048o414k4378L4140l2250l2326n3517n5014
8366A79156j4732K1072J4388R888R709L0619K2659j445j8508n0822O650p7354
8354A31280J9380J6219J8740l7863m100r903j7412J3492j3256j1731o4422l9143
8342A281J4135O0395M2118M2858J6337j670l9533J4093O7K5230l7001o9589o2838
8329E883L4817O6748K9668m1191n0935J8965J4739K5660k0283l1935L8237L7324
8317A27697j1324k6103l1722O944k701L7842N5562K6820m1522o1086n1112j8108
$$ y = [402140, 464461, 542091, 637735, 733456, 894754, 1013145, 1135185, 1161148, 1087686, 997912, 912645, 780054, 602747, 492526, 426139, 432432, 383017, 333008, 329592, 336463, 347149, 316252, 288140, 259309, 317780, 337686, 355963, 348915, 342501, 318123, 352263, 320013, 287687, 234170, 179156, 164424, 185496, 199884, 209772, 219481, 250100, 272759, 271314, 252806, 201984, 208634, 131280, 150660, 166879, 185619, 147756, 143656, 133753, 116341, 129833, 116577, 104846, 40424, 1281, 15416, 75811, 117929, 160787, 177124, 175454, 135921, 150014, 150081, 175311, 138310, 68721, 5883, 40700, 107448, 137116, 95925, 44990, 63955, 78694, 104354, 84071, 52136, 90373, 127697, 116373, 90270, 58548, 65492, 62791, 100633, 156195, 183015, 141493, 80407, 29295, 11187]
8305A1187M415K4885K2734K1927M217j1914J4500m327k1739m0858k8219L7897
8293C4705l42Q027m1432m2754N5978J00053K4565Q10K4682o5695j2267M4656N273
8280A36259q5599n4518j3923K2320o794l2011L8745O7577j1470k2246K9364m0342
8268B7362l3627J1788L862K976m2694Q6458K0303o9095K9167Q430k8493j1135
8256E302M691R301L3698M9213l6464n6939l4451k113N8885L4113m5475l7269r191
8243b6699K4583K1034l9536q728J0804j7003P388P0505K4982n6114k6069l0087
8231d4940j3199J8167O2428j1231j6840l3462K7980n455K8939M4519K3850Q341
8219H9097L2746p1514o3138j7795K169J0985M0544n1147m7370K1653K5256O3281
$$ y = [11187, 15602, 40487, 63221, 85148, 89365, 77451, 91951, 87624, 65885, 25027, -3192, 34705, 34363, 42390, 958, -41796, 14182, 114235, 138800, 139610, 164292, 98597, 86330, 130986, 136259, 50660, -3858, -17781, 4539, -2255, -34266, 4479, 72056, 60586, 38340, 67704, 27362, -6265, 5523, 9385, 12361, -30333, 56125, 76428, 7333, 36500, 44930, 16437, 5302, 9993, 19294, 52992, 102205, 65741, 8802, -25649, -27762, 31123, 65236, 19761, -17508, -26699, -2116, 18918, -20618, -29346, -18542, -35545, -28157, 42348, 67330, 11216, -14853, -44940, -58139, -39972, 22456, 11225, -5615, -39077, -11097, -16552, 12387, 56906, 80756, 89097, 121843, 50329, -12809, -30604, -28435, -17450, 23094, -28053, -75423, -53770, -28514, 34767]
8207C4767L1521m483j7461j4345l7381j9049R400K0256l664l2827m7437k2707
8195a03410k1306K7588O1670O4439M2383k9214q893L564J6951K6521r524M425
8183G5194o3844J5358K6314J4199Q203k4760k0254J8737K4217j343K189l1888
8171D2322j1467N516J3100k9608k9502l0502J5078N38J5691K9814L7166j3197
8159D4949J8074O442k4038k1483L1818J8603q462l4366j2051J4430O6761J43k5352
8146G5468J1123l4549j9771L1839j9938J6199r618m0799J4463O623j8009j7373
8134d342M3533M9335j0013J7437O035K3875l0978o4561q4456J5700N0656m1454
8122b9233l9712J9228N705o985n476n9207j0985R7630J9256m688r915k7817K3596
$$ y = [34767, 66288, 61805, 44344, 29999, -7382, -26431, -17031, 3225, -439, -33266, -80703, -103410, -124716, -97128, -35458, 28981, 71364, 42150, 33257, 36821, 53772, 80293, 70769, 75194, 11350, 26708, 53022, 67221, 75424, 50664, 30410, 49147, 73364, 72021, 74210, 42322, 30855, 36371, 49471, 19863, -9639, -40141, -25063, -24525, -8834, 20980, 58146, 44949, 63023, 69465, 45427, 23944, 55762, 74365, 65903, 31537, 19486, 33916, 100677, 100820, 75468, 86591, 52042, 32271, 64110, 44172, 60371, 50753, 9954, 24417, 31040, 13031, -4342, 39191, 88526, 78513, 95950, 101985, 125860, 94882, 30321, -54135, -38435, 12221, -29233, -68945, -49717, -44012, -50997, -56473, -115680, -126665, -29035, -9779, -14467, -24382, -52199, -28603]
8109b8603R670P982J3938R164l0800m4456k5371L8629K0223L3941K2862K3977
8097E1156M422k6100J6047P103j816j3376L8020N6473L5135j7178j4562P32m1204
8084I4852p8526J7609P250L3677m0245k3752N903J1427j2064K487N9807L0246
8072A08671m1906k7802J5040K2865L5675K9509L219j4353M132k3607j6369j1674
8060H3400j7373K3342j6266j2450K7232p43m2969m04J1654r814M4722O810j467
8047I5674K1094j3260R226M1180j979l1699J4250K2960N891J0463K3811o336l7375
8034A53900m0216L4425J8121k7582k8896J7501M9264n300m6328O614J0869k1378
8022A20994o1944J4507K2821L7816N4765r409l7906n0870R607M9676K0745l3152
$$ y = [-28603, -18933, -10951, 2987, 12151, -18649, -63105, -88476, -49847, -29624, 4317, 27179, 51156, 55578, 29478, 45525, 52628, 50812, 37436, 75456, 131929, 167064, 149886, 135324, 136056, 94852, 16326, 33935, 41185, 74862, 34617, 10865, 16768, 28195, 16131, 18618, 78425, 108671, 66765, 38963, 54003, 76868, 112543, 142052, 145271, 130918, 135050, 111443, 95074, 83400, 66027, 89369, 73103, 60653, 87885, 87142, 44173, 43769, 55423, 45609, 90331, 97141, 95674, 116768, 103508, 112734, 153914, 151935, 120236, 134486, 157446, 163337, 173800, 197611, 191275, 153900, 113684, 148109, 166230, 138648, 109752, 127253, 176517, 171217, 124889, 131503, 142372, 120994, 59050, 73557, 96378, 134194, 188959, 179550, 141644, 90774, 100381, 150057, 170802, 137650]
8010A37650o7265Q738L5453P2813Q6402L4511L5357l6136J4068M09l0769K580
7998B93811m278j9691j8822l1869o5870J8884k0764q576q155J9038M0980n1810
7986A42878k7416p5k6649L3274N3685J6492k1038m4809k4473J2132n6664m6638
7974A0699l3982n398J5317K1713O6460j3862J3501J6127N0037r376K2881N9980
7962B14097l6732o6927l6032P3299J6779K1178k9843k4832j2893J5926K4018r346
7950A48692L3778K5913K323L3064l1547n4144p9743k6236L0449O6322O227m3549
7938A11549o1570j2329K7215n4364o173L3693K6737K2922J728k0507P20Q299O274
7925H4194N474L7192j7938M4430N2617l7132m5427l4260k144k3036m9541n554
$$ y = [137650, 70385, 79123, 114576, 187389, 273791, 308302, 343659, 307523, 321591, 322000, 291231, 293811, 289533, 269842, 251020, 219151, 153281, 172165, 151401, 142825, 134670, 153708, 194688, 142878, 115462, 115387, 88738, 122012, 175697, 192189, 171151, 126342, 101869, 114001, 57337, 10699, -23283, -28681, -13364, 8349, 74809, 60947, 74448, 90575, 140612, 131236, 154117, 214097, 177365, 110438, 74406, 147705, 164484, 185662, 155819, 130987, 118094, 134020, 158038, 148692, 182470, 208383, 210706, 243770, 212223, 158079, 78336, 52100, 82549, 148871, 155098, 111549, 49979, 37650, 64865, 10501, 4328, 38021, 64758, 87680, 89408, 68901, 69621, 77920, 84194, 89668, 126860, 108922, 153352, 205969, 168837, 123410, 89150, 87006, 63970, 14429, 8875]
7913H875L843L3232N8931K2564K6602l9765K7026N574l9718k8216l1979m3754
7901C215J0103O7237O3184p3780j2110o175M152O793J7946o3027j4200L2704K8414
7888F4456M0947j2117n5237l3273O79m2217J6095M1873M6435l0841j7328L3967
7876E3439l9566j2436l5980K5177J9591p529j0986n5928J0086l055L8366J4373
7864d448N19J1031M0786k6893k2381o450m4364O607M4429M5597j8554K1090K1581
7851F8550K2462N392j6699n084l9789j8745P681r387j4070k3921P724m3842j8114
7838g7842l97J6560J8879M6153k3100o1319k7600K823K8574m145M1289J4067j7289
7825d3347j5775j5074l0339r826O8783N6721o2411n2038J9810j5925P4414N8281
$$ y = [8875, 12718, 45950, 104881, 127445, 154047, 114282, 141308, 146882, 107164, 78948, 46969, 3215, 13318, 80555, 143739, 69959, 57849, 51674, 55826, 62619, 80565, 17538, 3338, 36042, 64456, 105403, 93286, 38049, 4776, 5455, -36762, -20667, 21206, 67641, 36800, 19472, 53439, 13873, 1437, -34543, -9366, 10225, 2696, -8290, -64218, -54132, -57187, -18821, -4448, -3929, 7102, 47888, 20995, -1386, -7836, -52200, -45593, -1164, 44433, 25879, 46969, 68550, 91012, 96404, 79705, 74621, 34832, 16087, 23768, 14381, 311, -23610, -15886, -59728, -77842, -78239, -61679, -42800, 3353, -19747, -81066, -108666, -105843, -77269, -81414, -40125, -26058, -43347, -59122, -74196, -104535, -114361, -45578, 11143, -51268, -103306, -83496, -99421, -25007, 33274]
7813C3274l6683L4675J301Q707k5170j8798l1478J5770J6974L5688l5384K936
7801A812L3688k1493n6819o5346L165N4189L1414P9229k8081l3446l0293P421
7789b4560L0196J7148l8642l0882J0465J0105L8396L3689j8683k209l0573M0597
7777C5047K5524j3990n225k665k1112M089k0554l7496K4476N1845R363m1396K883
7764A0789J0106J3886K3386n243k9703J6145l1116k3655l1731K4613l244K620
7752b3147Q1420m991m9833l7096j8662P543K8974J357Q132J508J3003n180l3411
7739c0383o884M5496j6258J6861K7002j0669n9110j7280k699L7805Q684R210q22
7726I53J3544P850n2182o567K736K030p584k5856M0107L6584l222K1117M603R605
$$ y = [33274, -3409, 31266, 32567, 41274, 16104, -2694, -34172, -18402, -1428, 34260, -1124, 1812, 35500, 14007, -42812, -108158, -104993, -50804, -19390, 59839, 31758, -1688, -31981, -24560, 5636, 22784, -15858, -46740, -36275, -26170, 12226, 45915, 27232, 25023, -5550, 35047, 60571, 46581, 41356, 38691, 17579, 21668, 1114, -36382, -11906, 39939, 49302, 7906, 10789, 20895, 34781, 58167, 52924, 23221, 39366, 8250, -15405, -47136, -22523, -25767, -23147, 58273, 53282, 3449, -33647, -52309, -44766, -15792, -14435, -6303, -4795, 8208, 3028, -30383, -37267, 8229, -8029, 8832, 35834, 25165, -33945, -51225, -53924, -16119, -7435, 1775, 953, 14497, 22347, -29835, -36402, -33666, -31636, -39220, -65076, -24969, 11615, 8393, 29510, 34113, 43718]
7712D3718j8453l5943L3776r883m5359J3247L5468k2628j9690l1405j4463L147
7700f8468O8241K3826J9671j05904k6262L9042p390k1158l4101l1587J043M7689
7688i5358R4197J5398j5976l126L1973k9189j9102L949K4672J8645P896J6793
7676E0772o5453j6962L8428o6995q8928N0212R2377o89R113j8055l3810L0115
7664a9875j3891L584L327L108L300J9562j84n1055l1050N1726N3337J5041p1867
7651c4937K6045J8951L6834K1880m5337n7433K9777m2854Q572K9280N6323J2176
7639E9277j7613j6928n3011k2905j6063k2836j5564Q403K9461m856j6336j2295
7627a01266J911O1907M1924K0883k9791q973J1826j2503j0335L1988R502O91M6648
$$ y = [43718, 25265, -10678, 23098, 13215, -32144, -18897, 16571, -6057, -25747, -57152, -71615, -68468, -227, 23599, 43270, -62634, -88896, -49854, -57244, -78402, -112503, -144090, -143047, -95358, -1161, 14237, -1739, -4865, 27108, -2081, -21183, -17234, 7438, 26083, 33979, 50772, -14681, -31643, 6785, -60210, -149138, -98926, -6549, -7238, 1875, -16180, -49990, -19875, -33766, -30182, -26855, -23747, -20447, -885, -1069, -52124, -83174, -31448, 21889, 36930, -34937, -8892, 10059, 46893, 68773, 23436, -33997, -4220, -47074, -38502, -9222, 47101, 59277, 41664, 24736, -28275, -51180, -67243, -90079, -105643, -97240, -67779, -72635, -88971, -101266, -99355, -37448, 4476, 25359, -4432, -13405, -1579, -14082, -24417, 7571, 17073, 17764, 64412]
7614F4412J4395q9525m2516L0145J8681j4852o3347j9530P0199M206j5362M2487
7602f07M508m5278m6008L9665J8134p202L9632n9406J7139N9952p821j7101o044
7589a0437k3680l6618L5216L5676k4026J650M116M5515M3056m8760k4936K6L932
7576G30K9225j6373m274J3107O8606j5116o7883k5690L5796J7901K6158L120J2277
7563G7584j4289P568P785j214j944l6042j082j4586k8847J944o811k0076K6249
7550c761J6294J3277l8976n0300m1574K6001K3648R843q713M8090M8662l4036
7538H455M323K5013J1340j3068j3626J8787j165n2479n7184K2300L919m5985J6903
7525g2467M2671J0865K7211L1433J4792K7488m3263l5530p123R709p2652L396
$$ y = [64412, 78807, -10718, -53234, -23089, -4408, -19260, -82607, -102137, -31938, -27732, -43094, -607, 3901, -41377, -87385, -47720, -29586, -36788, 2844, -56562, -39423, 20529, 12708, -4393, -10437, -34117, -70735, -35519, 157, -23869, -22219, -18103, 27412, 70468, 21708, -3228, -3202, 730, 29955, 13582, 9308, 22415, 91021, 75905, 8022, -17668, 18128, 36029, 62187, 65307, 77584, 63295, 70863, 78648, 77434, 75490, 39448, 38366, 23780, -5067, -3123, -9934, -30010, -3761, 12533, 25810, -13166, -63466, -105040, -79039, -55391, -45548, -54261, -6171, 42491, 8455, 12778, 37791, 49131, 36063, 22437, 41224, 40059, -12420, -69604, -47304, -43385, -89370, -72467, -29796, -18931, 8280, 39713, 54505, 81993, 38730, 3200, -3923, 5786, -66866, -63470]
7513f3470K690q849k6029K3142J3488O0334N0787P897j7727M745M052j3264k5728
7500A2068l2609l8003k1486k2508j2980N0760M8429L9666N4662n980j0774K177
7488F3422k0606m9344j8701j4005l416k5823k4646J7440K0065K597N8420L0010
7476C5413M0734Q186o0419J7399m3992l8852O2718Q150m0188j2049L7438L5050
7464D9588O960j8394r280M951L3238m0665r027l4773l1357j651L2412L8248J5758
7451C6008n0587p3555j5696k0552M2267J3786m6776N9795J4856n685P311O1400
7439B2572L2998J573R964n5861j3299j2631m0444p256M768L5094K0661l6202n3858
7426i1921k4245M4708M3937q9640o475L7469L6427L462J798J1295N3537j2049
$$ y = [-63470, -60780, -69629, -95658, -72516, -59028, 1306, 52093, 59990, 42263, 47008, 51060, 37796, 12068, -20541, -58544, -80030, -102538, -115518, -64758, -16329, 23337, 77999, 72019, 61245, 63422, 42816, -6528, -25229, -39234, -42650, -68473, -93119, -75679, -55614, -53017, 5403, 35413, 76147, 84333, 23914, 41313, -2679, -41531, 21187, 29337, -10851, -22900, 14538, 49588, 56548, 38154, 28874, 33825, 67063, 26398, 17371, -17402, -48759, -50410, -17998, 20250, 36008, -14579, -88134, -103830, -124382, -82115, -68329, -115105, -55310, -40454, -46139, -38828, 22572, 55570, 57143, 67107, 11246, -2053, -14684, -55128, -62384, -57616, -22522, -1861, -38063, -91921, -116166, -71458, -27521, -117161, -123636, -86167, -49740, -46278, -44480, -33185, 20352, 8303]
7414H303l4284m5650k3329M1312k8494L0209O4567K8950K6495k4161j00849k5141
7402h2072N8024K0510n0111o3286l2550O6959J24028M0767l712L860m0571q569
7390C3277L8725R477k2116k2659k420j332J0040l2030k8240m0878q723N9204L2850
7377B5175k7939m6588K2209p595o393j1673k5083m0448M6279P2444Q33J128k3818
7364b1469m0443R676K4179l5530L580M2647l1632L1458L876j8535j5582k7920
7352g5695J5531J4215J0698P153l8753j8279J3432P6710M4544l6683o094L3751
7340D0530Q971j738l6617n9027L3149J5877l2889L7472Q917k9520j6481J8898
7328a2458l5136L2910L0312p024K247L6519J1847o398r362J6681m2375J1725m5642
$$ y = [8303, -25981, -71631, -94960, -53648, -82142, -51933, 12634, 41584, 68079, 43918, -56931, -82072, -24048, -3538, -53649, -116935, -149485, -82526, 41502, 82269, 78557, 82417, 41846, 33277, 72002, 81479, 59363, 36704, 34284, 32952, 42992, 10962, -17278, -58156, -66879, -7675, 25175, -2764, -49352, -27143, -34738, -41131, -52804, -77887, -118335, -72056, 388, 1221, 2349, -21469, -61912, -52236, -28057, -63587, -60007, -17360, -48992, -17534, -13658, -32193, -47775, -75695, -60164, -45949, -35251, -28098, -66851, -85130, -71698, 5012, 49556, 12873, 6779, 40530, 49501, 47763, 11146, -47881, -14732, 1145, -31744, 5728, 14645, -14875, -31356, -12458, -47594, -14684, 15628, 8604, 10851, 47370, 59217, 52819, 43457, 60138, 17763, 29488, -16154]
7315a6154k1347K0088J4672K9647K9681M2754P383l8345m1509n012L2666J1180
7303F5704p9880m6839k9691K3033K5334K972j6348l4351M860l4539L0016N3976
7291c5753j9716j8912k534P466N1518L0869j1040P859L3806l3221l7960n184L1165
7278a637k2633M4361M4516l1599m5051k4941m0602J1610L0560K2418K313j6556
7266b7241k7776l4405K3678J7613k8115k7545K5931L1594J3780J0774M3870k607
7254A9551m4883m8776K1932L537j7084O565L56K034k2001j3408O9002P6692n4902
7241a385n1475o8357K1543O7712L1974k5739l3289N515j0602n8115q331M5066
7229h5483j2598J0279K5681L5914K8194O949K095l4203J9152l0695k4748J8180
$$ y = [-16154, -37501, -17413, -2741, 26906, 56587, 99341, 106724, 68379, 26870, 21858, 54524, 65704, -14176, -61015, -90706, -67673, -42339, -39367, -55715, -90066, -85206, -119745, -89729, -35753, -55469, -74381, -76915, -69449, -17931, 12938, 1898, 9757, 43563, 10342, -27618, -32802, -1637, -24270, 20091, 64607, 33008, -12043, -36984, -77586, -65976, -35416, -12998, -10685, -27241, -55017, -89422, -65744, -48131, -76246, -103791, -77860, -46266, -32486, -21712, 22158, 19551, -25332, -74108, -52176, -48639, -65723, -59158, -58802, -56768, -78769, -92177, -23175, 53517, -1385, -52860, -121217, -99674, -31962, 12, -25727, -59016, -53501, -64103, -122218, -130549, -85483, -98081, -87802, -62121, -26207, 1987, 8936, 11031, -23172, -4020, -34715, -59463, -41283]
7217d1283K4470l2424J6083m706k3704J18O395K4305J1743k369m1666k3146L5138
7204e1046M5486J1534k3244k0801j9156j1117n9754j4770L8983k9463k6967o246
7192a66561K2078M4026M5104M5347l41l9299K4643M9546L2895k2451k2079r37
7180A1971o357K0825j193l8929m2583J5996j5624Q879m061j8879k4270L3324k1378
7167h2279j0054M6199J7846J6279O639N352M468k559K4936K6877k3527o2244o8525
7154a00592J6533P1805P5549j6917p1884j4881J310l0834j0857n813O4817K0047
7142a717l5795l8053l4068p702L9957l6194K2058L9434O4176k1540n9938k6541
7130i5923L0760R581j6018r081R5868R477j1699L3470j1109n562J7268j7125n7495
$$ y = [-41283, -16813, -49237, -33154, -37860, -61564, -61446, -55051, -30746, -19003, -21372, -63038, -86184, -51046, -5560, 5974, -17270, -38071, -57227, -68344, -128098, -142868, -103885, -133348, -160315, -166561, -144483, -100457, -55353, -10006, -10347, -49646, -25003, 24543, 57438, 34987, 12908, 11971, 5614, 26439, 25246, -13683, -56266, -40270, -55894, -47015, -51076, -69955, -94225, -60901, -82279, -92333, -46134, -28288, -12009, -5370, -18, 4450, 1891, 26827, 53704, 30177, -32067, -100592, -84059, -12254, 63295, 46378, -25506, -40387, -39077, -69911, -80768, -86581, -21764, -1717, -37512, -75565, -109633, -117335, -77378, -113572, -91514, -52080, 12096, -9444, -69382, -95923, -65163, -55582, -71600, -80681, 15187, 24664, 12965, 46435, 35326, 29764, 47032, 29907, -27588]
7117b7588o8325N2721M3040J7563k4754P931l3998o9991j646J8747M7501k200
7105d0999K6927J4632J8013L1223l5548j14585k3896M8787J9811M7848L21N677
7093a789R585m8446N83M766k9824o8182L5013P4934m25l495J9024o141j591M5185
7079B9197k7138Q372M7382j5446p8805l7199K7372P0332K3506r614L7343k8209
7067D7093p1418j9498K6873P078k5251J3189K1541J499m2592j3924j09M2375l1313
7054d4457J4312k5176m9740m972J7222Q5271J4068l5794O5542L5950J4505m5390
$$ y = [-27588, -95913, -43192, -152, 17411, -7343, 588, -33410, -103401, -105047, -86300, -38799, -40999, -14072, 560, 18573, 49796, 14248, -100337, -124233, -75446, -55635, -7787, -7466, -1789, 7796, -40650, -40067, -35301, -65125, -133307, -98294, -23360, -23785, -27280, -8256, -14397, -15988, 29197, 2059, 10431, 57813, 42367, -36438, -73637, -46265, 24067, 47573, 37959, 75302, 47093, -24325, -43823, -16950, -9872, -35123, -21934, -393, 1106, -41486, -55410, -55519, -13144, -44457, -30145, -55321, -105061, -110033, -92811, -7540, 6528, -29266, 36276, 72226, 86731, 41341]
$$ [...]
##END NTUPLES=NMR SPECTRUM
##END=
