##TITLE=Analysis number 323725
Compound Code cc 20302
Book Reference 451/175
Project Code adrs
Chemist Name evam
##JCAMPDX= 6.0         $$ Bruker NMR JCAMP-DX V2.0
##DATA TYPE= NMR SPECTRUM
##DATA CLASS= NTUPLES
##ORIGIN= Bruker BioSpin GmbH
##OWNER= nmr
$$ XWIN-NMR		Version 3.5
$$ Fri Nov  3 16:13:11 2006 GMT Standard Time (UT+0h)  MAYBRIDGE\nmr@NMR_250MHZ
##.OBSERVE FREQUENCY= 250.131544655141
##.OBSERVE NUCLEUS= ^1H
##.ACQUISITION MODE= SIMULTANEOUS (DQD)
##.ACQUISITION SCHEME= undefined
##.AVERAGES= 16
##.DIGITISER RES= 18
##SPECTROMETER/DATA SYSTEM= dpx250
##.PULSE SEQUENCE= zg30
##.SOLVENT NAME= CDCl3
##.SHIFT REFERENCE= (INTERNAL, CDCl3, 0, 16.522)
##AUDIT TRAIL= $$ (NUMBER, WHEN, WHO, WHERE, WHAT)
$$ ##TITLE= Audit trail, XWIN-NMR		Version 3.5
$$ ##JCAMPDX= 5.01
$$ ##ORIGIN= Bruker BioSpin GmbH
$$ ##OWNER= nmr
$$ C:\u/data/dgb/nmr/ADRS/2240/pdata/1/auditp.txt
$$ ##AUDIT TRAIL=  $$ (NUMBER, WHEN, WHO, WHERE, WHAT)
(   1,<2006-11-03 16:12:46.75 +000>,<MAYBRIDGE\nmr>,<NMR_250MHZ>,
      <created by zg, POWCHK disabled, PULCHK disabled
       configuration hash MD5:
       49 4B E0 1D 92 C2 6B 37 9F E6 65 BC 52 41 86 1D
       data hash MD5: 64K
       DB 48 13 73 92 6A CB E6 14 13 ED 5C D8 DA 0F B9>)
(   2,<2006-11-03 16:13:01.09 +000>,<MAYBRIDGE\nmr>,<NMR_250MHZ>,
      <Start of raw data processing
       ef LB = 0.3 FT_mod = 6 PKNL = 1 SI = 32K 
       data hash MD5: 32K
       06 57 26 D4 C8 73 E8 BC C9 16 A3 61 F8 FB BF F6>)
(   3,<2006-11-03 16:13:02.72 +000>,<MAYBRIDGE\nmr>,<NMR_250MHZ>,
      <apk 
       data hash MD5: 32K
       B5 FF DB 5B F2 F2 29 14 A1 18 CE 4B 69 F3 83 ED>)
(   4,<2006-11-03 16:13:03.43 +000>,<MAYBRIDGE\nmr>,<NMR_250MHZ>,
      <abs ABSG = 5 
       data hash MD5: 32K
       DA E8 43 17 A8 FA 5C B2 BE 80 6F 73 AA D5 26 32>)
$$ ##END=
$$ 
$$ hash MD5
$$ AE B4 DF 12 11 2F 23 D4 BD D7 77 F1 FE 8A 12 75
##$RELAX= 
##$RELAX= 
##$RELAX= 
##$RELAX= 
##$RELAX= 
##$RELAX= 
##$RELAX= 
$$ Bruker specific parameters
$$ --------------------------
##$DU= <C:\u>
##$EXPNO= 2240
##$NAME= <ADRS>
##$PROCNO= 1
##$TYPE= <nmr>
##$USER= <dgb>
##$AMP= (0..31)
100 100 100 100 100 100 100 100 100 100 100 100 100 100 100 100 100 100 
100 100 100 100 100 100 100 100 100 100 100 100 100 100 
##$AQSEQ= 0
##$AQ_mod= 3
##$AUNM= <au_zg>
##$AUTOPOS= <40 >
##$BF1= 250.13
##$BF2= 250.13
##$BF3= 250.13
##$BF4= 250.13
##$BF5= 500.13
##$BF6= 500.13
##$BF7= 500.13
##$BF8= 500.13
##$BYTORDA= 1
##$CFDGTYP= 0
##$CFRGTYP= 5
##$CHEMSTR= <none>
##$CNST= (0..31)
1 1 145 1 1 1 1 1 1 1 1 1 1 1 1 1 1 1 1 1 1 1 1 1 1 1 1 1 1 1 1 1 
##$CPDPRG= <>
##$CPDPRG1= <>
##$CPDPRG2= <>
##$CPDPRG3= <>
##$CPDPRG4= <mlev>
##$CPDPRG5= <mlev>
##$CPDPRG6= <mlev>
##$CPDPRG7= <mlev>
##$CPDPRG8= <mlev>
##$CPDPRGB= <>
##$CPDPRGT= <>
##$D= (0..31)
0 1 0 0 0 0 0 0 0 0.06 0 0 0 0 0 0 0.0002 0 0 0 0 0 0 0 0 0 0 0 0 0 0 
0 
##$DATE= 1162570365
##$DBL= (0..7)
120 120 120 120 120 120 120 120 
##$DBP= (0..7)
150 150 150 150 150 150 150 150 
##$DBP07= 0
##$DBPNAM0= <>
##$DBPNAM1= <>
$$ [...]
##$SUBNAM7= <"">
##$SUBNAM8= <"">
##$SUBNAM9= <"">
##$SW= 20.6930455092707
##$SWIBOX= (0..15)
0 0 3 0 0 0 0 0 0 0 0 0 0 0 0 0 
##$SW_h= 5175.983436853
##$TD= 65536
##$TD0= 1
##$TE= 683.16
##$TE2= 300
##$TE3= 300
##$TEG= 300
##$TL= (0..7)
0 120 120 120 120 120 120 120 
##$TP= (0..7)
150 150 150 150 150 150 150 150 
##$TP07= 0
##$TPNAME0= <>
##$TPNAME1= <>
##$TPNAME2= <>
##$TPNAME3= <>
##$TPNAME4= <>
##$TPNAME5= <>
##$TPNAME6= <>
##$TPNAME7= <>
##$TPOAL= (0..7)
0.5 0.5 0.5 0.5 0.5 0.5 0.5 0.5 
##$TPOFFS= (0..7)
0 0 0 0 0 0 0 0 
##$TUNHIN= 0
##$TUNHOUT= 0
##$TUNXOUT= 0
##$USERA1= <user>
##$USERA2= <user>
##$USERA3= <user>
##$USERA4= <user>
##$USERA5= <user>
##$V9= 5
##$VALIST= <valist>
##$VCLIST= <CCCCCCCCCCCCCCC>
##$VD= 0
##$VDLIST= <DDDDDDDDDDDDDDD>
##$VPLIST= <PPPPPPPPPPPPPPP>
##$VTLIST= <TTTTTTTTTTTTTTT>
##$WBST= 1024
##$WBSW= 4
##$XGAIN= (0..3)
0 0 0 0 
##$XL= 0
##$YL= 0
##$YMAX_a= 581248
##$YMIN_a= -509180
##$ZGOPTNS= <>
##$ZL1= 120
##$ZL2= 120
##$ZL3= 120
##$ZL4= 120
##$ABSF1= 16.522
##$ABSF2= -4.171173
##$ABSG= 5
##$ABSL= 3
##$ALPHA= 0
##$AQORDER= 0
##$ASSFAC= 0
##$ASSFACI= 0
##$ASSFACX= 0
##$ASSWID= 0
##$AUNMP= <proc_1d>
##$AZFE= 0.1
##$AZFW= 0.1
##$BCFW= 0
##$BC_mod= 0
##$BYTORDP= 0
##$COROFFS= 0
##$CY= 12.5
##$DATMOD= 1
##$DC= 0
##$DFILT= <>
##$DTYPP= 0
##$F1P= 14.0000005364418
##$F2P= -0.99999901652339
##$FCOR= 0.5
##$FTSIZE= 32768
##$FT_mod= 6
##$GAMMA= 0
##$GB= 0
##$INTBC= 1
##$INTSCL= 1
##$ISEN= 128
##$LB= 0.3
##$LEV0= 0
##$LPBIN= 0
##$MAXI= 10000
##$MC2= 0
##$MEAN= 0
##$ME_mod= 0
##$MI= 0
##$NCOEF= 0
##$NC_proc= -2
##$NLEV= 6
##$NOISF1= 0
##$NOISF2= 0
##$NSP= 0
##$NTH_PI= 0
##$NZP= 0
##$OFFSET= 16.522
##$PC= 1
##$PHC0= -36.5029
##$PHC1= 3.986009
##$PH_mod= 1
##$PKNL= yes
##$PPARMOD= 0
##$PSCAL= 4
##$PSIGN= 0
##$REVERSE= no
##$SF= 250.13
##$SI= 32768
##$SIGF1= 0
##$SIGF2= 0
##$SINO= 400
##$SIOLD= 32768
##$SREGLST= <1H.CDCl3>
##$SSB= 0
##$STSI= 32768
##$STSR= 0
##$SW_p= 5175.98343685301
##$SYMM= 0
##$S_DEV= 0
##$TDeff= 65536
##$TDoff= 0
##$TI= <Analysis number 999999
Compound Code 99
Book Reference 9
Project Code 9>
##$TILT= no
##$TM1= 0
##$TM2= 0
##$TOPLEV= 0
##$USERP1= <user>
##$USERP2= <user>
##$USERP3= <user>
##$USERP4= <user>
##$USERP5= <user>
##$WDW= 1
##$XDIM= 32768
##$YMAX_p= 304241434
##$YMIN_p= -74264
$$ End of Bruker specific parameters
$$ ---------------------------------
##NTUPLES= NMR SPECTRUM
##VAR_NAME=  FREQUENCY,     SPECTRUM/REAL,   SPECTRUM/IMAG
##SYMBOL=    X,             R,               I
##VAR_TYPE=  INDEPENDENT,   DEPENDENT,       DEPENDENT
##VAR_FORM=  AFFN,          ASDF,            ASDF
##VAR_DIM=   32768,         32768,           32768
##UNITS=     HZ,            ARBITRARY UNITS, ARBITRARY UNITS
##FACTOR=    0.157963299565203, 1,           1
##FIRST=     4132.6476996994, 0,             0
##LAST=      -1043.33573715361, 0,           0
##MIN=       -1043.33573715361, -74264,      0
##MAX=       4132.6476996994, 304241434,     0
$$ Real data points
##PAGE= N=1
##DATA TABLE= (X++(R..R)), XYDATA
$$ [...]
$$ plain form
16939 -20319 -23535 -21380 -21112 -24919 -13969 891 1894 4500 17045 24476 27959 25958 7732 -1549
16925 -1549 -9987 -5847 5695 -725 -1289 -13082 -15225 -12945 -5808 -24191 -22558 -11658 -5743 8136
16911 8136 -3 -8127 -17102 -10722 1900 11729 -3025 -26893 -24241 -1046 1848 -21718 -32680
16898 -32680 -26649 -23392 -25336 -17747 -6023 -17813 -24484 -32936 -27328 -6002 5853 -18159 -34631
16885 -34631 -23780 -29192 -31124 -15046 -15659 -34079 -29877 -15623 -14727 -12709 -35287 -33152 -29006 -17513
16871 -17513 2789 13952 15305 20180 15146 17676 -8923 -13162 -14195 9167 12669 -7571 -5244
16858 -5244 7119 9790 10100 6109 -12908 -10316 -13813 -26452 -13461 -15667 -6424 19488 6318
16845 6318 -10741 -3914 446 -2022 -10161 -16574 -2147 7203 -6859 -2820 4567 -13875 3152
$$ packed form
16939b0319l216K155K68l807J0950J4860J003K606J2545P431L483k001j8226r281
16925a549q438M140J1542o420n64j1793k143K280P137j8383J633J0900N915J3879
16911H136q139q124q975O380J2622R829j4754k3868K652K3195K894k3566j0962
16898c2680O031L257j944P589J1724j1790o671q452N608K1326J1855k4012j6472
16885c4631J0851n412j932J6078o13j8420M202J4254Q96K018k2578K135M146J1493
16871a7513K0302J1163J353M875n034K530k6599m239j033K3362L502k0240K327
16858e244J2363K671L10l991j9017K592l497j2639J2991k206R243K5912j3170
16845F318j7059O827M360k468q139o413J4427R350j4062M039P387j8442J7027
$$ plain form
16832 3152 46401 67843 63070 35899 931 -17412 -28586 -17176 -7540 2258 -6390 -12111 -26172
16819 -26172 -33964 -26011 -24087 -17453 -12940 -19727 -22125 -21351 -5073 9311 23661 26540 6992 11617
16805 11617 2938 5711 -7080 -36690 -54129 -48011 -46802 -40927 -31248 -29857 -24410 -38846 -46200
16792 -46200 -15802 7514 -54 -4203 8478 1834 3972 21708 16307 34833 46756 20251 13390
16779 13390 8845 31702 37284 22043 29177 19117 1157 -10874 -4948 -3049 -4482 -4002 5910
16766 5910 13344 39835 55758 44277 18012 7603 19320 20882 28648 46876 38754 17782 21660
16753 21660 57 -18097 -15346 12318 21719 23154 17493 27169 25665 7957 11036 27821 37799
16740 37799 26793 29726 10272 174 3474 2421 8647 -2394 -8568 -2831 -886 -5723 -306
$$ packed form
16832C152M3249K1442m773k7171l4968j8343j1174J1410R636R798q648n721j4061
16819b6172p792P953J924O634M513o787k398P74J6278J4384J4350K879j9548M625
16805A1617q679K773j2791k9610j7439O118J209N875R679J391N447j4436p354
16792d6200L0398K3316p568m149J2681o644K138J7736n401J8526J1923k6505o861
16779A3390m545K2857N582j5241P134j0060j7960j2031N926J899j433M80R912
16766E910P434K6491J5923j1481k6265j0409J1717J562P766J8228q122k0972L878
16753B1660k1603j8154K751K7664R401J435n661R676j504j7708L079J6785R978
16740C7799j1006K933j9454j0098L300j053O226j1041o174N737J945m837N417
$$ plain form
16727 -306 3577 2038 -1244 -1090 1601 11297 20833 16315 17554 9893 -12725 -12996 -16023 842 35355
16712 35355 31653 46566 34331 10045 8906 -5211 -27628 -34049 -17039 16731 17012 2472 -12368
16699 -12368 -10112 5958 7538 24175 10742 -20144 -36764 -33772 -24115 -7495 -7567 10330 21320
16686 21320 13492 11891 3131 -7052 2562 5023 3883 3648 -4757 -6321 -6198 -16135 -1907 14965
16672 14965 23926 23910 26922 25999 8504 635 -11722 -18737 -35828 -42948 -46129 -33889 -20478 -14468
16658 -14468 -14215 -10137 -7795 -3113 -8138 -3860 7805 -6856 -27215 -17043 9247 12560 -3274
16645 -3274 -11655 -22713 -17080 -21190 -28385 -20116 -10940 -21567 -28802 -43770 -72318 -47324 -36516
16632 -36516 -21142 3566 -21810 -30615 -27298 -26522 -14045 1064 4265 -5973 -16181 -26670 -28609
$$ packed form
16727c06L883j539l282J54K691R696R536m518J239p661k2618k71l027J6865L4513
16712C5355l702J4913j2235k4286j139j4117k2417o421J7010L3770K81j4540j4840
16699a2368K256J6070J580J6637j3433l0886j6620K992R657J6620p2J7897J0990
16686B1320p828j601q760j0183R614K461j140k35q405j564J23r937J4228J6872
16672A4965Q961j6L012r23j7495p869j2357p015j7091p120l181J2240J3411O010
16658a4468K53M078K342M682n025M278J1665j4661k0359J0172K6290L313j5834
16645c274q381j1058N633m110p195Q269R176j0627p235j4968k8548K4994J0808
16632c6516J5374K4708k5376q805L317P76J2477J5109L201j0238j0208j0489j939
$$ plain form
16619 -28609 -19090 -13697 -17953 -22049 -23348 -21110 -7195 500 -1108 15650 21859 27475 23247 18117
16605 18117 1578 -5279 173 6365 12863 11797 -25068 -43115 -27788 720 5337 25837 34174
16592 34174 15760 2566 -9828 -1229 8800 -14037 -10058 -13502 -11571 -13934 -22670 -9926 22652
16579 22652 29620 25166 20991 16929 -9707 -18861 -33616 -42264 -31662 -14 16522 5331 2092
16566 2092 7513 3484 5570 8514 10101 10593 6453 -3287 -26028 -26114 -7737 16760 6006 -14876
16552 -14876 -24116 -18947 -11208 -10616 -16167 -13709 -24976 -20102 6656 -4680 -19472 -14414 6643
16539 6643 9136 1184 -14425 -38114 -45410 -34975 -18264 -7943 -8091 -12854 11008 19510 4494
16526 4494 -1043 10287 19627 -700 -7425 8020 -5054 -13292 -12959 5906 8883 -10069 7029
$$ packed form
16619b8609R519N393m256m096j299K238J3915P695j608J6758O209N616m228n130
16605A8117j6539o857N452O192O498j066l6865j8047J5327K8508M617K0500Q337
16592C4174j8414j3194j2394Q599J0029k2837L979l444J931k363q736J2744L2578
16579B2652O968m454m175m062k6636r154j4755q648J0602L1648J6536j1191l239
16566B092N421m029K086K944J587M92m140r740k2741q6J8377K4497j0754k0882
16552a4876r240N169P739N92n551K458j1267M874K6758j1336j4792N058K1057
16539F643K493p952j5609k3689p296J0435J6711J0321j48m763K3862Q502j5016
16526D494n537J1330R340k0327o725J5445j3074q238L33J8865K977j8952J7098
$$ plain form
16513 7029 14233 16459 25452 12353 -15866 -36153 -27169 -19381 -11453 -16697 -10469 -17535 3090 21140
16499 21140 29070 34126 22474 31444 32613 20120 9326 9801 -1079 4688 -737 -14330 -20003
16486 -20003 -13041 -14985 -4245 13127 20388 12279 42831 42483 39508 45144 29347 10106 -1463
16473 -1463 -6665 74 27487 25985 12379 9166 -8133 3202 28996 34686 32053 37825 46253
16460 46253 38695 7214 -16976 136 -4364 3788 8841 17747 17844 13808 15791 7919 23471 38126
16446 38126 32331 30832 21162 7789 4161 14423 13664 5433 -21807 -35760 -24458 -21492 -14846
16433 -14846 5789 11640 -5802 -25761 -28896 -15572 -1497 26610 29550 -5237 -11330 -17103 -3426
16420 -3426 -13 -4110 -9235 -15438 -19690 -39474 -26951 -30500 -28800 -24189 -31991 -34121 -22861 -5555
$$ packed form
16513G029P204K226Q993j3099k8219k0287Q984P788P928n244O228p066K0625J8050
16499B1140P930N056j1652Q970J169j2493j0794M75j0880N767n425j3593n673
16486b0003O962j944J0740J7372P261q109L0552l48k975N636j5797j9241j1569
16473a463n202O739K7413j502j3606l213j7299J1335K5794N690k633N772Q428
16460D6253p558l1481k4190J7112m500Q152N053Q906R7m036J983p872J5552J4655
16446C8126n795j499r670j3373l628J0262p59q231k7240j3953J1302K966O646
16433a4846K0635N851j7442j9959l135J3324J4075K8107K940l4787o093n773J3677
16420c426L413m097n125o203m252j9784J2523l549J700M611p802k130J1260J7306
$$ plain form
16406 -5555 -5867 -1966 8412 20511 -6278 -5972 -8029 -28140 -25665 -23049 -27778 -46610 -22525 -11445
16392 -11445 -10232 -16204 -16908 -8805 -10628 -8755 1183 14012 19947 16502 11012 6151 5603 14193 20430
16377 20430 20527 10531 -5187 132 4966 10722 2141 -7744 -12134 -14197 -26915 -27730 -29488 -18668
16363 -18668 -12836 11097 7173 7773 7278 -21496 -27500 -31262 -29760 -22120 -44569 -32624 -17607 -21774
16349 -21774 -30641 -30901 -24585 -23392 -482 10726 308 -10175 -26280 -27487 -39537 -35939 -28222
16336 -28222 -34912 -31223 -15162 -725 6269 -21289 -45205 -29920 -23707 -23131 6819 40758 31431
16323 31431 4740 1508 -5908 -7587 -22031 -30062 -14965 282 -18328 5802 14003 10674 2569
16310 2569 2754 -19200 -17683 -5664 7761 -10638 -8246 1664 7589 1884 -11307 -30389 -36329
$$ packed form
16406e555l12L901J0378J2099k6789L06k057k0111K475K616m729j8832K4085J1080
16392a1445J213n972p04Q103j823J873R938J2829N935l445n490m861n48Q590O237
16377B0430R7r996j5718N319M834N756q581r885m390k063j2718q15j758J0820
16363a8668N832K3933l924O00m95k8774o004l762J502P640k2449J1945J5017m167
16349b1774q867k60O316J193K2910J1208j0418j0483j6105j207j2050L598P717
16336b8222o690L689J6061J4437O994k7558k3916J5285O213N76K9950L3939r327
16323C1431k6691l232p416j679j4444q031J5097J5247j8610K4130Q201l329q105
16310B569J85k1954J517J2019J3425j8399K392R910N925n705j3191j9082n940
$$ plain form
16297 -36329 -38141 -29387 -8438 -5856 -168 22644 26708 17032 5582 -7452 -733 8130 -4005
16284 -4005 -12977 -2975 -5407 -17243 -3434 -25241 -45893 -53208 -52293 -25630 -6669 -5846 1905
16271 1905 16128 25419 22608 16455 11503 -24020 -37481 -15072 1257 15528 11958 7028 5332
16258 5332 -7180 -18050 15209 31585 14634 1710 -9997 -27504 -46735 -54455 -45730 -35329
16246 -35329 -29231 -35087 -34044 -33321 -19166 -19034 -16894 -6034 878 -3599 -7518 -11174 -3102 2221
16232 2221 -16667 -8306 15950 12520 -3445 -33063 -55653 -33785 -10288 -503 -5791 -12924 -15839
16219 -15839 -8312 2453 -7633 -18280 -5540 -16950 -24127 -2747 -16632 -5656 -8379 -13936
16207 -13936 2515 17543 41579 42238 15930 9813 18260 3991 -4441 -7778 -23014 -17005 -15242
$$ packed form
16297c6329j812Q754K0949K582N688K2812M064r676j1450j3034O719Q863j2135
16284d005q972J0002k432j1836J3809k1807k0652p315R15K6663J8961Q23P751
16271A905J4223R291k811o153m952l5523j3461K2409J6329J4271l570m930j696
16258E332j2512j0870L3259J6376j6951j2924j1707j7507j9231p720Q725J0401
16246c5329O098n856J043P23J4155J32K140J0860O912m477l919l656Q072N323
16232B221j8888Q361K4256l430j5965k9618k2590K1868K3497R785n288p133k915
16219a5839P527J0765j0086j0647J2740j1410p177K1380j3885J0976k723n557
16207a3936J6451J5028K4036O59k6308o117Q447j4269q432l337j5236O009J763
$$ plain form
16194 -15242 -34411 -12641 -429 -9861 2122 25557 34172 29191 39648 33702 44907 44018 24348
16181 24348 222 -8071 9229 19576 17471 18315 22520 23027 24425 16195 -6060 -3518 5056 -5264
16167 -5264 -14318 -1356 14839 11069 21788 16135 7244 3727 6404 -9428 -27601 -36786 -61729
16154 -61729 -35261 -3527 8863 -7556 -29619 -25411 -19140 143 -7601 -2971 -7416 -3404 8299
16141 8299 -3950 -15981 -19505 -14175 -670 -10690 -15902 -11968 3503 33496 26197 4116 -7293
16128 -7293 -11029 -6475 -1719 -3951 -12605 -24614 -27429 -12750 -8256 -2893 -8073 -19305 -39076 -35113
16114 -35113 -23493 581 -7030 -5759 2342 5982 17933 32972 38583 19582 5470 22080 20715
16101 20715 16990 15579 -1447 -7328 -19039 -22580 -4017 15486 6188 928 18767 43502 32963
$$ packed form
16194a5242j9169K1770J2212r432J1983K3435Q615m981J0457n946J1205q89j9670
16181B4348k4126q293J7300J0347k105Q44M205N07J398q230k2255K542Q574j0320
16167e264r054J2962J6195l770J0719n653q891l517K677j5832j8173r185k4943
16154f1729K6468L1734J2390j6419k2063M208O271J9283p744M630m445M012J1703
16141H299j2249j2031l524N330J3505j0020n212L934J5471K9993p299k2081j1409
16128g293l736M554M756k232q654j2009k815J4679M494N363n180j1232j9771L963
16114c5113J1620K4074p611J271Q101L640J1951J5039N611j9001j4112J6610j365
16101B0715l725j411j7026n881j1711l541J8563J9503r298n260J7839K4735j0539
$$ plain form
16088 32963 8653 -14955 -17346 -22864 -11706 -14745 -11546 12819 -2246 -9781 -10082 -11595 -4648
16075 -4648 -6176 5 -8072 -13779 -16254 -26283 -31239 -15246 -8526 552 -5819 -35810 -69584 -61971
16061 -61971 -38547 -34871 -23144 5153 -834 -11408 -13766 -28936 -32181 -28141 -38285 -19346 -1584
16048 -1584 1801 13863 14440 6494 13572 6552 -8213 -1943 5906 21430 23754 31991 12434 -15744
16034 -15744 -5366 13495 13791 3722 -3431 782 22665 33993 20620 -17873 -38170 -31943 2632
16021 2632 5977 13231 4031 12327 25231 29280 46020 26951 9716 19336 13311 -14772 -17508
16008 -17508 -23946 -11425 -17182 -20132 -15905 -8381 -4716 -2992 -5023 -28430 -36541 -15218 -3388
15995 -3388 16459 6951 16661 25341 17743 -15333 -23464 -7152 21270 13958 -23116 -24458 -10221
$$ packed form
16088C2963k4310k3608k391n518J1158l039L199K4365j5065p535l01j513O947
16075d648j528O181q077n707k475j0029m956J5993O720R078o371k9991l3774P613
16061f1971K3424L676J1727K8297n987j0574k358j5170l245M040j0144J8939J7762
16048a584L385J2062N77p946P078p020j4765O270P849J5524K324Q237j9557k8178
16034a5744J0378J8861K96j0069p153M213K1883J1328j3373l8493k0297O227L4575
16021B632L345P254r200Q296J2904M049J6740j9069j7235R620o025k8083k736
16008a7508o438J2521n757k950M227P524L665J724k031k3407q111K1323J1830
15995c388J9847r508R710Q680p598l3076q131J6312K8422p312l7074j342J4237
$$ plain form
15982 -10221 -8787 -8564 -10588 -32400 -29156 -27579 -13103 9326 18187 13217 21456 36361 29228 21381
15968 21381 13740 -2784 8589 7924 12272 234 11222 25267 4063 -16425 -25963 -26819 -21856
15955 -21856 -16892 -11939 -14012 -2058 4771 11576 23558 17495 -1782 -16817 -23589 -6953 10959
15942 10959 -1163 -6803 -15349 1496 2750 14166 8875 8872 14094 9517 -3676 -9352 3926 28328
15928 28328 37227 9888 1934 -5453 -24180 -46819 -41972 -29661 -6534 -684 -22408 -40686 -30326
15915 -30326 -28418 -24914 -11761 4196 -3049 -9681 -558 21834 36862 39726 36603 29540 32479
15902 32479 27077 11977 24230 34373 34087 18568 458 -23895 -38228 -34983 -15274 -4591
15890 -4591 -15561 -8233 10857 8398 -8039 -3518 6354 11889 -453 -8143 3553 22894 26855
$$ packed form
15982a0221J434K23k024k1812L244J577J4476K2429Q861m970Q239J4905p133p847
15968B1381p641j6524J1373o65M348j2038J0988J4045k1204k0488r538q56M963
15955b1856M964M953k073J1954O829O805J1982o063j9277j5035o772J6636J7912
15942A0959j2122n640q546J6845J254J1416n291lN222m577j3193n676J3278K4402
15928B8328Q899k7339p954p387j8727k2639M847J2311K3127N850k1724j8278J0360
15915c0326J908L504J3153J5957p245o632R123K2392J5028K864l123p063K939
15902C2479n402j5100J2253J0143k86j5519j8110k4353j4333L245J9709J0683
15890d591j0970P328J9090k459j6437M521R872N535j2342p690J1696J9341L961
$$ plain form
15877 26855 21749 18435 19341 26078 21385 28132 3827 -24567 -27905 -25821 -15447 9183 22489
15864 22489 33952 6427 -1555 4767 1238 6991 -11844 -13373 -3044 5837 -13189 -4207 -1441
15851 -1441 -4496 12285 -8199 -23276 -6698 18304 22156 17140 4324 -3519 -768 -11637 -12675
15838 -12675 -1149 6165 -11335 -8317 -12608 -991 13327 -8374 -28262 -23742 -3759 3951 4557
15825 4557 1147 3280 13021 17284 8558 -12998 -14949 -15626 -12492 3922 -9014 -17476 -14955 352
15811 352 11879 4540 -16474 -18264 -12670 2158 8850 -1583 -22812 -31353 -28137 -26127 -42362
15798 -42362 -42180 -62492 -48986 -18465 -15236 -11060 -7583 8421 10032 -4910 11366 16194 2954
15785 2954 -5091 -14818 -7416 -2915 -9336 -153 -2396 8631 17642 2777 5074 3639 -127 1473
$$ packed form
15877B6855n106l314R06O737m693O747k4305k8394l338K084J0374K4630J3306
15864B2489J1463k7525p982O322l529N753j8835j529J0329Q881j9026Q982K766
15851a441l055J6781k0484j5077J6578K5002L852n016j2816p843K751j0869j038
15838a2675J1526P314j7500L018m291J1617J4318k1701j9888M520J9983P710O06
15825D557l410K133R741M263q726k1556j951o77L134J6414j2936q462K521J5307
15811C52J1527p339k1014j790N594J4828O692j0433k1229q541L216K010j6235
15798d2362J82k0312J3506L0521L229M176L477J6004J611j4942J6276M828j3240
15785B954q045r727P402M501o421R183k243J1027R011j4865K297j435l766J600
$$ plain form
15771 1473 23518 57853 36228 -188 -21071 -19650 -12100 -5794 -14638 -21888 -28468 -48336 -45045
15758 -45045 -19034 -6447 -17373 -1691 -7454 4391 20735 19375 7032 -11320 -27550 -18617
15746 -18617 -11891 -11176 -7547 -4793 -1591 -17303 -32113 -53583 -51987 -19846 3532 -12375 -31095
15733 -31095 -29382 -18465 -18571 3653 24834 10268 13099 286 -4358 12220 17918 25488 2926
15720 2926 -12599 -3756 -2649 -28787 -24829 -23421 -8081 -8343 -8092 -10249 -1715 -5267 -2244 -910
15706 -910 -19416 -40115 -49154 -29180 -17095 -29751 -41869 -21476 -5724 -20948 -31328 -2878
15694 -2878 11500 15582 4284 -4255 -1146 -14064 -15644 -11732 -3878 -5608 -2304 -29627 -26096 -19714
15680 -19714 -27476 -4078 2562 -622 8464 22990 23869 10266 -10832 -2722 1034 802 -4459 2979
$$ packed form
15771A473K2045L4335k1625l6416k0883J421P550O306q844p250o580j9868L291
15758d5045K6011J2587j0926J5682n763J1845J6344j360j2343j8352j6230Q933
15746a8617O726P15L629K754L202j5712j4810k1470J596L2141K3378j5907j8720
15733c1095J713J0917j06K2224K1181j4566K831j2813m644J6578N698P570k2562
15720B926j5525Q843J107k6138L958J408J5340k62K51k157Q534l552L023J334
15706i10j8506k0699r039J9974J2085j2656j2118K0393J5752j5224j0380K8450
15694b878J4378M082j1298q539L109j2918j580L912P854j730L304k7323L531O382
15680a9714p762K3398O640l184R086J4526Q79j3603k1098Q110L756k32n261P438
$$ plain form
15666 2979 6919 -14439 -31822 -18674 -1167 10118 10746 6737 6118 3279 -10201 -20909 -8270
15653 -8270 3827 -7483 -15609 -18014 -21065 -18412 -14064 -30920 -31322 -32151 -39893 -36008 -33751 -36828
15639 -36828 -22222 -19956 -31503 -28449 -3473 21133 9379 -8260 1395 18011 17065 -7943 -23607
15626 -23607 -17572 -30809 -37653 -42422 -27871 -12666 -21276 -42033 -30555 -21918 -27817 -34326 -42492
15613 -42492 -26972 -8496 -13724 -4240 2888 10931 9105 -8303 -3109 1999 2011 -18990 -33820 -2241
15599 -2241 5939 1334 -1407 -8545 -35821 -58806 -49815 -23539 796 3501 -2127 -2534 -12986 -11708
15585 -11708 -10887 -9015 -561 843 4210 6885 -14497 -10464 -8365 -10937 -2921 -12614 -9500 -16148
15571 -16148 -8108 11151 -1124 -1420 2979 19083 35714 43991 30841 13386 5158 8616 20564
$$ packed form
15666B979L940k1358j7383J3148J7507J1285O28m009o19k839j3480j0708J2639
15653h270J2097j1310q126k405l051K653M348j6856m02q29p742L885K257l077
15639c6828J4606K266j1547L054K4976K4606j1754j7639R655J6616r46k5008j5664
15626b3607O035j3237o844m769J4551J5205q610k0757J1478Q637n899o509q166
15613d2492J5520J8476n228R484P128Q043j826j7408N194N108J2k1001j4830L1579
15599b241Q180m605k741p138k7276k2985Q991K6276K4335K705n628m07j0452J278
15585a1708Q21J872Q454J404L367K675k1382M033K099k572Q016r693L114o648
15571a6148Q040J9259j2275k96M399J6104J6631Q277j3150j7455q228L458J1948
$$ plain form
15558 20564 -926 -6894 9762 15937 10944 20050 28096 15978 20242 -2390 -12180 -9774 19315
15545 19315 34116 21652 9429 13034 367 -9283 10623 23497 18355 20711 31425 23162 -7067
15532 -7067 -20566 -13550 -15423 -31417 -5231 12174 6229 -19858 -35694 -43938 -38810 -10819 12345
15519 12345 10605 -15005 -28254 -17407 15517 3962 -13004 -23369 -20940 -8039 1108 4541
15507 4541 -12395 -5274 7987 -1058 -5082 10977 14129 17107 32850 13851 135 5968 -7340
15494 -7340 -6966 18295 8539 4594 -5997 -12936 -3931 4205 -8607 -25625 -14995 -7365 -22525
15481 -22525 -16972 -11723 -2024 575 16712 22020 2142 -14102 -25712 -25680 -17816 -143 10556
15468 10556 8062 15721 25862 15495 2420 17449 17414 2339 19323 28432 33474 9807 -16174
$$ packed form
15558B0564k1490n968J6656O175m993R106Q046j2118M264k2632r790K406K9089
15545A9315J4801j2464j2223L605j2667r650J9906J2874n142K356J0714q263l0229
15532g067j3499P016j873j5994K6186J7405n945k6087j5836q244N128K7991K3164
15519A2345j740k5610j3249J0847L2924j1555j6966j0365K429J2901R147L433
15507D541j6936P121J3261r045m024J6059L152K978J5743j8999j3716N833j3308
15494g340L74K5261r756l945j0591o939R005Q136j2812j7018J0630P630j5160
15481b2525N553N249R699K599J6137N308j9878j6244j1610L2P864J7673J0699
15468A0556k494P659J0141j0367j3075J5029l5j5075J6984R109N042k3667k5981
$$ plain form
15455 -16174 -19157 -35446 -41966 -46839 -56006 -40875 -53797 -41306 -33400 -28487 -27947 -17735 -18821
15442 -18821 -21884 6842 14842 -15609 -33586 -16911 10591 22530 17200 14729 6560 5471 -7292
15429 -7292 -1978 14084 24561 16003 2340 -10268 -12551 -27383 -38553 -38148 -33470 -28929 -16351
15416 -16351 -2220 -10034 -19019 -20593 -14245 -8936 -10041 -13550 -5039 8081 -9209 -14115 -3543
15403 -3543 19876 17357 31724 42585 17991 -477 -18992 -20202 -16605 -2893 -5500 8119 4192
15390 4192 -4242 -17921 -25455 -22261 -1971 2912 -12000 -34445 -42544 -68256 -61592 -38440 -20653
15377 -20653 -16447 -6719 8878 2865 3540 -17858 -19520 -16667 -30059 -35958 -39085 -36776 -37258 -22767
15363 -22767 -2772 7455 -5778 -33913 -48327 -46060 -39468 -32689 -21030 9963 23244 13057
$$ packed form
15455a6174k983j6289o520m873r167J5131j2922J2491P906M913N40J0212j086
15442a8821l063K8726Q000l0451j7977J6675K7502J1939n330k471q169j089j2763
15429g292N314J6062J0477q558j3663j2608k283j4832j1170M05M678M541J2578
15416a6351J4131p814q985j574O348N309j105l509Q511J3120j7290m906J0572
15403c543K3419k519J4367J0861k4594j8468j8515j210L597J3712k607J3619l927
15390D192q434j3679p534L194K0290M883j4912k2445q099k5712O664K3152J7787
15377b0653M206R728J5597o013O75k1398j662K853j3392n899l127K309m82J4491
15363b2767J9995J0227j3233k8135j4414K267O592O779J1659L0993J3281j0187
$$ plain form
15351 13057 27770 42727 39693 3151 -12076 -22791 -24237 -10133 -5502 -968 8838 519 -30979
15338 -30979 -29723 -23536 -46051 -57907 -46598 -25134 -10899 -7692 -26348 -30564 -10638 -2299 -16220
15325 -16220 145 -3051 -9582 -4406 -10728 -8609 -15666 -20478 -29909 -39093 -13190 3074 15504
15312 15504 20489 22144 25625 37179 33511 20770 -3216 -24415 -11990 1607 -4826 -24285 -27901
15299 -27901 -25980 -22088 -3469 1380 -8039 -8810 4300 33635 36461 33012 37514 2856 -9127
15286 -9127 -28809 -19518 18572 22976 5742 -10092 -23372 -25978 -16249 -12179 -24466 -27109 -21126
15273 -21126 -37594 -37932 -16477 -16824 -8708 -1578 3485 14799 24398 28857 2688 9302 33836 33106
15259 33106 14621 14687 -1953 -6111 3329 1289 5098 9861 1841 382 2646 17351 15771 -2255
$$ packed form
15351A3057J4713J4957l034l6542j5227j0715j446J4104M631M534R806q319l1498
15338c0979J256O187k2515j1856J1309K1464J4235L207j8656m216J9926Q339j3921
15325a6220J6365l196o531N176o322K119p057m812r431r184K5903J6264J2430
15312A5504M985J655L481J1554l668j2741k3986k1199J2425J3597o433j9459l616
15299b7901J921L892J8619M849r419p71J3110K9335K826l449M502l4658j1983
15286i127j9682R291L8090M404j7234j5834j3280k606R729M070j2287k643N983
15273b1126j6468l38K1455l47Q116P130N063J1314R599M459k6169O614K4534p30
15259C3106j8485O6j6640m158R440k040L809M763q020j459K264J4705j580j8026
$$ plain form
15245 -2255 -12807 -8004 -3116 -8402 -8061 -3696 -3395 -19853 -13765 -21997 -14674 -180 -9011 -17555
15231 -17555 -14481 -8327 -654 4082 1898 12956 13743 -13034 -34072 -30362 -17402 1055 -5393
15218 -5393 -9942 -16339 -31337 -37501 -8728 2344 4225 -5032 -13373 -18545 -23093 -25437 -12417 -92
15204 -92 9611 2924 -7038 -21887 -13424 -15246 7906 5431 -1901 -9770 718 17217 16440 8413
15190 8413 -9311 -12409 3561 9991 9450 -20921 -25295 -13011 6306 13893 17141 19523 10083 8436
15176 8436 2492 -7256 -34574 -54857 -50978 -17018 3999 14508 -4871 -22391 -17695 -17246 -7720
15163 -7720 -4677 -8085 3593 20601 18827 12576 1589 28422 49699 49799 55830 48470 32801
15150 32801 20939 -5615 -2463 -13178 -3643 13148 10239 -20053 -47975 -40534 -17750 12318
$$ packed form
15245b255j0552M803M888n286L41M365L01j6458O088q232P323J4494q831q544
15231a7555L074O154P673M736k184J1058P87k6777k1038L710J2960J8457o448
15218e393m549o397j4998o164K8773J1072J881r257q341n172m548k344J3020J2325
15204i2R703o687r962j4849Q463j822K3152k475p332p869J0488J6499p77q027
15190H413j7724l098J5970O430n41l0371m374J2284J9317P587L248K382r440j647
15176H436n944r748k7318k0283L879L3960K1017J0509j9379j7520M696M49R526
15163g720L043l408J1678J7008j774o251j0987K6833K1277J00O031p360j5669
15150C2801j1862k6554L152j0715R535J6791k909l0292k7922P441K2784L0068
$$ plain form
15138 12318 29327 14430 11220 4158 -1438 -14155 -16595 -27369 -20521 -12753 -11646 8464 -137
15125 -137 -14836 -13030 -15896 -8074 -14120 -27097 -46399 -64210 -50113 -56725 -56796 -50374 -42582 -25497
15111 -25497 -15713 -15563 7032 22471 -1241 -14784 -1305 24906 3447 -21006 -23506 5190
15099 5190 11832 10596 13707 6620 -690 -12051 -20932 -41606 -52494 -44553 -34020 -26883 7070
15086 7070 12890 -17230 -30506 -27537 9703 23315 10622 -327 4840 -3682 -14195 5859 5603
15073 5603 14387 18232 24953 20637 21124 24813 17071 2965 2827 1382 -5146 -271 4448 18270 42089
15058 42089 30162 19919 11200 2820 7497 14302 29441 31923 16862 2291 -3693 4981 6833
15045 6833 -3595 2615 -735 9148 14763 17145 30538 15233 1092 2496 7488 3405 -1093 13482
$$ packed form
15138A2318J7009j4897l210p062n596j2717k440j0774O848P768J107K0110q601
15125a37j4699J806k866P822o046j2977j9302j7811J4097o612p1O422P792J7085
15111b5497R784J50K2595J5439k3712j3543J3479K6211k1459k4453k500K8696
15099E190O642j236L111p087p310j1361q881k0674j0888P941J0533P137L3953
15086G070N820l0120j3276K969L7240J3612j2693j0949N167q522j0513K0054k56
15073E603Q784L845O721m316M87L689p742j4106j38j445o528M875M719J3822K3819
15058D2089j1927j0243q719q380M677O805J5139K482j5061j4571n984Q674J852
15045F833j0428O210l350R883N615K382J3393j5305j4141J404M992m083m498J4575
$$ plain form
15031 13482 24911 16692 11080 14019 6913 -2947 -11744 -13224 26852 42484 34282 -1371 -23906
15018 -23906 -18697 5116 14028 14815 24189 16437 23884 26112 4451 -14071 2844 22235 20055
15005 20055 35464 33940 39050 23908 28031 42124 29424 19763 22614 24587 8173 -16403 -27215
14992 -27215 -19637 -22198 -23636 -25944 -13158 2152 -216 -4243 -11321 -20187 -7942 7187 -556
14979 -556 -5209 -15612 -26572 -42005 -16756 -5588 -2357 371 -1920 -16203 -17520 821 1324
14966 1324 -3061 -12131 -9931 5101 14720 9180 2214 -971 10840 23035 10657 10033 6900 11528
14952 11528 -9534 -28214 -43031 -45211 -38109 -16626 -19176 -29134 -18285 -27659 -40431 -15476 -3237
14939 -3237 -14110 -21516 -18303 -20960 -45392 -40709 -12465 16839 4942 -2227 -11177 -24320 -27680
$$ packed form
15031A3482J1429q219n612K939p106r860q797j480M0076J5632q202l5653k2535
15018b3906N209K3813Q912P87R374p752P447K228k1661j8522J6915J9391k180
15005B0055J5409j524N110j5142M123J4093j2700r661K851J973j6414k4576j0812
14992b7215P578k561j438k308J2786J5310k368m027p078q866J2245J5129p743
14979e56m653j0403j0960j5433K5249J1168L231K728k291j4283j317J8341N03
14966A324m385r070K200J5032R619n540o966l185J1811J2195j2378o24l133M628
14952A1528k1062j8680j4817k180P102K1483k550r958J0849r374j2772K4955J2239
14939c237j0873p406L213k657k4432M683K8244K9304j1897p169q950j3143l360
$$ plain form
14926 -27680 -27427 -20049 -22307 -40375 -24562 -1977 6054 -2910 -7174 7456 39979 43709 47556
14913 47556 15383 -15288 -6972 12914 -625 -26493 -16577 -8762 1111 15147 15936 13836 11489
14900 11489 -931 -8131 -16305 2675 18150 3150 10335 20376 5220 -30257 -31259 -26454 -22239
14887 -22239 -7604 -2697 -2269 -21802 -45722 -34692 -30217 -29303 -28062 -43106 -37173 -30019 -22964 -16247
14873 -16247 -1681 8266 568 -11647 -26576 -36947 -30913 -15962 4839 1092 11936 15303 -13790
14860 -13790 -28084 -31882 -38127 -26285 -28890 -35792 -6696 18883 21557 9740 -4990 -1254 11174
14847 11174 11842 1952 -9786 -4494 -6424 -9507 12259 5578 -16599 -19048 -4570 -18542 -18455 -13654
14833 -13654 -17652 -12553 3271 -351 -22119 -23174 -11291 19 9407 24206 27137 -6536 -20978
$$ packed form
14926b7680K53P378k258j8068J5813K2585Q031q964m264J4630L2523L730L847
14913D7556l2173l0671Q316J9886j3539k5868R916P815R873J4036P89k100k347
14900A1489j2420p200q174J8980J5475j5000P185J0041j5156l5477j002M805M215
14887b2239J4635M907M28j9533k3920J1030M475R14J241j5044N933P154P055O717
14873a6247J4566R947p698j2215j4929j0371O034J4951K0801l747J0844L367k9093
14860a3790j4294l798o245J1842k605o902K9096K5579K674j1817j4730L736J2428
14847A1174O68r890j1738N292j930l083K1766o681k2177k449J4478j3972Q7M801
14833a3654l998N099J5824l622k1768j055J1883J1310R388J4799K931l3673j4442
$$ plain form
14820 -20978 -16468 -6904 -9678 -21879 -21021 -16918 -7361 -9059 1213 -3803 -9624 -8986 -1704 13471
14806 13471 -13131 -15207 -19873 -7148 -3157 -4823 -23572 -28362 -28026 -17785 -22611 -38317 -23029
14793 -23029 12448 18470 15344 10638 -1839 -23703 -9594 -18576 -36624 -22013 -9663 -20908
14781 -20908 -33572 -2066 16586 16119 9673 -6394 -16332 -13973 -5502 678 -8067 -2189 7004 1990
14767 1990 -2930 -5883 1734 16822 8599 -2534 -3885 13387 15191 -14652 -29647 -29531 -4191
14754 -4191 4837 5084 10744 16071 -58 -9205 -14406 -26375 -40832 -55645 -36620 -19693 -15365
14741 -15365 -14745 -18772 -11951 -23137 -25573 -19186 -10892 -7664 -4617 11870 20774 13272 1972 -5472
14727 -5472 3709 1648 -1095 -12662 -3775 -3657 -13061 -25146 -15672 -2772 10624 19469 3690 -21326
$$ packed form
14820b0978M510R564k774j2201Q58M103R557j698J0272n016n821O38P282J5175
14806A3471k6602k076m666J2725L991j666j8749m790L36J0241m826j5706J5288
14793b3029L5477O022l126m706j2477k1864J4109q982j8048J4611J2350j1245
14781b0908j2664L1506J8652m67o446j6067r938K359Q471O180q745N878R193n014
14767A990m920k953P617J5088q223j1133j351J7272J804k9843j4995J16K5340
14754d191R028K47N660N327j6129r147n201j1969j4457j4813J9025J6927M328
14741a5365O20m027O821j1186k436O387Q294L228L047J6487Q904p502j1300p444
14727e472R181k061k743j1567Q887J18r404j2085R474J2900J3396Q845j5779k5016
$$ plain form
14713 -21326 -19549 -11735 -3280 -6354 -3340 -24408 -35558 -26784 -18577 -22984 -15932 6177 11367 20859
14699 20859 23622 29272 32559 7329 -8372 3910 -253 -14234 -16282 -23248 -43365 -20018 -23213
14686 -23213 -15681 -10811 6280 -10212 -5355 3854 10437 6758 -8665 -443 2249 1643 -14723 -37658
14672 -37658 -28400 -30747 -23110 -12322 6785 20868 37069 36132 3425 1844 4310 -25064 -9144
14659 -9144 46237 42965 21119 2648 -15608 583 17821 9174 3074 -8672 -5953 7391 -3291
14646 -3291 -12642 -26884 -55863 -49499 -13143 -25072 -21238 -23453 -23530 981 -21054 -32418 -37228
14633 -37228 -25244 -9137 -11688 -25731 -39793 -46119 -24799 -22928 -10739 -5862 -19350 -8220
14621 -8220 13149 6226 -4264 -4537 6515 2770 2752 1502 -20861 -29570 -25933 -43670 -33838 -7914
$$ packed form
14713b1326J777P814Q455l074L014k1068j1150Q774Q207m407P052K2109N190R492
14699B0859K763N650L287k5230j5701J2282m163j3981k048o966k0117K3347l195
14686b3213P532M870J7091j6492M857R209O583l679j5423Q222K692o06j6366k2935
14672c7658R258k347P637J0788J9107J4083J6201r37l2707j581K466k9374J5920
14659i144N5381l272k1846j8471j8256J6191J7238q647o100j1746K719J3344j0682
14646c291r351j4242k8979O364L6356j1929L834k215p7K4511k2035j1364m810
14633c7228J1984J6107k551j4043j4062o326K1320J871J2189M877j3488J1130
14621h220K1369o923j0490k73J1052l745j8j250k2363q709L637j7737R832K5924
$$ plain form
14607 -7914 1879 -1290 -886 4936 -2884 -5756 -4249 1766 -1206 -3716 -4260 12663 8760 4549 -11619
14592 -11619 -29912 -30097 -25651 -26149 -8876 -3510 -11820 -19515 -14652 -2084 22638 22347 7935 -8932
14578 -8932 -9050 -9637 1308 9846 -12917 -7449 818 14094 16973 15745 -4623 6543 16382 13477
14564 13477 5338 -11033 -17078 -20818 -17291 -21090 -10365 1724 27158 16256 -4399 -34534 -30181
14551 -30181 -20980 -17701 -9237 -3394 1678 1956 -12293 -32665 -39128 -20362 2162 2617 31109 25945
14537 25945 10815 9553 3752 -4999 -7144 -13130 -12798 -19998 -10042 5667 1827 -17245 -16416 -10075
14523 -10075 -6452 -10603 -23036 -16185 -11486 -1615 -283 26686 8781 -6644 -3608 12694 5241
14510 5241 -5201 -12147 -18045 -15761 -3852 4632 17697 4881 -26255 -59941 -50127 -34652 -18034
$$ packed form
14607g914R793l169M04N822p820k872J507O015k972k510n44J6923l903m211j6168
14592a1619j8293j85M446m98J7273N366q310p695M863J2568K4722k91j4412j6867
14578h932j18n87J0945Q538k2763N468Q267J3276K879j228k0368J1166R839k905
14564A3477q139j6371o045l740L527l799J0725J2089K5434j0902k0655l0135M353
14551c0181R201L279Q464N843N072K78j4249k0372o463J8766K2524M55K8492n164
14537B5945j5130j262n801q751k145n986L32p200R956J5709l840j9072Q29O341
14523a0075L623m151j2433O851M699R871J332K6969j7905j5425L036J6302p453
14510E241j0442o946n898K284J1909Q484J3065j2816l1136l3686R814J5475J6618
$$ plain form
14497 -18034 -8577 7524 -2564 15235 18213 17147 19044 22830 5001 -7383 -15305 -13773 -9036
14484 -9036 -2538 -24913 -30633 -7451 4932 1326 -4983 2430 9768 12399 19424 27166 30567 18115
14470 18115 11018 5549 -19635 -36847 -13901 9796 15741 12209 3517 8363 -8364 -6955 -25539
14457 -25539 -17282 1823 11268 17457 24216 5166 -9037 5330 -16038 -25059 -22999 -29509 -29123
14444 -29123 -34078 -26037 -12971 -19015 -19383 -18569 -6614 -2348 -12567 -3621 -15837 -22633 -4193 -14097
14430 -14097 -17943 6262 20909 -10337 -19306 -8347 -9114 -6619 -14773 -29645 -31846 1069 1326
14417 1326 -16877 -34020 -45425 -35819 -22496 -29676 -20434 -13959 12173 12928 -7296 -5559 11621
14404 11621 30106 28569 5591 21 -10452 578 8506 13320 15942 7563 -11941 -18669 -16388
$$ packed form
14497a8034R457J6101j0088J7799K978j066J897L786j7829j2384p922J532M737
14484i036O498k2375n720K3182J2383l606o309P413P338K631P025P742L401j2452
14470A8115p097n469k5184j7212K2946K3697N945l532q692M846j6727J409j8584
14457b5539Q257J9105R445O189O759j9050j4203J4367k1368r021K060o510L86
14444b9123m955Q041J3066o044l68Q14J1955M266j0219Q946j2216o796J8440r904
14430a4097l846K4205J4647l1246q969J0959p67K495q154j4872k201L2915K57
14417A326j8203j7143j1405R606J3323p180R242O475K6132P55k0224J737J7180
14404A1621J8485j537k2978n570j0473J1030P928M814K622q379j9504o728K281
$$ plain form
14391 -16388 -13964 -6178 16497 37028 34511 28649 26063 30704 27032 20549 3990 3255 2762 -2580
14377 -2580 -5031 -12607 -36590 -45626 -30512 -22329 -8948 1869 6705 1445 1984 7674 11567 -18472
14363 -18472 -29026 -24782 -18554 -6085 16471 14498 6549 11607 14488 3432 -15225 -18025 25722
14350 25722 22634 21891 33245 17137 13231 4464 -23046 -28920 -28502 -19051 -8886 10306 18915 -1311
14336 -1311 -13152 -22779 -15957 -8443 -20765 -14692 -13291 -14038 -9578 -3791 -7688 6097 -4964 -27076
14322 -27076 -26094 -19061 -14306 10090 4215 -13424 -31257 -25607 -23896 -13380 13682 1662 -29491
14309 -29491 -20681 -25151 -25287 -13347 -24753 -13254 -9887 -36486 -35406 -20200 -25446 -20950 -1423
14296 -1423 -7978 -1845 -14551 -12800 897 -1736 -30564 -28598 -23779 -32478 -9946 12057 11475 1392
$$ packed form
14391a6388K424P786K2675K0531k517n862k586M641l672o483j6559p35m93n342
14377b580k451p576k3983r036J5114Q183J3381J0817M836n260N39N690L893l0039
14363a8472j0554M244O228J2469K2556j973p949N058K881j1056j8657k800M3747
14350B5722l088p43J1354j6108l906q767k7510n874M18R451J0165J9192Q609k0226
14336a311j1841r627O822P514j2322O073J401p47M460N787l897J3785j1061k2112
14322b7076R82P033M755K4396n875j7639j7833N650J711J0516K7062j2020l1153
14309b9491Q810m470j36J1940j1406J1499L367k6599J080J5206n246M496J9527
14296a423o555O133j2706J751J3697k633k8828J966M819q699K2532K2003n82j0083
$$ plain form
14282 1392 -6700 -9388 -2730 -6935 -14726 -19730 -34239 -50963 -45546 -24173 -23121 -16717 -1880 -6884
14268 -6884 -18550 -325 -1614 -12768 -12650 -16991 -22326 -14099 -11941 -14943 -5980 9284 21178 13778
14254 13778 5283 5812 2605 -6257 -6198 -61 14267 -3191 -12482 -11192 -18024 -14749 1519 1811 -25180
14239 -25180 -23398 -16481 -17812 -7789 -5397 -16500 -12101 -9585 -12968 -24724 -22931 -8513 -9863
14226 -9863 -7895 2082 26499 25997 -15698 -45318 -51367 -44624 -28831 -18207 -5172 16378 17705
14213 17705 10506 -3873 -18496 -24109 -22906 -22845 -25224 -18795 -32862 -47189 -41545 -14574 25051
14200 25051 33923 8279 -8893 -16067 -12952 -10232 -10530 -24799 -10430 -8791 10890 2740 -14870
14187 -14870 -10894 -10827 -3672 -23157 -30670 -29169 -23114 -12808 -24647 -30918 -13427 5486 15895
$$ packed form
14282A392q092k688O658m205p791n004j4509j6724N417K1373J052O404J4837n004
14268f884j1666J8225j289j1154J18m341n335Q227K158l002Q963J5264J1894p400
14254A3778q495N29l207q862N9O137J4328j7458r291J290o832L275J6268K92k6991
14239b5180J782O917j331J0023K392j1103M399K516l383j1756J793J4418j350
14226i863J968R977K4417n02m1695k9620o049O743J5793J0624J3035K1550J327
14213A7705p199j4379j4623n613J203O1k379O429j4067j4327N644K6971L9625
14200B5051Q872k5644j7172p174L115K720k98j4269J4369J639J9681q150j7610
14187a4870L976O7P155j9485p513J501O055J0306j1839o271J7491J8913J0409
$$ plain form
14174 15895 -9463 3616 1551 -8314 -15631 -22663 -46541 -54000 -30123 -2089 16018 30806 26431
14161 26431 11748 1679 -1431 -3907 6736 8262 -7667 -4501 29330 35905 44013 24302 8791
14148 8791 7667 15347 -404 -18334 -15629 -21728 -16055 -14264 -4798 8875 -1778 -13436 -10133
14135 -10133 2975 16028 13749 2788 -14457 -21007 -20547 -12792 -32642 -29782 -26997 -19891 -40900
14122 -40900 -20791 -3065 7621 26581 17427 -4957 -1622 1310 6930 6925 2482 -1283 11882 4922
14108 4922 -24354 -34637 -32444 -7182 7524 13441 2714 -3739 -13852 -6817 -4808 -8446 -5942
14095 -5942 -1745 -13366 -24533 -9631 -11836 -22204 -19765 -23397 -37795 -31595 -21409 -52061 -63878
14082 -63878 -42369 -7867 -4162 2628 9171 -15636 -25309 -25193 -21171 -4956 15145 2324 -32636
$$ packed form
14174A5895k5358J3079k065r865p317p032k3878p459K3877K8034J8107J4788m375
14161B6431j4683j0069l110k476J0643J526j5929L166L3831O575Q108j9711j5511
14148H791j124P680j5751j7930K705o099N673J791R466J3673j0653j1658L303
14135a0133J3108J3053k279j0961j7245o550M60P755j9850K860K785P106k1009
14122d0900K0109J7726J0686J8960r154k2384L335K932N620nm443l765J3165o960
14108D922k9276j0283K193K5262J4706N917j0727o453j0113P035K009l638K504
14095e942M197j1621j1167J4902k205j0368K439l632j4398O200J0186l0652j1817
14082f3878K1509L4502L705O790O543k4807r673J16M022J6215K0101j2821l4960
$$ plain form
14069 -32636 -31673 -8201 -16839 -15511 -2344 -5483 -21604 -15133 -12875 4709 1227 -53 -5838 5599
14055 5599 11164 5192 -596 13997 13789 12937 -5879 -11703 -22948 -19356 -26131 -14873 -15316 -38702
14041 -38702 -53319 -18661 -1415 -6714 -7887 -433 16846 27003 449 -26254 -38833 -35924
14029 -35924 -23478 -21955 -4848 9934 24610 25242 22876 23213 14927 26699 28774 9230 -10426
14016 -10426 -20150 3626 -1907 -12806 -12248 -765 9995 6157 -21619 -14935 -6581 -17313 -20098
14003 -20098 -17741 -14887 -46653 -54058 -45403 -28180 -21051 -10828 -11838 -31148 -26480 -29777 -36016
13990 -36016 -23476 -5455 -2617 6994 17332 33671 34209 16016 19783 3256 3672 7964 19697
13977 19697 36265 35020 29947 20635 -5811 -7195 2956 9063 11697 8413 2041 787 -11823
$$ packed form
14069c2636R63K3472q638J328J3167l139j6121O471K258J7584l482j280n785J1437
14055E599N565n972n788J4593k08q52j8816n824j1245L592o775J1258m43k3386
14041c8702j4617L4658J7246n299j173P454J7279J0157k6554k6703j2579K909
14029c5924J2446J523J7107J4782J4676O32k366L37q286J1772K075j9544j9656
14016a0426r724K3776n533j0899N58J1483J0760l838k7776O684Q354j0732k785
14003b0098K357K854l1766p405Q655J7223P129J0223j010j9310M668l297o239
13990c6016J2540J8021K838R611J0338J6339N38j8193L767j6527M16M292J1733
13977A9697J6568j245n073r312k6446j384J0151O107K634l284o372j254j2610
$$ plain form
13964 -11823 -18261 -29861 -47456 -49075 -21861 -7521 -4974 10160 -717 -11970 -15939 1344
13952 1344 12164 7899 -19604 -28602 -18342 -23120 -33333 -34041 -2796 10704 1 3344 -1560
13939 -1560 -3717 -10102 -4206 -7456 -11764 -6584 -5360 -16047 -26271 -11553 -784 -20619 -15963
13926 -15963 -715 8291 1799 1054 7384 6543 7119 5558 10488 5331 10521 10960 28679 30038 22275
13911 22275 -13943 -14061 -1500 -10276 -5265 -9008 -26009 -34745 -20750 -1750 8382 -3068 2150
13898 2150 27144 36931 13906 18162 26219 10819 12311 9277 3861 12787 4247 2447 536 1178
13884 1178 -365 -2088 -2459 -10488 -24879 -47684 -41405 -14048 -14741 -31482 -26431 -12816 3526 -9414
13870 -9414 1367 -5176 -25783 -42335 -35915 -11458 3181 -21792 -11515 9452 21512 43230
$$ packed form
13964a1823o438j1600j7595j619K7214J4340K547J5134j0877j1253l969J7283
13952A344J0820m265k7503q998J0260m778j0213p08L1245J3500j0703L343m904
13939a560k157o385N896l250m308N180J224j0687j0224J4718J0769j9835M656
13926a5963J5248R006o492p45O330q41N76j561M930n157N190M39J7719J359p763
13911B2275l6218j18J2561q776N011l743j7001q736J3995J9000J0132j1450N218
13898B150K4994R787k3025M256Q057j5400J492l034n416Q926q540j800j911O42
13884A178j543j723l71q029j4391k2805O279K7357o93j6741N051J3615J6342j2940
13870i414J0781o543k0607j6552O420K4457J4639k4973J0277K0967J2060K1718
$$ plain form
13858 43230 41139 25095 13995 24497 35201 35861 32470 16444 13234 8133 17103 27144 36207
13845 36207 27430 21712 7144 -4674 5346 14220 -2362 5281 35645 42461 32339 29647 51089
13832 51089 44276 20976 26725 27873 31498 7011 2166 3177 -8410 -15611 -12783 -17602 -22511 -27889
13818 -27889 -10946 6806 8336 10155 -3688 -2248 8903 4194 -3568 -19179 -33451 -36210 -31629
13805 -31629 -28837 -6113 3757 -4518 77 -6319 -12141 -20725 -18088 -1063 7662 -7472 -12791 8363
13791 8363 22279 58510 63606 34752 24450 5372 -5010 -3396 -5488 -1826 3567 -1877 -17867
13778 -17867 -7812 7694 13078 28048 28683 30091 28534 12876 -614 -5083 -7477 -17205 -10619
13765 -10619 -4567 -13408 -20393 -17399 -19089 -26633 -39699 -18431 4879 13438 16726 22766 14891 11061
$$ packed form
13858D3230k091j6044j1100J0502J0704O60l391j6026l210n101Q970J0041R063
13845C6207q777n718j4568j1818J0020Q874j6582P643L0364O816j0122k692K1442
13832E1089o813k3300N749J148L625k4487m845J011j1587p201K828m819m909n378
13818b7889J6943J7752J530J819j3843J440J1151m709p762j5611j4272k759M581
13805c1629K792K2724R870q275M595o396n822q584K637J7025Q725j5134n319K1154
13791H363J3916L6231N096k8854j0302j9078j0382J614k092L662N393n444j5990
13778a7867J0055J5506N384J4970O35J408j557j5658j3490m469k394r728O586
13765a0619O052q841o985K994j690p544j3066K1268K3310Q559L288O040p875l830
$$ plain form
13751 11061 -20757 -15148 10359 12607 4682 7092 -3201 187 294 14020 29719 30375 26295 19111
13737 19111 18456 12765 26833 36678 21495 6697 10742 34360 12087 -10090 -9214 -7999 -18445
13724 -18445 -21730 -10318 -13342 -12903 -8125 9639 29521 35234 37255 11459 -22725 -42271 -39801
13711 -39801 -26521 4752 5334 -17461 -31923 -34656 -33982 -14945 3327 -11091 -21465 -21940 -20266
13698 -20266 -14052 -19914 -29421 -30087 -13267 -7103 11217 -6211 -12342 18771 9231 852 -5182 5451
13684 5451 12237 2535 -10266 -12370 -8803 -14961 -23243 -45430 -23504 -8363 -11644 -11402 -18135 -16864
13670 -16864 -15831 -19366 -21992 -12251 -3963 5005 1225 389 20890 11962 13204 35868 21184 -4740
13656 -4740 -15685 -12813 -14439 -22376 -19104 -27564 -43586 -61499 -67724 -57835 -56220 -56458 -38859 -29056
$$ packed form
13751A1061l1818N609K5507K248p925K410j0293L388J07J3726J5699O56m080p184
13737A9111o55n691J4068R845j5183j4798M045K3618k2273k2177Q76J215j0446
13724a8445l285J1412l024M39M778J7764J9882N713K021k5796l4184j9546K470
13711c9801J3280L1273N82k2795j4462k733O74J9037J8272j4418j0374m75J674
13698b0266O214n862r507o66J6820O164J8320j7428o131L1113r540q379o034J0633
13684E451O786r702j2801k104L567o158q282k2187K1926J5141l281K42o733J271
13670a6864J033l535k626R741Q288Q968l780q36K0501q928J242K2664j4684k5924
13656d740j0945K872j626p937L272q460j6022j7913o225R889J615k38J7599R803
$$ plain form
13642 -29056 -32994 -32848 -21908 -21376 -26510 -40925 -36935 -38747 -45700 -39393 -21522 -20332 -33517 -11028
13628 -11028 1312 -13188 -23309 5342 23555 2376 -12789 1297 -284 -5383 -6882 -9066
13616 -9066 -460 14854 17170 4394 15008 14408 -17421 -30817 -43941 -30640 8636 18044 5851
13603 5851 -13455 -37303 -37470 -39341 -35929 -21849 -11461 -14030 -12469 -13458 -15240 -14913 -24671 -15221
13589 -15221 13392 25111 23478 29243 4751 4470 5935 1787 -14297 -22795 -23093 -23354 -20812 -26331
13575 -26331 -42716 -32104 -18197 -17468 -18542 -1335 12188 3777 12579 14280 34077 46770 38440
13562 38440 35991 28581 -487 -14224 -26939 -39791 -30912 -25159 -23904 -8251 5000 10924 -4721
13549 -4721 -13748 -17272 -5039 34047 36393 24442 24754 13789 -6054 6338 18376 2661 -17406
$$ packed form
13642b9056l938J46J0940N32n134j4415L990j812o953O307J7871J190j3185K2489
13628a1028J2340j4500j0121K8651J8213k1179j5165J4086j581n099j499k184
13616i066Q606J5314K316j2776J0614o00l1829j3396j3124J3301L9276R408j2193
13603E851j9306k3848j67j871L412J4080J0388k569J561r89j782L27r758R450
13589a5221K8613J1719j633N765k4492k81J465m148j6084q498k98k61K542n519
13575b6331j6385J0612J3907P29j074J7207J3523q411Q802J701J9797J2693q330
13562C8440k449p410k9068j3737j2715j2852Q879N753J255J5653J3251N924j5645
13549d721r027l524J2233L9086K346j1951L12j0965j9843J2392J2038j5715k0067
$$ plain form
13536 -17406 -11613 -1269 5126 620 -13717 -32329 -26003 -23620 -32921 -25201 2851 17542 13267
13523 13267 10846 -17916 -45589 -62122 -55193 -61910 -55827 -32187 -17788 2475 5962 5201 16316
13510 16316 4107 -10512 15026 15028 21440 33660 20064 -20285 -16156 -912 -6207 -20788 -5138
13497 -5138 9063 12766 5637 -11429 -28595 -40099 -28611 -9597 -8619 -25831 -14943 -4625 -15151
13484 -15151 -19971 -18005 -20379 -19367 -14917 -14017 -28596 -40625 -42406 -23923 -31898 -47141 -63026
13471 -63026 -44773 -24519 -15922 -430 13057 15032 15235 19340 12966 5519 23150 33941 10342
13458 10342 -2026 -11815 -11219 -20030 -12235 17726 52380 63002 61232 69131 60037 42136 6145
13445 6145 2496 35093 20102 8577 7447 -1619 19142 41089 24896 12584 19828 19533 -8623
$$ packed form
13536a7406N793J0344O395m506j4337j8612O326K383r301P720K8052J4691m275
13523A3267k421k8762k7673j6533O929o717O083K3640J4399K0263L487p61J1115
13510A6316j2209j4619K5538KO412J2220j3596m0349M129J5244n295j4581J5650
13497e138J4201L703p129j7066j7166j1504J1488J9014R78j7212J0888J0318j0526
13484a5151m820J966k374J012M450R00j4579j2029j781J8483p975j5243j5885
13471f3026J8253K0254Q597J5492J3487J975K03M105o374p447J7631J0791k3599
13458A0342j2368r789N96q811P795K9961L4654J0622j770P899r094j7901l5991
13445F145l649L2597j4991j1525j130r066K0761K1947j6193j2312P244k95k8156
$$ plain form
13432 -8623 -13706 -32844 -29657 -2303 -7178 3366 233 1432 30817 42615 38613 34222 22874
13419 22874 25657 30047 7052 -4012 4856 13913 124 -29782 -23684 -3590 10996 2151 6749
13406 6749 -10762 -29469 -11810 -8487 -23813 -7933 15615 18499 -17918 -8163 -12459 -22749 -28612
13393 -28612 -11851 -12482 -16028 -14247 -18724 4558 16010 4055 -7765 -1748 9840 9094 22876
13380 22876 23596 35374 20918 -1492 -8062 -3062 4874 16976 5481 13322 36152 18892 8348
13367 8348 18025 11858 11143 2435 11575 23284 11143 26334 18233 20906 28699 30252 4535 -15102
13353 -15102 3262 21723 4949 -5099 -8308 -8611 -9938 -4621 -23200 -31275 -15008 -21092 -19523
13340 -19523 -11612 10404 16060 -1595 -23135 -13379 -10914 14 -13328 -15389 -22422 -18880 3681
$$ packed form
13432h623n083j9138L187K7354m875J0544l133J199K9385J1798m002m391j1348
13419B2874K783M390k2995j1064Q868R057j3789k9906O098K0094J4586q845M598
13406F749j7511j8707J7659L323j5326J5880K3548K884l6417R755m296j0290n863
13393b8612J6761o31l546J781m477K3282J1452j1955j1820O017J1588p46J3782
13380B2876P20J1778j4456k2410o570N000P936J2102j1495P841K2830j7260j0544
13367H348R677o167p15q708R140J1709j2141J5191q101K673P793J553k5717j9637
13353a5102J8364J8461j6774j0048l209l03j327N317j8579q075J6267o084J569
13340a9523P911K2016N656j7655k1540R756K465J0928j3342k061p033L542K2561
$$ plain form
13327 3681 13445 8661 11454 14474 19667 24429 11575 -3408 -25983 -35329 -27267 -9109 9296
13314 9296 -12047 -18583 3418 19934 14270 18931 7030 6473 16606 14823 14160 -2759 -28963
13301 -28963 -41620 -42580 -40119 -29137 -30213 -29229 -36466 -20743 -2849 -10760 -23193 -17933 -13769 -14023
13287 -14023 -23836 -28230 -30399 -13832 501 -6974 -19618 -28117 -18358 19712 43048 36656 3387
13274 3387 -16933 -15710 -4358 9696 2317 1786 -4137 -18853 -25904 -20896 -30216 -40298 -17319
13261 -17319 6327 -14367 -12802 -14750 -20539 -35778 -32991 -12094 -2218 12123 16085 6663 -8445
13248 -8445 2047 9634 8706 2199 14360 14909 -20371 -26887 -13678 -10362 -27828 -28836 3449 350
13234 350 -17182 -2379 -45 -1405 -2328 -12647 -17098 -24981 -37502 -14380 -1029 -4442 -32251
$$ packed form
13327C681R764m784K793L020N193M762j2854j4983k2575r346Q062J8158J8405
13314I296k1343o536K2001J6516n664M661j1901n57J0133j783o63j6919k6204
13301b8963j2657r60K461J0982j076R84p237J5723J7894p911j2433N260M164k54
13287a4023r813m394k169J6567J4333p475j2644q499R759L8070K3336o392l3269
13274C387k0320J223J1352J4054p379n31n923j4716p051N008r320j0082K2979
13261a7319K3646k0694J565j948n789j5239K787K0897R876J4341L962r422j5108
13248h445J0492P587r28o507J2161N49l5280o516J3209L316j7466j008L2285l099
13234C50j7532J4803K334j360r23j0319m451p883j2521K3122J3351l413k7809
$$ plain form
13221 -32251 -52683 -25832 -11307 -7279 -14729 -35267 -9229 -3546 -16306 -16954 -10944 -10034 -15828
13208 -15828 -23005 -24588 -8365 15416 26676 27214 9729 27318 19157 21592 42448 42840 18450
13195 18450 5825 -1269 -12301 -14977 7850 25179 25547 24426 13101 1700 12192 43579 31644
13182 31644 15725 1624 2097 19719 4205 3046 1640 1440 5920 -17540 -24110 -34248 -45082
13169 -45082 -58555 -67331 -44150 -7816 -7316 -12633 7354 222 -29941 -73173 -58755 -45666 -43826
13156 -43826 -41884 -35225 -29358 -21177 -20648 -30555 -20158 -27380 -19127 1190 7749 9595 18276 2611
13142 2611 -28035 -33048 -27652 -42912 -51319 -41835 -31350 -27083 -12241 -3305 4707 18047 13034
13129 13034 27798 17630 6067 -21908 -17481 -13667 1272 2275 26957 32545 34280 3190 -9676
$$ packed form
13221c2251k0432K6851J4525M028p450k0538K6038N683j2760o48O010R10n794
13208a5828p177j583J6223K3781J1260N38j7485J7589q161K435K0856L92k4390
13195A8450j2625p094j1032k676K2827J7329L68j121j1325j1401J0492L1387j1935
13182C1644j5919j4101M73J7622j5514j159j406k00M480k3460o570j0138j0834
13169d5082j3473q776K3181L6334N00n317J9987p132l0163m3232J4418J3089J840
13156d3826J942O659N867Q181N29r907J0397p222Q253K0317O559J846Q681j5665
13142B611l0646n013N396j5260q407R484J0485M267J4842Q936Q012J3340n013
13129A3034J4764j0168j1563k7975M427L814J4939J003K4682N588J735l1090j2866
$$ plain form
13116 -9676 11786 10328 12183 4493 14123 35668 30193 31596 18632 22418 1734 5152 -9268
13103 -9268 -17281 -22132 -12398 11520 -378 -23542 -50079 -35859 -20789 -18597 -12505 -10276 -3478
13090 -3478 -12020 -22921 -31767 -26763 -35803 -7023 -6772 -11399 11216 9029 -26629 -27616 -30394 -20516
13076 -20516 2539 30725 54515 28534 21751 33918 39964 45864 32303 8822 5594 10052 9348
13063 9348 2673 6280 2189 5153 12116 12546 -6256 -11698 -9442 17135 29456 22590 17918 23139
13049 23139 21264 23906 3819 -12304 -14727 -2130 10928 31879 33924 4764 -9028 1572
13037 1572 7482 4358 17992 30627 24177 16753 16741 14969 -13249 -11468 -5162 7555 846 -16260
13023 -16260 -950 4538 -2377 -28480 -24049 -7283 -2713 5537 -1702 -2714 -14661 12156 33584
$$ packed form
13116i676K1462j458J855p690R630K1545n475J403j2964L786k0684L418j4420
13103i268q013m851R734K3918j1898k3164k6537J4220J5070K192O092K229O798
13090c478q542j0901q846N004r040K8780K51m627K2615k187l5658r87k778R878
13076b0516K3055K8186K3790k5981o783J2167O046N900j3561k3481l228M458p04
13063I348o675L607m091K964O963M30j8802n442K256K6577J2321o866m672N221
13049B3139j875K642k0087j6123k423J2597J3058K0951K045k9160j3792J0600
13037A572N910l124J3634J2635o450p424j2j772k8218J781O306J2717o709j7106
13023a6260J5310N488o915k6103M431J6766M570Q250p239j012j1947K6817K1428
$$ plain form
13010 33584 24078 22452 27378 26190 15738 34305 62855 43262 38919 52914 36944 34271 18198
12997 18198 6657 14046 5152 -4953 -13252 -28728 -38802 -33661 -40570 -33355 -12359 -18223 -15621
12984 -15621 -26024 -34151 -30344 -10792 -16012 -7562 -17756 -29032 -43055 -23550 -13612 10245 16926
12971 16926 -1428 -16255 -30331 -13710 -11196 -5353 -19468 -25538 -14054 -1924 -4154 4024 14320
12958 14320 8043 -35691 -41723 -24690 4610 12107 -438 7982 29932 41633 33464 23740 -3648
12945 -3648 -19116 -15809 -17285 570 -4626 -2990 -1422 -1555 10250 13258 19565 1858 -5936 5058
12931 5058 14706 4339 -4372 -15480 -6811 10756 16575 9952 -2569 1785 -13025 -27918 -10334
12918 -10334 6985 17210 15631 4068 2093 10936 6870 -9766 13042 33960 38544 31794 33353
$$ packed form
13010C3584r506j626M926j188j0452J8567K8550j9593m343J3995j5970k673j6073
12997A8198j1541P389q894j0105q299j5476j0074N141o909P215K0996n864K602
12984a5621j0403q127L807J9552n220Q450j0194j1276j4023J9505R938K3857O681
12971A6926j8354j4827j4076J6621K514N843j4115o070J1484J2130k230Q178J0296
12958A4320o277m3734o032J7033K9300P497j2545Q420K1950J1701q169r724k7388
12945c648j5468L307j476J7855n196J636J568j33J1805L008O307j7707p794J0994
12931E058R648j0367q711j1108Q669J7567N819o623j2521M354j4810j4893J7584
12918a0334J7319J0225j579j1563j975Q843m066j6636K2808K0918M584o750J559
$$ plain form
12905 33353 16109 14788 27266 35110 20293 26848 38373 17525 -2638 -16930 -21629 3624
12893 3624 260 -33060 -41942 -25516 -12243 -13572 -33310 -36523 -16565 -24086 -20914 -30039 -24421
12880 -24421 -2450 10705 10059 23014 27254 2742 -18127 -24018 -11402 28995 43025 53287
12868 53287 38908 15793 5347 21034 21198 207 13071 20365 17387 24813 32273 14561 -11927
12855 -11927 -11552 -15887 -1318 -10029 -13361 -4063 -11861 -14920 -27510 -38069 -52710 -37370 -29821
12842 -29821 -20811 -21245 -7344 -8309 -25256 -19053 -40944 -36550 -31184 -19799 -24477 -8902 13388
12829 13388 32206 30706 19631 4014 -15154 -28079 -22809 -10243 -7249 -6684 5821 16438 27012
12816 27012 29914 42763 42074 36888 29273 19677 8575 23664 54576 34413 -7884 -20021 -17136
$$ packed form
12905C3353j7244j321J2478P844j4817O555J1525k0848k0163j4292m699K5253
12893C624l364l3320q882J6426J3273j329j9738l213J9958p521L172r125N618
12880b4421K1971J3155o46J2955M240k4512k0869n891J2616M0397J4030J0262
12868E3287j4379k3115j0446J5687J64k0991J2864P294k978P426P460j7712k6488
12855a1927L75m335J4569q711l332R298p798l059j2590j0559j4641J5340P549
12842b9821R010m34J3901r65j6947O203k1891M394N366J1385m678J5575K2290
12829A3388J8818j500j1075j5617j9168j2925N270J2566K994N65J2505J0617J0574
12816B7012K902J2849o89n186p615r596j1102J5089L0912k0163m2297j2137K885
$$ plain form
12803 -17136 -14318 -9190 -17333 -26239 -8237 -1239 -3533 -5416 -11840 -2526 -5929 -11921 5241 -7055
12789 -7055 6037 23352 41489 31100 12182 7063 4041 -5974 -13634 -11192 6994 -14558 -30369
12776 -30369 -35769 -34685 -37674 -24192 -9662 3815 919 -22952 -27855 -8790 -2996 10566 7608
12763 7608 -9063 -859 11515 8882 -5131 -371 -580 12506 15956 28531 26349 13645 7313
12750 7313 12343 3625 -7603 -9372 -5431 -15702 -14755 2336 4884 9926 8903 22492 27458 -2995
12736 -2995 -13980 11094 36251 52280 52127 37140 24917 20939 13761 14590 2488 8184 273
12723 273 -16346 -21978 -23081 -13803 -3017 -5547 -4692 -11998 -21127 -13686 5884 3068 13375 2283
12709 2283 21790 40343 40498 19287 5896 4573 18804 18051 9608 6058 17394 34624 45638
$$ packed form
12803a7136K818N128q143q906J8002O998k294j883o424R314l403n992J7162j2296
12789g055J3092J7315J8137j0389j8918n119l022j0015p660K442J8186k1552j5811
12776c0369n400J084k989J3482J4530J3477k896k3871m903J9065N794J3562k958
12763G608j6671Q204J2374k633j4013M760k09J3086L450J2575k182j2704o332
12750G313N030q718j1228j769L941j0271R47J7091K548N042j023J3589M966l0453
12736b995j0985K5074K5157J6029j53j4987j2223l978p178Q29j2102N696p911
12723B73j6619n632j103R278J0786k530Q55p306r129P441J9570k816J0307j1092
12709B283J9507J8553J55k1211j3391j323J4231p53q443l550J1336J7230J1014
$$ plain form
12696 45638 47998 45791 33307 31564 37610 24888 -509 -6842 -10530 -12121 -113 24812 25306
12683 25306 13425 10231 5107 8673 7273 8320 16301 12356 10753 -2756 -703 11911 21880 9923
12669 9923 -6607 -9141 8690 6751 14850 37526 8760 -2817 6187 6772 -241 6289 4485 -16225
12655 -16225 -28150 2071 27973 34333 9705 9654 26044 43289 37547 37490 45604 15331 10243 -4134
12641 -4134 -14228 -12050 -3174 -24503 -33971 -41222 -34467 -18572 -20432 12521 31648 27992 29941
12628 29941 29749 16730 29031 22085 -3554 1835 9161 2255 -2592 -18458 -10073 -21508 -29948
12615 -29948 -26289 -16741 -7238 -10822 -28896 -44076 -38960 -29071 -11565 1825 5016 1681 8759
12602 8759 8782 4296 3790 15694 20174 24101 35497 30091 23014 34748 40999 49784 44356 35776 29005
$$ packed form
12696D5638K360k207j2484j743O046j2722k5397o333l688j591J2008K4925M94
12683B5306j1881l194n124L566j400J047P981l945j603j3509K053J2614R969j1957
12669I923j6530k534J7831j939Q099K2676k8766j1577R004N85p013O530j804k0710
12655a6225j1925L0221K5902O360k4628n1J6390J7245n742n7Q114l0273n088j4377
12641d134j0094K178Q876k1329r468p251O755J5895j860L2953J9127l656J949
12628B9941j92j3019J2301o946k5639N389P326o906m847j5866Q385j1435q440
12615b9948L659R548R503l584j8074j5180N116R889J7506J3390L191l335P078
12602H759K3m486n06J1904M480L927J1396n406p077J1734O251Q785n428q580o771
$$ plain form
12587 29005 20570 16877 20615 8562 17391 27062 34893 23625 22405 47894 38363 26085 3227
12574 3227 -15699 -21964 -20013 -9889 -13306 -6201 -4481 -21269 -31212 -8646 6758 16098 6996
12561 6996 20520 21042 17884 12656 7765 3978 15176 24007 17625 21430 15498 17235 29888 18090
12547 18090 34091 37355 29821 30709 44630 30984 30681 20383 2010 564 113 20829 47884
12534 47884 67351 55473 43348 37267 45345 57020 58349 72796 105551 153424 223948 286258
12522 286258 326014 343193 322137 248963 192111 120511 76656 66740 67567 52304 34487 38765
12510 38765 47189 38704 32283 18648 16343 25274 19958 27177 35039 26618 33081 37833 39947 19107
12496 19107 6431 -4729 -13636 -16425 6332 27157 45359 34894 31210 39038 31762 9721 -4228
$$ packed form
12587B9005q435l693L738j2053Q829R671P831j1268j220K5489r531j2278k2858
12574C227j8926o265J951J0124l417P105J720j6788r943K2566J5404R340r102
12561F996J3524N22l158n228m891l787J1198Q831o382L805n932J737J2653j1798
12547A8090J6001L264p534Q88J3921j3646l03j0298j8373j446m51K0716K7055
12534D7884J9467j1878j2125o081Q078J1675J329J4447L2755M7873P0524O2310
12522B86258L9756J7179k1056p3174n6852p1600m3855r916Q27j5263j7817M278
12510C8765Q424q485o421j3635k305Q931n316P219P862q421O463M752K114k0840
12496A9107j2676j1160q907k789K2757K0825J8202j0465l684P828p276k2041j3949
$$ plain form
12483 -4228 -11187 -15901 -6491 1777 6081 31553 31181 11724 5349 -8343 -1588 10080 2802 -11873
12469 -11873 -21661 -12912 -12399 5019 15416 16483 6826 1553 -11451 -12356 -691 14315 19990 15657
12455 15657 10808 12232 28417 8002 -14599 -19003 3045 -3861 -11596 5193 10622 -8767 786
12442 786 -1149 -5225 -1232 -14559 -16357 8120 22600 22956 19030 -3784 -5561 8488 10024 11113
12428 11113 15635 12543 36931 39949 17635 -6837 6639 5556 -9930 -10796 15934 22299 3118
12415 3118 1830 4120 7396 15392 8480 2882 6014 5375 -14691 -18006 -13338 -9232 -20255 -29503
12401 -29503 -36973 -38572 -46312 -36526 -14824 2597 -13636 -8843 5464 26899 35212 26706 18337
12388 18337 21934 35700 14907 28959 32743 4420 2696 14986 10925 -7645 15969 37864
$$ packed form
12483d228o959m714R410Q268M304K5472l72j9457o375j3692O755J1668p278j4675
12469a1873r788Q749N13J7418J0397J067r657n273j3004r05J1665J5006N675m333
12455A5657m849J424J6185k0415k2601m404K2048o906p735J6789N429j9389R553
12442G86j935m076L993j3327j798K4477J4480L56l926k2814j777J4049J536J089
12428A1113M522l092K4388L018k2314k4472J3476j083j5486q66K6730O365j9181
12415C118j288K290L276P996o912n598L132o39k0066l315M668M106j1023r248
12401b9503p470j599p740R786K1702J7421j6233M793J4307K1435Q313q506q369
12388A8337L597J3766k0793J4052L784k8323j724J2290m061j8570K3614K1895
$$ plain form
12376 37864 28590 11167 14622 9563 12772 16989 11198 -31232 -46209 -49342 -31740 -13118 526
12363 526 14725 5626 -14849 -3128 15529 18188 8 -4515 -1182 -6673 -16137 -13472 -8279 -5788
12349 -5788 -14598 -22250 -1433 -12814 -9961 -5342 3642 13242 31756 39755 37125 32642 11541 -7153
12335 -7153 -16281 -18147 3238 30088 16628 -8550 -19040 -35304 -33610 -6545 15309 9555 5908
12322 5908 -5749 -15125 -1074 8432 4154 423 -5672 -7368 -21979 -16183 5439 16127 16050 4162
12308 4162 -14506 -44527 -17672 -4053 21757 25429 -6608 -41177 -43915 -6444 -6357 -17334 -15646
12295 -15646 4064 19205 16665 22728 21825 18549 7161 927 -3020 -9266 -7323 -14633 -28068 -32552
12281 -32552 -15354 6911 -3998 -12879 -12435 -13747 -17616 -16643 -8226 -11354 -15469 -9023 -21018 -30059
$$ packed form
12376C7864r274j7423L455n059L209M217n791m2430j4977l133J7602J8622J3644
12363E26J4199r099k0475J1721J8657K659j8180m523L333n491r464K665N193K491
12349e788q810p652K0817j1381K853M619Q984R600J8514P999k630m483k1101j8694
12335g153r128j866K1385K6850j3460k5178j0490j6264J694K7065K1854n754l647
12322E908j1657r376J4051R506m278l731o095j696j4611N796K1622J0688p7j1888
12308D162j8668l0021K6855J3619K5810L672l2037l4569k738L7471Q7j0977J688
12295a5646J9710J5141k540O063r03l276j1388o234l947o246J943p310j3435m484
12281c2552J7198K2265j0909q881M44j312l869R73Q417l128m115O446j1995r041
$$ plain form
12267 -30059 -20506 -25242 -32208 -24474 -31824 -26740 -29772 -7516 -3228 -316 -8023 -16925 -13332 -10573
12253 -10573 -19395 -27212 -15631 -515 12455 14460 -1688 -19993 -10673 4829 20230 17431 4175
12240 4175 -2977 -1356 9910 11195 3413 8075 25593 32646 32434 20308 11292 -1923 -1463 -10181
12226 -10181 -10600 -7789 -2847 -5393 -3766 5289 20819 19810 21289 28425 24342 22518 15523 8296
12212 8296 8442 13243 -3737 -13073 -8452 2359 -75 -25884 -31626 -29298 -20430 -28449 -24825 -27512
12198 -27512 -25459 -14492 22007 43185 32729 12039 3592 -9162 -11378 -4701 -22802 -40686
12186 -40686 -33841 -14126 7413 14190 16822 10073 4798 -4481 -19379 -27238 -9413 4618 23807
12173 23807 27796 5738 14001 9101 13719 4589 3550 9434 9074 585 6964 10119 15718 20900
$$ packed form
12267c0059R553m736o966P734p350N084l032K2256M288K912p707q902L593K759
12253a0573q822p817J1581J5116J2970K005j6148j8305R320J5502J5401k799j3256
12240D175p152J621J1266J285p782M662J7518P053k12j2126r016j3215M60q718
12226a0181m19K811M942k546J627R055J5530j009J479P136m083j824o995p227
12212H296J46M801j6980r336M621J0811k434k5809n742K328Q868q019L624k687
12198b7512K053J0967L6499K1178j0456k0690q447j2754k216O677j8101j7884
12186d0686O845J9715K1539O777K632o749n275r279j4898p859J7825J4031J9189
12173B3807L989k2058Q263m900M618r130j039N884l60q489O379L155N599N182
$$ plain form
12159 20900 9925 -18198 -21382 -11985 10256 30244 16903 -4536 -11320 7943 9705 7745 10740
12146 10740 534 -12477 -18989 -20655 -11383 -16242 -21136 -23155 -14419 -10392 -22604 -31381 -26864 -45890
12132 -45890 -50402 -47701 -18619 11890 47596 43848 -894 -39795 -20432 -7206 27517 37966
12120 37966 34400 36297 19142 12387 20122 7791 -8283 -11776 -23779 -21319 -13227 4286 -2161
12107 -2161 2680 20872 6198 16766 20051 11177 6259 13925 13118 22774 33683 28279 18889 4325
12093 4325 12502 15975 34779 32125 18001 28190 45251 40308 11364 15253 21958 29088 42324
12080 42324 54061 53470 48773 50282 48433 65560 63201 46300 36816 23068 2315 28878 32183
12067 32183 -2250 -15262 -7628 16485 14996 8458 13140 20876 17285 19038 29755 15424 4195
$$ packed form
12159B0900j0975k8123l184R397K2241J9988j3341k1439o784J9263J762j960K995
12146A0740j0206j3011o512j666R272m859m894k019Q736M027j2212q777M517j9026
12132d5890m512K701K9082L0509L5706l748m4742l8901J9363J3226L4723J0449
12120C7966l566J897j7155o755P735j2331j6074l493j2003K460Q092J7513o447
12107b161M841J8192j4674J0568L285q874m918P666q07R656J0909n404r390j4564
12093D325Q177L473J8804k654j4124J0189J7061m943k8944L889O705P130J3236
12080D2324J1737n91m697J509j849J7127k359j6901r484j3748k0753K6563L305
12067C2183l4433j3012P634K4113j489o538M682P736l591J753J0717j4331j1229
$$ plain form
12054 4195 -3433 12825 12358 15814 23111 29931 32523 32461 33892 31813 21911 8156 4680 10342 8269
12039 8269 -12243 -18201 -21374 -9001 -14396 -11738 -8973 -10313 12335 18253 3949 25733 16991
12026 16991 18664 25384 18713 19220 37043 39899 31013 18939 29273 38189 43492 54943 40266
12013 40266 26243 23683 18703 5741 -10935 12181 29770 28927 18763 20239 13472 -2299 134
12000 134 -4454 3692 20575 26089 14705 12323 26337 44167 46121 25041 12399 -6293 1533
11987 1533 -2367 8226 -202 -13898 -17173 -7193 17179 23697 7934 9435 13207 17428 21668 44098
11973 44098 32406 21213 28834 39109 37599 33691 17383 11964 6632 -15600 -20886 2274 24429
11960 24429 19047 12885 1840 7442 11605 16195 8917 -8706 -3861 7187 15258 25548 46242
$$ packed form
12054D195p628J6258m67L456P297O820K592o2J431k079r902j3755l476N662k073
12039H269k0512n958l173J2373n395K658K765j340K2648N918j4304K1784q742
12026A6991J673O720o671N07J7823K856q886j2074J0334Q916N303J1451j4677
12013D0266j4023k560m980j2962j6676K3116J7589q43j0164J476o767j5771K433
12000A34m588Q146J6883N514j1384k382J4014J7830J954k1080j2642j8692P826
11987A533l900J0593q428j3696l275R980K4372O518j5763J501L772M221M240K2430
11973D4098j1692j1193P621J0275j510l908j6308n419n332k2232n286K3160K2155
11960B4429n382o162j1045N602M163M590p278j7623M845J1048Q071J0290K0694
$$ plain form
11947 46242 29485 2144 -6615 18387 13144 11903 24979 40317 57283 57594 50384 26511 27221
11934 27221 19882 6815 -21076 -31017 -15839 -7819 18189 43814 45149 20130 47699 59228
11922 59228 41054 26781 30706 25348 3326 -3774 -16106 -4192 28863 42984 57129 50089
11910 50089 41078 25871 11260 15980 -1422 8812 13213 11533 12551 9540 19976 9821 8974
11897 8974 28376 25770 30258 28995 15937 12834 3799 10976 -2836 -7437 -11561 -9911 8926 884
11883 884 -12730 -2845 -31899 -27738 -12526 -21740 -27340 -18364 -14877 -13149 -41243 -35868 -23328 -25628
11869 -25628 -28580 -16306 -16565 5463 21330 4878 -11787 -23395 -26456 -18657 -7032 -6960 -7684 -18865
11855 -18865 -26492 -25068 -15086 -33028 -30070 -24713 -33412 -30384 -10565 -2086 -1259 -8971 3148 11582
$$ packed form
11947D6242j6757k7341q759K5002n243j241J3076J5338J6966L11p210k3873P10
11934B7221p339j3067k7891r941J5178Q020K6008K5625J335k5019K7569J1529
11922E9228j8174j4273L925n358k2022p100j2332J1914L3055J4121J4145p040
11910E0089r011j5207j4611M720j7402J0234M401j680J018l011J0436j0155q47
11897H974J9402k606M488j263j3058l103r035P177j3812m601m124J650J8837q042
11883H84j3614R885k9054M161J5212r214n600Q976L487J728k8094N375J2540k300
11869b5628k952J2274k59K2028J5867j6452j6665j1608l061P799J1625P2p24j1181
11855a8865p627J424R982j7942K958N357q699L028J9819Q479Q27p712J2119Q434
$$ plain form
11841 11582 183 10035 47267 40103 31828 17402 -4384 -4450 9915 14036 6285 6243 17269 13137
11827 13137 12309 1792 -14555 -20663 -15794 -13737 1274 -16395 -8726 5830 -4593 -17026 -6564
11814 -6564 -5364 -2159 20495 17823 14871 14883 -7528 -15159 -7278 -11547 8258 10519 -1831 2981
11800 2981 18129 24823 24642 20162 1252 9173 17395 4725 7832 -19095 -25982 -20918 4047 7360
11786 7360 9677 9082 10659 9266 6603 -7763 -7394 5048 10505 2719 21154 5133 -489 20660
11772 20660 28859 15125 6758 7050 123 5207 -9456 -10116 5822 -1614 8667 30837 24995 31475
11758 31475 32608 27538 23840 -3843 -13718 -8087 -35203 -37926 -3148 18288 16780 19888 28561
11745 28561 40754 29810 5697 -855 7590 12938 7293 -2180 4612 18982 17634 8178 7451 -5479
$$ packed form
11841A1582j1399R852L7232p164q275j4426k1786o6J4365M121p751m2J1026m132
11827A3137q28j0517j6347o108M869K057J5011j7669P669J4556j0423j2433J0462
11814f564J200L205K2654k672k952J2k2411p631P881m269J9805K261j2350M812
11800B981J5148O694j81m480j8910P921Q222j2670L107k6927o887N064K4965L313
11786G360K317n95J577j393k663j4366L69J2442N457p786J8435j6021n622K1149
11772B0660Q199j3734q367K92o927N084j4663o60J5938p436J0281K2170n842O480
11758C1475J133n070l698k7683r875N631k7116k723L4778K1436j508L108Q673
11745B8561J2193j0944k4113o552Q445N348n645r473O792J4370j348r456p27j2930
$$ plain form
11731 -5479 -21423 -14977 -4867 -4905 9317 25892 15269 -29514 -42923 -25165 6149 13559 8548
11718 8548 31725 39516 13746 -24454 -16868 19540 28068 5784 3311 9234 12385 6801 6819 15474
11704 15474 7643 -1758 10875 23947 22200 413 -12834 -869 -1484 2 -12168 -2953 19816
11691 19816 25813 27144 22805 26046 6918 2959 12827 11477 -155 -13311 13044 12734 -11341
11678 -11341 -20600 -6833 -3358 7791 9051 18787 25945 15780 11466 -2983 -18122 1861 8428
11665 8428 -13534 -11129 -23553 -43767 -48384 -38055 -43332 -39111 -28234 -25337 -38000 -28198 -21378
11652 -21378 -22427 -9644 -1114 9148 22951 20578 20343 23096 7157 16914 14437 15254 31401 42194
11638 42194 42731 43805 48252 41376 33323 8200 -18122 -23774 -18807 -10428 -6733 133 9587 22463
$$ packed form
11731e479j5944O446J0110l8J4222J6575j0623m4783j3409J7758L1314P410n011
11718H548K3177P791k5770l8200P586L6408Q528k2284k473N923L151n584J8Q655
11704A5474p831r401J2633J3072j747k1787j3247J1965o15J486j2170R215K2769
11691A9816N997J331m339L241j9128l959R868j350j1632j3156K6355l10k4075
11678a1341r259J3767L475J1149J260R736P158j0165m314j4449j5139J9983O567
11665H428k1962K405j2424k0214m617J0329n277M221J0877K897j2663R802O820
11652b1378j049J2783Q530J0262J3803k373k35K753j5939R757k477Q17J6147J0793
11638D2194N37J074M447o876q053k5123k6322n652M967Q379L695O866R454J2876
$$ plain form
11624 22463 -3786 -15289 2582 7214 -5510 -16286 -14954 -17722 11296 44905 39029 27625
11612 27625 49735 47243 37401 28559 32534 25325 12958 -17805 -14317 -6154 -10701 -11562 3423 -1017
11598 -1017 3303 9854 26299 47435 64605 62189 43976 51328 66566 59435 54534 49835 45368
11585 45368 59711 44092 19398 14281 23049 7287 4772 10828 7222 23276 26972 10400 11074
11572 11074 3196 14205 13375 -3080 2082 8202 -8322 -6637 1431 15603 13410 35219 45937
11559 45937 42654 42430 26044 21359 18418 35731 34372 51878 31174 25053 31055 27442 19323 11473
11545 11473 8181 6956 9652 13976 23743 16790 13485 18038 17604 879 6921 12907 12740 6169 5906
11530 5906 18092 19064 17300 20677 13336 15631 8895 4137 -797 -1111 -5558 2856 15420 31704
$$ packed form
11624B2463k6249j1503J7871M632j2724j0776J332k768K9018L3609n876j1404
11612B7625K2110k492r842q842L975p209j2367l0763L488Q163m547q61J4985m440
11598a017M320O551J6445K1136J7170k416j8213P352J5238p131m901m699m467
11585D5368J4343j5619k4694n117Q768j5762k515O056l606J6054L696j6572O74
11572A1074p878J1009q30j6455N162O120j6524J685Q068J4172k193K1809J0718
11559D5937l283k24j6386m685k941J7313j359J7506k0704o121O002l613q119p850
11545A1473l292j225K696M324R767o953l305M553m34j6725O042N986j67o571k63
11530E906J2186R72j764L377p341K295o736m758m934l14m447Q414J2564J6284
$$ plain form
11516 31704 41986 28759 35615 51225 59483 39500 19482 23236 25068 29084 32216 40292 43235
11503 43235 44186 41861 38212 16243 -8346 1830 26775 53820 64396 7472 -16198 -11551 2385
11490 2385 20272 33254 25801 19589 19242 25469 19909 19490 12318 7698 14696 13972 2217 15918
11476 15918 33109 15118 7420 -18263 -64610 -50828 -15577 9538 10781 7295 7554 -300 149
11463 149 15525 11609 17667 34068 37735 20021 13861 -138 -8142 -5018 -3532 7894 10757 17661
11449 17661 33260 55496 42853 15937 -5154 11947 12881 6714 10529 4449 11372 12561 2069
11436 2069 29215 33332 23323 -2039 -14177 -7327 20259 24534 19 -11983 22440 33069
11424 33069 18178 12209 18402 42896 40784 31329 27135 42695 43119 28696 16157 8729 7956 -1618
$$ packed form
11516C1704J0282j3227O856J5610Q258j9983k0018L754J832M016L132Q076K943
11503D3235R51k325l649k1969k4589J0176K4945K7045J0576n6924k3670M647J3936
11490B385J7887J2982p453o212l47O227n560m19p172m620O998p24j1755J3701
11476A5918J7191j7991p698k5683m6347J3782L5251K5115J243l486K59p854M49
11463A49J5376l916O058J6401L667j7714o160j3999q004L124J486J1426K863O904
11449A7661J5599K2236j2643k6916k1091J7101R34o167L815o080O923J189j0492
11436B069K7146M117j0009k5362j2138O850K7586M275k4515j2002L4423J0629
11424C3069j4891n969O193K4494k112r455m194J5560M24j4423j2539p428p73r574
$$ plain form
11410 -1618 2710 19718 13631 -3665 -3928 29684 53921 51992 49026 32696 37257 36955 33141 29152
11396 29152 31451 23188 8347 11649 25578 47807 54218 30019 37971 41846 39245 34834 20776
11383 20776 1525 6970 6514 12543 22285 7272 -1213 20097 45112 38695 18613 8787 5836
11370 5836 21795 22195 15922 27801 30332 27561 19525 12392 20589 7443 19902 20694 14583 22976
11356 22976 40396 48207 38955 26360 25549 13799 7471 10157 37857 41039 41916 31168 11786
11343 11786 11012 9873 27084 31552 22426 9040 13786 12993 3086 14153 27818 18662 12835 6654
11329 6654 2398 -8117 258 1304 23691 29836 30874 29537 33125 43653 43292 41014 31366 37561
11315 37561 32737 27801 45528 40881 34919 43141 56813 43951 23787 11880 12404 40018 43325
$$ packed form
11410a618M328J7008o087j7296k63L3612K4237j929k966j6330M561l02l814l989
11396B9152K299q263j4841L302J3929K2229O411k4199P952L875k601m411j4058
11383B0776j9251N445m56O029R742j5013q485K1310K5015o417k0082r826k951
11370E836J5959M00o273J1879K531k771q036p133Q197j3146J2459P92o111Q393
11356B2976J7420P811r252j2595q11j1750o328K686K7700L182Q77j0748j9382
11343A1786p74j139J7211M468r126j3386M746p93r907J1067J3665r156n827o181
11329F654m256j0515Q375J046K2387O145J038j337L588J0528l61k278r648O195
11315C7561m824m936J7727m647n962Q222J3672j2862k0164j1907N24K7614L307
$$ plain form
11302 43325 31465 19521 7393 -21411 -25187 -14184 11808 5320 2259 24688 52467 43672
11290 43672 30960 32025 27409 23819 16165 24976 25444 16045 30300 63931 56761 31931 26634 23526
11276 23526 35913 22785 25364 9967 -14700 -9086 -3841 16530 25684 55426 71917 70240 70963
11263 70963 66788 44894 43139 46704 31973 37187 38322 26103 17238 7485 8281 32030 22710 19025
11249 19025 20916 42651 47158 30731 44979 46439 49685 72989 66033 46370 44209 51298 67691
11236 67691 65519 40030 33736 24826 43489 71338 88254 76147 72173 69818 50571 55625 57930
11223 57930 38020 38520 37403 26614 18844 10863 20154 37854 31007 36732 43050 20684 25935 23662
11209 23662 21426 16046 4148 7235 21816 40368 66259 67107 72963 79270 80057 56390 46881 46928
$$ packed form
11302D3325j1860j1944j2128k8804l776J1003K5992o488l061K2429K7779q795
11290D3672j2712J065m616l590p654Q811M68r399J4255L3631p170k4830n297l108
11276B3526J2387j3128K579j5397k4667N614N245K0371R154K9742J6491j677P23
11263G0963m175k1894j755L565j4731N214J135j2219q865r753P96K3749r320l685
11249A9025J891K1735M507j6427J4248J460L246K3304o956j9663k161P089J6393
11236F7691k172k5489o294q910J8663K7849J6916j2107l974k355j9247N054K305
11223E7930j9910N00j117j0789p770p981R291J7700o847N725O318k2366N251k273
11209B3662k236n380j1898L087J4581J8552K5891Q48N856O307P87k3667r509M7
$$ plain form
11195 46928 60089 44951 39036 53613 53318 63957 60812 63800 49412 29155 16634 -7955 10434
11182 10434 35571 25574 16735 22077 34068 55791 66633 48801 28223 25060 57710 75533
11170 75533 72330 67055 72799 78254 85278 78467 74022 73283 59981 43499 34451 56155 65332 56743
11156 56743 49993 39193 38062 37900 60733 65812 67043 61712 58518 57428 53476 47058 40392 54652
11142 54652 52550 41817 40940 56096 66969 89239 115759 146923 159235 169710 173271 182222 196866
11129 196866 185782 158597 154850 157938 150626 136064 126007 108073 79569 91286 118859 143935
11117 143935 179351 203243 241043 287511 358646 468267 627130 864605 1157862 1442107
11107 1442107 1625284 1690021 1523335 1224937 957903 695952 517030 417667 330473 251822
$$ packed form
11195D6928J3161j5138n915J4577k95J0639l145K988j4388k0257j2521k4589J8389
11182A0434K5137r997q839N342J1991K1723J0842j7832k0578l163L2650J7823
11170G5533l203n275N744N455P024o811m445p39j3302j6482r048K1704R177q589
11156E6743o750j0800j131j62K2833N079J231n331l194j090l952o418o666J4260
11142E4652k102j0733q77J5156J0873K2270K6520L1164J2312J0475L561Q951J4644
11129A96866j1084k7185l747L088p312j4562j0057j7934k8504J1717K7573K5076
11117A43935L5416K3892L7800M6468P1135J09621J58863K37475K93257K84245
11107A442107J83177O4737j66686k98398k67034k61951j78922r9363q7194p8651
$$ plain form
11097 251822 208535 186697 183966 161845 129444 116417 118816 119266 101818 98711 114329 151332
11085 151332 129574 96592 92061 117705 124221 101703 99781 111946 127927 131797 96080 87023
11073 87023 92806 101592 94806 72940 67042 51957 40917 68668 95612 93108 83672 65714 74428
11060 74428 88809 81412 64443 59795 70278 111694 115732 99484 98533 106630 96166 101942 99536
11047 99536 93115 83025 91614 114088 105532 104995 99351 73275 66693 76042 77934 57628 46601
11034 46601 45663 38702 50598 32128 28343 36418 42332 69592 68052 78264 68498 51807 48738
11021 48738 64340 82759 74950 61000 33316 27206 29987 54263 93916 130049 113579 99777
11009 99777 98999 85086 83395 77455 59531 34075 50635 81952 72771 85910 85548 82959 97374
$$ packed form
11097B51822m3287k1838k731k2121l2401j3027K399M50j7448l107J5618L7003
11085A51332k1758l2982m531K5644O516k2518j922J2165J5981L870l5717r057
11073H7023N783Q786o786k1866n898j5085j1040K7751K6944k504r436j7958Q714
11060G4428J4381p397j6969m648J0483M1416M038j6248r51Q097j0464N776k406
11047I9536o421j0090Q589K2474q556n37n644k6076o582R349J892k0306j1027
11034D6601r38o961J1896j8470l785Q075N914K7260j540J0212r766j6691l069
11021D8738J5602J8419p809j3950k7684o110K781K4276L9653L6133j6470j3802
11009I9777p78j3913j691n940j7924k5456J6560L1317r181J3139l62k589J4415
$$ plain form
10996 97374 107674 102879 96423 90927 87634 83967 81804 66733 70951 65852 63690 60755 53003 41686
10982 41686 53657 76387 84081 98297 103550 110645 110104 95235 79320 93700 85563 73670 77115
10969 77115 74298 65821 62010 86354 99616 101101 107416 86084 95103 88637 87985 120252 120952 134614
10955 134614 156416 172737 189321 178841 221951 298988 359006 422872 511537 537780 480822
10944 480822 396132 306736 230477 197157 192608 191549 164832 161981 156172 151984 156543 169035 174517
10931 174517 170413 167568 172831 173975 189440 187373 196188 197215 174684 163690 172865 161063 145662
10918 145662 148567 152083 142215 139410 145847 140144 130367 129144 138191 143375 135094 142617 138191 129906
10904 129906 122578 132734 136959 152607 168357 166414 156001 148697 168247 180161 179958 224623 256595
$$ packed form
10996I7374J0300m795o456n496l293l667k163j5071M218n099k162k935p752j1317
10982D1686J1971K2730P694J4216N253P095n41j4869j5915J4380q137j1893L445
10969G7115k817q477l811K4344J3262J485O315k1332R019o466o52L2267P00J3662
10955A34614K1802J6321J6584j0480M3110P7037O0018O3866Q8665K6243n6958
10944D80822q4690q9396p6259l3320m549j059k6717k851n809m188M559J2492N482
10931A74517m104k845N263J144J5465k067Q815J027k2531j0994R175j1802j5401
10918A45662K905L516r868k805O437n703r777j223R047N184q281P523m426q285
10904A29906p328J0156M225J5648J5750j943j0413p304J9550J1914k03M4665L1972
$$ plain form
10891 256595 238235 225501 243396 248367 229215 189741 161904 132271 107966 78748 67821 59143
10879 59143 51328 83457 119860 125835 162254 196988 195085 204825 218297 236084 254929 253106 214524
10866 214524 201605 200909 214419 210003 226214 226172 221614 213271 203944 205831 194772 187788 208357 229534
10852 229534 271218 305124 323565 329347 316635 306342 285521 254610 246426 263918 285286 271087
10840 271087 278135 290365 286110 284041 278213 287720 286001 289346 281536 287736 304940 315168 317069
10827 317069 313403 340415 366981 410835 419646 410431 387645 350055 324155 317605 332261 365240
10815 365240 378785 375300 365891 342119 337833 363414 356137 334327 324990 338177 370978 399951
10803 399951 418690 413075 429597 430161 449023 466494 480679 466948 453344 479312 489319 503205
$$ packed form
10891B56595j8360j2734J7895M971j9152l9474k7837k9633k4305k9218j0927q678
10879E9143p815L2129L6403N975L6419L4734j903R740J3472J7787J8845j823l8582
10866B14524j2919o96J3510m416J6211m2m558q343r327J887j1059o984K0569K1177
10852B29534M1684L3906J8441N782j2712j0293k0821l0911q184J7492K1368j4199
10840B71087P048J2230m255k069n828R507j719L345p810O200J7204J0228J901
10827C17069l666K7012K6566M3854Q811r215k2786l7590k5900o550J4656L2979
10815C65240J3545l485r409k3772m286K5581p277k1810r337J3187L2801K8973
10803C99951J8739n615J6522N64J8862J7471J4185j3731j3604K5968J0007J3886
$$ plain form
10791 503205 505508 501392 510584 523933 543874 549257 547106 547619 552020 563602 586557 601330 638524
10778 638524 652566 653932 661672 698745 734564 760715 773396 765807 796768 802395 806066 838106
10766 838106 856972 857100 853334 883791 927578 952162 995965 1018597 1018087 1027192 1063618 1088207 1135874
10753 1135874 1168899 1175122 1193596 1239525 1288363 1341026 1376111 1390852 1424893 1488255 1562195
10742 1562195 1608471 1664623 1748223 1827399 1881330 1931339 2014938 2110365 2199259 2291909 2416038
10731 2416038 2548734 2694943 2862123 3053764 3256036 3486664 3696202 3911113 4159481
10722 4159481 4443210 4764609 5187586 5749407 6452660 7208673 7913551 8565306 9132748
10713 9132748 9572047 10085062 10842681 11885916 13277213 15055648 17323420 20177532 23835627
$$ packed form
10791E03205K303m116R192J3349J9941N383k151N13M401J1582K2955J4773L7194
10778F38524J4042J366P740L7073L5819K6151J2681p589L0961N627L671L2040
10766H38106J8866J28l766L0457M3787K4584M3803K2632n10R105L6426K4589M7667
10753A135874L3025O223J8474M5929M8838N2663L5085J4741L4041O3362P3940
10742A562195M6276N6152Q3600P9176N3931N0009Q3599R5427Q8894R2650J24129
10731B416038J32696J46209J67180J91641K02272K30628K09538K14911K48368
10722D159481K83729L21399M22977N61821P03253P56013P04878O51755N67442
10713I132748M39299N13015P57619J043235J391297J778435K267772K854112L658095
$$ plain form
10704 23835627 28609133 34846235 43364005 55358816 72667947 98308009 135579532
10697 135579532 184874535 238367392 280303198 304241434 297061823 246340772 184537077
10690 184537077 134947068 99173360 74578616 58016853 46838007 39002773 33145621
10683 33145621 28576699 25020506 22159911 19838103 17972646 16449445 15165307 14088504
10675 14088504 13194918 12494983 11957915 11451681 10910412 10270885 9435215 8569171 7812298
10666 7812298 7178139 6635691 6153590 5742754 5419308 5153469 4928940 4718253 4536270
10657 4536270 4375934 4195993 4043992 3901274 3752846 3596018 3479577 3357250 3239847
10648 3239847 3150665 3090858 3039532 2995152 2936305 2803573 2650543 2517738 2400915 2271905
$$ packed form
10704B3835627M773506O237102Q517770J1994811J7309131K5640062L7271523
10697A35579532M9295003N3492857M1935806K3938236p179611n0721051o1803695
10690A84537077m9590009l5773708k4594744j6561763j1178846p835234n857152
10683C3145621m568922l556193k860595k321808j865457j523201j284138j076803
10675A4088504q93586o99935n37068n06234n41269o39527q35670q66044p56873
10666G812298o34159n42448m82101m10836l23446k65839k24529k10687j81983
10657D536270j60336j79941j52001j42718j48428j56828j16441j22327j17403
10648C239847q9182n9807n1326m4380n8847j32732j53030j32805j16823j29010
$$ plain form
10638 2271905 2158558 2067639 2004528 1929180 1875245 1816358 1741468 1664689 1594659 1534636 1473556
10627 1473556 1421849 1386510 1357731 1329702 1288373 1248751 1210128 1167852 1117056 1074184 1046600
10616 1046600 1018672 978212 944561 931150 914748 886353 874079 842303 834077 818405 811563 804874
10604 804874 762705 737863 712898 698380 685556 680565 655162 626316 609405 596833 598122 596491
10592 596491 587100 569120 556107 531279 512138 500340 485344 510039 533340 539348 510650 485079
10580 485079 484564 502164 515996 496241 478426 494936 501125 509126 526208 552710 555605 585244
10568 585244 611538 617838 616262 594228 564373 518206 477826 431243 403528 374564 349263 308481
10556 308481 285928 277948 249758 235679 248632 230452 236775 254359 259900 258726 239852 218692
$$ packed form
10638B271905j13347r0919o3111p5348n3935n8887p4890p6779p0030o0023o1080
10627A473556n1707l5339k8779k8029m1329l9622l8623m2276n0796m2872k7584
10616A046600k7928m0460l3651j3411j6402k8395j2274l1776q226j5672o842o689
10604H04874m2169k4842k4965j4518j2824m991k5403k8846j6911j2572J289j631
10592E96491r391j7980j3013k4828j9141j1798j4996K4695K3301O008k8698k5571
10580D85079n15J7600J3832j9755j7815J6510O189Q001J7082K6502K895K9639
10568E85244K6294O300j576k2034k9855m6167m0380m6583k7715k8964k5301m0782
10556C08481k2553p980k8190j4079J2953j8180O323J7584N541j174j8874k1160
$$ plain form
10544 218692 208455 196126 188882 167403 140734 122487 147847 144050 138929 150039 147145 183735
10532 183735 215105 230084 229033 211516 205363 186860 186090 172867 172206 173257 151726 140053 124784
10519 124784 120587 114391 101984 103591 103563 107301 99258 122132 161348 170627 173630 177231 173491 160508
10505 160508 140897 123935 94834 52437 49543 36291 26753 16026 13033 26352 26976 9943
10493 9943 14752 21647 33481 58459 70521 81758 83418 60652 35392 18390 38839 56773
10481 56773 63188 70712 68400 62789 43183 44263 62716 54236 29106 14348 20134 24102 33365
10468 33365 60275 56476 64553 50333 23711 2365 -25612 -55051 -57179 -33404 -112 18147
10456 18147 9437 4165 21186 33260 25140 20483 24759 34093 34374 41538 51399 36119 38929 28333
$$ packed form
10544B18692j0237j2329p244k1479k6669j8247K5360l797n121J1110k894L6590
10532A83735L1370J4979j051j7517o153j8503p70j3223o61J051k1531j1673j5269
10519A24784m197o196j2407J607k8L738q043K2874L9216R279L003L601l740j2983
10505A60508j9611j6962k9101m2397k894j3252r538j0727k993J3319O24j7033
10493I943M809O895J1834K4978J2062J1237J660k2766k5260j7002K0449J7934
10481E6773O415P524k312n611j9606J080J8453q480k5130j4758N786L968R263
10468C3365K6910l799Q077j4220k6622k1346k7977k9439k128K3775L3292J8259
10456A8147q710n272J7021J2074q120m657M276R334K81P164R861j5280K810j0596
$$ plain form
10442 28333 35355 38294 61882 88495 74711 58994 37460 27740 36462 45705 63836 64911 63573
10429 63573 49129 49365 45514 19894 444 -6564 -7923 -3690 -2441 11738 47666 40402 6485
10416 6485 -807 9750 5209 407 3686 14906 34580 46858 70366 50569 46048 51474 34114
10403 34114 33551 43009 64067 58678 49972 47157 35834 40048 56942 49560 33709 59096 72727
10390 72727 68164 69815 58259 48848 56814 59303 55400 53121 45326 71006 85219 73766 82874
10377 82874 97785 96180 88429 92998 100407 100634 113374 128258 116601 112519 113756 97584 78788
10364 78788 84430 92332 96901 116126 132716 129591 148025 154311 181610 213012 237484 272013 276728
10351 276728 277611 293067 312297 338296 367706 413144 471383 542994 638751 755880 901574
$$ packed form
10442B8333P022K939K3588K6613j3784j5717k1534r720Q722R243J8131J075j338
10429F3573j4444K36l851k5620j9450p008j359M233J249J4179L5928p264l3917
10416F485p292J0557m541m802L279J1220J9674J2278K3508j9797m521N426j7360
10403C4114n63R458K1058n389q706k815j1323M214J6894p382j5851K5387J3631
10390G2727m563J651j1556r411P966K489l903k279p795K5680J4213j1453R108
10377H2874J4911j605p751M569P409K27J2740J4884j1657m082J237j6172j8796
10364G8788N642P902M569J9225J6590l125J8434O286K7299L1402K4472L4529M715
10351B76728Q83J5456J9230K5999K9410M5438N8239P1611R5757J17129J45694
$$ plain form
10340 901574 1136457 1431929 1836007 2423601 3234731 4274297 5406777 6314768 6791453
10331 6791453 6599647 5605469 4361389 3303594 2506011 1930151 1516679 1231424 1017905
10322 1017905 862187 746534 670723 619338 566717 490683 421292 393655 368334 357064 361780
10311 361780 359872 332899 321831 315832 303425 281215 259944 268248 247371 240827 251534 237149
10299 237149 227812 231507 225557 219478 195153 158647 137673 151497 169249 183252 187865 207849
10287 207849 214973 235218 261985 307977 383830 478202 616874 805647 1054983 1318769 1540131
10276 1540131 1678779 1665224 1424237 1087685 804894 585514 442418 335017 279421 256189
10266 256189 239930 208159 180038 162111 146867 151283 141048 138907 121062 99189 99829 95069
$$ packed form
10340I01574K34883K95472M04078N87594Q11130J039566J132480R07991M76685
10331F791453j91806r94178j244080j057795p97583n75860m13472k85255k13519
10322A017905j55718j15653p5811n1385n2621p6034o9391k7637k5321j1270M716
10311C61780j908k6973j1068n999j2407k2210k1271Q304k0877o544J0707j4385
10299B37149r337L695n950o079k4325l6506k0974J3824J7752J4003M613J9984
10287B07849P124K0245K6767M5992P5853R4372J38672J88773K49336K63786K21362
10276A540131J38648j3555k40987l36552k82791k19380j43096j07401n5596k3232
10266B56189j6259l1771k8121j7927j5244M416j0235k141j7845k1873O40m760
$$ plain form
10254 95069 90271 80391 65383 52775 71158 73364 84755 83551 79435 66254 66470 52125 32156
10241 32156 32053 20131 24799 13974 17329 14547 12923 28442 30590 47830 65942 54314 47997
10228 47997 47493 29243 23773 17276 15847 1303 12441 35076 28848 14119 27356 50131 49047
10215 49047 50949 54317 48585 30851 627 -5747 26280 27701 14746 23038 55951 39075 22822
10202 22822 17059 14499 9686 6500 -645 -5144 10634 20156 3855 -12809 -24319 -21638 -10629
10189 -10629 -18218 890 13364 9492 8589 -6200 -2629 -16954 -10445 2268 18415 26541 1114
10176 1114 -13536 -22000 6560 16622 21879 18249 26513 32053 30842 25011 2405 -3291 -3869 11754
10162 11754 10491 -1929 -4314 -15099 -10454 -5909 12085 21843 13435 21004 -4241 -14035 12336
$$ packed form
10254I5069m798r880j5008j2608J8383K206J1391j204m116j3181K16j4345j9969
10241C2156j03j1922M668j0825L355k782j624J5519K148J7240J8112j1628o317
10228D7997n04j8250n470o497j429j4544J1138K2635o228j4729J3237K2775j084
10215D9047J902L368n732j7734l0224o374L2027J421j2955Q292L2913j6876j6253
10202B2822n763k560m813l186p145m499J5778R522j6301j6664j1510K681J1009
10189a0629p589J9108J2474l872r03j4789L571j4325O509J2713J6147Q126k5427
10176A114j4650q464K8560J0062N257l630Q264N540j211n831k2606n696n78J5623
10162A1754j263j2420k385j0785M645M545J7994R758q408P569k5245r794K6371
$$ plain form
10149 12336 16384 948 -11534 -8083 6572 6251 1117 -18613 -17974 -8277 24708 25459 19651 20987
10135 20987 20621 -6306 -10080 4221 5714 21861 26532 23225 15881 -6136 -10490 12533 20030
10122 20030 24757 21691 24425 13842 4667 -2409 -6142 -7306 -3930 -5186 -6819 -7433 14028 15981
10108 15981 5825 -12604 -31413 -28394 -30385 -8524 -18682 -20181 -21812 -16089 -17378 -15195 -9850
10095 -9850 6080 4255 86 -18068 -21718 -18950 -15000 502 2387 4125 1442 -7077 -16885 -18033
10081 -18033 13184 23941 17423 38883 49005 27297 13357 6708 -10211 -8758 4161 6203
10069 6203 -6127 -5792 -10805 -9218 -14495 -4167 3099 3270 14104 23814 23750 28539 12344 -9631
10055 -9631 -15349 444 22867 20698 2801 9011 6585 -2489 -23246 -28173 -25677 -15474 -5789
$$ packed form
10149A2336M048j5436j2482L451J4655l21n134j9730O39R697L2985P51n808J336
10135B0987l66k6927l774J4301J493J6147M671l307p344k2017m354K3023P497
10122B0030M727l066K734j0583r175p076l733j164L376j256j633o14K1461J953
10108A5981j0156j8429j8809L019j991K1861j0158j499j631N723j289K183N345
10095i850J5930j825m169j8154l650K768L950J5502J885J738k683q519r808j148
10081a8033L1217J0757o518K1460J0122k1708j3940o649j6919J453J2919K042
10069F203j2330L35n013J587n277J0328P266J71J0834R710o4M789j6195k1975
10055i631n718J5793K2423k169j7897O210k426r074k0757m927K496J0203R685
$$ plain form
10042 -5789 1990 -2744 695 -3237 -21825 -34046 -22183 -22187 1758 6030 4168 11781 7414 -469
10028 -469 5590 -237 -2888 8739 -5095 -21614 -5804 -1294 -6846 -9121 -25475 -19045 -11667 -17353
10014 -17353 -8794 13980 3247 -2744 -4825 -3259 15679 12396 18358 6712 -881 2346 16325
10001 16325 18431 29402 31746 20499 -8376 -18637 -21761 -28161 -36399 -19030 1277 3671 6391
9988 6391 8235 -15261 -17610 -16448 -26081 -6914 -3082 2601 7365 8785 -3706 2939 -20697 -17042
9974 -17042 -22988 -23492 -10288 6343 10068 -18951 -38645 -35026 -22485 -36281 -51835 -40112 -31512
9961 -31512 -38282 -38056 -32595 -15903 1623 16898 16879 17215 3792 -18059 -13689 -6458 25142 20857
9947 20857 -4080 9856 10265 13358 -2858 -29529 -21919 915 21775 19561 -1587 -4181 1641
$$ packed form
10042e789P779m734L439l932j8588j2221J1863mK3945M272j862P613m367p883
10028d69O059n827k651J1627j3834j6519J5810M510n552k275j6354O430P378n686
10014a7353Q559K2774j0733n991k081J566J8938l283N962j1646p593L227J3979
10001A6325K106J0971K344j1247k8875j0261l124o400q238J7369K0307K394K720
9988F391J844k3496k349J162r633J9167L832N683M764J420j2491O645k3636L655
9974a7042n946n04J3204J6631L725k9019j9694L619J2541j3796j5554J1723Q600
9961c1512o770K26N461J6692J7526J5275j9L36j3423k1851M370P231L1600m285
9947B0857k4937J3936M09L093j6216k6671P610K2834K0860k214k1148k594N822
$$ plain form
9934 1641 12189 25935 34180 28220 11559 25449 25373 23889 20781 -9407 -19601 -6866 5305
9921 5305 30662 42441 34426 35918 34322 19827 24938 41131 34783 21281 -10169 -22823 -20951
9908 -20951 -6395 -8492 -18801 -10908 -432 8839 8745 26660 26311 25818 -818 -1078 8587 12407 -385
9893 -385 -10087 -19915 -24691 -9575 -19307 -31591 -26528 -5701 -22574 -30166 -23911 -28619 -24280 -28729
9879 -28729 -21399 -1542 17134 24344 21133 20136 21682 17828 30051 21164 5918 -13876 -20491 -12453
9865 -12453 10975 26200 39013 22865 16525 30467 22073 -2993 -14653 -9304 -9982 1532 1232
9852 1232 4388 2985 -7529 -14069 -8246 -891 292 -11336 -12414 3878 2010 10899 -2200 391
9838 391 -27049 -39562 -25174 -5637 7403 1395 -14490 -10358 1972 -7548 -45290 -46936 -26540
$$ packed form
9934A641J0548J3746Q245n960j6661J3890p6j484l108l0188j0194J2735J2171
9921E305K5357J1779q015J492j596j4495N111J6193o348j3502l1450j2654J872
9908b0951J4556k097j0309P893J0476R271r4J7915l49m93k6636k60R665L820j2792
9893c85r702r828m776J5116r732j2284N063K0827j6873p592O255m708M339m449
9879b8729P330J9857J8676P210l211r97J546l854J2223q887j5246j9794o615Q038
9865a2453K3428J5225J2813j6148o340J3942q394k5066j1660N349o78J1514l00
9852A232L156j403j0514o540N823P355J183j1628j078J6292j868Q889j3099K591
9838C91k7440j2513J4388J9537J3040o008j5885M132J2330r520l7742j646K0396
$$ plain form
9825 -26540 -11685 -9093 -24106 -23271 -14848 -17726 -19158 -23553 -23380 -22459 -9624 4613 24229 22377
9811 22377 7775 6019 -12063 -21308 -9709 -13788 -18595 -16808 -16512 -13907 24 2567 -14576 -33393
9797 -33393 -32807 -30137 -19279 -2013 -8453 -24629 -22443 -32793 -46027 -34239 -28460 -34334 -23150
9784 -23150 -3793 -5666 -18133 -17757 7125 20995 15737 2519 -5088 1704 11833 19845 34957
9771 34957 34469 35289 13712 21379 16531 -16262 -4217 3526 14540 1221 -2755 -13925 -3318
9758 -3318 15108 -6423 -22653 -8119 -1848 43 -7278 -22689 -19856 -37242 -45644 -42349 -38471
9745 -38471 -45462 -53274 -45994 -30358 -12019 -9456 -7273 -9629 -5652 -17619 -21090 2819 16624
9732 16624 -6496 -27354 -43521 -18914 -14307 -12160 -5838 17485 16447 17118 17055 15275 17326 5961
$$ packed form
9825b6540J4855K592j5013Q35Q423k878j432m395J73R21J2835J4237J9616j852
9811B2377j4602j756j8082r245J1599m079m807J787K96K605J3931K543j7143j8817
9797c3393N86K670J0858J7266o440j6176K186j0350j3234J1788N779n874J1184
9784b3150J9357j873j2467L76K4882J3870n258j3218p607O792J0129Q012J5112
9771C4957m88Q20k1577P667m848l2793J2045P743J1014j3319l976j1170J0607
9758c318J8426k1531j6230J4534O271J891p321j5411K833j7386q402L295L878
9745c8471o991p812P280J5636J8339K563K183k356L977j1967l471K3909J3805
9732A6624k3120k0858j6167K4607M607K147O322K3323j038O71o3j780K051j1365
$$ plain form
9718 5961 -5522 -18604 -21352 -8893 22823 23530 6607 1521 17829 8726 -8697 -658 -6370
9705 -6370 -2539 11763 -7775 -33359 -44672 -36075 -20023 -9128 -9555 -13943 873 20356 13123
9692 13123 -5063 -7289 -6324 11422 34779 32881 43969 16910 12624 24143 16695 5302 -9694
9679 -9694 -907 11912 24407 26736 28391 16649 8170 17853 31613 13127 24625 7319 -19355
9666 -19355 -5463 17154 24843 35149 23635 31144 26716 13601 9378 -1793 -4568 980 2582
9653 2582 877 8710 26632 18758 -11601 -27960 -26920 -10457 13440 35926 51721 43234 26825
9640 26825 18400 15253 1353 -1935 -13622 -20381 -19692 -45519 -25976 -4985 -12520 -16490 -589
9627 -589 22825 18854 23350 16940 18797 1310 -26723 -29318 -12656 -4692 -20591 -31924 -20089
$$ packed form
9718E961j1483j3082k748J2459L1716P07j6923n086J6308r103j7423Q039n712
9705f370L831J4302j9538k5584j1313Q597J6052J0895m27m388J4816J9483p233
9692A3123j8186k226R65J7746K3357j898J1088k7059m286J1519p448j1393j4996
9679i694Q787J2819J2495K329J655j1742q479R683J3760j8486J1498j7306k6674
9666a9355J3892K2617P689J0306j1514P509m428j3115m223j1171k775N548J602
9653B582j705P833J7922p874l0359j6359J040J6463K3897K2486J5795q487j6409
9640B6825q425l147j3900l288j1687o759O89k5827J9543K0991p535l970J5901
9627e89K3414l971M496o410J857j7487k8033k595J6662P964j5899j1333J1835
$$ plain form
9614 -20089 -9420 -19382 -24591 -7397 3466 20349 8860 -3288 -3027 11726 12678 13230 25595
9601 25595 17226 26579 38303 43027 22649 30336 38955 14336 -8350 -12638 -23965 -18534 12758
9588 12758 22620 17499 -264 -322 5815 18951 17618 9829 15719 16106 20757 33911 29188 13672
9574 13672 10555 -12684 -5076 8896 36820 29007 -4598 -14655 9640 14703 -2497 -7597 -6323
9561 -6323 -17226 1612 5309 61 15450 6859 -9358 -27642 -23773 221 17741 34499 16180
9548 16180 1717 15547 4060 -2951 -8660 -5687 -4230 -8781 10234 29185 13789 4066 2846
9535 2846 -6393 -13982 -2896 7539 8501 6588 11249 5747 -32998 -21377 5021 -15779 -32371
9522 -32371 -44637 -36695 -40658 -53207 -43960 -35168 -18056 -5975 -12306 -17043 -11163 -25202 -27667
$$ packed form
9614b0089J0669r962n209J7194J0863J6883j1489j2148K61J4753R52N52J2365
9601B5595q369R353J1724M724k0378P687Q619k4619k2686m288j1327N431L1292
9588A2758R862n121j7763n8O137J3136j333p789N890L87M651J3154m723j5516
9574A3672l117k3239P608J3972K7924p813l3605j0057K4295N063j7200n100J274
9561f323j0903J8838L697n248J5389q591j6217j8284L869K3994J7520J6758j8319
9548A6180j4463J3830j1487p011n709K973J457m551J9015J8951j5396r723j220
9535B846r239p589J1086J0435R62j913M661n502l8745J1621K6398k0800j6592
9522c2371j2266P942l963j2549R247Q792J7112J2081o331m737N880j4039k465
$$ plain form
9509 -27667 -30087 -13481 16083 24542 6980 20869 31202 -5108 -28749 -15246 -1140 -6259
9497 -6259 -15394 -21611 -4711 20057 29957 31712 14793 19979 10978 15940 5050 -21795 -14098 3445
9483 3445 2746 -749 6118 5021 3473 12878 21575 -9283 -10797 12013 17228 34701 36692 29330
9469 29330 -217 -17777 -5327 17790 25009 19641 5002 -9742 -2736 -13707 -35055 -32996 -30248
9456 -30248 7696 32216 3120 -3161 4447 9235 8522 -1944 -23273 -16738 -22142 -36485 -26335
9443 -26335 -21343 -15736 -2247 6915 -3099 -5433 -12589 -9841 -37898 -25766 2059 21827 19828
9430 19828 -4343 -4477 15985 8704 20462 17176 1018 -9447 -20734 -21894 -17496 -8711 16210
9417 16210 35759 36925 40750 24680 13142 6920 3249 5069 4732 5068 15642 25961 19393 17553
$$ packed form
9509b7667k420J6606K9564Q459j7562J3889J0333l6310k3641J3503J4106n119
9497f259r135o217J6900K4768R900J755j6919N186r001M962j0890k6845P697J7543
9483C445o99l495O867j097j548R405Q697l0858j514K2810N215J7473J991p362
9469B9330k9547j7560J2450K3117P219n368j4639j4744P006j0971k1348K059K748
9456c0248L7944K4520k9096o281P608M788p13j0466k1329O535n404j4343J0150
9443b6335M992N607J3489R162j0014k334p156K748k8057J2132K7825J9768j999
9430A9828k4171j34K0462p281J1758l286j6158j0465j1287j160M398Q785K4921
9417A6210J9549J166L825j6070j1538o222l671J820l37L36J0574J0319o568j840
$$ plain form
9403 17553 8077 4026 -3066 -13113 -6276 -2412 15963 32726 31723 10947 -2935 274 -8487
9390 -8487 4250 14118 19042 21786 50693 70919 64676 33248 316 -6084 4472 13736 19007
9377 19007 18492 4000 -11617 -7842 -10356 -16537 16519 34687 23662 10915 11308 22625 27190
9364 27190 7649 -15188 -14783 -29496 -24854 -3942 16435 19961 -7557 -5337 4778 -5129 -5374
9351 -5374 -12151 4810 36031 34696 32414 27499 34769 47370 50757 30143 41115 55984 49845
9338 49845 64366 52635 26624 11122 28772 43473 34441 24946 -1833 -26042 -19420 -7710
9326 -7710 16694 39725 37880 36198 42928 32492 28137 21044 7492 -3625 -18048 -17272 -10
9313 -10 14242 4676 -5739 883 -12326 -22244 -15842 -4571 -1113 18986 47965 66997 40333
$$ packed form
9403A7553r476m051p092j0047O837L864J8375J6763j003k0776j3882L209q761
9390h487J2737R868M924K744K8907K0226o243l1428l2932o400J0556R264N271
9377A9007n15j4492j5617L775k514o181L3056J8168j1025j2747L93J1317M565
9364B7190j9541k2837M05j4713M642K0912K0377L526k7518K220J0115r907k45
9351e374o777J6961L1221j335k282m915P270J2601L387k0614J0972J4869o139
9338D9845J4521j1731k6011j5502J7650J4701r032r495k6779k4209O622J1710
9326g710K4404K3031j845j682O730j0436m355p093j3552j1117j4423P76J7262
9313a0J4252r566j0415O622j3209r918O402J1271L458K0099K8979J9032k6664
$$ plain form
9300 40333 24371 34279 41559 45528 44949 35289 31472 45781 29519 4662 -9769 -9188 -18301 12565
9286 12565 55865 61240 25870 9250 23737 17698 4154 15886 40946 44265 47249 48633 56822
9273 56822 55958 41744 39779 40038 30492 38044 37441 42322 37077 11030 13238 30512 41646 48578
9259 48578 38133 37620 25271 13085 21864 37228 53895 58707 48421 44130 40895 39709 37586
9246 37586 12800 3728 14331 11573 -2324 4049 16115 17567 21973 25046 47074 53867 77586
9233 77586 83774 72388 55778 66899 52777 28585 31071 36594 45243 53151 58631 40280 37577
9220 37577 48852 46578 42315 59409 58845 43932 68595 82957 83452 75315 58481 51503 53919 73113
9206 73113 95049 92450 58746 46967 44753 35403 64744 52166 41571 47861 51773 59023 68770
$$ packed form
9300D0333j5962R908P280L969n79r660l817J4309j6262k4857j4431N81r113L0866
9286A2565M3300N375l5370j6620J4487o039j3544J1732K5060L319K984J384Q189
9273E6822q64j4214j965K59r546P552o03M881n245k6047K208J7274J1134O932
9259D8578j0445n13j2349j2186Q779J5364J6667M812j0286m291l235j186k123
9246C7586k4786r072J0603k758j3897O373J2066J452M406L073K2028O793K3719
9233G7586O188j1386j6610J1121j4122k4192K486N523Q649P908N480j8351k703
9220C7577J1275k274m263J7094n64j4913K4663J4362M95q137j6834o978K416J9194
9206G3113K1936k599l3704j1779k214r350K9341j2578j0595O290L912P250R747
$$ plain form
9193 68770 85478 78867 85273 81170 77717 67039 102296 130243 110131 101000 107511 119005 134863
9180 134863 143936 153078 145706 152390 150728 133474 136840 136605 145032 156965 164633 174812 179965 173058
9166 173058 154045 140743 151949 173334 178594 186507 206790 222091 238786 223822 224818 243294
9154 243294 240423 250193 263941 296387 333293 369466 379002 409667 424840 425000 427766 442274 467790
9141 467790 519398 564402 586705 611419 648013 689470 762918 855750 925989 999472 1084266 1194244
9129 1194244 1294973 1403672 1536146 1717283 1896437 2094706 2283788 2497318 2719396 2953676
9119 2953676 3165307 3375389 3567716 3711985 3802446 3831812 3780691 3675014 3543812 3364177
9109 3364177 3152938 2933484 2696915 2457483 2276364 2099458 1903149 1724298 1559011 1444228
$$ packed form
9193F8770J6708o611O406m103l453j0678L5257K7947k0112r131O511J1494J5858
9180A34863R073R142p372O684j662j7254L366k35Q427J1933P668J0179N153o907
9166A73058j9013j3302J1206K1385N260P913K0283J5301J6695j4964R96J8476
9154B43294k871R770J3748L2446L6906L6173R536L0665J5173J60K766J4508K5516
9141D67790N1608M5004K2303K4714L6594M1457P3448R2832P0239P3483Q4794J09978
9129A194244J00729J08699J32474J81137J79154J98269J89082K13530K22078K34280
9119B953676K11631K10082J92327J44269R0461K9366n1121j05677j31202j79635
9109C364177k11239k19454k36569k39432j81119j76906j96309j78851j65287j14783
$$ plain form
9099 1444228 1343280 1217118 1110554 1031456 948772 884047 841012 789593 716735 677127 637163
9088 637163 607961 573907 534266 508657 483388 459535 420126 396406 368834 359594 351661 329395
9076 329395 322921 316442 315765 303076 285103 288184 292146 282561 245672 214427 203105 207387 199003
9063 199003 191150 188721 200876 210921 213472 194106 168286 164219 156071 162253 173078 162347 145583
9050 145583 137467 124543 125647 123730 113702 126406 115715 84812 67636 85742 105421 99499
9038 99499 93873 113013 117335 85232 61645 74780 89168 100308 121528 97036 88229 96357 85213
9025 85213 64361 50926 64475 50161 50851 79445 83995 73737 70993 67367 69598 88854 93310
9012 93310 85501 73496 71400 57681 45087 42261 46479 51229 49052 46187 54488 53466 60559 56796
$$ packed form
9099A444228j00948j26162j06564p9098q2684o4725m3035n1419p2858l9608l9964
9088F37163k9202l4054l9641k5609k5269k3853l9409k3720k7572r240p933k2266
9076C29395o474o479o77j2689j7973L081L962r585l6889l1245j1322M282q384
9063A99003p853k429J2155J0045K551j9366k5820m067q148O182J0825j0731j6764
9050A45583q116j2924J104j917j0028J2704j0691l0903j7176J8106J9679n922
9038I9499n626J9140M322l2103k3587J3135J4388J1140K1220k4492q807Q128j1144
9025H5213k0852j3435J3549j4314O90K8594M550j0258k744l626K231J9256M456
9012I3310p809j2005k096j3719j2594k826M218M750k177k865Q301j022P093l763
$$ plain form
8998 56796 44760 24827 12318 20867 38593 23243 26206 37300 46508 39995 44479 37247 23653
8985 23653 14641 14096 26816 53642 56667 64113 46722 22791 -1178 -7404 18611 16168 10571
8972 10571 3748 4340 11131 20149 25491 20942 20548 35570 33711 35231 32481 13454 5421 8598 17671
8957 17671 20460 4515 -7315 -19313 3632 18058 30691 45298 45615 40350 34212 17904 21666
8944 21666 4749 -4854 9813 25735 29861 22892 15098 15921 7682 -727 -6395 1630 2835 -4537
8930 -4537 951 11146 30055 30299 26862 12096 19044 13635 8536 17488 38152 31397 6640 -5630
8916 -5630 123 11951 22415 26553 41250 52492 53735 16767 -4190 3997 2315 17182 13515
8903 13515 -12389 -5273 16402 -350 -3858 5525 9749 10787 -8782 -1657 3617 13568 -8079
$$ packed form
8998E6796j2036j9933j2509Q549J7726j5350K963J1094R208o513M484p232j3594
8985B3653r012n45J2720K6826L025P446j7391k3931k3969o226K6015k443n597
8972A0571o823N92O791R018N342m549l94J5022j859J520k750j9027q033L177R073
8957A7671K789j5945j1830j1998K2945J4426J2633J4607L17n265o138j6308L762
8944B1666j6917r603J4667J5922M126o969p794Q23q239q409n668Q025J205p372
8930d537N488J0195J8909K44l437j4766O948n409n099Q952K0664o755k4757j2270
8916e630N753J1828J0464M138J4697J1242J243l6968k0957Q187j682J4867l667
8903A3515k5904P116K1675j6752l508R383M224J038j9569P125N274R951k1647
$$ plain form
8890 -8079 -11795 -10547 2048 4567 4170 -1657 -3922 10865 20270 15051 11589 24468 3264 -20863
8876 -20863 -9989 -10438 -14541 -15731 -10822 -1882 3363 18284 7349 4178 15640 6327 -5216 5074
8862 5074 22153 12762 -4153 -1771 12485 19624 35475 11409 -27362 -40221 -40829 -19653 3839
8849 3839 916 1207 -14691 -27099 -14499 8902 16411 19738 12655 6953 24549 14041 15283 5693
8835 5693 -3014 -8509 -7764 1472 23991 30254 16271 4808 -18708 -11307 -10148 8453 38647 19178
8821 19178 1065 1776 3711 -1198 4545 7431 2523 -4296 -3248 9210 4485 7118 6291 19318
8807 19318 19000 16609 10722 11749 10467 27005 36715 17534 18122 33385 39388 30644 21974 31864
8793 31864 26222 14099 17691 29164 23025 23284 28357 44795 53302 48941 42597 43389 24346 24789
$$ packed form
8890h079l716J248J2595K519l97n827k265J4787R405n219l462J2879k1204k4127
8876b0863J0874m49m103j190M909Q940N245J4921j0935l171J1462r313j1543J0290
8862E074J7079r391j6915K382J4256P139J5851k4066l8771j2859o08K1176K3492
8849C839k923K91j5898j2408J2600K3401P509L327p083n702J7596j0508J242r590
8835E693q707n495P45R236K2519O263j3983j1463k3516P401J159J8601L0194j9469
8821A9178j8113P11J935m909N743K886m908o819J048J2458m725K633q27J3027
8807A9318l18k391n887J027j282J6538R710j9181N88J5263O003q744q670R890
8793C1864n642j2123L592J1473o139K59N073J6438Q507m361o344P92j9043M43
$$ plain form
8779 24789 33718 22162 6191 20335 16132 -5771 -27692 -24765 9615 42050 47680 49206 40141
8766 40141 19901 34627 41995 29147 12880 8406 16668 30927 17868 13015 21497 2426 -208
8753 -208 12134 4110 14971 16664 7343 24061 26224 42488 47270 26457 32826 41203 24362 12063
8739 12063 20712 10316 24148 33249 -4078 5391 29726 51562 34601 6607 9677 18665 5238
8726 5238 -8739 12551 22854 28377 39129 43771 40259 44714 49855 47036 37841 24994 560
8713 560 7095 21288 33082 16966 21739 34373 45301 27471 19224 18950 30460 50202 47474
8700 47474 45543 39630 35970 37077 44673 44476 37237 45121 52360 67864 85850 83682 58239 61751
8686 61751 75205 86000 80377 69616 80137 86007 98603 107957 135469 140743 129721 120527 106332
$$ packed form
8779B4789Q929j1556j5971J4144m203k1903k1921K927L4380L2435N630J526r065
8766D0141k0240J4726P368j2848j6267m474Q262J4259j3059m853Q482j9071k634
8753b08J2342q024J0861J693r321J6718K163J6264M782k0813O369Q377j6841j2299
8739A2063Q649j0396J3832R101l7327R469K4335K1836j6961k7994L070Q988j3427
8726E238j3977K1290J0303N523J0752M642l512M455N141k819r195j2847k4434
8713E60O535J4193J1794j6116M773J2634J0928j7830q247k74J1510J9742k728
8700D7474j931n913l660J107P596j97p239P884P239J5504J7986k168k5443L512
8686F1751J3454J0795n623j0761J0521N870J2596R354K7512N274j1022r194j4195
$$ plain form
8673 106332 82820 57649 37332 53632 51108 59590 80308 65011 68725 70503 68181 58417 46561
8660 46561 46084 48770 57297 60842 71736 75828 73343 65004 89264 90829 61164 55569 66318 77765
8646 77765 86167 76948 104132 108794 101045 108465 109823 101978 82245 87280 87091 83825 76176 53562
8632 53562 49726 61974 83881 86608 89953 95871 95540 108350 117983 120931 125659 116190 119607 116963
8618 116963 113257 132181 145543 147129 156781 163339 163571 172100 193716 203249 217068 230545 263823
8605 263823 288122 296723 292234 305670 325717 331354 361961 394146 410764 408460 387566 386395 365341
8592 365341 338552 314323 305463 264351 249969 237392 214926 183748 162497 142530 116434 89968
8580 89968 95589 119545 94018 78940 100761 107488 109936 106363 92153 96746 94695 77518 62933
$$ packed form
8673A06332k3512k5171k0317J6300k524Q482K0718j5297L714J778k322r764j1856
8660D6561m77K686Q527L545J0894M092k485q339K4260J565k9665n595J0749J1447
8646G7765Q402r219K7184M662p749P420J358p845j9733N035j89l266p649k2614
8632E3562l836J2248K1907K727L345N918l31J2810R633K948M728r469L417k644
8618A16963l706J8924J3362J586R652O558K32Q529K1616R533J3819J3477L3278
8605B63823K4299Q601m489J3436K0047N637L0607L2185J6618k304k0894j171k1054
8592C65341k6789k4229q860m1112j4382j2577k2466l1178k1251j9967k6096k6466
8580H9968N621K3956k5527j5078K1821O727K448l573j4210M593k051j7177j4585
$$ plain form
8567 62933 53549 51049 64511 65600 53815 40440 47498 64860 58766 31069 31711 31917 39466 56472
8553 56472 79845 60869 53644 47085 46914 53035 39384 25600 36856 28759 51489 50101 33885
8540 33885 29739 40982 50197 50698 48677 23922 19431 16385 20172 -4405 11115 40947 45715 46459
8526 46459 34798 35924 47098 47199 33157 36771 44528 35522 48937 49622 42783 34255 36056 29721
8512 29721 24191 29187 21970 16378 38239 40185 23273 14566 29184 38359 33944 23770 30420 16220
8498 16220 19195 35255 33753 24670 12696 18713 22292 12724 14771 12775 -1743 -3243 -2775 -133
8484 -133 -3025 -17421 -13603 6023 8746 5822 7567 27728 41155 27393 -5084 -1803 4379 -9699
8470 -9699 -16495 15129 33030 39289 30635 20932 8279 1470 12084 22174 34036 33584 18945
$$ packed form
8567F2933r384k500J3462J089j1785j3375P058J7362o094k7697O42K06P549J7006
8553E6472K3373j8976p225o559j71O121j3651j3784J1256q097K2730j388j6216
8540C3885m146J1243R215N01k021k4755m491l046L787k4577J5520K9832M768P44
8526D6459j1661J126J1174J01j4042L614P757r006J3415O85o839q528J801o335
8512B9721n530M996p217n592K1861J946j6912q707J4618R175m415j0174O650j4200
8498A6220K975J6060j502r083j1974O017L579r568K047j996j4518j500M68K642
8484a33k892j4396L818J9626K723k924J745K0161J3427j3762l2477L281O182j4078
8470i699o796L1624J7901O259q654r703j2653o809J0614J0090J1862m52j4639
$$ plain form
8457 18945 -8867 -34831 -27466 -13822 -2503 -7593 -3923 -11274 -16168 8801 9973 -385 -7820
8444 -7820 -5057 2522 2094 -3783 -4065 17227 17202 40575 51764 36196 25876 35557 29913 19951 11508
8429 11508 -6538 -8975 -8996 -1124 12130 10837 17163 19746 16657 19052 22127 39017 30040 755
8415 755 18605 42505 51355 52702 46173 33433 28806 3805 -18164 6195 22358 6957 20419
8402 20419 37749 45435 32420 19971 49612 59765 34007 18702 7771 3883 6443 18090
8390 18090 10557 24522 34415 28708 21420 29109 28397 32664 10139 17084 17295 13073 6992 2409 405
8375 405 23408 30559 15557 3311 6594 11144 -7177 -5552 4412 164 -4825 -20718 -7467 21064
8361 21064 29328 22400 19163 27113 27953 12597 30870 29606 28846 8366 -1214 -2351 -4378 2121
$$ packed form
8457A8945k7812k5964P365J3644J1319n090L670p351m894K4969J172j0358p435
8444g820K763P579m28n877k82K1292k5K3373J1189j5568j0320R681n644r962q443
8429A1508j8046k437k1P872J3254j293O326K583l089K395L075J6890q977k9285
8415G55J7850K3900Q850J347o529j2740m627k5001k1969K4359J6163j5401J3462
8402B0419J7330P686j3015j2449K9641J0153k5758j5305j0931l888K560J1647
8390A8090p533J3965R893n707p288P689p12M267k2525O945K11m222o081m583k004
8375D05K3003P151j5002j2246L283M550j8321J625R964m248m989j5893J3251K8531
8361B1064Q264o928l237P950Q40j5356J8273j264p60k0480r580j137k027O499
$$ plain form
8347 2121 24011 12386 14912 28559 41325 37949 35675 32943 18122 11956 19020 32993 10001
8334 10001 6751 7851 5110 190 -5623 -6150 -8137 -15887 -26775 -21324 -2014 5590 813 3211
8320 3211 7840 -4635 -9940 -4905 -7373 -10632 -19224 -3346 6247 -238 7554 36493 29330 18241
8306 18241 7142 -1631 -7308 4144 16199 15752 22111 9840 -5082 -5755 -6183 14177 22066 22213
8292 22213 23389 -9804 -27868 -15588 -25838 -35485 -38346 -40815 -38603 -18146 7363 10354 -2736
8279 -2736 -9444 -914 -22337 -27411 7560 36898 26136 11649 10438 16954 7356 -16208 -15812 16882
8265 16882 28270 17559 -8897 -3944 14929 18381 15666 264 -9348 -13985 -27885 -22929 -24571
8252 -24571 -21056 -2583 -402 14412 24011 16835 -6643 -10085 -3961 4200 -17282 -17385 -10188 -12947
$$ packed form
8347B121K1890j1625K526J3647J2766l376k274k732j4821o166P064J3973k2992
8334A0001l250J100k741m920n813n27j987p750j0888N451J9310P604m777K398
8320C211M629j2475n305N035k468l259q592J5878R593o485P792K8939p163j1089
8306A8241j1099q773n677J1452J2055m47O359j2271j4922o73m28K0360P889J47
8292B2213J176l3193j8064J2280j0250r647k861k469K212K0457K5509K991j3090
8279b736o708Q530k1423n074L4971K9338j0762j4487j211O516r598k3564L96L2694
8265A6882J1388j0711k6456M953J8873L452k715j5402r612m637j3900M956j642
8252b4571L515J8473K181J4814R599p176k3478l442O124Q161k1482j03P197k759
$$ plain form
8238 -12947 -10566 2902 20597 17825 3273 -6793 -16479 -17843 -11969 7593 -4264 -16240 7191
8225 7191 28510 34533 34757 18740 -10204 -44022 -43409 -21996 -19625 -10225 17965 39101 30879 18379
8211 18379 26635 13904 9779 10922 15633 19902 5360 -15548 -16643 -32287 -33873 -27322 -11701
8198 -11701 -6824 -6272 -2683 -4825 -5051 12968 3928 -11515 -7559 -10963 -19025 -16513 -8920 4808
8184 4808 23567 21067 13839 13615 24461 24470 18342 30289 27445 17670 8634 -3621 2475 7373 3036
8169 3036 -4664 21198 28035 26209 16945 29183 36211 36324 27790 34194 25545 -485 -9589 -16950
8155 -16950 3751 15354 23718 11881 6123 -2629 -14345 -3083 6868 900 -9454 -12367 -11597
8142 -11597 14597 37892 32270 21473 16246 11946 23103 24590 32338 20782 843 3989 -302
$$ packed form
8238a2947K381J3468J7695k772j4552j0066r686j364N874J9562j1857j1976K3431
8225G191K1319O023K24j6017k8944l3818O13K1413K371R400K8190K1136q222j2500
8211A8379Q256j2731m125J143M711M269j4542k0908j095j5644j586O551J5621
8198a1701M877N52L589k142k26J8019r040j5443L956l404q062K512P593J3728
8184D808J8759k500p228k24J0846Ro128J1947k844r775r036j2255O096M898m337
8169C036p700K5862O837j826r264J2238P028J13q534O404q649k6030r104p361
8155a6950K0701J1603Q364j1837n758q752j1716J1262R951n968j0354k913P70
8142a1597K6194K3295n622j0797n227m300J1157J487P748j1556j9939L146m291
$$ plain form
8129 -302 2136 2903 -12258 -11447 -1032 -12631 -14338 14134 22308 18826 11944 12716 -22597 -13188 6144
8114 6144 -5202 -14020 -4366 8725 29629 5526 4867 -4896 1242 11478 -10236 -19845 -19315 -13233
8100 -13233 -21043 -41561 -38519 -28078 -20262 12831 30613 28222 453 -6344 -10372 -7523 -1070
8087 -1070 -1278 -6645 11840 599 -3176 13801 10280 -12292 -6626 -21104 -13065 6728 18652
8074 18652 30877 26098 40867 37215 26164 19821 -3520 -5554 12941 40000 42739 9364 1653
8061 1653 15971 26083 25122 34052 8822 11822 13301 10823 -3037 340 -12161 16978 27567
8048 27567 16672 20361 55775 45565 23380 31694 55487 56677 45808 54324 67760 71629 61151
8035 61151 59084 53370 43720 43833 41731 47704 66767 54848 54058 53566 49884 30436 21721 47897
$$ packed form
8129c02K438P67j5161Q11J0415j1599j707K8472Q174l482o882P72l5313R409J9332
8114F144j1346q818R654J3091K0904k4103o59r763O138J0236k1714r609N30O082
8100a3233p810k0518L042J0441P816L3093J7782k391k7769o797m028K849O453
8087a070k08n367J8485j1241l775J6977l521k2572N666j4478Q039J9793J1924
8074A8652J2225m779J4769l652j1051o343k3341k034J8495K7059K739l3375p711
8061A653J4318J0112r61Q930k5230L000J479k478j3860L377j2501K9139J0589
8048B7567j0895L689L5414j0210k2185Q314K3793J190j0869Q516J3436L869j0478
8035F1151k067n714r650J13k102N973J9063j1919p90m92l682j9448q715K6176
$$ plain form
8021 47897 91931 100039 90608 87543 70978 46337 69186 81902 73868 61175 58714 67063 80296
8008 80296 101887 116378 119227 100652 66296 67875 72677 66707 66322 59980 58130 55168 54437 42874
7994 42874 39646 38186 37729 16077 10802 30850 52516 30940 12840 30950 30436 27682 29504 18393
7980 18393 13434 21562 27086 39935 47008 53454 48502 44641 40054 38221 32263 51587 70218 84843
7966 84843 83753 84387 73807 53258 58078 71791 85904 88717 86396 100319 96420 73445 81281
7953 81281 106294 99732 105074 72390 59953 60875 40876 41046 43874 61676 81950 88309 104761
7940 104761 89526 72742 81674 81272 62127 62006 73200 68389 81232 116442 118007 101131 86533
7927 86533 62312 58008 55650 62914 60629 57938 91661 92059 77533 83319 100092 92816 68042 47498
$$ packed form
8021D7897M4034Q108r431l065j6565k4641K2849J2716q034j2693k461Q349J3233
8008H0296K1591J4491K849j8575l4356J579M802n970l85o342j850k962p31j1563
7994D2874l228j460m57k1652n275K0048K1666k1576j8100J8110n14k754J822j1111
7980A8393m959Q128N524J2849P073O446m952l861m587j833n958J9324J8631J4625
7966H4843j090O34j0580k0549M820J3713J4113K813k321J3923l899k2975P836
7953H1281K5013o562N342l2684j2437R22j9999J70K828J7802K0274O359J6452
7940A04761j5235j6784Q932m02j9145j21J1194m811J2843L5210J565j6876j4598
7927H6533k4221m304k358P264k285k691L3723L98j4526N786J6773p276k4774k0544
$$ plain form
7913 47498 41274 56429 100730 104095 100745 88834 96120 74959 67339 76865 83687 70632 75541
7900 75541 60033 48432 56009 63677 75485 72093 92000 99819 83549 54133 33839 37550 35749
7887 35749 37902 44216 45880 43539 31102 5868 -2808 4196 17002 34043 39537 40083 63442 55245
7873 55245 29798 35626 32632 21498 2262 -7075 2418 17393 18696 10495 24893 29079 22347
7860 22347 21657 26616 35015 27467 142 -4522 -2803 -4456 15295 18410 21008 35693 37819 24452
7846 24452 26309 21684 27386 17736 5337 6072 -521 8654 12427 12395 12005 9550 -1214 -4570 -34
7831 -34 8859 5534 4184 10478 26102 22479 24360 30909 20458 7641 14408 16451 24514 17791 22437
7816 22437 29182 25921 44588 50952 26893 18417 15760 14077 12709 5231 9539 11695 6730 2955
$$ packed form
7913D7498o224J5155M4301L365l350j1911P286k1161p620R526O822j3055M909
7900G5541j5508j1601P577P668J1808l392J9907P819j6270k9416k0294L711j801
7887C5749K153O314J664k341j2437k5234q676P004J2806J7041N494N46K3359q197
7873E5245k5447N828k994j1134j9236r337R493J4975J303q201J4398M186o732
7860B2347o90M959Q399p548k7325m664J719j653J9751L115K598J4685K126j3367
7846B4452J857m625N702r650j2399P35o593R175L773l2l90k455j0764l356M536
7831c4Q893l325j350O294J5624l623J881O549j0451j2817O767K043Q063o723M646
7816B2437O745l261J8667O364k4059q476k657j683j368p478M308K156m965l775
$$ plain form
7802 2955 4660 2185 4191 871 14258 31229 26347 -1535 3804 20556 13081 17867 33898 20124
7788 20124 16948 15179 23516 21115 22609 22222 4966 -10072 -7763 -6400 -5855 6624 -7245 -23256
7774 -23256 -29047 -33610 -27786 -16756 -3913 -2268 -7288 -33704 -21609 -225 -6597 -27871 -23861
7761 -23861 -15516 -8469 -14560 -33386 -42031 -41270 -19377 6250 -4930 -13862 5798 15139 25867
7748 25867 21336 9767 7199 -621 5643 2242 -9720 -11170 -14036 -2249 2816 2155 4392 19080
7734 19080 7992 -5251 -13854 -15881 -16098 -17660 -37712 -45240 -25959 -28889 5650 18211 23281
7721 23281 6327 -23567 -28610 -25198 -35824 -39313 -25068 -17172 -5136 17519 32943 13221 2458
7708 2458 10262 11944 15676 7692 731 -16441 -18480 -7863 -18634 -29448 -30159 -15703 5775 15809
$$ packed form
7802B955J705k475K006l320J3387J6971m882k7882N339J6752p475M786J6031j3774
7788B0124l176j769Q337k401J494l87j7256j5038K309J363N45J2479j3869j6011
7774b3256n791m563N824J1030J2843J645n020k6416J2095K1384o372k1274M010
7761b3861Q345P047o091j8826q645P61K1893K5627j1180q932J9660R341J0728
7748B5867m531j1569k568p820O264l401j1962j450k866J1787N065o61K237J4688
7734A9080j1088j3243q603k027k17j562k0052p528J9281k930L4539J2561N070
7721B3281j6954k9894n043L412j0626l489J4245P896J2036K2655J5424j9722j0763
7708B458P804J682L732p984o961j7172k039J0617j0771j0814p11J4456K1478J0034
$$ plain form
7694 15809 40834 52269 43130 17166 4489 -8209 -24997 -21820 -22725 -26290 -20353 -10642 4090
7681 4090 19627 8818 8636 23473 34059 38540 23629 11173 -4033 -466 -24447 -29355 2158
7668 2158 25491 22500 18918 -2116 -33505 -16759 4498 -12885 -29576 -19477 -15805 -27361 -28968
7655 -28968 -24896 -19716 -20124 -20113 -33592 -52746 -48160 -32164 -22162 -26689 -38376 -50091 -43329 -35434
7641 -35434 -45724 -49952 -37821 -15893 -2303 -3629 7637 1939 -21356 -36438 -25452 -27597 -44568
7628 -44568 -26020 -19742 -6875 -1645 -12423 -13132 -4906 1368 -12890 -12875 4390 3837 -76 -10042
7614 -10042 -17979 -15089 -20646 -36571 -25411 -26328 -27157 -14132 4820 13304 1995 -3406 -5833 -22304
7600 -22304 -11795 -11375 -14530 -8964 -3571 -24616 -37124 -18749 -11506 4637 16210 30375 27049
$$ packed form
7694A5809K5025J1435r139k5964j2677j2698j6788L177r05l565N937R711J4732
7681D090J5537j0809j82J4837J0586M481j4911j2456j5206L567k3981m908L1513
7668B158K3333k991l582k1034l1389J6746K1257j7383j6691J0099L672j1556j607
7655b8968M072N180m08J1j3479j9154M586J5996J0002m527j1687j1715O762P895
7641c5434j0290m228J2131K1928J3590j326J1266n698k3295j5082J0986k145j6971
7628d4568J8548O278J2867N230j0778p09Q226O274j4258J5J7265n53l913r966
7614a0042p937K890n557j5925J1160r17q29J3025J8952Q484j1309n401k427j6471
7600b2304J0509M20l155N566N393k1045j2508J8375P243J6143J1573J4165l326
$$ plain form
7587 27049 -637 -11053 -7659 -7171 -22902 -19776 -10377 737 -3011 -22900 -6763 -979 -2828
7574 -2828 -15693 -7709 5341 -5830 -10408 -12340 7176 12042 11771 1010 -16846 -13302 -9076 -7743
7560 -7743 14878 -6387 -21537 -16984 -15584 -5086 8272 -13191 -10356 -10592 -6575 -20108 -36445
7547 -36445 -19648 -15945 -14102 -3228 -15321 -27399 -31788 -17267 -11265 -17774 -12476 -23415 -34036
7534 -34036 -27801 -10427 -7295 734 13506 7583 -3889 6417 37255 35163 25570 10471 11485
7521 11485 2887 7238 9871 1776 4968 -4595 98 403 -19462 -17382 9960 14471 2776 -7327
7507 -7327 -19404 -9525 -1048 -1938 -21803 -2773 -3431 -6264 -5165 -140 6004 21142 31061 31256 26290
7492 26290 25303 19309 24644 3197 -29424 -24255 -13698 -8818 -19195 -13153 -19535 -28892 -12506 -19312
$$ packed form
7587B7049k7686j0416L394M88j5731L126R399J1114l748j9889J6137N784j849
7574b828j2865P984J3050j1171m578j932J9516M866k71j0761j7856L544M226J333
7560g743K2621k1265j5150M553J400J0498J3358k1463K835k36M017j3533j6337
7547c6445J6797L703J843J0874j2093j2078m389J4521O002o509N298j0939j0621
7534c4036O235J7374L132Q029J2772n923j1472J0306L0838k092r593j5099J014
7521A1485q598M351K633q095L192r563M693L05j9865K080K7342M511j1695j0103
7507g327j2077R879Q477q90j9865J9030o58k833J099N025O144J5138R919J95m966
7492B6290r87n994N335k1447l2621N169J0557M880j0377O042o382r357J6386o806
$$ plain form
7478 -19312 -5497 4904 -11288 -4905 17183 11236 3069 15861 17247 20548 25343 11434 10503
7465 10503 14593 -1046 -9744 -15465 -14808 -4269 5239 -12491 -23520 -12081 -14853 -42443 -50926
7452 -50926 -34124 1765 717 2864 11339 3396 6480 -14805 -21699 -1715 20725 39381 36409
7439 36409 27266 9193 11173 -8817 -27432 -23863 -37160 -4847 21979 42685 38556 22486 28961
7426 28961 15438 -11187 -14584 -5892 -3793 1877 -11057 -17000 -14374 -33954 -51418 -55627 -41728
7413 -41728 -24573 -27423 -422 -5244 -20371 -22372 -11239 -15907 -25108 -1776 -2527 -20846 1389
7400 1389 25951 51837 24056 -1156 -4928 -6425 14861 25746 18013 -511 8625 12596 8774
7387 8774 -18872 -22973 -20642 -49846 -74264 -61370 -46371 -19290 -170 6713 32639 34008 22008
$$ packed form
7478a9312J3815J0401j6192O383K2088n947q167J2792J386L301M795j3909r31
7465A0503M090j5639q698n721O57J0539R508j7730j1029J1439k772k7590q483
7452e0926J6802L5889j048K147Q475p943L084k1285o894J9984K2440J8656k972
7439C6409r143j8073J980j9990j8615L569j3297L2313K6826K0706m129j6070O475
7426B8961j3523k6625l397Q692K099N670j2934n943K626j9580j7464m209J3899
7413d1728J7155k850K7001m822j5127k001J1133m668r201K3332p51j8319K2235
7400A389K4562K5886k7781k5212l772j497K1286J0885p733j8524R136L971l822
7387H774k7646m101K331k9204k4418J2894J4999K7081J9120O883K5926J369j2000
$$ plain form
7374 22008 27261 22226 26209 32818 13511 -2919 -3594 8259 19495 23362 12328 -746 -4963
7361 -4963 -12426 -13434 -3489 3114 -2201 -4013 12966 14822 8424 -8988 -15441 -22636 -6015 9190
7347 9190 16383 12035 -1070 -766 5596 -5067 -16124 -24257 -20787 -31144 -31503 -34491 -32223 -27814
7333 -27814 -11584 -8284 -13055 -23691 -25616 -26560 -25206 -14157 -7166 -665 -30049 -27883 -23984 -28599
7319 -28599 -33834 -17707 1156 5676 5990 6096 23182 29888 22136 8027 -625 -6856 -11140 -6827
7305 -6827 -14171 -38379 -46053 -30146 -21691 -6989 8250 11115 5805 10955 12450 -7327 20 -2140
7291 -2140 -3857 -10364 -7553 -11251 -25676 -48232 -30721 -20172 -20302 -24856 -19137 -8631 5274 17297
7277 17297 14134 21831 33281 13160 -13855 -18069 -23561 -28179 -57060 -53567 -19710 -19181 -4125
$$ packed form
7374B2008N253n035L983O609j9307j6430o75J1853J1236L867j1034j3074m217
7361d963p463j008R945O603n315j812J6979J856o398j7412o453p195J6621J5205
7347I190P193m348j3105L04O362j0663j1057q133L470j0357l59k988K268M409
7333b7814J6230L300m771j0636j925r44J354J1049O991O501k9384K166L899m615
7319b8599n235J6127J8863M520L14J06J7086O706p752j4109q652o231m284M313
7305f827p344k4208p674J5907Q455J4702J5239K865n310N150J495j9777P347k160
7291b140j717o507K811l698j4425k2556J7511J0549j30m554N719J0506J3905J2023
7277A7297l163P697J1450k0121k7015m214n492m618k8881L493L3857N29J5056
$$ plain form
7264 -4125 15765 23310 33460 -3642 -35545 -26841 -6916 -7189 119 23115 29736 26441 15674
7251 15674 1925 -12445 -16626 -9036 -10042 -7169 15632 2235 -14258 -9421 -22376 -42165 -33279
7238 -33279 7558 36140 24143 -7059 -16218 -17486 -32796 -12402 2196 6018 -6635 -12676 -2024
7225 -2024 -15884 -6312 8977 2419 12918 -6596 -42087 -41444 -21351 -3935 -3265 9776 19304
7212 19304 13289 15359 6946 974 -9096 -10063 -24109 -34544 -29670 -34985 -22992 -35151 -45576
7199 -45576 -36403 -27075 -38726 -31742 -24220 -15648 -24736 -30584 -29503 -17378 15063 17016 936 -4983
7185 -4983 -8748 -18413 -34802 -37680 -21354 -21427 -15868 -1291 -8236 -18047 -31438 -28191 -16788 -13818
7171 -13818 -19080 -29409 -36354 -48234 -28078 -13701 -10243 -31680 -21402 -2196 -6956 -2009 2435
$$ packed form
7264d125J9890P545J0150l7102l1903Q704J9925k73P308K2996O621l295j0767
7251A5674j3749j4370m181P590j006K873K2801j3397j6493M837j2955j9789Q886
7238c3279M0837K8582j1997l1202r159j268j5310K0394J4598L822j2653o041J0652
7225b024j3860R572J5289o558J0499j9514l5491O43K0093J7416O70J3041R528
7212A9304o015K070q413n972j0070r67j4046j0435M874n315J1993j2159j0425
7199d5576R173R328j1651O984P522Q572r088n848J081J2125L2441J953j6080n919
7185d983l765r665j6389k878J6326p3N559J4577o945r811j3391L247J1403K970
7171a3818n262j0329o945j1880K0156J4377L458k1437J0278J9206m760M947M444
$$ plain form
7158 2435 -22385 -29770 1029 6050 -13178 -28410 -23050 -3063 12951 -5740 -24282 -18963 9817
7145 9817 8926 15386 -3455 -19254 -14303 -18700 -21932 -9245 -28542 -43733 -8461 15805 24962
7132 24962 39747 23126 12126 31571 18350 2737 -9687 -27269 -17929 -3958 -13673 -9355
7120 -9355 -11792 3066 -7238 -14478 -25506 -9962 -8715 -10581 2563 -7129 -4357 14864 22287
7107 22287 8059 -6574 955 2398 5389 -10737 -7864 -8940 -2395 -15047 -14069 -8274 -4305 7339
7093 7339 -8930 -21822 -20922 -16002 1789 -4369 -20012 8097 24378 20830 9315 -1460 19152
7080 19152 24748 18789 30970 6551 -2463 982 -4530 -17505 -28107 -27847 -28725 -22430 -24786 -32962
7066 -32962 -23458 -1704 -27367 -31541 -15959 -12296 -6482 13754 6113 -9068 -18190 -15852 -958
$$ packed form
7158B435k4820p385L0799N021j9228j5232N360J9987J6014j8691j8542N319K8780
7145I817q91O460j8841j5799M951m397l232J2687j9297j5191L5272K4266R157
7132B4962J4785j6621j1000J9445j3221j5613j2424j7582R340J3971r715M318
7120i355k437J4858j0304p240j1028J5544J247j866J3144r692K772J9221P423
7107B2287j4228j4633P529J443K991j6126K873j076O545j2652R78N795L969J1644
7093G339j6269j2892R00M920J7791o158j5643K8109J6281l548j1515j0775K0612
7080A9152N596n959J2181k4419r014L445n512j2975j0602K60q78O295k356q176
7066c2962R504K1754k5663m174J5582L663N814K0236p641j5181r122K338J4894
$$ plain form
7053 -958 22782 33847 15669 -15284 -12471 -8932 -27911 -29493 -28624 -37343 -35664 -12404 -11212 -5754
7039 -5754 -10156 -21812 -21872 -30180 -24273 -6353 -11824 -17907 -4164 -3789 -29320 -40721 -24081 -19455
7025 -19455 -1510 -965 -14779 -22418 -23854 -27600 -42504 -20203 -7921 -7832 -879 -8581 -22163 -32176
7011 -32176 6416 3872 463 8791 -3732 -14235 -14859 -20618 -16995 1291 19650 13208 2298
6998 2298 2654 6151 6985 -745 22919 31687 11369 -20920 -26215 -11124 12146 7335 -8399 15964
6984 15964 6836 -25458 -15304 -10297 -14560 -16602 -15389 -23031 -35250 -23297 -4063 -14467 -27548
6971 -27548 -25911 -30406 -26288 -443 -10661 -9025 3491 -1431 695 -7691 5327 2295 -2831 507
6957 507 3607 9126 -3211 -14191 -29525 -33170 -31122 -15898 -12540 -28599 -25529 -36537 -40013 -36973
$$ packed form
7053i58K3740J1065j8178l0953K813L539j8979j582Q69q719J679K3260J192N458
7039e754m402j1656o0q308N907J7920n471o083J3743L75k5531j1401J6640M626
7025a9455J7945N45j3814p639j436l746j4904K2301J2282Q9O953p702j3582j0013
7011c2176L8592k544l409Q328j2523j0503o24n759L623J8286J8359o442j0910
6998B298L56L497Q34p730K3664Q768k0318l2289n295J5091K3270m811j5734K4363
6984A5964r128l2294J0154N007m263k042J213p642j2219J1953J9234j0404j3081
6971b7548J637m495M118K5845j0218J636J2516m922K126q386J3018l032n126L338
6957E07L100N519j2337j0980j5334l645K048J5224L358j6059L070j1008l476L040
$$ plain form
6943 -36973 -24430 -12174 -13138 -22824 -24411 -30731 -32611 -31090 -39395 -13628 -11409 -7732 13631 12791
6929 12791 27614 45460 41426 22180 -444 -24897 -13896 -21314 -27048 -16694 -2735 132 10397
6916 10397 13300 2219 12153 13486 19570 4360 -611 -1130 6735 16745 -1990 -5269 289 -328
6902 -328 731 -8532 -25275 -14285 -16212 -20101 -21305 -13745 -34747 -35351 -24399 -3126 -6564 -5406
6888 -5406 -13164 -23418 -32197 -11894 3124 -7398 -17518 8820 23435 20141 16602 31135 33984
6875 33984 38358 22099 -9007 1240 9625 6744 13236 40777 43660 18408 7712 13171 13799
6862 13799 -790 -14728 -10730 15139 6131 -8952 -12675 -28170 -23763 -18411 -11974 15574 15360
6849 15360 -12490 -20821 -9564 -8808 -26414 -16282 5383 10747 11884 18945 15222 -3166 -12088
$$ packed form
6943c6973J2543J2256r64r686j587o320j880J521q305K5767K219L677K1363q40
6929A2791J4823J7846m034j9246k2624k4453J1001p418n734J0354J3959K867J0265
6916A0397K903j1081R934J333O084j5210m971n19P865J0010j8735l279N558o17
6902c28J059r263j6743J0990j927l889j204P560k1002o04J0952K1273l438J158
6888e406p758j0254q779K0303J5018j0522j0120K6338J4615l294l539J4533K849
6875C3984M374j6259l1106J0247Q385k881O492K7541K883k5252j0696N459O28
6862A3799j4589j3938L998K5869r008j5083l723j5495M407N352O437K7548k14
6849A5360k7850q331J1257P56j7606J0132K1665N364J137P061l723j8388q922
$$ plain form
6836 -12088 -7644 -6306 -10138 -31909 -23377 -8966 -18299 -30585 -9939 3659 -10647 -12008 -5558
6823 -5558 -5975 -7938 -21005 -37855 -44242 -41227 -32271 -14671 2736 3531 8691 -8535 -18221 -16818
6809 -16818 -22912 -15955 -14469 -13760 -16037 -27546 -22133 -26037 -32833 -41173 -38154 -22793 -3799 -2440
6795 -2440 -5141 4667 11371 -7979 -6802 15302 38588 45850 36532 19407 10319 3243 478 -15213
6781 -15213 -13765 2200 7426 4112 3646 -11612 -14125 3340 9648 -15698 -41595 -31371 -20026
6768 -20026 -18679 -29629 -26557 3954 4726 14372 25376 22439 6237 12013 16185 19097 25273 20554
6754 20554 5036 -18887 -6030 1237 10155 15536 13361 -3773 -16529 -12932 -7914 -14450 5174
6741 5174 29635 20387 8750 22793 35949 21741 20208 10334 -1301 2042 -3130 -1868 -10633
$$ packed form
6836a2088M444J338l832k1771Q532J4411r333j2286K0646J3598j4306j361O450
6823e558m17j963j3067j6850o387L015Q956J7600J7407P95N160j7226r686J403
6809a6818o094O957J486P09k277j1509N413l904o796q340L019J5361J8994J359
6795b440k701R808O704j9350J177K2104K3286P262r318j7125r088p076k765j5691
6781a5213J448J5965N226l314m66j5258k513J7465O308k5346k5897J0224J1345
6768b0026J347j0950L072L0511P72R646J1004k937j6202N776M172K912O176m719
6754B0554j5518k3923J2857P267Q918N381k175j7134j2756L597N018o536J9624
6741E174K4461r248j1637J4043J3156j4208j533r874j1635L343n172J262q765
$$ plain form
6728 -10633 4063 10134 360 -3217 1427 21212 30737 35975 21973 1943 1332 -7219 828 -4454
6714 -4454 -428 -2246 -7075 -7352 -26358 -12864 18237 14130 20454 34355 35237 40718 44105 21375
6700 21375 -9796 -28991 -7686 15324 7857 -7902 -16873 -29453 -42771 -24344 -12646 -2263
6688 -2263 -24747 -22606 -34068 -33569 6289 -15680 -13296 2966 16351 9202 8119 -1088 -14967
6675 -14967 -11875 -12206 -15217 2317 28504 18075 -1282 7943 22972 16978 54 1491 1411 -664
6661 -664 -11296 -16166 7494 9304 -16429 -34707 -28621 -27902 -29725 -46349 -34869 -35539 -29921 -5437
6647 -5437 -9195 -14503 -1379 21177 10882 -3102 17235 25345 23125 15072 2628 -17410 -12210
6634 -12210 3685 7764 21799 19908 17237 3442 -3204 12171 15555 6450 1571 5583 -2257 -19172
$$ packed form
6728a0633J4696O071r774l577M644J9785R525N238j4002k0030o11q551Q047n282
6714d454M026j818m829k77j9006J3494L1101m107O324J3901Q82N481L387k2730
6700B1375l1171j9195K1305K3010p467j5759q971j2580j3318J8427J1698J0383
6688b263k2484K141j1462M99L9858k1969K384J6262J3385p149j083r207j3879
6675a4967L092l31l011J7534K6187j0429j9357R225J5029n994j6924J437q0k075
6661f64j0632m870K3660J810k5733j8278O086P19j823j6624J1480o70N618K4484
6647e437l758n308J3124K2556j0295j3984K0337Q110k220q053j2444k0038N200
6634a2210J5895M079J4035j891k671j3795o646J5375L384r105m879M012p840j6915
$$ plain form
6620 -19172 -19654 -21005 -7790 -7509 -34862 -25576 -13441 -12032 1704 -172 -22116 -4821 6310
6607 6310 10735 888 -32351 -50255 -55951 -35746 -16096 -21297 -13349 -4773 -7651 -5524 -18247 -2450
6593 -2450 4570 15758 18493 8584 3466 -3984 18594 40078 42911 31772 11021 -2716 -4652
6580 -4652 164 15156 665 -10043 -9832 -13120 -15603 -2077 18359 15768 -11243 -13534 1897
6567 1897 1966 -9786 -22775 -21204 -7853 16764 14222 2590 3254 -4401 -9835 -10678 14117 25607
6553 25607 596 -12375 -6287 5250 8643 -16749 -12044 -10750 -12653 -15216 -15436 -7188 -12223 -9714
6539 -9714 3434 33550 61370 55941 23403 -2818 -20649 -49297 -68706 -66479 -46511 -14359
6527 -14359 -7233 -4024 -1703 3807 17639 22888 34098 31718 30528 14498 -13230 -8855 18472
$$ packed form
6620a9172m82j351J3215K81k7353R286J2135J409J3736j876k1944J7295J1131
6607F310M425r847l3239j7904n696K0205J9650n201P948Q576k878K127j2723J5797
6593b450P020J1188K735r909n118p450K2578K1484K833j1139k0751j3737j936
6580d652M816J4992j4491j0708K11l288k483J3526K0436k591k7011k291J5431
6567A897O9j1752j2989J571J3351K4617k542j1632O64p655n434q43K4795J1490
6553B5607k5011j2971O088J1537L393k5392M705J294j903k563k20Q248n035K509
6539i714J3148L0116K7820n429l2538k6221j7831k8648j9409K227J9968L2152
6527a4359P126L209K321N510J3832N249J1210k380j190j6030k7728M375K7327
$$ plain form
6514 18472 37241 21253 27085 33600 5585 -22154 -38369 -49298 -44022 -38288 -32789 -23331 -20508
6501 -20508 -31534 -43389 -40426 -28353 -9889 -25515 -26044 -18866 -21456 -19200 -11704 -12133 -6192 11670
6487 11670 2820 -7195 -7474 4445 13279 7137 5064 8680 -5771 3409 10599 -1714 -15793 -7010
6473 -7010 -1353 -3095 -15819 -7254 -7718 -15461 5512 12120 23642 9298 -6599 -1774 -3785 85
6459 85 11143 34207 29043 -7095 -14188 -11207 -26016 -24010 -23382 -11485 -2527 -22116 -9588 -6659
6445 -6659 -11089 -6332 9275 16429 24962 16182 7994 9128 -589 -13121 10059 18640 13476 15855
6431 15855 16744 10581 -522 -9778 -11886 4923 3183 -2114 8289 445 -11609 -16962 -15615 -18698
6417 -18698 -3191 -3461 -3221 -7941 -4133 -3235 -48877 -55117 -37337 -31119 -18974 -9910 -9594 -10310 -10156
$$ packed form
6514A8472J8769j5988N832O515k8015k7739j6215j0929N276N734N499R458K823
6501b0508j1026j1855K963J2073J8464j5626n29P178k590K256P496m29N941J7862
6487A1670q850j0015k79J1919Q834o142k073L616j4451R180P190j2313j4079Q783
6473g010N657j742j2724Q565m64p743K0973O608J1522j4344j5897M825k011L870
6459H5J1058K3064n164l6138p093K981j4809K006O28J1897Q958j9589J2528K929
6445f659m430M757J5607P154Q533q780q188J134r717j2532K3180Q581n164K379
6431A5855Q89o163j1103r256k108J6809j740n297J0403p844j2054n353J347l083
6417a8698J5507k70K40m720L808Q98m5642o240J7780O218J2145R064L16p16J54
$$ plain form
6402 -10156 -13943 -13368 -9057 -20966 -26692 -21358 -2456 -5532 -14121 -26401 -34086 -16697 -5109 -1384
6388 -1384 47 -5784 -22892 -12863 -15472 -13228 -10788 -11862 -20383 -26542 -36814 -20424 1742 6124
6374 6124 10604 -366 -20272 -31655 -25940 -20596 -1005 1309 -9758 -19016 -35050 -31560 -26475
6361 -26475 -8450 6078 -9431 -18324 -2307 -6050 -6895 -8156 -6710 20655 10895 7975 14160 41330
6347 41330 50576 39448 25103 10117 -1349 -13640 -29128 -37613 -27152 -10851 248 26324
6335 26324 7699 9504 -1193 -15900 88 -1221 -2750 -28969 -6374 15737 11113 10561 -19699
6322 -19699 -22245 12805 17256 19335 2800 -12828 -11085 9956 7383 -20706 -23198 -30642 -30502 -24956
6308 -24956 -28108 -15675 -9018 -10426 -13805 -8627 2412 -15733 -19620 -8215 -6885 -18626 -9763
$$ packed form
6402a0156l787N75M311j1909n726N334J8902l076q589j2280p685J7389J1588L725
6388a384J431n831j7108J0029k609K244K440j074q521o159j0272J6390K2166M382
6374F124M480j0970j9906j1383N715N344J9591K314j1067r258j6034L490N085
6361b6475J8025J4528j5509q893J6017l743q45j261J446K7365r760k920O185K7170
6347D1330R246j1128j4345j4986j1466j2291j5488q485J0461J6301J1099K6076
6335B6324j8625J805j0697j4707J5988j309j529k6219K2595K2111m624n52l0260
6322a9699k546L5050M451K079j6535j5628J743K1041k573k8089k492p444J40N546
6308b4956l152J2433O657j408l379N178J1039j8145l887J1405J330j1741Q863
$$ plain form
6295 -9763 7449 18171 10453 10403 3154 4779 33144 42759 17948 7546 -5354 -34431 -30307 -10912
6281 -10912 -3560 -16746 -14401 -7672 -1780 -2589 -7055 -11793 -24983 -17741 -5448 -2987 9944 18501
6267 18501 20245 30543 27129 -1993 -823 -6028 -15742 -16391 -20953 -26711 2807 892 -1261 32555
6253 32555 41257 32317 7396 -4564 6569 6565 -5620 -15121 -20698 -17004 -9354 -1999 -9749 -2885
6239 -2885 7493 -1087 -5599 -11667 2447 7391 1990 -14428 -8437 -13033 -19414 -8184 -5452 -18124
6225 -18124 -49467 -28665 -13899 -2139 -6249 -6720 -8682 11027 -34 -26006 -23357 -28627 -19745
6212 -19745 -18400 -18263 -12209 -7858 -5411 -15695 -16643 -17242 -14525 -2897 -23105 -33917 -33823 -21748 -9110
6197 -9110 -1650 -17875 -30604 -26606 -39935 -19779 -12326 -7412 -30467 -38018 -18031 11451 27560
$$ packed form
6295i763J7212J0722p718n0p249J625K8365R615k4811j0402j2900k9077M124J9395
6281a0912P352j3186K345O729N892q09m466m738j3190P242J2293K461J2931Q557
6267A8501J744J0298l414k9122J170n205r714o49m562n758K9518j915k153L3816
6253C2555Q702q940k4921j1960J1133mj2185r501n577L694P650P355p750O864
6239b885J0378q580m512o068J4114M944n401j6418N991m596o381J1230K732j2672
6225a8124l1343K0802J4766J1760m110m71j962J9709j1061k5972K649n270Q882
6212a9745J345J37O054M351K447j0284r48n99K717J1628k0208j0812R4J2075J2638
6197i110P460j6225j2729L998j3329K0156P453M914k3055p551J9987K9482J6109
$$ plain form
6184 27560 20873 7368 402 -14566 -2382 2271 -17215 -29274 -6117 -2883 16795 34053 33144
6171 33144 46392 40731 4497 -17549 -11035 -13294 8438 24065 26065 32297 25620 6582 10195
6158 10195 824 -8018 9953 18513 24448 5835 -1230 -4699 10970 8644 3670 -8626 -9512 336
6144 336 27444 26728 15587 -12066 -24855 -4334 -1324 2123 -3833 10242 4983 -1200 -6831 -17423
6130 -17423 -28221 -25617 -16040 -22274 -28035 -14468 -15004 -19448 -34554 -37346 -25673 -11093 4072
6117 4072 10899 14061 10727 -1151 -9334 -1114 2525 -1840 -8756 -10338 -3561 3411 6161 2066 5924
6102 5924 6207 6192 13572 10395 9965 -2807 -22499 -10570 2490 2609 11391 6331 -481 -8422 -6295
6087 -6295 -1264 11192 16525 -1863 -5116 -13497 -18334 -21068 2915 14061 -8164 -26764 -19932
$$ packed form
6184B7560o687j3505o966j4968J2184M653j9486j2059K3157L234J9678J7258r09
6171C3144J3248n661l6234k2046O514k259K1732J5627K000O232o677j9038L613
6158A0195r371q842J7971Q560N935j8613p065l469J5669k326m974j2296q86R848
6144C36K7108p16j1141k7653j2789K0521L010L447n956J4075n259o183n631j0592
6130a7423j0798K604R577o234n761J3567n36m444j5106k792J1673J4580J5165
6117D072O827L162l334j1878q183Q220L639m365o916j582O777O972K750m095L858
6102E924K83j5P380l177m30j2772j9692J1929J3060J19Q782n060o812p941K127
6087f295N031J2456N333j8388l253q381m837k734K3983J1146k2225j8600O832
$$ plain form
6074 -19932 -9970 -18517 -28241 -12032 11438 -7506 -25383 -21440 -28839 -13708 5364 10001 17170
6061 17170 17672 1790 1313 -16457 -16205 -21050 -15989 -7187 8496 25351 23939 13892 25394 13428
6047 13428 -1030 -8682 -24581 -25733 -13695 -20833 -35486 -14539 5514 26328 41028 17220
6035 17220 -30344 -59381 -37740 -3893 2729 22087 23938 22063 13711 -5749 -14536 8840 21067
6022 21067 13421 -2159 -20065 -1051 913 7909 -18420 -20757 1233 14675 10137 -3013 -16775
6009 -16775 -13457 -22419 -8541 13343 11793 21073 -2850 -46712 -45792 -39040 -30822 -22361 -20642 -34394
5995 -34394 -35547 -20654 -507 3761 3703 -1618 -8199 -14889 -8882 -9842 -9568 -6760 -13249 -8781 -16602
5980 -16602 -22074 -35226 -27654 -12079 -2431 -12321 -7924 -18126 -15104 -9234 17134 34394 26546
$$ packed form
6074a9932R962q547r724J6209K3470j8944j7877L943p399J5131J9072M637P169
6061A7170N02j5882m77j7770K52m845N061Q802J5683J6855j412j0047J1502j1966
6047A3428j4458p652j5899j152J2038p138j4653K0947K0053K0814J4700k3808
6035A7220m7564k9037K1641L3847O622J9358J851j875q352j9460q787K3376J2227
6022B1067p646j5580j7906J9014J964O996k6329k337K1990J3442m538j3150j3762
6009a6775L318q962J3878K1884j550R280k3923m3862R20O752Q218Q461J719j3752
5995c4394j153J4893K0147M268n8n321o581o690O007r60K74K808o489M468p821
5980a6602n472j3152P572J5575R648r890M397j0202L022N870K6368J7260p848
$$ plain form
5967 26546 8999 -3838 3144 2819 20584 7339 6809 -3282 -10344 -14726 3946 -189 2459 5284
5953 5284 78 13651 17760 13341 2199 -11216 -9300 -5975 5403 20674 17216 16680 3764 -9684
5939 -9684 1203 10825 -896 -4555 -5403 10096 11880 1748 -13835 -29364 -29622 -17150 -32847
5926 -32847 -43427 -45933 -39990 -27454 -21415 -19680 -22984 -2191 6000 33 410 15085 21051 22051
5912 22051 22860 2062 -5238 -30 13997 33530 29411 9892 12547 17165 -1376 -21778 -10365
5899 -10365 8505 -19616 -53209 -51852 -32209 -10731 -9663 896 3782 1849 -2406 -2153 31573
5886 31573 47131 33361 17808 16450 -11524 1754 -4844 -17438 -4067 -5788 -11092 -10000 -8017
5873 -8017 -10670 -7316 -11414 15515 29007 14764 9406 3809 -19805 -4516 700 -6128 -6149 -24216
$$ packed form
5967B6546j7547j2837O982l25J7765j3245n30j0091p062m382J8672m135K648K825
5953E284n206J3573M109m419j1142j3415J916L325J1378J5271l458n36j2916j3448
5939i684J0887R622j1721l659q48J5499J784j0132j5583j5529k58J2472j5697
5926c2847j0580k506N943J2536O039J735l304K0793Q191n967L77J4675N966J000
5912B2051Q09k0798p300N208J4027J9533m119j9519K655M618j8541k0402J1413
5899a0365J8870k8121l3593J357J9643K1478J068J0559K886j933m255K53L3726
5886C1573J5558j3770j5553j358k7974J3278o598j2594J3371j721n304J092J983
5873h017k653L354m098K6929J3492j4243n358n597k3614J5289N216o828k1j8067
$$ plain form
5859 -24216 -32651 -13241 -12693 -19018 -16681 -20836 -35711 -20852 -18410 -17619 -12833 -14066 -67 19924
5845 19924 5197 -10520 4224 26011 24030 15853 10963 3181 9646 8533 134 1382 15106
5832 15106 30076 16379 154 -1685 -13902 -1460 -290 -17108 -29988 -33174 -18536 -1127
5820 -1127 11383 -13136 -9104 -8877 -27563 -19285 -23521 -10248 -21364 -32179 1746 112 -17878
5807 -17878 -6372 1414 6410 -380 -9428 -30612 -46901 -34698 -47581 -37996 -20476 -7644 -5299
5794 -5299 7064 20842 14916 -3657 -12009 -5560 -3838 -11016 -3391 2982 7123 -6495 -21766 -18639
5780 -18639 -19081 -7036 -335 -1054 11405 33278 30336 17542 -16042 -12398 -20975 -38413 -30655 -12099
5766 -12099 6157 10487 -7743 -29619 -53551 -45925 -26618 5993 -1845 -7394 -4941 4956 -8175
$$ packed form
5859b4216q435J9410N48o325K337m155j4875J4859K442P91M786j233J3999J9991
5845A9924j4727j5717J4744K1787j981q177m890p782O465j113q399J248J3724
5832A5106J4970j3697j6225j839j2217J2442J170j6818j2880l186J4638J7409
5820a127J2510k4519M032K27j8686Q278m236J3273j1116j0815L3925j634j7990
5807a7878J1506P786M996o790r048k1184j6289J2203j2883R585J7520J2832K345
5794e299J2363J3778n926j8573q352O449J722p178P625O373M141j3618j5271L127
5780a8639m42J2045O701p19J2459K1873k942j2794l3584L644q577j7438P758J8556
5766a2099J8256M330j8230k1876k3932P626J9307L2611p838n549K453R897j3131
$$ plain form
5753 -8175 -10777 21386 32652 13038 -5319 -12539 2004 6724 2383 -5628 -222 -3205 5811 -10025
5739 -10025 -46688 -43233 -4028 23726 25652 2727 -4110 -2296 -6656 -8136 -6418 4242 2552
5726 2552 -1354 11769 30347 16707 -4443 -14279 -30131 -36161 -28941 -31634 -14852 -11474 -14871
5713 -14871 -3595 -5858 -21666 -27342 -18638 -31129 -43261 -49736 -54427 -42014 -11830 15263 27572
5700 27572 20343 15657 719 -1194 8219 -1516 -16776 -19660 -16198 -8013 3611 6412 12255 9317
5686 9317 8387 16278 27665 29377 15296 18368 6034 -1971 -7366 -4496 5459 -10781 -15022 -1585
5672 -1585 -1293 -11183 -16174 -29070 -19809 -4819 -3107 -19406 -24732 -31766 -15714 -5147 1985 2413
5658 2413 12508 20465 11842 -11694 -22865 -23878 -20972 -20225 -11375 -8741 9809 -21289 -27061 -12410
$$ packed form
5753h175k602L2163J1266j9614j8357p220J4543M720m341q011N406k983R016j5836
5739a0025l6663L455L9205K7754J926k2925o837J814m360j480J718J0660j690
5726B552l906J3123J8578j3640k1150r836j5852o030P220k693J6782L378l397
5713a4871J1276k263j5808n676Q704j2491j2132o475m691J2413L0184K7093J2309
5700B7572p229m686j4938j913R413r735j5260k884L462Q185J1624K801N843k938
5686I317r30P891J1387J712j4081L072j2334q005n395K870R955j6240m241J3437
5672a585K92r890m991j2896R261J4990J712j6299n326p034J6052J0567P132M28
5658B413J0095P957q623k3536j1171j013K906P47Q850K634J8550l1098n772J4651
$$ plain form
5644 -12410 3552 -8468 -8168 -16704 -5443 6535 -6854 -29858 -18186 -21769 -23391 -19230 -22236
5631 -22236 -24437 -21496 -21551 -43627 -43923 -23003 -2611 6831 13740 36717 31063 11610 5014 -4154
5617 -4154 11686 6928 -22449 -39189 -7811 10713 -7019 -17661 -21784 -12029 8978 5197 6893
5604 6893 14794 27268 25116 27880 35131 14812 -16139 -27224 -31230 -31746 -24212 -19402 -5933 -26578
5590 -26578 -40364 -35704 -15490 -5803 -11939 -15462 3455 5080 13674 11825 6632 -8158 -823 -10317
5576 -10317 -8643 -4555 4330 22783 36307 24559 25134 14924 5142 12594 17266 19271 10995 33787
5562 33787 56469 61617 44920 18749 24040 15117 11487 -17073 -19216 -8479 -7057 -1690 6512
5549 6512 -6453 -8017 -13879 -28169 -43630 -28797 -13656 -16722 2189 10154 -4620 10201 20178
$$ packed form
5644a2410J5962j2020L00q536J1261J1978j3389k3004J1672l583j622M161l006
5631b2236k201K941n5k2076k96K0920K0392R442O909K2977n654j9453o596r168
5617d154J5840m758k9377j6740L1378J8524j7732j0642m123R755K1007l781J696
5604F893P901J2474k152K764P251k0319l0951j1085m006n16P534M810J3469k0645
5590b6578j3786M660K0214R687o136l523J8917J625Q594j849n193j4790P335r494
5576a0317J674M088Q885J8453J3524j1748N75j0210r782P452M672K005q276K2792
5562C3787K2682N148j6697k6171N291q923l630k8560k143J0737J422N367Q202
5549F512j2965j564n862j4290j5461J4833J5141l066J8911P965j4774J4821R977
$$ plain form
5536 20178 24475 20666 13710 13032 17399 4367 -22411 -14058 -7166 598 13578 7492 -14148 -14669
5522 -14669 -6902 1152 -4540 -19687 -9786 -824 -16784 -36970 -37860 -19871 -12419 2401 21179
5509 21179 16656 -8448 -19227 -1564 5900 271 -14320 -27085 -18124 -2892 -24121 -27705 -48082
5496 -48082 -32329 -24495 -11049 -5049 -6174 -1764 2018 -612 -4147 -5621 -1381 -10747 2350 4092
5482 4092 10346 37881 42673 14653 12699 22055 29261 2883 -13959 -29072 -16143 -8236 -3495
5469 -3495 -31082 -36866 -48476 -52699 -36928 -24692 -22325 -21112 -33922 -23631 -10748 -5519 2371
5456 2371 -13754 -15329 -2004 8769 273 -35303 -55695 -27004 -21055 -22733 -11624 -8715 -15341
5443 -15341 -479 5830 279 4723 -10480 -33127 -37567 -34941 -39088 -27597 -2248 12926 1943
$$ packed form
5536B0178M297l809o956o78M367j3032k6778Q353O892P764J2980o086k1640n21
5522a4669P767Q054n692j5147R901Q962j5960k0186q90J7989P452J4820J8778
5509B1179m523k5104j0779J7663P464n629j4591j2765Q961J5232k1229l584k0377
5496d8082J5753P834J3446O000j125M410L782k630l535j474M240r366J3097J742
5482D092O254K7535M792k8020j954R356P206k6378j6842j5113J2929P907M741
5469c495k7587n784j1610m223J5771J2236K367J213j2810J0291J2883N229P890
5456B371j6125j575J3325J0773q496l5576k0392K8691N949j678J1109K909o626
5443a5341J4862O309n551M444j5203k2647m440K626m147J1491K5349J5174j0983
$$ plain form
5430 1943 -5723 6518 13568 1824 15269 5151 -13318 -18542 -4044 3215 8027 -12269 -5677
5417 -5677 2034 -5129 -11262 -21428 -12309 -1862 -6973 -9100 -4031 5773 405 -1378 28513 18599
5403 18599 7625 2243 -1345 1756 8162 10231 6485 10843 31945 9574 -835 16805 27805
5390 27805 45247 37483 13214 -3275 -5825 -3495 12127 5307 -12308 -24172 -23864 -14337 131
5377 131 -4993 -11721 -18447 -20482 -21446 -26351 -17116 -15121 -16660 -17458 -20484 -18046 -14678 -13509 -22101 -19657
5361 -19657 -21192 -47425 -36071 -17105 -7875 6524 -1505 -12823 -20291 -43502 -35828 -13573 -13730
5348 -13730 -9379 -45329 -57609 -42861 -4648 11506 9063 998 2682 5512 -10610 -22374 -18053
5335 -18053 -24942 -29838 -25900 -18299 -11822 -13726 -936 -16001 -10705 7725 5587 -194 20243 15334
$$ packed form
5430A943p666J2241P050j1744J3445j0118j8469n224J4498P259M812k0296O592
5417e677P711p163o133j0166R119J0447n111k127N069R804n368j783K9891r914
5403A8599j0974n382l588L101O406K069l746M358K1102k2371j0409J7640J1000
5390B7805J7442p764k4269j6489k550K330J5622o820j7615j1864L08R527J4468
5377A31n124o728o726k035r64m905R235J995j539p98l026K438L368J169q592K444
5361a9657j535k6233J1354J8966R230J4399q029j1318p468k3211P674K2255j57
5348a3730M351l5950j2280J4748L8213J6154k443q065J684K830j6122j1764M321
5335a8053o889m896L938P601O477j904J2790j5065N296J8430k138n781K0437m909
$$ plain form
5321 15334 4985 15401 7898 -22619 -44393 -42065 -45628 -24461 -14198 -16942 -6101 -30895 -29431
5308 -29431 -14774 -11548 -13710 -12395 -9704 3481 13384 -98 6267 12452 8661 18618 8904 -11980
5294 -11980 -32953 -49448 -57681 -72236 -42323 -25663 -17753 -32954 -31699 -23272 -19407 -44103 -57393
5281 -57393 -45915 -36717 -52608 -41893 -30736 -20721 -46687 -41758 -41354 -25333 -6997 -1301 -7961
5268 -7961 -16663 -27694 -32643 -19293 -7099 2297 -16917 -28404 -19285 -19515 -8623 -5683 -8940 -10137
5254 -10137 -4213 -15436 -4093 -25741 -29395 -24832 -22768 -23550 -17224 -11827 -26288 -44479 -38362 -28402
5240 -28402 -25807 -1401 31251 32997 16823 -2916 21461 33243 7271 -2313 14514 4009
5228 4009 1302 -212 8465 12522 6834 7472 10532 25828 17346 3889 -21761 -23017 -12439 -12451 -25321
$$ packed form
5321A5334j0349J0416p503l0517k1774K328l563K1167J0263k744J0841k4794J464
5308b9431J4657L226k162J315K691J3185R903j3482O365O185l791R957r714k0884
5294a1980k0973j6495q233j4555K9913J6660P910j5201J255Q427L865k4696j3290
5281e7393J1478R198j5891J0715J1157J0015k5966M929M04J6021J8336N696o660
5268g961q702j1031m949J3350J2194R396j9214j1487R119k30J0892K940l257j197
5254a0137N924j1223J1343k1648l654M563K064p82O326N397j4461j8191O117R960
5240b8402K595K4406L2652J746j6174j9739K4377J1782k5972r584J6827j0505
5228D009k707j514Q677M057n688O38L060J5296q482j3457k5650j256J0578j2j2870
$$ plain form
5213 -25321 -38243 -42431 -28347 -24698 -19027 -17624 -38173 -45481 -40976 -36664 -24018 -8904 1288
5200 1288 -4672 -19636 -4378 -7498 -27688 -19213 -24095 -27930 -37742 -43066 -22481 -31043 -19839 -14496
5186 -14496 -5574 -5067 -15861 -34884 -55092 -40555 -18304 -26091 -33919 -10792 8556 20225 33432
5173 33432 16291 -380 -4024 -20769 -7858 -5964 -13173 -847 14752 1089 -12977 3068
5161 3068 6597 16996 6514 5637 -14593 144 3722 -17183 -22213 -12302 -9824 -4519 7126 24559
5147 24559 22411 17970 21925 -1601 -11478 -5830 9779 8984 18637 10545 15275 7365 -29 2757
5133 2757 -17076 -14697 -32451 -49688 -47160 -9491 6071 265 4856 8872 12657 14339 9708 2862
5119 2862 -635 6635 10451 11147 17401 937 3157 13457 20386 -6896 -2298 -3494 5478 4046
$$ packed form
5213b5321j2922m188J4084L649N671J403k0549p308M505M312J2646J5114J0192
5200A288n960j4964J5258l120k0190Q475m882l835r812n324K0585q562J1204N343
5186a4496Q922N07j0794j9023k0208J4537K2251p787p828K3127J9348J1669J3207
5173C3432j7141j6671l644j6745J2911J894p209J2326J5599j3663j4066J6045
5161C068L529J0399j0482q77k0230J4737L578k0905n030R911K478N305J1645J7433
5147B4559k148m441L955k3526r877N648J5609p95R653q092M730p910p394K786
5133B757j9833K379j7754j7237K528L7669J5562n806M591M016L785J682m631o846
5119B862l497P270L816O96O254j6464K220J0300O929k7282M598j196Q972j432
$$ plain form
5105 4046 13773 30356 18625 2936 -1875 -10988 -18746 -30836 -41324 -31966 -13791 -9194 -7991
5092 -7991 -10291 -465 3920 15176 25237 14210 592 -8914 -7844 10025 9095 2657 -3010 -20659
5078 -20659 -14254 -3853 6408 -11930 -19808 -20181 -10410 -28310 -41464 -32843 -35114 -37541 -41624 -33294
5064 -33294 -13491 -4352 156 -4961 -5767 5985 -14242 -9080 4510 24048 21214 20419 -6461 -28442
5050 -28442 -25918 -8027 -1200 673 -20143 -31305 -26119 -18102 -9108 15698 106 -17988 -16276
5037 -16276 -40760 -60996 -36796 -41684 -54692 -36090 -21738 -3031 10836 12266 12613 9 -13932
5024 -13932 -10068 -13172 -163 14301 7118 -7640 -30805 -43112 -33198 -50346 -47563 -42347 -41770
5011 -41770 -47014 -38921 -1575 14754 -646 -7993 -7116 -5382 1702 13612 19777 36964 22132
$$ packed form
5105D046R727J6583j1731j5689m811r113p758j2090j0488R358J8175M597J203
5092g991k300R826M385J1256J0061j1027j3618r506J070J7869r30o438n667j7649
5078b0659O405J0401J0261j8338p878l73R771j7900j3154Q621k271k427m083Q330
5064c3294J9803R139M508n117q06J1752k0227N162J3590J9538k834p95k6880k1981
5050b8442K524J7891O827J873k0816j1162N186Q017Q994K4806j5592j8094J712
5037a6276k4484k0236K4200m888j3008J8602J4352J8707J3867J430L47j2604j3941
5024a3932L864l104J3009J4464p183j4758k3165j2307R914j7148K783N216N77
5011d1770n244Q093L7346J6329j5400p347Q77J734P084J1910O165J7187j4832
$$ plain form
4998 22132 -9289 -14045 -3816 -9806 -14802 -12602 -13538 -9744 -21852 -26610 -14207 4085 153 4373
4984 4373 10855 17658 4866 -28508 -19635 -12580 -16629 -4380 16662 17993 5385 -17246 -20338
4971 -20338 -21697 -34648 -4661 17257 28611 26078 40733 36754 16490 16117 11147 11495 17851 24025
4957 24025 33218 26116 20941 24237 3659 5441 17596 14492 5897 -3104 7231 11649 7889 18798
4943 18798 25291 23326 19203 555 2815 -1998 -16416 -25126 -20691 -16595 -12766 -5724 17967 22181
4929 22181 2988 4525 9401 4269 18925 19341 12261 25079 25794 15653 8228 6600 7183 149
4915 149 12073 11385 29984 37748 34000 30893 21868 24552 11218 -18960 -27316 -12970 10273 6904
4901 6904 -11251 -30647 -31832 -16945 -9612 -10007 -3269 4538 3501 4381 -8984 -17781 -34704 -32286
$$ packed form
4998B2132l1421m756J0229n990m996K200r36L794j2108m758J2403J8292l932M220
4984D373O482O803j2792l3374Q873P055m049J2249K1042J331j2608k2631l092
4971b0338j359j2951K9987K1918J1354k533J4655l979k0264l73m970L48O356O174
4957B4025R193p102n175L296k0578J782J2155l104q595r001J0335M418l760J0909
4943A8798O493j965m123j8648K260m813j4418q710M435M096L829P042K3691M214
4929B2181j9193J537M876n132J4656M16p080J2818P15j0141p425j628N83p034
4915A49J1924o88J8599P764l748l107r025K684j3334l0178q356J4346K3243l369
4901F904j8155j9396j185J4887P333l95O738P807j037Q80j3365q797j6923K418
$$ plain form
4887 -32286 -21814 -4369 27092 32066 9344 21532 -814 -14160 -6671 -6872 -15441 -40194 -24031
4874 -24031 5166 -1705 -20620 -33481 -18087 -4175 -13684 -27312 -28359 -25756 -21698 -10545 -2095
4861 -2095 -19068 -21987 -33282 -29006 -6873 -5189 -2453 16516 10688 -4948 4674 20145 9263
4848 9263 10683 23753 6412 -23530 -33867 -40576 -43265 -21051 -10638 -17044 -17370 -31030 -43188
4835 -43188 -37354 -47133 -35026 -28145 -31689 -40250 -33391 -16892 -18511 -8113 -5605 -7995 -7387 -26388
4821 -26388 -26170 -6077 -17959 -10657 -5801 5917 16895 14830 -9486 -23619 -27781 -13994 1444
4808 1444 14833 3007 7578 20732 11344 8414 13297 23234 6748 -28737 -33803 -22395 -10352
4795 -10352 -1330 16336 20992 18197 27386 6117 -17066 -2191 -11322 -14644 -5582 10554 -1197
$$ packed form
4887c2286J0472J7445L1461M974k2722J2188k2346j3346P489k01q569k4753J6163
4874b4031K9197o871j8915j2861J5394J3912r509j3628j047K603M058J1153Q450
4861b095j6973k919j1295M276K2133J684K736J8969n828j5636R622J5471j0882
4848I263J420J3070j7341k9942j0337o709k689K2214J0413o406l26j3660j2158
4835d3188N834r779J2107O881l544q561O859J6499j619J0398K508k390O08j9001
4821b6388K18K0093j1882P302M856J1718J0978k065k4316j4133m162J3787J5438
4808A444J3389j1826M571J3154r388k930M883R937j6486l5485n066J1408J2043
4795a0352R022J7666M656k795R189k1269k3183J4875r131l322R062J6136j1751
$$ plain form
4782 -1197 675 -1665 24743 49718 44355 52995 30915 4967 12184 -3134 1676 2336 1834 10201
4768 10201 39125 26098 41362 47751 22314 1063 1294 23727 14173 -12890 -20047 -11988 -5615
4755 -5615 -11088 -10827 -1375 8715 888 -18091 -33031 -47524 -41778 -18395 4587 10727 19180 11160
4741 11160 -3476 -4154 16901 20870 4462 -489 -4685 -5626 3510 9495 8191 -25216 -25853 6102
4727 6102 19025 11545 14174 -2797 5410 -20674 -38493 -29182 -22037 -15918 1165 4290 -5788
4714 -5788 -10176 -19045 -10572 -13509 -29830 -36940 -37154 -23670 -6753 -32333 -59237 -55915 -26049 -22485
4700 -22485 -41877 -22807 -70 -13310 -17601 -15354 -13478 -15892 -14349 -5746 -963 -13588 -34081
4687 -34081 -20793 4703 7521 19202 29478 11467 -25978 -15777 11159 17446 14611 -19097
$$ packed form
4782a197J872k340K6408K4975n363Q640k2080k5948P217j5318M810O60n02Q367
4768A0201K8924j3027J5264O389k5437k1251K31K2433r554k7063p157Q059O373
4755e615n473K61R452J0090p827j8979j4940j4493N746K3383K2982O140Q453q020
4741A1160j4636o78K1055L969j6408m951m196r41R136N985j304l3407o37L1955
4727F102J2923p480K629j6971Q207k6084j7819R311P145O119J7083L125j0078
4714e788m388q869Q473k937j6321p110k14J3484J6917k5580k6904L322K9866L564
4700b2485j9392J9070K2737j3240m291K247J876k414J543Q603M783j2625k0493
4687c4081J3288K5496K818J1681J0276j8011l7445J0201K6936O287k835l3708
$$ plain form
4675 -19097 -34440 701 3265 -6452 -2364 15807 7443 -7058 -4595 -14300 -35611 -18064 -5520
4662 -5520 1333 1615 3894 -10623 -4535 4967 12602 8118 -738 4033 -201 -9653 14411 22767 32171
4647 32171 27714 -882 6309 13046 -4696 -17034 -12917 -20676 -22655 -29172 -8552 22654 32986
4634 32986 11009 6679 10758 10772 7563 -6443 -12337 3828 8065 8226 -10412 -14613 -6573 -13929
4620 -13929 -23688 -18911 -14482 -11247 329 7038 10204 2410 -8239 -2919 3713 7177 441 -23637
4606 -23637 -15497 -2853 10172 8081 -23470 -19619 -7945 -8878 -16583 -15936 -34555 -36935 -28071 -20597
4592 -20597 -25072 -22942 -32298 -28808 -27772 -14307 4859 9189 23168 9104 -19148 -27365 -32922
4579 -32922 -28104 -26614 -27132 -23078 -35242 -38022 -33553 -21491 -2794 13454 19960 3222 -6303 -7034
$$ packed form
4675a9097j5343L5141K564r717M088J8171q364j4501K463r705k1311J7547J2544
4662e520O853K82K279j4517O088R502P635m484q856M771m234r452K4064Q356R404
4647C2171m457k8596P191O737j7742j2338M117p759j979o517K0620L1206J0332
4634C2986k1977m330M079J4l209j4006n894J6165M237J61j8638m201Q040p356
4620a3929r759M777M429L235J1576O709L166p794j0649N320O632L464o736k4078
4606b3637Q140J2644J3025k091l1551L851J1674r33p705O47j8619k380Q864P474
4592b0597m475K130r356L490J036J3465J9166M330J3979j4064k8252q217n557
4579c2922M818J490n18M054j2164k780M469J2062J8697J6248O506j6738r525p31
$$ plain form
4565 -7034 12006 5577 -1851 -3460 3953 -4031 -5578 28711 25584 5680 -620 -12438 -19154 -12282
4551 -12282 -8341 -1411 18547 18924 14579 3709 13174 9075 15157 11325 14854 14993 11264 17014 -814
4536 -814 -23028 -19528 -24427 -15382 -9288 3509 16923 12128 17291 -8581 -25155 -31194 -26930 -16725
4522 -16725 15333 13362 -2181 -10800 -896 -6543 -851 18302 5171 -33437 -31023 -18079 -18728
4509 -18728 -10302 -2724 851 -9151 -23017 -25594 -25960 -23257 -3376 -23365 -25027 -21227 -15627 -34427
4495 -34427 -36577 -3458 -992 19120 10653 -5829 -11515 -3017 -2828 -4873 9543 15018 19923 13307
4481 13307 15341 2608 -6919 831 8956 1531 16429 23772 19032 10468 25934 29318 12992 6446
4467 6446 6745 4258 4644 -469 -7180 -12178 -26372 -47471 -43064 -5729 74 1911 -17516 -20421
$$ packed form
4565g034J9040o429p428j609P413p984j547L4289l127j9904o300j1818o716O872
4551a2282L941O930J9958L77m345j0870R465m099O082l832L529J39l729N750j7828
4536h14k2214L500m899R045O094J2797J3414m795N163k5872j6574o039M264J0205
4522a6725L2058j971j5543q619R904n647N692J9153j3131l8608K414J2944o49
4509a8728Q426P578L575j0002j3866k577l66K703J9881j9989j662L800N600j8800
4495c4427k150L3119K466K0112q467j6482n686Q498J89k045J4416N475M905o616
4481A3307K034j2733r527P750Q125p425J4898P343m740q564J5466L384j6326o546
4467F446K99k487L86n113o711m998j4194k1099M407L7335N803J837j9427k905
$$ plain form
4453 -20421 -11686 -3463 13005 34 -1056 33553 35412 16996 8396 -118 -330 3910 -8200 -14366
4439 -14366 -15520 11180 14172 24996 16673 16962 14751 18760 28356 34160 37820 32948 18163 10471
4425 10471 21423 5635 -29493 -45033 -30549 -6881 11630 14272 8118 31375 15610 -8207
4413 -8207 -12575 -18512 -17732 -10479 -8871 -27042 -18772 -1657 -6592 6465 14885 6735 23420 13693
4399 13693 5151 11295 18536 -2556 -8148 3840 12462 8243 9007 7115 5209 -6314 -9272 4987
$$ packed form
4453b0421Q735Q223J6468j2971j090L4609J859j8416q600q514k12M240j2110o166
4439a4366j154K6700K992J0824q323K89k211M009R596N804L660m872j4785p692
4425A0471J0952j5788l5128j5540J4484K3668J8511K642o154K3257j5765k3817
4413h207m368n937P80P253J608j8171Q270J7115m935J3057Q420q150J6685r727
4399A3693q542O144P241k1092n592J1988Q622m219P64j892j906j1523k958J4259
$$ [...]
##END NTUPLES=NMR SPECTRUM
##END=
