##TITLE=Analysis number 324645
Compound Code cc 21113
Book Reference 483/82
Project Code adrs
Chemist Name mattw
##JCAMPDX= 6.0         $$ Bruker NMR JCAMP-DX V2.0
##DATA TYPE= NMR SPECTRUM
##DATA CLASS= NTUPLES
##ORIGIN= Bruker BioSpin GmbH
##OWNER= nmr
$$ XWIN-NMR		Version 3.5
$$ Tue Nov 28 14:00:51 2006 GMT Standard Time (UT+0h)  MAYBRIDGE\nmr@NMR_250MHZ
##.OBSERVE FREQUENCY= 250.131544655141
##.OBSERVE NUCLEUS= ^1H
##.ACQUISITION MODE= SIMULTANEOUS (DQD)
##.ACQUISITION SCHEME= undefined
##.AVERAGES= 16
##.DIGITISER RES= 18
##SPECTROMETER/DATA SYSTEM= dpx250
##.PULSE SEQUENCE= zg30
##.SOLVENT NAME= CDCl3
##.SHIFT REFERENCE= (INTERNAL, CDCl3, 0, 16.4474)
##AUDIT TRAIL= $$ (NUMBER, WHEN, WHO, WHERE, WHAT)
$$ ##TITLE= Audit trail, XWIN-NMR		Version 3.5
$$ ##JCAMPDX= 5.01
$$ ##ORIGIN= Bruker BioSpin GmbH
$$ ##OWNER= nmr
$$ C:\u/data/dgb/nmr/ADRS/1350/pdata/1/auditp.txt
$$ ##AUDIT TRAIL=  $$ (NUMBER, WHEN, WHO, WHERE, WHAT)
(   1,<2006-11-28 14:00:18.61 +000>,<MAYBRIDGE\nmr>,<NMR_250MHZ>,
      <created by zg, POWCHK disabled, PULCHK disabled
       configuration hash MD5:
       49 4B E0 1D 92 C2 6B 37 9F E6 65 BC 52 41 86 1D
       data hash MD5: 64K
       E8 7D A6 34 95 95 2B 5E 50 64 69 F7 D1 C9 74 2A>)
(   2,<2006-11-28 14:00:38.59 +000>,<MAYBRIDGE\nmr>,<NMR_250MHZ>,
      <Start of raw data processing
       ef LB = 0.3 FT_mod = 6 PKNL = 1 SI = 32K 
       data hash MD5: 32K
       06 61 86 98 A2 04 E5 97 FA B5 78 10 ED A1 AB B4>)
(   3,<2006-11-28 14:00:40.36 +000>,<MAYBRIDGE\nmr>,<NMR_250MHZ>,
      <apk 
       data hash MD5: 32K
       0A 73 57 6D 3B 0F C4 59 84 34 43 07 89 20 D1 65>)
(   4,<2006-11-28 14:00:41.08 +000>,<MAYBRIDGE\nmr>,<NMR_250MHZ>,
      <abs ABSG = 5 
       data hash MD5: 32K
       59 19 A8 78 3F 59 01 24 3D 7D D8 AC 2E DB C2 E0>)
$$ ##END=
$$ 
$$ hash MD5
$$ 05 FD A7 AB CD 77 AD 3B 16 FD F6 B4 0E 98 40 C6
##$RELAX= 
##$RELAX= 
##$RELAX= 
##$RELAX= 
##$RELAX= 
##$RELAX= 
##$RELAX= 
$$ Bruker specific parameters
$$ --------------------------
##$DU= <C:\u>
##$EXPNO= 1350
##$NAME= <ADRS>
##$PROCNO= 1
##$TYPE= <nmr>
##$USER= <dgb>
##$AMP= (0..31)
100 100 100 100 100 100 100 100 100 100 100 100 100 100 100 100 100 100 
100 100 100 100 100 100 100 100 100 100 100 100 100 100 
##$AQSEQ= 0
##$AQ_mod= 3
##$AUNM= <au_zg>
##$AUTOPOS= <45 >
##$BF1= 250.13
##$BF2= 250.13
##$BF3= 250.13
##$BF4= 250.13
##$BF5= 500.13
##$BF6= 500.13
##$BF7= 500.13
##$BF8= 500.13
##$BYTORDA= 1
##$CFDGTYP= 0
##$CFRGTYP= 5
##$CHEMSTR= <none>
##$CNST= (0..31)
1 1 145 1 1 1 1 1 1 1 1 1 1 1 1 1 1 1 1 1 1 1 1 1 1 1 1 1 1 1 1 1 
##$CPDPRG= <>
##$CPDPRG1= <>
##$CPDPRG2= <>
##$CPDPRG3= <>
##$CPDPRG4= <mlev>
##$CPDPRG5= <mlev>
##$CPDPRG6= <mlev>
##$CPDPRG7= <mlev>
##$CPDPRG8= <mlev>
##$CPDPRGB= <>
##$CPDPRGT= <>
##$D= (0..31)
0 1 0 0 0 0 0 0 0 0.06 0 0 0 0 0 0 0.0002 0 0 0 0 0 0 0 0 0 0 0 0 0 0 
0 
##$DATE= 1164722416
##$DBL= (0..7)
120 120 120 120 120 120 120 120 
##$DBP= (0..7)
150 150 150 150 150 150 150 150 
##$DBP07= 0
##$DBPNAM0= <>
##$DBPNAM1= <>
$$ [...]
##$SUBNAM7= <"">
##$SUBNAM8= <"">
##$SUBNAM9= <"">
##$SW= 20.6930455092707
##$SWIBOX= (0..15)
0 0 3 0 0 0 0 0 0 0 0 0 0 0 0 0 
##$SW_h= 5175.983436853
##$TD= 65536
##$TD0= 1
##$TE= 294.16
##$TE2= 300
##$TE3= 300
##$TEG= 300
##$TL= (0..7)
0 120 120 120 120 120 120 120 
##$TP= (0..7)
150 150 150 150 150 150 150 150 
##$TP07= 0
##$TPNAME0= <>
##$TPNAME1= <>
##$TPNAME2= <>
##$TPNAME3= <>
##$TPNAME4= <>
##$TPNAME5= <>
##$TPNAME6= <>
##$TPNAME7= <>
##$TPOAL= (0..7)
0.5 0.5 0.5 0.5 0.5 0.5 0.5 0.5 
##$TPOFFS= (0..7)
0 0 0 0 0 0 0 0 
##$TUNHIN= 0
##$TUNHOUT= 0
##$TUNXOUT= 0
##$USERA1= <user>
##$USERA2= <user>
##$USERA3= <user>
##$USERA4= <user>
##$USERA5= <user>
##$V9= 5
##$VALIST= <valist>
##$VCLIST= <CCCCCCCCCCCCCCC>
##$VD= 0
##$VDLIST= <DDDDDDDDDDDDDDD>
##$VPLIST= <PPPPPPPPPPPPPPP>
##$VTLIST= <TTTTTTTTTTTTTTT>
##$WBST= 1024
##$WBSW= 4
##$XGAIN= (0..3)
0 0 0 0 
##$XL= 0
##$YL= 0
##$YMAX_a= 299780
##$YMIN_a= -398183
##$ZGOPTNS= <>
##$ZL1= 120
##$ZL2= 120
##$ZL3= 120
##$ZL4= 120
##$ABSF1= 16.4474
##$ABSF2= -4.245773
##$ABSG= 5
##$ABSL= 3
##$ALPHA= 0
##$AQORDER= 0
##$ASSFAC= 0
##$ASSFACI= 0
##$ASSFACX= 0
##$ASSWID= 0
##$AUNMP= <proc_1d>
##$AZFE= 0.1
##$AZFW= 0.1
##$BCFW= 0
##$BC_mod= 0
##$BYTORDP= 0
##$COROFFS= 0
##$CY= 12.5
##$DATMOD= 1
##$DC= 0
##$DFILT= <>
##$DTYPP= 0
##$F1P= 14.0000005364418
##$F2P= -0.99999901652339
##$FCOR= 0.5
##$FTSIZE= 32768
##$FT_mod= 6
##$GAMMA= 0
##$GB= 0
##$INTBC= 1
##$INTSCL= 1
##$ISEN= 128
##$LB= 0.3
##$LEV0= 0
##$LPBIN= 0
##$MAXI= 10000
##$MC2= 0
##$MEAN= 0
##$ME_mod= 0
##$MI= 0
##$NCOEF= 0
##$NC_proc= -4
##$NLEV= 6
##$NOISF1= 0
##$NOISF2= 0
##$NSP= 0
##$NTH_PI= 0
##$NZP= 0
##$OFFSET= 16.4474
##$PC= 1
##$PHC0= 222.4995
##$PHC1= 5.481455
##$PH_mod= 1
##$PKNL= yes
##$PPARMOD= 0
##$PSCAL= 4
##$PSIGN= 0
##$REVERSE= no
##$SF= 250.130018657343
##$SI= 32768
##$SIGF1= 0
##$SIGF2= 0
##$SINO= 400
##$SIOLD= 32768
##$SREGLST= <1H.CDCl3>
##$SSB= 0
##$STSI= 32768
##$STSR= 0
##$SW_p= 5175.98343685301
##$SYMM= 0
##$S_DEV= 0
##$TDeff= 65536
##$TDoff= 0
##$TI= <Analysis number 999999
Compound Code 99
Book Reference 9
Project Code 9>
##$TILT= no
##$TM1= 0
##$TM2= 0
##$TOPLEV= 0
##$USERP1= <user>
##$USERP2= <user>
##$USERP3= <user>
##$USERP4= <user>
##$USERP5= <user>
##$WDW= 1
##$XDIM= 32768
##$YMAX_p= 329469899
##$YMIN_p= -105532
$$ End of Bruker specific parameters
$$ ---------------------------------
##NTUPLES= NMR SPECTRUM
##VAR_NAME=  FREQUENCY,     SPECTRUM/REAL,   SPECTRUM/IMAG
##SYMBOL=    X,             R,               I
##VAR_TYPE=  INDEPENDENT,   DEPENDENT,       DEPENDENT
##VAR_FORM=  AFFN,          ASDF,            ASDF
##VAR_DIM=   32768,         32768,           32768
##UNITS=     HZ,            ARBITRARY UNITS, ARBITRARY UNITS
##FACTOR=    0.157963299565203, 1,           1
##FIRST=     4113.98825360396, 0,            0
##LAST=      -1061.99518324905, 0,           0
##MIN=       -1061.99518324905, -105532,     0
##MAX=       4113.98825360396, 329469899,    0
$$ Real data points
##PAGE= N=1
##DATA TABLE= (X++(R..R)), XYDATA
$$ [...]
18686D56922J7496q08j3452k416K9966j3677m7174j6601O566M43j4437O88j0591
18673C92925j7184J4607q503j1868j6729j011j558Q438J0751k6147K279R322k7270
18660C28052M59K3842j2222P73J543J265k5564j1801J5871L0587M719k2058k1477
18647C13989Q070m157o747j505j3106j8190O631N916J1310L677K1381m227k5253
18634B97789k3692J4490j7635j5323J4883M905J4483M7934N3209j623J6465J0053
18622D15938n2577k8876J0892j8972j0260P76M927P339o859N368O098o116J383
18609C29061m752n44j6348p39J5635j7072k8345J2217Q068K5015K370l3366k1921
18596B69279m508r226j6218J814M542N535j2465L4114L1941N658m808k2101Q876
$$ plain form
18686 456922 474418 473610 460158 457742 487708 474031 426857 410256 416822 417265 402828 403516 392925
18673 392925 375741 390348 381845 369977 353248 352237 350679 359117 369868 343721 346000 355322 328052
18660 328052 328511 352353 340131 340904 342447 343712 318148 306347 322218 352805 357524 335466 313989
18647 313989 322059 317902 311155 309650 296544 278354 284985 290901 302211 305888 327269 323042 297789
18634 297789 274097 288587 270952 255629 270512 275417 289900 337834 391043 389420 405885 415938
18622 415938 363361 334485 345377 326405 316145 316921 321848 329187 322328 327696 333794 327678 329061
18609 329061 324309 323765 307417 306678 322313 305241 276896 289113 297181 322196 324566 291200 269279
18596 269279 264771 255545 239327 241141 245683 251218 238753 272867 304808 310466 305658 283557 292433
18583B92433M936k5157P596J8912K4027L5005K5264L830M9649J7110m7662m0447
18571C65496j3106K1277M9746K2789o477m1621k9219K7231K1140K8134M355N1659
18559E01404M4535N9504j9401o0180m7668j6841l5821j9890j3484J1232K4805
18548D28195K8438j3461j2586L1062L1326k410o371q268Q211M0501n637J3287
18536E32287M1067L5507J810M846J9467K3384J4052q16L9998N4285O7050P5784
18524I08721O5114Q5136P4277O9507P4459J03406J04271K7013K6233P3356J09378
18513A720871J51345J91480K22972K38068K49001K43640L11844M36131O21068
18504D386420Q99159J319257J836989K635239L822804N367794N773603L951955
$$ plain form
18583 292433 297369 272212 279808 298720 322747 357752 383016 386846 436495 453605 405943 365496
18571 365496 352390 373667 423413 446202 439725 398104 368885 396116 417256 445390 449745 501404
18559 501404 545939 605443 586042 525862 478194 461353 425532 405642 392158 403390 428195
18548 428195 456633 443172 430586 461648 492974 490564 484193 475925 484136 524637 519000 532287
18536 532287 573354 608861 610671 615517 634984 658368 672420 671604 711602 765887 832937 908721
18524 908721 973835 1058971 1133248 1202755 1277214 1380620 1484891 1511904 1538137 1611493 1720871
18513 1720871 1872216 2063696 2286668 2524736 2773737 3017377 3329221 3765352 4386420
18504 4386420 5285579 6604836 8441825 11077064 14899868 20267662 26041265 29993220
18496B9993220o73547n668481n434575k906913q54412O21740K015301L900453
18488B0992786O342238P142786L385711j15798J411888J030477n847358q697212
18480B5645518o101067l411051j697732m14538N80796J544469K767690K920202
18472B1834287j96191l720418l729584k334178j287501o65843k06915J33720L91473
18463A0218850O55955J002071J619352K579223L340977K346163P7286m3673J346535
18454B3142739J846705J322066K014455M026079O890669J1312543J6687851J7205633
18446H4448740P315152j139854M044881J5171823J7476692j91407k1229935k6354958
18438G9541134j9043898j0568399m716210l39737L393984M927708Q39197n104343
$$ plain form
18496 29993220 29319673 23651192 18216617 15309704 14455292 15077032 17092333 20992786
18488 20992786 27335024 34477810 37863521 37747723 39159611 40190088 34342730 25645518
18480 25645518 19544451 16133400 14435668 14021130 14601926 16146395 18914085 21834287
18472 21834287 21638096 17917678 14188094 11853916 10566415 9900572 9693657 9827377 10218850
18463 10218850 10874805 11876876 13496228 16075451 19416428 21762591 21839877 21796204 23142739
18454 23142739 24989444 26311510 28325965 32352044 39242713 50555256 67243107 84448740
18446 84448740 91763892 90624038 94668919 109840742 127317434 127126027 105896092 79541134
18438 79541134 60497236 49928837 45212627 44872890 48266874 53194582 54033779 48929436
18430D8929436m915893p94278J928243J64767n838252q938887o778208m185946
18422A9570982k650851j779010j170617q14191n27003l48100j39290J15201L64212
18413A2621333O26722J026957J638002K422323L224004M359793O344822Q872791
18405D1136747Q801847K229482m457909m100479l24506L710464Q478476J4546286
18397G0020408J9214801J4950470K787585q361666j0424941l495581j127027j0378848
18389G3185201j6497088j2717731p463979m142205k133218l46914J932328M910788
18381C6727182Q485355R753083L093638o737215q804427n419552k238415K894
18373C4862543K786644O799230J2475302J6830012R797130r711530j8278914j3520797
$$ plain form
18430 48929436 44013543 43219265 45147508 45312275 39474023 30535136 23756928 19570982
18422 19570982 16920131 15141121 13970504 13156313 12629310 12281210 12141920 12257121 12621333
18413 12621333 13248055 14275012 15913014 18335337 21559341 25919134 32263956 41136747
18405 41136747 49938594 52168076 47710167 43609688 43285182 46995646 55474122 70020408
18397 70020408 89235209 104185679 106973264 98611598 88186657 84691076 83564049 73185201
18389 73185201 56688113 43970382 36506403 32364198 30230980 29884066 31816394 36727182
18381 36727182 45212537 54965620 58059258 51322043 42517616 37098064 34859649 34862543
18373 34862543 37649187 44448417 56923719 73753731 83550861 73839331 55560417 42039620
18365D2039620p746542m037708j059443J936317N205848P312542K770125p167028
18357C9253731j0136418p269114m446280k710604j688142r83947n00344j44220
18349A1374662L8656K72712P23580J576568K962767M203729K709600k136094m299450
18340A7426730l170449j734211p33690m760N54050R62933J338008J937901L026087
18331A9602599M837225P021635P941251N995800L708286J857554Q89240l089968
18323D8763622q574946q971722n602303l091872k962087l548370l052115k185216
18315A0774991j546570j143848q16163n56980l74564k03093p3667j4162J23643
18306F169587M39465R82908J574187J553653j12111j869214j823000j196458o97967
$$ plain form
18365 42039620 34293078 30255370 29195927 31132244 36338092 43650634 46420759 39253731
18357 39253731 29117313 21848199 17401919 14691315 13003173 12019226 11518882 11374662
18349 11374662 11413318 11686030 12409610 13986178 16948945 21152674 23862274 21726180 17426730
18340 17426730 14256281 12522070 11788380 11783620 12337670 13300603 14638611 16576512 19602599
18331 19602599 24439824 31461459 39402710 45398510 49106796 50964350 51853590 48763622
18323 48763622 40188676 31216954 25614651 22522779 19560692 16012322 12960207 10774991
18315 10774991 9228421 8084573 7268410 6711430 6336866 6133773 6060106 6045944 6169587
18306 6169587 6609052 7591960 9166147 10719800 10607689 8738475 6915475 5719017 5021050
18297E021050l51144q1721Q845P2677K70690O37427J148928J837483K080601M29797
18287A1074633j488558j518677q72584j85940N91584J574663K746254L155944
18279A5077319O30940k894288l219729k067613j093424m19385K50077Q67522J001212
18270H132631k32873j611592j567117j005366o02448m09482l11569k53649k37430
18261A901105j86149j34572r1042p0733n9252n7675o5766p1759r0727p3500m2844
18250I57086N235K0877k3274l2945j9707l8746m9133m2459k4792l1077o321L116
18238G17860l3318N101L9898l2819m7212n8983l7391m0000k6638P794p151j442
18226D85699l077j6946l241k6516m2509K4273J4514J3878m919J4274j032n0206
$$ plain form
18297 5021050 4669906 4588185 4597030 4669707 4940397 5577824 6726752 8564235 10644836 11074633
18287 11074633 9586075 8067398 7194814 7008874 7600458 9175121 11921375 15077319
18279 15077319 15708259 12813971 9594242 7526629 6433205 6013820 6263897 7131419 8132631
18270 8132631 7899758 6288166 4721049 3715683 3113235 2703753 2392184 2138535 1901105
18261 1901105 1714956 1580384 1489342 1418609 1359357 1301682 1235916 1164157 1073430 999930 957086
18250 957086 962321 983198 959924 926979 907272 868526 819393 776934 752142 721065 714744 717860
18238 717860 684542 689643 729541 696722 649510 590527 553136 513136 486498 494292 487141 485699
18226 485699 482622 465676 462435 435919 393410 417683 432197 446075 441156 455430 454398 404192
18214D04192n0029r381j689j87J359l395L790K1827O448q769K8045j5956l8215
18201C38040J7437K7895j1206k3329l0768n870l742j6284j3046J9357K343p835
18189B92992O46N298j47m139P48n742K231j2800K3656K3457n014l7594l3133P341
18175B57800K7696Q596J0498P755n318k1040o319L3507K1121j1133N479m015k5033
18162B99594j7711j6438q028R235K9843K7810J872O975j2289r891j7845K9834
18150C22961J9228K4698J0605j8364j638O11K500J886K0361K3159L3250J3228
18138D52485K5561J9383L4891K4634L6907M1373K5871L6759M3095M8037N6280
18127H45276P2127J18169J53852J57937J51065J81158K64110L40629M28155N56659
$$ plain form
18214 404192 354163 344782 343093 342906 344265 340870 344660 366487 372935 364166 392211 376255 338040
18201 338040 355477 383372 372166 348837 318069 312199 308457 292173 279127 298484 300827 292992
18189 292992 293638 298936 298789 294650 295398 289656 291887 279087 302743 326200 321186 283592 250459 257800
18175 257800 285496 294092 304590 312345 307027 285987 279668 313175 334296 323163 328642 324627 299594
18162 299594 281883 265445 257417 266652 296495 324305 326177 333152 320863 310972 293127 322961
18150 322961 342189 366887 377492 359128 357490 358101 360601 362487 382848 406007 439257 452485
18138 452485 478046 497429 532320 556954 593861 635234 661105 697864 740959 788996 845276
18127 845276 917403 1035572 1189424 1347361 1498426 1679584 1943694 2284323 2712478 3269137
18117C269137P29420R91430J475179K257085L751870O661671J2283935K0554461
18109E1974188J7368266j2696012k2913086j3432067o692829l684575k283621
18102G640264j552264j129332q27042n78006m54717l90221l00929k86438k15401
18093A905914j70081j29765j51606j57470j34562r0586p8274m2922r6531q6433
18083G67684o4603k3515J0789K7326O117m0169n3189k6414q458j0945n1952m4235
18071D88436m643J0619j0213k0374j0482j095k7693m1991l2676j0911k8695L460
18059C13742k9146k7072K1162J6213l9021m2414k2757q585K5321K2198J576R315
18047B40532q45j21j0148K3485J716j9639J4911J6145J8213N328n3679k7872M838
$$ plain form
18117 3269137 3998557 4989987 6465166 8722251 12474121 19135792 31419727 51974188
18109 51974188 69342454 56646442 33733356 20301289 13608460 9923885 7640264
18102 7640264 6088000 4958668 4131626 3553620 3098903 2708682 2407753 2121315 1905914
18093 1905914 1735833 1606068 1454462 1296992 1162430 1071844 993570 950648 854117 767684
18083 767684 703081 679566 690355 717681 723798 683629 630440 604026 595568 584623 532671 488436
18071 488436 483793 494412 484199 463825 453343 452248 424555 382564 349888 338977 310282 313742
18059 313742 284596 257524 278686 294899 255878 213464 190707 182122 207443 229641 231217 240532
18047 240532 239687 239566 229418 252903 254619 234980 249891 266036 284249 289577 235898 208026 212864
18034B12864l4702k6542J7977J5681J409j1703j9366J0797j1798j2216J0763j148
18022A52016K4903O838J6422k3476l4850j6565j1593m226O695J1979L3189P777
18010A69109j6396j1575K4742L528J2527m909j886j012J2019K3187k5746n7705
17998A25883l4370K5617L2354K015J6281m687M083J3452j1756P411K8997L4334
17986B39614L7670L752K1373p75Q513P488k1118j331j8206K3849M4814J7439l551
17973C59531J6813L0586J7763R743j9369l3257n2104p0427m2399m8777l7416K248
17961A32935M866L683l905L7257J7974j0996R074K6004L8065k4774m1982m5716
17949A42485k5737N252K9079J8532K6399K9285J1509k727q989L5302N1973J9683
$$ plain form
18034 212864 178162 151620 169597 185278 186687 174984 155618 166415 154617 142401 153164 152016
18022 152016 176919 183757 200179 176703 141853 125288 113695 109469 116164 128143 161332 169109
18010 169109 152713 141138 165880 169408 181935 177026 175140 174128 186147 209334 183588 125883
17998 125883 91513 117130 149484 151499 167780 163093 167176 180628 168872 176283 205280 239614
17986 239614 277284 281036 302409 301634 310147 317635 296517 295186 276980 300829 345643 363082 359531
17973 359531 376344 406930 424693 434436 415067 381810 329706 259279 216880 168103 130687 132935
17961 132935 137801 141484 137579 174836 192810 181814 190888 216892 254957 230183 188201 142485
17949 142485 116748 122000 151079 169611 196010 225295 236804 234077 225088 260390 312363 332046
17937C32046L0735Q9502O5385N266J8845M393j868J7901K0482j3161J5706q219
17925E77013m932n9403q9610o6526n3221l1787J7765J7310N4596J2496N0950o056
17913D18595m3551l0495n1218m2912l0651m7599n3187K2439J1653J9623o880O540
17901A72357j4989l095J6473J886K284L179r610k8367j6018K0837O2526O4373
17889B71836N509j6541K4336L3139L2351P284l4435l1862j6358K7748k949j2991
17877B87067j4306l113J9168M5967P7637P9666N3621m6361o9022r5289q7982j8694
17865B28359k2402m425K4723L2252j0789l2055m7034o5712l1185J4994M2752N99
17853A30077m3349m537n421J678J5443K2790j1872j2459l677k8288j4552n337
$$ plain form
17937 332046 362781 452283 517668 522934 541779 546172 544304 562205 582687 569526 585232 577013
17925 577013 572081 512678 423068 356542 303321 271534 289299 306609 361205 373701 424651 418595
17913 418595 375044 344549 293331 250419 219768 172169 118982 141421 153074 172697 165817 172357
17901 172357 157368 154273 170746 172632 174916 178095 168485 140118 124100 144937 207463 271836
17889 271836 277345 260804 285140 318279 350630 357914 323479 291617 275259 303007 300058 287067
17877 287067 272761 269648 288816 334783 412420 492086 545707 499346 430324 335035 247053 228359
17865 228359 205957 201532 226255 258507 247718 215663 168629 102917 71732 86726 129478 130077
17853 130077 86728 82191 76770 78448 93891 116681 104809 92350 88673 60385 45833 40496
17841D0496J2143j932O323K2162J6290O5532L7224k4793J2894L2403N2354K8363
17829B99459K6549J4762k481k246M0898J4139l8305p3709o3602j0456L1891J2461
17817B49360k0110j8702k820P74j7945m5543j0677k5936k6376J0050j6258M647
17805H0464j0765K1250j2036n337o198K31q76j505M895j293n22q268J5493j3431
17791F2102j2835L1419n599M435L218K6806O2193J3171j7251m1620j9874L3571
17779A39736K4226K6001K4674j0541p837j9547l2477k3748k4231K3543J8812M136
17767A42747m891J1583l2553k1544P236R180p909k633m524k5473k8604N186n782
17754D2019j0817L58K1341r611n123J2208k0124j0133K0522J2363P802j0671j2855
$$ plain form
17841 40496 52639 50707 57030 79192 95482 161014 198238 173445 186339 218742 271096 299459
17829 299459 326008 340770 338289 336043 376941 391080 352775 279066 215464 205008 236899 249360
17817 249360 229250 210548 207728 208502 190557 145014 134337 108401 82025 92075 75817 80464
17805 80464 69699 90949 78913 73576 67378 67609 66733 65228 70123 68830 68308 60040 75533 62102
17791 62102 49267 80686 75087 79522 82740 109546 171739 184910 167659 126039 106165 139736
17779 139736 163962 189963 214637 204096 196259 176712 144235 120487 96256 119799 138611 142747
17767 142747 137856 149439 116886 95342 102578 111758 103849 101216 96692 71219 42615 47801 42019
17754 42019 31202 31560 52901 43290 38167 50375 30251 20118 40640 53003 60805 50134 37279
17741C7279j3623K8159K6031L235o835j0697J8785o010L548l0259l1581j7314
17729G18n91L7958m667k7562l7794J1824M2755K5353K695j1195j1720j7668k7597
17716a7491L6880L9787n294l7851m893R11L106J314l7103J3949M3143m75j2891
17703B3092l3897l4870J025L8511j1639L5745M7864K5031J4281k615j5731j5072
17691G1725P384o661o316j2163J6677o704l1167l651l518J4776k422k296K5397
17678F1061M711p819l4856j635j1639O766n405J8363J1988l768j3528o830p935
17665I474L6382m55N586k0096k3668j5612q58L6233J0900m2233k0853K2729L0416
17652B7945J482M840M150j6247L460J9929J1193k8403k4306K0568n477j1590j4690
$$ plain form
17741 37279 23656 51815 77846 81081 74246 63549 82334 76324 79872 49613 18032 718
17729 718 127 38085 33418 5856 -31938 -20114 22641 47994 50689 39494 27774 10106 -17491
17716 -17491 19389 59176 53882 16031 11138 12049 15155 16469 -20634 -6685 36458 35983 23092
17703 23092 -10805 -45675 -44650 -6139 -17778 17967 65831 90862 105143 102528 86797 71725
17691 71725 79109 72448 66132 53969 70646 63942 32775 29124 25606 40382 37960 35664 61061
17678 61061 65772 57953 23097 21462 9823 16589 11184 29547 41535 37767 24239 17409 9474
17665 9474 45856 45401 50987 30891 7223 -8389 -9247 26986 37886 -4347 -25200 -2471 27945
17652 27945 29427 34267 38417 22170 25630 45559 56752 28349 4043 24611 19134 7544 -7146
17639g146j0380J3982P668K2730K7066j5703j2172r117k0463j2526K3111J8281
17627B5331L937j63o08L966N5932q379l8523J2319J4110j0475q299N195j6970
17614C7373k2675K2245Q279j5796J5423j0773j4992J122K1887J8604j148m3170
17602A6379k2068K7398Q893Q845K8695N446j8951o404k8046l638L3563j226m2942
17589E944k5591j0205K3058K5089j972r881L5912Q708O867p184m1836K4463K0230
17576E3602l6424l4573Q72R422J9852k620J1752J9750N149o438J3225j878j4156
17563C7535n4196n247O582L252L263N878L849k165R065N330k7000k6153L0337
17550i670K7161k8202k7308L1124J9321j9014K0830K8874o948k6407j6311j0440
$$ plain form
17639 -7146 -17526 -3544 4124 26854 53920 38217 26045 16928 -3535 -16061 7050 25331
17627 25331 29268 29105 28497 32463 88395 80016 41493 53812 67922 57447 49148 54343 37373
17614 37373 14698 36943 45222 29426 44849 34076 19084 20206 42093 60697 59549 16379
17602 16379 -5689 21709 30602 39447 68142 73588 54637 48233 20187 16549 50112 48886 5944
17589 5944 -19647 -29852 -6794 18295 16323 6442 42354 51062 57929 50745 8909 33372 53602
17576 53602 17178 -17395 -16523 -7101 12751 10131 21883 41633 46782 40344 53569 51691 37535
17563 37535 -16661 -21908 -15326 -12074 -8811 -2933 916 -1249 7816 13146 -13854 -40007 -9670
17550 -9670 17491 -10711 -38019 -6895 12426 -6588 14242 43116 36168 9761 -6550 -16990
17538a6990N899J314l171K6717K8340j1751j4737j6109j0823M111j934Q422l151
17525c863K1138J3245R334k6594l2488Q168J8536J5099p747q688J3479j1890m047
17512C682M680J3587J2480J099K3244j9734j8003J545j0117K28Q552J4316m71
17499C5088L4561K3595l3039k7435J9772j9420l208J8795j7933o368m627J4589
17487C4370J6681j7348l418L067j9775k608j2565J1085j5578j3176K7792M406
17475A2933l868J7737O687q385m630m081L535N534K0458m212J3475J3581l4668
17462C4096J455o841n790L2336J9325j1650j8313K4550j4915q434K24j5510j1864
17449A8669n960p644J2451K6278N1942J03606J35567P5562r8572j16108r7050
$$ plain form
17538 -16990 -11091 -9777 -12948 13769 42109 30358 15621 -488 -11311 -7200 -9134 -712 -3863
17525 -3863 17275 30520 39854 13260 -19228 -11060 7476 22575 14828 6140 19619 7729 3682
17512 3682 8362 21949 34429 35528 58772 39038 21035 22580 12463 12691 21243 35559 35088
17499 35088 69649 93244 60205 32770 52542 33122 29914 48709 30776 24408 19781 34370
17487 34370 51051 33703 30285 33352 13577 10969 -1596 9489 -6089 -19265 8527 12933
17475 12933 9065 26802 33489 25104 20474 16393 19928 25462 45920 41708 55183 68764 34096
17462 34096 35551 28710 22920 55256 74581 62931 44618 69168 54253 45819 46043 30533 18669
17449 18669 12709 5065 17516 43794 95736 199342 334909 410471 311899 195791 98741
17438I8741m6322o875j1366j72j5129j1482J2699M110j8439p724n884k0621j6668
17425d5132J7649Q962J9914L1032O261m05K3135O089l4550L313J1824k8970o414
17412A2708K0457l336n257M670j8246k257J516K0931R325J5037J2583m4515l2607
17399h991m008j7616j024J1792K538r465J4915K2219O239P349K2196j1034j8008
17386A7102Q926P449K6797J7280o767L641L8477M523m0550m1417k5458n633N278
17373I648L6058j5931k8922o338M856k787K132J3968J2730j8553q865Q850K5869
17360C2715J8923k6513m328j4626o900K0086m067P147P428k8732J0272q334j9903
17347a6832K4826K3624j7520m540m579Q083n953K168K746j2606L14L0222L095
$$ plain form
17438 98741 52419 45544 34178 34006 18877 7395 20094 24204 5765 -1959 -7843 -28464 -45132
17425 -45132 -27483 -18521 1393 32425 38686 38281 61416 67505 32955 36268 48092 19122 12708
17412 12708 33165 29829 24572 29242 10996 8739 10255 31186 40511 55548 68131 23616 -8991
17399 -8991 -12999 -30615 -31639 -19847 -17309 -26774 -11859 10360 16599 23948 46144 35110 17102
17386 17102 26028 33477 60274 77554 70787 74428 112905 117428 76878 35461 10003 4370 9648
17373 9648 45706 29775 853 -5485 -629 -3416 -1284 12684 25414 6861 -2004 6846 32715
17360 32715 51638 25125 20797 6171 -729 19357 15290 22437 29865 1133 11405 3071 -16832
17347 -16832 7994 31618 14098 9558 4979 13062 7109 9277 12023 -583 -269 29953 33048
17334C3048l3172j4582K0527J690R295K571k6876l396Q21j2112K5287L7657j987
17321C8771n046k4983l9038r552K4047M1639j7929k0297l994k7643l514K8805
17309a8734P872K4503J577k6274K3577J4858j0161l098l4998j9074R631J2507
17297a7814r894k3528J8992L2342j4813j438P030J3889J9218J374Q04j1460N538
17284B0240j0688k8547k0448J3428j4816K2397K5839K6082R261k0013l212q579
17272A0944Q274J6515P288k5887k3166j4306p463J7084O543k48q147o593J4104
17259e058P049l058M015j850l260R746L0941o51k853J7263K5590L945l1290q583
17245D1946j0537k0843j2297j0479J6632q464p009n704j3875J0327j705n671n051
$$ plain form
17334 33048 -124 -14706 5821 7511 16806 19377 -7499 -10895 -10074 -22186 3101 40758 38771
17321 38771 33725 8742 -30296 -39848 -15801 25838 7909 -12388 -16382 -44025 -47539 -18734
17309 -18734 -10862 13641 15218 -11056 12521 27379 17218 14120 -20878 -39952 -30321 -17814
17297 -17814 -27708 -51236 -32244 98 -14715 -16153 -9123 4766 23984 25358 26162 14702 20240
17284 20240 9552 -18995 -39443 -26015 -40831 -18434 7405 33487 42748 22735 19523 10944
17272 10944 19218 35733 43021 17134 -6032 -20338 -27801 -10717 -4174 -4422 -12569 -19162 -5058
17259 -5058 1991 -1067 2948 1098 -2162 7584 38525 37874 35021 52284 77874 81819 50529 41946
17245 41946 31409 10566 -1731 -12210 4422 -4042 -11051 -16755 -30630 -20303 -22008 -27679 -32730
17232c2730K1192L5671j9380j0107O465K5791j9637j2740m611k3643J377K9206
17220c146J2274J1439J3400K2840r051j388j7615m670j137j9192k2253j7017k162
17207c7678O60K4214K5585k0497k7951k4487J9658K9544j2719q566J5141j0187
17195b7283L402J7554J5149L41q903K016J9910m701j3314o768J3262R201J1031
17182C0897m077j8989n729j6286o460j2133r448K8366P475N215J2930K3177J4355
17169D9293O828k7936j8168k3318n609R277J3713K0410K6145K0869r379n367j2267
17156D4491j4612j7700k5475q492K418K5049L090j5800P837j8259r301N245J2759
17143h750O402p204O014K0233k083J0196J5331j8621N525K2173Q580k7614k1363
$$ plain form
17232 -32730 -11538 24133 4753 -5354 1111 26902 7265 -5475 -10086 -33729 -32352 -3146
17220 -3146 9128 20567 33967 56807 47756 46368 28753 24083 22946 3754 -18499 -35516 -37678
17207 -37678 -37018 -12804 12781 -7716 -35667 -60154 -40496 -10952 -23671 -32237 -17096 -27283
17195 -27283 -23881 -6327 8822 9163 260 2276 22186 17485 4171 -2597 10665 19866 30897
17182 30897 26820 7831 2102 -14184 -20644 -32777 -42225 -13859 -6384 -1169 11761 34938 49293
17169 49293 56121 28185 10017 -13301 -18910 -9633 4080 24490 50635 71504 62125 56758 44491
17156 44491 29879 12179 -13296 -21788 -19370 5679 8769 -7031 806 -17453 -26754 -21509 -8750
17143 -8750 -2348 -9552 -3538 16695 14612 24808 40139 21518 27043 49216 57796 30182 8819
17130H819K341L949j9316q996K0203k0382R433P881J8549n575K4701J0010j8397
17117C3220j7955j0867L686j7149j3089j0207j7384K6653K5949m845k9827L478
17105b8337L1962L4135m759O29n890o878k0649R34K210J143j8386j587K2307q309
17091a475r35J5895M071k3342M002J586K006l458j5586K7544j2923K1160L7116
17078E5661p01j9262j4734j288J0660j0689j7771M961j0576o824K390j2040j1583
17065c1796N067L724p718N678J7019k024K7292J7893K291k1958k8276k4234L539
17052c3503K5032o757r354Q592q225J6760J9337l294n441L715j6836J0571J3709
17039A4306K7908j6188k4101K367M209n969j114o649j1228J0171Q456o431j1187
$$ plain form
17130 8819 11160 15109 -4207 -13203 7000 -13382 -3949 3932 22481 16906 41607 51617 33220
17117 33220 15265 4398 8084 -9065 -22154 -32361 -49745 -23092 2857 -1988 -31815 -28337
17105 -28337 3625 37760 33001 33630 27740 20862 213 1147 3357 4500 -13886 -15473 6834 -1475
17091 -1475 -2410 13485 17556 -5786 -1784 -198 1808 -1650 -17236 10308 -2615 18545 55661
17078 55661 54960 35698 20964 19676 30336 19647 1876 6837 -3739 -10563 -8173 -20213 -31796
17065 -31796 -26729 -23005 -30723 -25045 -8026 -10050 17242 35135 37426 15468 -12808 -37042 -33503
17052 -33503 -8471 -15228 -24582 -15990 -24215 -7455 11882 8588 3147 6862 -9974 597 14306
17039 14306 42214 26026 1925 4292 8501 2532 1418 -5231 -16459 -6288 2168 -4263 -15450
17026a5450N532l612Q23P787n111j8959k3196k769K1234J3363p61J1925k125r107
17012b0426K8776J801k0695k507r981J5007J9952J3132j9297p523J632n187J897
16999c419k69K678k495J2130l923l713o991k7356J5876L3167K2022l232r523J323
16985B6275j7316N3J531l2794j0679j6371J6422J1413M982M011j189k893J3772
16972b783P831K2742K88m1389q067Q038k1631M657M3470J078k6169K273r189O414
16958a2437k0032J759K2297J4210R677K1613P645J2176K168J0245o599m2074o599
16945A4049J1896m872n989n55J1323q955l3666J4841N273P353k256k4573k9524
16932d5655J8275M9731n499j4496K0136L090k1169l3570j6005j51j1311N648K6059
$$ plain form
17026 -15450 -9918 -13530 -12707 -4920 -10031 -28990 -52186 -54955 -33721 -20358 -21119 -9194 -11319 -20426
17012 -20426 8350 10151 -10544 -13051 -23032 -8025 11927 25059 5762 -1761 -129 -5316 -3419
16999 -3419 -3688 -1010 -3505 8625 4702 989 -6002 -33358 -17482 15685 37707 34475 24952 26275
16985 26275 8959 9012 10543 -22251 -32930 -49301 -32879 -21466 -16484 -12473 -13662 -16555 -2783
16972 -2783 5048 27790 28078 -13311 -21378 -13340 -34971 -30314 13156 14234 -11935 -9662 -18851 -12437
16958 -12437 -32469 -30710 -8413 5797 15474 37087 44732 56908 59076 69321 62722 20648 14049
16945 14049 25945 21073 15084 14529 25852 16897 -16769 -1928 3345 10698 8442 -16131 -45655
16932 -45655 -27380 22351 16852 2356 22492 25582 4413 -29157 -45162 -45313 -56624 -50976 -24917
16919b4917O879L688N6219K05Q796p186m41P007k2489j7688j0979n775j7539j6859
16905d1079J7800K5800J7035J1745j2419j0588j0356m498L467j082J5933L313
16893A5071j3545J1910R290N228j8633p3M523j4892P247k0667k075K7099q815
16880A668j2761K825K5128K0525k5951k4724R367J4429j629N180J3303j9388k6140
16867a8168K511M531j6952L2855K79j5343J0883J4932J0857o461n288j4268J5276
16854A5644j0020k0974j9384J0377P791J4338j400l050J1172N645k3775j5492
16842b9128k7388j5256k4584K6777M6790M5955R736o120r346K867j9079l443J1459
16829I240J3551k592m928k6831o516m83j2502P442M728R087k1315J1179K977L1658
$$ plain form
16919 -24917 -18038 -14350 41869 42074 50870 43684 43243 50250 27761 10073 -906 -6681 -24220 -41079
16905 -41079 -23279 2521 19556 31301 18882 8294 -2062 -6560 -3093 -4175 11758 15071
16893 15071 1526 13436 22726 27954 9321 9248 13771 -1121 6126 -14541 -16616 10483 1668
16880 1668 -11093 -8268 16860 37385 11434 -13290 -3923 10506 8877 14057 27360 7972 -18168
16867 -18168 -15657 -11126 -28078 4777 5056 -10287 596 15528 26385 19924 14636 368 15644
16854 15644 5624 -15350 -34734 -24357 -16566 -2228 -3628 -6678 4494 10139 -13636 -29128
16842 -29128 -56516 -71772 -96356 -69579 -22789 23166 32902 26782 17436 20303 1224 -2219 9240
16829 9240 22791 20199 15271 -11560 -18076 -18559 -31061 -23619 -18891 -9804 -31119 -19940 -16963 14695
16815A4695n484j3328O762R183o487j8982J2865p713j729l0161J2706N5359J8835
16802D6521j6954j9777P614m229p012R185J9685k953N16p860j4726O656k1207
16789d541k6796N200Q347M1509J5984l8365j2923J6782L0997L5910q293o110j1294
16776D6407j3796j2161j5201k2660J3315J7256Q701n532j2404O353p783j1186
16764h691J61j8521k2003J3428J5783N808J3899j7084j8253L0409j0810n195P227
16751a3842J4147K608k897Q702J3519J2200L166k5130q489M994j2107n418j7649
16738b6196l416J2721p562L3614M0118J2346k8524k9199j2387j7223K5934J3644
16726A3870k8405o179L1895O208m80j1645P723K5975L3955l5213l5504j3669L0722
$$ plain form
16815 14695 9211 -4117 2645 11828 5341 -13641 -776 -8489 -10218 -40379 -27673 27686 46521
16802 46521 29567 9790 17404 13175 6163 15348 35033 32080 32596 24736 10010 16666 -4541
16789 -4541 -31337 -26137 -17790 23719 39703 1338 -11585 5197 36194 72104 63811 57701 46407
16776 46407 32611 20450 5249 -17411 -4096 13160 21861 16329 3925 10278 2495 -8691
16764 -8691 -8530 -27051 -49054 -35626 -19843 -14035 -136 -17220 -35473 -5064 -15874 -21069 -13842
16751 -13842 305 2913 16 8718 22237 34437 37603 12473 3984 8978 -3129 -8547 -26196
16738 -26196 -29612 -16891 -24453 9161 49279 61625 33101 3902 -8485 -25708 226 13870
16726 13870 -14535 -20714 11181 17389 16909 5264 12987 38962 72917 37704 2200 -11469 19253
16713A9253l028n3790p633L2845M3402L87m2302K103J4430k7978j0547J155K6094
16700e609K4303j3946o39J328j2287n917J8109q483k206K0222k7447l0202l065
16687d5839K242J5799q149k2475L317j8434Q902K0662J9079J8252P458J0416m365
16674F865J9877Q032J663Q045k7284k796l459k295m7258k5984K5394L9952K0185
16661B0937j508N34K3415j3590k8094k5359k7902j5143L4330N2836l341k7658
16649a0543l3129k383K0624j93k7931O789M7295J2572p093k9305j6328L2475K9413
16636B2263q815n844J062J3342J372n029m3135l9247J4967K4353j1086J7858L1256
16623A3317k7004o149K5466R078j9128k4128q409K5742j0450N362N982j1748l822
$$ plain form
16713 19253 16225 -37565 -45198 -12353 31049 31436 -10866 -8763 5667 -22311 -32858 -31703 -5609
16700 -5609 18694 4748 4109 5437 -6850 -12767 5342 -3141 -5347 14875 -12572 -42774 -45839
16687 -45839 -43597 -27798 -35947 -58422 -55105 -73539 -64637 -43975 -24896 -6644 814 11230 6865
16674 6865 26742 34774 36437 44482 17198 14402 10943 8648 -38610 -64594 -39200 752 20937
16661 20937 19429 19963 43378 29788 1694 -23665 -51567 -66710 -32380 20456 17115 -10543
16649 -10543 -43672 -46055 -25431 -25624 -53555 -46766 529 13101 6008 -23297 -39625 -7150 22263
16636 22263 13448 7604 8666 22008 23380 18351 -24784 -64031 -49064 -24711 -35797 -17939 13317
16623 13317 -13687 -19836 5630 14708 -4420 -28548 -36957 -11215 -21665 -16303 -10321 -22069 -25891
16610b5891l69O80j641j9352q274L8212K5745L1896J7981j1161p106m3862j2843
16597a5985L041J3496J6942K949q981j0731J0710r713Q35J4420J4823m444k5192
16584B170R541j4028l3389Q991K1500J055J1089J1368J2499j1104l3111j5059
16572b8478j0223K3173K4283j1091o664J520k5393k3099J074K5718J7746j2832
16560b4266k6668N713L2717M4194l154n961k4003P899K3084k5180k5363M656K88
16547a6044K8389L9839Q844j5771j8083j9763k013J7353L6227R40j4664n877j4839
16534B4538j6346R048K5403K251n0934r086k418K1214N212k8731k4839J3367L272
16521b8049j1757K5613N2105P813j6344j1830q515n61n648k66N691j9272M294
$$ plain form
16610 -25891 -26260 -25580 -27221 -46573 -54847 -16635 9110 41006 58987 47826 40720 -3142 -15985
16597 -15985 -12944 552 17494 20443 11462 731 11441 1728 2563 16983 31806 27362 2170
16584 2170 11711 -2317 -35706 -26715 -5215 -4160 6929 18297 30796 19692 -13419 -28478
16572 -28478 -38701 -15528 8755 -2336 -9000 -7480 -32873 -55972 -54898 -29180 -11434 -24266
16560 -24266 -50934 -45221 -12504 31690 28536 22575 -1428 6471 29555 4375 -20988 -16332 -16044
16547 -16044 12345 52184 61028 45257 27174 7411 5398 22751 58978 59918 45254 39377 24538
16534 24538 8192 17240 42643 44894 -6040 -15126 -17544 3670 8882 -19849 -44688 -31321 -28049
16521 -28049 -39806 -14193 37912 45725 29381 17551 9036 8475 2827 2561 8252 -11020 -6726
16508f726J3314R653m873k0342Q025M544J4186J2152k436q070J2743j3430q306
16495A0434j8199J5817J0714N373j35k2740j149N885J3174k6381P129R298J4200
16482B3420o41j3495k3599n871K5626K4015j3228q212L546r111O6N796K47J6475
16468B5034L3874q050o349j7043J4364l3991j6977j028k749K3185J5326k1171
16456D425l519o723m872k833p901n322n797L0373P348K4940J2461J475j7466J1364
16442C7953m513k3111l3136K1396J9642J4191j3515l3095k167J5092K4046R301
16430C2084p674j9251k344J2509j0274L885O615K2830J1346j5922k9469K212K2497
16417B9044R318l2712k1758j4113P896K2385J3039J747l8083J05K5462o776L422
$$ plain form
16508 -6726 6588 16241 11368 -8974 -949 3595 17781 29933 27497 19427 32170 18740 10434
16495 10434 -7765 8052 18766 24139 24004 1264 115 6000 19174 -7207 -78 9220 23420
16482 23420 22779 9284 -14315 -20186 5440 29455 16227 8015 11561 2450 2516 8312 8559 25034
16468 25034 58908 50858 44509 27466 41830 7839 -9138 -10166 -12915 10270 25596 4425
16456 4425 906 -5817 -10689 -13522 -21423 -26745 -32542 -2169 5179 30119 42580 44055 26589 37953
16442 37953 33440 10329 -22807 -1411 18231 32422 18907 -14188 -16355 -1263 22783 32084
16430 32084 24410 5159 2815 15324 5050 8935 15550 38380 49726 33804 4335 6547 29044
16417 29044 38362 5650 -16108 -30221 -22325 60 13099 14846 -23237 -23132 2330 -4446 -1024
16404a024K67M262l020L3618K1146l5907q200K41L5008K1521l964j2213j0904
16391D0831l1814r84o316k3657K9922M0814j4907k8098l805J0874J0263O36K565
16378B6324J5203O513K4206K2307j7197k2539k7208j8026J0705j6131j5890L1511
16366A9778O492j5731m332m623J2491K7079J7845M725j1972r247J771j2449k304
16353B9523J5469l5j2075J3693r01n166K0756m496k8612p480j0656P973K7107
16340D5100J5275J350n74j1455j1727j319O283K018r546n625L0006K6443J6594
16327A02823m273K039j3114m0744k3438J2097K2864R168L3026J564R544Q385J050
16314A20991j4052m454J427k718j7891K354J7248M4430K9952j6632l7865J4521
$$ plain form
16404 -1024 -757 3505 485 34103 55249 19342 11142 11383 46391 67912 63948 51735 40831
16391 40831 9017 8033 1717 -21940 7982 48796 33889 5791 1986 12860 23123 23759 26324
16378 26324 41527 48040 72246 94553 77356 54817 27609 9583 20288 4157 -11733 19778
16366 19778 26270 10539 6207 1584 14075 41154 58999 63724 51752 42505 44276 31827 29523
16353 29523 44992 44957 32882 46575 45674 40508 61264 56768 28156 20676 10020 17993 45100
16340 45100 60375 61725 61151 49696 37969 36650 42933 44951 35405 29780 59786 86229 102823
16327 102823 98550 100589 87475 46731 23293 35390 58254 67422 100448 102012 111556 119941 120991
16314 120991 106939 102485 103912 101194 83303 85657 102905 147335 177287 160655 122790 137311
16302A37311O738k9611l071J1545j212j2854j3992l870r524K4645L3103J869M520
16289A45597M196j9228j7227M658K6716j1743k4950k3700R987L3835o168K4261
16277A46234L4163n348j3558J244l0120k0243J8312J0489J0850L0707J2970o411
16265A89289J7384k597l0081m284M131P760L400l2307l2598J1318K8485K1957
16253A81857J541l478j2242j9309K0453j0714K344k686j4416q997K687J6339P670
16240A61049J756L271K7879k1340o816L462K26l6992n561j7800m865j8523l389
16227H2357P213J6827P400r791P724J084j4192j2982k668J378N192J1805J1868
16214A13215j2278o714j5984j2111J3710j7526l841J893M184l1701j5927j2071
$$ plain form
16302 137311 144049 114438 111367 122912 121700 108846 94854 90984 81460 106105 139208 141077 145597
16289 145597 149793 130565 113338 117996 144712 132969 108019 84319 94306 128141 121973 146234
16277 146234 180397 175049 161491 162735 132615 112372 130684 141173 152023 182730 195700 189289
16265 189289 206673 204076 173995 169711 173842 181602 185002 152695 120097 131415 159900 181857
16253 181857 183398 179920 167678 148369 168822 158108 160452 157766 143350 134353 137040 153379 161049
16240 161049 162805 166076 193955 172615 165799 169261 169487 132495 126934 109134 104269 85746 82357
16227 82357 89570 106397 113797 104006 111730 112814 98622 85640 82972 84350 89542 101347 113215
16214 113215 100937 94223 78239 66128 79838 62312 58471 60364 64548 32847 16920 4849
16202D849L3971K2661K323o465J471J0426J0608k2421k3102J0966k81J842l2142
16189A4706j4417J0241O553J4858L336j7241Q460R989j5619o900J10J1046P35
16176B5857J0845M312n356K102J2647M73j3869j8073q27Q419M425J5012Q018q638
16162D5347j1376Q884j2953J3111L528j7794M32N91j1112k4030Q739M4491K4689
16149G2547j1595j7265k364k8048j4573k3206R608Q588l472k1034J5191j0092
16137b5715m557J3336L0023r022l395K0314l8461j296L5001J4586Q397J26J1897
16124E1234j834j9225J0648r906l6208j9825l1347J562L5530J9983J3959O510
16112B1081k6030Q261J0081P801j0754k9565j6395J8190J7984K5278L74j76K226
$$ plain form
16202 4849 38820 61481 63804 57339 58810 69236 79844 57423 34321 45287 45006 46848 14706
16189 14706 289 10530 17083 31941 35277 18036 26496 36485 20866 13966 14076 25122 25857
16176 25857 36702 41014 35658 37760 50407 50880 37011 18938 18111 26530 30955 45967 53985 45347
16162 45347 33971 42855 29902 43013 46541 28747 29179 29770 18658 -5372 3367 47858 72547
16149 72547 60952 43687 41323 13275 -1298 -24504 -14896 -6308 -9780 -30814 -15623 -25715
16137 -25715 -30272 -16936 13087 4065 670 20984 -17477 -18773 16228 30814 39211 39337 51234
16124 51234 49400 30175 40823 30917 -5291 -25116 -56463 -54901 -19371 612 14571 21081
16112 21081 -4949 3312 13393 21194 10440 -19125 -35520 -17330 654 25932 26306 26130 28356
16099B8356M164l865j0455j5725j5844J6038J4356O326L187j8785k1891K189m742
16086a6691n60j235j0227k4064j185J3018K6321L4115n786m2980j6949K3797J8905
16073c521r584J5064R868K4380R664k2880k4567j2544o550J2149o299j206p793
16060b3819k3680N61L9338O834l9499R594K3089J5432k7o36J3985j1450p005j3469
16046a0752L803J2205J8604K027k209l601m0167j13K9861N80N84J2728j093j7830
16032D627j8088q636R267r496p986J2697j4674n035M819j2208J1050J4096N172
16019a4395K0148m419k0314J1599k33q457q352l0486L6065K1555l786k1552J7070
16006e557O005l2743j0629J6282Q538K50K2172o168O927J6863o424q745l0984
$$ plain form
16099 28356 32520 28655 18200 2475 -13369 2669 17025 23351 26538 7753 -14138 -11949 -16691
16086 -16691 -17251 -18486 -28713 -52777 -53962 -40944 -14623 19492 13706 -29274 -46223 -22426 -3521
16073 -3521 -13105 1959 11827 36207 45871 22991 -1576 -14120 -20670 -8521 -14820 -16026 -23819
16060 -23819 -47499 -46938 -7600 -766 -40265 -30671 -7582 7850 7823 7187 21172 9722 2717 -10752
16046 -10752 -6949 5256 23860 25887 23678 20077 -20090 -20203 9658 10238 10822 23550 22457 4627
16032 4627 -13461 -22097 -12830 -22326 -30312 -17615 -32289 -37324 -32505 -44713 -33663 -19567 -14395
16019 -14395 5753 1334 -18980 -7381 -7614 -16071 -24423 -54909 -18844 2711 -1075 -22627 -5557
16006 -5557 448 -32295 -42924 -26642 -18104 -17854 4318 -1850 5077 21940 15516 6771 -24213
15993b4213J2061k819J0366K0335M901j1091J3226j1581k0762j5796k807J7529
15981a0651m154n400J5854L907m26k61J47K736k2455L049r505j1413Q403P300
15967b2869J4123N869J0346l5354q678J501K8699L121N906O358m09k1249j1443
15954b4079k0146m399q30J878o811j3287K6634L1642K1526J0648j4063k8191J2440
15941g038K601n792j114J8965J0243j7297l430M1860J3748o2852l678M909J2492
15928C617o307j4680Q785K2347r340k5244K2018Q852J7165J4176J2370J535k7548
15915B7746j5576Q193k5132J1518j595J853K2212J9097K51o692k0635j3960q926
15902a646J3238J4011l4467k494J6349p425j3720L868J7811J0140j9731M007o282
$$ plain form
15993 -24213 -12152 -14971 -4605 15730 20631 9540 22766 11185 -9577 -25373 -28180 -10651
15981 -10651 -14805 -20205 -4351 -444 -870 -1131 -984 1752 -20703 -17654 -27159 -38572 -30169 -22869
15967 -22869 -8746 -2877 7469 -27885 -36563 -35062 -6363 -3242 2664 9022 8613 -12636 -24079
15954 -24079 -44225 -48624 -49454 -47576 -54387 -67674 -41040 -9398 12128 22776 8713 -19478 -7038
15941 -7038 -4437 -10229 -11343 7622 17865 568 -2862 38998 52746 -10106 -13784 -8875 3617
15928 3617 -2690 -17370 -8585 13762 4422 -20822 1196 10048 27213 41389 53759 55294 27746
15915 27746 12170 20363 -4769 6749 5154 7007 29219 48316 48567 41875 21240 7280 -1646
15902 -1646 11592 25603 -8864 -11358 4991 -2434 -16154 -12286 5525 15665 -4066 -59 -6341
15889f341n063M992J2493q081k4337k7517K4683j3005r798R878L17J8503J7577
15876e699K111k0356M379j9935J698N2904O676J507k7789J0651P321j8452r417
15863a4401k533K556M09j5964n649k717k794l538J9016K3752k9331l2692L1335
15850c2551J3984Q845K6008o924l472j8202J2441J9137J5242j0696j6029q593
15838h10L473k1294l909K1986q164J5706p629K7j8949J2856l774j2112R632L47
15824a2614N18p906j1858K3930N9025j4531l5598l8000k1604L2945J4604L6197
15812B5108K8294j8664k8239j8842j0446J6661j48k4322k4255j3384J6474K0435
15800c1328K5119J818L0170O329N472n521k4754k0776r27J4407J3238N093q881
$$ plain form
15889 -6341 -11404 -6412 6081 -2000 -26337 -53854 -29171 -42176 -51974 -42096 -41779 -23276 -5699
15876 -5699 -3588 -23944 -19565 -39500 -37802 15102 21778 23285 -4504 6147 13468 -4984 -14401
15863 -14401 -16934 -14378 -13969 -29933 -35582 -38299 -41093 -44631 -25615 -1863 -31194 -63886 -32551
15850 -32551 -18567 -9722 16286 9362 5890 -12312 129 19266 34508 23812 7783 -810
15838 -810 2663 -18631 -22540 -554 -8718 6988 -641 -614 -19563 -6707 -10481 -22593 -12961 -12614
15824 -12614 -12096 -20002 -31860 -7930 51095 36564 966 -37034 -58638 -25693 -11089 25108
15812 25108 53402 34738 6499 -12343 -22789 -6128 -6276 -30598 -54853 -68237 -51763 -31328
15800 -31328 -6209 -4391 25779 32108 37580 32059 7305 -13471 -14398 9 13247 18340 9459
15787I459J3788J306q267l5458j4660l210J414j1199J0274L1940P331j8111R764
15774e629O400k1332K9546Q620k0589j995J4554n561k8465l691J7392J3405j4760
15761a2105k2708K1465m86L386j7131L625K5233N96n50k314J204J0886N483j0859
15747E725k438K1789Q328J2480m0960l2376r431r998N888L4816L0856k570l3300
15734a1191L143j676o768J3991J0921j6815o26j8705n895J1826J2403l5167r720
15721e4279r078K0582J8052j549L931L089j0331Q907M7291q569k5261j3375J0808
15708i782R854M078P39k0479r231k2543o110O024J1086q45K4834p306j4089J5230
15694a8540K5179o946M733J1290j5203n34J3178o988k697J1976j3443r467J0147
$$ plain form
15787 9459 23247 24553 16286 -19172 -33832 -37042 -35628 -46827 -36553 -4613 2718 -15393 -5629
15774 -5629 771 -20561 8985 17605 -2984 -4979 9575 4014 -24451 -28142 -10750 2655 -12105
15761 -12105 -34813 -13348 -13834 -10448 -27579 -23954 1279 1875 1325 -989 215 11101 16584 5725
15747 5725 3287 25076 33404 45884 4924 -27452 -36883 -46881 -40993 -6177 24679 22109 -11191
15734 -11191 -8048 -9724 -16492 -2501 8420 -8395 -9021 -27726 -33621 -21795 -9392 -44559 -54279
15721 -54279 -63357 -42775 -24723 -26272 -22341 -19252 -29583 -20676 26615 18046 -7215 -20590 -9782
15708 -9782 72 4150 4889 -15590 -24821 -47364 -53474 -47450 -36364 -37209 -12375 -19681 -33770 -18540
15694 -18540 6639 -307 4426 15716 513 -21 13157 6169 3472 15448 2005 -7462 2685
15681B685L639Q91k6037j848R301M421Q754p703J758j846p219J6952J2024K3148
15667C8920l6569k7597j9141k2918J8537J0679L2429N834j8308k3454n247j4710
15655f1545N009M8763K3478O929q475j6593l084J7310J829k4132J1655k73q817
15642g946j9694j7271K0071K4761j4724j8749K1768J4742L022r729j970n834l2790
15629d4343J77o486K7018J4169q2M932J3145k2379K314J6772j6427j567m154P992
15615h919j6673l3182O933K9470O86k0104j3879L374J0974R352m343J1836o551
15602c1026j4363L2032J4306L440J997m848l4251J1519J5663J2067J8648J7303
15590D2487p956k3594k8551K510o754j0980j3514Q338j1012j1493J6763K0744
$$ plain form
15681 2685 6324 7215 -18822 -20670 -11369 -6948 1806 -5897 -4139 -5985 -13204 3748 15772 38920
15667 38920 2351 -25246 -44387 -67305 -48768 -38089 -5660 174 -18134 -41588 -46835 -61545
15655 -61545 -56536 -7773 15705 22634 14159 -2434 -5518 11792 13621 -10511 1144 871 -7946
15642 -7946 -27640 -44911 -24840 -79 -14803 -33552 -11784 2958 5980 -3749 -5719 -11553 -44343
15629 -44343 -44166 -50652 -23634 -9465 -9547 -4615 8530 -13849 -11535 5237 -11190 -12757 -16911 -8919
15615 -8919 -25592 -58774 -51841 -22371 -21685 -41789 -55668 -52294 -41320 -31968 -36311 -24475 -31026
15602 -31026 -45389 -13357 949 4389 6386 1538 -32713 -21194 -5531 6536 25184 42487
15590 42487 34531 10937 -17614 -15104 -21858 -32838 -46352 -38014 -49026 -60519 -43756 -23012
15578b3012J5729j3208j0126J840P433j0243L062J9625j3949k4924K7367O817
15566a3589k7742K5231K7676k896K3106l8023j9838J31o121j1876J7650K6359
15554F8J4941Q708N275k9253l4830L195j488O097L747K1434L1199j2482q653l5420
15540b7462k0457K416M630L1833J0980j6219P765o741o823j604m729J2033J1680
15527b698n234N611l834j7892J3557O297Q594j3903j3699k0667m244L708K6629
15514a7775K5586P005j1489j0736J4387N81J6835o706j9107j4411j2210l072K1217
15501i895M1377n373o308k041M670k2574J0326K7977j8007k1552j9060p875J4091
15488a4244K6268J8643k4374k1812K9112R84k2723q595p886j370O140K6506J1695
$$ plain form
15578 -23012 -7283 -20491 -30617 -28777 -21344 -31587 -28525 -8900 -22849 -47773 -20406 -13589
15566 -13589 -41331 -16100 11576 8680 31786 -6237 -26075 -25944 -32065 -43941 -26291 68
15554 68 15009 23717 28992 -261 -35091 -31896 -33384 -27287 -23540 -2106 29093 16611 7958 -27462
15540 -27462 -47919 -45503 -40873 -9040 1940 -14279 -6514 -13255 -20078 -21682 -26411 -14378 -2698
15527 -2698 -7932 -2321 -6155 -24047 -10490 -4193 4401 -9502 -23201 -43868 -48112 -44404 -17775
15514 -17775 7811 14816 3327 -7409 6978 7559 24394 17688 -1419 -15830 -28040 -31112 -9895
15501 -9895 31482 26109 19801 17760 22430 -144 10182 38159 20152 -1400 -20460 -28335 -14244
15488 -14244 12024 30667 6293 -15519 13593 14577 -8146 -16741 -24627 -25997 -19857 6649 18344
15475A8344K2374j1713j2310J1523J2432p071O350j5442k0559k6504l6740J740
15463e7576L9975L5305K368J6554O779j8435j2673m2468j1617r654K895J3878
15451c4669L823J527n069L5731L4143k6888j7350J3727N871Q114J5152m3051q649
15438a7588L6553J4161o632j0362j2187j8243j4320k3277l593L2949J5236J9572
15426A2269O182L482k5796M66L0381K2173N10m610J409N005k0320q101n966j6487
15412E97j8675P166p305K3936l753j5649m261L7014j1367o785p704j3194J2126
15399g854R171K0936J4973N914k47N344k1368j7688p032J3533k733n24L066J6717
15385C2208L768J9500j7434l6013k0431K913R896K66k1187P106J4063j6440J9385
$$ plain form
15475 18344 40718 29005 16695 28218 40650 33579 39929 24487 3928 -22576 -59316 -57576
15463 -57576 -17601 17704 20072 36626 43405 24970 12297 -30171 -41788 -51442 -48547 -34669
15451 -34669 -30846 -29319 -34388 1343 35486 8598 -8752 4975 10846 18960 34112 -8939 -17588
15438 -17588 18965 33126 26494 16132 3945 -14298 -28618 -51895 -55488 -22539 -7303 12269
15426 12269 18451 21933 -3863 -3397 26984 49157 49667 45057 46466 51471 31151 23050 17084 597
15412 597 -18078 -10912 -18217 5719 1966 -13683 -17944 19070 7703 918 -6786 -19980 -7854
15399 -7854 1317 22253 37226 43140 42893 48237 26869 9181 2149 15682 12949 12425 15491 32208
15385 32208 35976 55476 38042 2029 -18402 -15489 -5593 -5327 -26514 -19408 -5345 -21785 -2400
15372b400J0353J3411Q570j0514j7908O26N047m342L335k8104n224m274j4699
15359d6123K8445J8617l394j7988j2636J0138K0958k801J804k2043l4993j6539
15347g6555J0371K4085K311J5255L4375K0236r89M056l9239l1002K4533K0238
15335G675K190J7295N017M089m861J1342l3497k3416q842J0646r860k473K9836
15322E141P533j2015r050j5140J4334K16q119J4037M364o693n238j2150P653K891
15308a2236j8293j3855J3879K6733J0607m174j6835k2749K345j4084K5042J5443
15296h177j3791J703j0736N341r778k6035N976K8495pk7681J0726M0022o43n59
15282e144J3631k7025j2687Q807O424P930J871q874m107N356o196K8591J6513
$$ plain form
15372 -2400 7953 21364 29934 19420 1512 2138 7185 2843 6178 -21926 -27150 -31424 -46123
15359 -46123 -17678 939 -2455 -20443 -33079 -22941 -1983 -4784 -2980 -25023 -60016 -76555
15347 -76555 -66184 -42099 -39788 -24533 9842 30078 29089 33145 -6094 -37096 -12563 7675
15335 7675 9865 27160 32177 36266 31405 42747 9250 -14166 -23008 -12362 -22222 -24695 5141
15322 5141 12674 659 -8391 -23531 -9197 -8981 -17100 -3063 1301 -5392 -10630 -22780 -15127 -12236
15308 -12236 -30529 -44384 -30505 -3772 6835 2661 -14174 -36923 -34578 -48662 -23620 -8177
15296 -8177 -21968 -20265 -31001 -25660 -35438 -61473 -55497 -27002 -27009 -54690 -43964 -3942 -4585 -5144
15282 -5144 8487 -18538 -31225 -22418 -15994 -8064 -6193 -15067 -19174 -13818 -20014 8577 25090
15269B5090k4993k1589N28N519L461M484M816j6410q208j0211O549R009k7K346
15255a9636j1160J4878J9606Q220j2056m7860l870M0735J8150J939j1335r294
15243a1683J068J3228J4198j1048p261P396j7027p55K9381n030l0309r537J3154
15230a4225P564n782K6499k1911o150K0994j6424j2948j682J3124K849j696L6446
15217B6658J4596M105k0173j1756K634n758k3477r58l3490p935L3481N284j1497
15204b8286j6838L5349N3468N491q086l609j8797j6978Q073K634J3763J4057m573
15191C5668m6361r856K8222J1778j774J9832P11K794j5889n5441k1299J6172J1619
15178b3824J0280J1393k5203L980Q101M359j4250J6188K2195J314k3835o340k373
$$ plain form
15269 25090 97 -21492 -20964 -15445 -11984 -7500 -2684 -19094 -27302 -37513 -30964 -21955 -21982 -19636
15255 -19636 -30796 -15918 3688 11908 -148 -48008 -51878 -11143 7007 8946 -2389 -11683
15243 -11683 -10615 2613 16811 5763 -1498 5898 -11129 -11884 17497 12467 -17842 -27379 -14225
15230 -14225 -6661 -12443 14056 -7855 -14005 6989 -9435 -22383 -24065 -10941 -8092 -9788 26658
15217 26658 41254 45359 25186 13430 16064 10306 -13171 -14129 -47619 -55554 -22073 -16789 -28286
15204 -28286 -45124 -9775 43693 49184 41098 37489 18692 1714 9787 12421 26184 40241 35668
15191 35668 -10693 -20549 7673 19451 17677 37509 38220 41014 25125 -30316 -51615 -35443 -23824
15178 -23824 -13544 -2151 -27354 -23374 -15273 -10914 -25164 -8976 13219 14533 -9302 -15642 -18015
15165a8015j9493j545Q4P350J9867J8911M4736j855r423Q068o897j9481l168O044
15151B5183j7461O541N83k9216j5931K405r497Q878L3140K4581K5152N854J739
15138F1951R509J0062J0084j2535n1533j066k1340K7777o599k4819q122L7891
15126C1260J2047l152j4117j6098L412J761J3879R481j3929j2961N697r571M984
15113A2693j4335j1137J6897j3610k1775N545J0806q762K7814N580k2853K2692
15101I555J6994N285o109j1559j7476P993Q607k996K3580r6m0228l7405K657M7342
15087F144K9469Q66j0586k0365P605o442J284J2729P088p513r949q715K2413N513
15073B9541k3341k6842j6584j8558K1696K1683J5142N715O103O804r941l921L1279
$$ plain form
15165 -18015 -37508 -39053 -38969 -31619 -11752 7159 51895 50040 40617 48685 41788 22307 19139 25183
15151 25183 7722 14263 14846 -14370 -30301 -27896 -37393 -28515 4625 29206 54358 60212 61951
15138 61951 71460 81522 91606 79071 27538 26472 5132 32909 26310 1491 -6631 31260
15126 31260 43307 40155 26038 9940 13352 15113 28992 38473 24544 11583 17280 7709 12693
15113 12693 -1642 -12779 4118 -9492 -31267 -25722 -14916 -23678 4136 9716 -13137 9555
15101 9555 26549 31834 25725 14166 -3310 4683 13290 10294 33874 33778 -6450 -43855 -41198 6144
15087 6144 35613 36479 25893 5528 13133 6691 7975 20704 27792 20279 10330 1615 24028 29541
15073 29541 6200 -20642 -37226 -55784 -34088 -12405 2737 8452 14555 21359 11418 7497 38776
15060C8776J2234l4686k425L4102K4404k5337l5906l6378J5826K5166N698k3334
15048a860J63K840k0541j3437J1190M699Q995J6722K1750N131l1466N596l488
15035F294J6078j9066k4375P387m849Q011L0637k2447l3786j2886r114M8552K7686
15022A8122j2917P623M628k4345J1867K0280R866l4373j2978J1935k7829M15K7408
15009b98r417J2916K9941J0429K5069j172k7885K14j3821j3843K6692J6245j5949
14996C9121k0281j1154j0602k2646N944o77p134j0881P757K4001J6792l616n345
14983A279q433j0189J1967J8408j0924k824r05q558r675K1299m103l2453k524
14970c7635J0643k144l655Q078p596J9733j476k890M962j5058k477J2245j9138
$$ plain form
15060 38776 51010 16324 13899 48001 72405 47068 11162 -25216 -9390 15776 21474 -1860
15048 -1860 -1697 1143 -19398 -32835 -21645 -16946 -7951 8771 30521 35652 4186 9782 6294
15035 6294 22372 3306 -21069 -13682 -18531 -10520 20117 -2330 -36116 -49002 -58116 -9564 18122
15022 18122 5205 12828 17456 -6889 4978 25258 35124 751 -12227 -292 -28121 -27706 -298
15009 -298 -9715 3201 33142 43571 68640 67468 39583 39797 25976 12133 38825 55070 39121
14996 39121 18840 7686 -2916 -25562 -19618 -20295 -27429 -38310 -30553 -6552 10240 6624 1279
14983 1279 -7154 -17343 -5376 13032 2108 -716 -1621 -10179 -19854 1445 -2658 -35111 -37635
14970 -37635 -26992 -29136 -32791 -24713 -32309 -12576 -14052 -16942 -11980 -27038 -29515 -17270 -36408
14957c6408k7754k449j315r63J3502M3450J4361q360K5820M679P135J6378O024
14944E4100K066J099k0727k7682k7050k7707J1011J0703J4475J9402J3948J6393
14932D0031l033l2298j0320k3629k6569o420K5301J0796K7922K3257Q493q527
14920B5004n0302l6064p539k689J3901J0671J3193M478N816J7812K6389J7534
14908C8204J2859j0929l472m2163j6155J5938J6484L0206P829l2583k9062L695
14896i149k8585p636R819O522K1008L2855J1057j5753k7170j8968J8625Q371J680
14883B676L279j3994K68r914l211J534L7564K492j4193R842P309j7579m4166l9502
14869g7595J681N1567O1594m349j5030j1045j7370K78J6868k2443J5655Q143J810
$$ plain form
14957 -36408 -64162 -66611 -67926 -68889 -55387 -11937 2424 -5936 19884 24563 31698 48076 54100
14944 54100 56166 57265 36538 8856 -18194 -45901 -34890 -24187 -9712 9690 23638 40031
14932 40031 36998 4700 -5620 -29249 -55818 -62238 -36937 -26141 1781 25038 33531 25004
14920 25004 -25298 -61362 -68901 -71590 -57689 -47018 -33825 -29347 -23531 -5719 20670 38204
14908 38204 51063 40134 36662 -5501 -21656 -5718 10766 40972 48801 16218 -12844 -9149
14896 -9149 -37734 -45370 -35551 -29029 -8021 24834 35891 20138 -7032 -26000 -7375 996 2676
14883 2676 5955 -8039 -7771 -17685 -20896 -19362 18202 20694 6501 16343 23652 6073 -38093 -77595
14869 -77595 -75914 -24347 37247 32898 17868 6823 -10547 -10269 6599 -15844 -189 7954 9764
14856I764l8751l047K3857J3876l822o429n833J0897Q336k58l450j3563k7888
14843c6311j8488J1128O713R03Q018L5043K9291j6996O636j9020J3045j248l0723
14830a2009l341m247k600j4651P10k6858J9643K8655K4027Q585r253M925J5399
14817B8985j9243n6980L91Q346j7845J8845K6021j0577J6771k6273m0138m627
14805g6324K1824K8268L1200K3159k2113l04j1590m869N283l426J7403K3140J982
14792C3633l1777k4763K550R025n814J3297J4645j4941j6138j780k4273J0091
14780c6245L3222m534J8667P878j2953l7038j7108L4765M9345l310l0020r988
14768g319K1241o836k3537J318J920R771K2709j724j4247J9343j891j2971P185
$$ plain form
14856 9764 -28987 -32034 -8177 5699 1877 -4552 -10385 512 8848 8590 5140 -8423 -36311
14843 -36311 -54799 -43671 -36958 -36055 -28037 7006 36297 19301 25937 6917 19962 18714 -12009
14830 -12009 -15350 -19597 -22197 -36848 -36138 -62996 -43353 -14698 9329 17914 8661 13586 28985
14817 28985 9742 -47238 -46847 -38501 -56346 -37501 -11480 -22057 -5286 -31559 -71697 -76324
14805 -76324 -54500 -26232 4968 28127 6014 5710 -5880 -10749 -5466 -8892 8511 31651 33633
14792 33633 1856 -22907 -20357 -11332 -17146 -3849 10796 -4145 -20283 -22063 -46336 -36245
14780 -36245 -3023 -7557 11110 18988 6035 -31003 -48111 -13346 35999 32689 2669 -7319
14768 -7319 13922 7086 -16451 -15133 -13213 -3442 19267 17543 3296 22639 20748 7777 14962
14755A4962N02j0677k5260Q171K8433J3129l8406k0229P178J1313J585j6804j8411
14742d4514j3791L3065J0785J2021l605p171K0515P414n764L1683j3524m0482
14730a3368M346K160j332K847J3646N310M923j8965j4746P222R015q517J6111
14717H652N082J952M808n205k1775k920q075q825L3195n624j8760j7247J7457
14704a7285K2961J7703k413m3035k1858R650J8342O453l288L321J0118j8878j0137
14691b8346N607N00l001j3739l0083R764M415K4936L9147J1815Q174k8717o834
14678f362Q612l76N973O518j6761k4048Q074L2406J6646j9765k4376J1235K8286
14665B6062o884m546l4181k7073K5679M0662j2797l4141K900L2468J5099M101
$$ plain form
14755 14962 15464 4787 -20473 -12302 16131 29260 -9146 -29375 -22197 -10884 -9299 -26103 -44514
14742 -44514 -58305 -25240 -14455 -2434 -6039 -13210 7305 14719 8955 40638 27114 -13368
14730 -13368 -9022 -6862 -8194 -5347 8299 13609 18532 -433 -15179 -7957 1058 -7459 8652
14717 8652 13734 15686 20494 15289 -6486 -9406 -17481 -26306 6889 1265 -17495 -34742 -17285
14704 -17285 5676 23379 20966 -22069 -43927 -34277 -15935 -9482 -12770 -9449 669 -18209 -28346
14691 -28346 -22739 -22239 -25240 -38979 -69062 -59298 -54883 -29947 9200 21015 29189 472 -6362
14678 -6362 2250 1874 7847 14365 -2396 -26444 -18370 14036 30682 10917 -13459 -2224 26062
14665 26062 19178 14632 -19549 -46622 -20943 19719 6922 -27219 -24319 8149 23248 27349
14653B7349j4164o388n72r628J4905J9653j3309l497o90j5824j1531j3034L2849
14640F119K7825J1367p700j6385o738k499J6536j8866L54M136K0481J2341l2408
14627A4563m1701K936o0j9071J0748M183l4665R399L4871K9889m770J6629R994
14614C2945l0505l7105j3295l0429j1884K9254k952J9187K9795J8675k8364p683
14602c2361Q217K0242J6082R327q767j8200k3233o762N428J6239O205k462j1367
14589b1412O39L048J1589N821L178j1423M686N358Q971k470o796N372l996r451
14575f886n092K218k575n500K6452J6441j896k4317k7718m504Q730J761K7491
14562D605J0072J4397J3145O637j0555j4161j5232Q085k2478j9233p220J4886
$$ plain form
14653 27349 13185 6797 6225 -3403 11502 31155 17846 14349 13659 -2165 -13696 -26730 6119
14640 6119 33944 45311 37611 21226 14488 11989 28525 9659 10013 14149 34630 46971 14563
14627 14563 -27138 -24202 -24262 -43333 -32585 -28402 -63067 -53668 -18797 11092 6322 22951 32945
14614 32945 2440 -34665 -47960 -78389 -90273 -61019 -63971 -44784 -14989 3686 -24678 -32361
14602 -32361 -24144 -3902 12180 21507 12740 -5460 -28693 -35455 -30027 -13788 -7583 -10045 -21412
14589 -21412 -20773 -17725 -6136 -315 2863 -8560 -3874 1484 10455 7985 1189 6561 2565 -6886
14575 -6886 -11978 -9760 -12335 -17835 8617 25058 23162 -1155 -28873 -33377 -24647 -22886 4605
14562 4605 14677 29074 42219 48856 38301 24140 8908 16993 -5485 -24718 -31938 -17052
14550a7052L0732P267j6090j3673L75j5296J002L175Q806J4130k416N427J1951
14537A8338j8922k5600K0531j5700j6801J1121o72K4948K0245J356j0556j3806
14525e518J8203K2106Q443k4446j3777J647k3834j4542J1555k295J045K0460k0612
14512b1565m486n469o388j3337M0385K9924j3816o931J4039j9550l957J6145J2764
14499A7758O809j1405j2005P531J849J07p734m282J1589j1846N457N286m485J316
14485E945k9250o04J8774m384k72N132K2214j6433j6247n655J5370j7492j4216
14472c7118J9515n892r221L6827M515j8065N832l33k0863Q907J5006j0291k092
14459a3273L342K0475j4265J0036L4599K117l0432N855k6759j6056N298J9726
$$ plain form
14550 -17052 13680 20947 4857 -8816 -8441 -23737 -22735 -19560 -10754 3376 960 6387 18338
14537 18338 -584 -26184 -5653 -21353 -38154 -27033 -27705 -2757 17488 18844 8288 -5518
14525 -5518 12685 34791 43234 18788 5011 6658 -17176 -31718 -20163 -22458 -21413 -953 -21565
14512 -21565 -26051 -31520 -37908 -51245 -10860 19064 5248 -1683 12356 -7194 -11151 4994 17758
14499 17758 24567 13162 1157 8688 10537 10644 2910 -1372 10217 -1629 3828 9114 4629 5945
14485 5945 -23305 -23909 -5135 -9519 -9791 -4659 17555 1122 -15125 -20780 -5410 -22902 -37118
14472 -37118 -17603 -23495 -32716 4111 8626 -9439 -3607 -3940 -24803 -15896 -890 -11181 -13273
14459 -13273 -9931 10544 -3721 6315 40914 43031 12599 18454 -8305 -24361 -19063 663
14447F63J3914P005p812M913k3087l4929K3923O391R535j3333l6669J9631L5755
14434E900k447J4501k0991j8129K617L35l274K5091J2355j6823K4430L1582l3883
14421B1264m7994j2975L6646P724j2185K0624l695r611J672j3617r489J2002O967
14408b667J2568K78K051O706p456j1365k529j4106J159j0338o868J3452o825J2605
14394a3335r671j0152m482K6056j7737J4629J0512l5k5924o001m462J4629J9610
14381f363O357J2946K1229J3834l4660j939J7936N1547M0686J1043J1361j2602
14369A31375l661K857k7400K26J0984M1788J0019j5737j0521o781j0796k6642
14357I5711j9863k5316k9967k0175l672K6976l580k1321K185J4158o217k040M97
$$ plain form
14447 663 14577 21582 13770 18683 -4404 -39333 -15410 -9019 516 -12817 -49486 -29855 5900
14434 5900 3453 17954 -3037 -21166 -18549 -18214 -21488 3603 15958 -865 23565 55147 21264
14421 21264 -26730 -39705 -3059 4665 -7520 13104 9409 -202 1470 -12147 -21636 -9634 -2667
14408 -2667 9901 10179 12230 18936 11480 115 -2414 -16520 -15361 -25699 -32567 -19115 -25940 -13335
14394 -13335 -23006 -33158 -37640 -11584 -29321 -14692 -4180 -4215 -30139 -36140 -40602 -25973 -6363
14381 -6363 -6 12940 34169 48003 13343 11404 29340 80887 121573 132616 143977 131375
14369 131375 127714 130571 103171 103397 114381 156169 166188 150451 139930 133149 122353 95711
14357 95711 75848 50532 20565 390 -3282 23694 20114 -1207 978 15136 8919 6879 7376
14344G376L998K475J3818K4865k6612j7204L0107J371m565l0013j1568p969j7956
14331c1877Q361J4988k536N225J426k0255q223R231K9308J0555j0771J6253J3628
14318C5313J8689J4602M985k6379k5316l9880q535K6442J3003j7151l3266M1479
14306C986r97j7593L419o610R601K1859j1690n934j2442n192L609p442k6691K1781
14292c0336M4435n34o749R296l904l7822m698K7275q418k9717k2847J1840O629
14279d5550J0091m186L0774L5210P423K733J3229l252j9528j3954m4839j0675
14267d2524L0132L3123J0033q469Q868M255P958L755k5958q308j0509J9562j1955
14254I963k1341Q079M744J6660n990m602J0312j2712l5933j3410K2654r977j5986
$$ plain form
14344 7376 11374 13849 27667 52532 25920 8716 38823 40194 35629 5616 -5952 -13921 -31877
14331 -31877 -23516 -8528 -11064 -5839 -4413 -24668 -32891 -23660 5648 16203 5432 21685 35313
14318 35313 54002 68604 73589 47210 21894 -17986 -26521 -79 12924 -4227 -37493 3986
14306 3986 2989 -14604 -11185 -17795 -8194 13665 1975 -3959 -16401 -21593 -17984 -25426 -52117 -30336
14292 -30336 14099 13565 6816 16112 12208 -25614 -30312 -3037 -11455 -41172 -64019 -52179 -45550
14279 -45550 -35459 -39645 -8871 26339 33762 36495 49724 46472 26944 12990 -31849 -42524
14267 -42524 -12392 20731 30764 22295 31163 35418 43376 47131 21173 12865 2356 21918 9963
14254 9963 -11378 -3299 1445 18105 12115 7513 17825 5113 -30820 -44230 -21576 -31553 -47539
14241d7539l204J838L5967K1325j3462l899P47Q334k4694j0732L821K862K9813
14228A177J5485k5461j2709P648K8195L2396j8031o22m037l1722J2086q607k0768
14215b4970o343p950P207K5246n923J8006K5649Q262Q318O753j2479k0438J1177
14202C2515K5527k0550k6772N077K2136j545r093q680l2394l415J5069l3913N423
14189c0615j6332j2607J7470J8917K4241N098n492J4780J045j8929j861k7592
14177c1877n055J7605k3005o031M7251L1916K223k1007R10n62n265k0814l3298
14164d7009K3063P966j0901J9553M31J2914q266J1465j0727j4459j6527j4053
14152d6550J4189L8122J3186P913q779j0923j5382j3966J4195l718l0265j0289
$$ plain form
14241 -47539 -50743 -48905 -12938 8387 -5075 -8974 -8227 107 -24587 -35319 -31498 -28636 1177
14228 1177 16662 -8799 -21508 -13860 14335 46731 28700 28078 24041 -7681 4405 -4202 -24970
14215 -24970 -31313 -39263 -32056 -6810 -12733 5273 30922 39184 47502 54255 41776 21338 32515
14202 32515 58042 37492 10720 15797 37933 36388 27295 18615 -13779 -17194 -2125 -36038 -30615
14189 -30615 -46947 -59554 -42084 -23167 1074 6172 680 15460 16505 -2424 -4285 -31877
14177 -31877 -36932 -19327 -42332 -48363 -1112 30804 33027 12020 12930 12368 7103 -13711 -47009
14164 -47009 -23946 -15980 -26881 -7328 -6897 6017 -2249 9216 -1511 -15970 -32497 -46550
14152 -46550 -32361 5761 18947 26860 18081 7158 -8224 -22190 -7995 -11713 -41978 -52267
14140e2267J7007K9049K7597L4005j388q449k6306n086J4433Q582J3987r681j912
14127C9571m5379l2508j6820J5152K4094L4861j439J8725J5654l6330l974j640
14115I967L349O220N19K0632J0919j1130o79l5750j7978k8209m99K0994J7337
14102d308l458J2993K1784j4589J445j3998p94J0200K3958p199k5607J8478Q106
14089B7011M868K7358P563j0403j4515L1987J128j1136m1105J5238M390j6840
14077B5544l8786k1490J026M4377J4346j8768j4034m468o222N246j5889R523r48
14064b0543J1557Q030r553j2315o275K567J60p936n958K5315J4418J1020j165
14051I322j8795n334K2377J0277O439J987k340k2200n8023J094L1801J681K878
$$ plain form
14140 -52267 -35260 -6211 21386 55391 54003 45554 19248 14162 28595 37177 51164 41483 39571
14127 39571 -5808 -38316 -55136 -39984 -15890 18971 17532 36257 51911 15581 11607 9967
14115 9967 13316 19536 20055 40687 51606 40476 39797 4047 -13931 -42140 -42639 -21645 -4308
14102 -4308 -7766 5227 27011 12422 13867 -131 -925 9275 33233 26034 427 18905 27011
14089 27011 31879 59237 66800 56397 41882 73869 74997 63861 22756 37994 42384 25544
14077 25544 -13242 -34732 -33706 10671 25017 6249 -7785 -12253 -18475 -13229 -29118 -19595 -20543
14064 -20543 -8986 -956 -10509 -22824 -29099 -26532 -26372 -34308 -40266 -14951 -533 10487 9322
14051 9322 -9473 -14807 7570 17847 24286 26273 23933 1733 -56290 -55196 -23395 -21714 -18836
14038a8836r224K1675R858J6047J408o97L934j8165k3083J0278j470l6949j453
14025d6677M0981o573k0303K3317K1216j2200J5976K696j4271j02J1603J2606
14013B8269J1460k2388l0144j4534L0011O453j1912M374J2548N723j5782k2853
14001a8775j2629j5905L456J2684P935K2708o352m2221J8987K4938K8614l974
13989A9466j8824k178R28j4936J2062j467J4441j794M279K6959K1275r176j0371
13976D0664p11j3783j6692l4683k184k8020K7862J6220j174j7235R358J6103J2526
13963H251O513j4363J7178r409m4359j4709J831N3041J401J3730P840m920q147
13950A3878O644K2408k4631j5889J937j1499k2794J8162J9720j4528K4395J5878
$$ plain form
14038 -18836 -28060 -6385 3473 19520 20928 20231 24165 6000 -17083 -6805 -8275 -45224 -46677
14025 -46677 -5696 -12269 -32572 -9255 11961 -239 15737 18433 4162 4060 15663 28269
14013 28269 39729 17341 -12803 -27337 2674 9127 -2785 1589 14137 19860 4078 -18775
14001 -18775 -31404 -47309 -43853 -31169 -23234 -526 -6878 -49099 -30112 -5174 23440 19466
13989 19466 642 -1536 -608 -15544 -3482 -4949 9492 7698 11977 38936 60211 51035 40664
13976 40664 39953 26170 9478 -25205 -27389 -55409 -27547 -11327 -12501 -29736 -20378 -4275 8251
13963 8251 14764 401 17579 8170 -36189 -50898 -49067 3974 5375 19105 26945 22025 13878
13950 13878 20522 42930 18299 2410 4347 -7152 -29946 -11784 7936 -6592 17803 33681
13938C3681p691j3731j4833m911J407J2177r533n25J1181J754n528j489p664J9539
13924A3834K788K1207O354j3868r550q191j4283K2283j9715r427L8534J2321l035
13911C9252M986K3333K0119k2474k6572m7533O974Q715N522J5491K374L164P817
13898D1168P574J0514J151k3226k3815j6926q664K2082j1618m618j4000J0085
13886a0293L7327k597m471N388J1255K1607j7551n120J8314M454j2420j5112j9024
13873A1757k1629o439j7154m452N0377J4189l3628k0239q288J6979J3885l680
13861h322j4982J3823l124j7852l78J9730J7496j0590l7777l2971K190M6005L1157
13848D405R288R100m395l5725k3538l460J7486K8269J995j901M218k199j1258
$$ plain form
13938 33681 25990 12259 -2574 -7485 -6078 6099 -3434 -3959 7222 8976 3448 1959 -5705 13834
13924 13834 16622 37829 44183 30315 20765 12574 -1709 20574 859 -8568 29966 42287 39252
13911 39252 44238 67571 87690 65216 38644 -8889 -1915 6800 12322 27813 30187 33351 41168
13898 41168 48742 59256 60407 37181 13366 -3560 -12224 9858 -1760 -6378 -20378 -10293
13886 -10293 27034 24437 19966 25354 36609 58216 40665 35545 53859 58313 45893 30781 11757
13873 11757 -9872 -16311 -33465 -37917 12460 26649 -6979 -27218 -35506 -18527 -4642 -8322
13861 -8322 -23304 -9481 -12605 -30457 -30835 -11105 6391 -4199 -41976 -74947 -72757 -26752 4405
13848 4405 13693 22793 18398 -17327 -40865 -44325 -26839 1430 3425 1524 5742 3543 -7715
13835g715j0770o742J5754K0740j1526K5203J0327k3659m104k7110J2770K5347
13823A8515m208R10l1747j0200Q195k0602k0596J338P840K2930J3670k0929O829
13810b8055n53K6706K9956J2062o631k0758l4026J2894N405l999K7480K7754j7130
13797C1105j9190J7351j9102j9555J819l0013J2125J9071J3063J0794l886m386
13785I196k2991k79M549J3445j4218q891O428P899p718j2770M9176J5037L618
13772D2481k7150k6841N07J9264K125n147K8800l1138j1919L3873j1055o295R66
13759H471J3661j4194m0904j1715K223j3198J0154L0167Q079J3080j556j6945
13747a2677L164L4079N702q412J4936M0337J1302o644J0050J6042j1645Q036J0300
$$ plain form
13835 -7715 -18485 -25227 -9473 11267 -259 24944 35271 11612 7508 -19602 -6832 18515
13823 18515 14307 15217 -16530 -26730 -18535 -39137 -59733 -58395 -50555 -27625 -13955 -34884 -28055
13810 -28055 -28608 -1902 28054 40116 33485 12727 -21299 -8405 -3000 -6999 20481 48235 31105
13797 31105 11915 29266 10164 -9391 -7572 -37585 -25460 -6389 6674 17468 13582 9196
13785 9196 -13795 -14074 -9525 3920 -10298 -19189 -12761 -4862 -12580 -25350 23826 38863 42481
13772 42481 15331 -11510 -11003 8261 10386 5239 34039 2901 -9018 24855 13800 7505 8471
13759 8471 22132 7938 -32966 -44681 -42458 -55656 -45502 -15335 -7256 5824 4268 -12677
13747 -12677 -9513 24566 30268 21856 36792 77129 88431 81787 91837 107879 96234 104270 114570
13734A14570P213J855j0585j6320j8865k2172m785O609J1397J4772j3283k1976
13722D8430J2738P906j6073k3113Q042k6778R55L3216P550n917L0972L1842K6553
13709A36323J3542J2178J7434J5977L3293L264j577J0913L9648M2326P2901Q6980
13697D83202J16329J68117K38383K53657K13084J80914J27464P0404j2730j02326
13687A736498j80986k19364k26488k14394j73837j12575o4852o8880o2966k2368
13677C89788k1288l1490j6048l7221l1840J8294l1230l8180J346p619L281J7068
13665B14861j865R571N8139L2280O9591R7999J21746J76506K06590K27659K60247
13654A473324J47732P4494P824o9976j83191k16340j89437k36870j82160j29661
$$ plain form
13734 114570 121783 123638 113053 96733 77868 55696 50911 57520 68917 83689 70406 48430
13722 48430 61168 69074 53001 29888 37930 11152 12107 45323 52873 46956 77928 109770 136323
13709 136323 149865 162043 179477 195454 228747 232011 230434 241347 280995 323321 396222 483202
13697 483202 599531 767648 1006031 1259688 1472772 1653686 1781150 1851554 1838824 1736498
13687 1736498 1555512 1336148 1109660 895266 721429 608854 544002 475122 412156 389788
13677 389788 368500 337010 320962 283741 251901 270195 238965 200785 202131 194512 197793 214861
13665 214861 212996 222567 280706 312986 382577 480576 602322 778828 985418 1213077 1473324
13654 1473324 1621056 1695550 1703374 1633398 1450207 1233867 1044430 807560 625400 495739
13644D95739j06220q1325l3549n0031l8261k8149k949l495j9786k4644k4058N83
13632H3855j743j9270J1875J2517k6725k1473m869j837m609q82J114J5462K6941
13619G0356R644j4060j2566j4882p069k7197K743K8579K2577j4582K2739l64k8737
13606C7181j5564k286K3693O449r09j155O344j6523N329N762k8192k2891J7567
13593A4805l208j3443J0285j2862P318j5484k971J9492k7886j4283N0099L0204
13581D2066l25J4881r933k5634J4287k1771j9047j692K5374J4596j316k902R45
13568B9529L907J8765k3912L689O749k2292k0015k289J2527K2743p570j3321K9154
13555C7664k152Q548k7750j6945q417K7413q249p981O692J4778j6629j0731O304
$$ plain form
13644 495739 389519 308194 274645 224614 186353 158204 155255 151760 131974 107330 83272 83855
13632 83855 82112 62842 74717 87234 60509 39036 34167 32330 27721 26839 27953 43415 70356
13619 70356 80000 65940 53374 38492 31423 4226 6969 35548 58125 43543 66282 65918 37181
13606 37181 21617 19331 43024 49473 48564 47409 53753 37230 42559 48321 20129 -2762 14805
13593 14805 11597 -1846 8439 -4423 2895 -12589 -15560 3932 -23954 -38237 11862 42066
13581 42066 41741 56622 46689 21055 35342 13571 -5476 -7168 18206 32802 31486 28584 29529
13568 29529 33436 52201 28289 31978 38727 16435 -3580 -5869 6658 29401 21831 8510 37664
13555 37664 35512 44060 16310 -635 -9052 18361 10112 2131 8823 23601 6972 -3759 2545
13542B545r510N873O376J518r87M269k1166j750J6167J3391j2956k762K7824R134
13528C7966p473J1108K7307k016j2357j7293k5543j5347r647K72J9060N701O581
13515A8319m818k036J6398Q964L563O336M300n182j2335p065M122J8267k0416
13502B8417J0270l019k459J5334K2868Q259j094l5123l3347m134j9655k1778k0028
13489e5489J9455J6358J9065N151K2251J7413k0919j4600p253r666k2445J2899
13477a7780K7814R557j3464J364K9869j7868l235k155j8482q389K5723K7437p150
13464C3241p462k5626k0188n26J5215k8221j0669P077Q78K6310L8200j1416M594
13451B1407p652J2357J0469j2275n650j544k1046L0032K9226m525K5916M614l4190
$$ plain form
13542 2545 -6965 -1092 5284 6802 5815 10084 -11082 -12832 3335 16726 3770 1008 28832 37966
13528 37966 30493 41601 68908 66892 54535 37242 11699 -3648 -13295 -13023 6037 11738 18319
13515 18319 13501 11465 27863 36827 40390 46726 51026 45844 33509 26444 30566 48833 28417
13502 28417 38687 35668 33209 48543 71411 79670 78576 43453 10106 5972 -13683 -35461 -55489
13489 -55489 -36034 -19676 -611 4540 26791 44204 23285 8685 1432 -8234 -30679 -17780
13477 -17780 10034 19591 6127 7491 37360 19492 16257 14102 -4380 -12769 12954 40391 33241
13464 33241 25779 153 -20035 -20561 -5346 -33567 -44236 -37159 -36281 -9971 28229 16813 21407
13451 21407 13755 26112 36581 24306 18656 17112 -3934 26098 55324 50799 76715 81329 47139
13438D7139l7512p964K5972O442r671k6328j3179m077j2621k900J2735j2637j3960
13425d8561J2393K2096P82J6141J502j6630l4889Q822j9849o085J1889K9802L4972
13412A2385J8838j170J6010K1008j7656k3268k5056q264j6811n187J1565O580
13400a1026J1928J5786q780J7585J6378n651J3112J3619L275r67l308j8190m642
13387C9119J4056l420j2075m525L017j7945j3727J5693J5845j4613K0970j6054
13375B6341k3786J095K1692J0110O367o149k5957O318J1856j7668j5030N128O051
13362F368J2142L758l616j6006r891j4210J7709J5024J8298J0150P737M975O439
13349E8877K498k5523k0457j8128p577j343P523m498o603K1633J0129J0987L051
$$ plain form
13438 47139 9627 1663 27635 34077 24406 -1922 -15101 -19178 -31799 -34699 -21964 -34601 -48561
13425 -48561 -36168 -14072 -13290 2851 4353 -12277 -47166 -38344 -58193 -64278 -52389 -22587 12385
13412 12385 31223 30053 46063 67071 49415 26147 1091 -7173 -23984 -29171 -17606 -11026
13400 -11026 902 16688 7908 25493 41871 36220 49332 62951 66226 65259 61951 43761 39119
13387 39119 53175 49755 37680 33155 36172 18227 4500 20193 36038 21425 42395 26341
13375 26341 2555 3650 25342 35452 41819 35670 9713 16031 27887 10219 -4811 317 6368
13362 6368 18510 22268 18652 2646 -7245 -21455 -3746 11278 29576 39726 47463 52438 58877
13349 58877 61375 35852 15395 -2733 -10310 -11653 -4130 -8628 -15231 6402 16531 27518 30569
13336C0569j7950j2576k5133L7921J8942k2050k6779j0267K848J5609J7108K4660
13324C2902l876k4999J9305j195j8537k3128M69J0005J7956K4735j01q25k23N795
13310C8283M98j4525Q515K2934k0385n0134j7612j6825L393j2750K4710P3794
13298C9896K8133k3478k5137lJ4126J6978O531l2021j0852K9245K2177L0346J3674
13285A09615j1600J7454L2377K3450M6680L7123M4649L2152O2474P0932M7387
13274E12693K7831r651J9377J06553J62432K20853K38036J87779J37917J40173
13264A743993L3419r1746j85465j75933j75485k07589k15628j53102j13229j06884
13254C52351p1426p567k306j4791q494k3017l3857k0131J7815j082J3567J0179
$$ plain form
13336 30569 12619 43 -25090 12831 31773 9723 -17056 -27323 -24475 -8866 8242 32902
13324 32902 29026 4027 23332 22137 3600 -19528 -19059 -9054 8902 33637 33536 32711 32488 38283
13310 38283 38781 24256 32771 55705 35320 -14814 -32426 -49251 -45858 -58608 -33898 39896
13298 39896 68029 44551 19414 19411 33537 50515 57046 25025 14173 43418 65595 95941 109615
13285 109615 98015 115469 147846 171296 217976 255099 299748 331900 394374 465306 512693
13274 512693 540524 530873 550250 656803 819235 1040088 1278124 1465903 1603820 1743993
13264 1743993 1777412 1685666 1500201 1324268 1148783 941194 725566 572464 459235 352351
13254 352351 280925 273358 271052 256261 247767 224750 190893 170762 188577 187495 201062 211241
13242B11241J6119Q591J2156K5037P946J5684m0231o7161j6174k6762j4909k5712
13230A05825O170j1247j2792r637j3718n811J0980K369l0796N237K255p56K288
13217E0367l7354j0317Q685M6823K0496j0517Q20n176O745j6832j539L2420K7375
13204A11996k2759m443K5004K2981L475M3644M2148J9094Q8038J79875K42890
13193G51943K22184P2274j04965j98842k13312j51825p9604l4229l4720m863j3213
13182B10828j2293j3541r341J4382k6683j9178J897Jm775l5708j4977K109J9386
13169A12107l3486r963K6056J6520l542r101M368M5727K4940J4410o304K6728
13157B08460M8278O0531L2351J06407J60003J77254K87153M69140O77580P01487
$$ plain form
13242 211241 227360 235951 248107 273144 281090 296774 256543 189382 173208 146446 131537 105825
13230 105825 111995 100748 87956 78319 64601 58790 69770 72139 41343 46580 48835 48079 50367
13217 50367 13013 2696 11381 58204 78700 68183 69003 63827 70572 53740 52201 84621 111996
13204 111996 89237 84794 109798 132779 136254 179898 222046 241140 329178 509053 751943
13193 751943 974127 1046401 941436 742594 529282 377457 297853 263624 228904 224041 210828
13182 210828 198535 184994 175653 190035 163352 144174 146071 146072 141297 105589 90612 92721 112107
13169 112107 78621 68658 94714 111234 107692 98591 102959 148686 173626 188036 181732 208460
13157 208460 256738 317269 349620 456027 616030 793284 1080437 1549577 2227157 2928644
13147B928644L60471k48363o80988o99275n13391l26498j87408j02118n3671m3829
13137D33574n6440l5781n4342k0126k2985k4324j6252q798J1671j5212n0524j3675
13125A26786L2141O195K903J1745k4394n488J3451K7178l16j063L1021J6632R414
13112B46205N7109O4821M3761P5911J16783J53814K50239M24379O62852P52524
13102B848398N16311n5143n96356p38397n62556l20661k32365j49033q9149m9620
13092E71429n0200n8715n6409m9193m5357j8549p438j5111k151m1069k5053O623
13080B08807l3463k7412j2214L604L0213k5018l7940j77N599M35l0271r149Q534
13067H1548K5423J5598L3524L2115K3647K5793P9710J46556K22439K21223J86209
$$ plain form
13147 2928644 3289115 3040752 2359764 1660489 1147098 820600 633192 531074 477403 433574
13137 433574 377134 341353 287011 266885 243900 219576 203324 194526 206197 190985 140461 126786
13125 126786 158927 165122 168025 179770 155376 149888 163339 190517 190201 189138 220159 236791 246205
13112 246205 303314 368135 411896 487807 604590 758404 1008643 1433022 2095874 2848398
13102 2848398 3364709 3309566 2713210 1974813 1412257 1091596 859231 710198 621049 571429
13092 571429 521229 462514 406105 356912 311555 293006 285568 270457 268306 227237 202184 208807
13080 208807 175344 147932 135718 139322 169535 144517 106577 106400 111999 112434 82163 73014 81548
13067 81548 106971 122569 156093 188208 211855 237648 317358 463914 686353 907576 1093785
13056A093785K4509j53860k32294j85439j29804r5729q9990n6407n6957j3048
13046A04766K0918L56J5934M963m6039Q609P430K0317j548j7068k8908J748O845
13033I8323J1756m999J5377M032n336k871j606l158K841j5143o743J3616k935
13020A03154J2839L3119L753M6098L822l6707J2772N849l231R281K4656k418m7284
13007A65703j4638J1531l0220m2278J239N913j755j736M614j5217N466k2277j1647
12994E4698J1096R113J3858J6051J4589J7683K0411j6648M399N463q540J9561
12982A61734L0496j293K6504m836j0982p311K741L5790K8184P765L1234K0575
12970C20601K6632N183R568J0889K6869p604l5619k8198l0648n2647o3801k5155
$$ plain form
13056 1093785 1118294 964434 732140 546701 416897 321168 231178 174771 117814 104766
13046 104766 125684 126040 141974 146937 100898 109507 116937 137254 135706 118638 89730 91478 98323
13033 98323 110079 105080 120457 124489 119153 116282 114676 111518 114359 99216 92473 106089 103154
13020 103154 115993 149112 152865 198963 202785 166078 178850 184699 181468 190749 215405 212987 165703
13007 165703 151065 162596 132376 90098 91337 97250 95495 93759 98373 83156 88622 66345 54698
12994 54698 65794 74907 88765 104816 119405 137088 157499 140851 145250 150713 142173 161734
12982 161734 192230 190937 217441 212605 201623 194312 197053 232843 261027 268792 300026 320601
12970 320601 347233 352416 361984 372873 399742 392138 356519 328321 297673 245026 181225 156070
12958A56070K4648J6362K6488n308n596r018l0581k6477K4136K439N943J9226
12946A98332L1743K4736M374J0828K4531k2124n771j0086j0290L8760k8197k0240
12934B36596K5970K5119J4527o598r201L0579N8466J7048j9935k5998k0466l295
12922C22812K1459J3386K1826M0736N4646k3614J2198J8985J8109k0L9423O6404
12910F06350L6023J3641j6052k3265J0393K7861K3804L2507K8440J2353M962M5877
12898H02894K0529L5239K2986M2510N9397L3032O1925Q5204O3806Q5529R078O8045
12886A390174R2072N9459P2204J03456P7259N8735J23211R8233R0488J08988J09274
12875B383553J51852J78235J86230K03644K33674K88291L33549L60506L96205
$$ plain form
12958 156070 180718 197080 223568 218260 212664 203646 173065 146588 170724 173163 179106 198332
12946 198332 230075 254811 259185 270013 294544 272420 266649 256563 246273 285033 256836 236596
12934 236596 262566 287685 302212 295614 286413 316992 375458 392506 372571 346573 326107 322812
12922 322812 344271 357657 379483 420219 474865 451251 463449 482434 500543 500523 539946 606350
12910 606350 642373 656014 639962 616697 627090 654951 678755 711262 739702 752055 757017 802894
12898 802894 823423 858662 881648 924158 983555 1016587 1078512 1163716 1227522 1313051 1322129 1390174
12886 1390174 1482246 1541705 1613909 1717365 1794624 1853359 1976570 2074803 2165291 2274279 2383553
12875 2383553 2535405 2713640 2899870 3103514 3337188 3625479 3959028 4319534 4715739
12866D715739M57413M90182M93976N64698O42494Q30686J105671J363805J584557
12857A2249221J771420J974127K219239K458030K654610K993188L686740M928176
12849C4934751O817518R683677J4291508K1813823L2935204M5038133M8839290
12842B14353904M0610770L3954656L0207926J0342643j8413092l0628845k9859396
12835B50568566l5058171m4353312m3499608l2953567k2044793j4504313r745402
12828D8409400o768764m940622l896683l201446k777993k587736k442450k221313
12820A9572393k154263k044208j792390j467395j207338j011651q43782o69930
12812H381436n74226m95136m13988l29392l22320l35862k55668k31359k48520
$$ plain form
12866 4715739 5173152 5663334 6157310 6722008 7364502 8195188 9300859 10664664 12249221
12857 12249221 14020641 15994768 18214007 20672037 23326647 26319835 30006575 34934751
12849 34934751 41752269 51435946 65727454 87541277 120476481 165514614 214353904
12842 214353904 254964674 288919330 319127256 329469899 311056807 280427962 250568566
12835 250568566 215510395 171157083 127657475 94703908 72659115 58154802 48409400
12828 48409400 41640636 36700014 32803331 29601885 26823892 24236156 21793706 19572393
12820 19572393 17418130 15373922 13581532 12114137 10906799 9895148 9051366 8381436
12812 8381436 7807210 7312074 6898086 6568694 6246374 5910512 5654844 5423485 5174965
12803E174965k20836k04237j72196j46066j93763j68374j78064j84535j80637
12794C526257k00305j90205j65917j80855j17417p0107r3718q8756q0806o7329
12784B270842p5128o6074j0923k5362k3297q585K8618L2998O1570Q0067R9693
12773B364419J11214J25240J42098J78422J81186K84616M30747N98604Q64216
12764E280762J193920J502609J653852J627010J496774J282541Q18783J43639
12756A4999890n94258j094467j386378j569788j646728j586529j349130j047968
12748D724644p53616n19705l96089k93239k36240j98589j86693j50861j58850
12739A830762j71912j22363r3980j18338j27660j10622n2806k7547k1602p0424
$$ plain form
12803 5174965 4954129 4749892 4577696 4431630 4237867 4069493 3891429 3706894 3526257
12794 3526257 3325952 3135747 2969830 2788975 2671558 2601451 2507733 2418977 2338171 2270842
12784 2270842 2195714 2129640 2118717 2093355 2070058 2061473 2090091 2123089 2184659 2264726 2364419
12773 2364419 2475633 2600873 2742971 2921393 3102579 3387195 3817942 4416546 5280762
12764 5280762 6474682 7977291 9631143 11258153 12754927 14037468 14856251 14999890
12756 14999890 14405632 13311165 11924787 10354999 8708271 7121742 5772612 4724644
12748 4724644 3971028 3451323 3055234 2761995 2525755 2327166 2140473 1989612 1830762
12739 1830762 1658850 1536487 1442507 1324169 1196509 1085887 1033081 1005534 983932 913508
12729I13508m3448k7454q380K7979j1021p704l4726q338J3173j5570j376R83k2596
12716G75030m0548n3921l7386n2378o0616o4550m8113m0866O018q936j6309j8366
12704C39059P072O539k2504j705L7513M645j6832n593O71j2985j1835K183J340
12691C27568J1012K3445L757j1900j8228q487n769o469J3090J241j4912l3436
12679B80912k3144J4574n693r381k1390p788Q51j8756r681j615k4494j9125J1471
12666A66741J7667l878n909k0620M001k426k1041q608J4837K6959j9624p29J4711
12653A62081K288P19N689j0867k720J2204K152j883k626M443J5164J5240r698
12640A92186J807O463R24j9001K1425J1259j2474L039k921k2612L455j565R975
$$ plain form
12729 913508 870060 842606 834226 862205 851184 843480 808754 800416 813589 798019 796643 797626 775030
12716 775030 734482 680561 643175 590797 530181 465631 417518 376652 382670 373734 357425 339059
12704 339059 346131 352670 330166 328461 365974 370619 353787 348194 348865 335880 324045 326228 327568
12691 327568 338580 362025 365782 353882 335654 327167 321398 314929 328019 329260 314348 280912
12679 280912 257768 272342 266649 257268 235878 228090 228941 210185 200504 198889 174395 155270 166741
12666 166741 184408 180530 174621 154001 158002 155576 134535 125927 140764 167723 148099 147370 162081
12653 162081 164369 165088 170777 159910 157190 169394 171546 169663 167037 171480 186644 201884 192186
12640 192186 193993 200456 201380 182379 203804 215063 202589 205628 202707 180095 183550 181985 191960
12627A91960k3084J8732o116m9359j2008k2175K708K2277K1852K7499K9559l467
12615A98378n003l0348k8658J2919L4513J6030l7520k1500j3265l4942j7063L417
12603G6958N401j9212J5635L798j8667k929J2555N939J8485R53J3583O981K6903
12590A46383M5225O514k2307Q296j4567p651n649l9524o140J4114k7424m604n271
12577H7395k4157p28J1052m622l927J9247K9819l512r849r835J1813J6501j6066
12564A03131j2643k0735J4274J8275K3704J0228j8172k5898j3581J0629l9664
12553D9548j9062O102K9765J5317J1343j52P217m796o431J5955k72j8990k5460
12540F0084q08j774J4520J4756L546j5993l67L383O684k0844j98L7839K6223k8184
$$ plain form
12627 191960 168876 187608 181492 132133 120125 97950 100658 122935 144787 172286 201845 198378
12615 198378 193375 163027 134369 147288 181801 197831 160311 138811 125546 90604 73541 76958
12603 76958 82359 63147 78782 82580 63913 60984 73539 79478 97963 98916 112499 119480 146383
12590 146383 191608 198122 175815 184111 169544 161893 156244 116720 110580 124694 97270 92666 87395
12577 87395 63238 62510 73562 68940 65013 84260 114079 110567 100718 90883 102696 119197 103131
12564 103131 90488 69753 84027 102302 126006 136234 118062 92164 78583 89212 49548
12553 49548 30486 36588 66353 81670 93013 92861 100078 95282 88851 104806 104534 85544 60084
12540 60084 59276 57502 72022 86778 90324 74331 73964 77347 84031 63187 62989 100828 127051 98867
12526I8867l2082j8042N352K292k0291Q652L7941K7808O505n3591l6791J6162
12514D2782K8250k911j0868n886o696l448L8932K5408J0079l522n3991k8873j6814
12501A2442J8007J1857J8985J2518j8168k3928M903L4148n981l0574J0692N663
12489E0564L7008L425j3740J7398j0411P783M907m700m0279Q721K4167Q067m4770
12476D8140k4749n559P321J480r179l0216K1909J0954K7064M6871K7662j4362
12464A07336o016r432J0588j3649j206k7156l1216Q89J9251K6176K5457M021K3928
12451A28971k0156k9160n123K1128J5703l400l2635m3633j3209J1487K6928J7922
12439G4823j3854j0498L52M509L6800m665Q53j105K7787J478k3010l9889J4231
$$ plain form
12526 98867 66785 48743 54095 56387 36096 44748 82689 110497 117002 63411 26620 42782
12514 42782 71032 68121 57253 51367 44671 41223 80155 105563 115642 112120 58129 29256 12442
12501 12442 30449 42306 61291 73809 55641 31713 36616 70764 64783 34209 44901 50564
12489 50564 87572 90997 77257 94655 84244 92027 96934 92234 51955 60676 84843 92910 48140
12476 48140 23391 17832 25153 26633 17454 -12762 9147 20101 47165 94036 121698 107336
12464 107336 101320 91888 102476 88827 87621 60465 29249 30138 49389 75565 101022 105043 128971
12451 128971 108815 79655 74532 95660 111363 107963 75328 31695 18486 29973 56901 74823
12439 74823 60969 50471 50823 55332 92132 87467 88320 87215 115002 116480 93470 53581 67812
12426F7812J1335J3326J1741J9324Q710K1721R0M0762L7289N1211O8696J36954
12414D88971J45486K04497K68765K52448K02745J57839N6865n1135j29055j40091
12404A457335j76749k17454k54562k12925j13764m3802l5495n1692l9309n9140
12394B52443m2913K920l533k9222n016k753k4394k0831j6748M2593K4023k0263
12382A56306m1114k0661j4900M971j9012r312K3502R659j4732j2122j8595Q940
12370E2930j5282O805q901k4122J9788j1010J5579L0072K2322k8374k2532R554
12358D6829L8599J1696r832k895k1857l1744j0712K23k286K545K8748J297k9965
12345B0646O58L7105o42j2401R912k2355K9785m711r488J0291j889r213m365K9650
$$ plain form
12426 67812 79147 92473 104214 123538 132248 153969 154059 194821 232110 283321 352017 488971
12414 488971 634457 838954 1107719 1360167 1562912 1720751 1777616 1726481 1597426 1457335
12404 1457335 1280586 1063132 808570 595645 481881 438079 402584 350892 311583 252443
12394 252443 209530 212450 208917 179695 174679 171926 147532 126701 109953 152546 176569 156306
12382 156306 115192 94531 79631 84602 65590 56278 79780 89439 74707 62585 43990 52930
12370 52930 37648 44453 35552 11430 31218 20208 35787 65859 88181 59807 37275 46829
12358 46829 85428 97124 87292 84397 62540 30796 20084 20307 18021 20566 49314 50611 20646
12345 20646 21304 58409 57767 45366 55278 32923 62708 57997 48509 58800 56911 47698 43333 72983
12331G2983J9891j5805J7119M463q33o055J6284M607j4139q500q986k427j9377
12318E9225j5586n709M283J6998J6452k3203j250K361m043J8254j4261k5013K595
12305C1103j3146L677L1458K6702j9682k0582j1111L4442j2507p650J7602K5346
12293H5652J3539j9529m0881m3594k552L976J5229K1451K3909J4201r865j4258
12281D7278k4634o860K0382o647K829M0867j2155k3454j3261M403P147L996M748
12268D4639q688k8671J3500J9088j7994j1651m8373j5938J9240M6748K7880k2462
12256A7318k078N654K830N080R367k282k0593Q9o622J1728K821K2828p622l4375
12242D143k2531K7041J1296O716j6804p918K5277j7050j8223K7859J3698q030
$$ plain form
12331 72983 92874 77069 94188 98651 97818 91763 108047 112654 98515 90015 81029 78602 59225
12318 59225 43639 37930 42213 59211 75663 52460 51210 53571 49528 67782 53521 28508 31103
12305 31103 17957 21634 53092 79794 60112 39530 28419 62861 50354 42704 60306 85652
12293 85652 99191 79662 38781 -4813 -7365 -3389 11840 33291 57200 71401 61536 47278
12281 47278 22644 15784 36166 29519 32348 73215 61060 37606 24345 28748 35895 39891 44639
12268 44639 35951 7280 20780 39868 21874 10223 -38150 -54088 -34848 11900 39780 17318
12256 17318 15240 20894 23724 28804 38171 35889 15296 15385 8763 20491 23312 46140 38518 4143
12242 4143 -18388 8653 19949 26665 9861 1943 27220 10170 -8053 19806 33504 25474
12230B5474l775p742j9578Q575R418k4313K0l29K524j953j6289J4019J7655J8508
12216B2214q178k1384J3573N36l165J5809n24j2639J8166L5685O126l2214k3528
12203A0477M151j0134q183J2954m109l4888K1476Q252k136k556J1622O386j6626
12190c314l407K3059L8859J0416l3623j7515n915N863m868k1247N377J4763L656
12177A2104J4212K981M848l107k8473k254M591N06J1775J6913J404K211K2316
12164F0027R064R256k2433k3162J2858K3894q622k3486j6009j8328o536o887J8853
12151H489o399J6904j746m8364P953L1875J3591J4942J7305L330o613j1009J1481
12138E1739j13P23j7666R338J1969P901n178j3482q086P935p046k2408j1807K867
$$ plain form
12230 25474 21699 13957 -5621 2954 12372 -11941 -11921 -12250 -9726 -11679 -27968 -13949 3706 22214
12216 22214 14036 -7348 6225 6761 3596 19405 18881 6242 24408 60093 66219 34005 10477
12203 10477 14628 4494 -3689 9265 5156 -29732 -8256 -4 -2140 -4696 6926 13312 -3314
12190 -3314 -6721 16338 55197 65613 31990 14475 8560 14423 9555 -11692 -6315 8448 12104
12177 12104 26316 29297 34145 31038 2565 311 4902 5408 17183 34096 35500 37711 60027
12164 60027 69091 78347 55914 32752 45610 69504 60882 37396 21387 3059 -3477 -10364 8489
12151 8489 2090 18994 17248 -31116 -23163 8712 22303 37245 54550 57880 51267 40258 51739
12138 51739 51626 52349 34683 44021 55990 63891 58713 45231 37145 45080 38034 15626 3819 6686
12124F686O428N54L817K730K1003l611l013Q956j3328K2111J8688R14k1637k8101
12110B2197J0436L6921n082j0513j0210l3165O587K6062q393n1613q158K7525
12098B594L0130p148J572j8186m559k1262j0445R328J7302J5837q190j7230k5068
12085c5325o305J9038N85q625R3L7477J2084j0940K0262j1982k7594J278j2789
12072b2743K2810J6315K627j2866J3569K8609j3779j1556K678K981j5305L91J0236
12059B3967K589L291m682r106L2378J8953k0069r745J1095J667n474m778j1898
12046B8188k3126p213j0717j6560o376Q869J9079q771J4169Q653j3148p34P304
12033c83K4490l76k2941l6153j4543k3267k2041M4711K8888J3719l035M735K9459
$$ plain form
12124 6686 13114 13668 17485 20215 41218 37607 34594 43550 30222 52333 71021 71935 50298 22197
12110 22197 32633 69554 64472 53959 43749 10584 17171 43233 34840 -16773 -24931 2594
12098 2594 32724 25576 27148 8962 4403 -16859 -27304 -17976 -674 15163 6973 -10257 -35325
12085 -35325 -41630 -22592 -22007 -30632 -30539 6938 19022 8082 28344 16362 -11232 -9954 -22743
12072 -22743 67 16382 19009 6143 19712 48321 34542 22986 25664 28645 13340 13731 23967
12059 23967 26556 29847 25165 16059 48437 67390 47321 37576 48671 50338 44864 40086 28188
12046 28188 5062 -2151 -12868 -29428 -35804 -26935 -7856 -16627 -2458 6195 -6953 -7687 -383
12033 -383 24107 23731 790 -35363 -49906 -73173 -95214 -50503 -21615 -7896 -10931 -6196 23263
12020B3263K3720j6177J4579l217j2186j5080j6751j3538Q299K4246r725j252
12008F181r852K4487M3686M605j4532l2535N07j6969Q195J5280j5275r762K546
11995F562j0683o404m817o421J7767J2324J7147j545k3066r765P533j7595j0526
11982b9489n128j2088J633Q934L936Q727m179L081P506J3288J8762J3399J586
11969B9968r874p643L131k312l0854J8010J6950K7802J2252l4705j4619J156j562
11956G700j7011k4853R664Q733J253p974k430L4504J1157j7804m1729o301J5526
11943b9565K0161J0213J3583K371j8227k7702j9537j4849O647J2985J6544j1087
11931c8463K3096J3819J7390j753j4576M825O860L5213k3139l8213J455j4068
$$ plain form
12020 23263 46983 30806 45385 42168 29982 14902 -1849 -15387 -7088 17158 7433 6181
12008 6181 -3671 20816 64502 69107 54575 22040 22547 5578 13773 29053 13778 4016 6562
11995 6562 -4121 -10525 -15342 -21763 -3996 8328 25475 23930 864 -8901 -1368 -18963 -29489
11982 -29489 -34617 -46705 -45072 -36138 -32202 -23475 -27654 -24573 -17067 -3779 14983 28382 29968
11969 29968 20094 12451 15582 13270 -17584 426 17376 45178 57430 22725 8106 9262 7700
11956 7700 -9311 -34164 -24500 -15767 -14514 -22488 -24918 9586 20743 2939 -38790 -45091 -29565
11943 -29565 -9404 809 14392 16763 -1464 -29166 -48703 -63552 -56905 -43920 -27376 -38463
11931 -38463 -15367 -1548 15842 14089 -487 4338 11198 46411 23272 -14941 -13486 -27554
11919b7554r1J5736O807Q338k302m445n058K72k0217j8351J1526J2253J4750L7018
11905B8682J8544j1156r748J2558K083k2721j1416r40J8084K9818J5573n32j9778
11892D9051l8235L386J2971J931l0667m6706j4682K4527J4978K7990N839j1600
11880a217J5293K1528K190l554n72J3911j7015l6960N88J6323P093J4466l699
11867B8375j5495J3191J5085j2261n124K265j1259j1733q46P77J7351o389n490
11854H447J5293K13l9559j499J5402l0633j9221R526J0699k389J689L3211k3454
11841b2275l1953K8608l740J5696M2847p458k4931K0227m157j8528L992k7160
11829b8832l068m715p050j361j606L195L3995K6165L754l644m6895J507J4197
$$ plain form
11919 -27554 -27645 -11909 -5102 3236 934 -3511 -8569 -8297 -28514 -46865 -35339 -23086 -8336 28682
11905 28682 47226 36070 26322 38880 40963 18242 6826 5886 23970 53788 69361 68829 49051
11892 49051 10816 14202 27173 29104 -1563 -48269 -62951 -38424 -23446 4544 10383 -1217
11880 -1217 14076 35604 37794 34240 33668 47579 30564 -6396 -5808 10515 17608 32074 28375
11867 28375 12880 26071 41156 28895 23771 26036 14777 3044 2198 2975 20326 13937 8447
11854 8447 23740 23953 -15606 -17105 -1703 -32336 -51557 -42031 -31332 -33721 -32032 1179 -22275
11841 -22275 -54228 -25620 -29360 -13664 29183 21725 -3206 17021 12864 -5664 -1672 -28832
11829 -28832 -31900 -36615 -43665 -45026 -46632 -43437 -9442 16723 20477 16833 -30062 -28555 -14358
11816a4358m719k4259m855n98R827J7102J1485m614J4665o142j6306J1600J9244
11803H072m427J5965o784j9506M75l300r230Q753P820L753r128l5786r951K0612
11789c2662r416j6818J4172J131J5509K3923J6540j7492J8919O909q398m76K750
11776A4591o260N248r751M696o70M560K7923j2061j1963j2526m1770o602L5978
11763h607J7336r47k904N364q744n300l0226j0655K7962K5424R817j7258j1434
11750a0172o747K5516q204j0937l7749N581K2504K9144k687k2935Q27K8521n688
11737F974j2094N114K8104m845O622p112j2838Q52k150j0386K901M216R259K8
11723A4645l790j3540l719K5276j487j4896k9908O916P133n309j1549K3599j0501
$$ plain form
11816 -14358 -19077 -43336 -48191 -48789 -38962 -21860 -10375 -14989 -324 -6466 -22772 -11172 8072
11803 8072 3645 19610 12826 -6680 -6205 -9505 -18735 -9982 -2162 1591 -7537 -43323 -53274 -32662
11789 -32662 -42078 -58896 -44724 -43593 -28084 -4161 12379 -5113 13806 20715 12317 11841 14591
11776 14591 8331 13579 3828 8524 7854 12414 40337 28276 16313 3787 -37983 -44585 -8607
11763 -8607 8729 7782 4878 10242 1498 -3802 -34028 -44683 -16721 8703 18520 1262 -10172
11750 -10172 -16919 8597 393 -10544 -48293 -42712 -20208 8936 6249 -16686 -15859 12662 6974
11737 6974 -5120 -6 28098 23253 29875 22763 9925 10777 8627 -1759 1142 5358 14617 14645
11723 14645 10855 -2685 -6404 18872 17385 2489 -27419 -20503 -13370 -18679 -30228 -6629 -17130
11710a7130l348J4687K6235J3097j709n4185m277M8405m369P045l478k5432J426
11697c033m986K784R210j6582j8831l0869K1778K4735J330j6761j317J1674R20
11684a9948j7611K3557k4104J464j129p743J8425p077K0253m84o028j5878M446
11671c1857K6641K5306k859m8495r290j4832Q058J5916m555J993O648J7990J509
11658g827J6364K8386O422o758k8634Q21j674l0368j3868J1818n142l453K628
11645c1285L0151l780j5098k2083j1972K7053K1844j3088Q98J959J5450J0498
11633A0547k2258j515j2931q498j0991J2393M113Q096J5296J274j5925K771J6223
11620a405j2327Q239P612L3968N895n7067l1674j0837J1700J0432K2807K0836
$$ plain form
11710 -17130 -20478 -5791 20444 33541 31832 -22353 -26630 21775 17406 24451 20973 -4459 -3033
11697 -3033 -8019 -5235 3975 -12607 -31438 -62307 -40529 -15794 -14464 -31225 -32542 -20868 -19948
11684 -19948 -37559 -14002 -38106 -36642 -37771 -45514 -27089 -34166 -13913 -14397 -20425 -36303 -31857
11671 -31857 -5216 20090 17231 -31264 -40554 -55386 -47328 -31412 -35967 -33974 -27326 -9336 -7827
11658 -7827 8537 36923 43345 36587 7953 8774 7100 -23268 -37136 -25318 -30460 -33913 -31285
11645 -31285 -1134 -4914 -20012 -42095 -54067 -27014 -5170 -18258 -17360 -15401 49 10547
11633 10547 -11711 -13226 -26157 -34655 -45646 -33253 -29140 -21044 -5748 -4474 -20399 -17628 -1405
11620 -1405 -13732 -5493 2119 36087 41982 -15085 -46759 -57596 -45896 -35464 -12657 8179
11608H179J1643l4682n421j3805j8742J7637J0692J7488k980P400j6353p362J4916
11595a1390Q148l880j4191O289K5809J2767j2839j4408o673K241r85M0j4597q963
11581c2632J7673M641N165O714n635M602k799j1774j189K7368Q008r459k5552
11568a4869l800k2721j8696j586L0443J5134J9737O368j0044R607k4206l5448
11556e0081k4408N926J7657J0300J0511J8632O921k826o266j6314J3839R986R937
11543C814P206k0834l80J3879Q119j2982m307O177J102J3192P920j8581m848k406
11529b929k754J08K2785P253k1039k3614j707O872J9171J0998J8357K4212m8698
11516I015m2957n174J2987K7907J8346j3155j7578m882JO409L01j7583j6445J3623
$$ plain form
11608 8179 19822 -14860 -20281 -34086 -52828 -35191 -24499 -7011 -9991 -2591 -18944 -26306 -11390
11595 -11390 -3242 -7122 -21313 -15024 10785 23552 10713 -3695 -10368 -8127 -9112 -9072 -23669 -32632
11581 -32632 -14959 -10318 -5153 1561 -4074 528 -2271 -14045 -15234 12134 20142 10683 -14869
11568 -14869 -18669 -41390 -60086 -61672 -31229 -16095 3642 10010 -34 9573 -14633 -50081
11556 -50081 -74489 -68563 -50906 -40606 -30095 -11463 -4542 -7368 -13634 -29948 -16109 -6123 3814
11543 3814 11020 -9814 -10194 3685 11804 -1178 -5485 692 1794 14986 22906 4325 -523 -2929
11529 -2929 -5683 -5575 17210 24463 3424 -20190 -21897 -15025 4146 15144 33501 57713 9015
11516 9015 -33942 -39116 -26129 1778 20124 6969 -10609 -15491 -15490 -9081 -8780 -26363 -42808 -29185
11502b9185l524p001R877J6367J482p53k747q036k0559K1329K3968p931k8264
11489c4977m800K1067K9095R267m577j0116k1749j5692k743p712R267J4213j333
11476b0790J5287k08l6973J0510K0849r24j3793K3087J2152j9405N788q184l3319
11463d5923k2772K8278K9500k3887l1347J0617K096K8699K6483K384k681k5717
11451b4270k0808J6698O865k743O756k286l987j7171j3588L3125J1232q840J5865
11438c152J2700l5215j4725J2604K8468M716j4885j6245K500O953J1536Q774j2080
11425h051J1397p583J055j8453l4692K559M9581L3387J708k505J0867K246j4563
11412B6953j2390j3648K186n496j484K0259K3454J395l0911p147K5726j9291k2178
$$ plain form
11502 -29185 -32709 -39710 -29833 -13466 -11984 -12737 -15484 -23520 -44079 -22750 1218 -6713 -34977
11489 -34977 -39777 -18710 10385 19652 15075 4959 -16790 -32482 -35225 -42937 -33670 -19457 -20790
11476 -20790 -5503 -5711 -42684 -32174 -11325 -12249 -26042 -2955 9197 -10208 -4420 -12604 -45923
11463 -45923 -68695 -40417 -10917 -34804 -66151 -55534 -53438 -24739 1744 4128 1447 -24270
11451 -24270 -45078 -28380 -21515 -24258 -17502 -19788 -23775 -40946 -54534 -21409 -10177 -19017 -3152
11438 -3152 9548 -25667 -40392 -27788 680 5396 -9489 -25734 -23234 -16281 -4745 4029 -8051
11425 -8051 3346 -4237 -3182 -21635 -56327 -53768 -4187 29200 30908 28403 39270 41516 26953
11412 26953 14563 915 3101 -2395 -3879 16380 39834 41229 10318 3171 28897 9606 -12572
11399a2572J4576j2458R400J605k181O141q900j9683n549L0306J2777l0918K0983
11386C527J2410J325l0021r647j5K664p918J3584J4500j4315J953j444k2807n797
11372d2001J5723J8134L1911O491m263n242k188k8519j897J2658J1410j8920K097
11359d606J4032j0478j3328K5864P037j5151k338J6330j1312k20J0578O417j1453
11346A1372K660J8919J6998j4299j6157j8648k7798n05K8566J6886n74j3218P543
11333A1745L806j3749j1740J025n965M789N043r917j2811l99P567K7768J9318
11320B6480O86k1801K703Q652L630J636q023n695o872n0842j4296p032L6J7210
11306e3528K9210j6103k34L5108J739l0012k6842J8829K9031J1520q136k2500
$$ plain form
11399 -12572 2004 -10454 -1054 551 -1630 4511 -4389 -24072 -29621 685 13462 -17456 3527
11386 3527 15937 17262 -12759 -22406 -22421 -19757 -27675 -14091 409 -13906 -11953 -13397 -36204 -42001
11372 -42001 -26278 -8144 23767 30258 25995 20753 18565 -9954 -11851 807 12217 -6703 -4606
11359 -4606 9426 -1052 -14380 11484 18521 3370 1032 17362 6050 5830 16408 22825 11372
11346 11372 14032 32951 49949 35650 19493 845 -26953 -27458 1108 17994 17420 4202 11745
11333 11745 15551 1802 -9938 -8913 -14878 -10089 -5046 -14963 -27774 -28173 -20606 7162 26480
11320 26480 27166 5365 8068 16720 20350 21986 13963 8268 1396 -49446 -63742 -70774 -70738 -53528
11306 -53528 -24318 -40421 -40655 -5547 -3808 -33820 -60662 -41833 -12802 -1282 -9418 -31918
11294c1918J5964j8088J271Q283l092o469j2616k8196K3910N3264j1108j5959
11282b4754J8100J026p599J4748k1262l84K8897J437r767J3895J446J4517j3715
11269A6585j4218K2016J577j217j6797j123J4081J6930k057j0127R583O152M219
11256D5604l922j5321p689j569k7570o396k109j2076J863j672J9544K8283J6418
11243C3388K0956j7419o701o591k4963o105J3543j4945J8815L812j0855r048O355
11230B42K872J3430J4762j0097j4868j9253j3129K4507P173R316j5012n853n175
11217a1085J5099M452k510L2177P447l0732M89n927k1119j29k2621k289j6917
11204e3665r512J2176P597j700j114p149L833K4138j0363J3024J4756k6510J3307
$$ plain form
11294 -31918 -15954 -34042 -32771 -24488 -27580 -34049 -46665 -74861 -50951 2313 -8795 -24754
11282 -24754 -6654 -5628 -13227 1521 -19741 -20125 8772 10209 442 14337 15783 30300 16585
11269 16585 2367 24383 25960 24743 7946 6823 20904 37834 35777 25650 35233 41385 45604
11256 45604 41682 26361 18672 17103 -10467 -16863 -18972 -31048 -29185 -30857 -11313 16970 33388
11243 33388 54344 36925 30224 23633 -1330 -7435 6108 -8837 9978 13790 2935 -6113 242
11230 242 3114 16544 31306 21209 6341 -12912 -26041 -1534 5639 14955 -57 -5910 -11085
11217 -11085 4014 8466 5956 38133 45580 14848 15337 9410 -11709 -11838 -34459 -36748 -53665
11204 -53665 -63177 -51001 -43404 -45104 -46218 -53367 -49534 -25396 -35759 -22735 -7979 -34489 -21182
11191b1182j2965r223n70m212J3982J0228Q551q336k6411J30R859L424j307q423
11177d6455j331J6717M069K1120O563P944J4534j1439m740J5504n93J4630o691
11164B9832k6033O212Q115o974m377k520o329j7741k8398R360J9984J5451P412
11151C994J0085k0404q695L6447J6473J2055j4655j4394j3761j2640L628J4886
11139A3019m181j1202j2868K087l195j9338M256j1998m440J9284K8144m803l9914
11126d5149o634K3376L2177K2929n165k837K643K11q672k6567p697j1873j9707
11113e2965N071J3374P407K0076J2917K389k773j1192j730j7420O151j2967K4518
11100g144K792J2967l561k7902j620J7106q062R944K7462Q350o6521k3644L8758
$$ plain form
11191 -21182 -34147 -43370 -43940 -48152 -34170 -23942 -15391 -23727 -50138 -50008 -40149 -36725 -38032 -46455
11177 -46455 -47786 -31069 -27000 -5880 683 8627 23161 11722 6982 22486 21893 36523 29832
11164 29832 3799 10011 18126 11152 6775 4255 -2074 -19815 -48213 -38853 -18869 -3418 3994
11151 3994 14079 -6325 -15020 21427 37900 49955 35300 20906 7145 -5495 -1867 13019
11139 13019 8838 -2364 -15232 -13145 -16340 -35678 -31422 -43420 -47860 -28576 -432 -5235 -45149
11126 -45149 -51783 -28407 3770 26699 21534 18697 21340 21551 12879 -13688 -21385 -33258 -52965
11113 -52965 -47894 -34520 -27113 -7037 5880 8269 5496 -5696 -7426 -24846 -18695 -31662 -7144
11100 -7144 -4352 8615 5054 -22848 -24468 -7362 -15424 -5480 21982 30332 -36189 -59833 -21075
11087b1075K3067j894P487o505j4301j4111j7442o306J3888L3005L1648n577j1429
11074A0455q360l7373j9701l2080P219L7476J7011m747K8242L6105k324j6459
11062A5464j1795k125j7573l1541O521j3862J5557L2647j539o702o142m575J3058
11049a2607K5290K683K2124l319j7999l2531r389j6591L861k724Q711K7741J5484
11036A0734j4226j2434J6951q996J7537K8946K653j2874k4341j8318j808J0535
11024e641K4546J0054J2267k8322l2278P194Q243k2486o457J2416J694O589p793
11011a9974q40J3306l0485J695J2735L919k0420l8014L64J7781J8845M3855J7258
10998B0025j0126j9595L4941j2160m675r002K5866K7575j2885j6917P513p892
$$ plain form
11087 -21075 1992 98 7585 1080 -13221 -27332 -44774 -51080 -37192 -4187 27461 21884 10455
11074 10455 2095 -35278 -54979 -87059 -79840 -42364 -25353 -30100 -1858 34247 31923 15464
11062 15464 3669 1544 -16029 -47570 -41049 -54911 -39354 -6707 -8246 -14948 -21090 -25665 -12607
11049 -12607 12683 15366 37490 34171 16172 -16359 -25748 -42339 -38478 -41202 -32491 -4750 10734
11036 10734 -3492 -15926 1025 -7971 9566 38512 41165 28291 3950 -14368 -16176 -5641
11024 -5641 18905 28959 41226 12904 -19374 -12180 -3937 -26423 -32880 -20464 -18770 -12181 -19974
11011 -19974 -20814 -7508 -37993 -36298 -23563 -19644 -40064 -78078 -77714 -59933 -41088 2767 20025
10998 20025 9899 -9696 25245 13085 8410 -592 25274 52849 39964 23047 30560 22668
10986B2668j5529J0073n83q139l6131r512K08k6981J2377Q852k32k3496J4804
10973e1621K726R992J3383J5204M988o65j1355L025R408M335L1748j7878j0000
10960C290Q867K1150q540l1738l502O736m871J4233O961l2122j2168L3251L9823
10947D1370J1524k6112J3602m259n0147l5062o442k140K3120L07n103J3302J013
10934b5027j3505k6356l761K1639R323K0189O205j2157j7382j1552J557r27O094
10921d5660J1344J6019P163m676J1391j4099q357J9614J1976j7420j9980m616
10909c7301q095L2882P852K953l0352k6594J373L0061K1842J6162k2038k2226
10897c3481n05J1715m652j4077q486J5183L4269K834k1803j5972L464M46j396
$$ plain form
10986 22668 7139 17212 16629 8490 -27641 -37153 -36945 -63926 -51549 -42697 -42929 -66425 -51621
10973 -51621 -48895 -38903 -25520 -10316 -5328 -5993 -17348 -14323 -4915 -580 31168 13290 3290
10960 3290 12157 33307 24767 -6971 -10473 -3737 -8608 5625 12586 -19536 -31704 1547 41370
10947 41370 52894 26782 40384 36125 -14022 -49084 -55526 -57666 -34546 -34239 -39342 -26040 -25027
10934 -25027 -38532 -64888 -68649 -47010 -37687 -17498 -11293 -23450 -40832 -52384 -50827 -51754 -45660
10921 -45660 -34316 -18297 -11134 -15810 -4419 -18518 -26875 -7261 4715 -12705 -32685 -37301
10909 -37301 -45396 -12514 -4662 -1709 -32061 -58655 -57282 -27221 -5379 10783 -11255 -33481
10897 -33481 -33986 -22271 -26923 -41000 -49486 -34303 -34 2800 -19003 -34975 -31511 -31065 -32461
10884c2461J8624J3559L169k3352J067J7941j2554M691K3433l580o025R061j636
10871A1937j2338r390j6544J4967J2178M738L0296K1372j3082k5548j4581k0162
10859a6157m743r842J4710K6323K1696J2834J4551k1606j9607j6085k6855o050
10847c0831M682N998J6365P154r640j3500q087k4771R686P179J1760K058j6972
10834c8919L806N470J7651k643l054P563n003r605J378K5800M817j5570M470n409
10820i248j2815k9628J0356J706L0851R277k5551J119Q42J3906J143j252K0754
10807A1460k5444l1264q158j6233K8187L8797J6423k6756o0L33J206l526k546
10794a7581j5210r970J3190L096q664Q223q106l3325n212J0632j876J6460j818
$$ plain form
10884 -32461 -13837 -278 2891 -20461 -19394 -1453 -14007 -9316 14117 10537 4512 13573 11937
10871 11937 -401 -9791 -26335 -11368 810 5548 35844 57216 44134 18586 4005 -16157
10859 -16157 -20900 -30742 -16032 10291 31987 44821 59372 37766 18159 2074 -24781 -30831
10847 -30831 -26149 -20151 -3786 3368 -6272 -19772 -27859 -52630 -42944 -35765 -24005 -21947 -38919
10834 -38919 -35113 -29643 -11992 -14635 -17689 -10126 -15129 -24734 -23356 2444 7261 -8309 -3839 -9248
10820 -9248 -22063 -51691 -41335 -39629 -8778 499 -25052 -23933 -23091 -9185 -8042 -9294 11460
10807 11460 -13984 -45248 -53406 -69639 -41452 -2655 13768 -12988 -13048 -12715 -11509 -15035 -17581
10794 -17581 -32791 -42761 -29571 -26475 -35139 -26916 -35022 -68347 -73559 -62927 -64803 -48343 -50161
10781e0161K6084P157P407n531J3138K4106m158m686L959m52p303k3054n366q496
10767b7356J2181K2974j7807J5950J9461j2682q906n328j6668m797k1440j3774
10755e8192K5166j711n362O310q273P090J4305K915k1889k594R899J0913M777
10742a6646J1547K8048l059m245R055J3564r732j4158j3439L103j5842j2761K47
10729b4318j013k776j417K4999J2797K1250Q385m875n271k686k319m7570k6039
10716e0853K2242K5341m020j4703k87J659J7144j2669n381L179K321O418J6376
10703F767k401k2864j3230K5838j555J9672J1785j9389j0486k1140k4746J4317
10691c7432J4813J6377k3161j3108L0357j7270o797j3226j4632J6932K9263K1188
$$ plain form
10781 -50161 -24077 -16920 -9513 -15044 -1906 22200 18042 13356 17315 16863 9560 -13494 -18860 -27356
10767 -27356 -15175 7799 -10008 5942 25403 12721 3815 -1513 -18181 -22978 -44418 -58192
10755 -58192 -33026 -34737 -40099 -33789 -42062 -34972 -20667 -17752 -39641 -42235 -32336 -21423 -16646
10742 -16646 -5099 22949 19890 15645 24700 38264 28532 14374 935 4038 -11804 -24565 -24318
10729 -24318 -25331 -28107 -29524 -4525 8272 29522 37907 33032 27761 25075 22756 -24814 -50853
10716 -50853 -28611 -3270 -7290 -21993 -22280 -20621 -3477 -16146 -21527 -18348 -16027 -9609 6767
10703 6767 4366 -18498 -31728 -5890 -7445 12227 24012 4623 -5863 -27003 -51749 -37432
10691 -37432 -22619 -6242 -29403 -42511 -12154 -29424 -36221 -49447 -64079 -47147 -17884 3304
10679C304K6935q496l9339n852m812R826J7145R538R80p527j5975J2716N784k779
10665A448R176J0188N193l391j0784k9050J2707K1747j4216j4887n628j6219J6379
10652a7337L3723L0290l891j7190j2508k9794Q37R085o852L4613k795j8165o891
10639f875p036L909K475K531j2188p220o837j1091p626P018K7352P406l7412m413
10625e0007K6036K4331k839n2790J5730J7693j6872k1906J6309K5386l401M425
10613a7905N411o33J5075k1572K134O997l8865k2374j192L1911L1682L6129Q44
10600B7642o851O162K1635k002j5498k8258J810j7031j838L5418n603j3647l6274
10587c4335p376J7106o657j2105K985K5482r29n554j060k5818R653K2372Q588
$$ plain form
10679 3304 30239 21743 -17596 -23448 -28260 -18434 -1289 8249 9229 1702 -14273 -1557 4227 1448
10665 1448 10624 20812 26005 22614 11830 -17220 -4513 17234 3018 -11869 -17497 -33716 -17337
10652 -17337 16386 46676 42785 25595 13087 -16707 -15870 -6785 -13637 20976 18181 16 -6875
10639 -6875 -13911 -10002 -7527 -4996 -17184 -24404 -31241 -42332 -49958 -42940 -15588 -8182 -45594 -50007
10625 -50007 -23971 360 -2479 -55269 -39539 -21846 -38718 -60624 -44315 -18929 -22330 -17905
10613 -17905 -12494 -13127 1948 -19624 -17490 -10493 -49358 -71732 -72924 -41013 -9331 26798 27642
10600 27642 20791 26953 48588 46586 31088 2830 4640 -12391 -14229 21189 15586 1939 -34335
10587 -34335 -41711 -24605 -31262 -43367 -40382 -14900 -15829 -21383 -22443 -48261 -38608 -16236 -7648
10574g648j0647J987L3629j022J272J3625J2969j5473p798K5222k2635l5703o352
10561a8574m50r14L478J0816o772L11j1863M948m326J3899l21l5395J8606K1551
10547e006J7760k0106l0359K3597K0981O029j727n846J621k0456j8887j4306L988
10534d2717J8971K6027O53o279j4948j1441j2476J0034P330M710N814l064J4373
10521c013J1442j4001P140O260M228J8298K3602k8466l5467p742j1703j0141J7721
10508b1842M0544K9357r54j1358l1749O446j857j9252J3239K6757J6118M961L940
10495E4350N938J5724p863j9140k0123j7874p245L752K2468j6327l3412p768j1070
10482c8590k524K1869K417j413Q059j6721j0736J0767K1374Q448J8820j1705k5200
$$ plain form
10574 -7648 -18295 -16308 17321 16299 17571 31196 44165 28692 20894 46116 23481 -12222 -18574
10561 -18574 -19024 -19938 -16460 -5644 -12416 -12105 -23968 -19020 -23346 -9447 -9768 -45163 -26557 -5006
10547 -5006 12754 -7352 -37711 -14114 6867 12896 11169 5323 6944 -13512 -32399 -46705 -42717
10534 -42717 -23746 2281 2934 -3345 -18293 -29734 -42210 -32176 -24846 -20136 -14322 -17386 -3013
10521 -3013 8429 -5572 1568 7828 12056 30354 53956 25490 -9977 -17719 -29422 -39563 -21842
10508 -21842 18702 48059 47105 35747 3998 10444 8587 -10665 2574 29331 45449 50410 54350
10495 54350 60288 76012 68149 49009 28886 11012 3767 7519 29987 13660 -19752 -27520 -38590
10482 -38590 -41114 -19245 -16828 -18241 -10182 -26903 -37639 -26872 -5498 2950 21770 10065 -15135
10469a5135j8709N623J7754o963P294R007K235k0880q252J8167Q167q19K029N225
10455D743J2831M502k2653j3171J704J6271k7714J0074J8378L386N739j1935n949
10442c794r6Q524K8406J0405k4129L968Jj1510m907J0011j6404j5895P055J2952
10428D587k1067L25K6331N513l4311J4068J4106j7628j9008j3609j129O488k146
10415c7480J7679J962K0585J0814k0802m261L2720K3713r800l2289j205K469J682
10402E787j1991l065J5753J3390j994Q301N063j2439m0177K4222J6386J8518j3587
10389B4167j3445n035N884k617K2662j9023j2454j4219M930K809J1343q397R841
10376F446L3919K982m8771M269K5374J1457K2888J3393k622j0452Q151j4569m1947
$$ plain form
10469 -15135 -33844 -28221 -10467 -17430 -10136 -1129 1106 -19774 -28026 -9859 -1692 -2511 -482 4743
10455 4743 17574 22076 -577 -13748 -12044 4227 -23487 -13413 4965 8351 14090 2155 -3794
10442 -3794 -3890 4634 33040 43445 19316 23284 23285 11775 6868 16879 475 -15420 -8365 4587
10428 4587 -16480 -16155 10176 15689 -18622 -4554 9552 -8076 -27084 -40693 -41822 -35334 -37480
10415 -37480 -19801 -17839 2746 13560 -7242 -11503 21217 44930 35130 2841 1636 4105 5787
10402 5787 -6204 -9269 6484 19874 17880 26181 31244 18805 -21372 2850 19236 37754 24167
10389 24167 10722 5687 11571 8954 31616 12593 139 -14080 -9150 -6341 5002 -3395 6446
10376 6446 40365 43347 -5424 -1155 24219 35676 58564 71957 69335 58883 67034 52465 10518
10363A0518J5534J9184L1761l722m811j2201m536j8319n178l497j8207l2501p429
10350c3404L783M29J5056L8998J4510r26j1063j3366K1096K8789j2203k5919k991
10337B2789k395k7113K4188K2034p651p324r446r748j6443L0048K9716j6058j8311
10324A4286Q035O670k705l4362J1040L1040L4494L50k1722l2292j5655Q869J3414
10311B1462j3837k5508L356J4548K2469k1458k725K7158J0240j4206j8061j926
10299A512N756M004J8578j9057p607j2676j2994r574J2490j826J4727K4874J6359
10286C4566j108l1812k1888J779Q669J0012j9767J2550M852J7136p630k7786j9812
10273d0239J9748K0329j686m161k999L886K3969l55R424O877n379j4586r331R173
$$ plain form
10363 10518 26052 45236 76997 73275 68464 56263 51727 33408 28230 24733 6526 -25975 -33404
10350 -33404 -29621 -29192 -14136 24862 39372 38446 27383 14017 35113 63902 51699 25780 22789
10337 22789 20394 -6719 17469 39503 31852 24528 15082 5334 -11109 18939 48655 32597 14286
10324 14286 22321 28991 26286 -8076 2964 34004 68498 68848 47126 14834 -821 8048 21462
10311 21462 7625 -17883 -14527 21 22490 1032 -1693 25465 35705 21499 3438 1512
10299 1512 7268 11272 29850 10793 3186 -9490 -22484 -32058 -19568 -21394 -6667 18207 34566
10286 34566 33458 1646 -20242 -18463 -9794 218 -19549 -6999 -2147 14989 7359 -20427 -40239
10273 -40239 -20491 -162 -1848 -6009 -9008 -5122 18847 18492 27916 34793 29414 14828 5497 14670
10259A4670K3867j8365l2013k459K0625j710L396K0772K667J1428J159J782N7038
10246A02857K9381j0973m4334l7640m833R794j1195J0721K616P889m082J692k8935
10233B2958l0158L058K0552J2103l562j5959J1737L792K3068k0333j3287J7245
10221C1214K5035J1688J1688J5997k2246k0252K38m127J529p212K418j0364m137
10208C1469k3289j2435R207m622J8634Q916l951k2814j5457M998R333J0394K922
10195A3305J3933J453K3005k9586j8841K5860J2675Q829p878k5702k250O631J4444
10182C5878K1877l0415l7497j7889j2785n603J0835L1063J7770M3009K46N988
10170F2477k855RQ65j6711k4893M682j2450J2433P005j2405r32K9664n799o376
$$ plain form
10259 14670 38537 20172 -11841 -14300 6325 4615 8011 28783 31450 42878 44037 45819 102857
10246 102857 132238 121265 76931 39291 34458 44252 33057 43778 46394 54283 50201 51893 22958
10233 22958 -7200 -4142 16410 28513 24951 8992 20729 24521 47589 27256 13969 31214
10221 31214 56249 67937 79625 95622 73376 53124 53362 49235 50764 43552 45970 35606 31469
10208 31469 8180 -4255 4952 330 18964 27880 23929 1115 -14342 -9344 -11 10383 13305
10195 13305 27238 28691 51696 22110 3269 29129 41804 50633 42755 17053 14803 21434 35878
10182 35878 57755 27340 -10157 -28046 -40831 -46434 -35599 -4536 13234 56243 56489 62477
10170 62477 59622 59631 60496 43785 18892 23574 11124 23557 30562 18157 17225 46889 41090 34714
10156C4714j6146k4870q348J3325N050k1121k805K2796J2348J7692j0145K907
10144B5397J3500L703j8397m0980R755j5754r119J3504J8959K5822L5378l223
10132E8545O285j1203j6813l9263j8564J9063r498M773J8152N558j1236j315J6327
10119B0811J3181R711j1493j1635j4473J0872M996j327J200j0030k1897J4772
10107D688l445j7495o522K9513K9223k637M934p069j4194n457M769M710N3124
10094G4142J7543j5501l2635k5679j4781J2270K8399J3851l5780j9159J2212p14
10082A4168J0918N168N093k8467j7354l8913k320L7463J7413p5Q222m022j2289
10069d995M724m283M889k1506p497J5073M957j8540L0054O130j5900J4087O382
$$ plain form
10156 34714 18568 -6302 -14650 -1325 3725 -17396 -20201 2595 14943 32635 22490 25397
10144 25397 38897 42600 24203 -16777 -7022 -22776 -31895 -18391 568 26390 61768 58545
10132 58545 64830 53627 36814 -2449 -21013 -1950 -11448 -6675 11477 17035 5799 4484 20811
10119 20811 33992 43703 32210 20575 6102 16974 21970 20643 21843 11813 -10084 4688
10107 4688 1243 -16252 -22774 6739 35962 33325 38259 31190 16996 11539 16308 21018 74142
10094 74142 91685 76184 43549 17870 3089 15359 43758 57609 21829 2670 14882 14168
10082 14168 25086 30254 35347 6880 -10474 -49387 -51707 -14244 3169 3094 11316 7294 -4995
10069 -4995 -271 -4554 335 -21171 -28668 -13595 -8638 -27178 2876 9006 -6894 7193 13575
10056A3575L0351K6274O28k5238n475J3505L9830m6218k0163j6657J3800J5479
10044C9691K707j7152k2824R887L9809l2708o257L8758J4611N5139J21845J18042
10032C61548j3583j40829p7381m6383k4956K8597k1328j2834N698K6695O541k0465
10020G1320l1222r313J1754J7136K146k4777j8397m206J1241K800j4289j2686
10008A507J9548J1636J7846L1451p557l3128j8349J4490m371o718j3448R997K2669
9995D5573J1468R669m4080j7712L0595J0954Q030p730M804p253k140J4468R437
9982F6083N344k3057j3603r053o644K650j6636Q830K3384J2021p384R676L0885
9969H2496M528j937P866K3220o867k3934k2922p868J6471Q74J173K7679N2310
$$ plain form
10056 13575 43926 70200 70828 45590 40115 53620 93450 47232 27069 10412 24212 39691
10044 39691 42398 25246 2422 12309 52118 19410 13153 51911 66522 121661 243506 361548
10032 361548 347965 207136 129755 83372 58416 87013 65685 52851 58549 85244 91785 71320
10020 71320 40098 30785 42539 59675 61821 37044 18647 14441 25682 28482 14193 1507
10008 1507 21055 32691 50537 81988 74431 41303 22954 37444 33073 26355 12907 22904 45573
9995 45573 57041 66710 22630 4918 35513 46467 54497 46767 51571 44318 42178 56646 66083
9982 66083 71427 48370 34767 25714 19070 21720 5084 13914 37298 49319 41935 51611 82496
9969 82496 87024 85087 92953 116173 109306 85372 62450 54582 71053 71927 73100 100779 153089
9956A53089O8319N7379J598j6411r162k7578j6439Q246O9989J11428J02166p71
9944E01853p6635j09832m4062J8219m3349j1806K6255K1468j2287m1885m3341
9933A84598m9932j6027k7626k9166m929K2453K0272K1720m738j1907r821J782
9921I6679j7549k9669M277j058k2941L269K9595J0603n582k2727j5267p866L0555
9908E2319J5621K859l2172j3351K8580M0421k2770k0976k8841J7707L730l422
9896C9705K3839J6121J2727Q150R732j3128k2922K730K5350J1233j246j4194j4967
9883H3130p372K778q52K5071R244j2938Q109j0706p255J9502N210j6393J0013
9870A07541K1833L972J2867m512J9763M4136J7111n731M48L4155M0942K0043j0555
$$ plain form
9956 153089 221408 278787 280385 263974 254812 227234 210795 219041 289030 400458 502624 501853
9944 501853 425218 315386 271324 289543 246194 234388 260643 282111 269824 227939 184598
9933 184598 134666 118639 91013 61847 56918 79371 99643 121363 116625 104718 94897 96679
9921 96679 79130 49461 53738 52680 29739 33008 62603 73206 67624 44897 29630 21764 52319
9908 52319 67940 70799 38627 25276 53856 94277 71507 50531 21690 39397 43127 39705
9896 39705 63544 79665 92392 100542 110274 97146 74224 76954 102304 113537 112291 98097 83130
9883 83130 75758 78536 77684 102755 111999 99061 107170 96464 89209 108711 113921 97528 107541
9870 107541 129374 133346 146213 141701 161464 205600 222711 216980 217428 251583 292525 312568 302013
9857C02013R046p444L0467L6474M2381Q3476Q1554P9145Q4665J48049J98421K84076
9845A372323M12999O24770R99317J773950L084980M106913K911641q51363l795443
9836A0640087l770705k319466j232290p20596m20089l00047k29120j59281j12271
9827A376222j5630M0267R3864J88302L13515N43360Q99188J334682J630203J379773
9817G783746L53227r53281j607373j596954j184534p28537m67871l59731k18646
9808A020046j48525j28867r6893o9713l8966l8407n1890k9304l454j3517k4517
9797C75993m1264m2800k4786k4154q369k8785j2944j6178j8940K85J7683o978
9785A68763o261M83Q911O0q768o559j5651p580n963q432K1164J3789k232o006
$$ plain form
9857 302013 311059 303615 334082 370556 412937 496413 577967 657112 741777 889826 1088247 1372323
9845 1372323 1785322 2410092 3409409 5183359 8268339 12375252 15286893 14435530 10640087
9836 10640087 6869382 4549916 3317626 2597030 2176941 1876894 1647774 1488493 1376222
9827 1376222 1360592 1400859 1494723 1683025 1996540 2539900 3439088 4773770 6403973 7783746
9817 7783746 8136973 7183692 5576319 3979365 2794831 2066294 1598423 1238692 1020046
9808 1020046 871521 742654 645761 576048 537082 498675 446785 417481 414027 400510 375993
9797 375993 334729 291929 267143 242989 234620 205835 192891 176713 157773 158058 175741 168763
9785 168763 162502 162985 171896 171956 163188 156629 140978 133398 127435 119003 140167 153956 151724 145718
9771A45718j8395j3197j3342l8648k6360j7980K7613K23m650o097K0981O676j2712
9758D9830J1762R006M571J94J290r794P096J9931K933p834o816l141K3837J9368
9744A22233o850Q139l408K564J7228K6727N7970P5357O1287M3181K2077M6701
9732D73206R5731Q6913o2278j11434o3959l5931n3906o7298k8555j4152k1456
9721A96881k4335l5343j2726M558j4177k3946n587p901j9181M68k289j0265j4088
9708C2069j6650N582J8759L0590L2518K308j9771j970o683j819m699J4791o917
9695G8108j8499M774M833J4378j2387j5180n566J8318L1237K5139L1365L0630
9683A87150j5553J4031L6253L270k7431k7866j1733O489j1018j3806l2661j7100
$$ plain form
9771 145718 127323 114126 100784 62136 35776 17796 45409 45632 40982 34885 55866 62542 49830
9758 49830 61592 70598 75169 75363 76653 66859 73955 93886 96819 88985 82169 79028 102865 122233
9744 122233 115383 123522 120114 122678 139906 166633 224603 299960 361247 404428 426505 473206
9732 473206 568937 655850 593572 482138 418179 382248 328342 261044 232489 218337 196881
9721 196881 172546 137203 124477 129035 114858 90912 85325 77424 58243 58711 56422 46157 32069
9708 32069 15419 21001 39760 70350 102868 105176 85405 83435 76752 74933 70234 85025 78108
9695 78108 59609 64383 69216 83594 71207 56027 50461 68779 100016 125155 156520 187150
9683 187150 171597 185628 221881 225151 197720 169854 158121 164610 153592 139786 107125 90025
9671I0025K398k0898l408P26j8064J4660J0527K5985M5930p600n729m4692j4178
9658G5682M61p805N854j6016n300J191J6526M660j9136j7654m25r583n312J1606
9644C4749K1086L565j7651m323J1913J5513q925J8050J818j3707l321J2077l6610
9631C4234o987L4811J0213Q597K1639N753l115J1141j4249k4221j2973M673n871
9618F3645k289K0024J7615J6110k0912p657j4545j1376k309K0899l090J5820j3977
9605G7958k4205J375Q641J1759R95j3916K208O691k0366j6786J1634K699m85P824
9591E6026j724p055L1081L6558M733r750j7588j9017n238J1604K6677k044q942
9578I5321L249M136m067r402n438J0188o895n715K937j9730j9414j0228m341j1183
$$ plain form
9671 90025 92423 71525 68117 68843 50779 65439 75966 101951 147881 140281 134552 89860 75682
9658 75682 76143 68338 74192 58176 52876 54067 70593 75253 56117 38463 38038 28455 23143 34749
9644 34749 55835 59400 41749 37426 49339 64852 55927 73977 75795 62088 58767 70844 34234
9631 34234 27247 62058 72271 80868 102507 108260 105145 116286 102037 77816 64843 69516 63645
9618 63645 61356 81380 98995 115105 94193 86536 71991 60615 58306 79205 76115 91935 77958
9605 77958 53753 55128 63769 75528 76523 62607 64815 71506 51140 34354 45988 48687 48202 56026
9591 56026 54302 47247 78328 114886 119619 109869 92281 73264 68026 79630 106307 104263 95321
9578 95321 98570 102706 98639 89237 83799 93987 87092 81377 84314 64584 45170 34942 30601 19418
9564A9418J1777K2844J7202n180j558J4565j2921k1671K4787K1817J7678p829
9552A00929k7100R946j0902k6550m846J5838m20J6022J4900J1570r62R175J7250
9539A24850J2129K827J6564j6787l9144l6739j4687k2005J2529N938j6971J4762
9527D3266L5844l289k0403j4450j2991J2008J2653L2311Q248k0755k2071k9698
9515B0673j7790J41J7678M2946K3008R59j1381O928J347k6701j7068j8094l223
9502A9423K1816O461R312o170m445j5319R081L9011K1443J2128q351p356j3596
9489H3438J4230k121j1264M2612J6181J9740k197J0329J612m1365k5588J39J213
9476A06959M891K7897m864j7556q895k879J7713L987L222L251O33m959k795j463
$$ plain form
9564 19418 31195 54039 71241 66061 64503 79068 66147 44476 69263 91080 108758 100929
9552 100929 73829 83775 72873 46323 41477 57315 56895 72917 87817 99387 98425 107600 124850
9539 124850 136979 139806 156370 139583 100439 63700 49013 27008 39537 45475 28504 43266
9527 43266 79110 75821 55418 40968 27977 39985 52638 84949 93197 72442 50371 20673
9515 20673 2883 3024 20702 63648 86656 87615 76234 83162 84509 57808 40740 22646 19423
9502 19423 41239 47700 57012 50842 46397 31078 40159 79170 100613 112741 104390 97034 83438
9489 83438 97668 95547 84283 126895 143076 162816 160619 170948 172560 131195 105607 105746 106959
9476 106959 111850 139747 134883 117327 108432 105553 123266 127253 130475 133726 134359 129400 126605 125142
9462A25142J1021J214J278J912j4960j5318j4909k3347J1180L0416L497j1760
9450A05366J2390r386q343J2918n667j2545m23K6572Q745L178r415n683Q245L3240
9436A59192N837m629r869j9116j160K4605N841m154j5039Q388j75K4135j3118
9423A60738k5163m1699j2560K0424J0235N409J4539J8951k7517O074K7692K3324
9411A80447q29K1529L1454K263n1280k2168j672l1145K4118j510k2013n928K3479
9398A46745j8167J539k124J801K8962O596r026Q872N696l8166k4784J0496q05
9385A17635m258J0490L8830K0488J828J2043j5265k9068p850k862K5670j031L125
9372A69775k77L847P8L021P517P761R252J8179M531p47l3314j6215L771k641P444
$$ plain form
9462 125142 136163 137377 138655 140567 125607 110289 95380 72033 83213 113629 117126 105366
9450 105366 117756 108370 100027 112945 107278 94733 94310 120882 129627 132805 123390 117707 125952 159192
9436 159192 165029 160400 150531 131415 130255 154860 160701 156547 141508 149896 149721 173856 160738
9423 160738 135575 93876 81316 101740 111975 117384 131923 150874 123357 129431 157123 180447
9411 180447 179618 201147 232601 234864 183584 161416 159744 128599 152717 151207 129194 123266 146745
9398 146745 128578 130117 127993 129794 158756 165352 156326 165198 170894 132728 107944 118440 117635
9385 117635 113377 123867 162697 183185 185013 197056 181791 152723 144873 142011 167681 166650 169775
9372 169775 169498 173345 173423 176444 183961 191722 200974 219153 223684 222937 189623 173408 177179 174538 181982
9357A81982r97j4714K38N735j089M923K6994k4861J5620J0887Q219j8835q294
9344A85808p40K3276K1657J0000l475m4973k3434n143J7179l006j2566J1100r092
9331A66591j65p652j1253O339J2303n654r333J5788M6290J1247P994j3356J6488
9318B35627J5405r623j2955k0802n353P661J3415J6883N013j3670m122n93l455
9305B23431L5537p886k1605n776J7044J1126j3381k6716K7287L6138j0255k5496
9293B39448K8520J3844l0896j617J7394j4798J6418J574L960K5131L300m410J059
9280B98927J2914J2566j6896q15j1209O59o720J3171J6655J2504k5797k996o362
9267B96601N375k483m96K7138j2655j378M0473J9133l654o816k8295J104L4057
$$ plain form
9357 181982 180985 166271 166509 172244 171155 176078 203072 178211 193831 204718 212937 194102 185808
9344 185808 185068 208344 230001 240001 236526 191553 168119 162976 180155 177149 164583 175683 166591
9331 166591 166426 158774 147521 153860 166163 160509 151176 166964 213254 224501 232495 219139 235627
9318 235627 251032 241409 228454 207652 202299 209960 223375 240258 245271 231601 227479 226886 223431
9305 223431 258968 251082 229477 223701 240745 251871 238490 211774 239061 275199 264944 239448
9293 239448 267968 281812 250916 249299 266693 251895 268313 269887 273847 298978 302278 297868 298927
9280 298927 311841 324407 307511 306696 295487 296146 289426 302597 319252 331756 305959 302963 296601
9267 296601 301976 299493 298997 326135 313480 312102 352575 371708 368054 361238 332943 334047 368104
9254C68104K9041j9033j3604r398N64n683Q737K6433J1748K764L201R612J8825
9241D31311j5335q860J233L3169P078O373J753q048k0128j2270J6970K3743R53
9228D57942R582m456O693L5072J8591l5510j1554j1508j1192p65K1946K8598K1432
9215E24871m489J3361J3208j1729j9486j9451m5386O455K2824J4318O123j8610
9203D82009J8186M8258m570o804j2793j5209n254k5923Q784K6920o724R789N696
9190E22365J891J7692o737K4316J7733j147k0688Q264j4481m508K211K1345L1188
9177E99444P818j7783K5264K2671J507K6070j4118j607K476J57K9021J7912k8924
9164F69908j7776J9916K6847N031J8016L7157m0232r641K8900j32L821J3619o484
$$ plain form
9254 368104 397145 378112 364508 355110 355674 349991 358728 385161 396909 399673 402874 412486 431311
9241 431311 415976 407116 408349 441518 448596 454969 456722 448674 428546 416276 433246 456989 457942
9228 457942 467524 463068 469761 504833 523424 487914 476360 464852 453660 452895 474841 503439 524871
9215 524871 520382 533743 546951 535222 515736 496285 450899 457354 480178 494496 500619 482009
9203 482009 500195 548453 543883 537079 524286 509077 503823 477900 486684 513604 506880 516669 522365
9190 522365 524256 541948 535211 559527 577260 576113 555425 563689 549208 544700 546911 568256 599444
9177 599444 607262 589479 614743 637414 638921 664991 650873 649266 651742 651899 680920 698832 669908
9164 669908 652132 672048 698895 703926 721942 759099 718867 709226 738126 737994 741815 755434 748950
9151G48950q69M5675M3420l4462j3048L2332R252N48j3118n980K9695M5036L2576
9138I20007J6817k2239N425K3546J3084j2438j0898L2927K0687k9785n113L5661
9126I87681M3741J6099K2804J7016K2214K5470O180M1241J3844J246j0062K5502
9114A212976K1978q997J560J3618J7548K2026R845K1772J0356N4459P4766M494
9102A456401J3706M4049K3943j8784J3898K5576R102L3184J9988R063K4576L0505
9090A685207K6822K1018L7151L751R354L2131M5318K2334L6428M2917O149K5436
9078A994016N6011K8816r687K3578N4171J8663L8521M8845O0762N2931N3664N0910
9066B471201K5168M3978M2703N4251O9702N2176K3687K6351O4460N3296M8889
$$ plain form
9151 748950 748081 793756 837176 802714 789666 821998 831250 831798 818680 812700 842395 887431 920007
9138 920007 936824 914585 920010 943556 956640 944202 933304 966231 986918 957133 952020 987681
9126 987681 1031422 1047521 1070325 1087341 1109555 1135025 1141205 1182446 1196290 1197536 1187474 1212976
9114 1212976 1234954 1225957 1227517 1241135 1258683 1280709 1290554 1312326 1322682 1377141 1451907 1456401
9102 1456401 1470107 1514156 1538099 1519315 1533213 1558789 1567891 1601075 1621063 1630126 1654702 1685207
9090 1685207 1712029 1733047 1770198 1773949 1783303 1815434 1860752 1883086 1919514 1962431 1968580 1994016
9078 1994016 2050027 2078843 2069156 2092734 2146905 2165568 2204089 2252934 2313696 2366627 2420291 2471201
9066 2471201 2496369 2540347 2583050 2637301 2707003 2759179 2782866 2809217 2873677 2926973 2975862
9055B975862Q5657N9532O7429R4171P1799O5253Q4126O0143O5948Q8599J03472
9044C821991R8566O0857P8399J10113J22386J39236J20492J27938J50584J26649
9034D957211J18718J19329J16791J19391J72688J75563J59122J83350J74760J63391
9024F460314K31690K16965K35813K69072K06171K21138K46440K66983K98532L28463
9014H981581L15473L13105L42616L75764M27209M33753M44524M46342M62204M99203
9004A3041774N28725N91744N93237O36125O92798P38696P51403Q13572Q60859
8995A9248933R08230J003131J098673J153559J190640J267389J330710J430212
8987B8631477J542635J648985J765753J919476K025321K139044K270882K392487
$$ plain form
9055 2975862 3061519 3121051 3188480 3282651 3354450 3419703 3503829 3563972 3629920 3718519 3821991
9044 3821991 3920557 3981414 4059813 4169926 4292312 4431548 4552040 4679978 4830562 4957211
9034 4957211 5075929 5195258 5312049 5431440 5604128 5779691 5938813 6122163 6296923 6460314
9024 6460314 6692004 6908969 7144782 7413854 7620025 7841163 8087603 8354586 8653118 8981581
9014 8981581 9297054 9610159 9952775 10328539 10755748 11189501 11634025 12080367 12542571 13041774
9004 13041774 13570499 14162243 14755480 15391605 16084403 16823099 17574502 18388074 19248933
8995 19248933 20157163 21160294 22258967 23412526 24603166 25870555 27201265 28631477
8987 28631477 30174112 31823097 33588850 35508326 37533647 39672691 41943573 44336060
8979D4336060K553669K710234K825979K927891L023253L117033L178077L198448
8971F7870644L138927L023334K891283K684947K400501K104923J613147J114390
8963H6842096O17626J11461m10511r42376j431514j880036k227055k533807k740571
8954G5405313k910175l001781l063126l067113l017789k972271k871731k736287
8946E1765040k639694k551370k414560k276881k142280k015143j899025j804805
8938C4021282j713567j592103j468718j390101j318640j224693j156051j067837
8930B3089572j035885r41614q89744q65040q34481p86665p05903o52757o17854
8921A5759629o30173n92480n31197n08619m79345m78155m67776m67943m32272
$$ plain form
8979 44336060 46889729 49599963 52425942 55353833 58377086 61494119 64672196 67870644
8971 67870644 71009571 74032905 76924188 79609135 82009636 84114559 85727706 86842096
8963 86842096 87459722 87571183 87160672 86218296 84786782 82906746 80679691 78145884 75405313
8954 75405313 72495138 69493357 66430231 63363118 60345329 57373058 54501327 51765040
8946 51765040 49125346 46573976 44159416 41882535 39740255 37725112 35826087 34021282
8938 34021282 32307715 30715612 29246894 27856793 26538153 25313460 24157409 23089572
8930 23089572 22053687 21112073 20222329 19357289 18522808 17736143 17030240 16377483 15759629
8921 15759629 15129456 14536976 14005779 13497160 13017815 12539660 12071884 11603941 11171669
8912A1171669l77543l54419l36080l33627l32939l19738k78360k83973k66810
8903H288180k64916k46187k23685j99571k24165k33693j83218j90834j78792j55026
8893F188093j73137j51882j21845j47167j57269j67447j67383r6657q9556j23508
8883D792242j35924r9276n4829j05201j34381j18053q0992o3774j02350r1800
8873C805662q1042o3168r7988p5563n1654n4210o7753o4400o2695o7161o3391
8862C056637n9440m0456l4524o1590q4585o1263o7950n2628j2716j5550l1638
8851B534297k8706o4309p6076n8989m1471j8192l0331m2784n6716k3136l7743
8840B055844k5689j4657k8315q3924m9800k2152l309j8975k7688l9408k1744k6615
$$ plain form
8912 11171669 10794126 10439707 10103627 9770000 9437061 9117323 8838963 8554990 8288180
8903 8288180 8023264 7777077 7553392 7353821 7129656 6895963 6712745 6521911 6343119 6188093
8893 6188093 6014956 5863074 5741229 5594062 5436793 5269346 5101963 5005306 4915750 4792242
8883 4792242 4656318 4557042 4502213 4397012 4262631 4144578 4063586 3999812 3897462 3805662
8873 3805662 3724620 3661452 3563464 3487901 3436247 3382037 3314284 3249884 3187189 3120028 3056637
8862 3056637 2997197 2956741 2922217 2860627 2776042 2714779 2646829 2594201 2581485 2565935 2534297
8851 2534297 2505591 2441282 2365206 2306217 2264746 2246554 2216223 2173439 2116723 2093587 2055844
8840 2055844 2030155 2015498 1987183 1903259 1853459 1831307 1827998 1809023 1781335 1741927 1720183 1693568
8828A693568k8574q429j5859l9089k3410m0489n6601j1787J5703J0021l5332k6710
8816A433012j8663J1473r024l0660l6321Q009n3976k7669M53j1453k9922k8038
8804A207221r092J800k9255j6564n723k853o0859k0558K0996k171j2589j8641
8792A051712l9124m7979k2416K0891J8259k3040j5442L495q761k6981k5097P69
8780H86286R455m453N949n600j7601j3259o168K58k575k3531j0427r697J7458
8767H26095j0872k5981k6033n957q451K4435R893K697n311k6639j5096q234k4861
8754G05685j0600j3215Q655N411m515r772k2311J3748J3607j5413r789J0205L591
8741F75287j568n5397l8574m33K0030l0628o550j1289k241J8814J7189j120j0544
$$ plain form
8828 1693568 1664994 1656565 1640706 1601617 1578207 1537718 1481117 1469330 1485033 1495054 1459722 1433012
8816 1433012 1414349 1425822 1416798 1386138 1349817 1357826 1303850 1276181 1276634 1265181 1235259 1207221
8804 1207221 1198129 1199929 1170674 1154110 1148387 1145534 1084675 1064117 1085113 1082942 1070353 1051712
8792 1051712 1012588 964609 942193 963084 981343 958303 942861 946356 937595 910614 885517 886286
8780 886286 895741 891288 897237 891637 874036 860777 854609 854867 852292 828761 818334 808637 826095
8767 826095 815223 789242 763209 757252 748801 773236 783129 785826 780515 753876 738780 730546 705685
8754 705685 695085 681870 690525 695936 691421 681649 659338 673086 686693 671280 661491 671696 675287
8741 675287 673719 618322 579748 579315 599345 568717 562167 550878 548637 567451 584640 583520 572976
8728E72976o399J3518Q702r264l0257k141K5211l2677o5189j3473o685O289J8348
8715D78959k20P366L402l697K966R994M820J8186j3936k8869J4748J7961L796
8702E15476k0879K670L020k5379j5048J6567J0217p139j2782Q183j83j6330j455
8689D56938R68k7701J141K5887j234l1043n0133j2641J7421L391l5351J4984J6276
8676C78903J9892J706L868j5991J6500K9872J91n0643k9493J9439J6781j6324
8664C74701j7157K2644p487j3532j1606j1849J4622J9689K296J4746J0884n528
8652C92423K130K6702K8413N252J2020p242M8083P6085J07696J30126K18896L69618
8640A410202O23305R66945J119109J39699j110850j067319o08381l53971j91656
$$ plain form
8728 572976 566577 580095 588797 579533 549276 547135 572346 539669 474480 461007 454322 460611 478959
8715 478959 478739 486105 489507 485810 488776 498770 503590 521776 507840 478971 493719 511680 515476
8702 515476 494597 497267 500287 474908 459860 476427 486644 479505 466723 474906 474723 458393 456938
8689 456938 457906 430205 431346 457233 455999 424956 374823 362182 379603 382994 347643 362627 378903
8676 378903 398795 400501 404369 388378 404878 434750 434941 384298 354805 374244 391025 374701
8664 374701 357544 380188 372701 359169 347563 335714 350336 370025 372321 387067 397951 392423
8652 392423 394553 421255 449668 454920 466940 459698 507781 583866 691562 821688 1040584 1410202
8640 1410202 2033507 3000452 4119561 4259260 3148410 2081091 1472710 1118739 927083
8631I27083j05157q7036p1389o0797n9329k3078k1928j4348l346q239j1365j5830
8619D45241j0936j6604k9287j3236J5094J5555j275j4250L6280N363L494M6441
8607D81880M3128L1696L2404K8793M5184O4793O3530J12123J58325K07694L53416
8596A622966O16107J039608J754734K430927R28568j974948k255257j385180p96755
8587A980770m64071k63989j82116j64414j04744p0693n1285m4668m1352k1368
8577E72070m4499k7818k5228n667n5261k9171J2707q14j8217k6783L82J2775j2683
8564C51793P921J9881M500P73M152O003J6514M8643L8492O4204P5968R7491J51250
8551H87585K47344M34695P44305J120112P97889o22950j194511q32443m54573
$$ plain form
8631 927083 821926 734890 663501 602704 543375 520297 498369 484021 480675 472436 461071 445241
8619 445241 434305 417701 388414 375178 390272 405827 404552 390302 426582 431945 435439 481880
8607 481880 525008 556704 589108 617901 663085 727878 791408 903531 1061856 1269550 1622966
8596 1622966 2239073 3278681 5033415 7464342 8392910 6417962 4162705 2777525 1980770
8587 1980770 1516699 1252710 1070594 906180 801436 730743 679458 634790 593438 572070
8577 572070 527571 499753 474525 468858 413597 384426 397133 396319 378102 351319 351701 364476 351793
8564 351793 359714 379595 384095 384868 389020 395023 411537 460180 498672 562876 638844 736335 887585
8551 887585 1134929 1569624 2313929 3434041 4231930 3608980 2414469 1582026 1127453
8542A127453k42546j65753j14518j00646n1781j9711j5076j8422m8333j4169l768
8531C32730k3418j2317Q906l3663j5769Q069m638k6478l859k944k9587J6562O538
8518B20132p77j618p57j6530k7865O314K7464L9149q78m6593p86K3707l250m390
8504B13322j1488L450M9976N0762K3299L9868l4224p3554l7983J13j8774n98r104
8491A95065k7490k2946q351J2426k1751j1408K5763M3391O885o182j5270k5069
8479A45063j111p199M261J84k0439K7759J5610R994K4414l777L4552r801j3887
8466B05623m7445q413n479j2927l3166n539J723M179J5983J0499r361j7585J110
8453I9202J7843J4099j2882k1491N75k777l592J3121k855m7092N067M1021m35
$$ plain form
8542 1127453 884907 719154 604636 503990 452209 432498 417422 399000 350667 336498 332730
8531 332730 309312 296995 305901 272238 256469 264538 259900 233422 229563 226619 197032 213594 220132
8518 220132 219355 217737 216980 200450 172585 178899 206363 245512 244634 198041 197255 220962 217712 213322
8504 213322 201834 205284 255260 306022 329321 369189 334965 261411 223428 223541 204767 204169 195065
8491 195065 167575 144629 136278 148704 126953 115545 141308 184699 191584 185402 170132 145063
8479 145063 143952 136753 141014 141198 120759 148518 164128 174122 198536 194759 229311 219510 205623
8466 205623 158178 149765 144286 131359 98193 92654 94377 98556 114539 125038 115677 98092 99202
8453 99202 117045 131144 118262 96771 97346 94569 90977 104098 101243 54151 59218 100239 99804
8440I9804L653J5534j6913k2702M985K1150j1825J5943j1607N41L860j3896J2575
8427A01102L8844O796J3379J3849L7063L3764K993l1552m1346k7786J4674j1125
8415A50655k3424J8659L0461J4408j1158j4817n3456j4959p705J5900J8534J3179
8403A36277o017q243k3074j1413J8334N39k0760n343q149K852l852k4080J9917
8390F6988O886n62O606r106J3092K1294n113J8713K8828k4622K0126J8009j8262
8377A42877l0261k4124K8841K5898r490j2284p5j0651q804l3257N417K8766q975
8364I3878k634J226r927O026r092P826J910n910j3170j5127o601p057J8066k680
8350E6734j1943L165M274K0559R593j8959l5704r518J5125M8022L0089j5309l648
$$ plain form
8440 99804 103457 118991 102078 79376 84361 105511 93686 109629 98022 98563 102423 88527 101102
8427 101102 139946 146742 160121 173970 211033 244797 247790 216238 174892 147106 161780 150655
8415 150655 127231 145890 176351 190759 179601 164784 111328 96369 88664 104564 123098 136277
8403 136277 130260 122017 98943 87530 105864 106403 85643 80300 72151 75003 71151 47071 66988
8390 66988 73874 73312 79918 70812 83904 105198 100085 118798 147626 123004 143130 161139 142877
8377 142877 112616 88492 117333 143231 133741 121457 121382 110731 101927 68670 74087 102853 93878
8364 93878 91244 92470 82543 88569 79477 87303 89213 83303 70133 55006 48405 41348 59414 56734
8350 56734 44791 47956 52230 72789 82382 63423 27719 18201 33326 81348 111437 96128 92480
8337I2480k289j9896q582Q920K4535Q882O381L816k4113k0265R175L434K0778
8324A03256r292k6615n536O875n510Q579o997j6513m525J977J4861k171k3294
8311C5095J773K3526l365J0115p795j4857O556L071R065Q396k0565M946k4708
8298C1253J5068J1606k4292q078J4430k7944Q809J5115p914q987k635K0540K1807
8285E8778p401O424l899Q087N581J77j924p880Q416J5589J9131j9821q865R500
8271H1893j1583j3070j8995l824j0814j1556o713p656j5436N4333J9644N278p670
8258E3831k0736O633J6332j4372k2190J5157K6572M272j4026M70O143k2137j9412
8245A6537n097Q624J2451l055j6044J1371L4208J0936p500m734J1003J7338J4643
$$ plain form
8337 92480 90191 70295 61713 70633 95168 104050 110431 114247 90134 69869 79044 82478 103256
8324 103256 93964 67349 61813 68688 63178 71757 64760 48247 43722 45699 60560 58389 35095
8311 35095 36868 60394 57029 67144 59349 44492 51048 54119 63184 71580 51015 55961 31253
8298 31253 46321 57927 33635 25557 39987 12043 20852 35967 28053 19066 16431 36971 58778
8285 58778 51377 57801 53902 61989 67570 67747 65823 57943 66359 81948 101079 81258 72393 81893
8271 81893 70310 57240 38245 34421 23607 12051 5338 -2318 -17754 36579 56223 61501 53831
8258 53831 33095 39728 56060 41688 19498 34655 61227 65499 51473 51943 58086 35949 16537
8245 16537 11440 20064 32515 29460 13416 24787 58995 69931 62431 57697 68700 86038 100681
8232A00681l0647r563j5565k5431j077K341K7967L9586j653l7211j9344J4467
8220D4551J8513q116r869j6598k1083J3437K6313K0433K8117M966k2843j1466
8208F6355j7074L463K7063J638l3579p615J7932J5496J686j8996k361j169k4222
8195B8617M719O06J0798Q367J7443K953j6901M6643P884l3872k0614J5351J0409
8182H2403l9431j4883P386K4587m069l7402j3999K0321J4172M989j8786q933q197
8169H158J9960J4558L2757J4471l0374j0133K3434j7341l8646m651L9549j6114
8157C5628j6509M1580L1075R402m3685k2974J2083l491Q434J7986K7805J2650
8145A09984J553j0520k6281j2955R146J2669j7058k7947r518K1839K275r147r787
$$ plain form
8232 100681 70034 60471 44906 19475 18398 20739 48706 88292 86639 49428 30084 44551
8220 44551 63064 54948 45079 28481 7398 20835 47148 67581 95698 100664 77821 66355
8208 66355 49281 52744 79807 81445 47866 40251 58183 73679 75365 56369 54008 52839 28617
8195 28617 33336 33942 44740 53107 70550 73503 56602 103245 111129 77257 56643 71994 82403
8182 82403 42972 28089 35475 60062 55993 18591 4592 24913 39085 44074 25288 16355 8158
8169 8158 28118 42676 75433 89904 59530 49397 72831 55490 16844 12193 51742 35628
8157 35628 19119 60699 91774 101176 57491 34517 46600 43109 51543 69529 97334 109984
8145 109984 111537 101017 74736 61781 70927 83596 66538 38591 29073 50912 53187 44040 34253
8132C4253j8591R457K2757J618J87O545J0456j8704j9965j6563Q128K2351K3467
8119F5396q815J3484k16K2369o278o685J9986n246k1838j1763k2554j5380k0608
8106A852r975P685j6379j2120K5893J3117m188K0113J3175K8978j1429r612k6167
8093B0943j9482J3301m520L49J682j7169q290m856K0365R721K8220r87Q592K552
8079E0421q510M145n645k7701K2717j5502l9685l670J7933J1979j3739m964L957
8066h264R79k3297J0558k951l578J2839J2017K1987j6719k6496l682J3659J6513
8053C565R196J0389J0495J1139J3971j9944j7010J7421j0323q085Q716J8375L964
8040E1869J685m557l881o024J6553r86J0878k1012k4719n672R660J4802m916R526
$$ plain form
8132 34253 15662 25119 47876 49494 49681 56226 66682 47978 28013 11450 19578 41929 65396
8119 65396 56581 70065 69849 92218 85940 79255 99241 93995 72157 60394 37840 22460 1852
8106 1852 -8123 -438 -16817 -28937 -3044 10073 5885 25998 39173 68151 56722 47110 20943
8093 20943 1461 14762 10242 10591 12273 -4896 -13186 -18042 2323 12044 40264 39277 47869 50421
8079 50421 41911 46056 40411 12710 35427 19925 -19760 -23430 -5497 6482 -7257 -12221 -8264
8066 -8264 -7285 -30582 -20024 -22975 -26553 -13714 -1697 20290 3571 -22925 -26607 -12948 3565
8053 3565 12761 23150 33645 44784 58755 38811 21801 39222 28899 20814 29530 47905 51869
8040 51869 53554 48997 45116 39092 55645 54659 65537 44525 19806 14134 23794 38596 33680 43206
8026D3206K7679P24r044j6157k4233j1837l4819j1396M7537K4748l0648p469Q966
8013G257Q928K2546N94j1135q758J2199K7978k6249k7841j9894P843L1285K8820
8000E3573k256k7967k0417N96J4539L3796k0346j7084m178Q351J0632r129n299
7987A4811p031K137n917M04m025J6648K561l4928K711L3137J7149P495J4488p035
7973E2605L010m767l5109k0313L673J3989j3846k0881J789J6324K1582J4577J190
7960C3823k5736l715m967j133J4165l087Q631L2824L732L674j6834l9298j2303
7947a0224J7239P81J7119K330K4531J9795j8104p137r077Q664J8134k1563M325
7934D6813J9994j1720j0666L935k1162r401L6197K6987k4225P060N265j7870m2586
$$ plain form
8026 43206 70885 71609 62565 46408 22175 10338 -24481 -35877 11660 36408 5760 -1709 7257
8013 7257 16185 38731 39325 28190 19432 31631 59609 33360 5519 -14375 -6532 24753 53573
8000 53573 51317 23350 2933 3529 18068 51864 31518 14434 10256 18607 29239 20110 14811
7987 14811 7780 9917 4000 4404 379 17027 19588 -15340 -12629 20508 37657 45152 59640 52605
7973 52605 55615 50848 15739 -4574 -901 13088 -758 -21639 -19850 -3526 18056 32633 33823
7960 33823 8087 4372 -595 -1728 12437 9350 17981 50805 54537 58211 41377 2079 -10224
7947 -10224 7015 7796 24915 27245 51776 71571 53467 46330 37253 45917 64051 42488 46813
7934 46813 66807 55087 44421 48356 27194 17793 53990 80977 56752 63812 69077 51207 8621
7921H621k1485k2938K7332L0644j083Q196J0041j904J3987K14l1783J194K1938
7908D2974Q016o260k0217L944j384l4305j1213L040K029k263L0448J3839J8342
7895D6990q029k7662k2515K4368M3883K5325J18j5483l3556l3099L6J3811k347
7882A1840K94K4593O228k2759k6568j5294L6676L5372J1388k7935K914K1326L544
7869F1619j3288p248J2881j8670j1865p430L3086M963j4866j3963k3991r986K0512
7856A1754k3884j498J9889R7J0546j2027j531Q632K8014J4063R219j1180m2988
7843I106k7319K88J3618j3949J5382J9724j4919K1137j8384k1275J2678K9301
7831B5388K1284o063k1201J2610L856k2867P240J2212r40J27R179J5819k4302
$$ plain form
7921 8621 -12864 -35802 -8470 22174 21091 29287 39328 37424 51411 51625 19842 21036 42974
7908 42974 50990 44730 24513 28457 27073 -7232 -18445 -15405 -13376 -15639 14809 28648 46990
7895 46990 38961 11299 -11216 13152 57035 82360 82478 66995 33439 340 376 14187 11840
7882 11840 12134 36727 42955 20196 -6372 -21666 15010 50382 61770 33835 36749 58075 61619
7869 61619 48331 41083 53964 35294 23429 15999 49085 54048 39182 25219 1228 -8758 11754
7856 11754 -12130 -13628 6261 6358 16904 4877 3346 11978 39992 54055 63274 52094 9106
7843 9106 -18213 -17925 -4307 -18256 -2874 16850 1931 23068 4684 -16591 -3913 25388
7831 25388 46672 40609 19408 32018 35874 13007 20247 32459 31519 31646 40825 56644 32342
7818C2342l5218N100L0334n168O23O238K1519l448J4844r002k1666k734K5453
7805E9217j2104k4488j0803J2911J4467n286K0395R233j4655k2803j5350R803
7793B0537K1001L595n194p808J1289j1190M747J2384l754l421j4987j986J84j3979
7779A1418j2556o217k077J9145J5216J357K413q120J7289o375l966Q212j9429
7766A6310m578j4919k8490j6758l583J7598R22j2610M505L2512J7788Q463k97
7753A6863J2384p831j8610r194k234J3870K2939n809j8732L494P82k0404r454
7740b1936R269M834m501p956K2206k65P559L0004n118l3618k0492K2489l826j4689
7726a6040N33Q232J4776K8160o993j3224j1980l0297k188K0197L1070J9538N228
$$ plain form
7818 32342 -2876 2224 32558 27390 28013 34251 55770 52322 67166 58164 36498 33764 59217
7805 59217 47113 22625 11822 24733 39200 33914 54309 63542 48887 26084 10734 20537
7793 20537 41538 45133 39939 32131 43420 32230 36977 49361 45607 42186 27199 25213 25397 11418
7779 11418 -1138 -7355 -9432 9713 24929 26286 28699 20579 37868 31493 27527 35739 16310
7766 16310 11732 -3187 -31677 -48435 -52018 -34420 -33498 -46108 -41603 -9091 8697 17160 16863
7753 16863 29247 21416 2806 -6388 -8622 5248 28187 22378 3646 7140 7922 -12482 -21936
7740 -21936 -12667 -7833 -12334 -20290 1916 1651 9210 39214 34096 478 -20014 2475 -1351 -16040
7726 -16040 -15507 -7275 7501 35661 28668 15444 3464 -26833 -29021 -8824 22246 41784 47012
7713D7012n189j870n791j3507p386j942N543M369l370J3138P021k9933O105J1176
7699B5376K206J2772J3902k908j1053m2385j7874l588J9999j6771K05M7459K6695
7686E4035j1430j6715j0223J3942k082l88J2522j873l2853o609J4718J6127j5835
7673A3336l6483m386K0469L858j2629K2653J6249j1461q781j0309J0176j0808
7661h116j6406j2239K5771K0229j328j6841L836q714K146k2748K5776K7170k1322
7648b786J5274p965j0667J099k5972O242J9468K3338j8612j6757J7857O569j5367
7635h279k1417k174J3500J1778r021N368J5735q164j3375m711p009J5953J4707
7622B891l905l913j8208p439m819j6070J2063J2806K4613n225j1458K287M3314
$$ plain form
7713 47012 41823 39953 34162 20655 13269 11327 16870 21239 17869 31007 38028 8095 14200 25376
7699 25376 27582 40354 54256 51348 40295 -2090 -19964 -23552 -3553 -20324 -20119 27340 54035
7686 54035 42605 25890 15667 29609 27527 27139 39661 37788 4935 -1674 13044 29171 13336
7673 13336 -23147 -27533 -7064 -3206 -15835 6818 23067 11606 2825 -7484 2692 -8116
7661 -8116 -24522 -36761 -10990 9239 7911 -8930 -5094 -13808 -11662 -34410 -8634 18536 -2786
7648 -2786 12488 4523 -6144 -5045 -31017 -24775 -5307 18031 -581 -17338 519 7088 -8279
7635 -8279 -29696 -31870 -18370 -6592 -15613 -10245 5490 -2674 -16049 -20760 -27769 -11816 2891
7622 2891 -1014 -4927 -23135 -30574 -35393 -51463 -39400 -26594 -1981 -7206 -18664 -16377 26937
7609B6937J1619k4566K633J4088j8074k590k2661n521m243P54Q775N66k456m829
7595a9568K7550n391K1713q805j8229n740P924j2755j1142m911L837L455K4526
7582B464q435j9230m597R827J628M0039K7695q137j1183J4855k1421p759m483
7569A1263k6318Q690J1956j411j5753k0640J2974k167k7589K3719J19j0903k74
7556c6334l1733J79M0785K7185j0850P754J177j7762L2164K3519j3624j3837k2547
7543a3924n565J7872m60j9732m681L6725J8015j0779l067L211k869O970J7350
7530C9066J0644j0482j3295m969j52k3560J1520j3433J4910J0490j7429j5586
7518a2276n284K7584j965j5364N326j2836k788o704J6438L938k328K0204K621
$$ plain form
7609 26937 38556 13990 16623 30711 12637 10047 -12614 -18135 -22378 -21624 -12849 -12283 -14739 -19568
7595 -19568 7982 2591 24304 15499 -2730 -8470 -546 -13301 -24443 -29354 -25517 -22062 2464
7582 2464 -5971 -25201 -29798 -19971 -18343 21696 49391 41254 30071 44926 23505 15746 11263
7569 11263 -15055 -6365 5591 4180 -11573 -32213 -19239 -21406 -48995 -25276 -25157 -36060 -36334
7556 -36334 -68067 -67888 -27103 82 -10768 -3014 -1837 -19599 12565 36084 22460 8623 -13924
7543 -13924 -19489 -1617 -2077 -21809 -26490 10235 28250 17471 14404 17615 14746 21716 39066
7530 39066 49710 39228 25933 20964 20812 -2748 8772 -4661 10249 20739 3310 -12276
7518 -12276 -17560 10024 8059 -7305 -1979 -14815 -17603 -24307 -7869 -3931 -6259 13945 16566
7505A6566l8287O41L7756J3112l205k4872k9759j1281J7183K8895P779j3906Q320
7492H942n377l539j145j1532J8592Q241l5746J080k74O288J4416m544m919l432
7478a2949K4506J7496k4321j7548l0118m04M244L2801J3220j3618k5803L292J2917
7465a6285J4776K764m398J4987r108J3143J4612k3071k4218j0987j154j5943k232
7452d7114L977M026J6902n450j2839N98Q202J7784Q591J2803L1880M310k6846
7439A6824m594L6941J9439o104j6606m9631n2951M315K0508L9050J7664J3030
7427C7885J894n383O651j4412k7118J7939l512k9585M296K9467n805j8703j8871
7414b5257p980o195Q22j1952J0582M2979K0417j845J0399k1993j1219m612j4462
$$ plain form
7505 16566 -21721 -21080 16676 29788 26583 1711 -28048 -39329 -22146 6749 14528 622 8942
7492 8942 3565 26 -1119 -12651 5941 14182 -21564 -20484 -20758 -14470 -54 -4598 -9517 -12949
7478 -12949 11557 29053 4732 -12816 -42934 -43338 -39094 -6293 6927 -6691 -32494 -29202 -16285
7465 -16285 -1509 1255 -3143 11844 2736 15879 30491 7420 -16798 -27785 -28939 -44882 -47114
7452 -47114 -43137 -39111 -22209 -27659 -40498 -39900 -31698 -13914 -5323 7480 39360 43670 16824
7439 16824 12230 49171 68610 62506 45900 -3731 -56682 -52367 -31859 7191 24855 37885
7427 37885 39779 34396 41047 26635 -483 17456 13944 -15641 -11345 18122 12317 -6386 -25257
7414 -25257 -33237 -39432 -38610 -50562 -39980 2999 23416 21571 31970 9977 -1242 -5854 -20316
7401b0316M580L4352p180k0003K0545R936p737k0379L395J0662J0823k2087j6979
7388b0388K6390J5086j3582L166J1578J0571l809j5578N474j881j9386j1163K647
7375a0875o303k355j5452J6767L709j0086o340J9523J9239l3813k3574o952O446
7362e0066J3846r607J2126P279M173J0716J3257L2254Q171Q809l7816p744J914
7349G312P155j3826o967P957N558j5683P574p062K298K301Q71J915k097j0375
7335a3069j706J880L8828J2570j4175k5641K160L7493K538p682q189p843k6572
7322i408j3628j4878J089K7753K7545k7750k4198J2828J6529K801l231n196M964
7309d780p545j6328J711L9522j1034k8207j8714L682J7629k953o967j4154J0820
$$ plain form
7401 -20316 -15736 18616 11436 -8567 11978 21914 14177 -6202 -2807 7855 18678 -3409 -20388
7388 -20388 6002 21088 7506 10672 22250 32821 29012 13434 18908 17027 -2359 -13522 -10875
7375 -10875 -17178 -19533 -34985 -18218 -14509 -24595 -30935 -11412 7827 -25986 -49560 -56512 -50066
7362 -50066 -36220 -45827 -33701 -26422 -22249 -11533 1724 33978 42149 50958 13142 5398 7312
7349 7312 14467 641 -6326 1631 7189 -8494 -920 -7982 -5684 -3383 -2512 -597 -2694 -13069
7335 -13069 -14775 -12895 25933 38503 24328 -1313 847 38340 40878 33196 25007 17164 -9408
7322 -9408 -23036 -37914 -36825 -9072 18473 -9277 -33475 -20647 -4118 -1317 -4548 -9744 -4780
7309 -4780 -12325 -28653 -26942 12580 1546 -26661 -45375 -41693 -24064 -27017 -33984 -48138 -37318
7296c7318k631j5775J0564J9669K1167L1469L0888l7093j7659L959p456J9805
7284A9589K8457N815N365k86q415j7029N96q748j2868j4003J5987N702j0240J6473
7270B6395O666j5891O180j1397j554q873k601l0041j4339J3719J0291o191L8116
7257A0480q260j8827j3690j2382J7605n57j9242Q835k895n742P343o713q56q589
7243e3490j1828L3059N071L38N816N3255K1230J0043J2233k0139k4030l9634Q42
7230g234n796M291J1312r958L453J019j523L407R055J9653L913k4597p823j1419
7216a2247p382j1377N524K0276n266r434j736q474J5481o349p602L655J3686o56
7202a1901k0055L8797L0300j9743K1965K3515j0555j3230j3749k0348K5556M951
$$ plain form
7296 -37318 -39949 -55724 -45160 -25491 -4324 27145 58033 20940 3281 7240 -216 19589
7284 19589 48046 53861 59226 58940 50525 33496 34092 25344 12476 -1527 14460 20162 9922 26395
7270 26395 33061 17170 23350 11953 10399 1526 -1075 -31116 -45455 -31736 -21445 -27636 10480
7257 10480 2220 -16607 -30297 -42679 -25074 -25631 -44873 -36038 -38933 -44675 -37332 -44045 -44901 -53490
7243 -53490 -65318 -32259 -27188 -26850 -21034 32221 53451 63494 75727 55588 31558 -8076 -7234
7230 -7234 -13030 -8739 2573 -7385 -3932 -2913 -4436 -1029 8026 27679 31592 6995 -828 -12247
7216 -12247 -19629 -31006 -25482 -5206 -10472 -19906 -21642 -30116 -14635 -20984 -28586 -24931 -11245 -11901
7202 -11901 -31956 6841 37141 17398 39363 62878 52323 39093 25344 4996 30552 35503
7190C5503k9155l41K2980K205j3235n919o761j3295K9780K0753j239J5024J2413
7177F8713r428k6074k2260J365k7054k3796j396R410K3397J3937j9583J3771j2026
7164a1024j0464j7277j5452J2247N810K1147L0073l765j106K6035n082k3029k2667
7151a4554o592q063j1369n123N829K1958L783N586j570k152O036l504J9803j8926
7137h858o505P112o222q747l110k1144q90j203J5013L610J2508j1525P322L910
7123a8729l440O431R578j4527j2991O427J1391J6010J4800P177j0744p783K7824
7110C1424j931l7191l1394j3999K2582l60K7820K2478k0616k2074R316J7715J7714
7097B1484j460j9602j0870r400k3900m044J6904R968J8049n596q882j6363Q255
$$ plain form
7190 35503 6348 6007 28987 31192 17957 12038 5277 -8018 21762 42515 41276 56300 68713
7177 68713 59285 33211 10951 12316 -14738 -38534 -39930 -30520 -7123 6814 -12769 1002 -11024
7164 -11024 -21488 -38765 -54217 -41970 -36160 -15013 15060 11295 10189 36224 31142 8113 -14554
7151 -14554 -21146 -29209 -40578 -45701 -39872 -17914 -14131 -8545 -10115 -12267 -6231 -9735 10068 -8858
7137 -8858 -15363 -8251 -14473 -23220 -26330 -47474 -48364 -49567 -34554 -30944 -18436 -29961 -22639 -18729
7123 -18729 -22169 -15738 -6160 -20687 -33678 -27251 -15860 150 14950 22127 11383 3600 31424
7110 31424 29493 -7698 -39092 -53091 -30509 -30869 -3049 19429 -1187 -23261 -13945 3770 21484
7097 21484 20024 422 -10448 -19848 -43748 -47792 -30888 -20920 -2871 -8467 -17349 -33712 -25457
7084b5457L1976L2512k726j8459j7761K8541L256j2012N301k039N118j3123J6843
7071C1970k612k5259k9745o524J289j91j5237M880J3282L0568J5565k3914k5182
7058c1110j7576j021K8438J7919j8275n287L951p787j8623k183K1823K5786O773
7045B828q111J6796o747R882J2154j4652J4312K2607r784o714l0957P207J1868
7032B0689k4741j3574j0908n329p749N455L094J8557q170k1711q171m758N407
7019e1909Q321J4574j0433N3255J1880k8110l6289j3471K7620J0336j4536j2463
7007d1225L0060O482k7171j6845q419J6409N688k374K685j682J6247K1307l503
6994b341K3010j5760l8655O041l654K2459O965J4529J0757k7403M170Q788K2529
$$ plain form
7084 -25457 6519 39031 36305 17846 85 28626 31882 19870 25171 23132 28250 15127 31970
7071 31970 29358 4099 -25646 -32170 -30881 -31072 -46309 -41429 -28147 2421 17986 -5928 -31110
7058 -31110 -48686 -49707 -21269 -3350 -21625 -26912 -22961 -30748 -49371 -51554 -29731 -3945 2828
7045 2828 -5283 11513 4766 14648 26802 12150 26462 49069 39285 32571 1614 8821 20689
7032 20689 -4052 -17626 -28534 -33863 -41612 -36157 -33063 -14506 -22676 -44387 -52558 -57316 -51909
7019 -51909 -43588 -29014 -39447 13808 25688 -2422 -38711 -52182 -24562 -14226 -28762 -41225
7007 -41225 -11165 -4683 -31854 -48699 -57118 -40709 -35021 -37395 -34710 -36392 -20145 1162 -2341
6994 -2341 20669 4909 -33746 -27705 -31359 -8900 -1935 12594 23351 -4052 118 8906 31435
6981C1435J331j5701J870j4851n600R204j64j1l862Q587l1418k1868K6706L3315
6967A8973J378j4558l5403k9221J3586J1377o811M755K4364k5305j0323K2282
6955b4906L1241k456j0879q499k2893Q60K2598J2944Q434K3890l93J776m825k1967
6941D925k9402J7448l099o370k8903r97P445j059L1114m296j5862J768P429N031
6927a4828Q295O08j7276J0028J2757k3056k1106J4782J8784M399L0450J612k8644
6914c195J3276J0081j0781j3105L541q777k0161J6957N263j5246j1144k1882J5021
6901d0152P632m89R466J2850J1143n419J4385k624j0393m555l4920R39M2193J0880
6887A0936k206j4885M418l392k8681K904Q643q156L056K3894J9203K353J7959
$$ plain form
6981 31435 32766 17065 18935 4084 -1516 7688 7524 7513 3651 12238 -19180 -41048 -14342 18973
6967 18973 20351 5793 -29610 -58831 -45245 -33868 -40679 -35924 -11560 -36865 -47188 -24906
6955 -24906 6335 3879 -7000 -15499 -38392 -37532 -14934 -1990 6444 30334 29941 31717 26892 4925
6941 4925 -24477 -7029 -10128 -16498 -45401 -46398 -38953 -40012 -8898 -13194 -29056 -27288 -19859 -14828
6927 -14828 -6533 -5925 -23201 -13173 -416 -23472 -44578 -29796 -11012 -6613 23837 25449 -3195
6914 -3195 10081 20162 9381 -3724 -183 -8960 -29121 -12164 -6901 -22147 -33291 -55173 -40152
6901 -40152 -32520 -33009 -23543 -10693 450 -4969 9416 6792 -3601 -8156 -43076 -42137 56 10936
6887 10936 8730 -6155 -1737 -5129 -33810 -30906 -22263 -30419 -27363 -3469 15734 18087 36046
6874C6046K798m3033j8532j8366j0457J4533K0198J542j725K5203L6787J196k7970
$$ plain form
6874 36046 38844 -4189 -22721 -41087 -51544 -37011 -16813 -15271 -16996 8207 44994 46190 18220
$$ [...]
##END NTUPLES=NMR SPECTRUM
##END=
