##TITLE=Analysis number 323723
Compound Code cc 32716
Book Reference 488/126
Project Code adrs
Chemist Name miguelg
##JCAMPDX= 6.0         $$ Bruker NMR JCAMP-DX V2.0
##DATA TYPE= NMR SPECTRUM
##DATA CLASS= NTUPLES
##ORIGIN= Bruker BioSpin GmbH
##OWNER= nmr
$$ XWIN-NMR		Version 3.5
$$ Fri Nov  3 15:57:05 2006 GMT Standard Time (UT+0h)  MAYBRIDGE\nmr@NMR_250MHZ
##.OBSERVE FREQUENCY= 250.131544655141
##.OBSERVE NUCLEUS= ^1H
##.ACQUISITION MODE= SIMULTANEOUS (DQD)
##.ACQUISITION SCHEME= undefined
##.AVERAGES= 16
##.DIGITISER RES= 18
##SPECTROMETER/DATA SYSTEM= dpx250
##.PULSE SEQUENCE= zg30
##.SOLVENT NAME= CDCl3
##.SHIFT REFERENCE= (INTERNAL, CDCl3, 0, 16.522)
##AUDIT TRAIL= $$ (NUMBER, WHEN, WHO, WHERE, WHAT)
$$ ##TITLE= Audit trail, XWIN-NMR		Version 3.5
$$ ##JCAMPDX= 5.01
$$ ##ORIGIN= Bruker BioSpin GmbH
$$ ##OWNER= nmr
$$ C:\u/data/dgb/nmr/ADRS/2220/pdata/1/auditp.txt
$$ ##AUDIT TRAIL=  $$ (NUMBER, WHEN, WHO, WHERE, WHAT)
(   1,<2006-11-03 15:56:41.75 +000>,<MAYBRIDGE\nmr>,<NMR_250MHZ>,
      <created by zg, POWCHK disabled, PULCHK disabled
       configuration hash MD5:
       49 4B E0 1D 92 C2 6B 37 9F E6 65 BC 52 41 86 1D
       data hash MD5: 64K
       38 1D D5 1E C3 6C 78 5E 33 38 61 F4 2E 94 28 BE>)
(   2,<2006-11-03 15:56:54.70 +000>,<MAYBRIDGE\nmr>,<NMR_250MHZ>,
      <Start of raw data processing
       ef LB = 0.3 FT_mod = 6 PKNL = 1 SI = 32K 
       data hash MD5: 32K
       67 DC 04 B2 D3 13 3F A5 F4 90 15 14 B1 8E 67 9C>)
(   3,<2006-11-03 15:56:56.42 +000>,<MAYBRIDGE\nmr>,<NMR_250MHZ>,
      <apk 
       data hash MD5: 32K
       D7 AC DF AF 10 E9 A5 87 20 F8 A3 CB B2 09 5F D3>)
(   4,<2006-11-03 15:56:57.20 +000>,<MAYBRIDGE\nmr>,<NMR_250MHZ>,
      <abs ABSG = 5 
       data hash MD5: 32K
       B0 99 D5 FF 0C 11 79 A1 A8 8B 88 EF 38 95 70 15>)
$$ ##END=
$$ 
$$ hash MD5
$$ CD 07 31 AA D8 DC EB DF 4B C2 FE BF 6C E7 1F 24
##$RELAX= 
##$RELAX= 
##$RELAX= 
##$RELAX= 
##$RELAX= 
##$RELAX= 
##$RELAX= 
$$ Bruker specific parameters
$$ --------------------------
##$DU= <C:\u>
##$EXPNO= 2220
##$NAME= <ADRS>
##$PROCNO= 1
##$TYPE= <nmr>
##$USER= <dgb>
##$AMP= (0..31)
100 100 100 100 100 100 100 100 100 100 100 100 100 100 100 100 100 100 
100 100 100 100 100 100 100 100 100 100 100 100 100 100 
##$AQSEQ= 0
##$AQ_mod= 3
##$AUNM= <au_zg>
##$AUTOPOS= <38 >
##$BF1= 250.13
##$BF2= 250.13
##$BF3= 250.13
##$BF4= 250.13
##$BF5= 500.13
##$BF6= 500.13
##$BF7= 500.13
##$BF8= 500.13
##$BYTORDA= 1
##$CFDGTYP= 0
##$CFRGTYP= 5
##$CHEMSTR= <none>
##$CNST= (0..31)
1 1 145 1 1 1 1 1 1 1 1 1 1 1 1 1 1 1 1 1 1 1 1 1 1 1 1 1 1 1 1 1 
##$CPDPRG= <>
##$CPDPRG1= <>
##$CPDPRG2= <>
##$CPDPRG3= <>
##$CPDPRG4= <mlev>
##$CPDPRG5= <mlev>
##$CPDPRG6= <mlev>
##$CPDPRG7= <mlev>
##$CPDPRG8= <mlev>
##$CPDPRGB= <>
##$CPDPRGT= <>
##$D= (0..31)
0 1 0 0 0 0 0 0 0 0.06 0 0 0 0 0 0 0.0002 0 0 0 0 0 0 0 0 0 0 0 0 0 0 
0 
##$DATE= 1162569400
##$DBL= (0..7)
120 120 120 120 120 120 120 120 
##$DBP= (0..7)
150 150 150 150 150 150 150 150 
##$DBP07= 0
##$DBPNAM0= <>
##$DBPNAM1= <>
$$ [...]
##$SUBNAM7= <"">
##$SUBNAM8= <"">
##$SUBNAM9= <"">
##$SW= 20.6930455092707
##$SWIBOX= (0..15)
0 0 3 0 0 0 0 0 0 0 0 0 0 0 0 0 
##$SW_h= 5175.983436853
##$TD= 65536
##$TD0= 1
##$TE= 683.16
##$TE2= 300
##$TE3= 300
##$TEG= 300
##$TL= (0..7)
0 120 120 120 120 120 120 120 
##$TP= (0..7)
150 150 150 150 150 150 150 150 
##$TP07= 0
##$TPNAME0= <>
##$TPNAME1= <>
##$TPNAME2= <>
##$TPNAME3= <>
##$TPNAME4= <>
##$TPNAME5= <>
##$TPNAME6= <>
##$TPNAME7= <>
##$TPOAL= (0..7)
0.5 0.5 0.5 0.5 0.5 0.5 0.5 0.5 
##$TPOFFS= (0..7)
0 0 0 0 0 0 0 0 
##$TUNHIN= 0
##$TUNHOUT= 0
##$TUNXOUT= 0
##$USERA1= <user>
##$USERA2= <user>
##$USERA3= <user>
##$USERA4= <user>
##$USERA5= <user>
##$V9= 5
##$VALIST= <valist>
##$VCLIST= <CCCCCCCCCCCCCCC>
##$VD= 0
##$VDLIST= <DDDDDDDDDDDDDDD>
##$VPLIST= <PPPPPPPPPPPPPPP>
##$VTLIST= <TTTTTTTTTTTTTTT>
##$WBST= 1024
##$WBSW= 4
##$XGAIN= (0..3)
0 0 0 0 
##$XL= 0
##$YL= 0
##$YMAX_a= 534954
##$YMIN_a= -422910
##$ZGOPTNS= <>
##$ZL1= 120
##$ZL2= 120
##$ZL3= 120
##$ZL4= 120
##$ABSF1= 16.522
##$ABSF2= -4.171173
##$ABSG= 5
##$ABSL= 3
##$ALPHA= 0
##$AQORDER= 0
##$ASSFAC= 0
##$ASSFACI= 0
##$ASSFACX= 0
##$ASSWID= 0
##$AUNMP= <proc_1d>
##$AZFE= 0.1
##$AZFW= 0.1
##$BCFW= 0
##$BC_mod= 0
##$BYTORDP= 0
##$COROFFS= 0
##$CY= 12.5
##$DATMOD= 1
##$DC= 0
##$DFILT= <>
##$DTYPP= 0
##$F1P= 14.0000005364418
##$F2P= -0.99999901652339
##$FCOR= 0.5
##$FTSIZE= 32768
##$FT_mod= 6
##$GAMMA= 0
##$GB= 0
##$INTBC= 1
##$INTSCL= 1
##$ISEN= 128
##$LB= 0.3
##$LEV0= 0
##$LPBIN= 0
##$MAXI= 10000
##$MC2= 0
##$MEAN= 0
##$ME_mod= 0
##$MI= 0
##$NCOEF= 0
##$NC_proc= -5
##$NLEV= 6
##$NOISF1= 0
##$NOISF2= 0
##$NSP= 0
##$NTH_PI= 0
##$NZP= 0
##$OFFSET= 16.522
##$PC= 1
##$PHC0= -37.38991
##$PHC1= 3.367008
##$PH_mod= 1
##$PKNL= yes
##$PPARMOD= 0
##$PSCAL= 4
##$PSIGN= 0
##$REVERSE= no
##$SF= 250.13
##$SI= 32768
##$SIGF1= 0
##$SIGF2= 0
##$SINO= 400
##$SIOLD= 32768
##$SREGLST= <1H.CDCl3>
##$SSB= 0
##$STSI= 32768
##$STSR= 0
##$SW_p= 5175.98343685301
##$SYMM= 0
##$S_DEV= 0
##$TDeff= 65536
##$TDoff= 0
##$TI= <Analysis number 999999
Compound Code 99
Book Reference 9
Project Code 9>
##$TILT= no
##$TM1= 0
##$TM2= 0
##$TOPLEV= 0
##$USERP1= <user>
##$USERP2= <user>
##$USERP3= <user>
##$USERP4= <user>
##$USERP5= <user>
##$WDW= 1
##$XDIM= 32768
##$YMAX_p= 405869391
##$YMIN_p= -1313258
$$ End of Bruker specific parameters
$$ ---------------------------------
##NTUPLES= NMR SPECTRUM
##VAR_NAME=  FREQUENCY,     SPECTRUM/REAL,   SPECTRUM/IMAG
##SYMBOL=    X,             R,               I
##VAR_TYPE=  INDEPENDENT,   DEPENDENT,       DEPENDENT
##VAR_FORM=  AFFN,          ASDF,            ASDF
##VAR_DIM=   32768,         32768,           32768
##UNITS=     HZ,            ARBITRARY UNITS, ARBITRARY UNITS
##FACTOR=    0.157963299565203, 1,           1
##FIRST=     4132.6476996994, 0,             0
##LAST=      -1043.33573715361, 0,           0
##MIN=       -1043.33573715361, -1313258,    0
##MAX=       4132.6476996994, 405869391,     0
$$ Real data points
##PAGE= N=1
##DATA TABLE= (X++(R..R)), XYDATA
$$ [...]
##PAGE= N=2
##DATA TABLE= (X++(I..I)), XYDATA
22296E502704P8400J62551O8822K94928M14153l10532k23569P6307j5417J57113
$$ 5502704 5581104 5743655 5812477 6107405 6521558 6211026 5987457 6063764 6048347 6205460
22286F205460J68788j16816j85154j0977J25670j04558L7830j76921L2011K67622
$$ 6205460 6374248 6257432 6072278 6061301 6186971 6082413 6120243 5943322 5975333 6242955
22276F242955k4405m75176j85257J89370L75323M06634k26779n5010J04863J82938
$$ 6242955 6218550 5743374 5558117 5747487 6122810 6529444 6302665 6247655 6352518 6535456
22266F535456J5555L1634k58944m03244m35871J00478L59483k33358R2669K24549
$$ 6535456 6551011 6582645 6323701 5920457 5484586 5585064 5944547 5711189 5803858 6028407
22256F028407k34176l25517J06180O18310k9852j09278p827k47946m6946m23206
$$ 6028407 5794231 5468714 5574894 6193204 6163352 6054074 6046247 5798301 5751355 5328149
22246E328149j8201P2446R681K79227K05294n6795M31196J24214r3990m01833
$$ 5328149 5309948 5382394 5392075 5671302 5876596 5819801 6250997 6375211 6281221 5879388
22236E879388K43936O27309j32526l14330k82696K66610K4090m17092m27420l32135
$$ 5879388 6123324 6750633 6618107 6303777 6021081 6287691 6311781 5894689 5467269 5135134
22226E135134Q8267P692K07810K35419L2595j81371J21306K55669k3442j33645
$$ 5135134 5223401 5231093 5438903 5674322 5706917 5525546 5646852 5902521 5879079 5745434
22216E745434J22828j6294L15049K37411l21087j19135n7966P0914J76234k35330
$$ 5745434 5868262 5851968 6167017 6404428 6083341 5964206 5906240 5977154 6153388 5918058
22206E918058M56457N1512r580L63581p8464j50965j40718l65352m01283J03907
$$ 5918058 6374515 6426027 6416447 6780028 6701564 6550599 6409881 6044529 5643246 5747153
22196E747153J25841k10591L3327K8026J55147L53564J32949J02866j06212l20472
$$ 5747153 5872994 5662403 5695730 5723756 5878903 6232467 6365416 6468282 6362070 6041598
22186F041598k4415k93668q744N57810J52881J26222R3017j73468j05271j23112
$$ 6041598 6017183 5723515 5714771 6272581 6425462 6551684 6644701 6471233 6365962 6242850
22176F242850j3841J5065j66106J50320K42222j93753k35899k17387p1335J22359
$$ 6242850 6229009 6244074 6077968 6228288 6470510 6276757 6040858 5823471 5752136 5874495
22166E874495Q3470p0145k99662R58Q1289Q9545P599L47604j44186k90162n3883
$$ 5874495 5957965 5887820 5588158 5589116 5670405 5759950 5767549 6115153 5970967 5680805 5626922
22155E626922K59738L31947j63826m5149M90490L39265j72074k45119k4986J57437
$$ 5626922 5886660 6218607 6054781 6009632 6500122 6839387 6667313 6422194 6397208 6554645
22145F554645J52858j33474K7725L9393k08744l30582j94199j46925K88113L05104
$$ 6554645 6707503 6574029 6601754 6641147 6432403 6101821 5907622 5760697 6048810 6353914
22135F353914m48799l84670L64880L86284p4359j32497p785J17360l19946j99072
$$ 6353914 5905115 5520445 5885325 6271609 6197250 6064753 6056968 6174328 5854382 5655310
22125E655310J41450L10454L34937Q434J78300Q8862p8085p8978J4304m3203m0680
$$ 5655310 5796760 6107214 6442151 6450585 6628885 6717747 6639662 6560684 6574988 6531785 6491105
22114F491105j84487J5371J46161L13726l8639l02177l19832O0319j29543K2607
$$ 6491105 6306618 6321989 6468150 6781876 6743237 6441060 6121228 6181547 6052004 6074611
22104F074611J00071o6765k28674p0642L2281K00716J53839k82710j66820J83743
$$ 6074611 6174682 6107917 5879243 5808601 5840882 6041598 6195437 5912727 5745907 5929650
22094E929650J93148L2252j17994J06644K16353l2733l67511m60606J8485k5079
$$ 5929650 6122798 6155050 6037056 6143700 6360053 6327320 5959809 5499203 5517688 5492609
22084E492609L71886N10921L89921k96698m95158P4807J50420M74830j23943k95701
$$ 5492609 5864495 6375416 6765337 6468639 5973481 6048288 6198708 6673538 6549595 6253894
22074F253894j78195p9781K29719L21196j66113k98792j02354P7079L0306K47600
$$ 6253894 6075699 5995918 6225637 6546833 6380720 6081928 5979574 6056653 6086959 6334559
22064F334559j19285M9463K98015k7502j24983j7934k26976m16296P2817L41129
$$ 6334559 6215274 6264737 6562752 6535250 6410267 6392333 6165357 5749061 5821878 6163007
22054F163007K07874M15565N3401r1808o59817j33005K01406J31849K95377K79921
$$ 6163007 6370881 6786446 6839847 6748039 6088222 5955217 6156623 6288472 6583849 6863770
22044F863770n35168m38521M39390K32423k41904m84943J20287M73808m7536l3387
$$ 6863770 6328602 5890081 6329471 6561894 6319990 5835047 5955334 6429142 6381606 6348219
22034F348219K05832p6040j62399K35785l1558j2738k21506j31387M3711K41979
$$ 6348219 6554051 6478011 6315612 6551397 6519839 6507101 6285595 6154208 6197919 6439898
22024F439898J18150P7155m43292J22128K01110k25762o6123J27958J36442l6889
$$ 6439898 6558048 6635203 6191911 6314039 6515149 6289387 6223264 6351222 6487664 6450775
22014F450775O2148j55547m36766j97494L33534M41605J4491L43218J99272j60251
$$ 6450775 6512923 6357376 5920610 5723116 6056650 6498255 6512746 6855964 7055236 6894985
22004F894985o72906k97033N0615L3655j22599k20098K30581L25324n7083K18844
$$ 6894985 6222079 5925046 5975661 6009316 5886717 5666619 5897200 6222524 6165441 6384285
21994F384285Q2943K6793p7220J48883p4182m02634l46485M07175M84492O4697
$$ 6384285 6467228 6494021 6416801 6565684 6491502 6088868 5742383 6149558 6634050 6698747
21984F698747j41119J53694l64610l83086M131K56170K3533K77149L7769m71674
$$ 6698747 6557628 6711322 6346712 5963626 5967757 6223927 6247460 6524609 6562378 6090704
21974F090704k31862o4381o2490k06137L43652L41273P5140j69463k03837o4143
$$ 6090704 5858842 5794461 5731971 5525834 5869486 6210759 6285899 6116436 5912599 5848456
21964E848456K86625L94710M0264j07551k27478p3330q2814K72334M9464M54507
$$ 5848456 6135081 6529791 6570055 6462504 6235026 6161696 6078882 6351216 6400680 6855187
21954F855187L0945l39796J49488m0278l27518j3282K72360j08800j03916j51615
$$ 6855187 6886132 6546336 6695824 6655546 6328028 6314746 6587106 6478306 6374390 6222775
21944F222775p3521J93570j27179j2741M16137L9705l53737j1373K18720O6182
$$ 6222775 6149254 6342824 6215645 6202904 6619041 6658746 6305009 6293636 6512356 6578538
21934F578538l38653j09326K12330k39154k16311J06874K0930r7943J35270L28341
$$ 6578538 6239885 6130559 6342889 6103735 5887424 5994298 6015228 5917285 6052555 6380896
21924F380896J38938m10350k14960Q9780K70109N26091Q1845k97974m18161L41998
$$ 6380896 6519834 6109484 5894524 5984304 6254413 6780504 6862349 6564375 6146214 6488212
21914F488212n2721k1559R0364l0638L0169J1518M5374K70696j66502J61037k2693
$$ 6488212 6435491 6413932 6504296 6473658 6503827 6515345 6560719 6831415 6664913 6825950 6803257
21903F803257l77407R184j3877P0769O5034J76707k82979l74384j700J84190J33707
$$ 6803257 6425850 6435034 6421157 6491926 6556960 6733667 6450688 6076304 6074604 6258794 6392501
21892F392501l21959p6311J59990L85717J59155l43013j30734O1408R6769J05415
$$ 6392501 6070542 5994231 6154221 6539938 6699093 6356080 6225346 6286754 6383523 6488938
21882F488938K9334j68704O2265L71127K88268l4314m38616L1411j43416k95241
$$ 6488938 6518272 6349568 6411833 6782960 7071228 7036914 6598298 6629709 6486293 6191052
21872F191052n694L45850K6160N429M1843j39169J6066R1933K81298J78665k77904
$$ 6191052 6185358 6531208 6557368 6562797 6604640 6465471 6481537 6573470 6854768 7033433 6755529
21861F755529j689K09512j32057k23971Q3826L60797r7381J68916m45849j81328
$$ 6755529 6753840 6963352 6831295 6607324 6691150 7051947 6954566 7123482 6677633 6496305
21851F496305J29314K08113k01772l87028N7536J93041J42593j02713o8992L82
$$ 6496305 6625619 6833732 6631960 6244932 6302468 6495509 6638102 6535389 6466397 6466779
21841F466779K81502m0592k40849j37961J96737K69607K30760j1262j2090n27439
$$ 6466779 6748281 6707689 6466840 6328879 6525616 6795223 7025983 7014721 7002631 6475192
21831F475192m3546M22841P3769N7613O161K74161K3933k21732j85307M3935m77666
$$ 6475192 6431646 6854487 6928256 6985869 6992030 7266191 7290124 7068392 6883085 6927020 6449354
21820F449354N0539J05190J12620J17286J81878k48861o3229J7883J22871n9005
$$ 6449354 6499893 6605083 6717703 6834989 7016867 6768006 6704777 6722660 6845531 6786526
21810F786526j173J74457k29226k17812J08449K26127n565J66671j33630m24257
$$ 6786526 6785353 6959810 6730584 6512772 6621221 6847348 6841783 7008454 6874824 6450567
21800F450567K06388K37162J36866q923J08005k21248j74385q5167J15214j54007
$$ 6450567 6656955 6894117 7030983 7022060 7130065 6908817 6734432 6649265 6764479 6610472
21790F610472j20502o2193L33593K90715Q0846J64052k91709m60069j88915j13965
$$ 6610472 6489970 6427777 6761370 7052085 7132931 7296983 7005274 6545205 6356290 6242325
21780F242325o6499j57515K26408L93316J16673q0310j1408n4194j21471J50821
$$ 6242325 6175826 6018311 6244719 6638035 6754708 6674398 6662990 6608796 6487325 6638146
21770F638146J9237k27068k87856J68517K53970m0426m7232j01200M39591L46649
$$ 6638146 6657383 6430315 6142459 6310976 6564946 6524520 6477288 6376088 6815679 7162328
21760G162328q6481Q3526L79883l18799m10025l67485j82971L3238j70457K01072
$$ 7162328 7075847 7159373 7539256 7220457 6810432 6442947 6259976 6293214 6122757 6323829
21750F323829J62283J86805M51251L88023l51927m05808j80856r1996J23064J54098
$$ 6323829 6486112 6672917 7124168 7512191 7160264 6754456 6573600 6481604 6604668 6758766
21740F758766K39849l98697j54324O72959J12138j41604k58767J099m370O5211
$$ 6758766 6998615 6599918 6445594 7118553 7230691 7089087 6830320 6831419 6827049 6892260
21730F892260J73105r5812k50554j18238R7959K47246J19292M1642k10649q3919
$$ 6892260 7065365 6969553 6718999 6600761 6698720 6945966 7065258 7106900 6896251 6812332
21720F812332p8731J41191J94842M8692k80375j50952K39499q8489l53671q3585
$$ 6812332 6733601 6874792 7069634 7118326 6837951 6686999 6926498 6838009 6484338 6400753
21710F400753J26250L49534L6808j03991j24528l3356l15838J27318q0782k44239
$$ 6400753 6527003 6876537 6913345 6809354 6684826 6651470 6335632 6462950 6382168 6137929
21700F137929l17849j2862K03518N03084L89147j37797J27939k21135J55080J50337
$$ 6137929 5820080 5807218 6010736 6513820 6902967 6765170 6893109 6671974 6827054 6977391
21690F977391N1215L8592j38213K0591J24337J77421j26595j43125N4857m19850
$$ 6977391 7028606 7067198 6928985 6949576 7073913 7251334 7124739 6981614 7036471 6616621
21680F616621l03236n7781K37014K35215J22125j90274o9903J48416N9119p7175
$$ 6616621 6313385 6255604 6492618 6727833 6849958 6659684 6589781 6738197 6797316 6720141
21670F720141J382J37579o1800K58539j20155l77414p316K79647L17897J94882
$$ 6720141 6721523 6859102 6797302 7055841 6935686 6558272 6550956 6830603 7148500 7343382
21660G343382o5643R8357l35028p8077k48577k66001R3506O4030P1733J82728
$$ 7343382 7277739 7376096 7041068 6962991 6714414 6448413 6541919 6605949 6677682 6860410
21650F860410K24215L64874m72337l10976L39277L34870R0279l15889l15704J16519
$$ 6860410 7084625 7449499 6977162 6666186 7005463 7340333 7430612 7114723 6799019 6915538
21640F915538k52430Q1471M3590M32630K28870j55261n56021J14483N90135N1364
$$ 6915538 6663108 6744579 6788169 7220799 7449669 7294408 6738387 6852870 7443005 7494369
21630G494369o3867k10268j11528J45417K64519K21675j55829n4777j0288J15850
$$ 7494369 7430502 7220234 7108706 7254123 7518642 7740317 7584488 7529711 7519423 7635273
21620G635273r8595l52070l19066J88019K95350J1825q0281K2289n7298q5597
$$ 7635273 7536678 7184608 6865542 7053561 7348911 7360736 7280455 7302744 7245446 7159849
21610G159849k98990l39506J06237J74660K69716o2167j4941K94053J61346P8301
$$ 7159849 6860859 6521353 6627590 6802250 7071966 7009799 6994858 7288911 7450257 7528558
21600G528558n5446l6337j23870j73118j44169O1664N7452j286o9051j68423o321
$$ 7528558 7473112 7436775 7312905 7139787 6995618 7057282 7114734 7113448 7044397 6875974 6869653
21589F869653n88233k04979K01639L41677L66202p5423J20723J09076k94604K42314
$$ 6869653 6281420 6076441 6278080 6619757 6985959 6910536 7031259 7140335 6845731 7088045
21579G088045k04118r1184j30482j99279K54705R1952n9252K25516K02829K32511
$$ 7088045 6883927 6792743 6662261 6462982 6717687 6809639 6750387 6975903 7178732 7411243
21569G411243k17661l14050K18482o6581R7841j48665k71649K71963K46642j22668
$$ 7411243 7193582 6879532 7098014 7031433 7129274 6980609 6708960 6980923 7227565 7104897
21559G104897k5448l2339n1235K66896J18700j77418p2051J09454K30704l23381
$$ 7104897 7079449 7047110 6995875 7262771 7381471 7204053 7132002 7241456 7472160 7148779
21549G148779k54308N2163K68164k80456j7385j93688J25756P52459K84094n0432
$$ 7148779 6894471 6946634 7214798 6934342 6916957 6723269 6849025 7601484 7885578 7835146
21539G835146j96394p060k4155l2442k03181j18840k7539m30176p2689N7535M39223
$$ 7835146 7638752 7631692 7607537 7575095 7371914 7253074 7225535 6795359 6722670 6780205 7219428
21528G219428M6311j5111j23634o15032P7778K29808k5081R6377L13546M94565
$$ 7219428 7265739 7250628 7126994 6511962 6589740 6819548 6794467 6890844 7204390 7698955
21518G698955n8528o19003K789k57624k89839k12514J23252L15682K53795N87016
$$ 7698955 7640427 7021424 7024213 6766589 6476750 6264236 6387488 6703170 6956965 7543981
21508G543981J51732j86906j26525J39104Q6842R9960J77277k65469J09513J39856
$$ 7543981 7695713 7508807 7382282 7521386 7608228 7708188 7885465 7619996 7729509 7869365
21498G869365j37143J20837k90174K6525l57203n03636J07231M32496K38375p5859
$$ 7869365 7732222 7853059 7562885 7589410 7232207 6728571 6835802 7268298 7506673 7430814
21488G430814m42620m43047q7909J94034p8670j45713L04675M01754O5790M1170
$$ 7430814 6988194 6545147 6457238 6651272 6572602 6426889 6731564 7133318 7199108 7240278
21478G240278j46894N6366J15423j76817J09979O7693J90628N14212j0019M9500
$$ 7240278 7093384 7149750 7265173 7088356 7198335 7266028 7456656 7970868 7960849 8010349
21468H010349m3357o4391L02782R0622l40707j27951j80323K38522K09937k64397
$$ 8010349 7966992 7902601 8205383 8296005 7955298 7827347 7647024 7885546 8095483 7831086
21458G831086j24580k4149n91003j48592j11622N7735J85991N08005K25400l82493
$$ 7831086 7706506 7682357 7091354 6942762 6831140 6888875 7074866 7582871 7808271 7425778
21448G425778j32728Q8944j6902j21471J0662m3183j35502j49655o4426P4213
$$ 7425778 7293050 7381994 7365092 7243621 7254283 7211100 7075598 6925943 6861517 6935730
21438F935730L66418J63903m79141j53411J79949K57476K24182J18162Q690J26333
$$ 6935730 7302148 7466051 6986910 6833499 7013448 7270924 7495106 7613268 7621958 7748291
21428G748291L56323J55802n8156k47759j98097J43212j16848q2616n4171l3130
$$ 7748291 8104614 8260416 8202260 7954501 7756404 7899616 7782768 7700152 7645981 7612851
21418G612851o3033k00213j12061n515K64201K6643J05076O7490m5321j09916
$$ 7612851 7549818 7349605 7237544 7232029 7496230 7522873 7627949 7695439 7650118 7540202
21408G540202j34710N7367J09912J42324K31899p4176O8655j85784j42145n3837
$$ 7540202 7405492 7462859 7572771 7715095 7946994 7872818 7941473 7755689 7613544 7559707
21398G559707k18206m22635K5746o9103R8409L91745K47350l19155J595J27400
$$ 7559707 7341501 6918866 6944612 6875509 6973918 7365663 7613013 7293858 7295453 7422853
21388G422853n0659Q8155l5902J95645O5101J4776k78718k51911M27118K77361
$$ 7422853 7372194 7460349 7424447 7620092 7685193 7699969 7421251 7169340 7596458 7873819
21378G873819j93478J02183m0558J59621l86622q0683R4054M87473n7280K17313
$$ 7873819 7680341 7782524 7741966 7901587 7514965 7434282 7528336 8015809 7958529 8175842
21368H175842O3751j3987l39105l1640L8036j18890M58140j22790N1581K6846
$$ 8175842 8239593 8225606 7886501 7854861 7892897 7774007 8232147 8109357 8160938 8187784
21358H187784m06819k28554J55540M95775L56819j71702J00845k61082l25733
$$ 8187784 7780965 7552411 7707951 8203726 8560545 8388843 8489688 8228606 7902873
21349G902873r1970J23440p5803j86099K3591Q015Q4293J40861J45620Q2673j48068
$$ 7902873 7810903 7934343 7858540 7672441 7696032 7704047 7788340 7929201 8074821 8157494 8009426
21338H009426J31143J10884J80583L76518K11600k33283k88412k28563j23528
$$ 8009426 8140569 8251453 8432036 8808554 9020154 8786871 8498459 8269896 8146368
21329H146368j10987q3345j27005m0758J28942k75003j42876M2550J51959j508
$$ 8146368 8035381 7952036 7825031 7784273 7913215 7638212 7495336 7537886 7689845 7688337
21319G688337j96858O4782L9460R433K23582J83730K49744J01990n38903o36900
$$ 7688337 7491479 7556261 7595721 7605154 7828736 8012466 8262210 8364200 7825297 7188397
21309G188397j22489L13360J25788M3510J74262N8158K4844L0226J67695j98625
$$ 7188397 7065908 7379268 7505056 7548566 7722828 7780986 7805830 7836056 8003751 7805126
21299G805126k69563j23290L0929K83996J39454K11338J3459k4472k2068j88157
$$ 7805126 7535563 7412273 7443202 7727198 7866652 8077990 8091449 8066977 8044909 7856752
21289G856752n54k0206k66011J68911O4472J05846J65056l609m8961L2328k15127
$$ 7856752 7856198 7835992 7569981 7738892 7803364 7909210 8074266 8070657 8021696 8054024 7838897
21278G838897l26618r560J05351P0906N70502L97472j07128k95149l34551K70511
$$ 7838897 7512279 7502719 7608070 7678976 8249478 8646950 8539822 8244673 7910122 8180633
21268H180633O0260L6983j98023P0961K23503k4570q9024k73555Q6997j5829k2235
$$ 8180633 8240893 8277876 8079853 8150814 8374317 8349747 8260723 7987168 8074165 8058336 8036101
21257H036101j89389J44147M88532j86860m29789k94609J05208O6746K71551k0502
$$ 8036101 7846712 7990859 8479391 8292531 7862742 7568133 7673341 7740087 8011638 7991136
21247G991136k17962q7740j9864K91929K90554j96309k09717j10733L52385J19634
$$ 7991136 7773174 7685434 7665570 7957499 8248053 8051744 7842027 7731294 8083679 8203313
21237H203313j00622k87097j15703p8188L15235O85887L34073l67162M9250m7979
$$ 8203313 8102691 7815594 7699891 7621703 7936938 8622825 8956898 8589736 8638986 8591007
21227H591007m07747M3551K47647P8906R0272m43239L0839M90942q8018R6833
$$ 8591007 8183260 8226811 8474458 8553364 8643636 8200397 8231236 8722178 8634160 8730993
21217H730993N971j31855j56283k20855p9600j46194J21150Q4375P6953J05372
$$ 8730993 8736964 8605109 8448826 8227971 8148371 8002177 8123327 8207702 8284655 8390027
21207H390027l90625k1529K65603o8278J05826M31233r7737r1248L8625k10196
$$ 8390027 7999402 7977873 8243476 8175198 8281024 8712257 8614520 8523272 8561897 8351701
21197H351701j76704n7607k99512j19682l46014J56324K93381J17738j0244L01120
$$ 8351701 8174997 8117390 7817878 7698196 7352182 7508506 7801887 7919625 7909381 8210501
21187H210501j11909K23282L13210J70118o4126l76315j19451m5534m037N9717
$$ 8210501 8098592 8321874 8635084 8805202 8741076 8364761 8245310 8199776 8195739 8255456
21177H255456k25551k25335m7013K55318j98385j64658k07532M12793M29835O1366
$$ 8255456 8029905 7804570 7757557 8012875 7814490 7649832 7442300 7855093 8284928 8346294
21167H346294j69184m3823J27462J30169L7645J50957l20802l37806J80202M34825
$$ 8346294 8177110 8133287 8260749 8390918 8428563 8579520 8258718 7920912 8101114 8535939
21157H535939J27002k51513k50437K10579M5841l46090k35659K2795M66292O10973
$$ 8535939 8662941 8411428 8160991 8371570 8417411 8071321 7835662 7858457 8324749 8935722
21147H935722k14442l26910J49629M53724q1645o02463K68221J43207R0566K65033
$$ 8935722 8721280 8394370 8543999 8997723 8916078 8313615 8581836 8725043 8815609 9080642
21137I080642P3778k92751k12898J14956J7752j55335n48443k82973J3160m15
$$ 9080642 9154420 8861669 8648771 8763727 8781479 8626144 8077701 7794728 7807888 7807473
21127G807473L22772M75214K80857l63715k2206K0547K78936L27631l87179N3784
$$ 7807473 8130245 8605459 8886316 8522601 8500395 8520942 8799878 9127509 8740330 8794114
21117H794114j57652m86935r6771L40746K86841o6062O0291k22965j36820L73133
$$ 8794114 8636462 8149527 8052756 8393502 8680343 8614281 8674572 8451607 8314787 8687920
21107H687920K77436k54564j03234n1794m36202K44445O4469K10017j25500k23577
$$ 8687920 8965356 8710792 8607558 8555764 8119562 8364007 8428476 8638493 8512993 8289416
21097H289416M3761r8921J78610l79335j93293L17474R1782O9053K1709J28918
$$ 8289416 8333177 8234256 8412866 8033531 7840238 8157712 8249494 8318547 8340256 8469174
21087H469174J80179j70326k6122k94361J43790J5599n5417K81309K31080J42952
$$ 8469174 8649353 8479027 8452905 8158544 8302334 8317933 8262516 8543825 8774905 8917857
21077H917857o6019q6454r9399R6142M41191j10422k18079k13474n8499K64115
$$ 8917857 8851838 8765384 8665985 8762127 9203318 9092896 8874817 8661343 8602844 8866959
21067H866959J81405j75083l89441p7454M13069J36019k60872k93567K21684K83118
$$ 8866959 9048364 8873281 8483840 8406386 8819455 8955474 8694602 8401035 8622719 8905837
21057H905837J11579j84572j99907m60279j02427L49833J07518k7864j02518J85366
$$ 8905837 9017416 8832844 8632937 8172658 8070231 8420064 8527582 8499718 8397200 8582566
21047H582566L1004j99555J63321J99421j38294j00322L8874L0070L39116P3128
$$ 8582566 8613570 8414015 8577336 8776757 8638463 8538141 8577015 8607085 8946201 9019329
21037I019329J68300l76133o5982J70145k51816m2879J00361M212R8710j86126
$$ 9019329 9187629 8811496 8745514 8915659 8663843 8620964 8721325 8725537 8824247 8638121
21027H638121r0035k6746J45586m78170k93822J62132k9808K17492K8678O2717
$$ 8638121 8548086 8521340 8666926 8188756 7894934 8057066 8027258 8244750 8273428 8336145
21017H336145Q4787K41994k9567R7603K94587K05903J20668J14972J29825m31705
$$ 8336145 8420932 8662926 8633359 8730962 9025549 9231452 9352120 9467092 9596917 9165212
21007I165212l51799q9659K20297K15955N0104L02127M4724p8086n4818k19117
$$ 9165212 8813413 8723754 8944051 9160006 9210110 9512237 9556961 9478875 9424057 9204940
20997I204940l28852j32626J27617J85151J38884q4366R3445J87102K14628r4097
$$ 9204940 8876088 8743462 8871079 9056230 9195114 9110748 9204193 9391295 9605923 9511826
20987I511826m19922K49788L08387J72155N0708N2902l97754l62992l58187K1789
$$ 9511826 9091904 9341692 9650079 9822234 9872942 9925844 9528090 9165098 8806911 8828700
20977H828700K38272r9203j4946k68507j31242Q2208j70351k60981J98392K73839
$$ 8828700 9066972 8967769 8952823 8684316 8553074 8635282 8464931 8203950 8402342 8676181
20967H676181J28410J48357p8843J21943m7073J98775L31637l76464p097j80120
$$ 8676181 8804591 8952948 8874105 8996048 8948975 9147750 9479387 9102923 9095826 8915706
20957H915706J75292J41114k9044j08602J846J26186R2002P5751j14832j09082
$$ 8915706 9090998 9232112 9203068 9094466 9096312 9222498 9314500 9390251 9275419 9166337
20947I166337N1054J49420j20422J705M0727J77756j79037o76732J83515M92092
$$ 9166337 9217391 9366811 9246389 9248094 9288821 9466577 9287540 8610808 8794323 9286415
20937I286415Q740Q506Q4732J7954j90905M47388j45539l86697L73928J31373
$$ 9286415 9295155 9303661 9388393 9406347 9215442 9662830 9517291 9130594 9504522 9635895
20927I635895r7716q273n3814k81922k09506p6281k12538k87613M81808N71478
$$ 9635895 9538179 9529906 9476092 9194170 8984664 8908383 8695845 8408232 8890040 9461518
20917I461518J27797j66394r3919K47610O0012j78671j94019J66285K3464m9016
$$ 9461518 9589315 9422921 9329002 9576612 9636624 9457953 9263934 9430219 9453683 9404667
20907I404667N1243J42208k03884L11463J58062O1276j31119j56625l95585J8431
$$ 9404667 9455910 9598118 9394234 9705697 9863759 9925035 9793916 9637291 9241706 9260137
20897I260137J83269J62502j9264j88785P8287J19056J18263P0011j87044p3757
$$ 9260137 9443406 9605908 9586644 9397859 9476146 9595202 9713465 9783476 9596432 9522675
20887I522675j31733j40393j4482l1695J29001M33634o9447Q2374l61621j19727
$$ 9522675 9390942 9250549 9236067 9204372 9333373 9767007 9697560 9779934 9418313 9298586
20877I298586P7029P1951L68603j70487m9140J7078l3497j49687J9970k88411
$$ 9298586 9375615 9447566 9816169 9645682 9596542 9613620 9580123 9430436 9450406 9161995
20867I161995j82934K7167J35025j60291j25583L1501N20577J77429J83918j4373
$$ 9161995 8979061 9006228 9141253 8980962 8855379 8886880 9407457 9584886 9768804 9754431
20857I754431P200K44447P5466m8456L68o9676j95070J58432O074j99003q4648
$$ 9754431 9761631 10006078 10081544 10033088 10033456 9963780 9768710 9927142 9933216 9734213 9649565
20846I649565m6524K16662l9599l26478J62368K13645k21306k36007K19552O2826
$$ 9649565 9603041 9819703 9780104 9453626 9615994 9829639 9608333 9372326 9591878 9654704
20836I654704j83932J17653J12134J2243L9412j26524l06154J66259K48991K09580
$$ 9654704 9470772 9588425 9700559 9712802 9752214 9625690 9319536 9485795 9734786 9944366
20826I944366K8166j33506j44529R141J53084J09544n69289j355J27183R6524
$$ 9944366 9972532 9839026 9694497 9703638 9856722 9966266 9396977 9395622 9522805 9619329
20816I619329m2447N7077l64020K22960J85357J92873J44586J55884k3043k17612
$$ 9619329 9576882 9633959 9269939 9492899 9678256 9871129 10015715 10171599 10148556 9930944
20806I930944J8961k25235P6949j45030m9762L7672j73664J55350k52656J28293
$$ 9930944 9949905 9724670 9801619 9656589 9606827 9644499 9470835 9626185 9373529 9501822
20796I501822K10334k04282j71829L78101K0972j99030L9700M145p3030k74282
$$ 9501822 9712156 9507874 9336045 9714146 9735118 9536088 9575788 9579933 9506903 9232621
20786I232621M8094N13200J13212l1529k43776j45991l1975J62471J29964j52882
$$ 9232621 9280715 9793915 9907127 9875598 9631822 9485831 9453856 9616327 9746291 9593409
20776I593409j12127n5307j52642L81719O23395J39282k59367k15776Q4842j83229
$$ 9593409 9481282 9425975 9273333 9655052 10278447 10417729 10158362 9942586 10027428 9844199
20766I844199O5312J17487o7594j98563O6848J96396o6096L46743J44440j95945
$$ 9844199 9909511 10026998 9959404 9760841 9827689 10024085 9957989 10304732 10449172 10253227
20756A0253227j78173q8873J87524j4092o3814J30608k2998P8043n26332n0033
$$ 10253227 10075054 9986181 10173705 10159613 10095799 10226407 10203409 10281452 9755120 9705087
20746I705087K33045R9885L57747k0723l61537j17403J7453L16936M76179k58110
$$ 9705087 9938132 10038017 10395764 10375041 10013504 9896101 9913554 10230490 10706669 10448559
20736A0448559j83327l67790J38502J78058n1706q1160J42504J2585n7371j26834
$$ 10448559 10265232 9897442 10035944 10214002 10162296 10081136 10223640 10236225 10178854 10052020
20726A0052020J2832k34729l082m7703K37163L20200J96124k76294m5928M57973
$$ 10052020 10064852 9830123 9827041 9779338 10016501 10336701 10532825 10256531 10210603 10668576
20716A0668576J84732j52700k70039l13325l23626j41458J03712l8904p6226P1963
$$ 10668576 10853308 10700608 10430569 10117244 9793618 9652160 9755872 9716968 9640742 9712705
20706I712705m4870J55941L72079j32317J37786L5316k1888j06461J52300O9515
$$ 9712705 9667835 9823776 10195855 10063538 10201324 10236640 10214752 10108291 10260591 10330106
20696A0330106k70050J50276m3768J40459j83486J87887O0525o622k33087K41567
$$ 10330106 10060056 10210332 10166564 10307023 10123537 10311424 10371949 10365327 10132240 10373807
20686A0373807J71858R6980p6203k2374l13382j36228j90987l1827l74541Q3683
$$ 10373807 10545665 10642645 10566442 10544068 10230686 10094458 9903471 9871644 9497103 9580786
20676I580786K71113l48476J00724K55742K61890q950k26695J37032L48578J13525
$$ 9580786 9851899 9503423 9604147 9859889 10121779 10112829 9886134 10023166 10371744 10485269
20666A0485269k13034l20065j54785L60707o6802N4399J21459j97312L6598L65750
$$ 10485269 10272235 9952170 9797385 10158092 10091290 10145689 10267148 10069836 10106434 10472184
20656A0472184M66507j49180o0613K76302n0465j76271k27442K5831j36699k36408
$$ 10472184 10938691 10789511 10728898 11005200 10954735 10778464 10551022 10576853 10440154 10203746
20646A0203746J01108K01936p8704K4602q6048k63652J33186L13339J49824m4175
$$ 10203746 10304854 10506790 10428086 10452688 10366640 10102988 10236174 10549513 10699337 10655162
20636A0655162l7139M5330K9544Q3444j67947O2197L23263O2382K2136l7546k35221
$$ 10655162 10618023 10663353 10692897 10776341 10608394 10670591 10993854 11056236 11078372 11040826 10805605
20625A0805605l37025j21041K32603j67683k02157m2733K19446J41366r424J00395
$$ 10805605 10468580 10347539 10580142 10412459 10210302 10167569 10387015 10528381 10518957 10619352
20615A0619352l2628k03614M05452K47903l63816J75886K95985l1218L0724k4547
$$ 10619352 10586724 10383110 10788562 11036465 10672649 10848535 11144520 11113302 11144026 11119479
20605A1119479p949M4199r7490m59725k80748L14958J11084l758l501j53471l2445
$$ 11119479 11111530 11155729 11058239 10598514 10317766 10632724 10743808 10740050 10736549 10583078 10550633
20594A0550633J85806J49582j78920j25934q8403R7193q2204n9610n7566Q4764
$$ 10550633 10736439 10886021 10707101 10581167 10492764 10589957 10507753 10448143 10390577 10475341
20584A0475341p5949K20944N94538k1787j15652N4864j84480J07088l1280n3486
$$ 10475341 10399392 10620336 11214874 11193087 11077435 11132299 10947819 11054907 11023627 10970141
20574A0970141P5702O3954J41812m0695k41817j14144R5824r5453j03059k8176
$$ 10970141 11045843 11109797 11251609 11210914 10969097 10854953 10950777 10855324 10752265 10724089
20564A0724089K5064J59929L68210j68238n0010j83030k1758j11601P8882J01344
$$ 10724089 10749153 10909082 11277292 11109054 11059044 10876014 10854256 10742655 10821537 10922881
20554A0922881m6487k4529j68548r6489j96177l2916Q4775K48021K03765M0727
$$ 10922881 10876394 10851865 10683317 10586828 10390651 10357735 10442510 10690531 10894296 10935023
20544A0935023j25063j51463J94120L32633k8351l08424R6529J8754J22388j1398
$$ 10935023 10809960 10658497 10852617 11185250 11156899 10848475 10945004 10963758 11086146 11074748
20534A1074748o1429J24247K04311K6380n86260k74424K32543j3014K17707K0336
$$ 11074748 11013319 11137566 11341877 11368257 10781997 10507573 10740116 10727102 10944809 10965145
20524A0965145O0084k6466j82605k40558m7142L10288J01334j57254O4403J64870
$$ 10965145 11025229 10998763 10816158 10575600 10528458 10838746 10940080 10782826 10847229 11012099
20514A1012099J01512l4281p7291o6320N7371L73183O8713O6708j95450j13607
$$ 11012099 11113611 11079330 11002039 10935719 10993090 11366273 11434986 11501694 11306244 11192637
20504A1192637l3018q2505J10063J58916L9535k21108r3814L1650J59725j23060
$$ 11192637 11159619 11077114 11187177 11346093 11385628 11164520 11070706 11102356 11262081 11139021
20494A1139021J45003r3188J19327L01579N0621K06475J71178k42408j16998j83051
$$ 11139021 11284024 11190836 11310163 11611742 11662363 11868838 12040016 11797608 11680610 11497559
20484A1497559k99737j17084K35639m0448J20437J66091J45131r4128j38045J0178
$$ 11497559 11197822 11080738 11316377 11275929 11396366 11562457 11707588 11613460 11475415 11485593
20474A1485593M2043J46726j56473J45311L26085j48171L24106L9936J85896Q6162
$$ 11485593 11527636 11674362 11517889 11663200 11989285 11841114 12165220 12205156 12391052 12477214
20464A2477214k59469l339J18433L80l04048j45419K27322j72951l31986m93721
$$ 12477214 12217745 12214406 12332839 12333219 12029171 11883752 12111074 11938123 11606137 11112416
20454A1112416k31483n8655K95687M15561R147J64120j96931j57287K46674k8868
$$ 11112416 10880933 10822278 11117965 11533526 11542673 11706793 11509862 11352575 11599249 11570381
20444A1570381l62961K71343J80126p39n071p3540l32154K03898J6122r6617L13595
$$ 11570381 11207420 11478763 11658889 11658150 11653079 11579539 11247385 11451283 11467405 11370788 11684383
20433A1684383K77879j24201O799j39190Q4117o4383k05810j0829j53706p3382
$$ 11684383 11962262 11838061 11844860 11705670 11789787 11725404 11519594 11508765 11355059 11281677
20423A1281677N7762J90614L8332j9182k3868K62277j76452Q6279M1457P0626
$$ 11281677 11339439 11530053 11568385 11549203 11525335 11787612 11611160 11697439 11738896 11809522
20413A1809522N0002l291Q0128M1297k47593j39981o9692n3145K94274j66036
$$ 11809522 11859524 11856233 11936361 11977658 11730065 11590084 11520392 11467247 11761521 11595485
20403A1595485j30963o6694K43172J83459K77186L70086M2461j82655l7640j48761
$$ 11595485 11464522 11397828 11641000 11824459 12101645 12471731 12514192 12331537 12293897 12145136
20393A2145136j36372l0052Q7616J77642M46568j50776m61812l92362p7503J53307
$$ 12145136 12008764 11978712 12066328 12243970 12690538 12539762 12077950 11685588 11608085 11761392
20383A1761392K7972N028P8704J58007k18968j11859K64475l0719L19774L52196
$$ 11761392 11789364 11794392 11873096 12031103 11812135 11700276 11964751 11934032 12253806 12606002
20373A2606002j27377J16505l75472K8J92672N3481n01307j30704L64316j15204
$$ 12606002 12478625 12595130 12219658 12219686 12412358 12465839 11964532 11833828 12198144 12082940
20363A2082940j90134J26163J62421M930P4507L11804J27212j20315j38773O4831
$$ 12082940 11892806 12018969 12181390 12186320 12260827 12572631 12699843 12579528 12440755 12505586
20353A2505586q2453k44061j74753j88890J92932M24525L74156p5522Q2775j0505
$$ 12505586 12423133 12179072 12004319 11815429 12008361 12432886 12807042 12731520 12814295 12803790
20343A2803790q7191j28104m58572j66715K70817K7873p7062O8358j33558q5487
$$ 12803790 12716599 12588495 12129923 11963208 12234025 12261898 12184836 12253194 12119636 12034149
20333A2034149L04630M56673j5498j75089j86000m7876m1570K53573J16284J90184
$$ 12034149 12338779 12795452 12779954 12604865 12418865 12370989 12329419 12582992 12699276 12889460
20323A2889460k4399j86864R7735l9284l61370M9673P7044j05372K85943J02019
$$ 12889460 12865061 12678197 12775932 12736648 12375278 12424951 12501995 12396623 12682566 12784585
20313A2784585p1712q1996J40122L84822K13040k04909n1586k99214m8226M2668
$$ 12784585 12712873 12630877 12770999 13155821 13368861 13163952 13112366 12813152 12764926 12807594
20303A2807594l24666K1238L15250J77308l54512j99498Q6020J45200n1998J20654
$$ 12807594 12482928 12504166 12819416 12996724 12642212 12442714 12528734 12673934 12621936 12742590
20293A2742590K4764k91212M067J53101J43660j95363L22525k7201K68917J57103
$$ 12742590 12767354 12476142 12480209 12633310 12776970 12581607 12904132 12876931 13145848 13302951
20283A3302951P9442J57216k1712j5997p285l04233j10650O8140K11190l4155
$$ 13302951 13382393 13539609 13517897 13501900 13494615 13190382 13079732 13147872 13359062 13324907
20273A3324907q0304q9587q1559j76975J64656K55317m4419P6402l99523j35106
$$ 13324907 13244603 13155016 13073457 12896482 13061138 13316455 13272036 13348438 12948915 12813809
20263A2813809k2011O2010J29274j69072J13917J73746K21693n7746K28248J51758
$$ 12813809 12791798 12853808 12983082 12814010 12927927 13101673 13323366 13265620 13493868 13645626
20253A3645626P683o99325m65446N41108J12900J26993j1946k56126l0982M0586
$$ 13645626 13653309 12953984 12488538 13029646 13142546 13269539 13257593 13001467 12970485 13011071
20243A3011071K99756j08374m16316p2402K26338J62674j17071o1223j72533J9832
$$ 13011071 13310827 13202453 12786137 12713735 12940073 13102747 12985676 12924453 12751920 12771752
20233A2771752m0394K49272j35978J62475L2372p3258J47743J1511N4683L50096
$$ 12771752 12731358 12980630 12844652 13007127 13039499 12966241 13113984 13125495 13180178 13530274
20223A3530274L91724o0442m06021K284R1355j66735j11225J43322J14862M9964
$$ 13530274 13921998 13861556 13455535 13457819 13549174 13382439 13271214 13414536 13529398 13579362
20213A3579362j52704p2268k13648k31594L12660N16245J00716l71985k68979
$$ 13579362 13426658 13354390 13140742 12909148 13221808 13738053 13838769 13466784 13197805
20204A3197805R3625j28686q1288M34567J49834J0110J17679j52108k39846R4658
$$ 13197805 13291430 13162744 13081456 13516023 13665857 13675967 13793646 13641538 13401692 13496350
20194A3496350j18649N5692O4562j3732K67827M05211J41784m6410l74915J08051
$$ 13496350 13377701 13433393 13497955 13484223 13752050 14157261 14299045 14252635 13877720 13985771
20184A3985771O4936j83593j37957K43139o9447m27636K09440k1408q9071P5478
$$ 13985771 14050707 13867114 13729157 13972296 13902849 13475213 13684653 13663245 13574174 13649652
20174A3649652n1906N0290J84281k80573l7561M51273N98346J70314n20367l28065
$$ 13649652 13597746 13648036 13832317 13551744 13514183 13965456 14563802 14734116 14213749 13885684
20164A3885684J17204M26305o1342j26466O9202J53443K74090J60891j61887o6035
$$ 13885684 14002888 14429193 14367851 14241385 14310587 14464030 14738120 14899011 14737124 14671089
20154A4671089k15882j86695m0246j4745k8213L35000o7344O0891j9609M62492
$$ 14671089 14455207 14268512 14228266 14213521 14185308 14520308 14452964 14513855 14494246 14956738
20144A4956738q5233K26607j24699o90599l06133L59799L9846P5547j07361K11405
$$ 14956738 14871505 15098112 14973413 14282814 13976681 14336480 14376326 14451873 14344512 14555917
20134A4555917K86688J06992o17669m29857L16718M46788J58906k07659k97426
$$ 14555917 14842605 14949597 14331928 13902071 14218789 14665577 14824483 14616824 14319398
20125A4319398K80147o3386L2576l4370j09119k89354J7440J77465J64143J00165
$$ 14319398 14599545 14536159 14568735 14534365 14425246 14135892 14153332 14330797 14494940 14595105
20115A4595105L7969K24405k59452j05176l0565L5365K13440j53692l91723M3758
$$ 14595105 14633074 14857479 14598027 14492851 14462286 14497651 14711091 14557399 14165676 14209434
20105A4209434K51957K16076L10896M3278k4909n4752j35889j22561j06904J24063
$$ 14209434 14461391 14677467 14988363 15031641 15006732 14951980 14816091 14693530 14586626 14710689
20095A4710689J20815M7466R6577j41313N1319j02698J50105m13719j3366k7466
$$ 14710689 14831504 14878970 14975547 14834234 14885553 14782855 14932960 14519241 14505875 14478409
20085A4478409q1078L0619n663K63687j38523Q065j68886O8125j08777J26468
$$ 14478409 14397331 14427950 14422287 14685974 14547451 14555516 14386630 14454755 14345978 14472446
20075A4472446R4398L42569J94499l23351k86960j039o0614Q7035L28889m4937
$$ 14472446 14566844 14909413 15103912 14780561 14493601 14492562 14431948 14518983 14847872 14802935
20065A4802935m8863m0348j6142J22171r6643K13472M18273J14931j66810k4775
$$ 14802935 14754072 14713724 14697582 14819753 14723110 14936582 15354855 15469786 15302976 15278201
20055A5278201n9480k76084Q4412J69489j21435k94557j25922J12811j92001L80515
$$ 15278201 15218721 14942637 15027049 15196538 15075103 14780546 14654624 14767435 14575434 14955949
20045A4955949N94978m1792m95451K23301J36001j07537L65233L61072J11501
$$ 14955949 15550927 15509135 15013684 15236985 15372986 15265449 15630682 15991754 16103255
20036A6103255J44981l01184j17419n16855m38369K12377J51348L17962M43966
$$ 16103255 16248236 15947052 15829633 15312778 14874409 15086786 15238134 15556096 16000062
20027A6000062j65083J26526r0380m7967j87673l67140J46352J12266k64303l29165
$$ 16000062 15834979 15961505 15871125 15823158 15635485 15268345 15414697 15526963 15262660 14933495
20017A4933495l67875J90229J10104K73661K65690j98335K79788J46295J5182
$$ 14933495 14565620 14755849 14865953 15139614 15405304 15206969 15486757 15633052 15648234
20008A5648234K461K48115J5098L20653P6546J71543K20567l77326j10982q112
$$ 15648234 15650695 15898810 15913908 16234561 16311107 16482650 16703217 16325891 16214909 16206797
19998A6206797l31549l11405O2299L8196j26277J2973k50422j57865J17326M71869
$$ 16206797 15875248 15563843 15626142 15664338 15538061 15551034 15300612 15142747 15260073 15731942
19988A5731942K61375J13349j5091o0604j89278j6677L57919L7319l62754l0494
$$ 15731942 15993317 16106666 16091575 16030971 15841693 15825016 16182935 16220254 15857500 15827006
19978A5827006L90405K23671Q2616L4526L9587L12785j24137m48793m12442M84360
$$ 15827006 16217411 16441082 16523698 16558224 16597811 16910596 16786459 16337666 15925224 16409584
19968A6409584Q0185r2460j8275j44285j09463j75432J50160l3745j96851K83795
$$ 16409584 16489769 16397309 16379034 16234749 16125286 15949854 16100014 16066269 15869418 16153213
19958A6153213M53763N1731j77568Q159q7979J44169K38927M9935J25151k4173
$$ 16153213 16606976 16658707 16481139 16489298 16401319 16545488 16784415 16834350 16959501 16935328
19948A6935328o7853J50179l83178k63444J77959J48769N824j12078m4309r9462
$$ 16935328 16867475 17017654 16634476 16371032 16548991 16697760 16703584 16591506 16547197 16447735
19938A6447735L21691L0343L4379L50650l16478n75450J93877P4942k3253P906
$$ 16447735 16769426 16799769 16834148 17184798 16868320 16292870 16486747 16561689 16538436 16546342
19928A6546342K4572m73834K88023O57044J57358j85938n0557n3090J24326M3041
$$ 16546342 16570914 16097080 16385103 17042147 17199505 17013567 16963010 16909920 17034246 17077287
19918A7077287l585r1293j81636J41914j7105L42751L39573j84843O3136k32396
$$ 17077287 17073702 16982409 16800773 16942687 16925582 17268333 17607906 17423063 17486199 17253803
19908A7253803k46499m03614J02720L00478J83672J91414m27639l41205l00496
$$ 17253803 17007304 16603690 16706410 17006888 17190560 17381974 16954335 16613130 16312634
19899A6312634M98166J88096K3750O490j67119K54480O63352J54967l65070K6554
$$ 16312634 16810800 16998896 17022646 17029136 16862017 17116497 17779849 17934816 17569746 17596300
19889A7596300J16149P0568j82664j22447J78764J21891j65964p2635j46824J5344
$$ 17596300 17712449 17783017 17600353 17477906 17656670 17778561 17612597 17539962 17393138 17408482
19879A7408482r2906J50565k2341j8977N412L04623J50686J35839k43993k84602
$$ 17408482 17315576 17466141 17443800 17424823 17430235 17734858 17885544 18021383 17777390 17492788
19869A7492788R2839l43403j12667N01862L42657J50884P3121k29459m26430n0490
$$ 17492788 17585627 17242224 17129557 17631419 17974076 18124960 18198081 17968622 17542192 17491702
19859A7491702K69708J50126n1879p3105p9637K58921N7122j42762k77147N85350
$$ 17491702 17761410 17911536 17859657 17786552 17706915 17965836 18022958 17880196 17603049 18188399
19849A8188399J5896k47649j06582M2023n4129J11654K95661K18791L07623J19129
$$ 18188399 18204295 17956646 17850064 17892087 17837958 17949612 18245273 18464064 18771687 18890816
19839A8890816p3148j91495L6698m23992L5198l9811k70543M77995L85220k21032
$$ 18890816 18817668 18626173 18662871 18238879 18274077 18234266 17963723 18441718 18826938 18605906
19829A8605906j39176r4241k61883j72808l5784J08921j16782l7730J35305J87679
$$ 18605906 18466730 18372489 18110606 17937798 17902014 18010935 17894153 17856423 17991728 18179407
19819A8179407K4521j11554r381M48832m1992l31790K57994L01716Q3215q5316
$$ 18179407 18203928 18092374 18082993 18531825 18489833 18158043 18416037 18717753 18800968 18715652
19809A8715652n7501q8200Q0462K88527j0229M9264L1629l6072j05554J86628
$$ 18715652 18658151 18569951 18650413 18938940 18928711 18977975 19009604 18973532 18867978 19054606
19799A9054606K27377n37910K23394J10275P4535j312J603l08783N568q4398K2865
$$ 19054606 19281983 18744073 18967467 19077742 19152277 19150965 19152568 18843785 18849353 18764955 18787820
19788A8787820L15437O6070o3088j14429P0236n2393J95687K26890K19044K47890
$$ 18787820 19103257 19169327 19106239 18991810 19062046 19009653 19205340 19432230 19651274 19899164
19778A9899164Q7359K40261j18458j86090l98161r939K09749J71984K4004l61296
$$ 19899164 19986523 20226784 20108326 19922236 19524075 19514136 19723885 19895869 19919873 19558577
19768A9558577j86200J70098J53547M25942J0585J51325N74225p3576m2505J6540
$$ 19558577 19372377 19542475 19696022 20121964 20132549 20283874 20858099 20784523 20742018 20758558
19758B0758558J85592k36979l32981N0807q9142Q3259J60077j92318k83020j9394
$$ 20758558 20944150 20707171 20374190 20424997 20335855 20419114 20579191 20386873 20103853 20084459
19748B0084459K40613K82912J78557J58814k5329r2712J57329j58900l63618l49994
$$ 20084459 20325072 20607984 20786541 20945355 20920026 20827314 20984643 20825743 20462125 20112131
19738B0112131L48124N06419J48920j17236J77561m9986l69532j92587o222p740
$$ 20112131 20460255 20966674 21115594 20998358 21175919 21125933 20756401 20563814 20557592 20549852
19728B0549852p5139n3244l94373p1604K9818k62046n79121J6807J34887J41317
$$ 20549852 20474713 20421469 20027096 19955492 19985310 19723264 19144143 19160950 19295837 19437154
19718A9437154J7384j14366J04371K56853K20445m33665l71394K03747K46923
$$ 19437154 19454538 19340172 19444543 19701396 19921841 19488176 19116782 19320529 19567452
19709A9567452J69324k73158M14714K86362j63191j08978J16114J51927n2498
$$ 19567452 19736776 19463618 19878332 20164694 20001503 19892525 20008639 20160566 20108068
19700B0108068K77596o6877K06357p0387N3830J4542l42942Q8687J90117k6590
$$ 20108068 20385664 20318787 20525144 20454757 20508587 20523129 20180187 20268874 20458991 20432401
19690B0432401L12917K85722P7125j76105r0867j03140p4791r7248k0058M06011
$$ 20432401 20745318 21031040 21108165 20932060 20841193 20738053 20663262 20566014 20545956 20951967
19680B0951967k60864k58401M01587L94628q8898k57808K86621K88113l8408N2283
$$ 20951967 20691103 20432702 20834289 21228917 21140019 20882211 21168832 21456945 21418537 21470820
19670B1470820J76335j28463L737j71715L593r7597o4278P0693K77260J35405
$$ 21470820 21647155 21518692 21522429 21350714 21354307 21256710 21192432 21263125 21540385 21675790
19660B1675790M761L15797Q9740l00558l49711M71049J82656O1919p4404j23432
$$ 21675790 21680551 21996348 22086088 21785530 21435819 21906868 22089524 22151443 22077039 21953607
19650B1953607J29265O5981j96180j54989J44229J12644J54500j07088j16751
$$ 21953607 22082872 22148853 21952673 21797684 21941913 22054557 22209057 22101969 21985218
19641B1985218M9364L30558J64639o3296j84530j89682p0862L7530J1011j6761
$$ 21985218 22034582 22365140 22529779 22466483 22281953 22092271 22021409 22058939 22069950 22053189
19631B2053189l7612J62216j209K73396k8132j94025K77637O10650j31154j51181
$$ 22053189 22015577 22177793 22176584 22449980 22421848 22227823 22505460 23116110 22984956 22833775
19621B2833775k11816K64152P6175n37J58861m630k41993L1093R8004M90674o691
$$ 22833775 22621959 22886111 22962286 22961749 23120610 23115980 22873987 22905080 23003084 23493758 23487067
19610B3487067k36983M7626n6993k55824j1060L52626J17579J67049m3335L1938
$$ 23487067 23250084 23297710 23240717 22984893 22973833 23326459 23444038 23611087 23567752 23599690
19600B3599690M03366J76855l37426k68288j79949j06057Q2960J78896r2577o8237
$$ 23599690 24003056 24179911 23842485 23574197 23394248 23288191 23371151 23550047 23457470 23389233
19590B3389233K00506K10631o0753p3793L31943J78816L10188l9030k31806J9707
$$ 23389233 23589739 23800370 23739617 23665824 23997767 24176583 24486771 24447741 24215935 24235642
19580B4235642L19688L25272j53314J2413K12345L57213j97538l36660K4077j67782
$$ 24235642 24555330 24880602 24727288 24739701 24952046 25309259 25111721 24775061 24799138 24631356
19570B4631356l42654O5438j50571K79045q0032N1217K18340l1967m09912k89169
$$ 24631356 24288702 24354140 24203569 24482614 24402582 24453799 24672139 24640172 24230260 23941091
19560B3941091j94280R2576L44641L65822P6610r9523J22861N7651j47599L60303
$$ 23941091 23746811 23839387 24184028 24549850 24626460 24526937 24649798 24707449 24559850 24920153
19550B4920153L86770m7122j65276k2443L71686J15651k27597J72657J2408k71513
$$ 24920153 25306923 25259801 25094525 25072082 25443768 25559419 25331822 25504479 25516887 25245374
19540B5245374M82359J03758m90069k26420K5121M3170J27135M76039J84133o495
$$ 25245374 25727733 25831491 25341422 25115002 25140123 25183293 25310428 25786467 25970600 25964105
19530B5964105J19923O158L75864K74969M5920J97574j49093l9098m68087k80238
$$ 25964105 26084028 26090186 26466050 26741019 26786939 26984513 26835420 26796322 26328235 26047997
19520B6047997J33647K3469j97149j88013J96151K36631p2716k39242r9977m4962
$$ 26047997 26181644 26205113 26007964 25819951 26016102 26252733 26180017 25940775 25840798 25795836
19510B5795836l26419n081L34569J89729J32682J07547j16669R1724K01431j53941
$$ 25795836 25469417 25464336 25798905 25988634 26121316 26228863 26112194 26203918 26405349 26251408
19500B6251408N7643N74006K68698j97889o05397j84415j00176K48636L27399
$$ 26251408 26309051 26883057 27151755 26953866 26348469 26164054 26063878 26312514 26639913
19491B6639913M58712L20233J94222J3741k07839l93122m158J90345L07266K23007
$$ 26639913 27098625 27418858 27613080 27626821 27418982 27025860 27021702 27212047 27519313 27742320
19481B7742320O591P1689l24845J23833L65303K08543k02738k05678J33389K57606
$$ 27742320 27748911 27820600 27495755 27619588 27984891 28193434 27990696 27785018 27918407 28176013
19471B8176013J46933M7522Q1693q1551L02373L04611j37490K46084J90516k45403
$$ 28176013 28322946 28370468 28452161 28370610 28672983 28977594 28840104 29086188 29276704 29031301
19461B9031301l46460O6064J66708K17571J60071K0050j4581j55845m9122M0239
$$ 29031301 28684841 28750905 28917613 29135184 29295255 29315305 29300724 29144879 29095757 29135996
19451B9135996J45933L08759m7872j74699K74506Q22j89645k35018k6922k9845
$$ 29135996 29281929 29590688 29542816 29368117 29642623 29643445 29453800 29218782 29191860 29162015
19441B9162015j99051P6496Q7793J29170l5028l07345j24274N26800L56385J29144
$$ 29162015 28962964 29039460 29127253 29256423 29221395 28914050 28789776 29316576 29672961 29802105
19431B9802105L2837o0100j37375M30723K99321R9766j0882K34070N0983J42894
$$ 29802105 29834942 29774842 29637467 30068190 30367511 30467277 30456395 30690465 30741448 30884342
19421C0884342j76834j2557K7592J31982L30304J22255k60727m05474J35893N85538
$$ 30884342 30707508 30694951 30722543 30854525 31184829 31307084 31046357 30640883 30776776 31362314
19411C1362314P17213K72522j19419k63526l07626l50303j46308q3060J17507
$$ 31362314 32079527 32352049 32232630 31969104 31661478 31311175 31164867 31081807 31199314
19402C1199314K94877L28022P0117j08165N35664M19403k15708n78739k31892
$$ 31199314 31494191 31822213 31892330 31784165 32319829 32739232 32523524 31944785 31712893
19393C1712893k04096Q1060K34210L47302L9675N3943j43443J56807J76835J7518
$$ 31712893 31508797 31589857 31824067 32171369 32211044 32264987 32121544 32278351 32455186 32472704
19383C2472704J16379o6085k84560J56429L11466k50793M8940M73851M62670J45111
$$ 32472704 32589083 32522998 32238438 32394867 32706333 32455540 32504480 32978331 33441001 33586112
19373C3586112j11944N8771J9922j145L77614K36492j86294j16774R4315O85170
$$ 33586112 33474168 33532939 33552861 33551716 33929330 34165822 33979528 33862754 33957069 34642239
19363C4642239O5820j74964p6649O4234K7224L9307j12881J14803j5053J00726
$$ 34642239 34708059 34533095 34456446 34520680 34547904 34587211 34474330 34589133 34574080 34674806
19353C4674806o2866M99476K43793R7051L0988j47960J12197j05598l38575l5064
$$ 34674806 34611940 35111416 35355209 35452260 35483248 35335288 35447485 35341887 35003312 34968248
19343C4968248N65141R4880J30805L80043k8652l75258N326O00039L45452K39382
$$ 34968248 35533389 35628269 35759074 36139117 36110465 35735207 35740533 36340572 36686024 36925406
19333C6925406k03547l95987M67809O45013J09302k53545p414J67362N1266Q8661
$$ 36925406 36721859 36325872 36793681 37438694 37547996 37294451 37287037 37454399 37505665 37594326
19323C7594326K34308j63716J962l37307k65075r1564N1729M65953K75414K07538
$$ 37594326 37828634 37664918 37666880 37329573 37064498 36972934 37024663 37490616 37766030 37973568
19313C7973568K63235J37082k84628L41984N85056K72159J33072j02961j05758
$$ 37973568 38236803 38373885 38089257 38431241 39016297 39288456 39421528 39318567 39212809
19304C9212809q2488q3320J19033o0843J0262K86620K09690J55068J5994J55843
$$ 39212809 39130321 39047001 39166034 39105191 39115453 39402073 39611763 39766831 39782825 39938668
19294C9938668m4001L69505R8359K2817k3533K84332M42262M43860J1299l4638
$$ 39938668 39894667 40264172 40362531 40385348 40361815 40646147 41088409 41532269 41543568 41508930
19284D1508930o9977j382P8895K41529K15513k7382K50518J85944Q5243K70943
$$ 41508930 41438953 41437571 41516466 41757995 41973508 41946126 42196644 42382588 42467831 42738774
19274D2738774K52383j9528j16035J1827M20591K71294o8941L49686L28114J97304
$$ 42738774 42991157 42971629 42855594 42867421 43288012 43559306 43490365 43840051 44168165 44365469
19264D4365469J47335k29429L08145M0465r9552M10427M45132L23974J42172K0194
$$ 44365469 44512804 44283375 44591520 44631985 44532433 44942860 45387992 45711966 45854138 45874332
19254D5874332j33772l615L08534K29079M58903J52762k11227Q5503l42929L09183
$$ 45874332 45740560 45736945 46045479 46274558 46733461 46886223 46674996 46760499 46417570 46726753
19244D6726753O19774K1299p654R7604J50453J98613L5075L52867M27110J80423
$$ 46726753 47346527 47367826 47360172 47457776 47608229 47806842 47841917 48194784 48621894 48802317
19234D8802317q059M29137K62211L35414J81158M29856J22897p3986M62568L74693
$$ 48802317 48794258 49223395 49485606 49821020 50002178 50432034 50554931 50480945 50943513 51318206
19224E1318206J46467j98031k83256N7252L54089K66113M46095J98572R0263o2057
$$ 51318206 51464673 51266642 50983386 51040638 51394727 51660840 52106935 52305507 52395770 52333713
19214E2333713N56038N48427L50985K72595P0709K71597J47049K13973K69394
$$ 52333713 52889751 53438178 53789163 54061758 54132467 54404064 54551113 54765086 55034480
19205E5034480L67074Q0659M60311O9974K26868J05386Q0943L33920L79722K79842
$$ 55034480 55401554 55482213 55942524 56012498 56239366 56344752 56425695 56759615 57139337 57419179
19195E7419179K12085L00921O69417L62925L79586J76557M79583L62842r7642
$$ 57419179 57631264 57932185 58601602 58964527 59344113 59520670 60000253 60363095 60265453
19186F0265453K56726J30316M71077O97199O18056L99781o1256k87013P9873N15529
$$ 60265453 60522179 60652495 61123572 61820771 62438827 62838608 62777352 62490339 62570212 63085741
19176F3085741L18762K80300M42994O63088M47233P9550M69944M74868K61116
$$ 63085741 63404503 63684803 64127797 64790885 65238118 65317668 65787612 66262480 66523596
19167F6523596M0306K39202Q57223N47438N08440O68381Q140K52287K52901M96075
$$ 66523596 66563902 66803104 67660327 68207765 68716205 69384586 69392726 69645013 69897914 70393989
19157G0393989P46252O61068L09845M47292N08155L56090P84413Q14668M64028
$$ 70393989 71140241 71801309 72111154 72558446 73066601 73422691 74207104 75021772 75485800
19148G5485800K17424M31807N07603O80132P71489N49043O32125J005811Q79952
$$ 75485800 75703224 76135031 76642634 77322766 78094255 78643298 79275423 80281234 81161186
19139H1161186L69657L87731Q46124Q87608P29927O80887P85999O32880N55674
$$ 81161186 81530843 81918574 82764698 83652306 84382233 85063120 85849119 86481999 87037673
19130H7037673P99565Q65211J098493J199714P61457O35993M76309R48651J471594
$$ 87037673 87837238 88702449 89800942 91000656 91762113 92398106 92874415 93823066 95294660
19121I5294660J157040P40606J162941R75062J430941J717671J275247J183463
$$ 95294660 96451700 97192306 98355247 99330309 100761250 102478921 103754168 104937631
19113A04937631J526340J390592J517994J180173J380026J221202K006195K059769
$$ 104937631 106463971 107854563 109372557 110552730 111932756 113153958 115160153 117219922
19105A17219922K012108J786500J740023J864142K053571J890564J998248K140314
$$ 117219922 119232030 121018530 122758553 124622695 126676266 128566830 130565078 132705392
19097A32705392K538200K512090K076238K479755K692795K580862L281281L435680
$$ 132705392 135243592 137755682 139831920 142311675 145004470 147585332 150866613 154302293
19089A54302293L485681L723915M289543M188268M477548N462883N835851O258062
$$ 154302293 157787974 161511889 165801432 169989700 174467248 179930131 185765982 192024044
19081A92024044O469677O699597Q201313R093592R421799J0408541J1821881J2655919
$$ 192024044 198493721 205193318 213394631 222488223 231910022 242318563 254140444 266796363
19073B66796363J2915476J2108844Q309345K186432m414697r432817j3606514
$$ 266796363 279711839 291820683 300130028 302316460 297901763 288468946 274862432
19066B74862432j7720657j9286278j7721061j6752726k0639541k8032420l4770038
$$ 274862432 257141775 237855497 220134436 203381710 182742169 154709749 119939711
19059A19939711l3336650k6535860k1120832j6310510j1019417p013571o413546
$$ 119939711 86603061 60067201 38946369 22635859 11616442 4602871 -1810675
19052a810675r672449j3251021j1218612m950689n075138j2775497j3415692k990926
$$ -1810675 -11483124 -24734145 -35952757 -40903446 -45978584 -58754081 -72169773 -75160699
19044g5160699Q85667J386486R274065J1338494N133832O7813r853370k4449297
$$ -75160699 -74275032 -72888546 -63614481 -52275987 -47142155 -47074342 -56927712 -81377009
19036h1377009k7199248j4396605r876794r682402K385491J2786860J4697708
$$ -81377009 -108576257 -122972862 -132849656 -142532058 -140146567 -127359707 -112661999
19029a12661999J3439819J1912316J0597625R593206Q191077O967194O048142
$$ -112661999 -99222180 -87309864 -76712239 -67119033 -58927956 -51960762 -45912620
19022d5912620N608287N427159N841691N681219N499324N603874N783994N444103
$$ -45912620 -40304333 -34877174 -29035483 -23354264 -17854940 -12251066 -6467072 -1022969
19014a022969N509585N769413N869147O863671P851002Q314558R111244R879921
$$ -1022969 4486616 10256029 16125176 22988847 30839849 39154407 48265651 58145572
19006E8145572J0578982J1946453J2735784J0466894M030979l440709p559929
$$ 58145572 68724554 80671007 93406791 103873685 107904664 104463955 96904026
18999I6904026j5903871k8857553k8395422j4735672r799696p456905L026411
$$ 96904026 81000155 52142602 23747180 9011508 -788188 -8245093 -5218682
18992e218682N951739j327145p562755j9501079l6409555l8936412k3602111j7206275
$$ -5218682 733057 -594088 -8156843 -27657922 -64067477 -103003889 -126606000 -143812275
18984a43812275j5380945r50955J1348291J4392550J3482656J1541251R927112
$$ -143812275 -159193220 -160144175 -148795884 -134403334 -120920678 -109379427 -99452315
18977i9452315Q613710P619794O717034N817916M865715M447613M014166L553248
$$ -99452315 -90838605 -83218811 -76501777 -70683861 -65818146 -61370533 -57356367 -53803119
18969e3803119L893635L607886L598930K932898L087276K912239K693816K900346
$$ -53803119 -49909484 -46301598 -42702668 -39769770 -36682494 -33770255 -31076439 -28176093
18961b8176093L038457K955504K810439K862102K938188K950371K833043L132907
$$ -28176093 -25137636 -22182132 -19371693 -16509591 -13571403 -10621032 -7787989 -4655082
18953d655082K947603L145163L682265L806058M239936M649392N019902N469155
$$ -4655082 -1707479 1437684 5119949 8926007 13165943 17815335 22835237 28304392
18945B8304392N806074O027536M018043n36438p123957r867379j1382377j5351774
$$ 28304392 34110466 40138002 44156045 43619607 36495650 26628271 15245894 -105880
18937a05880j3985263k723758O138019Q275096O825623J330928n216674q451896
$$ -105880 -14091143 -16814901 -10676882 -2401786 4423837 5754765 538091 -7913805
18929g913805r367522j2963964j3613310l075436M885808O844459O133960N239891
$$ -7913805 -17281327 -30245291 -43858601 -46934037 -42048229 -35203770 -29069810 -23829919
18921b3829919M620611L885767L488282L411901L551913L572584L721042L558935
$$ -23829919 -19209308 -15323541 -11835259 -8423358 -4871445 -1298861 2422181 5981116
18913E981116L341596L206910L454637L284840L489135L219948L556142M056371
$$ 5981116 9322712 12529622 15984259 19269099 22758234 25978182 29534324 33590695
18905C3590695M207440M890404N570571N612034O543920P373563Q231253R267297
$$ 33590695 37798135 42688539 48259110 53871144 60415064 67788627 76019880 85287177
18897H5287177J0623970J1277154J0590152O342726k412413j1244312j8323967
$$ 85287177 95911147 107188301 117778453 124121179 121708766 110464454 92140487
18890I2140487k9598348l6757464k7802773j5707670r156904L704712J0603950
$$ 92140487 62542139 25784675 -2018098 -17725768 -26882672 -23177960 -12574010
18883a2574010N826394j989302j0448940k1890234k9908510k5769432j7966627
$$ -12574010 -6747616 -8736918 -19185858 -41076092 -70984602 -96754034 -114720661
18876a14720661j3140159p69141R533379J1904402J0542338R155898P908867O816120
$$ -114720661 -127860820 -128629961 -119096582 -107192180 -96649842 -87493944 -79585077 -72768957
18868g2768957N952013N333008N171033M926996M484999M192936M020506L757628
$$ -72768957 -66816944 -61483936 -56312903 -51385907 -46900908 -42707972 -38687466 -34929838
18860c4929838L509521L549743L494606L389802L228854L591249M274444M404741
$$ -34929838 -31420317 -27870574 -24375968 -20986166 -17757312 -14166063 -9891619 -5486878
18852e486878N071672M817021N318361O097086O623710P569748Q668617Q615884
$$ -5486878 -415206 4401815 9720176 15817262 22440972 30010720 38679337 47295221
18844D7295221P288302J337996r569990j7819238j9444349k4106527k8768075
$$ 47295221 54583523 55921519 46351529 28532291 9087942 -15018585 -43786660
18837d3786660j6334166L288477J1801140J1690222O206846m556389j2575511
$$ -43786660 -60120826 -56832349 -45031209 -33340987 -27134141 -31690530 -44266041
18830d4266041j4701903j9022543k4210464j6157444K59979P518891P824455P412966
$$ -44266041 -58967944 -77990487 -102200951 -118358395 -118098416 -110579525 -102755070 -95342104
18822i5342104O449704N455508N018262M595173L770218L651858L392775K684176
$$ -95342104 -88892400 -83436892 -78418630 -73823457 -70053239 -66401381 -63008606 -60324430
18814f0324430J970833J911212K127570K139691J705662J334500J500432J895261
$$ -60324430 -58353597 -56442385 -54314815 -52175124 -50469462 -49134962 -47634530 -45739269
18806d5739269J807950J242786J211159J175397Q83034Q90017R86778J062153
$$ -45739269 -43931319 -42688533 -41477374 -40301977 -39418943 -38528926 -37542148 -36479995
18798c6479995J105295J020188Q56084O94975N55624P57198J036580R06880O99799
$$ -36479995 -35374700 -34354512 -33498428 -32803453 -32247829 -31490631 -30454051 -29547171 -28847372
18789b8847372P30830P11400J114214J070650Q30113O12392N89640R12643Q84377
$$ -28847372 -28116542 -27405142 -26290928 -25220278 -24390165 -23777773 -23188133 -22275490 -21391113
18780b1391113O82862M92254P17976O01904J047478J092618M11753K64827P08150
$$ -21391113 -20708251 -20215997 -19498021 -18896117 -17848639 -16756021 -16344268 -16079441 -15371291
18771a5371291N63877L43595m85734n7577Q1427K1590M51718N60861N44671N86766
$$ -15371291 -14807414 -14463819 -14949553 -15007130 -14925703 -14904113 -14452395 -13891534 -13346863 -12760097
18761a2760097N74075O08677M18338N83022N29523N53979N56521J32971N42632
$$ -12760097 -12186022 -11577345 -11159007 -10575985 -10046462 -9492483 -8935962 -8802991 -8260359
18752h260359O02893P28148O22447O01284J74972J85823N85025N66562O41519
$$ -8260359 -7657466 -6929318 -6306871 -5705587 -5530615 -5344792 -4759767 -4193205 -3551686
18743c551686L74489L52608K64362j19012J35314J20118O12459O02825p7092l6827
$$ -3551686 -3177197 -2824589 -2560227 -2679239 -2543925 -2423807 -1811348 -1208523 -1285615 -1322442
18733a322442M44554K1912K73725M17436M41942M97334J63979J59948M57547K69512
$$ -1322442 -877888 -855976 -582251 -164815 277127 774461 938440 1098388 1555935 1825447
18723A825447l5859l18204J62712P25256O52428O87294O19500N02669J44658K31254
$$ 1825447 1789588 1471384 1634096 2359352 3011780 3699074 4318574 4821243 4965901 5197155
18713E197155M50236L66362M39589N55840L42637L87046N33249J11239N0155P93940
$$ 5197155 5647391 6013753 6453342 7009182 7351819 7738865 8272114 8383353 8433508 9227448
18703I227448N88653M93211M56976L59848K65977N17381L72483L61356K40973
$$ 9227448 9816101 10309312 10766288 11126136 11392113 11909494 12281977 12643333 12884306
18694A2884306L72061J25614J75161P47559O92153k0322K53752P62724K91846
$$ 12884306 13256367 13381981 13557142 14304701 14996854 14976532 15230284 15993008 16284854
18685A6284854J7641J93738R40217P65717K77267K13999p4391L20501K29186M26433
$$ 16284854 16302495 16496233 17436450 18202167 18479434 18693433 18619042 18939543 19168729 19595162
18675A9595162N91400O82462M05451L31656L32160M48856M39199K1913K09937
$$ 19595162 20186562 20869024 21274475 21606131 21938291 22387147 22826346 22848259 23058196
18666B3058196Q15638J007952Q22531M17024N94635M39159L27830N30524P02258
$$ 23058196 23873834 24881786 25704317 26121341 26715976 27155135 27482965 28013489 28715747
18657B8715747O10728L50475L02310M45765R12100N85237Q81198P60116N41755
$$ 28715747 29326475 29676950 29979260 30425025 31337125 31922362 32803560 33563676 34105431
18648C4105431L89473L64622R25053Q43802O01245N46769J214632R80108N30925
$$ 34105431 34494904 34859526 35784579 36628381 37229626 37776395 38991027 39971135 40502060
18639D0502060N65037J069588J313155R40908M98449R02000O77079J182264J341195
$$ 40502060 41067097 42136685 43449840 44390748 44889197 45791197 46468276 47650540 48991735
18630D8991735J284290R55347J251469R37040Q31983J437196J362700J225581
$$ 48991735 50276025 51231372 52482841 53419881 54251864 55689060 57051760 58277341
18622E8277341J631857J889406J983418J720611K194217K764732K671493K767711
$$ 58277341 59909198 61798604 63782022 65502633 67696850 70461582 73133075 75900786
18614G5900786L108196L179298L558815M091263N030795N465240O019374P068384
$$ 75900786 79008982 82188280 85747095 89838358 94869153 100334393 106353767 113422151
18606A13422151Q104086P869272N423390r36107r978829j3087931j4468426j9586122
$$ 113422151 121526237 129395509 134818899 133882792 123903963 110816032 96347606 76761484
18598G6761484j9498195n344979K165051m908880j3656905j7330389k1771447
$$ 76761484 57263289 51918310 54083361 49174481 35517576 18187187 -3584260
18591c584260k8125760k0352545j86364R322496J0650037R563979Q318592P444992
$$ -3584260 -31710020 -52062565 -52248929 -42926433 -32276396 -22712417 -14393825 -6948833
18583f948833O524485N379709M830094M655743M071200M085114L932228L807250
$$ -6948833 -424348 4955361 9785455 14441198 18512398 22597512 26529740 30336990
18575C0336990L508667L185346K994965L487351L688071M107248L758817L893100
$$ 30336990 33845657 37031003 40025968 43513319 47201390 51308638 55067455 58960555
18567E8960555M689495M945976N207367N464919N965184O906130Q298602R333929
$$ 58960555 63650050 68596026 73803393 79268312 85233496 92139626 100438228 109772157
18559A09772157J0101335J1812049J2539617J1441898N712964p273221j8501689
$$ 109772157 119873492 131685541 144225158 155667056 161380020 154106799 135605110
18552A35605110k1351984k5567767l3240532k4882532k668834J082232j2016570
$$ 135605110 114253126 88685359 55444827 30562295 27893461 28975693 16959123
18545A6959123k2778261k7828658l6906110m1974011k1597163M966687J4807617
$$ 16959123 -5819138 -33647796 -70553906 -112527917 -134125080 -129158393 -114350776
18538a14350776J5238951J3592893J1335580J0038598R035069P550620O568199
$$ -114350776 -99111825 -85518932 -74183352 -64144754 -55109685 -47559065 -40990866
18531d0990866N711902N191199M950963M424917M409182M057351L610426L345064
$$ -40990866 -35278964 -30087765 -25136802 -20711885 -16302703 -12245352 -8634926 -5289862
18523e289862L292474L097735L449290L643371L575768L630959L655626M011258
$$ -5289862 -1997388 1100347 4549637 8193008 11768776 15399735 19055361 23066619
18515B3066619L802556L696901M488911N280123N543496O096467O192369O535685
$$ 23066619 26869175 30566076 35054987 40335110 45878606 51975073 58167442 64703127
18507F4703127N718460K520734l082507p169651p627385r850147j3220879p208903
$$ 64703127 70421587 72942321 69859814 62690163 55062778 45212631 31991752 24782849
18499B4782849K437865J928840l842599o680002q883262j3511375j3120395k124683
$$ 24782849 27220714 29149554 25306955 18626953 9743691 -3767684 -16888079 -19012762
18491a9012762O747322Q744643Q547748P875371P575492Q055645P847780P834979
$$ -19012762 -12265440 -3520797 5026951 12902322 20477814 28533459 36381239 44216218
18483D4216218Q480519Q716767R004683R775256J0852138J2877877J3784223J3909510
$$ 44216218 52696737 61413504 70418187 80193443 91045581 103923458 117707681 131617191
18475A31617191J0943291L310342n326867j0748045k1147224l5726694l4274299
$$ 131617191 142560482 145870824 140543957 129795912 108648688 72921994 38647695
18468C8647695k0871160k1584353k6451656j6760154j0236128j8677144k8122660
$$ 38647695 17776535 -3807818 -30259474 -47019628 -57255756 -75932900 -104055560
18461a04055560k0708100j1553015j0920697m395742Q134089J3882978J3600272
$$ -104055560 -124763660 -136316675 -147237372 -151633114 -143499025 -129616047 -116015775
18454a16015775J2158769J0086260Q861648Q366754P036860O231426N977263N297465
$$ -116015775 -103857006 -93770746 -84909098 -76542344 -69505484 -63274058 -57296795 -51999330
18446e1999330M585045M265999M741360M879773M201975L597169L916878L950157
$$ -51999330 -47414285 -43148286 -38406926 -33527153 -29325178 -25728009 -21811131 -17860974
18438a7860974M009324M029229M620709M829715N053115N234516N279303O195561
$$ -17860974 -13851650 -9822421 -5201712 -371997 4681118 9915634 15194937 21390498
18430B1390498O681057P443805Q477070R459318J0268047J0657074R053558L718553
$$ 21390498 28071555 35515360 43992430 53451748 63719795 74376869 83430427 87148980
18422H7148980l579955p535895j5018279k6857711k7140633j6096399j6068478
$$ 87148980 83569025 76033130 61014851 34157140 7016507 -9079892 -25148370
18415b5148370k1203474j4040591q446435j5952542k4388048j8203008j0061460
$$ -25148370 -46351844 -60392435 -68838870 -84791412 -109179460 -127382468 -137443928
18408a37443928r484276l886018O624297J0881126J0732417R967608Q383851P004918
$$ -137443928 -146928204 -150814222 -144189925 -133308799 -122576382 -112608774 -104224923 -97220005
18400i7220005O256042N331722M236297L529145L305752K940821K564071K356109
$$ -97220005 -90963963 -85632241 -81395944 -77866799 -74561047 -71620226 -69056155 -66700046
18392f6700046K660826K351926J979100K248062J457001R41345J734227J580317
$$ -66700046 -64039220 -61687294 -59708194 -57460132 -56003131 -55061786 -53327559 -51747242
18384e1747242J476243J762992J936888J977771J661715J642619J262800R91641
$$ -51747242 -50270999 -48508007 -46571119 -44593348 -42931633 -41289014 -40026214 -39034573
18376c9034573J362816J497292J337701J452263J288535J569596J795797J293233
$$ -39034573 -37671757 -36174465 -34836764 -33384501 -32095966 -30526370 -28730573 -27437340
18368b7437340J305741J443569R07222J004486N54017Q77097J319083J038738
$$ -27437340 -26131599 -24688030 -23780808 -22776322 -22222305 -21345208 -20026125 -18987387
18360a8987387Q45669J044630J324493J097040J134405R38663J150813R27191
$$ -18987387 -18141718 -17097088 -15772595 -14675555 -13541150 -12602487 -11451674 -10524483
18352a0524483Q88754J113586Q48095P83237J032844J027538J001270R87226R55618
$$ -10524483 -9635729 -8522143 -7674048 -6890811 -5857967 -4830429 -3829159 -2841933 -1886315
18343a886315J210366J125780Q53906P98153J122591J231692J118051Q67377O70461
$$ -1886315 -675949 449831 1303737 2101890 3224481 4456173 5574224 6441601 7112062
18334G112062R56963J083387J238379J489975J013333J223276J391632J371117
$$ 7112062 8069025 9152412 10390791 11880766 12894099 14117375 15509007 16880124
18326A6880124J232921J410964J033491J199778J616979K043744J736484J470729
$$ 16880124 18113045 19524009 20557500 21757278 23374257 25418001 27154485 28625214
18318B8625214J267298J948768J924113J780668K125651J993615J919636J706263
$$ 28625214 29892512 31841280 33765393 35546061 37671712 39665327 41584963 43291226
18310D3291226K084107K368468K099241K481969K793478L125960K816837K902744
$$ 43291226 45375333 47743801 49843042 52325011 55118489 58244449 61061286 63964030
18302F3964030K748937L019660L602676L172105L322893M230308N290596O305322
$$ 63964030 66712967 69732627 73335303 76507408 79830301 84060609 89351205 95656527
18294I5656527O395073O418273O637797P621269Q975674J0433950J2082746J3895408
$$ 95656527 102051600 108469873 115107670 122728939 131704613 142138563 154221309 168116717
18286A68116717J5421966J4467152P856061m486938j5010391j7645311k0626806
$$ 168116717 183538683 198005835 205861896 201374958 186364567 168719256 148092450
18279A48092450k5775711j3753939J1473770K0601048P591356k2005935m5222273
$$ 148092450 122316739 108562800 120036570 140637618 148228974 126223039 81000766
18272H1000766n2954372o5145545p6563679m8169419K032783K2626291J6824515
$$ 81000766 28046394 -37099151 -113662830 -161832249 -159799466 -137173175 -120348660
18265a20348660r41852j3882511k0292287k9555153l5483914j7636608P411037
$$ -120348660 -121290512 -135173023 -155465310 -185020463 -220504377 -238140985 -230729948
18258b30729948J6884312J7100533J5370355J3116202J1523194R592616Q270621
$$ -230729948 -213845636 -196745103 -181374748 -168258546 -156735352 -147142736 -138872115
18251a38872115P299883O232275O051740N292782M679593M152897M179756M251189
$$ -138872115 -131572232 -125339957 -119288217 -113995435 -109315842 -105162945 -100983189 -96732000
18243i6732000M037234L541423K996848K878447K802600K598350K413428K676805
$$ -96732000 -92694766 -89153343 -86156495 -83278048 -80475448 -77877098 -75463670 -72786865
18235g2786865K607966K250161J979713J902435J993851K028798K201867K279770
$$ -72786865 -70178899 -67928738 -65949025 -64046590 -62052739 -60023941 -57822074 -55542304
18227e5542304J739337J654959J713363K135704J895193J745184J433865J280653
$$ -55542304 -53802967 -52148008 -50434645 -48298941 -46403748 -44658564 -43224699 -41944046
18219d1944046J708614J644076J024304J297717J824412J602957J543930J188144
$$ -41944046 -40235432 -38591356 -37567052 -36269335 -34444923 -32841966 -31298036 -30109892
18211c0109892J347147J309158J420802J212296J444479J349877J645397J216839
$$ -30109892 -28762745 -27453587 -26032785 -24820489 -23376010 -22026133 -20380736 -19163897
18203a9163897J637841J602145J221701J466526J510670J043697J198135J771722
$$ -19163897 -17526056 -15923911 -14702210 -13235684 -11725014 -10681317 -9483182 -7711460
18195g711460J625469J175301J232248J213696J247939J367140J621415J475351
$$ -7711460 -6085991 -4910690 -3678442 -2464746 -1216807 150333 1771748 3247099
18187C247099J413102J368371J493693J332222J705645J924897J899113J696059
$$ 3247099 4660201 6028572 7522265 8854487 10560132 12485029 14384142 16080201
18179A6080201J920543K053471J777338J862715J932648K050575J553365K126352
$$ 16080201 18000744 20054215 21831553 23694268 25626916 27677491 29230856 31357208
18171C1357208K265454K664218K389198K689114K360685K664966L229251L181267
$$ 31357208 33622662 36286880 38676078 41365192 43725877 46390843 49620094 52801361
18163E2801361L741770L814124M072630L866786M187259M893911N726570O369395
$$ 52801361 56543131 60357255 64429885 68296671 72483930 77377841 83104411 89473806
18155H9473806O020424O413158P602464Q403646R374311J0570102J1797681J3258095
$$ 89473806 95494230 101907388 109509852 117913498 127287809 137857911 149655592 162913687
18147A62913687J4707443J6253571J5969482J2635286L467245q014925j4401288
$$ 162913687 177621130 193874701 209844183 222479469 225946714 217931789 203530501
18140B03530501j8575520k5837059k9386642k2354582j5907107j7244608k8076747
$$ 203530501 184954981 159117922 129731280 107376698 91469591 74224983 46148236
18133D6148236m2879848m3490459k8728787k0647024k0577803j4876343r068411
$$ 46148236 3268388 -40222071 -68950858 -89597882 -110175685 -125052028 -134120439
18126a34120439q391185j1199754j5613338j0327790N943178J9274532K4581825
$$ -134120439 -142511624 -153711378 -169324716 -179652506 -173709328 -154434796 -129852971
18119a29852971K5631429K5728556K6570785K9009699L0601075K9682371J7374960
$$ -129852971 -104221542 -78492986 -51922201 -22912502 7688573 37370944 54745904
18112E4745904j9148424n9028506o3554253p1177544j05352787r6714197j2434949
$$ 54745904 35597480 -23431026 -86985279 -158162823 -263515610 -360229807 -372664756
18105c72664756K9418580L1992702K6966206K1955474J7769252J4242112J1898891
$$ -372664756 -343246176 -311253474 -284287268 -262331794 -244562542 -230320430 -218421539
18098b18421539J0151168Q993972Q183991O673038N982245N361492M867724M618149
$$ -218421539 -208270371 -199276399 -191092408 -184419370 -178437125 -173075633 -168207909 -163589760
18090a63589760M742446M247754L722516L426401L338800K962087K984149K675809
$$ -163589760 -158847314 -154599560 -150877044 -147450643 -144111843 -141149756 -138165607 -135489798
18082a35489798K690147K824621K746898K304238K174117K021209J766666J510994
$$ -135489798 -132799651 -129975030 -127228132 -124923894 -122749777 -120728568 -118961902 -117450908
18074a17450908J399924J356354J582473J610821J333800J312198J675070J198248
$$ -117450908 -116050984 -114694630 -113112157 -111501336 -110167536 -108855338 -107180268 -105982020
18066a05982020J536807J328009J003786J243450J224293J168737J272118J105910
$$ -105982020 -104445213 -103117204 -102113418 -100869968 -99645675 -98476938 -97204820 -96098910
18058i6098910J053905J431809J459471P80059R06838J317195R19726M92455O19280
$$ -96098910 -95045005 -93613196 -92153725 -91373666 -90466828 -89149633 -88229907 -87737452 -87118172
18049h7118172O44790N05044R62691J167293P93623R64553R74766Q44084P54319
$$ -87118172 -86473382 -85968338 -85005647 -83838354 -83044731 -82080178 -81105412 -80261328 -79507009
18040g9507009P59031N31274J82148O55532Q12215Q03453M73227Q37686M13778
$$ -79507009 -78747978 -78216704 -78034556 -77379024 -76566809 -75763356 -75290129 -74452443 -74038665
18031g4038665N17463O38715N33571Q49496L90646L63079N31304L07447J26276
$$ -74038665 -73521202 -72882487 -72348916 -71499420 -71108774 -70745695 -70214391 -69906944 -69780668
18022f9780668K61027J36645O78798N69357L05920K54114L53062L65657L11958
$$ -69780668 -69519641 -69382996 -68704198 -68134841 -67828921 -67574807 -67221745 -66856088 -66544130
18013f6544130M63891K91091L36612M51352N69904N15126K10694K33754K93207
$$ -66544130 -66080239 -65789148 -65452536 -65001184 -64431280 -63916154 -63705460 -63471706 -63178499
18004f3178499O37382L82989M61213J76607M31377m7855K82230P78823K22699
$$ -63178499 -62541117 -62158128 -61696915 -61520308 -61088931 -61136786 -60854556 -60075733 -59853034
17995e9853034J74645K87397J71485L33456N93120Q9866K35574N05980M18533
$$ -59853034 -59678389 -59390992 -59219507 -58886051 -58292931 -58203065 -57967491 -57461511 -57042978
17986e7042978O93254L62091p5264K68191m0201M09861K61071M19611L17933L41657
$$ -57042978 -56349724 -55987633 -56062897 -55794706 -55834907 -55425046 -55163975 -54744364 -54426431 -54084774
17976e4084774M6388K8654L88960O49026M85594J05009K5968j09373J88998J45405
$$ -54084774 -54038386 -54009732 -53620772 -52971746 -52486152 -52381143 -52355175 -52464548 -52275550 -52130145
17966e2130145K0852K21579J06179M00109J25388K93235K47158K29934N32891
$$ -52130145 -52109293 -51887714 -51781535 -51381426 -51256038 -50962803 -50715645 -50485711 -49952820
17957d9952820M28002L11182L71441M28494k6337M1130Q6538M49643J01166k3168
$$ -49952820 -49524818 -49213636 -48842195 -48413701 -48440038 -48398908 -48312370 -47862727 -47761561 -47784729
17947d7784729K25676L17987n9671j13482k99542K26446K65103k37770j77158
$$ -47784729 -47559053 -47241066 -47300737 -47414219 -47713761 -47487315 -47222212 -47459982 -47637140
17938d7637140k13369J99838k760k05985N25382O28188N20077M46900p1304Q6945
$$ -47637140 -47850509 -47650671 -47653431 -47859416 -47334034 -46705846 -46185769 -45738869 -45810173 -45723228
17928d5723228J89354K00133K73398L75624K46164k29138k90383L148n5420N04451
$$ -45723228 -45533874 -45333741 -45060343 -44684719 -44438555 -44667693 -44958076 -44954928 -45010348 -44505897
17918d4505897L19708L31175L59483L14317J82553K50504K21543M3646J03428
$$ -44505897 -44186189 -43855014 -43495531 -43181214 -42998661 -42748157 -42526614 -42482968 -42379540
17909d2379540J94835R3578J90026o356J44108M69857O10519O03043R3885p8252
$$ -42379540 -42184705 -42091127 -41901101 -41907457 -41763349 -41293492 -40682973 -40079930 -39986045 -40064297
17899d0064297o3163L61142l0516k14598k64800N9056Q546k29296n0913K34853
$$ -40064297 -40127460 -39766318 -39796834 -40011432 -40276232 -40217176 -40208630 -40437926 -40488839 -40253986
17889d0253986K05968k5864k20276k91736j19611K03850K39901N24148K03626
$$ -40253986 -40048018 -40073882 -40294158 -40585894 -40705505 -40501655 -40261754 -39737606 -39533980
17880c9533980J18490J94381j73533n8158O432L29263M06560J88618J98282M20164
$$ -39533980 -39415490 -39221109 -39394642 -39452800 -39446368 -39117105 -38710545 -38521927 -38323645 -37903481
17870c7903481J37796p0127J31712J88644k12678p2516K31954L84475K76438J13002
$$ -37903481 -37765685 -37835812 -37704100 -37515456 -37728134 -37800650 -37568696 -37184221 -36907783 -36794781
17860c6794781j06938k44571j33605K60648M04971K576M5792m1129L44139J90038
$$ -36794781 -36901719 -37146290 -37279895 -37019247 -36614276 -36611700 -36565908 -36607037 -36262898 -36072860
17850c6072860j08065R1525L66266N36513j82209q2749L9965L28828k0959j5777
$$ -36072860 -36180925 -36089400 -35723134 -35186621 -35368830 -35451579 -35411614 -35082786 -35103745 -35119522
17840c5119522K26627K32904J66004q4691p5541K66601K17593L62732q6912l93727
$$ -35119522 -34892895 -34659991 -34493987 -34578678 -34654219 -34387618 -34170025 -33807293 -33894205 -34287932
17830c4287932m8740J28984L90767J58973k57872j21008K19530Q5895J93265L12839
$$ -34287932 -34336672 -34207688 -33816921 -33657948 -33915820 -34036828 -33817298 -33731403 -33538138 -33225299
17820c3225299J640j82836J03131l60114j05225m7566L29723m7967J83138R9713
$$ -33225299 -33223659 -33406495 -33303364 -33663478 -33768703 -33816269 -33486546 -33534513 -33351375 -33251662
17810c3251662R0990M30354M13310J85909k26832q6713o3375k45706j85897N6315
$$ -33251662 -33160672 -32730318 -32317008 -32131099 -32357931 -32444644 -32508019 -32753725 -32939622 -32883307
17800c2883307M11668M6274q3305J14134J67333M17073J57727l202J12750P4261
$$ -32883307 -32471639 -32425365 -32508670 -32394536 -32227203 -31810130 -31652403 -31655605 -31542855 -31468594
17790c1468594k97580m22861J30405K75157K32134m6360q9990L8631J52956K51928
$$ -31468594 -31766174 -32189035 -32058630 -31783473 -31551339 -31597699 -31687689 -31649058 -31496102 -31244174
17780c1244174L82290J43086L22070O3004o1697l79j5218J78927j96962k45654
$$ -31244174 -30861884 -30718798 -30396728 -30333724 -30395421 -30395800 -30411018 -30232091 -30429053 -30674707
17770c0674707q9875P1777M37244K08852l047O8077j44225r750J03137N3898l722
$$ -30674707 -30764582 -30692805 -30255561 -30046709 -30049756 -29981679 -30125904 -30135654 -30032517 -29978619 -29982341
17759b9982341l20113k4354N89862N52317J31724l5331l53259j10593K89472L26166
$$ -29982341 -30302454 -30326808 -29736946 -29184629 -29052905 -29088236 -29441495 -29552088 -29262616 -28936450
17749b8936450K70063J68890k11305K60032J50571j87245k35357k26075L66530
$$ -28936450 -28666387 -28497497 -28708802 -28448770 -28298199 -28485444 -28720801 -28946876 -28580346
17740b8580346L69750L47810l28859l96995p6671l7687Q8907L39561M55130m0392
$$ -28580346 -28210596 -27862786 -28191645 -28588640 -28665311 -28702998 -28614091 -28274530 -27819400 -27859792
17730b7859792K17323M12501j33058k23919o7156R6672j21317m81961j49771J25954
$$ -27859792 -27642469 -27229968 -27363026 -27586945 -27654101 -27557429 -27678746 -28160707 -28310478 -28184524
17720b8184524K2008j1061K48000M8902q1386N9766L17812L3934j79976R6535
$$ -28184524 -28162516 -28173577 -27925577 -27876675 -27958061 -27898295 -27580483 -27546549 -27726525 -27629990
17710b7629990J41490M12764O3930p3661K19349n4867q3833M75627L94122k00182
$$ -27629990 -27488500 -27075736 -27011806 -27085467 -26866118 -26920985 -27004818 -26529191 -26135069 -26335251
17700b6335251k1588J41711J28749J36283l34715K59927J12246j22873J031K27046
$$ -26335251 -26356839 -26215128 -26086379 -25950096 -26284811 -26024884 -25912638 -26035511 -26034480 -25807434
17690b5807434K38942j03500J55181N8346j16042j9939L00685K3197K11866J52122
$$ -25807434 -25568492 -25671992 -25516811 -25458465 -25574507 -25594446 -25293761 -25270564 -25058698 -24906576
17680b4906576O7454J888K9223K22395L04547j8995J6477K29202n7409k09999
$$ -24906576 -24839122 -24837234 -24808011 -24585616 -24281069 -24300064 -24283587 -24054385 -24111794 -24321793
17670b4321793N1331R5791j5617q8668j35534k01133j68456L94085R2773l51886
$$ -24321793 -24270462 -24174671 -24190288 -24278956 -24414490 -24615623 -24784079 -24389994 -24297221 -24649107
17660b4649107k96279j48635k49492l45576j65327K78581J27404j72334o3328
$$ -24649107 -24945386 -25094021 -25343513 -25689089 -25854416 -25575835 -25448431 -25620765 -25684093
17651b5684093J15208J44033k82880l59567J19281M6447J27206K49192M74494
$$ -25684093 -25568885 -25424852 -25707732 -26067299 -25948018 -25901571 -25774365 -25525173 -25050679
17642b5050679K28172J62880J94472k54039j4332m4751q3840J55304M52896P87228
$$ -25050679 -24822507 -24659627 -24465155 -24719194 -24733526 -24778277 -24862117 -24706813 -24253917 -23466689
17632b3466689L45271l18249p31423j02631j04231K9318K75687J3804J08903K47015
$$ -23466689 -23121418 -23439667 -24171090 -24273721 -24377952 -24348634 -24072947 -24059143 -23950240 -23703225
17622b3703225K517o7581j21476j84153J23451n3010r6650m01439l01754r757
$$ -23703225 -23700708 -23768289 -23889765 -24073918 -23950467 -24003477 -24100127 -24501566 -24803320 -24813077
17612b4813077N80817M61694K19580N9986j21458J98860l3328k45316J59483J38886
$$ -24813077 -24232260 -23770566 -23550986 -23491000 -23612458 -23413598 -23446926 -23692242 -23532759 -23393873
17602b3393873K85821L52108n6377j01002m90554l92900Q7684M74021J58984J64162
$$ -23393873 -23108052 -22755944 -22812321 -22913323 -23403877 -23796777 -23709093 -23235072 -23076088 -22911926
17592b2911926P2794P4648J74017o3071k806K62144M3000j74576O6642L56682
$$ -22911926 -22839132 -22764484 -22590467 -22653538 -22656344 -22394200 -22351200 -22525776 -22459134 -22102452
17582b2102452J43979k52828j78763K32361L43961J31058K70717j40448J05191
$$ -22102452 -21958473 -22211301 -22390064 -22157703 -21813742 -21682684 -21411967 -21552415 -21447224
17573b1447224j96034k85950n2429M21394P524l61496j9388K4756L5656K32407
$$ -21447224 -21643258 -21929208 -21981637 -21560243 -21552719 -21914215 -21933603 -21908847 -21873191 -21640784
17563b1640784K5362j21194K46600M83531K11030l30202l24225K76941L32269
$$ -21640784 -21615422 -21736616 -21490016 -21006485 -20795455 -21125657 -21449882 -21172941 -20840672
17554b0840672r3013k79397k28767N9576N12530k1932j08730O9597o7346J86334
$$ -20840672 -20933685 -21213082 -21441849 -21382273 -20869743 -20891675 -21000405 -20930808 -20998154 -20811820
17544b0811820K27963J30825L63576J78491r9941L23047L02567j84964l95702
$$ -20811820 -20583857 -20453032 -20089456 -19910965 -20010906 -19687859 -19385292 -19570256 -19965958
17535a9965958Q9889K52743K69325L2977k74232k88921n03856N1032L69733r5506
$$ -19965958 -19876069 -19623326 -19354001 -19321024 -19595256 -19884177 -20388033 -20337001 -19967268 -20062774
17525b0062774N3328P6223j74668p09728n51110l42724K94765J5344j731m3898
$$ -20062774 -20009446 -19933223 -20107891 -20817619 -21368729 -21711453 -21416688 -21401344 -21403075 -21446973
17515b1446973k51209L15379J45331l86024k43529k9383J15960M6897n3325L57316
$$ -21446973 -21698182 -21382803 -21237472 -21623496 -21867025 -21896408 -21780448 -21733551 -21786876 -21429560
17505b1429560K2217M11681R1621J04696K56342n2964k66095L17490J12784n8245
$$ -21429560 -21407343 -20995662 -20904041 -20799345 -20543003 -20595967 -20862062 -20544572 -20431788 -20490033
17495b0490033J88125R7835j74950J9812J35946j15149n08618L4028K05821Q6347
$$ -20490033 -20301908 -20204073 -20379023 -20359211 -20223265 -20338414 -20847032 -20813004 -20607183 -20520836
17485b0520836L14955J07265m19N7140k59650k11994j6129J00572r6746J28767
$$ -20520836 -20205881 -20098616 -20099035 -20041895 -20301545 -20513539 -20529668 -20429096 -20525842 -20397075
17475b0397075k5802j45995O5517j60023m6916K36574P3660l17585L49122M61199
$$ -20397075 -20422877 -20568872 -20503355 -20663378 -20710294 -20473720 -20400060 -20717645 -20368523 -19907324
17465a9907324r3588L37992N4332L25927k39244l73134l8301M41183n927k84984
$$ -19907324 -20000912 -19662920 -19608588 -19282661 -19521905 -19895039 -19933340 -19492157 -19498084 -19783068
17455a9783068L0003l1789J00605N9324n872N5735K06710J4946M93103M49821
$$ -19783068 -19753065 -19784854 -19684249 -19624925 -19630797 -19575062 -19368352 -19353406 -18860303 -18410482
17445a8410482l63844l08210n97980p73454o42185n2799J02352L50818M29484
$$ -18410482 -18774326 -19082536 -19680516 -20453970 -21096155 -21148954 -21046602 -20695784 -20266300
17436b0266300N42220p7990l07090p7261J58574J69980R1179k01265k59408J99490
$$ -20266300 -19724080 -19802070 -20109160 -20186421 -20027847 -19857867 -19766688 -19967953 -20227361 -20027871
17426b0027871M02602K55167p2295m01795j57095K42968K51955K60972l58898
$$ -20027871 -19625269 -19370102 -19442397 -19844192 -20001287 -19758319 -19506364 -19245392 -19604290
17417a9604290K81423N41729J06573k42188n2269R3228m8648j51203Q2676K65271
$$ -19604290 -19322867 -18781138 -18674565 -18916753 -18969022 -18875794 -18924442 -19075645 -18992969 -18727698
17407a8727698j9180K99525K7040j39194k53636l0378P1549M2459J76424k09006
$$ -18727698 -18746878 -18447353 -18420313 -18559507 -18813143 -18843521 -18771972 -18729513 -18553089 -18762095
17397a8762095k00236K2944J69437j03212k4451m9272J09815J84672L74791K48710
$$ -18762095 -18962331 -18939387 -18769950 -18873162 -18897613 -18946885 -18837070 -18652398 -18277607 -18028897
17387a8028897k03287l91762J95176J83081O2999J4293K6083R0878K57152o5147
$$ -18028897 -18232184 -18623946 -18428770 -18245689 -18182690 -18168397 -18142314 -18051436 -17794284 -17859431
17377a7859431P3976j47508j81612J38293j02787j57132l4796N9155l75468K13550
$$ -17859431 -17785455 -17932963 -18114575 -17976282 -18079069 -18236201 -18270997 -18211842 -18587310 -18373760
17367a8373760K99085L28896k17712M4590L30842L35919O7795l86371M7753m7922
$$ -18373760 -18074675 -17745779 -17963491 -17918901 -17588059 -17252140 -17184345 -17570716 -17522963 -17570885
17357a7570885N4474J32303k64409N7922o3403j06136J39046J57869J6022L58958
$$ -17570885 -17516411 -17384108 -17648517 -17590595 -17653998 -17760134 -17621088 -17463219 -17447197 -17088239
17347a7088239n5793l73179r5009M18618j94199k64748J01202J15112q9145M11223
$$ -17088239 -17144032 -17517211 -17612220 -17193602 -17387801 -17652549 -17551347 -17436235 -17525380 -17114157
17337a7114157r2534J81746J43137j22000n8750N2889M8960p0669R8871k49443
$$ -17114157 -17206691 -17024945 -16881808 -17003808 -17062558 -17009669 -16960709 -17031378 -16932507 -17181950
17327a7181950l09461N5400J01779j14988k85235N3137L33522N0599K13926J86906
$$ -17181950 -17491411 -17436011 -17334232 -17449220 -17734455 -17681318 -17347796 -17297197 -17083271 -16896365
17317a6896365j36552N8785j03190P4610J11847j75618p5689K09788k53505Q0174
$$ -16896365 -17032917 -16974132 -17077322 -17002712 -16890865 -17066483 -17142172 -16932384 -17185889 -17105715
17307a7105715J47268l17087j93838L60899L02953K05635k99807N2439L74096
$$ -17105715 -16958447 -17275534 -17469372 -17108473 -16805520 -16599885 -16899692 -16847253 -16473157
17298a6473157J6236R1301j23381q0264o8976J84163j19834k4467l714L8414O1404
$$ -16473157 -16456921 -16365620 -16489001 -16569265 -16638241 -16454078 -16573912 -16598379 -16602093 -16563679 -16502275
17287a6502275p8292j87416l8119k6987J73795L08445k54403j32392L55259q0225
$$ -16502275 -16580567 -16767983 -16806102 -16833089 -16659294 -16350849 -16605252 -16737644 -16382385 -16462610
17277a6462610p6816j6768J53348P1213P6597J16546j29332L3978j6714j31144
$$ -16462610 -16539426 -16556194 -16402846 -16331633 -16255036 -16138490 -16267822 -16233844 -16250558 -16381702
17267a6381702r855k1253J25814J51389l256J37141K19533p9976N5804j47529
$$ -16381702 -16391557 -16412810 -16286996 -16135607 -16138863 -16001722 -15782189 -15862165 -15806361 -15953890
17257a5953890k01465K3402J83381j40429j08588M01447Q5576L47241K20329J42251
$$ -15953890 -16155355 -16131953 -15948572 -16089001 -16197589 -15796142 -15710566 -15363325 -15142996 -15000745
17247a5000745j37296k67837m86556k68372k171J95452r8696q0133N9045M2996
$$ -15000745 -15138041 -15405878 -15892434 -16160806 -16162977 -15967525 -16066221 -16146354 -16087309 -16044313
17237a6044313J01504J13164J75960m4460j60762L19083J14651O5146K54603P6162
$$ -16044313 -15942809 -15829645 -15653685 -15698145 -15858907 -15539824 -15425173 -15360027 -15105424 -15029262
17227a5029262p2376K21922K36658l90404q9502r9117J14573J16166j39657K10514
$$ -15029262 -15101638 -14879716 -14643058 -15033462 -15122964 -15222081 -15107508 -14991342 -15130999 -14920485
17217a4920485K35585m79668k81531N0580P3676n4725j9129M6426j10245K59071
$$ -14920485 -14684900 -15164568 -15446099 -15395519 -15321843 -15376568 -15395697 -15349271 -15459516 -15200445
17207a5200445j9123k29075L70951J01165j82592j20081J78135K72052M86323
$$ -15200445 -15219568 -15448643 -15077692 -14976527 -15159119 -15279200 -15101065 -14829013 -14342690
17198a4342690L0834l31790m73723k45126J25153Q5181K67778O0511j12307P5106
$$ -14342690 -14311856 -14643646 -15117369 -15362495 -15237342 -15152161 -14884383 -14823872 -14936179 -14861073
17188a4861073r2458j24393j28205j82570n6012L4180r946N1056K84417k5734
$$ -14861073 -14953531 -15077924 -15206129 -15388699 -15444711 -15410531 -15420477 -15369421 -15085004 -15110738
17178a5110738k63313K12917k1429p5543O8644M2286j69451J01609L63098L5197
$$ -15110738 -15374051 -15161134 -15182563 -15258106 -15189462 -15147176 -15316627 -15215018 -14851920 -14816723
17168a4816723n90897p198J53804K24485N9373M0363J22407j2603j53803K01033
$$ -14816723 -15407620 -15414818 -15261014 -15036529 -14977156 -14936793 -14814386 -14826989 -14980792 -14779759
17158a4779759L36349K11232j8017M2748P8824m3711l63666l07557k55462J7873
$$ -14779759 -14443410 -14232178 -14250195 -14207447 -14128623 -14172334 -14536000 -14843557 -15099019 -15081146
17148a5081146J90076K15527m6666L8533r5199K1870o9350Q0898k46811l28790
$$ -15081146 -14891070 -14675543 -14722209 -14683676 -14778875 -14757005 -14826355 -14745457 -14992268 -15321058
17138a5321058R7188L47180J21127k57589p956o9348j72577K8895L28323P0263
$$ -15321058 -15223870 -14876690 -14755563 -15013152 -15021108 -15090456 -15263033 -15234138 -14905815 -14835552
17128a4835552k83497p5934K48015K11200k08173p8159L07129K26724K03008K5415
$$ -14835552 -15119049 -15194983 -14946968 -14735768 -14943941 -15022100 -14714971 -14488247 -14285239 -14259824
17118a4259824K83099K6942j99360K01043L26248J48172j54575m82381r334l11100
$$ -14259824 -13976725 -13949783 -14149143 -13948100 -13621852 -13473680 -13628255 -14110636 -14119970 -14431070
17108a4431070j04899r889Q3012K61798Q9247J50318k14072J11146j63221J23618
$$ -14431070 -14535969 -14545858 -14462846 -14201048 -14111801 -13961483 -14175555 -14064409 -14227630 -14104012
17098a4104012Q3335K67476L371P879k15030n9166r3886j72760l59619R7782O00347
$$ -14104012 -14020677 -13753201 -13749830 -13741951 -13956981 -14016147 -14110033 -14282793 -14642412 -14544630 -13944283
17087a3944283O8534l0148j38357k1118j69971k8626R9966k09651p6123K09386
$$ -13944283 -13875749 -13905897 -14044254 -14065372 -14235343 -14263969 -14164003 -14373654 -14449777 -14240391
17077a4240391K85482k5284N0207L68552K28170k45362k71870l49985j71159J11152
$$ -14240391 -13954909 -13980193 -13929986 -13561434 -13333264 -13578626 -13850496 -14200481 -14371640 -14260488
17067a4260488J74150L85487J72333j66647j8306k2397j34212R9408Q398K50963
$$ -14260488 -14086338 -13700851 -13528518 -13695165 -13713471 -13735868 -13870080 -13770672 -13762274 -13511311
17057a3511311K13096j72487p7627L09547j79597j23163L05630J19215l50241
$$ -13511311 -13298215 -13470702 -13548329 -13238782 -13418379 -13541542 -13235912 -13116697 -13466938
17048a3466938r6296J35592J16903l15176q2869q0092r4332K51686L79755n1526
$$ -13466938 -13563234 -13427642 -13310739 -13625915 -13708784 -13788876 -13883208 -13631522 -13251767 -13303293
17038a3303293J93753R7190k98944k27872j08418o0315M3414P0904L7890p7331
$$ -13303293 -13109540 -13012350 -13311294 -13539166 -13647584 -13707899 -13664485 -13593581 -13555691 -13633022
17028a3633022r4557k64242m4265K50856O45606J85462O644j88637R3080j6928
$$ -13633022 -13727579 -13991821 -14036086 -13785230 -13139624 -12954162 -12947518 -13136155 -13043075 -13060003
17018a3060003j65258j67539o6220M3983j14320k9748R2630K91714L09578P5026
$$ -13060003 -13225261 -13392800 -13459020 -13415037 -13529357 -13559105 -13466475 -13174761 -12865183 -12790157
17008a2790157R8285O9314n16217k78831k88897j10991k2457N08793L03780l3246
$$ -12790157 -12691872 -12622558 -13138775 -13417606 -13706503 -13817494 -13839951 -13331158 -13027378 -13060624
16998a3060624q6733Q5664J18982j32455l7255j31634l12970J95831K94206j15266
$$ -13060624 -13147357 -13061693 -12942711 -13075166 -13112421 -13244055 -13557025 -13361194 -13066988 -13182254
16988a3182254j8755L5685p6752l17400k09497K03511L64460N42244N79198J42360
$$ -13182254 -13201009 -13165324 -13242076 -13559476 -13768973 -13565462 -13201002 -12658758 -12079560 -11937200
16978a1937200k73218j43741L9225n08846k95987K7069k2412L07524J76209Q0137
$$ -11937200 -12210418 -12354159 -12314934 -12823780 -13119767 -13092698 -13115110 -12807586 -12631377 -12551240
16968a2551240K1038P3522j50001j3206N5861j59728k0657J46598K3871J50622
$$ -12551240 -12530202 -12456680 -12606681 -12619887 -12564026 -12723754 -12744411 -12597813 -12573942 -12423320
16958a2423320K4610P0040O4540R7878k58779j70526L13676K35141l92969q6723
$$ -12423320 -12398710 -12328670 -12264130 -12166252 -12425031 -12595557 -12281881 -12046740 -12439709 -12526432
16948a2526432j30813j42959k4378K95885K40817J92606K03404m52214l17528
$$ -12526432 -12657245 -12800204 -12824582 -12528697 -12287880 -12095274 -11891870 -12344084 -12661612
16939a2661612L3260k2634J00889o2411j15284J37969N9333K37866Q5040k76169
$$ -12661612 -12628352 -12650986 -12550097 -12612508 -12727792 -12589823 -12530490 -12292624 -12207584 -12483753
16929a2483753j36794j83686L51695M80891K9560k30111q1780j21511j0317P5800
$$ -12483753 -12620547 -12804233 -12452538 -11971647 -11942087 -12172198 -12253978 -12375489 -12385806 -12310006
16919a2310006j58112o6336J90247j01021J62387j4765k61984k17944k98258L42736
$$ -12310006 -12468118 -12534454 -12344207 -12445228 -12282841 -12297606 -12559590 -12777534 -13075792 -12733056
16909a2733056L095K5496K585j83991N6455L03943N5312J58199M7231K6939L06429
$$ -12733056 -12729961 -12704465 -12701880 -12885871 -12829416 -12525473 -12470161 -12311962 -12264731 -12237792 -11931363
16898a1931363M44778N4604m3709j64107k46096p5595M2951l8549K21285J68537
$$ -11931363 -11486585 -11431981 -11475690 -11639797 -11885893 -11961488 -11918537 -11957086 -11735801 -11567264
16888a1567264k63901m5985L6693j77231k03307J07377l303J20852l03919N0540
$$ -11567264 -11831165 -11877150 -11840457 -12017688 -12220995 -12113618 -12116921 -11996069 -12299988 -12249448
16878a2249448L1975j9889J05556J7525O7746K45988K08336j08388j88366k7985
$$ -12249448 -12217473 -12237362 -12131806 -12114281 -12046535 -11800547 -11592211 -11700599 -11888965 -11916950
16868a1916950k0363Q3938K81109M3305k42199J10925k41548p1412J52169J88239
$$ -11916950 -11937313 -11853375 -11572266 -11528961 -11771160 -11660235 -11901783 -11973195 -11821026 -11632787
16858a1632787J00227k32026Q2680j61440j65447p4496J37746J14576j18658j56052
$$ -11632787 -11532560 -11764586 -11681906 -11843346 -12008793 -12083289 -11945543 -11830967 -11949625 -12105677
16848a2105677K65324j9904j87217L00921M3652L1265N8791K35854k11668j67209
$$ -12105677 -11840353 -11860257 -12047474 -11746553 -11702901 -11671636 -11612845 -11376991 -11588659 -11755868
16838a1755868k572J08106o6228n8518k07598N7865j72774R8350M02880J87331
$$ -11755868 -11758440 -11650334 -11716562 -11775080 -11982678 -11924813 -12097587 -11999237 -11596357 -11409026
16828a1409026J2206n1831l75437m71195M1087M61815N14778R8648l53398j83825
$$ -11409026 -11396820 -11448651 -11824088 -12295283 -12254196 -11792381 -11277603 -11178955 -11532353 -11716178
16818a1716178q4519Q4826l54781o2602o060L49245l9583j3661j02308K19158
$$ -11716178 -11800697 -11715871 -12070652 -12133254 -12139314 -11790069 -11829652 -11843313 -11945621 -11726463
16808a1726463L43392J9514j36334j50723N31359J58914p8205Q948l63797j78845
$$ -11726463 -11383071 -11363557 -11499891 -11650614 -11119255 -10960341 -11038546 -11029598 -11393395 -11572240
16798a1572240K90344Q0617l2577m52893k45007J93309k23274M7144k4187K3242
$$ -11572240 -11281896 -11201279 -11233856 -11686749 -11931756 -11738447 -11961721 -11914577 -11938764 -11915522
16788a1915522M21216L7682k01529N2322J16425n7950j38544N4177K59472j24683
$$ -11915522 -11494306 -11456624 -11658153 -11605831 -11489406 -11547356 -11685900 -11631723 -11372251 -11496934
16778a1496934K25558J81483l30546k95941L30800J82082r0192j05207j9748O31029
$$ -11496934 -11271376 -11089893 -11420439 -11716380 -11385580 -11203498 -11293690 -11398897 -11418645 -10787616
16768a0787616N58258j72490n68825j74355p5137M2390j77204k04136r2637o22
$$ -10787616 -10229358 -10401848 -10970673 -11145028 -11220165 -11177775 -11354979 -11559115 -11651752 -11652374
16758a1652374J81480l9130K11517M00973r8978Q7719J58274j05600J41237j40484
$$ -11652374 -11470894 -11510024 -11298507 -10897534 -10996512 -10908793 -10750519 -10856119 -10714882 -10855366
16748a0855366o5732J21004j60576L8331j09354N2361R8164j71826l27508p047
$$ -10855366 -10921098 -10800094 -10960670 -10922339 -11031693 -10979332 -10881168 -11052994 -11380502 -11387549
16738a1387549K00164L664K72473K06274j47501l30793P9072L1985L02150J86651
$$ -11387549 -11187385 -11183721 -10911248 -10704974 -10852475 -11183268 -11104196 -11072211 -10770061 -10583410
16728a0583410Q9795J48046J2778r6019j56352o9571m6978N3103l57527k65905
$$ -10583410 -10493615 -10345569 -10332791 -10428810 -10585162 -10654733 -10701711 -10648608 -11006135 -11272040
16718a1272040L53293M23535k7433j38590k74684M12011k62369r2555J39985n6048
$$ -11272040 -10918747 -10495212 -10522645 -10661235 -10935919 -10523908 -10786277 -10878832 -10738847 -10794895
16708a0794895l1970k20542K00451m2756P9972M5996j82245j01172k13566J22532
$$ -10794895 -10826865 -11047407 -10846956 -10889712 -10809740 -10763744 -10945989 -11047161 -11260727 -11138195
16698a1138195K38308j81657J9008K99298J63936k16997k4121J43014q48l02424
$$ -11138195 -10899887 -11081544 -11062536 -10763238 -10599302 -10816299 -10840420 -10697406 -10698254 -11000678
16688a1000678M1898J73273K22991m8256j85411J59629K04038k28425k50373l55778
$$ -11000678 -10958780 -10785507 -10562516 -10610772 -10796183 -10636554 -10432516 -10660941 -10911314 -11267092
16678a1267092j85749J73025J7458K42634L14162L6870L1199L72691j01307m28775
$$ -11267092 -11452841 -11279816 -11262358 -11019724 -10705562 -10668692 -10637493 -10264802 -10366109 -10794884
16668a0794884o0761L56261J80275M0301j78609K11031j34597l05607n53598m5301
$$ -10794884 -10855645 -10499384 -10319109 -10278808 -10457417 -10246386 -10380983 -10686590 -11240188 -11285489
16658a1285489J07037J90751K12103j40394J28244N44136J00685l7757k89861
$$ -11285489 -11178452 -10987701 -10775598 -10915992 -10787748 -10243612 -10142927 -10180684 -10470545
16649a0470545j92801K63419J54290p7832j97068J0988K35330K159J44099J675
$$ -10470545 -10663346 -10399927 -10245637 -10323469 -10520537 -10509549 -10274219 -10272060 -10127961 -10126286
16639a0126286J0415J74971j22688J62822K5470k94924l88506j03734J33541j18675
$$ -10126286 -10115871 -9940900 -10063588 -9900766 -9875296 -10170220 -10558726 -10662460 -10528919 -10647594
16629a0647594K5543l4198J77649J28691q9145j76484m04204O1690J99795M31799
$$ -10647594 -10622051 -10656249 -10478600 -10349909 -10439054 -10615538 -11019742 -10958052 -10758257 -10326458
16619a0326458K25225R477l2915j19123j44330j79684K9254K63301k62318Q3115
$$ -10326458 -10101233 -10091756 -10124671 -10243794 -10388124 -10567808 -10538554 -10275253 -10537571 -10454456
16609a0454456R4811J11074K24515k41461J76794k21787j36103J92966K37897
$$ -10454456 -10359645 -10248571 -10024056 -10265517 -10088723 -10310510 -10446613 -10253647 -10015750
16600a0015750L6039K72115J21024l30397k41127L1809J29099l82L5530o0312
$$ -10015750 -9979711 -9707596 -9586572 -9916969 -10158096 -10126287 -9997188 -9997570 -9962040 -10022352
16590a0022352l11836J97956N14531j91877R5342p5585k01500L1669j07352k46687
$$ -10022352 -10334188 -10136232 -9621701 -9813578 -9718236 -9793821 -9995321 -9963652 -10071004 -10317691
16580a0317691j40035J74763J08400j07251o8618K31670n626o2078l0692j53309
$$ -10317691 -10457726 -10282963 -10174563 -10281814 -10350432 -10118762 -10124388 -10186466 -10217158 -10370467
16570a0370467K6K78260L82943J25557J82245K24227j86388l01349q0101J38357
$$ -10370467 -10370441 -10092181 -9709238 -9583681 -9401436 -9177209 -9363597 -9664946 -9745047 -9606690
16560i606690K5327k2098k58541M7721j23743k18018k38652J37138J13870J9753
$$ -9606690 -9581363 -9603461 -9862002 -9814281 -9938024 -10156042 -10394694 -10257556 -10143686 -10123933
16550a0123933m19520Q2774M09601j78380k93493N4107j5137J96990j78598J54956
$$ -10123933 -10543453 -10460679 -10051078 -10229458 -10522951 -10468844 -10483981 -10286991 -10465589 -10310633
16540a0310633M06119J28229k04198K90085K13030K50710K80678J32573k98565
$$ -10310633 -9904514 -9776285 -9980483 -9690398 -9477368 -9226658 -8945980 -8813407 -9111972
16531i111972l26270m0735j19509j50610R3135k52871m00020K46403J97075L02309
$$ -9111972 -9438242 -9478977 -9598486 -9749096 -9655961 -9908832 -10308852 -10062449 -9865374 -9563065
16521i563065k84609k10409j24639L38461K09388m2018J37512K82157j19292n33836
$$ -9563065 -9847674 -10058083 -10182722 -9844261 -9634873 -9676891 -9539379 -9257222 -9376514 -9910350
16511i910350m5401K04084L17980O8889q9478j10447J60405J21685K02102q7687
$$ -9910350 -9955751 -9751667 -9433687 -9364798 -9454276 -9564723 -9404318 -9282633 -9080531 -9168218
16501i168218m8754R8026m3389M7889p8650q9352m3631k6544k49666j38621J29210
$$ -9168218 -9216972 -9118946 -9162335 -9114446 -9193096 -9282448 -9326079 -9352623 -9602289 -9740910 -9611700
16490i611700K39054K33697q7169k50875n8019J25023l1725Q4973J08728l40243
$$ -9611700 -9372646 -9138949 -9226118 -9476993 -9535012 -9409989 -9441714 -9356741 -9248013 -9588256
16480i588256m47185K96524O32472j15715j63032J48593q4754K32912J03474l14401
$$ -9588256 -10035441 -9738917 -9106445 -9222160 -9385192 -9236599 -9321353 -9088441 -8984967 -9299368
16470i299368n01794m15513P9415j06963J66348K35863O4643J24066J04206J00225
$$ -9299368 -9801162 -10216675 -10137260 -10244223 -10077875 -9842012 -9777369 -9653303 -9549097 -9448872
16460i448872j88745L25934J08523o366J54271R996m90197j89631j84776N1016
$$ -9448872 -9637617 -9311683 -9203160 -9209526 -9055255 -9045259 -9535456 -9725087 -9909863 -9858847
16450i858847J98689Q4177j15160j92838J17365K65217j97803j00576J67600J7398
$$ -9858847 -9660158 -9575981 -9691141 -9883979 -9766614 -9501397 -9699200 -9799776 -9632176 -9614778
16440i614778m3319J15440J66467L51051J01240k34669R7996J2116J09967j45426
$$ -9614778 -9658097 -9542657 -9376190 -9025139 -8923899 -9158568 -9060572 -9048456 -8938489 -9083915
16430i083915q3770J91788J00549l03342j31423L89030N3632p9986m20223o0992
$$ -9083915 -9167685 -8975897 -8875348 -9178690 -9310113 -8921083 -8867451 -8947437 -9367660 -9428652
16420i428652P7122M279J26757J46238J87631R7678l20742M891J44406j35352
$$ -9428652 -9351530 -9347251 -9220494 -9074256 -8886625 -8788947 -9109689 -9104798 -8960392 -9095744
16410i095744j10535o9894P0114M24383O3440k52697j2546o8186r7603M49935
$$ -9095744 -9206279 -9276173 -9206059 -8781676 -8718236 -8970933 -8983479 -9051665 -9149268 -8699333
16400h699333J33423L16944J10887m35845o41849j89140j2801j35796p7211O6485
$$ -8699333 -8565910 -8248966 -8138079 -8573924 -9215773 -9404913 -9417714 -9553510 -9630721 -9564236
16390i564236Q3833L25438j25872L58204L77657k08780O7661N5818k93405n7686
$$ -9564236 -9480403 -9154965 -9280837 -8922633 -8544976 -8753756 -8686095 -8630277 -8923682 -8981368
16380h981368j9575N3273Q4418R0362J41591J88747j84531j57958k5729k76584
$$ -8981368 -9000943 -8947670 -8863252 -8772890 -8631299 -8442552 -8627083 -8785041 -8810770 -9087354
16370i087354j37543j78605j30069o2148J95010N03389n216J50294J47962J0049
$$ -9087354 -9224897 -9403502 -9533571 -9595719 -9400709 -8897320 -8902536 -8752242 -8604280 -8594231
16360h594231k32204l97379J74710j61084j83165L10381K67735j27666j05871
$$ -8594231 -8826435 -9223814 -9049104 -9210188 -9393353 -9082972 -8815237 -8942903 -9048774
16351i048774l3631k32958K30832K06154J61366J83574N7824n3902r5922R6427
$$ -9048774 -9082405 -9315363 -9084531 -8878377 -8717011 -8533437 -8475613 -8529515 -8625437 -8529010
16341h529010k30101r3153j65262m5084K50594L12594j79813k20088j44789m3400
$$ -8529010 -8759111 -8852264 -9017526 -9062610 -8812016 -8499422 -8679235 -8899323 -9044112 -9087512
16331i087512L3728m4299L9653P3013j55179k09794j53640J84743K77446r9810
$$ -9087512 -9053784 -9098083 -9058430 -8985417 -9140596 -9350390 -9504030 -9319287 -9041841 -9141651
16321i141651k44760n840K86428J48707R895p2782r8760J3887K42685n1490J56226
$$ -9141651 -9386411 -9392251 -9105823 -8957116 -8947221 -9020003 -9118763 -9104876 -8862191 -8913681 -8757455
16310h757455K86812L47064k88022l64471O002k2428L49338n8276l72424l11891
$$ -8757455 -8470643 -8123579 -8411601 -8776072 -8770070 -8792498 -8443160 -8501436 -8873860 -9185751
16300i185751R0161j33903j40158M01874K5248k9518l4157j87000j72263j06475
$$ -9185751 -9095590 -9229493 -9369651 -8967777 -8942529 -8972047 -9006204 -9193204 -9365467 -9471942
16290i471942M13152K37760K33417r2126k07587l29990R7222r2535m8731Q0822
$$ -9471942 -9058790 -8821030 -8587613 -8679739 -8887326 -9217316 -9120094 -9212629 -9261360 -9180538
16280i180538K69137J57777n8878k34438R6996K30742k46755l23176j01689M93630
$$ -9180538 -8911401 -8753624 -8812502 -9046940 -8949944 -8719202 -8965957 -9289133 -9390822 -8897192
16270h897192M84930K00075l26953K5480J34070k90369q7347N1972J07901j8450
$$ -8897192 -8412262 -8212187 -8539140 -8513660 -8379590 -8669959 -8757306 -8705334 -8597433 -8615883
16260h615883K44636J14584k99435O513l3288J7320K21934K29343j89617q7651
$$ -8615883 -8371247 -8256663 -8556098 -8549585 -8582873 -8565553 -8343619 -8114276 -8303893 -8391544
16250h391544K78323k04809p9456R1673r5412k75287J79333J86206Q2598j84252
$$ -8391544 -8113221 -8318030 -8397486 -8305813 -8401225 -8676512 -8497179 -8310973 -8228375 -8412627
16240h412627k60311j59320K29766r7575k00231J8596J05682o0338J0287K97401
$$ -8412627 -8672938 -8832258 -8602492 -8700067 -8900298 -8881702 -8776020 -8836358 -8826071 -8528670
16230h528670L01634k53271k18702M6977L07828K17210L2926j15909j07432k06003
$$ -8528670 -8227036 -8480307 -8699009 -8652032 -8344204 -8126994 -8094068 -8209977 -8317409 -8523412
16220h523412K65681K52079p0490P2334L02153K34743k55824j87119k4608j9427
$$ -8523412 -8257731 -8005652 -8076142 -8003808 -7701655 -7466912 -7722736 -7909855 -7934463 -7953890
16210g953890J16744j01529L4835l45031n66347m6799N84260J15981j24703K8255
$$ -7953890 -7837146 -7938675 -7903840 -8248871 -8815218 -8862017 -8277757 -8161776 -8286479 -8258224
16200h258224k41559m11307l2402j77772J59568K70619N34769m0875j0220o9410
$$ -8258224 -8499783 -8911090 -8943492 -9121264 -8961696 -8691077 -8156308 -8197183 -8207403 -8276813
16190h276813k02334J9831k66235j15143J17326L31915K70592K8419K32886N9887
$$ -8276813 -8479147 -8459316 -8725551 -8840694 -8723368 -8391453 -8120861 -8092442 -7859556 -7799669
16180g799669R1182R4203k81285l28043m5618l3488m51427j23976J01099K80720
$$ -7799669 -7708487 -7614284 -7895569 -8223612 -8269230 -8302718 -8754145 -8878121 -8777022 -8496302
16170h496302K43083J037o3050j09852L57155J63896M6848l06107j81772J51974
$$ -8496302 -8253219 -8252182 -8315232 -8425084 -8067929 -7904033 -7857185 -8163292 -8345064 -8193090
16160h193090K9026j76532m5012r7587o9781J51879J57060o5161j78752K47431
$$ -8193090 -8164064 -8340596 -8385608 -8483195 -8552976 -8401097 -8244037 -8309198 -8487950 -8240519
16150h240519L84973k95284l65457L7859N3807L95788N0555o824j62521l53925
$$ -8240519 -7855546 -8150830 -8516287 -8478428 -8424621 -8028833 -7978278 -7985102 -8147623 -8501548
16140h501548l79519l7400J92996M10510M60534J07165k04943l70199l19000P693
$$ -8501548 -8881067 -8918467 -8725471 -8314961 -7854427 -7747262 -7952205 -8322404 -8641404 -8633711
16130h633711O4030K20033K69876j02518J82126K16323J9928N9591j80086q1667
$$ -8633711 -8569681 -8349648 -8079772 -8182290 -8000164 -7783841 -7763913 -7704322 -7884408 -7966075
16120g966075k19674l5064M13J83080m32717j81805K18285K08843p6879J2395
$$ -7966075 -8185749 -8220813 -8220400 -8037320 -8470037 -8651842 -8433557 -8224714 -8301593 -8289198
16110h289198k04915j58926N43494K02245m02774m22904j00493J36559N19719
$$ -8289198 -8494113 -8653039 -8109545 -7907300 -8310074 -8732978 -8833471 -8696912 -8177193
16101h177193L49831j72190Q9207J79477j1473j0362j70513Q9182J69045k99264
$$ -8177193 -7827362 -7999552 -7910345 -7730868 -7742341 -7752703 -7923216 -7834034 -7664989 -7964253
16091g964253l7798L16668L326M1475j54979k67420j54988r3650p7421Q2337n0510
$$ -7964253 -8002051 -7685383 -7682057 -7640582 -7795561 -8062981 -8217969 -8311619 -8389040 -8306703 -8357213
16080h357213J13530R7433j22284R9557L66738K21178j27613k10991j73645M2982
$$ -8357213 -8243683 -8146250 -8268534 -8168977 -7802239 -7581061 -7708674 -7919665 -8093310 -8050328
16070h050328J5352J26803K43807M13912j67148j07333J38462K2107j09501Q7208
$$ -8050328 -8034976 -7908173 -7664366 -7250454 -7417602 -7524935 -7386473 -7364366 -7473867 -7386659
16060g386659J06187l06633k46064L68856J22740j70076l33667N2664J92109L50939
$$ -7386659 -7280472 -7587105 -7833169 -7464313 -7341573 -7511649 -7845316 -7792652 -7600543 -7249604
16050g249604K11318l21534r5774r3267l36643k63963k17894K71061J55962k16340
$$ -7249604 -7038286 -7359820 -7455594 -7548861 -7885504 -8149467 -8367361 -8096300 -7940338 -8156678
16040h156678k94987j53694K62223N8170J96327J74924P8668l39748L10679K09423
$$ -8156678 -8451665 -8605359 -8343136 -8284966 -8088639 -7913715 -7835047 -8174795 -7864116 -7654693
16030g654693O3602p0382R1720k5961p4298R6860O4982m4859Q3853k1445j0915
$$ -7654693 -7591091 -7661473 -7569753 -7595714 -7670012 -7573152 -7508170 -7553029 -7469176 -7490621 -7501536
16019g501536l47429j43049J15875P5317p4236R3337J43360o5785O4622J32499
$$ -7501536 -7848965 -7992014 -7876139 -7800822 -7875058 -7781721 -7638361 -7704146 -7639524 -7507025
16009g507025J1989M1733Q5065L90703k67718l7851j97942k76229k3860j06196
$$ -7507025 -7495036 -7453303 -7368238 -6977535 -7245253 -7283104 -7481046 -7757275 -7781135 -7887331
15999g887331N8951j04045O3202M6516N9903N8418j40724J1143l4599k1881L60190
$$ -7887331 -7828380 -7932425 -7869223 -7822707 -7762804 -7704386 -7845110 -7833967 -7868566 -7890447 -7530257
15988g530257K38595R647r4004k17188K8282L13875L19116j45153j15659J16107
$$ -7530257 -7291662 -7282015 -7376019 -7593207 -7564925 -7251050 -6931934 -7077087 -7192746 -7076639
15978g076639l03493m4854l0017j14712N5764l0080J89497J13188l59993k36294
$$ -7076639 -7380132 -7424986 -7455003 -7569715 -7513951 -7544031 -7354534 -7241346 -7601339 -7837633
15968g837633j50496N6071j10886L0902K99564J22984k1980K2244L50713J71820
$$ -7837633 -7988129 -7932058 -8042944 -8012042 -7712478 -7589494 -7611474 -7589230 -7238517 -7066697
15958g066697l49783l85570j61524L17978n1269L2937J67712J87737q2901n36205
$$ -7066697 -7416480 -7802050 -7963574 -7645596 -7696865 -7663928 -7496216 -7308479 -7391380 -7927585
15948g927585j49542K63115N4559k32264j13470P802O6418j2054j16867L56270
$$ -7927585 -8077127 -7814012 -7759453 -7991717 -8105187 -8097385 -8030967 -8043021 -8159888 -7803618
15938g803618K05237l0667j47339l96157j40285N86172L14576M3194r0554J3174
$$ -7803618 -7598381 -7629048 -7776387 -8172544 -8312829 -7726657 -7412081 -7368887 -7459441 -7446267
15928g446267K859J60731j91050J74520J68481l39677l91553r6034J13347Q8432
$$ -7446267 -7443408 -7282677 -7473727 -7299207 -7130726 -7470403 -7861956 -7957990 -7844643 -7756211
15918g756211Q8428P5423J81878O0497n4148J29581j70762l62108J64250l0544
$$ -7756211 -7667783 -7592360 -7410482 -7349985 -7404133 -7274552 -7445314 -7807422 -7643172 -7673716
15908g673716Q5067o9003k10467j66152J53034L62414L77911j05009m43139j13405
$$ -7673716 -7588649 -7657652 -7868119 -8034271 -7881237 -7518823 -7140912 -7245921 -7689060 -7802465
15898g802465K31300k10518l32792L53596N51235K13482J7574k39965q9988K36844
$$ -7802465 -7571165 -7781683 -8114475 -7760879 -7209644 -6996162 -6978588 -7218553 -7308541 -7071697
15888g071697Q9457k92060j27213J10623j2324j50976J68862K47513m21462K5630
$$ -7071697 -6982240 -7274300 -7401513 -7290890 -7303214 -7454190 -7285328 -7037815 -7459277 -7433647
15878g433647J76878J3323J03639l4718k63185m1596K54018J43532K09383K33717
$$ -7433647 -7256769 -7243446 -7139807 -7174525 -7437710 -7479306 -7225288 -7081756 -6872373 -6638656
15868f638656j66444k97567J14285r3364p1032R2303J42235N8914k02001m25176
$$ -6638656 -6805100 -7102667 -6988382 -7081746 -7152778 -7060475 -6918240 -6859326 -7061327 -7486503
15858g486503l7397J30079p715Q002j77179j7138K51481m4089J72312K52134K08748
$$ -7486503 -7523900 -7393821 -7401536 -7393534 -7570713 -7587851 -7336370 -7380459 -7208147 -6956013 -6747265
15847f747265m1091k78854K77500L35202k36872j38474J38612J09249j47285j65629
$$ -6747265 -6788356 -7067210 -6789710 -6454508 -6691380 -6829854 -6691242 -6581993 -6729278 -6894907
15837f894907R7787l9447j7327J06721N3075k91850p4494K43246J71110M2400
$$ -6894907 -6797120 -6836567 -6853894 -6747173 -6694098 -6985948 -7060442 -6817196 -6646086 -6603686
15827f603686J32856j66829j19754r0191P6346j98311l15608j7280k67907L03021
$$ -6603686 -6470830 -6637659 -6757413 -6847604 -6771258 -6969569 -7285177 -7302457 -7570364 -7267343
15817g267343J52126J56562p8682k14856j25530L85827K87912k8144j28018o48445
$$ -7267343 -7115217 -6958655 -7037337 -7252193 -7377723 -6991896 -6703984 -6732128 -6860146 -7508591
15807g508591l19525L99909M05565M69116j76278l98094n26788j97502K56749
$$ -7508591 -7828116 -7428207 -7022642 -6553526 -6729804 -7127898 -7654686 -7852188 -7595439
15798g595439M57988L63980J80748j71222n7012m57096O3019K12792k41095O6100
$$ -7595439 -7137451 -6773471 -6592723 -6763945 -6820957 -7278053 -7215034 -7002242 -7243337 -7177237
15788g177237K50670q7752K3512J91339J4325J09558M7259j08906r0071j5325
$$ -7177237 -6926567 -7014319 -6990807 -6799468 -6785143 -6675585 -6628326 -6737232 -6827303 -6842628
15778f842628J41872n7728K13024n5031l5946q6766k21899m5164Q2633J90472
$$ -6842628 -6700756 -6758484 -6545460 -6600491 -6636437 -6723203 -6945102 -6990266 -6907633 -6717161
15768f717161j07259k89323k98337K19338J52552J16820K28124j45687j75924
$$ -6717161 -6824420 -7113743 -7412080 -7192742 -7040190 -6923370 -6695246 -6840933 -7016857
15759g016857m4757J5880J36491J59249k34096J48861K56316j99241r1294J39614
$$ -7016857 -7061614 -7045734 -6909243 -6749994 -6984090 -6835229 -6578913 -6778154 -6869448 -6729834
15749f729834j40831r2851o3904j67165J97975J95754j47325k82958j76027Q8834
$$ -6729834 -6870665 -6963516 -7027420 -7194585 -6996610 -6800856 -6948181 -7231139 -7407166 -7318332
15739g318332K37349O6601K12658j60189J21648J27754M785L0977k31412l49010
$$ -7318332 -7080983 -7014382 -6801724 -6961913 -6840265 -6712511 -6707726 -6676749 -6908161 -7257171
15729g257171K79054M25683J98695j02202o127o3172j13625r9358K24985l8869
$$ -7257171 -6978117 -6552434 -6353739 -6455941 -6462068 -6525240 -6638865 -6738223 -6513238 -6552107
15719f552107M3114j75387K21862L21210J9555j04024j09278l73521l66848r9975
$$ -6552107 -6508993 -6684380 -6462518 -6141308 -6121753 -6225777 -6335055 -6708576 -7075424 -7175399
15709g175399m5739J53274O17151J73973m23829l10092N4090l39603j60361L00686
$$ -7175399 -7221138 -7067864 -6450713 -6276740 -6700569 -7010661 -6956571 -7296174 -7456535 -7155849
15699g155849M39217p2091P4259m0234J78796l9921L89525L65666j81207l70491
$$ -7155849 -6716632 -6788723 -6714464 -6754698 -6575902 -6615823 -6226298 -5860632 -6041839 -6412330
15689f412330j65498L34195j70524j20666p6544l56753q7814M50993J19671j89840
$$ -6412330 -6577828 -6243633 -6414157 -6534823 -6611367 -6968120 -7055934 -6604941 -6485270 -6675110
15679f675110j76005p6452K92337J06631j33221m63803l6540O201l7837K45897
$$ -6675110 -6851115 -6927567 -6635230 -6528599 -6661820 -7125623 -7162163 -7155962 -7193799 -6947902
15669f947902J4547j32599N20430K13766j10158m58401k80390P54J87638J31466
$$ -6947902 -6933355 -7065954 -6545524 -6331758 -6441916 -6900317 -7180707 -7179953 -6992315 -6860849
15659f860849K34367j28539k3600r3641J45446K56936K16795P3658J67656m46957
$$ -6860849 -6626482 -6755021 -6778621 -6872262 -6726816 -6469880 -6253085 -6179427 -6011771 -6458728
15649f458728l65017k03277k2766J11569j7354K7975o1263l4203L7699k25631
$$ -6458728 -6823745 -7027022 -7049788 -6938219 -6955573 -6927598 -6988861 -7023064 -6985365 -7210996
15639g210996N99114O1391n33188j85057K53538n5212j13550J90446R9763l4268
$$ -7210996 -6611882 -6550491 -7083679 -7268736 -7015198 -7070410 -7183960 -6993514 -6893751 -6928019
15629f928019J05148M9968L05350K73141m1804q0994J5489J11951l1483k9990
$$ -6928019 -6822871 -6772903 -6467553 -6194412 -6236216 -6317210 -6301721 -6189770 -6221253 -6251243
15619f251243j50876J3367p6256j52798K14194K06030r5776n1604N793k11475
$$ -6251243 -6402119 -6388752 -6465008 -6617806 -6403612 -6197582 -6293358 -6344962 -6339169 -6550644
15609f550644j05473l15211M694K28187J65903L9294J82265K52868n3040m62935
$$ -6550644 -6656117 -6971328 -6966634 -6738447 -6572544 -6533250 -6350985 -6098117 -6151157 -6614092
15599f614092j44484R7924J54144L40175M2647K38060J54561l46533j01210P7308
$$ -6614092 -6758576 -6660652 -6506508 -6166333 -6123686 -5885626 -5731065 -6077598 -6178808 -6101500
15589f101500m6361r5386j4521m63964k18460P2012J51812K25994j34389m75978
$$ -6101500 -6147861 -6243247 -6257768 -6721732 -6940192 -6868180 -6716368 -6490374 -6624763 -7100741
15579g100741j44209j04466L11675M17463J24632J75843k35892Q3963J2620k71815
$$ -7100741 -7244950 -7349416 -7037741 -6620278 -6495646 -6319803 -6555695 -6471732 -6459112 -6730927
15569f730927k51975N05106L15420k45822l15528k78181j32644P4640L45042K76791
$$ -6730927 -6982902 -6477796 -6162376 -6408198 -6723726 -7001907 -7134551 -7059911 -6714869 -6438078
15559f438078Q2936j30636l17845o2719j67276J95532L45537L36400K82555J97622
$$ -6438078 -6355142 -6485778 -6803623 -6866342 -7033618 -6838086 -6492549 -6156149 -5873594 -5675972
15549e675972j70201k66085o9506l12625l85922J03674K69998j23460L89672K74642
$$ -5675972 -5846173 -6112258 -6181764 -6494389 -6880311 -6776637 -6506639 -6630099 -6240427 -5965785
15539e965785R4903l47112k64931J91896J32622k8432J17498l6529J01301k15795
$$ -5965785 -5870882 -6217994 -6482925 -6291029 -6158407 -6186839 -6069341 -6105870 -6004569 -6220364
15529f220364m27499R2937J8222R2760J63148j0619m45342K12535J83665j06509
$$ -6220364 -6647863 -6554926 -6536704 -6443944 -6280796 -6291415 -6736757 -6524222 -6340557 -6447066
15519f447066l1122P6309j86948k89888K00378o6362k20457k6914M87875L37620
$$ -6447066 -6478188 -6401879 -6588827 -6878715 -6678337 -6744699 -6965156 -6992070 -6504195 -6166575
15509f166575K5355j42796j76013K18137M57485R5524k69548l29561m49869n5771
$$ -6166575 -6141220 -6284016 -6460029 -6241892 -5784407 -5688883 -5958431 -6287992 -6737861 -6793632
15499f793632j57680l1964J11252M75510M51215J47114j58754k11055J87889J96123
$$ -6793632 -6951312 -6983276 -6872024 -6396514 -5945299 -5798185 -5956939 -6167994 -5980105 -5783982
15489e783982j36909l46173r3234K25478J33026J33369l80566l63343K37950K71526
$$ -5783982 -5920891 -6267064 -6360298 -6134820 -6001794 -5868425 -6248991 -6612334 -6374384 -6102858
15479f102858J56112k58956k49418K47425K55523j83593k65728m47223k03317
$$ -6102858 -5946746 -6205702 -6455120 -6207695 -5952172 -6135765 -6401493 -6848716 -7052033
15470g052033J13469K2311K00319K30997j64973Q4697M65532L64506M3104n50958
$$ -7052033 -6938564 -6916253 -6715934 -6484937 -6649910 -6565213 -6099681 -5735175 -5692071 -6243029
15460f243029n81157K13987N78287N5046l440l10000P9028p0562M3375J20324
$$ -6243029 -6824186 -6610199 -6031912 -5976866 -5980306 -6290306 -6211278 -6281840 -6238465 -6118141
15450f118141N5729k33125j61392L5438j81897j92828K71982J37875l0778M2430
$$ -6118141 -6062412 -6295537 -6456929 -6421491 -6603388 -6796216 -6524234 -6386359 -6417137 -6374707
15440f374707K682K5123L21667j5717l57091J6130K32817K5830K72143k71955
$$ -6374707 -6372025 -6346902 -6025235 -6040952 -6398043 -6381913 -6149096 -6123266 -5851123 -6123078
15430f123078n33992K87170r7737m36957o0528L54246J35425L8263J69560L44624
$$ -6123078 -6657070 -6369900 -6467637 -6904594 -6965122 -6610876 -6475451 -6437188 -6267628 -5923004
15420e923004j80549j98725q5955L7085K40622J6034O3587l36041q3306R3906
$$ -5923004 -6103553 -6302278 -6388233 -6351148 -6110526 -6094492 -6030905 -6366946 -6450252 -6356346
15410f356346Q8599Q5357p5389p9306J00029l9338K08458M69785J59251l8961
$$ -6356346 -6267747 -6182390 -6257779 -6337085 -6237056 -6276394 -6067936 -5598151 -5438900 -5477861
15400e477861j03439j98499k73656m16042K9921J7361p6625j74047j74398N6195
$$ -5477861 -5581300 -5779799 -6053455 -6469497 -6439576 -6422215 -6498840 -6672887 -6847285 -6791090
15390f791090J74197O6390L9041K7689M5070M96895j4380j44362P9180J11361
$$ -6791090 -6616893 -6550503 -6511462 -6483773 -6438703 -5941808 -5956188 -6100550 -6021370 -5910009
15380e910009q1290m74885k91967K70523K55356K25359N9352k7387j50010K16669
$$ -5910009 -5991299 -6466184 -6758151 -6487628 -6232272 -6006913 -5947561 -5974948 -6124958 -5908289
15370e908289L17593k36993k012j11339L8251l82869j37384J2189K81478P7599
$$ -5908289 -5590696 -5827689 -5829701 -5941040 -5902789 -6285658 -6423042 -6410853 -6129375 -6051776
15360f051776N5679r0755p9787K5978p8033J01102j60840L56352K80655J11483
$$ -6051776 -5996097 -6086852 -6166639 -6140661 -6218694 -6117592 -6278432 -5922080 -5641425 -5529942
15350e529942q9790j79761j7350R149r5446R102K04716j30193j98625k23455J20710
$$ -5529942 -5619732 -5799493 -5816843 -5807694 -5903140 -5894038 -5689322 -5819515 -6018140 -6241595 -6120885
15339f120885j8029L38622N2710j94964k13141Q6723j10978m09661N8417K97236
$$ -6120885 -6138914 -5800292 -5747582 -5942546 -6155687 -6068964 -6179942 -6589603 -6531186 -6233950
15329f233950K23804j22711j01555J90322P1029O9460K98362q6740o22606k01171
$$ -6233950 -6010146 -6132857 -6234412 -6044090 -5973061 -5903601 -5605239 -5691979 -6314585 -6515756
15319f515756L5344L1846j40206L79972L81870R002j20740n1522n1969k40213
$$ -6515756 -6480412 -6448566 -6588772 -6208800 -5826930 -5817928 -5938668 -5990190 -6042159 -6282372
15309f282372L6611J50060R0759m811N7199K02613j28784m57963k09552K69276
$$ -6282372 -6245761 -6095701 -6004942 -6009753 -5952554 -5749941 -5878725 -6336688 -6546240 -6276964
15299f276964J03598k12724n6162L10671J08866Q2416K12318k32321j13635K09308
$$ -6276964 -6173366 -6386090 -6442252 -6131581 -6022715 -5940299 -5727981 -5960302 -6073937 -5864629
15289e864629P755P3567O2356O336K64186J98301Q5479j59472j23005k46963j96287
$$ -5864629 -5856874 -5783307 -5720951 -5714615 -5450429 -5252128 -5166649 -5326121 -5449126 -5696089 -5892376
15278e892376J37836p3051j30615N3886k04010o4751K74418J3598J36994O0728
$$ -5892376 -5754540 -5827591 -5958206 -5904320 -6108330 -6173081 -5898663 -5885065 -5748071 -5687343
15268e687343k37346r9889q6219K00197r8385M2291K3916n9746p8438k64839M75215
$$ -5687343 -5924689 -6024578 -6110797 -5910600 -6008985 -5966694 -5942778 -6002524 -6080962 -6345801 -5870586
15257e870586M78103J04213J50360p1199n57322j19358R5065Q9657k31204k36795
$$ -5870586 -5392483 -5288270 -5137910 -5209109 -5766431 -5885789 -5790724 -5701067 -5932271 -6169066
15247f169066o6789J28053J84960K72584J96423j6394K87625l6849k06367l65253
$$ -6169066 -6235855 -6107802 -5922842 -5650258 -5453835 -5470229 -5182604 -5219453 -5425820 -5791073
15237e791073q1540J25219q464L10514J12432l82757Q7709Q0405O5422K02296
$$ -5791073 -5872613 -5747394 -5755858 -5445344 -5332912 -5715669 -5627960 -5547555 -5482133 -5279837
15227e279837j16822n20297n7073r2965M2157K79577K1634j32658k53928K94453
$$ -5279837 -5396659 -5916956 -5974029 -6066994 -6024837 -5745260 -5723626 -5856284 -6110212 -5815759
15217e815759L27196k6204K08144n930l22826j08515K8405L75968J16617j73780
$$ -5815759 -5488563 -5514767 -5306623 -5312553 -5635379 -5743894 -5715489 -5339521 -5222904 -5396684
15207e396684q3835p3512K4584N301M96392J26207j94996j34410l08514j96193
$$ -5396684 -5480519 -5554031 -5529447 -5524146 -5027754 -4901547 -5096543 -5230953 -5539467 -5735660
15197e735660j44405j60939M10752O6889k00595j61135l43110R5086J91756j75024
$$ -5735660 -5880065 -6041004 -5630252 -5563363 -5763958 -5925093 -6268203 -6173117 -5981361 -6156385
15187f156385N8419M05440m4843J06013N25940j3980l89664J9688k24028O2054
$$ -6156385 -6097966 -5692526 -5737369 -5631356 -5105416 -5119396 -5509060 -5489372 -5713400 -5651346
15177e651346J28441j0108M6503k15603M72308j39291l09053j04868M135j47821
$$ -5651346 -5522905 -5533013 -5486510 -5702113 -5229805 -5369096 -5678149 -5783017 -5778882 -5926703
15167e926703j18067K93430R0790Q7518j58342j28990L23630K8875k22599j41360
$$ -5926703 -6044770 -5751340 -5660550 -5573032 -5731374 -5860364 -5536734 -5507859 -5730458 -5871818
15157e871818o3424j32749J80285K31617K33874Q2600l02155k34645K09816k44107
$$ -5871818 -5935242 -6067991 -5887706 -5656089 -5422215 -5339615 -5641770 -5876415 -5666599 -5910706
15147e910706j79405N7618j7187J86237L10807J67860L0057M2188p0957j53630
$$ -5910706 -6090111 -6032493 -6049680 -5863443 -5552636 -5384776 -5354719 -5312531 -5383488 -5537118
15137e537118P674J13847m9569L2363L16681J48909l68502L71576M64251m39109
$$ -5537118 -5529444 -5415597 -5465166 -5432803 -5116122 -4967213 -5335715 -4964139 -4499888 -4938997
15127d938997r95103J04429M86117j809j73206k20823p5448j71032K32888K65713
$$ -4938997 -5934100 -5829671 -5343554 -5345363 -5518569 -5739392 -5814840 -5985872 -5752984 -5487271
15117e487271p0877k5184J74919K45730j97592p3298j08181J16536K2484J09405
$$ -5487271 -5558148 -5583332 -5408413 -5162683 -5360275 -5433573 -5541754 -5425218 -5402734 -5293329
15107e293329J52438n7903K24435j14395m70406L9652K5721k91108j124J13248
$$ -5293329 -5140891 -5198794 -4974359 -5088754 -5559160 -5519508 -5493787 -5784895 -5786019 -5672771
15097e672771J62484J22624k31182J19935K8949j01346K9855J03279L00045j09667
$$ -5672771 -5510287 -5387663 -5618845 -5498910 -5469961 -5571307 -5541452 -5438173 -5138128 -5247795
15087e247795j66280j85365K5333J87286L11192P0504k79571k39883j31807J42058
$$ -5247795 -5414075 -5599440 -5574107 -5386821 -5075629 -5005125 -5284696 -5524579 -5656386 -5514328
15077e514328M38679k5105j45029J31105q5614j72538M37079L8669j02875k79538
$$ -5514328 -5075649 -5100754 -5245783 -5114678 -5200292 -5372830 -4935751 -4897082 -4999957 -5279495
15067e279495m71941M4589L50989R9520N3879j99671j85519m2324L07035j196
$$ -5279495 -5751436 -5706847 -5355858 -5256338 -5202459 -5402130 -5587649 -5629973 -5322938 -5324134
15057e324134p8719m5576K07447K11889O237l4453P5857P07q1690l9739k17921
$$ -5324134 -5402853 -5448429 -5240982 -5029093 -5022856 -5057309 -4981452 -4980745 -5062435 -5102174 -5320095
15046e320095q3757Q9394L69035M36241n3905m04978r2250K09252q3169K09123
$$ -5320095 -5403852 -5314458 -4945423 -4509182 -4563087 -4968065 -5060315 -4851063 -4934232 -4725109
15036d725109o0293k56245J4022K92791j15021m19252Q1628k76491k34074P4278
$$ -4725109 -4785402 -5041647 -5027625 -4734834 -4849855 -5269107 -5187479 -5463970 -5698044 -5623766
15026e623766O2539j44394J9039J89756N5418o6152P4902k9673O5762R9138O82186
$$ -5623766 -5561227 -5705621 -5686582 -5496826 -5441408 -5507560 -5432658 -5462331 -5396569 -5297431 -4615245
15015d615245j72109j54206Q9612Q6556l04511K32932O6168J03192M58788J14308
$$ -4615245 -4787354 -4941560 -4851948 -4765392 -5069903 -4836971 -4770803 -4667611 -4208823 -4094515
15005d094515J39946J0088j87038m43507n12683n09403j119294r52977k35528
$$ -4094515 -3954569 -3944481 -4131519 -4575026 -5087709 -5597112 -6716406 -7669383 -7904911
14996g904911M49896M87332K97171J05326K48685M91395M09393k72553k99032
$$ -7904911 -7455015 -6967683 -6670512 -6565186 -6316501 -5825106 -5415713 -5688266 -5987298
14987e987298O8747k95855j43892J49256M29074K73607k59752J15986l00519k13572
$$ -5987298 -5918551 -6214406 -6358298 -6209042 -5779968 -5506361 -5766113 -5650127 -5950646 -6164218
14977f164218L16342L06677n0738k46089p0532k38146K27482M2994J76456J36321
$$ -6164218 -5847876 -5541199 -5591937 -5838026 -5908558 -6146704 -5919222 -5876228 -5699772 -5563451
14967e563451K02459k1477K2463o3811j72148N2540j6485j36961N22413J17807
$$ -5563451 -5360992 -5382469 -5360006 -5423817 -5595965 -5543425 -5559910 -5696871 -5174458 -5056651
14957e056651j18380L6903q8919n87744j86755J01793K32069M54955J32653j05153
$$ -5056651 -5175031 -5138128 -5227047 -5814791 -6001546 -5899753 -5667684 -5212729 -5080076 -5185229
14947e185229j4944p1429J38277Q6353k78816q9056q7539p2454K96272R5746M3025
$$ -5185229 -5200173 -5271602 -5133325 -5046972 -5325788 -5414844 -5502383 -5574837 -5278565 -5182819 -5139794
14936e139794k41524j60317J2037J47369m02823L32690j18661j36842Q1207J57475
$$ -5139794 -5381318 -5541635 -5529598 -5382229 -5785052 -5452362 -5571023 -5707865 -5626658 -5469183
14926e469183N40389k41195m93703m61201L3739N04379L78208K27016k14530l00917
$$ -5469183 -4928794 -5169989 -5663692 -6124893 -6091154 -5586775 -5208567 -4981551 -5196081 -5496998
14916e496998o2061O9043j53216m2626l41434K57468J98758j13245K30732L96669
$$ -5496998 -5559059 -5490016 -5643232 -5685858 -6027292 -5769824 -5571066 -5684311 -5453579 -5056910
14906e056910l84920k11054J71014M32505k81539p0737l41107k44665j37511j1944
$$ -5056910 -5441830 -5652884 -5481870 -5049365 -5330904 -5401641 -5742748 -5987413 -6124924 -6136868
14896f136868J87435J97711J69964j7519P6956j96722K96004J90940p7693l49213
$$ -6136868 -5949433 -5751722 -5581758 -5599277 -5522321 -5719043 -5423039 -5232099 -5309792 -5659005
14886e659005J3869J38486M23919J75301K01251k41344q8048j56162j94580J98064
$$ -5659005 -5645136 -5506650 -5082731 -4907430 -4706179 -4947523 -5035571 -5191733 -5386313 -5188249
14876e188249P7487p1003l02624L8996l4254Q0549K10946J62162j16390l70468
$$ -5188249 -5110762 -5181765 -5484389 -5445393 -5479647 -5399098 -5188152 -5025990 -5142380 -5512848
14866e512848j10199k3532K37100K65429l4174J51490L5440k80363l6903k25571
$$ -5512848 -5623047 -5646579 -5409479 -5144050 -5178224 -5026734 -4991294 -5271657 -5308560 -5534131
14856e534131l89699j30398J71041M6673J86886R1962J62849n9588P056J58507
$$ -5534131 -5923830 -6054228 -5883187 -5836514 -5649628 -5557666 -5394817 -5454405 -5447349 -5288842
14846e288842J28010k15800j35920J19358M42344l5027j8392k87901k2751l6972
$$ -5288842 -5160832 -5376632 -5512552 -5393194 -4950850 -4985877 -5004269 -5292170 -5314921 -5351893
14836e351893j78953o3297J70104q0421R0284K38158k31189j77591j8702K60911
$$ -5351893 -5530846 -5594143 -5424039 -5504460 -5414176 -5176018 -5407207 -5584798 -5603500 -5342589
14826e342589L18577J52719p8993j09423j02396K19814m3938k83552j28076q6415
$$ -5342589 -5024012 -4871293 -4950286 -5059709 -5162105 -4942291 -4986229 -5269781 -5397857 -5484272
14816e484272O5014M84Q5757K46796N0357k62299J10520n6574q1840K8829K14030
$$ -5484272 -5419258 -5418774 -5333017 -5086221 -5035864 -5298163 -5187643 -5244217 -5326057 -5297228 -5083198
14805e083198q1046l05928k17875J03486M5024L88709O36995j03829r3406K14934
$$ -5083198 -5164244 -5470172 -5688047 -5584561 -5539537 -5150828 -4513833 -4617662 -4711068 -4496134
14795d496134l89414k87943m3335j13263j04734o629J54163M94273l82547k89084
$$ -4496134 -4885548 -5173491 -5216826 -5330089 -5434823 -5441452 -5287289 -4793016 -5175563 -5464647
14785e464647L00772m0215j89494q802j33827n5335J40168K25778j10625K18309
$$ -5464647 -5163875 -5204090 -5393584 -5402386 -5536213 -5591548 -5451380 -5225602 -5336227 -5117918
14775e117918j22064K65043K78808k11771m52598J23266K44593j24288l47700
$$ -5117918 -5239982 -4974939 -4696131 -4907902 -5360500 -5237234 -4992641 -5116929 -5464629
14766e464629L65573L90190K65513K9301o44611n07807l0739R4582j47400Q0839
$$ -5464629 -5099056 -4708866 -4443353 -4414052 -5058663 -5566470 -5597209 -5502627 -5650027 -5569188
14756e569188l344n5799L00710J89898K20899j91911l43689K7207j60224K44144
$$ -5569188 -5572532 -5628331 -5327621 -5137723 -4916824 -5108735 -5452424 -5425217 -5585441 -5341297
14746e341297O29362J53431j59342k27657j52062J10435K6933J012l4231l8382
$$ -5341297 -4711935 -4558504 -4717846 -4945503 -5097565 -4987130 -4960197 -4959185 -4993416 -5031798
14736e031798Q3961J73605j76468j370j39817j01694L46889M9465k30080P0514
$$ -5031798 -4947837 -4774232 -4950700 -4952070 -5091887 -5193581 -4846692 -4797227 -5027307 -4956793
14726d956793J1157K29186k90939p2050p533K22537M13931k81232k98515l34636
$$ -4956793 -4945636 -4716450 -5007389 -5079439 -5086972 -4864435 -4450504 -4731736 -5030251 -5364887
14716e364887J49185L09687k97088q0978k70960j02997L13783M90226j58661r0040
$$ -5364887 -5215702 -4906015 -5203103 -5284081 -5555041 -5658038 -5344255 -4854029 -5012690 -5102730
14706e102730j30327k14813J62981P1367o0883K42364J89640k52004q4409j98014
$$ -5102730 -5233057 -5447870 -5284889 -5213522 -5274405 -5032041 -4842401 -5094405 -5178814 -5376828
14696e376828o5469K12744K39701k23611k24060j36578L26085P8215J52541J52786
$$ -5376828 -5442297 -5229553 -4989852 -5213463 -5437523 -5574101 -5248016 -5169801 -5017260 -4864474
14686d864474m9065l84929K91517K72513j76262j18227p0936N8558k36477l03745
$$ -4864474 -4913539 -5298468 -5006951 -4734438 -4910700 -5028927 -5099863 -5041305 -5277782 -5581527
14676e581527J72163M52429n3629r7497K13185J61875L5512k59127l43658O9483
$$ -5581527 -5409364 -4956935 -5010564 -5108061 -4894876 -4733001 -4697489 -4956616 -5300274 -5230791
14666e230791M2669j01083Q635j87837N18536j01024k21360J06066J73895K53426
$$ -5230791 -5188122 -5289205 -5280570 -5468407 -4949871 -5050895 -5272255 -5166189 -4992294 -4738868
14656d738868J73662l33642O9384J80566j26189L0210q465k57256k03889j27581
$$ -4738868 -4565206 -4898848 -4829464 -4648898 -4775087 -4744877 -4753342 -5010598 -5214487 -5342068
14646e342068L25367M95731J54251k08267j71725k00218K69455q7723j16354L7766
$$ -5342068 -5016701 -4520970 -4366719 -4574986 -4746711 -4946929 -4677474 -4765197 -4881551 -4843785
14636d843785j12033l3004P2620Q2956l9301K61747j18221q2298l4016r1642k77606
$$ -4843785 -4955818 -4988822 -4916202 -4833246 -4872547 -4610800 -4729021 -4811319 -4845335 -4936977 -5214583
14625e214583r8012j9818p0751L48057M66872L60492o3700n16080k59602j7876
$$ -5214583 -5312595 -5332413 -5403164 -5055107 -4588235 -4227743 -4291443 -4807523 -5067125 -5085001
14615e085001K36890j19292l59221p4509K16749K06259K23257Q0141L59866K68448
$$ -5085001 -4848111 -4967403 -5326624 -5401133 -5184384 -4978125 -4754868 -4674727 -4314861 -4046413
14605d046413j04573j62536K45809k1679k15631n18828J27761Q3934o5985N5994
$$ -4046413 -4150986 -4313522 -4067713 -4089392 -4305023 -4823851 -4696090 -4612156 -4678141 -4622147
14595d622147K00275l53450j89999L02612P2401j9008J08639j7490k25168o6587
$$ -4622147 -4421872 -4775322 -4965321 -4662709 -4590308 -4609316 -4500677 -4518167 -4743335 -4809922
14585d809922J42887Q3573l75720r178J02346j43570M1733L43019K218k05192
$$ -4809922 -4667035 -4583462 -4959182 -4968360 -4866014 -5009584 -4967851 -4624832 -4622614 -4827806
14575d827806j74739l11907L50396K95678l44819k63786O3308k68617Q6977J91132
$$ -4827806 -5002545 -5314452 -4964056 -4668378 -5013197 -5276983 -5213675 -5482292 -5395315 -5204183
14565e204183J8725L61834J67170K33621j00789k09585l1319j97003L47827J32426
$$ -5204183 -5185458 -4823624 -4656454 -4422833 -4523622 -4733207 -4764526 -4961529 -4613702 -4481276
14555d481276J85241n2030j2093j99462j10563R4940k73180k54908Q09L84285
$$ -4481276 -4296035 -4348065 -4360158 -4559620 -4670183 -4575243 -4848423 -5103331 -5102522 -4718237
14545d718237M59158R2868k12181M3118J65087o1208l65073o9913J85640L12151
$$ -4718237 -4259079 -4166211 -4378392 -4335274 -4170187 -4231395 -4596468 -4666381 -4480741 -4168590
14535d168590p4593m19561l00130M3282M53545L08904j20822k88066p8086n4235
$$ -4168590 -4243183 -4662744 -4962874 -4919592 -4466047 -4157143 -4277965 -4566031 -4644117 -4698352
14525d698352L0005M24842R6812q0063j4372J983k02454r4016l142j0211L23726
$$ -4698352 -4668347 -4243505 -4146693 -4226756 -4241128 -4239145 -4441599 -4535615 -4538757 -4548968 -4225242
14514d225242O5624j73157k48816k85288J87491N9456K45881J69156j73193r6283
$$ -4225242 -4159618 -4332775 -4581591 -4866879 -4679388 -4619932 -4374051 -4204895 -4378088 -4474371
14504d474371k21682j29356K5544K20564K4345l6898J37173n6181k50150r6654
$$ -4474371 -4696053 -4825409 -4799865 -4579301 -4554956 -4591854 -4454681 -4510862 -4761012 -4857666
14494d857666J64809n4165J1188L13253Q9432k11285J43138k7343p6026m87009
$$ -4857666 -4692857 -4747022 -4735834 -4422581 -4333149 -4544434 -4401296 -4428639 -4504665 -4991674
14484d991674k5503j3630p28J79034J31597J54839L28954O3771l28561j89976
$$ -4991674 -5017177 -5030807 -5031535 -4852501 -4720904 -4566065 -4237111 -4173340 -4501901 -4691877
14474d691877K36380J69798k89913J83749k95209k89730r0938j36025j63678J3426
$$ -4691877 -4455497 -4285699 -4575612 -4391863 -4687072 -4976802 -5067740 -5203765 -5367443 -5354017
14464e354017N1637L64956R2615k4206j91114J62945j32332j62760L57345j97113
$$ -5354017 -5302380 -4937424 -4844809 -4869015 -5060129 -4897184 -5029516 -5192276 -4834931 -5032044
14454e032044k42952j3431N6281J42367q908k10375P0682n743l2213K66937J08985
$$ -5032044 -5274996 -5288427 -5232146 -5089779 -5098687 -5309062 -5238380 -5244123 -5276336 -5009399 -4900414
14443d900414n688Q5921q0968K27146K47042k88527L2480K13342K12574r0422
$$ -4900414 -4906102 -4820181 -4901149 -4674003 -4426961 -4715488 -4683008 -4469666 -4257092 -4347514
14433d347514m16403k95959O7069L049L69975L18328n31130m81094K41890K69729
$$ -4347514 -4763917 -5059876 -4992807 -4989758 -4619783 -4301455 -4832585 -5313679 -5071789 -4802060
14423d802060K52121J34579j6615J20439k21330j40330m3205J59802j53963m74472
$$ -4802060 -4549939 -4415360 -4431975 -4311536 -4532866 -4673196 -4716401 -4556599 -4710562 -5185034
14413e185034j59193J72694q0521N6379L31654K93540p7064k51297K86298K74892
$$ -5185034 -5344227 -5171533 -5252054 -5195675 -4864021 -4570481 -4647545 -4898842 -4612544 -4337652
14403d337652J85255j35861k68678M41327J72531m07962k29303j9900K24007j8013
$$ -4337652 -4152397 -4288258 -4556936 -4115609 -3943078 -4351040 -4580343 -4600243 -4376236 -4394249
14393d394249j89495J4485j50227P2685K06010k17271j52969N4880J14916K66331
$$ -4394249 -4583744 -4569259 -4719486 -4646801 -4440791 -4658062 -4811031 -4756151 -4641235 -4374904
14383d374904L82200J87076l71565m60959P7187N5359N9499Q3853J06303l8162
$$ -4374904 -3992704 -3805628 -4177193 -4638152 -4560965 -4505606 -4446107 -4362254 -4255951 -4294113
14373d294113J82275k93072P6292n21007m98498J44766L05500J13287K44916J85767
$$ -4294113 -4111838 -4404910 -4328618 -4849625 -5348123 -5203357 -4897857 -4784570 -4539654 -4353887
14363d353887N6634j31613r5443L72595M6370k64785j99971m2653J99680m15764
$$ -4353887 -4297253 -4428866 -4524309 -4151714 -4105344 -4370129 -4570100 -4612753 -4413073 -4828837
14353d828837j05469r3296J75232j27423K07799K94763j46297k73100L3314N6078
$$ -4828837 -4934306 -5027602 -4852370 -4979793 -4771994 -4477231 -4623528 -4896628 -4863314 -4807236
14343d807236k04038J9540q4368j06659J30833P7909L29681K3975k46364j48461
$$ -4807236 -5011274 -4991734 -5076102 -5182761 -5051928 -4974019 -4644338 -4620363 -4866727 -5015188
14333e015188J28956P1745J87137j76302q0583K51646J22173j40664J6835K53354
$$ -5015188 -4886232 -4814487 -4627350 -4803652 -4884235 -4632589 -4510416 -4651080 -4634245 -4380891
14323d380891j16250j14360k17984j13266J54995J42817J57079L22782q3327l58360
$$ -4380891 -4497141 -4611501 -4829485 -4942751 -4787756 -4644939 -4487860 -4165078 -4248405 -4606765
14313d606765l48843K1066J61434j35139j6970N09381J00653K15330j3911j92257
$$ -4606765 -4955608 -4934542 -4773108 -4908247 -4925217 -4415836 -4315183 -4099853 -4113764 -4306021
14303d306021l13331j85649J84888J11953o3264L7374J68352K86078o9279L392
$$ -4306021 -4619352 -4805001 -4620113 -4508160 -4571424 -4534050 -4365698 -4079620 -4148899 -4145507
14293d145507K28194O7116j88333m09453m34284o6714O5001P7356M41060J23692
$$ -4145507 -3917313 -3850197 -4038530 -4447983 -4882267 -4948981 -4883980 -4806624 -4365564 -4241872
14283d241872J60717N5863N2401k05171k22414R4430J60644R431l46164p2425
$$ -4241872 -4081155 -4025292 -3972891 -4178062 -4400476 -4306046 -4145402 -4135971 -4482135 -4554560
14273d554560R9945J23171Q9612J70741J19537o2478j47967m6431k14445n00395
$$ -4554560 -4454615 -4331444 -4241832 -4071091 -3951554 -4014032 -4161999 -4208430 -4422875 -4923270
14263d923270o066M23581J25094j014M50103J01283k19272k94445p6683O3261
$$ -4923270 -4929336 -4505755 -4380661 -4381675 -3931572 -3830289 -4049561 -4344006 -4420689 -4357428
14253d357428L21928M65k33110k59928k10288j55285K8438R6972K87851k53079
$$ -4357428 -4035500 -4035035 -4268145 -4528073 -4738361 -4893646 -4865208 -4768236 -4480385 -4733464
14243d733464r6637L62233J54168L17039J8108p91800l57644K22333K83271K36954
$$ -4733464 -4830101 -4467868 -4313700 -3996661 -3978553 -4770353 -5127997 -4905664 -4622393 -4385439
14233d385439j87914k16405L80313J43465K96779P1726j3833n83753l67772k22975
$$ -4385439 -4573353 -4789758 -4409445 -4265980 -3969201 -3897475 -3911308 -4495061 -4862833 -5085808
14223e085808j48442K00696L07826P6121J23432j97566k8674R5478k83028N3393
$$ -5085808 -5234250 -5033554 -4725728 -4649607 -4526175 -4723741 -4752415 -4656937 -4939965 -4886572
14213d886572K05531K17464k27721N4260K01526K17932K22710n0324n40275l23069
$$ -4886572 -4681041 -4463577 -4691298 -4637038 -4435512 -4217580 -3994870 -4045194 -4585469 -4908538
14203d908538J87223K19293l26402j87772L93120P7233q1724L37276K49591O5690
$$ -4908538 -4721315 -4502022 -4828424 -5016196 -4623076 -4545843 -4627567 -4290291 -4040700 -3975010
14193c975010j29733m731k71936L79217L34287j76200l03469o2832J99572k35126
$$ -3975010 -4104743 -4109474 -4381410 -4002193 -3667906 -3844106 -4147575 -4210407 -4010835 -4245961
14183d245961J62318J14944k2008p9629J22142j74889j31330R5631J23361j12869
$$ -4245961 -4083643 -3968699 -3990707 -4070336 -3948194 -4123083 -4254413 -4158782 -4035421 -4148290
14173d148290l84183j02902p0512k06477J78928K5217p5542m1409j34805q2671
$$ -4148290 -4532473 -4635375 -4705887 -4912364 -4733436 -4708219 -4783761 -4825170 -4959975 -5042646
14163e042646k9909K14859L45698J29906J39937L34777j17011j79065J01868p662
$$ -5042646 -5072555 -4857696 -4511998 -4382092 -4242155 -3907378 -4024389 -4203454 -4101586 -4109248
14153d109248K0617J87304k12476o2457j29269M18259J50938l24668L6284R4956
$$ -4109248 -4088631 -3901327 -4113803 -4176260 -4305529 -3887270 -3736332 -4061000 -4024716 -3929760
14143c929760m10736j41571J62397K33386q7853j97988k37280J38397J74371J13922
$$ -3929760 -4340496 -4482067 -4319670 -4086284 -4174137 -4372125 -4609405 -4471008 -4296637 -4182715
14133d182715R8558j77687j4009J37323J13090J81238r5881j02r4664m5107R8999
$$ -4182715 -4084157 -4261844 -4275853 -4138530 -4025440 -3844202 -3940083 -3940185 -4034849 -4079956 -3980957
14122c980957R7023p6104J00741r9616j72672l8686j32327j97993j18632k77701
$$ -3980957 -3883934 -3960038 -3859297 -3958913 -4131585 -4170271 -4302598 -4500591 -4619223 -4896924
14112d896924J42409M82795L02041K22374K25203J02867k82046o57727O8495K07316
$$ -4896924 -4754515 -4271720 -3969679 -3747305 -3522102 -3419235 -3701281 -4359008 -4290513 -4083197
14102d083197k24046j20734N2580Q7828J57812m37533j25766M16563J54602K55795
$$ -4083197 -4307243 -4427977 -4375397 -4287569 -4129757 -4567290 -4693056 -4276493 -4121891 -3866096
14092c866096j31345n943o0294K5107j47989k86422j34829K55263L12422J03526
$$ -3866096 -3997441 -4003384 -4063678 -4038571 -4186560 -4472982 -4607811 -4352548 -4040126 -3936600
14082c936600j27474k91961J05716J17840L68154L11808l35089k47447k79697
$$ -3936600 -4064074 -4356035 -4250319 -4132479 -3764325 -3452517 -3787606 -4035053 -4314750
14073d314750J7805J54683k45727k64466N2876J6243j22977P269L46634J03817
$$ -4314750 -4296945 -4142262 -4387989 -4652455 -4599579 -4583336 -4706313 -4699044 -4352410 -4248593
14063d248593R0943j93244Q8169j6478P958J97658J9894q4470o31964L21593J61834
$$ -4248593 -4157650 -4350894 -4262725 -4279203 -4271245 -4073587 -4053693 -4138163 -4770127 -4448534 -4286700
14052d286700J68851k15769l23133P7726l2159J06319K53744m7524Q5621K15193
$$ -4286700 -4117849 -4333618 -4656751 -4579025 -4611184 -4504865 -4251121 -4298645 -4213024 -3997831
14042c997831q9904J17877K33732r2927l15857k60731j2027M12551K19039l17528
$$ -3997831 -4087735 -3969858 -3736126 -3829053 -4144910 -4405641 -4417668 -4005117 -3786078 -4103606
14032d103606l92747L15057K26540P6712l00739k31140K04475j18776j48628K04411
$$ -4103606 -4496353 -4181296 -3954756 -3878044 -4178783 -4409923 -4205448 -4324224 -4472852 -4268441
14022d268441K00926n61979k11780k2187J45050L78203K14167J62668r3432q188
$$ -4268441 -4067515 -4629494 -4841274 -4863461 -4718411 -4340208 -4126041 -3963373 -4056805 -4064993
14012d064993k38399K3087j35845j01647n4743Q5953J81533l94796j41134M30143
$$ -4064993 -4303392 -4280305 -4416150 -4517797 -4572540 -4486587 -4305054 -4699850 -4840984 -4410841
14002d410841J79449j30887k69927M06549j90366l6307J00153k1030p4807Q7034
$$ -4410841 -4231392 -4362279 -4632206 -4225657 -4416023 -4452330 -4352177 -4373207 -4448014 -4360980
13992d360980J97706K75925k9047j7154j35138Q7001k98777r3279J46253M22371
$$ -4360980 -4163274 -3887349 -3916396 -3933550 -4068688 -3981687 -4280464 -4373743 -4227490 -3805119
13982c805119k8230j65388n3318L42934K15043J66271k10572k95672m07457j61326
$$ -3805119 -3833349 -3998737 -4052055 -3709121 -3494078 -3327807 -3538379 -3834051 -4241508 -4402834
13972d402834k04118l9510K159K59570K42331K56267q6818n88689K88132K44225
$$ -4402834 -4606952 -4646462 -4644303 -4384733 -4142402 -3886135 -3972953 -4561642 -4273510 -4029285
13962d029285L5080J00540J62700k3178k78207n9250O2435j00078k19581L95932
$$ -4029285 -3994205 -3893665 -3730965 -3754143 -4032350 -4091600 -4029165 -4129243 -4348824 -3952892
13952c952892J81096J78536K53073m57027k57217K27762J54343k94413j90080
$$ -3952892 -3771796 -3593260 -3340187 -3797214 -4054431 -3826669 -3672326 -3966739 -4156819
13943d156819k05256J76605K74441m8079j35430k1325P4217J01647P0073J27030
$$ -4156819 -4362075 -4185470 -3911029 -3959108 -4094538 -4115863 -4041646 -3939999 -3869926 -3742896
13933c742896M2915P1040M1164J11028K10958m22258k88052K2470k88008p5906
$$ -3742896 -3699981 -3628941 -3587777 -3476749 -3265791 -3688049 -3976101 -3953631 -4241639 -4317545
13923d317545J9298q8689K71601K17978k4833J40557k38335k16716j88054P26
$$ -4317545 -4298247 -4386936 -4115335 -3897357 -3922190 -3781633 -4019968 -4236684 -4424738 -4424012
13913d424012L6256J00016K99757O7598m29820k53355K32196J89057l6504K46114
$$ -4424012 -4387756 -4287740 -3987983 -3920385 -4350205 -4603560 -4371364 -4182307 -4218811 -3972697
13903c972697K49635L775j47547l22771k22636J19281J95793L04674J54357J81389
$$ -3972697 -3723062 -3719287 -3866834 -4189605 -4412241 -4292960 -4097167 -3792493 -3638136 -3456747
13893c456747j17797k18153M0846L1856l17791j10764J47951k07317J19045K3171
$$ -3456747 -3574544 -3792697 -3751851 -3719995 -4037786 -4148550 -4000599 -4207916 -4088871 -4065700
13883d065700j7629K32714k58903j39695M25404o3708k11346M29076O5983l60638
$$ -4065700 -4083329 -3850615 -4109518 -4249213 -3823809 -3887517 -4098863 -3669787 -3603804 -3964442
13873c964442K75678k22418r7083K22984l0988p3873j7688n8811j84920J89907
$$ -3964442 -3688764 -3911182 -4008265 -3785281 -3816269 -3890142 -3907830 -3966641 -4151561 -3961654
13863c961654j34362j63509N9089J13589j4465l12709p8507N12988L14969m90345
$$ -3961654 -4096016 -4259525 -4200436 -4086847 -4101312 -4414021 -4492528 -3979540 -3664571 -4154916
13853d154916k17439L26795j5602k08851j9573K28147L9881k9737P3127j9167
$$ -4154916 -4372355 -4045560 -4061162 -4270013 -4289586 -4061439 -4021558 -4051295 -3978168 -3997335
13843c997335N9442M31315N3623j65988j3300j88216k66671q6760J95324p9406
$$ -3997335 -3937893 -3506578 -3452955 -3618943 -3632243 -3820459 -4087130 -4173890 -3978566 -4057972
13833d057972m31084l51521J93336L11894N7838M0372n688J89381n7118k10010
$$ -4057972 -4489056 -4840577 -4647241 -4335347 -4277509 -4237137 -4242825 -4053444 -4110562 -4320572
13823d320572J19304M35699J09173l46694j4519j20283J0428K59354k01513m68445
$$ -4320572 -4201268 -3765569 -3656396 -4003090 -4017609 -4137892 -4127464 -3868110 -4069623 -4538068
13813d538068l50581j03148N58056J54570K78816K71258N8621l14481q3855r775
$$ -4538068 -4888649 -4991797 -4433741 -4279171 -4000355 -3729097 -3670476 -3984957 -4068812 -4078587
13803d078587P7426L276K33498K37480j03264l55178j68937j17576L91611L58722
$$ -4078587 -4001161 -3997885 -3764387 -3526907 -3630171 -3985349 -4154286 -4271862 -3880251 -3521529
13793c521529l1153J29071R837q6268J1356l30789j45130j26685O7743Q5129N1985
$$ -3521529 -3552682 -3423611 -3413774 -3500042 -3488686 -3819475 -3964605 -4091290 -4023547 -3938418 -3886433
13782c886433j76452J47427p0061r0801J20443J57632K29621k6937j84082o9421
$$ -3886433 -4062885 -3915458 -3985519 -4076320 -3955877 -3798245 -3568624 -3595561 -3779643 -3849064
13772c849064j30091J28404K68048J54764M7603K24764m6806k50995k59362n1568
$$ -3849064 -3979155 -3850751 -3582703 -3427939 -3380336 -3155572 -3202378 -3453373 -3712735 -3764303
13762c764303P2302j22685K88231K0397m01850r448q9821l45695K92843J29606
$$ -3764303 -3692001 -3814686 -3526455 -3506058 -3907908 -3917356 -4007177 -4352872 -4060029 -3930423
13752c930423P5554O8612L17816j55300m38995l11219N7513p4068L38686P21619
$$ -3930423 -3854869 -3786257 -3468441 -3623741 -4062736 -4373955 -4316442 -4390510 -4051824 -3330205
13742c330205J11353m6441j72724o2866j67323P0112o4229k2423J54410j82464
$$ -3330205 -3218852 -3265293 -3438017 -3500883 -3668206 -3598094 -3662323 -3684746 -3530336 -3712800
13732c712800k72235k81930k902l81839L5784K7117l046L89606O1852k20303q2130
$$ -3712800 -3985035 -4266965 -4269867 -4651706 -4615922 -4588805 -4591851 -4202245 -4140393 -4360696 -4442826
13721d442826J62970K4486j50394M5481K0342J16829k0481J93752J03747j04220
$$ -4442826 -4279856 -4255370 -4405764 -4360283 -4339941 -4223112 -4243593 -4049841 -3946094 -4050314
13711d050314k61186K73531M70463J55329k57821m200k68494J99385q2288R4368
$$ -4050314 -4311500 -4037969 -3567506 -3412177 -3669998 -3674198 -3942692 -3743307 -3825595 -3731227
13701c731227L0703j51751K46292K67858K19938K75239l4532m97185o22874L00660
$$ -3731227 -3700524 -3852275 -3605983 -3338125 -3118187 -2842948 -2877480 -3374665 -3997539 -3696879
13691c696879K88657M4275P3311k86701J49126J71090k80127O0268k17239J64107
$$ -3696879 -3408222 -3363947 -3290636 -3577337 -3428211 -3257121 -3537248 -3476980 -3694219 -3530112
13681c530112J72978k60486j86564L9946j13636q9417o3017K32014J75415j95220
$$ -3530112 -3357134 -3617620 -3804184 -3764238 -3877874 -3967291 -4030308 -3798294 -3622879 -3818099
13671c818099m11343j83900Q6671K16167K1950l87371J69397L08649J95718j8142
$$ -3818099 -4229442 -4413342 -4326671 -4110504 -4088554 -4475925 -4306528 -3997879 -3802161 -3820303
13661c820303N9902m9498J38015L37204K24585l39233j31768K6879L03674K11950
$$ -3820303 -3760401 -3809899 -3671884 -3334680 -3110095 -3449328 -3581096 -3554217 -3250543 -3038593
$$ [...]
##END NTUPLES=NMR SPECTRUM
##END=
