##TITLE=Analysis number 324056
Compound Code cc 36013
Project Code adrs
Chemist Name ugmt
##JCAMPDX= 6.0         $$ Bruker NMR JCAMP-DX V2.0
##DATA TYPE= NMR SPECTRUM
##DATA CLASS= NTUPLES
##ORIGIN= Bruker BioSpin GmbH
##OWNER= nmr
$$ XWIN-NMR		Version 3.5
$$ Tue Nov 14 12:02:16 2006 GMT Standard Time (UT+0h)  MAYBRIDGE\nmr@NMR_250MHZ
##.OBSERVE FREQUENCY= 250.131544655141
##.OBSERVE NUCLEUS= ^1H
##.ACQUISITION MODE= SIMULTANEOUS (DQD)
##.ACQUISITION SCHEME= undefined
##.AVERAGES= 16
##.DIGITISER RES= 18
##SPECTROMETER/DATA SYSTEM= dpx250
##.PULSE SEQUENCE= zg30
##.SOLVENT NAME= CDCl3
##.SHIFT REFERENCE= (INTERNAL, CDCl3, 0, 16.522)
##AUDIT TRAIL= $$ (NUMBER, WHEN, WHO, WHERE, WHAT)
$$ ##TITLE= Audit trail, XWIN-NMR		Version 3.5
$$ ##JCAMPDX= 5.01
$$ ##ORIGIN= Bruker BioSpin GmbH
$$ ##OWNER= nmr
$$ C:\u/data/dgb/nmr/ADRS/270/pdata/1/auditp.txt
$$ ##AUDIT TRAIL=  $$ (NUMBER, WHEN, WHO, WHERE, WHAT)
(   1,<2006-11-14 12:01:49.44 +000>,<MAYBRIDGE\nmr>,<NMR_250MHZ>,
      <created by zg, POWCHK disabled, PULCHK disabled
       configuration hash MD5:
       49 4B E0 1D 92 C2 6B 37 9F E6 65 BC 52 41 86 1D
       data hash MD5: 64K
       F5 F4 A0 96 9E 8C B4 ED 9F B7 0D 51 68 4B A3 CF>)
(   2,<2006-11-14 12:02:04.53 +000>,<MAYBRIDGE\nmr>,<NMR_250MHZ>,
      <Start of raw data processing
       ef LB = 0.3 FT_mod = 6 PKNL = 1 SI = 32K 
       data hash MD5: 32K
       10 CF A7 A3 F8 EF 1C A4 E1 99 3D B4 BD 8B 3F 24>)
(   3,<2006-11-14 12:02:07.34 +000>,<MAYBRIDGE\nmr>,<NMR_250MHZ>,
      <apk 
       data hash MD5: 32K
       02 0B FC 5B AB 55 FC 51 58 F9 7D B3 75 83 6F 8B>)
(   4,<2006-11-14 12:02:08.25 +000>,<MAYBRIDGE\nmr>,<NMR_250MHZ>,
      <abs ABSG = 5 
       data hash MD5: 32K
       55 85 51 83 DA 9F 8F 2D 93 DE B5 72 E2 61 09 68>)
$$ ##END=
$$ 
$$ hash MD5
$$ 4F 61 3D A5 6D 07 30 0F 84 8F BD 78 2C B3 22 13
##$RELAX= 
##$RELAX= 
##$RELAX= 
##$RELAX= 
##$RELAX= 
##$RELAX= 
##$RELAX= 
$$ Bruker specific parameters
$$ --------------------------
##$DU= <C:\u>
##$EXPNO= 270
##$NAME= <ADRS>
##$PROCNO= 1
##$TYPE= <nmr>
##$USER= <dgb>
##$AMP= (0..31)
100 100 100 100 100 100 100 100 100 100 100 100 100 100 100 100 100 100 
100 100 100 100 100 100 100 100 100 100 100 100 100 100 
##$AQSEQ= 0
##$AQ_mod= 3
##$AUNM= <au_zg>
##$AUTOPOS= <30 >
##$BF1= 250.13
##$BF2= 250.13
##$BF3= 250.13
##$BF4= 250.13
##$BF5= 500.13
##$BF6= 500.13
##$BF7= 500.13
##$BF8= 500.13
##$BYTORDA= 1
##$CFDGTYP= 0
##$CFRGTYP= 5
##$CHEMSTR= <none>
##$CNST= (0..31)
1 1 145 1 1 1 1 1 1 1 1 1 1 1 1 1 1 1 1 1 1 1 1 1 1 1 1 1 1 1 1 1 
##$CPDPRG= <>
##$CPDPRG1= <>
##$CPDPRG2= <>
##$CPDPRG3= <>
##$CPDPRG4= <mlev>
##$CPDPRG5= <mlev>
##$CPDPRG6= <mlev>
##$CPDPRG7= <mlev>
##$CPDPRG8= <mlev>
##$CPDPRGB= <>
##$CPDPRGT= <>
##$D= (0..31)
0 1 0 0 0 0 0 0 0 0.06 0 0 0 0 0 0 0.0002 0 0 0 0 0 0 0 0 0 0 0 0 0 0 
0 
##$DATE= 1163505708
##$DBL= (0..7)
120 120 120 120 120 120 120 120 
##$DBP= (0..7)
150 150 150 150 150 150 150 150 
##$DBP07= 0
##$DBPNAM0= <>
##$DBPNAM1= <>
##$DBPNAM2= <>
##$DBPNAM3= <>
$$ [...]
##$SUBNAM7= <"">
##$SUBNAM8= <"">
##$SUBNAM9= <"">
##$SW= 20.6930455092707
##$SWIBOX= (0..15)
0 0 3 0 0 0 0 0 0 0 0 0 0 0 0 0 
##$SW_h= 5175.983436853
##$TD= 65536
##$TD0= 1
##$TE= 683.16
##$TE2= 300
##$TE3= 300
##$TEG= 300
##$TL= (0..7)
0 120 120 120 120 120 120 120 
##$TP= (0..7)
150 150 150 150 150 150 150 150 
##$TP07= 0
##$TPNAME0= <>
##$TPNAME1= <>
##$TPNAME2= <>
##$TPNAME3= <>
##$TPNAME4= <>
##$TPNAME5= <>
##$TPNAME6= <>
##$TPNAME7= <>
##$TPOAL= (0..7)
0.5 0.5 0.5 0.5 0.5 0.5 0.5 0.5 
##$TPOFFS= (0..7)
0 0 0 0 0 0 0 0 
##$TUNHIN= 0
##$TUNHOUT= 0
##$TUNXOUT= 0
##$USERA1= <user>
##$USERA2= <user>
##$USERA3= <user>
##$USERA4= <user>
##$USERA5= <user>
##$V9= 5
##$VALIST= <valist>
##$VCLIST= <CCCCCCCCCCCCCCC>
##$VD= 0
##$VDLIST= <DDDDDDDDDDDDDDD>
##$VPLIST= <PPPPPPPPPPPPPPP>
##$VTLIST= <TTTTTTTTTTTTTTT>
##$WBST= 1024
##$WBSW= 4
##$XGAIN= (0..3)
0 0 0 0 
##$XL= 0
##$YL= 0
##$YMAX_a= 452945
##$YMIN_a= -640198
##$ZGOPTNS= <>
##$ZL1= 120
##$ZL2= 120
##$ZL3= 120
##$ZL4= 120
##$ABSF1= 16.522
##$ABSF2= -4.171173
##$ABSG= 5
##$ABSL= 3
##$ALPHA= 0
##$AQORDER= 0
##$ASSFAC= 0
##$ASSFACI= 0
##$ASSFACX= 0
##$ASSWID= 0
##$AUNMP= <proc_1d>
##$AZFE= 0.1
##$AZFW= 0.1
##$BCFW= 0
##$BC_mod= 0
##$BYTORDP= 0
##$COROFFS= 0
##$CY= 12.5
##$DATMOD= 1
##$DC= 0
##$DFILT= <>
##$DTYPP= 0
##$F1P= 14.0000005364418
##$F2P= -0.99999901652339
##$FCOR= 0.5
##$FTSIZE= 32768
##$FT_mod= 6
##$GAMMA= 0
##$GB= 0
##$INTBC= 1
##$INTSCL= 1
##$ISEN= 128
##$LB= 0.3
##$LEV0= 0
##$LPBIN= 0
##$MAXI= 10000
##$MC2= 0
##$MEAN= 0
##$ME_mod= 0
##$MI= 0
##$NCOEF= 0
##$NC_proc= -3
##$NLEV= 6
##$NOISF1= 0
##$NOISF2= 0
##$NSP= 0
##$NTH_PI= 0
##$NZP= 0
##$OFFSET= 16.522
##$PC= 1
##$PHC0= 157.8195
##$PHC1= 5.024948
##$PH_mod= 1
##$PKNL= yes
##$PPARMOD= 0
##$PSCAL= 4
##$PSIGN= 0
##$REVERSE= no
##$SF= 250.13
##$SI= 32768
##$SIGF1= 0
##$SIGF2= 0
##$SINO= 400
##$SIOLD= 32768
##$SREGLST= <1H.CDCl3>
##$SSB= 0
##$STSI= 32768
##$STSR= 0
##$SW_p= 5175.98343685301
##$SYMM= 0
##$S_DEV= 0
##$TDeff= 65536
##$TDoff= 0
##$TI= <Analysis number 999999
Compound Code 99
Book Reference 9
Project Code 9>
##$TILT= no
##$TM1= 0
##$TM2= 0
##$TOPLEV= 0
##$USERP1= <user>
##$USERP2= <user>
##$USERP3= <user>
##$USERP4= <user>
##$USERP5= <user>
##$WDW= 1
##$XDIM= 32768
##$YMAX_p= 288382753
##$YMIN_p= -25974
$$ End of Bruker specific parameters
$$ ---------------------------------
##NTUPLES= NMR SPECTRUM
##VAR_NAME=  FREQUENCY,     SPECTRUM/REAL,   SPECTRUM/IMAG
##SYMBOL=    X,             R,               I
##VAR_TYPE=  INDEPENDENT,   DEPENDENT,       DEPENDENT
##VAR_FORM=  AFFN,          ASDF,            ASDF
##VAR_DIM=   32768,         32768,           32768
##UNITS=     HZ,            ARBITRARY UNITS, ARBITRARY UNITS
##FACTOR=    0.157963299565203, 1,           1
##FIRST=     4132.6476996994, 0,             0
##LAST=      -1043.33573715361, 0,           0
##MIN=       -1043.33573715361, -25974,      0
##MAX=       4132.6476996994, 288382753,     0
$$ Real data points
##PAGE= N=1
##DATA TABLE= (X++(R..R)), XYDATA
$$ [...]
$$ plain form
16566 -2907 -7438 -6149 -11245 -10163 -6103 -5029 -5039 -7606 -9122 -8436 -4987 -1346 -3990 -8151 -9710
16551 -9710 -15327 -18441 -14752 -8334 -10359 -10411 -4234 81 1249 -4420 -8683 -9475 -11789 -11097 -11644 -8940
16535 -8940 -9111 -8866 -1690 1107 -4206 -7370 -11419 -8058 -6201 -7332 -3349 -1330 -2282 722 46 1540
16519 1540 -2853 -8260 -13131 -10936 -11397 -10484 -9435 -6420 -5393 -3846 3100 7005 3032 -4596 -10171
16504 -10171 -9338 -4477 -3653 -5062 -6429 -2207 2573 -426 -6162 -10157 -8460 -7240 -8029 -3484 -6733
16489 -6733 -8117 -3538 -5771 -9835 -4249 -6653 -4947 -2862 -1671 2639 3926 -173 -796 20 -3189
16474 -3189 -1464 2648 6675 3635 -5368 -9099 -4603 -6189 -5240 -6683 -8528 -8209 -4281 -4109 42
16459 42 -559 -2116 -6155 -6014 -4205 -8979 -12259 -4794 64 -1997 -6798 -11345 -16648 -15217 -14370 -11392
$$ packed form
16566b907m531J289n096J082M060J074j0k567j516O86L449L641k644m161j559
16551i710n617l114L689O418k025n2O177M315J168n669m263p92k314O92n47K704
16535h940j71K45P176K797n313l164m049L361J857j131L983K019r52L004o76J494
16519A540m393n407m871K195m61R13J049L015J027J547O946L905l973p628n575
16504a0171Q33M861Q24j409j367M222M780k999n736l995J697J220p89M545l249
16489f733j384M579k233m064N586k404J706K085J191M310J287m099o23Q16l209
16474c189J725M112M027l040r003l731M496j586R49j443j845L19L928J72M151
16459D2o01j557m039J41J809m774l280P465M858k061m801m547n303J431Q47K978
$$ plain form
16443 -11392 -12120 -17077 -11586 -10384 -14290 -15065 -17000 -18274 -11342 -4071 -3243 -3601 -7912 -3349 6117
16428 6117 3863 4703 -1930 -5210 734 -1929 -7244 -6822 -3044 -1273 -4168 -6566 -130 -8834 -13360
16413 -13360 -10007 -12591 -11209 -12527 -5796 -1612 -7842 -16940 -8901 -3416 -329 5655 9743 6560
16399 6560 -44 -3176 3079 4120 -3559 -8901 -12303 -16264 -15355 -11348 -2025 2744 1447 2398 7802
16384 7802 2430 -5517 -4859 -623 1583 -5094 -7364 -2560 -1749 -2062 1458 2588 -3591 -9466 -10826
16369 -10826 -6370 -5875 -8182 -13109 -22366 -18850 -14900 -12179 -11720 -11381 -13472 -10362 -4196 -3537 -3433 1897
16353 1897 4412 -1712 484 3593 1882 1229 223 -1609 -5427 -3784 865 -2723 -9516 -8208 -4031
16338 -4031 -5941 -3042 -5526 -5491 -2758 -3575 -4007 -8771 -13008 -10045 -11014 -12778 -10506 -5767 -5788 -4282
$$ packed form
16443a1392p28m957N491J202l906p75j935j274O932P271Q28l58m311M563R466
16428F117k254Q40o633l280N944k663n315M22L778J771k895k398O436q704m526
16413a3360L353k584J382j318O731M184o230r098Q039N485L087N984M088l183
16399F560o604l132O255J041p679n342l402l961R09M007R323M769j297R51N404
16384G802n372p947O58M236K206o677k270M804Q11l13L520J130o179n875j360
16369a0826M456M95k307m927r257L516L950K721M59L39k091L110O166O59J04N330
16353A897K515o124K196L109j711o53j006j832l818J643M649l588o793J308M177
16338d031j910K899k484L5K733q17m32m764m237K963r69j764K272M739k1J506
$$ plain form
16322 -4282 -4278 -3210 2196 -1634 -1035 -1793 -4934 -11239 -13341 -8361 -8709 -6932 -4585 -7858 -11591 -15097
16306 -15097 -11995 -7088 -916 -1551 -5562 -23 2348 7 -7073 -6678 -4765 -9403 -11816 -13174 -14033
16291 -14033 -12087 -13997 -11446 -11394 -18912 -19187 -18129 -18652 -12786 -15625 -15629 -13019 -17359 -11892 -11523 -6772
16275 -6772 -3921 -6501 -5262 -2367 -10670 -11609 -5949 -4059 267 -6904 -9158 -5426 -566 4036 -2168
16260 -2168 -8215 -11445 -13067 -15083 -13923 -13579 -13409 -18636 -20624 -20679 -13049 -6679 -7282 -7988 -5609 -10808
16244 -10808 -11366 -5790 -1074 -1279 -6092 -5752 -2973 -3633 -2124 -3134 -8142 -4850 -3739 -1711 -5405
16229 -5405 -13990 -16059 -14468 -9360 -10448 -12562 -5112 -5 2864 -4992 -13294 -11245 -7598 -6960 -5023
16214 -5023 -9863 -13164 -12850 -8908 -9619 -13110 -9298 -4507 -5307 -9824 -12495 -15782 -17435 -11591 -9768
$$ packed form
16322d282MJ068N406l830N99p58l141o305k102M980l48J777K347l273l733l506
16306a5097L102M907O172o35m011N539K371k341p080L95J913m638k413j358q59
16291a4033J946j910K551N2p518k75J058n23N866k839mK610m340N467L69M751
16275f772K851k580J239K895q303r39N660J890M326p171k254L732M860M602o204
16260b168o047l230j622k016J160L44J70n227j988n5P630O370o03p06K379n199
16244a0808n58N576M716k05m813L40K779o60J509j010n008L292J111K028l694
16229e405q585k069J591N108j088k114P450N107K869p856q302K049L647O38J937
16214e023m840l301L14L942p11l491L812M791q00m517k671l287j653N844J823
$$ plain form
16199 -9768 -8726 -12306 -17028 -14435 -9739 -10787 -12272 -14535 -13750 -10134 -10022 -9755 -7626 -7921 -4541 -1158
16183 -1158 -440 -3877 -5340 -4338 -9115 -13783 -13755 -12672 -10619 -8331 -4384 -1162 -6900 -7839 628 6645
16167 6645 6182 -1179 -1925 315 -8666 -14111 -11674 -4524 -12691 -17127 -14107 -13279 -18061 -19128 -20037 -13348
16151 -13348 -8779 -7714 -9700 -13152 -16450 -16051 -13958 -9625 -7345 -5367 -6431 -12890 -11019 -12714 -16167
16136 -16167 -11021 -1683 -954 -1420 -1264 -8386 -7576 -4580 -10490 -12873 -4625 -703 5859 -790 -10926
16121 -10926 -15459 -14757 -14121 -12295 -8706 -10110 -9572 -10465 -9878 -8995 -8322 -3617 -3511 -7708 -9054 -6140
16105 -6140 -5764 -5495 -4681 -1014 3614 3558 -1601 -7733 -7955 -9629 -7938 -3037 -1309 -1991 -4594 -9527
16089 -9527 -12237 -9370 -4991 -6713 -7448 -6159 -6847 -3580 1973 2794 2264 -7794 -4460 -5485 -8159
$$ packed form
16199i768J042l580m722K593M696j048j485k263P85L616J12K67K129k95L380L383
16183a158P18l437j463J002m777m668K8J083K053K288L947L222n738r39Q467O017
16167F645m63p361p46K240q981n445K437P150q167m436L020Q28m782j067r09O689
16151a3348M569J065j986l452l298L99K093M333K280J978j064o459J871j695l453
16136a6167N146R338P29m66J56p122Q10K996n910k383Q248L922O562o649j0136
16121a0926m533P02O36J826L589j404N38q93N87Q83O73M705J06m197j346K914
16105f140L76K69Q14L667M628n6n159o132k22j674J691M901J728o82k603m933
16089i527k710K867M379j722p35J289o88L267N553Q21n30j0058L334j025k674
$$ plain form
16074 -8159 -8079 -15500 -16216 -5594 1330 2898 7466 6817 326 -2790 -7383 -10813 -14466 -19649 -20999
16059 -20999 -18175 -19484 -17514 -17529 -9794 -3827 -1818 -5144 -4457 -6108 -2471 -3401 -7859 -6619 -4116
16044 -4116 1298 -2766 -5824 -5 664 -1291 -6603 -11031 -12213 -9708 -12130 -14486 -12295 -13745 -12622
16029 -12622 -10523 -11787 -12224 -13600 -10248 -8563 -3169 3355 3750 555 -3815 -9039 -12407 -15738 -10397
16014 -10397 -12460 -12122 -8580 -6323 -4100 -2038 197 1798 -1057 -1620 222 -2597 -8404 -12145 -7888
15999 -7888 -2931 -440 -4057 -2740 -4604 -3598 -4574 -12411 -13627 -3909 1180 -2394 -6155 -7174 -9757
15984 -9757 -8072 -7241 -10603 -10081 -615 -3212 -5594 -11988 -12262 -14923 -17491 -16975 -18379 -12591 -6125 -7683
15968 -7683 -12292 -12903 -17043 -18200 -14457 -11493 -10485 -9567 -4506 -6372 -2500 -1228 3137 -881 -7340
$$ packed form
16074h159Q0p421p16J0622O924J568M568o49o491l116m593l430l653n183j350
16059b0999K824j309J970j5P735N967K009l326O87j651L637r30m458J240K503
16044d116N414m064l058N819O69j955n312m428j182K505k422k356K191j450J123
16029a2622K099j264m37j376L352J685N394O524L95l195m370n224l368l331N341
16014a0397k063L38L542K257K223K062K235J601k855n63J842k819n807l741M257
15999g888M957K491l617J317j864J006r76p837j216R718N089l574l761j019k583
15984i757J685Q31l362N22R466k597k382o394k74k661k568N16j404N788O466j558
15968g683m609o11m140j157L743K964J008R18N061j866L872J272M365m018o459
$$ plain form
15953 -7340 -4201 -1256 -7846 -10947 -8306 -8370 -7502 -5251 -8841 -9876 -5652 -4300 -4981 -7602 -1094 2867
15937 2867 -2579 -9188 -8835 -11755 -13390 -15475 -11419 -11504 -11529 -7412 -7884 -10724 -12399 -6554 -3814 -6098
15921 -6098 122 -2930 -8278 -6635 1386 908 -7197 -5058 -2032 -3262 -3609 -7208 -5393 -6590 -10283
15906 -10283 -10951 -9854 -8931 -7908 -12343 -12432 -10638 -9672 -10686 -10109 -8799 -15482 -14884 -13128 -14841 -14273
15890 -14273 -10952 -8152 -8731 -6127 -2340 -2430 -8368 -11101 -12852 -10615 -3697 -2221 -5929 -9547 -6564
15875 -6564 -7889 -10930 -12615 -11618 -12230 -12187 -9958 -5094 948 -1408 -958 -920 -5325 -10953 -11605 -7308 -6128
15858 -6128 -944 2469 -1076 -5066 -6957 -11929 -15031 -7425 -7395 -10452 -13106 -7296 -13253 -22134 -17925
15843 -17925 -18229 -9701 -9585 -8024 -6080 1631 789 -1369 4830 1709 -7743 -9168 -1287 327 265 -3484
$$ packed form
15953g340L139K945o590l101K641o4Q68K251l590j035M224J352o81k621O508L961
15937B867n446o609L53k920j635k085M056q5k5M117m72k840j675N845K740k284
15921f098O220l052n348J643Q021m78q105K139L026j230l47l599J815j197l693
15906a0283o68J097R23J023m435q9J794R66j014N77J310o683N98J756j713N68
15890a4273L321K800n79K604L787r0n938k733j751K237O918J476l708l618K983
15875f564j325l041j685R97o12M3K229M864O042k356M50L8m405n628o52M297J180
15858f128N184L413l545l990j891m972l102P606L0l057k654N810n957q881M209
15843a7925l04Q528J16J561J944P711q42k158O199l121r452j425P881J614o2l749
$$ plain form
15827 -3484 -7598 -6350 -3554 -5337 -3987 -473 -4212 -7693 -6810 -7725 -10813 -14127 -10133 -10020 -9056 -11369
15811 -11369 -13107 -13594 -11594 -8093 -6656 -4508 -3388 -1413 -6934 -10402 -7284 -2808 2612 -310 -5063
15796 -5063 -5801 -3531 -1816 228 1397 -3020 -8739 -11136 -15394 -13984 -7490 -5600 -2732 1829 1626
15781 1626 -3583 -1888 -5833 -3426 -5783 -4787 -2343 -5030 -6615 -6177 -5092 -5384 -13153 -13824 -6293 -4814
15765 -4814 -9695 -9381 -6280 -11116 -11829 -11811 -11855 -4626 -4534 -4149 -3950 -7048 -11173 -8419 -8111 -10988 -6440
15748 -6440 -8066 -6622 -5992 -7449 -1889 -4284 -3510 6736 14498 12708 5326 -2918 -1559 -1792 349
15733 349 -3019 -13582 -15911 -15775 -10294 -7832 -915 -585 -10331 -11120 -5607 -4295 -10035 -6237 -4259
15718 -4259 -1686 -5564 -13586 -19976 -12361 -3600 -4719 -5920 -5962 -6116 -3392 -5356 310 1570 2564 5357
$$ packed form
15827c484m114J248K796j783J350L514l739l481Q83r15l088l314L994J13R64k313
15811a1369j738m87K000L501J437K148J120J975n521l468L118M476N420k922m753
15796e063p38K270J715K044J169m417n719k397m258J410O494J890K868M561k03
15781A626n209J695l945K407k357R96K444k687j585M38J085k92p769o71P531J479
15765d814m881L14L101m836p13J8m4P229R2L85J99l098m125K754L08k877M548
15748f440j626J444O30j457N560k395P74J0246P762j790p382q244J359k33K141
15733C49l368j0563k329J36N481K462O917L30r746p89N513J312n740L798J978
15718d259K573l878q022o390P615Q761j119j201m2j54K724j964N666J260R94K793
$$ plain form
15702 5357 1525 -5150 -4408 -3649 958 7544 1254 1818 478 -2729 -507 4212 2968 -804 -1065 -1411
15686 -1411 -632 1751 1109 -3864 -10644 -7982 -2960 2785 -457 -2000 -3859 -5983 -9037 -11498 -18329
15671 -18329 -14286 -11606 -9311 -9765 -9520 -8125 -4963 -276 -2996 -12609 -9401 -9018 -5849 -2149 -2702
15656 -2702 -1058 -2911 -2258 1040 -2579 2051 4991 2077 4757 10011 9385 5537 5612 4149 -2728 -6312
15640 -6312 -9611 -11438 -14255 -10112 -7641 -7078 -4321 -2968 -4279 -5871 -7681 -10549 -12472 -5900 -10524
15625 -10524 -11447 -6145 -7389 -13323 -9213 -100 3861 4837 152 -3341 28 -799 -1959 -1944 -5453 -6439
15609 -6439 -9090 -6775 -9819 -12544 -8505 -3440 2750 2921 3179 -1211 -5137 -10063 -10988 -8263 -1452
15594 -1452 5861 9376 11418 8397 9273 6230 3141 4081 -3892 -3630 -2696 -735 -3954 496 3027 3167
$$ packed form
15702E357l832o675P42P59M607O586o290N64j340l207K222M719j244l772k61l46
15686a411P79K383o42m973o780K662N022N745l242j543j859k124l054k461o831
15671a8329M043K680K295m54K45J395L162M687k720r613L208L83L169L700n53
15656b702J644j853O53L298l619M630K940k914K680N254o26l848P5j463o877l584
15640f312l299j827k817M143K471N63K757J353j311j592j810k868j923O572m624
15625a0524r23N302j244n934M110R113L961R76m685l493L369q27j160J5l509r86
15609f439k651K315l044k725M039N065O190J71K58m390l926m926r25K725O811
15594a452P313L515K042l021Q76l043l089R40p973K62R34J961l219M450K531J40
$$ plain form
15578 3167 2991 -4228 -4723 -6025 -3301 3775 6627 5260 3683 8149 11051 5483 -1065 -7680 -6009
15563 -6009 -6621 -4723 -5841 -3880 6778 4696 6888 1521 -6334 -7731 -2558 -3072 -2482 1341 -4419
15548 -4419 -9258 -15353 -9537 -4435 -2897 -9419 -13920 -9267 -6413 -4875 -5927 -3154 -2244 -5600 -7256
15533 -7256 -8032 -6141 -1314 4504 3318 2568 3086 310 -5707 -9448 -7948 -6108 679 2170 767
15518 767 -10740 -10404 -8000 -6914 -3388 -1703 -5635 -10893 -15182 -16662 -17503 -18862 -17492 -9672 -9639 -10012
15502 -10012 -8392 -6251 -10561 -8644 -8197 -11167 -14318 -10094 -10824 -9918 -4138 885 4325 5602 4645
15487 4645 6593 8037 1855 -1070 -2850 -1989 -6270 -4693 -9475 -14971 -10984 -5764 -7945 -9571 -15105
15472 -15105 -15005 -14015 -8013 -1502 -5695 -10821 -5951 -1429 -3587 -6547 -9084 -3429 797 -913 -3171
$$ packed form
15578C167j76p219m95j302K724P076K852j367j577M466K902n568o548o615J671
15563f009o12J898j118J961J0658k082K192n367p855j397N173n14N90L823n760
15548d419m839o095N816N102J538o522m501M653K854J538j052K773R10l356j656
15533g256p76J891M827N818j186p50N18k776o017l741J500J840O787J491j403
15518G67j1507L36K404J086L526J685l932n258m289j480q41j359J370P820L3l73
15502a0012J620K141m310J917M47k970l151M224p30R06N780N023L440J277r57
15487D645J948J444o182k925j780Q61m281J577m782n496L987N220k181j626n534
15472a5105J00R90O002O511m193n126M870M522k158k960k537N655M226j710k258
$$ plain form
15457 -3171 -6969 -12431 -13145 -11747 -10172 -9290 -8126 -8182 -11427 -13698 -12109 -4765 -6316 -7811 -12476 -13701
15441 -13701 -9234 -14630 -14223 -7997 -7321 -8639 -7262 -11358 -11416 -7763 -4511 -4698 -5282 -367 -18 939
15425 939 -1299 -7026 -9044 -8558 -11697 -16140 -9507 -2767 -3627 -1106 3668 3785 816 -4767 -6469 -9198
15409 -9198 -15641 -12503 -7899 -11632 -7299 -2561 -4723 -1535 -4085 -11723 -12646 -5840 184 -523 -6012
15394 -6012 -10361 -14795 -17197 -15968 -20161 -19112 -14919 -11684 -11833 -7092 -679 -1289 -1322 -988 5494 8646
15378 8646 4337 -1894 -4803 -6213 -6406 -8562 -8256 -6056 -7381 -12744 -11225 -1940 1541 -2477 -5686
15363 -5686 -4748 1403 5759 -4743 -13636 -8926 -10649 -13592 -12931 -13829 -16731 -15637 -12830 -15208 -13364
15348 -13364 -17682 -19226 -15742 -13116 -17126 -22392 -19183 -18319 -12672 -3337 384 -1170 461 3415 9099
$$ packed form
15457c171l798n462p14J398J575Q82J164n6l245k271J589P344j551j495m665j225
15441a3701M467n396M07O226O76j318J377m096n8L653L252j87n84M915L49R57
15425I39k238n727k018M86l139m443O633O740q60K521M774J17k969n583j702k729
15409i198o443L138M604l733M333M738k162L188k550p638r23O806O024p07n489
15394f012m349m434k402J229m193J049M193L235j49M741O413o10l3L34O482L152
15378H646m309o231k909j410j93k156L06K200j325n363J519R285L481m018l209
15363e686R38O151M356j0502q893M710j723k943O61q98k902J094K807k378J844
15348a3364m318j544L484K626m010n266L209Q64N647R335L721j554J631K954N684
$$ plain form
15333 9099 10618 2803 -8135 -10305 -10101 -5614 -326 2906 -5650 -8128 -5207 -6936 -5748 -9535 -15868
15318 -15868 -17251 -14244 -12645 -2787 330 243 -3104 -7451 -11344 -12276 -13743 -15689 -18639 -18032 -10603
15303 -10603 -7181 2800 8799 7259 -3115 -7616 -9617 -10883 -11199 -9729 -13121 -15051 -11514 -13618
15289 -13618 -7002 -4334 -5955 -4432 -4237 -3432 -6180 -7145 -13777 -11393 -12310 -12559 -6494 -5112 -4550 -8032
15273 -8032 -3454 -4283 -6376 -2960 -3047 -4001 -3453 -516 -836 -5077 -5401 -8708 -13380 -17432 -16320 -13755
15257 -13755 -8426 -7736 -5267 -2095 -6556 -17352 -18728 -9646 -5098 -976 3603 -1775 -5169 -3108
15243 -3108 -2453 -2058 -10972 -16341 -7688 1278 6337 4571 -577 -4142 -8137 -17520 -17581 -15213 -10785 -12110
15227 -12110 -10348 -6543 -6121 -12054 -11901 -13670 -11128 -11114 -8829 -6082 -7471 -9904 -6846 -9034 -8224 0
$$ packed form
15333I099J519p815j0938k170K04M487N288L232q556k478K921j729J188l787o333
15318a5868j383L007J599R858L117q7l347m347l893r32j467j946k950O07P429
15303a0603L422R981N999j540j0374m501k001j266l16J470l392j930L537k104
15289a3618O616K668j621J523J95Q05k748r65o632K384r17k49O065J382N62l482
15273h032M578q29k093L416q7r54N48K937l20m241l24l307m672m052J112K565
15257a3755N329O90K469L172m461j0796j376R082M548M122M579n378l394K061
15243c108O55L95q914n369Q653Q966N059j766n148l565l995r383o1K368M428j325
15227a2110J762L805M22n933J53j769K542J4K285K747j389k433L058k188Q10Q224
$$ plain form
15211 0 7476 3380 -3749 -13740 -8297 303 -453 -7125 -7757 -3398 -11235 -19609 -18281 -12126 -2176 -4777
15195 -4777 -6104 -7689 -10277 -18096 -22612 -17187 -11656 -11173 -6324 2689 6462 7549 3690 -2845 -5573
15180 -5573 -9871 -14063 -7370 27 2441 1615 -4819 -6515 -11175 -12902 -11115 -11261 -10138 -8006 -10259
15165 -10259 -19564 -21432 -10296 -435 -195 -2743 -2875 -3654 -5938 -9889 -6970 -1932 -4493 -4916 -809
15150 -809 2501 -2996 -6250 -5231 -4786 -4453 -6445 -7403 -12069 -7828 -9778 -9486 -10398 -12214 -15188 -13965
15134 -13965 -8456 -5858 -12230 -13574 -8105 -4728 -5601 -10099 -13946 -19547 -10488 -10238 -12586 -9194 -5698
15119 -5698 -3377 -4841 -8324 -4631 4867 3795 1126 2136 1987 6866 5073 4283 3886 -1562 -7035
15104 -7035 -5205 -8719 -11971 -7191 -4171 -10374 -13699 -17787 -15846 -8987 -9081 -14161 -14796 -13052 -9254
$$ packed form
15211@P476m096p129r991N443Q600p56o672o32M359p837q374J328O155R950k601
15195d777j327j585k588p819m516N425N531M83M849R013L773J087l859o535k728
15180e573m298m192O693P397K414q26o434j696m660j727J787j46J123K132k253
15165a0259r305j868J1136R861K40k548j32p79k284l951K919N038k561m23M107
15150h09L310n497l254J019M45L33j992r58m666M241j950K92r12j816k974J223
15134a3965N509K598o372j344N469L377q73m498l847n601R059K50k348L392L496
15119e698K321j464l483L693R498j072k669J010j49M879j793p90l97n448n473
15104g035J830l514l252M780L020o203l325m088J941O859r4n080o35J744L798
$$ plain form
15089 -9254 -9719 -9735 -7850 -2904 -8318 -13522 -12849 -7499 -3031 -4823 -8239 -11374 -21248 -25036 -16726 -13821
15073 -13821 -19264 -19486 -17115 -5745 -2064 -8095 -12873 -15977 -10821 839 5869 771 -362 -1056
15059 -1056 -1366 -1616 -3223 -8316 -8182 -7134 -2692 5045 3596 -2108 -6570 -8787 -14678 -8244 -5807
15044 -5807 -4844 -8833 -14531 -10364 -7591 -11244 -7770 2471 4907 -6629 -6935 -529 2220 5503 4568
15029 4568 6247 3496 3581 -772 -4715 -8067 -6667 -578 2548 2511 1233 -3864 -5698 -5943 -6584 -2635
15013 -2635 -2831 -9093 -12127 -8552 -8354 -8392 -7289 349 2180 6990 10275 4623 785 -33 -10766 -16122
14997 -16122 -13829 -10443 -3053 -1086 -7290 -9684 -4263 -1330 -5424 -11499 -14872 -12747 -5348 -921
14983 -921 -2725 -6755 -8049 -7827 -8494 -6730 -8828 -14954 -11096 -10050 -11030 -10904 -10151 -12697 -12432 -8310
$$ packed form
15089i254m65j6J885M946n414n204O73N350M468j792l416l135r874l788Q310K905
15073a3821n443k22K371J1370L681o031m778l104N156J1660N030n098j133o94
15059a056l10k50j607n093J34J048M442P737j449n704m462k217n891O434K437
15044e807R63l989n698M167K773l653L474J0241K436j1536l06O406K749L283r35
15029D568J679k751Q5m353l943l352J400O089L126l7j278n097j834k45o41L949
15013b635j96o262l034L575J98l8J103P638J831M810L285n652l838q18j0733n356
14997a6122K293L386P390J967o204k394N421K933m094o075l373K125P399M427
14983i21j804m030j294K22o67J764k098o126L858J046r80J26P53k546K65M122
$$ plain form
14967 -8310 -10326 -6816 -5863 -5362 -5673 -1416 -1277 -5235 -3371 -4653 2332 -3527 -4480 686 -3031 -11742
14951 -11742 -14241 -9920 -11069 -10089 -13442 -8897 -7571 -1129 -730 -5508 -7096 1915 5581 5881 5956 373
14935 373 -4587 -6810 -6370 -3712 -596 -440 2224 6405 3707 -2378 -2194 1276 4175 699 -5819 -7819
14919 -7819 -4450 -6223 -3847 -3795 -3324 -668 3473 6277 596 -4601 -417 3666 -1034 -4920 -3957 -1530
14903 -1530 -4602 -7501 -1489 2251 -8 -634 2461 1412 3357 -3719 -3947 -1323 -2433 -6154 -5449
14888 -5449 -6787 -7517 -3462 1859 -2580 -11736 -12263 -11647 -12967 -12346 -10767 -12003 -12535 -3149 -2960 -357
14872 -357 223 -4169 -1650 1749 528 -3485 -4528 -2662 158 -2290 -3524 -508 4719 3717 -990
14857 -990 -878 3214 5534 3366 101 -1214 -6408 -7669 -4992 -4845 -4419 -2198 4062 -1514 -2046 -4084
$$ packed form
14967h310k016L510R53N01l11M257J39l958J864j282O985n859r53N166l717q711
14951a1742k499M321j149R80l353M545J326O442L99m778j588R011L666L00P5n583
14935C73m960k223M40K658L116J56K664M181k698o085J84L470K899l476o518k000
14919g819L369j773K376N2M71K656M141K804n681n197M184M083m700l886R63K427
14903a530l072k899O012L740k259o26L095j049J945p076k28K624j110l721P05
14888e449j338p30M055N321m439r156n27O16j320O21J579j236n32R386J89K603
14872c57N80m392K519L399j221m013j043J866K820k448j234L016N227j002m707
14857i90J12M092K320k168l265j315n194j261K677J47M26K221O260n576n32k038
$$ plain form
14841 -4084 -13084 -14188 -8002 -1878 -3784 -5926 -6261 -3283 2159 4888 4788 -2740 -4104 -4057 -5148 -1068
14825 -1068 -1780 625 5408 743 -4232 -7721 -9112 -10668 -4849 -5485 -5218 -2225 -4447 -8603 -6738
14810 -6738 -4664 -1924 -1719 1597 12884 9674 8031 4087 8215 6706 685 -3334 -7068 -7666 -576
14795 -576 4768 2689 1189 -2699 -1344 -624 -910 2338 -1750 -8925 -11754 -14522 -12439 -11254 -7228
14780 -7228 -4301 -7145 -10736 -9290 -9589 -10518 -12675 -14230 -19025 -18817 -14574 -10156 -6750 -5321 -4219
14765 -4219 260 1299 -1568 -1942 -6637 -8693 -6156 -5288 -4407 -2283 -5246 -3495 -1275 -461 -6584 -8209
14749 -8209 -7314 -7671 -7596 -12220 -13099 -16715 -14776 -9903 -8257 -11398 -15153 -7877 -5063 -8107 1590 92
14733 92 -14288 -17693 -12629 -11231 -11404 -13635 -10537 -8882 -9622 -12096 -7931 -9217 -1521 6065 1603
$$ packed form
14841d084r000j104O186O124j906k142l35K978N442K729j00p528j364M7j091M080
14825a068p12K405M783m665m975l489j391j556N819o36K67K993k222m156J865
14810f738K074K740K05L316J1287l210j643l944M128j509o021m019l734n98P090
14795e76N344k079j500l888J355P20k86L248m088p175k829k768K083J185M026
14780g228K927k844l591J446k99r29k157j555m795K08M243M418L406J429J102
14765d219M479J039k867l74m695k056K537Q68Q81K124k963J751K220Q14o123j625
14749h209Q95l57P5m624q79l616J939M873J646l141l755P276K814l044R697j498
14733I2j4380l405N064J398j73k231L098J655p40k474M165j286P696P586m462
$$ plain form
14718 1603 -673 -4437 -1963 -1313 -2701 1054 -1765 -4978 -5269 -3512 -2100 -7210 -5840 -4935 -6043
14703 -6043 -7227 -9804 -8511 -9630 -11895 -11948 -8216 -4648 -6032 949 2854 1211 2985 3953 3789 1300
14687 1300 -582 -3336 -12657 -12625 -9372 -11258 -8937 -7563 -3759 4733 -3154 -12564 -14359 -6094 -4484
14672 -4484 -2936 -7212 -16536 -14310 -10191 -6858 -10037 -13691 -16659 -13615 -10628 -12610 -11641 -7022 -5412
14657 -5412 -1945 634 -1841 -1827 2166 98 -5795 -8644 -7205 -8093 -8944 -2468 1853 1050 603 1244
14641 1244 -8135 -16507 -19637 -20166 -23485 -17788 -9301 -10247 -8358 -6002 -3390 -5386 -2774 -3415 -12770
14626 -12770 -11844 -9078 -8117 -5341 -3310 -3210 -4891 -3548 -9179 -11698 -8745 -6003 -2978 -3182 -12478
14611 -12478 -16580 -10132 -15613 -13920 -10566 -5862 -5440 -10448 -21993 -18518 -12499 -12093 -8684 52 4866
$$ packed form
14718A603k276l764K474O50j388L755k819l213k91J757J412n110J370R05j108
14703f043j184k577J293j119k265n3L732L568j384O981J905j643J774R68j64k489
14687A300j882k754r321L2L253j886K321J374L804Q492p887r410j795Q265J610
14672d484J548m276r324K226M119L333l179l654k968L044K987j982R69M619J610
14657e412L467K579k475J4L993k068n893k849J439q88q51O476M321q03m47O41
14641A244r379q372l130n29l319N697Q487r46J889K356K612j996K612o41r355
14626a2770R26K766R61K776K031J00j681J343n631k519K953K742L025k04r296
14611a2478m102O448n481J693L354M704M22n008j1545L475O019M06L409Q736M814
$$ plain form
14596 4866 9488 9925 9275 8409 6068 2454 2960 5122 2767 4750 14383 11452 9740 7595 -1906 -5190
14580 -5190 -4811 -7074 -12603 -8413 -3200 -3347 -9674 -14710 -13726 -16080 -12020 -1874 2248 774 271
14565 271 -5756 -9719 -12456 -12194 -1681 -816 -8619 -10682 -8366 2975 6234 2485 -6884 -11104 -14700
14550 -14700 -8711 -3431 1998 -3900 -9629 -10467 -12158 -8436 -1940 -4314 -10449 -9639 -492 6243 12852
14535 12852 11876 2939 -1050 -1322 -1949 1910 5711 2775 -24 -8377 -13420 -7989 -824 -61 1842
14520 1842 4685 1065 -4301 -10691 -12648 -9349 -7452 -939 3214 3669 -3699 -8722 -11408 -10853 -5140
14505 -5140 -5558 -10307 -4978 -4699 -9783 -10969 -11606 -14686 -13963 -13815 -20045 -21407 -15456 -13459 -6824 -9679
14489 -9679 -6992 -1789 -4141 -4306 -1578 -1574 -4615 -7122 -6160 -3850 -6439 -12767 -13304 -19064 -16772 -11438
$$ packed form
14596D866M622M37o50q66k341l614N06K162k355J983R633k931j712k145r501l284
14580e190L79k263n529M190N213j47o327n036R84k354M060J0146M122j474n03
14565B71o027l963k737K62J0513Q65p803k063K316J1341L259l749r369m220l596
14550a4700N989N280N429n898n729q38j691L722O496k374o135Q10R147O735O609
14535A2852r76q937l989k72o27L859L801k936k799q353n043N431P165P63J903
14520A842K843l620n366o390j957L299J897O513M153M55p368n023k686N55N713
14505e140m18m749N329K79n084j186o37l080P23J48o230j362N951J997O635k855
14489i679K687N203k352j65K728Ml041k507R62K310k589o328n37n760K292N334
$$ plain form
14473 -11438 -8690 -6511 -7568 -7559 -14460 -11463 -9049 -9457 -6981 -6154 -5478 1793 449 -2769 -1085 -5539
14457 -5539 -7603 -9586 -3587 -1439 -1329 -204 1339 -180 1589 168 -5524 -6392 -7191 -7495 -4036 -572
14441 -572 -1390 -5017 -2527 -3969 -4218 -6301 -6939 -8972 -5380 -4170 -8123 -10064 -16948 -16802 -12902 -12881
14425 -12881 -11837 -8928 -2257 -7467 -6909 -3596 -468 -1551 -2270 -8409 -7049 -6756 -9151 -9453 -8100
14410 -8100 -2854 -5938 -8362 -2235 4893 1500 -3214 5089 5078 -1896 -6164 -8848 -8246 -4098 -2169
14395 -2169 -2940 -11930 -13843 -13625 -5297 -2084 -5583 -7768 -10296 -7345 -7247 -8221 1751 6797 199 -7501
14379 -7501 -8029 -6723 286 -1943 -3594 -5764 -5352 -2768 -4293 -5587 -6092 -58 3733 6193 4946
14364 4946 974 -6712 -7155 -4496 -1839 -5976 -9328 -9060 -4653 -2440 3783 4129 4551 1589 -3794 -3384
$$ packed form
14473a1438K748K179j057Ro901K997K414m08K476Q27O76P271j344l218J684m454
14457e539k064j983N999K148J10J125J543j519J769j421n692q68p99l04L459L464
14441e72q18l627K490j442k49k083o38k033L592J210l953j941o884J46L900K1
14425a2881J044K909O671n210N58L313L128j083p19o139J360K93k395l02J353
14410h100N246l084k424O127P128l393m714Q303j1o974m268k684O02M148J929
14395b169p71q990j913K18Q328L213l499k185k528K951R8r74R972N046o598p700
14379g501n28J306P009k229j651k170M12K584j525j294n05O034L791K460j247
14364D946l972p686m43K659K657m137l352K68M407K213O223L46M22k962n383M10
$$ plain form
14348 -3384 -2090 -3775 -6927 -7934 -8732 -5131 -405 -4823 -3672 -6129 -5498 -6450 -9695 -4725 -1775
14333 -1775 -5987 -7803 -4174 -6565 -7918 -3288 -2354 -2367 -2234 -3298 -288 -2041 -2510 290 -3833 -5226
14317 -5226 -1561 4969 1396 -5976 827 3916 3704 -4065 -6998 -3257 -3699 -5543 -2058 4325 8260
14302 8260 -191 -1429 -1386 -4747 -8182 -9494 -6885 -4035 -2261 -3231 -4477 -9397 -6780 -1041 1361
14287 1361 3483 3865 -1989 -4484 2192 5355 -843 -6507 -10893 -9487 -4419 -4059 -9335 -12225 -10523
14272 -10523 -10766 -11796 -13488 -19685 -16372 -14472 -10658 -10912 -8041 -4894 -5259 1143 -385 431 3735
14257 3735 -3091 -9304 -11713 -10719 -5727 -3197 -412 1673 -2819 -7994 -5401 -925 -2218 -6730 -8621
14242 -8621 -6401 -202 2946 -4284 -5719 -2869 -4145 -5154 -3150 -478 52 -731 -5906 -2230 -3310
$$ packed form
14348c384J294j685l152j007p98L601M726m418J151k457O31r52l245M970K950
14333a775m212j816L629k391j353M630R34j3J33j064L010j753m69K800m123j393
14317e226L665O530l573p372O803L089k12p769k933L741m42j844L485O383L935
14302H260q451j238M3l361l435j312K609K850J774r70j246m920K617N739K402
14287A361K122L82n854k495O676L163o198n664m386J406N068L60n276k890J702
14272a0523k43j030j692o197L313J900L814k54K871L147l65O402j528Q16L304
14257C735o826o213k409R94M992K530K785K085m492n175K593M476j293m512j891
14242h621K220O199L148p230j435K850j276j009K004K672N30p83n175L676j080
$$ plain form
14227 -3310 -2373 1103 -1347 -3154 -558 4054 8465 9050 419 -4775 514 -89 2276 234 -5043
14212 -5043 -7545 -5698 771 6109 4645 3725 -841 -3445 -3643 -4685 15 2261 -527 -152 3050
14197 3050 6338 5115 1294 -3636 -1915 3714 -1023 -9689 -14718 -11156 -4174 -2445 -1052 2590 -1026
14182 -1026 -2768 489 -1694 -1886 1532 885 415 -3970 -7193 -3488 -591 -4009 -12064 -17162 -18494
14167 -18494 -20929 -18035 -15065 -13065 -10656 -3781 -464 -2311 -4375 -9197 -7295 487 2035 107
14153 107 -1966 -6343 157 -1975 -10772 -6338 -5753 -7575 -9310 -5557 -2173 -825 1669 -745 2066
14138 2066 -1139 -4027 -6305 -3634 -1509 3951 7541 13987 9210 2264 -5324 -10323 -7458 -1459 -521
14123 -521 604 -3935 -4890 -609 5287 6561 1394 -8294 -13557 -13338 -9391 -7205 -3289 139 5470
$$ packed form
14227c310R37L476k450j807K596M612M411N85q631n194N289o03K365k042n277
14212e043k502J847O469N338j464r20m566k604j98j042M700K246k788L75L202
14197C050L288j223l821m930J721N629m737q666n029L562O982J729J393L642l616
14182a026j742L257k183j92L418o47m70m385l223L705K897l418q055n098j332
14167a8494k435K894K970K000K409O875L317j847k064m822J902P782J548j928
14153A07k073m377O500k132q797M434N85j822j735L753L384J348K494k414K811
14138B066l205k888k278K671K125N460L590O446m777o946p588m999K865N999R38
14123e21J125m539r55M281N896J274n167r688n263K19L947K186L916L428N331
$$ plain form
14108 5470 5140 -529 -4455 -5553 -2117 2497 6481 674 -1588 1746 5358 4019 2899 3409 7168
14093 7168 8832 10325 8070 2503 1806 -3360 -2477 47 -762 -5379 2759 4899 4148 3085 4816 3489
14077 3489 7956 6790 6089 6721 6842 12701 15098 7214 -1268 -4298 -3762 3559 4218 208 2932 3659
14061 3659 9670 8049 3912 -2630 -11356 -9729 -3806 825 3285 -1817 3 1193 11165 20105 17082
14046 17082 7043 3059 7066 5265 3181 -1716 7169 5680 -3169 -4273 2097 5392 657 -2464
14032 -2464 712 6696 9958 5713 -2605 768 8872 8833 2568 -3717 3986 6035 970 2880 1304
14017 1304 -2219 3709 7292 1965 -693 9996 5827 -889 -402 961 -1816 3484 1900 -4671 -6197
14002 -6197 169 6384 8420 9368 1391 -7235 -9616 -2620 -3454 -5949 -9610 -13445 -8574 -4218 1417
$$ packed form
14108E470l30n669l926j098L436M614L984n807k262L334L612j339j120N10L759
14093G168J664J493k255n567o97n166Q83K524q09m617Q138K140p51j063J731j327
14077C489M467j166p01O32J21N859K397p884q482l030N36P321O59m010K724P27
14061C659O011j621m137o542q726J627N923M631K460n102J820J190R972Q940l023
14046A7082j0039l984M007j801k084m897Q885j489q849j104O370L295m735l121
14032b464L176N984L262m245q318L373Q104l9o265o285P703K049n065J910j576
14017A304l523N928L583n327k658J0689m169o716M87J363k777N300j584o571j526
14002f197O366O215K036R48p977q626k381O996q34k495l661l835M871M356N635
$$ plain form
13987 1417 -1420 1304 8737 2375 -4528 -3351 321 6957 15563 10640 7256 3502 5497 2694 -2989
13972 -2989 -3270 -2913 -558 3764 2949 -3875 -5523 -7057 -2527 3907 5097 9762 9663 -2 -3612 -1944
13956 -1944 564 2867 -1295 -2898 -1254 -3783 -3456 9406 9111 -7982 -12759 -6787 -2671 -904 6159
13941 6159 8750 4640 9169 3811 1506 3533 7685 8089 8329 8469 4964 1915 -751 3824 10346
13926 10346 6219 -4092 -6615 -5815 -5393 -7330 -8066 -3902 -4681 -5667 576 3739 5683 23 -674 -4083
13910 -4083 -5924 -779 5056 3691 7546 11060 9443 3271 3439 5934 4296 -3966 -4517 2431 1156
13895 1156 -2894 1800 3003 4974 2386 -224 -142 1728 754 -1397 3458 -629 -1406 4083 1700 -6396
13879 -6396 -6197 223 5903 1585 1914 3554 9063 9387 6641 -135 -3508 589 6758 3128 2918 2526
$$ packed form
13987A417k837K724P433o362o903J177L672O636Q606m923l384l754J995k803n683
13972b989k81L57K355M322q15o824j648j534M530O434J190M665r9r665l610J668
13956a944K508K303m162j603J644k529L27J2862k95j7093m777N972M116J767P063
13941F159K591m110M529n358k305K027M152M04K40J40l505l049k666M575O522
13926A0346m127j0311k523Q00M22j937p36M164p79r86O243L163J944n660o97l409
13910d083j841N145N835j365L855L514j617o172J68K495j638q262n51O948j275
13895A156m050M694J203J971k588k610Q2J870r74k151M855m087p77N489k383q096
13879f396J99O420N680m318L29J640N509L24k746o776l373M097O169l630k10l92
$$ plain form
13863 2526 365 2660 756 4870 6275 4956 462 -7487 -12224 -9428 -10424 -14293 -10719 -6388 -757
13848 -757 4066 1855 -5081 -3306 -78 -2335 -7925 -10529 -8605 -10469 -6844 2298 -4677 -6091 -9772
13833 -9772 -12982 -16512 -12960 -7795 -4558 3726 9740 7857 5765 -76 -955 4650 7409 7247 6664
13818 6664 7508 7637 13030 14729 8119 -1887 -3955 674 3390 9674 7790 5837 1962 -2549 -3551
13803 -3551 -4943 1970 3585 4624 933 379 -757 873 3105 2772 918 2112 4023 2791 1159
13788 1159 1680 -1147 -4334 -3387 3003 12880 11962 3996 5527 6034 2547 8319 11908 8260 13152 11978
13772 11978 7095 8409 10859 2757 4031 5704 3316 746 2970 3957 1916 6219 2073 -192 -4117
13757 -4117 -5851 -7050 -7528 -9583 -6761 1857 6243 -2111 -5787 3387 4858 1860 -2846 -321 3906
$$ packed form
13863B526k161K295j904M114J405j319m494p949m737K796r96l869L574M331N631
13848g57M823k211o936J775L228k257n590k604J924j864L625R142o975j414l681
13833i772l210l530L552N165L237Q284O014j883k092n841q79N605K759j62n83
13818F664Q44J29N393J699o610j0006k068M629K716O284j884j953l875m511j002
13803c551j392O913J615J039l691n54j136J630K232l33j854J194J911j232j632
13788A159N21k827l187R47O390R877r18p966J531N07l487N772L589l648M892j174
13772A1978m883J314K450q102J274J673k388k570K224R87k041M303m146k265l925
13757d117j734j199m78k055K822Q618M386q354l676R174J471k998m706K525M227
$$ plain form
13742 3906 5802 10540 8071 5825 2681 5967 5992 8415 3645 1855 4661 3902 3839 6104 7279 5249
13726 5249 1246 3180 6887 8706 13173 14162 13855 5817 6020 12499 14625 11072 8086 9138 16985
13711 16985 19370 22230 32125 36004 35866 33981 37383 48347 51190 48451 52582 55901 56866 55132 52154
13696 52154 51806 54157 54136 51199 37652 34766 39628 42883 37358 33325 28928 21294 23593 37065 37182
13681 37182 28585 23165 15628 7426 3573 7265 8367 14514 16418 17527 14906 11111 11741 14271 14494
13666 14494 14154 17728 26168 28899 26156 23870 35837 51763 69029 78350 81434 87160 88112 91713
13652 91713 98590 98617 99376 104389 103022 90287 83222 70687 64552 63550 60535 59064 50263 38140
13638 38140 30159 26233 27743 24534 20803 15439 17903 27882 28472 28575 30552 32407 35169 36521 38235
$$ packed form
13742C906J896M738k469k246l144L286K5K423m770j790K806p59o3K265J175k030
13726E249m003J934L707J819M467R89l07q038K03O479K126l553k986J052P847
13711A6985K385K860R895L879j38j885L402J0964K843k739M131L319R65j734k978
13696E2154l48K351k1k937j3547k886M862L255n525m033m397p634K299J3472J17
13681C7182q597n420p537q202l853L692J102O147J904J109k621l795O30K530K23
13666A4494l40L574Q440K731k743k286J1967J5926J7266R321L084N726R52L601
13652I1713O877K7P59N013j367j2735p065j2535o135j002l015j471q801j2123
13638C8140p981l926J510l209l731n364K464R979N90J03J977J855K762J352J714
$$ plain form
13623 38235 39658 42268 45385 47965 51441 57694 71079 77802 76344 79772 85855 86234 79747 82502
13609 82502 82677 74795 66344 62178 56892 51207 45351 38203 33281 23751 16758 12132 15278 23061 22808
13594 22808 19072 20749 22431 21183 19854 23955 23339 21691 17563 9882 9169 15880 13560 13064 19541
13579 19541 23026 19451 19174 20544 14754 5450 6764 13644 12296 7251 515 -4033 -906 7803 12309
13564 12309 11476 12346 10377 8427 5535 7861 7050 4862 5185 8772 12254 9972 6919 8397 3914
13549 3914 10343 18456 16122 10886 12643 21686 17311 16430 22082 16314 12767 14782 18684 21968 14272
13534 14272 7242 7196 9351 9832 10483 14249 13341 11847 9056 9296 11582 12152 11519 9705 8054 8439 8871
13517 8871 11487 13127 11023 14290 16618 13012 11364 7804 11399 17953 16682 15595 16445 22678 15234
$$ packed form
13623C8235J423K610L117K580L476O253J3385O723j458L428O083L79o487K755
13609H2502J75p882q451m166n286n685n856p148m922r530o993m626L146P783k53
13594B2808l736J677J682j248j329M101o16j648m128p681p13O711k320m96O477
13579A9541L485l575k77J370n790r304J314O880j348n045o736m548L127Q709M506
13564A2309q33Q70j969j950k892K326q11k188L23L587L482k282l053J478m483
13549C914O429Q113k334n236J757R043m375q81N652n768l547K015L902L284p696
13534A4272p030m6K155M81O51L766r08j494k791K40K286N70o33j814j651L85M32
13517H871K616J640k104L267K328l606j648l560L595O554j271j087Q50O233p444
$$ plain form
13502 15234 11725 12160 12755 18250 16838 8149 1112 196 -1416 548 4060 3289 4150 4390 6358 8923
13486 8923 8439 6799 2425 4319 10297 17913 17923 15798 9945 10613 3068 -1094 3812 1878 157 -374
13470 -374 1250 7523 12293 10407 3773 9534 12818 11404 7777 3661 782 750 6597 8120 5580
13455 5580 6954 5551 388 3382 2521 6254 8682 8860 9514 13926 19713 14955 9883 6737 3946
13440 3946 9316 6217 3490 3841 3469 4600 6942 6272 2039 -976 1402 8985 6146 1149 4480
13425 4480 14051 14527 13429 15662 15466 14152 14382 11222 11909 5594 3798 6014 10885 13979 11205 13245
13409 13245 15714 16581 10624 10346 15714 13530 11396 9424 12265 14938 14399 11883 13930 14535 15562
13394 15562 13947 7974 9343 5577 2225 9183 10137 10738 12486 13703 17184 17869 23816 26685 21736
$$ packed form
13502A5234l509M35N95N495j412q689p037r16j612J964L512p71Q61K40J968K565
13486H923m84j640m374J894N978P616J0k125n853O68p545m162M906j934j721n31
13470c74J624O273M770j886o634N761L284j414l627m116k879l2N847J523k540
13455E580J374j403n163K994q61L733K428J78O54M412N787m758n072l146k791
13440C946N370l099k727L51l72J131K342o70m233l015K378P583k839m997L331
13425D480R571M76j098K233j96j314K30l160O87o315j796K216M871L094k774K040
13409A3245K469Q67n957k78N368k184k134j972K841K673n39k516K047O05J027
13394A5562j615n973J369l766l352O958R54O01J748J217L481O85N947K869m949
$$ plain form
13379 21736 23018 18868 13149 15117 18180 17218 10809 9120 11148 11195 15622 16013 16044 9484 7579 10759
13363 10759 12148 10040 10215 11186 11267 6706 6118 10000 17991 22208 20647 18794 18544 18228 11499 8769
13347 8769 7609 5111 6868 10925 15307 18716 21261 20558 17650 14957 13667 12034 13108 14255 15799
13332 15799 14671 14202 13522 11097 12140 9591 4272 9470 10699 13205 17328 20696 23041 22376 22717
13317 22717 26343 22235 19965 20817 21230 20360 18603 20243 21025 15818 14140 17634 18836 14169 13520 16581
13301 16581 13989 12426 15665 15229 10027 12670 14157 14969 18783 16816 20474 16610 9435 11510 14401
13286 14401 17738 16825 16852 12758 9326 13279 13687 12452 15879 20325 24458 21489 16870 15813 18877
13271 18877 20446 20561 25181 30668 30092 32509 35058 32840 30666 38255 43626 38484 38395 35459 28964
$$ packed form
13379B1736J282m150n719J968L063r62o409j689K028M7M427L91L1o560j905L180
13363A0759J389k108J75R71Q1m561n88L882P991M217j561j853k50l16o729k730
13347H769j160k498J757M057M382L409K545p03k908k693j290j633J074J147J544
13332A5799j128m69o80k425J043k549n319N198J229K506M123L368K345o65L41
13317B2717L626m108k270Q52M13q70j757J640P82n207j678L494J202m667o49L061
13301A6581k592j563L239m36n202K643J487Q12L814j967L658l864p175K075K891
13286A4401L337r13K7m094l432L953M08j235L427M446M133k969m619j057L064
13271A8877J569J15M620N487n76K417K549k218k174P589N371n142q9k936o495
$$ plain form
13256 28964 27833 25945 21124 17988 18630 15837 16453 17827 16555 17226 21092 22590 22625 21773 28191 23671
13240 23671 21045 22089 24756 25656 26647 25444 18719 17190 18574 24766 29872 27642 25195 23727 20352
13225 20352 23189 30093 41159 49457 53005 46780 48233 50228 44226 38122 36109 37174 32925 31734
13211 31734 35593 37024 33693 30721 32029 31359 28149 25565 23823 21279 18931 19647 20530 23393 24725
13196 24725 25738 22315 20157 21880 19631 16317 14635 18015 15911 17393 20053 21931 19132 14042
13182 14042 14155 10301 12273 14464 18397 20128 27173 35638 34305 27114 19241 16338 18564 14922 14243
13167 14243 23574 25741 29316 32960 26495 28084 31535 31068 36943 33562 32287 39309 40791 37550 36328
13152 36328 45235 51994 57058 62478 71322 80808 90486 101223 111187 128955 150095 172936 208333
$$ packed form
13256B8964j131j888m821l136O42k793O16J374j272O71L866J498L5q52O418m520
13240B3671k626J044K667R00R91j203o725j529J384O192N106k230k447j468l375
13225B0352K837O904J1066Q298L548o225J453J995o002o104k013J065m249j191
13211C1734L859J431l331k972J308o70l210k584j742k544k348P16Q83K863J332
13196B4725J013l423k158J723k249l314j682L380k104J482K660J878k799n090
13182A4042J13l854J972K191L933J731P045Q465j333p191p873k903K226l642o79
13167A4243R331K167L575L644o465J589L451m67N875l381j275P022J482l241j222
13152C6328Q907O759N064N420Q844R486R678J0737R964J7768K1140K2841L5397
$$ plain form
13139 208333 256333 317372 390484 487432 598391 699564 787276 862515 906394 912206 881211
13128 881211 808434 710229 605744 503187 407999 326941 263517 218173 186396 164337 146681
13117 146681 129765 114165 109449 102226 92988 90420 86334 84765 87479 85412 77149 71749 75037 70603
13103 70603 69403 65694 57858 54087 60376 61799 57915 62471 58298 47041 46735 44842 46092 41587
13089 41587 35227 36551 38361 33982 29479 30308 31249 38681 43025 48150 47832 44525 42382 45104 47033
13074 47033 47988 52630 50981 52001 47927 45794 47420 49233 50107 48225 43505 46937 47965 41814 43117
13059 43117 47795 52768 55909 55999 47331 39242 41054 46343 52027 60138 69772 79373 82327 90085 103239
13044 103239 126366 151335 178664 200737 220239 225386 226393 225547 208708 186661 161134 132470
$$ packed form
13139B08333M8000O1039P3112R6948J10959J01173Q7712P5239M3879N812l0995
13128H81211p2777r8205j04485j02557r5188q1058o3424m5344l1777k2059j7656
13117A46681j6916j5600m716p223r238k568m086j569K714k067q263n400L288m434
13103G0603j200l709p836l771O289J423l884M556m173j1257l06j893J250m505
13089D1587o360J324J810m379m503Q29R41P432M344N125l18l307k143K722J929
13074D7033R55M642j649J020m074k133J626J813Q74j882m720L432J028o151J303
13059D3117M678M973L141R0q668q089J812N289N684Q111R634R601K954P758J3154
13044A03239K3127K4969K7329K2073J9502N147J007q46j6839k2047k5527k8664
$$ plain form
13032 132470 107807 92537 83036 71238 66799 62986 53768 52470 51903 44943 38799 35469 36030 34504
13018 34504 44683 49772 45872 47922 47790 42835 42911 45677 46895 53796 54088 60446 68134 70510 71969
13003 71969 72957 70868 62815 57523 54765 47000 46559 47037 50143 48751 45950 50975 56355 51958 46714
12988 46714 48421 52526 50184 46986 43630 36970 37695 42319 51375 55857 61315 62385 66160 72742 72177
12973 72177 67631 68993 70945 76950 94015 105888 111712 118722 132719 146730 166214 186284 198989
12960 198989 208004 219246 226772 220638 198471 179877 166966 153929 138399 120207 106739 100719
12948 100719 92706 91009 96732 101627 102909 101009 103958 112766 124674 134741 148762 165590 170047
12935 170047 166831 175389 185168 188150 191017 189921 185134 177917 166338 153098 145141 138800 122847
$$ packed form
13032A32470k4663j5270r501j1798m439l813r218j298n67o960o144l330N61j526
13018C4504J0179N089l900K050j32m955P6K766J218O901K92O358P688K376J459
13003G1969R88k089q053n292k758p765m41M78L106j392k801N025N380m397n244
12988D6714J707M105k342l198l356o660P25M624R056M482N458J070L775O582n65
12973G2177m546J362J952O005J7065J1873N824P010J3997J4011J9484K0070J2705
12960A98989R015J1242P526o134k2167j8594j2911j3037j5530j8192j3468o020
12948A00719q013j697N723M895J282j900K949Q808J1908J0067J4021J6828M457
12935A70047l216Q558R779K982K867j096m787p217j1579j3240p957o341j5953
$$ plain form
12922 122847 113898 110499 98700 89926 85523 75621 72694 73664 79325 87065 90603 94926 94896 100686 107358
12907 107358 107529 106644 101104 96577 90090 84135 80360 77592 76773 74575 75437 78605 84699 88357 97078
12892 97078 113828 125607 135133 138760 139705 134202 129410 127065 130466 128167 120944 118610 114458 107037
12878 107037 96895 96914 89961 80902 81495 86941 93324 97932 99894 98766 103579 103882 104518 106721 99405
12863 99405 93571 91430 90852 99832 108379 109615 108152 113155 117715 111092 108121 113940 124834 130483
12849 130483 130669 132240 147147 160530 164841 172908 178852 183119 182637 183623 186780 184760 192091 202154
12835 202154 222406 244381 261912 280689 293541 301268 306280 304011 304972 303626 301210 281796 267249
12822 267249 264054 256490 248369 237224 228186 230711 231805 235561 238064 238227 238156 238264 238952 241660 247211
$$ packed form
12922A22847q949l399j1799q774m403r902k927R70N661P740L538M323l0N790O672
12907A07358J71q85n540m527o487n955l775k768q19k198Q62L168O094L658Q721
12892I7078J6750J1779R526L627R45n503m792k345L401k299p223k334m152p421
12878A07037j0142J9o953r059N93N446O383M608J962j128M813L03O36K203p316
12863I9405n834k141n78Q980Q547J236j463N003M560o623k971N819J0894N649
12849A30483J86J571J4907J3383M311Q067N944M267m82R86L157k020P331J0063
12835B02154K0252K1975J7531J8777J2852P727N012k269R61j346k416j9414j4547
12822B67249l195p564q121j1145r038K525J094L756K503J63p1J08O88K708N551
$$ plain form
12807 247211 241496 242492 252105 250494 252037 254447 257405 259331 270358 279767 277487 275085 281502 291666
12793 291666 301512 305868 316304 328210 336558 343686 347898 349541 350839 353059 361591 369669 374643 377887
12779 377887 381683 390802 401743 417671 435206 448189 462412 470232 476672 487930 494708 491377 498313
12766 498313 517815 528629 546868 572523 601795 633686 669554 710319 750607 788075 813854
12755 813854 840567 860760 877431 898381 919431 944634 975588 1015852 1062815 1119145 1179442
12744 1179442 1242451 1303726 1365325 1440822 1534976 1647358 1796364 1979870 2206604 2473054
12734 2473054 2773674 3105682 3461128 3836642 4226844 4640706 5076672 5561495 6100993
12725 6100993 6709734 7406524 8219207 9146230 10206954 11444439 12938245 14800652 17245231
$$ packed form
12807B47211n715R96R613j611J543K410K958J926J1027R409k280k402O417J0164
12793B91666R846M356J0436J1906Q348P128M212J643J298K220Q532Q078M974L244
12779C77887L796R119J0941J5928J7535J2983J4223P820O440J1258O778l331O936
12766D98313J9502J0814J8239K5655K9272L1891L5868M0765M0288L7468K5779
12755H13854K6713K0193J6671K0950K1050K5203L0954M0264M6963N6330O0297
12744A179442O3009O1275O1599P5497R4154J12382J49006J83506K26734K66450
12734B473054L00620L32008L55446L75514L90202M13862M35966M84823N39498
12725F100993O08741O96790Q12683R27023J060724J237485J493806J862407K444579
$$ plain form
12716 17245231 20644248 25514414 32562673 42465641 55618565 71967995 90866594 110997437
12708 110997437 130361026 146819049 158459133 163705953 161880134 153223818 139028988
12701 139028988 121168547 101750037 82599607 65382246 51239330 40467158 32632004
12694 32632004 26962857 22773026 19594505 17100066 15072229 13394061 11960870 10736945
12686 10736945 9677945 8774295 8007661 7355256 6800428 6318149 5902444 5537941 5200527
12677 5200527 4893939 4618872 4361513 4120048 3889489 3678965 3471810 3276164 3088185
12668 3088185 2915836 2767657 2631979 2504038 2390560 2290872 2197773 2110391 2018827 1940185
12658 1940185 1866936 1789665 1716762 1641115 1575416 1514084 1455094 1400564 1349383 1298329 1246512
$$ packed form
12716A7245231L399017M870166P048259R902968J3152924J6349430J8898599K0130843
12708A10997437J9363589J6458023J1640084N246820j825819q656316j4194830
12701A39028988j7860441j9418510j9150430j7217361j4142916j0772172p835154
12694C2632004n669147m189831l178521k494439k027837j678168j433191j223925
12686A0736945j059000r03650p66634o52405n54828m82279m15705l64503l37414
12677E200527l06588k75067k57359k41465k30559k10524k07155j95646j87979
12668C088185j72349j48179j35678j27941j13478r9688r3099q7382r1564p8642
12658A940185p3249p7271p2903p5647o5699o1332n8990n4530n1181n1054n1817
$$ plain form
12647 1246512 1191276 1150675 1110101 1069232 1025377 983458 933229 890657 854318 821959 802873
12636 802873 785928 764261 738578 710982 693029 674029 648590 627345 603534 584991 569149
12625 569149 558284 536720 517116 504587 495926 484314 475901 470001 466134 461381 458273 450587 437966
12612 437966 427006 421299 403788 384575 364779 354459 344468 332626 321674 312860 306705 303765
12600 303765 299947 299905 296737 294515 289672 284039 278480 278747 274715 278015 280584 281149 281884 285544 294188
12585 294188 302679 306820 315450 326899 344022 358332 381042 397190 408622 415547 414626 402126 382377
12572 382377 351681 325616 300252 276425 258202 237800 218115 205742 193953 186665 184746 181611
12560 181611 185421 192911 201077 212434 224167 241678 263481 288245 317591 342046 361914 378753
$$ packed form
12647A246512n5236m0601m0574m0869m3855m1919n0229m2572l6339l2359j9086
12636H02873j6945k1667k5683k7596j7953j9000k5439k1245k3811j8543j5842
12625E69149j0865k1564j9604j2529q661j1612q413n900l867m753l108p686j2621
12612D37966j0960n707j7511j9213j9796j0320r991j1842j0952q814o155k940
12600C03765l818m2l168k222m843n633n559K67m032L300K569N65P35L660Q644
12585B94188Q491M141Q630J1449J7123J4310K2710J6148J1432O925r21j2500j9749
12572C82377l0696k6065k5364k3827j8223k0402j9685j2373j1789p288j919l135
12560A81611L810P490Q166J1357J1733J7511K1803K4764K9346K4455J9868J6839
$$ plain form
12548 378753 385568 374274 353929 329857 308135 283414 255668 240132 223245 202717 188231 175213
12536 175213 166252 160652 146687 136382 127279 123155 114862 108411 99892 90479 74821 59411 54360
12523 54360 49122 52135 56986 60237 66663 66917 66379 69669 77330 88684 96025 93360 85535 88878 90528
12508 90528 96659 92177 83909 72820 71145 64764 58972 58072 55671 58795 65225 68007 69494 72606
12494 72606 71507 76804 75840 77182 79234 71570 65831 64586 64033 63725 63062 65374 66707 70607 72028
12479 72028 69387 69265 69932 61495 58014 57085 56571 56624 55100 53788 57332 59110 53533 47827 45314 40956
12463 40956 34640 37868 45648 56083 59577 53129 55860 62977 63633 62330 63604 67096 66810 62341 55746
12448 55746 52621 54410 59247 56784 56691 56363 58924 51534 47235 41451 42582 42078 40926 45147 48748
$$ packed form
12548C78753O815j1294k0345k4072k1722k4721k7746j5536j6887k0528j4486j3018
12536A75213q961n600j3965j0305r103m124q293o451q519r413j5658j5410n051
12523E4360n238L013M851L251O426K54n38L290P661J1354P341k665p825L343J650
12508I0528O131m482q268j1089j675o381n792r00k401L124O430K782J487L112
12494G2606j099N297r64J342K052p664n739j245n53l08o63K312J333L900J421
12479G2028k641j22O67q437l481r29n14N3j524j312L544J778n577n706k513m358
12463D0956o316L228P780J0435L494o448K731P117O56j303J274L492k86m469o595
12448E5746l125J789M837k463r3l28K561p390m299n784J131n04j152M221L601
$$ plain form
12433 48748 49422 50735 60706 59281 55782 49188 43575 43510 45303 41348 38499 38023 36727 37326 37735 38710
12417 38710 44245 47367 43633 41898 44485 45276 46291 42546 39169 43446 40494 36423 38315 36822 38282
12402 38282 37601 36232 32290 27054 26775 27647 27206 23504 27869 27148 27203 35437 34135 36180 41966 48140
12386 48140 41401 32722 34992 42724 52855 50373 46730 45892 47619 48220 45539 45664 43606 49229 54659
12371 54659 48376 47248 47552 52183 51031 49891 52924 50543 47146 46230 47773 47659 48185 50611 57968
12356 57968 56816 55962 59497 63721 66535 76201 88957 98688 118709 142639 157726 165343 170610 162012
12342 162012 154415 142009 132658 129527 132072 130456 128419 125803 127694 123607 126220 135250 135362 139435
12328 139435 143991 149830 153216 153952 154022 152744 149738 150355 147113 146820 147984 150288 153750 163044 177528
$$ packed form
12433D8748O74J313R971j425l499o594n613o5J793l955k849m76j296N99M09R75
12417C8710N535L122l734j735K587P91J015l745l377M277k952m071J892j493J460
12402C8282o81j369l942n236k79Q72m41l702M365p21N5Q234j302K045N786O174
12386D8140o739q679K270P732J0131k482l643q38J727O01k681J25k058N623N430
12371E4659o283j128L04M631j152j140L033k381l397r16J543j14N26K426P357
12356E7968j152q54L535M224K814R666J2756R731K0021K3930J5087P617N267q598
12342A62012p597j2406r351l131K545j616k037k616J891m087K613R030J12M073
12328A39435M556N839L386P36P0j278l006O17l242k93J164K304L462R294J4484
$$ plain form
12313 177528 200934 234312 275389 305383 329079 346966 343488 322145 305540 280839 246237 210726
12301 210726 192550 178714 169130 166483 165877 168485 175146 186802 194204 192497 192535 197529 198616 204214
12287 204214 213778 220480 222622 231681 254354 285381 322904 385163 476245 575920 684551 799931
12275 799931 905619 986523 1031324 1038093 998318 925183 822784 701165 578611 473500 385537
12264 385537 310417 260648 228578 206517 189327 173197 157577 139808 131089 131489 127436 126345
12252 126345 124658 114815 107213 97938 90169 89689 88763 83769 79417 77791 75754 76866 78655 72900 70384
12237 70384 66937 64572 60791 63931 63953 65692 69685 72483 76430 73473 69274 64304 65032 66625 67495
12222 67495 63515 61906 63704 57934 48974 50762 58165 54175 50987 42406 36505 39315 45272 50395
$$ packed form
12313A77528K3406L3378M1077K9994K3696J7887l478k1343j6605k4701l4602l5511
12301B10726j8176j3836r584k647o06K608O661J1656P402j707L8M994J087N598
12287B04214R564O702K142R059K2673L1027L7523O2259R1082R9675J08631J15380
12275G99931J05688Q0904M4801O769l9775p3135j02399j21619j22554j05111q7963
12264C85537p5120m9769l2070k2061j7190j6130j5620j7769q719M00m053j091
12252A26345j687r843p602r275p769m80r26m994m352j626k037J112J789n755k516
12237G0384l447k365l781L140K2J739L993K798L947k957m199m970P28J593Q70
12222F7495l980j609J798n770q960J788P403l990l188q581n901K810N957N123
$$ plain form
12208 50395 62041 65733 60138 57130 59874 55451 51038 43514 47960 53509 52266 51186 52658 55037
12194 55037 57154 56850 50508 51502 48182 40049 38162 40193 44505 45808 47722 51833 51930 46405 41663
12179 41663 41776 41540 39893 43509 51935 54636 48946 45679 41203 37094 34074 35653 34156 31658 32812
12164 32812 36637 30898 23976 26773 33467 35226 38255 42493 45006 39041 33409 33920 36732 37472 39332
12149 39332 38022 36651 36028 34325 31829 30115 30317 37490 43769 39203 40636 42380 44480 46801 37181
12134 37181 33466 40417 44878 41089 38145 36297 39476 46241 45555 39416 40734 43365 47142 45269 38764
12119 38764 39298 42541 40061 40611 41685 42039 43137 44228 44383 40604 37645 38674 41399 37776 43992
12104 43992 42839 43525 42053 39666 42067 37399 31327 31118 32674 36349 34353 31699 32117 35756 40926
$$ packed form
12208E0395J1646L692n595l008K744m423m413p524M446N549j243j080J472K379
12194E5037K117l04o342R94l320q133j887K031M312J303J914M111R7n525m742
12179D1663J13k36j647L616Q426K701n690l267m476m109l020J579j497k498J154
12164C2812L825n739o922K797O694J759L029M238K513n965n632N11K812P40J860
12149C9332j310j371o23j703k496j714K02P173O279m566J433J744K100K321r620
12134C7181l715O951M461l789k944j848L179O765o86o139J318K631L777j873o505
12119C8764N34L243k480N50J074L54J098J091J55l779k959J029K725l623O216
12104D3992j153O86j472k387K401m668o072k09J556L675j996k654M18L639N170
$$ plain form
12089 40926 40216 39677 39754 41367 38186 37494 37016 39528 39208 38071 42059 40094 36730 37527 37385 33562 37814
12072 37814 44002 44552 45701 40693 37108 38734 31950 30597 37911 41314 39140 35629 33833 33762 37331
12057 37331 42650 44266 42533 41128 37583 34350 35452 37860 38570 40305 42900 41569 37118 36130 43062
12042 43062 45684 42812 41505 43319 39570 36078 33872 38195 44447 43004 40219 45122 46851 46837 44701
12027 44701 49239 51477 51139 54660 56101 55501 51917 48378 46383 42927 43099 55621 54561 50447 51006
12012 51006 52367 51629 51080 49633 45305 41160 40137 40195 39595 44419 47405 52503 47875 43222 42179 38876
11996 38876 41675 40596 41769 46688 45476 42122 51727 54485 56673 53268 48420 51022 55661 56557 55095
11981 55095 55678 55376 55312 52917 47652 43889 43960 48865 46890 45048 53558 52868 51131 55958 53186 46467
$$ packed form
12089D0926p10n39P7J613l181o92m78K512l20j137L988j965l364P97j42l823M252
12072C7814O188N50J149n008l585J626o784j353P314L403k174l511j796p1L569
12057C7331N319J616j733j405l545l233J102K408P10J735K595j331m451r88O932
12042D3062K622k872j307J814l749l492k206M323O252j443k785M903J729j4k136
12027D4701M538K238l38L521J441o00l584l539j995l456J72J2522j060m114N59
12012E1006J361p38n49j447m328m145j023N8o00M824K986N098m628m653j043l303
11996C8876K799j079J173M919j212l354R605K758K188l405m848K602M639Q96j462
11981E5095N83l02o4k395n265l763P1M905j975j842Q510o90j737M827k772o719
$$ plain form
11965 46467 42696 44163 46485 47748 46813 50502 51358 47997 50177 52099 53555 56876 60278 63514 56710
11950 56710 50831 49008 47779 57782 62345 62153 60991 66637 67431 67142 65698 60220 63328 72974 75382
11935 75382 69202 57343 47637 51435 49209 48001 47497 48455 49363 50456 51081 57489 57989 57925 59710 62825
11919 62825 63361 65914 70961 67307 66798 65657 66491 66621 66445 66632 72371 72159 70339 66537 69775 69163
11903 69163 71060 72415 72278 73246 68307 62690 66686 65607 63916 67584 68885 64834 68126 73517 76059
11888 76059 79731 83608 78230 76287 72635 66982 60772 59168 61401 63277 60211 60711 67039 71771 74721
11873 74721 78550 72004 67927 70171 72214 74298 73509 73595 81461 83591 83107 87799 90818 87420 84244
11858 84244 80578 79098 76707 77317 81243 79104 71680 64064 61735 67265 75556 73419 71522 74583 68091
$$ packed form
11965D6467l771J467K322J263r35L689Q56l361K180J922J456L321L402L236o804
11950E6710n879j823j229J0003M563j92j162N646P94k89j444n478L108R646K408
11935G5382o180j1859r706L798k226j208n04R58R08J093O25O408N00o4J785L115
11919F2825N36K553N047l654n09j141Q34J30j76J87N739k12j820l802L238o12
11903F9163J897J355j37R68m939n617L996j079j691L668J301m051L292N391K542
11888G6059L672L877n378j943l652n653o210j604K233J876l066N00O328M732K950
11873G4721L829o546m077K244K043K084p89Q6P866K130m84M692L019l398l176
11858H4244l666j480k391O10L926k139p424p616k329N530Q291k137j897L061o492
$$ plain form
11843 68091 70126 76182 72366 66430 64151 69827 76496 80168 84332 87553 83690 77172 72272 73011 72935
11828 72935 72542 76295 76892 77529 73524 74975 72369 73096 77772 78685 75037 73935 74779 76177 77488 83951
11812 83951 81006 72312 70471 75795 77303 76347 77442 75879 72730 71602 77467 77115 74077 74556 78035
11797 78035 79308 79716 78899 83423 77001 74497 86186 86997 87844 91170 96876 101596 107980 107630 106003
11782 106003 97791 96915 93244 89623 87011 84680 89410 89137 86853 85423 89205 89868 88237 83366 82359
11767 82359 87878 87114 87920 89224 94787 101998 100365 101436 108080 108005 112160 118861 119336 117967 119542 114943
11751 114943 108258 105720 100156 95258 90589 83666 83722 90519 86791 82463 81888 84889 87141 86267 81585
11736 81585 80792 82607 92044 95798 96085 97993 107208 119287 129535 135964 141978 149664 155099 154885 154333
$$ packed form
11843F8091K035O056l816n936k279N676O669L672M164L221l863o518m900P39p6
11828G2935l93L753N97O37m005J451k606P27M676R13l648j102Q44J398J311O463
11812H3951k945q694j841N324J508r56J095j563l149j128N865l52l038M79L479
11797G8035J273M08q17M524o422k504J1689Q11Q47L326N706M720O384l50j627
11782A06003q212q76l671l621k612k331M730k73k284j430L782O63j631m871j007
11767H2359N519p64Q06J304N563P211j633J071O644p5M155O701M75j369J575m599
11751A14943o685k538n564m898m669o923N6O797l728m328n75L001K252q74m682
11736H1585p93J815R437L754K87J908R215J2079J0248O429O014P686N435k14n52
$$ plain form
11721 154333 153541 157623 156044 159156 168969 176025 188694 207540 226856 242072 274105 317637 359631
11708 359631 396330 422722 441028 445531 444293 436109 415399 395707 367555 340547 316271 296536
11696 296536 277739 262326 255889 260227 254430 249031 261161 269086 277003 296333 320056 343453 375205
11683 375205 409558 449302 496661 543347 581805 617740 654714 678967 688120 692543 688424 665409
11671 665409 643753 618251 581586 545020 503282 465994 436677 402686 367524 345110 327049
11660 327049 310238 298745 286530 285234 293309 300225 310236 320425 340910 363376 386233 416581
11648 416581 452274 483376 506495 516088 518257 514597 509378 491897 459222 423303 392079 361871
11636 361871 330240 299259 272814 250546 227304 211451 203481 205542 206572 200326 196532 189686 180707
$$ packed form
11721A54333p92M082j579L112R813P056J2669J8846J9316J5216L2033M3532M1994
11708C59631L6699K6392J8306M503j238q184k0710j9692k8152k7008k4276j9735
11696B96536j8797j5413o437M338n797n399J2130P925P917J9330K3723K3397L1752
11683C75205L4353L9744M7359M6686L8458L5935L6974K4253R153M423m119k3015
11671F65409k1656k5502l6665l6566m1738l7288k9317l3991l5162k2414j8061
11660C27049j6811j1493j2215j296Q075O916J0011J0189K0485K2466K2857L0348
11648D16581L5693L1102K3119R593K169l660n219j7481l2675l5919l1224l0208
11636C61871l1631l0981k6445k2268k3242j5853p970K061J030o246l794o846q979
$$ plain form
11623 180707 177572 176928 179828 179867 175617 172207 166034 165098 160243 161589 166169 162411 158183 161808 158537
11608 158537 154670 156734 158449 159549 158105 158812 160834 158139 156623 153895 148092 143630 147410 153532
11594 153532 149415 151087 156368 151704 152859 154501 150631 149482 152100 154730 151271 154234 153765 145862
11580 145862 140964 144313 141553 149165 148958 143608 143911 141598 143338 144683 146826 155065 162323 160730 154776
11565 154776 153667 161533 158550 158613 160376 159744 159187 160464 164002 166406 168777 169970 165040 156075 149699
11550 149699 153282 162417 170745 178870 177638 169372 173706 178466 183786 197446 203948 210118 221661 222024
11536 222024 224604 231211 230971 225505 221994 217187 217060 213675 202627 202759 204773 206626 210804 210615 207605
11521 207605 204241 207187 210899 213422 214435 219421 222315 227616 232528 239091 251648 263877 271773 282345
$$ packed form
11623A80707l135o44K900L9m250l410o173r36m855J346M580l758m228L625l271
11608A58537l867K064J715J100j444P07K022k695j516k728n803m462L780O122
11594A53532m117J672N281m664J155J642l870j149K618K630l459K963m69p903
11580A45862m898L349k760P612k07n350L03k313J740J345K143Q239P258j593n954
11565A54776j109P866k983O3J763o32n57J277L538K404K371J193m930q965o376
11550A49699L583R135Q328Q125j232q266M334M760N320J3660O502O170J1543L63
11536B22024K580O607k40n466l511m807j27l385j1048J32K014J853M178j89l010
11521B07605l364K946L712K523J013M986K894N301M912O563J2557J2229P896J0572
$$ plain form
11507 282345 290615 303969 313609 314514 312326 300124 288095 289124 278918 271865 271199 263185 254699 252486
11493 252486 250254 244312 240534 241901 244284 238568 232897 243627 248497 244808 247564 249442 246785 252874
11479 252874 260534 269009 280329 279342 281832 286556 292914 292540 285039 277076 271610 271237 274392 273030 268099
11464 268099 264563 264404 263493 254512 252608 255875 256912 252324 248748 242929 238841 236980 241714 239749 235520
11449 235520 238185 237474 236669 238495 240791 247211 249299 244455 249092 259785 262674 271863 279492 284209
11435 284209 286532 287615 291904 301765 305012 305204 309028 311262 308781 307326 310797 315395 321675 327014
11421 327014 324350 326497 329904 334916 329025 324737 324267 332283 342030 352732 366471 377141 392978
11408 392978 409902 427564 437099 440751 446792 450240 452535 448529 446963 440521 437746 429496 430312 426377
$$ packed form
11507B82345Q270J3354R640R05k188j2202j2029J029j0206p053o66q014q486k213
11493B52486k232n942l778J367K383n716n671J0730M870l689K756J878k657O089
11479B52874P660Q475J1320r87K490M724O358l74p501p963n466l73L155j362m931
11464B68099l536j59r11q981j904L267J037m588l576n819m088j861M734j965m229
11449B35520K665p11q05J826K296O420K088m844M637J0693K889R189P629M717
11435B84209K323J083M289R861L247J92L824K234k481j455L471M598O280N339
11421C27014k664K147L407N012n891m288m70Q016R747J0702J3739J0670J5837
11408C92978J6924J7662R535L652O041L448K295m006j566o442k775q250Q16l935
$$ plain form
11394 426377 429747 429748 442655 458786 464948 480892 492573 493479 496959 515947 541038 557482 574991
11381 574991 592080 608926 626676 643841 656625 669880 681351 689686 688016 685915 685494 682361 680040
11368 680040 687415 692733 691959 694270 708088 721810 729542 743074 755530 769225 782743 798029 817199
11355 817199 839953 859513 876565 896647 918488 933789 948526 964220 982545 999689 1013257
11344 1013257 1029828 1043585 1049587 1056137 1069462 1090663 1108344 1134576 1157248 1180696 1206657 1221997
11332 1221997 1243094 1266750 1300009 1323855 1345677 1375815 1406837 1447298 1494744 1552509 1617659
11321 1617659 1671543 1723068 1778826 1843642 1908100 1963924 2016878 2073823 2132099 2206614 2301229
11310 2301229 2407745 2533350 2676128 2840866 3037434 3253075 3504304 3790329 4124220
$$ packed form
11394D26377L370JJ2907J6131O162J5944J1681R06L480J8988K5091J6444J7509
11381E74991J7089J6846J7750J7165J2784J3255J1471Q335j670k101m21l133k321
11368F80040P375N318p74K311J3818J3722P732J3532J2456J3695J3518J5286J9170
11355H17199K2754J9560J7052K0082K1841J5301J4737J5694J8325J7144J3568
11344A013257J6571J3757O002O550J3325K1201J7681K6232K2672K3448K5961J5340
11332A221997K1097K3656L3259K3846K1822L0138L1022M0461M7446N7765O5150
11321A617659N3884N1525N5758O4816O4458N5824N2954N6945N8276P4515R4615
11310B301229J06516J25605J42778J64738J96568K15641K51229K86025L33891
$$ plain form
11301 4124220 4512664 4961331 5492797 6127643 6885823 7800943 8909797 10280219 11984702
11292 11984702 14097353 16733372 20023480 24112722 29131961 35124556 41965033 49256947
11284 49256947 56323106 62352814 66634927 68629389 68059057 64996285 60009100 53974341
11276 53974341 47762476 41990216 36993269 32900596 29729193 27418256 25881063 25042271
11268 25042271 24841728 25259885 26276645 27923807 30254526 33344563 37282309 42165640
11260 42165640 48107707 55184213 63405860 72679028 82688094 92888175 102540878 110802640
11252 110802640 116834810 119950705 119768473 116344255 110144269 101910330 92507433 82783359
11244 82783359 73424069 64851696 57266663 50715273 45170590 40594731 36910064 34035771
$$ packed form
11301D124220L88444M48667N31466O34846P58180R15120J108854J370422J704483
11292A1984702K112651K636019L290108M089242N019239N992595O840477P291914
11284D9256947P066159O029708M282113J994462n70332l062772m987185o034759
11276E3974341o211865n772260m996947m092673l171403k310937j537193q38792
11268B5042271k00543M18157J016760J647162K330719L090037L937746M883331
11260D2165640N942067P076506Q221647R273168J0009066J0200081R652703Q261762
11252A10802640O032170L115895j82232l424218o199986q233939r402897r724074
11244H2783359r359290q572373p585033o551390n544683m575859l684667k874293
$$ plain form
11236 34035771 31896999 30447973 29653859 29513128 30048512 31358054 33536526 36712584
11228 36712584 41011451 46462923 52958221 60210942 67678026 74529884 79834886 82830972
11220 82830972 83162490 80729039 75716463 68728033 60754852 52750792 45297953 38667387
11212 38667387 32942081 28097857 24076321 20777693 18096030 15923863 14153219 12705723
11204 12705723 11498054 10486977 9630414 8897176 8256436 7694276 7197841 6763089 6376751
11195 6376751 6029211 5715956 5433109 5177508 4944097 4725960 4515834 4313867 4125745
11186 4125745 3946137 3778817 3630788 3495608 3360261 3239967 3129029 3022194 2918129
11177 2918129 2825638 2742708 2659485 2580551 2511027 2445227 2374838 2307836 2247628 2194937 2152009
$$ packed form
11236C4035771k138772j449026p94114j40731N35384J309542K178472L176058
11228C6712584M298867N451472O495298P252721P467084O851858N305002K996086
11220H2830972L31518k433451n012576o988430p973181q004060p452839o630566
11212C8667387n725306m844224m021536l298628k681663k172167j770644j447496
11204A2705723j207669j011077q56563p33238o40740n62160m96435m34752l86338
11195F376751l47540l13255k82847k55601k33411k18137k10126k01967j88122
11186D125745j79608j67320j48029j35180j35347j20294j10938j06835j04065
11177B918129r2491q2930q3223p8934o9524o5800p0389o7002o0208n2691m2928
$$ plain form
11166 2152009 2110875 2073941 2033669 1994164 1956348 1908525 1861678 1814100 1772440 1731586 1693314
11155 1693314 1654706 1625612 1594656 1567440 1542233 1513108 1484882 1453589 1421866 1395436 1369988
11144 1369988 1345311 1319236 1295629 1272520 1251641 1232297 1218078 1207877 1196568 1184200 1176552
11133 1176552 1170052 1162230 1154021 1144721 1134471 1134297 1135067 1129402 1127463 1119522 1115675 1111805 1101053 1079134
11119 1079134 1066104 1045949 1026597 1006098 985692 966829 956652 952053 941901 933121 925420 919320
11107 919320 914542 912713 911870 907433 895653 885097 877407 880104 887492 887511 882582 881996 888593 893388 894176
11092 894176 901382 907042 905491 893609 891138 887933 881437 866443 847698 831286 824320 815166 802048
11079 802048 794216 784283 777563 776702 773201 762907 749085 746009 747778 747780 747323 742906 726303 710285
$$ packed form
11166B152009m1134l6934m0272l9505l7816m7823m6847m7578m1660m0854l8272
11155A693314l8608k9094l0956k7216k5207k9125k8226l1293l1723k6430k5448
11144A369988k4677k6075k3607k3109k0879j9344j4219j0201j1309j2368p648
11133A176552o500p822q209r300j0250j74P70n665j939p941l847l870j0752k1919
11119A079134j3030k0155j9352k0499k0406j8863j0177m599j0152q780p701o100
11107I19320m778j829q43m437j1780j0556p690K697P388J9m929n86O597M795P88
11092H94176P206N660j551j1882k471l205o496j4994j8745j6412o966r154j3118
11079H02048p832r933o720q61l501j0294j3822l076J769Km57m417j6603j6018
$$ plain form
11065 710285 708836 701365 696412 696669 698619 702565 702688 698853 695526 698096 692576 687088 694542 693740 684341
11050 684341 676116 665964 657650 650938 641418 642776 639744 635027 635135 632091 619700 612657 615493 615113
11036 615113 612681 611587 613654 613457 609391 610298 611178 614468 625922 634788 636405 632868 624267 620609 621840
11021 621840 617631 608457 600734 599459 596084 594510 601489 610393 607225 606191 607729 615952 618378 621035
11007 621035 629630 634817 637836 647235 666962 687737 722922 769292 834732 894475 944255 985841
10995 985841 1003371 982511 931752 859385 780651 721327 690250 671326 667572 667478 657044 647941
10983 647941 640391 632360 630292 633244 639879 641951 641567 639681 644491 646318 655575 660972 668378 675198
10969 675198 672632 665726 665465 673704 683081 692705 700213 703937 708555 716695 718364 720833 721779 718008 714032
$$ packed form
11065G10285j449p471m953K57J950L946J23l835l327K570n520n488P454q02r399
11050F84341q225j0152q314o712r520J358l032m717J08l044j2391p043K836l80
11036F15113k432j094K067j97m066R07Q80L290J1454Q866J617l537q601l658J231
11021F21840m209r174p723j275l375j574O979Q904l168j034J538Q223K426K657
11007F21035Q595N187L019R399J9727K0775L5185M6370O5440N9743M9780M1586
10995I85841J7530k0860n0759p2367p8734n9324l1077j8924l754r4j0434r103
10983F47941p550q031k068K952O635K072l84j886M810J827R257N397P406O820
10969F75198k566o906k61Q239R377R624P508L724M618Q140J669K469R46l771l976
$$ plain form
10954 714032 722810 725232 718147 718920 722577 729957 740399 749831 755179 763524 774921 774699 777644 776150
10940 776150 776417 778466 774992 778927 789835 798801 803224 810668 822284 829291 829773 836892 845105 850338
10926 850338 850957 850599 853405 853586 856882 865899 879796 875626 882909 896273 905642 909413 923917 929041
10912 929041 928696 934184 940433 942636 942512 950941 958921 962850 965429 974319 979180 980207 993217 1000889
10898 1000889 1006733 1019500 1032545 1037622 1038865 1049988 1057076 1062816 1065360 1075432 1082654 1087832 1097012
10885 1097012 1106641 1112103 1118117 1126682 1135768 1144576 1159226 1174280 1188431 1203743 1212181 1215597 1221067
10872 1221067 1228895 1244399 1257073 1274674 1295946 1312953 1333173 1353252 1372883 1387735 1407494
10861 1407494 1438092 1478191 1511335 1538774 1566535 1586778 1608653 1627069 1646069 1663500 1685182
$$ packed form
10954G14032Q778K422p085P73L657P380J0442R432N348Q345J1397k22K945j494
10940G76150K67K049l474L935J0908Q966M423P444J1616P007M82P119Q213N233
10926H50338O19l58K806J81L296R017J3897m170P283J3364R369L771J4504N124
10912I29041l45N488O249K203j24Q429P980L929K579Q890M861J027J3010P672
10898A000889N844J2767J3045N077J243J1123P088N740K544J0072P222N178R180
10885A097012R629N462O014Q565R086Q808J4650J5054J4151J5312Q438L416N470
10872A221067P828J5504J2674J7601K1272J7007K0220K0079J9631J4852J9759
10861A407494L0598M0099L3144K7439K7761K0243K1875J8416J9000J7431K1682
$$ plain form
10850 1685182 1699007 1716449 1731033 1743557 1753999 1762778 1777232 1790215 1808939 1838067 1870437
10839 1870437 1906590 1962070 2036369 2147471 2278266 2401468 2492678 2563810 2621510 2630237 2573526
10828 2573526 2512900 2496733 2500816 2504903 2508796 2519202 2528617 2534562 2538640 2552940 2562296 2572153 2573885
10815 2573885 2581317 2593422 2602995 2609063 2628015 2651943 2671177 2692736 2721463 2757677 2794848 2839981
10803 2839981 2878661 2926267 2976456 3024233 3079949 3142539 3202413 3251269 3293258 3326307 3358982
10792 3358982 3387806 3406251 3426455 3453279 3473844 3497014 3527373 3557183 3588310 3611784 3644049
10781 3644049 3675483 3715870 3758019 3800849 3844113 3884986 3936526 3990251 4046460 4100458 4160858
10770 4160858 4226649 4284433 4345388 4417272 4486861 4562531 4638906 4724892 4803945 4885339 4963471
$$ packed form
10850A685182J3825J7442J4584J2524J0442Q779J4454J2983J8724K9128L2370
10839A870437L6153N5480P4299J11102J30795J23202R1210P1132N7700Q727n6711
10828B573526o0626j6167M083M087L893J0406R415N945M078J4300R356R857J732
10815B573885P432J2105R573O068J8952K3928J9234K1559K8727L6214L7171M5133
10803B839981L8680M7606N0189M7777N5716O2590N9874M8856M1989L3049L2675
10792C358982K8824J8445K0204K6824K0565K3170L0359K9810L1127K3474L2265
10781C644049L1434M0387M2149M2830M3264M0873N1540N3725N6209N3998O0400
10770D160858O5791N7784O0955P1884O9589P5670P6375Q5986P9053Q1394P8132
$$ plain form
10759 4963471 5051416 5149449 5245279 5339138 5431998 5535072 5639100 5746565 5851676 5966964
10749 5966964 6089831 6219921 6355622 6498957 6637846 6777709 6925012 7083768 7251264
10740 7251264 7416032 7586212 7767826 7947060 8136378 8330903 8534836 8748024 8970101
10731 8970101 9200129 9438693 9697379 9973642 10270660 10589191 10936123 11323236 11772203
10722 11772203 12274853 12798979 13301110 13751793 14140386 14467694 14707905 14876070 15034700
10713 15034700 15236221 15504885 15825969 16182182 16579412 17001867 17445615 17906562 18385061
10704 18385061 18878064 19383927 19897851 20424735 20960277 21500358 22043093 22588008 23134557
10695 23134557 23681755 24233666 24782817 25335572 25881915 26413945 26945133 27458505 27960211
$$ packed form
10759D963471Q7945R8033R5830R3859R2860J03074J04028J07465J05111J15288
10749E966964J22867J30090J35701J43335J38889J39863J47303J58756J67496
10740G251264J64768J70180J81614J79234J89318J94525K03933K13188K22077
10731H970101K30028K38564K58686K76263K97018L18531L46932L87113M48967
10722A1772203N02650N24126N02131M50683L88593L27308K40211J68165J58630
10713A5034700K01521K68664L21084L56213L97230M22455M43748M60947M78499
10704A8385061M93003N05863N13924N26884N35542N40081N42735N44915N46549
10695B3134557N47198N51911N49151N52755N46343N32030N31188N13372N01706
$$ plain form
10686 27960211 28452243 28927643 29384738 29824352 30252751 30662222 31054978 31418927 31770508
10677 31770508 32105413 32430982 32741498 33032181 33309468 33568066 33805976 34026010 34230183
10668 34230183 34414444 34580483 34725048 34855343 34968952 35069854 35157093 35228061 35277353 35305580
10658 35305580 35318536 35312355 35287374 35247633 35190166 35104179 35000955 34880202 34744547 34592777
10648 34592777 34432054 34248773 34044981 33834013 33601502 33359053 33113604 32850360 32581078
10639 32581078 32296717 31997641 31690134 31371959 31045277 30709091 30367337 30018906 29663287
10630 29663287 29290408 28915341 28538070 28149390 27751249 27345901 26936544 26517851 26094388
10621 26094388 25671270 25238248 24800398 24357451 23910179 23456634 23002445 22547210 22092454
$$ packed form
10686B7960211M92032M75400M57095M39614M28399M09471L92756L63949L51581
10677C1770508L34905L25569L10516K90683K77287K58598K37910K20034K04173
10668C4230183J84261J66039J44565J30295J13609J00902Q7239P0968M9292K8227
10658C5305580J2956o181k4981l9741n7467q5987j03224j20753j35655j51770
10648C4592777j60723j83281k03792k10968k32511k42449k45449k63244k69282
10639C2581078k84361k99076l07507l18175l26682l36186l41754l48431l55619
10630B9663287l72879l75067l77271l88680l98141m05348m09357m18693m23463
10621B6094388m23118m33022m37850m42947m47272m53545m54189m55235m54756
$$ plain form
10612 22092454 21633805 21175060 20720884 20274041 19832463 19397497 18962426 18519564 18090021
10603 18090021 17666147 17248842 16843491 16444225 16050580 15669741 15286755 14913827 14549961
10594 14549961 14197470 13846917 13518827 13195775 12874357 12560910 12253705 11964305 11680961
10585 11680961 11409855 11137645 10873640 10616370 10362225 10116069 9882622 9655943 9436841
10576 9436841 9238115 9039956 8844661 8652666 8463235 8277072 8101424 7931933 7761199
10567 7761199 7603618 7450045 7285908 7132934 6999547 6877631 6766497 6664649 6574554 6488871
10557 6488871 6409807 6320376 6225999 6114606 5992964 5868625 5728250 5576202 5433019 5308125
10547 5308125 5192913 5095334 4996381 4898939 4805369 4718881 4636746 4554139 4470581 4393837 4317187
$$ packed form
10612B2092454m58649m58745m54176m46843m41578m34966m35071m42862m29543
10603A8090021m23874m17305m05351l99266l93645l80839l82986l72928l63866
10594A4549961l52491l50553l28090l23052l21418l13447l07205k89400k83344
10585A1680961k71106k72210k64005k57270k54145k46156k33447k26679k19102
10576I436841j98726j98159j95295j91995j89431j86163j75648j69491j70734
10567G761199j57581j53573j64137j52974j33387j21916j11134j01848r0095q5683
10557F488871p9064q9431r4377j11393j21642j24339j40375j52048j43183j24894
10547E308125j15212r7579r8953r7442r3570q6488q2135q2607q3558p6744p6650
$$ plain form
10536 4317187 4244154 4174188 4102706 4028669 3958119 3901801 3840990 3779439 3721523 3666849 3606970
10525 3606970 3548950 3496468 3443025 3390362 3343168 3298177 3249124 3201487 3152551 3103694 3051831
10514 3051831 2997405 2955358 2912966 2879882 2847653 2817930 2795944 2769953 2735288 2703136 2672200
10503 2672200 2638655 2598905 2560301 2521680 2484763 2449325 2411330 2380581 2353702 2318220 2300094
10492 2300094 2288994 2288829 2298199 2312182 2326419 2318802 2305912 2292296 2257832 2212602 2169197 2127063
10480 2127063 2087497 2055503 2024866 1993375 1961182 1927962 1903425 1876952 1850068 1825101 1810511
10469 1810511 1804902 1798376 1797169 1796828 1791953 1793543 1796011 1797842 1787424 1752267 1715779 1681493 1651236
10456 1651236 1627396 1604663 1585099 1567394 1554077 1532892 1516323 1501871 1488721 1477652 1470729
$$ packed form
10536D317187p3033o9966p1482p4037p0550n6318o0811o1551n7916n4674n9879
10525C606970n8020n2482n3443n2663m7194m4991m9053m7637m8936m8857n1863
10514C051831n4426m2047m2392l3084l2229k9723k1986k5991l4665l2152l0936
10503B672200l3545l9750l8604l8621l6917l5438l7995l0749k6879l5482j8126
10492B300094j1100j65R370J3983J4237p617j2890j3616l4464m5230m3405m2134
10480B127063l9566l1994l0637l1491l2193l3220k4537k6473k6884k4967j4590
10469A810511n609o526j207l41m875J590K468J831j0418l5157l6488l4286l0257
10456A651236k3840k2733j9564j7705j3317k1185j6569j4452j3150j1069o923
$$ plain form
10445 1470729 1461199 1464562 1477980 1482075 1477930 1476736 1477748 1475221 1466278 1451658 1447423 1443787 1436044
10432 1436044 1432290 1446356 1461792 1494534 1537856 1595849 1658162 1730537 1800607 1871969 1921319
10421 1921319 1940409 1927083 1892378 1815052 1685627 1568385 1476264 1408450 1364714 1343699 1321415
10410 1321415 1306023 1292529 1284043 1276145 1269279 1259652 1257934 1255688 1239336 1229897 1220877 1216582 1213108
10397 1213108 1212240 1207919 1205566 1219082 1233424 1236963 1242446 1239618 1235603 1247441 1251682 1251816 1257122 1261770
10383 1261770 1261647 1260217 1263706 1270179 1278126 1279673 1268574 1259288 1273650 1285282 1297272 1314832 1333201
10370 1333201 1352810 1361927 1372552 1383002 1398036 1406020 1407904 1407406 1414234 1424627 1430220 1447325 1475553
10357 1475553 1508488 1544799 1585597 1617170 1659180 1693559 1713504 1738202 1769559 1794504 1829941
$$ packed form
10445A470729r530L363J3418M095m145j194J012k527q943j4620m235l636p743
10432A436044l754J4066J5436L2742M3322N7993O2313P2375P0070P1362M9350
10421A921319J9090j3326l4705p7326j29425j17242r2121o7814m3736k1015k2284
10410A321415j5392j3494q486p898o866r627j718k246j6352r439r020m295l474
10397A213108q68m321k353J3516J4342L539N483k828m015J1838M241J34N306M648
10383A261770j23j430L489O473P947J547j1099r286J4362J1632J1990J7560J8369
10370A333201J9609R117J0625J0450J5034P984J884m98O828J0393N593J7105K8228
10357A475553L2935L6311M0798L1573M2010L4379J9945K4698L1357K4945L5437
$$ plain form
10346 1829941 1878516 1936600 1991710 2050972 2123180 2202292 2288577 2378683 2472334 2559533 2644863
10335 2644863 2730324 2823317 2938094 3080625 3246006 3454823 3704880 4004159 4357800 4779209
10325 4779209 5271463 5845291 6528609 7376103 8414246 9601836 10869815 12165729 13503680
10316 13503680 14894108 16348152 17983993 20095908 23006956 27069203 32781974 40887353
10308 40887353 52574653 69692242 94858237 130544309 175862763 222736957 259285987
10301 259285987 280204276 288382753 282590033 253298185 204250335 155630503 118102822
10294 118102822 91182585 71943368 57905793 47373277 39350916 33309636 28832522
10287 28832522 25526492 23075471 21195045 19650526 18302367 17042503 15773929 14449018
$$ packed form
10346A829941M8575N8084N5110N9262P2208P9112Q6285R0106R3651Q7199Q5330
10335B644863Q5461R2993J14777J42531J65381K08817K50057K99279L53641M21409
10325D779209M92254N73828O83318Q47494J038143J187590J267979J295914J337951
10316A3503680J390428J454044J635841K111915K911048M062247N712771Q105379
10308D0887353J1687300J7117589K5165995L5686072M5318454M6874194L6549030
10301B59285987K0918289Q178477n792720k9291848m9047850m8619832l7527681
10294A18102822k6920237j9239217j4037575j0532516q022361o041280m477114
10287B8832522l306030k451021j880426j544519j348159j259864j268574j324911
$$ plain form
10279 14449018 13174363 12061186 11129665 10355332 9688745 9109545 8587739 8119894 7708969
10270 7708969 7340733 6985693 6625058 6268050 5922192 5598446 5313588 5065375 4836587
10261 4836587 4631948 4460200 4302366 4152841 4003304 3851778 3705885 3567765 3421608
10252 3421608 3285229 3160687 3047112 2932957 2824616 2726476 2645797 2570776 2507344 2455105
10242 2455105 2394948 2326370 2262565 2193711 2124476 2053140 1988215 1925826 1866303 1818398 1771027
10231 1771027 1724712 1683705 1657952 1627111 1594665 1561155 1528060 1499609 1467957 1430146 1390285
10220 1390285 1350933 1313034 1282497 1256643 1237720 1215439 1187115 1166377 1149919 1132445 1114421
10209 1114421 1103688 1091248 1070724 1054334 1035024 1020248 1005023 983049 969558 952456 933807
$$ packed form
10279A4449018j274655j113177r31521p74333o66587n79200n21806m67845m10925
10270G708969l68236l55040l60635l57008l45858l23746k84858k48213k28788
10261D836587k04639j71748j57834j49525j49537j51526j45893j38120j46157
10252C421608j36379j24542j13575j14155j08341r8140q0679p5021o3432n2239
10242B455105o0157o8578o3805o8854o9235p1336o4925o2389n9523m7905m7371
10231A771027m6315m1007k5753l0841l2446l3510l3095k8451l1652l7811l9861
10220A390285l9352l7899l0537k5854j8923k2281k8324k0738j6458j7474j8024
10209A114421j0733j2440k0524j6390j9310j4776j5225k1974j3491j7102j8649
$$ plain form
10198 933807 908813 889422 882426 872281 865669 861233 850360 838285 836592 834723 825868 817004 805417
10185 805417 800550 799556 794369 782039 780350 776533 777456 793885 822495 849092 876308 898012 925826
10172 925826 945295 957509 963129 962136 959737 948077 945639 945751 939554 926036 907458 883962 859909
10159 859909 829848 775017 724650 686480 652860 620193 594119 573840 554777 536543 525598
10148 525598 513588 512669 513615 503530 497953 500168 495744 478211 462033 451112 439696 429926 429034
10135 429034 427617 429020 434825 433498 433290 421708 415382 413666 401754 383460 364853 352115 337445
10122 337445 334584 323170 309920 294357 288426 284459 281796 288989 297182 306492 318027 336777 360988
10109 360988 374079 372997 368949 365305 354254 341070 327680 315284 309083 310627 309130 303333 293303
$$ packed form
10198I33807k4994j9391o996j0145o612m436j0873j2075j693j869q855q864j1587
10185H05417m867r94n187j2330j689l817R23J6429K8610K6597K7216K1704K7814
10172I25826J9469J2214N620r93k399j1660k438J12o197j3518j8578k3496k4053
10159H59909l0061n4831n0367l8170l3620l2667k6074k0279j9063j8234j0945
10148E25598j2010r19R46j0085n577K215m424j7533j6178j0921j1416r770q92
10135D29034j417J403N805j327k08j1582o326j716j1912j8294j8607j2738j4670
10122C37445k861j1414j3250j5563n931l967k663P193Q193R310J1535J8750K4211
10109C60988J3091j082m048l644j1051j3184j3390j2396o201J544j497n797j0030
$$ plain form
10096 293303 290644 284439 284664 295900 299758 304791 308804 311152 308682 304710 296197 289455 281924 284834
10082 284834 283842 279201 277534 279928 273639 271106 275880 274361 269377 261654 262422 261207 258793 261996 260244
10067 260244 252415 245794 245601 246320 241132 234967 231754 232074 229207 223127 230648 234942 235218 237834 237221
10052 237221 247481 254893 254119 252345 250211 252582 256505 248712 242620 238077 240273 244822 239917 233348
10038 233348 227765 223825 213390 209545 213206 204394 195709 195314 195513 197397 198038 199346 208354 216740 219882
10023 219882 220705 217417 217116 219278 217279 214193 210358 206965 197119 192898 194417 196631 200455 201481 201973
10008 201973 201250 205506 205189 200373 199494 195549 187409 187490 174247 172836 176373 184742 190163 192858 195453
9993 195453 193516 194218 191499 186806 184187 182873 180205 180125 178978 176965 181909 181081 179212 182033 184909
$$ packed form
10096B93303k659o205K25J1236L858N033M013K348k470l972q513o742p531K910
10082B84834r92m641j667K394o289k533M774j519m984p723P68j215k414L203j752
10067B60244p829o621j93P19n188o165l213L20k867o080P521M294K76K616o13
10052B37221J0260P412p74j774k134K371L923p793o092m543K196M549m905o569
10038B33348n583l940j0435l845L661q812q685l95J99J884O41J308R008Q386L142
10023B19882Q23l288l01K162j999l086l835l393r846m221J519K214L824J026M92
10008B01973p23M256l17m816q79l945q140Q1j3243j411L537Q369N421K695K595
9993A95453j937P02k719m693k619j314k668q0j147k013M944q28j869K821K876
$$ plain form
9978 184909 190595 190492 188934 188957 188331 184801 191408 194818 190206 178636 170898 174442 174898 170497 162693
9963 162693 165438 165789 168949 172098 173244 169440 170818 170876 173746 173162 172090 166492 167107 170632 167974 168416
9947 168416 159669 153167 159578 163088 158410 163833 169509 169393 159558 154700 155756 151760 150882 146870 145227
9932 145227 146437 145538 145514 155799 155798 154984 159993 165581 169299 170357 169954 164344 162477 161262 161720 168859
9916 168859 168309 162224 162339 160137 165896 171036 172763 172668 172239 173380 169197 169680 171259 170492 167473 169288
9900 169288 171548 173661 171870 172199 180083 192679 205642 215446 240649 254711 263290 274353 297614
9887 297614 320001 349080 389713 444642 521827 637819 795365 999488 1223421 1425344 1561844
9876 1561844 1621243 1606735 1498772 1305112 1075717 875833 727377 624007 552772 496029
$$ packed form
9978A84909N686j03j558K3o26l530O607L410m612j1570p738L544M56m401p804
9963A62693K745L51L160L149J146l804J378N8K870n84j072n598O15L525k658M42
9947A68416q747o502O411L510m678N423N676j16r835m858J056l996q78m012j643
9932A45227J210q99k4J0285jq14N009N588L718J058m03n610j867j215M58P139
9916A68859n50o085J15k202N759N140J727r5m29J141m183M83J579p67l019J815
9900A69288K260K113j791L29P884J2596J2963R804K5203J4062Q579J1063K3261
9887B97614K2387K9079M0633N4929P7185J15992J57546K04123K23933K01923J36500
9876A561844N9399j4508j07963j93660k29395j99884j48456j03370p1235n6743
$$ plain form
9866 496029 459696 431845 411078 393855 379825 364531 343585 324290 308255 294639 284249 283058
9854 283058 281521 275823 263153 249708 236997 228764 219503 211695 208183 205077 191635 182168 180921
9841 180921 181134 182998 188007 185166 187691 192991 192600 189350 189688 184296 183466 180874 178394 172334 164618
9826 164618 162282 167036 173583 174929 180181 180780 181824 179675 179831 180006 178533 174894 168527 165001 166237
9811 166237 168151 168200 169735 172818 171383 170102 162500 153025 152029 148334 152556 153597 150892 150255 158499
9796 158499 163465 162714 164166 169143 171263 171541 161644 158624 162359 165848 169992 170456 167016 163861 170602
9781 170602 173059 170244 167881 167868 162008 158129 157304 157786 158354 159047 159562 159287 160168 164904 170753 176271 171473
9764 171473 169099 175522 178406 183107 184206 179677 177580 180857 185271 185716 184584 182207 178834 175514 176829
$$ packed form
9866D96029l6333k7851k0767j7223j4030j5294k0946j9295j6035j3616j0390j191
9854B83058j537n698j2670j3445j2711q233r261p808l512l106j3442r467j247
9841A80921K13J864N009k841K525N300l91l250L38n392q30k592k480o060p716
9826A64618k336M754O547J346N252N99J044k149J56J75j473l639o367l526J236
9811A66237J914M9J535L083j435j281p602r475r96l695M222J041k705o37Q244
9796A58499M966p51J452M977K120K78r897l020L735L489M144M64l440l155O741
9781A70602K457k815k363j3n860l879q25M82N68O93N15k75Q81M736N849N518m798
9764A71473k374O423K884M701J099m529k097L277M414M45j132k377l373l320J315
$$ plain form
9749 176829 176724 176135 181546 182962 181065 173963 170564 168427 165804 164018 163346 168024 174992 175048 173187 165162
9733 165162 167684 167576 167185 169161 169653 167388 166194 164923 161000 170518 176496 183330 196942 212771 226528
9718 226528 253625 292338 348297 413244 491745 553104 587993 600843 571853 520759 452731 379979
9706 379979 318525 275120 246414 224138 212901 203695 188677 176777 172749 173817 179534 177314 172946
9693 172946 172483 173161 171608 165232 161959 166179 172407 167709 168536 162065 166385 165246 160475 161019 160587 164057
9677 164057 161674 162234 166752 173876 177412 177031 167729 160217 164808 166795 163101 164994 167330 173744 179026
9662 179026 185795 187013 185802 180942 181855 188240 190732 195832 195457 189640 195228 203448 213268 231467 242127
9647 242127 250035 276891 299196 307732 304929 316367 315433 307839 284478 266579 258048 246907 236720
$$ packed form
9749A76829j05n89N411J416j897p102l399k137k623j786o72M678O968N6j861q025
9733A65162K522j08l91J976M92k265j194j271l923R518N978O834J3612J5829J3757
9718B26528K7097L8713N5959O4947P8501O1359L4889J2850k8990n1094o8028p2752
9706C79979o1454m3405k8706k2276j1237r206j5018j1900m028J068N717k220m368
9693A72946m63O78j553o376l273M220O228m698Q27o471M320j139m771N44m32L470
9677A64057k383N60M518P124L536l81r302p512M591J987l694J893K336O414N282
9662A79026O769J218j211m860R13O385K492N100l75n817N588Q220R820J8199J0660
9647B42127P908K6856K2305Q536k803J1438r34p594k3361j7899q531j1141j0187
$$ plain form
9634 236720 223869 204430 196510 191647 186649 185175 183364 174512 171354 176666 182156 184628 188533 192952
9620 192952 195224 196791 201982 201120 197092 190868 190254 192716 192539 191380 194704 196956 200972 206462 207497
9605 207497 204974 203683 195252 190386 191611 193297 194683 199598 191817 191715 197055 201474 202394 193981 196584
9590 196584 198550 200895 209988 212042 213141 205944 203191 206497 207266 212897 215212 212182 210251 210794 209561
9575 209561 212616 213923 214906 219224 220034 218401 217006 217562 214981 219081 224669 225300 227378 233109 235763
9560 235763 235129 232144 232724 234208 236705 238190 237430 234388 236410 240061 241700 244738 247704 250383 252320
9545 252320 255890 249895 251731 256400 253457 252388 256741 261275 261064 260129 257120 258981 264559 270631 266764
9530 266764 261367 266388 265321 259544 266546 264612 262604 268953 274460 276312 273024 271649 272704 281962
$$ packed form
9634B36720j2851j9439p920m863m998j474j811q852l158N312N490K472L905M419
9620A92952K272J567N191q62m028o224o14K462j77j159L324K252M016N490J035
9605B07497k523j291q431m866J225J686J386M915p781j02N340M419R20q413K603
9590A96584J966K345R093K054J099p197k753L306P69N631K315l030j931N43j233
9575B09561L055J307R83M318Q10j633j395N56k581M100N588O31K078N731K654
9560B35763o34k985N80J484K497J485p60l042K022L651J639L038K966K679J937
9545B52320L570n995J836M669k943j069M353M534k11r35l009J861N578O072l867
9530B66764n397N021j067n777P002j934k008O349N507J852l288j375J055R258
$$ plain form
9516 281962 288639 292309 292507 293322 290430 293866 297356 292439 289663 286641 290767 294623 292873 293646 292333
9501 292333 301467 310741 315832 313409 310217 312029 317090 318450 323817 326230 322778 326109 330691 330461 331746
9486 331746 333057 337150 335999 340451 349334 348149 350637 348305 344162 342835 344732 350727 362932 367263
9472 367263 364067 362883 367763 376842 375115 377928 386299 383894 384835 391240 399976 401664 406567 412914 410992
9457 410992 410815 414568 416048 416978 420551 427397 431239 434385 437344 440303 444142 446403 451383 453193 454436
9442 454436 459321 463226 458456 455254 456804 458877 465010 475014 478224 484084 483633 487306 493519 495681
9428 495681 495923 499333 501622 505335 508391 515437 520625 518933 515699 520678 527676 523900 523700 530760 534577
9413 534577 532243 534240 532213 527738 532654 541457 548285 553496 566528 573668 577147 582209 588886 592905
$$ packed form
9516B81962O677L670J98Q15k892L436L490m917k776l022M126L856j750P73j313
9501B92333R134R274N091k423l192J812N061J360N367K413l452L331M582k30J285
9486C31746J311M093j151M452Q883j185K488k332m143j327J897N995J2205M331
9472C67263l196j184M880R079j727K813Q371k405R41O405Q736J688M903O347j922
9457D10992j77L753J480R30L573O846L842L146K959K959L839K261M980J810J243
9442D54436M885L905m770l202J550K073O133J0004L210N860m51L673O213K162
9428D95681K42L410K289L713L056P046N188j692l234M979O998l776k00P060L817
9413E34577k334J997k027m475M916Q803O828N211J3032P140L479N062O677M019
$$ plain form
9399 592905 595296 606997 618444 621306 626524 630331 635451 644935 651479 653656 662808 674719 683486 695369
9385 695369 709142 718574 727123 733855 730974 728139 732207 735033 741934 748880 751763 749846 758758 761436
9371 761436 768667 785613 796854 798423 810813 822433 832716 841273 849693 856923 870012 885578 893989
9358 893989 897496 908483 911788 925175 945259 966419 990928 1001707 1011255 1025344 1032325 1035307 1041742
9345 1041742 1050127 1059618 1070243 1082098 1093323 1101495 1118873 1136125 1148186 1164285 1174460 1185394
9333 1185394 1201515 1217701 1235703 1257535 1273128 1294309 1310089 1328207 1348846 1377006 1398563
9322 1398563 1419372 1440301 1459192 1480957 1502408 1523554 1544481 1569223 1586667 1605085 1626441
9311 1626441 1652046 1683848 1705888 1728573 1754530 1773849 1799976 1828778 1858487 1890193 1924549
$$ packed form
9399E92905K391J1701J1447K862N218L807N120R484O544K177R152J1911Q767J1883
9385F95369J3773R432Q549O732k881k835M068K826O901O946K883j917Q912K678
9371G61436P231J6946J1241J569J2390J1620J0283Q557Q420P230J3089J5566Q411
9358H93989L507J0987L305J3387K0084K1160K4509J0779R548J4089O981K982O435
9345A041742Q385R491J0625J1855J1225Q172J7378J7252J2061J6099J0175J0934
9333A185394J6121J6186J8002K1832J5593K1181J5780J8118K0639K8160K1557
9322A398563K0809K0929J8891K1765K1451K1146K0927K4742J7444J8418K1356
9311A626441K5605L1802K2040K2685K5957J9319K6127K8802K9709L1706L4356
$$ plain form
9300 1924549 1955227 1986098 2023123 2060583 2090689 2120504 2157580 2199313 2230400 2268242 2313305
9289 2313305 2360071 2402412 2446949 2486416 2533735 2581866 2639723 2701546 2754665 2808572 2866575
9278 2866575 2924656 2984023 3035749 3093967 3162827 3229965 3298564 3369773 3446297 3526965 3612403
9267 3612403 3694046 3775719 3856174 3943636 4039872 4138415 4231726 4331515 4441970 4544727 4663412
9256 4663412 4789411 4913508 5049586 5187655 5326815 5477963 5635279 5797718 5962225 6134135
9246 6134135 6317275 6506414 6700896 6909997 7130880 7360000 7602482 7849746 8106734 8359151
9236 8359151 8620297 8890319 9164785 9449895 9752004 10076648 10421157 10782718 11159932 11558440
9226 11558440 11965059 12389016 12845639 13310647 13792473 14293507 14810803 15342429 15890352
$$ packed form
9300A924549L0678L0871L7025L7460L0106K9815L7076M1733L1087L7842M5063
9289B313305M6766M2341M4537L9467M7319M8131N7857O1823N3119N3907N8003
9278B866575N8081N9367N1726N8218O8860O7138O8599P1209P6524Q0668Q5438
9267C612403Q1643Q1673Q0455Q7462R6236R8543R3311R9789J10455J02757J18685
9256D663412J25999J24097J36078J38069J39160J51148J57316J62439J64507J71910
9246F134135J83140J89139J94482K09101K20883K29120K42482K47264K56988K52417
9236H359151K61146K70022K74466K85110L02109L24644L44509L61561L77214L98508
9226A1558440M06619M23957M56623M65008M81826N01034N17296N31626N47923
$$ plain form
9217 15890352 16446680 17024536 17623873 18243034 18864133 19503874 20152848 20816362 21491729
9208 21491729 22175977 22865065 23555073 24243210 24923680 25580101 26205881 26787908 27310023
9199 27310023 27774191 28173475 28510488 28803612 29043144 29218652 29335871 29390551 29383651 29310729
9189 29310729 29176967 28969343 28701438 28378482 28000096 27572802 27095445 26577981 26026170
9180 26026170 25447465 24836308 24205457 23560785 22902241 22251863 21601302 20955169 20318408
9171 20318408 19691514 19086318 18489812 17909474 17344844 16800219 16272076 15744176 15230647
9162 15230647 14724660 14232287 13752067 13293864 12849728 12427368 12020729 11629451 11256872
9153 11256872 10898503 10546876 10215091 9902187 9598841 9307715 9025010 8755399 8495625
$$ packed form
9217A5890352N56328N77856N99337O19161O21099O39741O48974O63514O75367
9208B1491729O84248O89088O90008O88137O80470O56421O25780N82027N22115
9199B7310023M64168L99284L37013K93124K39532J75508J17219N4680o900p2922
9189B9310729j33762k07624k67905l22956l78386m27294m77357n17464n51811
9180B6026170n78705o11157o30851o44672o58544o50378o50561o46133o36761
9171B0318408o26894o05196n96506n80338n64630n44625n28143n27900n13529
9162A5230647n05987m92373m80220m58203m44136m22360m06639l91278l72579
9153A1256872l58369l51627l31785l12904l03346k91126k82705k69611k59774
$$ plain form
9144 8495625 8239870 7998526 7770157 7547612 7325783 7115561 6915988 6725030 6539506 6361674
9134 6361674 6190172 6035491 5876793 5718831 5564037 5419786 5283408 5152867 5022524 4891271
9124 4891271 4772318 4658795 4545459 4433951 4330326 4230044 4135460 4038786 3945700 3859426
9114 3859426 3764651 3688707 3609476 3527313 3449668 3371595 3302366 3232656 3161185 3092303 3028948
9103 3028948 2970919 2916710 2857816 2808719 2756850 2703527 2648584 2596396 2552574 2494981 2448303
9092 2448303 2407140 2361260 2309243 2271932 2232395 2189809 2152482 2117821 2089069 2059904 2027477
9081 2027477 1991243 1953838 1914572 1887733 1859418 1833270 1805473 1775410 1746978 1721292 1695611
9070 1695611 1669671 1646932 1619830 1597622 1571938 1549203 1532846 1512649 1490601 1465275 1435897
$$ packed form
9144H495625k55755k41344k28369k22545k21829k10222j99573j90958j85524j77832
9134F361674j71502j54681j58698j57962j54794j44251j36378j30541j30343j31253
9124D891271j18953j13523j13336j11508j03625j00282r4584r6674r3086q6274
9114C859426r4775p5944p9231q2163p7645p8073o9229o9710p1471o8882o3355
9103C028948n8029n4209n8894m9097n1869n3323n4943n2188m3822n7593m6678
9092B448303m1163m5880n2017l7311l9537m2586l7327l4661k8752k9165l2427
9081B027477l6234l7405l9266k6839k8315k6148k7797l0063k8432k5686k5681
9070A695611k5940k2739k7102k2208k5684k2735j6357k0197k2048k5326k9378
$$ plain form
9059 1435897 1409899 1387176 1370782 1351533 1330862 1311924 1299073 1278649 1256379 1233915 1221286
9048 1221286 1208688 1189321 1170810 1157203 1144938 1139987 1122790 1099886 1076714 1053937 1034421 1024135
9036 1024135 1015259 1005425 993367 977189 972079 964254 950012 937108 924819 917826 905906 898804 885121
9023 885121 875832 868888 852254 838645 831794 825591 813236 795784 784294 775784 766951 759183 755801
9010 755801 750287 743124 734171 719122 708838 700054 696609 693816 686509 673905 667339 666662 663696 650957
8996 650957 640668 636409 633477 627806 623358 615137 601345 590616 584956 582760 578202 577920 575815 573397
8982 573397 568426 562583 549299 535811 532789 528175 521901 520227 517249 511605 508683 497093 490408 492337
8968 492337 493253 487878 481401 476623 464624 463533 467221 475319 469625 463026 453235 445537 432656 424190
$$ packed form
9059A435897k5998k2723j6394j9249k0671j8938j2851k0424k2270k2464j2629
9048A221286j2598j9367j8511j3607j2265m951j7197k2904k3172k2777j9516j0286
9036A024135q876r834j2058j6178n110p825j4242j2904j2289o993j1920p102j3683
9023H85121r289o944j6634j3609o851o203j2355j7452j1490q510q833p768l382
9010G55801n514p163q953j5049j0284q784l445k793p307j2604o566o77k966j2739
8996F50957j0289m259k932n671m448q221j3792j0729n660k196m558k82k105k418
8982E73397m971n843j3284j3488l022m614o274j674k978n644k922j1590o685J929
8968D92337R16n375o477m778j1999j091L688Q098n694o599r791p698j2881q466
$$ plain form
8954 424190 420988 422096 422537 424926 416616 414060 411454 407937 404962 397790 391407 383317 377083 374547 375552
8939 375552 377247 377040 374977 373492 374368 375614 372011 368552 363634 357006 345681 331979 336246 341385
8925 341385 340654 339815 339504 335066 329589 326287 324968 319441 315557 311305 309803 305630 299150 296496 293379
8910 293379 294603 299848 298644 292032 287941 289138 289692 293043 292763 290775 287842 278835 270808 265692 268250
8895 268250 270924 268772 262478 260262 264677 265430 264358 259512 257474 260886 255488 245416 247117 251730
8881 251730 256037 259006 258805 259536 254866 251733 247397 243717 236057 228858 227176 227881 229767 234495 240841
8866 240841 244422 236966 231429 225239 215334 218926 223898 222294 224871 225499 233265 233573 233200 246424 252967
8851 252967 254558 262356 270140 277014 280917 288121 294646 299168 312053 327504 347554 381376 434506
$$ packed form
8954D24190l202J108M41K389q310k556k606l517k975p172o383q090o234k536J005
8939C75552J695k07k063j485Q76J246l603l459m918o628j1325j3702M267N139
8925C41385p31q39l11m438n477l302j319n527l884m252j502m173o480k654l117
8910B93379J224N245j204o612m091J197N54L351k80j988k933r007q027n116K558
8895B68250K674k152o294k216M415P53j072m846k038L412n398j0072J701M613
8881B51730M307K969k01P31m670l133m336l680p660p199j682P05J886M728O346
8866B40841L581p456n537o190r905L592M972j604K577O28P766L08l73J3224O543
8851B52967J591P798P784O874L903P204O525M522J2885J5451K0050L3822N3130
$$ plain form
8838 434506 521531 655282 859365 1100337 1309048 1434877 1491040 1498671 1388665 1143728
8828 1143728 881410 686829 562555 477693 413060 368747 342717 328644 308715 292294 285791
8817 285791 278739 268623 256388 249723 241099 224026 214782 210665 203825 202372 199416 196636 195699 191030
8803 191030 187719 187756 182320 170090 168394 171286 166726 169477 170480 160808 149043 145695 149029 149648 149325
8788 149325 145615 144668 145856 143996 152836 155971 156543 152243 150932 152016 148639 141535 141117 147387 145960
8773 145960 139711 135011 134398 142918 150987 150721 153164 152816 148151 144083 138137 143096 141741 134532 131026
8758 131026 123164 124217 132699 130776 126628 122291 119705 118448 115570 116561 119506 118654 117762 126229 130185
8743 130185 132684 136302 132844 127038 123413 119566 116913 116535 112915 113464 108678 108482 115357 117357 112337
$$ packed form
8838D34506Q7025J33751K04083K40972K08711J25829N6163P631j10006k44937
8828A143728k62318j94581j24274q4862o4633m4313k6030j4073j9929j6421o503
8817B85791p052j0116j2235o665q624j7073r244m117o840j453k956k780r37m669
8803A91030l311L7n436j2230j696K892m560K751J003r672j1765l348L334O19l23
8788A49325l710r47J188j860Q840L135N72m300j311J084l377p104m18O270j427
8773A45960o249m700o13Q520Q069k66K443l48m665m068n946M959j355p209l506
8758A31026p862J053Q482j923m148m337k586j257k878R91K945q52q92Q467L956
8743A30185K499L618l458n806l625l847k653l78l620N49m786j96O875K000n020
$$ plain form
8728 112337 115415 115494 114429 115715 116881 118477 113369 109682 106219 109198 111397 110385 107580 109026 119457
8713 119457 118230 115720 113146 109230 106508 110590 108979 101582 102198 107873 114069 115611 107460 105417 102337
8698 102337 99753 101077 102279 103196 111388 115084 110916 103246 100386 96943 95291 99974 103331 105067 100044
8683 100044 103335 100770 98837 103193 101543 92885 84593 82511 87260 90205 85543 83360 82704 85263 85594
8668 85594 89007 91266 91742 92570 91969 101242 109096 104785 102608 103891 103292 104973 101118 93324 90005 91316
8652 91316 94027 90631 84709 80660 80051 87414 87227 84802 87952 87159 83689 81416 83486 86200 89710
8637 89710 90218 89243 86705 78257 73711 85178 93183 93731 86238 82377 84099 85424 82987 81375 82499
8622 82499 85828 89980 85506 84316 82298 70333 73633 82365 78330 79768 80736 80744 79151 76746 74578
$$ packed form
8728A12337L078P9j065J286J166J596n108l687l463K979K199j012k805J446J0431
8713A19457j227k510k574l916k722M082j611p397O16N675O196J542q151k043l080
8698A02337k584J324J202R17Q192L696m168p670k860l443j652M683L357J736n023
8683A00044L291k565j933M356j650q658q292k082M749K945m662k183o56K559L31
8668H5594L413K259M76Q28o01R273P854m311k177J283n99J681l855p794l319J311
8652I1316K711l396n922m049o09P363j87k425L150p93l470k273K070K714L510
8637H9710N08r75k538q448m546J1467Q005N48p493l861J722J325k437j612J124
8622H2499L329M152m474j190k018j1965L300Q732m035J438R68Qj593k405k168
$$ plain form
8607 74578 79129 80776 75815 74518 74090 71575 79401 79805 78867 80761 82068 83325 88036 86433 77484
8592 77484 73947 77964 82578 84795 85483 79698 76303 78158 73175 67845 65751 68780 70252 67032 70356
8577 70356 77949 78672 82776 82765 82996 77649 81422 84761 87558 85001 82199 79165 73994 79257 85583 90831
8561 90831 92089 91107 94876 94113 96582 102146 104017 102273 99229 98799 98303 95039 87698 83372 77396 74847
8545 74847 78981 75761 74984 75196 77466 72002 68980 61468 56613 57159 56653 55317 60201 64060 58066 56919
8529 56919 60276 63648 62540 54448 53846 61047 57749 53408 56859 56674 57757 59878 59816 57681 55956 62497
8513 62497 68853 62953 57518 63092 63298 61306 56968 52308 56699 59933 57154 62733 62085 63396 65891
8498 65891 64310 61494 61594 59640 62030 60951 55656 48947 49331 50367 51452 47766 42888 45830 48361
$$ packed form
8607G4578M551J647m961j297m28k515P826M04r38J894J307J257M711j603q949
8592G7484l537M017M614K217O88n785l395J855m983n330k094L029J472l220L324
8577G0356P593P23M104j1K31n347L773L339K797k557k802l034n171N263O326N248
8561I0831J258r82L769p63K469N564J871j744l044m30m96l264p341m326n976k549
8545G4847M134l220p77K12K270n464l022p512m855N46n06j336M884L859n994j147
8529E6919L357L372j108q092o02P201l298m341L451j85J083K121o2k135j725O541
8513F2497O356n900n435N574K06j992m338m660M391L234k779N579o48J311K495
8498F5891j581k816J00j954K390j079n295o709L84J036J085l686m878K942K531
$$ plain form
8483 48361 45368 40232 36232 37288 40177 44083 48489 51049 53258 50096 46191 48488 47959 49588 51246
8468 51246 49278 45425 39888 41782 38094 41754 50666 47843 50497 46045 45050 46363 50718 54404 57334
8453 57334 57609 50073 46261 44620 43964 42353 41699 38661 43181 46016 43787 39777 39820 43077 45287 48993
8437 48993 54769 55809 49299 44700 45018 42786 41614 45633 49014 56763 57958 53200 53197 54755 58168 51762
8421 51762 50262 49614 50890 44073 47774 49054 48144 40168 37361 39860 40359 38027 40655 41563 42210 44169
8405 44169 42622 44480 43308 45552 45099 46540 44381 39151 35793 35169 33142 29510 26210 30625 39049
8390 39049 39200 40485 35347 37920 38753 43481 48545 50565 45535 38125 41938 43816 44349 43633 47546 43890
8374 43890 38470 41374 40821 42311 41641 43073 42111 42595 45102 45288 44626 46865 41532 45681 51731 51696 51813
$$ packed form
8483D8361k993n136m000J056K889L906M406K560K209l162l905K297n29J629J658
8468E1246j968l853n537J894l688L660Q912k823K654m452r95J313M355L686K930
8453E7334K75p536l812j641o56j611o54l038M520K835k229m010M3L257K210L706
8437D8993N776J040o510m599L18k232j172M019L381P749J195m758lJ558L413o406
8421E1762j500o48J276o817L701J280r10p976k807K499M99k332K628R08O47J959
8405D4169j547J858j172K244m53J441k159n230l358o24k027l632l300M415Q424
8390C9049J51J285n138K573Q33M728N064K020n030p410L813J878N33p16L913l656
8374D3890n420K904n53J490o70J432r62M84K507J86o62K239n333M149O050l5J17
$$ plain form
8357 51813 47544 52382 50077 51801 55433 52689 45672 44453 48247 45993 53393 48414 36204 31178
8343 31178 31528 33330 36352 39391 39890 40519 39955 42284 45312 40201 36514 34330 29471 29333 30891 26980
8327 26980 35285 46759 47111 38754 24763 23666 26836 31058 30527 28371 31299 34268 40051 46289 48399
8312 48399 49313 42092 41188 41580 43583 41695 41554 39589 39464 38511 35986 34666 36005 32569 28421 28774
8296 28774 27630 31908 37384 35149 35750 30826 30703 30441 31548 32456 26643 22173 20817 24919 22714 30987
8280 30987 24101 26272 29690 32647 30508 24380 29441 32450 31796 31081 23879 18912 22810 28939 34922
8265 34922 32792 29831 28323 21262 20308 21635 18504 18063 19443 20197 24850 22135 22752 24653 24353 22608
8249 22608 28278 30930 32793 30988 25527 27908 28421 26738 19044 15888 22419 27405 20614 23934 20065
$$ packed form
8357E1813m269M838k305J724L632k744p017j219L794k254P400m979j2210n026
8343C1178L50J802L022L039M99O29n64K329L028n111l687k184m859j38J558l911
8327B6980Q305J1474L52q357j3991j097L170M222n31k156K928K969N783O238K110
8312D8399R14p221r04L92K003j888j41j965j25r53k525j320J339l436m148L53
8296B8774j144M278N476k235O01m924j23k62J107R08n813m470j356M102k205Q273
8280C0987o886K171L418K957k139o128N061L009o54p15p202m967L898O129N983
8265C4922k130k961j508p061r54J327l131m41J380P54M653k715O17J901l00j745
8249B2608N670K652J863j805n461K381N13j683p694l156O531M986o791L320l869
$$ plain form
8234 20065 24355 26496 21206 28478 34528 36955 34291 29646 23809 21402 26873 26666 21427 13687 16816
8219 16816 27682 30055 30840 29105 28224 28335 24244 16724 13846 13925 19968 24723 25970 22152 18662 15772
8203 15772 24046 27339 28450 29120 25470 24218 26653 26057 21918 21148 15703 12831 11733 21209 30440
8188 30440 26326 18413 15621 18474 23806 23975 18088 20285 24272 21165 19182 20398 21733 22629 20076
8173 20076 18765 23311 28658 33462 35881 34259 30790 28660 27038 27642 21140 18311 23228 22467 14026
8158 14026 10017 13703 13632 12971 18633 20810 21282 20182 15796 12405 11781 12543 10626 3472 8111 19186
8142 19186 21305 18667 23455 20568 21936 18882 18295 16937 16160 19423 13857 13363 15508 17327 18683
8127 18683 17888 21031 19566 14301 17107 16851 20277 24054 21099 16330 21843 30843 37060 38681 38940
$$ packed form
8234B0065M290K141n290P272O050K427k664m645n837k407N471k07n239p740L129
8219A6816J0866K373P85j735q81J11m091p520k878P9O043M755J247l818l490k890
8203A5772Q274L293J111O70l650j252K435n96m139p70n445k872j098R476R231
8188C0440m114p913k792K853N332J69n887K197L987l107j983J216J335Q96k553
8173B0076j311M546N347M804K419j622l469k130j622O04o502k829M917p61q441
8158A4026m009L686p1o61N662K177M72j100m386l391o24P62j917p154M639J1075
8142A9186K119k638M788k887J368l054n87j358p77L263n566m94K145J819J356
8127A8683p95L143j465n265K806k56L426L777k955m769N513R000O217J621K59
$$ plain form
8112 38940 37449 32417 35537 41348 41065 39128 31584 28997 30865 29340 22416 19156 18413 20663 20149
8097 20149 17906 19021 24373 31266 27839 21121 15191 13336 11518 9930 12426 12338 19438 24266 26910
8082 26910 22498 22863 23188 21286 21997 14649 13567 6817 11393 17761 20294 20350 18037 20628 18271 16058
8066 16058 13153 10754 13427 13193 17106 19802 19256 22048 26252 23440 18174 24170 22531 19762 13438
8051 13438 17575 21958 17690 13591 18615 14847 15449 15627 11331 4782 5380 15122 10778 9884 10096 11851
8035 11851 12352 10657 13219 14701 13763 13529 9282 15005 21392 18181 14897 11887 12562 15034 13517 15677
8019 15677 18750 21221 21281 19522 17870 20271 20954 20796 22351 21318 20953 24638 28676 29544 27078 23997
8003 23997 18142 15722 19238 21132 20180 25021 24290 22282 18859 13901 15367 15093 15763 18810 19339 26207
$$ packed form
8112C8940j491n032L120N811k83j937p544k587J868j525o924l260p43K250n14
8097B0149k243J115N352O893l427o718n930j855j818j588K496q8P100M828K644
8082B6910m412L65L25j902P11p348j082o750M576O368K533N6k313K591k357k213
8066A6058k905k399K673k34L913K696n46K792M204k812n266N996j639k769o324
8051A3438M137M383m268m099N024l768O02J78m296o549N98R742m344q94K12J755
8035A1851N01j695K562J482r38k34m247N723O387l211l284l010O75K472j517K160
8019A5677L073K471O0j759j652K401O83j58J555j033l65L685M038Q68k466l081
8003B3997n855k420L516J894r52M841p31k008l423m958J466k74O70L047N29O868
$$ plain form
7987 26207 31785 28786 24399 26355 26395 26167 27333 27453 23109 19886 21390 21657 21387 25112 25863 34125
7971 34125 31619 29123 33636 36658 39189 38468 37555 38455 36901 34566 41612 41867 39860 38129 28318 19598
7955 19598 21908 17780 17111 15820 14094 18237 21676 19444 15368 15198 20095 21207 19602 15529 20316
7940 20316 25533 21580 18335 20979 19795 20910 19860 18626 15596 16203 17340 23691 20258 13646 10297
7925 10297 8335 4775 2985 7235 20117 26918 26903 26233 24134 20801 14430 18359 24862 33391 34451
7910 34451 35185 38001 25734 12398 2246 5713 11970 13970 19767 32680 42535 54662 64304 72835
7896 72835 77228 69111 64391 53470 39309 25616 15933 7644 1856 4885 5698 4641 6880 17073
7882 17073 16990 16558 19705 17520 11396 12129 12482 9595 7473 2400 10128 7562 10388 12920 6436 9893
$$ packed form
7987B6207N578k999m387J956M0k28J166J20m344l223J504K67k70L725P51Q262
7971C4125k506k496M513L022K531p21r13R00j554k335P046K55k007j731r811q720
7955A9598K310m128o69j291j726M143L439k232m076j70M897J112j605m073M787
7940B0316N217l953l245K644j184J115j050j234l030O07J137O351l433o612l349
7925A0297j962l560j790M250J2882O801j5o70k099l333o371L929O503Q529J060
7910C4451P34K816j2267j3336j0152L467O257K000N797J2913R855J2127R642Q531
7896G2835M393q117m720j0921j4161j3693r683q289n788L029Q13j057K239J0193
7882A7073q3m32L147k185o124P33L53k887k122n073P728k566K826K532o484L457
$$ plain form
7866 9893 14735 11840 10477 8159 6305 5169 5550 3149 3269 6803 10998 10981 9118 2167 3145 11440
7850 11440 19075 25950 20764 12050 9446 15253 22265 24431 20703 18169 15135 12084 7167 5381 9109
7835 9109 6837 1315 582 2376 -438 -266 -1132 5147 17653 11210 8629 9347 12714 15448 14889 22885
7819 22885 26779 21174 16491 13540 7122 5801 8409 9359 12551 10772 8040 6521 7070 7115 7286 5980
7803 5980 5498 1707 839 12333 13747 9455 9105 9742 16212 15058 8914 7498 2306 2095 6188 10643
7787 10643 7026 3243 4279 7761 9946 6968 4542 6320 17205 16939 15964 17590 14101 6816 7568
7772 7568 9235 2770 5325 10222 6504 395 -4570 -6102 -3547 -5336 -5666 -1346 -38 2937 6708
7757 6708 7146 11098 12900 17105 12146 4481 2232 2801 3775 6208 7723 4426 7337 10996 9985 11641
$$ packed form
7866I893M842k895j363k318j854j136L81k401J20L534M195j7j863o951R78Q295
7850A1440P635O875n186q714k604N807P012K166l728k534l034l051m917j786L728
7835I109k272n522p33J794k814J72q66O279J2506o443k581P18L367K734n59P996
7819B2885L894n605m683k951o418j321K608R50L192j779k732j519N49M5J71j306
7803E980m82l791q68J1494J414m292l50O37O470j154o144j416n192k11M093M455
7787A0643l617l783J036L482K185k978k426J778J0885k66r75J626l489p285P52
7772G568J667o465K555M897l718o109m965j532K555j789l30M320J308K975L771
7757F708M38L952J802M205m959p665k249N69R74K433J515l297K911L659j011J656
$$ plain form
7741 11641 13711 9337 7525 3842 -3355 -336 5604 5664 4333 -173 3501 5748 2196 6433 10691
7726 10691 9830 7148 11772 12774 11590 8973 6749 12255 20091 10715 8827 3615 3016 7923 15462
7711 15462 13920 12663 6151 -1460 -1057 3128 -5988 -8352 -4747 1731 3802 4769 7390 8355 7983 7073
7695 7073 4066 6559 6472 7680 11036 5027 -798 1105 6099 5760 5576 12163 17958 18731 9913 7113
7679 7113 9692 7926 10417 9377 3758 7038 17887 15192 13241 251 -1438 -4828 -7916 -3440
7665 -3440 -5086 -3794 704 8315 14452 12680 8386 10674 7066 9216 5445 2250 1316 1052 2751
7650 2751 5415 5444 5360 1238 -3220 -10968 -7225 -1516 -555 6469 4802 309 1509 3325 3525 3640 -694
7633 -694 -681 4290 7298 3853 5233 6130 -4217 -6507 2091 671 -4970 -7854 -123 13379 12853 10845
$$ packed form
7741A1641K070m374j812l683p197L019N940O0j331m506L674K247l552M237M258
7726A0691q61k682M624J002j184k617k224N506P836r376j888n212n99M907P539
7711A5462j542j257o512p611M03M185r116k364L605O478K071R67K621R65l72r10
7695G073l007K493q7J208L356o009n825J903M994l39j84O587N795P73q818k800
7679G113K579j766K491j040n619L280J0849k695j951j2990j689l390l088M476
7665c440j646J292M498P611O137j772m294K288l608K150l771l195r34k64J699
7650B751K664K9q4m122m458p748L743N709R61P024j667m493J200J816K00J15m334
7633f94J3M971L008l445J380Q97j0347k290Q598j420n641k884P731J3502n26k008
$$ plain form
7617 10845 9129 5485 3812 -694 166 878 -2679 -4047 3593 9672 6874 4989 5349 8800 13008
7602 13008 7936 3167 7261 8030 8402 14813 14219 9825 8774 3984 8684 10992 5522 8458 10032
7587 10032 9498 13531 5461 -1472 -5213 -6426 -4746 -3005 141 5414 8802 7100 7602 10666 13500
7572 13500 6479 3345 3213 1319 1775 6149 9401 7029 7250 3707 5147 8770 8140 6781 7137 5008
7556 5008 7287 8446 4370 7564 13329 14032 17335 17088 17888 15018 12736 12744 14916 16939 10996 8451
7540 8451 7643 7179 6048 5195 9184 12401 5095 -2574 -5531 209 7316 6583 1896 -3267 -3652 2034
7524 2034 3635 1090 4009 7898 8094 10317 2223 402 6794 10937 8770 4918 4980 2149 -4060 -10272
7508 -10272 -6999 -1702 -29 1820 73 1300 -2464 -4630 2582 4480 357 -2936 2932 4988 7696
$$ packed form
7617A0845j716l644j673m506Q60P12l557j368P640O079k798j885L60L451M208
7602A3008n072m769M094P69L72O411n94m394j051m790M700K308n470K936J574
7587A0032n34M033q070o933l741j213J680J741L146N273L388j702N02L064K834
7572A3500p021l134j32j894M56M374L252k372K21l543J440L623o30j359L56k129
7556E008K279J159m076L194N765P03L303k47Q00k870k282QK172K023n943k545
7540H451q08m64j131q53L989L217p306p669k957N740P107p33m687n163l85N686
7524B034J601k545K919L889J96K223q094j821O392M143k167l852O2k831o209o212
7508a0272L273N297J673J849j747J227l764k166P212J898m123l293N868K056K708
$$ plain form
7493 7696 3245 3451 4821 1608 9393 12206 11453 9451 1903 378 1805 -6161 -9558 -4462 -6262
7478 -6262 -4008 -969 3563 10116 8481 5318 4622 2833 3639 5190 4747 541 1134 5600 8138 5726
7462 5726 10356 11541 9819 6405 751 -132 1440 1738 -432 -574 -2756 -3260 -1415 1950 2460 2018
7446 2018 7304 10365 6874 7289 -124 2119 6208 7945 11120 13462 12981 4844 -1850 -2695 -5703 -2376
7430 -2376 -3343 -6918 -1712 1489 1029 2991 7194 8861 4301 7622 9185 8821 6104 11405 17491 15934
7414 15934 10428 1559 -1594 -3621 1209 3556 3051 4280 6542 4443 1814 -3100 -6681 -3948 -5189
7399 -5189 -6103 -3516 -739 3445 7283 4271 1600 -2495 -2264 1473 1326 5523 3767 1117 3415 -1117
7383 -1117 -5490 -6579 -3001 -1279 -3978 -9913 -4316 4064 -1395 -1727 1299 4849 -470 -4212 -2967
$$ packed form
7493G696m451K06J370l213P785K813p53k002p548j525J427p966l397N096j800
7478f262K254L039M532O553j635l163o96j789Q06J551m43m206N93M466K538k412
7462E726M630J185j722l414n654q83J572K98k170j42k182n04J845L365N10m42
7446B018N286L061l491M15p413K243M089J737L175K342m81q137o694q45l008L327
7430b376r67l575N206L201m60J962M203J667m560L321J563l64k717N301O086j557
7414A5934n506q869l153k027M830K347n05J229K262k099k629m914l581K733j241
7399e189r14K587K777M184L838l012k671m095K31L737j47M197j756k650K298m532
7383a117m373j089L578J722k699n935N597Q380n459l32L026L550n319l742J245
$$ plain form
7368 -2967 -8195 -4696 -267 -1962 3447 2687 3911 6253 3155 2833 6467 8292 8874 8832 4846 3037
7352 3037 9082 8386 7371 1710 1642 4728 1730 -4784 -3009 1479 156 -3058 -6568 -5195 177 4079
7336 4079 3647 4497 -2104 -4236 -3061 -5704 -9593 -10494 -9816 -7025 -4636 1899 3193 8831 5122 -99
7320 -99 -1977 1430 3274 885 -911 -2726 -2719 -4102 -11766 -7751 -6666 -8050 -6752 -1347 1015 -407
7304 -407 -853 -2678 -345 4164 11 67 -984 -2053 -9109 -12312 -4776 1111 -1687 -1469 625 -703
7288 -703 3456 9991 7385 4030 -6591 -9687 -6758 -3288 -2401 -4441 1199 3970 5358 164 -5451
7273 -5451 -9861 -2365 3723 2217 -2626 -5244 -8614 -9679 -9015 -9434 -9083 -10588 -3004 -2684 -1567 1092
7257 1092 6559 4409 3849 3255 -154 -4273 -3928 -2357 -5842 -4429 747 1403 340 880 6314 2902
$$ packed form
7368b967n228L499M429j695N409p60J224K342l098l22L634J825N82m2l986j809
7352C037O045o96j015n661o8L086k998o514J775M488j323l214l510J373N372L902
7336D079m32Q50o601k132J175k643l889r01O78K791K389O535J294N638l709n221
7320i9j878L407J844k389j796j815Pj383p664M015J085j384J298N405K362j422
7304d07m46j825K333M509m153N6j051j069p056l203P536N887k798K18K094j328
7288g03M159O535k606l355j0621l096K929L470Q87k040N640K771J388n194n615
7273e451m410P496O088j506m843k618l370j065O64m19L51j505P584L20J117K659
7257A092N467k150n60n94l409m119L45J571l485J413N176O56j063N40N434l412
$$ plain form
7241 2902 4795 9270 7879 6890 9064 9389 9313 3293 4441 2918 1783 2353 3450 8540 1779 -6169
7225 -6169 -3378 4201 5021 6069 11750 11678 9006 7195 8635 6003 4837 9165 10126 3634 4455 4495 4534
7208 4534 8066 5161 2931 1398 -7076 -6275 -4297 -4331 -1768 -2118 -6635 -6581 -8771 -7554 -6950 -4232 -2998
7191 -2998 -1868 -1538 -1400 3596 5464 3190 624 4729 6284 3933 2157 -773 -4231 -234 -1185 679
7175 679 622 -28 4657 2306 -2419 -2957 -4273 -1759 -318 -3472 -3234 -1632 -2159 -6229 -5277 -1056 -1895
7158 -1895 -5904 -4903 -6376 -2363 -3272 -3382 -1919 1364 2404 838 -4541 -3509 1124 -3174 -9326
7143 -9326 -8194 4763 13745 9938 4939 1365 6590 10671 4772 6184 6554 -1124 -10067 -9380 -8364
7128 -8364 -11507 -9350 -6600 -2543 -1693 -631 -9066 -10351 -5518 -892 -2189 -7680 -7398 -1058 2274
$$ packed form
7241B902J893M475j391r89K174L25p6o020J148j523j135N70J097N090o761p948
7225f169K791P579Q20J048N681p2k672j811J440k632j166M328R61o492Q21M0L9
7208D534L532k905k230j533q474Q01J978l4K563l50m517N4k190J217O04K718J234
7191b998J130L30J38M996J868k274k566M105J555k351j776k930l458L997r51J864
7175F79n7o50M685k351m725n38j316K514J441l154K38J602n27m070R52M221q39
7158a895m009J001j473M013r09j10J463L283J040j566n379J032M633m298o152
7143i326J132J2957Q982l807m999l574N225M081n899J412L70p678q943O87J016
7128h364l143K157K750M057Q50J062q435j285M833M626j297n491K82O340L332
$$ plain form
7113 2274 -4289 -4598 -4260 -11529 -13754 -8864 -6863 -5693 -3573 -5015 -4431 -5680 -8395 -4013 -831 1264
7097 1264 -27 -196 -5263 -7856 -7873 -3761 -2742 -1459 1913 -6454 -6721 1715 7077 10763 6315 7830
7081 7830 7556 -1335 -2455 2844 9440 9510 11373 12641 12503 7865 2785 -965 642 820 4264 3223
7065 3223 -2216 -6599 -2145 3404 1217 -488 -1087 -6842 -14247 -14209 -9696 -6318 -4009 -2904 -1991 -2100
7049 -2100 -5319 -3322 4766 13964 10942 2085 -2716 2779 1852 -839 -748 -4263 -4657 -1021 -2763 1609
7033 1609 1673 3481 31 -2396 -1446 258 469 5018 9051 8147 6029 4593 2338 37 -2298 -4174
7017 -4174 -1752 95 3673 5982 4179 3127 -154 -2811 -515 6283 6456 7154 5300 8751 10252
7002 10252 7728 10289 10117 683 -5210 -2761 478 861 -3751 -3553 -6867 -2987 -2329 -5061 -5942 -925
$$ packed form
7113B274o563l09L38p269k225M890K001J170K120j442N84j249k715M382L182K095
7097A264j291j69n067k593j7M112J019J283L372q367k67Q436N362L686m448J515
7081G830k74q891j120N299O596P0J863J268j38m638n080l750J607J78L444j041
7065C223n439m383M454N549k187j705n99n755p405L8M513L378K309J105R13j09
7049b100l219J997Q088R198l022q857m801N495r27k691R1l515l94L636j742M372
7033A609O4J808l450k427R50J704K11M549M033r04k118j436k255k301k335j876
7017d174K422J847L578K309j803j052l281k657K296O798J73O98j854L451J501
7002A0252k524K561j72r434n893K449L239L83m612J98l314L880O58k732q81N017
$$ plain form
6986 -925 1536 4320 3894 1636 3412 315 -6500 -10348 -11068 -13357 -14332 -19187 -25432 -15136 -8115 -9015
6970 -9015 -8819 -2072 2829 3706 6651 5971 4211 3807 10080 3480 -4300 -3180 774 -3146 576 6786
6954 6786 4441 1099 -6985 -5220 -5510 -3614 -6692 -14753 -18010 -16776 -20070 -18109 -14550 -5901 -532
6939 -532 3705 3042 2526 2539 -1139 413 -395 1805 864 -918 -8911 -15117 -17229 -14310 -9796 -279 4549
6922 4549 8037 4925 -579 -616 -605 -3749 -12426 -15564 -11009 29 8686 9277 11884 5766 544 7120
6906 7120 12501 10684 8088 5822 8679 5799 1657 33 -6003 -4666 -5458 -8888 -10006 -7106 -5381
6891 -5381 -3047 6762 9953 3418 1286 1900 459 1038 4816 9041 9874 6040 6290 6791 -3216 -6061
6875 -6061 -6420 -10965 -9967 -4084 -4076 -7726 -5561 2757 6233 7087 2977 6100 11379 11965 8222 2758 9577
$$ packed form
6986i25K461K784m26k258J776l097o815l848p20k289r75m855o245J0296P021r00
6970i015J96O747M901Q77K945o80j760m04O273o600p780J120L954l920L722O210
6954F786k345l342q084J765k90J896l078q061l257J234l294J961L559Q649N369
6939e32M237o63n16J3l678J552q08K200r41j782p993o206k112K919M514R517M828
6922D549L488l112n504l7J1l144q677l138M555J1038Q657N91K607o118n222O576
6906G120N381j817k596k266K857k880m142j624o036J337p92l430j118K900J725
6891e381K334R809L191o535k132O14j441N79L778M225Q33l834K50N01j0007k845
6875f061l59m545R98N883Ql650K165Q318L476Q54m110L123N279N86l743n464O819
$$ plain form
6858 9577 5290 552 999 3684 2214 2122 1421 -2054 -1613 29 -385 -2841 -2277 1175 5645 3384 1367
6841 1367 7214 9974 4036 -483 -3875 -2462 2048 -3989 -6827 -8197 -6282 -8746 -3836 -1027 -13039
6826 -13039 -12300 -6780 -3955 -4950 -3087 -5066 -1129 4092 3704 5113 3783 695 4577 5412 3075 -3003
6810 -3003 1224 2099 3349 7801 4811 2112 8792 21109 19930 8197 2616 -835 -5815 -8145 -7628
6795 -7628 -890 -5466 -13826 -15969 -15970 -11659 -14732 -17884 -6011 8322 14708 16993 19555 12257 6389
6780 6389 -279 -2788 1112 -3483 -11425 -8861 -1019 802 3753 4736 2723 4633 3837 -1539 -3441
6765 -3441 -7633 -11598 -9951 -5081 -3905 4022 2141 -7471 -12590 -13529 -5897 -1649 -1613 2621 3018 -239
6749 -239 3231 1784 -3990 -6170 -8052 -10416 -5776 -3501 -1190 -240 -1595 -445 -4059 297 1374
$$ packed form
6858I577m287m738M47K685j470r2p01l475M41J642m14k456N64L452M470k261k017
6841A367N847K760n938m519l392J413M510o037k838j370J915k464M910K809j2012
6826a3039P39N520K825r95J863j979L937N221l88J409j330l088L882Q35k337o078
6810c003M227Q75J250M452k990k699O680J2317j179j1733n581l451m980k330N17
6795g628O738m576q360k143jM311l073l152J1873J4333O386K285K562p298n868
6780F389o668k509L900m595p942K564P842J821K951R83k013J910p96n376j902
6765c441m192l965J647M870J176P927j881r612n119r39P632M248L6M234L97l257
6749b39L470j447n774k180j882k364M640K275K311R50j355J150l614M356J077
$$ plain form
6734 1374 -2198 -5949 -3828 3707 674 -5224 -3702 -1744 1780 610 6295 8362 8594 10200 9082
6719 9082 11131 13358 13528 12745 12319 9449 1175 1909 5887 7987 8446 11152 8685 712 -1381 2691
6703 2691 3972 -1666 -6893 -5268 -1970 -2552 -3708 -2299 -3777 2452 5735 2714 3245 4974 4753 3781
6687 3781 2520 3175 2293 4332 3725 657 4973 6076 10086 2257 -5136 -12803 -13864 -10580 -1149 319
6671 319 -660 7236 8384 6486 3085 -811 -4100 -330 1691 2761 3313 3305 5728 3970 -1156 -2665
6655 -2665 -4352 -3246 -538 3047 1763 2014 3808 1664 1282 6954 5373 -2193 -7316 -5969 -1059
6640 -1059 60 -6736 -6588 -2596 -10215 -10260 -6458 -9341 -10691 -15204 -9999 -1296 -852 -1229 4571 -4636
6624 -4636 -13975 -16245 -9078 -5799 -5972 -11968 -13924 -15352 -14241 -10058 -5973 -4259 -4974 -8994 -11488
$$ packed form
6734A374l572l751K121P535l033n898J522J958L524j170N685K067K32J606j118
6719I082K049K227J70p83m26k870q274P34L978K100M59K706k467p973k093M072
6703B691J281n638n227J625L298n82j156J409j478O229L283l021N31J729k21r72
6687C781j261O55q82K039o07l068M316J103M010p829p393p667j061L284R431J468
6671C19r79P896J148j898l401l896l289L770K021J070N52qK423j758n126j509
6655b665j687J106K708L585j284K51J794k144l82N672j581p566n123J347M910
6640a059J119o796J48L992p619m5L802k883j350m513N205Q703M44l77N800r207
6624d636r339k270P167L279j73n996j956j428J111M183M085J714p15m020k494
$$ plain form
6609 -11488 -11042 -9360 27 2675 -1359 -3994 -7119 -7402 -10695 -6457 1935 -76 -1034 -2979 -5467
6594 -5467 -6681 -4220 -2160 -581 -3565 -11530 -5375 -1083 -3510 -5323 -8085 -4289 799 926 262
6579 262 -2906 -10624 -10245 -9530 -5816 324 2682 3382 1679 2534 5704 -2845 -2885 -3272 -3851 1002 -3053
6562 -3053 -4485 668 6562 13440 12491 8889 1772 -1831 -5013 -4777 -1839 -1049 -3878 -10232 -21996
6547 -21996 -24122 -10561 2038 2950 -175 -3443 -8385 -11881 -5540 -165 -2769 -7723 -11679 -11835 -4469
6532 -4469 -1649 469 371 -497 462 432 -537 2631 6125 6955 7516 9061 10170 7416 5784 1791 -3232
6515 -3232 -6391 -4158 -8458 -3839 -3859 -10303 -8104 4293 4904 -4614 -4503 -3256 -1218 -449 -3099 -587
6499 -587 -160 -30 275 -5199 -9401 -9535 -3519 3552 80 -1156 -571 -2005 -2989 -4983 135 2530 -4222
$$ packed form
6609a1488M46J682R387K648m034k635l125k83l293M238Q392k011r58j945k488
6594e467j214K461K060J579k984p965O155M292k427j813k762L796N088J27o64
6579B62l168p718L79P15L714O140K358P00j703Q55L170q549m0l87n79M853m055
6562c053j432N153N894O878r49l602p117l603l182K36K938P90k829o354j1764
6547b1996k126J3561J2599R12l125l268m942l496O341N375k604m954l956j56P366
6532d469K820K118r8q68R59l0r69L168L494Q30N61J545J109k754j632l993n023
6515c232l159K233m300M619k0o444K199J2397O11r518J11J247K038P69k650K512
6499e87M27J30L05n474m202j34O016P071l472j236N85j434r84j994N118K395o752
$$ plain form
6482 -4222 -4326 618 2715 -2331 -1326 84 -1899 -6666 -8566 -4989 -5399 -4418 -3034 -5098 -2854 -1276
6466 -1276 35 3575 -394 -9414 -8582 -4629 -140 1895 234 2241 350 -5428 -2782 -2383 -1973 -558
6450 -558 42 -2025 -5847 -3617 -3922 -3986 -5208 -2306 -5555 -5125 -7162 -7887 -6141 -6703 -3556 -1801 -3846
6433 -3846 2813 985 -999 -2883 -514 -1183 -3771 -3195 170 -1586 -6105 -2634 2993 5797 3780
6418 3780 5657 9636 14165 15194 8896 4176 -1622 -7403 -9509 -12454 -11343 -14633 -13269 -4123 -1972
6403 -1972 3083 -3336 -11948 -8454 -7142 -3941 -5963 -6027 -6550 -2726 286 1323 -20 4535 3841 5430
6387 5430 11570 7654 2088 -4219 -8612 -6657 -5965 -2044 -1022 -797 1848 11154 13587 9593 1326
6372 1326 -1327 -4847 -4563 -2696 -456 -818 -3139 -4784 -515 3234 2463 10434 4753 -4648 -8114 -4354
$$ packed form
6482d222j04M944K097n046J005J410j983m767j900L577m10R81J384k064K244J578
6466a276J311L540l969r020Q32L953M489K035j661K007j891n778K646L99M10J415
6450e58O00k067l822K230l05o4j222K902l249M30k037p25J746n62L147J755k045
6433c846O659j828j984j884K369o69k588N76L365j756m519L471N627K804k017
6418C780J877L979M529J029o298m720n798n781k106k945J111l290J364R146K151
6403a972N055o419q612L494J312L201k022o4n23L824L012J037j343M555o94J589
6387E430O140l916n566o307m393J955O92L921J022K25K645R306K433l994q267
6372A326k653l520K84J867K240l62k321j645M269L749p71P971n681r401l466L760
$$ plain form
6356 -4354 -1802 -1944 -2450 -2871 -5689 -2182 2060 9242 6840 985 -3730 -4115 -1872 -6797 -7172 -1868
6340 -1868 1984 12857 12831 9464 7678 6542 3383 1918 8142 6935 707 -753 -2949 -7645 -11847
6325 -11847 -8487 -10174 -11022 -10372 -9395 -3852 -4377 -11513 -14872 -8412 -2385 -969 -3076 2365 10107 3072
6309 3072 -2457 -3335 1985 8905 12533 11996 3717 -1917 -3931 -1722 -246 1272 2194 3636 2853 -64
6293 -64 -8698 -9026 -4521 1267 -2131 -517 4685 5755 3494 5970 7350 2985 -6735 -8214 -9783 -14229
6277 -14229 -21491 -25974 -21278 -14662 -15451 -8718 4799 5238 -2898 -9917 -9281 -8887 -6878 -5616 -6101 -6454
6261 -6454 2828 6365 3396 4559 5057 -268 -7470 -5719 -188 -964 -5521 -257 7847 8083 1660 2868
6245 2868 5799 6230 5078 5739 1050 1468 44 -3531 -589 1502 -2214 1663 5021 610 -2920 -6827
$$ packed form
6356d354K552j42n06m21k818L507M242P182k402n855m715l85K243m925l75N304
6340a868L852J0873k6l367j786j136l159j465O224j207o228j460k196m696m202
6325a1847L360j687q48O50R77N543n25p136l359O460O027J416k107N441P742p035
6309C072n529q78N320O920L628n37q279n634k014K209J476J518R22J442p83k917
6293f4q634l28M505N788l398J614N202J070k261K476J380m365r720j479j569m446
6277a4229p262m483M696O616p89O733J3517M39q136p019O36L94K009J262m85l53
6261f454R282L537k969J163M98n325p202J751N531p76m557N264Q104K36o423J208
6245B868K931M31j152O61m689M18j424l575K942K091l716L877L358m411l530l907
$$ plain form
6229 -6827 -8551 -8142 -10158 -10813 -5792 -7327 -12368 -10497 -3077 2398 5744 6893 5227 -320 -902 2117
6213 2117 4750 -2458 -9993 -9206 -8132 -5460 -3424 -5712 -7184 -5591 -2275 -2947 -4554 -6431 2640
6198 2640 -10 -4366 -7262 -6511 -4301 -9461 -6465 1792 -840 -614 1914 -2123 1138 4106 4380 -2903
6182 -2903 -7786 -11482 -13949 -4904 -5236 -4831 -3265 -3172 -738 -1494 -1298 -8122 -15952 -12980 -8113 -4482
6166 -4482 737 1298 2620 10348 14488 11673 7587 5068 8567 3664 1667 -4842 -7203 -8211 -4617
6151 -4617 -3944 -299 4076 3497 -2639 -4190 -6 9210 8835 6081 8159 6701 4875 2642 517 3533
6135 3533 5671 -852 -4203 -1141 -5321 -3935 -4142 -3985 -147 7222 6348 -322 -6635 -7628 -5970 -4355
6119 -4355 -2996 -3219 -517 3194 3884 1351 -6726 -6018 -2493 -3093 -4873 -1611 9310 11703 7986 2952
$$ packed form
6229f827j724M09k016o55N021j535n041J871P420N475L346J149j666n547n82L019
6213B117K633p208p535P87J074K672K036k288j472J593L316o72j607j877R071
6198B640k650m356k896P51K210n160K996Q257k632K26K528m037L261K968K74p283
6182b903m883l696k467R045l32M05J566R3K434p56J96o824p830K972M867L631
6166d482N219N61J322P728M140k815m086k519L499m903j997o509k361j008L594
6151d617O73L645M375n79o136j551M184R216l75k754K078j458j826k233k125L016
6135C533K138o523l351L062m180J386k07J57L838P369q74o670o313r93J658J615
6119d355J359k23K702L711O90k533q077P08L525o00j780L262J0921K393l717n034
$$ plain form
6103 2952 -3828 -3861 -1737 60 1234 1539 -842 -3734 -6079 852 1286 -9994 -10470 -6299 -4182 1313
6087 1313 3559 1736 -1721 -6571 -6436 -8273 -8021 -5914 -4108 -53 4842 2140 1132 -8754 -11829
6072 -11829 -15028 -12663 -9205 -7253 -9960 -8799 -6101 -3876 -7523 -3536 -4052 -3191 3874 9127 2094
6057 2094 -4292 -11989 -10809 -7728 -5146 -604 -1577 -6106 -6324 -2993 -311 63 1515 -79 -3380 -1061
6041 -1061 1877 6982 3345 -6468 -9506 -5473 -1321 702 5716 4090 5927 7053 5175 1149 4072
6026 4072 6037 4938 6752 11044 8838 2649 4792 5617 1435 -2586 -10958 -10687 -4556 -6697 -6344 -8281
6010 -8281 -7385 -4671 -2385 -1455 -141 1338 -887 384 -1916 -1642 -1584 -11218 -7771 -4581 -7189 -7996
5994 -7996 127 4891 6651 1707 -6312 -8205 -7502 -6846 -2134 631 -6420 -11134 -2941 1237 2029 3678
$$ packed form
6103B952o780l3K124J797J174L05k381k892k345O931M34j1280m76M171K117N495
6087A313K246j823l457m850J35j837K52K107J806M055M895k702j008r886l075
6072a1829l199K365L458J952k707J161K698K225l647L987n16Q61P065N253p033
6057B094o386p697J180L081K582M542r73m529k18L331K682L74J452j594l301K319
6041a061K938N105l637r813l038M033M152K023N014j626J837J126j878m026K923
6026D072J965j099J814M292k206o189K143Q25m182m021q372K71O131k141L53j937
6010h281Q96K714K286R30J314J479k225J271k300K74N8r634L447L190k608q07
5994g996Q123M764J760m944q019j893P03O56M712K765p051m714Q193M178P92J649
$$ plain form
5978 3678 3747 -1703 -247 1201 70 -1068 -3679 -5241 -4471 -5642 -8436 -4448 2192 1 -2789 -28
5962 -28 65 -2125 -146 1040 1006 -2187 -1402 -511 6140 3151 -3136 1146 243 -2469 962 5141 5245
5945 5245 5734 326 1538 -1759 -2596 554 869 3592 3787 -5762 -9804 -4457 -4381 -5665 -6962 -4060
5929 -4060 -1121 2928 4057 2541 -1781 -5458 -456 1551 326 -5724 -4807 -1333 -345 -1874 1405
5914 1405 -3824 -15971 -15741 -9655 -9403 -2361 -4234 -7069 -2292 422 1037 -4179 -3604 3383 66 1470
5898 1470 -2939 -1237 2407 4377 1426 -3080 -8075 -8557 -3108 -898 3953 10109 10088 714 891 2665
5882 2665 4859 3893 4695 1663 5727 4775 6406 5375 8278 10841 8323 2026 977 992 -1617 1017
5866 1017 146 2941 5542 5630 4006 3089 4750 4585 -2470 593 402 -4982 -7107 -8441 -3611 -946
$$ packed form
5978C678O9n450J456J448j131j138k611j562P70j171k794L988O640k191k790K761
5962b8R3k190J979J186l4l193P85Q91O651k989o287M282r03k712L431M179J04
5945E245M89n408J212l297q37L150L15K723J95r549m042N347P6j284j297K902
5929d060K939M049J129j516m322l677N002K007j225o050R17L474R88j529L279
5914A405n229j2147K30O086K52P042j873k835M777K714O15n216N75O987l317J404
5898A470m409J702L644J970k951m506m995m82N449K210M851O156k1r374J77J774
5882B665K194r66Q02l032M064r52J631j031K903K563k518o297j049J5k609K634
5866A017q71K795K601Q8j624r17J661j65p055L063j91n384k125j334M830K665
$$ plain form
5850 -946 -4928 -11945 -6338 4227 8645 2548 -977 -3209 4746 5663 -975 -1464 -766 -4796 -13015 -14160
5834 -14160 -12569 -7613 -7495 -6698 -7927 -7193 -8866 -9192 -5395 -1315 -736 1458 -979 -3187 -10678 -13357
5818 -13357 -11932 -9235 -4642 -2831 -4013 -2914 -937 1522 -704 -5984 -8040 -6400 -3918 -3755 -4699
5803 -4699 -2455 -2129 -8949 -11036 -4094 73 93 -4405 -210 -708 -3174 -5313 -10599 -16350 -9827 -8620
5787 -8620 -5285 -2695 255 826 -1433 5120 5850 720 -2456 -2738 -2816 -6530 -7864 -2953 -6174 -8093
5771 -8093 -3668 -2480 -9017 -14285 -12411 -7519 -2800 1614 -2442 -7599 -5442 -2640 -1502 -2651 -6179
5756 -6179 -3825 -3128 -6024 -6234 -11707 -11741 -8689 -704 -2539 -4487 2047 2965 346 -4168 -6832 -2880
5740 -2880 -1024 -5727 -2642 -659 -1847 -497 -1507 -4859 -8158 -9184 -6812 -3484 -5630 -4475 -2093
$$ packed form
5850i46l982p017N607J0565M418o097l525k232P955R17o638m89O98m030q219j145
5834a4160J591M956J18P97j229P34j673l26L797M080N79K194k437k208p491k679
5818a3357J425K697M593J811j182J099J977K459k226n280k056J640K482J63r44
5803d699K244L26o820k087O942M167K0m498M195m98k466k139n286n751O523J207
5787h620L335K590K950N71k259O553P30n130l176k82p8l714j334M911l221j919
5771h093M425J188o537n268J874M892M719M414m056n157K157K802J138j149l528
5756f179K354O97k896k10n473l4L052P985j835j948O534R18k619m514k664L952
5740b880J856m703L085J983j188J350j010l352l299j026K372L328k146J155K382
$$ plain form
5725 -2093 -3327 -1468 -4232 -7501 -6832 1444 2525 -3503 -5907 -4281 -2928 -4940 140 1459 1983
5710 1983 1912 4560 -3206 -5636 -6024 -12526 -16039 -15010 -1683 3934 3579 -397 -39 597 -5425 -7094
5694 -7094 -3109 -512 3934 7751 2563 -6596 -11855 -10677 -6519 -5716 -1319 1535 -4061 -2132 -3116
5679 -3116 -7656 -9077 -7963 -4561 -3751 -7438 -4522 744 4501 7433 6489 4940 6551 6333 3207 -3840
5663 -3840 -9418 -11385 -5594 -2977 -8082 -4993 -7301 -10160 -7739 -3016 -824 2620 -516 -1081 -1735
5648 -1735 -1930 1200 602 -3604 -8510 -7468 -5921 -4525 145 -2222 -1461 301 -7089 -9917 -4462 -6910
5632 -6910 -13925 -10784 -8180 -4049 -23 2072 -2450 -3370 -4745 -3883 1052 484 6068 4217 4684 3490
5616 3490 881 -9194 -15601 -12352 -4654 -3693 69 2775 2901 1914 -607 1557 -838 -2009 3109
$$ packed form
5725b093j234J859k764l269O69Q276J081o028k404J626J353k012N080J319N24
5710A983p1K648p766k430l88o502l513J029J3327N617l55l976L58O36o022j669
5694g094L985K597M446L817n188r159n259J178M158Q03M397K854n596J929r84
5679c116m540j421J114L402Q10l687K916N266L757K932r44j549J611k18l126p047
5663c840n578j967N791K617n105L089k308k859K421M723K192L444l136n65o54
5648a735j95L130n98m206m906J042J547J396M670k367P61J762p390k828N455k448
5632f910p015L141K604M131M026K095m522r20j375Q62M935n68N584j851M67j194
5616C490k609j0075o407L249P698R61L762K706J26r87k521K164k395j171N118
$$ plain form
5601 3109 5608 -3032 -3796 -4095 -5932 -8672 -10109 -9146 -10823 -6094 187 -2158 -3658 -1206 2962 -1252
5585 -1252 -5707 -8905 -8824 -3348 -1587 -1992 -772 -20 -8941 -8494 -9994 -7550 12 -631 2921 6446
5569 6446 4866 -1056 -3669 785 5549 3407 667 -1984 -3531 -2439 1412 2486 2257 2149 3820
5554 3820 -1664 -7765 -7567 -2620 -4248 -6000 -4850 -800 6150 4444 1849 -1831 -3406 -4583 -5423
5539 -5423 -7654 -9635 -13546 -17144 -18914 -7803 3498 6090 207 -4471 -7136 -719 1181 9844
5525 9844 10749 5169 1012 -4235 -6281 -5134 2816 5364 4394 842 2464 3354 -70 1324 -537 -6313
5509 -6313 -11932 -14388 -11528 -5861 165 2157 -280 36 3784 2668 -2641 -2831 -3629 -5876 -6816 -10603
5493 -10603 -20681 -23988 -20762 -18343 -16775 -12636 -12552 -10155 -3702 5715 5874 6750 6371 2458 -6331 -8664
$$ packed form
5601C109K499q640p64k99j837k740j437R63j677M729O281k345j500K452M168m214
5585a252m455l198Q1N476J761m05J220P52q921M47j500K444P562o43L552L525
5569F446j580n922k613M454M764k142k740k651j547J092L851J074k29j08J671
5554C820n484o101J98M947j628j752J150M050O950j706k595l680j575j177q40
5539e423k231j981l911l598j770J1111J1301K592n883m678k665O417J900Q663
5525I844R05n580m157n247k046J147P950K548r70l552J622Q90l424J394j861n776
5509f313n619k456K860N667O026J992k437L16L748j116n309j90p98k247r40l787
5493a0603j0078l307L226K419J568M139Q4K397O453R417J59Q76l79l913q789k333
$$ plain form
5477 -8664 -11736 -12248 -3116 2619 6942 6771 6964 7356 6723 1444 -925 -6747 -8007 -6344 -10172 -10257 -8724
5460 -8724 2159 7360 3648 -3495 -4909 -4936 -3275 -202 1521 2920 1741 -2459 -8585 -9501 -12333
5445 -12333 -10500 -6830 -3659 -4789 -2107 -7987 -9596 -11926 -8873 -7972 -9389 -4657 -2815 -426 3344
5430 3344 10475 14644 9722 11142 11608 5817 361 -2216 -8995 -14104 -12521 -6569 2322 1152 -4809
5415 -4809 250 2203 -4944 -7943 -8280 -12895 -12106 -4865 -1047 -1268 -5331 -11792 -11393 -7302 -1030 -284
5399 -284 -4964 -4391 -4481 -5274 -1973 5470 11883 16619 13146 7654 2471 2445 769 -1539 1878 4263 4846
5382 4846 6049 2651 2522 430 -3540 -7339 -8236 -12518 -8998 -1630 -1512 -3748 -1583 -962 962 1877
5366 1877 4813 2554 -5185 -10162 -6609 -9161 -5634 -2508 1976 6867 4422 -1538 -1203 -1175 -2393 -3045
$$ packed form
5477h664l072n12R132N735M323j71J93L92o33n279k369n822j260J663l828q5J533
5460h724J0883N201l712p143j414k7J661L073J723J399j179m200o126r16k832
5445a2333J833L670L171j130K682n880j609k330L053R01j417M732J842K389L770
5430C344P131M169m922J420M66n791n456k577o779n109J583N952Q891j170n961
5415d809N059J953p147k999l37m615P89P241L818k21m063o461L99M091O272P46
5399b84m680N73r0p93L301P443O413M736l473n492n183k6j676k308L417K385N83
5382D846J203l398j29k092l970l799q97m282L520P368J18k236K165O21J924R15
5366A877K936k259p739m977L553k552L527L126M484M891k445n960L35K8j218o52
$$ plain form
5350 -3045 -7849 -4237 2591 7108 1089 -5901 -12342 -8276 735 -3348 -5737 -3920 1649 3367 -927
5335 -927 -1133 2183 6815 1442 -1425 -1303 179 -1688 2143 6621 7572 282 -1833 -676 1641 943
5319 943 -879 -4071 -6644 -4017 -7257 -3623 -6724 -11137 -11774 -8213 3 -1938 -5324 -7509 -1719
5304 -1719 -515 -3041 1822 3373 -661 -4010 -449 -6119 -9437 -7201 -5697 -5554 -2782 -1863 4065
5289 4065 2039 -3812 -4449 -3592 -4624 -11248 -9942 -6112 -5236 -1010 3231 -391 -4142 -5655 -7745 -7915
5273 -7915 -4111 -6294 -2051 1628 1369 6206 1964 -2313 -3065 -5949 -1192 1998 -6731 -8789 -8459 -10453
5257 -10453 -12264 -5785 -7294 -3275 289 -2185 1904 4226 1 -8346 -8641 -12080 -9935 -7402 -7246
5242 -7246 -10218 -13643 -10385 -6816 -3455 -1557 -5812 -2332 -1057 4142 8734 7988 789 -3599 -3760
$$ packed form
5350c045m804L612O828M517o019o990o441M066R011m083k389J817N569J718m294
5335i27k06L316M632n373k867J22J482j867L831M478R51p290k115J157K317o98
5319I43j822l192k573K627l240L634l101m413o37L561Q216j941l386k185N790
5304a719J204k526M863J551m034l349L561n670l318K236J504J43K772R19N928
5289D065k026n851o37Q57j032o624J306L830Q76M226M241l622l751j513k090j70
5273g915L804k183M243L679k59M837m242m277p52k884M757L190q729k058L30j994
5257a0453j811O479j509M019L564k474M089K322m225q347k95l439K145K533J56
5242g246k972l425L258L569L361J898m255L480J275N199M592p46p199m388j61
$$ plain form
5227 -3760 841 3615 8133 10545 7204 -3438 -2012 1215 5432 2015 1440 5011 124 -3958 -3274
5212 -3274 -2891 -5910 -10720 -15198 -13642 -18516 -15833 -7898 -11820 -10690 -3657 -711 -996 -513 -1535 -3538
5196 -3538 -7623 -10919 -12771 -13369 -11426 -11731 -14444 -9285 -7990 -5434 -926 -3079 -3925 -1225 -6345 -2666
5180 -2666 1879 3008 3368 4152 129 -5583 -8534 -851 2612 1783 -946 -1665 -326 1275 5429 -1144
5164 -1144 -4405 419 4585 3290 2319 2498 -1059 -7090 -8751 -8318 -8376 -8223 -4449 -8712 -10671 -6374
5148 -6374 -4354 -2965 -6145 -10984 -15865 -12865 -9069 -6986 -11668 -14040 -6964 -7616 -5718 -8042 -8807
5133 -8807 -11989 -14178 -9956 -3785 -2816 -2309 5954 4419 -78 1201 4172 9107 7801 -671 -2743
5118 -2743 -3211 -3498 -2558 -5129 -4722 1133 4353 1941 2697 7529 4066 -6526 -12029 -4479 -2038 -6761
$$ packed form
5227c760M601K774M518K412l341j0642J426L227M217l417n75L571m887m082O84
5212c274L83l019m810m478J556m874K683P935l922J130P033K946k85M83j022k003
5196c538m085l296j852n98J943l05k713N159J295K556M508k153q46K700n120L679
5180b666M545J129L60P84m023n712k951P683L463q29k729p19J339J601M154o573
5164a144l261M824M166j295r71J79l557o031j661M33n8J53L774m263j959M297
5148f374K020J389l180m839m881L000L796K083m682k372P076o52J898k324p65
5133h807l182k189M222O171R69N07Q263j535m497J279K971M935j306q472k072
5118b743m68k87R40k571M07N855L220k412P56M832l463j0592n503P550K441m723
$$ plain form
5102 -6761 -6885 -6083 -6604 -4326 -7887 -5386 -1663 -1571 -4508 -3199 -4412 -1427 -2385 -231 3696 -6340
5086 -6340 -16745 -16326 -16820 -15978 -11739 -10016 -11993 -16083 -18511 -19819 -17981 -18146 -20675 -17768 -8989 -11406
5070 -11406 -14118 -11973 -11691 -7654 127 186 -7343 -5158 -5674 -12226 -12723 -14597 -13390 -10899 -4358 -4428
5054 -4428 -13040 -14648 -14405 -12905 -13075 -8925 -8813 -2852 -1034 1799 2883 5458 2955 2857 -5505 -10503
5038 -10503 -16155 -8372 1377 7311 -123 -7469 -9007 -6970 -902 2961 6259 7085 7601 155 -2647
5023 -2647 -1010 -82 -669 -1686 -5860 -7364 -7700 -6544 -6303 -8285 -8478 -10965 -9092 -10772 -6009 -7202
5007 -7202 -9710 -6449 -7010 -8619 -4347 -3661 258 9110 6525 3999 4040 3000 1625 -3946 -3557 -418
4991 -418 1308 2753 588 -229 -666 -996 2428 -1533 -5324 -5539 -5524 -8907 -2714 7823 14204 13123
$$ packed form
5102f761j24Q02n21K278l561K501L723R2k937J309j213K985r58K154L927j0036
5086f340j0405M19m94Q42M239J723j977m090k428j308J838j65k529K907Q779k417
5070a1406k712K145K82M037P781N9p529K185n16o552m97j874J207K491O541p0
5054d428q612j608K43J500j70M150J12N961J818K833J084K575k503r8q362m998
5038a0503n652P783R749N934p434p346j538K037O068L863L298Q26N16p446k802
5023b647J637R28n87j017m174j504l36J156K41j982j93k487J873j680M763j193
5007g202k508L261n61j609M272O86L919Q852k585k526M1j040j375n571L89L139
4991d18J726J445k165q17m37l30L424l961l791k15J5l383O193J0537O381j081
$$ plain form
4975 13123 11184 4304 -559 -1307 -5137 -12776 -10500 -6624 -6362 -7630 -6893 -3165 33 1221 71
4960 71 657 -1360 -5154 -4977 -10576 -18714 -13599 -7020 1341 3824 956 -3913 -5243 -5595 -3362 -1577
4944 -1577 2553 2986 -616 2004 1417 692 2024 964 7223 5121 2992 815 5163 6287 7176 674
4928 674 -4327 -2923 -3261 -1915 -1211 -4315 -987 -4757 -7228 -1629 5149 6361 6789 7879 8895 10314
4912 10314 922 -6737 -8330 -5510 -322 -5120 -7736 -833 4712 2746 -573 2914 -644 -8069 -9233
4897 -9233 -5467 -1803 -105 -5721 -6552 -430 6706 2563 578 1471 3424 1311 -1793 -1091 -970 -2962
4881 -2962 -560 -5146 -6304 -3065 2663 5820 6208 13807 13787 10522 7977 3305 587 -686 -5228 -7320
4865 -7320 -5142 3706 4401 7795 9425 8831 1732 -310 984 375 -7204 -8123 -7635 -1764 654 2875
$$ packed form
4975A3123j939o880m863p48l830p639K276L876K62j268P37L728L198J188j150
4960G1N86k017l794J77n599q138N115O579Q361K483k868m869j330l52K233J785
4944a577M130M33l602K620n87p25J332j060O259k102k129k177M348J124Q89o502
4928F74n001J404l38J346P04l104L328l770k471N599O778J212M28J090J016J419
4912A0314r392p659j593K820N188m798k616O903N545j966l319L487l558p425j164
4897i233L766L664J698n616q31O122P136m143j985Q93J953k113l104P02J21j992
4881b962K402m586j158L239N728L157L88P599k0l265k545m672k718j273m542k092
4865g320K178Q848O95L394J630n94p099k042J294o09p579r19M88N871K418K221
$$ plain form
4849 2875 -5943 -12571 -4909 -8214 -9974 -9485 -6345 -4485 -4504 -3013 -993 2094 918 442 -5196 -3786
4833 -3786 -10283 -8238 -16757 -22427 -18894 -17403 -9074 -2067 -6422 -5442 -6049 -9923 1077 8057 4548
4818 4548 1629 443 2956 7696 1338 -3959 -3795 -2695 -307 -7655 -9269 -6509 -15 -2923 -8740
4803 -8740 -5718 -224 1490 -2684 -4430 -9830 -13478 -11857 -8463 -7767 -5165 -2814 5578 5996 2538
4788 2538 3981 4100 -1634 -10481 -12638 -8913 866 2638 -2515 -8887 -5846 -7068 -2065 -2080 -4518 -2864
4772 -2864 -7865 -11059 -7508 -8848 -9075 -6171 -6700 -7618 556 -1416 -6416 -11158 -9633 -5009 373 1661
4756 1661 -4941 2143 2643 3127 -1820 -903 1685 -395 761 -3096 -6732 -7956 -7244 -5002 -998 -1632
4740 -1632 -5849 -8472 -5228 -5104 -4763 -5033 -2379 1694 -385 -2169 514 -471 -1045 694 -259 443 635
$$ packed form
4849B875q818o628P662l305j760M89L140J860j9J491K020L087j176m76n638J410
4833c786o497K045q519n670L533J491Q329P007m355R80o07l874J1000O980l509
4818D548k919j186K513M740o358n297J64J100K388p348j614K760O494k908n817
4803h740L022N494J714m174j746n400l648J621L394O96K602K351Q392M18l458
4788B538J443J19n734q847k157L725R779J772n153o372L041j222N003j5k438J654
4772b864n001l194L551j340k27K904n29r18Q174j972n000m742J525M624N382J288
4756A661o602P084N00M84m947R17K588k080J156l857l636j224P12K242M004o34
4740a632m217k623L244J24L41k70K654M073k079j784K683r85n74J739r53P02J92
$$ plain form
4723 635 -2958 -7211 -4355 4144 3178 -191 -3720 -3230 -401 2853 29 -5207 1813 2626 -7148 -4014
4707 -4014 6041 4814 4364 -351 -7579 -9981 -4478 4363 13668 10068 3668 1764 3203 4675 8413
4692 8413 5936 1646 24 1635 -1628 -519 4064 -3786 -2632 1824 3459 -953 5451 10348 13201
4677 13201 6299 -801 -1442 1996 -10268 -15097 -3019 2120 -4544 -6421 2552 487 -356 -762 2320
4662 2320 13573 11419 5023 2547 3438 2127 5655 6800 3312 2978 4253 2412 -4977 -7391 -6726
4647 -6726 -5644 -8273 -6031 -2398 -1889 6537 10852 5432 1155 5822 6744 10562 7173 -1508 -2851
4632 -2851 -4124 -7058 -10387 -9179 1109 5752 3412 -753 -5875 -8382 -3719 -6598 -2423 -3062 -4513
4617 -4513 -10845 -7019 1450 337 -4106 -1638 -7161 -11046 -13205 -4453 296 -2617 -3134 -1154 3900
$$ packed form
4723F35l593m253K856Q499r66l369l529M90K829L254k824n236P020Q13r774L134
4707d014J0055j227m50m715p228k402N503Q841R305l600o400j904J439J472L738
4692H413k477m290j622J611l263J109M583p850J154M456J635m412O404M897K853
4677A3201o902p100o41L438j2264m829J2078N139o664j877Q973k065q43m06L082
4662B320J1253k154o396k476Q91j311L528J145l488l34J275j841p389k414O65
4647f726J082k629K242L633N09Q426M315n420m277M667R22L818l389q681j343
4632b851j273k934l329J208J0288M643k340m165n122k507M663k879M175o39j451
4617d513o332L826Q469j113m443K468n523l885k159Q752M749k913n17J980N054
$$ plain form
4602 3900 1994 2635 2481 661 1562 4116 6474 2042 20 -198 4177 3498 -1412 410 2377 -1134
4586 -1134 -8674 -6651 -4746 -7599 -10270 -12387 -10684 -7161 -3327 -6004 -4197 -2413 302 -159 -916
4571 -916 878 -1286 -1281 2388 4029 1247 628 -94 -911 -3176 -5930 -3805 -3036 -6133 550 5920 8525
4554 8525 7589 5724 1297 -3103 613 1570 -4289 -5913 -9002 -9694 -7089 -670 1881 -7168 -12363 -10273
4538 -10273 -5949 -6963 -15447 -16602 -12406 -7059 -6306 -2295 -2401 -4185 3056 7617 7158 1899 1545 5628
4522 5628 6826 3034 -3385 -722 394 1730 -320 -422 397 1032 -766 -9578 -11841 -8045 -2432 -825
4506 -825 3697 3465 2380 2955 -3938 -9701 -9802 -6963 -4119 3795 5154 1186 -4714 -3654 127 -3501
4490 -3501 -13055 -10174 -4922 -7201 -1233 1321 -1751 -1090 -2975 -5647 -3714 -13551 -13346 -10544 -4630
$$ packed form
4602C900j906O41j54j820R01K554K358m432k022k18M375o79m910J822J967l511
4586a134p540K023J905k853k671k117J703L523L834k677J807J784K715m61p57
4571i16J794k164NL669J641k782o19p22q17k265k754K125P69l097O683N370K605
4554H525r36j865m427m400L716R57n859j624l089o92K605O419K551r049n195K090
4538a0273M324j014q484j155M196N347P53M011j06j784P241M561m59n259l54M083
4522E628J198l792o419K663J116J336k050j02Q19O35j798q812k263L796N613J607
4506h25M522k32j085N75o893n763j01K839K844P914J359l968n900J060L781l628
4490c501r554K881N252k279N968K554l072O61j885k672J933r837K05K802N914
$$ plain form
4475 -4630 -2609 -2289 -3039 -817 3170 2370 -3852 -10236 -8814 -4861 -5578 -6419 -6776 -6824 -4145 92 -6621
4458 -6621 -6599 -717 617 -2506 360 -1882 -9823 -9978 -346 139 2835 2177 2521 1593 2221 -1177 -5471
4441 -5471 -4387 -1489 -155 1305 1656 438 -5455 -8590 -4933 6527 6542 1745 679 2496 4126
4426 4126 4885 9404 6270 -4243 -8461 -4908 -5748 -2574 -4883 -6691 -5622 -5255 -4523 -1786 -2830 -2546
4410 -2546 850 5902 13385 10575 2514 -1955 -146 4161 6942 8131 4681 1719 1218 633 -2827
4395 -2827 1287 5947 5670 4860 4580 -690 -3581 -4714 -6534 -4850 -2647 -11308 -14245 -10140 -6607 -461
4379 -461 4066 367 4731 7126 6799 5620 2558 4345 2966 -2922 2746 3553 -2236 1588 9493 9096
4363 9096 6743 2461 3704 4033 -621 1264 3728 4033 1517 -1139 -2127 -826 2806 2664 6387 6800
$$ packed form
4475d630K021L20p50K222L987q00o222o384J422L953p17q41l57m8K679M237o713
4458f621K2N882J334l123K866k242p941j55R632M85K696o58L44r28O28l398m294
4441e471J084K898J334J460L51j218n893l135L657J1460J5m797j066J817J630
4426D126P59M519l134j0513m218L553q40L174k309j808J069L67P32K737j044K84
4410b546L396N052P483k810q061m469J809M307K781J189l450k962n01n85l460
4395b827M114M660k77q10k80n270k891j133j820J684K203q661k937M105L533O146
4379d61M527l699M364K395l27j179l062J787j379n888N668Q07n789L824P905l97
4363I096k353m282J243L29m654J885K464L05k516k656r88J301L632j42L723M13
$$ plain form
4347 6800 1355 -146 522 7104 13445 13428 12721 8630 1620 947 7163 -1611 -6011 -3376 -5415 -15242
4331 -15242 -18020 -10131 -10160 -8140 -955 -4083 -907 3989 5896 826 -3368 -10153 -11548 -6623 -2187
4316 -2187 1517 5000 2927 5664 9413 7152 1016 2963 7444 3105 174 -1293 -1842 -4665 -6420
4301 -6420 3120 11430 6618 792 1730 3513 4122 4359 -1975 -1539 3470 2949 -5539 -1256 -1831 -5633
4285 -5633 -10695 -10972 -9433 -6905 -3139 -7052 -7773 -10211 -7209 -12592 -13698 -8837 -1766 952 -7474
4270 -7474 -11356 -6676 -4516 -2141 -4367 -6339 -5445 593 2170 2301 3510 30 -3936 -1908 -9228
4255 -9228 -8141 -2659 -2905 -2151 -7563 -2899 -6001 -6766 -2727 -2354 -4213 -5342 -4189 -3615 -11829 -16999
4239 -16999 -11219 -5187 2773 7218 5030 3406 3573 -4129 -9010 -4723 429 2103 -547 -1553 -1933
$$ packed form
4347F800n445j501O68O582O341j7p07m091p010o73O216q774m400K635k039r827
4331a5242k778P889k9K020P185l128L176M896J907n070m194o785j395M925M436
4316b187L704L483k073K737L749k261o136J947M481m339k931j467n49k823j755
4301f420R540Q310m812n826R38J783O09K37o334M36N009n21q488M283n75l802
4285e633n062k77J539K528L766l913p21k438L002n383j106M861P071K718q426
4270g474l882M680K160K375k226j972Q94O038J577J31J209l480l966K028p320
4255i228J087N482k46P54n412M664l102p65M039L73j859j129J153N74q214n170
4239a6999N780O032P960M445k188j624J67p702m881M287N152J674k650j006l80
$$ plain form
4224 -1933 -1361 -7143 -5307 -1814 -1188 1950 -1909 2147 4657 6574 2623 -1778 3370 1980 2828 4950
4208 4950 4677 863 -6429 -5247 -5663 -7771 -9435 -9627 -10778 -9446 -8376 -4799 -5977 -6644 -4504 -2148
4192 -2148 892 1360 2176 -1776 -2136 -3611 -2816 484 1757 50 -6783 -8920 -5984 -8518 -10344 -728
4176 -728 -1790 -5631 -6509 -9640 -12191 -12663 -14326 -15106 -10754 -11860 -14998 -15925 -9744 -5172 -3130 -3857
4160 -3857 -6429 -4515 239 946 3848 2382 -2943 -3334 -758 1810 494 -3934 -4134 2303 3399 228
4144 228 -2178 1398 5257 -1004 1316 917 931 -338 -581 7898 9198 14357 14695 9305 9861 13795 14034
4127 14034 10963 6081 -749 -7184 -5888 -1532 -5028 -8214 -4955 2519 3548 -1481 -5023 -4753 -3185
4112 -3185 -2449 -2609 -2022 1823 25 -1639 -1421 9728 9504 5050 3390 9712 9163 8573 5189 1522
$$ packed form
4224a933N72n782J836L493O26L138l859M056K510J917l951m401N148j390Q48K122
4208D950k73l814p292J182m16k108j664j92j151J332J070L577j178o67K140K356
4192b148L040M68Q16l952l60j475P95L300J273j707o833k137K936k534j826R616
4176g28j062l841q78l131k551m72j663p80M352j106l138r27O181M572K042p27
4160c857k572J914M754P07K902j466n325l91K576K568j316m428k00O437J096l171
4144B28k406L576L859o261K320l99J4j269k43Q479J300N159L38n390N56L934K39
4127A4034l071m882o830o435J296M356l496l186L259P474J029n029l542K70J568
4112c185P36j60N87L845j798j664K18J1149k24m454j660O322n49n90l384l667
$$ plain form
4096 1522 -3159 -1521 1664 6237 6776 4838 3799 3272 -990 3029 8817 9899 2543 -6901 -2530
4081 -2530 -506 -801 -6847 -9679 -4084 1297 2292 -4896 -13138 -14487 -16455 -12268 -7424 -8104 -11092 -14308
4065 -14308 -13196 -9754 -9248 -7656 -9804 -11016 -8899 -7913 -6592 4329 12999 13697 5882 2541 748
4050 748 1634 4159 3890 3238 5525 6298 3173 -2097 -2103 -2549 -5748 -6874 -4244 -515 4499 4519 2682 3619
4032 3619 1739 8745 10162 8470 7341 2544 2549 -3248 -10554 -4337 -1831 -3105 -4354 -3703 1854 10643
4016 10643 10598 7580 6611 5353 2054 4200 7505 4410 -2531 3151 -70 1801 591 -1638 6996
4001 6996 11322 8892 6040 795 -4881 -11449 -12075 -6605 -9762 -11680 -3533 4242 -3090 -4589 1642
3986 1642 3271 731 -2480 -2956 2010 1512 -3695 -10328 -15252 -12829 -6531 49 -5592 -6407 -4048 -2644
$$ packed form
4096A522m681J638L185M573N39j938j039n27m262M019N788J082p356r444M371
4081b530K024k95o046k832N595N381R95p188q242j349j968M187M844o80k988l216
4065a4308J112L442N06J592k148j212K117R86J321J0921Q670O98p815l341j793
4050G48Q86K525k69o52K287P73l125n270om46l199j126K630L729N014K0j837R37
4032C619j880P006J417j692j129m797Nn797p306O217K506j274j249O51N557Q789
4016A0643m5l018r69j258l299K146L305l095o941N682l221J871j210k229Q634
4001F996M326k430k852n245n676o568o26N470l157j918Q147P775p332j499O231
3986A642J629k540l211m76M966m98n207o633m924K423O298O580n641q15K359J404
$$ plain form
3970 -2644 -964 -2706 -1625 2710 4421 2628 -3874 -12102 -11585 -8395 -3978 -1548 -102 -2845 3345
3955 3345 7755 12316 5290 -2876 -4704 -2994 992 8125 9755 10838 7983 -858 -2307 -118 508
3940 508 995 1602 5131 1108 -2027 -4418 -4414 -5168 -3911 -1781 -3306 2440 3112 -6300 -13204 -7419 -12552
3923 -12552 -16538 -12586 -12295 -10170 -8991 -13068 -10312 -7319 -8518 -10445 -13433 -12378 -13955 -6597 1623
3908 1623 7352 2362 -587 1839 113 2250 46 -28 7529 8743 7588 -2591 1886 6424 3841
3893 3841 -3158 -4214 -5023 -10861 -9832 -6901 -6312 -7014 -3979 -2469 -2326 -3262 -4047 -2706 783 2940
3877 2940 2036 -4916 -6601 -4354 4015 6933 4988 -3599 -10616 -5403 4857 1242 1043 2535 3911
3862 3911 -4310 -8813 -7563 -6833 -1319 3675 4930 2583 2646 602 2057 -4581 -6572 -5744 -3966 2246
$$ packed form
3970b644J680j742J081M335J711j793o502q228N17L190M417K430J446k743O190
3955C345M410M561p026q166j828J710L986P133J630J083k855q841j449K189O26
3940E08M87O07L529m023l135k391Mp54J257K130j525N746O72r412o904N785n133
3923a2552l986L952K91K125J179m077K756K993j199j927k988J055j577P358Q220
3908A623N729m990k949K426j726K137k204p4P557J214j155j0179M477M538k583
3893C841o999j056q09n838J029K931N89p02L035J510J43r36p85J341L489K157
3877B940r04o952j685K247Q369K918j945q587p017N213J0260l615j99J492J376
3862C911q221m503J250P30N514M994J255k347O3k044J455o638j991Q28J778O212
$$ plain form
3846 2246 2538 5954 2189 807 1812 1853 1888 3673 8324 2958 6333 1233 1764 1820 6351 5337 2919
3829 2919 4048 7175 6828 3048 2383 -318 -3147 5486 4358 230 3831 11554 13214 10705 9208
3814 9208 9365 4068 10203 4341 1606 3950 2076 -44 -1430 1828 -2180 -2631 -323 472 4961 5268
3798 5268 974 -687 -4397 -5298 1916 2869 1370 167 -1031 933 3251 1436 5386 3408 3192 1907
3782 1907 3877 1785 2341 -1260 4446 4268 -3475 -6687 -5847 -2169 1537 5907 1212 -5710 -10031 -7440
3766 -7440 -2654 -2466 255 3883 -921 -1125 -4645 -5008 -2130 -6693 -3888 60 1797 5768 3496 5478
3750 5478 6825 -25 -6180 -5741 -4229 -4061 -3758 -4079 -3408 -1650 4064 4239 1419 2979 -1508 -1286 -2779
3733 -2779 -7875 -7828 -10074 -10915 -11283 -11580 -4174 1694 1002 -454 2707 2905 3680 1229 316 4907 2874
$$ packed form
3846B246K92L416l765j382J005M1L5J785M651n366L375n100N31N6M531j014k418
3829B919J129L127l47l780o65k701k829Q633j128m128L601P723J660k509j497
3814I208J57n297O135n862k735K344j874k120j386L258m008m51K308P95M489L07
3798E268m294j661l710r01P214R53j499j203j198J964K318j815L950j978k16j285
3782A907J970k092N56l601N706j78p743l212Q40L678L706M370m695o922m321K591
3766g440M786J88K721L628m804k04l520l63K878m563K805L948J737L971k272J982
3750E478J347o850o155M39J512J68L03l21O71J758N714J75k820J560m487K22j493
3733b779n096M7k246q41l68k97P406N868o92j456L161J98P75k451r13M591k033
$$ plain form
3716 2874 4231 4357 4990 6792 3998 2961 8055 9793 227 -4001 -1694 4825 6814 2700 7217
3701 7217 6009 -7060 -14756 -9329 -2113 1074 -1809 -299 1223 -1753 1956 1365 -3787 -10169 -11648
3686 -11648 -11829 -17917 -17990 -12315 -3857 -234 3534 7133 9603 13159 13515 17025 18183 11675 3042 6584
3670 6584 8577 13249 11441 12739 14527 11875 8356 -847 -4705 1264 2672 4101 1390 929 808
3655 808 2024 -341 -2784 -7808 2371 7663 8609 8135 6015 6097 6043 3940 -2492 -2513 -4476 -4280 -3115
3638 -3115 -3564 -5073 73 6798 8986 8844 7420 9191 7187 2840 2855 2460 1108 6301 7453 1209
3622 1209 1566 3872 749 418 2477 -189 -360 -444 -4885 -5861 -1524 -4450 -8513 -6170 -5225 -2208 -5157
3605 -5157 -1575 5876 8163 8835 6313 3406 369 -107 -2055 -1188 -9904 -11660 -4978 85 578 -2312
$$ packed form
3716B874J357J26O33J802k794j037N094J738r566m228K307O519J989m114M517
3701G217j208j3069p696N427P216L187k883J510J522k976L709n91n152o382j479
3686a1648j81o088p3N675Q458L623L768L599K470L556L56L510J158o508q633L542
3670F584J993M672j808J298J788k652l519r203l858N969J408J429k711m61j21
3655H08J216k365k443n024J0179N292R46m74k120Q2n4k103o432k1j963J96J165
3638c115m49j509N146O725K188j42j424J771k004m347J5l95j352N193J152o244
3622A209L57K306l123l31K059k666j71q4m441r76M337k926m063K343R45L017k949
3605e157L582P451K287O72k522k907l037m76j948Q67q716j756O682N063M93k890
$$ plain form
3589 -2312 -2257 -4879 -7920 -10334 -8737 -1502 7335 14109 15834 10362 7871 10468 6248 148 794 -2348
3573 -2348 597 3938 -468 -3854 -1212 -3622 -8910 -7815 4326 3883 -5689 -8131 -7535 -6137 -1970
3558 -1970 -3852 -5844 -2211 -2812 1258 -1813 -5434 -1723 6632 9139 10721 8287 6736 2454 1603
$$ packed form
3589b312N5k622l041k414J597P235Q837O774J725n472k491K597m220o100O46l142
3573b348K945L341m406l386K642k410n288J095J2141m43r572k442N96J398M167
3558a970j882j992L633o01M070l071l621L711Q355K507J582k434j551m282q51
$$ [...]
##END NTUPLES=NMR SPECTRUM
##END=
