##TITLE=Analysis number 324396
Compound Code cc 39401
Project Code adrs
Chemist Name fudan
##JCAMPDX= 6.0         $$ Bruker NMR JCAMP-DX V2.0
##DATA TYPE= NMR SPECTRUM
##DATA CLASS= NTUPLES
##ORIGIN= Bruker BioSpin GmbH
##OWNER= nmr
$$ XWIN-NMR		Version 3.5
$$ Mon Nov 20 14:25:11 2006 GMT Standard Time (UT+0h)  MAYBRIDGE\nmr@NMR_250MHZ
##.OBSERVE FREQUENCY= 250.131544655141
##.OBSERVE NUCLEUS= ^1H
##.ACQUISITION MODE= SIMULTANEOUS (DQD)
##.ACQUISITION SCHEME= undefined
##.AVERAGES= 16
##.DIGITISER RES= 18
##SPECTROMETER/DATA SYSTEM= dpx250
##.PULSE SEQUENCE= zg30
##.SOLVENT NAME= DMSO
##.SHIFT REFERENCE= (INTERNAL, DMSO, 0, 16.522)
##AUDIT TRAIL= $$ (NUMBER, WHEN, WHO, WHERE, WHAT)
$$ ##TITLE= Audit trail, XWIN-NMR		Version 3.5
$$ ##JCAMPDX= 5.01
$$ ##ORIGIN= Bruker BioSpin GmbH
$$ ##OWNER= nmr
$$ C:\u/data/dgb/nmr/ADRS/700/pdata/1/auditp.txt
$$ ##AUDIT TRAIL=  $$ (NUMBER, WHEN, WHO, WHERE, WHAT)
(   1,<2006-11-20 14:24:45.04 +000>,<MAYBRIDGE\nmr>,<NMR_250MHZ>,
      <created by zg, POWCHK disabled, PULCHK disabled
       configuration hash MD5:
       49 4B E0 1D 92 C2 6B 37 9F E6 65 BC 52 41 86 1D
       data hash MD5: 64K
       FA B4 59 5A 7C 63 AC 83 FE 38 7C 01 D5 8A C7 A6>)
(   2,<2006-11-20 14:24:59.61 +000>,<MAYBRIDGE\nmr>,<NMR_250MHZ>,
      <Start of raw data processing
       ef LB = 0.3 FT_mod = 6 PKNL = 1 SI = 32K 
       data hash MD5: 32K
       91 1F A9 03 AC 85 45 84 CC BA 53 D7 7E 85 51 86>)
(   3,<2006-11-20 14:25:01.41 +000>,<MAYBRIDGE\nmr>,<NMR_250MHZ>,
      <apk 
       data hash MD5: 32K
       5D BE 66 B8 0C 37 E2 45 13 F0 9E A1 9F 00 F8 04>)
(   4,<2006-11-20 14:25:02.16 +000>,<MAYBRIDGE\nmr>,<NMR_250MHZ>,
      <abs ABSG = 5 
       data hash MD5: 32K
       5E 9A 7E 80 3B 4D 44 04 B4 F6 04 16 78 DD A3 F6>)
$$ ##END=
$$ 
$$ hash MD5
$$ 44 04 23 4B 95 E7 2C FA 5A 1E EB 62 B0 FE BC D4
##$RELAX= 
##$RELAX= 
##$RELAX= 
##$RELAX= 
##$RELAX= 
##$RELAX= 
##$RELAX= 
$$ Bruker specific parameters
$$ --------------------------
##$DU= <C:\u>
##$EXPNO= 700
##$NAME= <ADRS>
##$PROCNO= 1
##$TYPE= <nmr>
##$USER= <dgb>
##$AMP= (0..31)
100 100 100 100 100 100 100 100 100 100 100 100 100 100 100 100 100 100 
100 100 100 100 100 100 100 100 100 100 100 100 100 100 
##$AQSEQ= 0
##$AQ_mod= 3
##$AUNM= <au_zg>
##$AUTOPOS= <23 >
##$BF1= 250.13
##$BF2= 250.13
##$BF3= 250.13
##$BF4= 250.13
##$BF5= 500.13
##$BF6= 500.13
##$BF7= 500.13
##$BF8= 500.13
##$BYTORDA= 1
##$CFDGTYP= 0
##$CFRGTYP= 5
##$CHEMSTR= <none>
##$CNST= (0..31)
1 1 145 1 1 1 1 1 1 1 1 1 1 1 1 1 1 1 1 1 1 1 1 1 1 1 1 1 1 1 1 1 
##$CPDPRG= <>
##$CPDPRG1= <>
##$CPDPRG2= <>
##$CPDPRG3= <>
##$CPDPRG4= <mlev>
##$CPDPRG5= <mlev>
##$CPDPRG6= <mlev>
##$CPDPRG7= <mlev>
##$CPDPRG8= <mlev>
##$CPDPRGB= <>
##$CPDPRGT= <>
##$D= (0..31)
0 1 0 0 0 0 0 0 0 0.06 0 0 0 0 0 0 0.0002 0 0 0 0 0 0 0 0 0 0 0 0 0 0 
0 
##$DATE= 1164032683
##$DBL= (0..7)
120 120 120 120 120 120 120 120 
##$DBP= (0..7)
150 150 150 150 150 150 150 150 
##$DBP07= 0
##$DBPNAM0= <>
##$DBPNAM1= <>
##$DBPNAM2= <>
##$DBPNAM3= <>
$$ [...]
##$SUBNAM7= <"">
##$SUBNAM8= <"">
##$SUBNAM9= <"">
##$SW= 20.6930455092707
##$SWIBOX= (0..15)
0 0 3 0 0 0 0 0 0 0 0 0 0 0 0 0 
##$SW_h= 5175.983436853
##$TD= 65536
##$TD0= 1
##$TE= 683.16
##$TE2= 300
##$TE3= 300
##$TEG= 300
##$TL= (0..7)
0 120 120 120 120 120 120 120 
##$TP= (0..7)
150 150 150 150 150 150 150 150 
##$TP07= 0
##$TPNAME0= <>
##$TPNAME1= <>
##$TPNAME2= <>
##$TPNAME3= <>
##$TPNAME4= <>
##$TPNAME5= <>
##$TPNAME6= <>
##$TPNAME7= <>
##$TPOAL= (0..7)
0.5 0.5 0.5 0.5 0.5 0.5 0.5 0.5 
##$TPOFFS= (0..7)
0 0 0 0 0 0 0 0 
##$TUNHIN= 0
##$TUNHOUT= 0
##$TUNXOUT= 0
##$USERA1= <user>
##$USERA2= <user>
##$USERA3= <user>
##$USERA4= <user>
##$USERA5= <user>
##$V9= 5
##$VALIST= <valist>
##$VCLIST= <CCCCCCCCCCCCCCC>
##$VD= 0
##$VDLIST= <DDDDDDDDDDDDDDD>
##$VPLIST= <PPPPPPPPPPPPPPP>
##$VTLIST= <TTTTTTTTTTTTTTT>
##$WBST= 1024
##$WBSW= 4
##$XGAIN= (0..3)
0 0 0 0 
##$XL= 0
##$YL= 0
##$YMAX_a= 418694
##$YMIN_a= -223382
##$ZGOPTNS= <>
##$ZL1= 120
##$ZL2= 120
##$ZL3= 120
##$ZL4= 120
##$ABSF1= 16.522
##$ABSF2= -4.171173
##$ABSG= 5
##$ABSL= 3
##$ALPHA= 0
##$AQORDER= 0
##$ASSFAC= 0
##$ASSFACI= 0
##$ASSFACX= 0
##$ASSWID= 0
##$AUNMP= <proc_1d>
##$AZFE= 0.1
##$AZFW= 0.1
##$BCFW= 0
##$BC_mod= 0
##$BYTORDP= 0
##$COROFFS= 0
##$CY= 12.5
##$DATMOD= 1
##$DC= 0
##$DFILT= <>
##$DTYPP= 0
##$F1P= 14.0000005364418
##$F2P= -0.99999901652339
##$FCOR= 0.5
##$FTSIZE= 32768
##$FT_mod= 6
##$GAMMA= 0
##$GB= 0
##$INTBC= 1
##$INTSCL= 1
##$ISEN= 128
##$LB= 0.3
##$LEV0= 0
##$LPBIN= 0
##$MAXI= 10000
##$MC2= 0
##$MEAN= 0
##$ME_mod= 0
##$MI= 0
##$NCOEF= 0
##$NC_proc= -5
##$NLEV= 6
##$NOISF1= 0
##$NOISF2= 0
##$NSP= 0
##$NTH_PI= 0
##$NZP= 0
##$OFFSET= 16.522
##$PC= 1
##$PHC0= -55.6276
##$PHC1= 13.13227
##$PH_mod= 1
##$PKNL= yes
##$PPARMOD= 0
##$PSCAL= 4
##$PSIGN= 0
##$REVERSE= no
##$SF= 250.13
##$SI= 32768
##$SIGF1= 0
##$SIGF2= 0
##$SINO= 400
##$SIOLD= 32768
##$SREGLST= <1H.DMSO>
##$SSB= 0
##$STSI= 32768
##$STSR= 0
##$SW_p= 5175.98343685301
##$SYMM= 0
##$S_DEV= 0
##$TDeff= 65536
##$TDoff= 0
##$TI= <Analysis number 999999
Compound Code 99
Book Reference 9
Project Code 9>
##$TILT= no
##$TM1= 0
##$TM2= 0
##$TOPLEV= 0
##$USERP1= <user>
##$USERP2= <user>
##$USERP3= <user>
##$USERP4= <user>
##$USERP5= <user>
##$WDW= 1
##$XDIM= 32768
##$YMAX_p= 402570582
##$YMIN_p= -816025
$$ End of Bruker specific parameters
$$ ---------------------------------
##NTUPLES= NMR SPECTRUM
##VAR_NAME=  FREQUENCY,     SPECTRUM/REAL,   SPECTRUM/IMAG
##SYMBOL=    X,             R,               I
##VAR_TYPE=  INDEPENDENT,   DEPENDENT,       DEPENDENT
##VAR_FORM=  AFFN,          ASDF,            ASDF
##VAR_DIM=   32768,         32768,           32768
##UNITS=     HZ,            ARBITRARY UNITS, ARBITRARY UNITS
##FACTOR=    0.157963299565203, 1,           1
##FIRST=     4132.6476996994, 0,             0
##LAST=      -1043.33573715361, 0,           0
##MIN=       -1043.33573715361, -816025,     0
##MAX=       4132.6476996994, 402570582,     0
$$ Real data points
##PAGE= N=1
##DATA TABLE= (X++(R..R)), XYDATA
$$ [...]
22832a22938P3943J25187J15767Q2630N9941J1464J6328l02349m4648j34973j9766
22821a39414Q0314j00203J09507O575q4806j09785J23648n7022m6199K0305J61232
22810c5848j35529k7720N9819M3468j35149p1316J33710Q1376j62463k3018Q0184
22799a92486K90142j00930j16671k53J6835J14827k748k43073n954p2580j48876
22788d61767N7280J46259O4342R931q8789j41078J06102R9317j89402Q4997j15399
22777d28207j35505L42043K0519r3138L7636J07171L06374j6333J42192l1247
22767B51505j56228k37345j67426J28452J05899P0971J50820m8808l6812j54591
22757i3563j45141p0782P4612J27159L7579j7357Q033J68968J11833L0681j49834
$$ plain form
22832 -122938 -48995 76192 191959 274589 334530 345994 362322 59973 15325 -119648 -139414
22821 -139414 -59100 -159303 -49796 -43221 -128027 -237812 -114164 -171186 -217385 -197080 -35848
22810 -35848 -171377 -199097 -139278 -95810 -230959 -302275 -168565 -87189 -249652 -272670 -192486
22799 -192486 97656 -3274 -119945 -120198 -103363 11464 8716 -234357 -240311 -312891 -461767
22788 -461767 -404487 -258228 -193886 -183955 -272744 -413822 -307720 -208403 -397805 -312808 -428207
22777 -428207 -563712 -221669 -201150 -294288 -256652 -149481 156893 140560 282752 251505
22767 251505 95277 -142068 -309494 -181042 -75143 -4172 146648 97840 61028 -93563
22757 -93563 -238704 -309486 -234874 -107715 -70136 -87493 -79460 89508 201341 232022 82188
22746H2188j84908j11395L0788J9824j63706m4784J10903J84929K76576r0336
22736A10079k04252j10544J34545J97531R3940m7825j65509O395p0237m5457M6028
22725e5306P7101N2674l6167p7073J825k26234J8175L3528K6699P3631J55498
22714D4351j1252o3761k5113j4642q0354O0402j12066J4917R9261O426m1085m0218
22702a63134q3555q6231J79009J65057k29487q6834J96289N5013J92572P9711
22692B18410r4286j81482p2966n2218k15780r4736p6387L2271J21255j30921R1602
22681d55238Q6209k0497R9148N1150l5009Q0062J49111J08943O7057p6074n5827
22670i65p3952j8242O8491P8495l3384R9346j53415j72420J30744J78679N9109
$$ plain form
22746 82188 -102720 -214115 -183327 -163503 -327209 -371993 -261090 -76161 200415 110079
22736 110079 -94173 -204717 -70172 127359 221299 173474 7965 14360 -55877 -101334 -55306
22725 -55306 21795 74469 38302 -38771 -36946 -263180 -245005 -211477 -184778 -111147 44351
22714 44351 33099 -30662 -55775 -70417 -150771 -90369 -202435 -187518 -88257 -81831 -122916 -163134
22702 -163134 -246689 -332920 -153911 11146 -218341 -305175 -108886 -53873 138699 218410
22692 218410 124124 -57358 -130324 -182542 -398322 -493058 -569445 -537174 -415919 -546840 -455238
22681 -455238 -369029 -389526 -290378 -239228 -274237 -194175 -45064 63879 130936 54862 -965
22670 -965 -74917 -93159 -24668 53827 20443 119789 -33626 -206046 -75302 103377 162486
22659A62486j15597j98134k49241R5252m3608J39298J96435j92667j84580J05833
22649b84523L0015J15953J90958l2429l2555q1521k66374M6512O8328J00044m7764
22638a93356O6255J75236j09679o1565n7792N3961j51718j1147J32266K14893
22628E7354M8504j66295j30375j9836J10717Q1479k0654j56695P627n5596l9274
22617b83044L16168J42824o9759L9401n0224m2016j90247L4191J11076O1580j39579
22606f9629m5184L5108r4151K224j10100L488J16851J52486M7699l8456J62281
22595A62617l892M684k90116j27303J64870K59112n1143P5693j10334k64062Q2405
22584i7469J05325q3613k6691P7259L4947k1148j1657k0849r719J19866n7303
$$ plain form
22659 162486 46889 -151245 -400486 -305234 -348842 -209544 -13109 -205776 -390356 -284523
22649 -284523 -254508 -138555 52403 19974 -12581 -94102 -360476 -313964 -245636 -145592 -193356
22638 -193356 -127101 48135 -61544 -123109 -180901 -126940 -278658 -289805 -157539 57354
22628 57354 105858 -60437 -190812 -210648 -99931 -18452 -39106 -195801 -188174 -243770 -283044
22617 -283044 33124 175948 106189 145590 95366 53350 -136897 -102706 8370 69950 -69629
22606 -69629 -114813 -79705 -173856 -171632 -281732 -278244 -161393 -8907 38792 336 162617
22595 162617 158725 163409 -126707 -254010 -89140 169972 118829 194522 84188 -179874 -97469
22584 -97469 7856 -75757 -102448 -25189 9758 -11390 -23047 -43896 -53615 66251 8948
22573H948q2332k895k1091O4960m2236m3277J02268n6329j87458L5373J85443
22562c8626R650q2741J51072M7414M3835j91151j31810m0580J9210j4269J5940
22551b12056J40313j58541l0611O7804n2894j67895M5975J58748J00008r2757
22541b01906o6300M0273P9114R3295P5792k1084o659l1639J17375j01686k4109
22530d7534j05934K22418O5503j09152j40138N2303o9660R5728l0504N2192o9463
22519h4241r6745j45791R4593M8250k02448p6818O5356L52954J08274j43921j58385
22508b38922j93985Q1955J63741P6533J74311j47516j29929O0278R6145n4877
22498a12266q4290J33961M5489Q8794l1516j48903J88195K24084Q0987o1245j73690
$$ plain form
22573 8948 -73384 -76279 -97370 -32410 -74646 -117923 -15655 -71984 -259442 -224069 -38626
22562 -38626 -28976 -111717 39355 86769 130604 -60547 -192357 -232937 -213727 -227996 -212056
22551 -212056 -71743 -230284 -260895 -193091 -245985 -413880 -367905 -209157 -109149 -201906
22541 -201906 -268206 -227933 -148819 -55524 20268 -816 -7475 -39114 78261 -23425 -47534
22530 -47534 -153468 68950 134453 25301 -114837 -62534 -132194 -36466 -66970 -14778 -84241
22519 -84241 -180986 -326777 -232184 -183934 -386382 -463200 -397844 -44890 63384 -80537 -238922
22508 -238922 -432907 -350952 -187211 -110678 63633 -83883 -213812 -153534 -57389 -112266
22498 -112266 -196556 -62595 -17106 71688 40172 -108731 79464 303548 384535 323290 149600
22487A49600k62092n2624K2733o8018k8698N8642J94029o340j64016p3450K11281
22476a8953O8947j14383r099j73502j79774R9597J38478O0191J20106j94241O4491
22465a38142Q9103j36669M1403m4159j62302o098J91259K13189P1481q458j31490
22454b0883l01778M92Q2075J62530J64193n068j56807k91466o743j12655r0770
22443e76880O7024R9501L7454J76365J88014o320o2160K11550q3999J1940J10936
22432A73425j07758j61142J29627q9654j50241n2781k3489j5054J42376L0396
22422a24295M3953K98650j14655R365k8683k02168k25973j15266R2107J2242L0224
22411c24499k6170n884n455j79908Q9399J29279K57632O9j08919J81088j32247
$$ plain form
22487 149600 -112492 -165116 -142383 -210401 -239099 -180457 13572 7232 -156784 -230234 -18953
22476 -18953 49994 -64389 -73488 -246990 -426764 -327167 -188689 -128498 -8392 -202633 -138142
22465 -138142 -49039 -185708 -144305 -188464 -350766 -356864 -165605 47584 119065 110607 -20883
22454 -20883 -322661 -322169 -240094 -77564 86629 81561 -75246 -366712 -373455 -486110 -576880
22443 -576880 -509856 -410355 -372901 -196536 -8522 -14842 -77002 134548 50549 62489 173425
22432 173425 65667 -95475 34152 -55502 -205743 -258524 -282013 -297067 -154691 -124295
22422 -124295 -80342 218308 103653 113018 84335 -117833 -343806 -459072 -366965 -354723 -324499
22411 -324499 -350669 -356553 -362008 -541916 -452517 -323238 -65606 -65537 -174456 6632 -125615
22400a25615j32848m4768J24097R167j76469J57584J19885J21836O478j49356
22390i0009K4615L4332m4328O7678l2988J52863j37069n5928k4638n0044L6927
22379a18589m0314K02707q384j82194j52642q8598N7979K30183K45297k1060k0728
22368A03657j4896j13620n604j16506q2334k6734N7321J41569j5732o0381n8610
22357a91870N700J49211o8400l8395j00257k18729P9899j3323q3947K00978L5075
22346b44058j8783J25003J82373N3313K8535j13368j68804o3356M4740P6869M7313
22335e0223K04125j68441J907J19659J56225j65247j14616k3383m4860j02081
22325a86935M1750M2624j71516j51692J37334J18216J52987J80383M1345j23636
$$ plain form
22400 -125615 -258463 -303231 -179134 -169967 -346436 -188852 -68967 52869 59347 -90009
22390 -90009 -65394 -31062 -75390 -7712 -40700 112163 -24906 -80834 -105472 -155516 -118589
22379 -118589 -158903 43804 35420 -146774 -299416 -388014 -330035 -99852 145445 124385 103657
22368 103657 88761 -24859 -30463 -146969 -229303 -256037 -198716 -57147 -72879 -133260 -191870
22357 -191870 -186170 -36959 -105359 -143754 -244011 -462740 -382841 -396164 -480111 -279133 -244058
22346 -244058 -262841 -137838 44535 97848 126383 13015 -155789 -219145 -174405 -97536 -50223
22335 -50223 153902 -14539 -12632 107027 263252 98005 -16611 -39994 -84854 -186935
22325 -186935 -145185 -102561 -274077 -425769 -288435 -170219 -17232 163151 204496 80860
22315H0860k12183m8491Q8915J3031p2375O488j16504j67862j18512J58560L6065
22304c52008J04532K22208k08858j89259K05700K85055m1729q3768M6805m5212
22294e6534j03255j27062J56903j5423j0289J46949j01969o9528p4552K2239P4309
22283a58212O5842K53887J95024j25159k63248k24495O2470J15111O2345L7670
22273B1235l6125N5519N5789j96539q6762j74789j54794J7991J11200M3725K51803
22262i1747J10495j01582k022J16875N852K1791j35500L8051N672k92729o0122
22251c84966L05940J89275p3145J09446P1853P8007j44059j63892L5014K17973
22241B41446J51436k7886k2633l71397j21545L7203j14228m018P9831L73600J1935
$$ plain form
22315 80860 -131323 -179814 -90899 -77868 -150243 -143755 -260259 -428121 -546633 -388073 -352008
22304 -352008 -247476 -25268 -234126 -423385 -217685 67370 25641 -58127 -11322 -56534
22294 -56534 -159789 -286851 -129948 -145371 -155660 -8711 -110680 -180208 -254760 -232521 -158212
22283 -158212 -92370 161517 356541 231382 -31866 -256361 -193891 -78780 -16435 21235
22273 21235 -14890 40629 96418 -100121 -186883 -361672 -516466 -498475 -387275 -343550 -91747
22262 -91747 18748 -82834 -84856 32019 37871 59662 -75838 -37787 -32115 -324844 -384966
22251 -384966 -79026 110249 37104 146550 218403 296410 152351 -11541 23473 241446
22241 241446 392882 364996 342363 -29034 -150579 -113376 -227604 -231622 -151791 221809 233744
22230B33744l1304j29789R1318J19849K1782m0843p7543j39440P6710M08332j5267
22219E17549j79089p905l2284j98501J20274K9554p188R6360j87038l9881J20583
22208B32434J3579m8958l78334q9758R9483K05145k28593k8144J22042P6012k0884
22197d5976J18082O3554k57288j43451J55997L6935J49436k25138n2518j07438
22187c07805j3672L40458J15057j16604k03198k39779J98379L13816o0888l8854
22177a3090j06613P9340J57651K2851k11722K1345K91488J30629l0412r1595k07567
22166D2305j34822m0068l09095P4615L70317L7773j56720j08911L5763K3426j79947
22155c45364r3977L1570J78213m8837K0303K2886O5739J59649o9140k89540M5330
$$ plain form
22230 233744 202440 72651 163969 283818 305600 264757 187214 47774 124484 532816 517549
22219 517549 338460 330555 298271 99770 220044 249598 242410 338770 151732 111851 232434
22208 232434 246013 197055 -181279 -271037 -171554 33591 -195002 -223146 -101104 -25092 -45976
22197 -45976 72106 135660 -121628 -265079 -109082 -72147 77289 -147849 -200367 -307805
22187 -307805 -321477 18981 134038 17434 -185764 -425543 -227164 86652 25764 -13090
22177 -13090 -119703 -40363 117288 140139 -71583 -50238 241250 371879 341467 249872 42305
22166 42305 -92517 -132585 -441680 -367065 3252 41025 -115695 -224606 -188843 -165417 -345364
22155 -345364 -439341 -407771 -229558 -278395 -258092 -235206 -169467 -9818 -78958 -368498 -323168
22144c23168J13124M6180m8062j00173j21042Q4042K87045M7855Q1715n3633j74257
22133a60374Q0639q2096j41965Q3840j71423p6989K16000J05379K15111q3837
22123a5715k1634J5752j04089J52281j5249M2786q873j37190j24604L7571K2181
22112a56783Q4393R8066j80072p6216P5256p4387j9227J71722J12243j65919K689
22101a28235J85707j25655J911K26470l6128j76789K1413l347p9172j84508m3317
22090c41650l4181J63375K49033K02203o8380N2032p6846j42871l35352j2747
22080c45384J04855R3639N399j43378N1665P8599K97903J05410k30069j19640
22070a01001M3392K04306K0557R3431q3054l50932o8587q9871K2387J42096P3477
$$ plain form
22144 -323168 -210044 -163864 -211926 -312099 -433141 -349099 -62054 -14199 67516 13883 -160374
22133 -160374 -79735 -161831 -303796 -219956 -391379 -468368 -252368 -146989 68122 -15715
22123 -15715 -37349 -21597 -125686 26595 11346 54132 45259 -91931 -216535 -178964 -156783
22112 -156783 -72390 25676 -154396 -230612 -155356 -229743 -248970 -77248 34995 -130924 -128235
22101 -128235 57472 -68183 -66272 160198 124070 -52719 -31306 -34653 -113825 -298333 -341650
22090 -341650 -375831 -212456 36577 238780 170400 222432 145586 2715 -332637 -345384
22080 -345384 -240529 -146890 -141491 -284869 -233204 -154605 143298 248708 18639 -101001
22070 -101001 -57609 146697 167254 260685 177631 -173301 -241888 -331759 -309372 -167276 -93799
22059i3799p9615k477J1337j71929j94556J61447J99794O6315j55287J34471k2872
22048a47171j2812M8986o8868J32262P2938J08262J50533o9194m0682j73266O6012
22037F7000R595k5489p8153k05850O5754K28889j72961k6534r5190N2774O8234
22026a11931J58076L4437o9536K9547M970m9327L5067L3424P3442J41886j1447
22015B68608k11971j32712l103N4597K6336k04190q8075J03837K14596k459o1712
22004c6248j45969J127P0798P4814l4531l4076O7486J28108J11165p5242o4934
21993F2498j34170m7681k27558j48879K4730J51897M6523j4622J08415n354K04428
21982B0227J63106L0471j3595m36204j70212K77299K60198K11066L0316K37l7014
$$ plain form
22059 -93799 -173414 -175891 -164554 -336483 -531039 -369592 -169798 -103483 -258770 -124299 -147171
22048 -147171 -159983 -110997 -179865 -47603 25335 133597 284130 214936 174254 988 67000
22037 67000 76595 51106 -27047 -232897 -167143 61746 -111215 -137749 -232939 -180165 -111931
22026 -111931 46145 80582 11046 40593 45563 -3764 31303 64727 138169 280055 268608
22015 268608 56637 -76075 -79178 -24581 1755 -202435 -290510 -186673 27923 25464 -36248
22004 -36248 -182217 -181090 -110292 -35478 -70009 -104085 -36599 91509 202674 127432 62498
21993 62498 -71672 -119353 -346911 -495790 -471060 -319163 -272640 -287262 -178847 -184201 20227
21982 20227 183333 213804 200209 -235995 -406207 -128908 131290 342356 372672 372909 335895
21971C35895L8932j60840n4727M5669J16274j38997j825k35435j05357r7664m5744
21960c03819R0334j3340R4863j68923k73617k679J07826J71489K02756K02728
21950A07618l544L3779J1856K1655R093k3054O3855m0436j98675M3466p6561j58950
21938b09898K09175L6725J94959P6929l01409j66762Q123J45342J20994m8782
21928F5396r420r5354k0021M9630N1443j01289k2642N2515L4366L0572j12778
21917g7582j38238j7767J2121P5051J08538q1337j75699J08965J79362l2093j03590
21906a42269J4586J27316o8970k44031J64432J05694J81122J03608n8816p2490
21896A10182p4767p4792j16466r9440P8462j9723j75210M7763J17941O644P6550
$$ plain form
21971 335895 374827 213987 159260 204929 321203 182206 180381 -55054 -160411 -258075 -303819
21960 -303819 -213485 -226825 -131962 -300885 -574502 -577181 -469355 -297866 -95110 107618
21950 107618 104074 137853 149709 171364 180457 157403 221258 180822 -17853 25613 -50948 -209898
21938 -209898 -723 36002 230961 307890 6481 -160281 -152158 -6816 114178 65396
21928 65396 55976 -39378 -59399 -9769 41674 -59615 -82257 -29742 4624 35196 -77582
21917 -77582 -215820 -233587 -221466 -146415 -37877 -119214 -294913 -185948 -6586 -38679 -142269
21906 -142269 -127683 -367 -69337 -313368 -148936 -43242 137880 241488 182672 110182
21896 110182 35415 -39377 -155843 -255283 -176821 -196544 -371754 -323991 -206050 -199406 -122856
21885a22856j148J85512J69518J47314j91915k04829j25576M6799q1075k35606
21875d13862J47395K52727O9842o2967J61061j3119p5256p0529j06108j76541
21865b87357n8753n6789J69540K04144J82740Q7327k23558j01340m0970j28109
21855b53125j01396J17136m0917P7493k856k59417N66R9491J42652J11555o6533
21844a75351K407O0457O8416J5781L1228J54313K4534l7021J67933r3556j56385
21833F2756j0040R7333j78835p2309L1186J61890J54994M3496k11972l20806j01105
21822c43412K26035j2995p1993m9657n984k8232n2086o2321J55939K49023l673
21811F44o2370j2182J4369m6980p0207K28281J37820n2106k5909l85317o0932
$$ plain form
21885 -122856 -124004 61508 231026 378340 186425 -18404 -143980 -97181 -178256 -413862
21875 -413862 -266467 -13740 56102 -6865 154196 141077 65821 -4708 -110816 -287357
21865 -287357 -346110 -402899 -233359 -29215 153525 240852 17294 -84046 -125016 -253125
21855 -253125 -354521 -237385 -278302 -200809 -203665 -463082 -462516 -363025 -220373 -108818 -175351
21844 -175351 -172944 -112487 -44071 -28290 2938 157251 181785 144764 312697 219141 62756
21833 62756 52716 150049 -28786 -101095 -69909 91981 246975 290471 78499 -242307 -343412
21822 -343412 -117377 -130372 -202365 -252022 -258006 -286238 -338324 -400645 -244706 4317 644
21811 644 -61726 -73908 -59539 -106519 -176726 51555 189375 137269 111360 -273957 -334889
21800c34889J42213P6072K797R4092j55533k738K6676J4950J03769k5678L1214
21789b7055J52969j45758j37145P5318K66715j14976j93999l5212p7444k8833
21779b65420k0081J44698R9104p0731j66619l0870L50664n1428r3496j64087R4330
21768a73936K44563K81531l0059k45151J2816L3255l83470k41364j50810K69909
21758c82716m4218J33988q231J65564K8445j52993r8187K13780L02277R4340L2340
21747B84389l7802r1852r4881n7829k07764l6732J82716J14534q8859j32447J31921
21736c4606L695m3832L2097L1662q510j89332j30757Q7956L5840j0n3474j10562
21724c79833M4391M7721R8264R5621N0535J05794m4901K0309M7976K46599o613
$$ plain form
21800 -334889 -192676 -116604 -113807 -19715 -175248 -177986 -151310 -136360 -32591 -58269 -27055
21789 -27055 125914 -19844 -156989 -81671 185044 70068 -123931 -159143 -236587 -265420
21779 -265420 -285501 -140803 -41699 -112430 -279049 -309919 40745 -10683 -104179 -268266 -173936
21768 -173936 70627 352158 322099 76948 89764 123019 -260451 -501815 -652625 -382716
21758 -382716 -426934 -292946 -301177 -135613 -107168 -260161 -358348 -144568 157709 252049 284389
21747 284389 246587 154735 59854 2025 -205739 -242471 -59755 54779 -34080 -166527 -34606
21736 -34606 -30911 -74743 -42646 -10984 -19494 -208826 -339583 -251627 -215787 -215797 -269271 -379833
21724 -379833 -335442 -287721 -189457 -93836 -43301 62493 17592 37901 85877 332476 325863
21713C25863J33666M189j35751J30428J3075k71365l37162N567L01052J32585
21703C02147r9688j47058j04551k40772l05435N3627K84507K02810l8153k78164
21693c70730j75885K62898L67713j58018j19741L0871J4466k53172L4662L80174
21683A3238R518j3384J12660k11016J0025l6038m2477j81660J54901J80611J11341
21672A07719K9118l9930P6931j05784p165j27901k82353N2031J7630K6401J28357
21661a24946P7453q7209O4765J4662Q5848j4143J39124k774j71135j17247J15164
21650b0438K00389p464j46974r124p7312q2799Q9069R8073k3116q4797j5377l5951
21638a15821M9017o2848J04148K41293j00775j55301J33612r5677q4909L8668
$$ plain form
21713 325863 459529 463718 327967 458395 471470 200105 -137057 -131490 169562 302147
21703 302147 202459 55401 -49150 -289922 -595357 -541730 -257223 -54413 -92566 -370730
21693 -370730 -546615 -283717 83996 -74022 -193763 -162892 -148426 -401598 -366936 13238
21683 13238 22756 9372 122032 -88984 -78959 -114997 -157474 -339134 -184233 -3622 107719
21672 107719 136837 96907 173838 68054 60889 -67012 -349365 -297334 -279704 -253303 -124946
21661 -124946 -47493 -134702 -69937 -55275 30573 16430 155554 152780 -18355 -135602 -20438
21650 -20438 179951 172487 25513 16389 -60923 -143722 -54653 43420 20304 -64493 -79870 -115821
21638 -115821 -66804 -129652 -25504 215789 115014 -40287 93325 -2352 -87261 -48593
21628d8593N0313R3586k0950r6524J56499N7874l37236l45043Q2813K99925J22673
21617A5337J21958L5328N2478j50296k0327j32328j27668N9814J58571R5701j36684
21606b8116m3603R7911J18075j10303k2382L4216j65237M7299J11994Q8501j00686
21595B7669k03473k8715o7208L3417N6982J3208q5576j17585J8821J2104K24330
21584a16026K118J0332J1380j005o444J84839K61639K2510q7969k27243k13914
21573a59783l4431m7132o33j91670j61200J36046K27167J06907J10874j47641
21563a61496k0715j02921N5969k7653m9674M1307N6538l7286J6814K10353j84389
21552b03153j80590l7164k5423R6446J72733l545l0233j84289J23178L90332L04224
$$ plain form
21628 -48593 1720 95306 74356 -22168 134331 192205 -145031 -490074 -407261 -107336 15337
21617 15337 137295 172623 225101 74805 54478 -77850 -205518 -145704 12867 108568 -28116
21606 -28116 -71719 26192 144267 33964 11582 45798 -119439 -72140 39854 128355 27669
21595 27669 -175804 -204519 -271727 -238310 -181328 -168120 -253696 -371281 -352460 -340356 -116026
21584 -116026 -113908 -103576 -92196 -93201 -99645 85194 346833 369343 281374 54131 -159783
21573 -159783 -194214 -241346 -241979 -433649 -594849 -458803 -231636 -124729 -13855 -161496
21563 -161496 -182211 -285132 -229163 -256816 -306490 -265183 -208645 -245931 -229117 -18764 -203153
21552 -203153 -383743 -420907 -446330 -349884 -177151 -180696 -210929 -395218 -272040 118292 422516
21541D22516j4818k41767j81166r527r1764q2614m5996j9997J57267l650n8428
21530a69944R3790k9783L7417n5144K9908J62225m0605k06950q9676O5569j8504
21519b21697J33201K00785L1558k55419k99776N8242K48959n9779J49232n014
21509a9708o682J06709j18121l7241q0857j8932K0168j60994j34709n0214J89110
21498c11471J79240j23164j66855j4780N1682J93231r539J07445J50409m6777
21488I421n8349j30932K735K40758q1599k72885N8687K59108K25068p8712j26744
21477D6556M5792J74292j01023j23421j2797k787n1897R4467J04311m5442N1093
21466A79144j51480k1484K96966N242j85326n6512j49059k2554R2829L6840o9141
$$ plain form
21541 422516 407698 165931 -15235 -24762 -116526 -199140 -245136 -265133 -107866 -111516 -169944
21530 -169944 -76154 -105937 -68520 -123664 -93756 68469 27864 -179086 -268762 -203193 -221697
21519 -221697 -88496 112289 143847 -111572 -411348 -353106 -104147 -163926 -14694 -19708
21509 -19708 -26390 80319 -37802 -75043 -155900 -174832 -154664 -315658 -450367 -500581 -311471
21498 -311471 -132231 -255395 -422250 -437030 -385348 -192117 -201656 -94211 56198 9421
21488 9421 -48928 -179860 -177125 63633 -17966 -290851 -232164 26944 252012 173300 46556
21477 46556 92348 266640 165617 42196 29399 26612 -25285 69182 173493 128051 179144
21466 179144 27664 6180 303146 308388 123062 66550 -82509 -105063 -12234 24606 -44535
21455d4535J81128J26026r8699j53768j98661j1372l9278K09836P6849o8553j14413
21444a35440j92389o4225j52478K03159K77283j73649J27954J85325K7316J31917
21434B34773o5292j54335n5298k8115l4027j56377j34515j92694J41566j4369
21424d58683J98762Q597j22403j71957J25185L59589K82019J47395j21696o4944
21414A81864l3172K93017N0271j01186k38615k27698m5253J50181j396o2081O584
21403b7484n2333l8701J60899l6481J72882O4635j75701R8671O6154j33098k23973
21392a24530j89469j46782n2172Q7184K00548L21606Q1970K8866K4560j68844
21382F2937L5953m1335m3639k29329q1076o7617J49151Q0432J36570r5136j47588
$$ plain form
21455 -44535 136593 262619 163920 10152 -188509 -199881 -239159 -29323 47526 -21027 -135440
21444 -135440 -327829 -392054 -544532 -341373 -64090 -237739 -109785 75540 102856 234773
21434 234773 169481 15146 -40152 -68267 -102294 -258671 -393186 -585880 -444314 -458683
21424 -458683 -259921 -251324 -373727 -545684 -420499 -60910 221109 368504 246808 181864
21414 181864 148692 441709 491980 390794 152179 -75519 -120772 29409 28013 -34068 -27484
21403 -27484 -79817 -118518 42381 5900 178782 243417 67716 166387 232541 99443 -124530
21392 -124530 -313999 -460781 -512953 -425769 -225221 96385 178355 207221 231781 62937
21382 62937 98890 57555 13916 -215413 -296489 -364106 -214955 -134523 2047 -93089 -240677
21371b40677l4719J70460O6072j0592M3217K53681J61869J16407j14812r3562
21361C17344q786L1591k3162j3624l9611m0547j91916k32815O0931J2176j94802
21350c23221k804K29023J5836L4366k14242M4926J28396p6586J4608j05396N1236
21339b03858J44861R124J25955K0408o2330j07962O8782J19868J14803j22234
21329A07417P496k2726K5656Q95k67110j62613N1940R3295J7004O7754O3427J8150
21317E85J62964k35761j82884p9847J39251K35718o1056r5374o6642l6428R1033
21306a28441K34153N588Q2282J1046r0668j15840j29945J0185J1563J16050K79388
21295B85361J07503j28404j80004m4026k2894j20613k7804j7750J35321m5959
$$ plain form
21371 -240677 -275396 -104936 -38864 -49456 -6239 247442 409311 525718 410906 317344
21361 317344 308558 340149 316987 303363 263752 223205 31289 -201526 -140595 -128419 -323221
21350 -323221 -326025 -97002 -81166 -46800 -261042 -216116 -87720 -164306 -149698 -255094 -203858
21339 -203858 -58997 -49873 76082 96490 34160 -73802 -5020 114848 229651 107417
21329 107417 114913 92187 117843 118738 -148372 -310985 -259045 -165750 -148746 -80992 -17565 585
21317 585 163549 -72212 -255096 -334943 -195692 40026 -21030 -116404 -183046 -219474 -128441
21306 -128441 105712 111300 193582 204628 113960 -1880 -131825 -121640 -110077 5973 285361
21295 285361 392864 264460 84456 40430 17536 -103077 -130881 -148631 -13310 -59269
21285e9269J1836J34957J60051l84N1226q3006n8002J9041J32166J00125j10265
21274B98476j6025n0158o2520k13426r2180J30142J29781p8530k3404q940o8048
21263e4832q9411P3146N3939l9592r8814J7217L0964m0864j65482K0572J44014
21252a49143N6240J95088J34128j40953K351J27374j6801j06619k47691l2220
21242a78246K27893q008J11605r8698l1195k9887n4191p654k84020P1591J7000
21231b63810j23822L3204K00011J67656J09659J38202m0447k951J09162m7985
21221B78879k17516j57830M8548K2123j7296M2257J89546j08093J3771Q7974j59554
21210B2809k32822K19236K37952P5663j52138l45489n8368L33142J89438K6836
$$ plain form
21285 -59269 -47433 87524 247575 247191 298417 215411 157409 176450 308616 408741 298476
21274 298476 282451 232293 169773 -43653 -135833 -5691 124090 45560 22156 13216 -54832
21263 -54832 -144243 -71097 -17158 -56750 -155564 -138347 -107383 -148247 -313729 -293157 -149143
21252 -149143 -92903 102185 236313 95360 97711 225085 208284 101665 -146026 -178246
21242 -178246 49647 41639 153244 54546 23351 -6536 -60727 -68381 -352401 -280810 -263810
21231 -263810 -387632 -354428 -154417 13239 122898 261100 220653 217702 326864 278879
21221 278879 61363 -96467 -47919 -25796 -43092 -835 188711 80618 94389 182363 22809
21210 22809 -210013 9223 247175 322838 170700 -174789 -233157 99985 289423 316259
21200C16259j86381l4401j93891J04967O5540j56538j28618j47426j37302l3665
21190e31456K79501L66782J24950j24110o4080o0233L6633K06527k5045l8959
21180A70510O9445j9598k68315o8728J22927K33444n5815j09467j30251j50249
21170b06097j71993j47646Q045O9251o8202J81842O6785j93354L5820J21855K38261
21159f5433L2659j79766J69203J95644L9301R4317j26660l9911N0500p3341J55740
21148B52253j12228k33336j49624J91111J5749j80635M7327J20857R4786j14138
21138f7878m2974J76698P255J08544j05584k48258k2815J05302J8509J39329q0790
21127a2662m1580O6164Q7004j13191J6729J22604L2865k2261p5149R2624L2284
$$ plain form
21200 316259 129878 95477 -98414 6553 72093 -84445 -213063 -360489 -497791 -531456
21190 -531456 -251955 114827 239777 115667 51587 -8646 27987 234514 209469 170510
21180 170510 239955 220357 -47958 -116686 6241 239685 183870 74403 -55848 -206097
21170 -206097 -378090 -525736 -517691 -448440 -516642 -334800 -268015 -461369 -425549 -303694 -65433
21159 -65433 -32774 -212540 -43337 152307 191608 285925 159265 119354 169854 96513 252253
21148 252253 140025 -93311 -242935 -51824 -36075 -216710 -169383 -48526 46260 -67878
21138 -67878 -110852 65846 73101 181645 76061 -172197 -195012 -89710 -71201 68128 -12662
21127 -12662 -54242 11922 98926 -14265 2464 125068 157933 135672 60523 153147 185431
21116A85431n1117j11738N4400J9549L8996j3191q7133j81738p1206R5636J49525
21105B7414j67513k27142L1015L8033K69158K61959O457J02102J0237J34141j47539
21094C38322j8264Q5153J36336m505j33015J39708J22767m3190K12416K61978
21084A097706J9129k2778m1833j41183j6808k7196l3104r7945j65615k19611n3390
21073B97372j2307Q8157j83053P4087k4042r9064q8789m4284m2485J28600o7865
21062B6327n2743J12724R8927J02211m9051k0938J1003P7085q9580K30679J43212
21051E89856j84989m2658K04933J32140J4085l998J30312O5333J69614K5960j0610
21040A089978k35548j14939j26205j20587k1797j24649R349J56395q457n7391
$$ plain form
21116 185431 134314 22576 76976 96525 135521 122330 35197 -146541 -217747 -122111 27414
21105 27414 -140099 -367241 -336226 -298193 -29035 232924 239381 341483 351720 485861 338322
21094 338322 320058 405211 541547 537042 404027 543735 666502 623312 835728 1097706
21084 1097706 1116835 1094057 1052224 911041 894233 867037 833933 735988 570373 350762 297372
21073 297372 285065 373222 190169 264256 240214 141150 52361 8077 -34408 94192 26327
21062 26327 -26416 86308 185235 287446 238395 217457 228460 305545 215965 446644 589856
21051 589856 404867 362209 567142 699282 713367 709369 839681 905014 1074628 1100588 1089978
21040 1089978 854430 739491 613286 492699 470902 346253 355602 511997 503540 446149
21030D46149o0767j49164L8390n6865j19401Q008L377J92012p1248q3904q4574
21019F2013M38Q4789J17541J69908n5852J71070P8338k96177j19231j01533r7612
21008A3692Q6156Q8680j67566j92543M2999j03901k3826j52887p0310J76798L07482
20997D774J57148L1207K0659J59139K46311n2379j84067r0116q6247J5568n9058
20986A62939j71064O3546J63897r8359j28360N4225J57292j8666o6472j35504
20976a6526k0404m4613Q8711R7135k45623q2310l0696k004J10632m073k3565R773
20964a63563k54222N4710K47468N3468M8580r6534K9308J9085k383J2806K6643
20953b4634R3344J34508J16563R4853q9700k47473J5298Q8296q1352j46462l8193
$$ plain form
21030 446149 385382 236218 274608 217743 98342 106350 109727 301739 230491 146587 62013
21019 62013 62451 147240 264781 434689 378837 549907 628245 332068 212837 111304 13692
21008 13692 99848 188528 20962 -171581 -128582 -232483 -256309 -409196 -479506 -302708 4774
20997 4774 161922 193129 213788 372927 619238 566859 382792 292676 206429 221997 162939
20986 162939 -8125 55421 219318 120959 -7401 46824 204116 185450 118978 -16526
20976 -16526 -36930 -81543 7168 104303 -141320 -223630 -254326 -256330 -145698 -149771 -173336 -163563
20964 -163563 -417785 -363075 -115607 -62139 -13559 -110093 -80785 -61700 -64083 -51277 -24634
20953 -24634 68710 203218 319781 414634 324934 77461 92759 181055 99703 -46759 -84952
20942h4952K8604j28415J84362K88909j18402l08099p8125J27636L8455j3938
20932f3965j36923J79756J568l2505J8390J49564K27747k1694j64789j46663N084
20921A5570M0282j25661M2785j05449J16242L48M2438K9064j15777M0162j47987
20910a67983j39202K06880J68275j61214m4162M7003m3794l0300J34168K58153
20900B27824K70918j15215m2409P2820J6489k15912j26378j438l1105j64172J76918
20889F8340P2434m3506R0024J68390k44524j84297R975p9605k7390o7084P6226
20878a61017J57171J88888J8275N9806J23034j33402j24433j6082J16397j1971
20868B16666K3511M9928j01161l7562j08443l9497j74142j17522L24816J64553
$$ plain form
20942 -84952 -56348 -184763 -401 288508 170106 -137993 -216118 -88482 -50027 -63965
20932 -63965 -200888 -21132 -19564 -52069 -33679 115885 343632 321938 157149 10486 15570
20921 15570 55852 -69809 -27024 -132473 -16231 -15883 26555 55619 -60158 -19996 -167983
20910 -167983 -307185 -100305 67970 -93244 -137406 -90403 -134197 -164497 -30329 227824
20900 227824 498742 383527 341118 413938 430427 214515 88137 86699 55594 -108578 68340
20889 68340 140774 97268 187292 355682 111158 -73139 -63164 -142769 -170159 -237243 -161017
20878 -161017 -3846 185042 203317 263123 386157 252755 128322 112240 228637 216666
20868 216666 240177 290105 188944 151382 42939 3442 -170700 -288222 36594 201147
20858B01147k30310j60928J41705O5848j7397j12249J00252R2533M4242J6320
20848A41163j2004J8358j088K6728L039M3959Q7312J61782j08492l19540r8519
20837e7302P7939l017O2383J05095O1576p7496j00019j48053P6039J6222j08231
20826i4864p6387N0712R8608R4526R0301Q5049P1241K937n8264k48841l10982
20815b95964j10796L37899K95897N0610j13025k3089J35920J99311k5066p2188
20805C79509o4507P0093n7048k44617j91153J0064K52515J97804k3032p690j64995
20794A56943O9927j2040n9280J29038o0475j09003l9907K6712j05358q4043K9241
20783e8245M5115j52247P7058O9274j04551j9689o3141Q6678L1932K75498p7014
$$ plain form
20858 201147 -29163 -190091 -48386 17462 65 -112184 -11932 80601 124843 141163
20848 141163 129159 147517 146429 173157 176196 220155 307467 469249 360757 41217 -57302
20837 -57302 20637 17620 80003 185098 246674 169178 69159 -78894 -2855 13367 -94864
20826 -94864 -171251 -120539 -21931 72595 162896 247945 319186 322123 263859 15018 -295964
20815 -295964 -406760 -68861 227036 277646 164621 141532 277452 476763 451697 379509
20805 379509 315002 385095 328047 83430 -107723 -97659 154856 352660 329628 321938 156943
20794 156943 226870 214830 155550 284588 224113 115110 75203 101915 -3443 -87486 -58245
20783 -58245 -13130 -165377 -88319 -19045 -123596 -143285 -206426 -119748 -87816 187682 110668
20772A10668m2599K89215K76081k41477j49400o4544L6207P6890j08745k30386
20762d8090N2056N0313Q4389J3508m0291P468N8602k81356J16946Q3868K58318
20751C55731k3947j17849L3600q9507L4235M8577O8293l2018m0243k75514M130
20740c4512J86172j09870L5896O5593J75257j63254m7796l229j27931j22101p8608
20729b24383J00634J86989M8499k31309o3023O5891P4731J64694J32860Q1550
20719C37133R789J00200p0241O569P0186l6674n7795J20110K3758J496M6592l2557
20707E18566k85686J06385l0420j80486R0740L00688K13283l216r2718k29960
20697D07176k65113m3024J81438R1348P0412n8945m9264j34195J1959J14871K1949
$$ plain form
20772 110668 68069 357284 633365 391888 242488 177944 214151 291041 182296 -48090
20762 -48090 3966 54279 138668 152176 111885 119353 177955 -103401 13545 97413 355731
20751 355731 331784 213935 247535 158028 192263 240840 309133 277115 236872 -38642 -34512
20740 -34512 151660 41790 77686 143279 318536 155282 107486 104257 -23674 -145775 -224383
20729 -224383 -123749 63240 111739 -119570 -182593 -116702 -41971 122723 255583 337133
20719 337133 346922 447122 376881 383450 453636 416962 359167 479277 503035 504531 551123 518566
20707 518566 232880 339265 308845 128359 219099 519787 733070 729854 637136 407176
20697 407176 142063 99039 280477 371825 442237 383292 334028 199833 211792 326663 348612
20686C48612n4197J2837j49523n7871Q0590J93693j97707j30626K53620K70657
20676E70085j57472j91439j82015p9678J35530Q7790j32780k9013K32670J69566
20666D23244M6099J5586j70699p68q0269L1200q114q4664J25637J66886l8167
20655D25971j51920L2830J30163q5041r0192J65012n9004k6544J25667N4486j57697
20644C63731R617J17873K6933Q156J47226M4119p1618n3702O7036M2749j22440
20633E79680O7623P5420K38464J27456M8162P2731J14846j01109j52901J66060
20623A236432J54116j35624j41956J1135O1255R4838k2681l0049N5416p0317P8626
20612A291191j41081k6873j09718n1138Q975K11487J1434N4435j5421J13354m0609
$$ plain form
20686 348612 294415 307252 157729 99858 180448 374141 176434 45808 299428 570085
20676 570085 412613 221174 39159 -40519 95011 182801 50021 21008 253678 423244
20666 423244 469343 484929 314230 313462 233193 264393 256279 171615 297252 464138 425971
20655 425971 274051 306881 437044 352003 261811 426823 367819 341275 466942 521428 363731
20644 363731 373348 491221 518154 526310 673536 717655 646037 592335 659371 702120 579680
20633 579680 647303 722723 961187 1088643 1136805 1209536 1324382 1223273 1070372 1236432
20623 1236432 1390548 1254924 1112968 1124103 1185358 1280196 1257515 1227466 1282882 1212565 1291191
20612 1291191 1150110 1123237 1013519 962381 971356 1182843 1194277 1248712 1233291 1346645 1306036
20601A306036o2353m5902l21339l13759K7622j3668J02568Q1781j06150k0565
20591F34271J11309P2266K50852K09202J7146m3544Q0893L4200n8302J51745J34037
20580A594075N8276K5515k6047K02524P3526p5539o7678j0752J31334J17299j07390
20569A915143q8055O3445r4518o8036J17677k9136k11334L5625M221j18707K09734
20558A736059K44947M230j39741N6755j7374n9813J12090J02703m6313O085L59616
20547B359244J59440K57708K22886K27037p3677J96039K13008K44962K16281N34801
20537D557729K22829R0041K96270K86785K94981n5217J87257K72308K37600K74792
20527F665375J84282J68690K24465K93643K98120L55260K89740K88885M19068
$$ plain form
20601 1306036 1243683 1197781 876442 562683 590305 576637 679205 760986 654836 634271
20591 634271 745580 817846 1068698 1277900 1295046 1251502 1332395 1366595 1308293 1460038 1594075
20580 1594075 1652351 1677866 1651819 1854343 1927869 1852330 1784652 1773900 1905234 2022533 1915143
20569 1915143 1827088 1890533 1796015 1727979 1845656 1816520 1605186 1640811 1645032 1526325 1736059
20558 1736059 1981006 1985236 1845495 1902250 1884876 1825063 1937153 2039856 1993543 1999628 2359244
20547 2359244 2518684 2776392 2999278 3226315 3152638 3348677 3561685 3806647 4022928 4557729
20537 4557729 4780558 4870599 5166869 5453654 5748635 5693418 5880675 6152983 6390583 6665375
20527 6665375 6849657 7018347 7242812 7536455 7834575 8189835 8479575 8768460 9187528
20518I187528O70431N61979Q28186J175598J478988J575618J998023K727272L872730
20509B4076353M933939O483143P889385P920740P236991P182845Q635144J1398752
20501H5757292J4423783J5183463J0720186N294990L018483K869679M323530N985147
20493A47576553L708480k521065p120847q586269q879007q594455q367422r653059
20485I7562909j1097553j0647993r185961q082544p275676o353599n726072n035940
20477C4157571l658293k670714j993054j445262r37184l80769j98531J18220Q30564
20468B3822548J133956J634159K453800L576078N077572O678611Q019046P872673
20460F0268443P204814P471856R280776J2437161J5216733J4433320Q624502L982571
$$ plain form
20518 9187528 9857959 10419938 11248124 12423722 13902710 15478328 17476351 20203623 24076353
20509 24076353 29010292 35493435 43382820 51303560 58540551 65723396 74358540 85757292
20501 85757292 100181075 115364538 126084724 131379714 134398197 137267876 141591406 147576553
20493 147576553 151285033 148763968 141643121 133056852 124177845 115583390 107215968 97562909
20485 97562909 86465356 75817363 66631402 58548858 51273182 44919583 39193511 34157571
20477 34157571 30499278 27828564 25835510 24390248 23453064 23072295 22873764 22991984 23822548
20468 23822548 24956504 26590663 29044463 32620541 37698113 44376724 52395770 60268443
20460 60268443 67473257 74945113 84225889 96663050 111879783 126313103 134937605 138920176
20452A38920176K145980K424147M505776N511093J457469n133322q502656r342944
20444A31985719r566865q989111r267795j0923414j1722728j0621788r347683
20437F1546335q381060p528369o560386o066247n085653l913629l094995k112909
20429A8803087j830741j646198j286420j029600q22690p25649p79358p14442o23865
20420I344124o77026m37844l90807n45038n04353n15177k73681j99777j91011
20411E609410j24202k36299m19742j94928o8094k08832k37124j17622j26827l97393
20401C478347o1585K13657K5096j90643l87998l83427j35681L20230j10196l59776
20391B408024j81111J0530j52956j65374J9418n3524m9940j11880K08508p9780
$$ plain form
20452 138920176 141066156 143490303 147996079 153507172 154964641 149831319 141328663 131985719
20444 131985719 122418854 113429743 104161948 93238534 81515806 70894018 61546335
20437 61546335 53165275 45636906 39076520 33010273 27924620 24010991 20915996 18803087
20429 18803087 16972346 15326148 14039728 13010128 12187438 11461789 10682431 9967989 9344124
20420 9344124 8667098 8229254 7838447 7293409 6789056 6273879 6000198 5800421 5609410
20411 5609410 5485208 5248909 4829167 4634239 4566145 4357313 4120189 4002567 3875740 3478347
20401 3478347 3416762 3630419 3655515 3464872 3076874 2693447 2557766 2877996 2767800 2408024
20391 2408024 2226913 2237443 2084487 1919113 1938531 1885007 1835067 1723187 1931695 1851915
20381A851915k52884M6210P0914K77709J96243J59735P2243L3876j19001J09642
20371B446602J21594k15413j74649j50894j4211N4737j33102r2266j18829j29451
20361A594118N8410o3811j31110o204k583n9461J53376P2892r3369m57221k27505
20350H37532l8808j27421M7486j47665j92820K2020K03593J13383J26637p3336
20340G70601o8480p8362L2131k7600K6254J6953j1880k24851N7895L81172L95068
20329A268901K8464j67794J5960q0939L359M0226m1765J66384O3064j64972K14611
20318A345499n6891j81976j87429j6242k5833j9854J7919k73947N8298m5337l2778
20307E81429K1052l33915j59112J12213J45624o1182j55669n0732R1073J7857
$$ plain form
20381 1851915 1599031 1645241 1716155 1993864 2190107 2349842 2422085 2455961 2336960 2446602
20371 2446602 2568196 2352783 2178134 2027240 2013029 2067766 1934664 1842398 1723569 1594118
20361 1594118 1652528 1588717 1457607 1451403 1448820 1389359 1542735 1615627 1522258 1065037 837532
20350 837532 798724 671303 718789 571124 378304 400324 603917 717300 843937 770601
20340 770601 702121 623759 655890 628290 654544 671497 659617 434766 492661 873833 1268901
20329 1268901 1297365 1129571 1145531 1064592 1067951 1108177 1066412 1232796 1295860 1130888 1345499
20318 1345499 1288608 1106632 919203 902961 877128 857274 875193 601246 659544 614207 581429
20307 581429 602481 268566 109454 221667 367291 306109 150440 99708 190781 208638
20297B08638j93530k23357k1759l3480p2557n559K54680J57195R6418J01257j07790
20286A60156p8535j96065P6642J47820O6719l1933j42284j33118J52175n952M1699
20275E7324k14469K4134L61425R787n1832j46518p0212q9796j0242n3739l1983
20264b16121L65068M6766q3731L7365Q672J45103J63507o1127j48241j39393O1940
20253A79808j07592k39799r4695J52060J61085k1209J22461K11544k3318l2512
20243C07833j36357M4665k0198P2568j73156k4012r3549K0921Q8617O6315M3467
20232A97114n7449l2002q1827j50713j9473l6634R7904K14661M1731m6187N1838
20221A78963j64055j25951J79842m5801O4752p2483J31708J79558J7953k40082
$$ plain form
20297 208638 15108 -208249 -230008 -263488 -336045 -341604 -86924 70271 166689 267946 160156
20286 160156 81621 -114444 -37802 110018 176737 144804 2520 -130598 21577 15625 57324
20275 57324 -157145 -133011 228414 238201 186369 39851 -30361 -120157 -130399 -184138 -216121
20264 -216121 148947 195713 111982 149347 158019 303122 466629 405502 257261 117868 179808
20253 179808 72216 -167583 -262278 -110218 50867 29658 152119 363663 340345 307833
20243 307833 171476 216141 195943 268511 95355 71343 -22206 -1285 87332 153647 197114
20232 197114 139665 107663 25836 -124877 -144350 -180984 -83080 131581 173312 127125 178963
20221 178963 14908 -111043 68799 22998 87750 15267 146975 326533 344486 104404
20211A04404m8864J48879j439k47296k59121J60145K44714j17517j65037J41711
20201c9421M15727K24409j10150j14316j79132j71576Q0698m9243J6009R7748
20191A70753K21552j5497j91929m6258r9704j2209j47728j09715j33282j18699
20181d82716M8053J50975j09468k6441P7184J46421M7609J91480P8104o279k4783
20170I0139j35502O6291j19810O8656j62591J05287L09593l75484r8192J47938
20160a03675K93191o363k06393r6213p921N4391m0766o5538K8955K2434j26142
20149b54040l7313j22515r68l9252J20050K29680L8613m3352l5717m1463k4614
20138b10891r903J85541P1194J30422k4738q6217o9346j47804R9932J4533O6831
$$ plain form
20211 104404 55540 204419 202980 -44316 -303437 -143292 101422 -16095 -181132 -39421
20201 -39421 376306 600715 490565 376249 197117 25541 106239 56996 73005 170753
20191 170753 392305 376808 184879 138621 38917 26708 -121020 -230735 -364017 -482716
20181 -482716 -434663 -283688 -393156 -419597 -342413 -195992 -148383 43097 121201 114922 90139
20170 90139 -45363 20928 -98882 -30226 -192817 -87530 222063 -153421 -251613 -103675
20160 -103675 189516 183153 -23240 -119453 -127374 -72983 -113749 -179287 -150332 -127898 -254040
20149 -254040 -291353 -413868 -414836 -454088 -334038 -104358 -65745 -109097 -144814 -186277 -210891
20138 -210891 -220794 -35253 35941 166363 141625 55408 -13938 -161742 -61810 -47277 19554
20127A9554J00635J92316R0222n0563q4522j15535j09678q2469R0609J2132J43097
20116B05798q3374p4974p2303l8710r8078l4129J22934q2508j17398P3710J95795
20105c237O4777K3766R7517L7373k23604k4386m3310Q568L5355L661O6557j45873
20093a02836K3743K31151m8971l3020q0267K05582o3733q7330L3459J7777k0295
20082G5260m1267j21705j96959l10681m5223k3198K92988L69499J6557m6375R9345
20071F8241P2422o6144L689O4972o7709j76379o1433r4588O5246l1676J25846
20060i7513p0990J35865J14640k34969j31401O4003K15133L40722j4955k1104
20050B99431j72194l02861n0246J88184K35277J1596j11317J22234J96002J34137
$$ plain form
20127 19554 120189 312505 402727 352164 267642 152107 42429 -40040 50569 62701 205798
20116 205798 122424 47450 -24853 -63563 -161641 -195770 -72836 -155344 -272742 -199032 -3237
20105 -3237 61540 85306 182823 220196 -3408 -27794 -71104 -62536 -27181 -23520 43037 -102836
20093 -102836 -79093 152058 103087 70067 -10200 195382 131649 44319 77778 95555 75260
20082 75260 33993 -87712 -284671 -595352 -640575 -663773 -370785 -1286 15271 -31104 68241
20071 68241 140663 74519 78208 143180 75471 -100908 -162341 -256929 -191683 -223359 -97513
20060 -97513 -168503 -32638 82002 -152967 -284368 -220365 -5232 335490 320535 299431
20050 299431 127237 -175624 -225870 -37686 197591 209187 97870 220104 416106 550243
20040E50243k6001j3117n2442r9336j15527j53532O3716J14309K2521q6034r2262
20029A12538n6904J54439J65771r166j33769o1845J34819r8960j57600N3104L1043
20018A33470k5705j93055r6304M2473j00758p0288r1076N0959Q8851K5148Q5298
20007a50987O8363J00803k06254k33506K46724J38915m950j22661j29958J30356
19997a63155P2484J0968K73042n9106j88213P8633k8029K0173J36885q8752k8144
19986C6786m7661j09100j85997n9779k0769j05653O0228M6817j01173L4232L582
19975d48487K55922R9693j17446J0316J14663N4373K8345P1298n8116j7754j0558
19964a7751j74984j48255J03581J26939J82807O6952M3142k2419p3564j18844
$$ plain form
20040 550243 524242 511125 458683 359347 243820 90288 154004 268313 290834 204800 112538
20029 112538 55634 210073 375844 366678 232909 171064 305883 206923 49323 102427 133470
20018 133470 107765 -85290 -181594 -139121 -239879 -310167 -401243 -350284 -261433 -236285 -150987
20007 -150987 -82624 18179 -188075 -421581 -174857 -35942 -40892 -163553 -293511 -163155
19997 -163155 -90671 -79703 193339 134233 -53980 24653 -3376 16797 153682 64930 36786
19986 36786 -10875 -119975 -305972 -365751 -386520 -492173 -431945 -385128 -486301 -452069 -448487
19975 -448487 -192565 -92872 -210318 -200002 -85339 -30966 -2621 68677 10561 -7193 -17751
19964 -17751 -192735 -340990 -237409 -110470 72337 139289 182431 160012 86448 -32396
19954c2396j83564l1762M0653J54207J1047j36250M1122J19841n9767J33721k36604
19943a79752k17784K7167Q2289L8428J33814O2512j77481j89541O9367J41045
19933b09936P2698N1061Q8314Q7306r5298j092J15332l2861j3007P6119j97971
19922e9335k6726L2854J89655J34013j22325j54375J66584l5045M681J1736J18
19911A41835j74006J54868N6233R716q9805L1388J97921m916m0142O8350R7265
19900D48707J86791k7743j53873n5630J9928J8403K01171j6041r8836q3347j27769
19889C11761q2086L3473J91004j09611j21019j47289M0999J84149m5875n3101
19879B02405q0354r5630l3977p7478J65976M3441j01087K5407k4739j43321M0568
$$ plain form
19954 -32396 -215960 -247722 -207069 -52862 -41815 -178065 -136943 -17102 -76869 56852 -179752
19943 -179752 -397536 -370369 -288080 -249652 -115838 -53326 -230807 -420348 -350981 -209936
19933 -209936 -137238 -86177 2137 89443 -5855 -6947 108385 75524 62517 138636 -59335
19922 -59335 -86061 -53207 136448 270461 148136 -6239 160345 125300 129981 141717 141835
19911 141835 -32171 122697 178930 188646 98841 130229 328150 323234 283092 351442 448707
19900 448707 635498 607755 453882 398252 418180 436583 637754 621713 522877 439530 311761
19889 311761 229675 263148 454152 344541 223522 76233 117232 301381 255506 202405
19879 202405 122051 26421 -7556 -85034 80942 124383 23296 48703 23964 -119357 -78789
19868g8789n6058j42731O4947j3795N6831j0031J69849J54738o7064M9448K40360
19857C67705K32656k1907k01944J17969O4849L374p2776j3009k4328M5542Q6895
19846E85026O9871Q7120k33619p3329j03508p4513Q4916R558m995j25181j58965
19835F2381M1168O5241Q6481M5633j8620R3287j17113r5361q8783J35495J2312
19824B22121K12539j55736k02411n5871r5324k762j15945P8244J33615l2104K203
19813a1431o9218Q9233l263J01768O1399p1992O4238l6943q9527j35385m8419
19802a49540P246M0461o4810J09510L28873M9689o3671J24247J39383j70647l15825
19791C4916j30889p1280N6854j07316n9968J72602Q1234l6811N8207m1740R5621
$$ plain form
19868 -78789 -134847 -277578 -212631 -226426 -169595 -179626 -9777 144961 77897 127345 367705
19857 367705 600361 578454 376510 494479 559328 562702 489926 476917 452589 498131 585026
19846 585026 654897 742017 508398 435069 331561 257048 341964 351522 346527 221346 62381
19835 62381 103549 168790 255271 300904 282284 375571 258458 163097 74314 209809 222121
19824 222121 434660 278924 76513 20642 -74682 -77444 -193389 -115145 18470 -13634 -11431
19813 -11431 -80649 8584 5321 107089 168488 96496 160734 123791 34264 -101121 -149540
19802 -149540 -142294 -101833 -166643 -57133 271740 321429 257758 382005 521388 350741 34916
19791 34916 -95973 -167253 -110399 -217715 -277683 -105081 -23847 -60658 -2451 -44191 51430
19780E1430r6172L9753m1672j12541m744r8286J8939J05559J5254J29505q5613
19769g8588K7087K37908O1810k09986k22490q0864n327K9786J92447l16R9263
19758E0730J0877O5134j60396k41742J120j77214M5337L22371J8779K8938K56474
19747B20408K58015r1276k19728o136J39929Q2763m2711o4449j79815j03672Q1611
19736G4939J05050J698q3057j12356O4890j46272Q5092r6964K7427J09643J5643
19725D5733N0311n010P1143q9279o8450r7293M8104Q2355J61544m6297o5892p6478
19713A0491J25440M1529P9847j04466j71347k20528R177M37025o3373k36071P6530
19702a5746o0444J4461P2358k5828o8967j62181M0876N1898r5074J61104j1738
$$ plain form
19780 51430 -44742 -4989 -46661 -159202 -163946 -262232 -243293 -137734 -122480 7025 -78588
19769 -78588 -51501 186407 248217 38231 -184259 -265123 -270450 -240664 -48217 -48533 50730
19758 50730 61607 126741 -33655 -275397 -274277 -451491 -406154 -83783 -65004 -36066 220408
19747 220408 478423 387147 167419 161283 301212 383975 341264 276815 97000 -6672 74939
19736 74939 179989 181687 98630 -13726 51164 -95108 -10016 -106980 -79553 30090 45733
19725 45733 96044 91034 162177 72898 4448 -92845 -44741 37614 199158 152861 86969 10491
19713 10491 135931 177460 257307 152841 -18506 -239034 -229857 207168 143795 -92276 -15746
19702 -15746 -76190 -61729 10629 -15199 -84166 -246347 -205471 -153573 -248647 -87543 -99281
19691i9281J79107j45550j13029r7806n9538r800J49299L02923j3701j44668j72203
19680b24247p7732o1430K2968J72674j22525P5797J3608n8956j15810J1537J37429
19669b26687J1239j69165L538L9290N6009J05222J51689P0435o8267j06089K3850
19658a08936k3122j43143p0047J89910R0205k3233J85851p9781Q9107n7060k80317
19647b30566j2739R0380N3523Q3040j34984r7465K25673n3147j02088J12206J5050
19636e1117J13703K36829l3994r9697n3680n5789K22421J97666p3202k34329q2783
19625H6028p9686J5518N2129O6282j94708j32891J26829J16178J36691l3417j07302
19614E1651J7804O6200J9749n2575j54606Q8112J93937p573M5628K06935Q6032
$$ plain form
19691 -99281 79826 -65724 -178753 -276559 -336097 -345897 -196598 106325 92624 -52044 -224247
19680 -224247 -301979 -363409 -340441 -167767 -290292 -214495 -200887 -259843 -375653 -364116 -226687
19669 -226687 -215448 -384613 -381075 -341785 -285776 -180554 -28865 41570 -26697 -132786 -108936
19658 -108936 -132058 -275201 -345248 -155338 -65133 -88366 97485 17704 106811 49751 -230566
19647 -230566 -243305 -152925 -99402 -16362 -151346 -248811 -23138 -76285 -178373 -66167 -51117
19636 -51117 62586 299415 265421 165724 112044 56255 278676 476342 403140 168811 86028
19625 86028 6342 21860 73989 140271 -54437 -187328 -60499 55679 192370 158953 51651
19614 51651 69455 135655 155404 102829 -51777 36335 230272 222699 268327 475262 561294
19603E61294k45099j23108J0194p63O9484M0300j49694j64066l25503q5290P3504
19592c38747P4988M7932K62229J49032j47956j82355J16108K6166J14291k1547
19582A00141j68779N2457P4585m5679n931j08197O4767M6822j32894J21685J40198
19571A39175p5309m6794J79027n9027j58253j34834j5600O7350L7914J49380L7595
19560A20624j32223L8451K1554J12983j30001j47462k9097Q3162J6633M1231j62929
19549a67074k36687k4727J6407P4909K29215j00343m7462j37117j35762j14364
19539f43005L32401M05806J23694o8333n7874J06447O2658N809j49846j52794
19529c5037n4555l6136Q8527J25019j380j16676q2080J28824k1892k50991L6422
$$ plain form
19603 561294 316195 193087 203281 202518 272002 312302 162608 -1458 -326961 -412251 -338747
19592 -338747 -263759 -215827 46402 195434 47478 -134877 -18769 7397 121688 100141
19582 100141 -68638 -16181 58404 12725 6794 -101403 -36636 10186 -122708 -1023 139175
19571 139175 63866 17072 196099 137072 -21181 -156015 -171615 -104265 -66351 83029 120624
19560 120624 -11599 26852 48406 161389 31388 -116074 -145171 -62009 -45376 -4145 -167074
19549 -167074 -403761 -428488 -412081 -337172 -107957 -208300 -255762 -392879 -528641 -643005
19539 -643005 -310604 95202 218896 150563 92689 199136 261794 267603 117757 -35037
19529 -35037 -89592 -125728 -37201 87818 86438 -30238 -112318 16506 -5386 -256377 -219955
19518b19955K08531J59928J79303O025j0485j87241p3195J96463N1420N2723R4514
19507D58031J21075o2449Q6427K00917K89831k0066n6887P3830n2097l55446o2798
19496F20368L0542N697k08936r8827k94563j45900P0023O4490o3867k8538L5741
19485a3770N5674O9689j04489p3239q401j0411P2676J40996k17863j83145P1435
19474b00848o7467j02422l5879R7913K6339L4630P8357J13586O0560J84689J41959
19463C31417k7376j03997o6391j5201J81792J76949k0996o7128j15007M251J69962
19452D48275J22106J8964l9272Q6208J0761j35012j9909j07358N4338L58701R7624
19441H95426k03559j95557j31915r3956m9330M0578j33626K873J92658k9610o0388
$$ plain form
19518 -219955 -11424 148504 327807 333832 323347 136106 62911 259374 310794 363517 458031
19507 458031 579106 516657 603084 804001 1093832 1073766 1016879 1090709 1038612 683166 620368
19496 620368 650910 656607 447671 348844 54281 -91619 -21596 42894 -20973 -49511 -13770
19485 -13770 41904 111593 7104 -66135 -74536 -84947 -12271 128725 -89138 -272283 -200848
19474 -200848 -268315 -370737 -406616 -308703 -282364 -247734 -169377 -55791 4769 189458 331417
19463 331417 304041 200044 133653 118452 300244 477193 456197 389069 274062 278313 448275
19452 448275 570381 589345 550073 636281 647042 512030 492121 384763 439101 797802 895426
19441 895426 691867 496310 364395 270439 221109 261687 128061 130934 323592 293982 233594
19430B33594J70223r8410o3161L3325P209N7511j4362j68542j14798k4420j07968
19419h9799L3727R8402J94443K48060k5973j31439j01041j09922j50263N5496
19409B1691K04783J98149k42399l16734o021l017m0283R828L3517j52759o2729
19398c55974J90089q780N7001j89560N4359L19318p707j20202J3213J55173k5517
19387H1413j69336J69081J9116l47351r5154N2470K49604O8612l514j9822q8020
19376h2901l721K47539Q2002q8758p1992l413K03986M5216r7780l3602j41507
19365E5069p4072K00289P5012o1914j29089j59849q6657m7081P2536J75698R630
19354B9572M117o5298N1275n6255j35079n348j148n2202M9695J37904P5014N2894
$$ plain form
19430 233594 403817 305407 242246 275571 282780 340291 325929 157387 42589 18169 -89799
19419 -89799 -56072 42330 236773 484833 458860 327421 226380 116458 -33805 21691
19409 21691 226474 424623 182224 -134510 -140531 -143548 -183831 -174003 -140486 -293245 -355974
19398 -355974 -165885 -174665 -117664 -307224 -252865 66453 58746 -61456 -48243 106930 81413
19387 81413 -87923 81158 100274 -247077 -342231 -289761 -40157 28455 24941 5119 -82901
19376 -82901 -86622 160917 242919 154161 82169 78756 282742 327958 230178 196576 55069
19365 55069 -19003 181286 256298 194384 65295 -94554 -181211 -228292 -155756 19942 29572
19354 29572 33689 -31609 19666 -36589 -171668 -177016 -178164 -230366 -180671 -42767 32247 85141
19342H5141k03312K8347P1206K41184o0861O5577p6650k21461L3891Q2467j44777
19331i9248J46840J05845j48401p2691j684J55459m8970p0665j48935n8245q1720
19320c22415P5103K1160l5907K54443K13617J6922j79536M2345K4925J87902n9854
19309B38705p2016K5091R964r2375l1626J02181J8882j00268j15104n7779q1808
19298a56153Q866J52066J77410R8832J31918j7819p7073o4105j02603m5135q9946
19287A6258j79447J9592J65393K15282J52829k18091m18684J8468L9799R6825
19277i1776j5156J04040J09365J6974l7926j42175j6577j9865J42465K2694j03985
19266c1922J27928O5854j53804l3915K2602M3951o305j18605j13166n4158P1097
$$ plain form
19342 85141 -118171 -89824 -18618 222566 161705 227282 150632 -70829 -36938 45529 -99248
19331 -99248 47592 153437 5036 -67655 -69339 86120 37150 -33515 -182450 -240695 -322415
19320 -322415 -247312 -226152 -262059 -7616 206001 222923 43387 85732 110657 298559 238705
19309 238705 166689 191780 201744 109369 77743 179924 198806 98538 -16566 -74345 -156153
19298 -156153 -147287 4779 182189 281021 412939 395120 318047 253942 151339 106204 16258
19287 16258 -163189 -143597 21796 237078 389907 171816 -246868 -228400 -188601 -91776
19277 -91776 -106932 -2892 106473 123447 85521 -56654 -73231 -93096 49369 72063 -31922
19266 -31922 96006 161860 8056 -25859 -3257 40694 34389 -84216 -197382 -251540 -180443
19255a80443Q8501K34468K4274j1351Q8873K4784M0386j22412r4374Q7515j00161
19244H0060j52538O4980l6682j39855J00040p5353K48J19561J14953m6418M4274
19233G3270J20409O0865J7635K9944K52Q2746P3020j88157o3061K9654o4735o100
19221A65742J32280j52899L4852N2703n9537p4480j08090N4673J5371O4355J12141
19210B37111J36589l21024q5729j05867j25327N1769J53486L9792r379L7786P4207
19199H3414J68576j19928j12032K996K07200j11942O2892Q2772o8990l35572m5084
19188a85698J92716O8727o4189j62086p1755J2932j7201K06681J74359j3133J59555
19177C00908r094M9853J7475p8885J211N2956j607N1187J33354J00248j05152
$$ plain form
19255 -180443 -91942 142526 166800 155449 244322 269106 309492 187080 92706 180221 80060
19244 80060 -72478 -7498 -44180 -184035 -83995 -159348 -159100 -39539 75414 28996 73270
19233 73270 193679 254544 272179 302123 302375 385121 458141 269984 206923 236577 171842 165742
19221 165742 298022 145123 179975 232678 173141 98661 -9429 45244 60615 124970 237111
19210 237111 373700 52676 -33053 -138920 -264247 -212478 -58992 -19200 -28579 9207 83414
19199 83414 251990 132062 20030 23026 230226 118284 181176 263948 194958 -140614 -185698
19188 -185698 7018 75745 11556 -150530 -222285 -209353 -226554 -19873 154486 141353 300908
19177 300908 291814 341667 359142 280257 281468 334424 332817 384004 517358 617606 512454
19166E12454Q090J23424o5699r5231j7489K3547L6195k07532k54625O6778K18168
19155C48080J06618m07900p4599M2538k29022N2984J40195J81448L5528o6302
19145A29568L8497n0234K572M7806L4827j20703l6720r8378J89130K17889p3156
19134B81098j67993q9057j06785K171O5608K40754M1981O4802M7592O06P9562
19123D60339j23411j96413J16278J89108P4654n332L2723j6738j8680L2896k42906
19112C02518M863n714l3358J19389M7098m0375L13304J43160O9273J22563J47860
19101A190581K59349R7762K062j33984j50308p0960n2965r5022N8640J95986K4743
19090A325884j69594j47416j02248J50225j34172j59436p8854j53681j73723J3944
$$ plain form
19166 512454 520544 643968 578269 483038 465549 489096 525291 317759 63134 129912 348080
19155 348080 454698 46798 -27801 14737 -214285 -161301 -21106 160342 195870 129568
19145 129568 168065 117831 120403 168209 203036 82333 45613 -52765 136365 354254 281098
19134 281098 113105 24048 -82737 -80566 -14958 225796 267777 332579 380171 380777 460339
19123 460339 336928 140515 256793 445901 520555 515223 547946 531208 512528 545424 302518
19112 302518 307381 301667 268309 387698 434796 394421 707725 850885 920158 1042721 1190581
19101 1190581 1449930 1547692 1549754 1415770 1265462 1194502 1141537 1046515 1105155 1301141 1325884
19090 1325884 1156290 1008874 906626 1056851 922679 763243 684389 530708 356985 370929
19080C70929J99553j02952l6179O5068L1601O4345n8998k62520l042K88371K04273
19069G60449k3517r5927N5282j34453L1245j7744J50340l2339K06947J01544n4165
19058I47662J4634O4858j17981R7768P8580j12421J50136L41229M1554K9829K0927
19047A556775m87J06481Q9958R3654J05550J19355P0802l3191J42342q9359O9010
19036B230890j11539J9565J48403K8067o3358j47537r785j80128k30239o3311
19026A621028p9988P2704L45998K95329J95473J566P368L28918L06779K02499
19016C297674L73620L13927K89074L51428J12838K37984L23877L90591M23771
19007F114784J13980J98763K94685O5173J44980L01824K71883M16566K24743K87493
$$ plain form
19080 370929 570482 467530 431351 496419 528020 592365 533367 270847 267805 556176 760449
19069 760449 736932 641005 696287 561834 593079 575335 725675 693336 900283 1001827 947662
19058 947662 962296 1027154 909173 1006941 1085521 973100 1123236 1464465 1506019 1535848 1556775
19047 1556775 1556288 1662769 1752727 1846381 1951931 2071286 2142088 2108897 2251239 2161880 2230890
19036 2230890 2119351 2138916 2287319 2315386 2252028 2104491 2094706 1914578 1684339 1621028
19026 1621028 1541040 1613744 1959742 2255071 2450544 2452110 2459478 2788396 3095175 3297674
19016 3297674 3671294 3985221 4274295 4625723 4738561 4976545 5300422 5691013 6114784
19007 6114784 6228764 6427527 6722212 6787385 6932365 7234189 7506072 7922638 8147381 8434874
18997H434874M26439N06174M87471O66370J079409J194539J340381J506383J995494
18988A7637534K932995M110188N575580P651451R901322J0880811J0047711Q349801
18980G7087393O735736O025964O875853Q259196R775275R864475Q406990M766420
18972A37797302P08556l079110n260170n381317n409714n370124o007096p375190
18964A00623137q428004q934183r102405r194978q955789q352474p590500o156100
18956C3908704m488079l139168k258899j743084j127758q33272q69636q92153
18948A8556655o53311n19099k03403q9716l24086j17232k22939n8054J29338K39424
18938A6737577L87825M79224P09953J002838J410732J904051K728794L528817
$$ plain form
18997 8434874 8861313 9367487 9854958 10521328 11600737 12795276 14135657 15642040 17637534
18988 17637534 20570529 24680717 30256297 37907748 47809070 58689881 68737592 77087393
18980 77087393 83823129 89849093 96724946 104984142 114759417 124623892 133030882 137797302
18972 137797302 138505858 135426748 130166578 124785261 119375547 114005423 107998327 100623137
18964 100623137 92195133 83260950 74158545 64963567 56007778 47655304 40064804 33908704
18956 33908704 29420625 26281457 24022558 22279474 21151716 20318444 19448808 18556655
18948 18556655 17903344 17384245 17180842 17091126 16767040 16649808 16426869 16368815 16498153 16737577
18938 16737577 17125402 17604626 18314579 19317417 20728149 22632200 25360994 28889811
18930B8889811M712494O701119R534809J1853177J2429870J1309703R128662P109548
18922A01669193P062127Q590788J0589599J1560146J0896029P856321L056490
18915A61280693j075997n051947o924376p115382o650124o660846p291147q764516
18907A11746358j0454304j0936817j0977041j0753968j0453500r704704q617952
18900C9848072p085931n054816l632132k764755j943272j848390j507439j206568
18892A4804769j160092q65248j005601q18838n22469n18784n62449m27077k26620
18883H697591n52152n42133l86720l52555m51850j80077k59139l04647k69639
18874E398679l21111m37337r3914N991k28700l07027j42788j35255k8913j41541
$$ plain form
18930 28889811 33602305 40303424 49838233 61691410 74121280 85430983 94559645 101669193
18922 101669193 108731320 117322108 127911707 139471853 150367882 158224203 161280693
18915 161280693 160204696 155152749 148228373 141112991 134462867 127802021 120510874 111746358
18907 111746358 101292054 90355237 79378196 68624228 58170728 48466024 39848072
18900 39848072 32762141 27707325 24075193 21310438 19367166 17518776 16011337 14804769
18892 14804769 13644677 12779429 11773828 10954990 10432521 9913737 9351288 8924211 8697591
18883 8697591 8145439 7603306 7216586 6864031 6412181 6232104 5972965 5668318 5398679
18874 5398679 5077568 4640231 4546317 4552308 4323608 4016581 3873793 3738538 3709625 3568084
18864C568084r8141n952o6558r9623O3134k54879q5829j17211k34479j35076Q2658
18853B616128J09534n9162O8229N181J29969K964k37316j51142K3691J33094q9443
18842B551727j82841j26709p0567n0591j94405k08145q362m100J71741k66558
18832A611190r0239J48402Q286q7836k43275j99471j90724q4740j2718o2530N7349
18821H53694J6690j85864J12032M0907O3656l7149q8013N9165l089J7209J84413
18810A033651j55725p7922l8653n8299p6779J15962k6906J76743o5885J35146
18800I61333p3837j74928k13M0243K11745R0389N0691J9570J93853Q6716n984
18789A399578K5269k1045J19204j13396k39099k55039j04168N2737O177J7318
$$ plain form
18864 3568084 3469943 3463991 3397433 3297810 3360944 3106065 3020236 2903025 2668546 2533470 2616128
18853 2616128 2725662 2666500 2734729 2739910 2869879 2872843 2635527 2484385 2508076 2641170 2551727
18842 2551727 2368886 2242177 2171610 2121019 1926614 1718469 1710107 1706007 1877748 1611190
18832 1611190 1520951 1669353 1677639 1589803 1346528 1147057 956333 871593 858875 796345 853694
18821 853694 870384 684520 796552 837459 901115 863966 775953 835118 832029 849238 1033651
18810 1033651 877926 800004 761351 703052 626273 742235 715329 892072 826187 961333
18800 961333 887496 712568 712355 752598 964343 1054732 1105423 1124993 1318846 1405562 1399578
18789 1399578 1424847 1403802 1523006 1409610 1170511 915472 811304 864041 870218 887536
18779H87536J9910L6717m7810J63234k1913j89913n2122J7136r7756L7874K3483
18768G76376M2035l5846P0740k38482j29769m0732j15526K51314L1791k66646
18758C45255J7576K17652j23833J20554Q9538j44949L1708q6674P4976J20358
18748F62161Q3217R4380K0403j44932j43361k03643L2169J06395k50498m1817
18738B14474j76663r9879J16410o6889J37257Q5321J96549J53512j7667k25855
18728C16570o4262K54904N8110J3474P3059O0859j27666j09320j3835r1188R7745
18717D68450J37485q6590j61667r728L52762J45889k15444j56642j3403j60150
18707C00962J21930J05559J88203K03000O9056k50711m6957l0004q3541R1884
$$ plain form
18779 887536 907446 944163 896353 1059587 1037674 847761 795639 812775 715019 752893 776376
18768 776376 818411 782565 853305 614823 485054 444322 328796 580110 611901 345255
18758 345255 362831 580483 456650 577204 666742 521793 553501 466827 541803 662161
18748 662161 745378 839758 860161 715229 571868 368225 400394 506789 256291 214474
18738 214474 37811 -62068 54342 -12547 124710 210031 406580 560092 542425 316570
18728 316570 252308 507212 565322 578796 651855 712714 585048 475728 461893 370705 468450
18717 468450 605935 519345 357678 347950 700712 846601 631157 474515 461112 300962
18707 300962 422892 528451 716654 919654 988710 737999 691042 661038 577497 669381
18697F69381k00432k84000q6027L03966M2326l9547L5370J50782n441j19128P877
18686D75127P5547j12711J26749j3290p1382K7367J52126R5112k16606j02475
18676D35564j70265j63119l3686J03030L0742j59039Q1458J14514R1217M9255
18666C79671j06877R3156J09579k37697k11047k29757J87872k991j53634j4858
18656a86583O2250J09681M8855K84096P1881j19729p1653j31744l1180L1898K32317
18645C00089j2837j14193k19436J8905K53879J81241J3054l57504M7114J4608
18635A24920J71447R1308J24176J09660k6317m27049m760j22743o4197J02947
18625G9392J00596N2709l85M5085o8817k2820J14304K39062n0724k09980j55613
$$ plain form
18697 669381 468949 184949 98922 402888 445214 405667 441037 591819 586378 467250 475127
18686 475127 550674 437963 564712 551422 480040 507407 659533 754645 538039 435564
18676 435564 265299 102180 68494 171524 202266 43227 124685 239199 330416 379671
18666 379671 272794 365950 475529 237832 26785 -202972 -15100 -18091 -171725 -186583
18656 -186583 -124333 -14652 34203 318299 390180 270451 198798 67054 35874 67772 300089
18645 300089 287252 173059 -46377 -27472 226407 407648 420702 63198 110312 124920
18635 124920 296367 387675 511851 621511 595194 168145 163385 40642 -23555 79392
18625 79392 179988 232697 232312 277397 208580 185760 300064 539126 488402 278422 122809
18614A22809N4097J14632p6916m6905N9093L0081M6762j22296k76389j07055n9688
18603b61775J79743J63089N9764o5438K8253K5705j07423O840J67933l8448k5735
18592A32508n3244J7833P3813m764J9848P5867j12580j21535L837J7146L111Q9792
18580A41632K3570j64861J0516R2545N4824o7320j98188o0531m5179Q1284J9016
18569a12692J53574O871m9132k8300J6083L9820j40973k4771j5722p2756J16599
18558a11399j4974k657K07035P8631l3766J07870n8656j39102q7760J51156J8557
18547A14935R7228J04505K7957O7920O838k22553j26490J91662J32483k17435
18537A77050P0429J00027l08327q6332J42672J49128q9507k22600J21602J67393
$$ plain form
18614 122809 176906 291538 214622 167717 226810 256891 303653 181357 -95032 -202087 -261775
18603 -261775 -82032 81057 140821 75383 103636 129341 21918 28758 196691 158243 132508
18592 132508 79264 97097 170910 166146 185994 261861 149281 27746 31583 48729 51840 141632
18580 141632 165202 341 10857 103402 158226 90906 -107282 -167813 -212992 -131708 -112692
18569 -112692 40882 47753 -1379 -29679 -13596 26224 -114749 -139520 -155242 -227998 -111399
18558 -111399 -126373 -129030 78005 156636 122870 230740 172084 32982 -54778 96378 114935
18547 114935 212163 316668 344625 412545 419383 196830 70340 262002 394485 177050
18537 177050 247479 347506 39179 -47153 95519 244647 155140 -67460 54142 221535
18527B21535N3176O272r6495j46156n7367Q1243J05094J59748j61837k50084l7135
18516a22006r8330J06407K94559J24114j37201j17321r780j9527l8055j32759
18506a49899K3057k341L67128P0156L8154o2165J8933j34284j46108N7907J44185
18495B24723J3935j03885K295q2733o5943l6242j29612K86071P9505M6446J13208
18484C47768l1649r6170j04189k34307O5678j00381m1777Q9758K59111J81900
18474C35742r8223m6467q1952k644J93533q4447n3204K4274N0680M689N6364j37715
18462A60630J8421K8855j06823j63608k24533J44630K03244P1298P1206j37346
18452F5974l3887K09995K36552o5236K42520J27380j15971j32098R523P1397J59252
$$ plain form
18527 221535 274711 280983 184488 38332 -19035 62208 167302 327050 165213 -84871 -122006
18516 -122006 -220336 -113929 180630 304744 167543 50222 40442 20915 -17140 -149899
18506 -149899 -126842 -129183 237945 308101 346255 284090 303023 168739 22631 80538 224723
18495 224723 238658 134773 137068 54335 -11608 -47850 -177462 108609 188114 234560 347768
18484 347768 316119 219949 115760 -118547 -52869 -153250 -195027 -105269 153842 335742
18474 335742 237519 191052 109100 106456 299989 215542 162338 186612 237292 241981 298345 160630
18462 160630 179051 207906 101083 -62525 -287058 -142428 60816 132114 203320 65974
18452 65974 32087 242082 478634 413398 655918 783298 667327 535229 544752 616149 775401
18441G75401O9455L5720j56854M1042j4188k49245r6806J92440J69224J33530
18431H99719q2839j05863l2142j34122J62258J74388j35473j21734j13009j35973
18421C75210o2850J276j27569j02571j50619j93351J8722Q6699M08407K63798
18411E17152j78763j1707R3251k86947j55014K20393J97615J702J36944J88713
18401G23339j83150j91499K81771J06520Q4609J25339K7311N8918Q9881p6175
18391A046864P3524n1905J20085J78664J70455K81880L35280J25876J86578J82039
18381B649340K37214K59360j6300k0935R5853o9523j07952l12131m92487k94034
18371A928405j14891q4501k01204J525j96311j24294j26068J12211J49000J35015
$$ plain form
18441 775401 844856 880576 723722 764764 750576 501331 404525 596965 766189 899719
18431 899719 816880 711017 678875 544753 707011 881399 745926 624192 511183 375210
18421 375210 312360 313636 186067 83496 -67123 -260474 -241752 -155053 253354 517152
18411 517152 338389 326682 419933 132986 -22028 198365 395980 397682 534626 723339
18401 723339 540189 348690 630461 736981 821590 946929 974240 1033158 1123039 1046864
18391 1046864 1120388 1068483 1188568 1367232 1537687 1819567 2154847 2280723 2467301 2649340
18381 2649340 2886554 3145914 3129614 3108679 3204532 3135009 3027057 2714926 2222439 1928405
18371 1928405 1813514 1729013 1527809 1529334 1333023 1208729 1082661 1194872 1343872 1478887
18361A478887J65059m889k23150O6229J59927L3251q0147m9006j83457k43535
18351A119169j3182l4500j0205O2091r794o6984j71677m495p6256j13433k63769
18340D16965N7005K44972Q2459J09679n7029J03767O85p0383p8169L12J80205
18329I90468J90702j27152L5810J57988J05189M3233J76337P1599n1240R2185
18319A685119J13502K39178R3712n6680k62776J3679J67985O8495j6179j03031
18309A943004q0620j50796p2023o926k02159j77554P6164J29090J29537N1521
18299A639238N838K5314j20930J02519P3923o0323J26049r350M9796l4184j32827
18288A665063n340K9592N2802J49184J27530n5915k4768J14458K32847K0615P9899
$$ plain form
18361 1478887 1643946 1639057 1415907 1482136 1642063 1675314 1595167 1546161 1362704 1119169
18351 1119169 1105987 1071487 1061282 1123373 1113579 1046595 874918 870423 794167 680734 416965
18340 416965 473970 718942 801401 911080 854051 957818 958503 888120 809951 810263 990468
18329 990468 1181170 1054018 1089828 1247816 1353005 1396238 1572575 1644174 1592934 1685119
18319 1685119 1798621 2037799 2131511 2074831 1812055 1825734 1993719 2062214 2046035 1943004
18309 1943004 1862384 1711588 1639565 1632639 1430480 1252926 1329090 1458180 1587717 1639238
18299 1639238 1645076 1670390 1549460 1651979 1725902 1665579 1791628 1782278 1832074 1797890 1665063
18288 1665063 1659723 1689315 1742117 1891301 2018831 1962916 1938148 2052606 2285453 2306068 2385967
18277B385967J76972L55143K79212J18010j8657K43683R4738R7036k1872O1559
18267C771791n2511J64352K30289K33184J87008l5204L7564j4381l3468J87337
18257D675961J89026M1830J07432L39667J72064R9263J17090J66897K02892M80428
18247F592550N27992O96072R09954J076970J655201J961776K613090L639107M835176
18238B4507888O773631R439879J1509502J1240876Q280151N003747L026726K734219
18230H2516619L585112M037482J913283j799536n218779o717215p675173q481639
18222F2160154q681233q418985p738861o230266m538746l359008k231766j467161
18214A9494128j274491j046866j036867l70773k42831k26397k0776N0009K75972
$$ plain form
18277 2385967 2562939 2918082 3197294 3315304 3296647 3540330 3635068 3732104 3710232 3771791
18267 3771791 3719280 3883632 4113921 4347105 4534113 4498909 4536473 4522092 4488624 4675961
18257 4675961 4864987 4906817 5014249 5353916 5525980 5625243 5742333 5909230 6112122 6592550
18247 6592550 7120542 7816614 8726568 9803538 11458739 13420515 16033605 19672712 24507888
18238 24507888 31281519 40721398 52230900 63471776 71751927 76755674 79782400 82516619
18230 82516619 86101731 90139213 92052496 90252960 85034181 78316966 70641793 62160154
18222 62160154 53478921 45059936 37321075 31090809 26552063 23193055 20961289 19494128
18214 19494128 18219637 17172771 16135904 15765131 15522300 15295903 15275127 15325136 15601108
18205A5601108K28490M97816P94558J115150J224293J632304K613588L405605
18197B7112912M692805O886204R651457J2675555J4023570J2251134Q291265N044987
18189A00629889L338705L347691L981059L639100J515906j906188l890978l709494
18181A06945690k943300j654604p91112j421616l015585l575229k689478j079110
18173H9775656M10355O99164r95805l781810n800633o963572p817229p983385
18165E7542741p933436p661648o646270n377355l894857k726215k209399j637925
18157A9455636j074078p48878p75368p53275m63577m37872k91463l18025K8512
18148A4621612J39902R0283M13272N67586J127201J499922K178424L118949M500108
$$ plain form
18205 15601108 15829598 16327414 17121972 18237122 19461415 21093719 23707307 27112912
18197 27112912 31805717 38691921 48343378 61018933 75042503 87293637 95584902 100629889
18189 100629889 103968594 107316285 111297344 114936444 116452350 114546162 110655184 106945690
18181 106945690 104002390 102347786 101556674 100135058 97119473 93544244 90854766 89775656
18173 89775656 90186011 90885175 89889370 86107560 80306927 73343355 65526126 57542741
18165 57542741 49609305 41947657 35301387 29924032 26029175 23302960 21093561 19455636
18157 19455636 18381558 17632680 16857312 16104037 15640460 15202588 14911125 14593100 14621612
18148 14621612 14761514 14851797 15265069 15832655 16959856 18459778 20638202 23757151 28257259
18139B8257259O585081R360654J1866061J2314714R416743N625290K980691J976836
18131H8383329K285481L184673J843598j355022m888217o954854q216424r106099
18123F5176465r354502r336100q890534p272594n665407m189140k862576k290806
18115A5314806j626521j492158j137635n20208n01781r28045p54073l17798k1283
18106H015304j76981l08133m55659n04134k40922m0763J8658k84476m19945n62970
18096E039979j77638j30741k09971k04894r2096k17545k14229l24925j17819J05237
18086C455358k97805l61925r8654m184j41448q9112J32158M1246j13894j31400
18076B390340Q7672k6849k40172L2580l14866j21533M2782M6916K61048J85043
$$ plain form
18139 28257259 34842340 44202994 56069055 68383769 77800512 83425802 86406493 88383329
18131 88383329 90668810 93853483 95697081 94342059 89453842 82498988 74282564 65176465
18123 65176465 55821963 46485863 37595329 30322735 24657328 20468188 17605612 15314806
18115 15314806 13688285 12196127 11058492 10538284 10036503 9108458 8354385 8036587 8015304
18106 8015304 7838323 7530190 7074531 6570397 6329475 6288712 6307370 6022894 5602949 5039979
18096 5039979 4862341 4731600 4521629 4316735 4224639 4007094 3792865 3467940 3350121 3455358
18086 3455358 3157553 2795628 2696974 2692790 2551342 2462230 2594388 2635634 2521740 2390340
18076 2390340 2478012 2451163 2210991 2243571 1928705 1807172 1849954 1896870 2157918 2342961
18066B342961j7812j40028O5505N0701m5322Q3743J77544n459j50335P1169N2770
18055B485437l3122j08659r9934q7963r3160r8362j14653P8070j8287J7304J27971
18044B054642K04420k10430k78101k12931n3279L7653n7645j9894q2345j02885
18034A279205N3036R0723k57482l16028j44388q3856m4898J44301k6687j21766
18024E72160q4385K67929J92832N3130L9309j03658k19159j44456q814K19196
18014G84084K17692J82122j4283P377M3663q525J39486n4727r8610J8570L4514
18003A251363o9959j58977n5640j6171q6029j80886J1706p3997o65l3691J54078
17992G41132N5392j30561N4972K01169J74978k24074k45175O3793K04630j59185
$$ plain form
18066 2342961 2325149 2185121 2250626 2301327 2256005 2339748 2517292 2511833 2361498 2432667 2485437
18055 2485437 2452315 2343656 2243722 2155759 2062599 1964237 1849584 1927654 1909367 1926671 2054642
18044 2054642 2259062 2048632 1770531 1557600 1504321 1541974 1484329 1464435 1382090 1279205
18034 1279205 1332241 1422964 1165482 849454 705066 621210 576312 720613 693926 572160
18024 572160 487775 755704 948536 1001666 1040975 937317 718158 573702 564888 784084
18014 784084 1001776 1183898 1169615 1176992 1220655 1212130 1351616 1296889 1198279 1216849 1251363
18003 1251363 1181404 1022427 966787 950616 864587 683701 695407 621410 620745 587054 741132
17992 741132 796524 665963 720935 922104 1097082 873008 627833 691626 896256 737071
17982G37071n6797K36643M7233N7063j88889J2589j00891j45060p1228J53083
17972F80817J30809N3567M3740M6740J87239N6281j61715J06478R8721j31032
17962A111645k060M6185J24410Q9518J79174k4236R8080P411N8593J28750J272
17951A818742j14190K69350j24775k63049k1987j42536j52468j8114N7169J44563
17941A452705M05182M85187K21968j19239L23015M51381J04271J94304L57142
17932C875916R92J6452q9090m640m6818j5290r8035o6472N345r1313j78960R5145
17920C403232J84089M02206M47577Q01702R44853O87979L78434N07274M06253
17911H163599J03589J52725K45998M2588l15801o80487n77766p79582p52755p46570
$$ plain form
17982 737071 680274 916917 964150 1021213 832324 844913 744022 598962 527734 680817
17972 680817 811626 865193 908933 955673 1142912 1199193 1037478 1143956 1242677 1111645
17962 1111645 1109585 1155770 1280180 1369698 1548872 1524636 1622716 1630127 1688720 1817470 1818742
17951 1818742 1704552 1973902 1849127 1586078 1564091 1421555 1269087 1250973 1308142 1452705
17941 1452705 1857887 2343074 2565042 2445803 2768818 3220199 3324470 3518774 3875916
17932 3875916 3876908 3893360 3804270 3799630 3752812 3737522 3639487 3573015 3578360 3487047 3308087 3403232
17920 3403232 3587321 3989527 4437104 5238806 6183659 6871638 7250072 7757346 8163599
17911 8163599 8267188 8419913 8665911 8708499 8392698 7712211 7134445 6354863 5602108 4855538
17901D855538p01227m12750l83654l15227j17014J48436k61641J10734K61853
17892C185048L2396J27545K46130L65651J56242K37848K00462m3483p5231m9397
17882D383211P4256J02708J26545R2988k7530j82505j1637K29133J21070J11781
17872E020020J38250k14067M9563j25241q7745N6215K01424L4346n4970J60737
17862E178532N03372L65557J42457L24690L08721K30336L61393N01146L36694
17853H252898O75780P07282P56518R91723J050586J269711J278418J468962J875636
17844A8327514K202328K953451L693664M923885O709020R277981J2436368J4078084
17836G4602295J0837816N938363K467169J61877j096829j045435N62390L331553
$$ plain form
17901 4855538 4154311 3741561 3357907 3042680 2925666 3074102 2812461 2923195 3185048
17892 3185048 3217444 3344989 3591119 3956770 4113012 4350860 4551322 4507839 4432608 4383211
17882 4383211 4457467 4560175 4686720 4779708 4752178 4569673 4558036 4787169 4908239 5020020
17872 5020020 5158270 4944203 4993766 4868525 4780780 4836995 5038419 5072765 5017795 5178532
17862 5178532 5681904 6047461 6189918 6514608 6823329 7053665 7415058 7916204 8252898
17853 8252898 8928678 9635960 10392478 11384201 12434787 13704498 14982916 16451878 18327514
17844 18327514 20529842 23483293 27176957 32100842 38809862 48087843 60524211 74602295
17836 74602295 85440111 91378474 93845643 94007520 92910691 91865256 92427646 95759199
17828I5759199N625070M323249K97720k614867m655172n923300o311631o326925
17820H0173343n836980m085510j208144K257136N947871J0195559J6222571K4393203
17812A28059049L4725221M3647086M6253778M1285078L2140148K3679558J9673019
17805C69462937J8010609J2928447K168589j1669190k3737729l0997449l3218887
17798C02947327l2522436k9577558k3843061j4949582o163579o71159J086241
17791A96306193q95914m327943o381247o469472n267109k254898P70275J953526
17783A73433411Q64666l177692q532787j1679686j4073899j6030379j6402254
17776A04401380j5442586j3941553j1464839q373496o270394m734088l787159
$$ plain form
17828 95759199 101384269 105707518 106005238 103390371 98735199 92811899 86500268 80173343
17820 80173343 74336363 70250853 69042709 71299845 77247716 87443275 103665846 128059049
17812 128059049 162784270 206431356 252685134 293970212 326110360 349789918 369462937
17805 369462937 387473546 400401993 402570582 390901392 367163663 336166214 302947327
17798 302947327 270424891 240847333 217004272 202054690 195891111 195219952 196306193
17791 196306193 195410279 191082336 184701089 178231617 172964508 170709610 171479885 173433411
17783 173433411 174298077 171120385 162587598 150907912 136834013 120803634 104401380
17776 104401380 88958794 75017241 63552402 55178906 48908512 44174424 40387265
17769D0387265k994585k845441k330508j906947j554852j318625r32358q23976
17761B5679973n59609k68479n6177J02848M68733P60636J209081K253167L625822
17752C3215995N605689Q029520J0161061R623902N485799J660951m73768j780390
17744G1528759k127773j201000N06109K387876K910760L06140k343903m158596
17736F7808372n737435o978472p511228p510344p014668n797791m318353k996747
17728A9943334k339627j835697j257866j096169q94510q42499r26407o76362l25051
17719I749146m31473m83251m59658k94798k27227k15184m97468n29573j60653
17710F449861r8993j79915j84515j12607q3411j17850k69868J06006J00159j51441
$$ plain form
17769 40387265 37392680 34547239 32216731 30309784 28754932 27436307 26503949 25679973
17761 25679973 25120364 24851885 24795708 24898556 25367289 26127925 27337006 29590173 33215995
17752 33215995 38821684 46851204 57012265 66636167 72121966 73782917 73309149 71528759
17744 71528759 69400986 68199986 68706095 71093971 74004731 74310871 71966968 67808372
17736 67808372 62070937 55092465 47581237 40070893 33056225 27258434 22940081 19943334
17728 19943334 17603707 15768010 14510144 13413975 12519465 11676966 10750559 10074197 9749146
17719 9749146 9317673 8834422 8374764 8079966 7852739 7637555 7140087 6610514 6449861
17710 6449861 6350868 6170953 5986438 5873831 5790420 5672570 5402702 5508708 5608867 5457426
17700E457426j45197J44794k7989j16079j57397j92496k21875j20772k4377j26466
17690D469572l26592k31809N9669p9060n4908J2274J53850Q8034L33092K30687
17680D654809L04582J91048K9605k30941k8481j39673l66962l52493k77813k53156
17670C530525j57897k42331j84310R4783J05210j6321j76624j56590j22275l5963
17660B638207p4659n6751M9423Q3134j10779O001M7346k6158o5842o1981l16165
17649B111776m9270l5934k3653q2485n5741q5251J20583j47856n1359j8026J0818
17638A693602k3001j49981r7322l6733j9862j2928J4899l73J8973J05306J20209
17627A612789n0924k00621k17160j43702J1551J64748J44990j81242j23497K28397
$$ plain form
17700 5457426 5312229 5457023 5429034 5312955 5155558 4963062 4741187 4620415 4596038 4469572
17690 4469572 4142980 3911171 3970840 3891780 3836872 3849146 4002996 4091030 4424122 4654809
17680 4654809 4959391 5150439 5180044 4949103 4920622 4780949 4413987 4061494 3783681 3530525
17670 3530525 3372628 3130297 2945987 3040770 3145980 3129659 2953035 2796445 2674170 2638207
17660 2638207 2563548 2506797 2556220 2639354 2528575 2534576 2581922 2555764 2489922 2427941 2111776
17649 2111776 2062506 2026572 2002919 1920434 1864693 1779442 1900025 1752169 1700810 1682784 1693602
17638 1693602 1670601 1520620 1423298 1386565 1366703 1353775 1368674 1368301 1387274 1492580 1612789
17627 1612789 1561865 1361244 1144084 1000382 1011933 1176681 1321671 1140429 1016932 1245329
17617A245329J23028J8654k16769k8278J10745J1102o1720p9843N2379k23629
17607I50998L0477J82873M9027j16154L6858Q52j07486j39431j57500R8704K0747
17596H49965J66292L74413K1412k97761k50850m3509O0932j34024j09839k6768
17586F10263j41126J2898l2949j02497K3630J49446P3077J66004O6235j86585
17576F38396j37529O9049L7250K0933q7845J49860Q6794J5162N6601q7530j24665
17565F36476j36089K6867N90O9974K2559R1760q5206j27308Q172j47046J33488
17554D94237K3574r190J78570J61503J2786k49545j57682n2066R1639J16341p2207
17543E37960j28272J40595O1788j05432o4096j09723m9396M4120l394J67987J67594
$$ plain form
17617 1245329 1368357 1387011 1170242 1141964 1252709 1263811 1202091 1122248 1174627 950998
17607 950998 981475 1164348 1213375 1097221 1134079 1134931 1027445 888014 730514 829218 849965
17596 849965 1016257 1390670 1412082 1114321 863471 819962 880894 746870 637031 610263
17586 610263 469137 482035 449086 346589 370219 519665 592742 758746 824981 638396
17576 638396 500867 569916 607166 628099 540254 690114 776908 792070 848671 761141 636476
17565 636476 500387 527254 527844 597818 620377 712137 626931 499623 507795 360749 494237
17554 494237 517811 508621 687191 848694 861480 611935 454253 402187 493826 610167 537960
17543 537960 409688 550283 612071 506639 442543 332820 283424 327544 324150 492137 659731
17532F59731J8190k70995k16378j86274J11383M2354R8515J40318L2538k0030
17522D09352P1574j2750k91028k3581o8623J81524J25603L3352o5099j73573m24616
17511b37865J30817K24572J08313N62K10383Q3302k24026j46188J91006q5632
17501B55244j27502O8635J10428R2230j05234k5627J83934l1921o1782n1167J82136
17490D89374p2773j36907M4591J79482J16389p4558j83680r8843m7621j47528
17480F7926J72748P9743P4815K6895j804j03593o7813J31558K4532r5367j77576
17469A32064P8348J46260M2220k12454J11267J31010K0343p8608j49089j99976
17459B1385j72031j35630J99382K06953J46377L09p8714m0921L3648M3250N6055
$$ plain form
17532 659731 677921 406926 190548 4274 115657 158011 256526 396844 429382 409352
17522 409352 480926 468176 177148 153567 84944 266468 392071 425423 360324 186751 -237865
17511 -237865 -107048 117524 225837 226399 436782 520084 296058 149870 340876 255244
17501 255244 127742 196377 306805 399035 293801 268174 452108 420187 358405 307238 489374
17490 489374 416601 279694 324285 503767 620156 545598 361918 263075 215454 67926
17480 67926 240674 320417 395232 422127 420323 316730 248917 380475 405007 309640 132064
17469 132064 210412 356672 398892 186438 297705 428715 449058 370450 221361 21385
17459 21385 -150646 -286276 -86894 120059 266436 266745 188031 147110 180758 224008 280063
17448B80063Q3719J7057j28437k9347Q6442J13154k08362k15308K0284J80871
17438B00136J42518k0207j35512o8171J65189o1361j45323m7942j9668r1593K17385
17427A35451J15233J92419J29291l4147m4798k2047j25788m3612J3236p5986m4014
17416A95238L3826n5585M7494l522j8474J16491j30054k82327N7445J74088P4412
17405B09032n1171j70667L6187J28503J48975k44985o4495j12741L3377J20900
17395C2915j2210M1264K2239N5073j18375Q5610P8808k34957N3017L0935j28316
17384i3997j66306j01658J95051J46385J20922N1079Q6526j597n6005Q7599J02308
17373C70307j42376r018R561O9431j69464l2099o3729j0048j31877R5144K37770
$$ plain form
17448 280063 363782 380839 252402 223055 309497 422651 214289 -1019 19265 200136
17438 200136 342654 322447 186935 118764 283953 222592 77269 29327 9659 -81934 135451
17427 135451 250684 443103 572394 538247 493449 471402 345614 302002 315238 239252 195238
17416 195238 229064 173479 220973 217451 198977 315468 185414 -96913 -39468 134620 209032
17405 209032 157861 -12806 23381 151884 300859 55874 -8621 -121362 -87985 32915
17395 32915 20705 61969 84208 139281 20906 106516 185324 -49633 3384 34319 -93997
17384 -93997 -260303 -361961 -166910 -20525 100397 151476 238002 236405 180400 267999 370307
17373 370307 227931 218913 228474 297905 128441 96342 32613 22565 -109312 -14168 223602
17362B23602J55716n4437j33505r8495K4910l0575M3407o8627Q2504K84032J55323
17351E83855o7387l05374k04737M399K1736r1061O2657K96166J22231j24065k06335
17340I2085R7450p1208n0259k307Q381o2732O3036Q3882j00547r6016O9120L5065
17328F5950r8366P8680M7885j03685m3464J4508J8232j73479n0552J59654k1170
17317a05807n4597K8820p2075J24562J43400o5643m229J18810l7702j17096J02004
17306F0447P4958J35777J08692J14170q1616n1681l9154N1460r9048J2306P7257
17295C63568K01710j56511j79926j3293l2105J64490K15216J32554j61124l05132
17285B29447q3628P9558p8456O2077j12578k48136k36845M1840J20766K0442q0385
$$ plain form
17362 223602 379318 324881 191376 92881 117791 87216 130623 61996 144500 428532 583855
17351 583855 516468 211094 6357 10756 32492 -58569 4088 300254 422485 298420 92085
17340 92085 189535 118327 68068 65761 74142 11410 74446 158328 57781 -38235 30885 65950
17328 65950 -32416 46264 94149 -9536 -53000 -38492 -20260 -193739 -244291 -84637 -105807
17317 -105807 -160404 -131584 -203659 -79097 64303 -1340 -5569 113241 75539 -41557 60447
17306 60447 135405 271182 379874 494044 412428 360747 321593 373053 274005 286311 363568
17295 363568 565278 408767 228841 215548 183443 347933 563149 695703 534579 229447
17285 229447 145819 225377 146921 208998 96420 -151716 -388561 -346721 -225955 -205513 -285898
17274b85898K02430L39980J32588k33335q4929P8574N7312N5249J39356n4283
17264C47044m0299k0178J15774J16619Q4076K42955m9635J33656J9166N9827L5035
17253A044040k72112m8465j01592J4649J56337J0364n029o670n5428j19490j26823
17242D89781k8840n2737j08907p8995K7200J81324J10873K91693J57992P825K43990
17231A241199L86189J89226j94838L97186L71575l6780n6341p556n8847p6234
17221B154779j51184j55796m39615j17192L1648k27393o8087J12933j84246k61435
17211F94412l7572M7005m1645l21937j4491M61983K78587j39757n9184j25608
17201G41793j20432j01350Q7918n7797j38168j77111j00364j16657p1809L9498
$$ plain form
17274 -285898 -83468 256512 389100 155765 70836 149410 206722 261971 401327 347044
17264 347044 306745 286567 402341 518960 603036 845991 796356 930012 949178 1009005 1044040
17253 1044040 771928 723463 621871 636520 792857 803221 798192 791522 736094 616604 489781
17242 489781 460941 408204 299297 220302 247502 428826 539699 831392 989384 997209 1241199
17231 1241199 1627388 1816614 1621776 2018962 2390537 2353757 2297416 2289860 2231013 2154779
17221 2154779 2003595 1847799 1408184 1290992 1322640 1095247 1027160 1140093 955847 694412
17211 694412 656840 703845 662200 340263 325772 787755 1066342 926585 867401 741793
17201 741793 621361 520011 607929 550132 411964 234853 134489 17832 -53977 -14479
17191a4479J27830J00130j94886N1674L04570l4716M7592j12644j99517p4896
17181F58J33769l7987k31476P3772k0493R9143J33969J54378O4909r8837o7203
17170B04602q8788k3400K9153K6186K52492n4592j75317M3167M7908m2441P112
17159B26082j37853k3402j11774j0057P8621j54775q9537J46348J07431L6522
17149F7606J60675p9941j49081O6152K06905n72k40818j00589O4151J017P3153
17138F8658O8906k00705R0488J78850J17985l3702m7502J23421k35578j57375
17128b6554p5029N0082O6161R3435p3752r4588j8400n810K3557N7809L2134j24601
17116i5556K7722l3668J30022o527J5973K84023m4745j74093j70848j08569P2751
$$ plain form
17191 -14479 113351 213481 18595 70269 374839 340123 387715 275071 75554 658
17181 658 134427 96440 -135036 -61264 -81757 17386 151355 305733 370642 271805 204602
17170 204602 115814 92414 121567 147753 400245 345653 170336 213503 261411 218970 226082
17159 226082 88229 64827 -46947 -57004 21617 -133158 -222695 -76347 31084 67606
17149 67606 228281 148340 -741 65411 272316 271744 30926 -69663 -5512 -4495 68658
17138 68658 137564 -63141 27347 206197 324182 290480 242978 366399 130821 -26554
17128 -26554 -101583 -51501 14660 108095 34343 -60245 -78645 -84455 -60898 -3089 29045 -95556
17116 -95556 -67834 -101502 28520 21993 37966 321989 277244 103151 -67697 -176266 -103515
17105a03515K57382J71956m5864R961o4737j53316K3334J60600n8251q3461J03115
17094B17204N7020j41803j42581R1830j09066p3119j8865J72887R102N8784Q3553
17083B04946j46672l1877J4755L7853n6357m1050r1094j18952N8492K76919Q1002
17072A87965j27808j02883K3264M2640k06575J5653Q3466J33614J94329P5037
17062C18702j33448j13884J95306P4591j61523k5300j32461k24197J17045J39341
17052E4172r6568j1193N310r6879j13763K67934J61828L3364R5039K353M0109
17041C41706m5483j59375J2192R7213m724k6942O0322k7147o4235M1539J50818
17030C75884P3026q8844R196J90695k9316o4589L1109r9425k42445j51570N188
$$ plain form
17105 -103515 153867 325823 279959 289920 225183 71867 95201 255801 197550 114089 217204
17094 217204 274224 132421 -10160 81670 -27396 -100515 -119380 53507 62609 121393 204946
17083 204946 58274 26397 41152 79005 22648 -18402 -109496 -228448 -169956 106963 187965
17072 187965 60157 -42726 -19462 23178 -183397 -167744 -84278 49336 243665 318702
17062 318702 185254 71370 266676 341267 179744 154444 21983 -202214 -85169 54172
17052 54172 -42396 -53589 -48279 -145158 -258921 9013 170841 204205 299244 301597 341706
17041 341706 296223 136848 149040 246253 241529 214587 274909 247762 183527 225066 375884
17030 375884 448910 360066 369262 559957 530641 466052 497161 397736 155291 3721 8909
17019H909J6707j40214J10632J10848j70710p1693J68821K19827j31204Q7142
17009B09065K6480j55095N7861N8400j78423j55672r5687M8293J1213J82035K24042
16998B32512k066p3789j36510L8292L4304N0524j31987j28980l4279O9411K1178
16987f1390j7321j62232N4943j18654p3576L05811R3968j21582N7529L25244Q5319
16976C68059r7044P5613j08121j14990J58044L3657J3402Q3335q7306j1292L9172
16965C52529j55547N3329J08996j70285O7907O0595j48624j64315k02150K641
16955a94924n4169j43476j0364j6640J90818J77910M2167M8868j7868j13280R753
16944h1205N9427K52704J1768k25735j77802N9004J38953N3051j33231n1976J17721
$$ plain form
17019 8909 25616 -114598 -3966 106882 -63828 -135521 33300 253127 121923 209065
17009 209065 235545 80450 138311 196711 18288 -137384 -233071 -184778 -173565 8470 232512
16998 232512 230446 156657 20147 58439 92743 143267 11280 -117700 -151979 -82568 -61390
16987 -61390 -78711 -240943 -186000 -304654 -378230 -72419 21549 -100033 -42504 282740 368059
16976 368059 271015 346628 238507 123517 281561 315218 328620 411955 324649 313357 352529
16965 352529 196982 250311 359307 189022 256929 317524 168900 4585 -197565 -194924
16955 -194924 -249093 -392569 -402933 -419573 -228755 -50845 -8678 40190 22322 -90958 -81205
16944 -81205 -21778 230926 242694 16959 -160843 -101839 37114 90165 -43066 -95042 22679
16933B2679l01758k72487K40633L76570J05436j924J17542j87296p5151o2485
16923c8241j31918K9763Q0337r562Q3350r3498P7572P3676p486j08060J02791
16912E8724m5364J45538M17116j10407m11473j8755P4659K08254J87568k7896
16902D77964l31519j82475q5920J62578j78327k2283J03639k18265J44220k2395
16892a52783l4917J31566J51971j26355j06468k5055j6629O9339O8070k1590j0146
16881g2997m8613j07244R950Q0023J50247L8256j48623m5881J25665O9460K9203
16870G9446q6338k95791P7766J58981p202j13970J59470L9362j61048J09486N4482
16859A4644J0858j13015O1113j03295j05787L2041n4629L4657j6410Q924J56792
$$ plain form
16933 22679 -279079 -551566 -310933 65637 171073 169149 286691 99395 24244 -38241
16923 -38241 -170159 -140396 -60059 -69621 13729 -79769 -2197 71479 63993 -44067 58724
16912 58724 13360 158898 576014 465607 54134 35379 110038 318292 505860 477964
16902 477964 146445 -36030 -121950 40628 -137699 -159982 -56343 -274608 -130388 -152783
16892 -152783 -187700 -56134 95837 -30518 -136986 -162041 -178670 -109331 -41261 -62851 -72997
16881 -72997 -121610 -228854 -218904 -138881 11366 49622 -99001 -144882 -19217 50243 79446
16870 79446 -6892 -302683 -224917 -65936 -73138 -187108 -27638 11724 -149324 -39838 14644
16859 14644 25502 -87513 -26400 -129695 -235482 -203441 -258070 -223413 -239823 -230899 -74107
16848g4107R5438n1092J41761O0654j15550O2265M0788J02968J7009j91918j02973
16837a4757l6568n1122J3504p5472k61064J63030J54116p343R2424R202M4984
16826C0934j2800j29720j57888j2381j30970K59586J21586L5112N1076j29266
16816g4731R2224o5396O5815l3420q9770J06291O534O7914J793l80431R558K64781
16804b8838J45195K9471n8715Q7739l9511N132k2329q9948p0021k36173J82869
16793i5129J36672q2321p0643l4085k0327p1265J39569N5542J07943P2354j34846
16782C464j36840k05249J18970k7044K75169P5185j18841J19533K3137J9616k57076
16771a09976k31342l3854J61095J51200l0236K120k521M225J18466j23508j39562
$$ plain form
16848 -74107 21331 -29761 112000 172654 57104 119369 160157 263125 280134 88216 -14757
16837 -14757 -51325 -102447 -88943 -164415 -425479 -262449 -108333 -115676 -23252 -14050 30934
16826 30934 18134 -111586 -269474 -281855 -412825 -153239 -31653 3459 54535 -74731
16816 -74731 17493 -47903 17912 -15508 -105278 1013 7547 75461 77254 -303177 -293619 -28838
16804 -28838 116357 145828 87113 174852 135341 140473 118144 28196 -41825 -277998 -95129
16793 -95129 41543 -40778 -111421 -145506 -165833 -237098 -97529 -41987 65956 138310 3464
16782 3464 -133376 -338625 -219655 -246699 28470 103655 -15186 104347 127484 147100 -109976
16771 -109976 -341318 -375172 -214077 -62877 -93113 -90993 -93514 -89289 29177 -94331 -233893
16760b33893O0970M8747j4888k03910k4664J32908O8770J2746Q8873P2529r3400
16749h5212P9096N6375o8722K04316K150m6319r3721N32j2094m0588p926J435
16737a0678K8709J53318R0337r7056k07832L7556R3402j80597R4367K15474p6207
16726A40793r9392P0397j0982m875L2559q7291j07165Q1831l8342M2673K01747
16715B21953J2524n0094k76351r6695k645K17326Q8175l1971l0151k73114q042
16704b29085J34123j47312j2384J47111M07506Q3074L0905r498j80164k76879
16694e2603j76353J13100r3422p3266j59894J21327K44193R517n8604L896k28364
16683c50473j27250P1389J7991J52440j5592J60521l8222k17487j03810K3168
$$ plain form
16760 -233893 -172923 -124176 -139064 -342974 -367638 -234730 -165960 -153214 -64341 8188 -85212
16749 -85212 -6116 50259 -18463 185853 188003 141684 47963 48495 36401 -4187 -12113 -10678
16737 -10678 18031 171349 261686 164630 -43202 -5646 87756 -92841 1526 217000 140793
16726 140793 41401 111798 100816 95941 128500 41209 -65956 15875 -22467 20206 221953
16715 221953 234477 184383 -91968 -188663 -191308 26018 114193 82222 52071 -221043 -229085
16704 -229085 -94962 -242274 -254658 -107547 299959 383033 413938 404440 224276 -52603
16694 -52603 -228956 -115856 -209278 -282544 -442438 -321111 -76918 -67401 -126005 -122109 -350473
16683 -350473 -477723 -406334 -388343 -235903 -251495 -90974 -129196 -346683 -450493 -427325
16673d27325K12703J5069L3748O2463r5046j55912J01713J71221n8207k9024J94406
16662B5809N6891r4994o1233J07271j15251J55477J99089j9084j74830p6783J47789
16651A50151M9473n812R7225k03774k81940O9320K44667J2467m8404k08461J86
16640a24902Q5626K29160L8042M0286j22486j71253P5576J48614q0031j28089
16630i457q0735j10173j44918P1397J79044M6164o6509j35004N5917J28552K97525
16619B31803q5801l5962j3142L7265N5773l9020o5086L6299q6729j81875n7083
16608b03558J36069J62491J72584q1460q7371k0765K67387L4218k49107o9500
16598F0988P1933J48580o3287J56181j431k01671j79120p3405K3548P4287q4746
$$ plain form
16673 -427325 -214622 -199553 -165805 -103342 -198388 -354300 -252587 -81366 -139573 -168597 25809
16662 25809 82700 -12294 -73527 33744 -81507 73970 273059 253975 79145 2362 150151
16651 150151 199624 193812 291037 87263 -194677 -125357 119310 131777 83373 -125088 -124902
16640 -124902 -39276 189884 227926 268212 145726 -25527 50049 198663 118632 -9457
16630 -9457 -90192 -200365 -345283 -273886 -94842 -48678 -115187 -250191 -194274 -65722 231803
16619 231803 146002 110040 96898 134163 189936 150916 85830 122129 35400 -146475 -203558
16608 -203558 -67489 95002 267586 186126 98755 77990 345377 379595 130488 60988
16598 60988 132921 281501 218214 374395 372964 171293 -7827 -81232 -57684 16603 -68143
16587f8143j18956O6436N564j21349n9898l1033J18445l3832j60479p5336L93478
16576h5103J75906l2541k44326j9270O4513J48331R2596j9825o7758j70426j77113
16565c35016k822N4600J29237J54786J64847k4213k554j87943l40802J63127M6479
16554a80274j43811O5510J11647n3555k8920J02036K60777j60426l34624J23009
16544b38631K71366O7777K04271l1060l37463j52997j18810k5726P4370j52398
16534d39301K1273K39119J06895K12184L4589k6957N6626L2821j59560j14850
16524c7161Q7216K00695l429k68738j11748p0385L5876J02345M147P9761k43627
16513b25048k41210P5371L1497K0837p1994J89116J67753O0943j7723j06304o5421
$$ plain form
16587 -68143 -187099 -120663 -115099 -236448 -296346 -327379 -208934 -242766 -403245 -478581 -85103
16576 -85103 90803 58262 -186064 -205334 -140821 7510 100106 80281 12523 -157903 -335016
16565 -335016 -337838 -283238 -154001 785 165632 141419 138865 -49078 -389880 -226753 -180274
16554 -180274 -324085 -258575 -146928 -200483 -229403 -127367 133410 -27016 -361640 -238631
16544 -238631 32735 100512 304783 273723 -63740 -216737 -335547 -361273 -286903 -439301
16534 -439301 -418028 -178909 -72014 140170 174759 147802 204428 237249 77689 -37161
16524 -37161 50055 250750 247321 -21417 -133165 -203550 -167674 -65329 -61182 18579 -225048
16513 -225048 -466258 -390887 -359390 -338553 -410547 -221431 -53678 7265 -10458 -116762 -182183
16502a82183J01291k0054j14381J03977k4793r1876Q7233J14945J35173J1269
16492A20601j98120K8217R7528L6857k19875N2981J2482R9264j18647j73885M3669
16481b18928J62844q7694J49317K13622m7819o3757k22012j94919J62310K38418
16471I1382K11711o6698k26415K6424o4849L3735P0983O3455N6101P3345m4478
16460B24696o8684J1299j18092J17203J44089Q1137J43021J350k32020j75024
16450A28975O2763O2398p56J05830P8787j10822j70546k24273l3601o732K06017
16439I8040k0533j56187P1392N5358l371K605J08624j98653l2062k636j54968
16428b32391n0490K48750O0755j08800j94007r7900Q2354L06287J10o2857P138
$$ plain form
16502 -182183 -80892 -100946 -215327 -111350 -136143 -228019 -140786 -25841 109332 120601
16492 120601 -77519 -49302 48226 85083 -134792 -81811 -69329 29935 -88712 -262597 -218928
16481 -218928 -56084 -143778 5539 219161 171342 107585 -114427 -309346 -147036 91382
16471 91382 303093 236395 9980 36404 -28445 5290 76273 139728 195829 269174 224696
16460 224696 156012 167311 49219 166422 310511 391648 534669 536019 303999 128975
16450 128975 191738 254136 253380 359210 437997 327175 156629 -67644 -101245 -107977 98040
16439 98040 77507 -78680 -7288 48070 44699 47304 155928 -42725 -74787 -77423 -232391
16428 -232391 -282881 -34131 26624 -82176 -276183 -374083 -291729 14558 14668 -48189 -41051
16417d1051M7698l3237J13255O5343Q8623M5776o824j37198j47237O1034K93725
16406C49907J12338k07542k54572o2099m9263N3311j38071n5861L5366l4992J20583
16395a30895N0828N7810J20176m9199l4742L4382r8705M9742J09906m0048P0683
16384A39938J23194m2472j47012J84998j87194M796J5335Q5824j18754j48362
16374h9709j75700r5192q376q6040J49954J82951N4720J44022K70958j0654q0257
16363B56677m2138j64526j59093J33358P5883J141j86821j65086j64988K14641
16353b00952O7972P5778J81241J09894p4146l5482Q2286n1866k7989J40879l821
16342B63794J7842m2624k5724j50844n0783P1756J5037o8687J59826J26713n5441
$$ plain form
16417 -41051 6647 -26590 86665 152008 240631 286407 279583 142385 -4852 56182 349907
16406 349907 462245 254703 131 -61968 -111231 -57920 -195991 -251852 -216486 -251478 -130895
16395 -130895 -80067 -22257 97919 48720 13978 48360 -50345 -603 109303 69255 139938
16384 139938 263132 220660 73648 258646 71452 76248 91583 177407 58653 -89709
16374 -89709 -265409 -360601 -368977 -455017 -305063 -122112 -67392 76630 347588 336934 256677
16363 256677 214539 50013 -109080 24278 100161 101302 -85519 -250605 -415593 -200952
16353 -200952 -132980 -57202 124039 233933 159787 124305 206591 154725 126736 267615 263794
16342 263794 281636 239012 213288 62444 11661 83417 98454 29767 189593 316306 260865
16331B60865m4183k99027q7896Q5843J48325m4461p3253J50156l0173j65199R2005
16320f998k08575k5776q3008J46980J15267j92277j45549J07357K64384P2617
16310D4422J89426o7875l02027o8201q4112j44237J8069K36174J87593Q2775j52588
16299f0581j41853l8949q4330P6421J22977L1510k23769p1848J04971J62554J24178
16288A281P6820n8373J68876Q9817o8617n2932j02918K1100k4758p2355P4786
16277E2727J92087K1289R7565j40458k75995j06258R7211j7841q0614m1130r0756
16266b92173J1245J2730n9560k31724L9434K92538J01698J48615Q7184o8855m6748
16255e616P0957m3761K581k29052k25398K90473K45074P1481j20482J8451M7523
$$ plain form
16331 260865 216682 -82345 -170241 -84398 63927 19466 -53787 96369 66196 -99003 -6998
16320 -6998 -215573 -241349 -324357 -177377 -62110 -254387 -399936 -292579 -28195 44422
16310 44422 233848 165973 -136054 -204255 -288367 -432604 -414535 -178361 9232 92007 -60581
16299 -60581 -202434 -241383 -325713 -249292 -126315 -94805 -318574 -390422 -285451 -122897 1281
16288 1281 78101 19728 188604 278421 209804 156872 53954 75054 50296 -22059 52727
16277 52727 244814 266103 363668 223210 -52785 -159043 -61832 -79673 -160287 -201417 -292173
16266 -292173 -280928 -268198 -327758 -559482 -520048 -227510 -125812 22803 109987 41132 -5616
16255 -5616 65341 21580 24161 -204891 -430289 -139816 105258 176739 56257 74708 122231
16244A22231n9406o6686O6848J23736P7605j85028l7666j12061j62818J37416
16234i5829l1499K3131N1440o3108N2270J96972p3191l0655n2890o72o6696j29486
16222b20213j78704n9387J16416K06418J15480R9990j33442j84882k0676K76719
16212A7719o3005j33552j06667K789J65865J92960R4225M9464Q2373j22053l03643
16201a23525k30917O819J36617p3134O2498J54848K6565K1735Q878J67477l956
16190A53905J8495L3579m6954o9448L7160j91556k42898m7838k5301K10372K30646
16179F0162J01639r7868k10136r0677J27209K5963J21145j03214r2703J17696
16169d0784J49930j30536p1857L1496q2351J33513L2651J66048r3179j79500j36343
$$ plain form
16244 122231 62825 -3861 62987 186723 264328 79300 41634 -70427 -233245 -95829
16234 -95829 -127328 -104197 -52757 -115865 -63595 133377 60186 29531 -23359 -24031 -90727 -220213
16222 -220213 -398917 -458304 -341888 -135470 -19990 80000 -53442 -238324 -259000 17719
16212 17719 -45286 -178838 -285505 -282716 -116851 76109 170334 219798 302171 180118 -123525
16201 -123525 -354442 -347623 -211006 -284140 -221642 -66794 -40229 -18494 -9616 157861 153905
16190 153905 172400 205979 159025 89577 126737 -64819 -307717 -355555 -380856 -170484 60162
16179 60162 161801 63933 -146203 -236880 -109671 -83708 37437 -65777 -158480 -40784
16169 -40784 109146 -21390 -93247 -61751 -144102 -10589 22062 188110 94931 -84569 -220912
16158b20912k40561P7270K43146J42524j59049N4506K67364J81379p5854k44832
16148B4981m9636j26913k03585P9760K38259N293l445k21975l8358J09901J6587
16137a69131p842M903O9745J80222n783n5712P190K13792k15139m8879n192o8223
16125a00049l4545J73359J38332J037J15108j13744j17807P4083k88492j65573
16115c18291J77206J58459o086r8246R0931L6750j76091m2148J30874M4584O7246
16104F5188j22438J35836K582p7594L4645P2406o2652k38398m0939l2557K48058
16093a5863J3334k02543k10639m6138Q049M4380J57037p4601j70998J07462N0893
16082c39627J2473p1841K00594O4462K09146J5654k14261m5982n830o8979j876
$$ plain form
16158 -220912 -461473 -384203 -141057 1467 -157582 -103076 164288 345667 269813 24981
16148 24981 -24655 -151568 -355153 -275393 -37134 -31841 -35286 -257261 -295619 -185718 -169131
16137 -169131 -176973 -172070 -102325 77897 72114 16402 23592 237384 22245 -26634 -31826 -100049
16125 -100049 -134594 38765 177097 178134 293242 179498 61691 135774 -152718 -318291
16115 -318291 -141085 17374 11288 -86958 3973 40723 -135368 -177516 -46642 -2058 65188
16104 65188 -57250 78586 81168 3574 38219 110625 47973 -190425 -231364 -263921 -15863
16093 -15863 -2529 -205072 -415711 -461849 -453800 -409420 -252383 -326984 -497982 -390520 -339627
16082 -339627 -327154 -398995 -198401 -133939 75207 90861 -123400 -169382 -175212 -244191 -246067
16071b46067m2776J26392J3947J29360J40600l5070L2003J36768j36103j88950
16061f9896N0336J5412k0810J50050q1294j31840N0324J8445n2407m6702k33268
16050c51650J1311M5252J14413J67911K2350r3815Q7260K9546J0103n163k10442
16039a72924M3019J0519O5623k495N7808m5725q8146j59723J1276K68544l0853
16028d3077k41165k231Q6723R9682m1243j48063J09812L4022O2875K50194J07833
16017B75362l05311r4261j68978N2601M5938l7876J13329O7776j93344R5501J13986
16006c5277l6783J16509K3442k55891n375J17981J32343j37252k9259n5068J95426
15995C0796O1825l8655j73317j13484Q1488O5174J59001J91003J01406l34429
$$ plain form
16071 -246067 -288843 -162451 -148504 -19144 121456 86386 118389 255157 119054 -69896
16061 -69896 -19560 -4148 -24958 125092 43798 -88042 -37718 -19273 -71680 -118382 -351650
16050 -351650 -340339 -295087 -180674 -12763 9587 -84228 3032 32578 42681 37518 -172924
16039 -172924 -129905 -119386 -53763 -56258 1550 -44175 -132321 -292044 -280768 -12224 -43077
16028 -43077 -284242 -286473 -199750 -100068 -141311 -289374 -179562 -145540 -82665 167529 275362
16017 275362 -29949 -124210 -293188 -240587 -194649 -232525 -119196 -51420 -244764 -149263 -35277
16006 -35277 -72060 44449 67891 -188000 -193375 -75394 56949 -80303 -109562 -164630 30796
15995 30796 92621 53966 -119351 -232835 -151347 -86173 72828 263831 365237 30808
15985C0808P9116J59257j12942j22313j46449O4444o5657Q5595m1010J2769l3595
15974h9977k81884L0769J41211L0885J18466k6736n3875l3020q5889Q9403R4123
15963f6524K01834J00375R9581j19327m9363N3238m3233j64884m0271j36793p1136
15952b36503q2084L562J25932J32529Q6834N3236k15166j22360J41792j07590
15942b19818Q2437Q9374J33273r5577j37277j16277N9204R5934J387J68395p6987
15931a5932l34906k3765J69303O970J96125m3504o5985J98405Q2730j14769r4779
15920d0107M8739j29780j96772M1892J17467k3677J14190Q6769J34641L8661O600
15909A98623j41789k54389j38342R1902O0097J18457J89381l674k5679J6046J23025
$$ plain form
15985 30808 109924 269181 156239 33926 -112523 -48079 -113736 -28141 -69151 -56382 -89977
15974 -89977 -371861 -341092 -199881 -168996 -50530 -77266 -131141 -164161 -250050 -160647 -66524
15963 -66524 135310 235685 335266 215939 166576 219814 176581 11697 -28574 -165367 -236503
15952 -236503 -318587 -315025 -189093 -56564 30270 83506 -131660 -254020 -112228 -219818
15942 -219818 -137381 -48007 85266 -10311 -147588 -263865 -204661 -108727 -107340 61055 -15932
15931 -15932 -350838 -374603 -205300 -198330 -2205 -45709 -111694 86711 169441 54672 -40107
15920 -40107 8632 -121148 -317920 -276028 -158561 -182238 -68048 18721 153362 192023 198623
15909 198623 56834 -197555 -335897 -243995 -183898 -65441 123940 120266 94587 110633 233658
15898B33658K981o3015j93095j59230J57857n9391j67173p6329L1452J36939J50717
15887d629L8821n8221N353l1939j27804L3341j89794m1453R5899P7273J00824
15876a02329J55245O1398r1918M4154j97428j71475K14838J12307j08477M1258
15866d2427q2877J34219Q3558j49047O7369O6544M2205K9359K16412K1110k47256
15855A39169k23796J9069K13556o2052q4195q0067K54424j07503j62164M5409
15845d8150K63001O7723j76184L7044p8663k04581K53P959K3232J03076k1325
15834b6615j20318j3464k0375j66208P5425K18938P0226k5025J01436K8980J801
15823A24801j15566j00468k84270r7J17222J22308K18225j108L7998q9278L9317
$$ plain form
15898 233658 236639 173624 -19471 -178701 -20844 -80235 -247408 -323737 -292285 -155346 -4629
15887 -4629 34192 -24029 -18676 -50615 -178419 -145078 -334872 -376325 -280426 -203153 -102329
15876 -102329 52916 114314 22396 66550 -130878 -302353 -87515 24792 -83685 -42427
15866 -42427 -125304 8915 92473 -56574 10795 77339 119544 148903 365315 386425 139169
15855 139169 -84627 -65558 147998 85946 1751 -78316 176108 68605 -93559 -48150
15845 -48150 214851 282574 106390 143434 64771 -139810 -139557 -131598 -108366 -5290 -26615
15834 -26615 -146933 -160397 -180772 -346980 -271555 -52617 17609 -7416 94020 123000 124801
15823 124801 9235 -91233 -375503 -375600 -258378 -136070 82155 81047 119045 29767 69084
15812F9084P5748n4913j27434P486J17734Q404k86163l0403K29168n6347j78625
15801b26261j65769N4805J95964J93671J86806k9920j72674L0959J43256p7886
15791A32951j51875m5309O2774M7063J27440p7596q0622j68273r5944J24876L6724
15780h7791o1666n2216j321j9136m2774J61503P4649k20500m2867K33162K97396
15769B38439n585k60275l7643J08603l771J31699R333k90571M3962L35191Q7830
15758C57212j77953m1473P2490J74041q5591k65162J4380M8207p848n2758j2545
15747B3000j73086j37815J10074n1378K2956J80074K30266m7313j61617J05420
15737A00581K2891n0678J7393N4468j36407n1219l0237O2193J00900J64041M6033
$$ plain form
15812 69084 144832 89919 -37515 -30029 87705 96109 -190054 -220457 8711 -47636 -226261
15801 -226261 -392030 -337225 -141261 52410 239216 209296 36622 67581 210837 132951
15791 132951 -18924 -64233 -1459 45604 173044 95448 14826 -153447 -249391 -124515 -87791
15780 -87791 -149457 -201673 -202994 -222130 -264904 -103401 -28752 -249252 -292119 -58957 238439
15769 238439 232854 -27421 -65064 43539 39768 171467 180800 -109771 -65809 269382 357212
15758 357212 179259 137786 210276 384317 298726 33564 47944 96151 88303 35545 23000
15747 23000 -150086 -287901 -177827 -229205 -206249 -26175 204091 156778 -4839 100581
15737 100581 123472 72794 90187 144655 8248 -42971 -73208 -11015 89885 253926 299959
15726B99959n5399j12483j16689l02795k5609K67440k2111k05676L50976J1853
15716H9466l14265M8243O6872J766R6615N8227K4554p7198p8700j67926J83414
15705f8932J75789r1763j23356J22514n9026j63850J70917n1855o584j19004q8618
15694c03768j34060J00006N5164m9112Q3979j24048J3118K51425k38o1038J44027
15683b4545K15327k75044j42988K68q9248J88985L2085M8667r8988k75025K4691
15672c95815j8399K37209K86170L0820p5914N3286J48747j20394j29607p4477
15662e8374m3624Q1146k67361j46640Q4199O188K0008K30288J19837L4960k29670
15651a69043J15503J2807j65213J07856M08320q109j91607j76559J9752j63924
$$ plain form
15726 299959 244560 132077 15388 -287407 -313016 -45576 -67687 -273363 77613 89466
15716 89466 -224799 -176556 -109684 -107918 -11303 46924 71478 -5720 -84420 -252346 -68932
15705 -68932 106857 15094 -108262 14252 -44774 -208624 -37707 -89562 -96146 -215150 -303768
15694 -303768 -437828 -337822 -282658 -331770 -247791 -371839 -358721 -107296 -107534 -168572 -24545
15683 -24545 190782 -84262 -227250 -226982 -316230 -127245 -95160 -46493 -145481 -420506 -395815
15672 -395815 -414214 -177005 109165 139985 64071 117357 266104 145710 16103 -58374
15662 -58374 -101998 -20852 -288213 -434853 -350654 -344466 -324458 -94170 25667 60627 -169043
15651 -169043 -53540 -40733 -205946 -98090 310230 302121 110514 -66045 -46293 -210217
15641b10217j55547R4251J81059p3193M6554K6859r7809k3408P5635J29766J46887
15630A40837m3923k42519j84564j21567K00360m4062J38864J76364k4914j77149
15620a82273M7454J42654N0627p8681j14245l938j04139k5404k0926j8544J5097
15609b92318k2207K3865J03092J70376J40499J09280k89463p1668N2005j06150
15599a82689J830R692J36144K12749J60123J86192q6260l56972k22632m8762O1857
15588a28728O0415k19178L5868L0861j48871K2973L53845M5375o0766M6350n1345
15577a3201l6217j5516J99035J69888j04140j84499k3916j4816J70495j2856j26035
15566H222k37817k47024N2570K40155q9280o2804l2448J73505R6157P18J43372
$$ plain form
15641 -210217 -365764 -271513 -90454 -163647 -117093 -90234 -188043 -211451 -135816 -6050 140837
15630 140837 96914 -145605 -330169 -451736 -251376 -295438 -156574 19790 -5124 -182273
15620 -182273 -134819 7835 58462 -20219 -134464 -138402 -242541 -267945 -288871 -307415 -292318
15609 -292318 -314525 -290660 -187568 -17192 123307 232587 -56876 -128544 -76539 -182689
15599 -182689 -180859 -171167 -35023 177726 337849 524041 437781 80809 -141823 -190585 -128728
15588 -128728 -68313 -287491 -251623 -220762 -369633 -346660 7185 52560 -8206 38144 -13201
15577 -13201 -49418 -64934 134101 303989 199849 15350 -8566 -23382 147113 134257 8222
15566 8222 -229595 -476619 -424049 -183894 -273174 -335978 -368426 -194921 -98764 -98046 45326
15555D5326k59672j53518m242j2908K0871K76034R3907j33277n8254J27290J25036
15544F6593L2432o7818r4621J84757j78350j24988J54546L00161k55606l23054
15534c05948p9438j9210Q3574O0571J99681J34402J08418r3983j79095j971K07191
15523A14192J52695j3354J3233k07693r5853n5822j06182J0427Q1063J01216J07629
15512A01551m9083n2247j17262M3113J18686N1897j05519j27589j98575K7736
15502c07292J29929J40399J21223j542M3437r3196j16631m812p1950q4492k09316
15491d54243r7808J30331L33904J89712k9816p9478n706J58051K30219K8745p6197
15480C27714j44254J30511j49245k86371l6066k618K1665n3599P0391P7027j10145
$$ plain form
15555 45326 -214346 -367864 -372106 -385014 -364143 -88109 5798 -127479 -185733 -58443 66593
15544 66593 99025 31207 -63414 121343 -57007 -181995 -27449 272712 17106 -305948
15534 -305948 -385386 -404596 -321022 -260451 -60770 73632 182050 88067 -91028 -92999 114192
15523 114192 266887 253533 266766 59073 -36780 -92602 -198784 -188357 -107294 -6078 101551
15512 101551 52468 221 -117041 -73928 44758 96655 -8864 -136453 -335028 -307292
15502 -307292 -177363 -36964 84259 82717 126154 32958 -83673 -88485 -160435 -244927 -454243
15491 -454243 -552051 -421720 -87816 101896 72080 -7398 -13104 144947 375166 403911 327714
15480 327714 183460 313971 164726 -121645 -157711 -160329 -138664 -192263 -121872 -44845 -154990
15469a54990K2150J55514p1237M5752o2668m4221n6610j09746n501J953m5622
15458c25226k04817J89986K99101O4805o4033n1881j22546k9738J28262j89085
15448c05172n5269J48355J69751J85221k7386j06676L850M7621q5758k65248j31456
15437d22167J98786J28242J25927J17774q2974Q123l9038J15611N6735k33868
15427b6849r5897k8864L898J01895j96022j4865P0725k3558J70978J54056o4391
15416E1106l4275Q2475m1020q6780j18511Q0301J9654p4413J01727L4801k46361
15405b31296j44534r7177J01959P2562L5304L6505K55123J77312q687o0686j51097
15394a4712J680J11825K39845n3744k77874k75556P5177J33893M0045j0354L6248
$$ plain form
15469 -154990 -132840 22674 -48563 -2811 -65479 -109700 -166310 -276056 -281557 -279604 -325226
15458 -325226 -530043 -340057 -40956 23849 -40184 -92065 -214611 -244349 -116087 -305172
15448 -305172 -360441 -212086 -42335 142886 115500 8824 12674 60295 -25463 -290711 -422167
15437 -422167 -223381 -95139 30788 148562 65588 73711 34673 150284 207019 -26849
15427 -26849 -122746 -151610 -147712 -45817 -241839 -256704 -185979 -209537 -38559 115497 51106
15416 51106 16831 99306 58286 -28494 -147005 -66704 -47050 -121463 -19736 15065 -231296
15405 -231296 -375830 -473007 -371048 -298486 -263182 -226677 28446 205758 197071 136385 -14712
15394 -14712 -13032 98793 338638 284894 7020 -268536 -193359 -59466 -19421 -29775 6473
15383F473K4741J3875k45966j62942J17038k1769J70127L0048J6553k5919r0836
15372a68577l2542O4265o4J44846J13657j69446j46393N1032J15998O0681J53616
15361A87073J65123j87947k09960o6897J36652R1468k18988o4292m4915O850K44916
15350C9083r7353j44730j51833J24464K69139p4055n372K11733K9957j65349n8263
15339b2579j15877j15386J6333l7309j9607J42487J01090m4669p7389k5251J17713
15328h0444R9039K2021P7322l075J81236P5113k36598p7091r2515j50467p7314
15317b62773J0318Q0839J81806N1866j25749p0499P5528M0378l3794P7872j48703
15306a22911J31204J09740j14768k81897M4234Q9063K28467j65363q2217P7412
$$ plain form
15383 6473 31214 45089 -200877 -363819 -246781 -268550 -98423 -68375 -51822 -77741 -168577
15372 -168577 -201119 -136854 -136918 7928 121585 -47861 -194254 -143222 -27224 33457 187073
15361 187073 352196 164249 -45711 -112608 24044 115512 -103476 -167768 -212683 -205833 39083
15350 39083 -58270 -203000 -354833 -230369 38770 -35285 -40657 171076 201033 35684 -22579
15339 -22579 -138456 -253842 -237509 -274818 -294425 -151938 -50848 -95517 -172906 -198157 -80444
15328 -80444 18595 40616 117938 114863 296099 371212 134614 57523 -34992 -185459 -262773
15317 -262773 -252455 -171616 10190 62056 -63693 -134192 -58664 -18286 -52080 25792 -122911
15306 -122911 8293 118033 3265 -278632 -234398 -145335 83132 -82231 -164448 -87036
15296h7036j3950j3167J24195P2516p9601l9313m118L0413q0567j3168J14762
15285A0966n7665n6235M7277O2801j54369Q7008j01030K611K61635l1317k07367
15274a35685o1687J90257Q0148k22046k74724j06670J49071j16105O9809J38779
15264b88853K4462k8088j48993N1199j87627J8212J74695K49982K91979J50643
15254C07611j27155j29405M234K0746j55773J04701K1208j30455J28562J92780
15244B37054j13130k79658L584p4498M0215p718j62659n066K81906J14059J18028
15233A52117M2304j25468r7470o7002q5628J19749J29191k9841o6481j49880M6033
15222a32376j3695j93278m3793K12866r1564p3710K94015R2526N7979q3106J1950
$$ plain form
15296 -87036 -100986 -114153 10042 82558 2957 -36356 -40474 -10061 -90628 -103796 10966
15285 10966 -46699 -102934 -55657 7144 -147225 -60217 -161247 -158636 102999 71682 -135685
15274 -135685 -197372 -7115 73033 -149013 -423737 -530407 -381336 -497441 -427632 -288853
15264 -288853 -264391 -292479 -441472 -390273 -577900 -559688 -384993 -135011 156968 307611
15254 307611 180456 51051 55285 76031 -79742 24959 46167 -84288 44274 237054
15244 237054 123924 -155734 -152150 -226648 -186433 -194151 -356810 -361876 -79970 34089 152117
15233 152117 194421 68953 -28517 -95519 -181147 -61398 67793 37952 -28529 -178409 -132376
15222 -132376 -146071 -339349 -383142 -170276 -261840 -335550 -41535 50991 108970 25864 37814
15211C7814O4826P6502K7138L5011k72060j23437Q6489J43159m0149j78457j33725
15200b76889J37934Q4814K45414R6590o4676j77320j59365n1914R4889J26705
15190E6182k86378j58244J40943n9033k5978l1047J10831j5338P8778N4215q6286
15179b21355K17192O0346l1901k1097r268O1155k1851j69333K45336J59189J29463
15168C97876j55657l14951n8082k9165K87228j1837r0662M9587L2173p7j20790
15157a4357r9666Q4163l1341J68134j0712j75634J15113l487o6936M2517K64729
15146B72523j3530j75925o444j203J46308J17611l31894j95567m390p7873j45043
15135d15427L1644L8165L47165k259j30073n744K30563r522j19880j13701L8640
$$ plain form
15211 37814 102640 179142 206280 241291 -30769 -154206 -67717 75442 35293 -143164 -276889
15200 -276889 -138955 -54141 191273 287863 223187 45867 -113498 -165412 -70523 56182
15190 56182 -230196 -388440 -247497 -306530 -332508 -363555 -252724 -268062 -189284 -135069 -221355
15179 -221355 -4163 56183 24282 3185 -6083 55072 33221 -136112 109224 268413 397876
15168 397876 242219 -72732 -130814 -159979 127249 115412 24750 74337 106510 106433 -14357
15157 -14357 -114023 -29860 -61201 106933 96221 -79413 35700 32213 -34723 7794 272523
15146 272523 258993 83068 76624 75421 221729 339340 7446 -188121 -192511 -270384 -415427
15135 -415427 -383783 -345618 1547 -712 -130785 -136529 94034 84512 -35368 -149069 -110429
15124a10429l1069m4206j0595M791j29789J00687R7625k66277Q441M0421O981
15113c33419M7632L8447J66567M1670k185q7633l3908J22720j6834J40817J93175
15102B77049J18299L8665r5682j30535L4814q7183p4525r3386m2486p3428j63680
15091b92078j84614M1134K11418K20678J76338M4865r7745l42382o597K78045
15081D9062K10546j57964q3043o1671k09146j09990L8907o9308J96367O623Q9840
15070i9777n6846j00624j411q9233M6329l5191J49947J48469p7074O1655J21263
15059F7507J11507j51646q241j76700k57081j15249J44691K21074J01297J07932
15049D5091j0360r2039J45881k16737J215j30460M9093J93698q3879j5450j7048
$$ plain form
15124 -110429 -141498 -185704 -196299 -191508 -321297 -220610 -122985 -389262 -380821 -340400 -333419
15113 -333419 -285787 -247340 -80773 -39103 -41288 -128921 -162829 -40109 -56943 83874 277049
15102 277049 395348 434013 338331 207796 242610 155427 80902 -12484 -54970 -128398 -292078
15091 -292078 -476692 -435558 -224140 -3462 172876 217741 119996 -222386 -228983 49062
15081 49062 259608 101644 18601 -43070 -252216 -362206 -323299 -392607 -196240 -189617 -99777
15070 -99777 -156623 -257247 -258658 -347891 -301562 -336753 -186806 -38337 -115411 -53756 67507
15059 67507 179014 27368 19127 -157573 -414654 -529903 -385212 -164138 -62841 45091
15049 45091 34731 -57308 88573 -128164 -126949 -257409 -208316 -14618 -98497 -113947 -130995
15038a30995J21206m3227j66675J9381N1197R3689N2589L1360J05839R1074m6157
15027A79281O8546N8943k34754r0626k35679L4336J53513N010l5968j46298o7301
15016c10997k0721J64781J09931q687j16172N0759J19295p909R5433P1650j25617
15005B1746l4367j6802q6707j2077o5246K4553L9100M1647J36629k594O3999j53874
14993d3993j83440M8005K2028K75803P6101l3998k35689k77274j75821K96712
14983b31566l0372J59666K7812J30839R814r826k64228j58432J90353j1627J15561
14972g2006p4366j26570j3736K75378K28737n5442J37694r5911J23137k5918k73352
14961B7645j05448o7640j68851K23676K74990l8629k47155j50127j30459L27355
$$ plain form
15038 -130995 -9789 -53016 -219691 -200310 -149113 -55424 -2835 28525 134364 225438 179281
15027 179281 247827 306770 72016 -18610 -254289 -219953 -66440 -61430 -97398 -243696 -310997
15016 -310997 -331718 -166937 -57006 -65693 -181865 -131106 -11811 -19720 75713 147363 21746
15005 21746 -12621 -29423 -116130 -128207 -193453 -168900 -129800 -88153 48476 45882 109881 -43993
14993 -43993 -227433 -179428 -157400 118403 194504 160506 -75183 -352457 -528278 -231566
14983 -231566 -261938 -102272 -74460 56379 66193 56367 -207861 -366293 -175940 -187567 -72006
14972 -72006 -146372 -272942 -286678 -11300 217437 161995 299689 203778 326915 300997 27645
14961 27645 -77803 -145443 -314294 -90618 184372 145743 -101412 -251539 -381998 -54643
14951e4643K30318L1660R6572N08j46060j24082j53268j745k2033J29278K34589
14940B21094J20236k02199k38278j07645P4298R9153n6191p9031l5822J95015
14930i370k1888o6092J79833J44510j10262j06567m4574j49424L9718M2704J1691
14919h9721J21114k5546p5757j8139k94204J21P7257J10864N4734K33308O168
14908A00199n278q5061q9098n1666l2687k1030j44739J00379j65871K1349Q5992
14897b87511M1620Q0023M2450K3052j31255j17153m1700m0314J09120q0248J41418
14886b60498R3627M1172K1219n0942P2982O9111J2956j31236j10442j80315j8073
14875d40439J19755j8801P3900j28075j74644K05198L47856K5146q1167J54902
$$ plain form
14951 -54643 175675 207335 303907 304415 158355 34273 -118995 -120740 -142773 -13495 221094
14940 221094 341330 139131 -99147 -206792 -132494 -33341 -89532 -168563 -204385 -9370
14930 -9370 -31258 -97350 82483 226993 116731 10164 -34410 -183834 -144116 -101412 -89721
14919 -89721 31393 5847 -69910 -88049 -382253 -382132 -304875 -194011 -139277 94031 100199
14908 100199 94921 9860 -79238 -130904 -163591 -184621 -329360 -228981 -394852 -373503 -287511
14897 -287511 -245891 -165868 -123418 -100366 -231621 -348774 -390474 -430788 -321668 -401916 -260498
14886 -260498 -166871 -125699 -104480 -155422 -82440 -13329 -373 -131609 -242051 -422366 -440439
14875 -440439 -320684 -339485 -265585 -393660 -568304 -363106 -15250 9896 -71271 83631
14865H3631J6165q9081k78273j35438P2449J96556P3311j54266M007J36749J21904
14854D7714J06225K2349P4789j80568j83512j35205m3902R3406K05153K36060
14844B42509P9196j70013q2386j03801j59247k3494J79989O1546j72665L3614
14834a14752Q6892K0649J53168o8421j30695k7317k6079p2753J57581M1592P1181
14823I1046l7259l3189j70838k49J60280j4943Q6385O1049j12654N0362l8377
14812D1613l19040m1402n6683N4389N6926J03092l2184j04551R7458J00883j0201
14801a09700R5831O895Q1203j02909q1104l9224j2085J12117J57906O209k18205
14790a03066K823q7519k8380L1097q5795J38672J21412p9318j81629o8133K55721
$$ plain form
14865 83631 99796 10715 -267558 -402996 -330547 -133991 -60680 -214946 -210939 -74190 47714
14854 47714 153939 176288 251077 70509 -113003 -248208 -292110 -198704 6449 242509
14844 242509 321705 151692 69306 -34495 -193742 -217236 -37247 24299 -148366 -114752
14834 -114752 -27860 -7211 145957 77536 -53159 -80476 -106555 -179308 -21727 19865 91046
14823 91046 53787 20598 -150240 -150489 9791 -5152 81233 142282 29628 79990 41613
14812 41613 -277427 -318829 -375512 -321123 -264197 -161105 -193289 -297840 -200382 -99499 -109700
14801 -109700 -13869 -6974 74229 -28680 -109784 -149008 -161093 -48976 108930 115139 -103066
14790 -103066 -100243 -187762 -216142 -185045 -270840 -132168 -10756 -90074 -271703 -339836 -84115
14779h4115K03966j88252k00852j60090J34283J40041J69813R0483j11470O9301
14769F3108Q4280P3440M7173p6753k34650K7498J25678j9104j28835j52453k93776
14758d84394r4853j1738K36028P1860Q53L5826J15625J35704j27353o4591k261
14747a89294N2227l9745j09352j6257J56634j21585K691K11571J8291n0728j49955
14736b35502j509J98964O6573K5348j95253n3930p3793Q6805o2562K4580k14497
14725d34776j45668J06242J80995L10878J35474j01002n4347L5774P7810L4837
14715A46217R3135J07302j89633k86170k00843J93787K69764O7385j77542R5460
14705A18862j80823j80838K04028J3973M6191q4448j30563j449J07539O301r2429
$$ plain form
14779 -84115 119851 -68401 -269253 -429343 -295060 -155019 14794 105277 -6193 63108
14769 63108 147388 220828 268001 191248 -43402 -15904 109774 90670 -38165 -190618 -484394
14758 -484394 -579247 -590985 -354957 -283097 -282244 -246418 -130793 4911 -122442 -187033 -189294
14747 -189294 -137067 -176812 -286164 -302421 -145787 -267372 -264681 -53110 -34819 -85547 -235502
14736 -235502 -237011 -38047 28526 53874 -141379 -195309 -269102 -182297 -244859 -220279 -434776
14725 -434776 -580444 -474202 -293207 17671 153145 52143 -2204 33570 111380 146217
14715 146217 239352 346654 157021 -129149 -329992 -136205 133559 200944 23402 118862
14705 118862 -61961 -242799 -38771 -24798 21393 -63055 -193618 -195067 -87528 -81227 -173656
14694a73656P4871l5827r3295J22159J13950K31457O7104k59993j57090k28081
14684c38401k01642M5108J0896K35186L47864J32984k71678j37858N6279l566
14674a24828m5195L1329J35849j1481N6102J32024r5051j32823m0609J04870n0599
14663d0412j98226K08490J54329q337j7536j05410K07819P7040k12307k96792
14653b31342M7208r3956l4837J51256N0851N5763L1203O8008N5513l16428j4487
14642b31248J20782n7969k5414J22677J39187j11583j21144K21729M5217r3797
14632H437j83861J7372M2873j10419J88257J20399Q3063J91718j5519k62230K08012
14621B88102k9205j01756j00916q0372M5429j43512K3474J43239l5699j25587
$$ plain form
14694 -173656 -98785 -134612 -227907 -105748 8202 239659 306763 46770 -110320 -338401
14684 -338401 -540043 -494935 -484039 -248853 99011 231995 -39683 -177541 -121262 -124828
14674 -124828 -170023 -138694 -2845 -14326 41776 173800 78749 -54074 -94683 10187 -40412
14663 -40412 -238638 -30148 124181 115844 98308 -7102 200717 277757 65450 -231342
14653 -231342 -184134 -278090 -312927 -161671 -110820 -55057 -23854 44154 99667 -216761 -231248
14642 -231248 -110466 -168435 -193849 -71172 68015 -43568 -164712 57017 102234 8437
14632 8437 -175424 -158052 -115179 -225598 -37341 83058 166121 357839 342320 80090 288102
14621 288102 258897 157141 56225 -24147 21282 -122230 -98756 44483 8784 -116803
14611a16803N0980N7708P8356j23042k11052J69877J8364J21740l2430J9751l8031
14600d582r0193j3449O6464q2853n4692J28127o0240l941r7516P655L078J80156
14588b1986M5270j85665j647o6268O9929J43716q366j58473r4122J46148n4780
14577a86244j45527j03095O1497j3963m2505J1106K61782K40252L0657j30570
14567a6610J28042j9764k58091K0531j0494J09543j4878n7605J51258K6k05687
14556a73729J9358K41221P2443k93726J45548J4912j8291Q03k04258J35182k6328
14545h6865n4400n7948J05316J4117j32655O2134l3813j6542k7503J18733n3257
14534a62683K0799j49805P2474J06365l9223Q4987k39295j26519P6460L6849Q0949
$$ plain form
14611 -116803 -65823 -8115 70241 -52801 -263853 -93976 -75612 46128 13698 33449 -4582
14600 -4582 -94775 -108224 -41760 -124613 -179305 -51178 -111418 -115359 -212875 -205220 -202142 -21986
14588 -21986 23284 -162381 -164028 -230296 -160367 -16651 -25017 -183490 -277612 -131464 -186244
14577 -186244 -331771 -434866 -373369 -387332 -429837 -418731 -156949 83303 113960 -16610
14567 -16610 111432 91668 -166423 -145892 -156386 -46843 -61721 -119326 31932 31958 -173729
14556 -173729 -154371 86850 159293 -134433 11115 26027 7736 8539 -195719 -60537 -86865
14545 -86865 -141265 -199213 -93897 -79780 -212435 -150301 -184114 -200656 -228159 -109426 -162683
14534 -162683 -141884 -291689 -219215 -112850 -152073 -67086 -306381 -432900 -356440 -319591 -238642
14523b38642O0246j61820n7537J65521J93556K28686k60735k34412r0787J34353
14513b61571R4703l6063m6254J07323Q953J00364J4112J01453J41237j18920l15690
14502b10353m2244K66394n0796j48327p5575q0696j61348M1785J78766P4864m7170
14491b54700j6372p3462Q438K61892J898L6077j0515n1601J34252P718O0731K3800
14479A28156k5358J347K6214j01628p6358j34165o4125K39945K2710k52492o0241
14468b95995l1414J27463K24984j57068r2042O4023J42332j13879j9901o0868
14458b12365N972L936l5579K53363J29906l7007J65863m9262l4958j6268j43403
14447C0198p5625Q1189L40329J10571k24k45654k16232p700m4268j25323j6574
$$ plain form
14523 -238642 -178396 -340216 -397753 -232232 -38676 190010 -70725 -305137 -395924 -261571
14513 -261571 -166868 -202931 -249185 -141862 -132909 -32545 -18433 83020 224257 105337 -210353
14502 -210353 -252597 13797 -36999 -185326 -260901 -341597 -502945 -461160 -282394 -207530 -254700
14491 -254700 -271072 -344534 -336096 -74204 -72306 -36229 -46744 -98345 35907 43625 104356 128156
14479 128156 102798 104145 130359 28731 -47627 -181792 -245917 -5972 16738 -235754 -295995
14468 -295995 -327409 -199946 25038 -132030 -224072 -160049 -17717 -131596 -151497 -212365
14458 -212365 -206393 -202457 -238036 15327 145233 108226 274089 224827 189869 173601 30198
14447 30198 -45427 35762 376091 486662 486438 240784 24552 16852 -27416 -152739 -169313
14436a69313K8176j2757k14992J15218K72858K2409j56987K97410p0498p4810
14426C6714M0910j22782J91505j4832K8766k1230j30405m9627l2097l1401J29251
14415B4772j1983n9661p2325q1456J95012p869J63679j49274p9291J96252O2991
14404A80847p8428n0727J60149l3985l01904k6429n849n8994Q6765J19832J81484
14393A72761q5434l30730j30536J54395J0732j04128J74298J89112j9875q8190
14383e7595r0132l5438N0735j54570j40092M0804K33489j7300o3382q6458l9774
14372c59713K04974J39780R5012j74718q3575J15932o6123R524p6086n7911p1532
14361c24436j9630J30922M6458P7336J59033J34295J08272q3685j72452M8258
$$ plain form
14436 -169313 -141137 -153894 -368886 -253668 19190 41599 -115388 182022 111524 36714
14426 36714 77624 -45158 146347 131515 160281 139051 8646 -40981 -73078 -104479 24772
14415 24772 12789 -46872 -119197 -200653 -5641 -13510 150169 895 -78396 117856 180847
14404 180847 102419 51692 211841 177856 -124048 -150477 -156326 -215320 -128555 -8723 172761
14393 172761 87327 -243403 -373939 -219544 -208812 -312940 -138642 50470 30595 -57595
14383 -57595 -147727 -183165 -132430 -287000 -427092 -386288 -152799 -170099 -233481 -319939 -359713
14372 -359713 -154739 -14959 80053 -94665 -178240 -62308 -128431 -118907 -194993 -252904 -324436
14361 -324436 -344066 -213144 -166686 -89350 69683 203978 312250 228565 56113 104371
14351A04371J13893j0791k704j1028J89710J46474n6790j05560j35422k40992
14341h839N8646j53898k9183J22339J06705M8537n5521n2070j29277j4535K9137
14330g7959l4008p7115p9005J13669J48420J09085R7686k2281o9978J2714M059
14319A25287j10763j06978n4977j5203j3465R2071K5947J87889j69254l39194
14309c78640N8256L02280K34620n9317k56702j55779j48988J24486J51039J74111
14299D5366o6271m2045P8412J3151r3130L1960J95084Q694o8232m8541K25042
14288B79490O5599k49934j03378K34380r721L2955j9784j23291k65168J62587
14278C735J20055R1819J7736N5406j45844j01827j80687k05828p6460l2481m4663
$$ plain form
14351 104371 218264 207473 204769 193741 383451 529925 473135 367575 232153 -8839
14341 -8839 49807 -104091 -133274 -10935 95770 144307 88786 36716 -92561 -107096 -77959
14330 -77959 -111967 -189082 -268087 -154418 -5998 103087 200773 178492 108514 121228 125287
14319 125287 14524 -92454 -147431 -162634 -176099 -84028 -58081 129808 -39446 -378640
14309 -378640 -320384 -18104 216516 157199 -99503 -255282 -404270 -279784 -128745 45366
14299 45366 -20905 -62950 15462 28613 -64517 -32557 162527 171221 102989 54448 279490
14288 279490 345089 95155 -8223 226157 216436 249391 229607 106316 -158852 3735
14278 3735 123790 215609 233345 288751 142907 41080 -139607 -345435 -421895 -454376 -499039
14267d99039J37066K05221K18742j0388k71143n8812K5739J06035R5267K15390
14257A64078O6285M1164q9579l5833k65849j61973J52893o4896m0761L0015q3621
14246b88077k64701j564L51735M2841N2287m0241M0573K48043J97949n0181k20361
14235F8303M987p7843r9054J13937M6599J00177p6523j53695k20767L1359J56924
14224a05596L919m0817j96284r5804J99267J51823K89051j0588k65485Q2205J8690
14213C0381j763J53406k8859O4473L844j82106o7051R8498N52j32471j20925J78585
14201c436J22120q5451N2721J5122Q4356J05361k53545j98944o5697P6119P2408
14190g8866K2085k8157R2025R7076j41474r2897R4713M5046R7410j18403r7616
$$ plain form
14267 -499039 -361973 -156752 61990 51602 -219541 -278353 -252614 -146579 -51312 164078
14257 164078 230363 271527 181948 146115 -119734 -281707 -128814 -193710 -234471 -204456 -288077
14246 -288077 -552778 -554342 -202607 -159766 -107479 -147720 -107147 140896 338845 288664 68303
14235 68303 73290 -4553 -103607 10330 56929 157106 80583 -73112 -293879 -262520 -105596
14224 -105596 -101677 -142494 -338778 -434582 -235315 -83492 205559 194971 -70514 11691 30381
14213 30381 28618 182024 153165 217638 221482 39376 -27675 70823 71375 -61096 -182021 -3436
14201 -3436 118684 33233 85954 101076 185432 290793 37248 -161696 -227393 -151274 -78866
14190 -78866 -56781 -84938 7087 104163 -37311 -130208 -35495 9551 106961 -11442 -109058
14179a09058M4295j12476j31024k59556J8116J19463J43498K71750m7238j84450
14169b46680j34425J76285J05431J46619N3404M1343k45093j45097K86793J33661
14159A72241N3356L9670j66143k49857o004J47949L6535L0922J72127j0128M9011
14148B69679M6168k58274j90372n8732Q8431k7581L6705J26143J94531L0591j05956
14137A51333j02892K5142j6669l5413p491j23460P955N5677L7963k4070J3560
14126a8365M1731M1066j40119Q2873K73920k7660j89936j6987J01513q976k7155
14115A11905J33622o0394j18850l5497j80353P4657K69278m9689L311j40581m8947
14104d1538k15532L7926N7885L7193q5887j77064J1573J76700K18511K33853J91502
$$ plain form
14179 -109058 -64763 -177239 -308263 -567819 -549703 -430240 -286742 -14992 -62230 -246680
14169 -246680 -381105 -204820 -99389 47230 100634 141977 -103116 -248213 38580 172241
14159 172241 225597 265267 99124 -150733 -156737 -8788 27747 58669 230796 220668 269679
14148 269679 315847 57573 -132799 -191531 -103100 -130681 -93976 32167 226698 257289 151333
14137 151333 48441 73583 56914 21501 14010 -109450 -101495 -45818 -7855 -31925 -18365
14126 -18365 23366 64432 -75687 7186 281106 253446 63510 46523 148036 139060 111905
14115 111905 245527 185133 66283 30786 -149567 -74910 194368 144679 147990 7409 -41538
14104 -41538 -257070 -219144 -161259 -124066 -209953 -387017 -375444 -198744 19767 253620 445122
14093D45122r7691l34909j46865j92828m5646J38839J34989J8983r1975R9565
14083g2416j5158Q03j37672L5258J14442K6114q3871K7312j21671J08567M7493
14072g0799n1161j40751J1205J91405L2423j28941J23691J3260O8470J08K2769
14061G1679l8147q915n9211j17728l30891N7305K53607K18635j2146p7269n0964
14050i4045k2636j67551K31744K50105k26342j99837P4904J37192j44824l246
14040a64536J96459k05321q0074J50528M4770L3134p901P8585M2224l6212n2149
14029d93j8230j90740K8332K17653N6776j63040j15178j19531M8055L8300k35215
14018d53311J00782K20371J46322N4448j77569N9535P2712m7910J81078L9869
$$ plain form
14093 445122 347431 12522 -134343 -327171 -372817 -233978 -98989 -80006 -171981 -72416
14083 -72416 -87574 -86771 -224443 -189185 -74743 -48629 -132500 -105188 -226859 -118292 -70799
14072 -70799 -121960 -262711 -251506 -60101 -27678 -156619 -32928 -19668 48802 48910 71679
14061 71679 33532 24617 -34594 -152322 -483213 -425908 -172301 46334 34188 -43081 -94045
14050 -94045 -116681 -284232 -52488 197617 -28725 -228562 -153658 -16466 -161290 -164536
14040 -164536 31923 -173398 -253472 -102944 -58174 -25040 -32941 45644 87868 51656 -493
14029 -493 -18723 -209463 -181131 36522 93298 -69742 -184920 -304451 -256396 -218096 -453311
14018 -453311 -352529 -132158 14164 68612 -108957 -49422 23290 -24620 156458 196327
14008A96327j26679o9174J5804m1Q4005J804K6876m7756n1693m8600Q7092J77420
13996B45385k8604K2164M3688j71066k81842k5046m7727J52177M3056l7052K9453
13985e5414K0697o6442N8230J68909k16013j13208R1990L0923l2733k01532j08667
13974d23260L17624J29705m5598j22485o6230O3676P3781o3178K4686j53588l8316
13963c03183o3860O908J11093K83774J01030k9434p4333J90868L2948n9002q5169
13952A11640n4628J3092k30606j6875m6225j42250o3184R6358j03172J23685J04894
13941b07271l0880n1436j32504M5499j20030j860J36901O956O9958M8520Q9695
13930a46452K7104M5220J38323o1376L4452P1213m7588o655n7454j29221M7828
$$ plain form
14008 196327 69648 474 16278 16237 100242 102046 128922 81166 29473 -19127 67965 245385
13996 245385 216781 238945 282633 111567 -170275 -195321 -243048 -90871 -47815 -84867 -55414
13985 -55414 -34717 -101159 -42929 125980 -90033 -203241 -111251 -80328 -113061 -314593 -423260
13974 -423260 -105636 24069 -21529 -144014 -210244 -146568 -72787 -135965 -111279 -264867 -303183
13963 -303183 -367043 -360135 -249042 34732 135762 106328 31995 222863 255811 196809 111640
13952 111640 57012 70104 -160502 -177377 -223602 -365852 -429036 -332678 -435850 -312165 -207271
13941 -207271 -238151 -289587 -422091 -376592 -496622 -498482 -361581 -354625 -284667 -236147 -146452
13930 -146452 -119348 -74128 64195 2819 37271 108484 60896 54241 -3213 -132434 -84606
13919h4606J7312k66438Q1618J09053l4227m5296Q0435n9419j86770j12612R7143
13908d03807K5082q3347R3174J06208J43561J71719J52229r5265n4216p1752j37847
13897a54261l7437L67146J7056l30567k30505K16315J53928r382n1666k04367
13887b63740j38835J14562K89065J8838K3550l10586m0666K15377j82219L9005
13877b35649K30264k7556M1427M4001j38654J02005q8285r5560J1948l7466j34707
13866c28232l2924K49324N9186k8644o7580J6667J46466n9604j05087q2192P8720
13855a53900K7145q295J70593N2943Q1170O3514Q0131p269k9254j00822L3740
13844B09696j435n748j3129K08379m8336l335M3184j98676k27425j10718m6935
$$ plain form
13919 -84606 -67294 -333732 -252114 -143061 -177288 -222584 -142149 -201568 -388338 -500950 -403807
13908 -403807 -378725 -462072 -368898 -262690 -119129 52590 204819 109554 55338 -16414 -154261
13897 -154261 -191698 175448 192504 -138063 -368568 -152253 1675 -7707 -59373 -263740
13887 -263740 -402575 -288013 1052 19890 43440 -267146 -307812 -92435 -274654 -235649
13877 -235649 -5385 -32941 8486 52487 -86167 15838 -72447 -168007 -156059 -193525 -328232
13866 -328232 -361156 -111832 -52646 -81290 -148870 -132203 14263 -45341 -150428 -232620 -153900
13855 -153900 -126755 -135050 35543 88486 169656 233170 313301 306032 276778 175956 209696
13844 209696 208261 202513 189384 397763 349427 346092 389276 190600 -36825 -147543 -194478
13833a94478K13211Q7424J4521p1362o3654j79673k12996N4282n214M2055J59025
13822a56859k9174j7947j7963J37051J66704L3328m8544J23142J12396l45427
13812d3293m03r540Q917K3394j668J48505o4316l71086j05000O6029K41517q3055
13800a89999n6613m3067j10234q3612J21748P9189Q7098K08566k1465m4843P3421
13789B0189o7511l7526n5149M8756k16j0453n1612K6440j3368J01725K5143j8904
13777c2486L8851k13581N1650j1116J09928J04630n394m1047p1130K4685m8999
13766i4009L9230r9840o0936n9767p3096J4962K99996p0612K0548l7735M7640
13755g3619M6135K2017j22208n5910N5106m6922k50918p9895J64142J74469l6125
$$ plain form
13833 -194478 18733 106157 120678 49316 -14338 -194011 -407007 -352725 -357939 -315884 -156859
13822 -156859 -186033 -203980 -221943 -84892 81812 115140 66596 189738 302134 -43293
13812 -43293 -43696 -53236 -44319 -20925 -22593 125912 61596 -309490 -414490 -348461 -106944 -189999
13800 -189999 -246612 -289679 -399913 -483525 -361777 -282588 -195490 13076 -8389 -53232 20189
13789 20189 -47322 -84848 -139997 -91241 -91457 -101910 -153522 -127082 -140450 -38725 -13582 -32486
13777 -32486 6365 -207216 -155566 -166682 -56754 47876 42482 1435 -69695 -45010 -94009
13766 -94009 -54779 -154619 -215555 -275322 -348418 -333456 -33460 -104072 -83524 -121259 -73619
13755 -73619 -27484 -5467 -127675 -183585 -128479 -175401 -426319 -506214 -342072 -167603 -203728
13744b03728k36792L6068J56866K20735L6107Q9685O3299o5492P4193r223j33252
13733B8466l1283j22584J1932p6743k4438P4312J60213M6247L2290j90058j80305
13722b71951N6403M0090q105k11999j38268K7224J68372L4012J09711J58827O5878
13711C0194O78J10754j09936l2891P8955M0211r265J89732q0692k69671J2711
13700c9220K15553l9425r2226K1814j0694j43472j93899k294O7865L3434m8085
13689b30649J19098J93588M4921J98803P7126m1869l30820r5826K21159K1442
13679A76973r5791j62376n8039R430l5448K09592J16550L2909J9242q8934m5374
13668G8734j05539p7238J07148j78712m6084N8463j07085j2100j6205O9657N2287
$$ plain form
13744 -203728 -440520 -404452 -247586 -26851 9256 98941 162240 96748 170941 161718 28466
13733 28466 -2817 -125401 -113469 -190212 -214650 -140338 19875 66122 98412 -91646 -271951
13722 -271951 -215548 -175458 -183563 -395562 -533830 -506606 -338234 -304222 -194511 -35684 30194
13711 30194 30872 141626 31690 -1201 77754 117965 108700 298432 217740 -51931 -39220
13700 -39220 176333 136908 44682 66496 55802 -87670 -281569 -283863 -215998 -182564 -230649
13689 -230649 -111551 82037 126958 325761 402887 361018 30198 -65628 155531 176973
13679 176973 81182 -81194 -139233 -129803 -165251 44341 160891 193800 213042 124108 78734
13668 78734 -26805 -104043 3105 -175607 -221691 -163228 -270313 -282413 -298618 -228961 -176674
13657a76674Q0471Q4825n4210j3906k49137j11722J63517L59663J54727k26169
13647A1385r3378j67056Q1826J80919L1023J48347l5820o5187r3848N7114j19817
13636f4492P2907J28834J1020j02131j79390o276J41996R0766k00924j49301K3220
13625b33771Q2186m8044q8362N0835Q2376r3217l7730J03026J46540J89247j37900
13614A5186j20034J04341j5675r6537j57814J45964K9732j1716M5377j31402J69605
13603b2973K05984r9304j1419n9127l03486M5359j40036P640P6923M7289R1686
13592a61464N5507O2142j81834p2756K51876q5602j81542k71442O0346K25099
13582b99670K05419J18141n8539j01096n8665O91J31046Q3162n5707l7650Q1247
$$ plain form
13657 -176674 -96203 -11378 -65588 -79494 -328631 -440353 -276836 82827 237554 11385
13647 11385 -81993 -249049 -167223 13696 44719 193066 157246 92059 -1789 55325 -64492
13636 -64492 8415 137249 148269 46138 -133252 -139528 2468 93234 -107690 -256991 -233771
13625 -233771 -151585 -199629 -287991 -237156 -154780 -247997 -285727 -182701 -36161 153086 15186
13614 15186 -104848 -507 -16182 -112719 -270533 -124569 -94837 -106553 -61176 -192578 -22973
13603 -22973 183011 83707 72288 13161 -290325 -244966 -385002 -377362 -300439 -253150 -161464
13592 -161464 -105957 -43815 -225649 -298405 -46529 -132131 -313673 -585115 -524769 -299670
13582 -299670 -94251 23890 -34649 -135745 -194410 -193719 -62673 20489 -35218 -72868 8379
13571H379Q432j43894L5884J7565o8941K4653J2199j73110J53296O6333N7546
13560a658L9468N4367k55541j16360n3753K26003K75703k18816j27058m5565J12317
13549a10893J6046j5453N2316R7958j3900K19821q2510l97762p830K16893R2789
13538F7475j60388r9088n4376o2214J93679K40122J33781J77378r653k14105k28520
13527a5909n0778j55752j51727K52661J44679N244k103L2370j1474p9394q3609
13516a15792j0000N8185Q8097j53985q398J01537J6501J06127J0780M1511k32758
13505i8195k5064J26319M0634k05206j53101P2915K34619L4620j21440j17405
13495b11304P1235R4123J5092J4114J545n0731k9776k31069m4569N1333J14680
$$ plain form
13571 8379 16811 -127083 -91199 -73634 -142575 -117922 -105723 -278833 -125537 -59204 -1658
13560 -1658 37810 92177 -163364 -279724 -333477 -107474 168229 -50587 -177645 -223210 -110893
13549 -110893 -94847 -110300 -57984 39974 26074 245895 163385 -234377 -242207 -25314 67475
13538 67475 -92913 -192001 -246377 -308591 -114912 125210 258991 436369 426716 212611 -15909
13527 -15909 -66687 -222439 -374166 -121505 23174 28418 26315 58685 47211 -32183 -115792
13516 -115792 -125792 -67607 20490 -133495 -141893 -40356 -23855 82272 93052 134563 -98195
13505 -98195 -123259 3060 43694 -161512 -314613 -241698 -7079 27541 -93899 -211304
13495 -211304 -140069 -45946 -30854 -16740 -15195 -65926 -95702 -326771 -371340 -320007 -205327
13484b05327K39141N5893j00892N8667J00994r6666j927n286p8632p2856L5295
13473g1596K1820l4812j98379k34092J23027J63257J50628K6416m5633O9523L3535
13462C694o5576P3155j52591j84189j62925Q1879O5437N6482K94275P8223J0055
13451I7919J94719N4749l10643j11070J12248N4974M6667L8151r7735L2463r511
13440A02931r0389J204j35143k08058r968J26695K00314j32986r396j63503P6941
13429b41358J52259j5318L3542j2735n2349K25479M328J1018M5892L2196L1751
13418B14705p4574j21400K2041M2829l9940j50718Q9873M0858j96574J71755n5578
13407e6723n8703j1992J84472j3874j72969P6833P9943K12991J04151j75312l12287
$$ plain form
13484 -205327 33814 89707 -11185 47482 148476 51810 49883 44597 -34035 -106891 -71596
13473 -71596 -49776 -84588 -282967 -517059 -394032 -230775 -80147 -53731 -99364 -29841 3694
13462 3694 -61882 11273 -141318 -325507 -488432 -406553 -341116 -284634 9641 87864 97919
13451 97919 292638 347387 36744 -74326 37922 92896 139563 177714 79979 112442 102931
13440 102931 12542 13746 -121397 -329455 -339423 -212728 -12414 -145400 -154796 -318299 -241358
13429 -241358 -89099 -104417 -70875 -83610 -135959 89520 93848 104866 150758 182954 214705
13418 214705 140131 18731 40772 83601 43661 -107057 -17184 23674 -172900 -1145 -56723
13407 -56723 -115426 -127418 57054 43180 -129789 -52956 26987 239978 344129 168817 -143470
13396a43470l303P542K32574J07936r7179k9429n3480j32851j14548K2857J2450
13385a90901J07923J5983N8765J30033j5818j09783p1114O4700K03852m2408j72474
13374b1242j62976p328J512L1620J61609J22442K5644R0808M0927k95158j01672
13363a13814P8476J71748M442l13222n7370P6413n5827O1786l4064j30228j429
13352c13089k0888J43836Q9239Q5797j5605O3724J46615P3967k22272j30917J43554
13341D3961J24937K3502j57504j64173K441j72404K25643K37937O629j10703j50912
13330i0646n7330K01118R2938q2957q7101k51207Q9588M16419o5946r9683j91528
13319a26335k05068j77977Q7093J81294K31444J62828j6299k8736R0817K46184
$$ plain form
13396 -143470 -146773 -139231 93343 201279 104100 74671 21191 -111660 -226208 -203351 -190901
13385 -190901 -82978 -66995 -8230 121803 105985 -3798 -74912 -10212 193640 151232 -21242
13374 -21242 -184218 -191546 -190034 -158414 3195 125637 151281 242089 283016 -12142 -113814
13363 -113814 -35338 136410 140852 -172370 -229740 -153327 -209154 -147368 -181432 -311660 -313089
13352 -313089 -333977 -190141 -100902 -15105 -30710 33014 179629 253596 31324 -99593 43961
13341 43961 168898 192400 34896 -129277 -126836 -299240 -73597 164340 170969 60266 -90646
13330 -90646 -147976 53142 146080 63123 -23978 -275185 -185597 230822 164876 65193 -126335
13319 -126335 -331403 -509380 -422287 -240993 -9549 153279 136980 108244 199061 445245
13309D45245m2518j79222l03067m3026L25200l9922m3926n2585j28712J46581
13299H4048K86414r6607j93478n0868k1120J43845O6906j39901j95061r8883J34141
13288h0564M05000L04949j7282j92135R834P6511m3698j7728j38460j24286p346
13277A74795M0195j51207j8387p3329j03014M1436K81174j5051j30954J56274
13267B01932J03886n7561m5647L3824M2631j59117j04159J12865J25143r0530
13257A63267j14178R1576m905J38338n7198j02578K26288Q8974j12573l40164
13247b3153j19238r2322L0337M67699K49484k7942M935K1688j04917p8728M28
13236C28271P287J2870J12644j17348k22766j35142J3203j648M8399r7552Q4140
$$ plain form
13309 445245 402727 223505 -79562 -122588 202612 162690 118764 66179 -62533 84048
13299 84048 370462 273855 80377 29509 8389 152234 219140 79239 -115822 -214705 -80564
13288 -80564 324436 629385 612103 419968 429802 506313 462615 444887 306427 182141 174795
13277 174795 214990 63783 45396 -27933 -130947 -89511 191663 176612 45658 201932
13267 201932 305818 248257 202610 236434 279065 119948 15789 128654 253797 163267
13257 163267 49089 140665 135760 274098 216900 114322 340610 429584 317011 -23153
13247 -23153 -142391 -234713 -204376 263323 512807 484865 489800 511488 406571 327843 328271
13236 328271 335558 348428 461072 343724 120958 -14184 -981 -2629 45770 -51782 32358
13225C2358O5124J76760j61031o2730J0238k17750j06852K23116J03576k0053
13215D2756j74029j7827M60117M6195j61915j06218j73577K26579J42383O7578
13205C52042k02482j07005K1277j26320q9264R1696J34929K18831J9124M4401
13195C57229j46061j5033K55269j2706k11965P4218q2271k23976k1195m4385l1546
13184a02422Q0405N513o2971R1960Q6867J14998k48016j63541n2060J95642L21697
13173B68072K245J6239j1632j0311k19729j08761J10583n2228j61976p0677j217
13162b39392J74198J09701K9647Q4374P2161k05134L6960N8783P2453j6470n8367
13151A18914J30483M9950j40347j77751j19676O9701j93446J25662J37223J62919
$$ plain form
13225 32358 97482 274242 113211 50481 60719 -157031 -263883 -40767 62809 42756
13215 42756 -131273 -149100 311017 357212 195297 89079 -84498 142081 284464 352042
13205 352042 149560 42555 63832 -62488 -151752 -60056 74873 293704 312828 357229
13195 357229 211168 196135 451404 438698 226733 300951 218680 -5296 -26491 -70876 -102422
13184 -102422 -22017 -16504 -79475 12485 99352 214350 -33666 -197207 -249267 -53625 268072
13173 268072 270317 286556 274924 264613 44884 -63877 46706 -5522 -167498 -238175 -239392
13162 -239392 -65194 44507 74154 158528 230689 25555 62515 121298 193751 177281 118914
13151 118914 249397 299347 159000 -18751 -138427 -68726 -262172 -136510 713 163632
13141A63632j4540j5592R1701n3240q5084J33256q1863o8663j53273P2342J20411
13130A09087l7804L1995J21240L4647k9896j18223j73209J49431L33683J38247
13120E59198m4219l20044k73385k6595R3131J47735k1602l226N0245k4703j96622
13109f0087j1153K66651J75128k27602k16865j25816R6931K35174k5292n0564
13099E6505j02449r1806M5129n5323J08824K24113Q6483j54661J32919M596j07451
13088A46879k59757l7210K58541J59897M8892j41689P4110J39741o7312M5069
13078C67161L2287k08567j54065N1426J41926j16207q2331j83085j02393n0075
13068c03923Q0369K80734k5703j06818Q5609K23115M7899J3714l84892l9195R9675
$$ plain form
13141 163632 149092 133500 225201 171961 86877 220133 138270 69607 -83666 -11324 109087
13130 109087 71283 103278 224518 259165 229269 111046 -62163 87268 420951 559198
13120 559198 514979 194935 -78450 -105045 -11914 135821 114219 110993 161238 136535 -60087
13109 -60087 -71240 195411 370539 142937 -73928 -199744 -102813 132361 107069 56505
13099 56505 -45944 -137750 -92621 -147944 -39120 184993 271476 116815 249734 254330 146879
13088 146879 -112878 -150088 108453 268350 317242 175553 249663 389404 322092 367161
13078 367161 399448 190881 36816 88242 230168 113961 31630 -151455 -253848 -303923
13068 -303923 -223554 57180 31477 -75341 10268 233383 281282 294996 -89896 -129091 -29416
13057b9416P724R3789J54393J11383j46882l06581k36533J81577K52077J39519
13047B21050M0753p8223M858q7662m7749o495J15963O0510l5321j51428k71217
13036b34961j93524J83614J89834R0873k4734m3104J38028P4861l8380j68190
13026b5683j15202k7318r1461J24698J06575l5128N543J27779L5557j44006n8024
13015i6670J25053K67418L3679k06532j3014O7817m1554J04083L6460j93093l1319
13004E2328Q4884R7508o3093N7144j17978j32833q4568J13968J84733r4185k0386
12993G7522j42758q6745P2429P9242M9810j96160p427K55280J65506r1882l6821
12982A37996J5069M0583j16985o0627q7440K35533L1685j20550J14123J90206
$$ plain form
13057 -29416 -21692 72097 226490 337873 190991 -115590 -352123 -170546 81531 221050
13047 221050 261803 183580 188438 100776 53027 46532 162495 223005 187684 36256 -234961
13036 -234961 -428485 -244871 -55037 35836 11102 -32002 106026 180887 142507 -25683
13026 -25683 -140885 -168203 -259664 -134966 -28391 -63519 -57976 69803 105360 -38646 -96670
13015 -96670 28383 295801 329480 122948 109934 177751 136197 240280 276740 83647 52328
13004 52328 137212 234720 171627 228771 110793 -22040 -106608 7360 192093 97908 77522
12993 77522 -65236 -151981 -79552 -310 49500 -146660 -154087 101193 266699 174817 137996
12982 137996 153065 193648 76663 16036 -71404 164129 195814 75264 189387 379593
12972C79593L777k27171j22201j720K00157J2184q8115j26071Q5815K9023J43250
12961B88521L3150j18438R2291L22J63731q664j43028q6617l09j28098j72224
12950g9363L21862J89942j25197l6833J42767l7033m2068j23554K790J34110K98533
12939F45956J54805r5156k54286p7211J27543m3488j64212j17881j46580k35083
12929b05593J3225K3797J30289J52014J21864P9831J03522J6090j50403m5443
12919B39193P0886o6415k2852j10677j9754J43321J81679O6030L6705j79058j78108
12908A60950j18369l9983J07658J22749j48880j13659o9124J25576R2495M8920
12898A68333k3042j48214m6445o6544P0850k78314m8586J41266J97659P8315n7793
$$ plain form
12972 379593 383370 156199 33998 32278 232435 244619 156504 30433 116248 145271 288521
12961 288521 321671 203233 295524 295846 459577 450913 307885 221268 220959 92861 -79363
12950 -79363 242499 432441 307244 270411 413178 376145 334077 210523 213313 347423 645956
12939 645956 800761 705605 451319 374108 501651 458163 293951 176070 29490 -205593
12929 -205593 -192368 -168571 -38282 113732 235596 315427 418949 435039 284636 239193
12919 239193 310079 243664 220812 110135 90381 233702 415381 481411 518116 339058 160950
12908 160950 42581 2598 110256 233005 84125 -29534 -98658 26918 119413 168333
12898 168333 145291 -2923 -49368 -115912 -45062 -323376 -371962 -230696 -33037 45278 -12515
12887a2515K61304o2662m3907K5866J19435k8438P6981m0239K3904j66186j6733
12876A36810j25869q8181k0378J41968K4579j0768q9087j5298M8981O0846J45909
12865B09512J39497m7919L4999p6001j6369K52647J3905j06032J4051L0269j10640
12854C37919j70055J7750J36623n1098l5556n822k4837L1965P8407p8400j24063
12843A12833j0531J42940K33351M5383q5015k79979n5093k10426L24697J44992
12833C63152p2918n6561O5676K12505J39658k9263q1131m1002j83545j15334j92687
12822H550K6442J14315K12804J65770j3384J01331m4909k65534k93771k39726
12812b28112K03328K18754M3213K25326J59173k06183J9047J38574J59491J02918
$$ plain form
12887 -12515 248789 186127 142220 168086 287521 259083 336064 295825 319729 153543 136810
12876 136810 10941 -77240 -97618 44350 68929 58161 -30926 -46224 2757 63603 209512
12865 209512 349009 301090 336089 260088 243719 496366 510271 404239 418290 448559 337919
12854 337919 167864 185614 322237 271139 235583 229761 204924 236889 315296 236896 112833
12843 112833 102302 245242 478593 523976 438961 158982 103889 -106537 218160 363152
12833 363152 290234 233673 299349 511854 651512 622249 541118 500116 316571 201237 8550
12822 8550 34992 149307 362111 527881 514497 615828 570919 305385 11614 -228112
12812 -228112 -24784 193970 237183 462509 621682 415499 434546 573120 732611 835529
12802H35529j07050k61607r3548R7597J30108j39808L5532K39928K38193r9629
12792H75245J41247J03324N4208K95001M85057L69962J21001M3632M33241N84748
12782C506666J58172O94710J347523J823180K506796L238339M371714M258674
12774B1905774K065607M84089n42421j673038k389845l034163k919018k722812
12766A1174173k315992j775540j274260p97377o54048n75234l29775m22008m38620
12757B591319l26859k96573r824l30047k49596n0374j29217m6673j15532N5079
12747A091703p798j42592m4495L0074m9112n4543l5850p8055k06764J37008J95352
12736H34928k18096j22523K20570J54898o0870j10661q246J58634p6625m4417
$$ plain form
12802 835529 728479 466872 373324 470921 601029 461221 496753 736681 974874 875245
12792 875245 1016492 1119816 1174024 1469025 1954082 2324044 2445045 2488677 2921918 3506666
12782 3506666 3664838 4359548 5707071 7530251 10037047 13275386 17647100 21905774
12774 21905774 23971381 24455470 23913049 22240011 19850166 16816003 13896985 11174173
12766 11174173 8858181 7082641 5808381 5011004 4356956 3781722 3451947 3029939 2591319
12757 2591319 2264460 1967887 1958063 1628016 1378420 1328046 1198829 1152156 1036624 1091703
12747 1091703 1083905 941313 896818 926892 877780 823237 787387 709332 502568 639576 834928
12736 834928 616832 494309 714879 869777 808907 698246 690000 848634 772009 727592
12726G27592j12338J04565j4830M7153Q3667j31916p692P1223k5602J32309m3104
12715H31027j81427O398n2535j09491J10948J64779n8737r0222k4059L7125r4052
12704E39754m7530N7491J03852M0769j34875j00179O6062j6814p911o3399r7754
12693C39466J397K09942N1411o9756m3154J850l2635O0976J5172J9695j12301
12682D42063j68779L2932j3338K08377P7307m2816j2294N4405n6134o4673k9915
12671D27135n6279J4695Q0660Q3773p8218q4370O6556K26733J75890P0057k31312
12660F95320k14879j67817q6784O1418J54441J92593k6349k35301o5825J95819
$$ plain form
12726 727592 615254 719819 704989 752142 835809 703893 696201 767424 741822 874131 831027
12715 831027 649600 655998 603463 493972 604920 769699 710962 620740 596681 633806 539754
12704 539754 492224 549715 653567 694336 559461 459282 525344 508530 500619 437220 339466
12693 339466 340863 550805 602216 532460 489306 491156 458521 519497 534669 554364 442063
12682 442063 273284 306216 292878 501255 578562 535746 523452 577857 521723 457050 427135
12671 427135 370856 385551 466211 549984 471766 387396 453952 680685 856575 926632 695320
12660 695320 480441 312624 225840 287258 441699 634292 607943 372642 306817 502636
$$ [...]
##END NTUPLES=NMR SPECTRUM
##END=
