##TITLE=Analysis number 323686
Compound Code cc 40139
Project Code adrs
Chemist Name af chempharm
##JCAMPDX= 6.0         $$ Bruker NMR JCAMP-DX V2.0
##DATA TYPE= NMR SPECTRUM
##DATA CLASS= NTUPLES
##ORIGIN= Bruker BioSpin GmbH
##OWNER= nmr
$$ XWIN-NMR		Version 3.5
$$ Fri Nov  3 11:08:50 2006 GMT Standard Time (UT+0h)  MAYBRIDGE\nmr@NMR_250MHZ
##.OBSERVE FREQUENCY= 250.131544655141
##.OBSERVE NUCLEUS= ^1H
##.ACQUISITION MODE= SIMULTANEOUS (DQD)
##.ACQUISITION SCHEME= undefined
##.AVERAGES= 16
##.DIGITISER RES= 18
##SPECTROMETER/DATA SYSTEM= dpx250
##.PULSE SEQUENCE= zg30
##.SOLVENT NAME= CDCl3
##.SHIFT REFERENCE= (INTERNAL, CDCl3, 0, 16.4491)
##AUDIT TRAIL= $$ (NUMBER, WHEN, WHO, WHERE, WHAT)
$$ ##TITLE= Audit trail, XWIN-NMR		Version 3.5
$$ ##JCAMPDX= 5.01
$$ ##ORIGIN= Bruker BioSpin GmbH
$$ ##OWNER= nmr
$$ C:\u/data/dgb/nmr/ADRS/2180/pdata/1/auditp.txt
$$ ##AUDIT TRAIL=  $$ (NUMBER, WHEN, WHO, WHERE, WHAT)
(   1,<2006-11-03 11:08:14.91 +000>,<MAYBRIDGE\nmr>,<NMR_250MHZ>,
      <created by zg, POWCHK disabled, PULCHK disabled
       configuration hash MD5:
       49 4B E0 1D 92 C2 6B 37 9F E6 65 BC 52 41 86 1D
       data hash MD5: 64K
       40 36 D6 27 DE 5C 36 FC 37 B8 DB 83 BB 67 B6 CD>)
(   2,<2006-11-03 11:08:36.30 +000>,<MAYBRIDGE\nmr>,<NMR_250MHZ>,
      <Start of raw data processing
       ef LB = 0.3 FT_mod = 6 PKNL = 1 SI = 32K 
       data hash MD5: 32K
       8C EE 42 AC 14 DE 38 76 66 91 E0 58 41 2C 3E EA>)
(   3,<2006-11-03 11:08:39.68 +000>,<MAYBRIDGE\nmr>,<NMR_250MHZ>,
      <apk 
       data hash MD5: 32K
       F9 18 C7 71 D0 79 80 53 5E E6 DE 13 7E 94 9A B4>)
(   4,<2006-11-03 11:08:40.57 +000>,<MAYBRIDGE\nmr>,<NMR_250MHZ>,
      <abs ABSG = 5 
       data hash MD5: 32K
       8F E1 7B A1 E2 AD 41 31 6F 9D FE DC B4 6B 8A E3>)
$$ ##END=
$$ 
$$ hash MD5
$$ 1D E8 73 DE 45 DF FA C7 AF 75 AA E3 59 B0 FE CD
##$RELAX= 
##$RELAX= 
##$RELAX= 
##$RELAX= 
##$RELAX= 
##$RELAX= 
##$RELAX= 
$$ Bruker specific parameters
$$ --------------------------
##$DU= <C:\u>
##$EXPNO= 2180
##$NAME= <ADRS>
##$PROCNO= 1
##$TYPE= <nmr>
##$USER= <dgb>
##$AMP= (0..31)
100 100 100 100 100 100 100 100 100 100 100 100 100 100 100 100 100 100 
100 100 100 100 100 100 100 100 100 100 100 100 100 100 
##$AQSEQ= 0
##$AQ_mod= 3
##$AUNM= <au_zg>
##$AUTOPOS= <5 >
##$BF1= 250.13
##$BF2= 250.13
##$BF3= 250.13
##$BF4= 250.13
##$BF5= 500.13
##$BF6= 500.13
##$BF7= 500.13
##$BF8= 500.13
##$BYTORDA= 1
##$CFDGTYP= 0
##$CFRGTYP= 5
##$CHEMSTR= <none>
##$CNST= (0..31)
1 1 145 1 1 1 1 1 1 1 1 1 1 1 1 1 1 1 1 1 1 1 1 1 1 1 1 1 1 1 1 1 
##$CPDPRG= <>
##$CPDPRG1= <>
##$CPDPRG2= <>
##$CPDPRG3= <>
##$CPDPRG4= <mlev>
##$CPDPRG5= <mlev>
##$CPDPRG6= <mlev>
##$CPDPRG7= <mlev>
##$CPDPRG8= <mlev>
##$CPDPRGB= <>
##$CPDPRGT= <>
##$D= (0..31)
0 1 0 0 0 0 0 0 0 0.06 0 0 0 0 0 0 0.0002 0 0 0 0 0 0 0 0 0 0 0 0 0 0 
0 
##$DATE= 1162552093
##$DBL= (0..7)
120 120 120 120 120 120 120 120 
##$DBP= (0..7)
150 150 150 150 150 150 150 150 
##$DBP07= 0
##$DBPNAM0= <>
##$DBPNAM1= <>
##$DBPNAM2= <>
$$ [...]
##$SUBNAM7= <"">
##$SUBNAM8= <"">
##$SUBNAM9= <"">
##$SW= 20.6930455092707
##$SWIBOX= (0..15)
0 0 3 0 0 0 0 0 0 0 0 0 0 0 0 0 
##$SW_h= 5175.983436853
##$TD= 65536
##$TD0= 1
##$TE= 683.16
##$TE2= 300
##$TE3= 300
##$TEG= 300
##$TL= (0..7)
0 120 120 120 120 120 120 120 
##$TP= (0..7)
150 150 150 150 150 150 150 150 
##$TP07= 0
##$TPNAME0= <>
##$TPNAME1= <>
##$TPNAME2= <>
##$TPNAME3= <>
##$TPNAME4= <>
##$TPNAME5= <>
##$TPNAME6= <>
##$TPNAME7= <>
##$TPOAL= (0..7)
0.5 0.5 0.5 0.5 0.5 0.5 0.5 0.5 
##$TPOFFS= (0..7)
0 0 0 0 0 0 0 0 
##$TUNHIN= 0
##$TUNHOUT= 0
##$TUNXOUT= 0
##$USERA1= <user>
##$USERA2= <user>
##$USERA3= <user>
##$USERA4= <user>
##$USERA5= <user>
##$V9= 5
##$VALIST= <valist>
##$VCLIST= <CCCCCCCCCCCCCCC>
##$VD= 0
##$VDLIST= <DDDDDDDDDDDDDDD>
##$VPLIST= <PPPPPPPPPPPPPPP>
##$VTLIST= <TTTTTTTTTTTTTTT>
##$WBST= 1024
##$WBSW= 4
##$XGAIN= (0..3)
0 0 0 0 
##$XL= 0
##$YL= 0
##$YMAX_a= 437038
##$YMIN_a= -381260
##$ZGOPTNS= <>
##$ZL1= 120
##$ZL2= 120
##$ZL3= 120
##$ZL4= 120
##$ABSF1= 16.44906
##$ABSF2= -4.244112
##$ABSG= 5
##$ABSL= 3
##$ALPHA= 0
##$AQORDER= 0
##$ASSFAC= 0
##$ASSFACI= 0
##$ASSFACX= 0
##$ASSWID= 0
##$AUNMP= <proc_1d>
##$AZFE= 0.1
##$AZFW= 0.1
##$BCFW= 0
##$BC_mod= 0
##$BYTORDP= 0
##$COROFFS= 0
##$CY= 12.5
##$DATMOD= 1
##$DC= 0
##$DFILT= <>
##$DTYPP= 0
##$F1P= 14.0000005364418
##$F2P= -0.99999901652339
##$FCOR= 0.5
##$FTSIZE= 32768
##$FT_mod= 6
##$GAMMA= 0
##$GB= 0
##$INTBC= 1
##$INTSCL= 1
##$ISEN= 128
##$LB= 0.3
##$LEV0= 0
##$LPBIN= 0
##$MAXI= 10000
##$MC2= 0
##$MEAN= 0
##$ME_mod= 0
##$MI= 0
##$NCOEF= 0
##$NC_proc= -3
##$NLEV= 6
##$NOISF1= 0
##$NOISF2= 0
##$NSP= 0
##$NTH_PI= 0
##$NZP= 0
##$OFFSET= 16.44906
##$PC= 1
##$PHC0= -42.30828
##$PHC1= 7.600327
##$PH_mod= 1
##$PKNL= yes
##$PPARMOD= 0
##$PSCAL= 4
##$PSIGN= 0
##$REVERSE= no
##$SF= 250.130018241777
##$SI= 32768
##$SIGF1= 0
##$SIGF2= 0
##$SINO= 400
##$SIOLD= 32768
##$SREGLST= <1H.CDCl3>
##$SSB= 0
##$STSI= 32768
##$STSR= 0
##$SW_p= 5175.98343685301
##$SYMM= 0
##$S_DEV= 0
##$TDeff= 65536
##$TDoff= 0
##$TI= <Analysis number 999999
Compound Code 99
Book Reference 9
Project Code 9>
##$TILT= no
##$TM1= 0
##$TM2= 0
##$TOPLEV= 0
##$USERP1= <user>
##$USERP2= <user>
##$USERP3= <user>
##$USERP4= <user>
##$USERP5= <user>
##$WDW= 1
##$XDIM= 32768
##$YMAX_p= 570763630
##$YMIN_p= -254257
$$ End of Bruker specific parameters
$$ ---------------------------------
##NTUPLES= NMR SPECTRUM
##VAR_NAME=  FREQUENCY,     SPECTRUM/REAL,   SPECTRUM/IMAG
##SYMBOL=    X,             R,               I
##VAR_TYPE=  INDEPENDENT,   DEPENDENT,       DEPENDENT
##VAR_FORM=  AFFN,          ASDF,            ASDF
##VAR_DIM=   32768,         32768,           32768
##UNITS=     HZ,            ARBITRARY UNITS, ARBITRARY UNITS
##FACTOR=    0.157963299565203, 1,           1
##FIRST=     4114.40378793317, 0,            0
##LAST=      -1061.57964891984, 0,           0
##MIN=       -1061.57964891984, -254257,     0
##MAX=       4114.40378793317, 570763630,    0
$$ Real data points
##PAGE= N=1
##DATA TABLE= (X++(R..R)), XYDATA
$$ [...]
14534f000j813j7055l2856J0103J7215J3969J488L3256J697J4122k3525j287j1000
$$ -6000 -7813 -24868 -57724 -47621 -30406 -16437 -14949 18307 20004 34126 10601 9314 -1686
14521a686j4043j7904J074K8247K3969k5166l5147q873M00J4881P144L557K0148
$$ -1686 -15729 -33633 -32559 -4312 19657 -5509 -40656 -49529 -49129 -34248 -27104 -23547 -3399
14508c399j8592l0420K397o71K2695n960P581M8514r76k1088l5345o221Q369J6183
$$ -3399 -21991 -52411 -50014 -50685 -27990 -33950 -26369 22145 21169 81 -35264 -41485 -33116 -16933
14494a6933K6366q098J808K0981O671l2606n2990j0356O798R357J3704M9422Q222
$$ -16933 9433 1335 3143 24124 30795 -1811 -54801 -65157 -58359 -49002 -35298 14124 22346
14481B2346k9197l1777J3443Q780j0067j4699L639Q759J6568K5541k320l7006
$$ 22346 -6851 -38628 -25185 -16405 -26472 -41171 -37532 -28773 -12205 13336 11016 -25990
14469b5990j3978K4998M2823J5265j9329k0060j3288K6938n05r199k5592J7946
$$ -25990 -39968 -14970 27853 43118 23789 3729 -9559 17379 16874 7675 -17917 29
14457B9L622p424n358m72j950M247l551M131j5007k3827L494k1512p817K891j8279
$$ 29 3651 -3773 -9131 -9603 -11553 -7306 -10857 -6726 -21733 -45560 -42066 -63578 -71395 -68504 -86783
14442h6783o137m366K4943N6224K1378r574k2698j2358L0656j0655m4702R178
$$ -86783 -92920 -97286 -72343 -16119 5259 -4315 -27013 -39371 -8715 -19370 -64072 -54894
14430e4894J8326J4429L831k1203l4628J8198J3894o85J2850l0606k695J1180
$$ -54894 -36568 -22139 -18308 -39511 -74139 -55941 -42047 -42732 -29882 -60488 -63183 -52003
14418e2003J6466K969O515N452j8134k0595K2804n021J4180J2189K0370k5604
$$ -52003 -35537 -32568 -26053 -20601 -38735 -59330 -36526 -41547 -27367 -15178 5192 -20412
14406b0412k2744m749l305j0305p326L2085J0102K0114k916Q920j521J3295K752
$$ -20412 -43156 -47905 -51210 -61515 -68841 -36756 -26654 -6540 -9456 -536 -2057 11238 13990
14393A3990q971K3516k316R279J4433J9479M704k9525l7295k3023K6081J3459
$$ 13990 5019 28535 26219 35498 49931 69410 74114 44589 7294 -15729 10352 23811
14381B3811J2680K0775j6519k9088O201N2771m8105l4801K2913J0879l8279m4172
$$ 23811 36491 57266 40747 11659 17860 70631 22526 -12275 10638 21517 -16762 -60934
14369f0934j7998n937J7275P816N200N395O519P019j3435L0813K5390O739j1871
$$ -60934 -78932 -84869 -67594 -59778 -54578 -49183 -42664 -35645 -49080 -18267 7123 13862 1991
14356A991N64q443L939J5223q060j5700l0713K066M5310O410k1718m158r47k1830
$$ 1991 2555 -5888 -1949 13274 5214 -10486 -41199 -39133 6177 12587 -9131 -13289 -14236 -36066
14342c6066K625j4226N7617K7212j5989l5934j4156k162k1200q611L3316M8847
$$ -36066 -33441 -47667 9950 37162 21173 -14761 -28917 -31079 -52279 -60890 -27574 21273
14330B1273J2369Q594K9838j7475k9554k831k1832o800K0322J4865k1293J4449
$$ 21273 33642 42236 72074 54599 25045 22214 382 -6418 13904 28769 7476 21925
14318B1925J3417j6217j7370Q419j1312j9375k7349J0129K680k7320J6346L959
$$ 21925 35342 19125 1755 10174 -1138 -20513 -47862 -37733 -35053 -62373 -46027 -42068
14306d2068L4158j0475j0089L0618J2816j2569j9442j4354Q707m046K7552L6643
$$ -42068 -7910 -18385 -28474 2144 14960 2391 -17051 -31405 -22698 -26744 808 37451
14294C7451j84r180J6331q013m4534l4576K484J4423Q156J4351j7598m1289Q778
$$ 37451 37267 28087 44418 36405 -8129 -42705 -40221 -25798 -17642 -3291 -20889 -62178 -53400
14281e3400K6650k303J557l3537R168J6780K3807q156j2106K5323J2658K5709
$$ -53400 -26750 -29053 -27496 -61033 -51865 -35085 -11278 -19434 -31540 -6217 6441 32150
14269C2150j3588J856L93j4265j4996J0649k0653J3257J3364p686p803O206j9030
$$ 32150 18562 20418 20811 6546 -8450 2199 -18454 -5197 8167 481 -7322 -1116 -20146
14256b0146n987J6280n22j133q529j0617j604O119j4994Q207P461j435J6780j4476
$$ -20146 -26133 -9853 -10375 -11508 -20037 -30654 -32258 -26139 -41133 -32926 -25465 -26900 -10120 -24596
14242b4596j0867m721m003L9331J3821J1993j4026N868J2199l2383j8333l759
$$ -24596 -35463 -40184 -44187 -4856 8965 20958 6932 12800 24999 -7384 -25717 -29476
14230b9476k0550O636N1486J3767l2919j351J5799l0688l5256L9504K8041p048
$$ -29476 -50026 -43390 8096 21863 -11056 -12407 3392 -27296 -62552 -23048 4993 -2055
14218b055R986R742r123p026K03k592j4279j7119N002K5598J1466j8111j9265
$$ -2055 7931 17673 8550 1524 1727 -865 -15144 -32263 -27261 -1663 9803 -8308 -27573
14205b7573k6313J771K0366R74K0392j1376J8778N155L8070K0270j0114q057j1791
$$ -27573 -53886 -52115 -31749 -30775 -10383 -21759 -2981 2174 40244 60514 50400 42343 30552
14192C0552N334k600J3100M752j6986r777L716l2025l6606J1791l421j3499J2766
$$ 30552 35886 33286 46386 51138 34152 24375 28091 -3934 -40540 -28749 -32170 -45669 -32903
14179c2903J1351J307l449q214K8726j948l3951L2418M1921J5253m418l0725l7804
$$ -32903 -21552 -20245 -23694 -31908 -3182 -5130 -39081 -6663 35258 50511 46093 15368 -22436
14166b2436n776M273J2789J4318j1549N315k308L116J4260p348j6259J8806P448
$$ -22436 -28212 -23939 -11150 3168 -8381 -3066 -5374 -2258 12002 4654 -11605 7201 14649
14153A4649J4255L9812j1862K3344K5513k7538k5344j157r163l6133m8511l8539
$$ 14649 28904 68716 56854 80198 105711 78173 52829 51672 42509 6376 -42135 -80674
14141h0674K511L2488L2184M2016J9888r201j8719K644k4075q495o340P205P440
$$ -80674 -78163 -45675 -13491 28525 48413 39212 20493 23137 -938 -9433 -15773 -8568 -1128
14128a128k2203M008R215P258J0290r182j0997o384K4969R766r3P940k3684k2245
$$ -1128 -23331 -19323 -10108 -2850 7440 -1742 -12739 -19123 5846 15612 15519 23459 -225 -22470
14114b2470n828l0590j2532L91K207J0903O634L8580J0688l177k2250L539K3909
$$ -22470 -28298 -58888 -71420 -71029 -68822 -57919 -51285 -12705 -2017 -5194 -27444 -23905 4
14101Dp50M391J4922K7990J3800j8649k8763k3200j7751J0264N466Q745L0751
$$ 4 -746 3645 18567 46557 60357 41708 12945 -10255 -28006 -17742 -12276 -3531 27220
14088B7220q642j7883k9307m104K3010M515j560R610q229k752r584J3089M3027
$$ 27220 18578 695 -28612 -32716 -9706 -5191 -6751 2859 -5370 -8122 -17706 -4617 38410
14075C8410n574l504O50j7723J7640J0059J364N568Q19q931N333j3114j0884l21
$$ 38410 32836 29332 29982 12259 29899 39958 41322 46890 47709 38778 44111 30997 20113 19792
14061A9792j4456l3219k0424M0809N8666K4221j5800j514L352O734j4664j2060
$$ 19792 5336 -27883 -48307 -7498 51168 75389 59589 58075 61427 68161 53497 41437
14049D1437k0631j5368J1877p00K0150r82m1271p322o312J3055J9860j32q318
$$ 41437 20806 5438 17315 16615 36765 35783 -5488 -12810 -19122 -6067 13793 13661 5343
14036E343m728J3916l5338l1405K3296M3598P656k2626J0505K8819j5535k7080
$$ 5343 615 14531 -20807 -52212 -28916 14682 22338 -288 10217 39036 23501 -3579
14024c579l342n094j5774N93K0368L7238K2033k3582j8710J9295M834j1710j1954
$$ -3579 -6921 -12015 -27789 -27196 -6828 30410 52443 28861 10151 29446 34280 22570 10616
14011A0616k3836k5391K0386Q88L44J6751L0323j1057l172J92J5051P471L823
$$ 10616 -13220 -38611 -18225 -17337 -16993 -242 30081 19024 15852 16044 31095 38566 42389
13998D2389j3477j6891p531l0944p76q122K8211K3279k7247J1725K4695r815J3751
$$ 42389 28912 12021 4490 -26454 -27230 -35352 -7141 16138 -11109 616 25311 15496 29247
13985B9247r183o5080j0920J8495j0179m0237K2363N136J1015M259R155J435R763
$$ 29247 20064 -45016 -55936 -37441 -47620 -87857 -65494 -60358 -49343 -45084 -35929 -34494 -24731
13972b4731K1823l001J3576Q599m734J0374J824j624l0053O681p019n390J2067
$$ -24731 -2908 -5909 7667 16266 11532 21906 23730 22106 -7947 -1266 -8285 -13675 -1608
13959a608P361k0022j9295r819k371J9632J4696K7328L2156J4547N566p882m6254
$$ -1608 5753 -14269 -33564 -43383 -45754 -26122 -11426 15902 48058 62605 68171 60289 14035
13946A4035k3704nn149Q19k6756j6968L3403J8694j2706j620P978k4609o205p01
$$ 14035 -9669 -9674 -14823 -14004 -40760 -57728 -24325 -5631 -18337 -19957 -11979 -36588 -42793 -43494
13932d3494J445K929J0557R561K2086q748O648p406j3029L0372l780k0089j3765
$$ -43494 -42049 -39120 -28563 -19002 3084 -5664 984 -6422 -19451 10921 7141 -12948 -26713
13919b6713j6835J3420M136n530p348k391j4565K165J5479K8402J3770J0265L091
$$ -26713 -43548 -30128 -25992 -31522 -38870 -41261 -55826 -53661 -38182 -9780 3990 14255 17346
13906A7346L1212N632j7975j4675K3114J3794j8302k4583J5228J4461q261j9673
$$ 17346 48558 54190 36215 21540 44654 58448 40146 15563 30791 45252 36991 17318
13894A7318L250j4929j764n353k5265L742K0252j6697k3038j346J0131L0962K4690
$$ 17318 20568 5639 3875 -1478 -26743 -23001 -2749 -19446 -42484 -43830 -33699 -2737 21953
13881B1953K6148k4479m1737J972j1282L4619K2236k616J7109j2928j9650j5926
$$ 21953 48101 23622 -18115 -16143 -27425 7194 29430 26814 43923 30995 11345 -4581
13869d581k293L6100L0987M435m4972k2335l458j1206j2401J4623J402j2511r967
$$ -4581 -6874 29226 60213 64648 19676 -2659 -6117 -17323 -29724 -15101 -13699 -26210 -36177
13856c6177m981J9010J9623J8906Q272n659l4512m1253n502J9514J1509L5034
$$ -36177 -41158 -22148 -2525 16381 24653 18994 -15518 -56771 -62273 -42759 -31250 3784
13844C784k109l736J5089J755Q664j5996J0343j201j2266j8115J129L846K5021
$$ 3784 1675 -2061 13028 14783 23447 7451 17794 16593 4327 -13788 -12659 -8813 16208
13831A6208j0783j9273o47J3048J5904k7631J5816j172j5089J894K6049L373o854
$$ 16208 5425 -13848 -14495 -1447 14457 -13174 2642 1470 -13619 -11725 14324 17697 10843
13818A0843m0688j3740R533Q123J1253J7534k504j3267m2857Q6K2820J3451J8164
$$ 10843 -29845 -43585 -34052 -25929 -14676 2858 354 -12913 -55770 -55684 -32864 -19413 -1249
13805a249J1206J1537P621K4545j9255k3182J1133M17r029j6379q746L118J4555
$$ -1249 9957 21494 29115 53660 34405 11223 22356 22773 13744 -2635 -11381 -8263 6292
13792F292M817k4660o176k3800j7244K7774J4164J4940p617j9584j9504j5345
$$ 6292 11109 -13551 -19727 -43527 -60771 -32997 -18833 -3893 -11510 -31094 -50598 -65943
13780f5943l2717J7050K8834j5401N839K5262j818m675M661J2600j3498M915L1801
$$ -65943 -98660 -81610 -52776 -68177 -62338 -37076 -38894 -43569 -38908 -26308 -39806 -34891 -3090
13767c090q838J4734J9275M2749K2474j3265l8120m6404j4089K2497J5633J1032
$$ -3090 -11928 2806 22081 64830 87304 74039 35919 -10485 -24574 -2077 13556 24588
13755B4588K2293L003M047J5431J8245j1831k6804J231L248j7034j4454J4960
$$ 24588 46881 49884 53931 69362 87607 75776 48972 50203 53451 36417 21963 36923
13743C6923L4436j5810o4005j2422L598K2067J4589o943j0856N951j3229k8162
$$ 36923 71359 55549 -8456 -20878 -17280 4787 19376 12433 1577 7528 -5701 -33863
13731c3863J364K4463J4042L3103J3360p769j6389k8569k8733O240j0435N307
$$ -33863 -32499 -8036 6006 39109 52469 44700 28311 -258 -28991 -22751 -33186 -27879
13719b7879p140k2727J2851J3775n966K372p977p335P551M866L4638J1536K0801
$$ -27879 -35019 -57746 -44895 -31120 -37086 -34714 -42691 -50026 -42475 -37609 -2971 8565 29366
13706B9366j7835r994m600K5427p199J6220K693O275J332l990l77j0185k1889
$$ 29366 11531 1537 -3063 22364 15165 31385 34078 40353 41685 37695 37318 27133 5244
13693E244k450o747J4070j5437n010J9480J6801q846k6002N714M0889k134m4617
$$ 5244 2794 -3953 10117 -5320 -10330 9150 25951 17105 -8897 -3183 37706 35572 -9045
13680i045k2596j2291J1591K9449J9016j6924J2819J3639k3729j8754L4653J4146
$$ -9045 -31641 -43932 -32341 -2892 16124 -800 12019 25658 1929 -16825 17828 31974
13668C1974k223O307k458j235j5707m059k7223k2108M1811K1872k9846k0658L7979
$$ 31974 29751 36058 33600 32365 16658 12599 -14624 -36732 5079 26951 -2895 -23553 14426
13655A4426k1356l2446p471M35M097p203k439r600M742k5312j233j1798N1912
$$ 14426 -6930 -39376 -46847 -46412 -42315 -49518 -51957 -61557 -56815 -82127 -83360 -95158 -43246
13642d3246L7705k271K9214m023k7749M646P703k2214L623K8511o173p951J9246
$$ -43246 -5541 -7812 21402 17379 -10370 -5724 1979 -20235 -16612 11899 5726 -2225 17021
13629A7021L7084j4471j0182k1967k2364l186J7062l594N503N0876K5906Q711
$$ 17021 54105 39634 29452 7485 -14879 -18065 -1003 -4597 906 51782 77688 86399
13617H6399j2257J3789j349N29l084j6175O142j4703m7738q304L6215q154k9905
$$ 86399 74142 87931 86582 87111 84027 67852 73994 59291 11553 3249 39464 31310 1405
13604A405k742j8612k1995J5558J3495J0568J0017j7738j281K1379j6719O362
$$ 1405 -1337 -19949 -41944 -26386 -12891 -2323 7694 -10044 -11325 10054 -6665 -303
13592c03k8994J737O334J865K6056m432J9833J2244k1798j2302j001j3847r74
$$ -303 -29297 -27560 -21226 -19361 6695 2263 22096 34340 12542 240 -761 -14608 -15582
13579a5582j0711j5896r260L3868R992n215J922M667n461j0411k0373J5243j517
$$ -15582 -26293 -42189 -51449 -17581 -7589 -12804 -10882 -6215 -11676 -22087 -42460 -27217 -28734
13566b8734J7202N982J6655O999j7666j7097K5411j2712o762R884O428K2825L5791
$$ -28734 -11532 -5550 11105 18104 438 -16659 8752 -3960 -10722 -838 5590 28415 64206
13553F4206J2190r891j4795J7048j8800J0203j778l8082K2258O330l6483j7673
$$ 64206 76396 66505 51710 68758 49958 60161 58383 20301 42559 48889 12406 -5267
13541e267m682r256j3591k338k6457K9252J7348K3429J3117N564J0663j6526j9544
$$ -5267 -9949 -19205 -32796 -35134 -61591 -32339 -14991 8438 21555 27119 37782 21256 1712
13528A712J3313k1909K753J0425K0547n643j8977J2993K2146j7021l7813j828
$$ 1712 15025 -6884 -4131 6294 26841 21198 2221 15214 37360 20339 -17474 -19302
13516a9302m02P391L1794K8137l072l5058L992J6404j6597l2328J0506K936k0310
$$ -19302 -19704 -12313 19481 47618 44546 9488 13480 29884 13287 -19041 -8535 -5599 -25909
13503b5909K1342j3293O69J8817j521j5972N67O694K7502J0231k625j0744j2053
$$ -25909 -4567 -17860 -17191 1626 105 -15867 -15300 -8606 18896 29127 26502 15758 3705
13490C705k7511K0584M3877O463q23n737O41j2857j0392K449p279j5101j365q695
$$ 3705 -23806 -3222 40655 47118 46295 40558 41199 28342 17950 20399 13120 -1981 -3346 -12041
13476a2041J9405J0812J9306p954n3632k5774K2689K7178K2967k443J6700K5144
$$ -12041 7364 18176 37482 29528 -24104 -49878 -27189 -11 22956 20513 37213 62357
13464F2357Q89r911o448M698L1375o109j6124l056m038K0753K2800k2498j4873
$$ 62357 63246 53335 46887 51585 82960 76851 60727 57671 53633 74386 97186 74688 59815
13451E9815l5046j8184k6148o864O377k4885L427O985P0751M0748O668k3563m0535
$$ 59815 24769 6585 -19563 -26427 -20050 -44935 -41508 -34523 36228 76976 83644 60081 19546
13438A9546j0413K6730l859m8803M624o63L0550M547l7930J970j249M977J4804
$$ 19546 9133 35863 32004 -16799 -12175 -12838 17712 22259 -15671 -13701 -14950 -9973 4831
13425D831P791J4771K0197n612q98r459l1038l713J2046q433P982o195M379J670
$$ 4831 12622 27393 47590 41978 41080 31621 583 -3130 8916 483 8465 2270 6649 8319
13411H319J3765o826j2933J7832K1598q319l028j1846j1151Q944j95Q953R697
$$ 8319 22084 15258 2325 20157 41755 33436 30408 18562 7411 16355 16160 25113 34810
13398C4810k6447Q390q106l6106J071K4493N1282j4606l2970l134J3739K8763
$$ 34810 8363 16753 8647 -27459 -26388 -1895 49387 34781 1811 -1323 12416 41179
13386D1179K104k7047k2485j0104o90Q29L1419k909j7318q305J2836K4043m446
$$ 41179 43283 16236 -6249 -16353 -17043 -16214 15205 12296 -5022 -13327 -491 23552 19106
13373A9106p805L2588M482k4649q300k4609n757r520K455K4006N782K1328k080
$$ 19106 11301 43889 48371 23722 15422 -9187 -14944 -24464 -22009 1997 7779 29107 27027
13360B7027J8808k6812l8185j0545L7921J0637l3725J7118L775J2418M350j2264
$$ 27027 45835 19023 -19162 -29707 8214 18851 -14874 2244 6019 18437 22787 10523
13348A0523j1893K20L5803L3734l1611L026m823k5214J4019J2781K4445k5712
$$ 10523 -1370 -1150 34653 68387 36776 39802 34979 9765 23784 36565 61010 35298
13336C5298j6836J510K5476r262k3460J5942J1669m080j7033m1471k5980k0980
$$ 35298 18462 19972 45448 36186 12726 28668 40337 36257 19224 -22247 -48227 -69207
13324f9207J3405L1800L6305J4504P043Q567L74O823j8453o060J0429l341j6545
$$ -69207 -55802 -24002 12303 26807 33850 42417 42791 49614 31161 25101 35530 32189 15644
13311A5644k1787o749J4631j801Q813j0828j3805o344K620K8920M1646j3710j9562
$$ 15644 -6143 -12892 1739 -62 8751 -2077 -15882 -22226 -19606 9314 50960 37250 17688
13298A7688q389N45j3751j4604L0293L7456L0120O170m5316j0220p433M9k0200
$$ 17688 9299 9844 -3907 -18511 11782 49238 79358 85528 40212 29992 22559 22608 2408
13285B408k8391L827k0154j8313L3067L6317j335K2438K255l3231j1194q366J9977
$$ 2408 -25983 -22156 -42310 -60623 -27556 8761 7426 29864 32119 -1112 -12306 -20672 -695
13272f95M48J9903m20m549k2859j6910j5088K2120K7736j722J755N475j3998k1186
$$ -695 -247 19656 19236 14687 -8172 -25082 -40170 -18050 9686 7964 9719 15194 1196 -19990
13258a9990m40r342J8019j5375j4084L7330L9238J3687n960j9218O466j2151k1677
$$ -19990 -20430 -29772 -11753 -27128 -41212 -3882 35356 49043 43083 23865 30331 18180 -3497
13245c497k796l601r759k040j2125K7787j4714m912K24L2264J8260m678J1677
$$ -3497 -6293 -9894 -19653 -21693 -33818 -6031 -20745 -25657 -25433 6831 25091 20413 32090
13232C2090Q415L666p499j6509n2148R873l593J3984K131K406M1172J1942k1534
$$ 32090 40505 44171 36672 20163 -31985 -22112 -25705 -11721 -9590 -7184 33988 45930 24396
13219B4396l0345k5388L2323L5362O258m9741j0365J9668j035l573Q604K9590
$$ 24396 -5949 -31337 986 36348 42606 -7135 -17500 2168 1133 -2440 6164 35754
13207C5754J2254J8735k254J0958k1915k0700r48J9098Q388J3505m1591l5786
$$ 35754 48008 66743 64489 75447 53532 32832 31884 50982 59370 72875 31284 -4502
13195d502L3370J0174K0773O1008O9180K3333j7811r496n4165m0557j5032j0445
$$ -4502 28868 39042 59815 120823 190003 213336 195525 186029 131864 91307 76275 65830
13183F5830n5376m2027p498J1295J4496l461j3465L038n352N798J8621J2040q013
$$ 65830 10454 -31573 -39071 -27776 -13280 -16741 -30206 -27168 -32520 -26722 -8101 3939 -4074
13170d074J6733K5748K4113j5938q119p631O020m839L0793K1782k174k8855l8848
$$ -4074 12659 38407 62520 46582 38463 30832 36852 32013 62806 84588 82414 53559 14711
13157A4711J3175K0989j535l1215m290l6014l0797J2294L7739J1962K6993J1270
$$ 14711 27886 48875 47340 16125 11835 -24179 -54976 -42682 -4943 7019 34012 45282
13145D5282j4644l9597J480P301O416P587j6930k4430j4142J3138R438J3912K5352
$$ 45282 30638 -8959 -7479 -178 6238 13825 -3105 -27535 -41677 -28539 -19101 -5189 20163
13132B0163J4411L5226j9240l9851J821K1379K1189q290k3832k3981j5669P536
$$ 20163 34574 69800 50560 10709 12530 33909 55098 46808 22976 -1005 -16674 -9138
13120i138K5665J892L06R404R92K005O0607K9377k6830k4920j2048N0451q505
$$ -9138 16527 18419 18725 28129 29121 31126 91733 121110 94280 69360 57312 107763 99258
13107I9258m2938N344p529k0382r58j213r697q607O098J8907q720J7591l0246
$$ 99258 56320 61664 54135 33753 32795 31582 21885 13278 19376 38283 29563 47154 16908
13094A6908j9733j4804L0066K3660k4459k532j2230M671K6307J2827k4222m802
$$ 16908 -2825 -17629 12437 36097 11638 9106 -3124 1547 27854 40681 16459 11657
13082A1657K7116J340j2683m933K3910L8325N311o0218k7911j5180L3592M5496
$$ 11657 38773 40113 27430 22497 46407 84732 90043 29825 1914 -13266 20326 65822
13070F5822p061k8876J1604O75K1293P706j4751k7398k57o266k178j3296j5380
$$ 65822 58761 29885 41489 42164 63457 71163 56412 29014 28757 22491 20313 7017 -8363
13057h363n156l5807j5342K7840K2338j2085j1741q13J0106J5052K9041M7514
$$ -8363 -13519 -49326 -64668 -36828 -14490 -26575 -38316 -39129 -29023 -13971 15070 62584
13045F2584m695o1713j9773J1225J3327O565J7684q698N48K335k9210j698N476
$$ 62584 57889 -3824 -23597 -12372 955 7520 25204 16506 17054 19389 -9821 -11519 -6043
13032f043K2321k431J09J3576q004j5676J1730K0397N200K8512K3686L2906j568
$$ -6043 16278 13847 13956 27532 19528 3852 15582 35979 41179 69691 93377 126283 124715
13019A24715k6565p402j926l5242j2708L92N344R138l7875m3288j4404K9745K5402
$$ 124715 98150 90748 88822 53580 40872 41264 46608 55746 17871 -25417 -39821 -10076 15326
13006A5326K1941M47k9524J0526n500L0561r221l3195J6104K5344M960l75j9796
$$ 15326 37267 37714 8190 18716 13216 43777 34556 1361 17465 42809 47769 47394 27598
12993B7598r332J4321j9373q583L237m690J5203J6593n845n189k921k0270N089
$$ 27598 18266 32587 13214 4631 7868 3178 18381 34974 29129 23940 21019 749 5838
12980E838J3513L469J0219L847K7515K6854L620j8616m5511j526L8623M525o522
$$ 5838 19351 22820 33039 36886 64401 91255 94875 76259 30748 29222 67845 72370 65848
12967F5848J768J9936r97j8241R482L9230J0839p130j1322M7611K3642K7821M1523
$$ 65848 67616 87552 86555 68314 77796 117026 127865 120735 109413 157024 180666 208487 250010
12954B50010j2623r977O975q198m5219o91j3632j6563n2424l2687k0024K4237
$$ 250010 237387 227410 234385 226187 180968 180277 166645 150082 97658 64971 44947 69184
12942F9184N7271N7439M191l12n0781k3387j096L777N994K5778l637J7710J1510
$$ 69184 126455 183894 188085 187773 136992 113605 112509 116286 122280 148058 144421 162131 173641
12929A73641m944J7383K9012K4385J3786r190n468p770K5919j2341k9092j8035
$$ 173641 168697 186080 215092 239477 253263 244073 238605 230835 256754 244413 215321 197286
12917A97286L0103R017k7448j9947p962q146l9471k8717J9650J9608l778K7349
$$ 197286 227389 236406 208958 189011 181049 172903 133432 104715 124365 143973 140195 167544
12905A67544J9386P687j1852o753J891j1606k850K9717L7143j9848j6471q182
$$ 167544 186930 194617 182765 176012 177903 166297 163447 193164 230307 210459 193988 185806
12893A85806L2028L9734k0234k7517j0983k3128m0007l224m2090J717J6852R37
$$ 185806 217834 257568 237334 209817 198834 175706 135699 132475 90385 92102 108954 109891
12881A09891j9344o419j050k1400j1616Q987N627K0841j9875l6205L209J3303
$$ 109891 90547 84128 83078 61678 50062 59049 64676 85517 65642 29437 32646 45949
12869D5949j3174N56l5249m245J6469O439o66M404k6282j0875J2865J1099K3002
$$ 45949 32775 33331 -1918 -6163 10306 16745 16079 20483 -5799 -16674 -3809 7290 30292
12856C0292j289k9641J2762L371k8520l5947k559K2298M4931q244M94k1949j489
$$ 30292 29003 -638 12124 15495 -13025 -48972 -51531 -29233 15698 7454 7948 -14001 -15490
12843a5490K772J0880L5927o346o189K8989L1339l6250l3296L8102N269J3284
$$ -15490 -12718 -1838 34089 27743 21554 50543 81882 45632 12336 50438 55707 68991
12831F8991K3403K4138R956k8326k9216l012k6455k693k875K4053O200K936r79
$$ 68991 92394 116532 126488 98162 68946 65934 39479 36786 33911 57964 64164 67100 66121
12818F6121j6643J5113l682l3795M091l1228n99L1104j8184j4021j4415m536L0544
$$ 66121 49478 64591 60909 27114 31205 -23 -622 30482 12298 -1723 -16138 -20674 9870
12805I870K4605J7087J0705K4177j4750k5368l757l406Q39K1498K6439J24k3651
$$ 9870 34475 51562 62267 86444 71694 46326 42569 39163 40002 61500 87939 88063 64412
12792F4412p769P351K1774J3612k1105q543L2522j5046N928m292k6009K0734p469
$$ 64412 56643 63994 85768 99380 78275 69732 102254 87208 93136 88844 62835 83569 76100
12779G6100m5158j4524J9061K0254J3975j1482j1573L28j9417k566L6488K1632
$$ 76100 30942 16418 35479 55733 69708 58226 46653 46981 27564 24998 61486 83118
12767H3118j6997N030K9892R584o438j4505k946j311j6220M168j8006Q697J1250
$$ 83118 66121 71151 101043 110627 104189 89684 86738 85427 69207 73375 55369 64066 75316
12754G5316q256J6195K2335j3787j1682p700j1804R962o247k687K8954L115j4031
$$ 75316 67060 83255 105590 91803 80121 72421 60617 70579 64332 61645 90599 93714 79683
12741G9683q83q891M2366j4330j7890n132J8124L7657j639p803K536K9047N322
$$ 79683 78800 69909 112275 97945 80055 74923 93047 130704 129065 121262 123798 152845 158167
12728A58167J329L2514k008k9964k8014r465l843J4165j3326j8453j6915r842
$$ 158167 159496 192010 190002 160038 132024 122559 118716 132881 119555 101102 84187 74345
12716G4345j4764J7830K9067j7524j1804M6197L644k7180r573J71j8641p006K1247
$$ 74345 59581 77411 106478 88954 77150 123347 126991 99811 90238 90409 71768 64762 86009
12703H6009j1301j4011o270j111L3327K0620N793K86k5503m2036P206m839J6661
$$ 86009 74708 60697 54427 53316 86643 107263 113056 113342 87839 45803 53009 48170 64831
12690F4831J4658j9733J4144P506j623L820j1759J368j321K5002L6868L90j409
$$ 64831 79489 59756 73900 81406 79783 83603 71844 73212 71891 96893 133761 134151 132742
12677A32742l7735m415M494L274R273k5876k3144k2894j193Q435J2239k8411l358
$$ 132742 95007 90592 95086 98360 107633 81757 58613 35719 34526 42961 55200 26789 23431
12664B3431J3653M335Q176K4897K3484J268k590J2516M198P121k580K135k5280
$$ 23431 37084 41419 49595 74492 97976 99244 96654 109170 113368 120489 117909 120044 94764
12651I4764n323m649N679J5776K2034j7484l0089o008N1646M4021Q069q263j982
$$ 94764 89441 84792 90471 106247 128281 110797 80708 74700 126346 170367 178436 170173 168191
12638A68191L828J1979m2242k8879L7428P1327J2753j4024j9010r86r022l2023
$$ 168191 172019 183998 141756 112877 150305 221632 234385 220361 201351 200365 191343 159320
12626A59320j3432J0207R584K5209J7706L65K590p869K3774O487J5545J4383J6680
$$ 159320 145888 156095 165679 190888 208594 208959 211549 203680 227454 233941 249486 263869 280549
12613B80549m940o778j4144m739K2871J9291l0785j3562L6022K7725K1973L4216
$$ 280549 275609 268831 254687 249948 272819 292110 261325 247763 283785 311510 333483 367699
12601C67699j2445K0537K201o073r645J0169j8683l7073L171j6428L2324M4608
$$ 367699 355254 375791 377992 371919 362274 372443 353760 316687 319858 303430 335754 380362
12589C80362R634n899n0968j8774j0123K1537K9347M8971N9770N360j2111j9603
$$ 380362 389996 384097 333129 314355 304232 325769 355116 404087 463857 469217 457106 437503
12577D37503L441O641L591K5128M3915N0464K6349M141K1438K0701L2723L5512
$$ 437503 440944 447585 451176 476304 520219 570683 597032 601173 622611 643312 676035 711547
12565G11547N1964O7945M4881J5731J9648l3351k3718j823j8186p882n758l3234
$$ 711547 763511 831456 876337 892068 911716 878365 854647 852824 834638 826756 820998 787764
12553G87764k6842K4719K0467J0347J6640K975j6502M1124P4905L6200J8265L2466
$$ 787764 760922 785641 806108 816455 833095 836070 819568 860692 935597 971797 990062 1022528
12541A022528P2161N2866K4496M2566L8133O3896P5566O0396Q5961Q4297R8307
$$ 1022528 1094689 1147555 1172051 1214617 1252750 1316646 1392212 1452608 1538569 1622866 1721173
12530A721173J14701J26505J52743J34040J47736J72680K09050K30437K78300
$$ 1721173 1835874 1962379 2115122 2249162 2396898 2569578 2778628 3009065 3287365
12521C287365L37428L79991M52185M93621O01930P56801R27634J154418J464062
$$ 3287365 3624793 4004784 4456969 4950590 5552520 6309321 7236955 8391373 9855435
12512I855435J877862K370447K944274L615127M236359M536995M144425L108059
$$ 9855435 11733297 14103744 17048018 20663145 24899504 29436499 33580924 36688983
12504C6688983J452332m61988k140347l157986l429410l192223k694786k102601
$$ 36688983 38141315 37679327 35538980 32380994 28951584 25759361 23064575 20961974
12496B0961974j523458r95442n13429j20677K59243N89139Q91262J159875J412955
$$ 20961974 19438516 18443074 17929645 17808968 18068211 18657350 19548612 20708487 22121442
12487B2121442J640452J792967J919376K045577K144668K183402K211807K141966
$$ 22121442 23761894 25554861 27474237 29519814 31664482 33847884 36059691 38201657
12479C8201657J997876J748539J398398R50229M78926k6475m77782r17222j319207
$$ 38201657 40199533 41948072 43346470 44296699 44775625 44749150 44271368 43354146 42034939
12470D2034939j581900j815653j949021k007730j944469j914678j873788j829578
$$ 42034939 40453039 38637386 36688365 34680635 32736166 30821488 28947700 27118122
12462B7118122j665319j468373j315907j171367r37322o32621l11490l5259L45974
$$ 27118122 25452803 23984430 22668523 21497156 20559834 19927213 19615723 19580464 19926438
12453A9926438Q44654J395359J947201K620121L219579L502332L382297K571203
$$ 19926438 20771092 22166451 24113652 26733773 29953352 33455684 36837981 39409184
12445C9409184J095665p17871k441774l682953m229606m194182l796302l264741
$$ 39409184 40504849 39786978 37345204 33662251 29432645 25238463 21442161 18177420
12437A8177420k663768k146926j726421j377379j133057r35294p71359o50042
$$ 18177420 15513652 13366726 11640305 10262926 9129869 8194575 7423216 6773174
12429F773174n46689m69480m19518l60209l48037l22230l08075k16415k37059
$$ 6773174 6226485 5757005 5337487 4977278 4629241 4307011 3998936 3782521 3545462
12420C545462k32294j89756j57588j53770j63793j34668q3312r4775p2267p0053
$$ 3545462 3313168 3123412 2965824 2812054 2648261 2513593 2430281 2335506 2263239 2193186
12410B193186j08732q8916p1547q2591n2904m0531o0106n854l4200n7349n7515
$$ 2193186 2084454 1995538 1923991 1841400 1788496 1747965 1687859 1682005 1647805 1590456 1532941
12399A532941o0470k5288n3232m1618l2943k6480k2495n5234m1628m7569n1852
$$ 1532941 1472471 1447183 1393951 1352333 1319390 1292910 1270415 1215181 1173553 1125984 1074132
12388A074132l7091k7224q585P75M377j3987m7828j4657p872p862l8871m9521
$$ 1074132 1037041 1009817 1001232 1002007 1006384 992397 944569 929912 922040 914178 875307 825786
12376H25786l3384l4845n9484j2053j4286l631k794j2900m254j7314k5979J7523
$$ 825786 792402 757557 698073 686020 671734 668103 665309 652409 648155 630841 604862 622385
12364F22385j6501k1439j8932k3358j0969k5891j7266M304J4505o925j3095J4999
$$ 622385 605884 584445 565513 542155 531186 505295 488029 492333 506838 499913 486818 501817
12352E01817M786k1036j6659P93k009j9516k2138j3222M208l4737l87K0676k0139
$$ 501817 506603 485567 468908 469701 467692 448176 426038 412816 417024 382287 381900 402576 382437
12339C82437j481Q980j624k9283k1538j1652J793J6485k720j1643k4742L3515
$$ 382437 380956 389936 388312 359029 337491 325839 327632 344117 341397 329754 305012 338527
12327C38527K122J298k7325j4781O051k5862K511j015k2694K1061K7509j5801
$$ 338527 340649 341947 314622 299841 305892 280030 282541 281526 258832 279893 307402 291601
12315B91601j6206m578j9473m993J230N154L4179l016l3623k3116l3202l331J2335
$$ 291601 275395 270817 251344 246351 247581 252735 286914 283898 250275 227159 193957 190626 202961
12302B02961k101m78K4625r796p123L766j2010m166J7694J9416L747j7339k6784
$$ 202961 200860 200382 225007 215211 208088 211854 199844 195678 213372 232788 236535 219196 192412
12289A92412j5286q367L536J0412K3052J678O97p558n232o596K4684p203J8838
$$ 192412 177126 168759 172295 182707 205759 207437 208134 200576 195344 188748 213432 206229 225067
12276B25067k586q738j2204R655K5280M2085J3539q053l5344j0872O379J5180
$$ 225067 222481 213743 201539 211194 236474 278559 292098 284045 248701 237829 244208 259388
12264B59388j9338l2144j4706J3354J1360j5708L33L91o338J4782O12K5113L4064
$$ 259388 240050 207906 193200 206554 217914 202206 202539 202930 196592 211374 211986 237099 271163
12251B71163J2800q210o7007l7949J2965O801R074K9716k0386m830P780j397q460
$$ 271163 283963 275753 208746 170797 183762 190563 199637 229353 208967 204137 211917 210520 202060
12238B02060k1224R696L8645L461o762O784J4908L6181Q831k5442j2774K5995
$$ 202060 180836 190532 229177 232638 225876 232660 247568 283749 292580 267138 254364 280359
12226B80359K5923l254p236K913j5466K3463J6055J0534J3025J7715K645K0588
$$ 280359 306282 303028 295792 298705 283239 306702 322757 333291 346316 364031 366676 387264
12214C87264j87J474L7620J4215M349K5588O093l6154Q904K1435N283j0605P079
$$ 387264 387077 388551 426171 440386 444735 470323 476416 440262 449166 470601 475884 465279 472358
12201D72358M78J6299M5796J103L9016M5537j7339j1651K9788L7768K5493J326
$$ 472358 472836 489135 534931 536034 575050 620587 603248 591597 621385 659153 684646 685972
12189F85972Q356K7017L6341M2263J8751M6479P7441Q7040M7813P4781Q2214O0744
$$ 685972 694328 721345 757686 799949 818700 865179 942620 1029660 1077473 1152254 1234468 1295212
12177A295212J06659J26769J18410J10851J41513J97725K04051J65436K51059
$$ 1295212 1401871 1528640 1647050 1757901 1899414 2097139 2301190 2466626 2717685
12168B717685L33308L86866M52406N16992N95886O41277P28237Q09864R14052
$$ 2717685 3050993 3437859 3890265 4407257 5003143 5644420 6372657 7182521 8096573
12159H096573J090620J354149J743929K372804L235160M324607N587795O765373
$$ 8096573 9187193 10541342 12285271 14658075 17893235 22217842 27805637 34571010
12151C4571010P750454Q199222P912749O807870M924744K377218m88205l257142
$$ 34571010 42321464 50520686 58433435 65241305 70166049 72543267 72055062 68797920
12143F8797920n564653p160579p915498p836026p182781o103957m882609l733072
$$ 68797920 63233267 56072688 48157190 40321164 33138383 27034426 22151817 18418745
12135A8418745k786674k080716j562008j220720j019916q61974p81629p11216
$$ 18418745 15632071 13551355 11989347 10768627 9748711 8886737 8105108 7393892
12127G393892o86971o42492n57792n41069m78052m12928l14129k74819k35420
$$ 7393892 6706921 6064429 5506637 4965568 4487516 4074588 3760459 3485640 3250220
12118C250220k21790j93596j70763j44112j22690j00547j17469j21647r9059q8759
$$ 3250220 3028430 2834834 2664071 2519959 2397269 2296722 2179253 2057606 1958547 1869788
12108A869788j15132r4943n2458l5494n3869n8834j4774k904r494m7999m5633
$$ 1869788 1754656 1659713 1607255 1571761 1517892 1459058 1444284 1441380 1431886 1383887 1338254
12097A338254n7566l7984m8729q9745n5711k0081m3270l9226j2561l5664l4859
$$ 1338254 1280688 1242704 1193975 1104230 1048519 1028438 985168 945942 933381 897717 862858
12086H62858N265l0543n6541m2900m0292q8905j4417J7902R382j2059k4560k3075
$$ 862858 868123 837580 781039 738139 697847 608942 594525 612427 621809 609750 585190 562115
12074E62115k3136p524j3648L001K928k8267Q022k6171n2187q646L9577k6079
$$ 562115 538979 531455 517807 520808 523736 495469 503491 477320 425133 416487 456064 429985
12062D29985r954j4869J4803L7590J2475k1534Q737j5656k3231J6398J4489k2025
$$ 429985 420031 405162 419965 457555 470030 448496 457233 441577 418346 434744 449233 427208
12050D27208j7954N1716N394j8072k3920k771N652l7233l7836j8227q040P564
$$ 427208 409254 460970 466364 448292 424372 421601 427253 390020 352184 333957 325917 333481
12038C33481Q477j4595J5724K3j1476j967j2393j2223J7719k1497m948J8699L3449
$$ 333481 341958 327363 343087 343110 331634 329667 317274 305051 322770 301273 296325 315024 348473
12025C48473L3412K5022j6952J1702K5806R410J230j2130l656j0165m5262m9183
$$ 348473 381885 406907 389955 401657 427463 436873 438103 425973 422317 412152 366890 317707
12013C17707j3024m4416L026L7047q281k8511N961l568J760P835k0308k2356K570
$$ 317707 304683 260267 263293 300340 292059 263548 269509 265941 267701 275536 255228 232872 235442
12000B35442o74j7641L817L872j3143j514J8129K7110J2500j5113J8740K1893
$$ 235442 234768 217127 220944 224816 211673 210159 228288 255398 267898 252785 271525 293418
11988B93418j5755j6765j4206M166J1783k5071r603k7307k3048j12l8769j4760
$$ 293418 277663 260898 246692 250858 262641 237570 227967 200660 177612 177500 138731 123971
11976A23971J7827m345l3920l6563O97N5128L3846l4615j4141j2565O031Q060
$$ 123971 141798 137453 103533 66970 67667 122795 156641 122026 107885 95320 101351 109411
11964A09411l764J0677J7345j2458q155l719K1336j495j3738m7730p003J8635
$$ 109411 105647 116324 133669 121211 113056 109337 130673 129178 115440 67710 60707 79342
11952G9342p892k7899J0945K472J2756l0921j2484l8071J9988L202j2996o953
$$ 79342 71450 43551 54496 56968 69724 38803 26319 -11752 8236 11438 -1558 -8511
11940h511m094J180J3770P976j107j2599j5208J6842R952L9415N0441j8469l1828
$$ -8511 -12605 -11425 2345 10321 9214 -3385 -18593 -1751 8201 47616 98057 79588 47760
11927D7760j0283k7402j2850m028k2027Q133J1366J2990L8657L0828p0l7223q512
$$ 47760 37477 10075 -2775 -6803 -28830 -20697 -9331 3659 42316 73144 73074 35851 27339
11914B7339J6275n760R541o741k6301k1414J7199J6650K5778k7544k5958k771
$$ 27339 43614 37854 47395 40654 14353 -7061 10138 26788 52566 25022 -936 -3707
11902c707k8771N618j5076j459M2209K0340K695p129j2814P205M0197P169p880
$$ -3707 -32478 -26860 -41936 -43395 -1186 19154 21849 14720 1906 9111 49308 56477 48597
11889D8597J8737J4850J878M525j1650K4848j6449j0222Q907n840p031m3252m4346
$$ 48597 67334 82184 84062 88587 76937 101785 85336 75114 84021 78181 71150 27898 -16448
11876a6448K4954K8575k1232M624O100r308l3331k2046M2017L0189L662j0328
$$ -16448 8506 37081 15849 20473 26573 17265 -16066 -38112 3905 34094 37756 27428
11864B7428l46j7209l3834j5508J5924K2548J3843L2216J9645r344k3917k3519
$$ 27428 27082 9873 -23961 -39469 -23545 -997 12846 45062 64707 55363 31446 7927
11852G927j6755J3902j824J7743J5909j4489o2548k4086K5864J8778J4122R382
$$ 7927 -8828 5074 3250 20993 36902 22413 -40135 -64221 -38357 -19579 -5457 3925
11840C925J6169j1822K1012J1808j8629j2087N934K0078j8208l3359j754J0668
$$ 3925 20094 8272 29284 41092 22463 10376 16310 36388 18180 -15179 -16933 -6265
11828f265M318j8104p696M748j2817j2444J8572J6503M899J3151J839R811K029
$$ -6265 -1947 -20051 -27747 -22999 -35816 -48260 -29688 -13185 -8286 4865 6704 16515 18544
11815A8544j769l3167j6029j025N9715L2504k8330l2568l3960p143J3665K9303
$$ 18544 16775 -16392 -32421 -33446 26269 58773 30443 -2125 -36085 -43228 -29563 -260
11803b60k883k7865j4365K1104K1722m037N730M350P233K4718j4348r392j5419
$$ -260 -3143 -31008 -45373 -24269 -2547 -6584 -854 3496 10729 35447 21099 11707 -3712
11790c712J4185K8280J1900Q482j210k0342j7195k4737l065J4339J4697j1520
$$ -3712 10473 38753 50653 59135 57925 37583 20388 -4349 -7414 6925 21622 10102
11778A0102Q698J1034j3642J3302n766j7803j9365q114M426K1173J05J3989j6861
$$ 10102 18800 29834 16192 29494 23728 5925 -13440 -21554 -17128 4045 4150 18139 1278
11765A278J4737m669k317J4225K2797R420J1866k497k6493l2830j4555J5101J8092
$$ 1278 16015 11346 9029 23254 46051 55471 67337 64840 38347 5517 -9038 6063 24155
11752B4155j5163j1175J0204L570l2586K2214K1714J1698O542O228m892j721J668
$$ 24155 8992 -2183 8021 11591 -20995 1219 22933 34631 41173 47401 42509 40788 42456
11739D2456k211J0738N154l3262R190R963K4351K3556M7956M5118Q2764K4109
$$ 42456 40245 50983 56137 22875 32065 42028 66379 89935 137891 183009 265773 289882
11727B89882M88l169J2806J2658M0406M9763l704o8945m3462l3393l9649n5814
$$ 289882 290370 287201 300007 312665 353071 402834 399130 330185 286723 253330 213681 157867
11715A57867m5314j7252k1901j1694o843j0505j1904j6762k867J4794J4278j8748
$$ 157867 112553 95301 73400 61706 54863 44358 32454 15692 12825 27619 41897 23149
11703B3149k3319m194L642N330j2949Q81j1628j6214M9103L8027l4899l565j811
$$ 23149 -170 -4364 -722 4608 -8341 -7460 -19088 -35302 13801 51828 16929 13364 11553
11690A1553m621j0984n48k175l6110R119K9366K5732j1757Q856p195j578K694
$$ 11553 6932 -4052 -4600 -6775 -42885 -33766 -4400 21332 9575 18431 11236 9658 12352
11677A2352P11j8990J9305J7023j0510j364k8549j1023K7673J6484J2502R547
$$ 12352 13063 -5927 13378 30401 19891 18527 -10022 -21045 6628 23112 35614 45161
11665D5161k1098K9327L0440n0604l4851j3013k4913k052J643J7668j248J3471
$$ 45161 24063 53390 83830 33226 -1625 -14638 -39551 -41603 -39960 -22292 -23540 -10069
11653a0069J2555k8592m2930J6319K6824J4078j5634l0358j011K174P529j2991
$$ -10069 2486 -26106 -69036 -52717 -25893 -11815 -27449 -57807 -58818 -56644 -49115 -62106
11641f2106J2668L2448p62K542J5505j4608M391J0264M556R611j0281O206K9176
$$ -62106 -49438 -16990 -17752 -15210 295 -14313 -9922 342 4898 14509 4228 10434 39610
11628C9610j2314k8492n58P951m63n522R404L3012P404j7616L454l8100k0207
$$ 39610 27296 -1196 -1754 6197 5734 212 9616 42628 50032 32416 35870 -2230 -22437
11615b2437P098L1472N797k3271k1956k62L699J3977k846k0131n951K1837J6922
$$ -22437 -15339 16133 21930 -1341 -23297 -23559 -19860 -5883 -8729 -28860 -34811 -12974 3948
11602C948l458r257k3613j9041L880q44J6913Q135k982q84j7125Q770K8725J6455
$$ 3948 490 -8767 -32380 -51421 -47541 -48385 -31472 -23337 -26319 -27203 -44328 -35558 -6833 9622
11588I622j3075k3556L0138J6287r590k1623n703j0363J628R643K0867n576j1671
$$ 9622 -3453 -27009 3129 19416 9826 -11797 -17500 -27863 -26235 -16592 4275 -1301 -12972
11575a2972n137J3385K1637O461j1635j0472j5018j054K1319K288j0769o084n77
$$ -12972 -18109 -4724 16913 23374 11739 1267 -13751 -14805 6514 8802 -1967 -8051 -8628
11562h628J7753j0814k1426J4386J1583k3280J0683J3727j3527j268q590P449
$$ -8628 9125 -1689 -23115 -8729 2854 -20426 -9743 3984 -9543 -10811 -19401 -11952
11550a1952K0884j6668q687K7350K1408p715l8010k4478R882k9163j2678M3788
$$ -11952 8932 -7736 -16423 10927 32335 24620 -13390 -37868 -27986 -57149 -69827 -26039
11538b6039L3853l4718J5120J8847J419J1838j7373k617o718J8130L7407L199
$$ -26039 7814 -26904 -11784 7063 8482 20320 2947 330 -6388 11742 49149 52348
11526E2348k0806m178n422M807K4058J2834k4524j6688j4576J0033l487l6533
$$ 52348 31542 27364 21942 26749 50807 63641 39117 22429 7853 17886 14399 -22134
11514b2134J1410K1822J2962k2811j3801q242q676L6445J4544L552r673j4614
$$ -22134 -10724 11098 24060 1249 -12552 -20794 -29470 6975 21519 25071 15398 784
11502G84J8103p446j1083k2437K276L4782j2307J1123L164m2557K24K9517q063
$$ 784 18887 11441 358 -22079 -19803 14979 2672 13795 16959 -25598 -25374 4143 -3920
11489c920K2765J4420Q709k5036k2677j3855J1256j1080k8514j2261L9033O5963
$$ -3920 18845 33265 41974 16938 -5739 -19594 -8338 -19418 -47932 -60193 -21160 44803
11477D4803J3671o450j0061j9789m2433k2921K5648O968K4186K6154m3100l541
$$ 44803 58474 52024 41963 22174 -20259 -43180 -17532 -10564 13622 39776 -3324 -6865
11465f865N233k2122n842J3247k574q328N614J1283j0007q729J0860J2699J7217
$$ -6865 -1632 -23754 -29596 -16349 -18923 -27251 -21637 -10354 -20361 -29090 -18230 -5531 11686
11452A1686L4058j7222o704n623k6343R651J6793J6874k1865j582L6360Q500K383
$$ 11686 45744 28522 21818 16195 -10148 -497 16296 33170 11305 9723 46083 54583 56966
11439E6966J8022r420k9022l4265L204j7802M950M2876j3212k2017j9069P098
$$ 56966 74988 65568 36546 2281 5485 -12317 -7367 35509 22297 280 -18789 -11691
11427a1691J6368l333K611K0872K4498L8046n52j3286o45j3207k8569k31M217
$$ -11691 4677 1344 3955 24827 49325 87371 86819 73533 72888 59681 31112 30881 35098
11414C5098j0261l302r514j6354r023k433M1960J5029j6236j8589k9412m235J5668
$$ 35098 24837 21535 12021 -4333 -13356 -15789 26171 41200 24964 6375 -23037 -27272 -11604
11401a1604Q959j2927R730K9226J6331R241j2716j7594k268j5407j3138J0080
$$ -11604 -2645 -15572 -5842 23384 39715 48956 36240 18646 16378 971 -12167 -2087
11389b087p39K15J0583K4969N177j0802J3464l1008l5451J4519J3131j7410l857
$$ -2087 -2826 -2611 7972 32941 38118 27316 40780 9772 -25679 -11160 1971 -15439 -19296
11376a9296L572j8798K1357M4402J0448J4021j2217l0289k3360j8276j3108J1591
$$ -19296 -15724 -34522 -13165 31237 41685 55706 43489 13200 -10160 -28436 -41544 -29953
11364b9953K6488J3219j1914j5272r233R242N02k1409n01J2294J6618J0999j8282
$$ -29953 -3465 9754 -2160 -17432 -26665 -17423 -16921 -38330 -38831 -26537 -9919 1080 -17202
11351a7202j99J5035k9133j4686K6178K8228o245l5092J808O1220l1852m5020
$$ -17202 -17401 -2366 -31499 -46185 -20007 8221 1976 -33116 -31308 29912 -1940 -46960
11339d6960r824P634R606J9480O929M581L0555p790k3528N185K2248n636r543
$$ -46960 -56784 -49150 -39544 -20064 -13135 -8554 22001 14211 -9317 -4132 18116 12480 2937
11326B937K2649P335J0648L0793P68J2546N602k1996k2670l6648j3407j2299K6765
$$ 2937 25586 32921 43569 74362 75130 87676 93278 71282 48612 11964 -1443 -13742 13023
11313A3023J8241j1994j9473j2542j8104J4274n649j2820J79l0314J0549K3139
$$ 13023 31264 19270 -203 -12745 -30849 -16575 -22224 -35044 -34865 -65179 -54630 -31491
11301c1491K5835K2265j8386J0091r091j4915N469J130j3674j518J606J6943N7483
$$ -31491 -5656 16609 -1777 8314 -777 -15692 -10223 -9093 -22767 -24285 -22679 -5736 51747
11288E1747l927j8882J1612M146l896K16j1920k8724j7003j9385J5491L1653K7944
$$ 51747 47820 28938 40550 44696 40800 41016 29096 372 -16631 -36016 -20525 11128 39072
11275C9072j93j9115p402p65j1414j7640j5105O609P546J7728K1391l7898n473
$$ 39072 38879 19764 12362 11597 183 -17457 -32562 -25953 -18407 -679 20712 -17186 -22659
11262b2659L513k2538j4432L5368J3359l8627J6184L6562J3116k8817k3555K081
$$ -22659 -19146 -41684 -56116 -20748 -7389 -46016 -29832 6730 19846 -8971 -32526 -30445
11250c0445J2432j1982o568K5556L360J7315J2415P335J9175k0782J318N815o585
$$ -30445 -18013 -29995 -36563 -11007 -7647 9668 22083 29418 48593 27811 29129 34944 28359
11237B8359j2403p809j6257J6486M563j3621K1746J4138r724J580P180K1383J2121
$$ 28359 15956 8147 -8110 8376 12939 -682 21064 35202 25478 27058 34238 55621 67742
11224F7742N280l284k3410l8684n1128l43K8605L7740O921k7721N524k6662k9399
$$ 67742 73022 69738 46328 7644 -43484 -43827 -15222 22518 29439 1718 7242 -19420 -48819
11211d8819L0518L3103J0140k9855j6653n96J2077L47K7938k928j2823q150J0707
$$ -48819 -18301 14802 24942 -4913 -21566 -22162 -10085 -9738 18200 15272 2449 -5701 5006
11198E006J2461J2323J1180P138m441o584n9328l5576N885m319k465J518O920
$$ 5006 17467 29790 40970 48108 43667 37083 -22245 -57821 -51936 -56255 -58720 -57202 -50282
11185e0282J612L1492K1856J2894q608j1052j7220j1927l1075o131J5605J8649
$$ -50282 -48670 -17178 4678 17572 8964 -2088 -19308 -31235 -62310 -68441 -52836 -34187
11173c4187K7977J8015j0397J8665K222M913l077j7796N1l447M268j8744l951
$$ -34187 -6210 11805 1408 20073 22295 27208 24131 6335 6386 2939 7207 -11537 -15488
11160a5488L2702k4152j9903N864L4774J2618p392o409j2586j2430L9002L7837
$$ -15488 17214 -6938 -26841 -20977 13797 26415 19023 12614 28 -12402 26600 64437
11148F4437p252j8013j0645j3160k062k5578q57Q942q466K4080O000j1417j1495
$$ 64437 57185 39172 28527 15367 13305 -12273 -13130 -4188 -12654 11426 17426 6009 -5486
11135e486m378l0758J9802L8984J8091J3337K861k1690m5175K6923K1955j5115
$$ -5486 -9864 -40622 -20820 18164 36255 49592 52453 30763 -14412 12511 34466 19351
11123A9351L549K2086j2073j0800o673k9930L7562L1323l1373q094k1159l1650
$$ 19351 22900 44986 32913 22113 15440 -14490 23072 54395 23022 14928 -6231 -37881
11111c7881K6715K3032l724o437K5745R523j0351J773O780j2553L313j927O891
$$ -37881 -11166 11866 8142 1705 27450 36973 26622 28395 35175 22622 25935 24008 30899
11098C0899m8418L275N241J7014K5197j1921p821j7596L922J7066J2547l2862
$$ 30899 -17519 -14244 -9003 8011 33208 21287 13466 -4130 -208 16858 29405 -3457
11086c457m7270q160O915K6476O023J550J4746L0190L0243l325l569j3384j1031
$$ -3457 -50727 -58887 -51972 -25496 -19473 -17923 -3177 27013 57256 53931 50362 36978 25947
11073B5947l0989M2688L183n424K1471R071l0798j4941l0470M781k5929j3614
$$ 25947 -5042 37646 40829 35405 56876 65947 35149 20208 -10262 -5481 -31410 -45024
11061d5024R945M5858K7961p880l9790r78L5206J4299M327k1977L411K1746k5872
$$ -45024 -35079 10779 38740 30860 -8930 -9908 25298 39597 43924 21947 25358 47104 21232
11048B1232l3503K3539K7123j3293j9838j2891k2438K4141Q909j5230j9980J7689
$$ 21232 -12271 11268 38391 25098 5260 -7631 -30069 -5928 2981 -12249 -32229 -14540
11036a4540o86J2827L679R247q835k1477M205N751L880K7150P021o254j9949j8331
$$ -14540 -15226 -2399 1280 10527 1692 -19785 -15580 -9829 -5949 21201 28222 21968 2019 -16312
11022a6312K0187L555J9288r698j9655K105L0646J5494j683K4030O465m5479n2951
$$ -16312 3875 7430 26718 17020 -2635 -530 30116 45610 43927 67957 74422 28943 -24008
11009b4008K0359M781J3870N808r681J8240O457k1671K4948K8118O976m2437j6102
$$ -24008 -3649 1132 15002 20810 11129 29369 35826 14155 39103 67221 74197 31760 15658
10996A5658m6819L214P986k645P436L579k1729M638K9507J8303K0047J552m6426
$$ 15658 -31161 -27947 -19961 -22606 -15170 -11591 -33320 -28682 825 19128 39175 40727 -5699
10983e699k8100J5482J1135K207K6477J046J0696J0858k7981L687N628k2985J6078
$$ -5699 -33799 -18317 -7182 -4975 21502 22548 33244 44102 16121 19808 25436 2451 18529
10970A8529k3342k7257l74L3745J7605J0741J2276q629j8232L342O868m171j6640
$$ 18529 -4813 -32070 -32444 1301 18906 29647 41923 33294 15062 18404 25272 21101 4461
10957D461K8022J1775j1609n617J8650q292k3371L271J1422Q792m110j2496K2949
$$ 4461 32483 44258 32649 27032 45682 37390 14019 17290 28712 37504 33394 20898 43847
10944D3847k1578j9358J1915K5958N446r845J0091j047L334L7322M942M19M077
$$ 43847 22269 2911 14826 40784 46230 36385 46476 45429 48763 86085 91027 91446 95523
10931I5523j9098k7631J1619o475J8372L2195R939J0392K3094J8940l4359J9520
$$ 95523 76425 48794 60413 53938 72310 104505 114444 124836 147930 166870 132511 152031
10919A52031m70j6614J6188O852K030n105N954J1051L852j4582k1095j4321J9991
$$ 152031 151561 134947 151135 157987 160017 154912 160866 171917 175769 161187 140092 125771 145762
10906A45762J1613r732j3718J5671J2612J1207O732L1908L339n599j5397Q39K3598
$$ 145762 157375 147643 133925 149596 162208 173415 180147 212055 215394 209795 194398 195237 218835
10893B18835L3908P858j7831k8448l2220M886K8473Q674q234m6916l2099n420
$$ 218835 252743 260601 242770 214322 182102 186988 215461 224135 215901 168985 136886 131466
10881A31466R170M9830J0921q008j3517j4854l270K2026m599p051j5828j1623
$$ 131466 140636 190466 201387 193379 179862 165008 161738 183764 179165 172114 156286 144663
10869A44663R46J2165L4291K3891m4048l2241j408O237L8169M0923j6038q108
$$ 144663 145609 157774 192065 215956 171908 139667 138259 144496 182665 223588 207550 199442
10857A99442L135K973j8457J5637p336j9319k2627k2274q787K03R936m865k501
$$ 199442 202577 205550 187093 202730 195394 176075 153448 131174 122387 122590 132526 127661 125160
10844A25160k6077J3763K8527j2319J4471m0083m2407J5438K8946K0795M874k8139
$$ 125160 99083 112846 141373 129054 143525 103442 61035 76473 105419 126214 131088 102949
10832A02949j9310N309K2961Q472k3936J5899J5892p194j164K5384n846j6434
$$ 102949 83639 88948 111909 120381 96445 112344 128236 121042 119878 145262 139416 122982
10820A22982q597k004j3245k6224k9970J2658l67K1633J2596K844O650q084O81
$$ 122982 114385 112381 99136 72912 42942 55600 55233 76866 89462 92306 98956 90872 91553
10807I1553J6173k2624m2290k3189J5710J6151R837k6170j8054m969J695K5073
$$ 91553 107726 85102 42812 19623 35333 51484 61321 35151 17097 12128 13823 38896
10795C8896M1160K6248j7543k4738q3M373J1532J8230j6937j1762n0699J671K6962
$$ 38896 80056 106304 88761 64023 63940 68313 79845 98075 81138 69376 18677 20348 47310
10782D7310j9561J8727K8142N312M812J6148j0497m692J3148J0830M436n5251
$$ 47310 27749 46476 74618 79930 84742 100890 90393 85701 98849 109679 114115 58864
10770E8864j652N0659J3884Q27J470p288K2316k047k5883k6036K0416N717k8687
$$ 58864 57212 107871 121755 122582 124052 116764 139080 137033 111150 85114 105530 111247 82560
10757H2560r309k7436O271L4421J1529J2828N647K912j4371l572l279j0119k0874
$$ 82560 73251 45815 52086 86507 98036 110864 116511 119423 105052 101480 98201 88082 67208
10744F7208j1271K6437J4101L545J7175J3662j477m597j4620j9332N067K4596
$$ 67208 55937 82374 96475 100020 117195 130857 129380 124783 110163 90831 95898 120494
10732A20494J5231q129j5318J2221k2188j8218J3769L9388K4024l1591n30J4410
$$ 120494 135725 127596 112278 124499 102311 84093 97862 137250 161274 129683 129153 143563
10720A43563J8487n401l0988k1610K4019M0256j1501k5885J0692M872J0772K7205
$$ 143563 162050 156649 125661 104051 128070 168326 156825 130940 141632 146504 157276 184481
10708A84481J9251k8381o5634P184L2144j3953k3911J9693K8620L1890K66j1103
$$ 184481 203732 175351 109717 116901 149045 135092 111181 130874 159494 191384 191650 180547
10696A80547j0465j7234j6816j4883N288N304j2869J0010j3527o095M2324J0987
$$ 180547 170082 152848 136032 121149 126437 131741 118872 128882 115355 109260 151584 162571
10684A62571l6213k0267N870j9242R724J1209M111k502P319j829l0129K4211J4372
$$ 162571 126358 106091 111961 92719 102443 113652 117763 115261 122580 120751 90622 114833 129205
10671A29205K0718O663j7189J1444m48q066K6259k752k1431l4760Q849j3630j7012
$$ 129205 149923 156586 139397 150841 150393 142327 168586 165834 144403 109643 118492 104862 87850
10658H7850O012J2512J651j2646J7588M5037L975j6892m4504n340O723K7851J0342
$$ 87850 93862 106374 108025 95379 112967 158004 161979 145087 100583 95243 101966 129817 140159
10645A40159k728L9655L1243k8298k223j638j6241M600L26Q067N7867L0949m847
$$ 140159 137431 177086 208329 180031 177808 176170 159929 164529 164855 172922 230789 261738 256891
10632B56891J112J5529j2389J2955j2164j9378N2035O400K236K5141K181j0823
$$ 256891 258003 273532 261143 274098 261934 242556 294591 300991 303227 328368 330549 319726
10620C19726r171L4187l704j6558P536N186O639N181J96N310J4537J9793K9001
$$ 319726 310555 344742 341038 324480 332016 337202 343841 349022 349218 354528 369065 388858 417859
10607D17859j5452j6292J0950m17K0693K3432q029j9006M812Q067J0320L77J142
$$ 417859 402407 386115 397065 396648 417341 440773 432744 413738 418550 426617 436937 437314 438456
10594D38456L5623K5601m80j1190l148M2411M6706J9367j8663l312L8318K8451
$$ 438456 474079 499680 499200 488010 484862 527273 573979 593346 574683 571371 609689 638140
10582F38140k0004j8081q167j8206k3009J5814j3182K7183N5835j0737M0871M4875
$$ 638140 618136 600055 591888 573682 550673 566487 553305 580488 636323 625586 666457 711332
10570G11332O150l0185k175M0004K0807n706L9810J242j1588M1531N1936L1080
$$ 711332 717482 687297 685122 725126 745933 740227 780037 781279 769691 811222 863158 894238
10558H94238K2003K7070K5341J6038j2379K2526L0763J5413K5266L3231M8252
$$ 894238 916241 943311 968652 984690 972311 994837 1025600 1041013 1066279 1099510 1147762
10547A147762J6047Q8685K5404L1198L3115M9220R0550O2704N7627M3778O2856
$$ 1147762 1163809 1252494 1277898 1309096 1342211 1391431 1481981 1544685 1602312 1646090 1708946
10536A708946P5373R7548O3584O3274R7642J14388J15295J30964J10483J52884
$$ 1708946 1784319 1881867 1945451 2008725 2106367 2220755 2336050 2467014 2577497 2730381
10526B730381J82765J96185J86030K28182K69540K57797K86321L19547M15806
$$ 2730381 2913146 3109331 3295361 3523543 3793083 4050880 4337201 4656748 5072554
10517E072554M78996N19254N66512O38316P71712Q83008J016382J189525J367225
$$ 5072554 5551550 6070804 6637316 7275632 8047344 8930352 9946734 11136259 12503484
10508A2503484J594236J813546K027818K178563K329885K271159K023959J627914
$$ 12503484 14097720 15911266 17939084 20117647 22447532 24718691 26742650 28370564
10500B8370564J057197M03663k18709p53530j173298j287122j250061j142052
$$ 28370564 29427761 29831424 29612715 28859185 27685887 26398765 25148704 24006652
10492B4006652r11909o10720l45719j2362K71608N44519P91684R34748R76417
$$ 24006652 23094743 22484023 22138304 22125942 22397550 22942069 23733753 24668501 25644918
10483B5644918R68177Q37373O80689N95515N48131N51011O72072Q83947J047387
$$ 25644918 26613095 27450468 28131157 28726672 29274803 29825814 30497886 31381833 32429220
10474C2429220J160535J171482J014510P26891K89848j70460n79521r05128j107909
$$ 32429220 33589755 34761237 35775747 36502638 36792486 36622026 36042505 35137377 34029468
10465C4029468j154105j056405r17040p51367o39183n95027o07764p25705q40630
$$ 34029468 32875363 31818958 30901918 30150551 29511368 28916341 28308577 27582872 26742242
10456B6742242r08413r36456q70700p69962n66255l62133q9680J92588M43423
$$ 26742242 25833829 24897373 24026673 23256711 22690456 22328323 22238643 22431231 22874654
10447B2874654O57252Q22897R28103R56322Q32925N89658K54813k45693p22916
$$ 22874654 23531906 24354803 25282906 26239228 27072153 27661811 27916624 27670931 26948015
10438B6948015j149137j565597j757819j836122j839432j735852j608108j461349
$$ 26948015 25798878 24233281 22475462 20639340 18799908 17064056 15455948 13994599
10430A3994599j287190j109626r66000q77503p95721o95516o00740n41981n18539
$$ 13994599 12707409 11597783 10631783 9754280 8958559 8263043 7662303 7120322 6601783
10421F601783m11904l81501l45949l13480k97924k54802k31371k27044j96527
$$ 6601783 6189879 5808378 5462429 5148949 4851025 4596223 4364852 4137808 3941281
10412C941281j63629j76417j69066j80222j42711q9461j38665j17103j33193p5711
$$ 3941281 3777652 3601235 3432169 3251947 3109236 3019775 2881110 2764007 2630814 2555103
10402B555103o3014p0609r0374j03146j07840m8516l3649r5007o2919n4608p0905
$$ 2555103 2492089 2421480 2331106 2227960 2120120 2071604 2037955 1942948 1880029 1825421 1754516
10391A754516l4238l9695k0125l3667n1037p5287m5342m5829n7296m2374n4368
$$ 1754516 1720278 1680583 1660458 1626791 1575754 1500467 1455125 1409296 1352000 1309626 1255258
10380A255258l7740j8561k7568o729k6170l4116l033r350m0314l9973L845j1612
$$ 1255258 1217518 1198957 1171389 1164660 1138490 1104374 1101341 1091991 1051677 1011704 1015549 1003937
10368A003937l3234k3878J1705J3336l6495l0869j2051j8774l0617m2529J4421
$$ 1003937 970703 946825 958530 971866 935371 904502 892451 873677 843060 800531 814952
10357H14952k2275j2809q290m3558l7129l49L4817P109J4462K8320O5085N0180
$$ 814952 792677 779868 771578 728020 690891 690542 725359 732468 746930 775250 840335 890515
10345H90515P4121M5709Q6482P2378O9251M3889M3189Q397j9596q3558j16541
$$ 890515 964636 1010345 1096827 1169205 1238456 1282345 1325534 1333931 1314335 1230777 1114236
10334A114236j08854p0707q6166p0334p4450o5873k9639l6920k2893j2332l5634
$$ 1114236 1005382 934675 848509 778175 703725 637852 608213 571293 548400 536068 500434
10323E00434k5731J1350J8202k3459m9984m744L0174J696N232R707l3690n4725
$$ 500434 474703 486053 504255 480796 430812 426068 456242 457938 463170 472877 439187 384462
10311C84462j4523K2126M1904k3634l4390k69j3515j3960r914j7646L375k4093
$$ 384462 369939 392065 433969 410335 375945 375676 362161 348201 338287 320641 324016 299923
10299B99923M610J9795J7513j1913n6996j0404k4534j2452K4187M1452O871Q48
$$ 299923 304533 324328 341841 329928 272932 262528 237994 225542 249729 291181 298052 298900
10287B98900n267j6757k9477Q936K3780j0537k0028k181q379J658k6221j6285
$$ 298900 293633 276876 247399 256335 280115 269578 249550 247369 238990 240648 214427 198142
10275A98142J0000j6864p966p219R2P858K0439n263l2652k0954K0195L5159k7739
$$ 198142 208142 191278 183312 176093 176185 184043 204482 199219 166567 145613 165808 200967 173228
10262A73228l9608M41M7650J2011K6208K4761j8229p620o295J834j7291j3840
$$ 173228 133620 134061 181711 193722 219930 244691 226462 218842 212547 214381 197090 183250
10250A83250j2597N036j4140L645k3718J9310j2137j9790J3742j336Q147J8190
$$ 183250 170653 175689 161549 165194 141476 160786 148649 128859 142601 141265 149412 167602
10238A67602N663j6235j8265k6135Q039K1749L7167j2993m0885l7850k0706q027
$$ 167602 173265 157030 138765 112630 120669 142418 179585 166592 125707 87857 67151 59124
10226E9124K8687j2494K1538J2830J8293k2175k8828Q104K0160j6401P298j0199
$$ 59124 87811 75317 96855 109685 127978 105803 76975 85079 105239 88838 96136 85937
10214H5937k1522L2772K6950N536j4957k4316N241J9425K609j4306k2140k3699
$$ 85937 64415 97187 124137 129673 114716 90400 95641 115066 117675 103369 81229 57530
10202E7530J4372j6389j3535L5823o258j9992Q882K622j3095m83O486J3421o453
$$ 57530 71902 55513 41978 77801 71543 51551 60433 63055 49960 49477 55963 69384 62931
10189F2931k0061L8567J4870k7478P770j3703M130o257N629j7138P965J9521p311
$$ 62931 42870 81437 96307 68829 76599 62896 67026 60769 66398 49260 57225 76746 69435
10176F9435l025p078m1850j5803L6303l823Q265L9447j1023k2612J2473L5535
$$ 69435 66410 59332 17482 1679 37982 34159 42424 81871 70848 48236 60709 96244
10164I6244K1407L48J4225r709q153j2414K484L891k0348j1978Q925k1033j2136
$$ 96244 117651 117999 132224 122515 114362 101948 104432 108323 87975 75997 84922 63889 51753
10151E1753l1980q458L252J9371M8512j3794j9548Q249j1822J856j1367k1673
$$ 51753 19773 11315 14567 33938 82450 68656 49108 57357 45535 47391 36024 14351
10139A4351j1771R97L7453L4198j8394j9791J801j951j1663K2921J7923j8227
$$ 14351 2580 3577 41030 75228 56834 37043 38844 36893 25230 48151 66074 47847
10127D7847k0937k6874n088J3060J2348J5079m171Q97q87k6985q063J8094L1367
$$ 47847 26910 36 -5052 8008 20356 35435 31264 32161 31274 4289 -3774 14320 45687
10114D5687N9558r055k0790l6545k539l634O035N24L768k095r904K7669O226J2701
$$ 45687 105245 96190 75400 38855 36316 32682 38717 39241 43009 40914 31010 58679 64905 77606
10100G7606N339n78j8774k0559j2302O150R695L2124K4167m3046k2451q783L906
$$ 77606 82945 82367 63593 43034 30732 36882 46577 78701 102868 59822 37371 28588 32494
10087C2494L0258K6101J0479q473K3874O618N645L5635J4281j0298L7201O181
$$ 32494 62752 88853 99332 90859 114733 121351 126996 162631 176912 166614 203815 209996
10075B09996k0751k942j0917N406j1488m729J1216K049l052m1973j8618J901L6680
$$ 209996 189245 186303 175386 180792 169304 164575 175791 177840 174788 132815 114197 116098 152778
10062A52778L8019J0303k3084J9170M3507J2196l0559m9771J3312j3447O004J2856
$$ 152778 190797 201100 178016 197186 240693 252889 222330 172559 185871 172424 178428 191284
10050A91284L3374q073j4836l7379r052m605L3741J0578k9465k773L1321K7060
$$ 191284 224658 216585 201749 164370 155318 150713 184454 195032 165567 162794 194115 221175
10038B21175l4159j6412o574J440l54j922j7086q715m471J3038J5103m7065k5478
$$ 221175 187016 170604 164030 165470 165116 163194 146108 137393 132922 145960 161063 113998 88520
10025H8520J7055l542q904K8458J9896m0741N738K7067N08n073Q123J8363q446
$$ 88520 105575 102033 93129 121587 141483 100742 106480 133547 134055 128982 137105 155468 147022
10012A47022M452n040j167n62J326j4721l4937m271j9258M578k396p793k1881
$$ 147022 151474 146434 145267 144705 146031 131310 96373 92102 72844 77422 75026 67233 45352
9999D5352r376J1102n190J2963k1058J1489J1678J1624j2213k3022j5427O548
$$ 45352 35976 47078 41888 54851 33793 45282 56960 68584 56371 33349 17922 24470
9987B4470K2520J3368j2815J5825j3337m8262j071J9390j1560R17K678N955K3437
$$ 24470 46990 60358 47543 63368 50031 1769 698 20088 8528 9445 12123 18078 41515
9974D1515J8243n387k2399n373k963j1050J7427K3914R736O537p516m4581j433
$$ 41515 59758 54371 31972 26599 23636 12586 30013 53927 63663 70200 62684 18103 16670
9961A6670K2950L3823n4713k344L6283k6046k1286J1375J0226O468N189o363J9269
$$ 16670 39620 73443 18730 16386 52669 26623 5337 16712 26938 33406 38595 32232 51501
9948E1501p108k0924l953j7063O466L8209J6734j4801o834j9930j5088J6726J0216
$$ 51501 44393 23469 19516 2453 8919 47128 63862 49061 42227 22297 7209 23935 34151
9935C4151M425q312k0073j7630k164J5253J0430j5696j1391m727J4367L1239o400
$$ 34151 38576 30264 10191 -7439 -9603 5650 16080 384 -11007 -15734 -1367 29872 23472
9922B3472j7591q331l855J4495j05o414K8644q939j1553J2234n732k924L0845
$$ 23472 5881 -2450 -6305 8190 8085 1671 30315 21376 9823 22057 16325 13401 44246
9909D4246j1334j5660J1018K9353O819m2387M544M174K6732J505J1715k6380k4016
$$ 44246 32912 17252 28270 57623 64442 22055 26599 30773 57505 59010 70725 44345 20329
9896B0329j855J7504k791L59K6109k2549o271N697K9177P422p878q621k2494k5932
$$ 20329 18474 35978 33187 33546 59655 37106 30835 36532 65709 73131 65253 56632 34138 8206
9882H206l278J6662j7808M731M9424o046k8482j1038r254L3218K4188r579m3424
$$ 8206 4928 21590 3782 8513 57937 51891 23409 12371 3117 36335 60523 50944 7520
9869G520j7387L0497L2469j2293l9976k3440J5649K4397J1433K4747O4680N3901
$$ 7520 -9867 20630 53099 40806 830 -22610 -6961 17436 28869 53616 118296 172197
9857A72197N3199R7247N1669L2403j8528n3867p3169p4681l7668m9371m8329l040
$$ 172197 225396 322643 374312 406715 388187 334320 261151 186470 148802 99431 51102 48062
9845D8062j4951j1806n917K1290L6730k3375l5931P735Q212P258L0360m995j8218
$$ 48062 33111 21305 15388 36678 73408 50033 14102 21837 30049 37307 67667 62672 44454
9832D4454J160j0690k0430k9185K9936J7693J7036k7949j7260j3580J6995K5288
$$ 44454 45614 34924 14494 -14691 15245 32938 49974 22025 4765 -8815 8180 33468
9820C3468j1977k5770j4127J2004P796J9245J1264l7317O741j877l855J5232j3115
$$ 33468 21491 -4279 -18406 -6402 1394 20639 31903 -5414 1327 -550 -4405 10827 -2288
9807b288L261J519K4648J7152p268j9751R679O049m40N168Q597j7911j4637o736
$$ -2288 973 2492 27140 44292 37024 17273 26952 33001 32561 37729 46326 28415 13778 7042
9793G042j8266j2154O0360K3165k3519n0506r658K7993K6256J7499q522J1699
$$ 7042 -11224 -23378 36982 60147 36628 -13878 -23536 4457 30713 48212 39690 51389
9781E1389J2101k3360l2418j1376k1558J1202M376K6715M114k3537l580J820k7685
$$ 51389 63490 40130 7712 -3664 -25222 -14020 -9644 17071 21185 -2352 -5932 -4112 -31797
9768c1797L843Q346K9619R656K3942k3232k0025K3461L7724j4189k7243j2395
$$ -31797 -27954 -19608 10011 19667 43609 20377 352 23813 61537 47348 20105 7710
9756G710n426k3220J492J4157M730K8711K3421l9107l4874Q727n560K6868j73
$$ 7710 2284 -20936 -19444 -5287 -557 28154 51575 12468 -22406 -13679 -19239 7629 7456
9743G456j4019J094k256k1138l479O755L1982K7664j588k4957j8780J570k802
$$ 7456 -6563 -5469 -7725 -28863 -32342 -25587 6395 34059 32471 7514 -11266 -9696 -12498
9730a2498J3940L8626K2362R301J8648N951o452r296j1181o650R597j3354l0815
$$ -12498 1442 40068 62430 71731 90379 96330 89878 80582 69401 62751 72348 58994 28179
9717B8179q241K348J8685J2435L5243L4945k8405l2738q713J7301K3647P252l4555
$$ 28179 19938 22286 40971 53406 88649 123594 95189 62451 53738 71039 94686 101938 67383
9704F7383k5888Q358j3602k6587J4693J9155L9180L9677K0322j5975J8015M2503
$$ 67383 41495 49853 36251 9664 24357 43512 82692 122369 142691 126716 144731 187234
9692A87234J4559J7559K9538J2397m5978J0825R3566N9900M9270R4701J12560
$$ 187234 201793 219352 248890 261287 215309 226134 319700 379600 428870 523571 636131
9681F36131J62125K14992K67245K96106L14405K74491J30436o0635k24406k75417
$$ 636131 798256 1013248 1280493 1576599 1891004 2165495 2295931 2235296 2010890 1735473
9671A735473k75291k65108k07658j96613j52599r6395p0366n6867m5933n8974
$$ 1735473 1460182 1195074 987416 790803 638204 541809 471443 414576 368643 309669
9661C09669m1397j8882p60k4253m1713k2814J0547p985j9825k299J0045L287o363
$$ 309669 268272 249390 248630 224377 182664 159850 170397 162412 142587 140288 150333 153620 147257
9648A47257j0418j7436j6250r172K864J0405l2617j1204j9862L350k7828m594
$$ 147257 136839 119403 103153 93981 96845 107250 74633 63429 43567 46917 19089 14495
9636A4495Q226j0858K6867J4761K832j4797J4265L003j1542l1119L5821M1908
$$ 14495 22721 11863 38730 53491 56323 41526 55791 58794 47252 16133 51954 93862
9624I3862q741n888p558J2053j1481N88q351l2031j0154j6192M693J0589K795
$$ 93862 85121 79233 71675 83728 72247 72835 64484 32453 22299 6107 10800 21389 24184
9611B4184J6467R192R800j7585l4760L444K9967K1089j6623K1159J5024R117j2590
$$ 24184 40651 49843 59643 42058 7298 10742 40709 61798 45175 66334 81358 90475 77885
9598G7885j6748n64N310K35l0513k2090M3170K0154j629M343k1564j9504J2416
$$ 77885 61137 60573 65883 66118 35605 13515 56685 76839 75210 79553 57989 38485 50901
9585E0901P761k5880k1060k925M0542L4165l7399n5140m389P287j9470l5132O754
$$ 50901 58662 32782 11722 8797 49339 83504 46105 -9035 -13424 -6137 -25607 -60739 -53985
9572e3985P6191L4095k0198J20J1669L459j7136K9309l1343m8917p039m057M83
$$ -53985 22206 56301 36103 36223 47892 51351 34215 63524 32181 -16736 -23775 -27832 -27349
9559b7349K0408l716K7963R417j0564n543o643j0716N37K8174K9188L833j6606
$$ -27349 -6941 -10657 17306 26723 16159 10616 3973 -6743 -6206 21968 51156 54989 38383
9546C8383k1499J045K1372j150k200K128J1885p712j1493K2332q88j9369j6236
$$ 38383 16884 17929 39301 38151 35951 38079 49964 42252 30759 53091 52203 32834 16598
9533A6598K0192q826j7865K4037K3577k2466k2166j2424j4249J4006K1637L3881
$$ 16598 36790 27964 10099 34136 57713 35247 13081 657 -13592 414 22051 55932
9521E5932M659k6823o360M0985l041m501J1419K851o734o622j7054J1912J8188
$$ 55932 60591 33768 27408 68393 65352 60851 72270 75121 68387 61765 44711 56623 74811
9508G4811l97n0234l1040K8438J3792j6628k0364l0753j4135L3724L2431L5520
$$ 74811 74414 24180 -6860 21578 35370 18742 -1622 -32375 -46510 -12786 19645 55165
9496E5165j8713j7677K5599k0108j4879J8871Q885J3559j8291J1261K1514L929
$$ 55165 36452 18775 44374 24266 9387 28258 37143 50702 32411 43672 65186 69115
9484F9115o052J2314q439M220j0662m161J3513L062q88j8570j9873l724J6506
$$ 69115 63063 75377 66938 71158 60496 56335 69848 72910 72022 53452 33579 29855 46361
9471D6361j0957l7686k1598J1371K1563m883R482J4279L691j5701J9177K4506
$$ 46361 35404 -2282 -23880 -12509 9054 4171 13653 27932 31623 15922 35099 59605
9459E9605j8805j5872K659K6933K4105m508k631k2881q403J1395K2444K240l7163
$$ 59605 40800 24928 27587 54520 78625 74117 71486 48605 40202 51597 74041 76281 39118
9446C9118o876n766J3208K637l8810j5572K0219O156L789P526K8017j6078K568
$$ 39118 32242 26476 39684 42321 3511 -12061 8158 14314 18103 25629 53646 37568 40136
9433D0136L0158r347j5855J7026l3422q793p783j3291j379R799J9677O482o152
$$ 40136 70294 60947 45092 62118 28696 19903 12120 -1171 -2550 7249 26926 33408 27256
9420B7256J6881L2834P475k8978l9692O720L8559K5408j2677p427L1j1194N689
$$ 27256 44137 76971 84446 55468 15776 22496 61055 86463 73786 66359 66390 55196 60885
9407F0885k115j8889K862L1992O064J4884L7161q741l5138p4756k3680J661K267
$$ 60885 58770 39881 42743 74735 80799 95683 132844 124103 88965 14209 -9471 -7810 -5543
9394e543O171J7828q210K2525J4120J38J3357R06m10J3511k5920n7358j5595p738
$$ -5543 628 18456 10246 32771 46891 47029 60386 61292 60882 74393 48473 -8885 -24480 -32218
9380c2218Q073J4947K3335j519J0316j0541m232N672L2509K0122K5722M863J5112
$$ -32218 -24145 -9198 14137 12618 22934 12393 8161 13833 46342 66464 92186 97049 112161
9367A12161l3198k8461m898K7593J7937j7902n8295J4208L3112J0176n75j0701
$$ 112161 78963 50502 45604 73197 91134 73232 14937 29145 62257 72433 71858 61157
9355F1157r071l990Q947l342O203K6457k1551q170j9348r795L0712L3101k2165
$$ 61157 52086 48096 57043 53701 59904 86361 64810 56640 37292 27497 58209 91310 69145
9342F9145l0573k7521M899J6014q97J6989L029k157M26N3091J3106r79k6602L698
$$ 69145 38572 11051 15950 31964 31067 48056 51085 48928 49354 102445 115551 114572 87970 91668
9328I1668O927q485j9178Q588K5368j5343j5029o357m163J6633O981o805l767
$$ 91668 98595 90110 70932 79520 104888 89545 74516 68159 63996 80629 87610 80805 77038
9315G7038l033J3864J7708K0408k1805j7846K0301m710j6523K0726L255K4058
$$ 77038 74005 87869 105577 125985 104180 86334 106635 101925 85402 106128 109383 133441
9303A33441k8117k4946k3070K9837L6508l9504n215o440r765m392J1469l147k088
$$ 133441 105324 80378 57308 87145 123653 84149 78934 72494 62729 58337 69806 66659 64571
9290F4571K1889N939J6459J6929r524L542J838R652j4445k5839O082J756J019
$$ 64571 86460 92399 108858 125787 116263 119805 121643 131295 116850 91011 97093 98849 99868
9277I9868m284j5728k8733P172k4380K9968M942j0919L2363J9492J7072J351r314
$$ 99868 95584 79856 51123 58295 33915 63883 68825 57906 90269 109761 126833 128184 118870
9264A18870J3617J5632K8821J4237J4249O854k2026l2792J5153N230N2939j7787
$$ 118870 132487 148119 176940 191177 205426 212280 190254 157462 172615 177845 230784 212997
9252B12997k6674K3782J1533j4664j769L496J5366J9861M4674J882k0803k5406
$$ 212997 186323 210105 221638 206974 205205 208701 224067 243928 288602 290484 269681 244275
9240B44275r354P664K4973L2425L8634P819J4804j9197j2242M7409K7016K2837
$$ 244275 234921 242585 267558 299983 338617 346436 361240 342043 329801 377210 404226 427063
9228D27063J7765N2276O3162R0735R4696P2261P2525O7518R9961R4770J22947
$$ 427063 444828 497104 560266 651001 745697 817958 890483 958001 1057962 1152732 1275679
9217A275679J57539J60928K46970L01164L68021M62487O15357P53163R26401J139278
$$ 1275679 1433218 1594146 1841116 2142280 2510301 2972788 3588145 4341308 5267709 6406987
9207F406987J262851J273633J029766N11118j12642o53630j050507j199656j183493
$$ 6406987 7669838 8943471 9973237 10484355 10371713 9718083 8667576 7467920 6284427
9198F284427j043878q28961o69381n36765m38139l64968l04097k31093j74597
$$ 6284427 5240549 4411588 3742207 3205442 2767303 2402335 2098238 1867145 1692548
9189A692548j38716j36437j18238r2662q9518q7256q9864n6580m6240o3444m0111
$$ 1692548 1553832 1417395 1299157 1206495 1116977 1029721 939857 883277 837037 773593 733482
9178G33482j8591j6522j3008j9051k0660l5088k2856l5407l3195m7947q876L0874
$$ 733482 714891 698369 685361 666310 645650 610562 587706 552299 519104 471157 462281 493155
9166D93155J0724k0006Q692O9304L4249J6065K7096K7073N6863K7958O4469J24040
$$ 493155 503879 483873 492565 561869 596118 612183 639279 666352 723215 751173 815642 939682
9154I39682J11710J40915J79239K22139K13874K21479J70702J15289M4880j6238
$$ 939682 1051392 1192307 1371546 1593685 1807559 2029038 2199740 2315029 2359909 2343671
9144B343671q8578j79840k09847j95351k14330j77837j72809j52270j05111j14837
$$ 2343671 2255093 2075253 1865406 1670055 1455725 1277888 1105079 952809 847698 732861
9134G32861j08471m7080k0021o0177m3487J762l3206l3385j3014K71Q749L877
$$ 732861 624390 577310 557289 497112 453625 455387 422181 388796 375782 376053 384802 388679
9122C88679j8663j2299K496j8884k5776l1741j4742J9910l483j0486j0658J3754
$$ 388679 370016 357717 360213 341329 315553 283812 269070 288980 285497 275011 264353 278107
9110B78107J0839j9743l4995L065q983J248M1627P891j361k0652k9425p072l1101
$$ 278107 288946 269203 234208 237273 228290 229538 271165 279056 277695 257043 227618 220546 189445
9097A89445K6867P693k821j2433k8109p831n192p434m541N585J9164J619O238
$$ 189445 216312 224005 221184 208751 180642 172811 167619 160185 155644 161229 180393 182012 188250
9084A88250J802j5275q935J7707j7807J9044J9615j5089j7728k514p732l682n056
$$ 188250 190052 174777 165842 183549 165742 184786 204401 189312 171584 169070 161338 157656 152600
9071A52600l743J0045q888M207K1522J8550k023l372k3109o453j9224j497J4510
$$ 152600 148857 158902 150014 154221 175743 194293 192270 188898 165789 159336 140112 138615 153125
9058A53125M53k9629j550j1481j4463n466R119K4465o651j2575K0429J6841K2989
$$ 153125 153578 123949 122399 110918 96455 90989 100108 124573 117922 105347 125776 142617 165606
9045A65606J5346j0114j3913L5174K3686p753r078m013J1448K3618k691L2268
$$ 165606 180952 170838 156925 192099 215785 208032 198954 194941 206389 230007 227316 259584
9033B59584j793m6459q353K6722K5344m1114k9350O576K267j6438j2510j61K7230
$$ 259584 257791 211332 202979 229701 255045 213931 184581 191157 193424 176986 164476 164315 191545
9020A91545J6751J3002P168M0735M22j9928L185K7258J2608J2998j2081M3448
$$ 191545 208296 221298 228466 269201 269623 249695 252880 280138 292746 305744 293663 337111
9008C37111L0891M3524N8798O3799O9941N5601M9049P904l2398o1457q4600q8319
$$ 337111 368002 411526 470324 534123 604064 659665 708714 716618 684220 622763 538163 449844
8996D49844m1212m1603j3035k9189l7311p912j1073K3246K5352J774L643r160
$$ 449844 408632 367029 353994 324805 287494 279582 268509 291755 317107 318881 322524 313364
8984C13364r670J811L975m7740n4336K479O414J9825J9602j8824P046m404P084
$$ 313364 303694 305505 309480 261740 207404 209883 216297 236122 255724 236900 243946 239542 246626
8971B46626K3253J6772n0277l5526L088K2185J1226J5857J004l471L2631j3823
$$ 246626 269879 286651 236374 200848 203936 226121 237347 253204 254208 250737 283368 269545
8959B69545N51n617m1090p968N0171M0278J1621j323J1402J1584L830p445l8203
$$ 269545 270096 264479 223389 215421 265592 305870 317491 316168 327570 339154 342984 335539 297336
8946B97336l7610n2063l421j1774O649j1169m2450o0087m1085k2417m025K3944
$$ 297336 259726 207663 204242 192468 199117 187948 145498 85411 44326 21909 17884 41828
8934D1828q279K795L8464J9341K0477K8005L2019L1705L673k4892m417K6460J2491
$$ 41828 33549 36344 74808 94149 114626 142631 174650 206355 210028 185136 180719 207179 219670
8921B19670o887M140L933J7435R03O250j6456L7213J7981k5930o286L1709k0763
$$ 219670 212783 216923 220856 238291 239194 245444 228988 266201 284182 258252 251966 283675 262912
8908B62912p000M8843J1925j886K5057r446J0716K3018K6808L6155L3107P847
$$ 262912 255912 304755 316680 314794 339851 330405 341121 364139 390947 427102 460209 468056
8896D68056j5635M3777L2524K5055K28Q743k5555J8149L0787R888J8941K2670
$$ 468056 452421 496198 528722 553777 554005 562748 537193 555342 586129 596017 614958 637628
8884F37628j4024Q773N6661M8976K2226Q6519O6167N9698M5711O9497K129j7887
$$ 637628 623604 632377 689038 738014 760240 846759 912926 972624 1018335 1087832 1089961 1072074
8872A072074k0941l1235n3733m3630m1911o8800l5207m764Q356K2105p692J6757
$$ 1072074 1051133 1019898 966165 922535 880624 811824 776617 771853 780209 802314 794622 811379
8860H11379j1142j277N295K6212J7885n316Q083O4362k487n477N3564K8050O453
$$ 811379 800237 798960 804255 830467 848352 843036 851119 915481 912994 907517 961081 989131 995584
8847I95584K917M0064K4855J2977K331O959J2046K3635K117J4559M990Q839L3778
$$ 995584 998501 1038565 1063420 1076397 1078728 1085687 1097733 1121368 1123485 1138044 1143034 1151873 1185651
8834A185651L7255L649K6412O6891l876N775N7564M8293K0579L0816L3297Q4834
$$ 1185651 1222906 1226555 1252967 1319858 1315982 1321757 1379321 1427614 1448193 1479009 1512306 1597140
8822A597140J26009P0712L0822O8415N4125O2029N8626M0538P0477N0140K4479
$$ 1597140 1723149 1793861 1824683 1893098 1947223 2009252 2067878 2108416 2178893 2229033 2253512
8811B253512L1969N9989N3279Q4317O7284Q3683P1654P6910J13506J40583Q9535
$$ 2253512 2285481 2345470 2398749 2483066 2550350 2634033 2705687 2782597 2896103 3036686 3126221
8800C126221J12751J07582J18964J34708J51016J64532J89151J70386J60661J61584
$$ 3126221 3238972 3346554 3465518 3600226 3751242 3915774 4104925 4275311 4435972 4597556
8790D597556J88858K03643K31298K06064K55791L03813L53390M03538M22573M62828
$$ 4597556 4786414 4990057 5221355 5427419 5683210 5987023 6340413 6743951 7166524 7629352
8780G629352N39157N66526O17512O18875P18685Q14847R11244J016739J123607
$$ 7629352 8168509 8735035 9352547 9971422 10690107 11504954 12416198 13432937 14556544
8771A4556544J251050J408239J644914J924691K290845K794165L346776M075491
$$ 14556544 15807594 17215833 18860747 20785438 23076283 25870448 29217224 33292715
8763C3292715M870564N711640O553148P461148Q685002J0572107J3724168J8686636
$$ 33292715 38163279 43874919 50428067 57889215 66574217 77146324 90870492 109557128
8755A09557128K6226567L7274033N2868527P2578166R0892873R3672541O7557131
$$ 109557128 135783695 173057728 225926255 298504421 389397294 483069835 550626966
8748E50626966K0136664l0338204p1648500q9490904q2133180o4183288m7242629
$$ 550626966 570763630 540425426 468776926 379286022 297152842 232969554 185726925
8741A85726925l4392304k5327651j9054821j4624977j1379006q986832p333613
$$ 185726925 151334621 126006970 106952149 92327172 80948166 71961334 64627721
8734F4627721o287281n509471m972422m550403m069162l560452l102353k698789
$$ 64627721 58340440 52830969 47858547 43308144 39238982 35678530 32576177 29877388
8726B9877388k330432j969153j770460j626853j457742j298443j159206j029478
$$ 29877388 27546956 25577803 23807343 22180490 20722748 19424305 18265099 17235621
8718A7235621r36499q66192p75903p04217o56184o09531n55931n37464m95854
$$ 17235621 16299122 15432930 14657027 13952810 13296626 12687095 12131164 11593700 11097846
8709A1097846m64214m43482m11436l80836l72966l84718l34204l04468k46956
$$ 11097846 10633632 10190150 9778714 9397878 9024912 8640194 8305990 8001522 7754566
8700G754566k23776k45191k36472k43991k44753k13623k07375j87307j53093j79407
$$ 7754566 7530790 7285599 7049127 6805136 6560383 6346760 6139385 5952078 5798985 5619578
8690E619578j86704j55416j52396j40999j64904j38608j46487j52385j60959j24630
$$ 5619578 5432874 5277458 5125062 4984063 4819159 4680551 4534064 4381679 4220720 4096090
8680D096090j26073j27702r0919r9656j00939j07430q0855l2943n9583j11326
$$ 4096090 3970017 3842315 3751396 3651740 3550801 3443371 3362516 3329573 3269990 3158664
8670C158664r6165r0416p6380o9505r1416o4955o4785n5781l7043k0411j691k7775
$$ 3158664 3062499 2972083 2895703 2826198 2734782 2669827 2605042 2549261 2512218 2491807 2490116 2462341
8658B462341q3327q1050m4663m1057k1776j8389o0805p1714n6233m8476m5741
$$ 2462341 2379014 2297964 2253301 2212244 2190468 2172079 2111274 2039560 1983327 1934851 1889110
8647A889110m4862m7586n2336l566k8373k0204o043l3365l7274k3041K3166j7819
$$ 1889110 1844248 1796662 1744326 1740760 1712387 1692183 1686140 1652775 1615501 1592460 1615626 1597807
8635A597807J934P714j6953k1405l6121q166l2883j8379k7974R750L0345J8619
$$ 1597807 1599741 1607455 1590502 1569097 1532976 1524810 1491927 1473548 1445574 1455324 1485669 1504288
8623A504288L7373K1216l610j9621l519k8834m7808p8751m6996k5970l1611L6861
$$ 1504288 1541661 1562877 1559267 1539646 1536127 1507293 1459485 1380734 1333738 1307768 1276157 1313018
8611A313018J7280J5194R719J5207M6869j650m8323m7889k4440k8107R568L0417
$$ 1313018 1330298 1345492 1355211 1370418 1417287 1415637 1367314 1319425 1294985 1266878 1276446 1306863
8599A306863M6370J00378J12864J18561Q7257O6921N4701K8850P6858J02041Q4729
$$ 1306863 1353233 1453611 1566475 1685036 1772293 1839214 1893915 1922765 1999623 2101664 2186393
8588B186393N6212R5965J38658J86275L50206N31830Q35297J361780K229724L582699
$$ 2186393 2242605 2338570 2477228 2663503 3013709 3545539 4380836 5742616 7972340 11555039
8578A1555039M628054L686613J083575j231106l485456m393482l411651k176909
$$ 11555039 16183093 19869706 20953281 19722175 16236719 11843237 8431586 6254677
8570F254677j395113r37224n92764l73977k62169j80086j46367o8846o1908r7465
$$ 6254677 4859564 3922340 3329576 2955599 2693430 2513344 2366977 2298131 2236223 2138758
8560B138758j25029j58965j46415j35574j11094n4331M07n111j6444l0304m8407
$$ 2138758 2013729 1854764 1708349 1572775 1461681 1407350 1407757 1402646 1386202 1355898 1307491
8549A307491q8879j60615j10546o3644m7421n1039o2815o5249l2219k0428j4996
$$ 1307491 1218612 1057997 947451 883807 836386 785347 722532 657283 625064 604636 589640
8538E89640p299k3412j2533j8695r374N5674J5462m2631r464j9588M089j96k077
$$ 589640 582341 558929 546396 527701 518327 574001 589463 546832 537368 517780 521869 521673 519596
8525E19596O22k8390m492O757o640l4993m4342j372j745N529j7497k3219m349
$$ 519596 520218 491828 487336 494093 487453 452460 408118 406746 405001 410530 393033 369814 365465
8512C65465k6176j7866M4693O585R88J0731J6958j2502k1918j2028n223p730q45
$$ 365465 339289 321423 366116 372701 373689 384420 401378 388876 366958 354930 349707 341977 341132
8499C41132m309L947M414n813O665N24J9628J1230n9049k9795j8697Q76l650j4219
$$ 341132 336823 340770 345184 339371 346036 346560 366188 377418 318369 288574 269877 270753 267103 252884
8485B52884N336j2027k4361k4719P823L5839r947k7474J8544L105l1560j4194
$$ 252884 258220 246193 221832 197113 204936 240775 230828 203354 221898 225003 193443 179249
8473A79249j0113O999M52k5k7161k0337j1518O640Q949J564p860J3601l1725k9036
$$ 179249 169136 176135 176587 176562 149401 129064 117546 124186 133135 134699 126839 140440 108715 79679
8459G9679j7308J6551K8601M0385L3074k4516k2415K217J9034Q26j8270j6416
$$ 79679 62371 78922 107523 147908 180982 156466 134051 136268 155302 156128 137858 121442
8447A21442k604J0326Q566L9459M3707j268j2415k4630J808J7151p395k7723j5140
$$ 121442 118838 129164 137730 177189 220896 219628 207213 182583 184391 201542 194147 166424 151284
8434A51284J5372J1098r079l2969k5278l306p98J6741L084j5258J7129Q476J0629
$$ 151284 166656 177754 168675 135706 110428 107122 106324 123065 126149 110891 128020 136496 147125
8421A47125J5894Q384j6566m9240j8528l0819L913K8794K2682J7358J2021J2446
$$ 147125 163019 171403 154837 105597 87069 56250 60163 88957 111639 128997 141018 153464
8409A53464L199k2890j3574j8421O639p284J7828J5547j9770k4881n260K6111
$$ 153464 156663 133773 120199 101778 108417 101133 118961 134508 114738 89857 84597 110708
8397A10708R879K926M572j8188J6014j735j2172j0342P161Q615p421p553Q051
$$ 110708 120587 123513 128085 109897 125911 124176 112004 101662 108823 117438 110017 102464 110515
8384A10515J2613J4094j2182j3024K6834K0693K537j5423K9681J5312J4158R517
$$ 110515 123128 137222 125040 112016 138850 159543 162080 146657 176338 191650 205808 215325
8372B15325k193J5883N402n497k8017j3864L0360m13O276K6093J6582L1483J4307
$$ 215325 213132 229015 234417 228920 200903 187039 217399 216986 223262 249355 265937 297420 311727
8359C11727K8776M3286K6081O5058P6606J21234J25534J69879J83307K38594K45057
$$ 311727 340503 383789 409870 474928 551534 672768 798302 968181 1151488 1390082 1635139
8348A635139K03885J66681J68014R1783p211q4582j16894k14604k31086k20443
$$ 1635139 1839024 2005705 2173719 2265502 2258291 2173709 2056815 1842211 1611125 1390682
8338A390682k13313k06494j55366j37297j04929q1466J5320l2919m5709m6044
$$ 1390682 1177369 970875 815509 678212 573283 491817 507137 474218 428509 382465
8328C82465l4453l0121l3246j5609J5980j2281n1486j7310r36l4483m3460P738
$$ 382465 348012 317891 284645 269036 285016 272735 221249 203939 203003 168520 125060 132798
8316A32798L0106j1985m4551l988K2413m560O707k1291k4541k9205O880K0040
$$ 132798 162904 150919 106368 102380 124793 120233 126940 105649 81108 51903 58783 78823
8304G8823J7022q006k571q762R437L528O573l9207k5499n848L1010Q971r102L967
$$ 78823 95845 87839 85268 76506 85943 89471 96044 56837 31338 25490 56500 65471 56369 60336
8290F0336m733J4685N926L7512L1976Q312k5232j1275k4717m1711J984m583K409
$$ 60336 55603 70288 76214 113726 145702 154014 128782 117507 92790 51079 53063 48480 50889
8277E0889O258l21j9433j8737J4200K7483K374J3010J3420L4431J2804m4226k9646
$$ 50889 57147 56826 37393 18656 32856 60339 62713 75723 89143 123574 136378 92152 62506
8264F2506j0367M165k2143J6901L5612j1971k779k652M573k3334l0213J0408K5039
$$ 62506 52139 56304 34161 51062 86674 74703 71924 69272 73845 50511 20298 30706 55745
8251E5745j1014r1l212k671J2655J2636j5632K0293J9745N912k1840j5155P142
$$ 55745 44731 44640 41428 38757 51412 64048 48416 68709 88454 94366 72526 57371 64513
8238F4513k443J3434J3456M574j8764k949J6674J5029p80j8958l9944l1300K8204
$$ 64513 62070 75504 88960 93534 74770 71821 88495 103524 102744 83786 43842 12542 40746
8225D0746J3981j7781n691K0972r321m2557K3984K5991r345q242j5482Q412J1881
$$ 40746 54727 36946 31255 52227 42906 349 24333 50324 40979 32737 17255 25667 37548
8212C7548j0251k269j5633K2699J027J3635j6686Q920J4581j6849J5321J9303
$$ 37548 27297 25028 9395 32094 33121 46756 30070 38990 53571 36722 52043 71346
8200G1346O697j1614L207j3034J0755J1610k8222R691K5955N4728j7836m1816
$$ 71346 78043 66429 69636 56602 67357 78967 50745 60436 86391 141119 123283 81467
8188H1467j1661L2058K715j440j0639k1227L2324J4860J3531p010k6103O328M4800
$$ 81467 69806 101864 104579 103139 92500 71273 103597 118457 131988 124978 98875 105203 150003
8175A50003p698l1699q884N511J2267k7137j7969k0454K405M000K2518J7912R911
$$ 150003 142305 110606 101722 107233 119500 92363 74394 53940 56345 60345 82863 100775 110686
8162A10686J2374l6669m5948K6426J6397r886k2073J0684R858j0148n642J587
$$ 110686 123060 86391 40443 66869 83266 73380 51307 61991 71849 61701 56059 57646
8150E7646Q978j6034J4898j1358k9937J6590J3012j842J0287O065k4886k8223
$$ 57646 66624 50590 65488 54130 24193 40783 53795 51953 62240 68305 43419 15196
8138A5196k8194m477K9909M4230K245K1785K0845M849j3189j5399K287J4753q683
$$ 15196 -12998 -17475 12434 56664 58909 80694 101539 106388 93199 77800 80087 94840 86157
8125H6157p477j1274J3960J6825o25p754n373k4404o079K3884n792M610r923k3322
$$ 86157 78680 67406 81366 98191 97566 89812 84439 60035 53956 77840 72048 76658 66735 43413
8111D3413j3284L8489K6568M140l4557j7230M423K2806Q24K313O285l812k0206
$$ 43413 30129 68618 95186 99326 64769 47539 51962 74768 75592 77905 84190 80378 60172
8098F0172l665j079r092j613K8133k0322p4315J2038N4542K9043p480J6242J4354
$$ 60172 56507 55428 46336 44723 72856 52534 -21781 -9743 44799 73842 66362 82604 96958
8085I6958k7454J0408r145o580j2009k1314P896K4002M805K4023o512k0650M028
$$ 96958 69504 79912 70767 64187 52178 30864 38760 62762 67567 91590 85078 64428 68456
8072F8456j6904l1728M673J7434R733j9716J7129J2788j0283J1635k3451k3411
$$ 68456 51552 19824 24497 41931 51664 31948 49077 61865 51582 63217 39766 16355
8060A6355k1047N0062K9605j2738J8722J0938l4933k5931j242L5646K8077K7948
$$ 16355 -4692 45370 74975 62237 80959 91897 56964 31033 29791 65437 93514 121462
8048A21462M603j5334k3297r470J4298j9142P628j443J7544J4171k2664l3431
$$ 121462 126065 110731 87434 77964 92262 73120 80748 79305 96849 111020 88356 54925
8036E4925K0138R45M90k4834j8599Q654O661k2202P72M287p804K2001J129l2157
$$ 54925 75063 76008 76498 51664 33065 41719 48380 26178 26950 31237 23433 45434 46563 14406
8022A4406l180K5680M2637L9543j0134m7525k8635n921N866M5748J2014p715J3142
$$ 14406 11226 36906 79543 119086 108952 61427 32792 26871 32737 78485 90499 82784 95926
8009I5926O255m4682j4247J4420R338L4308N033J0618L8711j8890j2470L286J1623
$$ 95926 102181 57499 43252 57672 67010 101318 106351 116969 155680 136790 124320 127606 139229
7996A39229R566j3826m7735l7412j6113J3775K9106p028M381L2536J4087L75m1586
$$ 139229 148795 134969 87234 49822 33709 47484 76590 69562 73943 106479 120566 120941 79355
7983G9355l8909k4464p52l085J5281J6207K1196O326k1570k7743L794L0169K0096
$$ 79355 40446 15982 15230 12145 27426 43633 64829 71155 49585 21842 25636 55805 75901
7970G5901P412j4279M801J7456k163K4974m392j1670m0012k3443l686K0495p572
$$ 75901 83313 69034 73835 91291 89128 114102 109710 98040 58028 34585 30899 51394 43822
7957D3822J1791K7174K8601o334j053k7017j538L1411n942k2082j5060N863l4974
$$ 43822 55613 82787 111388 105054 104001 76984 75446 106857 100915 78833 63773 69636 34662
7944C4662k8730J6855l346L0626L8631K129k3093k636J0057k4351o161J4423M094
$$ 34662 5932 22787 19441 50067 88698 90827 67734 65098 75155 50804 44643 59066 63160
7931F3160R750L3195k2751l0602K5444K5221J870j8984j8279r319J3423k7088
$$ 63160 72910 106105 83354 52752 78196 103417 105287 86303 68024 58705 72128 45040
7919D5040J0925J8815j7464l804j552k0560K0912J0145K1800l410j3106L6657
$$ 45040 55965 74780 57316 53512 51960 31400 52312 62457 84257 80847 67741 104398
7907A04398n671l1550j0055j8314l561K8852m808k953J5854o600P277J241K0443
$$ 104398 98727 67177 57122 38808 35247 64099 59291 56338 72192 65592 72869 74110 94553
7894I4553L6792p479l4352k4139j3632P79J2406m0306j1623M2495j210j1459l396
$$ 94553 131345 123866 89514 65375 51743 52522 64928 24622 12999 55494 54284 42825 39429
7881C9429L5277R445j1802k8756j962L3197N88L2765j7239n0236l6906n606K9520
$$ 39429 74706 84151 72349 43593 41631 74828 75416 108181 90942 40706 3800 -1806 27714
7868B7714M9590l1421j4305J821j2553Q988K5033L0523p389P593j6856j4255k0020
$$ 27714 77304 45883 31578 33399 20846 29834 54867 85390 78001 85594 68738 54483 34463
7855C4463J2087j857l1779k4594J9975J7826n264N655q154p33J5075J3484K3930
$$ 34463 46550 44693 12914 -11680 8295 26121 20857 26512 18358 17625 32700 46184 70114
7842G0114j5780q752k9700O498j0413o751M494p066q935k7897j0981J5610J7071
$$ 70114 54334 45582 15882 22380 11967 5216 9710 2644 -6291 -34188 -45169 -29559 -12488
7829a2488L87m147k3143K443J3311K3229J4706l946P818J7704j072m361P548L8802
$$ -12488 -12101 -16248 -39391 -36948 -23637 -408 14298 10352 18170 35874 34802 30441 37989 76791
7815G6791j2800k9181N550j6626J915N567r760J424l751L9701O223k3801M126
$$ 76791 63991 34810 40360 23734 25649 31216 21456 22880 19129 58830 65053 41252 45378
7802D5378k6392J1412J7122k202l024Q336M414m1134N503K1962N537n76J2717
$$ 45378 18986 30398 47520 45318 42294 50630 55044 13910 19413 41375 46912 46336 59053
7789E9053j7097j2355o547o767l703m579L1334R458l6078L170m048K977K3784
$$ 59053 41956 29601 23054 16287 12584 8005 39339 48797 12719 15889 11841 14818 38602
7776C8602q657K123m447J4537N798l1770l0329J2524J8603Q42J5631K91O095M494
$$ 38602 29945 32068 27621 42158 47956 16186 -14143 -1619 16984 17826 33457 33748 39843 44337
7762D4337o798l2518J1627K9904o148r076k5451k2480J1154J8313j1461k1466
$$ 44337 37539 5021 16648 46552 40404 31328 5877 -16603 -5449 12864 1403 -20063
7750b0063l0760N796M5196J7661M911P691J154M821k395r081k2432j1808P466
$$ -20063 -50823 -45027 169 17830 22741 30432 31586 36407 34012 24931 2499 -9309 -1843
7737a843p105J1958Q27J0357m299P935m302j7769m0953O140O273M8376R731r12
$$ -1843 -8948 3010 3837 14194 9895 17830 13528 -4241 -45194 -39054 -32781 15595 25326 24414
7723B4414O971J1039K743k4963j8583M624K3223L4244J2048j3465o4543m3902
$$ 24414 31385 42424 45167 20204 1621 6245 29468 63712 75760 62295 -2248 -46150
7711d6150K4696L6897Q25Q655k9955j8573k2601K1757N7185K936k2282k7574o045
$$ -46150 -21454 15443 16268 24923 -5032 -23605 -46206 -24449 32736 35672 13390 -14184 -20229
7698b0229J3651L2287J9169p911k0056k0305k7602L2434J4416k715j0807J7910
$$ -20229 -6578 25709 44878 36967 16911 -3394 -30996 1438 15854 13139 2332 20242
7686B0242J3634k0482P605J272K1001J2403l5662J3201j6287j963J6436j8017
$$ 20242 33876 13394 20999 22271 43272 55675 20013 33214 16927 14964 31400 13383
7674A3383k350R969j0739J1974O254o521J5874J152j1312m5432j2495K9877M8988
$$ 13383 11033 21002 10263 22237 28491 21970 37844 38996 27684 -17748 -30243 -366 48622
7661D8622k4869j4552K8247j4110n9596K187J9029j3891l2761j8746p503J6575
$$ 48622 23753 9201 37448 23338 -36258 -34071 -15042 -28933 -61694 -80440 -87943 -71368
7649g1368J0194L2308K2940q822N758J7853J0728j9783N983j5378k7867K108K8019
$$ -71368 -61174 -28866 -5926 -14748 -8990 8863 19591 -192 5791 -9587 -37454 -35346 -7327
7636g327L4599q591j5581j664j1718j5037J5010J1593q003O984J2970N702j736
$$ -7327 27272 18681 3100 1436 -10282 -25319 -10309 1284 -6719 265 13235 18937 17201
7623A7201m0257j5645K7165N231l318k4262k1162J00j679k3615M9669q676k5492
$$ 17201 -23056 -38701 -11536 -6305 -9623 -33885 -55047 -54947 -56626 -80241 -30572 -39248 -64740
7610f4740K7481K5967Q120J3006K918M232K3114K8511J691m4964l1003k9868j8653
$$ -64740 -37259 -11292 -3172 9834 12752 16984 40098 68609 70300 25336 -5667 -35535 -54188
7597e4188J770N723o09k142K447K6917J8830l5679K5917J9786j3263Q691J2669
$$ -54188 -52418 -46695 -47304 -49446 -46999 -20082 -1252 -36931 -11014 8772 -4491 4200 16869
7584A6869K0354M678k380m801J1164J83l0524l4430j1730K2492J3273n930k0383
$$ 16869 37223 41901 39521 34720 45884 46067 15543 -18887 -30617 -8125 5148 -782 -21165
7571b1165J8306O686k3185l0349J972J3179J4785K2537j4270k0757K1530J7366
$$ -21165 -2859 3827 -19358 -49707 -47735 -34556 -19771 2766 -11504 -32261 -10731 6635
7559F635k39j8974m954K5574O77J6413l4759j378J2648J900J75J491j1479r599
$$ 6635 6396 -12578 -17532 8042 8719 25132 -9627 -11005 1643 3543 3718 5209 -6270 -15869
7545a5869O303k6485M0003L5237j1912J3450L1458Q426k4641l3198J018j0200
$$ -15869 -9566 -36051 3952 39189 27277 40727 72185 80611 55970 22772 23790 13590
7533A3590j585j8030R567K7795n349j6307k17j5306M776N5078m927m5062j8284
$$ 13590 12005 -6025 3542 31337 25988 9681 9464 -5842 -1066 54012 49085 4023 -14261
7520a4261K6533m131j5469K1586n331k9304j8689K974O88R291j0915K4015J3134
$$ -14261 12272 8141 -7328 14258 8927 -20377 -39066 -36092 -35404 -26113 -37028 -13013 121
7507A21M0863J5193k0867j8785p041J5667J426M443j530K309k1716j6278R745
$$ 121 40984 56177 35310 16525 9484 25151 26577 31020 29490 31799 10083 -6195 3550
7494C550N4187J3580r824n102m0296k3162J0757m508j2147K447K3114K852j0799
$$ 3550 57737 71317 61493 56391 16095 -7067 3690 -818 -12965 -10518 12596 15448 4649
7481D649K9746Q278k0060l4699m059M3580K6290l2799J2212Q655k3386k8357j0676
$$ 4649 34395 42673 22613 -12086 -16145 27435 53725 20926 33138 41793 18407 -9950 -20626
7468b0626M6225N426k1907k0881k4222o754k697j9136K9341J4994L6261N152l578
$$ -20626 25599 31025 9118 -11763 -35985 -42739 -45436 -64572 -35231 -20237 16024 21176 17598
7455A7598J2304k4539N489M904j6095R937n597j8968J6897O061k6412M653J9921
$$ 17598 29902 5363 10852 15756 -339 9598 4001 -14967 1930 7991 -18421 -13768 6153
7442F153k7139k8242K9672K2708k2134q944j447J5238K0701K3898Q830J7852j103
$$ 6153 -20986 -49228 -19556 3152 -18982 -27926 -29373 -14135 6566 30464 39294 57146 56043
7429E6043l4194k4881p150J1917k7912Q46l446k471M304L6932K1266l6010k7212
$$ 56043 21849 -3032 -10182 1735 -26177 -25331 -28777 -31248 -26944 9988 31254 -4756 -31968
7416c1968K7425J3295P590Q894J5765k1285O908q382j3805J2266P013j7115k9662
$$ -31968 -4543 8752 16342 25236 41001 19716 26624 18242 4437 16703 23716 6601 -23061
7403b3061q49J7380p961L5340M43j5736k52j3233l8352j792J5098K0097N6973
$$ -23061 -23910 -6530 -14491 20849 21292 5556 5304 -7929 -46281 -48073 -32975 -12878 44095
7390D4095j3933l7709K344l1914q047M419J5028J2133N974q863n481j2984j8804
$$ 44095 30162 -7547 -5203 -37117 -45164 -40745 -25717 -13584 -7610 -16473 -21954 -34938 -53742
7377e3742j6476O323k6077J7549L4225o189l603m649K9346L6001J2333j1588L194
$$ -53742 -70218 -63895 -89972 -72423 -38198 -44387 -47990 -52639 -23293 12708 25041 13453 16647
7364A6647J0610K4621j6916j8716j5683j8311K0439k4042j0368K5605J9581q872
$$ 16647 27257 51878 34962 16246 563 -17748 2691 -21351 -31719 -6114 13467 4595
7352D595k2505j0288K0234l1558j5822j948J7821L7514K2570j7361l8288l853
$$ 4595 -17910 -28198 -7964 -39522 -55344 -57292 -39471 -1957 20613 3252 -35036 -38889
7340c8889Q437J7407q992m002R510k1168n718j802K0236j1063k5884j0795K4108
$$ -38889 -30452 -13045 -22037 -26039 -16529 -37697 -43415 -45217 -24981 -36044 -61928 -72723 -48615
7327d8615K3655J6762n82J4815m127J8422m3905j9508k7226L885l065j2732J2643
$$ -48615 -24960 -8198 -8780 6035 1908 20330 -23575 -43083 -70309 -66424 -69489 -82221 -69578
7314f9578L9948L5959J3328l3838k979L1240K9579j1205m123J3135l9359l1976
$$ -69578 -29630 6329 19657 -14181 -17160 14080 43659 32454 28331 41466 2107 -29869
7302b9869n665K1404K0048j0328k8638O944j828K1202N113j7835J0674J2900l000
$$ -29869 -35534 -14130 5918 -4410 -33048 -26104 -27932 -6730 -1617 -19452 -8778 4122 1122
7289A122q34L249J7571p24k4988j6172k315K0083J3261l3701l4983Q946K0970
$$ 1122 288 3537 21108 20384 -4604 -20776 -23091 -3008 10253 -23448 -58431 -49485 -28515
7276b8515j0931n0248O415N5284K4337L1712R626l5083l2843N301P858J7248K2965
$$ -28515 -39446 -89694 -83279 -27995 -3658 28054 37680 2597 -30246 -24945 -17087 161 23126
7263B3126J3085l3514m0109j1733J2994K7145l650O437J8007J4140q850N955n741
$$ 23126 36211 2697 -37412 -49145 -36151 -9006 -12656 -6219 11788 25928 17078 23033 17292
7250A7292n5804J4546J0375K0403L3114o166l9678P001j343n1060m103K3646l433
$$ 17292 -38512 -23966 -13591 6812 39926 33760 -5918 1083 -260 -51320 -55423 -31777 -35210
7237c5210M3703J4360k624O932K980j7170k9326j7473K4958K6253Q00j0936k1527
$$ -35210 8493 22853 20229 27161 30141 12971 -16355 -33828 -8870 17383 18183 7247 -14280
7224a4280L136J106k5766M632M1583M2826l0429j2918k2780M44K1563j4873j3782
$$ -14280 -11144 -10038 -35804 -31172 10411 53237 22808 9890 -12890 -12446 9117 -5756 -19538
7211a9538J3120J2018j2012k897P224k1009k2588k514J4573K1215o80M394J7225
$$ -19538 -6418 5600 -6412 -9309 -2085 -23094 -45682 -48196 -33623 -12408 -13088 -8694 8531
7198H531j9751j0640j412K2105r497N091p348l0174r258K2752L9163p12k5986
$$ 8531 -11220 -21860 -23272 -1167 -10664 -5573 -12921 -43095 -52353 -29601 9562 8850 -17136
7185a7136l33m153l2133J1047O930J4070q141J4437M380j6963P565O562Q220j1018
$$ -17136 -17469 -21622 -53755 -42708 -35778 -21708 -29849 -15412 -11032 -27995 -20430 -13868 -5648 -16666
7171a6666P123J0268j157R639J9467p215j4744o296j9605J1944J3482K095L5299
$$ -16666 -9543 725 -432 9207 28674 21459 6715 419 -19186 -7242 6240 8335 43634
7158D3634O203r876J0616L1115K6398j6902m8012k2185j56J4456J5864N716l040
$$ 43634 49837 39961 50577 81692 108090 91188 43176 20991 20835 35291 51155 56871 53831
7145E3831m2q171p559r874Q216j1136j0133m5703l3365m013J7626p981J3897J7617
$$ 53831 53789 45618 38059 28185 36401 25265 15132 -30571 -63936 -67949 -50323 -58304 -44407 -26790
7131b6790p837n1301K8645M6175M3396r203m3704m462L4996J7903K4487J5644
$$ -26790 -34627 -85928 -57283 -11108 32288 23085 -20619 -25081 9915 27818 52305 67949
7119F7949K601l3063k6696m937J0752k265q846J1773J7303J3293j0627m667j9228
$$ 67949 70550 37487 10791 5854 16606 14341 5495 17268 34571 47864 37237 32570 13342
7106A3342l0041m417J3322q734K690n992K5962J5334R791m0077k0750N579L098
$$ 13342 -16699 -21116 -7794 -16528 -13838 -19830 6132 21466 31257 -8820 -29570 -23991 -20893
7093b0893n121M9597J7012k2695J2520J1828k9347k2332J2375J9130J5538l2377
$$ -20893 -26014 23583 40595 17900 30420 42248 12901 -9431 2944 22074 37612 5235
7081E235R646R487j6576j3291j2725K1295j3204K206J9638N622R959q595m3483
$$ 5235 14881 24368 7792 -5499 -18224 3071 -10133 -7927 11711 17333 27292 18697 -24786
7068b4786l1779l826K4492K0278K5022k07J0531k9756J7217L9807j3450j0554
$$ -24786 -56565 -60391 -35899 -15621 9401 9194 19725 -10031 7186 46993 33543 22989
7056B2989j8681p797j4561j929j2867N137J0839K2086J274k5305l8141j9765j7936
$$ 22989 4308 -3489 -18050 -19979 -32846 -27709 -16870 5216 6490 -18815 -56956 -76721 -94657
7043i4657K0946L1254K3580L5312J9855J3310k604k3185j9084j6819J1216J6093
$$ -94657 -73711 -42457 -18877 16435 36290 49600 46996 23811 4727 -12092 -876 15217
7031A5217L325N000j5588k5662p861N13J2770j2556O769K7088R919L1178k5720
$$ 15217 18542 23542 7954 -17708 -25569 -25056 -12286 -24842 -18073 9015 18934 50112 24392
7018B4392j4042n799p011N84k1753j9616m58K3118N258j9111l0012K2205L1522
$$ 24392 10350 4551 -2460 -1876 -23629 -43245 -43703 -20585 -15327 -34438 -64450 -42245 -10723
7005a0723J8869k695p387K2593m76j7833R828Q652q013J1767J6722q841o117k058
$$ -10723 8146 5451 -1936 20657 20181 2348 12176 20828 12815 24582 41304 32463 26346 24288
6991B4288J4703J2129q793j2719l5965J107l951m0492k4014Q871N1097K6938K7983
$$ 24288 38991 51120 42327 29608 -6357 -5250 -9201 -49693 -73707 -64836 -13739 13199 41182
6978D1182l0363j7987K4187P288j514J1187m1244j7084l253L230J0504J6864l044
$$ 41182 10819 -7168 17019 24307 22793 33980 -7264 -24348 -27601 -24371 -13867 2997 -47
6965d7k3686J5865K3525O365N497K3109j6985q191q380l1363P187j0115o079N328
$$ -47 -23733 -7868 15657 22022 27519 50628 33643 25452 17072 -14291 -7104 -17219 -23298 -17970
6951a7970o026k99Q00K8651k9717m3904J4470L0703o884r685p773n915K8938P386
$$ -17970 -23996 -24295 -23495 5156 -24561 -68465 -53995 -23292 -30176 -39861 -47634 -53549 -24611 -17225
6937a7225j359K9858L0647p450p682j7742l6899K4132J1343K063K5112k674m2659
$$ -17225 -18584 11274 41921 34471 26789 9047 -27852 -3720 7623 9686 34798 32124 -10535
6924a0535l4410r797K4794K507J4959J2451m736k0491j2077j1939J9812K9588
$$ -10535 -44945 -54742 -29948 -27441 -12482 -31 -4767 -25258 -37335 -49274 -29462 126
6912A26J7000P688j0872N787J0352m706j3271J2522J860k7712j8864P655l1490
$$ 126 17126 24814 13942 19729 30081 25375 12104 24626 26486 -1226 -20090 -12435 -43925
6899d3925J9211K3841K498K1533O476m820n1961k0164O325J0148K644j1813Q017
$$ -43925 -24714 -873 1625 23158 29634 24814 -27147 -47311 -40986 -30838 -28194 -40007 -31990
6886c1990L3250K5258j4917j7995K5636K9797J9254l2594k0568k387m673j1663
$$ -31990 1260 26518 11601 -6394 19242 49039 68293 35699 15131 12744 8071 -3592
6874c592L806r312r776Q159j2116L169M4250K1971k7459L191k959l7626l3071
$$ -3592 214 -9098 -18874 -10715 -22831 -19662 24588 46559 19100 22291 19332 -18294 -51365
6861e1365J3207k529K6998L5095k1596k4179k0417k12K1935J0825j3158O373m357
$$ -51365 -38158 -40687 -13689 21406 -190 -24369 -44786 -44998 -23063 -12238 -25396 -19023 -23380
6848b3380k2740q844j5374n046M0728L7298K0560k2766N511m437j0822J7227n870
$$ -23380 -46120 -54964 -70338 -75384 -34656 2642 23202 436 5947 1510 -9312 7915 2045
6835B045m0675k1243J0131J8094j30j9208K7866J6024J3630j8518n274K3345K4029
$$ 2045 -38630 -59873 -49742 -31648 -31778 -50986 -23120 -7096 6534 -11984 -17258 6087 30116
6822C0116j1126k7022j2797k1731j5987L6128Q025m96J5745l728k2299Q386o083
$$ 30116 18990 -8032 -20829 -42560 -58547 -22419 -14394 -14890 855 -2873 -25172 -16786 -22869
6809b2869l035r454L763J2554j0816k290l140J3926J3579J8348O858j0252n3483
$$ -22869 -25904 -35358 -31595 -19041 -29857 -32147 -35287 -21361 -7782 10566 17424 7172 -46311
6796d6311k866M9717L4032R230J8352k06R809q297k0250K3322j7972m2869l1328
$$ -46311 -49177 540 34572 43802 62154 61948 71757 63460 43210 66532 48560 5691 -25637
6783b5637J7922K9384j4743q945l0011J2293J483K0181n3j7090j744J4409J0776
$$ -25637 -7715 21669 6926 -2019 -32030 -19737 -18254 1927 1874 -15216 -16960 -2551 8225
6770H225l6449q849L8424N834r772k893J8614k1284m2229J1319Q965K5446J4446
$$ 8225 -28224 -37073 1351 7185 -2587 -5480 13134 -8150 -50379 -39060 -30095 -4649 9797
6757I797j8483j1021J7935j0834j1042J3771j1387j4452K3996o716o14J5095l892
$$ 9797 -8686 -19707 -1772 -12606 -23648 -9877 -21264 -35716 -11720 -18436 -19050 -3955 -7847
6744g847l508m18L787L452J0096k1347j4638R21M6731K5818j3613j0599J6206
$$ -7847 -11355 -11773 -7986 -4534 5562 -15785 -30423 -29502 17229 43047 29434 18835 35041
6731C5041Q425K2684l2876l5462J1425M0448J4993M5164M3776O5463L2759m338
$$ 35041 43466 66150 33274 -2188 9237 49685 64678 109842 153618 219081 251840 247502
6719B47502j4089m0222p2177k9053p506n4553j8049P778j6391k4727m000J2882
$$ 247502 233413 193191 121014 91961 84455 29902 11853 19631 3240 -21487 -25487 -12605
6707a2605K6795k8889j7825J0607j0181j0547O13L4463L2491j5793k1091Q376
$$ -12605 14190 -14699 -32524 -21917 -32098 -42645 -42032 -7569 24922 9129 -11962 -3586
6695c586J3096J1802k681k9112j8643M2521J5809j2351p978J020J6015K1066K2905
$$ -3586 9510 21312 18631 -10481 -29124 13397 29206 16855 8877 9897 25912 46978 69883
6682F9883j8558l3714j8747J255j6089J1435o593q084P900K2302m643j5519n673
$$ 69883 51325 17611 -1136 119 -15970 -4535 -11128 -19212 -11312 10990 6347 -9172 -14845
6669a4845K2494R658O114q347j5346j3093K9949J2170O197L445k7654J0038r858
$$ -14845 7649 17307 23421 15074 -272 -13365 16584 28754 34951 38396 10742 20780 10922
6656A0922k7148k8085L1357L1807J7177J2653j3652j6682j1421K0254j8896J2129
$$ 10922 -16226 -44311 -12954 18853 36030 48683 35031 18349 6928 27182 8286 20415
6644B0415L259k8692K85K2845l875O77J3149K535j0109K2523J1731k6574j6775
$$ 20415 23674 -5018 -4733 18112 14237 14914 28063 30598 20489 43012 54743 28169 11394
6631A1394l5916K360r384K983J4734n213j6440k1930k500L094K5342K804N928
$$ 11394 -24522 -22162 -31546 -28563 -13829 -19042 -35482 -57412 -59912 -56818 -31476 -28672 -22744
6618b2744o361O773j927M183J3164q394M19Q851j9954N068M1605n476m3968J0368
$$ -22744 -29105 -22332 -24259 -20076 -6912 -15306 -14887 -6036 -25990 -20922 20683 15207 -28761 -18393
6604a8393O22j9959J2791K6391P136L763l30k2918K475P278o431j5637j0548j3833
$$ -18393 -17771 -37730 -24939 1452 8588 12351 12021 -10897 -8422 -1144 -7575 -23212 -33760 -47593
6590d7593R437K8165m217k1575j2252j5434q895l366M3749L9596j8417j5202J3115
$$ -47593 -38156 -9991 -14208 -35783 -48035 -63469 -72364 -75730 -31981 7615 -10802 -26004 -12889
6577a2889J5200J2379K890j3540j9902r504K2307K5347k0416j8262j541J8022
$$ -12889 2311 14690 17580 4040 -15862 -25366 -3059 22288 1872 -16390 -17931 91
6565I1q509j2882j709L377L326j183n601R845k3047R65L79L436J5724J579q851
$$ 91 -8418 -21300 -23009 -19632 -16306 -17489 -23090 -13245 -36292 -35327 -34948 -31512 -15788 -14209 -23060
6550b3060j7207j7058K9902M2663q165j9742q702o368o813J5091O623k3269k5962
$$ -23060 -40267 -57325 -27423 15240 7075 -12667 -21369 -27737 -34550 -19459 -12836 -36105 -62067
6537f2067J2685K3532P263J0717K7811K8896k4046k6895j1616l6408J0056P139
$$ -62067 -49382 -25850 -18587 -7870 19941 48837 24791 -2104 -13720 -50128 -40072 -32933
6525c2933l38J1941J1962K3711M942J5544q97j8661j5252p209J3665L87j6144
$$ -32933 -33271 -21330 -9368 14343 19285 34829 33932 15271 19 -7190 6475 6862 -9282
6512i282l3505M013J8524L2167p786p32L4366k281j5070n9m957k4077k5573k553
$$ -9282 -42787 -38774 -20250 11917 4131 3399 37765 35484 20414 20355 15398 -8679 -34252 -36805
6498c6805J3261Q221o699K759P124J8286O927Q323L3130k934l2503L894p428p361
$$ -36805 -23544 -15323 -22022 -19263 -12139 6147 13074 21397 54527 51593 19090 22984 15556 8195
6484H195k8693K9136L5637p761l2364j3664J0957r540o760L434J4649j6622L469
$$ 8195 -20498 8638 44275 36514 4150 -9514 1443 -8097 -14857 -11423 3226 -13396 -9927
6471i927K2793J5478M143Q64L864m355q48J7848l5258l3323l0854R81K6819J4126
$$ -9927 12866 28344 32487 33351 37215 32860 32012 49860 14602 -18721 -49575 -48594 -21775 -7649
6457g649n571l41j44M075J417J1707p721O670J2808n441j6838l044j8463j6664
$$ -7649 -13220 -13561 -13705 -9630 -8213 3494 -4227 2443 15251 9810 -7028 -10072 -28535 -45199
6443d5199j7774K7798J6336M348j1110K110K1733K7546q371m4823J525K5999q753
$$ -45199 -62973 -35175 -18839 -14491 -25601 -23491 -1758 25788 17417 -27406 -25881 118 -8635
6430h635J5956K1761l3872k2179K4778N104P108k5427Q799L156j4558N55L327
$$ -8635 7321 29082 -4790 -26969 -2191 2913 10021 -15406 -6607 -3451 -18009 -17454 -14127
6417a4127N109J0935k4465K4330n248l1563j1861J089j1039J1917J8758L4424
$$ -14127 -9018 1917 -22548 1782 -3466 -35029 -46890 -45801 -56840 -44923 -26165 8259
6405H259k4249l6318M125l278r206j7105L491L630L9780r321K5509K9581J2004
$$ 8259 -15990 -52308 -48183 -51461 -60667 -77772 -74281 -70651 -30871 -40192 -14683 14898 26902
6392B6902m850l505J2374M449L1850J5330l4190m9969J1247M8989j5424n638l4215
$$ 26902 22052 18547 30921 35370 67220 82550 48360 -1609 9638 58627 43203 37565 3350
6379C350j5292l0064K59J1246M1275k806m8524j5597J5374P190l143j8875J3102
$$ 3350 -11942 -42006 -41747 -30501 10774 7968 -40556 -56153 -40779 -33589 -36732 -55607 -42505
6366d2505K6043L1001J0238J1256k5518M267M183L189j7763l9579j9567j1923
$$ -42505 -16462 14539 24777 36033 10515 14782 18965 22154 4391 -35188 -54755 -66678
6354f6678Q604l307J0773L7372L2919L0749q793k8193k0648l201j4439L535J9092
$$ -66678 -58074 -61381 -50608 -13236 19683 50432 41639 13446 -7202 -10403 -24842 -21307 -2215
6341b215j6794l257j4425K3772N657k2852l0793o651J9040L4073J3746N269K5430
$$ -2215 -19009 -22266 -36691 -12919 -7262 -30114 -60907 -67558 -48518 -14445 -699 4570 30000
6328C0000j3581J2331k8479J7821Q093l3349j3903K802k1447l6814L3221L2597
$$ 30000 16419 28750 271 18092 26185 -7164 -21067 -18265 -39712 -76526 -43305 -10708
6316a0708N644j8001j5118K3557k0605l5003K148N0657J4955p214j0928l0625
$$ -10708 -5064 -23065 -38183 -14626 -35231 -70234 -68086 -17429 -2474 -9688 -20616 -51241
6304e1241l7242J0602m597k706K1946J1367J5400k691K9857L0073n998J25P110
$$ -51241 -88483 -77881 -82478 -85184 -63238 -51871 -36471 -39162 -9305 20768 14770 14895 22005
6291B2005m211j4273j8366m758J3060L5012K744j4034k3044j9831m2562J9177
$$ 22005 17794 3521 -14845 -19603 -6543 28469 31213 17179 -5865 -25696 -68258 -49081
6279d9081K4376J2265o786j3268L4282J7605j1984J2526K914j4531M111j508N957
$$ -49081 -24705 -12440 -19226 -32494 1788 19393 7409 19935 22849 8318 12429 10921 16878
6266A6878J4035n515N127r785k6940k1851J9567n5J067K7565J3280m2531j9755
$$ 16878 30913 25398 30525 20740 -6200 -28051 -8484 -8539 -7472 20093 33373 -9158 -28913
6253b8913K3749J6290p668N096L1705j5845m8101j5093k2944J89J4761K3030Q248
$$ -28913 -5164 11126 3458 8554 40259 24414 -23687 -38780 -61724 -61535 -46774 -23744 -15496
6240a5496J1825P721n1620r356M059j707k727M189J8726M0126J2345n201r212
$$ -15496 -3671 4050 -47570 -56926 -52867 -54574 -57301 -53112 -34386 5740 18085 12884 3672
6227C672R009k5852k1365J6151k665J1565J2537N771k540J1829J2795l0286n927
$$ 3672 12681 -13171 -34536 -18385 -21050 -9485 3052 8823 6283 18112 30907 621 -5306
6214e306k5642j357J3816L9144j7944r661k1811J1168J1223J3095k055j2037J520
$$ -5306 -30948 -32305 -18489 20655 2711 -6950 -28761 -17593 -6370 6725 4670 -7367 -5847
6201e847r362K6060M319j1353j8393Q903Q690Q616N656k4689o077K758k515k0948
$$ -5847 -15209 10851 15170 3817 -14576 -5673 3017 11633 17289 -7400 -13477 -10719 -13234 -34182
6187c4182O368M023O46k1086J535J5595K0507j2300k1391K3505L1528K7406j2398
$$ -34182 -27814 -23791 -23145 -44231 -42696 -27101 -6594 -18894 -40285 -16780 14748 42154 29756
6174B9756j5753j3157j3754r729q250K3212O726J3601R756J675J361M505k0616
$$ 29756 14003 846 -12908 -22637 -30887 -7675 -949 12652 22408 24083 25444 29949 9333
6161I333j3809k7502l1840M3780J7071m8881k3662J681K5683K4949J5480j58k3153
$$ 9333 -4476 -31978 -63818 -20038 -2967 -51848 -75510 -73829 -48146 -23197 -7717 -7875 -31028
6148c1028K4456J2736k2417j0221K0588L429k7907k6477J0433J1759O837O517
$$ -31028 -6572 6164 -16253 -26474 -5886 -2457 -30364 -56841 -46408 -34649 -27812 -21295
6136b1295m31l0444k6538K2708M2239K2641K1718o445l1573n095j2021N855j9070
$$ -21295 -21726 -52170 -78708 -56000 -13761 8880 30598 24153 -7420 -12515 -24536 -18681 -37751
6123c7751l173j8440J1741L2512J5090L058j7411j9996K4222J4560K0835J8642
$$ -37751 -40924 -59364 -47623 -15111 -21 3037 -14374 -34370 -10148 4412 25247 43889
6111D3889k5988k8682n218J1825j746J933Q761J3699L010l7040j5972m463J0793
$$ 43889 17901 -10781 -15999 -4174 -5920 -3987 4774 18473 21483 -15557 -31529 -35992 -25199
6098b5199O208J2462K651n896J652j3086J7077L2401k4341l2310P93J2159K2691
$$ -25199 -18991 -6529 -3878 -9774 -8122 -21208 -4131 28270 3929 -28381 -27588 -15429 7262
6085G262q049k0635O523J2626j2829k1701N105K8888P866j6246j9199K2949K8083
$$ 7262 -787 -21422 -14899 -2273 -15102 -36803 -31698 -2810 5056 -11190 -30389 -7440 20643
6072B0643o725l8061l5960l140L8317J1520j0360o481p406k761k167L064J800
$$ 20643 13918 -24143 -60103 -63243 -24926 -13406 -23766 -30247 -37653 -40414 -42581 -39517 -37717
6059c7717N5347R55j6404J024K7906Q183k713L05k1766j2333J9356K2463K246
$$ -37717 17630 18585 2181 3205 31111 39294 36581 36886 15120 2787 22143 44606 46852
6046D6852k1581o534k898k9467J8189J9565k3686l0117j4800k8201O265L0311
$$ 46852 25271 18737 15839 -13628 4561 24126 440 -29677 -44477 -72678 -66413 -36102
6034c6102L1635o337k7553k0104j442Q341J7675j5390K2844K1526r613q204Q571
$$ -36102 -4467 -10804 -38357 -58461 -59903 -51562 -33887 -49277 -26433 -4907 -14520 -22724 -14153
6021a4153J3299J5617M17J6863n034o5289j0524j1759L3952K6380J5197K1905
$$ -14153 -854 14763 15180 32043 27009 -38280 -48804 -60563 -26611 -231 14966 36871
6009C6871m340l3191j881q92J2654k8424k9884J0457K1944J4276l7671J8082K8893
$$ 36871 32531 -660 -2541 -3433 9221 -19203 -49087 -38630 -16686 -2410 -40081 -21999 6894
5996F894L4855J4794O0p724J0661J8477o964l0784L241l422j7809R805L776j6562
$$ 6894 41749 56543 56603 48879 59540 78017 71053 40269 43510 40088 22279 32084 35860 19298
5982A9298k0035m237j372q235j3906q964K083L1994J6950R908p074O539n768J254
$$ 19298 -737 -4974 -6346 -14581 -28487 -37451 -35368 -3374 13576 23484 16410 22949 17181 18435
5968A8435l0175j5203n021o71k761N025K4849O806K0045k314j2541J2506K265
$$ 18435 -11740 -26943 -31964 -32635 -35396 -30371 -5522 1284 21329 19015 6474 18980 21245
5955B1245m695l1751j2670o238K0235j0057M355K5907n865n516J9799J3070k8817
$$ 21245 16550 -15201 -27871 -34109 -13874 -23931 -19576 6331 466 -5050 14749 27819 -998
5942i98j6434j5051J5261P630J487J1007j4767k9194J5419K8404k3177k2042j3399
$$ -998 -17432 -32483 -17222 -9592 -8105 2902 -11865 -41059 -25640 2764 -20413 -42455 -55854
5929e5854j0147q074j0764n600L4414L9292l5003Q940K1695L0820o892l013J213
$$ -55854 -66001 -74075 -84839 -90439 -56025 -16733 -51736 -42796 -21101 9719 2827 -186 1027
5916A027K0212k5672j1050K0387J0929j099k259m781J0369K9923k5233j7931k3942
$$ 1027 21239 -4433 -15483 4904 15833 14734 12475 7694 18063 47986 22753 4822 -19120
5903a9120k4775J4436p634P244L0327K2243j3736j9649l2952J1885k9438J256
$$ -19120 -43895 -29459 -37093 -29849 478 22721 8985 -10664 -43616 -31731 -61169 -59913
5891e9913L8128M8281K4938J138J2025k0987k3110p800p746l586K2777N2080k0966
$$ -59913 -21785 26496 51434 52572 64597 43610 20500 12700 4954 1368 24145 76225 55259
5878E5259q717R186o184o994k8435q748J7223k1323p312j2906l049j4107k5788
$$ 55259 46542 55728 49544 42550 14115 5367 22590 1267 -6045 -18951 -22000 -36107 -61895
5865f1895J4473J5870J0877l594k4J4675k0439p026M4328J3892m2954j8213K0192
$$ -61895 -47422 -31552 -20675 -24269 -24293 -9618 -30057 -37083 7245 21137 -21817 -40030 -19838
5852a9838p738J2744Q522K3678k513m3798k9616K0955N0048P846j7829j4161k1524
$$ -19838 -27576 -14832 -6310 17368 14855 -28943 -58559 -37604 12444 20290 2461 -11700 -33224
5839c3224J8618J4848l362k6817j4552K7362J0973K765l763J1911Q00P267M2165
$$ -33224 -14606 242 -3120 -29937 -44489 -17127 -6154 -3389 -7152 4759 5559 12826 54991
5826E4991J6489J6974l8014l9454k513M655k1523j3281O835j2284JJ899J067m48
$$ 54991 71480 88454 50440 10986 8473 13128 -8395 -21676 -14841 -27125 -27124 -25225 -24158 -24606
5812b4606K1670k5420m4564K6166m909Q316K3534L702L5889J5879J4611j0325
$$ -24606 -2936 -28356 -72920 -46754 -51663 -43347 -19813 -16111 19778 35657 50268 39943
5800C9943k5382k3504J7341P695K362K0073J9763q7k1820k5913j5263K0568N628
$$ 39943 14561 -8943 8398 16093 18455 38528 58291 58204 36384 10471 -4792 15776 21404
5787B1404q340m305j3126L883J5958P081k4686l916j4960o331J3794J2565j6209
$$ 21404 13064 8759 -4367 -484 15474 22555 -2131 -6047 -21007 -27338 -13544 -979 -17188
5774a7188l387J9973K1720J3267j5131K745k40k092l0078J4781o304n162j70N563
$$ -17188 -20575 -602 21118 34385 19254 21999 21759 19667 -10411 4370 -1934 -7096 -7266 -1703
5760a703N003r02k7435J8695J1820n347j7619j8620j686K3596K1938K3472J2246
$$ -1703 3300 2398 -25037 -6342 5478 131 -17488 -36108 -37794 -14198 7740 31212 43458
5747D3458k8124j253L8417k060m3748l8941o690K31O377n471K212O847j5771j6302
$$ 43458 15334 14081 52498 50438 6690 -32251 -38941 -38710 -32333 -37804 -35592 -28745 -44516 -60818
5733f0818K0594K8127K1467J5625j9049P588J2684O290M6649o410m1062l3929
$$ -60818 -40224 -12097 9370 24995 5946 13534 26218 32508 79157 72747 31685 -2244
5721b244j8357J6369J2151Q136p375l3543l3633j3180j2836J6118R073L2707J8979
$$ -2244 -20601 -4232 7919 16055 8680 -24863 -58496 -71676 -84512 -68394 -59321 -26614 -7635
5708g635k3469L5552J3111l7292N13K1561k0407k728J889M16O248L251J7872J9547
$$ -7635 -31104 4448 17559 -19733 -19220 2341 -18066 -20794 -18905 -18489 -12241 -8990 8882 28429
5694B8429M626k4019m4795M968L0686l698Q523J2026J1216k3323J2448k4581j4669
$$ 28429 33055 9036 -35759 -30791 -105 -3803 4720 16746 27962 4639 17087 -7494 -22163
5681b2163Q775L249N43k7162M938J4036j9462n90n367q564K1430J335J0211p072
$$ -22163 -13388 -10139 -9596 -36758 -31820 -17784 -37246 -37836 -43203 -51767 -30337 -29002 -18791 -25863
5667b5863L070K1857M0696k278j6597j2762m045M753j4008R58L2663j1982k4277
$$ -25863 -22793 -936 39760 37482 20885 8123 4078 8831 -5177 -4219 28444 16462 -7815
5654g815k4748K2759L8542n668l2900O446N581J9148L659j4374j9962k9458j3006
$$ -7815 -32563 -9804 28738 23070 -9830 -3384 2197 21345 25004 10630 -9332 -38790 -51796
5641e1796P798j3418K1517L0036J3427J0865j525K9073l6290k3558p931P470M847
$$ -51796 -43998 -57416 -35899 -5863 7564 18429 16904 45977 9687 -13871 -21802 -14332 -9485
5628i485j2294J1989J9347O89k091o125J8539J6990j257m5543J7648P892J620
$$ -9485 -21779 -9790 9557 10246 8155 2030 20569 37559 36302 -9241 8407 16299 17919
5615A7919k4859M482k694j2046L8681j97q808k4005k1659j3798m0221l70K2183
$$ 17919 -6940 -2458 -5152 -17198 21483 21286 12478 -11527 -33186 -46984 -87205 -87575 -65392
5602f5392J6626K1291J3114K3435J2681j0198J3888m406q685k9300q521K7556
$$ -65392 -48766 -27475 -14361 9074 21755 11557 25445 21039 12354 -16946 -25467 2089
5590B089j88k7382o807J5974J7646n303J1757Q287j9859m0024J3322p992L2401
$$ 2089 1901 -25481 -32288 -16314 1332 -3971 7786 16073 -3786 -43810 -30488 -38480 -6079
5577f079K937J2047n917l2847L3951J7622j1244n689L989k955j1606j2250q359
$$ -6079 -3142 8905 2988 -29859 4092 21714 10470 4781 8770 5815 -5791 -18041 -26400
5564b6400J2365J0308Q714j6249K1195j4995p065n467J0708j237M098J1641m2827
$$ -26400 -14035 -3727 4987 -11262 9933 -5062 -12127 -17594 -6886 -8123 -4025 7616 -35211
5551c5211m107K4894J9220J0963k8436J2256J5984l036o032o608J58l1201j3168
$$ -35211 -39318 -14424 4796 15759 -12677 -421 15563 12527 6495 -113 45 -31156 -44324
5538d4324K3728K4865J3481l6090k802l028j1556r997J5569m260k4543J0596O1064
$$ -44324 -20596 4269 17750 -18340 -21142 -24170 -35726 -45723 -30154 -34414 -58957 -48361 12703
5525A2703k5204k8214J348M489R052k7503L048K0133R900k0635r005J0147K5212
$$ 12703 -12501 -40715 -39367 -34878 -25826 -53329 -50281 -30148 -20248 -40883 -49888 -39741 -14529
5512a4529Q180P544K3633K5985k3483p84k7823K5905K3868n403l110k2108p273
$$ -14529 -6349 1195 24828 50813 27330 26546 -1277 24628 48496 43093 39983 17875 10602
5499A0602q863J4608l867j2038r813k5290J2671N904q765j3052K3634j2202M460
$$ 10602 1739 16347 12480 442 -9371 -34661 -21990 -16086 -24851 -37903 -14269 -26471 -22011
5486b2011q523K2438N2292j3777l7968k1289J3914K7926r142r489J5925L7569
$$ -22011 -30534 -8096 44196 30419 -7549 -28838 -14924 13002 3860 -5629 10296 47865
5474D7865J488l4415L595N141j8390l4416P491m2060J4768K5594k0674k1190J9079
$$ 47865 49353 14938 18533 23674 5284 -29132 -21641 -63701 -48933 -23339 -44013 -65203 -46124
5461d6124M2187L4032j8549k386k2k5466M244K7972j5375r135J1816K95J4294
$$ -46124 -3937 30095 11546 9160 9138 -16328 -12084 15888 513 -8622 3194 3489 17783
5448A7783J897N698j9128p987j8631q482j581J3383j712K3650K4592k286k479
$$ 17783 19680 25378 6250 -1737 -20368 -28850 -30431 -17048 -18760 4890 29482 27196 24717
5435B4717j6715l2903j553L166K0094J4143R794N011p249r596l1984K7975J7418
$$ 24717 8002 -24901 -26454 -23288 -3194 10949 20743 25754 18505 8909 -23075 4900 22318
5422B2318r179M481o140K212j1548P39r029K0853M859l4436l8143j852L8220L7667
$$ 22318 13139 17620 11480 13692 2144 2883 -6146 14707 19566 -14870 -53013 -54865 -16645 21022
5408B1022j6114l855j5525N085o756m835Q757l9750k4923K1752J9966j7332J7974
$$ 21022 4908 1053 -14472 -9387 -16143 -20978 -12221 -51971 -76894 -55142 -35176 -52508 -34534
5395c4534o177p224j587K759K9386L2384J1012j779q137J673Q917M086j0545N724
$$ -34534 -40711 -47935 -49522 -46763 -17377 15007 26019 24240 16103 17776 26693 30779 20234 25958
5381B5958j1954l5546n677J5957M883j3076K1397K0878j7181J2403K4406j5529
$$ 25958 14004 -21542 -27219 -11262 -6379 -19455 1942 22820 5639 18042 42448 26919
5369B6919j0857O494J4908K4266l353l6789l3578J3758n68P105j2190q83l6865
$$ 26919 16062 22556 37464 61730 58377 21588 -11990 1768 1200 8305 -3885 -4768 -41633
5356d1633k101K1770L4328K5876l724K3732N256k9063L865n0782o499N599m315
$$ -41633 -43734 -21964 12364 38240 34516 58248 63504 34441 38306 -12476 -18975 -13376 -17691
5343a7691k721L5194P987q720k363J213j250p216o031l163j5162r323Q803j6357
$$ -17691 -20412 14782 22769 14049 11686 12899 11649 4433 -1598 -4761 -19923 -29246 -20443 -36800
5329c6800q940J3563L282J5220P707k4862K9972j252o452N26J0951j9453j1543
$$ -36800 -45740 -32177 -28895 -13675 -5968 -30830 -858 -2110 -8562 -8036 2915 -16538 -28081
5316b8081k6770j7389L5604L1696p527j7001J3574K1284m75Q722J633J0019l587
$$ -28081 -54851 -72240 -36636 -4940 -12467 -29468 -15894 5390 4915 13637 15270 25289 21702
5303B1702k3804j5636n2899p424J8362P987p959K9459K4986N257l5604N201P854
$$ 21702 -2102 -17738 -70637 -78061 -59699 -51712 -59671 -30212 -5226 31 -35573 -30372 -22518
5290b2518o628M039q226q232K17j9940k468K0917r192J5092J0413k647j176O122
$$ -22518 -29146 -25107 -33333 -41565 -41348 -61288 -63756 -42839 -52031 -36939 -26526 -29173 -30349 -24227
5276b4227j3001k3857Q527J0773N222J1833j2301J2546L1176J3740l842l6475
$$ -24227 -37228 -61085 -52558 -41785 -36563 -24730 -37031 -24485 6691 20431 16589 -19886
5264a9886j1521P769n016j2668o897Q952K4744q765m5995k4326l015J7456K2600
$$ -19886 -31407 -23638 -28654 -41322 -48219 -39267 -14523 -23288 -69283 -93609 -96624 -79168 -56568
5251e6568M4065J3654j0117l6101j679L1810K6860P00n601M031j1144j4576l6363
$$ -56568 -12503 1151 -8966 -45067 -46746 -14936 11924 12624 7023 11054 -90 -14666 -51029
5238e1029q256j9917M081K2950O145J318K2534K3487l51q381J7461L2528o612
$$ -51029 -59285 -79202 -75121 -52171 -46026 -44708 -22174 1313 962 -7419 10042 42570 35958
5225C5958k2042k8368k0583K3285k399p392J4772q850Q141o185j0752L559j251
$$ 35958 13916 -14452 -35035 -11750 -14149 -21541 -6769 -15619 -7478 -13663 -24415 -20856 -22107
5212b2107J3577R422K2717m5333k1470J083o441M0915M0789k955l1175l7611j9516
$$ -22107 -8530 892 23609 -21724 -43194 -42111 -48552 -7637 33152 30197 -978 -38589 -58105
5199e8105K4907K9809L610o21m427j3125J880L08K8450M76l5491l2890L560L0087
$$ -58105 -33198 -3389 221 -400 -4827 -17952 -16072 -15764 12686 13162 -22329 -55219 -51659 -21572
5185b1572L574p469L021J2938N469J8565J2478L556k0143o591L6370j6170k9602
$$ -21572 -17998 -25467 -22446 -9508 -4039 14526 27004 30560 10417 3826 40196 24026 -5576
5172e576p590k327J545J4402P697j3427J6559J159j4822m527K2260N757k7837
$$ -5576 -13166 -15493 -13948 454 8151 -5276 11283 12442 -2380 -6907 15353 21110 -6727
5159f727J503k6829R754K401l7440J4869Q041j8488j3992N508R398J3955N23o9
$$ -6727 -5224 -32053 -22299 -19898 -57338 -42469 -34428 -52916 -66908 -61400 -52002 -38047 -37524 -37593
5145c7593K0057M872K1537K350k3055k8759K9063K1412M049P442j744j2070l9752
$$ -37593 -17536 -12664 8873 11223 -11832 -40591 -11528 9884 13933 21375 19631 7561 -32191
5132c2191k0110J8113J1917J4065o926l657J8515L142j9835k970r016k0295M729
$$ -32191 -52301 -34188 -22271 -8206 -15132 -18789 -274 2868 -16967 -19937 -28953 -49248 -44519
5119d4519P864Q679K2594L645K7008k668J0427o415P722j3410l4654J1931J9988
$$ -44519 -36655 -27976 -5382 -1737 25271 22603 33030 26615 34337 20927 -13727 -1796 18192
5106A8192K5710m108K23J1068R8k653j5177p356N264j9587j0608l333k0454n521
$$ 18192 43902 39794 40017 51085 51183 48530 33353 25997 31261 11674 1066 -2267 -22721 -28242
5092b8242o84L4888k8238m532j3385K3876J750L535L33P136l6334l1343J2403
$$ -28242 -28926 5962 -22276 -26808 -40193 -16317 -14567 -11032 -10699 -3563 -39897 -71240 -58837
5079e8837K1662K7986J3757j9961J1639k2992J3677P189J9986k848k2446O755
$$ -58837 -37175 -9189 4568 -15393 -3754 -26746 -13069 -5880 14106 11258 -11188 -4433
5067d433J5595j7161M433j4875N988j3368k8218J571P361J3530J4737J8785L73
$$ -4433 11162 -5999 -1566 -16441 -10453 -23821 -52039 -50468 -43107 -29577 -14840 3945 4318
5054D318j39J1588J7530J0202j9197j8321J580j1828j5197k360p573J6100K0020
$$ 4318 4179 15767 33297 43499 24302 5981 7561 -4267 -19464 -21824 -29397 -13297 6723
5041F723J842l285j2679K3346K4868m729M103j2868j0929M571J875j1209j776
$$ 6723 8565 5280 -7399 15947 40815 36086 40189 27321 16392 20963 22838 11629 9853
5028I853k8412m5953m547P827L1942M3210M682j2095j0589j766K3751j0421j8767
$$ 9853 -18559 -64512 -69059 -61232 -29290 13920 18602 6507 -4082 -5848 17903 7482 -11285
5015a1285k0203j8970J1588L24K77J3265M644o8k5714j8178J8903M942r677k0883
$$ -11285 -31488 -50458 -38870 -38546 -38269 -25004 -20360 -20428 -46142 -64320 -45417 -40475 -50152 -71035
5001g1035J9179J4779J519j9219K2880J8126o889Q792r414q37K7282m461l9371
$$ -71035 -51856 -37077 -35558 -54777 -31897 -13771 -20660 -11868 -21282 -22119 5163 702 -38669
4988c8669J4030J4383K4804n0336o621N575L003L5092j700l753O61J3474J0479
$$ -38669 -24639 -10256 14548 -35788 -42409 -36834 -33831 1261 -439 -4192 -3531 9943 20422
4975B0422j7421N271j5437l3252n022L0013K9937J1024O072l4803r594J3530N408
$$ 20422 3001 8272 -7165 -40417 -45439 -15426 14511 25535 31607 -3196 -12790 740 6148
4962F148L2405K1689K855m1996l7368l7193j8349K2366P932J3166K3335q64q691
$$ 6148 38553 60242 63097 21101 -16267 -53460 -71809 -49443 -41511 -28345 -5010 -5874 -14565
4949a4565N366J8811K0577P274l2323Q322l685k6936k611j7672Q952Q157j0106
$$ -14565 -9199 9612 30189 37463 5140 13462 9777 -17159 -19770 -37442 -28490 -20333 -30439
4936c0439j3729P345J5927o764J3009J0631J4584N856J9311J1329R443O104o060
$$ -30439 -44168 -36823 -20896 -27660 -14651 -4020 10564 16420 35731 47060 56503 62607 56547
4923E6547m7295l6507Q393K7328L9926M894l7584l0739N652M804R482r086j7475
$$ 56547 9252 -27255 -18862 8466 48392 53286 15702 -15037 -9385 -4581 4901 -4185 -21660
4910b1660M0431J5214l3461K6600J4080n544j4085j8064n088j311J1037j704o281
$$ -21660 18771 33985 524 27124 41204 35660 21575 3511 -1577 -2888 8149 6445 164
4897A64j9183J763J0292J5567j1560O154K2398j023l9337j2140L7465J9858k6879
$$ 164 -19019 -17256 -6964 8603 -2957 3197 25595 24572 -14765 -26905 10560 30418 3539
4884C539l0110o760o165j08J5530Q549J2889J8209j5636j3403J3585O673J6357
$$ 3539 -26571 -33331 -39496 -39604 -24074 -15525 -2636 15573 -63 -13466 119 6792 23149
4871B3149q409P391l668l3831J309j665P663j4719K9863J5095l5622j4167o416
$$ 23149 14740 22131 18463 -15368 -14059 -15724 -8061 -22780 7083 22178 -13444 -27611 -34027
4858c4027J3982P306l4911p072O349K851L4214J1497j7423K2605N118j248k6621
$$ -34027 -20045 -12739 -47650 -54722 -48373 -45522 -11308 189 -17234 5371 10489 9241 -17380
4845a7380l981M4524k701j7875J0075K1935k7096L778K0215j7461l3472j5273
$$ -17380 -21361 23163 20462 2587 12662 34597 7501 11279 31494 14033 -19439 -34712
4833c4712J7389N446J9518l068Q918M991R805j2762l7443p701J5516J3540j515
$$ -34712 -17323 -11877 7641 4573 13491 18482 28287 15525 -21918 -29619 -14103 -563 -2078
4820b078R989l6938k0570N241K2493N1169J1633j9103K892L124k6976j4706l786
$$ -2078 7911 -29027 -49597 -44356 -21863 29306 40939 21836 24728 27852 876 -13830 -17616
4807a7616j0823j962j2882m768j132M787j7681J4187K4478J5423L1038o894k5762
$$ -17616 -28439 -30401 -43283 -48051 -49183 -44396 -62077 -47890 -23412 -7989 23049 16155 -9607
4794i607K3805k153k822K4248m0275M738J8443k1983n800K1382J527j0425j0899
$$ -9607 14198 12045 9223 33471 -6804 -2066 16377 -5606 -11406 9976 11503 1078 -9821
4781i821J1443M248k8084j2103j2135l032R356K514L017K1705P033K0487pj0151
$$ -9821 1622 5870 -22214 -34317 -46452 -49484 -40128 -37614 -34597 -12892 -5859 14628 14621 4470
4767D470L418l823q567k8683l1477m0275K694K3122J569L8434M880J6739Q647
$$ 4470 7888 4065 -4502 -33185 -64662 -104937 -102243 -79121 -77552 -39118 -34238 -17499 -8852
4754h852K7924L6416J167l4984k1895k3728k6811J7001L6025k405k796n987l3118
$$ -8852 19072 55488 56655 21671 -224 -23952 -50763 -33762 2263 -142 -2938 -8925 -42043
4741d2043J8802M862L97K9548M4896n235r016k0248q553r619l5601J814j7000
$$ -42043 -23241 -18379 -17982 11566 56462 51227 42211 21963 13410 3791 -31810 -29996 -46996
4728d6996j3935K94j0919o84K5413J4828j423n908J6838K2757K3983j266K362
$$ -46996 -60931 -60637 -71556 -72240 -46827 -31999 -33422 -39330 -22492 265 24248 22982 25344
4715B5344j2991J93M656m02k7299r970J5862J8955Q48k8270K4112Q148l3305M402
$$ 25344 12353 12546 17202 16800 -10499 -20469 -4607 14348 15196 -13074 11038 19186 -14119 -9717
4701i717M936j2450k0391K3168J1739M837O657j821Q443j6588l5717k7085J1835
$$ -9717 -4781 -17231 -37622 -14454 -2715 2122 8779 6958 15401 -1187 -36904 -63989 -52154
4688e2154Q189j658J6075J8311K3293N416m1718m7190J1492J1137K0766J9238
$$ -52154 -43965 -45623 -29548 -11237 12056 17472 -24246 -71436 -59944 -48807 -28041 -8803
4676h803K9764J3887o107q394o062k3456k0811K7322K4933j2237k0045m428K6926
$$ -8803 20961 34848 28741 20347 14285 -9171 -29982 -2660 22273 10036 -10009 -14437 12489
4663A2489K460l3442j450J5676J2145k358l2082j8664K4367L2227j6988K7126
$$ 12489 14949 -18493 -19943 -4267 7878 5520 -26562 -45226 -20859 11368 -5620 21506
4651B1506K4699m1062l2772O723k2974j2706K0549J4696j6470P714J4484j0978
$$ 21506 46205 5143 -27629 -20906 -43880 -56586 -36037 -21341 -37811 -30097 -15613 -26591
4639b6591Q206q934O416J2643n568K5543N36k0929l174k518j0943j1663K5340
$$ -26591 -18385 -27319 -20903 -8260 -13828 11715 12251 -8678 -11852 -14370 -25313 -36976 -11636
4626a1636K9762k818k0708k1309j9590m10K8827L3986J3964J7259j5839l0151
$$ -11636 18126 15308 -5400 -26709 -46299 -46709 -17882 16104 30068 47327 31488 1337
4614A337j3448p591J2509J5807K3846K8546n891k4889O726O314j8183k7738l4278
$$ 1337 -12111 -19702 -7193 8614 32460 61006 55115 30226 36952 43266 25083 -2655 -36933
4601c6933K0731K7772j9891K99q582k5406l331J5327K1155J6114K6480J5164n8949
$$ -36933 -16202 11570 -8321 -8022 -16604 -42010 -45341 -30014 -8859 7255 33735 48899 -10050
4588a0050j6002K2608k955n584j7743J8697J9815l063O592N603K5336P538j1730
$$ -10050 -26052 -3444 -6399 -11983 -29726 -11029 8786 5723 12315 17918 43254 50792 39062
4575C9062l5792j1338k089L518J5927j2723O632N077l824l3089q260L439Q856
$$ 39062 3270 -8068 -10157 -6639 9288 -3435 3197 8274 4450 -28639 -36899 -33460 -24604
4562b4604n864K14n87J5153K0603R889j2847l4789j8128k236P469J6272L8536
$$ -24604 -30468 -30254 -30841 -15688 4915 14804 1957 -32832 -50960 -53196 -45727 -29455 9081
4549I081r431J6051p195j0759j7130j2602J0428L093l8852j2003m875p303K2662
$$ 9081 -350 15701 8506 -2253 -19383 -31985 -21557 -18464 -57316 -69319 -74194 -81497 -58835
4536e8835L7820K009l2429k960M147L5295M6024J2602m9941k9774J6857L2156
$$ -58835 -21015 -19006 -51435 -54395 -50248 -14953 31071 43673 -6268 -36042 -19185 12971
4524A2971K3742p70r916p287j5640j9096j2490m709k0517n786j98J4079J9919
$$ 12971 36713 35943 26027 18740 3100 -15996 -28486 -33195 -53712 -59498 -59696 -45617 -25698
4511b5698l545R046p545k9218j1296K1845L7865R262j4895k8531J4732M7201J2656
$$ -25698 -29243 -20197 -27742 -56960 -68256 -46411 -8546 716 -14179 -42710 -27978 19223 31879
4498C1879o616k4030m7388J0882J5195j3154M397k5836j6700J7778J318q317l754
$$ 31879 25263 1233 -46155 -35273 -20078 -33232 -28835 -54671 -71371 -53593 -52275 -60592 -64346
4485f4346N8685K5724j7318l420J4382J4850Q443L038m0348J150R139l759j9267
$$ -64346 -5661 20063 2745 -675 13707 28557 37000 40038 -310 840 9979 6220 -13047
4472a3047l042p905K2831P27K976J9631k5204k4661k197K7287R786P209j2856
$$ -13047 -16089 -23994 -1163 -436 2540 22171 -3033 -27694 -29891 -2604 7182 14391 1535
4459A535k7129k0167k1600J7177o55M626L3816M905J5272j8792l5184K5942J7668
$$ 1535 -25594 -45761 -67361 -50184 -50839 -46213 -12397 -7492 7780 -11012 -46196 -20254 -2586
4446b586m0344j2209M8180L6854m023K86m088k726k3365J7718m327k3400J4187
$$ -2586 -42930 -55139 -6959 29895 25872 26158 22070 19344 -4021 13697 9370 -14030 157
4433A57M1957J9213k2942k7008J2542p43j0370l6171k483K3263J2136k920o168
$$ 157 42114 61327 38385 11377 23919 23176 12806 -23365 -25848 -2585 9551 6631 463
4420D63J6434J3850l447k2093j5000K8701J988q923J0662k4328j5352K596L704
$$ 463 16897 30747 27300 5207 -9793 18908 20896 11973 22635 -1693 -17045 -14449 -10745
4407a0745L584r156r337O383K1906L28J5139L153m3566n682K1536N14l049J374
$$ -10745 -7161 -16317 -25654 -19271 2635 2963 18102 21255 -22311 -27993 -6457 -5943 -8992 -7618
4393g618k2595j8654L1147J3362J1329l3176j8969j649k7176M741l258j6206P263
$$ -7618 -30213 -48867 -17720 -4358 6971 -26205 -45174 -46823 -73999 -69258 -72516 -88722 -81459
4380h1459K2887K5980P222J1735L234K3505R497k1775j4220K9473K2554k8116
$$ -81459 -58572 -32592 -25370 -13635 -10401 13104 22601 826 -13394 16079 38633 10517
4368A0517R449j6954J529j8193j9916M56M3298J0342m9578j5076J0847J4361l4479
$$ 10517 19966 3012 4541 -13652 -33568 -33112 10186 20528 -29050 -44126 -33279 -18918 -53397
4355e3397j5412P663N3627M9205R958M512j5112j3538k4355n567m326j0113l687
$$ -53397 -68809 -61146 -7519 41686 51644 56156 41044 27506 3151 -2416 -6742 -16855 -20542
4342b0542N656o460L5947q396m5417j0007o76k2449J5926L7994M855O452J6364
$$ -20542 -14886 -21346 14601 6205 -39212 -49219 -49895 -72344 -56418 -18424 -13569 -7117 9247
4329I247Q057j94l7935k7882K3351L7883K0429K3076j2163j1154r513k3674l1782
$$ 9247 17304 17110 -20825 -48707 -25356 12527 32956 56032 43869 32715 23202 -472 -32254
4316c2254r630J9064Q676K5471K6291k2111j274j2597J8694K1627k0865k9448
$$ -32254 -41884 -22820 -14144 11327 37618 15507 14233 1636 20330 41957 21092 -8356
4304h356o938K7995j2080j5575j6121n263N010K2146O223n427R802K1954j5046
$$ -8356 -15294 12701 621 -14954 -31075 -36338 -31328 -9182 -2959 -8386 1416 23370 8324
4291H324j5820l0693j3806J4346J4476J5969K8605m208J269L372L535j2896j3368
$$ 8324 -7496 -38189 -51995 -37649 -23173 -7204 21401 17193 18462 21834 25369 12473 -895
4278h95J3622K6120q235k0310j7901l6933m22L1454K9496j1542l9052j1733K5779
$$ -895 12727 38847 30612 10302 -7599 -44532 -44954 -13500 15996 4454 -34598 -46331 -20552
4265b0552k338j772k1539q833J6775n131Q63K1847K6781j1816k5982k3714O479
$$ -20552 -22890 -24662 -46201 -55034 -38259 -43390 -42527 -20680 6101 -5715 -31697 -55411 -48932
4252d8932m390K0064M9285J4174J8543j5817o179l0458r982m1194l4677L642Q410
$$ -48932 -53322 -33258 16027 30201 48744 32927 26748 -3710 -13692 -54886 -89563 -85921 -77511
4239g7511P632K3094L3929q419O938Q489j2155l7345o230M3907J1957N892r467
$$ -77511 -69879 -46785 -12856 -21275 -14337 -5848 -18003 -55348 -61578 -17671 -5714 178 -9289
4226i289J664o46p183j866j8082j0367k93J273K4303q47l41q03l218P287j939
$$ -9289 -7625 -8271 -15454 -17320 -35402 -45769 -46062 -44789 -20486 -21333 -21674 -22477 -25695 -18408 -20347
4211b0347K4902L7099j0332m3597l633L5307j2121J6977R765k0527n0268l1794
$$ -20347 4555 41654 31322 -12275 -15908 19399 7278 24255 34020 13493 -36775 -68569
4199f8569L2793K9345J7070J6879j4927l8688j0704Q715J7485j25k1193J4004
$$ -68569 -35776 -6431 10639 27518 12591 -26097 -36801 -28086 -10601 -10726 -31919 -17915
4187a7915K1866j5290M553K4726J9365j5035k0699k8161j0911M086j0778j0470
$$ -17915 3951 -11339 -6786 17940 37305 22270 1571 -26590 -37501 -33415 -44193 -54663
4175e4663K3236k6967l4541K1323J6160q667Q545Q073j4124J8520L1978K4085
$$ -54663 -31427 -58394 -92935 -71612 -55452 -64119 -55574 -47501 -61625 -43105 -11127 12958
4163A2958P724j070q644k1495R518J5111l0645Q425Q982n408J0079J0283L049
$$ 12958 20682 19612 10968 -10527 -1009 14102 -16543 -8118 864 -4544 5535 15818 18867
4150A8867K9704J278m5314j0206q735j2306P21J6746l208j6756K0059L294R892
$$ 18867 48571 49849 4535 -5671 -14406 -26712 -25991 -9245 -12453 -29209 -9150 -5856 4036
4137D036J6209j2287k4736J4001J6443j7827Q855P97J5706Q495m1551k6201R347
$$ 4036 20245 7958 -16778 -2777 13666 -4161 4694 5491 21197 29692 -11859 -38060 -28713
4124b8713J2169J2349M960K5579J3667k4625K941k2442j5407j9681N307J3449
$$ -28713 -16544 -4195 765 26344 40011 15386 18327 -4115 -19522 -39203 -33896 -20447
4112b0447J556j1160L8837k381j7547l919k0355R397J0846L7744j2387k4955k929
$$ -20447 -18891 -30051 8786 6405 -11142 -15061 -35416 -26019 -15173 22571 10184 -14771 -17700
4099a7700L8078K342k2828j0780p52l124j093k051J8347j0034k5337n959J7473
$$ -17700 20378 22720 -108 -10888 -11640 -14764 -15857 -17908 439 -9595 -34932 -40891 -23418
4086b3418J6859j844j3511j4975j0523Q419K2498k5311K427m258j2657K447Q240
$$ -23418 -6559 -8403 -21914 -36889 -47412 -38993 -16495 -41806 -39379 -43637 -56294 -53847 -45607
4073d5607L9765K2702n864J4137j6048o591j2033N541l78l060J7310L2344j4995
$$ -45607 -5842 16860 10996 25133 9085 2494 -9539 -3998 -4376 -7436 9874 42218 27223
4060B7223k2001l8923K0286J6030l960j2214l51k6328J4917K8742j1475j8647
$$ 27223 5222 -33701 -13415 2615 -1345 -13559 -13910 -40238 -25321 3421 -8054 -26701
4048b6701J9786P240J928k2750j010j133m54J7193K319n305J5103j7396R482J2384
$$ -26701 -6915 325 2253 -20497 -21507 -22640 -23094 -5901 -3582 -8887 6216 -11180 -1698 10686
4034A0686Q463k64l9786j1250K6279J2714k618j1923j1550L22q917R627L3184
$$ 10686 19149 18885 -20901 -32151 -5872 6842 4224 -7699 -19249 -18927 -27844 -18217 14967
4021A4967K1092J0000L40J067k3542n130k4564o449P609K7777K2237J8423k2013
$$ 14967 36059 46059 46399 47466 23924 18794 -5770 -12219 -4610 23167 45404 63827 41814
4008D1814j3761k6163j4881K2795m38k5915Q091o38j3160j0889k8845r019N7880
$$ 41814 28053 1890 -12991 9804 9366 -16549 -8458 -9096 -22256 -33145 -61990 -71009 -13129
3995a3129K8896n605L949k737J4830K2051k0789m0199o117k4304q485M7695j1233
$$ -13129 15767 10162 14111 11374 26204 48255 27466 -12733 -18850 -43154 -51639 -3944 -15177
3982a5177l147j2561p753O270j4977J4210L6338j1834j3209j8079J1182j129N207
$$ -15177 -18324 -30885 -38638 -32368 -47345 -33135 3203 -8631 -21840 -39919 -28737 -29866 -24659
3969b4659J851j653K3648k9431l6188J5858J9530j684l863k0326K471q446K1646
$$ -24659 -22808 -24461 -813 -30244 -66432 -50574 -31044 -32728 -36591 -56917 -54446 -62892 -41246
3956d1246M2584R978j8404q663J3807J3627K9608k162l2417J1838P793l1441K8649
$$ -41246 1338 11316 -7088 -15751 -1944 11683 41291 39129 6712 18550 26343 -5098 23551
3943B3551o997k0123J1727J8533R846J8622m3914P444J6443k4562j9927k2420
$$ 23551 16554 -3569 8158 26691 36537 55159 11245 18689 35132 10570 -9357 -31777
3931c1777J3263M391l676J1276j1128O77l6886j6442J85L0632J1380J1542M626
$$ -31777 -18514 -14123 -17799 -6523 -17651 -16974 -53860 -70302 -70117 -39485 -28105 -16563 -11937
3918a1937l0509J2820K8263K6330Q196m447O360k1137l4131r812J8733j750l4897
$$ -11937 -42446 -29626 -1363 24967 33163 28716 35076 13939 -20192 -30004 -11271 -13021 -47918
3905d7918L7924Q574q315J5101n423O69j9754o197J7872k3577k1343L3759K716
$$ -47918 -9994 -1420 -9735 5366 -57 612 -19142 -25339 -7467 -31044 -52387 -18628 -15912
3892a5912q419K3709Q711J0231J2161r575j7302k6309p350N8161K2032l10j3801
$$ -15912 -24331 -622 8089 18320 30481 20906 3604 -22705 -30055 28106 50138 49828 36027
3879C6027k6324J4539o927l1915K491J5155j1438J2324j3389j5728j4479K0746
$$ 36027 9703 24242 17315 -14600 -12109 3046 -8392 3932 -9457 -25185 -39664 -18918
3867a8918L0450M1123J0457q714J7648J5526j5716k1884M626n490m6521m2417
$$ -18918 11532 52655 63112 54398 72046 87572 71856 49972 54598 49108 2587 -39830
3855c9830j2214J110k0264L0673K5400J8992L6292l603j570j2591p178Q371K4708
$$ -39830 -52044 -50934 -71198 -40525 -15125 3867 40159 36556 34986 22395 15217 23588 48296
3842D8296O40l2334j9826p521L1202l9553k0151K8035L816l2683k637M2728K4616
$$ 48296 48936 16602 -3224 -10745 20457 -19096 -39247 -11212 -7396 -40079 -42716 12 24628
3829B4628j8003J982k044k4853j1367k536K6295K816P519M3594j1822r623J3947
$$ 24628 6625 8607 6563 -18290 -29657 -32193 -5898 -3082 4437 48031 36209 26586 40533
3816D0533j1492k7407L4352K1251l2476M083L93j6445r539L08p065K7487j1779
$$ 40533 29041 1634 35986 57237 24761 28844 29237 12792 3253 3561 -3504 23983 12204
3803A2204j2430O98K8910L8707j8031j159m737L8464k5756l2909J5841j1618j1761
$$ 12204 -226 472 29382 68089 50058 48899 44162 82626 56870 23961 39802 28184 16423
3790A6423r005r973k1146j6736K7965K1831J1257J4153J6800j676j7680m2395
$$ 16423 7418 -2555 -23701 -40437 -12472 9359 20616 34769 51569 49893 32213 -10182
3778a0182j8353K5341j192P274n49k2660N886P697J4220P298j8451J2679k566
$$ -10182 -28535 -3194 -4386 2888 2339 -20321 -14435 -6738 7482 14780 -3671 9008 6442
3765F442k6417j9053l753j5105j800M1102K6583k8732l6322K1337M4077M325j8953
$$ 6442 -19975 -39028 -42781 -57886 -59686 -18584 7999 -20733 -57055 -35718 8359 12684 -6269
3752f269R986M181m987k979R504o990N10P395q213J9034K8948n947m3320j5831
$$ -6269 3717 7898 2911 -68 9436 2446 2956 10351 2138 21172 50120 44173 853 -14978
3738a4978K6673R007L27j0453M991J9606k3046l6682O664K0081K1704k9603O740
$$ -14978 11695 20702 21029 10576 15567 35173 12127 -24555 -17891 2190 23894 -5709 1031
3725A031J9538K3257J1034j3341N526k604p769k4891M208n786k136n5659l7140
$$ 1031 20569 43826 54860 41519 47045 44441 36672 11781 15989 10203 8067 -47592 -84732
3712h4732L2976P123J1362L3660K8945j7168j6573k3495P443K5076L6804J7658
$$ -84732 -51756 -44633 -33271 389 29334 12166 -4407 -27902 -20459 4617 41421 59079
3700E9079k0415j164Q726Q237j5789m1987L905j6895j9213J7321L0800m376k5015
$$ 59079 38664 37500 46226 54463 38674 -3313 592 -16303 -35516 -18195 12605 8229 -16786
3687a6786Q018J8192K3412l120l1910k9610l127K4993N862k7327m158j993J3802
$$ -16786 -8768 9424 32836 29716 -2194 -31804 -34931 -9938 -4076 -31403 -35561 -37554 -23752
3674b3752K1758j58M10R404r950J7815j3179k6308p86Q635L7569L078k4550j7242
$$ -23752 -1994 -2152 -1742 7662 -2288 15527 2348 -23960 -24746 -16111 21458 24536 -14 -17256
3660a7256o704j4936k2783O703L7444m188j851K0339n0O61K0826Q267O451j6417
$$ -17256 -23960 -38896 -61679 -54976 -17532 -21720 -23571 -3232 -3282 -2621 18205 26472 32923 16506
3646A6506l8250l1562K2472M204j3977j6995J5520K5363J3394l271k2168l703
$$ 16506 -21744 -53306 -30834 -26630 -40607 -57602 -42082 -16719 -3325 -6596 -28764 -32467
3634c2467o744q079m883L7418L1551N344j3339l2180M293M7076L9913J261j9325
$$ -32467 -39211 -47290 -52173 -14755 16796 22140 8801 -23379 -19086 27990 67903 69164 49839
3621D9839l7885R464K4152m381l3656M612L1436r881p411j3469k8090q981J0188
$$ 49839 11954 21418 45570 41189 7533 12145 43581 33700 26289 12820 -15270 -24251 -14063
3608a4063K7386p37l199O989N978k06j2587n993o918M3822n904j0161L259l620
$$ -14063 13323 12586 9387 16376 22354 22148 9561 3568 -3350 40472 34568 24407 27666 24046
3594B4046l435k6212l1928q628L9579j1285l8012j240L4021L8706L3198k258m1289
$$ 24046 20611 -5601 -37529 -46157 -6578 -17863 -55875 -57115 -23094 15612 48810 46552 5263
3581E263J6421j618k46Q924k28p260j2824Q517j0144l98q617j1121k029m371j5465
$$ 5263 21684 20066 19820 28744 28516 21256 8432 16949 6805 6407 -2210 -13331 -15360 -19731 -35196
3566c5196j4766l78k1900M3376K0034j8517j3868N068R034J6150N660k762o678
$$ -35196 -49962 -50340 -72240 -28864 -8830 -27347 -41215 -36147 -27113 -10963 -5303 -8065 -14743
3553a4743n983M3129K867j1900k6767J4583j4938o211k435N058J8071n364J6199
$$ -14743 -20726 22403 25270 13370 -13397 1186 -13752 -19963 -22398 -17340 731 -4633 11566
3540A1566J583Q116K748K678l3085k0453J7858o684j2141j8799J1034k352J6626
$$ 11566 13149 21265 24013 26691 -6394 -26847 -8989 -15673 -27814 -46613 -35579 -37931 -21305
3527b1305m148j1342J9410j1638j8197K0201O387k563L1308j0109k5251j5024
$$ -21305 -25453 -36795 -17385 -29023 -47220 -27019 -20632 -23195 8113 -1996 -27247 -42271
3515d2271r07M631J4244o930J6981m571l4144J6886J6651N458j259J3185l302
$$ -42271 -43178 -38547 -24303 -31233 -14252 -18823 -52967 -36081 -19430 -13972 -15231 -2046 -5348
3502e348O44L0054J9915k0325k3919M657M339k2243p477j2331j5764Q088J2732
$$ -5348 -4704 25350 45265 24940 1021 5678 10017 -12226 -19703 -32034 -47798 -39710 -26978
3489b6978N855q311J350M4033J3551j2000k4301r448J857K7136j1102j2359j4726
$$ -26978 -21123 -29434 -28084 15949 29500 17500 -6801 -16249 -14392 12744 1642 -10717 -25443
3476b5443J73J116l3109j3468M1219K2750J3264j0584m637j2204J2042j5753J084
$$ -25443 -25270 -24154 -57263 -70731 -29512 -6762 6502 -4082 -8719 -20923 -8881 -24634 -23550
3463b3550m424q577N6619N4458j1666j8694j8439n673j3197n9501k5265M751J8235
$$ -23550 -27974 -36551 20068 74526 62860 44166 25727 20054 6857 -52644 -77909 -73158 -54923
3450e4923J7444o638m833p270j062p759J3769J9206K1802J536O22J0128K0629
$$ -54923 -37479 -44117 -48950 -56220 -57282 -65041 -51272 -32066 -10264 -8728 -8106 2022 22651
3437B2651R728R433J0864N807k4230l7783r642k947K8615J0949l502j899J488
$$ 22651 32379 41812 52676 58483 34253 -3530 -13172 -16119 12496 23445 19943 18044 19532
3424A9532k3705j1772j1049J75J8577o447o871N154o902j2367J6648K4921L458
$$ 19532 -4173 -15945 -26994 -26819 -8242 -14689 -21560 -16406 -23308 -35675 -19027 5894 9352
3411I352R92j5755j3153K1299K8656j7662m809j6553k7720O39J2834j8395R401
$$ 9352 10344 -5411 -18564 2735 31391 13729 8920 -7633 -35353 -34714 -21880 -40275 -30874
3398c0874K8068K7446j301J0997K5536J4391j3330j3978m6783l8486R06M6148
$$ -30874 -2806 24640 23339 34336 59872 74263 60933 46955 172 -38314 -37408 8740
3386H740K4246P897j0092N34j6758m789Q032o731J1645M1324J4690n9552k1167
$$ 8740 32986 40883 30791 31325 14567 9778 17810 11079 22724 64048 78738 19186 -1981
3373a981J8891j7827k1812k2565j2012q211J7537J0399j9449q28j4902O320k8610
$$ -1981 16910 -917 -22729 -45294 -57306 -65517 -47980 -37581 -57030 -57858 -72760 -66440 -95050
3360i5050M086J7572P006M4058j3417j3971K7038k4308J6227r516k973J7642q019
$$ -95050 -90964 -73392 -66386 -22328 -35745 -49716 -22678 -46986 -30759 -40275 -43248 -25606 -33625
3347c3625K313M211k5183J8727l416k8265J0737L1233K3268o216j537J3871Q974
$$ -33625 -31312 -27101 -52284 -33557 -36973 -65238 -54501 -23268 0 -6216 -7753 6118 15092
3334A5092q574k38J2082j4m2399l5772M553J9350n729K3348M393K2662k2759j6566
$$ 15092 6518 6280 18362 18348 -24051 -59823 -55270 -35920 -41649 -18301 -13908 8754 -14005 -30571
3320c0571K6148j7831m7167J256K9908K9882J0599n227M954k982J5908l58K8422
$$ -30571 -4423 -22254 -69421 -68165 -38257 -8375 2224 -3003 1951 -1031 14877 14519 42941
3307D2941j1610k0367n2422J7675r801k2025R344J9242J3538R253m440Q795k4062
$$ 42941 31331 10964 -41458 -23783 -33584 -55609 -46265 -27023 -13485 -4232 -8672 123 -23939
3294b3939j3328N197L7043J6564p441N96J1702p732N111K9345K0366J8696R204
$$ -23939 -37267 -32070 4973 21537 14096 14692 26394 18662 23773 53118 73484 92180 101384
3281A01384k1928m5800l1194M945J6780J3782q792p441j8502O078j0003o35J5824
$$ 101384 79456 33656 2462 7407 24187 37969 29177 21736 3234 9312 -691 -1326 14498
3268A4498j48k9995j9708j3688M175L8830K8988j7997k7537J770K2828N129K0521
$$ 14498 14350 -15645 -35353 -49041 -44866 -6036 22952 4955 -22582 -20812 2016 7145 27666
3255B7666j3265o068k8437k7974K2363K2764j0895N082J0099J914N350K798o695
$$ 27666 14401 8333 -20104 -48078 -25715 -2951 -13846 -8764 1335 3249 8599 11397 4702
3242D702j0944J893k0982l0755K445q682m555j7955J6273L3881k862m9918r389
$$ 4702 -6242 -4349 -25331 -56086 -53641 -62323 -66878 -84833 -68560 -34679 -37541 -87459 -96848
3229i6848Q322J0148p740M6900M4813n94K151K660l8932j6914N199J3913J0689
$$ -96848 -88526 -78378 -86118 -39218 5595 5001 7152 9812 -29120 -46034 -40835 -26922 -16233
3216a6233J253M12K3974K4496M9504K1924m2089m6198j3256O876m0356m627l792
$$ -16233 -14980 -14568 9406 33902 83406 105330 63241 17043 3787 10663 -29693 -34320 -38112
3203c8112k757K6145O274Q299J9869q534j8657n903j0543l2191N037J605O265
$$ -38112 -40869 -14724 -8450 -151 19718 11184 -7473 -13376 -23919 -56110 -51073 -49468 -43203
3190d3203J3519q334K8837J6556m2899r505J2015m085K5236N1705J0400j758j8282
$$ -43203 -29684 -38018 -9181 7375 -35524 -45029 -33014 -37099 -11863 39842 50242 48484 30202
3177C0202k2740J5267m159m867K4366j0717l7430n532n296J9380j4017J7635j0209
$$ 30202 7462 22729 18570 13703 38069 27352 -10078 -15610 -20906 -1526 -15543 2092 -8117
3164h117m4337k3702p736K5333M7905L3108j1741l0774k7599k3026J6513m946
$$ -8117 -52454 -76156 -83892 -58559 -10654 22454 10713 -20061 -47660 -70686 -54173 -59119
3152e9119K236O181K2109j4836K2858K9120n764J9105j9880k0571K7652J9502
$$ -59119 -56883 -50702 -28593 -43429 -20571 8549 2785 21890 2010 -18561 9091 28593
3140B8593M610K9118l6395k1987j0317k4494L831L306K3812J4371N174J7210J2694
$$ 28593 33203 62321 25926 3939 -6378 -30872 -27041 -23735 77 14448 19622 36832 49526
3127D9526J2708J5276P96j9661k0140j3025r179j1913J7637j7635k7965j5500
$$ 49526 62234 77510 78306 58645 38505 25480 16301 4388 22025 4390 -23575 -39075
3115c9075K7858K5061N930o541j2658k7090J3203N751n958j4469k8172L8055J4781
$$ -39075 -11217 13844 19774 13233 575 -26515 -13312 -7561 -13519 -27988 -56160 -18105 -3324
3102c324J1643K043j3134P35k1746j1379J098j9699O78j7374r011J4771M2927
$$ -3324 8319 10362 -2772 -2037 -23783 -35162 -34064 -53763 -53085 -70459 -79470 -64699 -21772
3089b1772J8440j2663j7509j2024K6831O587j694l973K3521O456K3413O812N650
$$ -21772 -3332 -15995 -33504 -45528 -18697 -12110 -13804 -17777 5744 12200 35613 42425 48075
3076D8075k0797j3563k5681K40J5441L891j2753k628k1244K1414l4662J8743L3233
$$ 48075 27278 13715 -11966 -11726 3715 7606 -5147 -7775 -29019 -7605 -42267 -23524 9709
3063I709O30k0992Q811L9188L24j2650p608N635R756K4639j4558m1977j8255j2103
$$ 9709 10339 -10653 -1842 37346 37670 25020 17412 23047 32803 57442 42884 907 -17348 -29451
3049b9451J0765J0640R969k7874L166M0286M975j1013q843j4928q597K704J9794
$$ -29451 -18686 -8046 1923 -25951 -22785 17501 22476 11463 2620 -12308 -20905 -18201 1593
3036A593p847J0309j3331R265N514m126Q061L2763J2767P758L844j7902k9685
$$ 1593 -6254 4055 -9276 -11 5503 1377 9438 42201 54968 62726 66570 48668 18983
3023A8983K0516K6253n877l6133L673j7114m2566j5003j0890K4814J8093j4277
$$ 18983 39499 65752 59875 23742 27415 10301 -32265 -47268 -58158 -33344 -15251 -29528
3011b9528j7679l7083L463K8734L934L282J4157p334P414o951j6676N195k104
$$ -29528 -47207 -84290 -80827 -52093 -48159 -44877 -30720 -38054 -30640 -37591 -54267 -49072 -51176
2998e1176K4644J3284j9290k3618N089K2787K1313j268O686j9776p261k2400m506
$$ -51176 -26532 -13248 -32538 -56156 -51067 -28280 -6967 -8235 -1549 -21325 -28586 -50986 -55492
2985e5492K9588K8282k248p858k6186k0428J568j64J353k1491O316J9943j828
$$ -55492 -25904 2378 130 -7728 -33914 -54342 -52774 -52938 -51585 -73076 -66760 -46817 -48645
2972d8645L0994K2666J6898n632k6616J918N4614J4057k1763l3783J0253J3334
$$ -48645 -17651 5015 21913 16281 -10335 -8417 46197 60254 38491 4708 14961 28295
2960B8295J8575j9879m4795j8340j227L400K5945P795k705J60l016l08q00j70
$$ 28295 46870 26991 -17804 -36144 -37371 -33971 -8026 -231 -2936 -2776 -5792 -6100 -6900 -7070
2946g070R322J4417K5512J7328J9593j8247k5882j4224N506P479l2452o077L898
$$ -7070 2252 16669 42181 59509 79102 60855 34973 20749 26255 33734 1282 -4795 -897
2933h97k704m474P018J3745l219p799j2555j0482o130O713o133K3450J9416J6639
$$ -897 -3601 -8075 -1057 12688 9469 1670 -10885 -21367 -27497 -20784 -26917 -3467 15949 32588
2919C2588o881R889m37o88M353j3320K599J1489l729J3933r888j3985p626j0539
$$ 32588 25707 35596 35159 34471 38824 25504 28103 39592 35863 49796 39908 25923 18297 7758
2905G758L053k5606O745R786p975p762N1331M6358l1607l6741j1083q184P707
$$ 7758 10811 -14795 -8050 1736 -6239 -14001 37330 83688 52081 15340 4257 -3927 3780
2892C780l2353m465j1310Q310K3641j0356p72R206p779k690J728k1199J6535L4802
$$ 3780 -28573 -33038 -44348 -36038 -12397 -22753 -23525 -14319 -22098 -24788 -23060 -44259 -27724 7078
2878G078R177K4655j9234M051K518k2541j7173Q44J5837k5844k2428k1019p598
$$ 7078 16255 40910 21676 25727 28245 5704 -11469 -10625 5212 -20632 -43060 -64079 -71677
2865g1677l612J781l899K7901r472j8910K5616K9044O030n901j1864J1875o542
$$ -71677 -75289 -73508 -77407 -49506 -58978 -77888 -52272 -23228 -17198 -23099 -34963 -23088 -29630
2852b9630R676J0304m906l5712J7939L7371k449j3661K244N613J220o375M081
$$ -29630 -19954 -9650 -14556 -50268 -32329 5042 2593 -11068 -8824 -3211 -1991 -8366 -4285
2839d285L7933R832l8629j7792J0819P807j346J3874J9106k0957l0633J1687J1966
$$ -4285 33648 43480 4851 -12941 -2122 5685 4339 18213 37319 16362 -14271 -2584 9382
2826I382K1743j5379m1297k540J0901J9588p363K429J7488j611j3881j5003L7083
$$ 9382 31125 15746 -25551 -28091 -17190 2398 -4965 -2536 14952 13341 -540 -15543 21540
2813B1540J9333o114j1553j5601J6547j734l5540k590J09L0242J4220k3472m1322
$$ 21540 40873 34759 23206 7605 24152 22418 -13122 -15712 -15603 14639 28859 5387 -35935
2800c5935J4418K0440j4835o293m635j697J2050J3499J1459J4403K6080j1639
$$ -35935 -21517 -1077 -15912 -22205 -26840 -28537 -16487 -2988 8471 22874 48954 37315
2788C7315l0372q41J6947J3410j1952n700o41m865r818j9845J9940M6576j1231
$$ 37315 6943 6102 23049 36459 24507 18807 18166 13301 3483 -16362 3578 50154 38923
2775C8923n0640K103M9123J3006r017j2955l4560j6468M940J107j5307l888J231
$$ 38923 -11717 -9614 39509 52515 43498 30543 -4017 -20485 -15545 -14438 -29745 -33633 -32402
2762c2402L967P768K2421j409N188K1325O182Q47K293L324R330P087l6541k7301
$$ -32402 -28435 -20667 1754 345 5533 26858 33040 33887 36180 39504 48834 55921 19380 -7921
2748g921j2392J1657j6974j1805J1760J8129J0416O73j2328j7427j0973M452O254
$$ -7921 -20313 -8656 -25630 -37435 -25675 -7546 2870 3543 -8785 -26212 -37185 -32733 -26479
2735b6479L1558j6808k4623N625K9956R568O842R524j3132Q650R063j4698o783
$$ -26479 5079 -11729 -36352 -30727 -771 8797 15639 25163 12031 20681 29744 15046 8263
2722H263n052J9181j2211j8535L797P172Q946j0405m488k0416k8754l891K566
$$ 8263 3211 22392 10181 -8354 -4557 2615 11561 1156 -3332 -23748 -52502 -56393 -53827
2709e3827L055M7463L9098Q381l348q603R69J8713j9792l6301J1298J0121l2604
$$ -53827 -50772 -3309 35789 44170 40822 32219 33188 51901 32109 -4192 7106 17227 -15377
2696a5377r514l0762p482L5243R112Q32J2675R918j369K657j37K3192o237M143
$$ -15377 -24891 -55653 -63135 -27892 -18780 -17948 -5273 4645 3276 5933 5796 28988 22751 26894
2682B6894K4515K5775k0279j1098j3206k2309k7045N4203K6458k3952m1699p930
$$ 26894 51409 77184 56905 45807 32601 10292 -16753 37450 63908 39956 -1743 -9673
2670i673K9240J894m747K9236k708n474J7370j3999k6830r953r014K3108K1408
$$ -9673 19567 21461 16714 45950 43242 37768 55138 41139 14309 4356 -4658 18450 39858
2657C9858j0287j8014j8483J2343J7497K7090M651j3663P296J912O594j5519n2718
$$ 39858 29571 11557 -6926 5417 22914 50004 54655 40992 48288 50200 56794 41275 -11443
$$ [...]
##END NTUPLES=NMR SPECTRUM
##END=
