##TITLE=Analysis number 323726
Compound Code cc 40202
Book Reference 468/183
Project Code adrs
Chemist Name colinb
##JCAMPDX= 6.0         $$ Bruker NMR JCAMP-DX V2.0
##DATA TYPE= NMR SPECTRUM
##DATA CLASS= NTUPLES
##ORIGIN= Bruker BioSpin GmbH
##OWNER= nmr
$$ XWIN-NMR		Version 3.5
$$ Mon Nov  6 11:05:50 2006 GMT Standard Time (UT+0h)  MAYBRIDGE\nmr@NMR_250MHZ
##.OBSERVE FREQUENCY= 250.131544655141
##.OBSERVE NUCLEUS= ^1H
##.ACQUISITION MODE= SIMULTANEOUS (DQD)
##.ACQUISITION SCHEME= undefined
##.AVERAGES= 16
##.DIGITISER RES= 18
##SPECTROMETER/DATA SYSTEM= dpx250
##.PULSE SEQUENCE= zg30
##.SOLVENT NAME= CDCl3
##.SHIFT REFERENCE= (INTERNAL, CDCl3, 0, 16.522)
##AUDIT TRAIL= $$ (NUMBER, WHEN, WHO, WHERE, WHAT)
$$ ##TITLE= Audit trail, XWIN-NMR		Version 3.5
$$ ##JCAMPDX= 5.01
$$ ##ORIGIN= Bruker BioSpin GmbH
$$ ##OWNER= nmr
$$ C:\u/data/dgb/nmr/ADRS/2250/pdata/1/auditp.txt
$$ ##AUDIT TRAIL=  $$ (NUMBER, WHEN, WHO, WHERE, WHAT)
(   1,<2006-11-06 11:05:26.14 +000>,<MAYBRIDGE\nmr>,<NMR_250MHZ>,
      <created by zg, POWCHK disabled, PULCHK disabled
       configuration hash MD5:
       49 4B E0 1D 92 C2 6B 37 9F E6 65 BC 52 41 86 1D
       data hash MD5: 64K
       90 31 08 44 ED 87 B9 A7 3D 4D 99 79 3D 6C 3F FC>)
(   2,<2006-11-06 11:05:40.21 +000>,<MAYBRIDGE\nmr>,<NMR_250MHZ>,
      <Start of raw data processing
       ef LB = 0.3 FT_mod = 6 PKNL = 1 SI = 32K 
       data hash MD5: 32K
       47 BF D5 D4 D7 B8 6D D5 CC F8 AE D7 F8 7B 6B BE>)
(   3,<2006-11-06 11:05:41.80 +000>,<MAYBRIDGE\nmr>,<NMR_250MHZ>,
      <apk 
       data hash MD5: 32K
       11 DE 34 34 BA D7 AB E9 06 B6 B2 49 82 1D D9 51>)
(   4,<2006-11-06 11:05:42.64 +000>,<MAYBRIDGE\nmr>,<NMR_250MHZ>,
      <abs ABSG = 5 
       data hash MD5: 32K
       B5 D3 23 72 36 6D FA C9 B2 6B F9 0A 8C E6 C8 94>)
$$ ##END=
$$ 
$$ hash MD5
$$ A3 B5 08 AB C2 46 3E 86 FF 53 09 B0 26 85 95 55
##$RELAX= 
##$RELAX= 
##$RELAX= 
##$RELAX= 
##$RELAX= 
##$RELAX= 
##$RELAX= 
$$ Bruker specific parameters
$$ --------------------------
##$DU= <C:\u>
##$EXPNO= 2250
##$NAME= <ADRS>
##$PROCNO= 1
##$TYPE= <nmr>
##$USER= <dgb>
##$AMP= (0..31)
100 100 100 100 100 100 100 100 100 100 100 100 100 100 100 100 100 100 
100 100 100 100 100 100 100 100 100 100 100 100 100 100 
##$AQSEQ= 0
##$AQ_mod= 3
##$AUNM= <au_zg>
##$AUTOPOS= <60 >
##$BF1= 250.13
##$BF2= 250.13
##$BF3= 250.13
##$BF4= 250.13
##$BF5= 500.13
##$BF6= 500.13
##$BF7= 500.13
##$BF8= 500.13
##$BYTORDA= 1
##$CFDGTYP= 0
##$CFRGTYP= 5
##$CHEMSTR= <none>
##$CNST= (0..31)
1 1 145 1 1 1 1 1 1 1 1 1 1 1 1 1 1 1 1 1 1 1 1 1 1 1 1 1 1 1 1 1 
##$CPDPRG= <>
##$CPDPRG1= <>
##$CPDPRG2= <>
##$CPDPRG3= <>
##$CPDPRG4= <mlev>
##$CPDPRG5= <mlev>
##$CPDPRG6= <mlev>
##$CPDPRG7= <mlev>
##$CPDPRG8= <mlev>
##$CPDPRGB= <>
##$CPDPRGT= <>
##$D= (0..31)
0 1 0 0 0 0 0 0 0 0.06 0 0 0 0 0 0 0.0002 0 0 0 0 0 0 0 0 0 0 0 0 0 0 
0 
##$DATE= 1162811124
##$DBL= (0..7)
120 120 120 120 120 120 120 120 
##$DBP= (0..7)
150 150 150 150 150 150 150 150 
##$DBP07= 0
##$DBPNAM0= <>
##$DBPNAM1= <>
$$ [...]
##$SUBNAM7= <"">
##$SUBNAM8= <"">
##$SUBNAM9= <"">
##$SW= 20.6930455092707
##$SWIBOX= (0..15)
0 0 3 0 0 0 0 0 0 0 0 0 0 0 0 0 
##$SW_h= 5175.983436853
##$TD= 65536
##$TD0= 1
##$TE= 683.16
##$TE2= 300
##$TE3= 300
##$TEG= 300
##$TL= (0..7)
0 120 120 120 120 120 120 120 
##$TP= (0..7)
150 150 150 150 150 150 150 150 
##$TP07= 0
##$TPNAME0= <>
##$TPNAME1= <>
##$TPNAME2= <>
##$TPNAME3= <>
##$TPNAME4= <>
##$TPNAME5= <>
##$TPNAME6= <>
##$TPNAME7= <>
##$TPOAL= (0..7)
0.5 0.5 0.5 0.5 0.5 0.5 0.5 0.5 
##$TPOFFS= (0..7)
0 0 0 0 0 0 0 0 
##$TUNHIN= 0
##$TUNHOUT= 0
##$TUNXOUT= 0
##$USERA1= <user>
##$USERA2= <user>
##$USERA3= <user>
##$USERA4= <user>
##$USERA5= <user>
##$V9= 5
##$VALIST= <valist>
##$VCLIST= <CCCCCCCCCCCCCCC>
##$VD= 0
##$VDLIST= <DDDDDDDDDDDDDDD>
##$VPLIST= <PPPPPPPPPPPPPPP>
##$VTLIST= <TTTTTTTTTTTTTTT>
##$WBST= 1024
##$WBSW= 4
##$XGAIN= (0..3)
0 0 0 0 
##$XL= 0
##$YL= 0
##$YMAX_a= 371759
##$YMIN_a= -250725
##$ZGOPTNS= <>
##$ZL1= 120
##$ZL2= 120
##$ZL3= 120
##$ZL4= 120
##$ABSF1= 16.522
##$ABSF2= -4.171173
##$ABSG= 5
##$ABSL= 3
##$ALPHA= 0
##$AQORDER= 0
##$ASSFAC= 0
##$ASSFACI= 0
##$ASSFACX= 0
##$ASSWID= 0
##$AUNMP= <proc_1d>
##$AZFE= 0.1
##$AZFW= 0.1
##$BCFW= 0
##$BC_mod= 0
##$BYTORDP= 0
##$COROFFS= 0
##$CY= 12.5
##$DATMOD= 1
##$DC= 0
##$DFILT= <>
##$DTYPP= 0
##$F1P= 14.0000005364418
##$F2P= -0.99999901652339
##$FCOR= 0.5
##$FTSIZE= 32768
##$FT_mod= 6
##$GAMMA= 0
##$GB= 0
##$INTBC= 1
##$INTSCL= 1
##$ISEN= 128
##$LB= 0.3
##$LEV0= 0
##$LPBIN= 0
##$MAXI= 10000
##$MC2= 0
##$MEAN= 0
##$ME_mod= 0
##$MI= 0
##$NCOEF= 0
##$NC_proc= -4
##$NLEV= 6
##$NOISF1= 0
##$NOISF2= 0
##$NSP= 0
##$NTH_PI= 0
##$NZP= 0
##$OFFSET= 16.522
##$PC= 1
##$PHC0= -34.61792
##$PHC1= -5.575253
##$PH_mod= 1
##$PKNL= yes
##$PPARMOD= 0
##$PSCAL= 4
##$PSIGN= 0
##$REVERSE= no
##$SF= 250.13
##$SI= 32768
##$SIGF1= 0
##$SIGF2= 0
##$SINO= 400
##$SIOLD= 32768
##$SREGLST= <1H.CDCl3>
##$SSB= 0
##$STSI= 32768
##$STSR= 0
##$SW_p= 5175.98343685301
##$SYMM= 0
##$S_DEV= 0
##$TDeff= 65536
##$TDoff= 0
##$TI= <Analysis number 999999
Compound Code 99
Book Reference 9
Project Code 9>
##$TILT= no
##$TM1= 0
##$TM2= 0
##$TOPLEV= 0
##$USERP1= <user>
##$USERP2= <user>
##$USERP3= <user>
##$USERP4= <user>
##$USERP5= <user>
##$WDW= 1
##$XDIM= 32768
##$YMAX_p= 408272558
##$YMIN_p= -1133549
$$ End of Bruker specific parameters
$$ ---------------------------------
##NTUPLES= NMR SPECTRUM
##VAR_NAME=  FREQUENCY,     SPECTRUM/REAL,   SPECTRUM/IMAG
##SYMBOL=    X,             R,               I
##VAR_TYPE=  INDEPENDENT,   DEPENDENT,       DEPENDENT
##VAR_FORM=  AFFN,          ASDF,            ASDF
##VAR_DIM=   32768,         32768,           32768
##UNITS=     HZ,            ARBITRARY UNITS, ARBITRARY UNITS
##FACTOR=    0.157963299565203, 1,           1
##FIRST=     4132.6476996994, 0,             0
##LAST=      -1043.33573715361, 0,           0
##MIN=       -1043.33573715361, -1133549,    0
##MAX=       4132.6476996994, 408272558,     0
$$ Real data points
##PAGE= N=1
##DATA TABLE= (X++(R..R)), XYDATA
$$ [...]
$$ plain form
23046 -683019 -619451 -521835 -458842 -140788 -98240 -375059 -552644 -542677 -384271 -361930 -351685
23035 -351685 -488059 -299982 -169596 -238256 -450715 -576128 -559066 -69263 35943 67803
23025 67803 295678 251088 -53757 -588882 -764060 -468802 -299143 -208525 59748 50316
23015 50316 37986 37790 140350 360759 333994 357399 417112 460223 351381 77509 114550
23004 114550 199642 12637 -201869 -334372 -345677 -256554 -271526 -135404 138920 -56068
22994 -56068 -240979 -127652 -241312 -140950 64566 489311 674773 235351 -150539 -185139
22984 -185139 14817 140917 35333 -270622 -221536 -190664 -128431 -137927 59502 35370 96519
22973 96519 352770 482860 482703 412887 42879 -463390 -415575 -199685 114358 -79616 -232935
$$ packed form
23046f83019O3568R7616O2993L18054M2548k76819j77585R967J58406K2341J0245
23035c51685j36374J88077J30386o8660k12459j25413J7062M89803J05206L1860
23025F7803K27875m4590l04845n35125j75178K95258J69659R0618K68273r432
23015E0316j2330j96J02560K20409k6765K3405N9713M3111j08842k73872L7041
23004A14550Q5092j87005k14506j32503j1305Q9123j4972J36122K74324j94988
22994e6068j84911J13327j13660J00362K05516M24745J85462m39422l85890l4600
22984a85139J99956J26100j05584l05955M9086L0872O2233r496J97429k4132O1149
22973I6519K56251J30090j57o9816l70008n06269M7815K15890L14043j93974j53319
$$ plain form
22962 -232935 -135804 4021 -53548 -256498 -406256 -261191 36131 230710 245608 179041
22952 179041 152530 309239 323622 193914 81455 -222083 -297153 -33093 122537 131383
22942 131383 17959 14487 67037 246803 81453 -147147 -36898 -80503 13789 118620
22932 118620 332354 300232 265881 301025 131598 -33899 -51398 53378 85072 308 -129741
22921 -129741 -226311 -216541 -310594 -125263 100732 -173979 -590722 -702557 -683575 -616838 -441587
22910 -441587 -363874 -254572 -282367 -292327 -544048 -671587 -435355 -203419 230115 249626
22900 249626 126009 -43387 26178 138921 -87655 -129715 -50768 11537 24441 115718 -47985
22889 -47985 -124357 98713 -158819 38577 440647 265061 -162047 -79313 -47219 -60137
$$ packed form
22962b32935R7131J39825n7569k02950j49758J45065K97322J94579J4898o6567
22952A79041k6511J56709J4383j29708j12459l03538p5070K64060J55630Q846
22942A31383j13424l472N2550J79766j65350k28600J10249m3605R4292J04831
22932A18620K13734l2122l4351L5144j69427j65497j7499J04776L1694q4764j30049
22921a29741r6570R770r4053J85331K25995k74711m16743j11835J8982O6737J75251
22910d41587P7713J09302k7795r960k51721j27539K36232K31936M33534J9511
22900B49626j23617j69396O9565J12743k26576m2060P8947O2305J2904R1277j63703
22889d7985p6372K23070k57532J97396M02070j75586m27108Q2734L2094j2918
$$ plain form
22879 -60137 66977 131677 -90711 -393394 -243754 10280 290951 441427 187496 197332
22869 197332 -8713 -240650 -246107 -115208 -27082 -83969 -151716 -233687 -522984 -745530 -587510
22858 -587510 -267961 -105716 -55932 126937 313020 370947 443591 283577 203075 220504
22848 220504 299481 262374 173618 105842 262756 140489 -118565 -206776 -378845 -351560 -373276
22837 -373276 -283860 -259108 -173414 -70333 -96972 -281324 -204999 -230941 -353270 -131725 -188532
22826 -188532 -116696 -4657 -297318 -250260 -175113 192475 395848 213279 165874 -35470
22816 -35470 72411 89940 9206 -62777 211427 203005 101102 162268 170094 39731 9518
22805 9518 75709 13207 -229825 -210030 46492 -127486 -380081 -364503 -410201 -63548 178228
$$ packed form
22879f0137J27114O4700k22388l02683J49640K54034K80671J50476k53931R836
22869A97332k06045k31937n457J30899Q8126n6887o7747q1971k89297k22546J58020
22858e87510L19549J62245M9784J82869J86083N7927P2644j60014q0502J7429
22848B20504P8977l7107q8756o7776J56914j22267k59054q8211j72069K7285k1716
22837c73276Q9416K4752Q5694J03081k6639j84352P6325k5942j22329K21545n6807
22826a88532P1836J12039k92661M7058P5147L67588K03373j82569m7405k01344
22816c5470J07881J7529q0734p1983K74204q422j01903O1166P826j30363l0213
22805I518O6191o2502k43032J9795K56522j73978k52595J5578m5698L46653K41776
$$ plain form
22794 178228 300457 210107 246354 293680 109818 -30987 234878 334619 334081 272340 399019
22783 399019 412934 289460 219876 212978 189766 9368 -163295 -191219 -100692 138756 602961
22772 602961 555901 327108 -141423 -84909 -43246 104343 -91581 -290923 -305320 -81692
22762 -81692 100240 121359 -12022 -243670 -169231 177758 394641 388992 69639 -42789
22752 -42789 -74012 407296 882820 590233 11820 -408373 -532099 -584076 -645993 -786632
22742 -786632 -616439 -249993 -253231 -532371 -533873 -434049 -103200 -16605 -131955 -350472 -409200
22731 -409200 -130843 74214 302866 446802 274948 151175 273617 79633 -113973 -230600
22721 -230600 -275845 103988 139007 -62564 -127493 -365821 -379322 -148147 -249446 -164557
$$ packed form
22794A78228J22229r0350L6247M7326j83862j40805K65865R9741n38o1741J26679
22783C99019J3915j23474o9584o898k3212j80398j72663k7924R0527K39448M64205
22772F02961m7060k28793m68531N6514M1663J47589j95924j99342j4397K23628
22762h1692J81932K1119j33381k31648P4439L46989K16883n649l19353j12428
22752d2789l1223M81308M75524k92587n78413m20193j23726n1977o1917j40639
22742g86632J70193L66446l238k79140j502R9824L30849Q6595j15350k18517n8728
22731d09200K78357K05057K28652J43936j71854j23773J22442j93984j93606j16627
22721b30600m5245L79833L5019k01571o4929k38328j3501K31175j01299Q4889
$$ plain form
22711 -164557 144979 109410 167798 -14206 230039 153618 273803 274164 36390 43773 97270
22700 97270 217125 150166 55152 -200654 -364598 -592564 -699946 -471713 -455038 -345429
22690 -345429 -169354 -330666 -192549 71646 188605 -47765 -279129 -259824 -202477 -368777
22680 -368777 -405763 -158610 -175912 -474847 -754692 -662943 -265700 6894 -146219 -307080
22670 -307080 -255384 12640 -64007 -61308 -230172 -478717 -627414 -448333 -176363 -25147
22660 -25147 8872 -258695 -447257 -231206 -119750 -291888 -398142 -162027 23748 131990
22650 131990 403325 564178 290953 222858 191086 413144 509289 318743 33828 -184784
22640 -184784 33251 19977 100249 29940 -111800 -189268 -93334 221780 238813 235927 -91517
$$ packed form
22711a64557L09536l5569N8388j82004K44245p6421J20185L61k37774P383N3497
22700I7270J19855o6959r5014k55806j63944k27966j07382K28233J6675J09609
22690c45429J76075j61312J38117K64195J16959k36370k31364J9305N7347j66300
22680c68777l6986K47153j7302k98935k79845R1749L97243K72594j53113j60861
22670c07080N1696K68024p6647K699j68864k48545j48697J79081K71970J51216
22660b5147L4019k67567j88562K16051J11456j72138j06254K36115J85775J08242
22650A31990K71335J60853k73225o8095l1772K22058R6145j90546k84915k18612
22640a84784K18035j3274Q0272p0309j41740p7468R5934L15114J7033k886l27444
$$ plain form
22629 -91517 -383903 -584849 -249339 113655 223355 211834 406651 274452 58733 -181930
22619 -181930 -259563 48636 141596 -31942 -89183 -356982 -429937 -411420 -145781 -165579 -304977
22608 -304977 -434200 -410980 -358740 -222641 102755 77671 -85082 143863 178632 -86307
22598 -86307 -54615 -38896 210582 170849 -49189 -81248 188147 343082 138484 112107 -147628
22587 -147628 -420729 -184270 79573 295585 -151665 -529636 -426961 -174321 -33305 333776
22577 333776 574170 686037 481201 79150 -13055 -298740 -370224 -368614 -231446 21109
22567 21109 -92717 -416142 -442698 -482279 -440293 -345280 -228933 -106704 -94909 -71569 -92267
22556 -92267 -42429 -108209 -107231 11256 25846 -110648 -376489 -166261 -6317 -142592 -281810
$$ packed form
22629i1517k92386k00946L35510L62994J09700j1521J94817j32199k15719k40663
22619a81930p7633L08199R2960j73538n7241k67799p2955J8517K65639j9798j39398
22608c04977j29223K3220N2240J36099L25396k5084j62753K28945L4769k64939
22598h6307L1692J5719K49478l9733k20038l2059K69395J54935k04598k6377k59735
22587a47628k73101K36459K63843K16012m47250l77971J02675K52640J41016L67081
22577C33776K40394J11867k04836m02051r2205k85685p1484J610J37168K52555
22567B1109j13826l23425k6556l9581M1986R5013J16347J22229J1795K3340k0698
22556i2267M9838o5780R78J18487J4590j36494k65841K10228J59944j36275j39218
$$ plain form
22545 -281810 -456654 -567555 -851122 -691971 -308326 -34753 -120217 -233872 -206250 103617
22535 103617 -37797 -209173 -51395 222990 274177 -114375 -420755 -529137 -597908 -357598
22525 -357598 93465 80287 -127461 -364682 -382196 -223181 -147197 108940 154206 37063
22515 37063 -299647 -477542 -428450 -320655 -108730 -150301 -266358 -374889 -465647 -260257
22505 -260257 -90206 -220161 -50652 337802 382133 153456 -303167 -481981 -555143 -381270
22495 -381270 -149585 -80519 -96596 -202919 -60584 287132 459679 463419 447018 496773 416751
22484 416751 143487 41015 -94569 -386355 -165130 -179131 137415 30100 -116544 -369755
22474 -369755 -429704 -407392 -440249 -442059 -253820 -171464 112930 -24243 -370921 -191791 40699
$$ packed form
22545b81810j74844j10901k83567J59151L83645K73573q5464j13655K7622L09867
22535A03617j41414j71376J57778K74385N1187l88552l06380j08382o8771K40310
22525c57598M51063j3178k07748k37221j7514J59015P5984K56137M5266j17143
22515C7063l36710j77895M9092J07795K11925m1571j16057j08531r0758K05390
22505b60257J70051j29955J69509L88454M4331k28677m56623j78814p3162J73873
22495c81270K31685O9066j6077j06323J42335L47716J72547L740j6401M9755q0022
22484D16751k73264j02472j35584k91786K21225j4001L16546j07315j46644k53211
22474c69755n9949K2312l2857j810J88239Q2356K84394j37173l46678J79130K32490
$$ plain form
22463 40699 31464 -33082 -35608 44783 6355 -35773 -89970 22013 -145719 -237896 -277983 -567733
22451 -567733 -453869 -86424 -60407 -79879 247586 208394 258941 122264 151633 139417 196758
22440 196758 426871 72786 -15887 111603 -53724 -175633 -451089 -500120 -187175 85757
22430 85757 -146417 -256714 -267669 24662 -59935 -57549 -429957 -615534 -230082 49677
22420 49677 144923 160603 -34448 -23103 63333 99847 -56234 123254 313486 248827 -51858
22409 -51858 -94208 -428247 -376651 -349084 -461734 -518716 -312794 -154524 -9806 -61427 -389965
22398 -389965 -321716 -86076 67775 -12028 43119 70833 -120402 -56693 259046 281834 6715
22387 6715 116538 105166 -172532 -596559 -546558 -169980 -2439 -237168 -418120 -426840 -230400
$$ packed form
22463D0699r235o4546k526Q0391l8428m2128n4197J11983j67732r2177m0087k89750
22451e67733J13864L67445K6017j9472L27465l9192N0547j36677K9369j2216N7341
22440A96758K30113l54085q8673J27490j65327j21909k75456m9031L12945K72932
22430H5757k32174j10297j0955K92331q4597K386l72408j85577L85452K79759
22420D9677R5246J5680j95051J1345Q6436L6514j56081J79488J90232o4659l00685
22409e1858m2350l34039N1596K7567j12650n6982K05922J58270J44718n1621l28538
22398c89965O8249K35640J53851p9803N5147K7714j91235O3709L15739K2788k75119
22387F715J09823j1372k77698m24027N0001L76578J67541k34729j80952q720J96440
$$ plain form
22376 -230400 -138510 -33069 -44285 -256377 -535509 -226817 -293407 -380847 -530537 -201953
22366 -201953 -225548 -294561 -275347 -184991 -47251 -29619 -140354 -217499 -28775 70090 -149530
22355 -149530 -63262 -114475 129632 30869 -201577 -221109 -105559 -79547 -54821 151301 136766
22344 136766 -276286 -239873 155253 170111 -99229 -85716 -44283 -267308 -322324 -203816
22334 -203816 -98951 -182936 -245663 -147903 53900 545056 616363 148622 -286957 -94127
22324 -94127 163407 31217 -134097 -291746 -313992 -209541 -89277 98275 42292 -94121
22314 -94121 67123 59365 -407497 -598496 -569662 -598760 -577937 -587341 -647197 -505456 -282532
22303 -282532 160884 144627 385305 299542 -218110 -176297 31768 -30474 -178109 -310796
$$ packed form
22376b30400R1890J05441j1216k12092k79132L08692o6590q7440j49690L28584
22366b01953k3595o9013J9214R0356J37740J7632j10735p7145J88724R8865k19620
22355a49530Q6268n1213K44107r8763k32446j9532J15550K6012K4726K06122j4535
22344A36766m13052L6413L95126J4858k69340J3513M1433k23025n5016J18508
22334b03816J04865q3985o2727R7760K01803M91156P1307m67741m35579J92830
22324i4127K57534j32190j65314j57649k2246J04451J20264J87552n5983j36413
22314i4121J61244p758m66862j90999K8834k9098K0823r404n9856J41741K22924
22303b82532M43416j6257K40678q5763n17652M1813K08065o2242j47635j32687
$$ plain form
22293 -310796 -135220 250803 307231 100099 224094 344662 132484 -342870 -221494 22038
22283 22038 252235 216537 9678 -349769 -610008 -799571 -670639 -210104 -241122 -44779
22273 -44779 224880 164608 -86368 -113772 -158382 -188432 -288251 -346246 -152323 -336724 -597870
22262 -597870 -563058 -508517 -325015 -195402 42668 -213392 -191366 -267624 -417968 -691203
22252 -691203 -838081 -684334 -506484 -347208 -364220 -165312 -285660 -326527 47267 98438
22242 98438 218136 -37693 -237683 -83083 233796 160299 98363 175569 -119173 142131
22232 142131 402633 341750 189667 326758 338717 232898 46512 -8731 62940 336200
22222 336200 530739 397685 216831 114171 111526 -65566 -9128 21834 51709 -175215
$$ packed form
22293c10796J75576L86023N6428k07132J23995J20568k12178m75354J21376K43532
22283B2038K30197l5698k06859l59447k60239j89563J28932M60535l1018J96343
22273d4779K69659o0272k50976k7404m4610l0050r9819n7995J93923j84401k61146
22262e97870L4812N4541J83502J29613K38070k56060K2026p6258j50344k73235
22252f91203j46878J53747J77850J59276j7012J98908j20348m0867L73794N1171
22242I8438J19698k55829j99990J54600L16879p3497o1936P7206k94742K61304
22232A42131K60502o0883j52083J37091J1959j05819j86386n5243P1671K73260
22222C36200J94539j33054j80854j02660k645j77092N6438L0962K9875k26924
$$ plain form
22212 -175215 -195866 -149905 -108840 -186156 -439641 -202390 -95420 27609 -213911 -740460
22202 -740460 -775837 -493864 -343727 -71407 52725 219370 56997 53222 -147445 -84829
22192 -84829 7972 202112 223067 59008 -196123 -319799 -350917 -493665 -551997 -334230
22182 -334230 -170870 -183372 -148757 9369 305943 334388 23525 -119758 -91671 123206
22172 123206 197332 186833 -82435 -234999 -299501 -160428 -182870 76451 -154004 -328411
22162 -328411 -175095 170006 -26249 -251597 -158962 82578 366576 238403 138726 157481
22152 157481 271210 114278 -223882 -138185 -93443 -179665 -113634 -136860 -360456 -221355
22142 -221355 31838 -86698 -124763 -78726 -199329 -233397 -324885 -532764 -736102 -621125
$$ packed form
22212a75215k0651M5961M1065p7316k53485K37251J06970J23029k41520n26549
22202g40460l5377K81973J50137K72320J24132J66645j62373l775k00667O2616
22192h4829R2801J94140K0955j64059k55131j23676l1118j42748n8332K17767
22182c34230J63360j2502L4615J58126K96574K8445l10863j43283K8087K14877
22172A23206P4126j0499k69268j52564o4502J39073k2442K59321k30455j74407
22162c28411J53316L45101j96255k25348R2635K41540K83998j28173r9677J8755
22152A57481J13729j56932l38160Q5697M4742q6222O6031k3226k23596J39101
22142b21355K53193j18536l8065M6037j20603l4068r1488k07879k03338J14977
$$ plain form
22132 -621125 -761721 -637699 -567126 -579817 -442710 -343736 -368594 -318950 -292541 -354086 -405250
22121 -405250 -472583 -133419 219560 136187 -178999 -178108 -169533 27913 245173 -26925 -98954
22110 -98954 -53663 -147646 -257177 -379635 -293164 -30568 85608 -243433 -97438 153790
22100 153790 220113 68418 -111313 -2362 186193 241021 160548 192999 123316 13458
22090 13458 12446 187953 250939 365155 257098 -77615 -208944 165149 600714 273317
22080 273317 219651 317575 -42630 -211384 -129929 58478 -215797 -129852 -108681 -185005 -177046
22069 -177046 -839 136728 64541 -6627 -110357 -19259 18364 -48900 -342549 -464737
22059 -464737 -102326 382363 169397 211430 547085 559027 382268 140091 -89874 -83244
$$ packed form
22132f21125j40596J24022P0573j2691J37107R8974k4858M9644K6409o1545n1164
22121d05250o7333L39164L52979q3373l15186Q91Q575J97446K17260k72098p2029
22110i8954M5291r3983j09531j22458Q6471K62596J16176l29041J45995K51228
22100A53790O6323j51695j79731J08951J88555N4828q0473L2451o9683j09858
22090A3458j012J75507O2986J14216j08057l34713j31329L74093M35565l27397
22080B73317n3666R7924l60205j68754Q1455J88407k74275Q5945K1171p6324P959
22069a77046J76207J37567p2187p1168j03730R1098L7623o7264k93649j22188
22059d64737L62411M84689k12966M2033L35655J1942j76759k42177k29965O630
$$ plain form
22049 -83244 -307013 -584737 -457704 -295588 -293437 -517314 -154020 43637 -544077 -556575
22039 -556575 -482042 -97025 -51383 -165199 -69390 92839 231989 335897 175832 199069
22029 199069 -43278 27057 205342 147080 272178 306627 185289 26175 -55286 -333157
22019 -333157 -474885 -152234 -102876 158081 123799 -143001 -99521 -150346 379690 399686
22009 399686 112566 -228636 -735486 -457110 132287 44476 -290647 -403121 -295857 -123764
21999 -123764 150039 -21303 -283689 -147195 -56033 62321 103965 -162342 -87421 123420
21989 123420 224702 227964 198073 228228 42148 76126 49818 9726 74663 279040 312969
21978 312969 346194 212808 -35415 -169897 -205729 -123182 -152110 54997 180994 349746
$$ packed form
22049h3244k23769k77724J27033J62116K151k23877L63294J97657n87714j2498
22039e56575P4533L85017M5642j13816R5809J62229J39150J03908j60065K3237
22029A99069k42347P0335J78285n8262J25098L4449j21338j59114q1461k77871
22019c33157j41728L22651M9358K60957l4282k66800M3480n0825N30036J9996
22009C99686k87120l41202n06850K78376N89397q7811l35123j12474J07264J72093
21999a23764K73803j71342k62386J36494R1162J18354M1644k66307P4921K10841
21989A23420J01282L262k9891L0155j86080L3978k6308m0092O4937K04377L3929
21978C12969L3225j33386k48223j34482l5832Q2547k8928K07107J25997J68752
$$ plain form
21968 349746 166220 -71699 -351885 -384963 -59266 -184488 -429263 -239776 43129 -106518
21958 -106518 -273204 -185685 -525400 -946466 -797069 -366877 -28381 -28038 125207 499010
21948 499010 559801 345998 339683 287333 205093 45879 -215739 -119892 189247 208298 -2044
21937 -2044 -37129 127208 230571 103481 -111057 -228248 -206405 -336156 -532470 -370516
21927 -370516 -184844 179534 408961 118690 57109 268219 428168 677198 664642 513362
21917 513362 286696 28403 195977 484659 451585 95294 25923 -15481 23677 -143233
21907 -143233 -137981 -194886 -255841 -192348 -81780 -6823 -138426 -299056 -331826 -181010 -79762
21896 -79762 -97358 -170272 105039 390266 361211 94831 -38499 290693 257766 -4596
$$ packed form
21968C49746j83526k37919k80186l3078L25697j25222k44775J89487K82905j49647
21958a06518j66686Q7519l39715m21066J49397M30192L38496L43J53245L73803
21948D99010O0791k13803o315n2350q2240j59214k61618R5847L09139J9051k10342
21937b044l5085J64337J03363j27090k14538j17191K1843j29751j96314J61954
21927c70516J85672L64378K29427k90271o1581K11110J59949K49030j2556j51280
21917E13362k26666k58293J67574K88682l3074l56291o9371m1404L9158j66910
21907a43233N252n6905o0955O3493J10568P4957j31603j60630l2770J50816J01248
21896g9762j7596p2914K75311K85227k9055k66380j33330L29192l2927k62362
$$ plain form
21886 -4596 40456 -204181 -205244 -126548 -17671 100240 244005 131305 -82664 -94567 179541
21875 179541 -36746 -26393 -26806 121246 -117811 -167689 98474 232363 354610 502474
21865 502474 357507 240389 371711 433225 114257 -20865 -154057 -148421 -214056 -166133
21855 -166133 106912 183922 170864 346085 595535 449477 482838 561390 255672 -66821
21845 -66821 227905 641963 564012 139919 -79016 93257 239473 262444 -79221 -220394
21835 -220394 -113309 -349088 -433512 -291676 -321228 29801 28953 54400 30336 237618 291003
21824 291003 464935 244087 -304332 -490705 -536045 -319338 -146796 -177510 -359184 -491175
21814 -491175 -569322 -552334 -553428 -391891 -215667 8036 -118147 -52715 -62563 71844 152619
$$ packed form
21886d596M5052k44637j063P8696J08877J17911J43765j12700k13969j1903K74108
21875A79541k16287J0353m13J48052k39057m9878K66163J33889J22247J47864
21865E02474j44967j17118J31322O1514l18968j35122j33192N636o5635M7923
21855a66133K73045P7010j3058J75221K49450j46058L3361P8552l05718l22493
21845f6821K94726M14058p7951m24093k18935J72273J46216K2971l41665j41173
21835b20394J07085k35779q4424J41836k9552L51029q48K5447k4064K07282N3385
21824B91003J73932k20848n48419j86373m5340K16707J72542l0714j81674j31991
21814d91175p8147J6988j094J61537J76224K23703j26183O5432r848J34407Q0775
$$ plain form
21803 152619 247356 428787 29152 -403942 -296257 -88539 -73962 -97501 -84544 -216963
21793 -216963 -233861 -80419 -2621 124784 -133971 -112003 187959 -84412 -413040 -476679
21783 -476679 -388506 -230406 -131478 113203 77712 21375 -44679 -197843 -343897 -291666 123432
21772 123432 235357 165509 303652 348278 337098 329198 259508 -69698 11121 -29877 13216
21761 13216 107419 -227877 -435813 -315580 -45119 321471 308271 98836 -9754 -409365
21751 -409365 -326117 16997 28708 2744 76500 -113754 -250824 -310265 -386051 -181695 80205
21740 80205 -303342 -146359 -453431 -417287 -444649 -466225 -318825 -359589 -329935 -124221 -48929
21729 -48929 -155196 71139 777974 779237 408991 337141 319568 131690 -66567 -274485
$$ packed form
21803A52619R4737J81431l99635m33094J07685K07718J4577k3539J2957j32419
21793b16963j6898J53442P7798J27405k58755K1968K99962k72371l28628o3639
21783d76679Q8173J58100R8928K44681l5491n6337o6054j53164j46054N2231M15098
21772A23432J11925o9848J38143M4626j1180p900o9690l29206Q0819m0998M3093
21761A3216R4203l35296k07936J20233K70461L66590j3200k09435j08590l99611
21751d09365Q3248L43114J1711k5964P3756j90254j37070n9441p5786K04356K61900
21740H0205l83547J56983l07072L6144k7362k1576J47400m0764K9654K05714P5292
21729d8929j06267K26335P06835J263l70246p1850j7573j87878j98257k07918
$$ plain form
21719 -274485 -88168 22461 -91236 -7427 32480 154967 255379 282684 295537 236103
21709 236103 344450 436509 364717 189447 126351 -169922 -96824 78952 113716 -213566
21699 -213566 -339074 -167447 89361 -116764 -198052 25039 137009 39813 108764 100408
21689 100408 120060 41728 25504 121517 334990 245376 139585 -133604 -144367 144669 78293
21678 78293 -89238 -250438 -194759 -220789 -222270 217893 417576 249953 48836 25427 96444
21667 96444 213287 32102 50686 -41541 -152429 -62068 131672 137939 247804 159331 209069
21656 209069 -12560 24397 53553 -34124 48936 93562 165648 86845 23231 194103 501488
21645 501488 374418 153908 51098 -130161 -117151 248266 158080 65185 -98811 -34799
$$ packed form
21719b74485J86317J10629j13697Q3809L9907J22487J00412K7305J2853n9434
21709B36103J08347R2059p1792j75270o3096k96273P3098J75776L4764l27282
21699b13566j25508J71627K56808k06125q1288K23091J11970r7196O8951q356
21689A00408J9652p8332j6224R6013K13473q9614j05791k73189j0763K89036o6376
21678G8293j67531j61200N5679k6030j481M40163J99683j67623k01117k3409P1017
21667I6444J16843j81185J8584r2227j10888R0361J93740O267J09865q8473M9738
21656B09069k21629L6957K9156q7677Q3060M4626P2086p8803o3614J70872L07385
21645E01488j27070k20510j02810j81259J3010L65417r0186r2895j63996O4012
$$ plain form
21635 -34799 -173217 -194017 -440825 -392762 -227701 -302714 63249 42614 -105584 99229
21625 99229 42367 -281098 -269360 -319135 -301620 -130433 -197114 275219 490587 216963 65663
21614 65663 -113228 -112474 -74523 30226 188521 212519 294872 292562 277786 542799 596431
21603 596431 436403 192913 -62618 -261256 -359544 -21449 71116 199361 -17986 47350
21593 47350 156901 -17415 94893 70902 38564 49840 43059 -181228 -408810 -230304 -111376
21582 -111376 -63410 -44067 -169953 85901 249851 311722 75811 127880 555061 629216
21572 629216 571759 264416 -78452 -372920 -254346 -323505 -408442 -240064 -390957 -547007
21562 -547007 -280756 -221767 -310814 -382896 -227809 -171668 46897 277690 316656 112465
$$ packed form
21635c4799j38418k0800k46808M8063J65061p5013L65963k0635j48198K04813
21625I9229n6862l23465J1738m9775J7515J71187o6681M72333K15368k73624j51300
21614F5663j78891P54L7951J04749J58295K3998Q2353k310j4776K65013N3632
21603E96431j60028k43490k55531j98638r8288L38095R2565J28245k17347O5336
21593D7350J09551j74316J12308k3991l2338J1276o781k24287k27582J78506J18928
21582a11376M7966J9343j25886K55854J63950O1871k35911N2069M27181P4155
21572F29216n7457l07343l42868k94468J18574o9159q4937J68378j50893j56050
21562e47007K66251N8989q9047p2082J55087N6141K18565K30793L8966k04191
$$ plain form
21552 112465 -103794 -139638 -169051 -11274 -33167 58291 120300 167619 114264 -59324 175222
21541 175222 466611 233698 101242 4491 -52875 27334 -23789 123979 133223 -13386 -391494
21530 -391494 -270692 201057 441814 278258 -68002 2519 -2529 -56320 -102852 -11181 -103044
21519 -103044 -304245 -371590 -370163 84785 50287 -97380 -299565 -356550 -271155 -83028 170739
21508 170739 397263 442682 306337 397720 233038 33637 -57705 -170893 -320928 -508807
21498 -508807 -896655 -655771 -320886 15153 -7654 67199 -60505 -293716 -276063 -62953
21488 -62953 -17912 -171949 -341813 -187593 -103776 -572867 -561104 -283988 -548551 -521467
21478 -521467 -332815 -219055 -20733 47748 -214656 -246871 -291676 -438326 -348241 -101772
$$ packed form
21552A12465k16259l5844k9413J57777k1893R1458O2009M7319n3355j73588K34546
21541A75222K91389k32913j32456r6751n7366Q0209n1123J47768R244j46609l78108
21530c91494J20802M71749K40757j63556l46260P0521n048n3791m6532R1671r1863
21519a03044k01201o7345J427M54948l4498j47667k02185n6985Q5395J88127K53767
21508A70739K26524M5419j36345R1383j64682j99401r1342j13188j50035j87879
21498e08807l87848K40884L34885L36039k2807P4853j27704k33211J7653K13110
21488f2953M5041j54037j69864J54220Q3817m69091J1763K77116k64563K7084
21478e21467J88652J13760J98322O8481k62404l2215m4805j46650R0085K46469
$$ plain form
21468 -101772 169481 -59326 -342267 -315865 -39707 231182 23553 -427679 -321598 -157569
21458 -157569 7683 159406 308881 148231 228333 497078 690514 717247 395164 200103
21448 200103 483371 494912 360343 273466 110559 156582 257572 81809 -135692 -176139
21438 -176139 124576 306163 416416 189150 75949 498213 299864 394599 276661 322437
21428 322437 211100 45005 95364 159551 181932 138214 -70587 -217509 -38351 -225223
21418 -225223 -359964 -209840 -360208 -770042 -582199 -345401 41787 164315 45777 -224072
21408 -224072 -309250 -147082 -306656 -368623 -231671 96559 88112 125417 196747 325936 503901
21397 503901 258136 94893 98676 -32206 -242173 -319699 120371 160833 -99346 -241726
$$ packed form
21468a01772K71253k28807k82941K6402K76158K70889k07629m51232J06081J64029
21458a57569J65252J51723J49475j60650Q0102K68745J93436K6733l22083j95061
21448B00103K83268J1541j34569q6877j62907M6023J00990j75763k17501m0447
21438a76139L00715J81587J10253k27266j13201M22264j98349R4735j17938M5776
21428C22437j11337j66095N0359O4187K2381m3718k08801j46922J79158j86872
21418b25223j34741J50124j50368m09834J87843K36798L87188J22528j18538k69849
21408b24072q5178J62168j59574o1967J36952L28230q447L7305P1330J29189J77965
21397E03901k45765j63243L783j30882k09967p7526M40070M0462k60179j42380
$$ plain form
21387 -241726 -150308 297048 469029 230426 -79611 -13789 86296 -92858 -115587 -376636
21377 -376636 -517122 -620623 -682906 -428920 -401340 -326721 -302171 -223996 140085 527042
21367 527042 440445 112966 -39090 -26623 178895 346402 552320 511863 379675 95568
21357 95568 -38609 195023 289584 313934 105574 37122 136704 541430 479835 149076 16459
21346 16459 -115700 -124202 -9051 195626 -13225 -87873 -2873 267171 462317 331437
21336 331437 390211 556665 178037 -10844 -59417 -160047 112147 204294 -185990 -500797
21326 -500797 -586325 -598315 -497343 -277990 -422824 -103692 331529 239110 -29730 -138767
21316 -138767 87842 262193 276154 422380 229619 459781 499296 360392 527553 532476
$$ packed form
21387b41726R1418M47356J71981k38603l10037O5822J00085j79154k2729k61049
21377c76636j40486j03501o2283K53986K7580P4619K4550P8175L64081L86957
21367E27042q6597l27479j52056J2467K05518J67507K05918m0457j32188k84107
21357I5568j34177K33632R4561K4350k08360o8452R9582M04726o1595l30759j32617
21346A6459j32159q502J15151K04677k08851p4648Q5000K70044J95146j30880
21336C31437N8774J66454l78628j88881m8573j00630K72194R2147l90284l14807
21326e00797q5528j1990J00972K19353j44834L19132M35221r2419k68840j09037
21316a38767K26609J74351J3961J46226j92761K30162L9515j38904J67161M923
$$ plain form
21306 532476 353906 260855 219479 366497 463605 101133 -48241 -44310 -308021 -139871
21296 -139871 327047 468523 629581 553326 448102 363889 367040 178045 257202 441769
21286 441769 446756 381438 366128 306462 -84658 -211796 -561229 -742986 -283594 -208718 -331211
21275 -331211 -111213 9670 268719 390159 496886 516311 723530 567627 409511 131846
21265 131846 -271122 -225220 97702 -67080 -51819 143061 148104 47132 -114249 -319546
21255 -319546 -512796 -651490 -564417 -444338 -158718 140565 104471 -34635 -236746 -478747
21245 -478747 -324310 -352499 -268438 -267726 -255787 -155466 138126 189510 268995 -63625 -319379
21234 -319379 -475912 -364069 -323010 -464315 -322621 -240973 -64875 -232991 -516651 -441397
$$ packed form
21306E32476j78570r3051m1376J47018R7108l62472j49374L931k63711J68150
21296a39871M66918J41476J61058p6255j05224q4213L151j88995P9157J84567
21286D41769M987o5318j5310n9666l91120j27138l49433j81757M59392P4876j22493
21275c31211K19998J20883K59049J21440J06727J9425K07219j55903j58116k77665
21265A31846m02968M5902L22922j64782J5261J94880N043j00972j61381k05297
21255c19546j93250j38694Q7073J20079K85620K99283l6094j39106k02111k42001
21245d78747J54437k8189Q4061P12J1939J00321K93592N1384P9485l32620k55754
21234c19379j56533J11843M1059j41305J41694Q1648J76098j68116k83660P5254
$$ plain form
21224 -441397 -388117 -259699 -312733 -654970 -537534 -218321 91034 391224 331461 -8702
21214 -8702 115688 359059 257048 124438 58210 114133 135333 -47246 -179002 -270301 -363135
21203 -363135 -245418 -176563 -185786 41739 -2390 -40256 76219 -237342 -234410 -3392 114212
21192 114212 129230 185981 240749 630846 756784 400478 459510 537581 203961 -44781
21182 -44781 -26242 -143166 -183382 -57935 -127702 -54774 15759 144383 176297 -47359 -372020
21171 -372020 -226316 260617 462026 385163 453914 536016 235957 -215722 -436614 -89570
21161 -89570 134035 -109647 -319877 -298232 -10094 78146 159317 67583 -58356 39370 17341
21150 17341 -3561 96801 -211561 -506808 -627642 -524146 -429515 -360591 -408878 -383175 -313447
$$ packed form
21224d41397N3280J28418n3034l42237J17436L19213L09355L00190n9763l40163
21214h702J24390K43371j02011j32610o6228N5923K1200j82579j31756r1299r2834
21203c63135J17717O8855r223K27525m4129l7866J16475l13561K932K31018J17604
21192A14212J5018N6751N4768L90097J25938l56306N9032P8071l33620k48742
21182d4781J8539j16924m0216J25447o9767P2928P0533J28624L1914k23656l24661
21171c72020J45704M86933K01409p6863O8751Q2102l00059m51679k20892L47044
21161h9570K23605k43682k10230K1645K88138Q8240Q1171r1734j25939R7726k2029
21150A7341k0902J00362l08362k95247j20834J03496R4631O8924m8287K5703O9728
$$ plain form
21139 -313447 -26740 164665 333578 159463 46260 136472 -94965 -42772 -45713 263836
21129 263836 305903 324382 517502 263497 -92437 -123687 91837 115961 227383 295715
21119 295715 344548 -45401 -401895 -600929 -658103 -303256 -256447 -157686 -236809 -78368
21109 -78368 211383 124129 -227451 -543461 -284857 -184098 -107962 79399 141735 63916
21099 63916 -182285 -72563 -64402 -66684 4819 2845 26809 -140929 -58502 53898 -120485
21088 -120485 -90977 -346707 -446463 -78870 127051 -42144 -144793 -170305 -172318 43880
21078 43880 138914 -122759 12999 101007 111281 258719 384740 511756 497050 582448 295701
21067 295701 82880 2133 -284752 -231439 -198175 -270041 -565291 -645144 -693508 -567327 -317138
$$ packed form
21139c13447K86707J91405J68913j74115j13203R0212k31437N2193k941L09549
21129B63836M2067J8479J93120k54005l55934l1250K15524K4124J11422O8332
21119B95715M8833l89949l56494j99034n7174L54847M6809R8761p9123J58441
21109g8368K89751q7254l51580l16010K58604J00759P6136J87361O2336p7819
21099F3916k46201J09722Q161k282P1503j974K3964j67738Q2427J12400j74383
21088a20485K9508k55730r9756L67593K05921j69195j02649k5512k013K16198
21078D3880R5034k61673J35758Q8008J0274J47438J26021J27016j4706Q5398k86747
21067B95701k12821q0747k86885N3313L3264p1866k95250p9853m8364J26181K50189
$$ plain form
21056 -317138 -98474 324187 161275 35165 -8806 7693 -192372 -459755 -54172 98159
21046 98159 165435 238476 -79853 -401183 -269446 -9059 24428 48739 62007 -584 40864
21035 40864 -3460 -121690 -211965 -235215 -107521 -18393 351844 566950 383259 191964
21025 191964 244678 536737 301094 94849 -100842 72455 -78260 -45787 -260501 22590
21015 22590 181371 207470 201988 173243 241318 159986 43494 45875 218268 112818 109053
21004 109053 162725 -253222 -579126 -734397 -606229 -202087 -66028 -128467 -396589 -133942
20994 -133942 205356 452491 378855 574275 616605 595575 757350 537281 435254 176240
20984 176240 97705 148651 64348 84806 208686 -16068 -220881 10178 137606 290356
$$ packed form
21056c17138K18664M22661j62912j26110m3971J6499k00065k67383M05583J52331
21046I8159O7276P3041l18329l21330J31737K60387L3487K4311J3268o2591M1448
21035D0864m4324j18230r0275k3250J27694Q9128L70237K15106j83691j91295
21025A91964N2714K92059k35643k06245j95691J73297j50715L2473k14714K83091
21015B2590J58781K6099n482k8745O8075q1332j16492K381J72393j05450l765
21004A09053N3672m15947l25904j55271J28168M04142J36059o2439k68122K62647
20994a33942L39298K47135p3636J95420M2330k1030J61775k20069j02027k59014
20984A76240p8535N0946q4303K0458J23880k24754k04813K31059J27428J52750
$$ plain form
20974 290356 275620 176365 -56766 -244283 -147322 310906 466126 340900 29950 -237516
20964 -237516 -412844 -347617 -265278 -302811 -158205 81060 27813 -258310 -267440 -102190 -14372
20953 -14372 61657 205551 308533 204206 26340 15705 -134316 -110071 -93229 -186548 210585
20942 210585 579408 390954 393192 634563 722593 329435 152498 323196 361422 478802
20932 478802 424787 -74481 -203846 -88096 -441733 -561620 -354522 -387029 -449094 -491580
20922 -491580 -499425 -549582 -497867 -490317 -151161 -108259 -81539 125925 -68031 19977 42445
20911 42445 -152900 -169537 -175827 -252771 -196337 -1233 274091 166969 -209190 -218809 -225887
20900 -225887 -136320 -139995 -160107 -93363 -65575 -66496 -37770 -142371 -203762 210 140118
$$ packed form
20974B90356j4736r9255k33131j87517R6961M58228J55220j25226l10950k67466
20964b37516j75328O5227Q2339l7533J44606K39265n3247k86123r130J65250Q7818
20953a4372P6029J43894J02982j04327j77866j0635j50021K4245J6842r3319L97133
20942B10585L68823j88454K238K41371Q8030l93158j76937J70698L8226J17380
20932D78802n4015m99268j29365J15750l53637j19887K07098l2507o2065m2486
20922d91580p845n0157N1715P550L39156M2902K6720K07464j93956Q8008K2468
20911D2445j95345j6637o290p6944N6434J95104K75324j07122l76159r619p078
20900b25887Q9567l675k0112O6744K7788r21K8726j04601o1391K03972J39908
$$ plain form
20889 140118 25423 -140325 -95048 -136942 70078 170191 -121457 -325906 -354989 -259456
20879 -259456 66511 178376 -120478 -221274 -227255 -98394 -250712 -359853 -339964 -266165
20869 -266165 -207310 56047 180476 103920 -185840 -289658 94965 183683 268996 -5331
20859 -5331 -257875 -349009 -399414 -128711 -16622 291232 501316 350883 192261 -140482
20849 -140482 -263361 49279 67889 360423 387668 210962 70703 -52648 -331865 -306423
20839 -306423 -24463 332085 493444 536046 284419 -15384 21949 30642 -362397 -568828
20829 -568828 -332155 -147087 -317724 -359052 -222225 -27019 251358 130918 -155451 -177985
20819 -177985 -133009 18959 209836 40344 232813 341100 487972 512579 228285 229024
$$ packed form
20889A40118j14695j65748M5277m1894K07020J00113k91648k04449k9083R5533
20879b59456L25967J11865k98854j00796n981J28861j52318j09141J9889P3799
20869b66165N8855K63357J24429p6556k89760j03818L84623Q8718Q5313k74327
20859e331k52544r1134n0405K70703J12089L07854K10084j50433j58622l32743
20849a40482j22879L12640J8610K92534K7245j76706j40259j23351k79217K5442
20839c06423K81960L56548J61359M2602k51627k99803L7333Q693l93039k06431
20829e68828K36673J85068j70637m1328J36827J95206K78377j20440k86369k2534
20819a77985M4976J51968J90877j69492J92469J08287J46872K4607k84294P39
$$ plain form
20809 229024 4368 -9014 145571 -4901 -189162 -96026 -286 -80264 -134343 -284862
20799 -284862 -263425 -39358 -21970 110570 188188 -15487 62893 3401 -264405 -288075 -321491
20788 -321491 -424662 -376413 -607356 -363814 45642 76494 98250 -6374 -142663 149721
20778 149721 42170 -310697 -565708 -528467 -142606 98475 71655 -136934 -45827 22901
20768 22901 38858 -25142 -152487 -63745 -17730 -228345 95512 417289 263297 407714
20758 407714 402929 -24818 -389738 -137482 -78192 89565 -64546 -203159 234499 731011
20748 731011 778793 412640 527741 506455 24191 -204443 -482342 -565791 -309168 -41875
20738 -41875 32018 365322 384148 27256 83650 372695 464661 569157 384797 21893
$$ packed form
20809B29024k24656j3382J54585j50472j84261R3136R5740p9978n4079j50519
20799b84862K1437K24067J7388J32540P7618k03675P8380n9492k67806k3670l3416
20788c21491j03171M8249k30943K43542M09456L0852K1756j04624j36289K92384
20778A49721j07551l52867k55011L7241L85861K41081k6820k08589R1107O8728
20768B2901J5957o4000j27345Q8742M6015k10615L23857L21777j53992J44417
20758D07714m785m27747l64920K52256N9290J67757j54111j38613M37658M96512
20748G31011M7782l66153J15101k1286m82264k28634k77899q3449K56623K67293
20738d1875P3893L33304J8826l56892N6394K89045R1966J04496j84360l62904
$$ plain form
20728 21893 -310006 -558278 -234095 27082 -86714 -314830 -260911 -123517 38907 137227
20718 137227 129393 200764 28212 73664 277541 218154 161829 33384 152270 202352 218215
20707 218215 -64894 -53347 -165731 28607 249721 -22546 -311727 -196887 -166465 19094
20697 19094 410471 282526 343655 239277 110250 -16009 42335 242043 250708 167899 226903
20686 226903 -8070 47429 271446 98930 -342469 -681674 -1001578 -698077 -195135 -8212
20676 -8212 -8929 279728 420110 473240 458057 50485 -92367 -311694 -296701 92732 -36021
20665 -36021 -284133 -387141 -409427 -33420 462206 301969 359978 190682 -6865 225830
20655 225830 477163 656972 530591 214279 14287 -107774 -250111 -360216 -89929 7287
$$ packed form
20728B1893l31899k48272L24183K61177j13796k28116N3919J37394J62424R8320
20718A37227p834P1371j72552M5452K03877n9387n6325j28445J18886N0082J5863
20707B18215k83109J1547j12384J94338K21114k72267k89181J14840L0422J85559
20697A9094L91377j27945O1129j04378j29027j26259N8344J99708Q665q2809N9004
20686B26903k34973N5499K24017j72516m41399l39205l19904L03501N02942J86923
20676h212p17K88657J40382N3130j5183m07572j42852k19327J4993L89433j28753
20665c6021k48112j03008k2286L76007M95626j60237N8009j69296j97547K32695
20655B25830K51333J79809j26381l16312j99992j22061j42337j10105K70287R7216
$$ plain form
20645 7287 379334 212443 39781 13450 -394086 -422083 -331931 -396581 -589033 -524877 -293582
20634 -293582 -240144 -381191 -372890 -58159 -38137 -185848 -350085 -76456 219474 300280
20624 300280 2668 -124848 51612 140949 -157584 -466042 -392950 124113 277914 -41764
20614 -41764 -262861 -655722 -739402 -543342 -666911 -409533 -240259 -190567 -295506 -178170
20604 -178170 -413574 -476249 -413780 -595220 -459226 -125286 -369041 -537615 -397763 -371700
20594 -371700 -430705 -90414 346153 -23082 -231708 -296413 -571537 -905582 -767527 -331719
20584 -331719 32089 118171 -47534 -261432 -279147 -126783 -58909 49694 -286958 -523567
20574 -523567 -249819 -142625 20875 181192 155731 234607 137703 100003 119382 -29804
$$ packed form
20645G287L72047j66891j72662k6331m07536k7997R0152o4650j92452O4156K31295
20634b93582N3438j41047Q301L14731K0022j47711j64237K73629K95930Q0806
20624C00280k97612j27516J76460Q9337k98533l08458P3092N17063J53801l19678
20614d1764k21097l92861q3680J96060j23569K57378J69274M9692j04939J17336
20604a78170k35404o2675O2469j81440J35994L33940k43755j68574J39852K6063
20594c71700n9005L40291M36567l69235k08626o4705k75124l34045J38055M35808
20584c31719L63808Q6082j65705k13898j7715J52364O7874J08603l36652k36609
20574e23567K73748J07194J63500J60317k5461P8876r6904l7700J9379j49186
$$ plain form
20564 -29804 -56340 48194 -39174 157550 274073 -33866 42003 338752 245048 236703 246865
20553 246865 421326 473312 495260 423988 514228 332133 200181 137431 5993 -322476
20543 -322476 -415599 -337592 -109940 -272832 -265640 -334997 -695805 -674409 -243057 81679 297919
20532 297919 444766 656594 639352 105478 230590 418791 207170 -129751 -40722 349074
20522 349074 330364 160190 448744 131469 -47274 85468 35039 229098 402968 353602
20512 353602 165129 -67626 -202201 60732 285098 153630 -46455 185137 593520 949523
20502 949523 715434 318645 139742 223791 312706 203211 -48047 -959 32435 -362318
20492 -362318 -130825 -11285 -157495 -224358 23324 -119894 -887 130643 46544 22563
$$ packed form
20564b9804k6536J04534q7368J96724J16523l07939P5869K96749r3704q345J0162
20553B46865J74461N1986K1948p1272R0240j82095j31952o2750j31438l28469
20543c22476r3123P8007K27652j62892P192o9357l60808K1396M31352L24736K16240
20532B97919J46847K11828j7242n33874J25112J88201k11621l36921Q9029L89796
20522C49074j8710j70174K88554l17275j78743J32742n0429J94059J73870m9366
20512C53602j88473k32755j34575K62933K24366j31468k00085K31592M08383L56003
20502I49523k34089l96789j78903Q4049Q8915j09495k51258M7088L3394l94753
20492c62318K31493J19540j46210o6863K47682j43218J19007J31530q4099k3981
$$ plain form
20482 22563 228681 220250 -28356 -36573 119112 277118 465295 230796 217508 -19495 67416
20471 67416 180559 281860 267071 564644 507744 64553 29894 179079 -16436 -157836
20461 -157836 -408086 -143012 -50179 -50916 -133241 189109 328458 158954 197303 229352 288064
20450 288064 379775 279625 346144 89405 59643 214335 131411 218522 361526 607521
20440 607521 639429 234398 268471 397195 135840 40261 115465 9870 134471 367773
20430 367773 366997 305587 372028 377473 78823 201350 124688 68073 74783 280870 281119 445841
20418 445841 379293 594914 521734 467889 334422 371903 298759 447148 428079 75874 -151330
20407 -151330 -21959 129329 426931 643123 317011 -97281 -504129 -497921 -543003 -327260
$$ packed form
20482B2563K06118q431k48606q217J55685J58006J88177k34499j3288k37003Q6911
20471F7416J13143J01301j4789K97573n6900m43191l4659J49185j95515j41400
20461a57836k50250K65074R2833p37q2325L22350J39349j69504L8349L2049N8712
20450B88064R1711j00150O6519k56739k9762J54692q2924Q7111J43004K45995
20440F07521L1908m05031L4073J28724k61355r5579P5204j05595J24601K33302
20430C67773p76o1410O6441N445k98650J22527p6662n6615O710K06087K49J64722
20418D45841o6548K15621p3180n3845j33467L7481p3144J48389j9069l52205k27204
20407a51330J29371J51288K97602K16192l26112m14292m06848O208m5082K15743
$$ plain form
20397 -327260 -249129 78764 400834 283857 -22201 -160534 -446955 -247969 -39665 -211260
20387 -211260 -143771 33974 87234 -230876 -356672 -162484 -60099 -75552 -458378 -420948
20377 -420948 -392052 -365458 -381746 -347255 -234120 148275 101991 282348 284623 390876 446429
20366 446429 229128 -621 157910 482613 653166 591231 407686 500987 496850 339231
20356 339231 263206 274814 103896 -240288 -223364 -68502 437202 729590 522904 252667
20346 252667 221694 162372 -155672 -260108 -105210 -500235 -807947 -626577 -524294 -389616
20336 -389616 -486589 -481509 -394994 -232074 -204212 -193051 -311893 -512283 -617274 -621312 -308191
20325 -308191 -31852 322567 311014 56581 -229820 -253211 -105939 -165411 -157186 -312366
$$ packed form
20397c27260P8131L27893L22070j16977l06058j38333k86421J98986K08304j71595
20387b11260O7489J77745N3260l18110j25796J94188J02385j5453l82826L7430
20377d20948K8896K6594j6288L4491J13135L82395m6284J80357K275J06253N5553
20366D46429k17301k29749J58531L24703J70553o1935j83545R3301m137j57619
20356C39231p6025J1608j70918l44184J6924J54862N05704K92388k06686k70237
20346B52667l0973n9322l18044j04436J54898l95025l07712J81370J02283J34678
20336c89616r6973N080Q6515J62920K7862J1161j18842k00390j04991m038L13121
20325c08191K76339L54419j1553k54433k86401k3391J47272n9472Q225j55180
$$ plain form
20315 -312366 -107249 -245053 -205480 -306788 -388180 -274204 99212 174183 360642 302991
20305 302991 257624 -74622 -74616 -344173 -510348 -661499 -345320 79966 529666 493547 604136
20294 604136 313360 90721 27376 107455 27728 200612 189205 -33433 -173965 -84765
20284 -84765 -33045 -378624 -304242 -310112 -195317 -194703 -11818 249751 139823 -68937 -260522
20273 -260522 -285425 -90749 259278 594246 688896 561159 240017 -18538 -308274 206600
20263 206600 305553 105998 118812 40979 126677 106059 -131327 -82054 79495 151348 -17918
20252 -17918 -75178 -249234 -47566 108123 226151 188162 -106699 -284441 -295946 -237600
20242 -237600 19235 -48218 -425637 -309923 -38478 249835 230115 281030 197690 -380272
$$ packed form
20315c12366K05117j37804L9573j01308q1392J13976L73416P4971J86459n7651
20305C02991m5367l32246Ok69557j66175j51151L16179M25286M49700l6119J10589
20294F04136k90776k22639o3345Q0079p9727J72884j1407k22638j40532Q9200
20284h4765N1720l45579P4382n870J14795O14J82885K61569j09928k08760j91585
20273b60522k4903J94676L50027L34968R4650j27737l21142k58555k89736N14874
20263B06600R8953j99555J2814p7833Q5698k0618k37386M9273J61549P1853j69266
20252a7918n7260j74056K01668J55689J18028l7989k94861j77742j1505N8346
20242b37600K56835o7453l77419J15714K71445K88313j9720N0915q3340n77962
$$ plain form
20232 -380272 -175319 -5121 -268892 -456261 -388618 -339412 -236840 -135375 -424739 -407080
20222 -407080 -396289 -248694 -154371 -34203 -333108 -301458 -121424 -84028 284611 146970
20212 146970 -72960 101511 210670 33481 -163827 -130831 -247584 -106995 -113912 -432341
20202 -432341 -67678 270445 349730 209126 52763 259299 455124 456276 246181 61380
20192 61380 -362750 -523497 -331513 -260406 -255551 -258647 -364126 -390523 -441722 -261186 91279
20181 91279 156577 -88252 30095 179670 -144010 -474121 -447599 88313 298777 303657
20171 303657 -70111 -185602 -275359 -304644 -136744 100153 293826 255616 184708 446354
20161 446354 738706 755830 703681 398780 139938 198846 38350 -42863 215591 493056
$$ packed form
20232c80272K04953J70198k63771j87369O7643M9206J02572J01465k89364J7659
20222d07080J0791J47595R4323J20168k98905L1650J80034L7396L68639j37641
20212A46970k19930J74471J09159j77189j97308L2996j16753J40589o917l18429
20202d32341L64663L38123P9285j40604j56363K06536J95825J152k10095j84801
20192F1380m24130j60747J91984P1107M855l096j05479k6397n1199J80536L52465
20181I1279O5298k44829J18347J49575l23680l30111K6522N35912K10464M880
20171C03657l73768j15491q9757k9285J67900K36897J93673l8210p0908K61646
20161D46354K92352J7124n2149l04901k58842N8908j60496q1213K58454K77465
$$ plain form
20151 493056 822730 970143 1082453 671326 622510 525556 679992 721261 712609 1088350
20141 1088350 1163048 864943 190686 -128842 -7199 46274 302649 553372 798760 817951
20131 817951 281051 104235 226017 167089 -3807 21750 2281 -37522 177572 314243
20121 314243 200024 299300 240269 184699 11510 114306 114837 -164380 -559940 -637130 -584052
20110 -584052 -209437 157013 91870 167743 449639 602559 709482 761935 556837 165186
20100 165186 169903 76881 136641 224412 505364 416754 569569 354203 177283 157328 12670
20089 12670 76303 60164 120495 411803 287985 343804 506192 568223 436188 364181 222381
20078 222381 -174574 -170089 -188649 -237921 -72052 -122086 -117177 -85104 -135341 -66428 -15676
$$ packed form
20151D93056L29674J47413J12310m11127m8816r6954J54436M1269q652L75741
20141A088350P4698k98105o74257l19528J21643N3473K56375K50723K45388J9191
20131H17951n36900j76816J21782n8928j70896K5557j9469l9803K15094J36671
20121C14243j14219R9276n9031n5570j73189J02796N31k79217l95560p7190N3078
20110e84052L74615L66450o5143P5873K81896J52920J06923N2453k05098l91651
20100A65186M717r3022N9760Q7771K80952q8610J52815k15366j76920j9955j44658
20089A2670O3633j6139O0331K91308j23818N5819J62388O2031j32035p2007j41800
20078B22381l96955M485j8560m9272J65869n0034M909L2073n0237O8913N0752
$$ plain form
20067 -15676 -138196 -230076 170567 371816 44018 -125466 88427 224052 375333 282985
20057 282985 51453 -198545 -314939 -309633 -326686 -146894 -87173 84698 -209448 -462112
20047 -462112 -570340 -619303 -96977 26984 -36909 40648 107543 -96973 -103998 109807 351464
20036 351464 348575 -12712 -270824 -256468 -71523 -136450 315605 531105 623880 883395
20026 883395 998123 778468 461428 391600 296471 168994 232525 239617 109450 204723 207157
20015 207157 49794 328705 222675 279186 544815 641737 596988 473307 161162 -247029
20005 -247029 -232739 -275665 -91196 439063 726954 466922 417081 538402 233878 -143853
19995 -143853 -210303 -393640 -469928 -414418 -303483 -204132 -57642 97746 122050 306176
$$ packed form
20067a5676j22520r1880M00643K01249l27798j69484K13893J35625J51281r2348
20057B82985k31532k49998j16394N306j7053J79792N9721J71871k94146k52664
20047d62112j08228m8963N22326J23961o3893P7557O6895k04516p025K13805K41657
20036C51464k889l61287k58112J4356J84945o4927M52055K15500R2775K59515
20026H83395J14728k19655l17040o9828r5129j27477O3531P092j30167R5273K434
20015B07157j57363K78911j06030N6511K65629R6922m4749j23681l12145m08191
20005b47029J4290m2926J84469N30259K87891k60032m9841J21321l04524l77731
19995a43853o6450j83337p6288N5510J10935R9351J46490J55388K4304J84126
$$ plain form
19985 306176 202778 -184312 -352350 -209467 100675 20096 -107150 -62346 114477 255983
19975 255983 466176 556771 610595 484237 561836 683784 460508 456033 356319 262648 54135
19964 54135 253152 553916 670059 423475 531067 690433 687811 747800 507057 419650
19954 419650 112698 115081 133392 60260 -158649 61268 43652 154158 166665 285137 306064
19943 306064 200291 156731 78090 -349602 -625495 -409464 -360791 -30435 305744 202141
19933 202141 -30687 -2686 144521 24276 -189994 -259266 -122488 -121138 -138318 -201570 297011
19922 297011 611934 385422 -58817 -135630 -179675 -298292 -96844 115521 611273 602039
19912 602039 404424 120784 93243 12922 56312 408413 382196 40304 -140971 -313310
$$ packed form
19985C06176j03398l87090j68038J42883L10142q0579j27246M4804J76823J41506
19975B55983K10193R0595N3824j26358P7599J21948k23276m475r9714r3671k08513
19964E4135J99017L00764J16143k46584J07592J59366k622N9989k40743q7407
19954D19650l06952K383J8311p3132k18909K19917j7616J10506J2507J18472K0927
19943C06064j05773m3560p8641m27692k75893K16031M8673L30356L36179j03603
19933B02141k32828K8001J47207j20245k14270o9272J36778J350j7180o3252M98581
19922B97011L14923k26512m44239p6813m4045j18617K01448K12365M95752r234
19912F02039j97615k83640k7541q0321M3390L52101k6217l41892j81275j72339
$$ plain form
19902 -313310 -58942 195900 230747 371006 213260 -17347 7157 17583 120068 84071
19892 84071 92530 135453 391028 494913 385634 378326 500530 260622 276448 327355 529412
19881 529412 453334 107165 434112 362059 424950 230547 202103 268883 -162759 -136537 170614
19870 170614 388985 182152 -20347 -236514 -355239 -255075 -168510 -192334 45792 164382
19860 164382 166778 200387 104833 338979 567340 561516 430852 672830 1034364 901423 941105
19849 941105 1068687 775524 663419 815752 882579 480899 440733 756003 473384 200457
19839 200457 26200 44736 257830 137747 77368 258773 533322 757660 772739 591375
19829 591375 464081 396433 446425 300518 303802 704184 598207 391298 348920 295047 533867
$$ packed form
19902c13310K54368K54842L4847J40259j57746k30607K4504J0426J02485l5997
19892H4071Q459M2923K55575J03885j09279p308J22204k39908J5826N0907K02057
19881E29412p6078l46169L26947p2053O2891j94403k8444O6780m31642K6222L07151
19870A70614K18371k06833k02499k16167j18725J00164Q6565k3824K38126J18590
19860A64382K396L3609r5554K34146K28361n824j30664K41978L61534j32941L9682
19849I41105J27582k93163j12105J52333O6827m01680m0166L15270k82619k72927
19839B00457j74257J8536K13094j20083o0379J81405K74549K24338J5079j81364
19829E91375j27294o7648M9992j45907L284M00382j05977k06909m2378n3873K38820
$$ plain form
19818 533867 681573 536648 617868 650774 242644 250048 472368 612327 512045 531881
19808 531881 527255 344238 298042 212202 61956 11754 -33009 -134221 165500 328515 430994
19797 430994 289685 130497 93024 -44571 -225503 -261041 -594040 -620403 -478781 -335052
19787 -335052 -421594 -139298 -41843 -7589 37920 142580 154969 148692 -38444 -373857 -280581
19776 -280581 208424 198682 -290936 -151659 258177 53247 -35954 167992 169814 268352 368153
19765 368153 282145 178421 73528 47563 82812 307288 24254 -259119 -386435 122647
19755 122647 281502 344912 496541 256496 124842 230168 348799 235123 161603 206813
19745 206813 244659 111529 203977 379221 -6194 -304827 -183893 -115978 -347558 120526
$$ packed form
19818E33867J47706j44925Q1220L2906m08130P404K22320J39959j00282J9836
19808E31881m626j83017m6196q5840j50246n0202m4763j01212K99721J63015J02479
19797D30994j41309j59188l7473j37595j80932l5538l32999k6363J41622J43729
19787c35052q6542K82296R7455L4254M5509J04660J2389o277j87136l35413R3276
19776b80581M89005r742m89618J39277M09836k04930q9201K03946J822R8538R9801
19765C68153q6008j03724j04893k5965L5249K24476k83034k83373j27316N09082
19755A22647J58855O3410J51629k40045j31654J05326J18631j13676p3520M5210
19745B06813L7846j33130R2448J75244l85415k98633J20934O7915k31580M68084
$$ plain form
19735 120526 214020 347719 392643 372471 444553 290407 174885 373244 481375 265723
19725 265723 326695 360306 341044 263035 315563 515852 614150 688642 891947 842366 613075
19714 613075 725305 816802 1044036 1019556 774783 582497 453325 247545 264915 466931
19704 466931 529491 571015 761776 598738 302571 192830 473916 667089 900463 1085427
19694 1085427 842832 642919 959656 966616 1040133 1209005 1165660 1291153 1587439 1397251
19684 1397251 810575 541457 382490 397255 437875 641147 728069 918472 750712 730054
19674 730054 849437 949552 935199 1200606 1379005 1669968 2122690 2291566 2232662 2401372
19664 2401372 2679552 3011802 3133125 3133273 3451285 3853841 3980685 3994615 4335613 4671331
$$ packed form
19735A20526R3494J33699M4924k0172P2082j54146j15522J98359J08131k15652
19725B65723O0972L3611j9262p8009N2528K00289R8298P4492K03305m9581k29291
19714F13075J12230R1497K27234k4480k44773j92286j29172k05780J7370K02016
19704D66931O2560M1524J90761j63038k96167j09741K81086J93173K33374J84964
19694A085427k42595j99913L16737O960P3517J68872m3345J25493K96286j90188
19684A397251n86676k69118j58967J4765M0620K03272Q6922J90403j67760k0658
19674G30054J19383J00115j4353K65407J78399K90963M52722J68876n8904J68710
19664B401372K78180L32250J21323J48L18012M02556J26844J3930L40998L35718
$$ plain form
19654 4671331 5417766 5983419 7214663 8806512 10063527 11734814 13670023 15406548
19646 15406548 16909714 18355143 20432899 23582568 28128717 35040192 44374401 54799716
19638 54799716 65270674 74646464 81481998 83637825 80734741 74915761 68463552 61809164
19630 61809164 54785356 48123960 43288506 40585097 39015459 37894893 36662920 35110877
19622 35110877 32504276 28664941 24646173 21333719 18974993 17319902 15411604 14066123
19614 14066123 12880319 12210629 12120908 11633122 11573024 11609473 11990922 12505041 13144214 13815828
19604 13815828 14490922 15441149 16681475 18997718 21841820 25539835 29927384 34687010
19596 34687010 39782619 44597480 48733392 51440568 53263419 54686252 56812611 61064922
$$ packed form
19654D671331P46435N65653J231244J591849J257015J671287J935209J736525
19646A5406548J503166J445429K077756L149669M546149O911475R334209J0425315
19638E4799716J0470958R375790O835534K155827k903084n818980o452209o654388
19630F1809164p023808o661396m835454k703409j569638j120566j231973j552043
19622C5110877k606601l839335m018768l312454k358726j655091j908298j345481
19614A4066123j185804o69690q9721m87786o0098L6449L81449N14119O39173O71614
19604A3815828O75094R50227J240326K316243K844102L698015M387549M759626
19596C4687010N095609M814861M135912K707176J822851J422833K126359M252311
$$ plain form
19588 61064922 69042884 81360891 98346942 119765589 143472895 166919201 185626243
19581 185626243 195342365 193002097 179865520 157595262 131407041 106919754 87751564
19574 87751564 74614655 65950107 59645602 54707735 49856721 44487913 38963094 33873626
19566 33873626 29284692 25379872 22045935 19113764 16988335 15368092 14224564 13690660
19558 13690660 13046513 12323626 11716463 11212664 10729858 10034406 9495491 8963282 8421146
19549 8421146 8081858 7535729 7061853 6901510 6726113 6621945 6644794 6946409 6942501 6537335
19539 6537335 6298539 6178350 6256655 5966143 5756810 5966811 6056810 6431335 6744318 7139583
19529 7139583 7466060 7614183 7742081 8329760 9014256 9726584 10168642 10721681 11174522
$$ packed form
19588F1064922P977962J2318007J6986051K1418647K3707306K3446306J8707042
19581A85626243R716122k340268j3136577k2270258k6188221k4487287j9168190
19574H7751564j3136909q664548o304505m937867m851014n368808n524819n089468
19566C3873626m588934l904820l333937k932171k125429j620243j143528n33904
19558A3690660o44147p22887o07163n03799m82806o95452n38915n32209n42136
19549H421146l39288n46129m73876j60343j75397j04168K2849L01615l908m05166
19539F537335k38796j20189P8305k90512k09333K10001Q9999L74525L12983L95265
19529G139583L26477J48123J27898N87679O84496P12328M42058N53039M52841
$$ plain form
19520 11174522 11740801 12135196 12544044 13114784 14011315 15108339 16441526 18553052 21315792
19511 21315792 24972050 29304942 34317001 39391597 44549777 49947969 55424318 61743628
19503 61743628 69866169 81718431 98059464 118550206 141048169 161943139 177924208
19496 177924208 185677566 182364668 168390101 148202821 126067558 104992280 87601604
19489 87601604 74522387 65916372 60650029 57439693 55986695 54844372 52863781 50140837
19481 50140837 45791960 40372741 35120582 30484282 26759937 23862648 21581805 19371972
19473 19371972 17452747 16520228 16123452 15671616 15091100 14702396 14002770 13479580 13320245
19464 13320245 13816896 14039887 14331639 14957272 16568695 18911969 21301597 24417264 27979640
$$ packed form
19520A1174522N66279L94395M08848N70740Q96531J097024J333187K111526K762740
19511B1315792L656258M332892N012059N074596N158180N398192N476349O319310
19503F1743628Q122541J1852262J6341033K0490742K2497963K0894970J5981069
19496A77924208P753358l312898j3974567k0187280k2135263k1075278j7390676
19489H7601604j3079217q606015n266343l210336j452998j142323j980591k722944
19481E0140837m348877n419219n252159m636300l724345k897289k280843k209833
19473A9371972j919225r32519l96776m51836n80516l88704o99626n23190j59335
19464A3320245M96651K22991K91752O25633J611423K343274K389628L115667L562376
$$ plain form
19455 27979640 31173126 33917544 35910633 37383738 38594224 39803343 42100572 46108134
19447 46108134 51653102 58596270 65733153 72486814 78256192 81466319 81708266 79054788
19439 79054788 73366601 64196928 53094544 42711436 34939438 29458934 26098056 23539689
19431 23539689 21441498 20023559 18752416 17170421 15214155 12898215 10995860 9891461
19423 9891461 8862464 8104949 7291698 7006576 6881444 6731762 6407218 6099756 5772148
19414 5772148 5044263 4747625 4497466 4397599 4536539 4362535 4129785 4030624 3987644 3831876
19404 3831876 3781571 4053435 3814483 3489888 3235650 3263905 3393909 3335192 3195657 3053437
19394 3053437 3241570 3226878 3013054 3132312 3313997 3305494 3242690 2672568 2006195 1985725
$$ packed form
19455B7979640L193486K744418J993089J473105J210486J209119K297229M007562
19447D6108134N544968O943168P136883O753661N769378L210127K41947k653478
19439G9054788n688187r169673j1102384j0383108p771998n480504l360878k558367
19431B3539689k098191j417939j271143j581995j956266k315940j902355j104399
19423I891461j028997p57515q13251k85122j25132j49682l24544l07462l27608
19414E772148p27885k96638k50159r9867J38940j74004k32750r9161m2980j55768
19404C831876n0305K71864k38952l24595k54238K8255J30004n8717j39535j42220
19394C053437J88133j4692k13824J19258J81685q503o2804n70122o66373k0470
$$ plain form
19384 1985725 2148357 2416532 2418640 2409381 2077654 1761398 1610758 1685303 1684649 1572796 1262571
19373 1262571 1780203 2019324 1888830 1651086 1584037 1718767 1692332 1652481 1455444 1480374
19363 1480374 1295546 1307053 1435311 1412501 1080871 861331 1029747 1533303 1746755 1831331
19353 1831331 1673816 1374465 1314240 1508245 1238037 825015 674753 888873 1266081 1531820
19343 1531820 1381641 1175428 1153156 1273800 1050764 1072549 1033358 836918 876322 745031
19333 745031 818138 1137549 1145881 984936 1248879 1190027 1122203 1189136 1126987 1229548 1046036
19322 1046036 798233 1265106 1496269 1447488 1068799 1038508 1455734 1551011 1417115 1289806
19312 1289806 1030682 807760 790750 983935 1190252 1289018 1501386 1764113 2069429 2356707
$$ packed form
19384A985725J62632K68175K108r259l31727l16256j50640P4545o54j11853l10225
19373A262571N17632K39121j30494k37744o7049J34730k6435l9851j97037K4930
19363A480374j84828J1507J28258k2810l31630k19540J68416N03556K13452Q4576
19353A831331j57515k99351o0225J94005k70208m13022j50262K14120L77208K65739
19343A531820j50179k06213k2272J20644k23036K1785l9191j96440L9404j31291
19333G45031P3107L19411Q332j60945K63943n8852o7824O6933o2149J02561j83512
19322A046036k47803M66873K31163m8781l78689l0291M17226R5277j33896j27309
19312A289806k59124k22922j7010J93185K06317R8766K12368K62727L05316K87278
$$ plain form
19302 2356707 2299675 2133217 1908088 1552928 1733593 1842210 1983379 2104948 2069303 2301536
19292 2301536 2415697 2412684 2502413 2393709 2587348 2490521 2606971 2857425 3272617 3560653
19282 3560653 3615508 3628744 3648740 3822651 4066188 4497159 4818849 5046157 5262727 5754670
19272 5754670 6204621 6862679 7795897 9010035 10139729 11722414 13362816 15448211 18247215
19263 18247215 22007169 26144090 31568969 38077211 45435674 53120746 60698681 66879053
19255 66879053 70434474 70838840 67804084 62083641 55378600 49001476 43528360 39315881
19247 39315881 36073367 33640974 32420590 32810054 34393494 36850760 40810924 46027717
19239 46027717 52254452 59236387 65868202 71298672 74579171 74648359 71302861 65068354
$$ packed form
19302B356707n7032j66458k25129l55160J80665J08617J41169J21569l5645K32233
19292B301536J14161l013Q9729j08704J93639r6827J16450K50454M15192K88036
19282C560653N4855J3236J9996J73911K43537M30971L21690K27308K16570M91943
19272E754670M49951O58058R33218J214138J129694J582685J640402K085395K799004
19263A8247215L759954M136921N424879O508242P358463P685072P577935O180372
19255F6879053L555421M04366l034756n720443o705041o377124n473116m212479
19247C9315881l242514k432393j220384L89464J583440K457266L960164N216793
19239D6027717O226735O981935O631815N430470L280499O9188l345498o234507
$$ plain form
19231 65068354 56977718 48545605 40871339 34633975 29668593 25562399 22340301 19581517
19223 19581517 17071036 14881773 13362389 12228767 11082275 10242954 9488457 8912649
19215 8912649 8452813 7896263 7465732 7096192 6790702 6456376 5985667 5521171 5362902
19206 5362902 5468709 5438733 5069617 4734878 4933486 5004563 4674524 4589829 4407697 3984085
19196 3984085 3867165 3809202 3806435 3727025 3463293 3381179 3237933 3261318 3453535 3552264 3522546
19185 3522546 3048354 2705114 2744402 2753677 2534351 2272923 2381463 2111483 2201480 1997026
19175 1997026 1642079 1677800 1369264 945263 975510 787807 815748 1059836 1012744 798535
19165 798535 1158109 1307017 1474302 1603144 1413875 1265393 1418452 1165998 905066 860551
$$ packed form
19231F5068354q090636q432113p674266o237364m965382m106194l222098k758784
19223A9581517k510481k189263j519384j133622j146492q39321p54497n75808
19215H912649m59836n56550m30531l69540l05490l34326m70709m64496j58269
19206E362902J05807k9976l69116l34739J98608P1077l30039q4695j82132m23612
19196C984085j16920n7963k767p9410k63732q2114j43246K3385J92217R8729k9718
19185C522546m74192l43240L9288R275k19326k61428J08540k69980Q9997k04454
19175A997026l54947L5721l08536m24001L0247j87703K7941K44088m7092k14209
19165G98535L59574J48908J67285J28842j89269j48482J53059k52454k60932m4515
$$ plain form
19155 860551 1125957 1262586 978597 947076 1018581 1032164 972954 1026183 915534 863439 748376
19144 748376 590313 490235 855589 1042597 1090198 1201547 1321069 1257191 1122825 964456
19134 964456 858117 793678 798365 800546 591857 493817 309757 287611 461659 424199 172082
19123 172082 151261 406769 777792 605050 526188 327943 412727 419263 396924 391728 5989
19112 5989 -154879 -65581 65356 434172 841081 755006 571108 789901 634987 341663
19102 341663 292312 553880 966911 1141853 973151 949499 1242068 831728 520207 648315
19092 648315 884345 633861 544114 526269 442013 276637 461469 529433 590400 408802
19082 408802 408316 464756 553546 419134 695886 902222 991157 1126935 1021937 828677 719281
$$ packed form
19155H60551K65406J36629k83989l1521P1505J3583n9210N3229j10649n2095j15063
19144G48376j58063j00078L65354J87008M7601J11349J19522o3878j34366j58369
19134I64456j06339o4439M687K181k08689r8040j84060k2146J74048l7460k52117
19123A72082k0821K55508L71023j72742p8862j98245Q4784O536k2339n196l85739
19112E989j60868Q9298J30937L68816M06909q6075j83898K18793j54914k93324
19102C41663m9351K61568M13031J74942j68702k3652K92569m10340l11521J28108
19092F48315K36030k50484q9747j7845q4256j65376J84832O7964O0967j81598
19082D08802m86N6440Q8790j34412K76752K06336Q8935J35778j04998j93260j09396
$$ plain form
19071 719281 969101 1054122 834278 742557 500864 398970 437999 638625 911664 1202735
19061 1202735 1536085 1333513 1418604 1141168 875459 1085150 974499 573779 821453 750645
19051 750645 451688 308753 437456 598043 897846 843948 983793 913486 722442 936196
19041 936196 900666 640941 389658 26000 141746 128946 408247 604398 514999 446931
19031 446931 172934 -283260 -205107 -159875 -30966 117790 266610 717005 421261 273663
19021 273663 213104 -296777 -336549 -107067 27457 -16568 335138 284433 284779 359728 541139
19010 541139 496786 359393 463447 208550 218263 417441 354294 513726 348005 136471
19000 136471 369010 581970 585327 713273 832539 799967 807533 618795 500416 492172 398130
$$ packed form
19071G19281K49820Q5021k19844r1721k41693j01894L9029K00626K73039K91071
19061A202735L33350k02572Q5091k77436k65709K09691j10651m00720K47674p0808
19051G50645k98957j42935J28703J60587K99803n3898J39845p0307j91044K13754
19041I36196l5530k59725k51283l63658J15746j2800K79301J96151q9399o8068
19031D46931k73997m56194P8153M5232J28909J48756J48820M50395k95744j47598
19021B73663o0559n09881l9772K29482J34524m4025L51706n0705L46P4949J81411
19010E41139m4353j37393J04054k54897R713J99178o3147J59432j65721k11534
19000A36471K32539K12960L357J27946J19266l2572P566j88738j18379q244r4042
$$ plain form
18989 398130 571272 408899 675380 686599 473588 550796 545306 537968 733315 759249 527761
18978 527761 351862 453775 510103 339079 259550 133930 103153 501854 474402 536556
18968 536556 516594 242130 259855 338818 473555 93925 -130732 297089 635041 714286
18958 714286 744071 569142 413555 399707 137060 -30486 -36119 291958 206003 264077 230153
18947 230153 19804 9130 402663 724056 944059 894938 655569 742735 748978 583123
18937 583123 619668 888310 917477 852332 536795 349624 489401 656447 703509 633053
18927 633053 310933 157527 350755 348874 376007 420037 361478 79277 264390 498313
18917 498313 445965 526577 594429 519159 348203 110187 -12901 233812 488373 700916
$$ packed form
18989C98130J73142j62373K66481J1219k13011P7208n490p338J95347K5934k31488
18978E27761j75899J01913N6328j71024p9529j25620l0777L98701k7452O2154
18968E36556j9962k74464J7725P8963J34737l79630k24657M27821L37952P9245
18958G14286K9785j74929j55587j3848k62647j67546n633L28077q5955N8074l3924
18947B30153k10349j0674L93533L21393K20003m9121k39369Q7166O243j65855
18937E83123L6545K68642K9167o5145l15537j87171J39777J67046M7062p0456
18927F33053l22120j53406J93228j881K7133M4030n8559k82201J85113K33923
18917D98313n2348Q0612O7852p5270j70956k38016j23088K46713K54561K12543
$$ plain form
18907 700916 494150 142099 224744 341218 386836 198740 79038 126144 296845 768511
18897 768511 1113525 971153 521528 589752 788922 653220 280344 62125 75043 528119
18887 528119 359849 353787 711806 695191 644096 799397 877614 725629 589376 483165
18877 483165 251898 179592 486669 618521 494049 288990 114193 202266 480415 234594
18867 234594 118019 -25866 -249817 -339692 -405483 -397714 -338915 -271589 -147171 -61715 -137463
18856 -137463 47197 379143 398956 35204 22207 -62296 152828 150725 129691 239350 341574
18845 341574 300665 388526 311620 394516 474321 508108 395281 323849 364321 259202 140349
18834 140349 261675 661188 683981 579750 414236 334125 303345 38535 -219839 -429967
$$ packed form
18907G00916k06766l52051Q2645J16474M5618j88096j19702M7106J70701M71666
18897G68511L45014j42372m49625O8224J99170j35702l72876k18219J2918M53076
18887E28119j68270o062L58019j6615n1095J55301P8217j51985j36253j06211
18877D83165k31267p2306L07077J31852j24472k05059j74797Q8073K78149k45821
18867B34594j16575j43885k23951q9875o5791P769N8799O7326J24418Q5456p5748
18856a37463J84660L31946J9813l63752j2997q4503K15124k103k1034J09659J02224
18845C41574m0909Q7861p6906Q2896P9805L3787j12827p1432M0472j05119j18853
18834A40349J21326L99513K2793j04231j65514q0111l0780k64810k58374k10128
$$ plain form
18824 -429967 -374209 80483 96749 159630 332737 640185 608430 229394 350320 575332
18814 575332 604252 348157 414389 479671 253198 98984 53923 397553 576902 359801
18804 359801 -126822 -325185 -187906 -75935 81330 -87298 -249769 -216931 -358324 -208741
18794 -208741 129815 73183 83609 95394 -106776 -88021 -100389 -84989 31172 113435 -124418
18783 -124418 -36101 168585 -15342 -92756 183765 386633 230636 30302 229887 309519
18773 309519 297752 502084 1113096 1406429 2029871 2229760 2032319 2285785 1967239 1299098
18763 1299098 701427 500429 388514 530861 870973 991844 1096176 849727 712129
18754 712129 443060 314804 122264 9782 176459 107747 109743 133490 256811 267418
$$ packed form
18824d29967N5758M54692J6266O2881J73107L07448l1755l79036J20926K25012
18814E75332K8920k56095O6232O5282k26473j54214m5061L43630J79349k17101
18804C59801m86623j98363J37279J11971J57265j68628j62471L2838j41393J49583
18794b08741L38556n6632J0426J1785k02170J8755j2368J5400J16161Q2263k37853
18783a24418Q8317K04686j83927p7414K76521K02868j55997k00334J99585P9632
18773C09519j1767K04332O11012K93333O23442J99889j97441K53466l18546o68141
18763A299098n97671k00998j11915J42347L40112J20871J04332k46449j37598
18754G12129k69069j28256j92540j12482J66677o8712J996K3747J23321J0607
$$ plain form
18744 267418 58877 -243576 -109986 -165866 208680 422967 275000 448644 628734 422237
18734 422237 227081 468527 481169 544167 415862 459455 361406 304525 235384 389332 188414
18723 188414 127480 -198423 -151151 51427 67012 77200 186152 8161 -10327 83999 244578
18712 244578 331026 494702 446320 535135 290595 373896 311153 523348 349537 223448
18702 223448 147543 44945 361122 599396 421035 7235 -84528 -198375 139 340336
18692 340336 331010 49601 164777 441886 621987 674688 391028 330609 149561 144300 361084
18681 361084 311953 203380 257469 307426 340002 364053 15665 -70290 -66756 239847 232824
18670 232824 21445 120223 253273 223497 297011 399340 499453 332673 300314 440337
$$ packed form
18744B67418k08541l02453J33590n5880L74546K14287j47967J73644J80090k06497
18734D22237j95156K41446J2642O2998j28305M3593r8049n6881o9141J53948k00918
18723A88414o0934l25903M7272K02578J5585J0188J08952j77991j8488R4326J60579
18712B44578Q6448J63676m8382Q8815k44540Q3301o2743K12195j73811j26089
18702B23448p5905j02598L16177K38274j78361m13800r1763j13847J98514L40197
18692C40336r326k81409J15176K77109J80101N2701k83660o0419j81048n261K16784
18681C61084m9131j08573N4089M9957L2576K4051l48388q5955L534L06603p023
18670B32824k11379R8778J33050k9776P3514J02329J00113j66780l2359J40023
$$ plain form
18660 440337 639478 637666 488275 138825 -40627 132430 621653 669893 792921 600101
18650 600101 411530 567737 450049 126285 92479 265359 365279 400196 467360 670249
18640 670249 654359 632369 479797 368737 291255 137798 155030 274732 328332 479476
18630 479476 545830 382828 156710 416426 633274 486839 502205 689117 665631 560162
18620 560162 324585 337369 411596 427621 263592 79985 150006 354596 417163 303026
18610 303026 282845 593910 668071 617146 594167 595471 754775 762086 414341 226267 33616
18599 33616 -135808 -104550 234504 263621 130984 -38034 131129 351033 433967 437988 77616
18588 77616 -141816 -222211 141501 400390 297802 327045 312536 197609 -21988 -170650
$$ packed form
18660D40337J99141j812j49391l49450j79452J73057M89223M8240J23028j92820
18650F00101j88571J56207j17688l23764l3806J72880R9920L4917O7164K02889
18640F70249j5890k1990j52572j11060p7482j53457J7232J19702N3600J51144
18630D79476O6354j63002k26118K59716K16848j46435J5366J86912k3486j05469
18620E60162k35577J2784P4227J6025j64029j83607P0021K04590O2567j14137
18610C03026k0181L11065P4161n0925k2979J304J59304P311l47745j88074j92651
18599C3616j69424L1258L39054K9117j32637j69018J69163K19904Q2934M021l60372
18588G7616k19432q0395L63712K58889j02588K9243j4509j14927k19597j48662
$$ plain form
18578 -170650 -70229 5858 181792 461859 637489 573378 450220 372474 451283 393957
18568 393957 290083 428745 488714 539091 688366 445423 277168 466029 437321 435258
18558 435258 316803 149402 21381 158942 146572 127218 231269 374829 571902 635679
18548 635679 391356 296678 545621 670557 562227 560748 553333 772827 767389 900138 806035
18537 806035 487969 241277 437761 676854 982680 956279 1089257 907113 488247 687538
18527 687538 705830 529892 686908 957879 1234459 1268600 1307260 1300101 1227598 1055172 1138148
18516 1138148 1278964 1500743 1353291 1172318 1391581 1603784 1938918 2034216 1942857 1940385
18506 1940385 2025190 2425305 2920023 3525106 3809695 3998196 4203655 4670278 5033952 5454240
$$ packed form
18578a70650J00421P6087J75934K80067J75630o4111j23158p7746P8809n7326
18568C93957j03874J38662N9969N0377J49275k42943j68255J88861k8708k063
18558D35258j18455j67401j28021J37561j2370j9354J04051J43560J97073O3777
18548F35679k44323r4678K48943J24936j08330j479p415K19494n438J32749r4103
18537H06035l18066k46692J96484K39093L05826k6401J32978j82144m18866J99291
18527F87538J8292j75938J57016K70971K76580L4141L8660p159p2503j72426Q2976
18516A138148J40816K21779j47452j80973K19263K12203L35134R5298r1359k472
18506A940385Q4805M00115M94718O05083K84589J88501K05459M66623L63674M20288
$$ plain form
18496 5454240 6530785 7701029 8437905 9436550 10731777 12687794 15656919 19755674
18488 19755674 24855998 32173398 41890940 53266457 66142137 78864872 88729231 93501193
18480 93501193 92301783 84558068 72583796 60023787 49951679 42728437 37678454 34238922
18472 34238922 32469674 31687329 32025200 34149379 37723367 43058822 50341583 59494593
18464 59494593 69685938 79740848 87107764 90123648 87846838 79363780 66413192 52913744
18456 52913744 41270394 32259040 25872847 21259168 17977499 15180610 13094767 11610385
18448 11610385 10203049 9055051 7963365 7313550 6999019 6674161 6372150 5886690 5694652
18439 5694652 5629500 5187791 4562687 3997521 3698562 3611528 3390061 3524800 3303291 2965490
$$ packed form
18496E454240J076545J170244P36876R98645J295227J956017K969125M098755
18488A9755674N100324P317400R717542J1375517J2875680J2722735R864359M771962
18480I3501193j199410p743715j1974272j2560009j0072108p223242n049983l439532
18472C4238922j769248p82345L37871K124179L573988N335455P282761R153010
18464E9494593J0191345J0054910P366916L015884k276810q483058j2950588j3499448
18456E2913744j1643350r011354o386193m613679l281669k796889k085843j484382
18448A1610385j407336j147998j091686o49815l14531l24858l02011m85460j92038
18439E694652o5152m41709o25104n65166k98959q7034k21467J34739k21509l37801
$$ plain form
18429 2965490 2461207 2695627 2818597 2806447 2750316 2578246 2449403 2286623 2212701 2384941
18419 2384941 2469179 2401069 2096738 1799542 1647748 1641286 1484958 1802802 2041996 1658807
18409 1658807 1430608 1446035 1715266 1865363 2096030 2059639 2007037 1856346 2044636 2292201
18399 2292201 2256602 1891641 1667474 1811971 1771501 1812120 1836450 1591169 1208628 1199922
18389 1199922 1058629 1104925 1023523 1116394 1292291 1109828 1063643 1341274 1354744 1295359
18379 1295359 1165448 1097015 1018999 735242 515757 527831 699860 690429 772218 767538 1036384
18368 1036384 1118673 847982 945491 1048368 974377 752760 768536 785028 668502 860626
18358 860626 660007 340122 465840 576425 737653 514903 310097 225166 196516 534284
$$ packed form
18429B965490n04283K34420J22970j2150n6131j72070j28843j62780p3922J72240
18419B384941Q4238o8110l04331k97196j51794o462j56328L17844K39194l83189
18409A658807k28199J5427K69231J50097K30667l6391n2602j50691J88290K47565
18399B292201l5599l64961k24167J44497m0470M0619K4330k45281l82541q706
18389A199922j41293M6296q1402R2871J75897j82463m6185K77631J3470n9385
18379A295359j29911o8433p8016k83757k19485J2074J72029r431Q1789m680K68846
18368A036384Q2289k70691R7509J02877p3991k21617J5776J6492j16526J92124
18358H60626k00619l19885J25718J10585J61228k22750k04806q4931k8650L37768
$$ plain form
18348 534284 760778 818973 278235 115355 422691 550785 373623 159417 168993 275103
18338 275103 180516 -12169 -57810 96498 281909 473022 314199 151620 64129 144744
18328 144744 264220 294228 27560 -65424 204400 38980 -121519 116142 466986 496688
18318 496688 91795 -115731 -22081 -58091 -211154 -377299 -265286 -292146 -336215 -301470
18308 -301470 -178879 240652 721638 947752 767734 631636 470510 479820 680921 677934
18298 677934 392136 416548 292915 66266 -161473 -410549 -475322 -513950 -149585 -108840
18288 -108840 -88049 -107212 26670 -101877 7502 53950 -26700 -165004 -317696 -189477
18278 -189477 -13416 182277 221714 255434 161131 324749 221846 134632 356056 132075
$$ packed form
18348E34284K26494N8195n40738j62880L07336J28094j77162k14206R576J06110
18338B75103r4587j92685m5641J54308J85411J91113j58823j62579q7491Q0615
18328A44744J19476L0008k66668r2984K69824j65420j60499K37661L50844K9702
18318D96688m04893k07526R3650l6010j53063j66145J12013k6860m4069L4745
18308c01470J22591M19531M80986K26114j80018j36098j61126R310K01101k987
18298F77934k85798K4412j23633k26649k27739k49076o4773l8628L64365M0745
18288a08840K0791j9163J33882j28547J09379M6448q0650j38304j52692J28219
18278a89477J76061J95693L9437L3720r4303J63618j02903q7214K21424k23981
$$ plain form
18268 132075 -55717 -34459 6247 39238 -19669 -135081 -210386 -257122 -299977 -421164 -309802
18257 -309802 -202802 -278384 -77895 100617 126081 186733 355472 453836 439062 262973
18247 262973 145628 206228 201257 579840 394310 501300 402310 465413 762389 977761
18237 977761 1101153 943625 632504 464964 721394 841676 756189 632154 824705 802141
18227 802141 906322 796455 472217 397479 336591 279320 381790 226832 96506 215212
18217 215212 88618 195182 224294 315560 58887 -304845 56724 317952 444567 224223
18207 224223 215717 299370 344622 302303 308278 433097 810382 886444 610651 447323 479272
18196 479272 533327 330856 422581 223961 222911 505009 487416 435358 390948 633759 699377
$$ packed form
18268A32075j87792K1258M0706L2991n8907j15412p5305m6736m2855j21187J11362
18257c09802J07000p5582K00489J78512K5464O0652J68739R8364j4774j76089
18247B62973j17345O0600m971L78583j85530J06990r8990O3103K96976K15372
18237I77761J23392j57528l11121j67540K56430J20282q5487j24035J92551k2564
18227H02141J04181j09867l24238p4738o0888n7271J02470j54958j30326J18706
18217B15212j26594J06564K9112R1266k56673l63732L61569K61228J26615k20344
18207B24223q506Q3653M5252m2319N975J24819L77285P6062k75793j63328L1949
18196D79272N4055k02471R1725j98620j050K82098j7593n2058m4410K42811O5618
$$ plain form
18185 699377 631196 785555 474111 188330 -22055 107322 89766 412544 663200 558767
18175 558767 560233 507975 378796 682044 640208 662778 1042424 1033505 958485 672981 753611
18164 753611 748986 726695 822795 740676 1077548 1322323 1395849 1459487 1500440 1379765 1495026
18153 1495026 1474285 1367675 1119808 1227357 1416810 1498802 1794308 2206030 2248007 2194477
18143 2194477 2328038 2206667 2405019 2651347 2941187 3344668 3321441 3239691 3419480 3504130
18133 3504130 3606497 4005356 4409621 5093312 5735546 6420980 7181128 7952953 8797127
18124 8797127 10019026 12152560 14479281 17167739 20930727 26008380 33216785 44271061
18116 44271061 61241880 87689504 129403991 190250669 266636680 337129212 382687658
$$ packed form
18185F99377o8181J54359l11444k85781k10385J29377j7556L22778K50656j04433
18175E58767J466n2258j29179L03248m1836K2570L79646q919p5020k85504Q0630
18164G53611m625k2291R6100q2119L36872K44775P3526O3638M0953j20675J15261
18153A495026k0741j06610k47867J07549J89453Q1992K95506M11722M1977n3530
18143B194477J33561j21371J98352K46328K89840M03481k3227q1750J79789Q4650
18133C504130J02367L98859M04265O83691O42234O85434P60148P71825Q44174
18124H797127J221899K133534K326721K688458L762988N077653P208405J1054276
18116D4271061J6970819K6447624M1714487O0846678P6386011P0492532M5558446
$$ plain form
18109 382687658 408272558 391271437 298539533 192352322 126078538 88699143 65919828
18102 65919828 51201993 40914761 33575659 28072659 23853693 20363480 17493259 15515818
18094 15515818 13801623 12200147 10972619 10114343 9271456 8695739 7996347 7397789 6930941
18085 6930941 6421913 5869390 5580548 5487006 5388399 5297280 4721906 4344911 4138163 4025282
18075 4025282 4169973 4226317 3880694 3393424 3672667 3972850 3829164 3501046 3202568 3249432
18065 3249432 3534623 3559516 3485040 3445976 2928117 2605216 2313130 2242335 2036578 2065506
18055 2065506 2165880 2037003 1818674 1513162 1595895 1452946 1456160 1757956 1505900 1065301
18045 1065301 747293 800314 854897 553232 367297 300388 417762 789179 880673 807034
$$ packed form
18109C82687658K5584900j7001121r2731904j06187211o6273784l7379395k2779315
18102F5919828j4717835j0287232p339102n503000m218966l490213k870221j977441
18094A5515818j714195j601476j227528q58276q42887n75717o99392n98558m66848
18085F930941n09028n52523k88842r3542r8607r1119n75374l76995k06748j12881
18075D025282J44691N6344l45623m87270K79243L00183j43686l28118k98478M6864
18065C249432K85191K4893p4476l9064n17859l22901k92086p0795k05757K8928
18055B065506J00374j28877k18329l05512Q2733j42949L214L01796k52056m40599
18045A065301l18008N3021N4583l01665j85935o6909J17374L71417R1494p3639
$$ plain form
18035 807034 829605 911755 947815 844208 813456 778164 892122 1106745 1253964 1164643 899798
18024 899798 882155 922835 854573 897242 585477 419237 751468 821702 518546 780534
18014 780534 1069566 1045154 923414 823107 806241 637041 481437 666946 734569 851817
18004 851817 940519 909612 885060 924983 793358 825630 1167993 1287168 1378069 1499977 1524622
17993 1524622 1447826 1364724 1120005 910732 904542 1089020 1214703 1039119 708739 615603
17983 615603 553119 445387 371221 633636 516015 342740 609176 830841 801692 694213
17973 694213 704963 834157 985508 469327 307866 436584 733695 623535 617316 480062
17963 480062 268106 310720 515689 569131 645917 612409 501482 439606 240319 232756 198382
$$ packed form
18035H07034K2571Q2150L6060j03607l0752l5292J13958K14623J47219q9321k64845
18024H99798j7643M0680o8262M2669l11765j66240L32231P0234l03156K61988
18014G80534K89032k4412j21740j00307j6866j69200j55604J85509O7623J17248
18004H51817Q8702l0907k4552L9923j31625L2272L42363J19175R0901J21908K4645
17993A524622p6796q3102k44719k09273o190J84478J25683j75584l30380r3136
17983F15603o2484j07732p4166K62415j17621j73275K66436K21665k9149j07479
17973F94213J0750J29194J51351n16181j61461J28718K97111j10160o219j37254
17963D80062k11956M2614K04969N3442P6786l3508j10927o1876j99287p563l4374
$$ plain form
17952 198382 412409 358143 487870 690506 664080 635694 597691 838172 554571 120855
17942 120855 205864 295729 422858 718966 764214 420156 469792 554279 424111 231216
17932 231216 186038 137133 -325945 -515681 -249198 259321 733381 585468 190248 -47068
17922 -47068 -97220 -255704 -412797 -279352 -162519 -333450 -73231 -32558 -87276 -66863
17912 -66863 -278194 -529212 -538837 -448621 -307181 -132954 315347 540946 508586 494965 782562
17901 782562 919341 676412 576413 594048 566169 410331 90716 4740 -13425 -21193 -89133
17890 -89133 18907 77214 257898 470693 210610 -159445 -221395 -216721 -41955 221777
17880 221777 428478 409707 387353 255801 367759 246163 280864 769724 810061 411624
$$ packed form
17952A98382K14027n4266J29727K02636k6426k8386l8003K40481k83601m33716
17942A20855Q5009Q9865J27129K96108M5248l44058M9636Q4487j30168j92895
17932B31216m5178m8905m63078j89736K66483N08519M74060j47913l95220k37316
17922d7068n0152j58484j57093J33445J16833j70931K60219M0673n4718K0413
17912f6863k11331k51018r625R0216J41440J74227M48301K25599l2360j3621K87597
17901G82562J36779k42929r9999J7635k7879j55838l19615q5976j8165p768o7940
17890h9133J08040N8307J80684K12795k60083l70055o1950M674J74766K63732
17880B21777K06701j8771k2354j31552J11958j21596L4701M88860M0337l98437
$$ plain form
17870 411624 316917 243908 273977 88708 164152 307672 207948 195401 248290 124559 21766
17859 21766 368994 354672 280812 61346 -81418 84463 277621 535 40487 254610
17849 254610 261964 375876 530541 667381 707334 766680 521127 422136 536509 281718
17839 281718 16253 103265 326914 509427 258142 75824 -277952 -314552 -503496 -454497
17829 -454497 115578 8672 -64803 -19279 -152051 -117945 81629 127794 -177320 -275092
17819 -275092 -149209 -316788 -346164 75289 203427 286841 335073 220634 65365 -54026
17809 -54026 255460 467669 286556 41931 -128555 47632 375394 622253 574441 177440
17799 177440 102854 216110 216651 96077 126776 -30127 -273337 -6932 101927 99186 211273
$$ packed form
17870D11624r4707p3009L0069j85269P5444J43520r9724j2547N2889j23731j02793
17859B1766L47228j4322p3860k19466j42764J65881J93158k77086L9952K14123
17849B54610P354J13912J54665J36840L9953N9346k45553r8991J14373k54791
17839B81718k65465Q7012K23649J82513k51285j82318l53776l6600j88944M8999
17829d54497N70075j06906p3475M5524j32772L4106J99574M6165l05114r7772
17819b75092J25883j67579k9376M21453J28138Q3414M8232j14439j55269j19391
17809e4026L09486K12209j81113k44625j70486J76187L27762K46859m7812l97001
17799A77440p4586J13256N41j20574L0699j56903k43210K66405J08859k741J12087
$$ plain form
17788 211273 227361 246070 99563 23398 88861 113364 342487 288001 205519 263890 220567
17777 220567 111970 -429975 -489666 -167159 -202161 -284976 -359821 -376394 -306223 -122302 -45415
17766 -45415 -23166 -130890 -96550 90578 41004 -141245 -111941 -110092 -422 174522 35128
17755 35128 -28422 -70378 -132449 -175294 -578965 -742122 -789199 -350905 -131762 -408109 -269880
17744 -269880 -26687 327934 274088 35986 -121299 -258716 -425495 -398331 -175659 -27058
17734 -27058 -358897 -437540 -522604 -441600 -533848 -432322 -477045 -662069 -429578 -141158 122071
17723 122071 -3995 92766 444195 381199 187069 197984 -65889 51008 -160105 -380618
17713 -380618 -291781 -269636 -301828 -334144 -66036 36369 111490 2635 -105018 -14238 16400
$$ packed form
17788B11273J6088J8709j46507p6165O5463K4503K29123n4486q2482N8371m3323
17777B20567j08597n41945n9691L22507l5002q2815p4845j6573P0171J83921P6887
17766d5415K2249j07724L4340J87128m9574j82249K9304J849J09670J74944j39394
17755C5128o3550m1956o2071m2845m03671j63157m7077M38294K19143k76347J38229
17744b69880K43193L54621n3846k38102j57285j37417j66779K7164K22672J48601
17734b7058l31839p8643q5064Q1004r2248J01526m4723j85024K32491K88420K63229
17723A22071j26066R6761L51429o2996j94130J0915k63873J16897k11113k20513
17713c80618Q8837K2145l2192l2316K68108J02405P5121j08855j07653R0780L0638
$$ plain form
17702 16400 225290 372973 350331 93678 -230755 -210121 -53057 171939 411973 602488
17692 602488 386933 64256 -173631 -249126 -271759 -275593 -120945 57569 256211 131249
17682 131249 205543 264155 200301 95926 -285504 -373711 -224031 -230859 -210529 -327423 -431844
17671 -431844 -383912 -174746 -74252 -3851 128723 321676 396546 256787 34105 6353
17661 6353 -127103 258303 394962 178374 233693 78345 -140249 -456517 -427407 -19053
17651 -19053 334361 236093 124088 16021 9692 -82201 -379987 -276362 -304709 -330752 -197155
17640 -197155 164480 515505 513727 476942 190077 -48514 -176959 11178 111686 -52796
17630 -52796 -79341 27562 -5730 -140512 -102780 -126800 -311086 -624067 -407685 -206934
$$ packed form
17702A6400K08890J47683k2642k56653l24433K0634J57064K24996K40034J90515
17692F02488k15555l22677k37887p5495k2633l834J54648J78514J98642j24962
17682A31249P4294N8612o3854j04375l81430q8207J49680o828K0330j16894j04421
17671d31844M7932K09166J00494P0401J32574J92953P4870j39759k22682k7752
17661F353j33456L85406J36659k16588N5319j55348k18594l16268K9110M08354
17651a9053L53414r8268j12005j08067o329r1893k97786J03625k8347k6043J33597
17640a97155L61635L51025j778l6785k86865k38591j28445J88137J00508j64482
17630e2796k6545J06903l3292j34782L7732k4020j84286l12981K16382K00751
$$ plain form
17620 -206934 12585 73946 158256 328798 346638 312376 293480 433916 692499 476125
17610 476125 330122 -24127 117782 470272 591273 247925 164315 377382 -113084 -55841
17600 -55841 88042 -131374 -113010 13179 111928 225251 459829 410386 606964 802422
17590 802422 1149874 871098 237919 -59038 208641 126777 118245 25306 -104936 91011
17580 91011 -154447 -112195 -224844 -465314 -375533 -272572 -254030 -210633 -156479 -37067 405176
17569 405176 653111 619751 752811 559359 281589 149090 108798 21868 -159572 181911
17559 181911 149028 -37418 -104926 -56865 13399 202418 135986 237704 207507 -254515 -439546
17548 -439546 -365703 -449394 -257331 117143 462221 266223 246948 566575 862393 1009011
$$ packed form
17620b06934K19519O1361Q4310J70542J7840l4262j8896J40436K58583k16374
17610D76125j46003l54249J41909L52490J21001l43348q3610K13067m90466N7243
17600e5841J43883k19416J8364J26189R8749J13323K34578m9443J96578J95458
17590H02422L47452k78776o33179k96957K67679q1864q532r2939j30242J95947
17580I1011k45458M2252j12649k40470Q9781J02961J8542M3397N4154J19412M42243
17569D05176K47935l3360J33060j93452k77770j32499m0292q6930j81440L41483
17559A81911l2883j86446o7508M8061P0264J89019o6432J01718l0197m62022j85031
17548d39546P3843q3691J92063L74474L45078j95998j9275L19627K95818J46618
$$ plain form
17538 1009011 722286 281783 396161 163857 368917 321659 159935 112413 123655 355427
17528 355427 201589 -138312 -246129 6041 332571 355890 20092 -157260 67180 229272
17518 229272 364089 376834 77604 111771 84547 -887 -125188 -260432 -399106 -355707
17508 -355707 -127097 18256 184630 148853 276532 466419 -44577 -435689 -370926 -200122
17498 -200122 70360 163451 256866 232803 320983 275726 138847 -46027 -164856 -176953 -155604
17487 -155604 80404 90802 139580 147929 78379 143743 -84580 -121245 -20030 -9790 38232
17476 38232 -74524 -154440 299003 115617 -114138 -206169 -224535 -212738 -322102 -499295
17466 -499295 -510845 -498712 -204245 36229 -86937 -218759 -166365 -102774 -236408 -7552
$$ packed form
17538A009011k86725m40503J14378k32304K05060m7258j61724m7522J1242K31772
17528C55427j53838l39901j07817K52170L26530K3319l35798j77352K24440J62092
17518B29272J34817J2745k99230L4167k7224q5434j24301j35244j38674M3399
17508c55707K28610J45353J66374l5777J27679J89887n10996l91112O4763J70804
17498b00122K70482R3091R3415k4063Q8180m5257j36879j84874j18829j2097K1349
17487a55604K36008J0398M8778Q349o9550O5364k28323l6665J01215J0240M8022
17476C8232j12756p9916M53443j83386k29755r2031j8366J1797j09364j77193
17466d99295j1550J2133K94467K40474j23166j31822N2394O3591j33634K28856
$$ plain form
17456 -7552 30783 170299 42249 35489 185503 234562 94674 194135 515727 618377 1079093
17445 1079093 1641270 1884342 2013359 2270417 1881820 1179243 818440 581754 449462
17436 449462 493303 285660 349702 430988 205586 56332 90183 154256 63086 -64652 -265760
17425 -265760 -268446 -180781 -78415 183380 59286 238672 329811 -12227 119180 33328
17415 33328 -369498 -394321 -328856 -320519 -562336 -351325 55840 4835 -19575 -47423 -59726
17404 -59726 -2563 -112432 -101650 223127 -31873 -265036 -221646 -207475 -313373 -176401
17394 -176401 -49218 -317811 -284628 85736 229540 186937 -196835 -444263 -462832 -324050
17384 -324050 -374963 -648570 -776594 -715237 -456327 -342269 -287670 -378853 -370011 -250701 -201349
$$ packed form
17456g552L8335J39516j28050o760J50014M9059j39888R9461L21592J02650M60716
17445A079093N62177K43072J29017K57058l88597p02577l60803k36686j32292
17436D49462M3841k07643O4042Q1286k25402j49254L3851O4073r1170j27738k01108
17425b65760k686Q7665J02366K61795j24094J79386R1139l42038J31407q5852
17415C3328m02826k4823O5465Q337k41817K11011M07165n1005k4410k7848j2303
17404e9726N7163j09869J0782L24777k55000k33163M3390J4171j05898J36972
17394a76401J27183k68593L3183L70364J43804m2603l83772k47428j8569J38782
17384c24050n0913k73607j28024O1357K58910J14058N4599r1183Q842J19310M9352
$$ plain form
17373 -201349 -40941 -142076 -208369 -111026 -63613 44392 -270617 -376133 -283959 -178810
17363 -178810 226115 538446 300759 277850 272621 128129 118503 159000 148157 217192 -31589
17352 -31589 -154172 -361587 -200687 136673 343805 310319 129520 8400 -112227 -128017
17342 -128017 -386056 -339230 -124917 -36920 -133041 18160 110067 -37972 -25642 248831
17332 248831 269820 1277 -214022 52977 -171725 -410136 -681664 -732601 -438158 -271586
17322 -271586 -194349 -166235 -228582 -120769 -248712 -466207 -465973 -58023 234233 265525 297890
17311 297890 208271 226427 118492 51082 -63966 -21357 41654 61619 3781 -200039 -404508
17300 -404508 -284261 -153303 -438897 -580936 -337728 -68434 -259922 -356081 -210395 -46172
$$ packed form
17373b01349J60408j01135o6293R7343M7413J08005l15009j05516R2174J05149
17363a78810M04925L12331k37687k2909n229j44492r626M0497j0843O9035k48781
17352c1589j22583k07415J60900L37360K07132l3486j80799j21120j20627j5790
17342a28017k58039M6826K14313Q7997r6121J51201R1907j48039J2330K74473
17332B48831K0989k68543k15299K66999k24702k38411k71528n0937K94443J66572
17322b71586P7237K8114o2347J07813j27943k17495K34M07950K92256L1292L2365
17311B97890q9619J8156j07935o7410j15048M2609O3011J9965n7838k03820k04469
17300d04508J20247J30958k85594j42039K43208K69294j91488r6159J45686J64223
$$ plain form
17290 -46172 -17599 97841 73078 -36865 -110487 -125517 -126065 -481075 -560675 -335360 -247771
17279 -247771 28088 69129 -190741 -169439 -131808 -290519 -179631 -264812 -263567 -73020 -170436
17268 -170436 -264474 -61671 9434 -105602 -32653 149177 24126 8710 -4043 -22080 347086
17257 347086 294459 101326 -81777 -276519 -326728 -389846 -183028 37962 -358052 -735179
17247 -735179 -583710 -500150 -388989 -470633 -378907 -59519 264530 123704 -52914 -181847
17237 -181847 335671 728089 341056 43105 279081 530303 652843 298421 284392 259742
17227 259742 298325 213664 340966 443792 333250 -15725 -152695 45466 69244 -193808
17217 -193808 -109661 -66793 4218 222792 163350 219013 193230 245504 101425 -111680 -51626
$$ packed form
17290d6172K8573J15440k4763j09943p3622j5030n48l55010p9600K25315Q7589
17279b47771K75859M1041k59870K1302L7631j58711J10888q5181J245J90547r7416
17268a70436r4038K02803P1105j15036P2949J81830j25051j5416j2753j8037L69166
17257C47086n2627j93133j83103j94742n0209o3118K06818K20990l96014l77127
17247g35179J51469Q3560J11161q1644R1726L19388L24049j40826j76618j28933
17237a81847N17518L92418l87033k97951K35976K51222J22540l54422j4029k4650
17227B59742L8583q4661J27302J02826j10542l48975j36970J98161K3778k63052
17217a93808Q4147M2868P1011K18574n9442N5663k5783N2274j44079k13105O0054
$$ plain form
17206 -51626 -87318 -223518 -285898 48081 235403 155146 388407 426458 222220 -242695
17196 -242695 -156605 -143848 -146255 -129739 -92033 283142 357908 59300 -242504 -338350 -288165
17185 -288165 -343964 -203640 -24108 240833 406779 184787 375167 130890 -49468 -148507
17175 -148507 -135096 -59662 -13973 -9391 -188095 -354006 -281761 -188628 -75013 -128371 8749
17164 8749 259769 45390 -15627 181925 217857 152774 126034 406091 254976 60639 -107559
17153 -107559 -192120 -94507 -238329 15599 109427 -37252 -100389 -207549 -90871 -247825
17143 -247825 -389062 -388161 -149588 115488 66814 64364 7655 -37351 106102 532993 430222
17132 430222 211006 -230577 -168879 146008 -17521 -246212 -536380 -747659 -533175 -524505
$$ packed form
17206e1626l5692j36200o2380L33979J87322q0257K33261L8051k04238m64915
17196b42695Q6090J2757k407J6516L7706L75175P4766k98608l01804r5846N0185
17185b88165n5799J40324J79532K64941J65946k21992J90380k44277j80358r9039
17175a48507J3411P5434M5689M582j78704j65911P2245R3133J13615n3358J37120
17164H749K51020k14379o1017J97552L5932o5083k6740K80057j51115j94337j68198
17153a07559q4561R7613j43822K53928R3828j46679o3137j07160J16678j56954
17143b47825j41237R01K38573K65076m8674k450n6709m5006J43453M26891j02771
17132D30222k19216m41583O1698L14887j63529k28691k90168k11279K14484Q670
$$ plain form
17122 -524505 -253969 52303 256168 199555 -16829 -81490 8864 -67613 -116827 -170660 -127299
17111 -127299 -347036 -94263 154538 580938 267476 112492 24711 351175 242306 73329
17101 73329 -225594 -227391 -472953 -754316 -707803 -447421 -120841 -222492 -473257 -606648
17091 -606648 -453181 -64888 287185 519097 472123 370758 -199740 -343287 -67067 -26947
17081 -26947 -4734 54157 10963 93419 118327 -277813 -524513 -448518 -294319 -153709 56702
17070 56702 220738 76750 -375705 -175983 -160225 -239706 -107253 -103246 -467864 -457002 -225721
17059 -225721 -175787 -392693 -518541 -429366 -305141 -262875 -128947 -68660 -109641 -117096 -60375
17048 -60375 101141 213218 82905 75263 373281 367318 232760 332319 151501 -94973 -47257
$$ packed form
17122e24505K70536L06272K03865n6613k16384o4661R0354p6477m9214n3833M3361
17111a27299k19737K52773K48801M26400l13462j54984q7781L26464j08869j68977
17101G3329k98923j797k45562k81363M6513K60382L26580j01651k50765j33391
17091f06648J53467L88293L52073K31912m6974j01365n70498j43547K76220M0120
17081b6947K2213N8891m3194Q2456K4908l96140k46700P5995J54199J40610K10411
17070E6702J64036j43988m52455J99722J5758p9481J32453M007l64618J0862K31281
17059b25721M9934k16906j25848Q9175J24225M2266J33928O0287m0981p455N6721
17048f0375J61516J12077j30313p642K98018n963j34558R9559j80818k46474M7716
$$ plain form
17037 -47257 -6136 -1179 -183988 -203780 -315962 -460491 -350230 -314118 -339425 -110411 -34122
17026 -34122 -167788 -94788 257748 445483 490185 483683 101293 56934 313706 236136 72503
17015 72503 -23343 162375 -87416 -343479 -252360 -311656 -309167 -45117 119903 -42074 64340
17004 64340 79067 -203827 -541029 -510936 -76289 33715 -28280 -217777 -289900 -619371
16994 -619371 -490889 -162881 -59227 -109834 167611 28645 -57540 91981 397606 709485
16984 709485 452985 29449 -179325 -227251 -26444 244668 233722 376605 522447 335516
16974 335516 127064 -69590 -63927 -180315 -217146 -326251 -350518 -282273 -263752 -376717 -281727
16963 -281727 -233861 -186353 -37275 -35194 -53903 -360979 -606610 -449937 -191741 -15311
$$ packed form
17037d7257M1121M957j82809j9792j12182j44529J10261L6112k5307K29014P6289
17026c4122j33666P3000L52536J87735M4702o502l82390m4359K56772p7570j63633
17015G2503r5846J85718k49791k56063R1119n9296K489K64050J65020j61977J06414
17004F4340J4727k82894l37202L0093M34647J10004o1995j89497p2123l29471
16994f19371J28482L28008J03654n0607K77445j38966q6185J49521L05625L11879
16984G09485k56500m23536k08774m7926K00807K71112j0946J42883J45842j86931
16974C35516k08452j96654N663j16388l6831j09105k4267O8245J8521j12965R4990
16963b81727M7866M7508J49078K081j8709l07076k45631J56673K58196J76430
$$ plain form
16953 -15311 -33615 349182 474483 342535 375387 216756 -112973 -265418 -368419 -29768
16943 -29768 109195 -180337 -254537 -52065 -36477 -38527 -64279 -176481 -408549 -392970 -469989
16932 -469989 -456220 88252 180379 -166386 106450 125529 -173334 -368948 -165291 91183
16922 91183 -187629 519 -176133 -386816 -348242 -24121 481402 331834 217592 175329
16912 175329 244634 87501 -124523 -226041 -247716 -292272 -228385 -130953 117588 177212 39940
16901 39940 -272537 -359489 -153060 -79739 -261915 -135314 63174 -26796 -224449 -315141
16891 -315141 -181551 -117440 -77645 -151767 -242163 -126281 218648 167679 7107 -48169 -204847
16880 -204847 22658 514369 749818 465359 73608 150322 270130 114927 -128996 -528903
$$ packed form
16953a5311j8304L82797J25301j31948L2852j58631l29729j52445j03001L38651
16943b9768J38963k89532p4200K02472J5588k050k5752j12202k32068J5579p7019
16932d69989J3769N44472R2127l46765K72836J9079k98863j95614K03657K56474
16922I1183k78812J88148j76652k10683L8574L24121N05523j49568j14242m2263
16912A75329O9305j57133k12024j01518k1675m4556O3887R7432K48541N9624j37272
16901C9940l12477q6952K06429P3321j82176J26601J98488q9970j97653r0692
16891c15141J33590O4111L9795p4122r0396J15882L44929n0969j60572n5276j56678
16880b04847K27505M91711K35449k84459l91751P6714J19808j55203k43923l99907
$$ plain form
16870 -528903 -361398 -345851 -293377 -155167 111780 438323 397118 126136 53118 254964
16860 254964 387316 305463 206001 -121114 -123092 -116685 -124852 -66924 -16323 -137532 -13582
16849 -13582 9095 170440 -277477 -713885 -649370 -379453 -356547 -724006 -667756 -557450
16839 -557450 -430215 -297916 -204436 -206119 -204522 -357814 -591688 -497795 -146329 103906 16507
16828 16507 -46745 -201273 -50919 9790 363018 230098 208339 293427 202936 -56231 -190367
16817 -190367 24790 -266663 -339340 -125289 -117759 230292 395263 160633 -237059 -302567
16807 -302567 -251331 -96979 -366745 -322025 -79303 -66790 -173437 -24959 106596 3007
16797 3007 106128 133464 5553 -151272 -550278 -646772 -344799 -366127 -257879 -188825 -11539
$$ packed form
16870e28903J67505J5547N2474J38210K66947L26543m1205k70982p3018K01846
16860B54964J32352q1853r9462l27115j978O407q167N7928N0601j21209J23950
16849a3582K2677J61345m47917m36408O4515K69917K2906l67459N6250J10306
16839e57450J27235J32299R3480j683J597j53292k33874R3893L51466K50235q7399
16828A6507o3252j54528J50354O0709L53228j32920k1759Q5088r0491k59167j34136
16817a90367K15157k91453p2677K14051P530L48051J64971k34630l97692o5508
16807c02567N1236J54352k69766M4720K42722J2513j06647J48478J31555j03589
16797C007J03121K7336j27911j56825l99006r6494L01973k1328J08248O9054J77286
$$ plain form
16786 -11539 -112283 -110887 -178646 -262272 -376101 -503541 -329108 -58773 228223 160785 -122951
16775 -122951 -103096 204505 234427 -35501 -117606 120804 184354 83973 23609 -203353
16765 -203353 -616612 -594986 -451691 -614589 -974421 -1071449 -968893 -325989 -155358 -50884
16755 -50884 -276555 -54432 187188 258950 390245 207053 -50816 2204 -72135 60415
16745 60415 205996 95060 -73220 -141703 -237096 -219147 -104525 -83895 9849 162465 163669
16734 163669 -18525 -247031 -134280 9871 217645 401065 357613 108677 -112974 -100155
16724 -100155 -105401 -129086 -304543 -298098 -185382 -89496 -91165 23250 238699 262321 174204
16713 174204 19108 -225848 -407663 8307 -88565 8567 185488 394990 512900 444317
$$ packed form
16786a1539j00744J396o7759q3626j13829j27440J74433K70335K86996o7438k83736
16775a22951J9855L07601K9922k69928q2105K38410O3550j00381o0364k26962
16765b03353m13259K1626J43295j62898l59832r7028J02556O42904J70631J04474
16755e0884k25671K22123K41620P1762J31295j83192k57869N3020p4339J32550
16745F0415J45581j10936j68280o8483r5393J7949J14622K0630R3744J52616J204
16734A63669j82194k28506J12751J44151K07774J83420m3452k48936k21651J2819
16724a00155n246k3685j75457O445J12716R5886j669J14415K15449K3622q8117
16713A74204j55096k44956j81815M15970r6872R7132J76921K09502J17910o8583
$$ plain form
16703 444317 149162 48517 -229073 -172286 -60473 -249721 94027 444832 506139 419185
16693 419185 374008 194971 -171378 -295106 -210497 -243592 -210127 -226794 -116827 -156467 -125310
16682 -125310 -38758 -177963 -272139 -337205 -534415 -595917 -320827 -17011 150400 260604
16672 260604 200709 135300 148905 82237 153223 339009 344519 287897 211816 68508 255903
16661 255903 309057 141580 -190573 -321404 -469206 -560679 -431399 -190062 -78909 -2615
16651 -2615 -43945 -24067 -179849 -495115 -476882 -352632 -73277 339254 365773 239979 206954
16640 206954 128409 -229436 -463165 -302394 -151592 243936 89065 -321995 -437263 -324709
16630 -324709 -357123 -382318 -243403 -122041 -159433 -96197 -236475 -351836 -353770 -260194 -361641
$$ packed form
16703D44317k95155j00645k77590N6787J11813j89248L43748L50805O1307q6954
16693D19185m5177j79037l66349j23728Q4609l3095L3465j6667J09967l9640L1157
16682a25310Q6552j39205r4176o5066j97210o1502K75090L03816J67411J10204
16672B60604n9895o5409J3605o6668P0986J85786N510n6622p6081j43308J87395
16661B55903N3154j67477l32153j30831j47802r1473J29280K41337J11153P6294
16651b615m1330J9878j55782l15266J8233J24250K79355M12531K6519j25794l3025
16640B06954p8545l57845k33729J60771J50802L95528j54871m11060j15268J12554
16630c24709l2414k5195J38915J21362l7392O3236j40278j15361j934R3576j01447
$$ plain form
16619 -361641 -429912 -171643 265881 652720 617065 551748 371459 135426 136524 237851
16609 237851 256862 293324 127780 19761 12316 -2056 -44428 -365129 -591615 -519274 -144096
16598 -144096 115847 -52350 -15953 45965 27219 -231893 -478533 -485456 -428485 -170262 20962
16587 20962 -47569 -31167 -19493 -328016 -417391 -318184 7121 -25283 -188254 -213550 -482894
16576 -482894 -337472 -359673 -260551 -268735 -109503 -111609 -380075 -83146 117300 201611 -18080
16565 -18080 -147251 -466633 -421809 -342436 -280108 8678 104921 -148892 -86780 -99041 139573
16554 139573 -255231 -286711 -142835 -92919 142487 230062 123251 -66168 -328565 -409917
16544 -409917 -111250 140172 144885 51120 255753 380577 504113 431248 469293 446542 162597
$$ packed form
16619c61641o8271K58269M37524L86839l5655o5317j80289k36033J098J01327
16609B37851J9011L6462j65544j08019p445j4372m2372l20701k26486P2341L75178
16598a44096K59943j68197L6397O1918j8746k59112k46640o923N6971K58223J91224
16587B0962o8531J6402J1674l08523q9375R9207L25305l2404j62971k5296k69344
16576d82894J45422k2201R9122q184J59232k106k68466K96929K00446Q4311k19691
16565a8080j29171l19382M4824P9373O2328K88786R6243k53813O2112j2261K38614
16554A39573l94804l1480J43876M9916K35406Q7575j06811j89419k62397q1352
16544d09917K98667K51422M713r3765K04633J24824J23536p2865L8045k2751k83945
$$ plain form
16533 162597 -13822 279946 169888 -25467 -159246 133038 296600 209668 199431 456535
16523 456535 492019 420133 305298 83550 23426 -31994 -415970 -458875 -246912 -82205
16513 -82205 167612 434542 406198 366644 464039 260181 -26688 -281774 -245303 -40706
16503 -40706 54170 14338 -198142 -313730 -84489 -237253 -394038 193 199499 532032
16493 532032 464707 336325 232349 -69561 -132854 -65811 63601 93080 -67129 -78147
16483 -78147 -357164 -571876 -650293 -652942 -329734 -140434 -166752 -56473 -120503 -38987 -169770
16472 -169770 -154544 -303753 -257422 -310812 -145890 331814 309848 36430 -409786 -384807
16462 -384807 -176888 -96486 -313619 -333188 -379392 -230489 175548 95450 257247 216863
$$ packed form
16533A62597j76419K93768j10058j95355j33779K92284J63562q6932j0237K57104
16523D56535L5484p1886j14835k21748o0124n5420l83976m2905K11963J64707
16513h2205K49817K66930k8344l9554R7395k03858k86869k55086L6471K04597
16503d0706R4876l9832k12480j15588K29241j52764j56785L94231J99306L32533
16493E32032o7325j28382j03976l01910o3293O7043J29412K9479j60209j1018
16483g8147k79017k14712p8417k649L23208J89300k6318J10279o4030Q1516j30783
16472a69770J5226j49209M6331n3390J64922M77704k1966k73418m46216K4979
16462c84807K07919Q0402k17133j9569m6204J48903M06037q0098J61797m0384
$$ plain form
16452 216863 120051 14286 -59858 38462 -49595 -214172 -117423 -20368 -94939 -313117 -370666
16441 -370666 -293827 -358384 -611704 -589901 -138291 66732 -172233 -170444 103334 161322 -13554
16430 -13554 68673 244295 317525 250950 -37311 -58302 329837 342396 276495 306398 261379
16419 261379 147165 191038 278923 348983 313153 51113 -106137 126061 51506 -183430
16409 -183430 -98547 -135381 252412 297229 93536 -12973 -34454 256836 515481 227063
16399 227063 -89071 -199551 -180268 28795 361344 646031 587551 408303 435159 411949
16389 411949 349176 117331 9854 76858 51824 -200933 -324548 -431210 -403831 -9602
16379 -9602 264077 228378 442946 505027 395212 374995 573490 438890 245496 -101969
$$ packed form
16452B16863r6812j05765p4144R8320q8057j64577R6749R7055p4571k18178n7549
16441c70666P6839o4557k53320K1803M51610K05023k38965J789K73778N7988j74876
16430a3554Q2227J75622P3230o6575k88261k0991L88139J2559o5901K9903m5019
16419B61379j14214M3873Q7885P0060l5830k62040j57250K32198p4555k34936
16409a83430Q4883l6834L87793M4817k03693j06509k1481K91290K58645k88418
16399B27063l16134j10480J9283K09063L32549K84687n8480j79248K6856k3210
16389D11949o2773k31845j07477O7004k5034k52757j23615j06662K7379L94229
16379i602K73679l5699K14568O2081j09815k0217J98495j34600j93394l47465
$$ plain form
16369 -101969 3323 178161 -78644 -514389 -694460 -206950 177064 191295 116437 58376
16359 58376 70592 -79997 47558 143917 575405 846022 835352 603230 136745 123294
16349 123294 453172 697607 741210 731660 556180 629769 753197 787957 555009 -37915
16339 -37915 -138718 129408 216735 90726 326959 194154 -34104 -191225 -150650 -341605
16329 -341605 -262107 -49535 99737 -16475 -48996 -113905 -149678 -86908 56549 105667 -50630
16318 -50630 -104070 -111062 -263244 -552019 -464996 -275890 -244102 10543 255324 407311 280001
16307 280001 123845 32922 -6683 -199021 -317416 -303771 -224077 -296356 -298427 -197891 9762
16296 9762 281247 128753 -65340 -99635 -203594 -252752 -12910 -94670 185962 32389
$$ packed form
16369a01969J05292J74838k56805m35745j80071M87510L84014J4231p4858n8061
16359E8376J2216j50589J27555R6359M31488K70617j0670k32122m66485j3451
16349A23294L29878K44435M3603r550j75480P3589J23428L4760k32948n92924
16339c7915j00803K68126Q7327j26009K36233j32805k28258j57121M0575j90955
16329c41605P9498K12572J49272j16212l2521o4909l5773O2770J43457M9118j56297
16318e0630n3440o992j52182k88775Q7023J89106L1788K54645K44781J51987j27310
16307B80001j56156r0923l9605j92338j18395J3645P9694p2279k071J00536K07653
16296I762K71485j52494j94093l4295j03959m9158K39842q1760K80632j53573
$$ plain form
16286 32389 -71929 19872 -177304 -519915 -530740 -517250 -439817 -169072 -19861 -63992 -203293
16275 -203293 -344930 -219728 -14764 97019 130831 223429 245462 294005 368665 387795 255823
16264 255823 356606 99168 208155 79752 -273154 -148180 -108832 -224990 -111452 -25495
16254 -25495 4768 -244765 -415932 -567574 -528474 -150887 69135 -29389 349096 364942
16244 364942 241571 31783 18486 242523 218604 13364 -43470 -17906 -6390 121936
16234 121936 250515 719 -143048 -219610 -276565 -398241 -428117 -500185 -476862 -218823
16224 -218823 -114508 183233 257559 84992 -48220 141418 201565 -67322 -196257 -2968
16214 -2968 -167098 -141755 -205567 -327592 -354567 -96559 308246 284366 165353 -2969 -244038
$$ packed form
16286C2389j04318R1801j97176l42611j0825J3490P7433K70745J49211m4131j39301
16275b03293j41637J25202K04964J11783L3812R2598K2033M8543P4660J9130j31972
16264B55823J00783k57438J08987j28403l52906J24974L9348j16158J13538Q5957
16254b5495L0263k49533j71167j51642L9100L77587K20022r8524L78485J5846
16244C64942j23371k09788j3297K24037k3919k05240n6834K5564J1516J28326
16234A21936J28579k49796j43767p6562n6955j21676k9876p2068K3323K58039
16224b18823J04315K97741P4326j72567j33212J89638O0147k68887j28935J93289
16214b968j64130K5343o3812j22025k6975K58008M04805k3880j19013j68322k41069
$$ plain form
16203 -244038 -283150 66492 85279 93852 391474 444489 129677 100694 98941 -142384 -165358
16192 -165358 -70455 -56360 -237149 -230659 -199679 128387 277684 306032 189591 93952 99601
16181 99601 -41374 -63366 -268633 -73640 -183854 -364173 -257213 -110396 -274605 -337566
16171 -337566 -357623 -453262 -234641 -221657 -112381 -85304 -144277 104709 -109938 -53926 -105273
16160 -105273 10862 -87726 12765 249546 375705 139812 -199155 -159405 -149540 9273
16150 9273 21583 -62222 72371 123164 93558 -171727 -616208 -337445 -247128 -328682 -68780
16139 -68780 -197474 -186620 -186298 -160793 -353048 -288587 -13047 141497 93806 -24846 -209280
16128 -209280 -373591 -176217 -161986 -79635 159237 693036 537657 381760 241579 -124906
$$ packed form
16203b44038l9112L49642J8787Q573K97622N3015l14812k8983j753k41325k2974
16192a65358R4903J4095j80789O490L0980L28066J49297K8348j16441r5639N649
16181I9601j40975k1992k05267J94993j10214j80319J06960J46817j64209o2961
16171c37566k0057r5639K18621J2984J09276K7077n8973K48986k14647N6012n1347
16160a05273J16135r8588J00491K36781J26159k35893l38967L9750R865J58813
16150I273J2310q3805J34593N0793k9606k65285m44481K78763R0317q1554K59902
16139f8780j28694J0854L22K5505j92255O4461K75540J54544m7691j18652j84434
16128b09280j64311J97374J4231Q2351K38872N33799j55379j55897j40181l66485
$$ plain form
16118 -124906 -134040 -221076 -275775 -148762 -82202 -327409 -89100 333923 201110 -22034
16108 -22034 -201177 -307335 71409 477366 519127 288581 200927 86103 204995 -257371
16098 -257371 -443444 -540066 -526084 -484464 -379120 -282338 -294789 -205727 -272990 -239513 -19448
16087 -19448 -194557 -241501 -384211 -418764 -396056 -323435 -533913 -709662 -739769 -472979 -398071
16076 -398071 -429490 -494319 -441139 -195116 135345 172048 129433 101879 42112 -160724 -364434
16065 -364434 -71381 -94106 -205063 -66237 -109160 -331428 -363420 68530 82438 44701
16055 44701 126855 66800 -5140 180529 330775 230422 30436 -120550 -182819 -145966 -327436
16044 -327436 -458978 -71092 209691 -118457 -54574 -8789 -195763 -70367 -66465 -202344
$$ packed form
16118a24906r134q7036n4699J27013O6560k45207K38309M23023j32813k23144
16108b2034j79143j06158L78744M05957M1761k30546q7654j14824J18892m62366
16098b57371j86073r6622J3982M1620J05344R6782j2451Q9062o7263L3477K20065
16087a9448j75109m6944j42710l4553K2708P2621k10478j75749l0107K66790P4908
16076c98071l1419o4829N3180K46023L30461L6703m2615k7554n9767k02836k03710
16065c64434K93053k2725j10957J38826m2923k22268l1992M31950J3908l7737
16055D4701Q2154o0055p1940J85669J50246j00353j99986j50986o2269L6853j81470
16044c27436j31542L87886K80783l28148O3883M5785j86974J25396L902j35879
$$ plain form
16034 -202344 -55339 21417 14380 34063 379151 680391 336856 126520 57915 40742 87326
16023 87326 18682 -201949 -140816 -65720 -217491 -46484 137588 188577 220014 171932 8010
16012 8010 13293 -280541 -209818 -140992 -233974 -244870 -15023 -5343 -17262 319748 142935
16001 142935 168352 232695 169015 37730 -149520 -404185 -600456 -240013 -178309 -254335
15991 -254335 -289273 -190716 -235248 -254123 217557 461687 513280 168090 -111614 -143097 -57636
15980 -57636 122685 4175 -177661 -186126 -176693 192144 -65935 -324181 -350058 -406203 -280270
15969 -280270 27730 51029 -355257 -501741 -276625 -124313 -102729 49758 75419 109052
15959 109052 -168673 -212630 29266 79720 -21146 -144338 -468976 -186867 -86622 -195782
$$ packed form
16034b02344J47005P6756p037J9683L45088L01240l43535k10336o8605j7173M6584
16023H7326o8644k20631O1133P5096j51771J71007J84072N0989L1437m8082j63922
16012H010N283k93834P0723O8826r2982j0896K29847R680j1919L37010j76813
16001A42935K5417O4343o3680j31285j87250k54665j96271L60443O1704p6026
15991b54335l4938R8557m4532j8875M71680K44130N1593l45190k79704l1483Q5461
15980e7636J80321j18510j81836q465R433L68837k58079k58246k5877n6145J25933
15969b80270L08000K3299m06286j46484K25116J52312K1584J52487K5661L3633
15959A09052k77725m3957K41896N0454j00866j23192l24638K82109J00245j09160
$$ plain form
15949 -195782 -129693 245025 530265 538802 229531 267410 433517 150909 82248 289067
15939 289067 532091 367175 48881 135223 -23657 -217500 -350050 -263353 -47785 -8788
15929 -8788 -272283 -350034 -343176 -250623 -340574 -463701 -509308 -553270 -535105 -236024 146009
15918 146009 392566 495883 374240 -52255 46575 -1614 -205974 -67563 -2568 -22950
15908 -22950 -73961 33510 170337 -14228 -141089 -40990 66990 122131 -16568 -174645
15898 -174645 -566118 -676314 -603024 -461637 -396961 -400252 -159186 79503 172002 -123140
15888 -123140 -528393 -215268 -1574 57508 38064 131967 96992 -38104 -24731 -157691
15878 -157691 -482002 -383848 -226742 -470803 -538247 -264500 31448 120117 292148 263900
$$ packed form
15949a95782O6089L74718K85240Q537l09271L7879J66107k82608o8661K06819
15939B89067K43024j64916l18294Q6342j58880j93843j32550Q6697K15568L8997
15929h788k63495p7751O858R2553q9951j23127m5607m3962J8165K99081L82033
15918A46009K46557J03317j21643m26495R8830m8189k04360J38411O4995k0382
15908b2950n1011J07471J36827j84565j26861J00099J07980N5141j38699j58077
15898a74645l91473j10196P3290J41387O4676l291K41066K38689R2499k95142
15888a23140m05253L13125K13694N9082j9444R3903l4975j35096J3373j32960
15878a57691l24311R8154J57106k44061o7444K73747K95948Q8669J72031k8248
$$ plain form
15868 263900 310529 198167 234353 322040 -47229 -20355 71438 129363 27717 -97124 -66316
15857 -66316 108644 237375 287619 204061 266037 230785 165073 -43481 -224622 -407254 -565151
15846 -565151 -589200 -789717 -448448 -147146 56428 348133 447300 318279 97848 -31825
15836 -31825 -140171 105407 348039 216551 287748 505299 461287 -156244 -736816 -604731
15826 -604731 28079 256791 206507 191779 -51003 -250006 30905 -67692 -172379 -122865
15816 -122865 59097 80941 28162 204883 -63021 -206330 -408754 -82234 -12073 -367641
15806 -367641 -489208 -710001 -459114 46146 401375 457788 303743 -202372 -416890 -250099
15796 -250099 -137236 86556 140273 416685 422540 384177 464395 411664 211403 97271 -307097
$$ packed form
15868B63900M6629j12362L6186Q7687l69269K6874R1793N7925j01646j24841L0808
15857f6316J74960J28731N0244q3558O1976l5252o5712k08554j81141j82632j57897
15846e65151k4049k00517L41269L01302K03574K91705R9167j29021k20431j29673
15836c1825j08346K45578K42632j31488P1197K17551m4012o17531n80572J32085
15826f04731O32810K28712n0284j4728k42782j99003K80911r8597j04687M9514
15816a22865J81962K1844n2779J76721k67904j43309k02424L26520P0161l55568
15806c67641j21567k20793K50887N05260L55229N6413j54045n06115k14518J66791
15796b50099J12863K23792N3717K76412N855l8363Q0218n2731k00261j14132m04368
$$ plain form
15785 -307097 -475525 -378391 -459401 -298115 -185803 78366 -196137 -280585 -9439 236740
15775 236740 383330 235658 -70618 -168817 -312304 -514077 -409313 -303475 -140082 -326224
15765 -326224 -404006 -429374 -276585 -76105 91420 -135738 -83432 -345233 -576128 -444996
15755 -444996 67271 565784 756792 480541 367232 271446 229198 221929 257500 175883 111768
15744 111768 92613 75877 70262 -196384 -368290 -380946 39636 188823 151495 319715 149529
15733 149529 75719 -173967 128492 416030 406327 11914 16731 4955 -61869 -31012 -211745
15722 -211745 -91297 -61084 13152 -242550 -368733 -344141 -253940 -219096 -278994 16501 257694
15711 257694 466588 324800 353870 448766 249157 -46781 -106112 -154797 -90944 -110507 -403441
$$ packed form
15785c07097j68428R7134q1010J61286J12312K64169k74503q4448K71146K46179
15775B36740J46590j47672l06276r8199j43487k01773J04764J05838J63393j86142
15765c26224p7782k5368J52789K00480J67525k27158N2306k61801k30895J31132
15755d44996N12267M98513J91008k76251j13309r5786m2248p269L5571q1617o4115
15744A11768j9155j6736n615k66646j71906j2656M20582J49187l7328J68220j70186
15733A49529p3810k49686L02459K87538r703l94413M817j1776o6824L0857j80733
15722b11745J20448L0213P4236k55702j26183K4592R0201L4844n9898K95495K41193
15711B57694K08894j41788K9070R4896j99609k95938n9331m8685O3853j9563k92934
$$ plain form
15700 -403441 -519242 -258341 -9000 -202258 -374007 -486157 -368226 -521769 -305244 -51480
15690 -51480 -303929 -445851 -251182 -250458 -36861 260711 -27258 -257354 -304034 -349453 -181792
15679 -181792 -70543 45655 359225 82870 -254359 -335306 -427826 -624629 -693706 -487777
15669 -487777 -168908 -191521 -438711 -296245 -123217 -287380 -463574 -529753 -163894 178075
15659 178075 234785 214978 302089 287390 201031 -70532 -97714 16867 -216331 -425214 -237851
15648 -237851 233912 441323 218088 42434 8070 388777 375857 238338 341852 515139
15638 515139 311433 91576 23435 73631 -13840 -103314 -351288 -391090 -294407 -683 33920
15627 33920 180898 318611 282783 182873 -192073 -453263 22065 212778 49325 -408434
$$ packed form
15700d03441j15801K60901K49341j93258j71749j12150J17931j53543K16525K53764
15690e1480k52449j41922J94669P24K13597K97572k87969k30096m6680m5419J67661
15679a81792J11249J16198L13570k76355l37229q0947r2520j96803o9077K05929
15669d87777L18869k2613k47190J42466J73028j64163j76194o6179L65859L41969
15659A78075N6710j9807Q7111j4699q6359k71563k7182J14581k33198k08883J87363
15648b37851M71763K07411k23235j75654l4364L80707j2920j37519J03514J73287
15638E15139k03706k19857o8141N0196q7471q9474k47974l9802R6683K93724L4603
15627C3920J46978J37713l5828r9910l74946k61190M75328J90713j63453m57759
$$ plain form
15617 -408434 -143549 237341 108543 85081 -99304 -169091 -330687 -535715 -659576 -415001
15607 -415001 -238620 -86504 41801 316410 208475 275663 427273 381882 53888 -187830
15597 -187830 -266492 -337118 -381317 -23428 44204 229336 406160 436899 202294 154490 466705
15586 466705 529472 228972 147418 -11363 -442205 -409359 -261659 -205099 56340 264328
15576 264328 -124582 -222579 -254853 -148362 -8385 26293 -168566 -28096 268551 131721
15566 131721 300964 368962 320705 23183 -261065 -175717 -177103 -148257 -275691 -190456 -452163
15555 -452163 -747480 -767537 -538555 -365259 -18322 252664 53127 -129967 25714 179190
15545 179190 131378 163283 210446 101883 98309 569250 588146 277239 -53975 27322 50406
$$ packed form
15617d08434K64885L80890j28798k3462j84385o9787j61596k05028j23861K44575
15607d15001J76381J52116J28305K74609j07935O7188J51610m5391l27994k41718
15597a87830p8662p0626m4199L57889O7632J85132J76824L0739k34605m7804L12215
15586D66705O2767l00500q1554j58781m30842L2846J47700N6560K61439K07988
15576B64328l88910r7997l2274J06491J39977L4678j94859J40470K96647j36830
15566A31721J69243O7998m8257k97522k84248Q5348j386K8846j27434Q5235k61707
15555d52163k95317k0057K28982J73296L46937K70986j99537j83094J55681J53476
15545A79190m7812L1905M7163j08563l574M70941J8896l10907l31214Q1297K3084
$$ plain form
15534 50406 -401754 -852014 -629285 -307121 -203738 -302429 -300804 -392758 -419443 -160713 -523332
15523 -523332 -549042 -195814 52133 -154984 -100625 103190 30158 -92074 -185411 4398
15513 4398 16232 273771 368309 251867 165291 -5377 -218454 -199147 -143629 -457405 -533926
15502 -533926 -291446 -96788 -65153 -181851 -325628 -447031 -325188 -88058 93735 158683
15492 158683 21376 138005 201688 476150 418212 297319 354889 61058 -131965 -148540
15482 -148540 -265276 -678933 -611956 -362380 -133949 -157151 -75046 -110343 -177066 -375013
15472 -375013 -206183 -111412 -294903 -175835 -163055 -221844 -314537 -99527 51125 67653
15462 67653 131926 -53560 -98069 251206 202995 12119 77485 -177526 -162128 -215758 -234237
$$ packed form
15534E0406m52160m50260K22729L22164J03383r8691J625r1954k6685K58730l62619
15523e23332k5710L53228K47947k07117N4359K03815p3032j22232r3337J89809
15513D398J1834K57539R4538j16442q6576j70668k13077J9307N5518l13776p6521
15502e33926K42480J94658L1635j16698j43777j21403J21843K37130J81793O4948
15492A58683j37307J16629O3683K74462n7938j20893N7570k93831j93023j6575
15482a48540j16736m13657O6977K49576K28431k3202Q2105l5297o6723j97947
15472c75013J68830R4771j83491J19068J2780n8789r2693K15010J50652J6528
15462F7653O4273j85486m4509L49275m8211j90876O5366k55011J5398n3630j8479
$$ plain form
15451 -234237 -161785 -125772 -241925 -167160 -52412 -207052 -189223 -156338 -351005 -5849
15441 -5849 225567 499917 700527 849595 634281 359337 -116384 -493585 -654441 -648791
15431 -648791 -602476 -687792 -513673 -220979 -163722 -238538 -22809 129012 99691 -91366
15421 -91366 -295844 -163104 -53044 -107 53919 -287684 -555958 -477817 -431522 -344183 -99367
15410 -99367 115264 323200 302595 315450 440141 173375 378270 242723 -44110 33377
15400 33377 148791 90483 239814 129215 173388 -26049 -322288 -670456 -673043 -593411 -298667
15389 -298667 -286504 -339242 -460226 -510217 -842841 -934597 -815961 -510759 -84835 -37026
15379 -37026 -210538 -137109 -370090 -790808 -657361 -27119 287560 343631 -56979 -245273
$$ packed form
15451b34237P2452L6013j16153P4765J14748j54640J7829L2885j94667L45156
15441e849K31416K74350K00610J49068k15314k74944m75721l77201j60856N650
15431f48791M6315q5316J74119K92694N7257p4816K15729J51821k9321j91057
15421i1366k04478J32740J10060N2937N4026l41603k68274P8141M6295Q7339K44816
15410i9367K14631K07936k0605J2855J24691k66766K04895j35547k86833P7487
15400C3377J15414n8308J49331j10599M4173j99437k96239l48168k587P9632K94744
15389b98667J2163n2738j20984m9991l32624r1756J18636L05202M25924M7809
15379c7026j73512P3429k32981m20718J33447O30242L14679N6071m00610j88294
$$ plain form
15369 -245273 -373343 -435747 -227875 -156285 -149181 157396 91599 -361767 -398905 -184702 -302928
15358 -302928 -114272 43202 73777 90338 46337 -110493 -5232 288501 146943 71357
15348 71357 138749 174346 502317 498497 152203 125042 -70763 -310179 -458342 -483657 44722
15337 44722 30816 -151664 -82107 144213 146108 -55493 -58504 36915 105958 -53811 142745
15326 142745 -31398 -227334 -50660 148632 -81601 -511544 -149176 300237 437545 212413
15316 212413 258844 323366 177400 347018 271216 -130417 -129538 -152383 152927 115803 13322
15305 13322 -302178 -588588 -722410 -911433 -833235 -498620 -115932 -53955 -599054 -731827
15295 -731827 -566457 -482346 -265072 -208743 -293702 -473005 -356239 -305030 -260283 -13185
$$ packed form
15369b45273j28070o2404K07872P1590P104L06577o5797m53366l7138K14203j18226
15358c02928J88656J57474L0575J6561m4001j56830J05261K93733j41558p5586
15348G1357O7392L5597L27971l820l46294k7161j95805k39416j48163k5315N28379
15337D4722j3906j82480O9557K26320J895k01601l011R5419O9043j59769J96556
15326A42745j74143j95936J76674J99292k30233m29943L62368M49413J37308k25132
15316B12413M6431O4522j45966J69618p5802m01633Q79k2845L05310l7124j02481
15305A3322l15500k86410j33822j89023P8198L34615L82688O1977n45099j32773
15295g31827J65370Q4111K17274N6329q4959j79303J16766N1209M4747K47098
$$ plain form
15285 -13185 -159540 -317357 -492621 -767365 -381704 -195137 -224782 107410 502667 418890
15275 418890 357271 310856 219462 85940 382209 367918 308510 185442 320061 355710 227763
15264 227763 108389 -64140 -126338 -51438 288657 507328 367789 -8061 -35261 63944
15254 63944 50732 224940 174633 -79667 -454869 -264896 -17093 -113363 -320258 -125700
15244 -125700 -27391 -61975 -204870 -136488 250572 271855 28734 -78860 -18338 -69065 39033
15233 39033 128819 143027 -61593 -177591 8894 33951 -13945 -175138 -294049 -920685
15223 -920685 -735871 -416873 -243296 82082 -168625 -426957 -219459 150250 278332 57011
15213 57011 -177649 -211839 33423 255323 204570 -10837 -47553 -63017 -202179 -603953
$$ packed form
15285a3185j46355j57817j75264k74744L85661J86567k9645L32192L95257q3777
15275D18890o1619m6415r1394j33522K96269j4291n9408j23068J34619L5649j27947
15264B27763j19374j72529o2198P4900L40095K18671j39539l75850k7200R9205
15254F3944j3212J74208n0307k54300l75202J89973K47803r6270k06895J94558
15244a25700R8309l4584j42895O8382L87060K1283k43121j07594O0522n0727J08098
15233C9033Q9786J4208k04620j15998J86485K5057m7896j61193j18911o26636
15223i20685J84814L18998J73577L25378k50707k58332K07498L69709J28082k21321
15213E7011k34660l4190K45262K21900n0753k15407l6716j5464j39162m01774
$$ plain form
15203 -603953 -661262 -315559 -24352 190566 -106131 -332862 -259761 -345356 -260198 -221651
15193 -221651 229488 185392 325845 500055 332131 97174 -116006 58483 481322 368502
15183 368502 197795 175714 85329 -21419 -52526 -177821 -143969 173784 -224279 -680566
15173 -680566 -621319 -159031 185393 -46849 -107640 -38216 -102119 -196667 -394373 -397821 -517406
15162 -517406 -208515 -107834 129315 374698 238280 122198 69832 171130 53820 111074
15152 111074 100852 327767 221600 -24375 -53099 24821 134485 118465 -133975 -157776
15142 -157776 52403 -58867 -290922 -292804 -126985 -83766 -120513 -257580 -117569 -147537
15132 -147537 -184015 -400342 -328972 -296851 -164806 323298 449770 139170 -128050 -164238
$$ packed form
15203f03953n7309L45703K91207K14918k96697k26731P3101q5595Q5158L8547
15193b21651M51139m4096J40453J74210j67924k34957k13180J74489M22839j12820
15183C68502j70707k2081r0385j06748l1107j25295L3852L17753l98063m56287
15173f80566N9247M62288L44424k32242o0791O9424o3903r4548j97706l448j19585
15162e17406L08891J00681K37149K45383j36418j16082n2366J01298j17310N7254
15152A11074j0222K26915j06167k45975k8724P7920J09664j6020k52440k3801
15142a57776K10179j11270k32055j882J65819M3219l6747j37067J40011k9968
15132a47537l6478k16327P1370L2121J32045M88104J26472l10600k67220l6188
$$ plain form
15122 -164238 -7621 -54544 -155995 -159298 -190281 22126 96729 16207 -260224 -441463 -219132
15111 -219132 -33191 -68628 -63034 173479 34357 -16520 205490 121375 -20439 -139030
15101 -139030 -145623 144155 227300 176511 213877 -55438 -179884 -85555 71937 -4096 -383732
15090 -383732 -482977 -311928 -100267 -461157 -450416 -251457 -143709 8490 -39971 -82354
15080 -82354 -218518 -20460 -34984 -7407 -5561 280881 180933 -28317 -187614 -296445 -337987
15069 -337987 -243966 -273338 -456508 -633538 -520427 -438346 -373675 -393920 -304581 -53205 65747
15058 65747 29216 -222050 -303373 -304923 -178064 -86081 -220502 -244473 145115 477255 468840
15047 468840 102719 270263 377958 373476 413380 334737 308514 518760 453672 224034 -37240
$$ packed form
15122a64238J56617m6923j01451l303l0983K12407P4603q0522k76431j81239K22331
15111b19132J85941l5437N594K36513j39122n0877K22010q4115j41814j18591
15101a39030o593K89778Q3145n0789L7366k69315j24446R4329J57492p6033l79636
15090c83732r9245J71049K11661l60890J0741J98959J07748J52199m8461m2383
15080h2354j36164J98058j4524K7577J846K86442r9948k09250j59297j08831m1542
15069c37987R4021k9372j83170j77030J13111Q2081O4671k0245Q9339K51376J18952
15058F5747l6531k51266q1323j550J26859R1983j34421k3971L89588L32140q415
15047D68840l66121J67544J07695m482L9904p8643k6223K10246o5088k29638k61274
$$ plain form
15036 -37240 141924 175005 98654 -76935 -163531 -480037 -448839 -450578 -835935 -760913 -705001
15025 -705001 -747938 -551218 -334800 -51465 -67161 -176427 -290719 -135053 2738 95204
15015 95204 56792 -112118 -75633 -3531 83330 18265 -47853 -179206 -205875 336653 696148
15004 696148 496988 346848 258506 -16744 291136 243938 -185432 -161096 -8165 64459
14994 64459 94668 -38111 171002 221693 339834 350966 -141154 -442136 -43272 339905
14984 339905 287502 464958 423444 139100 222292 466886 380593 360613 202856 -202745
14974 -202745 -219841 68764 -218712 -335955 -124839 164869 341396 270743 119167 118215
14964 118215 401176 520306 369610 269109 452276 506142 237131 153896 209111 139589
$$ packed form
15036c7240J79164L3081p6351j75589q6596l16506L1198j739l85357P5022N5912
15025g05001m2937J96720K16418K83335j5696j09266j14292J55666J37791R2466
15015I5204l8412j68910L6485P2102Q6861o5065o6118j31353k6669N42528L59495
15004F96148j99160j50140q8342k75250L07880m7198m29370K4336J52931P2624
14994F4459L0209j32779K09113N0691J18141J1132m92120l00982L98864L83177
14984C39905n2403J77456m1514k84344Q3192K44594q6293j9980j57757m05601
14974b02745j7096K88605k87476j17243K11116K89708J76527p0653j51576r52
14964A18215K82961J19130j50696j00501J83167N3866k69011q3235N5215o9522
$$ plain form
14954 139589 -148835 -217917 180918 512932 452987 603354 496414 340219 216462 232132
14944 232132 -256268 -579635 -355886 26933 -36851 -53464 202394 122653 -103252 -261441
14934 -261441 -92826 131867 261308 164203 52152 31544 -398469 -282639 -201226 -274236
14924 -274236 -239871 -605901 -628094 -470191 -308984 -483789 -640942 -561629 -318543 -338775
14914 -338775 -265887 -228662 4225 19748 -244107 -284427 -212342 61301 410169 123850
14904 123850 -237144 62748 195835 -168985 -245307 -209001 -165629 -244794 -386958 -385138 -91023
14893 -91023 -32271 -226986 -505277 -564063 -604568 -323663 -155883 26550 77820 40768 58990
14882 58990 21529 293894 320144 144786 -117751 -218506 -130812 -82925 -151088 -231623 -20529
$$ packed form
14954A39589k88424o9082L98835L32014n9945J50367j06940j56195j23757J5670
14944B32132m88400l23367K23749L82819o3784j6613K55858p9741k25905j58189
14934b61441J68615K24693J29441r7105j12051k0608m30013J15830Q1413p3010
14924b74236L4365l66030k2193J57903J61207j74805j57153P9313K43086k0232
14914c38775P2888L7225K32887J5523k63855m0320P2085K73643L48868k86319
14904A23850l60994K99892J33087l64820p6322L6306M3372p9165j42164J820K94115
14893i1023N8752j94715k78291n8786m0505K80905J67780J82433N1270l7052J8222
14882E8990l7461K72365K6250j75358k62537j00755Q7694M7887o8163q0535K11094
$$ plain form
14871 -20529 92902 186544 282077 198619 -3262 -227724 -565120 -237113 -210278 -238066 -60377
14860 -60377 -55274 -49765 83281 -271956 -804867 -792838 -378279 -227442 -136223 8796 -286484
14849 -286484 -590281 -314103 -245847 -579598 -642925 -514452 -660275 -385942 -322948 -271264
14839 -271264 -294288 -595744 -687470 -404999 -158436 -100756 -204841 -166173 -62888 -204194
14829 -204194 -249835 -4416 -91057 -28276 78595 39528 218129 243345 77774 -30729
14819 -30729 -44711 -247076 -349270 -205569 79614 68535 144548 76792 -238628 -307938 -407021
14808 -407021 -80488 -8461 -53919 -248642 -440716 -381690 -374149 -573543 -589840 -350617 -118491
14797 -118491 27820 9173 92097 -33917 -340210 -483906 -593157 -433898 -23653 50053
$$ packed form
14871b0529J13431R3642R5533q3458k01881k24462l37396L28007K6835k7788J77689
14860f0377N103N509J33046l55237n32911J2029M14559J50837R1219J45019k95280
14849b86484l03797K76178O8256l33751o3327J28473j45823K74333O2994N1684
14839b71264k3024l01456r1726K82471K46563N7680j04085L8668J03285j41306
14829b04194m5641K45419q6641O2781J06871l9067J78601K5216j65571j08503
14819c0729j3982k02365j02194J43701K85183j1079P6013o7756l15420o9310r9083
14808d07021L26533P2027m5458j94723j92074N9026P541j99394j6297K39223K32126
14797a18491J46311j8647Q2924j26014l06293j43696j09251J59259M10245P3706
$$ plain form
14787 50053 -93005 90153 -61640 24186 39105 229477 396358 137492 -153814 -182626
14777 -182626 -235185 -289718 -337252 -79485 -235745 -339669 -68093 34290 -60038 -70946
14767 -70946 -222737 -472286 -325923 -96646 85977 -29052 -246151 -281887 -201626 -205702
14757 -205702 -434005 -134804 12052 -94134 -139731 -19588 7902 -153121 -65180 422001
14747 422001 421196 183968 145104 432193 317702 -35510 -259816 -52065 58640 220050
14737 220050 223175 118339 -20916 47405 304123 283140 86155 180224 194063 208397 473709
14726 473709 275170 245546 123835 -332687 -394215 -225072 232386 240298 -70108 -191280
14716 -191280 -515291 -439669 -277800 38954 -69286 -16554 -392090 -757761 -559482 -203957
$$ packed form
14787E0053j43058J83158j51793Q5826J4919J90372J66881k58866k91306k8812
14777a82626n2559n4533m7534K57767j56260j03924K71576J02383r4328j0908
14767g0946j51791k49549J46363K29277J82623j15029k17099l5736Q0261m076
14757b05702k28303K99201J46856j06186m5597J20143K7490j61023Q7941M87181
14747D22001q05k37228l8864K87089j14491l53212k24306K07751J10705J61410
14737B20050L125j04836j39255O8321K56718k0983j96985R4069J3839J4334K65312
14726D73709j98539k9624j21711m56522o1528J69143M57458P912l10406j21172
14716a91280l24011P5622J61869L16754j08240N2732l75536l65671J98279L55525
$$ plain form
14706 -203957 144750 -2012 7690 176338 198309 -85967 -238813 -518939 -740487 -571831
14696 -571831 -598751 -393526 -72904 225833 119799 -2216 -123675 -234340 -337254 -561098
14686 -561098 -517323 -590250 -541017 -621263 -646748 -630593 -499467 -313892 -412092 -467714 -295072
14675 -295072 -155336 -333175 -475420 -309943 -504621 -406436 -132656 -292950 -355620 -69162
14665 -69162 -201695 -301299 -560055 -574108 -421095 -426505 -377122 -276654 -322055 -90765 155746
14654 155746 127536 47928 274601 85957 215406 181372 -192942 -169776 -705304 -1133549
14644 -1133549 -563251 -346026 -432676 -528726 -584061 -502931 -699143 -615500 -343732 -489056
14634 -489056 -287643 -136622 101856 -114129 -270396 -352328 -518283 -467548 -282993 -192720
$$ packed form
14706b03957L48707j46762R702J68648K1971k84276j52846k80126k21548J68656
14696e71831k6920K05225L20622K98737j06034j22015j21459j10665j02914k23844
14686e61098M3775p2927M9233q0246k5485J6155J31126J85575r8200n5622J72642
14675b95072J39736j77839j42245J65477j94678R8185K73780j60294o2670K86458
14665f9162j32533r9604k58756j4053J53013n410M9383J00468m5401K31290K46511
14654A55746k8210p9608K26673j88644J29449l4034l74314K3166n35528m28245
14644a133549N70298K17225q6650r6050n5335Q1130j96212Q3643K71768j45324
14634d89056K01413J51021K38478k15985j56267q1932j65955N0735J84555R0273
$$ plain form
14624 -192720 41136 205534 302150 202630 103283 122453 245526 159045 251806 196787 -128708
14613 -128708 -148941 -244945 -462720 -571282 -590046 -435749 -291293 -234752 -334537 -237914 -155425
14602 -155425 -146695 -239189 -291375 -377292 -234854 -328651 -355913 -38303 124552 63083 75212
14591 75212 -253961 -339331 -217547 -424428 -581952 -534279 -385657 -622906 -709608 -501705
14581 -501705 -539522 -315559 -297785 -185287 -214418 -16161 355132 486295 363172 180975
14571 180975 -47709 -38870 -10025 -71787 -252591 -288118 -306979 -149580 346040 518349 322047
14560 322047 250837 138123 92442 -32564 -65906 -66199 122779 -122796 -248106 -48998 -117770
14549 -117770 -55128 91937 -12400 133074 412984 584123 257471 -16705 -378648 -288541
$$ packed form
14624a92720K33856J64398R6616r9520r9347J9170J23073q6481R2761n5019l25495
14613a28708k0233r6004k17775j08562j8764J54297J44456N6541r9785R6623Q2489
14602a55425Q730r2494n2186q5917J42438r3797k7262L17610J62855o1469J2129
14591G5212l29173q5370J21784k06881j57524M7673J48622k37249q6702K07903
14581e01705l7817K23963J7774J12498k9131J98257L71293J31163j23123j82197
14571A80975k28684Q839K8845o1762j80804l5527j8861J57399M95620J72309j96302
14560C22047p1210j12714m5681j25006l3342k93J88978k45575j25310J99108o8772
14549a17770O2642J47065j04337J45474K79910J71139l26652k74176l61943R0107
$$ plain form
14539 -288541 -79129 -233514 -347540 -272312 -140760 -116469 -142799 -56730 -125707 -277319
14529 -277319 -139391 305258 224947 -227461 -132004 -209787 -264597 -187621 -31913 328268
14519 328268 419828 224107 114599 109209 498278 503661 151594 -154890 -46755 -93217 -467594
14508 -467594 -571845 -561601 -431212 -175262 -173850 -26260 1564 -36806 -529413 -721398
14498 -721398 -413744 -176325 -200937 -174147 -87731 196132 301731 62287 63789 181173
14488 181173 296339 241336 212321 114647 60136 53871 -106700 -191408 -211680 -95865 -177355
14477 -177355 -376704 -298309 39132 -148262 -511688 -470248 -369332 -284621 -218600 -279337
14467 -279337 -393154 -438235 -20364 121513 135411 139636 147921 -30377 -143236 90108 212516
$$ packed form
14539b88541K09412j54385j14026P5228J31552K4291k6330Q6069o8977j51612
14529b77319J37928M44649q0311m52408R5457p7783n4810P6976J55708L60181
14519C28268R1560j95721j09508n390L89069N383l52067l06484J08135m6462l74377
14508d67594j04251J0244J30389K55950J412J47590K7824l8370m92607j91985
14498g21398L07654K37419k4612K6790Q6416K83863J05599k39444J502J17384
14488A81173J15166n5003k9015r7674n4511o265j60571q4708k0272J15815q1490
14477a77355j99349P8395L37441j87394l63426M1440J00916Q4711O6021o0737
14467b79337j13817m5081M17871J41877J3898M225Q285j78298j12859K33344J22408
$$ plain form
14456 212516 66494 -294299 -441595 -161864 -12351 7820 226863 198070 -213750 -439234
14446 -439234 -413546 -379955 -415554 -114751 399957 402895 272754 380046 92075 -303285
14436 -303285 -193194 30345 221357 -70169 -121253 144839 161996 222991 78925 -40058
14426 -40058 53649 175312 112401 174233 264864 259796 190471 165033 364141 563527 448307
14415 448307 222878 171041 -167355 -107145 -16946 33642 -34421 190281 387256 455605 367423
14404 367423 418003 258318 124921 68257 207719 93747 339548 672058 798822 737815
14394 737815 135760 -149769 123374 411598 371535 253566 173765 -57026 106177 546248
14384 546248 517858 282799 56186 -64554 -49405 -113294 40184 -271157 -170938 -510437
$$ packed form
14456B12516j46022l60793j47296K79731J49513K0171K19043k8793m11820k25484
14446d39234K5688L3591l5599L00803N14708K938j30141J07292k87971l95360
14436c03285J10091K23539J91012k91526n1084K66092J7157O0995j44066j18983
14426d0058R3707J21663o2911O1832R0631n068o9325k5438J99108J99386j15220
14415D48307k25429n1837l38396O0210R0199N0588o8063K24702J96975O8349q8182
14404C67423N0580j59685j33397n6664J39462j13972K45801L32510J26764o1007
14394G37815o02055k85529K73143K88224m0063j17969p9801k30791J63203M40071
14384E46248k8390k35059k26613j20740J5149o3889J53478l11341J00219l39499
$$ plain form
14374 -510437 -633042 -324810 -90175 -97455 7434 37604 273983 404810 662449 437063
14364 437063 92167 248647 510927 452891 532371 195269 75875 110934 80662 -5704
14354 -5704 106572 54116 -199577 -114678 85108 -13319 -151797 54965 278797 216542 190248
14343 190248 147363 -18247 189583 -9065 17276 -41291 -69561 -49728 -112650 -318654 -274348
14332 -274348 -223302 -224897 1559 40873 -138798 -366945 -506152 -469792 -346534 -421355 -495514
14321 -495514 -449779 -216923 259371 359750 373630 349550 -2911 -26394 261754 300553
14311 300553 114145 148732 555078 380408 136530 393079 641413 563521 263701 56559
14301 56559 -281556 -516156 -549776 -309702 -315840 -546737 -459124 -331147 -161369 -352251
$$ packed form
14374e10437j22605L08232K34635p280J04889L0170K36379J30827K57639k25386
14364D37063l44896J56480K62280n8036P9480l37102j19394L5059l0272q6366
14354e704J12276n2456k53693Q4899J99786r8427j38478K06762K23832o2255k6294
14343A90248m2885j65610K07830j98648K6341n8567k8270J9833o2922k06004M4306
14332b74348N1046j595K26456L9314j79671k28147j39207L6360J23258p4821p4159
14321d95514M5735K32856M76294J00379J3880k4080l52461k3483K88148L8799
14311C00553j86408L4587M06346j74670k43878K56549K48334p7892k99820k07142
14301E6559l38115k34600l3620K40074o138k30897Q7613J27977J69778j90882
$$ plain form
14291 -352251 -156588 81117 -154584 -595073 -498249 -315639 -236074 -316138 -417598 -442953
14281 -442953 -428904 -270578 -239828 53958 137112 42251 -202084 -160961 -439931 -296818
14271 -296818 -298365 -280500 299517 153276 -170315 -434199 -652449 -446865 -458036 -186532
14261 -186532 119091 337547 82556 175710 225784 -192057 -466236 -549670 -518960 -534983
14251 -534983 -678903 -670134 -520187 -314531 -488283 -684232 -597182 -685499 -570679 -308939
14241 -308939 -133225 -198721 -220641 -310562 -195780 -46642 155646 -21547 189582 209580
14231 209580 -143759 -226888 -119118 -59167 -237849 -171288 -133629 -111392 138916 260421
14221 260421 108889 -22419 -91368 -240395 -264880 -387555 -520071 -427945 -557269 -463606
$$ packed form
14291c52251J95663K37705k35701m40489R6824J82610P9565q0064j01460k5355
14281d42953J4049J58326L0750K93786Q3154r4861k44335M1123k78970J43113
14271b96818j547J7865N80017j46241l23591k63884k18250K05584j1171K71504
14261a86532L05623K18456k54991R3154N0074m17841k74179q3434L0710j6023
14251e34983j43920Q769J49947K05656j73752j95949Q7050q8317J14820K61740
14241c08939J75714o5496k1920q9921J14782J49138K02288j77193K11129J9998
14231B09580l53339q3129J07770N9951j78682O6561L7659K2237K50308J21505
14221B60421j51532j31308o8949j49027k4485j22675j32516R2126j29324R3663
$$ plain form
14211 -463606 -288831 -246109 -173415 34234 170110 106755 3115 87577 99767 69287 240409
14200 240409 200301 188514 -76035 6964 120334 23263 254268 195051 26148 93860 -69569
14189 -69569 -33347 47764 129660 108729 197315 -18866 120293 392565 277788 209948 186871
14178 186871 111804 84395 -224508 -469661 -421809 -121872 29785 -73843 -253848 -80752
14168 -80752 -22011 180670 304112 222447 81189 -255333 -61937 -316542 -473074 -225896
14158 -225896 225876 552097 615127 369209 262428 54602 -33642 -83329 -82650 -34024 27732
14147 27732 120012 369899 71171 -282024 -143113 127431 23084 -17341 -33863 136022
14137 136022 27545 -85384 45066 1540 -346639 -750830 -931098 -372693 -215467 -410164
$$ packed form
14211d63606J74775M2722P2694K07649J35876o3355j03640Q4462J2190l0480J71122
14200B40409m0108j1787k64549Q2999J13370r7071K31005n9217j68903O7712j63429
14189f9569L6222Q1111Q1896k0931Q8586k16181J39159K72272j14777o7840k3077
14178A86871p5067k7409l08903k45153M7852K99937J51657j03628j80005J73096
14168h0752N8741K02681J23442q1665j41258l36522J93396k54605j56532K47178
14158b25896M51772L26221O3030k45918j06781k07826q8244m9687O79M8626O1756
14147B7732R2280K49887k98728l53195J38911K70544j04347m0425j6522J69885
14137A36022j08477j12929J30450m3526l48179m04191j80268N58405J57226j94697
$$ plain form
14127 -410164 -312498 -119933 -129028 -117720 -206985 -80381 320125 310585 -50932 -155770 -437869
14116 -437869 -688111 -620366 -490778 -161808 -10384 -345498 -561307 -413656 -171015 -68935
14106 -68935 -82686 -250518 -211259 52986 211970 18356 -183804 -93154 185882 241041
14096 241041 168510 59373 127173 -12351 -175435 87038 399564 112580 39276 -143006
14086 -143006 -324557 -446606 -190172 91871 228702 84913 -100223 -157215 -18789 177857
14076 177857 196059 152638 120402 163964 301315 341979 224546 19157 -177884 -316274
14066 -316274 -294849 -376783 -86422 252967 240757 21856 -139530 143816 424651 258129
14056 258129 -465 -67887 -146725 196240 211918 267136 25366 -83481 46010 340614
$$ packed form
14127d10164R7666J92565r095J1308q9265J26604M00506r540l61517j04838k82099
14116d37869k50242O7745J29588L28970J51424l35114k15809J47651K42641J02080
14106f8935j3751j67832L9259K64245J58984j93614k02160R0650K79036N5159
14096B41041p2531j09137O7800j39524j63084K62473L12526k86984p3304j82282
14086a43006j81551j22049K56434K82043J36831j43789j85136n6992J38426J96646
14076A77857J8202m3421l2236M3562J37351M0664j17433k05389j97041j38390
14066c16274K1425q1934K90361L39389j2210k18901j61386K83346K80835j66522
14056B58129k58594o7422p8838L42965J5678N5218k41770j08847J29491K94604
$$ plain form
14046 340614 527502 167636 59755 239290 -30768 -79550 66285 -73591 -236081 -232714
14036 -232714 -1450 204242 250555 225061 -11179 -110060 -209098 -76858 -26793 -45380 -184633
14025 -184633 -193305 -307715 -333643 -61042 3223 -282527 -434144 -526158 -429136 -180006 59129
14014 59129 -33023 -77461 129402 64053 -86250 -242973 -66388 -272605 -380971 -336761
14004 -336761 -221688 -280539 -144279 -193391 -154889 -17396 242060 194161 -287520 -724763
13994 -724763 -714369 -574200 -421120 -234498 21031 -21648 -415172 -517577 -662682 -869627
13984 -869627 -649021 -580547 -649426 -346506 -38042 -192288 -266733 -178374 176251 192199
13974 192199 43422 -106118 -251901 -203943 -202213 -583422 -795145 -540010 -173698 -276873
$$ packed form
14046C40614J86888l59866j07881J79535k70058m8782J45835j39876j62490L367
14036b32714K31264K05692M6313k5494k36240r8881r9038J32240N0065j8587j39253
14025a84633q672j14410k5928K72601O4265k85750j51617r2014R7022K49130K39135
14014E9129r2152m4438K06863o5349j50303j56723J76585k06217j08366M4210
14004c36761J15073n8851J36260m9112L8502J37493K59456m7899m81681m37243
13994g24763J0394J40169J53080J86622K55529m2679l93524j02405j45105k06945
13984h69627K20606O8474o8879L02920L08464j54246p4445Q8359L54625J5948
13974A92199j48777j49540j45783M7958J730l81209k11723K55135L66312j03175
$$ plain form
13964 -276873 -402269 -150522 -151620 -78473 -112118 -180272 -474410 -567231 -333938 -76951 26807
13953 26807 -42144 17590 103813 -17756 -282329 -443292 -273488 -314774 -344966 5661 199078
13942 199078 282540 313493 632758 592618 622554 345450 -4249 -100903 -87840 -257761 -356642
13931 -356642 -16235 210247 -153777 -221671 -180767 -238769 -98090 -70963 -181782 -278620
13921 -278620 -91876 5905 256368 270958 372213 752049 820713 757937 465729 -5660
13911 -5660 -168712 -229715 -251106 -6940 -66133 79026 398894 378728 84420 112517 -29872
13900 -29872 49973 83108 50219 180143 13935 -229166 -190527 -121433 11436 -59420 -168725
13889 -168725 -57931 151312 339838 312428 342400 280035 200800 117840 -21669 -93569 -166387
$$ packed form
13964b76873j25396K51747j098P3147l3645o8154k94138r2821K33293K56987J03758
13953B6807o8951N9734Q6223j21569k64573j60963J69804m1286l0192L50627J93417
13942A99078Q3462L0953L19265m0140K9936k77104l49699r6654J3063j69921r8881
13931c56642L40407K26482l64024o7894M0904n8002J40679K7127j10819r6838
13921b78620J86744R7781K50463J4590J01255L79836O8664o2776k92208m71389
13911e660j63052o1003k1391K44166n9193J45159L19868k0166k94308K8097j42389
13900b9872P9845L3135l2889J29924j66208k43101L8639O9094J32869p0856j09305
13889a68725J10794K09243J88526k7410K9972o2365p9235q2960j39509p1900p2818
$$ plain form
13878 -166387 -37882 49445 65071 323674 339203 190859 264562 248569 166999 87081 -227088
13867 -227088 -395422 -456052 -430182 -303032 -275550 -226751 -279134 -254177 -239022 -229155 -22740
13856 -22740 -171304 -132371 -192002 -189176 -130426 -87662 -151724 -458698 -209286 -57925 32338
13845 32338 -61410 -214833 -2756 298696 160033 230103 286843 -19991 -174091 -69335
13835 -69335 172490 -55859 -40644 -52500 177166 337749 101491 277911 496200 327885
13825 327885 201968 -277396 -531189 -221435 -294172 -545867 -226347 27248 -10589 189141
13815 189141 374424 63328 -89999 -139183 -63700 174494 184755 348752 621663 446745
13805 446745 235195 345918 269217 49029 -20200 -51768 117753 -185111 -95852 -77617
$$ packed form
13878a66387J28505Q7327J5626K58603J5529j48344P3703j5993q1570p9918l14169
13867b27088j68334o0630K5870J27150K7482M8799n2383K4957J5155R867K06415
13856b2740j48564L8933n9631K826N8750M2764o4062l06974K49412J51361R0263
13845C2338r3748j53423K12077L01452j38663P0070N6740l06834j54100J04756
13835f9335K41825k28349J5215j1856K29666J60583k36258J76420K18289j68315
13825C27885j25917m79364k53793L09754p2737k51695L19520K53595l7837J99730
13815A89141J85283l11096j53327m9184P5483K38194J0261J63997K72911j74918
13805D46745k11550J10723p6701k20188o9229l1568J69521l02864Q9259J8235
$$ plain form
13795 -77617 -123663 149599 265328 454211 265273 -17481 -169239 -124529 13027 118823
13785 118823 -196028 -288724 -376229 -212617 -306819 -326701 -314278 -471856 -637258 -542714 -299062
13774 -299062 -189514 -62244 184024 439877 548800 311314 -137286 -337995 -391797 -273520
13764 -273520 -137010 -156403 -154651 -265130 -382524 -276649 -298950 -499284 -368955 -351723
13754 -351723 -284156 32297 -51990 -215916 -206817 -275899 -298068 -349218 -181644 -163395 -467428
13743 -467428 -573606 -167080 -163143 -281337 -298642 -165936 -82373 39761 -149366 -216882
13733 -216882 -84530 34339 17203 87957 124255 335365 214082 -202459 -67762 225774
13723 225774 579057 391394 250770 10305 -205219 -314182 -266810 -112594 -13273 -205402
$$ packed form
13795g7617m6046K73262J15729J88883j88938k82754j51758M4710J37556J05796
13785A18823l14851r2696q7505J63612r4202j9882J2423j57578j65402R4544K43652
13774b99062J09548J27270K46268K55853J08923k37486m48600k00709n3802J18277
13764b73520J36510j9393J752j10479j17394J05875k2301k00334J30329J7232
13754c51723O7567L16453q4287j63926R099o9082k2169n1150J67574J8249l04033
13743d67428j06178M06526L937j18194j7305J32706Q3563J22134j89127o7516
13733b16882J32352J18869j7136P0754L6298K11110j21283m16541J34697K93536
13723B25774L53283j87663j40624k40465k15524j08963M7372J54216R9321j92129
$$ plain form
13713 -205402 -380597 -73962 176481 45325 -147403 -358694 -439918 -199542 -287993 -533350
13703 -533350 -228308 55182 18281 86064 157225 -15469 -227664 -409574 -529204 -372652
13693 -372652 -534973 -512249 -28648 -306392 -406668 195329 524702 373250 347133 537441
13683 537441 417331 94975 -60641 -71827 275020 225903 -7204 -22934 305762 315697
13673 315697 128402 19950 -231940 -205335 -64558 4409 248131 307755 376298 236427
13663 236427 99352 -639 -174112 -576635 -649549 -520170 -524889 -459718 -119296 43794
13653 43794 -64107 -168783 -31299 33344 94626 79144 -78331 -225269 -195863 -153450 10699
13642 10699 346795 585130 516266 280044 44899 -12700 -105748 -85059 -181787 -193672 -230703
$$ packed form
13713b05402j75195L06635K50443j31156j92728k11291q1224K40376q8451k45357
13703e33350L05042K83490l6901O7783P1161j72694k12195j81910j19630J56552
13693c72652j62321K2724M83601k77744j00276O01997L29373j51452k6117J90308
13683E37441j20110l22356j55616j1186L46847m9117k33107j5730L28696R935
13673C15697j87295j08452k51890K6605J40777O8967K43722N9624O8543j39871
13663B36427j37075r9991j73473m02523p2914J29379m719O5171L40422J63090
13653D3794j07901j04676J37484O4643O1282j5482j57475j46938K9406M2413J64149
13642A0699L36096K38335o8864k36222k35145n7599r3048K0689r6728j1885l7031
$$ plain form
13631 -230703 -403885 -281399 -553722 -518836 -260693 -220690 -353242 -428959 -431901 -229992
13621 -229992 50846 32608 -178185 -175768 3247 220257 394463 246603 227475 51715
13611 51715 -71216 78443 547012 629386 465056 363988 151251 4271 -187547 -240071
13601 -240071 100155 536391 603126 265607 241154 221262 41490 -40954 -85531 -267995
13591 -267995 -100012 -8653 -142462 19890 -100748 -117492 -180790 -155467 -240712 -335351 -395710
13580 -395710 -490139 -305820 -280855 70165 287400 159237 -16456 -186127 -86970 134569
13570 134569 310994 616148 598096 270488 374208 317353 78818 -187834 -434064 -334078
13560 -334078 -139819 47357 112532 -81028 -164564 127194 401581 183456 -114336 -234394
$$ packed form
13631b30703j73182J22486k72323L4886K58143M0003j32552p5717k942K01909
13621b29992K80838j8238k10793K417J79015K17010J74206j47860j9128j75760
13611E1715j22931J49659M68569Q2374j64330j01068k12737j46980j91818n2524
13601b40071L40226M36236O6735l37519k4453j9892j79772q2444m4577j82464
13591b67995J67983R1359j33809J62352j20638j6744o3298K5323q5245r4639o0359
13580c95710r4429J84319K4965L51020K17235j28163j75693j69671R9157K21539
13570A34569J76425L05154j8052l27608J03720n6855k38535k66652k46230R9986
13560c34078J94259J87176O5175j93560q3536K91758K74387k18125k97792j20058
$$ plain form
13550 -234394 -440430 -356509 -385981 -249646 -268074 54660 562284 575988 388735 479822
13540 479822 145916 -170607 -378515 -69013 -50683 -119251 125644 343004 588294 551108
13530 551108 232421 -109309 -223125 -187219 -84596 119086 155699 149663 10762 111020
13520 111020 114621 20192 -164119 -574312 -754134 -347601 -151818 -221790 101044 319497
13510 319497 396735 -97219 -285383 -75962 109217 -21279 -5107 -13113 -365400 -401894
13500 -401894 -493873 -849323 -787882 -399734 -175451 -410828 -350455 -226160 -254003 -225496
13490 -225496 -363701 -325161 -47805 -161603 -385753 -405059 -46717 399603 404221 441659
13480 441659 304642 214159 26993 208661 380367 318528 210117 66851 -93707 -208086
$$ packed form
13550b34394k06036Q3921k9472J36335j8428L22734N07624J3704j87253R1087
13540D79822l33906l16523k07908L09502J8330o8568K44895K17360K45290l7186
13530E51108l18687l41730j13816L5906J02623K03682L6613o036j38901J00258
13520A11020L601r4429j84311m10193j79822M06533J95783o9972L22834K18453
13510C19497P7238m93954j88164K09421J85179j30496J6172q006l52287l6494
13500d01894r1979l55450O1441L88148K24283k35377O0373J24295k7843K8507
13490b25496j38205L8540K77356j13798k24150j9306L58342M46320M618L7438
13480D41659j37017r0483j87166J81668J71706o1839j08411j43266j60558j14379
$$ plain form
13470 -208086 -477957 -553360 -372914 -331010 -143092 206752 -64288 -324525 -433505 -366941
13460 -366941 -299087 -48023 -132225 -87533 -62172 -134007 -34356 227053 -326 -128189 97898
13449 97898 196875 254354 77010 -59655 -141170 -176221 -203327 -168331 105775 276676 103699
13438 103699 -57462 -8524 120237 -27235 -93152 56919 125230 -36729 427506 645421
13428 645421 573583 316203 91300 47057 187843 250999 234520 63596 11755 -164572
13418 -164572 59185 199196 122557 76637 -117463 -116849 126315 140194 143128 219252 89432
13407 89432 30887 240954 250018 215495 38328 47026 -141260 -341440 -177602 13765 34897
13396 34897 -185735 -318932 -200091 -125182 -172223 -328525 -287895 -249301 -210469 46475 259745
$$ packed form
13470b08086k69871p5403J80446M1904J87918L49844k71040k60237j08980O6564
13460c66941O7854K51064q4202M4692K5361p1835R9651K61409k27379j27863K26087
13449I7898R8977N7479j77344j36665q1515l5051k7106L4996K74106J70901j72977
13438A03699j61161M8938J28761j47472o5917J50071O8311j61959M64235K17915
13428F45421p1838k57380k24903m4243J40786O3156j6479j70924n1841j76327
13418a64572K23757J40011p6639m5920j94100O14K43164J3879K934P6124j29820
13407H9432n8545K10067R064l4523j77167Q698j88286k00180J63838J91367K1132
13396C4897k20632j33197J18841P4909m7041j56302M0630L8594L8832K56944K13270
$$ plain form
13385 259745 305548 -2838 -176159 51649 -206099 -319408 -176392 -226820 -303919 -25515
13375 -25515 -35671 -315240 -66016 238715 256465 18936 145916 98182 -300960 -339262
13365 -339262 -343319 -83002 251515 333900 486504 426389 289185 109234 -94536 -99312 29042
13354 29042 336968 615703 288517 276947 417145 465491 211938 62212 -10143 -12294 119474
13343 119474 25261 -337385 -585724 -602979 -417846 -209391 -90736 302760 319794 71817
13333 71817 32160 39963 -74168 73643 58394 79859 143194 134152 62660 -106705 181594
13322 181594 137802 64925 318952 111692 139539 95468 -35261 -245949 -356317 -88846
13312 -88846 200695 113416 -133997 -49332 -117486 -294650 -439734 -430813 -761675 -764401 -505157
$$ packed form
13385B59745M5803l08386j73321K27808k57748j13309J43016n0428p7099K78404
13375b5515j0156k79569K49224L04731J7750k37529J26980m7734l99142l8302
13365c39262m057K60317L34517Q2385J52604o0115j37204j79951k03770m776J28354
13354B9042L07926K78735l27186j1570J40198M8346k53553j49726p2355k151J31768
13343A19474r4213l62646k48339j7255J85133K08455J18655L93496J7034k47977
13333G1817l9657P803j14131J47811j5249K1465O3335r042p1492j69365K88299
13322A81594m3792p2877K54027k07260K7847m4071j30729k10688j10368K67471
13312h8846K89541q7279k47413Q4665o8154j77164j45084Q921l30862k726K59244
$$ plain form
13301 -505157 -284638 125684 59992 -93732 -339361 -175696 79234 3861 -154084 -219183
13291 -219183 -11926 317671 252765 158265 61266 174437 17457 155542 393035 475432
13281 475432 118732 -107182 -391974 -171302 43442 109066 34307 29596 -138158 -125189
13271 -125189 -206012 -117848 -86412 -108925 30925 -1984 46861 190774 81889 -103273 -98046
13260 -98046 -179284 -472566 -595794 -286306 -17382 -67890 289793 516816 168814 -151498
13250 -151498 59697 214894 179385 91787 -78073 27776 62934 312328 137531 -33155
13240 -33155 -113570 -182113 -204917 6418 209465 -101034 -234591 -115149 -232030 -291471
13230 -291471 -152747 -264194 -405533 -383107 -306447 -320159 -418592 -256485 -402417 -212319
$$ packed form
13301e05157K20519M10322o5692j53724k45629J63665K54930p5373j57945o5099
13291b19183K07257L29597o4906r4500r6999J13171j56980J38085K37493Q2397
13281D75432l56700k25914k84792K20672K14744O5624p4759m711j67754J2969
13271a25189q0823Q8164L1436k2513J39850l2909M8845J43913j08885j85162N227
13260i8046q1238k93282j23228L09488K68924n0508L57683K27023l48002l20312
13250a51498K11195J55197l5509q7598j69860J05849L5158K49394j74797j70686
13240c3155q0415o8543k2804K11335K03047l10499j33557J19442j16881n9441
13230b91471J38724j11447j41339K2426P6660j3712r8433J62107j45932J90098
$$ plain form
13220 -212319 160631 155332 145666 150034 -176967 -95429 24730 -70588 -36496 146685 232985
13209 232985 300501 491292 266530 -101311 -88039 17477 71468 -120816 -178799 -73448
13199 -73448 64374 437736 247397 218527 129878 -234872 -299571 -450127 -436958 -468916 -438034
13188 -438034 -189436 -201619 -267461 -414500 -77836 29396 -29245 193577 461036 665664
13178 665664 708751 268198 -142497 -501352 -410224 -399248 -438653 -259960 -35534 -43277 -175935
13167 -175935 -187353 -115796 -25736 -66816 -263172 -213322 -204780 103845 70270 24090 -90155
13156 -90155 -237095 128227 228574 146758 -194477 -559415 -501587 78650 302063 74796
13146 74796 -33152 -81683 89236 -5868 -182354 -273982 -324307 -5890 -244197 -426359
$$ packed form
13220b12319L72950n299r666M368l27001Q1538J20159r5318L4092J83181Q6300
13209B32985O7516J90791k24762l67841J3272J05516N3991j92284n7983J05351
13199g3448J37822L73362j90339k8870q8649l64750o4699j50556J3169l1958L0882
13188d38034K48598j2183o5842j47039L36664J07232n8641K22822K67459K04628
13178F65664M3087m40553m10695l58855R1128J0976l9405J78693K24426p743j32658
13167a75935j1418P1557R0060m1080j96356M9850Q542L08625l3575m6180j14245
13156i0155j46940L65322J00347q1816l41235l64938N7828N80237K23413k27267
13146G4796j07948m8531J70919r5104j76486r1628n0325L18417k38307j82162
$$ plain form
13136 -426359 -54960 233050 157381 -118455 -163988 -331613 -166279 323796 132799 -34285
13126 -34285 -177627 -25200 -69490 -116858 -242816 -87036 -1270 12302 -13139 168155 342494
13115 342494 303093 -55844 -200097 67997 118618 -15291 -224970 -132243 131475 267587
13105 267587 -197830 -167539 -68629 -72980 -213999 -266817 13929 327712 208499 146504 183603
13094 183603 71513 -86583 102356 -80379 -61876 28422 -31878 -210376 55097 83843
13084 83843 151736 220767 238166 124123 -44870 -232734 -133273 -147877 77154 55799 -69163
13073 -69163 -178465 -90625 233380 32670 -430373 -686054 -625203 -32951 -58308 -226988
13063 -226988 -194140 -80164 115416 208106 378960 492291 -91770 -330595 -266800 -337037
$$ packed form
13136d26359L71399K88010p5669k75836m5533j67625J65334M90075j90997j67084
13126c4285j43342J52427m4290m7368j25958J55780Q5766J3572k5441J81294J74339
13115C42494l9401l58937j44253K68094N0621j33909k09679R2727K63718J36112
13105B67587m65417L0291R8910m351j41019n2818K80746L13783j19213o1995L7099
13094A83603j12090j58096J88939j82735J8503R0298o0300j78498K65473K8746
13084H3843O7893O9031J7399j14043j68993j87864R9461j4604K25031k1355j24962
13073f9163j09302Q7840L24005k00710m63043k55681O0851N92252k5357j68680
13063b26988L2848J13976J95580R2690J70854J13331n84061k38825O3795p0237
$$ plain form
13053 -337037 -400368 -401308 -280701 -98133 348238 439755 247888 -239078 -143188 -210583 -289448
$$ packed form
13053c37037o3331r40J20607J82568M46371R1517j91867m86966R5890o7395p8865
$$ [...]
##END NTUPLES=NMR SPECTRUM
##END=
