##TITLE=Analysis number 323976
Compound Code cc 40216
Book Reference 468/190
Project Code adr
Chemist Name colinb
##JCAMPDX= 6.0         $$ Bruker NMR JCAMP-DX V2.0
##DATA TYPE= NMR SPECTRUM
##DATA CLASS= NTUPLES
##ORIGIN= Bruker BioSpin GmbH
##OWNER= nmr
$$ XWIN-NMR		Version 3.5
$$ Fri Nov 10 13:18:45 2006 GMT Standard Time (UT+0h)  MAYBRIDGE\nmr@NMR_250MHZ
##.OBSERVE FREQUENCY= 250.131544655141
##.OBSERVE NUCLEUS= ^1H
##.ACQUISITION MODE= SIMULTANEOUS (DQD)
##.ACQUISITION SCHEME= undefined
##.AVERAGES= 16
##.DIGITISER RES= 18
##SPECTROMETER/DATA SYSTEM= dpx250
##.PULSE SEQUENCE= zg30
##.SOLVENT NAME= CDCl3
##.SHIFT REFERENCE= (INTERNAL, CDCl3, 0, 16.522)
##AUDIT TRAIL= $$ (NUMBER, WHEN, WHO, WHERE, WHAT)
$$ ##TITLE= Audit trail, XWIN-NMR		Version 3.5
$$ ##JCAMPDX= 5.01
$$ ##ORIGIN= Bruker BioSpin GmbH
$$ ##OWNER= nmr
$$ C:\u/data/dgb/nmr/ADRS/2640/pdata/1/auditp.txt
$$ ##AUDIT TRAIL=  $$ (NUMBER, WHEN, WHO, WHERE, WHAT)
(   1,<2006-11-10 13:18:17.11 +000>,<MAYBRIDGE\nmr>,<NMR_250MHZ>,
      <created by zg, POWCHK disabled, PULCHK disabled
       configuration hash MD5:
       49 4B E0 1D 92 C2 6B 37 9F E6 65 BC 52 41 86 1D
       data hash MD5: 64K
       CF A2 FB 15 64 A9 8B FE 92 AC 2C 42 A6 92 F7 B9>)
(   2,<2006-11-10 13:18:34.23 +000>,<MAYBRIDGE\nmr>,<NMR_250MHZ>,
      <Start of raw data processing
       ef LB = 0.3 FT_mod = 6 PKNL = 1 SI = 32K 
       data hash MD5: 32K
       04 AB 32 B7 81 C8 1F C1 8E 32 F3 D5 B0 86 9E 0E>)
(   3,<2006-11-10 13:18:35.98 +000>,<MAYBRIDGE\nmr>,<NMR_250MHZ>,
      <apk 
       data hash MD5: 32K
       25 AD C5 D3 10 17 2B 36 89 84 02 D9 FD DD 10 FB>)
(   4,<2006-11-10 13:18:36.86 +000>,<MAYBRIDGE\nmr>,<NMR_250MHZ>,
      <abs ABSG = 5 
       data hash MD5: 32K
       44 99 B6 DC 40 E7 F2 8F 3B 5B 43 48 CB 1D 43 48>)
$$ ##END=
$$ 
$$ hash MD5
$$ D4 94 AC D9 71 C8 C3 61 D3 FE 10 30 AA 62 01 9E
##$RELAX= 
##$RELAX= 
##$RELAX= 
##$RELAX= 
##$RELAX= 
##$RELAX= 
##$RELAX= 
$$ Bruker specific parameters
$$ --------------------------
##$DU= <C:\u>
##$EXPNO= 2640
##$NAME= <ADRS>
##$PROCNO= 1
##$TYPE= <nmr>
##$USER= <dgb>
##$AMP= (0..31)
100 100 100 100 100 100 100 100 100 100 100 100 100 100 100 100 100 100 
100 100 100 100 100 100 100 100 100 100 100 100 100 100 
##$AQSEQ= 0
##$AQ_mod= 3
##$AUNM= <au_zg>
##$AUTOPOS= <31 >
##$BF1= 250.13
##$BF2= 250.13
##$BF3= 250.13
##$BF4= 250.13
##$BF5= 500.13
##$BF6= 500.13
##$BF7= 500.13
##$BF8= 500.13
##$BYTORDA= 1
##$CFDGTYP= 0
##$CFRGTYP= 5
##$CHEMSTR= <none>
##$CNST= (0..31)
1 1 145 1 1 1 1 1 1 1 1 1 1 1 1 1 1 1 1 1 1 1 1 1 1 1 1 1 1 1 1 1 
##$CPDPRG= <>
##$CPDPRG1= <>
##$CPDPRG2= <>
##$CPDPRG3= <>
##$CPDPRG4= <mlev>
##$CPDPRG5= <mlev>
##$CPDPRG6= <mlev>
##$CPDPRG7= <mlev>
##$CPDPRG8= <mlev>
##$CPDPRGB= <>
##$CPDPRGT= <>
##$D= (0..31)
0 1 0 0 0 0 0 0 0 0.06 0 0 0 0 0 0 0.0002 0 0 0 0 0 0 0 0 0 0 0 0 0 0 
0 
##$DATE= 1163164695
##$DBL= (0..7)
120 120 120 120 120 120 120 120 
##$DBP= (0..7)
150 150 150 150 150 150 150 150 
##$DBP07= 0
##$DBPNAM0= <>
##$DBPNAM1= <>
$$ [...]
##$SUBNAM7= <"">
##$SUBNAM8= <"">
##$SUBNAM9= <"">
##$SW= 20.6930455092707
##$SWIBOX= (0..15)
0 0 3 0 0 0 0 0 0 0 0 0 0 0 0 0 
##$SW_h= 5175.983436853
##$TD= 65536
##$TD0= 1
##$TE= 683.16
##$TE2= 300
##$TE3= 300
##$TEG= 300
##$TL= (0..7)
0 120 120 120 120 120 120 120 
##$TP= (0..7)
150 150 150 150 150 150 150 150 
##$TP07= 0
##$TPNAME0= <>
##$TPNAME1= <>
##$TPNAME2= <>
##$TPNAME3= <>
##$TPNAME4= <>
##$TPNAME5= <>
##$TPNAME6= <>
##$TPNAME7= <>
##$TPOAL= (0..7)
0.5 0.5 0.5 0.5 0.5 0.5 0.5 0.5 
##$TPOFFS= (0..7)
0 0 0 0 0 0 0 0 
##$TUNHIN= 0
##$TUNHOUT= 0
##$TUNXOUT= 0
##$USERA1= <user>
##$USERA2= <user>
##$USERA3= <user>
##$USERA4= <user>
##$USERA5= <user>
##$V9= 5
##$VALIST= <valist>
##$VCLIST= <CCCCCCCCCCCCCCC>
##$VD= 0
##$VDLIST= <DDDDDDDDDDDDDDD>
##$VPLIST= <PPPPPPPPPPPPPPP>
##$VTLIST= <TTTTTTTTTTTTTTT>
##$WBST= 1024
##$WBSW= 4
##$XGAIN= (0..3)
0 0 0 0 
##$XL= 0
##$YL= 0
##$YMAX_a= 518137
##$YMIN_a= -418702
##$ZGOPTNS= <>
##$ZL1= 120
##$ZL2= 120
##$ZL3= 120
##$ZL4= 120
##$ABSF1= 16.522
##$ABSF2= -4.171173
##$ABSG= 5
##$ABSL= 3
##$ALPHA= 0
##$AQORDER= 0
##$ASSFAC= 0
##$ASSFACI= 0
##$ASSFACX= 0
##$ASSWID= 0
##$AUNMP= <proc_1d>
##$AZFE= 0.1
##$AZFW= 0.1
##$BCFW= 0
##$BC_mod= 0
##$BYTORDP= 0
##$COROFFS= 0
##$CY= 12.5
##$DATMOD= 1
##$DC= 0
##$DFILT= <>
##$DTYPP= 0
##$F1P= 14.0000005364418
##$F2P= -0.99999901652339
##$FCOR= 0.5
##$FTSIZE= 32768
##$FT_mod= 6
##$GAMMA= 0
##$GB= 0
##$INTBC= 1
##$INTSCL= 1
##$ISEN= 128
##$LB= 0.3
##$LEV0= 0
##$LPBIN= 0
##$MAXI= 10000
##$MC2= 0
##$MEAN= 0
##$ME_mod= 0
##$MI= 0
##$NCOEF= 0
##$NC_proc= -4
##$NLEV= 6
##$NOISF1= 0
##$NOISF2= 0
##$NSP= 0
##$NTH_PI= 0
##$NZP= 0
##$OFFSET= 16.522
##$PC= 1
##$PHC0= -39.05214
##$PHC1= 2.967091
##$PH_mod= 1
##$PKNL= yes
##$PPARMOD= 0
##$PSCAL= 4
##$PSIGN= 0
##$REVERSE= no
##$SF= 250.13
##$SI= 32768
##$SIGF1= 0
##$SIGF2= 0
##$SINO= 400
##$SIOLD= 32768
##$SREGLST= <1H.CDCl3>
##$SSB= 0
##$STSI= 32768
##$STSR= 0
##$SW_p= 5175.98343685301
##$SYMM= 0
##$S_DEV= 0
##$TDeff= 65536
##$TDoff= 0
##$TI= <Analysis number 999999
Compound Code 99
Book Reference 9
Project Code 9>
##$TILT= no
##$TM1= 0
##$TM2= 0
##$TOPLEV= 0
##$USERP1= <user>
##$USERP2= <user>
##$USERP3= <user>
##$USERP4= <user>
##$USERP5= <user>
##$WDW= 1
##$XDIM= 32768
##$YMAX_p= 335200155
##$YMIN_p= -811982
$$ End of Bruker specific parameters
$$ ---------------------------------
##NTUPLES= NMR SPECTRUM
##VAR_NAME=  FREQUENCY,     SPECTRUM/REAL,   SPECTRUM/IMAG
##SYMBOL=    X,             R,               I
##VAR_TYPE=  INDEPENDENT,   DEPENDENT,       DEPENDENT
##VAR_FORM=  AFFN,          ASDF,            ASDF
##VAR_DIM=   32768,         32768,           32768
##UNITS=     HZ,            ARBITRARY UNITS, ARBITRARY UNITS
##FACTOR=    0.157963299565203, 1,           1
##FIRST=     4132.6476996994, 0,             0
##LAST=      -1043.33573715361, 0,           0
##MIN=       -1043.33573715361, -811982,     0
##MAX=       4132.6476996994, 335200155,     0
$$ Real data points
##PAGE= N=1
##DATA TABLE= (X++(R..R)), XYDATA
$$ [...]
28062 218340 301510 324430 38706 -366398 -369370 -91602 -27300 -86571 -92204 -132090 -119570
28051 -119570 -141599 -133173 -294826 -223018 40594 175900 288643 141444 49563 -20150 72712
28040 72712 82133 -251325 -156675 77054 40906 -94023 33620 -17630 44272 123476 43880
28029 43880 -59804 -50078 56972 -46510 -284763 -236292 -168258 -118515 -136361 46416 228496
28018 228496 -50166 -10294 185994 265455 148078 -139795 -78488 237987 433153 503209
28008 503209 342994 138138 33868 -165773 -347522 -232733 -119177 -124728 -150331 38739
27998 38739 223497 183984 117250 2592 -20454 -61339 -202250 -38724 -161784 -282037
27988 -282037 -313330 -373190 -326532 -242386 -245333 -161491 -196563 -61035 -9016 130455 211536
27977 211536 174708 7094 1400 42331 62345 80510 -94061 -36099 139950 160805 337193
27966 337193 261117 91196 162876 271939 196055 144388 113360 -69393 -74769 280061 330602
27955 330602 176654 80913 -62065 -170562 -180868 -184796 -99785 86638 44530 -202965 -262902
27944 -262902 -98939 16231 148264 38270 4576 -51945 -15883 -88875 -136361 -69084 -43792
27933 -43792 17483 52738 33559 -70639 -44939 132975 261237 317177 419350 435804 371147
27922 371147 237536 239656 513564 592124 548570 488716 344926 -106722 -314199 -247207 -44121
27911 -44121 -132593 -64544 -11526 35146 81761 107217 58155 8421 -42982 -51839 -149340 -159341
27899 -159341 11636 20835 62328 191251 246911 425925 428136 130453 -41605 82272 493495
27888 493495 388814 152628 -9962 43862 207928 381607 124333 253437 149594 172556
27878 172556 337051 309156 193791 336485 412599 433817 261234 133341 247845 459303
27868 459303 330053 268143 76189 -78992 11077 -33511 -112160 -188311 4501 -18856 8485
27857 8485 127157 237194 248649 309132 348258 327040 200044 171123 140699 27999 133698
27846 133698 103397 -20017 -175944 -9689 47750 -17869 -22594 112649 15093 132358 98295
27835 98295 87940 14412 -46345 88131 177429 446523 314491 266869 83387 -65962 -117273
27824 -117273 -138535 -57715 213357 290384 -13739 -188440 -77526 37084 -82767 -11547
27814 -11547 40352 122164 324079 276393 197462 -30204 -51918 52440 38449 43648 23565
27803 23565 8939 -42029 36364 38988 -31614 -98770 -31322 245280 190016 172031 108015 -21077
27791 -21077 -22694 147347 315926 405163 346436 169617 -7841 -180937 -236177 -109751 2917
27780 2917 27138 15491 19251 128493 192532 213718 208757 298854 273326 31043 -91891 -129144
27768 -129144 -68391 110773 132896 196347 128786 148807 103677 66261 -90132 -99661 -224280
27757 -224280 -235488 -144543 -67593 42119 189559 317587 220455 187150 236607 353711 359521
27746 359521 167617 -165933 -255892 -275800 -177488 6031 -21926 8857 192306 187220 -85668
27735 -85668 -248151 -234098 -99436 2978 -100075 -34017 200950 369415 413041 539368
27725 539368 610164 526606 412010 193251 280377 364378 463810 565496 280662 -23314
27715 -23314 -140500 1563 -9517 -78732 71454 64176 79871 -98403 -94694 54703 88591
27704 88591 -23125 -127771 -153312 -40458 -38514 -149626 5313 42179 -16809 73962 120758
27693 120758 29032 -241382 -145676 -109097 -270983 -255946 -390 80190 80917 -78724 -88885
27682 -88885 57645 193661 52048 -117690 -163254 58469 270880 299570 139799 80995
27672 80995 -106726 -176007 -200648 32046 115633 59970 -67998 -98133 -101355 122755 157531
27661 157531 238292 62736 -284439 -143198 50244 32961 -24449 -55453 -175577 -129607
27651 -129607 43849 177912 277787 289020 181885 127623 232777 339581 326667 34025
27641 34025 -22345 -48866 -240877 -366378 -291605 -207383 -159116 16568 203311 122149 -81468
27630 -81468 -4714 -27127 -235961 -301828 -243218 -200831 -298742 -253374 -172552 19473 155754
27619 155754 -32061 -192448 -301339 -322476 -228085 -133940 -44708 13593 11998 77569 -1032
27608 -1032 17 149264 231857 81080 60244 90385 294524 460911 428787 206493 336507
27597 336507 271316 178793 106966 21118 -35797 -155902 14426 52358 91023 53615 -210023
27586 -210023 -89549 -68856 -187526 -131900 36663 -69651 -222135 -204714 -341886 -455010
27576 -455010 -187231 -185097 -197938 -255443 -124364 -1977 30871 8467 25343 -74621 -102289
27565 -102289 -166271 -181473 -185684 -113715 -145492 -70712 23863 -103838 -197887 -123901 -131693 14056
27553 14056 60557 -110609 -268484 -128710 90298 99602 178179 263515 513446 556294 423521
27542 423521 220269 144134 218621 262586 114615 -225347 -356073 -194218 -150639 -29
27532 -29 23471 -147681 -18905 183873 245345 250161 80303 -86285 35905 212775 -17872
27521 -17872 -290325 -237018 -266494 -103509 -160703 -144120 31976 -61262 -149844 -222402 -63188
27510 -63188 962 -95184 -176899 -43129 71627 -29372 -54265 36794 162906 7438 -141241
27499 -141241 -64553 -5901 -51975 36465 -169518 -203356 71834 -15387 40568 132467 -252200
27488 -252200 -397681 -317871 -303347 -50746 85964 -43591 -270519 -300639 -259537 -296882
27478 -296882 -159325 57985 119117 196991 290779 144749 140817 203203 227461 167778 247752
27467 247752 107886 -149888 -7633 -53823 -155874 15404 -96956 -151425 -256903 -265907
27457 -265907 -127774 17345 30747 -218434 -267468 -271034 -105684 246005 526288 619576
27447 619576 515190 366915 287355 188982 334151 365237 261930 257357 -42671 -15322 86576
27436 86576 -160732 -126203 47878 133880 40182 -8528 53379 59393 187205 194972 57975
27425 57975 -151330 -257094 -485360 -462076 -176950 120928 182054 118971 77024 196901
27415 196901 337652 258338 180217 -48366 -257875 -156586 78250 227846 405477 245240
27405 245240 215786 373847 337151 315870 431100 443497 209418 -31137 80895 121189
27395 121189 -105010 -126877 178526 322790 300826 175899 117212 67747 107975 58632 -173245
27384 -173245 -244295 -107798 125036 314305 258794 302564 398595 163757 -146775 -257162
27374 -257162 -277775 -278170 -249299 -494217 -498678 -185629 117706 195523 190963 270597 279262 240875
27362 240875 192225 127777 -180865 -306971 -35414 164798 -2692 -76601 -106291 -114929 -125495
27351 -125495 -152955 -114040 -315642 -454890 -405455 -431245 -135344 124962 -10864 -115465
27341 -115465 -264193 -317098 -235280 -194740 -210528 -268444 -225139 -226248 -166181 -58156 -32420
27330 -32420 -113652 -189183 2528 335890 276967 143610 71056 124253 148443 102659 111858
27319 111858 274732 323923 257151 141320 -66497 -69826 43318 28770 -11589 -33498 33102
27308 33102 224902 245096 29006 -147577 -266293 -300450 -259374 -192646 -256268 -135155 -270717
27297 -270717 -285811 -68931 81835 64381 135246 294561 280294 93450 -12579 79557
27287 79557 240759 323293 175400 89884 64103 113066 7112 -61329 -161432 37692 87168
27276 87168 80178 -51277 -86967 -151786 -214763 -180564 -132093 -42760 -117238 -26608 -4559 -108858
27264 -108858 -258825 -186953 -22787 118096 128364 180355 155589 -56587 -153178 -183861 -212641
27253 -212641 -312197 -244810 -124969 -146383 -123245 -84567 -51240 194539 210216 59393 77328
27242 77328 -43318 -9137 -82263 58238 101129 71145 -22383 -126907 -164965 -83736 -40186
27231 -40186 81371 166053 313481 164787 9245 46307 37783 -113264 -54193 3417 -32513
27220 -32513 8957 21899 23973 122064 101234 -61976 -67819 161280 191260 93582 46657 53709
27208 53709 -65000 -302533 -281138 85061 117264 7232 3913 108500 139446 7468 30112
27197 30112 43033 -4787 -20269 -128032 -83509 -137389 -221585 53724 48972 138112 191019
27186 191019 39500 132405 29384 -140691 16734 -26092 78216 155127 200608 137194
27176 137194 305320 204099 89806 63517 35725 101953 -10807 -11937 -215351 -310820 -176533
27165 -176533 -105704 138258 293514 268511 137755 -131463 -215553 -168985 -284224 -356315
27155 -356315 -266132 -119087 32134 3482 160465 270187 195263 74031 137490 303147
27145 303147 275292 184003 23963 -32572 77673 129339 260038 164982 216989 227583 151520
27134 151520 45246 55912 126853 170225 265837 250330 133308 152915 17072 -95217 -220289
27123 -220289 -319392 -370074 -192745 2624 37355 216621 348028 299357 165727 193106
27113 193106 -1285 49196 67682 170816 193080 298100 50743 -17824 187022 78469
27103 78469 209807 312150 241459 54482 8058 190372 15702 -76166 125423 262250
27093 262250 113597 253518 434944 430846 349333 237605 119396 10024 -19709 -6328
27083 -6328 -72109 -40342 -52507 -108062 33036 215378 249356 155393 88017 -90001 -202719
27072 -202719 -347358 -387018 -289664 -87054 69896 70006 122597 110205 -153160 -186327 -95202
27061 -95202 24452 184815 -36228 -88129 -93177 -26007 18626 4457 143825 227672 40561
27050 40561 -273605 -216765 -139210 128411 118173 72296 49993 -104034 -101476 37826 17600
27039 17600 -69207 -24992 -43635 -273833 -316693 -222476 -77729 208855 220324 232316 111138
27028 111138 8913 -179136 -429584 -339959 -236701 -272680 -290915 -141023 13557 -239528
27018 -239528 -401357 -301989 -73245 30663 -243082 -170035 -93979 -347133 -444354 -272926
27008 -272926 -253568 -213379 -195951 -134488 -187638 -73049 -168931 -121252 115635 22262 -160401
26997 -160401 -247181 -290928 -280077 -276971 -80441 92002 199805 259947 190319 21867 8751
26986 8751 77151 22272 -140609 -116215 -40075 -3233 -48385 -201391 -29376 122140 106499
26975 106499 34705 -107565 -110654 53252 155494 373503 394824 396219 322425 213474 -2946
26964 -2946 -15065 172604 -85130 -106092 221654 258442 251315 253069 290171 282758 133152 -20110
26952 -20110 -175592 -185076 -145503 -19100 80120 -150185 -211575 -242461 -306175 -264280 -184688
26941 -184688 -179535 -54992 77989 232267 175877 9702 -8060 18701 -131719 -217992 1390
26930 1390 209889 328473 75954 -149839 -74596 -39136 114738 165325 -5513 74573 -4393
26919 -4393 -21804 -121223 -132080 69098 58995 36245 93528 7748 -43714 150249 322541
26908 322541 204949 83507 -10238 -87427 -246322 -204474 -67534 63397 -110569 -133321
26898 -133321 -140278 119507 42900 -98631 -267503 -349666 -313040 -33892 275930 233660 100309
26887 100309 28563 217821 242926 350207 310895 206206 -15306 -84475 -241360 -119401
26877 -119401 85009 318906 257097 66684 73047 125248 186754 303581 84223 -150962
26867 -150962 -58471 37781 -29731 -209118 -294406 -177400 -331546 -603177 -647292 -544257
26857 -544257 -251624 -73467 -626 8200 -115854 -254366 -346490 -211756 -302538 -399320 -324265
26846 -324265 -122965 26077 -33736 -149083 -80357 52433 68763 39873 100657 118494 -50921
26835 -50921 -147496 -66269 -50711 -9303 22771 109697 259374 172269 94532 -8789 -65707
26824 -65707 -259885 -253811 -171479 -274561 -340704 -407244 -393544 -350628 -222966 -93436 199009
26813 199009 276675 32040 -47187 -89258 178364 440057 332921 298554 129807 153522
26803 153522 47747 101082 341002 194437 -63180 -154808 -218700 -227232 -217361 -198527 -257139
26792 -257139 -262327 -127245 -144861 -78247 160346 245590 53477 64110 -49987 -295214 -307461
26781 -307461 -109447 -83430 -150461 -195321 92652 346985 266871 256779 326095 308492 182225
26770 182225 -145695 -259917 -425252 -321027 -239812 -90793 -81737 -120543 -70961 -6500 102645
26759 102645 186126 273274 453339 264517 29503 -68915 -157610 134004 322854 205346
26749 205346 -93247 -124454 36234 56677 287738 284049 107263 94692 157616 261756 16892
26738 16892 48299 95232 111123 120466 37991 103547 309506 387656 356645 499776 387653
26727 387653 306787 54016 19533 114305 104015 50776 87559 217092 221689 -17734 -43755
26716 -43755 30461 -266499 -480641 -370760 -274537 -275071 -48923 -23924 -96094 -99234 -155206
26705 -155206 -104809 -21071 -34993 -22498 -77457 -133410 -8062 -55540 -50120 -114677 -110504 24971
26693 24971 310067 391256 278887 -206854 -314771 -236186 -158708 -36745 -28922 -65135 -216389
26682 -216389 -411483 -271095 125262 251053 102906 -151277 -152041 -88881 -41006 166853
26672 166853 206234 -50680 -220728 -82932 129263 234744 266698 329935 268521 164473
26662 164473 -28176 -175308 -258988 -248671 -20793 56835 -125833 -291466 -119620 -58812
26652 -58812 -105683 2822 -109484 -245437 -346096 -293440 -183338 132880 199371 202175 169695
26641 169695 -10258 -309068 -207198 15042 6849 -36325 1880 151520 -17802 -294304
26631 -294304 -263461 -120984 -101179 -189320 -154547 16847 26842 -110054 -155878 -307219 -210636
26620 -210636 -73364 -152995 -380196 -450915 -372275 -339298 -234849 -180526 -263468 -87426 -14792
26609 -14792 188379 175112 80856 307735 443560 388905 224699 140720 34831 -51390 14031
26598 14031 24705 108322 54115 -23559 212924 198486 31213 31813 -57128 -153356 -207046 -37922
26586 -37922 164379 64454 94699 179213 -21327 77337 -32423 -228680 -307526 -218585 -40372
26575 -40372 -259731 -223979 -296036 -220905 -289515 -355870 -90687 80813 15922 54252 -150988
26564 -150988 -264945 -336369 -138830 57229 -159079 -274220 -230150 -153743 23033 98957
26554 98957 62563 -42428 -106669 -136890 -207201 -101675 -74310 -102819 30360 65759 37182
26543 37182 -96427 -186515 -297434 -177602 -44403 391 -93539 -128767 -137346 62263 267157
26532 267157 235579 155770 122768 113020 100973 58446 -25047 -159505 -78669 -130010 -79677
26521 -79677 -78184 -18374 -116617 -49555 42497 -58262 749 4077 67713 163732 172236 49821
26509 49821 72514 5058 -40146 -151929 -277413 -106042 -64326 -87840 -57203 176456 48293
26498 48293 62258 40059 -47365 36855 155699 252850 193694 145418 157823 188445 70285
26487 70285 266771 250735 265832 354871 254213 219694 277736 19798 18939 266233 242191
26476 242191 123990 344987 153207 -112287 -155938 -1500 -75836 -45349 45375 58882
26466 58882 21262 21887 142322 156640 100301 149734 132857 133390 212067 34198 -143140 39489
26454 39489 -66421 -238053 -119452 -173140 -234262 -270063 -429283 -440363 -210288 -94205
26444 -94205 -35018 -57006 109618 131059 25664 -11365 -73705 68418 279882 312930 377914
26433 377914 100329 93109 105619 24204 55911 24941 -42976 -50338 -99402 -42812 -28292 -82678
26421 -82678 -11054 41395 283103 102584 53184 69469 1852 11934 111890 146361 66006
26410 66006 86783 -25902 -143307 -126963 -50650 34238 89262 112340 22435 -278701 -367036
26399 -367036 -359445 -152551 84622 147494 102943 246836 399934 377598 63665 -277832
26389 -277832 -390653 -346583 -188462 -19161 -51341 161804 40359 -316008 -466122 -486293
26379 -486293 -337980 -136344 -164409 -42739 26645 6190 148995 -103574 -89638 -116986
26369 -116986 -4310 78828 116712 231548 205998 463398 299837 -800 60674 169421
26359 169421 101139 179334 158764 -78459 -201334 56702 143065 -107265 -239489 -560725
26349 -560725 -348743 -258139 -269397 -275845 -249832 -195646 -196676 -221515 -178508 -278261 -177401
26338 -177401 -77612 -67408 -311564 -467401 -463951 -209050 -139539 -126284 -65774 -103724 -128221
26327 -128221 -145511 -135635 -127877 -119697 -130876 -13376 -125622 -164907 68973 315731 454907
26316 454907 196925 -129024 -87551 -3063 79629 134608 44545 -115076 -106560 164389 113704
26305 113704 4013 92384 96642 -18603 68374 95772 139706 61986 152205 151341 44645
26294 44645 -83204 -38443 -31561 -143508 -62886 -83396 -138518 -85075 -106757 100734 84648
26283 84648 -105114 -165571 -196464 43744 -42651 -20368 -50659 -6539 -34195 -245636 -341951
26272 -341951 -110242 66270 139924 181905 -4048 25694 191669 128145 -30857 -179648
26262 -179648 -123832 -37155 91848 72853 152015 126243 -63715 -138798 -49828 -89349 -154780
26251 -154780 -20933 177344 81619 45716 62318 105741 -73534 -128423 20275 193514
26241 193514 314396 194778 17845 -186493 -36080 -24152 -4975 -79781 -201085 -119573
26231 -119573 68316 113180 206397 359180 451268 315797 78336 -265762 -343565 -385346
26221 -385346 -251023 -174931 -276484 -343808 -200792 -111433 271 88186 274668 352256
26211 352256 281505 321798 296167 51386 -94881 -113182 18642 148372 290509 216771
26201 216771 214343 89513 133818 -2873 -139855 -163089 79546 222257 -26167 -334830
26191 -334830 -500183 -677961 -763139 -803242 -691236 -411993 -127506 9471 117645 190161
26181 190161 82435 -102752 -271654 -253457 47491 116957 -13064 -118261 -222947 -170674
26171 -170674 -125775 -229264 -132711 110202 119118 120381 28523 20049 50700 91467 26727 -73658
26159 -73658 61589 -55989 -161395 -146789 -112434 112861 91699 175636 147799 -87330 -89510
26148 -89510 123814 23990 -86749 -296129 -167562 135815 240673 338473 192086 122100
26138 122100 -1542 -77865 -19564 13007 15884 -64377 -72689 205055 287747 233647 88682
26127 88682 -5409 -237037 -226675 -178603 -75302 64552 172476 213755 229951 324537 345756
26116 345756 285838 371003 118526 -195831 -205944 -192905 -54683 97546 -154012 -273855
26106 -273855 -174752 99632 234327 17356 -55438 -12177 -48531 -325524 -361477 -327955 -191499
26095 -191499 -5890 64807 43986 24470 -2379 -179306 -205204 -109203 33124 120403 6539
26084 6539 50097 189447 52103 -209549 -81587 -36932 -109781 -238088 -190431 39006 123364
26073 123364 350611 348454 220940 -53520 -1897 -114249 -117741 -223831 -402374 -138300
26063 -138300 6783 -117534 -310479 -35713 -163492 -185217 -87487 -106221 -46140 111593
26053 111593 208730 -12333 28268 105444 -33052 -173166 -275807 -300570 -140401 155295
26043 155295 -45602 -196624 -156139 -144772 -325749 -142922 19214 220238 256025 60197
26033 60197 66063 -2864 68679 58586 -72993 -15876 -234873 -295425 -188369 -5905 185592
26022 185592 168836 -24937 18643 157481 99451 228034 264659 113619 66540 -18881 -142812
26011 -142812 -26852 159799 165250 154816 -95827 -333145 -193821 -109774 -197297 -52807
26001 -52807 264102 327054 231537 -64852 -190335 -248288 -11492 165514 -86271 51311
25991 51311 5498 -244590 -262600 -331715 -397135 -289286 -171235 30887 175258 41427
25981 41427 -16758 -172789 -84617 106371 237512 -59636 -202846 149239 311745 352072
25971 352072 143377 66686 36334 -37980 106175 137138 21721 164269 -19855 -138775
25961 -138775 -157403 -74136 155522 445996 281226 -38590 -98513 -52052 80393 7807
25951 7807 30433 -15701 -81339 -57906 -91081 -155833 146150 289736 182832 -93105 -143549
25940 -143549 51442 260942 105485 6724 57394 -87346 -205486 43819 93759 -37285
25930 -37285 -282439 -229241 64565 296241 225692 -22645 -220984 -229202 -233441 -105210 100440
25919 100440 360706 381720 377278 247236 347099 297950 145277 235742 213399 202218 108804
25908 108804 -7856 -138099 -190008 -137283 13102 118152 94265 -50883 -110411 -68952
25898 -68952 -50343 -83265 -71794 -111068 50554 189929 9479 4930 138796 280430 304550
25887 304550 325334 138387 100897 116739 275167 184731 81523 105395 54161 83815 221796
25876 221796 233350 375821 423407 249065 307417 427261 375399 368530 281649 117544 -77317
25865 -77317 -93089 367170 507028 468179 418010 113777 -124190 -8980 -130478 -175678
25855 -175678 -47266 -50699 -303495 -210255 -74098 -219718 -308713 -279117 -161624 -177235 -234457
25844 -234457 -126576 -67884 -170250 -149883 -42514 -6529 304908 44582 -89070 -344539
25834 -344539 -540343 -440450 -274573 -166749 -239680 -361770 -317402 -431365 -369352 -286294
25824 -286294 -258083 -147805 -98633 -207080 -285384 -79887 61257 201125 194258 -55161
25814 -55161 38903 31358 -118867 -106403 -143621 -165508 -327715 -506123 -468464 -525744 -482899
25803 -482899 -280113 -76474 -31564 -91112 -217392 -44716 3258 -2596 -106116 -174149 -202560
25792 -202560 -336218 -217951 -97533 75550 77925 -47364 -81049 -94469 -237579 -400167
25782 -400167 -266959 -57564 53754 183788 43790 -13929 -85817 -56917 -30009 -118115
25772 -118115 -118365 -168445 -299561 -338543 -211857 27705 38526 -9279 -150313 -256096 -115103
25761 -115103 236444 139287 -69353 -80312 -27076 -51303 -234036 -351058 -316253 -277890 -228835
25750 -228835 -31401 20247 35964 187751 213468 91070 -107839 -242344 -210346 -204464 -72558
25739 -72558 159938 262991 269145 269828 78222 109885 98636 -71256 -145617 -117064 -261603
25728 -261603 -282452 -257396 -176151 -160866 -27790 35126 28336 102353 285518 331997 146436
25717 146436 -94174 35932 -55393 -19891 126230 -55190 -80082 294961 414189 336905
25707 336905 309001 168201 11607 -71111 38698 -17707 -197680 -235362 -215614 -171459 -150366
25696 -150366 -133289 -110432 -238411 -153545 19728 -81651 -176519 -235556 -356681 -284303 -111808
25685 -111808 -78273 -97218 -43573 92638 33144 116929 124867 158894 85737 20213 161279
25674 161279 -17345 -237490 -338109 -302417 -323870 -260546 -225522 1720 63342 22374 103790
25663 103790 101745 -74428 -154172 -312789 -58671 88915 189969 64684 -195893 -7761
25653 -7761 54878 -8644 -38075 -325552 -235178 -47368 193468 276793 226282 189473 214908
25642 214908 307282 340862 221669 92109 105478 19408 -6916 -202965 -356598 -304590 16570
25631 16570 41980 44443 47703 -130692 -70677 149006 20394 -83101 -245739 -401571 -435893
25620 -435893 -551609 -366430 -196822 -199220 -166255 -228701 -185053 -270329 -251250 -120235 -57560
25609 -57560 97416 48003 -57678 116163 104375 2535 175473 147099 -26590 -16918 30912
25598 30912 131057 141945 -42737 -29046 134572 214790 233824 112980 -90976 -157699 70777
25587 70777 117863 242664 482783 551289 220383 -47858 -14041 -10908 -95417 -143741 -131621
25576 -131621 -265673 -324446 -227762 -182664 47592 273248 228638 133934 104679 70639 -89557
25565 -89557 -220634 -34084 111185 -17110 34929 116064 28405 151536 211265 228579 199064
25554 199064 117489 36038 -152465 -251050 -298170 -118630 196441 265964 170646 199414 101981
25543 101981 102743 71728 133435 116495 167612 200652 355497 249749 16938 -140276 -160566
25532 -160566 -132181 -261608 -53382 255284 242102 18629 -152971 -98203 79364 173119
25522 173119 182014 105108 255118 196738 150215 93073 99696 40897 44575 179330 242291 225517
25510 225517 195473 280540 314074 144535 57668 -27621 -76580 -75906 -70632 33386 34778 137130
25498 137130 80707 -72299 -180569 -206545 -307184 -219654 -161117 -18098 249541 264005
25488 264005 141073 -15572 61223 -40588 10343 -36760 -549 51563 113981 42720 -48880
25477 -48880 -44085 99655 12187 167893 98561 -50796 -235817 -286264 -108050 82682 13367
25466 13367 59697 -25805 -223195 -264069 -165734 -202851 -194338 -193885 -79463 26385 144255
25455 144255 254175 167342 51607 25094 47944 -129355 -96732 155950 5896 158664
25445 158664 265036 1720 -305915 -331569 -70281 -95989 -65494 -21441 -18531 176459 266657
25434 266657 288178 149509 192275 93350 15466 216277 206323 182460 290729 218649 -67851
25423 -67851 -326592 -234501 -11824 -8524 85817 156028 302819 268601 274740 151769 57174
25412 57174 13353 -146064 -189091 -97305 -109505 -164867 -128951 -116555 -210566 -171447 -198727
25401 -198727 -165817 -90559 -12358 -68533 3388 -60902 -182547 -116160 -161366 -293460 -355405
25390 -355405 -422544 -374626 -160374 206743 154392 177079 100612 -44670 -121108 -270638 -315830
25379 -315830 -443567 -312646 -208033 -323867 -183416 24224 84469 -78330 160406 117847
25369 117847 37206 -25058 -226295 -145112 75755 239451 170721 168679 374985 120369 -130525
25358 -130525 -131982 117658 -5794 1578 106834 43367 -30953 57144 334429 477823 220847
25347 220847 -70832 -142087 -34902 118649 212437 -77003 -242139 -308195 -116680 -171443
25337 -171443 -166108 -46812 -106757 283564 309232 140026 125039 1623 -198128 -195387 -73027
25326 -73027 50061 345405 477672 242661 82334 -162654 -257729 -75665 47337 115921
25316 115921 256508 123202 -155124 -406320 -556143 -507830 -416594 -293044 -227551 -235298
25306 -235298 -406021 -532075 -558940 -472775 -276158 -167914 -181494 -119708 -168004 -182817 -78894
25295 -78894 -221551 -297389 -221777 22390 124938 101399 174233 23396 -39876 -9101 -211672
25284 -211672 -392612 -286157 -168243 -51878 32086 6704 68211 80672 -6630 -77603 41780
25273 41780 126728 279347 113332 -281734 -215184 7191 46343 -29390 -83590 -114868 -130671
25262 -130671 -140207 -53322 -17745 38359 124907 201448 169874 23099 74948 9635 -44846
25251 -44846 133726 186600 267990 458502 414823 291695 211015 76379 95138 217406 101599
25240 101599 26074 185550 37905 -37063 47334 309525 312940 144601 28358 -75319
25230 -75319 -237848 -363629 -436456 -311313 -236871 -360939 -279907 33111 166887 68202
25220 68202 -83424 -32875 -81870 -92121 16574 -211843 -190806 57249 41742 -34040 -46656
25209 -46656 -70660 -135169 -135852 -134842 -69266 114776 48805 48974 -137955 -121078 42116 61967
25197 61967 56798 93720 -39671 -92767 18628 87566 70421 -110853 -202432 -320990 -241373
25186 -241373 32715 121375 238156 305699 32713 -73464 -314197 -484735 -389059 -250273
25176 -250273 -325884 -299742 -280728 -399382 -126889 2631 31053 108575 31366 -76499 -179479
25165 -179479 -52216 -50135 -134988 -102267 93271 39610 43892 -129213 -45834 123510 194419
25154 194419 235351 383959 124020 48752 -93253 -146828 -20673 -81575 -228364 -100387
25144 -100387 125925 -137728 -226413 -292834 -373970 -545214 -426250 -197613 -146294 -219577
25134 -219577 -76314 -4688 -32768 -22642 143731 104299 3140 -134867 -19247 -15899 -86217
25123 -86217 -246066 -272036 -113254 -53532 -37667 -32101 -652 52557 91783 -88866 -195089
25112 -195089 -209018 -137865 -45746 -33459 -173401 -124243 22570 37742 40701 -47743 -46922 32672
25100 32672 156479 -35320 -187766 -91034 152029 315797 110162 -6032 -65245 -170998
25090 -170998 -151659 -20461 198129 311552 259090 305273 319625 132785 -55441 -112710
25080 -112710 -244368 -271615 -286311 -148552 -4983 -20542 -14517 -16538 -244577 -267990 -6049
25069 -6049 -25058 -263075 -267504 -240359 -281863 -479422 -404127 -352461 -318856 -324593 -219046 -197787
25057 -197787 19151 9518 -113230 -50361 109533 175125 2957 -16551 39466 -15370 -181073
25046 -181073 -212287 101898 158139 -26206 -83314 -153535 11804 112578 226653 156683
25036 156683 -11075 -19129 18291 -26071 48473 -83254 -80624 -38105 -4053 -84195 7439
25025 7439 13991 -45376 -49280 -124095 -68173 -343469 -466157 -461475 -327857 -341335 -215866 -223910
25013 -223910 -281719 -133566 127328 95482 -90045 -163085 -181754 -367402 -430563 -365840 -344497
25002 -344497 -366273 -221086 73274 -28330 -94007 28828 64555 192351 374853 248651
24992 248651 43482 -188874 -302105 -214484 -148677 -80346 -61304 30498 83140 117561 83841
24981 83841 165995 322474 303248 727 -142200 -293299 -428616 -381362 -239557 -26334
24971 -26334 36983 69070 218453 42294 -135760 7188 159394 199608 302087 342965
24961 342965 323502 69213 24608 97644 51213 136342 236859 388824 263849 280035 321794
24950 321794 82631 11890 156678 173063 81685 928 -132492 11739 384255 209859
24940 209859 205769 201014 265574 403739 414567 419951 341122 212606 128391 202036 344497
24929 344497 333721 157574 -70750 -222435 -104145 -270018 -113221 -118440 -145137 -233493
24919 -233493 -228692 -136507 35598 -67428 -73165 77863 18009 62156 144192 -53 -190596
24908 -190596 9007 170148 187937 118121 125285 80748 140207 188293 335661 312348 329536
24897 329536 277046 297891 310405 263324 257878 302564 199778 57679 -5194 67473 42723
24886 42723 -41395 -196096 -147647 -334826 -396228 -241710 -89948 -85072 79226 -58122 -290216
24875 -290216 -185124 -153598 -159867 -9034 -45667 -34915 -143738 -25465 220307 240636 154197
24864 154197 175750 229157 161107 1488 -152040 -133717 -192853 -190008 -43890 44752 -110538
24853 -110538 -87287 148928 132149 -155754 -127847 4108 250995 -20928 -278588 -319313
24843 -319313 -176968 -157869 -17117 259159 35606 116829 4727 -50300 -223278 -489819
24833 -489819 -264705 4758 302932 424872 322034 215496 110311 28610 77201 275534
24823 275534 170010 -66137 -70784 168073 80280 -33679 -158571 -185562 -51919 49919
24813 49919 251825 331998 127849 -248257 -598807 -667078 -555349 -235091 68616 59044
24803 59044 -129115 -428406 -421041 -375635 -303407 -140452 33843 230270 55278 -97270
24793 -97270 94572 68187 51519 -160030 -167072 -86942 -10997 -40114 -165971 -136276 -127550
24782 -127550 -33074 47873 112150 163556 109786 -18134 -262991 -142123 -240808 -463641 -369163
24771 -369163 -182265 -100598 -180403 -149496 102823 122561 144222 160986 239330 59939 -45589
24760 -45589 -83534 -120343 -2248 50409 71483 16870 -50006 -138867 -24234 -18446 -185374
24749 -185374 -277042 -108218 -305043 -247761 -83261 -121316 -91620 -25634 -146140 -92746 46684
24738 46684 8168 184414 273480 111998 -58664 -181290 -299069 -282501 -147238 -109991
24728 -109991 -21063 8764 18409 -245245 -437584 -370147 35242 218214 284113 137124 -68363
24717 -68363 -72622 14337 264725 256605 42791 50591 18650 -156070 -167116 -202527 -130062 -262679
24705 -262679 -161176 5234 104842 12543 -3808 -213285 -163112 257795 343647 363148 213183
24694 213183 216714 174801 227498 183090 74205 124333 12182 -56665 -169522 -6226 -41162
24683 -41162 -79177 -161220 -135792 -77156 26551 -132794 -129818 20640 -81083 -55494 156070
24672 156070 309967 171165 75938 -86787 -300635 -230398 43648 29418 -68917 -76258 100091
24661 100091 94152 237026 129936 120460 209312 165982 146098 -12544 1305 -104594 -30043
24650 -30043 29425 122843 7260 14231 -18004 -52970 -382 127773 104590 -68611 -165952
24639 -165952 -140282 32982 140580 109491 189560 96926 -94110 -38155 146184 -143499
24629 -143499 -285314 -308199 -380212 -331782 -196353 -99083 -163322 -153428 -16858 -70006 -70646
24618 -70646 119108 234072 41056 -53679 -58199 -158468 -69841 -95150 -152150 -197036 79876
24607 79876 323645 302147 182052 94234 133957 -57400 16826 95440 117544 -46626 -88176
24596 -88176 -167333 -231061 -176288 -79948 -84334 218976 481163 326888 226581 0 -104940
24585 -104940 -111885 -139186 -133750 -164536 -175237 -152373 -13685 83563 3946 -68613 -100012 -98738
24573 -98738 39250 62716 185990 189054 339950 317234 275157 229967 305506 335262 412969
24562 412969 354395 93833 117537 159093 131077 -125610 -80161 99343 129790 48833 179459
24551 179459 300440 208632 39762 -176971 -400366 -325481 -311976 -377345 -462451 -305603
24541 -305603 -84586 21664 102665 144708 209593 200113 246781 54849 -69080 -53712 26224
24530 26224 211821 197781 77487 -66265 -193870 -418194 -569445 -422247 -224902 -93830
24520 -93830 62837 71890 -130801 -26702 165727 284198 400772 371666 319533 179451
24510 179451 103304 88787 285948 435428 476746 178500 71553 65070 -60733 103245
24500 103245 75525 134370 86810 -131345 -110257 -147204 35471 116065 68305 -177102 -284164
24489 -284164 -149093 -105819 -163396 -114820 -280114 -134804 34477 -146250 -361498 -359492
24479 -359492 -182044 -156520 -15781 8566 -5320 80094 41197 50787 145069 63308 -36555
24468 -36555 -169675 -80947 -113610 -11029 -116160 -155622 -133201 146902 330976 260188 205791
24457 205791 173281 16822 -132551 -37867 -162173 -97942 -77246 61083 -93679 -197099
24447 -197099 -145397 -135035 -138637 -137061 -181737 -151125 -363137 -446845 -350382 -212270 -179695
24436 -179695 -73779 -29656 -271679 -140800 28850 -92502 -167631 -204342 -58020 -171599
24426 -171599 -99405 -122754 -105529 197297 439232 521938 560654 354724 84454 71799 -178375
24415 -178375 -302640 -204162 -92073 25762 93295 174076 -47032 86507 41879 -136258
24405 -136258 72410 149356 75568 -84866 -475873 -469637 -259804 -124881 177609 298090
24395 298090 329727 276772 249269 308489 404709 486651 431858 177365 46907 142422 207665
24384 207665 89813 266033 72396 -136988 -110600 -137499 -258836 -287930 -214980 -180102
24374 -180102 -83360 -221250 -315895 -422334 -346531 -130197 -309826 -379910 -238663 -147713
24364 -147713 -162227 -49659 212965 -46051 -355204 -323336 -275834 -244828 -183101 -38043
24354 -38043 -169136 -39841 157987 285499 278933 235252 246085 352354 154677 -49645
24344 -49645 -216055 -161705 -115958 -19744 -25582 -120780 -269880 -115473 107959 266381 158974
24333 158974 -170651 -107333 37955 44995 -12715 17520 72913 102647 160655 104961 -8738
24322 -8738 -106222 -89869 -204272 -146179 38225 236616 266867 270249 223541 101738 8971
24311 8971 -114632 -177643 -43905 -32383 -192507 -241282 -66629 40066 -44085 155322 227828
24300 227828 428322 454695 69430 -207420 -64422 125740 148525 -145650 -213921 -159046
24290 -159046 -108891 -59704 -60096 186182 227728 274780 197372 177246 216268 305812 360031 286361
24278 286361 64837 -28353 -9621 -97924 27986 269258 224297 165176 87927 -64815 -20089
24267 -20089 -207928 -225061 -15655 -92490 -254867 -260298 -211168 -129038 75047 -106431 -333536
24256 -333536 -159287 -145537 -227084 -131392 -11150 -27940 -191342 -117181 -307598 -417429
24246 -417429 -356665 -260436 -383429 -385335 -153011 -19472 -3072 -43000 -48623 -162200 -60616
24235 -60616 -148809 -256067 -222654 -231551 -69005 92607 361561 278838 125440 191249 250608
24224 250608 366308 244070 37634 -18577 -101115 -47017 -58282 -104599 -205345 -258611 -305378
24213 -305378 -441197 -259456 -123777 -334625 -416069 -230875 -185846 -149985 -19874 93591
24203 93591 167391 69155 -89496 -780 74577 155638 202139 37937 -348090 -384862 -113965
24192 -113965 63458 305969 320364 406102 333509 245657 138699 236686 98750 120979 152086
24181 152086 93698 15888 -33069 -222981 -135054 154220 230184 148566 -69183 -146300 16438
24170 16438 206480 103170 21500 -115583 -233485 21628 226485 181529 183726 -106977
24160 -106977 -116984 -194962 -208081 -127006 111537 210098 321216 357386 194105 160522 -11072
24149 -11072 132895 401506 211774 -13958 -154558 -234667 -181649 34882 157853 232875
24139 232875 178523 172753 44641 36906 146930 279084 64601 -116413 -267693 -204203 -223463
24128 -223463 -9578 -83989 -209965 -149731 -11059 -18664 26086 -112569 -248438 -177769 -165792
24117 -165792 -234219 -212054 -123057 232234 293251 138014 189796 267423 143042 51944 22730
24106 22730 -89640 -167671 -169282 55781 264647 362088 124193 -51740 -61046 30602 -30887
24095 -30887 30999 366146 305516 194070 347634 377651 157001 43843 -89703 -150801
24085 -150801 -254452 -28600 97652 271283 315443 -16370 -94779 -149137 8701 29129
24075 29129 -148799 -70837 -14920 -260906 -354896 -392127 -322362 -167511 -214498 -114390 -202541
24064 -202541 -125961 90174 151134 79520 -66429 -24453 1184 3039 64673 156842 247043
24053 247043 245779 143188 229275 120977 -33675 -85059 -53956 61228 151212 224343 84545
24042 84545 -55809 122131 403117 394803 124550 116897 205178 -44693 -251612 -323620 -133389
24031 -133389 193119 280264 132664 134500 -51163 -199192 32554 227521 164123 62526
24021 62526 18164 21078 -80838 -95010 -106471 -48058 35948 78863 35370 125263 -15450
24010 -15450 -85179 -30786 204646 347967 352816 507449 266912 -89777 32672 53981 1334
23999 1334 88128 305039 114498 37752 -144239 -138484 -54896 -55775 176740 294093 -77897
23988 -77897 -366330 -364213 -411830 -344869 -182763 -77774 -20274 -22573 6088 40725 -34226
23977 -34226 -215295 -272283 -381850 -368256 -98783 -4403 -68039 29746 -229687 -429272 -529844
23966 -529844 -234732 -42861 -48886 72697 -25747 -126213 -107988 -108070 12215 21081 270461
23955 270461 255980 -26465 -215670 -279551 -132509 -199576 -80814 36209 181599 219069
23945 219069 228564 296616 137302 -166045 -123821 110447 183645 -134997 -114468 -92216 -266674
23934 -266674 -158539 218256 264774 226293 60268 -41572 -441237 -400626 -144218 -11146
23924 -11146 30825 -75229 -288728 -400361 -476600 -463531 -332311 -137551 -110508 135091
23914 135091 83576 -63300 -324307 -304226 -348917 -523956 -482861 -258558 -180272 61478
23904 61478 81314 3809 -44133 -119225 -14924 -62891 -40424 196224 305071 238902 94654
23893 94654 -42982 -100663 -65520 -106733 -99913 67445 218733 216092 -34886 -213265 -46700
23882 -46700 189564 165182 43592 187491 247608 182976 147909 166674 70182 102978 25460
23871 25460 34868 -137607 104852 341369 189518 77238 170501 181985 -101259 -188261 -26994
23860 -26994 -67078 -159067 -187616 -7640 227411 156254 112102 -149518 -221369 43543 249813
23849 249813 183965 -48781 -44366 139426 133110 185276 121138 96566 -47673 -9050 184613
23838 184613 190409 216576 193409 367591 163361 -48772 -229538 -201129 -139746 -21529 -22227
23827 -22227 641 23093 110081 72156 -35247 -8544 -199641 -178254 -212474 -244386 -78413
23816 -78413 20650 93942 -20963 -190437 -138056 -70028 -10729 14902 245543 336684 452795
23805 452795 344813 273499 104492 -218846 -206994 92313 284732 201710 55853 92586
23795 92586 4277 -82887 -47783 151249 126504 11310 43953 67508 202333 123210 84928
23784 84928 16580 36015 -80227 118759 138637 -49802 -256368 -152433 -204828 -167190 61717
23773 61717 137753 222882 74929 4142 72614 271390 237861 51520 -27872 -38369 19536
23762 19536 36643 72711 104765 178004 -22393 -144302 -196092 -10325 114367 82666 288854
23751 288854 466080 453650 430183 435151 66049 -18184 -6097 13436 53570 232858 200690
23740 200690 113992 111416 137674 121935 119338 23724 -44596 -416352 -418565 -364092 -172664 73195
23728 73195 69469 -28438 95840 120535 169632 59466 -176547 -180603 -35018 280789 129598
23717 129598 -68171 -321225 -437934 -565986 -615143 -410688 -111050 -4770 -53722 -110314
23707 -110314 -199923 -319284 -332578 -498911 -440236 -386684 -382920 -333531 -261602 -169646 110638
23696 110638 -46348 -247799 -325707 -369911 -106701 46782 -5824 -129032 105234 137942
23686 137942 48999 -105727 -186862 -279611 -113473 -22566 49769 111083 182928 150661 207492
23675 207492 221339 239491 185882 17289 26344 45321 -7040 126971 285005 214377 159233
23664 159233 124735 -20509 -83702 28880 179310 153390 121525 296862 197942 281177 240244
23653 240244 273572 428178 305949 64831 103985 -109022 -160179 -10186 136005 37901
23643 37901 -45360 48905 306257 148217 4847 33484 -49099 -27510 -34615 45083 137948
23632 137948 241802 203563 138925 -12087 124413 194006 243128 308161 247814 9930 -124095
23621 -124095 -58789 134672 306870 438223 392025 264914 350326 448041 441952 305319 160466
23610 160466 7672 -168675 -178728 -21365 -13777 -240744 -187591 218717 402532 311513
23600 311513 379579 342135 28224 143196 244990 296438 56995 82009 102241 174209 108581
23589 108581 -41491 -284703 -396889 -489380 -286808 -1900 254139 208193 258929 399123
23579 399123 301426 272825 222458 106996 -60306 -153326 -198251 26519 -196190 -170209 -103835
23568 -103835 -134173 -28009 64749 108271 25277 80529 -12743 -81221 51085 73924 57579
23557 57579 101900 62412 27120 -56984 -154367 85499 386080 236981 65643 -26022 20190
23546 20190 3458 228468 356271 114458 72202 24728 129605 195275 201076 272755 90800
23535 90800 -245272 -171332 27151 373457 473312 344992 224872 308032 265947 229138 282745
23524 282745 189527 283660 322772 216362 84928 182224 235522 99385 2411 -29682 42476
23513 42476 209525 64409 143463 308790 323666 214306 108932 199246 9989 -85152
23503 -85152 -57074 80209 106135 77892 149794 69958 77232 225642 113171 158157 206219
23492 206219 371205 273650 99184 134723 313621 184594 54727 25136 -95015 -20361
23482 -20361 98472 218845 153207 153809 57206 -342 102335 314059 465700 310400 262970
23471 262970 204513 321173 292659 127374 36551 -145427 -55767 -64979 -99428 -200529 35652
23460 35652 52613 -6659 -50210 -16731 122793 99126 156886 83526 -93635 -184695 -27528
23449 -27528 19077 -110996 26195 208967 193348 147878 26369 -150423 -136235 -196172 -95644
23438 -95644 -234628 -243233 -153525 -312025 -189179 -192700 -94389 -138813 -101817 36590 73090
23427 73090 43657 1508 65667 129792 16493 -281365 -249902 -50268 820 34525 193787
23416 193787 219968 56296 -242905 -393359 -274395 -196566 -46902 217034 116249 97057
23406 97057 109146 -19559 -135177 42999 156406 197717 304984 178960 80320 135987
23396 135987 3375 -47935 -111290 158216 98592 -69670 -121252 -13273 241227 449832
23386 449832 215141 -63977 -188689 -96512 85995 157929 -98651 -58438 -139460 -157801
23376 -157801 -129710 -118406 -279392 -428265 -472926 -408027 -173403 -181324 -182436 -205917 -248046
23365 -248046 -310242 -234454 -130527 -312998 -273000 43478 175596 72368 -211586 -77071
23355 -77071 115410 264721 290829 93511 111532 95995 -75849 -93267 -129934 18615 56603
23344 56603 80339 39516 -245591 -355795 -161529 -210231 -399249 -98056 90094 68091
23334 68091 -274460 -319223 -134212 104453 290374 284307 160633 166128 199421 253335 153587
23323 153587 -3120 227909 210670 38488 78999 107325 -60635 -174886 -203312 -41447
23313 -41447 216552 150752 70763 95401 -79055 -120109 -112619 -84956 -157060 -231008 -175499
23302 -175499 -139695 -202 33772 -192940 -413562 -305808 -153945 -294406 -502897 -374002
23292 -374002 -182829 2278 4451 -44597 93843 168920 269636 370342 309495 220851 88673
23281 88673 144710 -10527 -118905 14165 122758 204367 288321 198256 -10050 171596
23271 171596 284241 243988 231913 175130 138231 110895 57537 25207 62968 254875 248656
23260 248656 25695 -222524 -192310 -80884 35303 234981 230158 64054 -59506 -73886
23250 -73886 -80100 -146117 -251933 -291356 -339775 -262440 -81240 55994 114283 119065 123867 -22762
23238 -22762 -238213 -338465 -361152 -96380 125505 4180 -132520 -8215 21779 78481
23228 78481 124426 83707 145391 -58041 -220731 -137156 105696 15894 -32206 40541 18811
23217 18811 87350 159039 85844 287323 159636 7010 -114107 -57335 -48069 16321 -13385
23206 -13385 -8869 169500 214887 83062 -24038 -94106 15433 -8407 -29792 32439 155423
23195 155423 175871 172844 173102 46096 77075 164953 273284 130347 -252608 -104466 145851
23184 145851 250725 180142 28320 -43489 -84620 -31827 -111361 -217715 -218935 -310917 -227874
23173 -227874 -209883 -172749 -22712 -26563 4877 24265 9081 96924 134014 176546 -13540
23162 -13540 -131492 -269037 -364194 -239129 40066 20851 -139809 -43420 207978 489010
23152 489010 450396 289788 46153 -19740 -16504 -171073 -211750 -29977 100140 151386 92317
23141 92317 -112968 -222265 -187758 84453 49310 13230 230865 170236 -94607 -32896 -33459
23130 -33459 -120006 -109491 -123328 22297 38205 22032 79993 365113 287794 -83550 -189038
23119 -189038 -74834 -92357 -140199 -132066 -269980 -196090 57015 -167812 -206009 -148492 24392
23108 24392 138458 245120 235864 115894 168516 271854 216261 309130 236109 146846 108765
23097 108765 240896 19247 -6446 202437 -63996 2614 209211 299388 209405 178623
23087 178623 -10493 -238395 -153179 -45883 66970 111725 -23999 56343 108870 31200
23077 31200 -111507 -230740 -103522 20240 -158553 -100619 -157182 -480668 -557107 -402785
23067 -402785 -368698 -377365 -293741 -121820 -66836 1389 145921 193316 250768 11502 -154744
23056 -154744 -58888 171405 339725 463315 449822 320969 175348 192282 249706 253275 53391
23045 53391 -44259 -163366 -48888 -27960 -189461 -219672 -126920 -137393 -34847 79340 -151481
23034 -151481 -214396 -263395 -356486 -154509 259319 159305 70000 39542 179351 217027 135534
23023 135534 141087 117074 204657 255512 127979 39083 236727 242551 210415 35551 92059
23012 92059 141151 163986 47159 13279 -268684 -527605 -454031 -301126 -205793 45257 324067
23001 324067 218464 52385 -252289 -181011 -119832 -284378 -374958 -328052 -189396 -95400
22991 -95400 -56059 -72228 -172559 -161774 -194979 -161627 -49822 -166175 -376130 -244634 -365696
22980 -365696 -445143 -237663 -50879 8620 28113 -28793 6020 -61689 -304938 -402619 -358354
22969 -358354 -76044 41952 191854 255629 68263 -84731 -66959 -174890 -95081 69411
22959 69411 59051 -101155 -159031 -239929 -233953 -173062 77383 273240 200048 315536 58693
22948 58693 -130918 -51075 -67750 -82964 -21406 -183102 -242198 -50485 252843 140236 -10180
22937 -10180 45417 38704 66910 303853 253691 177450 153517 275806 271697 223848 144325 -4184
22925 -4184 172957 121112 -44565 -44783 -197630 -409164 -371228 -93863 -121203 -89994 -27157
22914 -27157 -184373 -252741 -211358 -94242 -49643 44482 -115604 -229339 -200445 -230860 -334698
22903 -334698 -217994 -32847 -147058 -186924 38231 141006 232738 188077 -2319 -58325
22893 -58325 -144028 -111894 -213698 -255066 -331257 -76257 64987 -105236 -134345 -238791 -66501
22882 -66501 -184015 -232765 -65049 222154 267904 154394 78955 43752 264559 233815 460105
22871 460105 530745 464895 114326 27205 -6181 65384 85393 203342 53228 -114852 -11853
22860 -11853 -150459 -368155 -162281 -5440 8682 14444 132154 310182 214064 -4852
22850 -4852 -28637 65751 177828 269400 185222 151487 122877 42147 165281 193986 98863
22839 98863 58250 251066 645209 627310 351246 69838 107754 340179 374209 279839 37868
22828 37868 -260008 -176914 77624 63314 -96692 -118226 -252899 -192792 -170656 89260 133750
22817 133750 99849 -76992 -146499 -193949 -312156 -259261 -189099 -123343 -183049 -39712 110755
22806 110755 195707 191481 284411 144740 84705 -80063 -152456 -162057 -322754 -246905 -63050
22795 -63050 102091 36400 141531 105630 237119 159638 18127 5311 78493 5431 10101
22784 10101 -21974 -13829 -126736 -253371 -42655 -212431 -234794 -164455 -34061 -190100 -256420
22773 -256420 -255519 -314531 -444139 -379313 -209553 -289628 -360626 -61542 -46886 -50595 147118
22762 147118 49668 -125602 -229051 -333033 -212912 -13955 72392 42346 142387 134160
22752 134160 239193 207775 52161 -158316 -143453 -55455 175239 226210 139719 147550 152829
22741 152829 250465 75639 -132701 -120731 -160864 65133 139631 23358 -23933 -30334 -93196
22730 -93196 -93765 -46380 9912 -23970 -30942 -197352 -181912 -4607 8654 78862 302612 286166
22718 286166 315 -279503 -224161 -116568 -265070 -359256 -276077 -79893 -27182 -26800 -196366
22707 -196366 -29569 136485 168972 109839 157973 -71662 -286247 -394569 -489814 -549513
22697 -549513 -384023 67786 203006 36606 -149061 -180526 -246190 -324981 -333949 -152329
22687 -152329 -197559 -141745 -222052 -241985 -176191 28994 -4483 -115175 38252 106562 48097
22676 48097 270207 308270 285676 133916 137855 114989 -166969 55113 316529 199162 -44208
22665 -44208 68182 4122 -154808 9223 47808 172691 353463 201028 71286 41504
22655 41504 176330 149688 -1783 10274 -51324 -117011 -225276 -189229 -128362 5791 312107
22644 312107 287542 223896 178096 23647 -58506 -146159 -133694 44680 422082 544713 435112
22633 435112 389122 188375 146354 94183 61078 122210 70270 31058 99866 167174 326228
22622 326228 504467 282318 118119 212481 218470 -51397 -83637 -217164 -353019 -224527
22612 -224527 -123637 -225790 -360678 -287064 -382447 -464845 -614531 -484986 -207166 109319
22602 109319 119731 73365 125751 222730 -4267 156383 75726 44800 76417 -204887 -165712
22591 -165712 -5431 -85297 -135024 -155209 -168269 16246 70947 68759 -116854 -191082 -328490
22580 -328490 -302927 -294915 -233553 -237139 -481520 -373892 -187036 -222625 -244734 -294924 -101524
22569 -101524 19362 188523 280509 267169 492623 393905 94411 -216651 -278862 -265947
22559 -265947 -146878 -133542 176217 228927 223207 2389 -214081 -121731 -77691 -126040 -186667
22548 -186667 -178192 -189134 -324039 -324840 -223827 -28252 11556 253166 280202 258884 208118
22537 208118 193313 284182 489728 614414 453146 101137 -131485 16967 198090 110530
22527 110530 15452 93535 156707 228545 189452 343055 372196 292412 420772 231991 130462
22516 130462 248954 335270 215573 100947 198233 426333 371755 354789 320539 278287 15866
22505 15866 -142782 -50218 -106481 -146298 -242402 -173264 -314376 -206976 -261108 -250723 -131322
22494 -131322 -76221 128024 245057 170293 144605 203558 312323 275620 113373 107809 242218
22483 242218 439781 332391 244330 238069 141514 157376 357274 279477 162536 250148 317260
22472 317260 443354 341057 249347 156988 228891 309177 222175 282567 189557 -85523 -71312
22461 -71312 -28579 6671 38566 249606 149409 -114330 -248890 -165557 -71459 -33430 53705
22450 53705 66634 169497 -131864 -357003 -234845 93455 -2414 -228283 -197090 -9633
22440 -9633 6834 -94908 -188825 -290379 13711 116872 346002 425327 194624 102775 105107
22429 105107 -157920 -274594 -209275 -97670 -27740 9334 -87917 -106043 -104399 -175673 -257863
22418 -257863 -150503 -73537 176599 99587 -119676 -127622 -140134 69549 19300 -90662 -321040
22407 -321040 -314302 -286735 -267414 -208362 -156883 -143836 -110452 92621 251640 380611 301537
22396 301537 104906 -11423 -103459 -276009 -394204 -315521 -197483 -120155 -166840 -193355
22386 -193355 -202909 -60412 77743 -97309 -130139 -38238 152736 61991 -76581 -45575 147372
22375 147372 13003 -58501 -12221 20516 -148959 -444482 -256746 -95346 -285487 -319477
22365 -319477 -403098 -471030 -578259 -488362 -334177 -342622 -190045 93136 52351 39321 3861
22354 3861 -22363 243585 340004 344744 88406 -363073 -304251 -144450 -155946 -309699 -309901
22343 -309901 -346403 -303684 -246664 -364555 -376841 -278650 -112799 -148125 -114712 -218045 -203350
22332 -203350 -109280 -64647 -78734 -129983 16876 112569 -176251 -337182 -162046 -100312 -123962
22321 -123962 -191158 -303801 -184729 -86832 -158219 -103172 -2806 85389 -57247 -193490
22311 -193490 -280178 -206680 -235088 -208286 12767 151838 185094 299543 170336 141127 74827
22300 74827 111108 184865 56590 65969 102412 75474 369615 417843 126842 3364 8711
22289 8711 39310 225417 269331 279207 422778 391377 410385 260537 51708 41055 174527
22278 174527 164673 103139 20108 -161796 -226519 -283697 -396933 -367152 -390417 -287165 -6903
22267 -6903 -24961 114892 111675 42639 23536 134423 36615 -32820 141789 98952 108066 65499
22255 65499 -50320 -128717 -291379 -414220 -138730 234512 123588 -4577 36724 129737
22245 129737 311877 237084 -16482 -212133 36589 104735 84797 -3157 181004 144350
22235 144350 232012 134546 78060 -166955 -221304 -221059 -170494 -55350 -35616 -319454 -539623
22224 -539623 -370362 -183892 -282054 -293208 -130154 -130523 -73596 -142499 71279 266882 216754
22213 216754 20073 -69817 -56308 -52103 12255 -163826 -78822 96606 232608 -1049 -104346
22202 -104346 47621 125080 -24442 -84178 -32647 3861 -46742 -206259 -324970 -322927 -142562
22191 -142562 -243408 -246349 -387495 -383846 -305340 -298795 -383802 -237128 -199031 -233478 -134050
22180 -134050 -14508 63005 -112057 -61307 151499 341091 314926 216753 53343 -202800
22170 -202800 -148220 155190 356258 167226 -83976 -35956 83313 160497 136486 -86326
22160 -86326 -94037 -113103 35385 110885 196067 168810 260641 327303 399282 413403 611148
22149 611148 461295 129852 -186755 -183278 87824 99516 -48467 34741 176302 378102
22139 378102 358597 293449 212494 110315 103707 185036 140682 24670 31630 -126044 -113053
22128 -113053 153197 134739 8239 134927 139315 -84627 -290889 -401830 -192281 -58861
22118 -58861 -180532 -370789 -138394 69929 174749 128970 156459 188036 43943 12553
22108 12553 -58816 231224 466266 492503 429321 434620 290545 352577 284927 135256 -51170
22097 -51170 12305 136348 120126 172570 44311 25792 -20381 -176700 -19535 59413 -62648
22086 -62648 -121462 15366 35509 71240 91660 44072 186414 227560 96137 119564 376963
22075 376963 326049 151655 71621 79491 22708 -142160 -128464 -27920 1544 -27388 -5297
22064 -5297 -38321 -172475 -153476 -109438 94260 105084 83249 150807 -186584 -302351 -329331
22053 -329331 -428167 -348962 -320473 -49991 82069 -84458 -274527 -304634 -270746 -84154
22043 -84154 10800 20315 -144825 -140890 -13686 52031 66657 53869 -95756 -135269 -247951
22032 -247951 -98033 3920 12755 84006 19078 -53946 46912 250416 277112 149399 35324
22021 35324 216485 200671 81209 -2544 -134236 -108692 53292 173572 171149 184936 260264
22010 260264 105961 63812 12444 -152520 -300114 -422819 -417272 -372727 -222476 -39820
22000 -39820 -134445 -107592 -18795 -186847 -316981 -267183 -462732 -390293 -198678 -27616 101248
21989 101248 -19467 -165423 -102691 -18172 -126905 -224403 -153814 -3487 -49686 88617
21979 88617 54528 61274 16262 -226798 -174438 -301975 -303917 -316531 -483647 -235344 -66417
21968 -66417 -160184 -340892 -202764 -152741 -237363 -78138 102276 -100207 -379214 -379986 -409665
21957 -409665 -544000 -459160 -353996 -593968 -456119 -366541 -33441 9016 -68104 -243645
21947 -243645 -321779 -106369 116741 135097 89720 111237 77188 74186 110982 -60578 -229309
21936 -229309 -198166 -88873 -164239 8095 -4044 -55215 -133433 -286893 22953 165258
21926 165258 122195 100702 -71077 -40866 -43001 -87279 -226976 -73972 217757 323574 101025
21915 101025 -94275 -17864 -37968 23140 150475 182382 242579 355435 213933 31468
21905 31468 31391 196316 -57528 -49357 225120 195651 184373 69920 -78919 -150421 -296558
21894 -296558 -397410 -438900 -307893 -113929 106703 237012 105117 -79802 -49852 55052
21884 55052 64963 67457 -62703 -280876 -441380 -426987 -365661 -447076 -235587 81974 -90999
21873 -90999 -237904 -178912 -68578 -41355 68782 -53118 -51931 -57001 30321 -118026 -205299
21862 -205299 -137349 -127673 -212609 -160959 -133257 -135172 -175368 -375149 -425374 -484998 -470627 -401889
21850 -401889 -327691 -396377 -375660 -338338 -209671 -209546 -61730 109450 124194 35439 83143
21839 83143 99366 15607 372843 367487 135674 40200 -8176 60660 227389 291580 125490
21828 125490 -36367 33723 63450 116707 52786 -47757 -181540 -306912 -328491 -263109 -154957
21817 -154957 -83237 -30962 68706 185420 80217 72792 188822 151058 149296 338184 309021
21806 309021 203973 35272 -177801 -151805 109694 247713 272561 -50069 -161862 -86046
21796 -86046 -56750 -14702 -40508 -5497 38268 67139 43395 82829 66584 -44251 156627
21785 156627 38232 38047 141341 196123 119028 82493 -144766 -274663 -349900 -251849 -215744
21774 -215744 -230982 -199980 -57310 -66151 -33671 27019 149336 69851 105780 98817 150537
21763 150537 135796 -77657 -33037 172341 76325 -65371 -32978 -107064 -197701 -202128 -296566
21752 -296566 -259282 -232003 -246251 -211829 79423 158570 48830 -40953 -35061 -123291 2076
21741 2076 81720 70564 45124 -62533 -97896 -80593 -71638 124306 159948 140232 39681
21730 39681 71203 66789 40387 207975 204323 284933 273293 252816 300780 195923 -7955
21719 -7955 -114850 -371711 -441866 -459146 -256531 -167183 -7644 -61446 -178484 -199207 -324833
21708 -324833 -339066 -169922 121498 254102 -20670 -33660 -80745 -74545 35671 79154 -102142
21697 -102142 -244684 -68018 35885 -187412 -288918 -230930 -123756 -42385 -91042 -237763
21687 -237763 -80861 -36197 -223417 -117735 190249 289335 117443 168944 272247 145813
21677 145813 12544 -103425 -267458 -217177 -146154 -117704 64479 124115 236617 389741
21667 389741 264952 198399 101844 169611 84844 -65888 42090 -59081 -81175 21608
21657 21608 155318 79152 215991 204210 71450 118393 287513 255789 196146 -26955 -73005
21646 -73005 -162447 -62543 -64723 -413473 -540245 -383956 -320949 -149394 -25581 93901 135705
21635 135705 154240 205174 202178 256120 270218 293233 88750 2262 111858 177697 123291
21624 123291 66919 36537 -21178 35732 171098 -60787 -140973 -203641 -516262 -314250 -101005
21613 -101005 -33634 68074 120111 187751 90134 -61422 -245135 -11748 323250 361747
21603 361747 248460 36437 -49061 -225990 -146983 -149847 16900 284467 398268 324471
21593 324471 263864 106529 -53050 -189330 -230638 -348869 -272650 -226612 -180439 -121075 -129597
21582 -129597 -120333 18146 136295 26028 -112912 -167148 -96058 69870 159783 -34343
21572 -34343 -119638 78449 150848 12980 -115318 -205919 -330244 -348700 -316573 -260637 -53651
21561 -53651 -98154 -184780 -219659 -134069 -185692 -74668 80822 269298 196307 143919 -57973
21550 -57973 -149929 -132525 -95034 29431 -33023 -70026 -90389 -194507 -201517 -42293 -48262
21539 -48262 82233 -46682 -34620 -112635 -115074 -38215 73859 -69511 -126539 -372935 -274522
21528 -274522 -131272 75631 187067 83275 119560 189742 291311 351315 235298 189691
21518 189691 283658 462494 452742 310631 146972 144092 129457 -201218 -228980 -107806 -60026
21507 -60026 10388 54844 -2206 56194 -49018 -109787 -57251 -172708 -340246 -119047 37288
21496 37288 -221087 -254056 -10932 -964 -213370 -382903 -189472 109637 170978 178205 10733
21485 10733 -67016 -220319 -109932 -176401 -106229 131089 312134 331797 333648 204112 70707
21474 70707 13646 -29805 -25390 -88327 -21179 13601 27725 85925 -31524 -177796 -179138 -112893
21462 -112893 17396 -87730 54053 56639 1143 -136764 -193746 18728 214108 357232
21452 357232 279827 126789 -39974 -77717 -82301 -150163 -195932 -131239 51249 267958 387755
21441 387755 299416 164558 148610 102339 254950 368000 306187 407638 486121 418138 337613
21430 337613 326246 217181 292462 258932 230772 353013 303780 286736 195280 276900 343974
21419 343974 365745 290119 53516 130488 258215 231781 125931 91497 162151 313511 213393
21408 213393 139008 138493 18666 47013 -20204 -29521 -90696 83264 95409 -10660 -215169
21397 -215169 -160274 2131 47249 83637 44773 50481 12587 -6900 -90393 -194981 -170783
21386 -170783 -78587 -4978 80542 -49369 -30834 -47119 -147526 -383778 -649756 -361319
21376 -361319 -73573 49232 131303 263038 440358 373448 386365 288971 201485 110747 -54747
21365 -54747 -182016 -147204 -164621 -260548 -251823 -34971 143176 224472 121069 -83167 -91992
21354 -91992 -110753 -127231 -154141 -205012 -116442 39554 84348 184900 205046 -47773 -259505
21343 -259505 -277236 -196816 -48052 -110372 -324874 -412443 -266039 -209973 -323802 -288368 -137147
21332 -137147 -8579 -42815 -56191 4200 -124187 -310395 -336291 -203599 229983 367702
21322 367702 301344 61216 69753 32574 53447 23532 3947 347952 416050 141093 159181
21311 159181 370940 352869 224187 8753 175633 429881 325773 190005 30694 154929
21301 154929 110366 -11154 -234007 -216424 -236454 -252650 -195729 32045 64875 119495 130940
21290 130940 102848 103589 56243 -142301 -60541 -66855 -70738 48115 61854 -77212 -51408 64952
21278 64952 162158 48053 31326 98534 113159 191326 336028 269539 219114 269524 95554
21267 95554 -7604 -100350 -188816 -213590 -111413 -4646 17954 -147048 -76432 30730 64780
21256 64780 73910 153563 48132 -76277 4467 8008 61117 215102 153642 -94547 -262287
21245 -262287 -337573 -197432 -169052 -234549 -315072 -229630 -143430 -219700 -449406 -322931 -109285
21234 -109285 9743 -49387 -39185 7102 -140363 -117071 39377 -92600 -118496 -201689 -343469
21223 -343469 -332882 -85868 -34509 -203969 -433156 -525076 -445694 -310321 -163980 849
21213 849 91175 222901 242855 70446 2498 -87773 78589 79657 147580 19981 231854
21202 231854 242628 321 -61538 -58816 -46249 48375 -269747 -530324 -477398 -494986 -368311
21191 -368311 -183277 -36892 86435 60063 -76444 -13069 69952 -131970 -268402 -256417
21181 -256417 -80396 -67525 38362 55139 -81180 67998 333623 417156 423874 393382 220602
21170 220602 285173 186524 -85029 -161187 -49821 43471 248202 376081 286046 276152 238632
21159 238632 150904 -96075 -179173 -140212 -228091 -180437 -177280 -188228 -124471 31120 63783
21148 63783 8165 32259 -94404 -177305 -98232 -149709 -172060 -77258 -114476 -420160 -332930
21137 -332930 37117 114823 15853 112126 76934 -84661 -56441 263271 240273 -94087 -54882
21126 -54882 -194980 -247003 15095 162505 -4450 63493 19495 4178 -166266 -133059 125919
21115 125919 435596 350014 113114 18948 -65761 -166975 -262313 -43092 60973 7814
21105 7814 -125050 -127636 -350792 -557374 -359740 -109082 17217 -172526 -339187 -209644
21095 -209644 71080 91704 -76610 35549 15626 262953 497845 275521 267908 293651
21085 293651 111662 -32578 -48252 -105823 -119611 -116643 -24824 -38721 -100354 -211965 -535750
21074 -535750 -561732 -339148 -104144 -290554 -344048 -413884 -156903 136869 127275 49022 229344
21063 229344 97119 -98137 -241949 -316837 -174915 -72408 -112606 -184917 -393632 -337597
21053 -337597 -187362 -264453 -204923 -142789 84434 260863 291270 223604 184309 -3324 -132014
21042 -132014 141379 284962 292360 336754 214963 -54144 -101743 193028 16637 -188367
21032 -188367 -19997 137998 182357 333641 355817 -10965 -99834 41018 84983 304137
21022 304137 374327 318851 410408 252021 38824 -73030 -12526 -13555 139956 302681 265817
21011 265817 299997 135488 -25775 -95500 54735 -43972 -179837 -43946 156797 137078
21001 137078 -100875 32696 200338 295757 328609 273871 97737 -53920 -62720 52486
20991 52486 18589 7780 -61379 58068 29637 153128 80402 -164417 -116478 -166740 -223366
20980 -223366 -198137 -356867 -250081 -234347 -173256 17314 -33236 -197946 -243746 137529
20970 137529 105359 118406 187457 210172 268506 93904 -222286 -124141 10229 88100 270167
20959 270167 416476 372189 167027 -61971 -189842 -192061 -82842 62380 60531 188282
20949 188282 170880 219822 331221 162548 82500 187382 79955 -229775 -273328 -218155
20939 -218155 -147398 -13616 -58751 46745 135381 105696 29578 12113 -15983 -229341 -341124
20928 -341124 -331916 -256603 -52277 140591 335456 209959 88320 23732 30630 -59088 -117396
20917 -117396 112666 304406 158153 55644 -92050 -221559 -307990 -278251 -287311 -417906
20907 -417906 -417504 -333245 -154240 -190756 -217109 -232077 -153011 -53729 529 -133351 -157933
20896 -157933 -192278 -294019 -404024 -304726 -99706 -7989 -35568 104710 -2473 -24160
20886 -24160 110729 109970 25451 -144584 -65582 14885 -6669 -41337 135114 180309 233930
20875 233930 133971 207283 235207 314073 252106 192014 31826 -170983 -308022 -284382 -311037
20864 -311037 -148246 -13666 209813 169317 260669 139746 -94430 -199642 -161607 -71678
20854 -71678 56469 108222 -74453 -201338 -115616 -99615 -215647 -204168 -102699 -90392 -66002
20843 -66002 -147456 -117268 95421 131742 -39004 -9435 71828 13371 -53238 67966 22286
20832 22286 129746 98824 -47022 -27066 52460 48937 163634 20429 -204478 -358137 -178004
20821 -178004 -2051 65209 187692 -90805 -300461 -368424 -237781 -89154 -116198 -17463
20811 -17463 -111783 27094 -150901 -171509 70114 192476 305436 137394 -31085 125637
20801 125637 349920 277908 112442 -28352 -71294 -104160 -174129 -364853 -453629 -374605 -80762
20790 -80762 -11261 122623 -29419 -37379 23530 -159031 -214748 -211761 -184138 -264928 -328419
20779 -328419 -234540 -214782 -39736 189046 258440 410382 370606 221814 -39361 -159195
20769 -159195 -59060 567 -44273 -210596 -125240 -114764 -15795 188352 316132 363281 379652
20758 379652 314877 200815 203552 96328 -12813 6447 -9182 112539 181365 208485 197870
20747 197870 179738 -21609 -72492 26958 202608 100523 50639 -14721 106850 238421
20737 238421 187125 139298 58325 -179577 -208559 -266790 -384900 -507439 -408487 -118273 147235
20726 147235 179952 293088 300494 37690 102929 141828 203250 155659 50347 136049 31937
20715 31937 20421 257522 317728 157629 12165 192648 151200 -153046 -74303 -115641 -136702
20704 -136702 19050 84467 173750 -9446 -37172 -63710 -7833 -139395 -180303 -22654 206277
20693 206277 318342 23871 -269152 -259278 9496 78896 9858 28783 26426 104892 74984
20682 74984 3971 -111979 -83248 64468 63843 3330 79385 178229 -4418 7338 38210
20671 38210 37444 194165 214783 81453 95142 239110 351688 173949 -39555 -191779 -217153
20660 -217153 -252428 -247049 -322209 -327503 -449231 -495476 -280860 -240493 -177408 43454 136865
20649 136865 285169 20511 15108 33923 128693 279385 258699 231025 250975 169816 157543
20638 157543 351846 439842 381141 428595 302931 258619 40764 -71298 -106255 24675
20628 24675 134066 124719 194626 155618 46525 -148679 -124951 -42978 -17338 -85815 15307
20617 15307 30099 -87612 -21074 207235 250104 292090 128549 -39548 -88780 -177741 -158656
20606 -158656 -252510 -310909 -342991 -382453 -218498 -310900 -272702 -155780 -359480 -523310 -366058
20595 -366058 -338152 -139782 -45274 -60725 -155132 -359505 -429140 -440159 -298632 -177425 -242441
20584 -242441 -190531 -209372 -133459 -241110 -287304 -234750 -160641 -38334 -22737 85468 2476
20573 2476 -33815 37368 74248 316695 432942 487565 524459 449394 151246 -3608 -121393
20562 -121393 114465 346942 303328 217549 208759 49378 -22106 9698 118029 173871 118075
20551 118075 -59437 -372323 -406087 -227850 -36701 124906 124885 153633 137499 83161 42394
20540 42394 -186071 -166503 -108482 -72990 9087 75393 130522 26052 171037 142910 -11579
20529 -11579 -67624 -36101 -123108 67912 303880 172524 164816 211219 185901 -70203 -76308
20518 -76308 -107202 62723 27576 11648 9847 -77813 -159858 -77764 186753 216201 47883
20507 47883 -54367 -21966 4027 79784 86512 -17021 80559 214132 150449 4257 -89926
20496 -89926 -74176 -130484 -52986 -74379 -252283 -114587 68363 79081 -42000 -34905 -124267
20485 -124267 -140176 -204922 -220004 -171669 -163352 -35984 70436 224614 206013 190524 283759
20474 283759 178962 204139 138641 -112652 -135906 -120262 119410 -53073 -53565 20761 58269
20463 58269 192843 235138 63856 49900 -13563 -85482 -110793 -166080 -37689 29384 25923
20452 25923 -223858 -281029 -266025 -4854 -64786 -62868 -164313 -321944 -158320 -112400 31736
20441 31736 60396 120733 193489 289296 198803 179952 25459 -119745 97782 110399 135219
20430 135219 189500 169260 66976 68678 251068 397291 213255 -57270 80259 175378
20420 175378 -41138 -166363 -38614 59184 101682 113881 251021 194191 -48797 -179053
20410 -179053 -151885 -216861 -318471 -127122 59477 293935 283500 98555 9472 289840
20400 289840 270443 259268 -43911 -174721 -146359 -166255 -294349 -204013 -95565 4434 121053
20389 121053 205000 119301 108236 95273 -76062 -227062 -219488 -197718 -91216 -50682 60532
20378 60532 127699 101801 220433 247004 160657 321168 602275 516342 352647 345136 101677
20367 101677 -52098 -34816 -36323 1357 83911 -29590 -188293 14624 71050 -102068 -218452
20356 -218452 -283492 -270598 -101578 -55247 -84411 14680 231331 267129 76789 54625 45888
20345 45888 21403 -239138 -309824 -353934 -377862 -411235 -316850 -253170 -92616 63479 170222
20334 170222 -49763 -351539 -438583 -368250 17596 216577 168464 65972 188236 196723
20324 196723 124918 -32953 -66965 -41170 -45625 110678 270084 150143 41252 152510
20314 152510 236263 191575 154038 15336 44939 122481 43074 235527 280717 172965 61218
20303 61218 -29568 -62997 -127155 -19827 48336 -18165 -61280 -78118 40807 69099 92736
20292 92736 -106668 -288786 -139772 72556 138474 202254 226239 230190 197599 5787 20326
20281 20326 75184 -20730 131814 160831 220634 89589 -70146 -54897 -77150 84930 121500
20270 121500 27384 -43434 -11938 64151 399313 356096 287627 198599 172599 251841 78667
20259 78667 59163 37050 170807 49231 -139335 62281 65700 -3875 164130 210099 94413
20248 94413 158521 236557 -3803 -80418 -163892 -92616 107629 129649 54572 97350 67854
20237 67854 32199 -145704 -230667 -353212 -341526 -184987 -90786 -103538 -44136 265841 115352
20226 115352 -59858 13916 5119 97554 86526 -10541 -36806 110168 20145 27394 58284
20215 58284 188236 99100 -104525 -277588 -164503 82328 112445 114065 253190 236904 79575
20204 79575 -25467 -85146 177 58076 -7492 -127717 21741 201588 195362 53623 -88351
20193 -88351 -81157 23808 13557 18573 51687 -42781 -221773 -177950 -211579 4733 -195174
20182 -195174 -486700 -580911 -409403 -201468 -217103 -195647 -161276 73037 51858 -20928 -39041
20171 -39041 -119938 -12185 181642 297802 191505 -167207 -273380 -172261 -25130 14591
20161 14591 100354 300069 190336 93027 90190 -177484 -361791 -227900 -143730 82591 236071
20150 236071 168307 246432 375801 365439 189689 167664 228132 79127 8030 17093 -92135
20139 -92135 -12121 30432 -184133 25457 -117230 -193970 -157584 -101452 -71248 3907 19939
20128 19939 246951 308388 296159 164165 -132692 -48335 -113089 -28251 82799 -71644 -296796
20117 -296796 -134037 186497 89700 -24355 196201 43246 55114 182490 83048 -85378
20107 -85378 -67810 95966 256505 182384 159607 223687 -18908 -104107 59163 33483 -110609
20096 -110609 -239330 -54897 53833 106446 -160156 -442287 -186245 -19668 -82638 -169929
20086 -169929 334 170702 59334 -96064 24233 96087 67646 10855 67542 39306
20076 39306 61727 -122199 -238666 -145357 -84846 -46415 26810 29083 -112027 -141923 -143729
20065 -143729 -25288 26137 58807 170225 243313 324643 436693 368818 305275 216533 83019
20054 83019 121371 153511 3926 50 -152049 -252147 -320701 -106972 269300 155376 -105073
20043 -105073 -109558 201508 288800 213024 21551 63407 341878 502546 327018 471952
20033 471952 338491 160885 11273 136145 424172 459541 265976 129546 94038 168106
20023 168106 250082 398698 576690 509386 613063 538793 418949 270292 217683 63531
20013 63531 87315 11115 -3494 -32944 23642 -71522 -224004 -26889 239751 304143 226355
20002 226355 281797 274253 99 -96696 54780 129140 53874 93018 -34188 102123 60367
19991 60367 111969 81212 54946 65455 174277 435218 398192 172196 37013 37522 70421
19980 70421 119236 -9940 -65242 61343 253600 222842 120865 292234 355511 353976 398400
19969 398400 164311 176978 375553 445187 487179 746878 956920 1038805 859550 718451
19959 718451 504489 470696 418583 357493 502129 628867 565344 821626 1033112 1140275
19949 1140275 947355 854456 791792 832857 1067681 1109554 980682 585058 372268 402899
19939 402899 500322 582879 436162 412411 475273 418398 325820 286969 139634 206628 298533
19928 298533 187299 147197 241832 383825 457582 495354 215353 295103 477741 380481 511172
19917 511172 354740 38563 -39241 85335 351203 424047 352862 606371 794796 1068768
19907 1068768 1087726 1233358 1280398 1145719 891393 990805 1128845 1099102 1092361 1014035 1123659
19896 1123659 1055793 990375 952319 852907 781547 683786 382810 107567 38341 96311 162491
19885 162491 277545 163744 120375 219465 288415 203506 100279 204307 429372 336651
19875 336651 343427 379298 536138 584026 507793 472660 320405 262173 232962 137532 139982
19864 139982 372037 514110 206586 44254 160012 138516 201693 269385 194629 255523
19854 255523 303209 251497 205964 203001 112572 114016 110337 66610 176118 -14138 11525 188429
19842 188429 147531 131973 -51472 -316046 -335483 -172444 -111588 -55829 81107 293207
19832 293207 494142 305971 429032 431816 287058 212347 181692 407559 446315 256844
19822 256844 130974 244458 82661 -150498 -155484 -98575 252131 450739 502001 500081 669108
19811 669108 633159 600378 563528 397648 356608 285173 370435 474903 299575 347220 540450
19800 540450 654656 919956 1163122 1313833 1036056 924716 626546 328005 279671 446286
19790 446286 430801 362889 263906 206613 296944 375786 297644 532706 667830 676721 775834
19779 775834 948898 1214980 1322288 1207189 890311 375299 106531 398763 498429 431919
19769 431919 304371 54628 38828 406467 549747 408016 96213 -263988 -193099 -29400
19759 -29400 134527 88922 148367 218955 267294 408277 347314 220643 86502 18344 -12065
19748 -12065 34089 35886 156265 240985 273511 234599 133505 221412 154049 249777 356348
19737 356348 337862 384734 453093 274457 188411 288533 542599 564645 460300 303777
19727 303777 327024 359907 277631 205560 189288 198873 312505 299960 389170 243085 201735
19716 201735 330578 423952 473732 398772 277168 183364 313147 337227 486346 482168 343758
19705 343758 230199 31643 186360 61386 80264 140170 24079 67585 294201 376855
19695 376855 330908 324297 454343 570391 556297 369601 431315 434247 189112 386168 561014
19684 561014 626888 374843 186713 42592 -31764 -61868 -37175 150964 96931 209768
19674 209768 218596 188661 196226 394376 415519 258573 179410 234299 365763 406879 377382
19663 377382 341218 327287 260550 189550 277669 330723 204267 203230 254414 463512 579871
19652 579871 634192 500547 465307 529300 447556 263420 220213 218633 457461 624906 562368
19641 562368 430145 468754 411606 625934 754751 703775 689228 595949 339195 208327
19631 208327 422922 388600 232971 215185 308134 345099 409633 340027 162089 129813 198091
19620 198091 406042 611837 559693 519595 524575 528261 593993 527656 381187 595444 416645
19609 416645 183645 158767 293047 520719 500540 383428 299437 220021 196579 185737 180732
19598 180732 347286 390819 407922 527476 583571 392617 202882 238998 324267 336492 345118
19587 345118 484472 557472 470729 245374 212296 313245 359336 340251 161199 -57098
19577 -57098 109653 262863 433126 565731 454762 370921 456012 554954 691084 749764
19567 749764 807867 1045110 1004772 1011898 1073082 1078585 936221 692359 505307 482957 598887
19556 598887 699949 571545 517331 675402 742924 649871 647417 646252 648146 652286 770096
19545 770096 729001 702058 809374 1034171 975387 593738 630713 627490 635464 735123 782596
19534 782596 776673 951306 1022407 1103510 1124719 1004397 902491 864988 844256 767855 951569
19523 951569 1025675 808586 797432 693485 720347 939265 1058310 1149534 1087168 1181762 1277577
19512 1277577 1352972 1460558 1509748 1296026 1073346 975908 932259 1133436 1085910 935597
19502 935597 933868 1043501 1357879 1495687 1375315 1186997 1080251 986805 1125618 1206558
19492 1206558 1382554 1333152 1476941 1718324 1569871 1576426 1592990 1583283 1897532 2227001
19482 2227001 2209038 2337610 2384753 2501413 2839612 3061580 2986182 3125654 3163247 3308611
19472 3308611 3539241 3748361 4018654 4479253 5115453 5894984 6225548 6386001 6624477
19463 6624477 7022775 7468876 7807925 8640426 9750760 11013441 12508623 14389463 17008312
19454 17008312 20280628 24417019 29813889 36457031 43531187 47857857 48384519 48319224
19446 48319224 51288187 59196109 72989775 94891908 127532061 173043388 224598536
19439 224598536 260229244 261230258 239206855 216278481 194170025 165930175 133949434
19432 133949434 107303522 90827135 84674178 86852142 94440444 101010938 98683343 85680382
19424 85680382 68220226 52493367 40920079 33218746 28252588 25256690 23441953 22372544
19416 22372544 21852067 21761790 21972451 22556844 23282166 23500811 23421209 22910239 22865978 23575712
19406 23575712 24862356 26800611 29592325 33474359 39173301 47026905 57749279 72703548
19398 72703548 90754031 106335075 112158990 106613768 97067145 91800168 94935678 108351183
19390 108351183 134075681 171954702 216632443 256459029 286043653 311877648 327546142
19383 327546142 308766982 252703501 187462921 134575239 99686535 79645570 69897711
19376 69897711 66796385 67748447 68719687 64713728 55606753 45042853 36012735 29273511
19368 29273511 24438490 21054763 18566617 16574837 15023866 13975036 13064663 12244767
19360 12244767 11820242 11592268 11425110 11119283 10500772 9833720 8979402 8129243 7384147
19351 7384147 6853323 6418364 5945186 5644072 5333629 5146516 5040562 4778619 4728950 4764199
19341 4764199 4647352 4447292 4127532 3748818 3559448 3437094 3398721 3361257 3263469 3325778
19331 3325778 3396222 3329272 3211047 3063788 2956401 2772114 2469453 2476331 2321611 2179713
19321 2179713 2107661 2120361 2205400 2287480 2395385 2281053 2189549 2320168 2254404 2087422
19311 2087422 2284701 2313337 2139177 1942804 1747381 1785555 1864428 1770830 1681187 1353932
19301 1353932 1290331 1376175 1345240 1358460 1500203 1429141 1326502 1441306 1282404 1122700
19291 1122700 1245788 1277280 1279896 1360926 1424457 1450366 1414026 1415567 1438384 1547678 1640469
19280 1640469 1394836 1202778 1304431 1420583 1555070 1679331 1977622 1847272 1744295
19271 1744295 1719202 1788857 1855419 1735551 1764906 1860938 1861006 2015086 1956567 2060625 2118594
19260 2118594 2301587 2657295 3059610 3305236 3366907 3515712 3693212 3701460 3512799 3339819
19250 3339819 2956543 2619015 2733616 2808871 2859639 2885741 3049812 3167525 3428979 3627967
19240 3627967 3764488 4151440 4326825 4667647 4991853 5244139 5334534 5196014 5426766 5728379
19230 5728379 5784709 6026397 6141454 6518082 6890859 7477706 8230915 8850304 9768967 10885570
19220 10885570 12305446 14029705 16022086 18822391 22651324 28144207 35824420 46220426
19212 46220426 60241182 79218937 104472909 136812094 171613499 195575055 194150900
19205 194150900 167671922 131520101 99036538 74921304 59128072 49382682 43528335
19198 43528335 40243537 38882351 39386439 41676861 46240309 53839144 65208981 81531102
19190 81531102 103890927 133627843 168924709 199751455 209675093 190393240 153200378
19183 153200378 114576759 83931010 62700219 48331000 38771505 32099882 27184446
19176 27184446 23542953 20713941 18298919 16257064 14456005 12961586 11896502 10937291
19168 10937291 10124340 9428424 8757881 8211900 7849068 7592135 7507808 7498117 7356916 7291467
19158 7291467 7147186 7106450 6920930 6697424 6548021 6036387 5706431 5503751 5384624 5147018
19148 5147018 4832171 4483473 4156008 3841304 3758166 3663617 3823988 4040145 4450647 4930314
19138 4930314 4760098 4914664 5260346 5363146 5282025 5006336 4578457 3918978 3312496 2871765
19128 2871765 2589561 2367705 2249006 2172482 2448403 2492062 2256195 2057625 2191702 2308151
19118 2308151 2413230 2557797 2843385 3102555 3310586 3195577 3026986 2736316 2405240
19109 2405240 2038134 1752868 1688458 1855632 1713666 1686368 1551221 1179131 1151880 1431806
19099 1431806 1574912 1596788 1689586 1550571 1476733 1428101 1307549 991318 792149 758225
19089 758225 859995 1064333 1388947 1326943 1248247 1152864 1057713 962713 1114309 1072013 874077
19078 874077 926220 967984 943605 886128 1048283 1088923 947865 947611 908560 940086 1059973
19067 1059973 842251 643117 568837 658558 842991 840005 766706 1038574 1024876 1064389 1094447
19056 1094447 975251 702840 562067 576787 659799 608906 717934 501230 407637 582974
19046 582974 649003 467912 466423 502275 602381 612338 820996 908533 1125966 1545352 1586038
19035 1586038 1877149 1949437 1898751 1746716 1488976 1485184 1271182 1245086 1108675 1132621
19025 1132621 1153455 1152284 1205602 1255576 1227582 1097615 1259010 1407759 1556811 1778464
19015 1778464 1875309 1992097 1866799 1635704 1474711 1250290 1038714 1029537 786230 591861
19005 591861 599597 648092 820212 1032707 1209752 1130843 1113328 1083986 1015828 878377 620657
18994 620657 532712 636693 906433 1159682 1108884 958372 1001120 863755 882144 853392
18984 853392 910409 1032594 1031857 998001 1171019 1322638 1236873 1203203 1340087 1527849 1454138
18973 1454138 1377791 1433024 1559776 1512506 1436768 1492660 1677047 1681847 1527294 1459044 1668544
18962 1668544 1680770 1597381 1732039 1736228 1898882 1821243 1471672 1284220 1377345 1588590
18952 1588590 1945575 1912255 1827236 1780544 2059401 2115695 2135757 2302784 2329356 2272891 2255707
18941 2255707 2374976 2799984 2808085 2850548 2798927 2912406 3151845 3322782 3382030 3613903
18931 3613903 3929027 4343766 4893686 5690130 6622160 7446558 8326436 9019204 9605851
18922 9605851 10104033 10668607 11547967 12837962 14411876 16340372 18924552 21756397 25686925
18913 25686925 31017780 38279580 47905149 57805717 63754930 64374316 64463009 69007804
18905 69007804 80409673 100515727 131847778 178219048 240792989 304216017 335200155
18898 335200155 320299535 288564340 256150011 217707997 172942402 133905283 107287992
18891 107287992 93481254 90300379 95607694 106249545 114986785 112621777 97423538
18884 97423538 77467849 60180972 47628031 39198904 33860554 30365078 28280454 26712474
18876 26712474 25818694 25265525 24560489 23888432 23428274 23163806 22847923 22262246 21756346
18867 21756346 21762222 22400570 23582308 25798010 29270821 34300870 41124003 50516014 63539671
18858 63539671 79805439 95282474 101730873 96939907 88998684 85379990 90369952 105545516
18850 105545516 131887158 165942141 197939242 218512655 235746717 257585514 266357882
18843 266357882 238289450 184434817 132553204 94944973 71710518 59029879 52788353
18836 52788353 50999964 52076202 53179446 50196095 42860232 34814654 28306085 23571210
18828 23571210 20278608 17909591 16001117 14557280 13497320 12644059 11800371 11176166
18820 11176166 10798557 10474866 10089767 9537978 8725645 7739182 7075563 6603722 6224355
18811 6224355 5808494 5365007 5234524 5005612 4724582 4386450 4095122 3864787 3706387
18802 3706387 3532946 3359559 3397173 3354903 3070384 2767555 2548972 2476313 2456382 2438524
18792 2438524 2553743 2309961 2162875 2179759 2238395 2141465 2069819 1828307 1931565 2013824
18782 2013824 1913489 1796753 1830729 1840334 1587133 1576498 1846172 1870245 2258208 2519469
18772 2519469 2553038 2606817 2836086 3130125 3383620 3583281 3180638 2499017 1984527 1712793
18762 1712793 1557031 1526987 1381865 1255797 1051126 1025578 812362 705952 737895 624201
18752 624201 646917 717946 842153 761631 767307 709350 765472 1049626 1242834 1130277 1009850
18741 1009850 997769 1099733 1021691 1031545 1087276 813008 892345 1072313 1107676 997264 799127
18730 799127 634519 561682 495591 543333 459360 499352 620013 598210 552462 553999 630905
18719 630905 603160 446132 375824 244299 401416 461210 471575 254619 108513 62277
18709 62277 171879 269170 561056 694283 685279 573815 630558 769706 858444 990083 1053622
18698 1053622 776754 632721 705323 728202 753312 674167 595945 777037 752545 827057 939274
18687 939274 1008840 915640 1033780 1059231 854327 767467 837963 1058018 868490 357670
18677 357670 330836 497774 745842 649698 530407 535159 658459 513996 401696 163400
18667 163400 61237 184635 221184 335770 390506 334888 277922 166752 9282 73644
18657 73644 212757 275078 217671 79192 151347 271689 271609 336969 264710 160448 306038
18646 306038 375514 298780 154437 188124 194798 150994 269435 395558 201101 -45850 -132164
18635 -132164 -147757 -49443 246578 468225 354622 384654 375643 297497 164576 141419 334152
18624 334152 370614 535374 726539 614717 548313 637009 873781 910401 793743 575517
18614 575517 503868 645814 839185 1111380 1318988 1424362 1302308 1215143 1218577 1058402
18604 1058402 840742 605940 753537 730058 594813 448659 535191 656049 646829 582354
18594 582354 777066 967080 994659 1058963 1204218 1444253 1697671 1812138 1473385 967256
18584 967256 659771 600106 789156 978722 1232482 1188519 1097680 1113102 1156501 1129155 1012905
18573 1012905 1059965 1237033 1133571 1027605 947315 1032156 1202431 1123730 1093218 1155098
18563 1155098 999892 1081397 997185 1068542 1006585 1033326 1194574 1408295 1574361 1684087
18553 1684087 1559662 1401083 1242467 1263406 1172618 1182894 1393292 1649394 1800099 1752578
18543 1752578 1795274 1872540 1958067 1981209 1899649 1731987 1389438 1339719 1532271 1604830 1555953
18532 1555953 1567280 1523176 1686251 1716897 1753290 1871463 1755745 1357003 1118267 809098
18522 809098 776001 981354 1113243 1305798 1252962 1331259 1598527 1570256 1499314 1652701
18512 1652701 1607311 1612759 1592426 1605652 1598786 1414456 1368491 1473337 1659677 1887931 1882157
18501 1882157 1897396 1965540 2052965 2267907 2693483 2540751 2392973 2413991 2400531 2414410
18491 2414410 2345665 2296538 2079367 1761544 1770197 1706696 1696377 1627413 1639762 1804864 1959154
18480 1959154 1886531 1840917 1601593 1759344 2089326 2354782 2460034 2451801 2556350 2757472
18470 2757472 2622321 2423316 2702613 3199133 3622912 3852327 4063666 4290852 4503805
18461 4503805 4963444 5461568 6122511 6725926 7213351 7933589 8412556 8659130 8738945 8903250
18451 8903250 9605545 10505110 12003402 13993307 16564237 20613676 26392512 34795836
18443 34795836 46689915 63559145 87661126 122875484 171874978 225998925 256946061
18436 256946061 239287964 186956341 132011924 90697180 64648812 49586010 41074669
18429 41074669 36389352 33654066 32369615 32812920 35278330 40557225 49021194 61655732
18421 61655732 80202329 107831064 147902437 198617964 240865190 244178879 203305641
18414 203305641 147431791 100155636 68129692 48892507 37464708 30246838 25365940
18407 25365940 21895096 18995844 16644060 14795251 13254533 11808888 10863973 9998422
18399 9998422 9822037 9965808 10502217 11020587 10911624 10194997 8860592 7648712 6737057
18390 6737057 6171830 5728444 5328740 4928403 4351749 3997222 3822053 3658522 3545587
18381 3545587 3309124 3293580 3316936 3257695 3494839 3419983 3249685 3120082 3035249 2974097
18371 2974097 2945435 2840851 2994291 3183313 3273463 3567563 3793741 3809847 3684990 3204867
18361 3204867 2654667 2243800 2062502 1846684 1480008 1249373 1295238 1335696 1332206 1146767
18351 1146767 1138752 1181594 1228088 1271321 1180028 1120842 1174065 1281947 1307408 1320227 1083739
18340 1083739 820133 867305 1036206 1089975 904783 904749 1136913 1148645 1174961 1005627 849429
18329 849429 993330 1104088 1337928 1443728 1375799 1235830 1267865 1288266 1228703 1307564
18319 1307564 1277054 1398666 1486662 1514934 1404054 1179876 1121750 1131791 1205971 1498019
18309 1498019 1838219 2001443 1940348 1692855 1421749 1241892 842370 632934 495668 501811
18299 501811 790998 905865 842422 979294 1113153 1114951 909849 858435 1039852 1126688
18289 1126688 910102 789910 688746 333253 215265 98675 294553 442147 660936
18280 660936 779155 722073 815706 955197 978908 1011242 866128 740503 697581 588315
18270 588315 467717 390709 541563 716474 714320 529821 495130 461129 610458 573895 735210
18259 735210 691057 566651 620964 429635 244402 362998 196805 -15462 -54160 84398
18249 84398 191750 318802 108619 226087 321153 300817 454965 781970 967061 1140881
18239 1140881 1205856 1056205 1062809 1166767 1262143 1295502 1122007 1098086 1068904 1018144 1171148
18228 1171148 1117216 1106506 1030525 1026389 1074991 1065779 1055090 937792 930941 863096 748140
18217 748140 722022 468547 211575 114389 181848 187940 49471 63675 16652 119993 244738
18206 244738 282191 458313 434061 344401 387121 445414 335895 144445 31554 177183
18196 177183 187361 371932 449344 429472 514628 414455 501892 643849 662094 708557 693771
18185 693771 703392 828960 965844 1150776 1050184 1090757 1183272 1266997 1226424 1121779 1216153
18174 1216153 1248408 1344193 1633064 1738098 1937497 2166897 2281134 2024376 1714398 1672583
18164 1672583 1546638 1483756 1451695 1631693 1607922 1591244 1578880 1325770 1232160 1235248 1101103
18153 1101103 975863 997004 1185498 1203500 1195663 1507739 1528982 1716784 1887906 1889063 1856045
18142 1856045 1861487 1809573 2024190 2290092 2314540 2399342 2673827 2995512 3212710 3563580
18132 3563580 4078027 4488440 5041491 5587337 6113198 6541319 7086241 7787458 8656601
18123 8656601 9636533 11066983 13143498 15823420 19259816 23827551 30653117 41053965
18115 41053965 55939508 76996924 108004849 154284198 219645890 287073695 310339059
18108 310339059 262665446 187413906 122778925 80376888 55580272 41089471 32562000
18101 32562000 27197752 23167448 19770511 16832771 14174313 12235220 10624161 9396228
18093 9396228 8437281 7713290 7065026 6454316 6107196 5638605 5240431 5046983 4916275
18084 4916275 4597596 4344703 4071903 3776597 3897226 3867062 3709925 3584820 3530465 3296088
18074 3296088 3176686 2778326 2443117 2497428 2509135 2502122 2600374 2410630 2133902 2013478
18064 2013478 1998681 1896982 1797795 1633334 1743451 1784716 1535062 1381871 1506824 1498632
18054 1498632 1453907 1161388 1119349 998029 1001179 838465 808783 739643 684611 721923 843696
18043 843696 960213 944899 754785 524486 550198 722477 630046 544369 541707 499096 608781
18032 608781 657160 616888 760115 987705 821383 659008 299975 234632 134779 30954
18022 30954 79340 181201 176974 14885 43939 128817 256902 325764 310215 171652 332041
18011 332041 494160 478520 511274 360979 312069 414316 235374 228703 235414 266955 330690
18000 330690 286823 276865 410462 184181 -59350 181451 240557 238308 120202 -36219 -20410
17989 -20410 -71546 -67879 23927 -22600 54498 236721 242182 165818 168089 159371 125201 127786
17977 127786 109350 -47497 -11378 -70120 -281104 -312270 -204644 -282903 -36480 63140 124701
17966 124701 107096 195666 101815 -5037 200411 269190 325059 156812 23280 80816 276472
17955 276472 184781 36742 74861 290432 128572 -132444 -250599 -329000 -13187 100338
17945 100338 -29180 89822 219930 125614 -11938 -20551 26360 81986 57772 -48629 143183
17934 143183 100303 16628 64658 89007 140300 251151 209202 363613 586558 284162 -175371
17923 -175371 -281611 14990 216840 156045 -39145 -119370 -239327 -46830 96026 214456
17913 214456 372457 510596 380346 77309 -72205 20973 92035 95182 62061 -30839 -229697
17902 -229697 -331072 -225617 70381 161539 84360 -114615 -74325 -47429 -61122 -169618
17892 -169618 -89866 -82615 -253899 -188229 190788 167168 19955 54893 -26440 -19197 4370
17881 4370 -46285 1890 66378 -264374 -512894 -156599 -85492 -54379 118274 237518 149772
17870 149772 386 -319736 -390942 -12457 46100 -91256 -185851 -250286 -315930 -342027 -251402
17859 -251402 -71272 -206471 7026 76980 -88059 -140282 16117 -74824 -104567 105040
17849 105040 121901 96762 64998 41476 -75628 -13312 127328 79238 -117000 -258813 -7424
17838 -7424 124773 378753 592654 783337 1144587 1393435 1330570 1215866 1134961 685399
17828 685399 279053 31224 52132 239649 151384 64868 -166786 -379492 -275011 -198289
17818 -198289 -107695 114268 151068 156363 564708 784237 981989 1328291 1506500 1196597
17808 1196597 763931 455870 330073 450870 473645 529742 358710 314726 196251 -58130
17798 -58130 32126 26678 -42864 -49557 -50461 -81774 257633 196181 61366 129011 144538 166946
17786 166946 -79472 -21057 241095 270857 114195 8659 26081 -88538 -343373 -249799
17776 -249799 -139604 -192884 64265 60570 5375 -86781 75616 194411 76370 117899 120663
17765 120663 -129790 -213186 -137637 25197 99079 -18593 -144952 -78891 129624 298008
17755 298008 219755 11520 -156142 -159765 -49545 60249 4813 147805 131293 8847
17745 8847 -10711 -63322 -147995 71291 306127 205905 153694 231043 293036 162136 -39350
17734 -39350 -79786 -48923 -60936 -122918 -187026 -125815 -9565 -13515 -120226 -171696 -265728
17723 -265728 -35820 103705 81199 253331 92577 -7308 91663 49452 111819 150661 134274
17712 134274 9908 159110 345595 325282 262441 101999 28714 192620 323444 429139
17702 429139 316302 26499 -2101 -31740 -78492 -140330 -23425 -8607 -19088 -19445 64857
17691 64857 -153925 -277157 -302086 -251877 51596 135015 -39010 -145644 1432 141351
17681 141351 390501 182390 84583 88301 58496 118972 -34675 88757 132197 128703 -43147
17670 -43147 -108143 -87212 41337 52156 -85445 61080 99623 -88788 -67372 142732 212520
17659 212520 194908 147351 -52396 -147471 -121430 -128785 99378 290812 242074 154166 145521
17648 145521 241953 218661 212593 -47594 -124614 -26732 -120782 21530 43553 -41562 -42903
17637 -42903 -237839 -310642 -172598 -196414 -224945 -169879 -45260 -81567 91474 157560 108884
17626 108884 91222 181529 61442 -105356 -193578 -276686 -235528 -319527 -252116 -225369 -152172
17615 -152172 25647 94056 85569 26415 -80931 122348 132790 -33596 -69865 -182633 -205628
17604 -205628 -85627 -66533 51096 237777 404431 369816 477821 307289 -41178 886
17594 886 65700 4723 -43282 43354 162890 160898 48024 167454 54909 -161108 -203053
17583 -203053 -253840 -409217 -547309 -453236 -392925 -174537 94006 15727 -46802 130360
17573 130360 157750 251387 257149 274538 423069 276715 93045 38130 -167508 -292019 -484042
17562 -484042 -751568 -626292 -203347 59351 -27045 -243113 -97294 -66574 -243418 -330308
17552 -330308 -163983 65228 173866 243513 115382 47123 -19759 -87066 131659 313143
17542 313143 280195 254385 193116 115374 124432 133962 357852 405474 340880 122215 -3685
17531 -3685 142335 47745 6195 66980 -135580 -112353 45267 -67367 -158943 -111141 19424
17520 19424 -55821 -125662 -211864 -180828 -160197 5921 2965 -38469 39273 136296 112950 119106
17508 119106 184523 -36288 -176167 -161846 -120238 -285752 -381202 -263740 50971 289457
17498 289457 243194 60995 113668 11411 -207018 -92283 -27358 75283 -45975 -424998
17488 -424998 -343609 -114995 -5143 -60805 -116146 -140920 -178684 -390463 -288564 -15721
17478 -15721 -93650 -141315 -169124 -107242 -75429 -115976 -229620 -283515 -326507 -156494 -105138
17467 -105138 -28329 90258 91075 73603 201248 407073 303206 224512 273472 259459 -9841
17456 -9841 -142982 -53093 150689 323538 366471 399008 417084 519723 719597 679851 730702
17445 730702 1088337 1380070 1254481 963586 636537 387803 -7714 -31118 32195 42903
17435 42903 -71898 -61989 166369 295232 433066 309964 153508 90100 -48444 -234338
17425 -234338 -279515 -125741 102722 56325 -41912 61979 81534 -45146 2213 59326 133530
17414 133530 144809 119192 123429 -11569 -39797 -71795 19147 -18235 171655 208565 47321
17403 47321 163842 167224 118130 23311 178414 469915 534192 377336 419343 403606 154007
17392 154007 134454 332673 233360 70317 -98558 -177983 -15143 205535 256741 206547
17382 206547 231490 315224 425649 275428 119850 162258 174675 231100 -28918 -235949
17372 -235949 -135114 -128851 -33876 53003 153113 171829 226006 160878 40691 -87405 -88767
17361 -88767 160754 332845 482791 531293 575820 686827 413047 253249 177266 36449
17351 36449 176717 431946 315831 157180 95876 133050 196852 -99935 -86881 -91568 -55881
17340 -55881 55131 222725 259731 55605 -34499 -24381 10377 39069 25999 -47500 -67705
17329 -67705 -152815 -219649 -154668 -64130 -123698 -156393 -230268 -128738 -17065 -63481 -187752
17318 -187752 -253961 -388660 -326129 -327764 -451815 -316468 -298373 -282444 -367680 -315475 -191870
17307 -191870 -19374 -43408 62400 19708 -211344 -229924 -61986 -199476 -190139 -121603 -177180
17296 -177180 -209855 -23993 17427 -174647 -196716 78377 198979 121052 66605 -60402
17286 -60402 -116575 4721 140099 21050 108511 221129 303152 217602 83308 118679 209817
17275 209817 2031 -110684 -85754 -99248 -189832 -148317 -219514 -103817 -198234 -210185 -113288
17264 -113288 -79358 22281 -60258 -186670 11472 -124519 -315271 -315852 -180675 19487
17254 19487 52067 -92766 -75896 -109718 -85756 -148634 -253161 -299818 -435471 -490786 -418834
17243 -418834 -440158 -191122 -58404 -1716 4355 -9204 92810 163955 158142 63127 45181
17232 45181 90174 -33769 68487 309345 379978 318593 245412 139260 269061 61445
17222 61445 -174913 -275787 -494732 -562719 -296870 -234110 -184065 35191 12271 -77477 -219527
17211 -219527 -90630 80793 39923 -49259 83021 104661 216071 279323 188191 136901 31103
17200 31103 5730 -130528 -263352 -27681 282908 367976 325995 287224 190636 230155 263709
17189 263709 250355 173598 37639 125070 93595 143324 -16834 -253714 -351195 -451427 -356349
17178 -356349 -420892 -316100 -321679 -360724 -268031 -170997 4614 228911 99502 83163 357222
17167 357222 245206 114484 -87763 20575 184822 239062 162721 -3520 -325976 -253804
17157 -253804 13245 79163 -189790 -127128 16689 131832 4114 -302046 -358658 -131664
17147 -131664 19973 87647 149518 3182 114357 281677 170866 -181380 -299653 -315584
17137 -315584 -260236 -259861 -161230 -102865 -136202 131096 228277 156748 328721 259882 -32881
17126 -32881 -128322 -240830 -180910 -58698 -19519 79599 175949 179736 203288 222530 292581
17115 292581 492467 392761 146497 -307150 -334152 -264380 -57880 15549 77903 169262 116855
17104 116855 -13622 -123718 -176628 -98438 7551 -87605 -243967 -196214 1602 -44520
17094 -44520 -223025 55172 81521 65440 74656 110182 -44013 -84868 -14118 -42489 6236
17083 6236 348215 633218 528408 263843 30926 -8417 39800 -162199 -179000 -149043 178133
17072 178133 203525 247406 214137 89792 107887 96559 -39689 -135834 -80544 78639 135281
17061 135281 154562 44402 -28770 38769 -3173 -10381 13389 43032 -7375 8589 -43765
17050 -43765 -105215 -72546 25875 31600 -191991 -240857 -259021 -221788 -253750 -287226 -181476
17039 -181476 -157192 -78787 -106336 -181737 -63224 177127 31364 -100553 -207463 -267443
17029 -267443 9360 -52222 -295388 -151566 -125912 -141924 -71243 -79760 -68582 -77058 79390
17018 79390 146422 -68250 -372786 -558690 -454532 -356904 -431781 -185127 -317183 -322824 -250690
17007 -250690 -191288 -305146 -184930 -131722 -159090 26823 33326 -105437 -370196 -420670 -289553
16996 -289553 -233247 -188268 -255585 -316947 -411823 -251435 -287989 -142257 -208491 -118019 -89639
16985 -89639 -114413 -273471 -296671 -192944 31058 133661 -52819 -337046 -275381 -109551
16975 -109551 82705 137250 107203 127303 246487 309555 88538 -264338 -238624 -88993
16965 -88993 -7939 65547 -50648 -103881 -114832 -186792 -306735 -269132 -64303 73263 74287
16954 74287 -30408 43617 -869 69234 -88874 -197932 -326045 -197632 -50157 -71901
16944 -71901 -421308 -494981 -364395 -157589 -110766 -346121 -278894 16813 298779 392514
16934 392514 431616 370533 176852 130631 109645 -48580 -96056 -88598 -30497 -143284 -25319
16923 -25319 20543 -153049 -214055 -152405 -34171 68087 106255 29135 -94427 -44572 105218
16912 105218 121412 48935 -34387 148940 517311 601684 600815 217813 158829 23662 133459
16901 133459 7097 -379186 -482598 -232163 -202981 -50568 -20308 -30883 -34168 9964 -5098
16890 -5098 1799 -220044 -109258 220284 143313 -147455 -198692 -151113 -127566 167078 283013
16879 283013 191946 146776 161583 63214 134729 44301 -31867 73660 85202 66780 55396
16868 55396 -36880 143019 191466 109952 114810 181296 144980 223726 47422 -32434 -96893
16857 -96893 -210613 -365967 -357931 -312749 -380907 -374436 -88336 -118970 -243228 -230602 76589
16846 76589 214914 209604 292469 283476 96138 69589 67572 245620 319519 381923 412452 236237
16834 236237 19828 -157694 -331950 -350978 -147281 -360 -35314 97668 168099 16975
16824 16975 -51352 -59141 -13760 -24555 68163 359517 412828 416296 409722 375706 389100 145314
16812 145314 -66074 -271809 -215942 -71172 28164 188533 290915 378620 580660 597482
16802 597482 354185 258595 54496 -96122 36619 217266 154771 186842 73951 14357
16792 14357 39894 22747 100397 103819 93808 160567 253853 222877 265863 458095 679322
16781 679322 583695 331068 182979 95484 232349 406026 380108 259656 133670 84376
16771 84376 96222 -173589 -180113 -155529 -146734 -20576 200849 230601 409702 390887 70075
16760 70075 -92262 22973 53258 -93075 -70551 72185 47239 120080 130980 186446 306436
16749 306436 173423 143589 110808 285905 258809 40255 -60916 59089 75297 38775
16739 38775 123571 365491 363596 381105 327635 101393 70197 62374 97509 276467 97675
16728 97675 -165794 26125 154958 94423 -15171 -35969 16592 -12956 -178228 -186269 -74157
16717 -74157 -119703 -154726 35160 119136 198689 289917 395867 247642 68404 79653 115385
16706 115385 -97664 -144289 4280 45035 10583 -47571 -150950 -39072 116068 243009
16696 243009 83587 -9095 3099 -25276 36079 23953 -105095 -198519 -161140 -197579 -218514
16685 -218514 -108874 49875 130681 179289 44336 146333 172352 110008 110230 177683 355005
16674 355005 254951 115540 250154 469057 388689 181615 189925 235965 193472 231858 144282
16663 144282 -40177 13937 86265 123059 143724 46071 -129821 -55640 -167313 -150963 118143
16652 118143 205819 144298 146606 75702 188101 219818 290874 119737 -48009 105558 77126
16641 77126 -5368 -8653 -10519 -227589 -308678 -306225 -165668 -90624 59772 174182 302371
16630 302371 261926 166498 -41378 -110475 -33198 28206 116779 218351 53412 -247140 -201003
16619 -201003 -265864 -209382 -12975 -13453 4568 17416 -39654 -32840 -2088 193560 359375
16608 359375 69797 -96130 -106223 -79882 -7021 189653 105366 -111631 -319684 -289250
16598 -289250 -309450 -288163 -68210 -70026 256680 412179 212906 281 -62059 -75820 -245019
16587 -245019 -135363 -81641 -82918 39385 59728 -6368 27451 41002 90914 77990 64933
16576 64933 28588 -50174 -176975 -200480 -242101 -276156 -165552 -149151 -125838 -26100 -155902
16565 -155902 -250788 -239290 -260759 32815 275950 23805 -83012 106438 113919 157668 166040
16554 166040 275100 175075 136899 253518 234336 -40942 -106197 -114546 24891 171192
16544 171192 331966 356910 384900 65202 20934 -195792 -132130 -53305 -46039 -45120 -9706
16533 -9706 36789 118879 -46461 1228 111162 131649 312194 510920 327335 169242 -138274
16522 -138274 -197998 -99497 -61891 34117 106568 -41041 -247117 -482661 -535203 -411274 -123383
16511 -123383 15050 21550 113383 304491 262953 347042 181517 -7988 -72242 -88982 -349510
16500 -349510 -354848 -352174 -315495 -191747 -63098 96272 172711 7060 -206345 -160586 -33649
16489 -33649 -45761 6768 -253728 -353060 -162575 -60659 -110206 -10742 -45052 118492 176406
16478 176406 154372 116794 176412 155763 -46478 -109567 169498 276220 169039 274555
16468 274555 79933 -157952 -233546 -68622 172082 292208 65547 -43743 -47735 38478
16458 38478 39977 -95864 -276909 -264688 -119066 38921 76761 50733 -20672 -146156 -159717
16447 -159717 -169469 -279845 -368582 -310018 -250371 -141015 -60575 86839 36862 -20650 -3433
16436 -3433 -48198 -61248 -31522 -118712 -135736 -126719 -56179 -143941 -197697 -288456 -247619 -152418
16424 -152418 44886 198707 143987 -37653 22989 -37238 168077 107013 -127159 -181247
16414 -181247 -85645 -173469 -425562 -515862 -439224 -429675 -273690 -95290 -267107 -375761 -429028
16403 -429028 -375074 -235061 -82071 -47924 166359 389106 297661 244601 216501 58051
16393 58051 -161960 -131097 -41254 48483 24247 82743 214395 326403 162826 14632 -180910
16382 -180910 -370118 -140718 -79546 9335 150992 446612 248360 51808 19444 76945
16372 76945 272447 187069 60637 -10214 -90383 -9332 -56856 40029 -37055 -81696 -96871
16361 -96871 -152627 -394683 -334640 -197830 -98256 90368 308208 119683 -91007 -66732
16351 -66732 -54488 -10315 82051 -439 30707 226525 335990 259214 353310 372233 93886
16340 93886 220334 253598 -34556 -166728 -218829 -243688 -212091 -198620 -252512 -203916 52441
16329 52441 12529 -230932 -291691 -338580 -270365 -86020 93234 71414 -57799 -44467 -66090
16318 -66090 -126382 -132911 -296259 -60352 42761 70573 -30553 -149116 -112812 -102102 125835
16307 125835 209425 -18752 -95266 124042 221967 143153 -31499 -38204 64388 318933 494776
16296 494776 329234 142205 29898 123493 114467 -108134 -35094 -59788 16935 195950 108495
16285 108495 -136577 -74320 -5825 -357062 -628606 -444922 -414266 -368118 -301400 -46842
16275 -46842 98246 -32645 -122417 38486 88551 87835 167175 252395 201756 -6099 -130095
16264 -130095 -101313 -60278 -148833 -216684 -90879 91666 163384 109798 -55055 -13431 87699
16253 87699 -73873 -43878 58542 -24032 -104943 40851 -39475 -103438 138770 50250 -116337
16242 -116337 -12195 25648 16891 -68068 -177644 -153126 -111069 55380 332826 305884 44707
16231 44707 -139783 -84978 -48718 -25263 -99123 -135902 -89243 100303 261766 231719 474869
16220 474869 318536 132143 323366 206379 -45783 -70678 20759 9417 -11900 -31356
16210 -31356 89348 7835 -70979 -37984 -89577 106752 126088 -21115 -176109 -55737 -82219
16199 -82219 -100213 -81397 -306584 -488565 -387584 -321943 -277732 -297236 -297087 -258457 -136239
16188 -136239 -265857 -394436 -485313 -345552 -373709 -217576 -144788 -307062 -391065 -449747
16178 -449747 -410639 -190034 -148936 -204259 -254868 -282719 -246540 -215389 -174582 -68861 -14609
16167 -14609 82213 172790 197310 195300 91392 -87662 -50887 -99272 -9061 86417 259801
16156 259801 419294 117681 -123162 -211424 -187023 14991 -75538 -95553 -82446 -35756 -171970
16145 -171970 -290934 -268770 -1436 220761 202487 248542 309198 371435 440471 264669 -98413
16134 -98413 -144079 -38389 1310 14268 -1095 -27305 -221105 -267007 -170963 -112907 -103122
16123 -103122 -263385 -127287 -242602 -256389 -4067 109298 213891 122080 8447 -129979
16113 -129979 -196696 -366675 -325884 -204093 -344492 -274378 -139619 -23393 -229371 -97411
16103 -97411 38020 24368 94733 157146 200036 306742 263997 193851 147560 27541 -184979
16092 -184979 -258988 -205211 -167386 84317 227458 377773 439750 372390 333168 146458 82176
16081 82176 98748 100584 22720 59472 205099 130739 -87287 42076 -39665 -268636 -283606
16070 -283606 -50907 64338 -147714 -182484 -146334 -112362 127954 67919 65027 160628 139169
16059 139169 -52656 21528 215596 155777 -78538 3783 31490 -179402 -284686 -368156
16049 -368156 -185405 196 -104401 -15419 -145228 -348810 -538243 -382741 -363739 -419024
16039 -419024 -229184 29040 10627 -35381 75539 -14738 19485 -28942 -313588 -510926
16029 -510926 -295405 -119258 13139 340298 547706 411510 123557 3321 -190176 -164352
16019 -164352 5249 -82794 -123686 -43091 -184853 -239311 -323556 -444441 -503559 -416432 -469967
16008 -469967 -261822 -6284 135389 243130 14084 -90980 -299509 -438359 -450318 -377936
15998 -377936 -233363 -16713 -88933 22624 267754 165000 102942 29247 -92202 -99242
15988 -99242 -117325 -11491 18724 128803 251902 348807 232214 293173 173783 25822
15978 25822 -40232 -142583 -160616 -273994 -53708 89226 -53355 -150065 -294881 -241007
15968 -241007 115405 188235 44432 -80306 -129563 -341896 -420838 -244183 -151753 -87221
15958 -87221 -53913 -35648 -184603 -200069 -118952 -175655 -57823 -861 102719 122801 84859
15947 84859 77980 211098 173234 -87733 134901 268984 255610 205654 65575 196597 123962
15936 123962 -140168 -88461 -88659 242 86156 34782 -58608 -64719 -100125 -36927 20106 100014
15924 100014 -132520 -213399 -195908 -205450 -162567 -175784 -222006 -371042 -148932 -167145 -165471
15913 -165471 -74235 94640 219972 215900 -45816 -234384 -140973 136899 195992 59752
15903 59752 -134165 -283246 -314696 -206948 -329705 -219900 82798 -28086 -157865 -153110
15893 -153110 -80295 -15149 -74915 -161779 -186721 -82916 25233 203312 21342 -224513
15883 -224513 -234358 -34491 -6916 -73747 -104546 -126046 -69636 -47302 -93421 -2287 -55823
15872 -55823 -59179 -121015 -202309 -151856 -364302 -417966 -128523 -53422 -5497 -60074 -92526
15861 -92526 57673 172865 237758 108610 -8438 -114272 -928 167324 351696 280175
15851 280175 196792 66907 -127417 -76039 86732 19285 -91715 -128943 -152029 -108770 -294975
15840 -294975 -204642 65038 240977 140423 197210 238073 302698 404824 434857 391198 123632
15829 123632 -51420 85751 205378 362005 482946 361640 13204 -96869 50748 14449
15819 14449 -89933 29982 78289 -96356 -204871 -229152 -360233 -312508 -5631 79669
15809 79669 -117013 -240185 -45110 -87401 -239524 -169720 -45301 -110128 -173719 -173301 -125003
15798 -125003 -77418 12167 124313 283531 356149 379008 10048 -6301 253506 325122 367163
15787 367163 406922 127007 -128858 -240572 -235264 -301446 -159609 -37302 -52334 -90535 -71438
15776 -71438 -251600 -138827 -21911 66490 140301 170559 75864 -120881 -156648 -149382 6001
15765 6001 84959 51043 73025 -158616 -375603 -493110 -390162 -174449 100532 236984
15755 236984 334814 91008 -73639 120167 78485 95400 -26759 -92570 -177832 -183926 6620
15744 6620 -2149 8274 -63329 -88281 -88704 -134271 -158155 -105134 -88812 -90256 -138397 -144299 -85471
15731 -85471 208203 141722 -57186 -60718 -56447 -103729 -85815 -123392 -122204 -64658 -118983 -221124
15719 -221124 -83728 -144867 -211049 51134 192733 215530 235250 212490 70671 -172927
15709 -172927 -94646 -10524 -18344 -166528 -81953 39384 236243 98078 81780 122720 54894
15698 54894 -20270 185677 245734 34424 -168569 -175991 -260282 -289928 -32173 132188 10572
15687 10572 4394 236045 328606 336586 99450 -133936 -177221 102571 -94301 -186086 -299993
15676 -299993 -181787 109832 240024 215728 57091 158115 363052 301427 227338 140898
15666 140898 88252 272697 306034 198550 288386 138383 -28736 -83080 -58188 20313 172855
15655 172855 67253 -25813 -36679 -80644 -65322 -52565 4015 101908 19039 -145195 -52094
15644 -52094 -110085 -27206 -54025 -221477 -169568 -80143 -98977 -174026 -140416 -113150 91092
15633 91092 11247 -24396 21175 93212 -60376 -265642 -442708 -361546 -157625 -3954 -29426
15622 -29426 -96196 -57189 -222229 -105165 252402 273636 290984 178908 57275 74858 -1912
15611 -1912 6012 135706 -48208 -326724 -217856 -246769 -412932 -290564 5348 101355 43325
15600 43325 -56137 -224520 -305768 -219087 -131215 -77055 -40084 -102339 -178359 -161727 -286986
15589 -286986 -252185 -8265 71384 -261082 -479290 -426305 -367157 -166143 -207508 -37376
15579 -37376 -3625 -61901 -62491 -109949 -264062 -145164 -200597 -453129 -593247 -376592 -321523
15568 -321523 -224384 -109927 68333 -13450 -51901 -24744 -42372 49713 -99870 -262423 -252884
15557 -252884 -94289 42545 19079 -25372 -19086 -53125 8581 59182 119706 64446 -45794
15546 -45794 -215073 -131446 195033 219189 236047 162347 39032 100504 53538 -84745 -84171
15535 -84171 -23485 27194 -154848 55767 172083 128808 21971 -127492 -106453 23955
15525 23955 88735 -43005 -230431 -111367 80246 -124790 -190154 -134649 -44424 -43864 -286158
15514 -286158 -370784 -428530 -313986 -261680 -248136 -94363 -41873 -101049 -188808 -306499 -360239
15503 -360239 -469396 -365949 -250926 -114865 -112440 -60785 -40353 8037 163459 34431
15493 34431 -90602 28911 43788 392609 394231 231717 22890 94704 125551 100258 -9624
15482 -9624 -295507 -202489 71818 -59004 -151791 -205043 -251814 -290477 -67452 106915 44495
15471 44495 -149602 -112889 95924 297313 379959 523610 465880 278444 140002 252158
15461 252158 200435 259216 212905 250854 188610 95590 179285 -33756 -243494 -149189 -33835
15450 -33835 -37622 -195011 -263306 -271920 -99401 94377 -171935 -257042 -250101 -331196 -237960
15439 -237960 -131426 -19868 -87127 37530 186771 182504 129482 154780 171073 221253 115674
15428 115674 -194996 -29217 -67818 -83843 -169399 -173906 79552 378367 273381 105898
15418 105898 51997 -125063 -30154 40179 -43964 -6769 108287 276696 230662 216285 117875
15407 117875 2053 -32311 -25826 24618 105399 49963 25692 29400 -30000 -12555 689 -58105
15395 -58105 -45087 96713 168762 142624 120719 233157 167824 144700 134059 223489 258274
15384 258274 65322 24908 35008 163270 231850 457085 509635 394476 349866 174157
15374 174157 74521 97252 13614 53005 130210 342029 232242 19194 -113657 -254780
15364 -254780 -102268 -279828 -290621 -327941 -282398 -165531 -73324 -157563 -70752 -8312 -52796
15353 -52796 -7634 -91845 -313921 -378979 -433490 -403529 -267622 -133080 -67944 -115453 -166293
15342 -166293 -157402 -23848 287471 444827 458471 485328 445257 119827 -141459 -228745 -154986
15331 -154986 -130293 -199966 -257902 -1867 158813 127911 53965 228435 376235 299018 228758
15320 228758 163343 233125 307478 194688 133180 60997 241949 314499 276857 290215 181423
15309 181423 -91386 -16415 190295 -6664 59173 191627 259818 202782 4470 -91233
15299 -91233 -321702 -293301 -182358 -87973 -160747 -218768 -326696 -235441 -221380 -301509 -244518
15288 -244518 -112488 -53237 -138850 -110515 149408 221719 222124 194315 188844 156742 125751 90851
15276 90851 12238 -78645 -129353 -291828 -78209 58163 159522 231697 122095 12317
15266 12317 -18075 -97982 -61511 -118712 -213304 -212910 -55510 205654 256341 213849 194233 -18451
15254 -18451 -183972 -335242 -37390 89450 -5044 -146320 -39642 -63100 -9819 12197
15244 12197 24038 -71164 -59017 -7374 -92722 -137804 -277853 -315180 -182247 -20379 15197
15233 15197 67242 -38525 -95134 -40308 192929 171769 28837 -226840 -170570 -111289 -84519
15222 -84519 -426637 -429286 -307165 -226716 -133382 25744 141079 -66738 -307929 -391951 -329753
15211 -329753 -145073 -102146 -296053 -333783 -283459 -429587 -428254 -412256 -361379 -317490 -169297
15200 -169297 -216141 -423861 -274292 -148800 -136974 -126801 49795 16549 -4017 83900 287275
15189 287275 66581 -51592 -46850 -124504 -111111 95662 294899 315311 193580 53045
15179 53045 233057 389165 285095 57588 -194682 -17772 13615 -252700 -433778 -300163
15169 -300163 -289597 -200555 -35853 -128372 23373 80798 62029 185302 221372 225745 212359
15158 212359 46536 -178384 -237477 -50104 94574 77941 106734 121343 11084 -206140
15148 -206140 -309793 -302980 -183936 -273539 -242878 -157273 -53987 122215 85416 -8107 54548
15137 54548 71921 96714 -30249 -126569 -141239 -20856 -128189 -266858 -175162 27504 -88127
15126 -88127 -187006 -297223 -176034 -137604 -55514 -47874 59843 -128964 -152168 -22164 86965
15115 86965 61033 -251459 -390418 -159664 88986 347060 387236 646230 719479 575315
15105 575315 313547 5413 -42295 193816 432414 265181 -2851 -7199 -113534 -268164
15095 -268164 -316932 -321511 -22944 86243 -16840 -122813 -257955 -189474 -192979 -34939 -182486
15084 -182486 -203000 -137394 -95151 -75520 -78844 -164642 -264765 -182740 -107023 -207064 -191951
15073 -191951 -101332 -35463 -3261 -16796 -5874 -14683 -73295 -221853 -275297 -189444 -128857
15062 -128857 -294859 -208661 -316534 -475879 -315489 -147639 -56542 124985 -31236 -146633
15052 -146633 -55948 14901 -39642 -97059 -262598 -220751 -264731 -117205 56569 57938 -322504
15041 -322504 -450886 -348952 -275093 -193630 -104669 -88503 70212 175347 169163 64599 -70096
15030 -70096 6614 -3417 -7292 106657 324560 343668 158305 102959 -20218 19919 -132678
15019 -132678 -66924 -70218 -106423 19406 27759 -39757 -154534 -43452 126685 233672 185821
15008 185821 107557 299719 414597 389377 315155 323571 207026 80815 39085 -177479 -119920
14997 -119920 -49210 67194 175537 168098 162489 150149 76937 85928 122784 24056 73519 134911
14985 134911 85023 -102727 -158144 -175992 -214624 8539 149716 294158 124797 204847
14975 204847 448267 357918 168580 67058 39541 -52574 -68851 -234579 -353173 -22434
14965 -22434 111835 5669 -148240 -387255 -404598 -262579 -111920 26304 35457 63687
14955 63687 -74130 -199602 -80629 -74462 -158248 -110041 -223510 -294272 -121370 70484 58919
14944 58919 -53260 -15304 -80626 -80813 54113 62350 -96844 -200306 -317461 -237728 -355383
14933 -355383 -413989 -397317 -303639 -218900 -51698 -156059 -307045 -477193 -321926 -252666
14923 -252666 -284998 -82366 14077 119983 -32893 -96934 -41407 -73099 -197555 -136312 -83108
14912 -83108 -56403 -143319 -399663 -505410 -538466 -468726 -333227 -149163 -71158 29259 -11727
14901 -11727 -168836 -125567 -135894 -131795 -14093 18845 77676 -37619 -82247 23646 -152690
14890 -152690 -273588 -265016 -83276 11520 54620 23979 -34123 -21241 -4433 -34259 84350
14879 84350 222028 29223 -51130 14973 -30325 -69720 -210881 -288154 -583812 -398807 -85978
14868 -85978 79234 69660 5662 99499 159748 108716 69856 -52260 -36639 36600 149674
14857 149674 134137 28154 -63616 20069 43956 -5024 27834 63829 -82921 -145532 -268092
14846 -268092 -311017 -365632 -487475 -509395 -194351 20693 82749 50777 272130 277202 17791
14835 17791 25831 -52782 -164277 69276 204232 27854 -102659 -75051 -102762 -207409 -254966
14824 -254966 -257485 -240610 -314703 -314478 -99580 141757 60466 -1415 39097 -8197 -19083 -89731
14812 -89731 134717 76161 -35986 -327916 -518352 -443226 -326759 -463975 -480159 -270274
14802 -270274 -165905 62042 119237 10788 -17626 -32282 -240426 -227733 -279074 -392650
14792 -392650 -327518 -264341 -249418 -211218 -168634 -261962 -132738 163573 258666 328567 381819
14781 381819 138539 34786 -21103 75810 84125 -67705 -201314 -367436 -366771 -23576 -24441
14770 -24441 -77820 -44507 26614 183749 52237 -8285 7027 47478 38141 39994 306654
14759 306654 390278 189509 -40083 -95462 -17276 6025 1337 10166 -83067 -173903 -41555
14748 -41555 -40775 25453 -140390 -242062 -275050 -133722 117473 98753 65374 27689 -174670
14737 -174670 214 180470 97621 25303 89842 247950 20231 -319089 -315139 -306036 -310144
14726 -310144 -225003 -144116 -235302 -338354 -204813 -146211 -210044 -51250 128667 154452 101556
14715 101556 29691 -45202 -310308 -149476 61916 280636 262303 124132 -68469 -157486
14705 -157486 -84450 136406 77064 -152707 -139931 -102764 -166357 -178827 -183914 -87321 193642
14694 193642 170767 127345 -97199 -77083 -394499 -429219 -107840 360543 332127 41712
14684 41712 33027 177677 160095 333591 264950 55960 -4077 -4509 -13103 13478 218906 171768
14672 171768 109616 -220663 -728464 -607798 -220111 -61892 -42551 -79704 -117757 -72857
14662 -72857 -81057 -189448 -59491 79183 -2516 134082 77945 -1989 146555 93804 -33127
14651 -33127 -136699 79480 348585 322149 204891 -37302 -160477 -157189 -228774 -286525 -403126
14640 -403126 -251677 -217474 -106337 79352 111440 197408 254932 329443 384106 283618 111339
14629 111339 -10893 -93112 -24738 121449 268522 53369 -173680 -107542 -178906 -309144
14619 -309144 -161593 -63447 -138232 -212464 -184365 39621 304104 126374 -30241 66047
14609 66047 121860 93090 216630 295690 255509 279639 268023 166682 14393 55163 154899
14598 154899 58165 152239 257139 160361 204973 -943 -145528 -236823 -219041 -262067 -180202
14587 -180202 8332 72425 17520 -127421 -111859 27686 73224 -34768 -110799 79152
14577 79152 147851 12577 -114124 -200966 -108113 34904 59673 71434 49941 -101696 -117258
14566 -117258 -270403 -184690 -153327 -102537 -124270 -109017 122450 212865 326764 330034 316930
14555 316930 149003 129099 77035 249412 405792 375841 -51481 -160677 -277418 -370695
14545 -370695 -384864 -243762 -133235 -111319 1979 172916 210087 173774 368471 431610
14535 431610 416238 57680 5030 26744 -30679 -83349 -34681 -24081 -158545 -172469 -83976
14524 -83976 92060 168573 139266 364995 320297 9353 95911 223756 179308 247159 222713
14513 222713 -18411 -156771 -318574 -318165 -166938 20065 -94249 -186361 -365703 -302437
14503 -302437 -230649 -105906 92073 98809 145218 258450 300355 -16389 -170087 -277177
14493 -277177 -502868 -506412 -118181 66858 -119810 -278373 -342267 -494281 -231969 -15474
14483 -15474 -45602 -152990 21692 94726 -64704 -39043 -207575 -69740 40759 -20908
14473 -20908 -178679 -41044 -123147 -449144 -418278 -307349 -272350 -259742 -214273 -61702 58404
14462 58404 53105 6872 -201018 -379312 -388717 2379 113946 161860 -112147 -21762 -53831
14451 -53831 -149740 -112195 -111374 38719 70603 -90879 -49648 -331307 -354605 -166861 -245985
14440 -245985 -102328 72648 -124015 -115022 -13550 151392 -78933 4653 99939 -41232
14430 -41232 -84858 87793 258799 309586 44792 -178432 -198351 25219 160853 287463
14420 287463 100998 -79308 -104033 125553 303863 198537 43211 -25827 -79368 -149475
14410 -149475 -56638 -17675 93072 153946 21022 211695 342040 320029 245186 78497
14400 78497 -37563 -87445 -54003 -55386 -103317 -73570 -19998 9780 357150 415355 184152
14389 184152 35762 97003 263464 314272 397128 287844 47850 42939 60832 174923 200189
14378 200189 85955 208628 17625 -106414 -269230 -222677 1087 -57703 72583 247007
14368 247007 303124 188362 24135 -90597 115740 214252 -127288 -85229 -305249 -251301
14358 -251301 -133065 -132901 -189578 -64108 -100218 -43805 139771 112158 105183 -28229 -136223
14347 -136223 -289584 -110518 -14490 -107881 -245733 -43657 -67010 -123658 -94511 85974
14337 85974 294631 128228 -180511 -165753 -128133 -203475 -3911 77957 -2912 -174038 -245862
14326 -245862 -203369 -79270 -53831 -4794 -109866 -120900 83879 -65411 -82543 -104373 25601
14315 25601 3078 -164541 -169746 -237094 -265771 -328955 -277027 -108710 141532 2085 56266
14304 56266 48734 2556 -23920 9100 -183827 -227595 -132243 -54019 79445 18764 24008 70433
14292 70433 25058 -158478 -269296 -217423 -118096 -66095 -112747 -279440 -300819 -152972 -196187
14281 -196187 -122078 -1399 -37774 39866 29704 -48661 -116471 -7413 132528 113262 -26966
14270 -26966 -7098 -53813 -21283 38278 -104974 -46210 -222892 -319672 -335053 -249875 -73683
14259 -73683 171641 133980 97088 207249 76150 -148235 -404439 -306951 -193319 -2350
14249 -2350 82057 174753 245352 161818 84632 226237 342758 295258 81631 -87520 -275366
14238 -275366 -434595 -441388 -218467 -194234 -91512 -193557 -175512 -203005 -180720 -195984 -85543
14227 -85543 -86389 -198835 -306771 -222296 -65742 -198298 -411216 -251680 -304853 -357168 -210222
14216 -210222 -261377 -374212 -245722 -49801 109209 11244 -30546 -32703 -194844 -185918 -181883
14205 -181883 -137031 -55640 -127138 -194456 -56783 297725 247623 170828 86628 50497 118585
14194 118585 120150 -109726 -287058 -246821 -113924 -30346 116474 42043 24309 29697 69303
14183 69303 150348 102421 11293 75889 85370 16012 -126849 -77365 -195230 -10137 366504
14172 366504 257956 130149 194199 137420 189650 166747 98233 193295 302057 29142 65301
14161 65301 155455 -78219 -346431 -196818 -77827 30261 -155581 -304630 -104551 1695
14151 1695 -161581 -169306 -248493 -257168 -157129 -222895 -191667 -61000 38780 -102857 -149112
14140 -149112 -123558 -191400 -119390 4618 18845 37943 222008 152436 -22128 113278 90280
14129 90280 140024 204718 22399 102558 99511 29790 109882 240514 118289 144781 38635
14118 38635 -56940 -169442 -242917 -134627 -191370 -6153 17286 3136 233222 269633 194438
14107 194438 195807 100277 45962 37102 -80073 54266 199125 30278 29139 12161 814
14096 814 173451 159489 -45772 -332171 -465060 -440343 -285982 -57839 108092 44466 83750
14085 83750 47890 138239 134272 52705 -22110 183814 154499 5973 -91350 1335 26517
14074 26517 117428 144722 -13586 -256404 -258203 -61850 229332 268287 112061 35327 -158076
14063 -158076 -115132 -15907 -128209 -21238 -60892 139828 241525 -52967 30994 -442
14053 -442 -15730 -118287 -211555 -38143 104826 129781 -110143 -177454 -125990 -121175 116123
14042 116123 186052 324467 408536 413708 604443 652368 347985 191792 275791 269086 365325
14031 365325 495233 429676 173757 -61905 -47195 -79023 24521 178068 131010 352017
14021 352017 169424 223171 336374 337736 237247 -19351 -7992 367994 587884 382550
14011 382550 280782 246647 176027 211502 91988 67708 -176956 -120580 -19888 144044
14001 144044 117576 -55486 -225904 -269990 -235617 -126087 -87895 -172368 -330964 -420072 -198064
13990 -198064 -291134 -543632 -488978 -494024 -319619 -29328 145295 -116121 -192374 -181306 246271
13979 246271 430748 433733 104266 -21646 10114 236506 146914 113916 36947 76134 57487
13968 57487 -15144 -93780 -178587 -309011 -350853 -81612 37969 7257 35822 254538 275901
13957 275901 199426 61280 56438 137200 -148538 -274285 -125326 40897 53241 7373 86816
13946 86816 377488 320266 111890 -98813 -54076 -31083 -119814 -54821 47177 69535 -186078
13935 -186078 -420131 -367938 -231245 -27680 290220 203194 115682 -2037 -30014 -74308
13925 -74308 -63765 -16831 -165101 -354771 -297615 -119238 78832 127412 111344 41837 95809
13914 95809 297870 294471 294025 140638 -70669 24007 140272 203848 66761 -84009 -87590
13903 -87590 -198268 -295041 -367722 -280015 -50609 -66753 -138975 -29807 72871 53110 64792
13892 64792 -52537 -251383 -164064 -202384 -19900 77327 78793 91347 -34802 -164655 -288821
13881 -288821 -371553 -299412 -100553 -215047 -210091 -277858 -171340 -127370 -75084 -11378 -31663
13870 -31663 -17952 1541 -49460 -227070 -283441 -221203 -182071 -82135 -65778 38412 15547
13859 15547 -59759 -59633 -110603 -162822 -190064 -152651 -167583 -7509 99952 -94342 -265930
13848 -265930 -84637 160359 242976 53453 -98885 -115987 36966 100927 50002 64176
13838 64176 155182 102903 -1766 67443 -51839 -223597 -167675 -109514 -197475 -157121 -13361
13827 -13361 71198 114559 109653 -197552 -334868 -117117 13936 1541 183615 352620 275776
13816 275776 22313 -44549 142455 320222 257660 172924 -6324 -195341 -132368 -30297
13806 -30297 -2066 7831 -147800 106796 149390 203434 250635 456633 365636 362780 285052
13795 285052 111060 -76620 -412353 -341754 -110319 -82587 -70264 100808 -48801 -79268
13785 -79268 -80531 -204635 -214460 -72284 15935 31107 -1527 55138 116413 -33992 -49127
13774 -49127 72602 71901 212324 300373 154368 -55095 -3107 -82508 -167842 -200090 -114534
13763 -114534 -16373 44123 70312 132266 70969 4716 49310 -110036 -178085 -111008 -148225
13752 -148225 -120714 144235 92369 243145 127032 -116592 -40298 247478 242698 142875 190047
13741 190047 216849 64411 -40192 -59001 -52877 -25864 41312 -47075 -130701 25090 173671
13730 173671 277775 177977 46125 25049 73370 112140 -116623 -340297 -508648 -351555
13720 -351555 -185744 -243632 -86327 436 -111198 -87313 -57489 -110565 -80380 -177676 -403041
13709 -403041 -454275 -250176 -149896 -91027 69311 193166 131892 -4200 -43946 -205445
13699 -205445 -194268 -198196 -114852 -38927 -4984 257025 325858 186171 -60584 -287853 -211428
13688 -211428 -59959 -136492 -129074 -71806 14663 56407 -111803 -181587 -321458 -264001 -44524
13677 -44524 136056 -49885 -204179 -287523 -79107 19683 -64787 -90494 -110368 -23723 -85229
13666 -85229 -182501 -160696 -135044 -103391 -88109 -2418 474 171122 78753 78249 75275 -264649
13654 -264649 -207804 14535 20120 37312 20004 -39396 -124247 -89809 -78152 4182 106074
13643 106074 86897 -59956 -35808 -60648 -279727 -289852 -146551 -241686 -150344 154489 108563
13632 108563 -72545 -352624 -212892 -95254 -298372 -320298 -225266 -97458 -138759 -251212
13622 -251212 -122567 -207336 -297769 -344061 -282176 -406975 -268162 30325 302729 273060
13612 273060 130100 -16645 29292 125538 95489 90690 72816 -63792 -1215 85189 18905
13601 18905 49906 85253 -10919 38556 -91592 -225657 -258561 -296916 -213046 -93168 -186602
13590 -186602 -208670 -85708 -28773 33196 -66726 -201576 -205432 -260 15925 -50452 -43411
13579 -43411 37752 -129956 -63002 -5714 173551 421963 260455 60897 185978 132454
13569 132454 95868 189491 142639 -115375 -198492 -89754 -89107 -44357 -24885 -194952 -261558
13558 -261558 -441021 -356322 -427170 -523355 -325878 -271179 -104679 265953 421940 325999
13548 325999 211654 183956 53319 99371 160437 121600 30899 -145667 -107409 -102636 -72881
13537 -72881 142871 275545 37366 -79444 -208956 -292232 -281360 -352036 -230681 -154491
13527 -154491 -156923 38894 -162674 64364 169686 28872 -139315 -268165 -123989 164405
13517 164405 250012 284583 352137 327098 232998 134697 237803 370808 257961 75379 20330
13506 20330 64958 200351 -110373 -113980 -97430 -249427 -374572 -410286 -190780 -19035 255910
13495 255910 181120 26271 -150059 -144342 -268924 -229399 -32960 92880 148012 333548
13485 333548 425498 73660 -207674 -271552 -173637 -61594 -161844 -102337 -170510 -141093 2948
13474 2948 113213 309135 205819 153317 62299 51501 221509 -12052 -302944 -311944 -276173
13463 -276173 -175074 -145213 -28552 281886 230954 23094 -103313 -136007 -68915 -141890
13453 -141890 -251605 -148019 27416 89668 183454 234527 100339 -192255 -128711 -111857
13443 -111857 -136291 -117999 27074 95622 15319 22873 101548 -43527 -37222 44752 139974
13432 139974 103464 8346 -10309 185881 198769 110729 92745 150091 150962 285369 303748
13421 303748 261764 -14631 55173 130016 217279 124320 57806 -217406 -306263 -324207 -523634
13410 -523634 -300333 64982 14762 -7517 -68084 -108287 -240499 -351388 -307098 -162906
13400 -162906 -139518 -74184 -64267 100871 -34311 -34378 180929 371434 334029 148417 20033
13389 20033 -31923 57482 216599 310902 245356 273962 182875 53674 -225777 -491722 -591478
13378 -591478 -361495 -16191 160956 232573 167684 22226 -147852 -168081 -117993 65346
13368 65346 107423 -63986 -213004 -363880 -308285 -149602 -121511 -97273 -14891 -153077 -223054
13357 -223054 -144491 -123472 -294741 -132589 -146150 -248994 -8966 131913 94783 177302
13347 177302 61038 -151095 -200945 -152188 -54483 -8049 -179418 -128594 70722 51598 -71047
13336 -71047 79911 85201 136260 184538 250474 541715 518867 403269 180682 -34577 30100
13325 30100 144122 120865 -52849 -55573 121642 321163 267475 217903 272723 169206 -19847
13314 -19847 -85242 189460 265321 309636 225367 414762 469484 232644 -92219 -349567 -345461
13303 -345461 -191160 -64412 127640 275544 291558 363149 38318 86036 108326 -115858
13293 -115858 -73357 37702 255904 249731 75168 28544 -93766 -371472 -402285 -116579
13283 -116579 163953 162572 54196 127438 92235 -57450 -36802 239190 124317 -3659
13273 -3659 -178887 -157091 -232003 -221942 -138028 49490 111807 -28635 38566 236187 240200
13262 240200 255745 300158 299933 350312 272677 19630 -120373 -51224 -275461 -228448 -24713
13251 -24713 57687 149818 125717 296334 290175 273573 163557 95231 21858 54738 -13053
13240 -13053 143659 345517 168879 -111752 -330394 -329834 -295669 -391699 -207131 -101816 -4631
13229 -4631 19486 7850 -167764 -136130 23805 54614 10706 -4174 46223 48945 95807 143174
13217 143174 145581 140841 76640 55936 -27538 -203952 -291041 7063 126032 30358 108764
13206 108764 -41321 -214087 -93620 -200147 -436413 -450376 -295400 43837 266938 305411
13196 305411 72390 24835 94626 86314 119739 151309 49444 -157002 -241001 -143639 -23097
13185 -23097 1019 -12608 -246044 -93948 154992 187295 84520 206660 384744 283527
13175 283527 70014 24749 92860 72901 33163 67697 -123376 -259562 -158156 -24010
13165 -24010 218124 165839 161705 141836 182570 211592 44745 -11941 -51450 -170851 -81904
13154 -81904 -251744 -430998 -175036 128145 340923 487931 392198 221218 215175 420540
13144 420540 350958 337497 246695 64667 -184225 -119031 -7951 -137144 -27657 -65101
13134 -65101 -214091 -66680 43322 133592 -37306 -57333 -48214 9655 32969 179064 199738
13123 199738 161322 147820 63864 -81145 -89838 120122 167113 10411 1237 61 -15705
13112 -15705 -148239 -141559 58769 158717 125685 160499 184756 100829 142205 122727 353535
13101 353535 267914 -89452 -140472 -137382 -278029 -349612 -187161 79387 60819 29493 -111071
13090 -111071 -104948 -272198 -309493 -180125 53055 267082 213412 34718 -90600 54553
13080 54553 -30414 -214497 -12601 184020 137006 86910 -12873 -141789 -76180 66570 -187901
13069 -187901 -291532 -168186 -63352 119406 42931 66861 170240 277211 368933 395362
13059 395362 325138 -25014 -117378 -195260 -210275 -205963 -198689 -51424 1251 -78108 22701
13048 22701 -107857 -172377 -213719 -131379 -33071 57021 -1338 22620 99287 195963 91616
13037 91616 -124403 -157723 -42158 150383 245130 21194 -133961 -285145 -126395 10077
13027 10077 20366 -107417 -168260 -227974 -248370 -425893 -292099 -204140 -116597 -79593 -57944
13016 -57944 -56166 151759 430866 350038 22323 -12559 -46689 13157 159038 276851 159671
13005 159671 -120945 -131984 -143992 -224231 -220468 -163223 -69492 10827 -106075 -189398 -236907
12994 -236907 -166920 -344379 -305249 -53871 117514 130940 -121266 -373503 -244200 95988
12984 95988 298416 324058 258494 88778 61889 80158 -158729 -315607 -259339 -257118 18906
12973 18906 -73710 -188710 -310606 -291781 -238876 -354145 -484398 -279772 -168717 -142381
12963 -142381 -91648 -186918 -187556 -253355 -247957 -69574 93075 -24835 70641 249666 317527
12952 317527 401426 332287 284052 248844 181208 238958 109839 -145328 -93785 106552 200552
12941 200552 196024 251833 264616 83066 24936 -21669 -145899 -44808 -166054 -142011 -35160
12930 -35160 -57252 -251318 -205685 60374 248381 304269 228405 280058 409765 194104 72588
12919 72588 -62432 -47652 179430 280948 419380 365851 140936 -219151 -175076 23385
12909 23385 28350 -175497 -187685 -95921 -40088 -83960 -45228 156765 292901 145786 198937
12898 198937 311201 336073 334218 284653 117074 5685 -266605 -66500 20366 104242 183532
12887 183532 125716 -87109 -7190 -158000 -152711 -78097 56596 19454 -28947 98500 264628
12876 264628 163252 26641 -435451 -545829 -360086 -366815 -274488 -276360 -395610 -487198 -123484
12865 -123484 -77395 -107935 38225 169831 193498 319788 130998 -223673 -354293 -241266
12855 -241266 -90673 26438 18277 40047 11736 -21342 -4773 97306 81701 -106426 63099
12844 63099 202519 171415 65858 125640 187281 246922 129480 87744 -135942 -235077 -303347
12833 -303347 -73669 98470 95607 377534 433327 148089 19809 124781 239610 279096
12823 279096 207944 325254 360537 446544 169332 -90592 -329404 -309098 -89087 -39897
12813 -39897 -152965 -300782 -166560 49391 118458 -125110 23471 -29272 -152699 -329889
12803 -329889 -268133 -247825 -359097 -362596 -219125 -117856 -248627 -275552 -186303 -105926 10651
12792 10651 122347 137829 103978 329009 379865 122876 8216 13135 -54458 19931 -36112
12781 -36112 -70489 7187 -111126 -71329 -184704 -311956 -101587 24703 140423 148899 88737
12770 88737 66951 -70339 -45412 121635 308737 251344 72310 -5474 -84121 -16380 58836
12759 58836 -12104 -239031 -418679 -330446 -86783 66841 17273 -41643 -155317 -215024 -244345
12748 -244345 -276069 -151717 -13811 267537 232616 83344 131536 25579 -71433 -84102
12738 -84102 31289 230386 329921 15557 -164431 -271969 -334522 -420207 -189386 1345
12728 1345 242154 346161 410221 397489 219695 150234 179812 38484 99864 -100271 -143136
12717 -143136 25584 62582 19550 148549 417458 337197 239519 -73841 -106865 64507
12707 64507 252938 278668 -18288 -147031 -324197 -323725 -263856 -219449 14789 -77963 -164516
12696 -164516 -257036 -185260 -158608 -206195 22613 106803 -70842 -177680 -257440 -149434 -10338
12685 -10338 -189499 -175972 -150802 -241945 -259789 -34418 7188 191810 435948 159786 101484
12674 101484 -93673 -124851 -149011 -124839 -114230 -146976 -307936 -367181 -227924 16613 5409
12663 5409 -388 486 156080 54532 134628 200535 72899 -148863 -123203 -28801 -162388
12652 -162388 -125768 -163330 -146150 -89073 -121016 -267000 -106250 113047 109656 -143812 -248950
12641 -248950 -48863 96330 169673 -42541 -257180 -23702 195685 1230 -122097 90421
12631 90421 76852 151209 140689 -75971 -107856 120469 162865 183654 114566 -42510 -156517
12620 -156517 -140892 -171411 -255362 -155231 -79121 -66863 112857 363109 288888 -46892 -9256
12609 -9256 -78123 -265609 -138810 -240341 -113753 -266036 -318917 -335953 -235048 90412
12599 90412 192744 -197779 -321937 -516467 -469715 -346117 -397728 -314808 -191208 -122245
12589 -122245 147577 389804 308520 20174 37684 162822 89383 73133 43381 89525 41296
12578 41296 -247032 -374709 -247205 -118634 -168491 -163610 -267993 -302284 -263175 -233628 -373991
12567 -373991 -200766 -62758 -1927 -33452 38603 -82911 -165469 14810 178450 109095
12557 109095 -96748 -353395 -171924 17663 157186 -30257 -255165 -339669 -202782 -161709
12547 -161709 152099 169916 62328 107115 -60325 -15255 -9368 32020 218444 90618 -36467
12536 -36467 -102168 -30516 20356 -17448 -42994 -1888 -73005 -47777 63382 141434 123146
12525 123146 -3803 50182 33150 -91569 -59935 -2180 -104898 -252546 -287025 -307244 -249246
12514 -249246 -108254 -3132 -38013 -100738 -251 -6789 -153555 -142637 68657 176990
12504 176990 102003 82797 -82326 -16403 -96459 -191767 -213210 -244957 -246267 36063 215609
12493 215609 112215 106124 253052 292518 174000 1981 -179521 -369153 -222702 -170241
12483 -170241 -246385 -268983 -268981 -402179 -28478 208939 247804 203242 331134 238069 43304
12472 43304 82507 194512 211125 76034 97405 -7458 -147543 -142814 -66487 -82945 24919
12461 24919 107557 -174228 -424778 -159492 -45506 54465 64527 -94412 -125004 -110209 -115681
12450 -115681 -13671 143963 89235 14508 279537 505404 321073 222080 216240 208106 166734
12439 166734 158372 189688 256473 156759 71898 113981 170749 89782 -107429 -328203 -385656
12428 -385656 -349526 -251756 -340013 -426228 -273689 -120671 19878 -19394 -19281 215964 371741
12417 371741 124274 171077 50569 36971 65138 -30849 -47281 -42700 -60319 268260 220129
12406 220129 44772 -216409 -502341 -392729 -244651 -134198 81066 105250 -57163 -96723
12396 -96723 -102104 9975 -146296 -290156 -253690 -229378 -176803 -145406 -259500 -137854 112067
12385 112067 130388 66211 104526 -12672 -102931 -165230 -137934 25461 -20519 200814 93997
12374 93997 -60896 59377 212290 136264 238501 288056 141776 24100 89303 149067
12364 149067 172479 99136 357361 333829 276767 104335 -28843 -44432 -81430 -45072 -9906
12353 -9906 87907 -22405 86944 268466 161261 96295 76454 51591 -31119 -89234 528
12342 528 -59931 -82318 20618 130036 8356 -213700 -266397 -84096 -336036 -336017 -75677
12331 -75677 -85981 -56767 97867 1995 26173 -20190 60530 145703 -87722 -113709 45535
12320 45535 197235 101230 197196 265087 310288 386476 211073 58563 123604 73813 -60709
12309 -60709 63161 124961 266083 328130 314384 152148 -55672 -210849 -201845 -68509 -7075
12298 -7075 -10246 -34096 260818 227376 27293 61487 438361 682550 365571 107895 211092
12287 211092 356170 221893 119430 406158 449157 315005 190152 103139 11409 268570
12277 268570 294343 411714 273600 133408 219244 70224 40004 22973 135623 203697
12267 203697 234673 6025 -80022 -70985 -73803 125791 77236 86461 396675 314328 225662
12256 225662 51728 249384 348547 387837 368837 94480 -67776 5922 61178 27115 48850
12245 48850 -1841 -199897 -339950 -95239 -66636 78536 -11956 -80306 -76276 -125730 86361
12234 86361 169890 21434 -28126 11622 25157 39890 20143 -23103 161058 346810 365720
12223 365720 185841 118776 119311 71172 156927 255598 233620 124193 79107 308229 209148
12212 209148 5552 -65952 142326 124728 48034 88460 182622 213784 261353 326347 190555
12201 190555 108034 157389 139876 -9839 -126315 126048 -76699 -83279 -160213 7182 185891
12190 185891 44327 -107682 -328688 -375643 -273822 -195067 -224701 -141919 -148048 -129402 -150239
12179 -150239 -110220 39401 84743 146602 81811 121301 192080 204829 184791 129669 92732
12168 92732 147686 14918 -88813 -149956 -39668 131623 31397 -17374 80149 -42151
12158 -42151 -34323 99092 32848 101613 123842 34970 26589 -98439 -19365 10804 33970 -5066
12146 -5066 -21809 -5571 -115156 -64786 247536 393436 263711 95746 156394 108121 77247
12135 77247 -21378 114708 26246 -146077 -239550 -306950 -16752 -8808 117732 104014 -22122
12124 -22122 16662 116735 -24059 -55807 144671 300338 74126 28095 217992 347590
12114 347590 295043 149688 190312 58823 10443 17251 160504 74900 263186 226531 -19393
12103 -19393 -237107 -359195 -516108 -390553 -277741 -195889 70638 274045 162374 168214
12093 168214 144508 136482 91597 -195097 -294962 40158 180314 104983 192104 170233 31633
12082 31633 -127633 -157515 -151441 -99880 52145 124914 272807 59381 67879 305959 320271
12071 320271 291216 310035 137128 -15283 -79971 -147181 54637 137985 25538 -112872
12061 -112872 40041 -18389 10330 152232 119668 150724 203568 83136 -106326 -156573 -26133
12050 -26133 218703 132412 19436 74892 215246 327460 238693 207881 132328 102783 184992
12039 184992 35096 41122 139217 138192 125147 188254 286753 212095 159360 153006 135862 100591
12027 100591 224934 96715 -57078 -231184 -79770 76257 203065 78647 -125269 -40417
12017 -40417 -93872 -23656 44020 225078 324702 368302 399352 382934 313523 202275 146622
12006 146622 135923 83396 174853 18863 172795 197295 251160 264214 234761 245038 87420
11995 87420 58616 180711 124410 25706 -161268 -291779 -355023 -374257 -222992 -315184 -166214
11984 -166214 -140912 -212481 -164357 -125842 -208203 -248673 -231670 -70170 80532 157698 205443
11973 205443 154085 210285 281710 330314 449762 476829 362305 129659 151178 -116179 -7477
11962 -7477 -57437 -13890 96491 -93407 -291257 -170003 104011 253132 410931 404442 359368
11951 359368 331586 268616 252979 226426 335431 473292 241034 50285 -73098 29544
11941 29544 69322 -117157 -231261 -172804 -206186 30377 290080 323677 354113 174911 -118346
11930 -118346 -269310 -117230 -96599 -124948 -112407 -106280 -86683 -157858 -44614 88708 -10203
11919 -10203 -41767 -41408 -95741 -161801 -109442 -97647 30720 215278 308237 176897 72934
11908 72934 103537 -34105 -12180 94836 2423 145491 151100 27289 22715 -4416 8110
11897 8110 46597 193321 298587 160935 21288 88251 51215 -108338 -323036 -177119
11887 -177119 -95634 105207 195920 157957 151786 77164 72814 196254 23900 -102058 -68838
11876 -68838 76711 154878 133567 29081 -216535 -247831 -234868 -113896 -3066 -91941 -224513
11865 -224513 -198922 -31274 270037 194913 212664 298626 102183 86083 19909 -70848 -134571
11854 -134571 -233310 -58205 -32684 87923 238677 360387 302759 203740 376593 218006
11844 218006 167700 145373 157694 46786 86480 63129 161185 103064 47755 81777 -75454
11833 -75454 44239 -45788 -65195 46885 -93503 -78510 -99142 -119746 -141960 -58849 -276699
11822 -276699 -214291 -91369 59801 14042 24783 57603 -110806 -215364 -251855 -201350 -236987
11811 -236987 -438695 -454172 -177639 204654 346393 241194 147364 232154 54103 214308
11801 214308 327041 256101 5494 -114865 19295 -2176 -69886 121143 254263 259330
11791 259330 101535 83683 228408 204937 -81434 -281899 -78255 -80032 -148967 -226184 -192377
11780 -192377 -197330 -356308 -267370 -293499 -258157 11137 7356 -177228 -183698 -51334 -152562
11769 -152562 -124735 11638 -44385 -91332 -88208 -153521 -185089 -159916 -86115 -194254 -173708
11758 -173708 -359063 -264075 -23305 -68309 -178031 -211331 -57023 78024 -76282 -134276
11748 -134276 -295848 -200459 142781 53127 -34802 -43780 -79954 -104957 193488 259956 223192
11737 223192 210490 148370 202960 212112 117990 1967 -236931 -207330 -205311 -108515 -70456
11726 -70456 5807 89622 63544 -40789 57548 -29258 -137579 -54260 13390 15368 -6980
11715 -6980 -20461 -192935 -318212 -190326 -67423 50931 228585 179912 -54462 -357513
11705 -357513 -199454 89425 219847 264644 71494 -126362 -73807 37359 141314 205614
11695 205614 264747 224894 46240 -21645 127663 187344 97342 -161733 -3698 87707 -89588
11684 -89588 -151014 -155519 -33755 -76770 57651 76504 105459 31079 -51431 110682 53148
11673 53148 -23961 5815 34303 5349 -54913 69060 221006 321297 129101 126406 90144
11662 90144 -44384 -71157 -75211 -42944 -43664 87007 297181 362123 205860 45029 70383
11651 70383 -114029 -214716 -275463 -181009 -195 97954 104953 42544 89981 -56040 -146155
11640 -146155 -216823 -63632 40481 -46025 -55845 -137687 -80643 -69683 -125104 -130159 -8413
11629 -8413 306075 225554 154235 176076 219697 400716 430007 234989 271132 197413 238921
11618 238921 442989 137920 133199 -50709 -116882 106850 264119 101717 163155 98478
11608 98478 132812 127711 34418 101255 -116971 -185982 -221880 -325705 -280879 -161470 -106156
11597 -106156 -243140 -226382 -178711 -319701 -310780 -168487 -48627 23317 66983 48727 -75486
11586 -75486 -4533 -18511 -127077 -222853 -226660 -129507 -50756 -93390 -92207 -93069 -43227 -36734
11574 -36734 28256 36689 -37561 22737 83029 35313 -52073 38993 105818 -4890 -83080 223201
11562 223201 284874 202896 234502 215163 208488 186122 193359 392065 472064 399653 258051
11551 258051 237317 165293 -27279 -144464 -61767 99635 -92662 -96525 281283 441320
11541 441320 68148 -201447 -144974 -115432 -113639 -1051 53348 59823 57195 64328 81125 -122985
11529 -122985 -151062 -238351 -220038 -311615 -398382 -276927 -230739 -165380 -90049 -35750 42946
11518 42946 274105 279525 110462 110089 179711 143890 210563 140304 -25578 -95752 22425
11507 22425 1020 -30069 -173661 -118081 -110861 -162543 -176691 -166936 -146160 -236124 -129857 155963
11495 155963 253938 263545 305377 308539 158644 -12994 120137 284168 301447 66598 -190457
11484 -190457 -285790 -470495 -530209 -309470 -198376 -341338 -57228 190407 247050 76601
11474 76601 -32352 -32308 -126853 -7104 151620 42771 -86586 -229076 -282866 32701 367394
11463 367394 137981 -94135 -163908 -99772 -133810 -158395 -195364 -249109 -294037 -286156 -162469
11452 -162469 -205881 -291425 -210922 -158894 57103 71761 41743 114529 151522 286755 475890
11441 475890 516067 237812 -9381 -115480 -209474 -101002 66018 70557 166470 284004
11431 284004 172588 147241 36243 135715 227837 96257 37545 28564 40801 -7627 -110584
11420 -110584 -113843 -58295 -76997 -239347 -71749 137875 99422 26124 8383 -66260 -288077
11409 -288077 -409381 -429863 -512645 -431704 -255417 -395614 -450389 -239932 -218806 -100978
11399 -100978 -60341 -158099 -377664 -285939 -121793 -63319 -80178 907 -6259 -161714 46994
11388 46994 50141 -22199 -69051 -402281 -397105 -209673 -85085 -139344 -275054 -59039 14957
11377 14957 5908 11904 -54602 -94781 -19267 -5154 -44251 -123999 -162859 -153311 -68954 -231676
11365 -231676 -322211 -194150 -105462 -121800 -202270 -80827 -98484 -247226 -127625 -57264 -44278
11354 -44278 -95828 -104392 -56287 -104486 -177695 -93830 -48429 -96655 -38600 -67963 -135373 -168732
11342 -168732 -109431 22493 -41568 19384 -91920 -165310 -259786 -340814 -358882 -325015 -313973
11331 -313973 -340276 -432626 -247684 -208207 -252488 -103496 8036 63815 92790 -109459 53638
11320 53638 76371 82563 -109621 -23920 134773 197387 276593 342883 242060 4027 -52892
11309 -52892 -96853 -25187 -151670 -309191 -241018 38392 132572 140756 136255 -14111 -2430
11298 -2430 -155484 -189290 -265823 -451981 -461235 -307209 -327076 -484812 -391666 -342292 -121371
11287 -121371 -73403 -87016 -209419 -276129 -255285 -241565 -121643 -159738 -142560 -147424 -210896
11276 -210896 -349104 -476725 -210933 175464 204463 267976 74794 37270 -166476 -167884
11266 -167884 50384 28652 -25960 -83439 -35549 141531 157816 201284 -180563 -392585 -254368
11255 -254368 18116 -70170 16872 264522 111927 -74217 -182588 -246149 -78543 184337
11245 184337 245418 211667 108890 1515 -47425 68523 119689 9807 -225351 -89769
11235 -89769 -32675 358 -61819 -14775 223266 383507 201581 8586 -163797 -126878 -80637
11224 -80637 -13835 34731 -99156 -181490 -246876 -122915 -143641 -153145 -202049 -219765 -270230
11213 -270230 -240741 -211790 -244599 -130083 -100172 40061 -166804 -274501 -183419 -149925 50227
11202 50227 35040 107116 349253 156419 -3981 64747 100677 129250 217343 226499 9127
11191 9127 -36769 98499 236300 145062 26746 -341686 -656907 -516120 -360050 -61001
11181 -61001 129146 86215 -169847 -270072 -309323 -130932 -72964 25799 294550 306465 374825
11170 374825 311753 -2720 -79393 -66224 -34100 -129121 -148542 56984 169267 256292 22775
11159 22775 -111697 -77413 -24982 90749 357250 429109 277630 141229 40017 189146
11149 189146 132571 33727 -3079 -204679 -176320 -124672 -72860 -121274 -185795 -206634 -291947
11138 -291947 -197386 -47542 15019 21857 7265 -90604 -81572 -71385 87300 302252 372452
11127 372452 398135 188925 -214015 -294253 -142286 -36429 117395 112972 86523 156345 167691
11116 167691 203874 219493 101909 39293 126497 136957 74681 -39474 -143185 -84563 -54531
11105 -54531 137845 332133 349113 244637 157754 106043 138194 173640 -62641 -229846 -60516
11094 -60516 122431 274204 -33209 -454331 -497018 -366276 -348010 -183591 -116865 -114105 244
11083 244 99322 52462 57119 57726 282024 457830 487115 351354 279984 279982 276170 160852 -89086
11070 -89086 -43326 162842 5934 -39326 27913 5521 -15157 163806 76718 -179678 -405233
11059 -405233 -426119 -347017 -265280 -156667 88357 12683 19521 47606 41929 170267 258086
11048 258086 150887 -198046 -186921 -20564 26785 -181439 -65015 62509 -104201 -233918
11038 -233918 34507 88682 154844 227435 63941 37056 17125 -188568 -153873 57883 28940
11027 28940 -173936 -236262 -201706 -98262 52147 -38130 -176642 -322685 -431423 -235691
11017 -235691 -67133 -157185 -3755 -203626 -329170 -417082 -399153 -241778 28861 168092
11007 168092 203241 159174 120526 53731 -52556 -204593 -215957 -103538 45053 188723
10997 188723 -9487 -204867 -213593 -284948 -315302 -203685 -68090 38980 12057 -62088 107517
10986 107517 163362 281964 137355 -214051 -65407 -122443 -110603 -28058 -102617 -152251 31138
10975 31138 -29943 -16372 74772 128115 -185705 -545633 -439486 -244208 233300 297835 184269
10964 184269 35664 -70117 -146782 -173568 -25273 -23275 29201 199235 189683 23605 -117017
10953 -117017 -63960 -96895 -98635 19335 180476 412088 328585 123144 77663 83015 26942
10942 26942 -133546 -280352 -104757 113593 239590 265957 373049 321880 222165 188684
10932 188684 178733 315965 300255 202954 46152 95576 -60471 -198570 -136989 -225497 -200261
10921 -200261 -204200 -233045 -200460 -60036 -81330 -106138 5094 43487 -27198 -80715 -35572
10910 -35572 -8563 -113032 -83156 53086 106069 138703 -129006 -121487 138709 93295 41057
10899 41057 -26764 -10451 221066 131120 157659 97235 131198 258285 163780 -124210 -229020
10888 -229020 -226800 -64155 -21987 -54828 -136269 -2019 44506 1806 125934 167116 129195
10877 129195 246503 218456 230859 111798 96915 185602 85379 46013 -48735 -180528 -341271
10866 -341271 -217811 -43999 8052 -26015 -3519 -65465 -79986 -77875 70800 246265 268582
10855 268582 343247 250984 43037 -54772 24367 125834 187294 49251 -176945 -60312
10845 -60312 -3996 32697 42774 198988 238056 64888 108622 23507 -210865 -281897 -409638
10834 -409638 -392704 -211701 -49586 283282 384297 138448 55354 -38690 123732 127855
10824 127855 206476 296000 139170 70671 36824 -229083 -135361 59895 30514 -120217 -170670
10813 -170670 -181692 -68240 50349 81721 189064 94652 -25165 -9911 137976 126882
10803 126882 82536 154586 231321 106601 -47793 -66863 95169 10325 -83473 -207568 -220256
10792 -220256 -275335 -334222 -242255 -204152 -154587 -39020 -18714 -22443 -163337 -82294 -79326
10781 -79326 -52961 -189617 -158050 -328665 -351898 -238111 -285259 -270332 -102177 -121650 -128951
10770 -128951 -3595 36623 135628 297325 258526 180402 36380 -32724 -86650 -42116 -157273
10759 -157273 -213917 -85456 -150426 -82532 28577 154912 203615 152643 110037 83862 -37612
10748 -37612 -59460 103856 123691 76582 243693 169849 -71007 -107272 -47676 -151443 79525
10737 79525 -22816 -146324 -97793 -184495 -308094 -431220 -183904 -49086 14547 30487
10727 30487 56846 88677 -18937 -245012 -209803 -243429 -73804 -66843 -135625 -238353 -227051
10716 -227051 -208085 -11658 326568 490835 388689 195207 210331 143256 63992 -3549
10706 -3549 -84199 -46948 133057 48331 93272 284860 249257 128850 168583 -82254 51033
10695 51033 204659 121521 112976 33015 -67321 -216008 -319951 -327105 -242149 -262557 -26057
10684 -26057 139799 33160 -73062 78143 68584 3812 118858 162701 472588 472118 128667
10673 128667 44909 -58813 -177536 -63404 144260 51367 -8284 136095 -95731 -282884
10663 -282884 -230653 -126329 12552 5831 68530 -189650 -323011 -22653 150205 275038
10653 275038 306100 73098 -104247 -197328 90213 200246 138245 52909 -20917 -115869 17499
10642 17499 57594 16187 58870 66003 -5394 11017 96365 132358 31626 -36798 -75450 47938
10630 47938 -58403 -43945 109697 118667 254533 303347 230220 164139 194080 97323 235124
10619 235124 325420 61817 -102240 -42899 30924 185574 41877 -77926 -317222 -379703
10609 -379703 -204479 -129326 -174494 -17749 295636 199647 -37403 -5484 263948 282268
10599 282268 343788 462312 295279 126417 249062 181297 250154 63330 70770 33720 -111227
10588 -111227 -117156 -162093 -111020 31360 62651 -46579 -226287 -240213 -290538 -123662 152847
10577 152847 224534 182347 118645 179133 294952 94916 47404 231557 330168 372011 350541
10566 350541 147067 10987 194595 194828 49815 121313 64719 -90277 -158795 -97126 -89914
10555 -89914 158231 129800 -43764 -164659 -138692 115484 129849 175827 235597 124268 322297
10544 322297 243327 -45783 -100826 45805 45857 -16502 67007 80627 -39083 -228743 -347699
10533 -347699 -198989 -21436 -122226 -274511 -169293 -45000 82615 172635 461127 449612
10523 449612 111535 -118214 -159429 -231910 -194912 -44910 188653 300777 103360 -146121
10513 -146121 -183379 -2351 14326 23744 27657 86368 261863 359220 101084 4917 -70651
10502 -70651 -167965 -109432 -157156 27697 32266 -109708 83648 55316 -162639 -202186 -188870
10491 -188870 -162303 -59737 -30677 -166544 -142834 47436 -45764 21410 64233 19726 -62360
10480 -62360 -15391 137189 306384 448891 201036 138942 130932 174865 -88262 -345865 -341753
10469 -341753 -206845 -143092 -279861 -268342 -122407 28129 5365 -144565 -170667 -126999
10459 -126999 -225823 -213285 -269645 -180542 -247405 -86940 128033 -123707 -308008 -309089 -300741
10448 -300741 -379860 -468001 -568957 -430209 -113655 10367 -220415 -411558 -142656 39471
10438 39471 62513 -155443 -83502 -211558 -387662 -370496 -509821 -302949 -167588 -167557 -160030
10427 -160030 -38061 6918 240546 432097 344553 325356 109341 37307 -48848 -96462 -31572
10416 -31572 135291 234665 211842 101940 38131 -95665 49672 54250 220435 251780 415418
10405 415418 431981 591858 625997 809366 889419 600081 414981 206945 -168159 -275375
10395 -275375 -106515 41517 35536 -86615 -159337 63764 234887 129238 57315 -12615
10385 -12615 -259665 -83630 182912 216181 229509 194654 47926 -21361 -3954 18654 27070
10374 27070 227149 248553 191199 49876 52061 45211 80230 66791 125469 182530 200468 200407
10362 200407 78744 -180220 -176272 -43787 125168 196374 28974 65247 322046 215657
10352 215657 -31642 -119117 -159274 -65930 -93077 68284 218135 28784 6550 -41804 248815
10341 248815 188122 280951 184380 110704 29655 112745 90018 249513 269360 61521 121562
10330 121562 164660 79438 -48719 83423 208898 235145 300153 304934 280066 238598 489160
10319 489160 385106 182874 67913 -10621 -79330 -5432 175706 172887 -52094 -185911
10309 -185911 -290208 -101375 138254 109534 17356 -2868 -90052 7249 -16678 -75866 -21845
10298 -21845 -101423 -13680 313807 269954 -75533 -154208 93679 124297 193229 216259 136875
10287 136875 201208 228191 236078 142358 27385 138104 271230 51771 151491 329826 373556
10276 373556 438232 590092 521831 375142 323135 134420 37766 184101 269053 267904 313837
10265 313837 254697 100949 -79554 81747 83117 -68315 -25529 8224 44966 44742 247194
10254 247194 72752 65184 38455 -183472 -116139 -104015 56467 61840 119440 -33611 -192465
10243 -192465 -164788 238536 288919 222170 141499 45490 -174812 -311918 -269237 -206071 -269617
10232 -269617 -142446 79154 307524 248399 157631 -38291 -30220 53576 178554 212407 97250
10221 97250 147054 118724 147077 284014 279075 261475 68270 -39109 -6380 46290 102498
10210 102498 154185 120019 56025 24022 56501 113352 328982 360201 253372 157559 24111
10199 24111 132072 176809 150201 93689 242302 389961 496918 492913 430589 303249 321310
10188 321310 301250 85052 251773 554726 464623 264651 153070 80118 -139086 -102941
10178 -102941 -45517 -176563 -103111 -100166 -113688 -66773 26274 -895 17535 -113192 -35579
10167 -35579 -1036 202135 351974 94591 19727 41674 -68280 -135646 -109796 -191564 -208643
10156 -208643 -262695 -202825 -213965 -160247 -258966 -217007 -17931 94374 121064 144007 216646
10145 216646 277383 344272 385677 393027 404731 327538 543018 672662 732024 619558 320551
10134 320551 369985 128595 68941 341067 378524 325723 181110 275721 444489 145041
10124 145041 -62321 -183165 -67859 158952 145159 -74077 -100422 -72086 82181 125831
10114 125831 91908 410757 269861 54334 57297 61711 -213552 -102859 -91192 186950 66548
10103 66548 -153003 -49904 -56103 -172325 -381769 -389131 -58151 172806 17487 199029
10093 199029 326455 90268 69980 29803 -26598 -746 240927 263567 -57715 82473
10083 82473 306059 291948 130052 -75282 -223776 -310977 -264292 -169960 26132 39386 -57529
10072 -57529 -190717 -213434 -242563 -221855 29026 -34248 -105278 -72486 -313227 -501088 -247509
10061 -247509 -79430 -197120 -244798 -198 -30667 -307717 -633187 -636291 -318602 -40413
10051 -40413 131110 171716 778 -212431 -179947 -190505 -71036 -111517 -115754 -28625 -13945
10040 -13945 -63459 -206255 -241329 -151810 -88762 18050 -9533 -71396 118697 87199 17008
10029 17008 -72259 -86442 -136636 -222677 -86564 190222 32640 44141 282931 316443 490827
10018 490827 505419 405088 368450 346720 268439 -73908 -303433 -362125 -273810 -291455 -175634
10007 -175634 -240894 -33210 111053 107162 11815 -120627 -74880 -281372 -230392 -88900 -22321
9996 -22321 197161 213498 156236 119805 -19266 -140497 24928 122837 -86345 -289155 -104609
9985 -104609 -128256 -255462 -87193 -171112 -63585 27363 53489 -16827 33896 12482 17400
9974 17400 -49525 -132334 -2524 -30058 -178804 20709 239683 303416 338308 286364 186660
9963 186660 62760 183623 254209 232919 -2896 -196959 -215307 -281885 -372415 -492824 -372591
9952 -372591 -445074 -439172 -275083 -312934 -77529 31061 30826 -211542 -242308 -34604 21597
9941 21597 155282 39630 65114 174742 61698 -202636 -183413 -75579 89670 206666
9931 206666 -111131 -402084 -471448 -475082 -452471 -231472 -245166 -253907 -203369 -217833 1489
9920 1489 191351 350079 129335 -14901 130923 184510 178793 110966 -67518 28693 147334
9909 147334 115557 155527 343584 446307 312025 203144 208494 231969 297787 368192 363535
9898 363535 514073 404278 244526 308292 87615 -99517 -30750 -34199 160411 109629 280860
9887 280860 322476 171913 276325 306252 231371 71101 33519 103541 157018 159144 128180
9876 128180 206330 337873 379985 120481 29924 -96232 -62374 31903 -140607 -267007 52976
9865 52976 286193 169644 149582 160734 159387 81847 69741 24211 95603 144527 92344 162727
9853 162727 5165 6141 -162507 -259566 -294018 -272842 -132427 38583 2942 -73887 -154574
9842 -154574 -182507 27341 199244 291095 338948 405617 393940 273878 271823 431625 442982
9831 442982 418858 452116 257243 65095 -54168 -196382 -369538 -372103 -146550 -119188 -325369
9820 -325369 -258815 -92992 -71231 28131 340694 218123 -20027 -81583 -17969 24280 -58537
9809 -58537 60691 175572 269476 89979 -34020 -100800 -145007 -143360 -181486 -141448 -104567
9798 -104567 -47546 57725 -74967 -2351 78108 195596 244000 109514 40467 166904 160030
9787 160030 239445 70069 -1188 -106540 -244901 -155309 -101789 -209610 -87673 188333
9777 188333 166453 273357 257104 -20866 -176008 -150658 -153282 -46910 11109 -120785 -95665
9766 -95665 12534 43245 27222 -25199 -100951 -171919 -242875 -157791 27953 198540 289622
9755 289622 219320 72458 81150 23469 91457 120147 88640 -70413 -174996 -165353 -63174
9744 -63174 -70099 -286876 -423547 -589618 -604176 -412339 -271626 -483682 -448827 -230100 -185808
9733 -185808 -53975 -12725 -16156 -214837 -262313 -170923 -190665 -242341 -19241 41302 -123033
9722 -123033 -57324 -18161 6790 89346 25021 -4518 -145801 -166832 -119716 -2317 68930
9711 68930 -1376 -86834 -59186 -14995 84784 55956 6086 44145 -73110 -6636 23355 118366
$$ [...]
##END NTUPLES=NMR SPECTRUM
##END=
