##TITLE=Analysis number 323722
Compound Code cc 40246
Book Reference 468/187
Project Code adrs
Chemist Name colinb
##JCAMPDX= 6.0         $$ Bruker NMR JCAMP-DX V2.0
##DATA TYPE= NMR SPECTRUM
##DATA CLASS= NTUPLES
##ORIGIN= Bruker BioSpin GmbH
##OWNER= nmr
$$ XWIN-NMR		Version 3.5
$$ Fri Nov  3 15:49:38 2006 GMT Standard Time (UT+0h)  MAYBRIDGE\nmr@NMR_250MHZ
##.OBSERVE FREQUENCY= 250.131544655141
##.OBSERVE NUCLEUS= ^1H
##.ACQUISITION MODE= SIMULTANEOUS (DQD)
##.ACQUISITION SCHEME= undefined
##.AVERAGES= 16
##.DIGITISER RES= 18
##SPECTROMETER/DATA SYSTEM= dpx250
##.PULSE SEQUENCE= zg30
##.SOLVENT NAME= CDCl3
##.SHIFT REFERENCE= (INTERNAL, CDCl3, 0, 16.522)
##AUDIT TRAIL= $$ (NUMBER, WHEN, WHO, WHERE, WHAT)
$$ ##TITLE= Audit trail, XWIN-NMR		Version 3.5
$$ ##JCAMPDX= 5.01
$$ ##ORIGIN= Bruker BioSpin GmbH
$$ ##OWNER= nmr
$$ C:\u/data/dgb/nmr/ADRS/2210/pdata/1/auditp.txt
$$ ##AUDIT TRAIL=  $$ (NUMBER, WHEN, WHO, WHERE, WHAT)
(   1,<2006-11-03 15:48:57.78 +000>,<MAYBRIDGE\nmr>,<NMR_250MHZ>,
      <created by zg, POWCHK disabled, PULCHK disabled
       configuration hash MD5:
       49 4B E0 1D 92 C2 6B 37 9F E6 65 BC 52 41 86 1D
       data hash MD5: 64K
       A0 1E D9 DB 76 AD 9A E9 16 37 A4 24 53 A2 58 77>)
(   2,<2006-11-03 15:49:18.08 +000>,<MAYBRIDGE\nmr>,<NMR_250MHZ>,
      <Start of raw data processing
       ef LB = 0.3 FT_mod = 6 PKNL = 1 SI = 32K 
       data hash MD5: 32K
       F4 9A BD 73 C5 73 60 3D 78 3D EB 42 A4 F2 32 90>)
(   3,<2006-11-03 15:49:21.95 +000>,<MAYBRIDGE\nmr>,<NMR_250MHZ>,
      <apk 
       data hash MD5: 32K
       1C 1B 9B 76 06 DC 93 0C 52 00 BF C6 34 59 5E 6D>)
(   4,<2006-11-03 15:49:23.31 +000>,<MAYBRIDGE\nmr>,<NMR_250MHZ>,
      <abs ABSG = 5 
       data hash MD5: 32K
       D2 EA 1B 0A 88 A5 44 07 2B 03 8D 5B 79 57 7C 0D>)
$$ ##END=
$$ 
$$ hash MD5
$$ B0 C2 CF 1D 0B 2F 12 57 E0 21 5A 2C 04 15 A8 4A
##$RELAX= 
##$RELAX= 
##$RELAX= 
##$RELAX= 
##$RELAX= 
##$RELAX= 
##$RELAX= 
$$ Bruker specific parameters
$$ --------------------------
##$DU= <C:\u>
##$EXPNO= 2210
##$NAME= <ADRS>
##$PROCNO= 1
##$TYPE= <nmr>
##$USER= <dgb>
##$AMP= (0..31)
100 100 100 100 100 100 100 100 100 100 100 100 100 100 100 100 100 100 
100 100 100 100 100 100 100 100 100 100 100 100 100 100 
##$AQSEQ= 0
##$AQ_mod= 3
##$AUNM= <au_zg>
##$AUTOPOS= <37 >
##$BF1= 250.13
##$BF2= 250.13
##$BF3= 250.13
##$BF4= 250.13
##$BF5= 500.13
##$BF6= 500.13
##$BF7= 500.13
##$BF8= 500.13
##$BYTORDA= 1
##$CFDGTYP= 0
##$CFRGTYP= 5
##$CHEMSTR= <none>
##$CNST= (0..31)
1 1 145 1 1 1 1 1 1 1 1 1 1 1 1 1 1 1 1 1 1 1 1 1 1 1 1 1 1 1 1 1 
##$CPDPRG= <>
##$CPDPRG1= <>
##$CPDPRG2= <>
##$CPDPRG3= <>
##$CPDPRG4= <mlev>
##$CPDPRG5= <mlev>
##$CPDPRG6= <mlev>
##$CPDPRG7= <mlev>
##$CPDPRG8= <mlev>
##$CPDPRGB= <>
##$CPDPRGT= <>
##$D= (0..31)
0 1 0 0 0 0 0 0 0 0.06 0 0 0 0 0 0 0.0002 0 0 0 0 0 0 0 0 0 0 0 0 0 0 
0 
##$DATE= 1162568935
##$DBL= (0..7)
120 120 120 120 120 120 120 120 
##$DBP= (0..7)
150 150 150 150 150 150 150 150 
##$DBP07= 0
##$DBPNAM0= <>
##$DBPNAM1= <>
$$ [...]
##$SUBNAM7= <"">
##$SUBNAM8= <"">
##$SUBNAM9= <"">
##$SW= 20.6930455092707
##$SWIBOX= (0..15)
0 0 3 0 0 0 0 0 0 0 0 0 0 0 0 0 
##$SW_h= 5175.983436853
##$TD= 65536
##$TD0= 1
##$TE= 683.16
##$TE2= 300
##$TE3= 300
##$TEG= 300
##$TL= (0..7)
0 120 120 120 120 120 120 120 
##$TP= (0..7)
150 150 150 150 150 150 150 150 
##$TP07= 0
##$TPNAME0= <>
##$TPNAME1= <>
##$TPNAME2= <>
##$TPNAME3= <>
##$TPNAME4= <>
##$TPNAME5= <>
##$TPNAME6= <>
##$TPNAME7= <>
##$TPOAL= (0..7)
0.5 0.5 0.5 0.5 0.5 0.5 0.5 0.5 
##$TPOFFS= (0..7)
0 0 0 0 0 0 0 0 
##$TUNHIN= 0
##$TUNHOUT= 0
##$TUNXOUT= 0
##$USERA1= <user>
##$USERA2= <user>
##$USERA3= <user>
##$USERA4= <user>
##$USERA5= <user>
##$V9= 5
##$VALIST= <valist>
##$VCLIST= <CCCCCCCCCCCCCCC>
##$VD= 0
##$VDLIST= <DDDDDDDDDDDDDDD>
##$VPLIST= <PPPPPPPPPPPPPPP>
##$VTLIST= <TTTTTTTTTTTTTTT>
##$WBST= 1024
##$WBSW= 4
##$XGAIN= (0..3)
0 0 0 0 
##$XL= 0
##$YL= 0
##$YMAX_a= 471622
##$YMIN_a= -350572
##$ZGOPTNS= <>
##$ZL1= 120
##$ZL2= 120
##$ZL3= 120
##$ZL4= 120
##$ABSF1= 16.522
##$ABSF2= -4.171173
##$ABSG= 5
##$ABSL= 3
##$ALPHA= 0
##$AQORDER= 0
##$ASSFAC= 0
##$ASSFACI= 0
##$ASSFACX= 0
##$ASSWID= 0
##$AUNMP= <proc_1d>
##$AZFE= 0.1
##$AZFW= 0.1
##$BCFW= 0
##$BC_mod= 0
##$BYTORDP= 0
##$COROFFS= 0
##$CY= 12.5
##$DATMOD= 1
##$DC= 0
##$DFILT= <>
##$DTYPP= 0
##$F1P= 14.0000005364418
##$F2P= -0.99999901652339
##$FCOR= 0.5
##$FTSIZE= 32768
##$FT_mod= 6
##$GAMMA= 0
##$GB= 0
##$INTBC= 1
##$INTSCL= 1
##$ISEN= 128
##$LB= 0.3
##$LEV0= 0
##$LPBIN= 0
##$MAXI= 10000
##$MC2= 0
##$MEAN= 0
##$ME_mod= 0
##$MI= 0
##$NCOEF= 0
##$NC_proc= -3
##$NLEV= 6
##$NOISF1= 0
##$NOISF2= 0
##$NSP= 0
##$NTH_PI= 0
##$NZP= 0
##$OFFSET= 16.522
##$PC= 1
##$PHC0= -38.06052
##$PHC1= 4.681641
##$PH_mod= 1
##$PKNL= yes
##$PPARMOD= 0
##$PSCAL= 4
##$PSIGN= 0
##$REVERSE= no
##$SF= 250.13
##$SI= 32768
##$SIGF1= 0
##$SIGF2= 0
##$SINO= 400
##$SIOLD= 32768
##$SREGLST= <1H.CDCl3>
##$SSB= 0
##$STSI= 32768
##$STSR= 0
##$SW_p= 5175.98343685301
##$SYMM= 0
##$S_DEV= 0
##$TDeff= 65536
##$TDoff= 0
##$TI= <Analysis number 999999
Compound Code 99
Book Reference 9
Project Code 9>
##$TILT= no
##$TM1= 0
##$TM2= 0
##$TOPLEV= 0
##$USERP1= <user>
##$USERP2= <user>
##$USERP3= <user>
##$USERP4= <user>
##$USERP5= <user>
##$WDW= 1
##$XDIM= 32768
##$YMAX_p= 351935358
##$YMIN_p= -173193
$$ End of Bruker specific parameters
$$ ---------------------------------
##NTUPLES= NMR SPECTRUM
##VAR_NAME=  FREQUENCY,     SPECTRUM/REAL,   SPECTRUM/IMAG
##SYMBOL=    X,             R,               I
##VAR_TYPE=  INDEPENDENT,   DEPENDENT,       DEPENDENT
##VAR_FORM=  AFFN,          ASDF,            ASDF
##VAR_DIM=   32768,         32768,           32768
##UNITS=     HZ,            ARBITRARY UNITS, ARBITRARY UNITS
##FACTOR=    0.157963299565203, 1,           1
##FIRST=     4132.6476996994, 0,             0
##LAST=      -1043.33573715361, 0,           0
##MIN=       -1043.33573715361, -173193,     0
##MAX=       4132.6476996994, 351935358,     0
$$ Real data points
##PAGE= N=1
##DATA TABLE= (X++(R..R)), XYDATA
$$ [...]
16393a1122l6361L0853Q301J5092P805o564q672J8526j0218K550L6200L2492k0889
16380E7993l9236N0922l854l107o516m0611j8131J3174m125J7958J4691r575k8192
16367A391j6930j9610m894p661l3978p889K1729K5156J9812j9101K9799J953J7888
16354G665n415K296K43j2129r727m2489k7683N7181M9677l975k0540J0689L88
16341F181m3280q5167N071N3225L5350J3503m49l1531M5706J5037J656j8665J0838
16328G475j2823P111Q764p671Q361j8123l7137K3830J5543j3018L96k619l473
16315b3384K1226J0509J2250m3855J7401K2952j2281j2537K6286J1014p240m5039
16303b2698j1098J0211L968j5039Q462L19k8652j2909L2011L3477J558j0250k6193
$$ y = [-11122, -47483, -16630, -8329, 6763, 14568, 8004, -668, 17858, 7640, 10190, 46390, 78882, 57993, 18757, 69679, 65825, 62718, 56202, 15591, -2540, 10634, 6509, 24467, 39158, 29583, 1391, -15539, -35149, -40043, -47704, -81682, -89571, -67842, -42686, -22874, -41975, -12176, -10223, 7665, 2250, 4546, 4789, -7340, -17067, -59556, -87239, -30058, 19619, 15644, -4896, 5793, 6181, -37099, -122266, -117195, -63970, -28620, -15117, -15566, -47097, -1391, 13646, 15302, -3363, 7475, -5348, 1763, 10527, 2856, 11217, -6906, -44043, -20213, -4670, -17688, -17292, -19911, -23384, -2158, 8351, 20601, -23254, -5853, 17099, 4818, -7719, 18567, 29581, 22341, -22698, -33796, -23585, -19617, -34656, -26194, -25875, -54527, -67436, -35425, -1948, -390, -10640, -36833]
16290c6833J0128J6132L76L472q426M1410o487K6213O019j6889j5188k7650n079
16277a2802j7460j5086n44L13L5421k7262k2106j0874J4410K8187N7267j8686
16265A0778n784N3330j3535l5397K7214P797j5976j988o889j174k9887m3972J7519
16252c7964j9854L867J5051J9424j9799P9J3838J5118O03K0331J0946k0227N166
16239F579J6030K3795O000j3366q688Q790l4888J2103J6850L183j6913O124r982
16226A5617k9854r324l9574r498O9470P199p380p530j2135k4178j1346J108L6657
16213b0768K7138K4722M6023j0116p9104k2816K236j132L607L2184l6313J2139
16201b2200J1716l5785j6271R310K0370K9722J3316l5275l8578J5463L9639j3261
$$ y = [-36833, -26705, -10573, -10197, -6725, -15151, 26259, 19772, 45985, 52004, 35115, 19927, -7723, -12802, -30262, -45348, -45892, -45579, -10158, -37420, -59526, -70400, -55990, -27803, 29464, 10778, 4994, 58324, 44789, 9392, 36606, 44403, 28427, 26439, 19550, 18376, -11511, -55483, -37964, -57818, -53951, -38900, -19476, -39275, -39196, -25358, -10240, -9637, 10694, 21640, 1413, 6579, 22609, 46404, 52404, 39038, 30350, 39140, 4252, 16355, 33205, 36388, 19475, 25599, 15617, -14237, -23561, -63135, -72633, -3163, 4036, -3344, -10874, -23009, -47187, -58533, -57425, -20768, 6370, 31092, 77115, 66999, -12105, -34921, -32685, -33817, -30210, 1974, -34339, -22200, -10484, -46269, -62540, -53230, -32860, -3138, 10178, -25097, -63675, -48212, -8573, -21834]
16189b1834J5180m97J189J0096J3267m48k1513j6396r354N029k4189J3113M2179
16176E822o2075k7995L8069J3554L2705K3407n467J809j2223J6335p806j630m544
16163I961m3481l1972j1818N0301M6587k4056m3271j113N0469j2311n7847k1689
16151i0240m903j0144M4155m769J0967o23N6554O189k0479p019j2555J6330m752
16138b1289J071m853L250j4865J4283O8152q96j1686m9383J84L3973J2290l2036
16125a805J7715K3051p861n4436o1382Q17J7084M6018J3422j7480k3126m1625
16113h9608J2798K2141J4031J4402j7933J5305J8213p027L2288K2390m7384l4682
16101d5066k4363K1645r120N1453M8032k871K2366l367l9830j6241n511N875K4935
$$ y = [-21834, -6654, -7151, -5962, 4134, 17401, 16953, -4560, -20956, -30310, -25281, -49470, -36357, 5822, -56253, -84248, -46179, -32625, 80, 23487, 18020, 19829, 7606, 23941, 16135, 14505, 9961, -33520, -65492, -77310, -27009, 19578, -4478, -47749, -48862, 1607, -10704, -68551, -90240, -95143, -105287, -61132, -65901, -54934, -55557, 997, 7186, -13293, -20312, -32867, -16537, -21289, -20218, -25071, -21821, -36686, -22403, 45749, 44853, 33167, -16216, -16032, 17941, 30231, -1805, 15910, 38961, 31100, -23336, -84718, -83901, -66817, -20799, -7377, -24857, -47983, -89608, -76810, -54669, -40638, -26236, -44169, -28864, -10651, -17678, 14610, 37000, -10384, -45066, -69429, -47784, -56904, -5451, 42581, 39710, 62076, 58709, 18879, 2638, -2873, 3002, 27937]
16088B7937j9769m8326k9618P223L3465K1287j0741j4709R908M9296j0499k7632
16076a2178n8300P876R131Q52j3607j3520N4765o112L4131j0846k5511N892K3413
16063d014l163R741L0291J0897j5597L887K1680k1920J3375j4146n2839l3271
16051e5079P691L3047M4052L5904J5186l8326m2346l0489k1566Q191L3789J9864
16039I918l8988K983o490k6287L0633J288K7003K9545J6355k7220m9977J5602
16027a5635j1422J5660M3147l308k3724l4217M351l1129j0721L5454L160j5693
16015d4077m4249J743N6179K5819l5735l678j2828P71K8043j6671J5489P584J4246
16002g364k4052J0424K8372M4606k2462l1454j5899K1077J4471J8889j5680p3305
$$ y = [27937, 8168, -40158, -69776, -62553, -29088, -7801, -18542, -33251, -23343, 25953, 15454, -12178, -70478, -62602, -53471, -52619, -66226, -79746, -24981, -31093, 3038, -7808, -33319, -27427, -4014, -7177, 2564, 32855, 43752, 28155, 32042, 53722, 31802, 45177, 31031, -21808, -55079, -47388, -14341, 29711, 65615, 80801, 42475, 129, -30360, -51926, -43735, -9946, 9918, -29070, -26087, -32577, -58864, -28231, -26943, 60, 29605, 45960, 18740, -31237, -15635, -27057, -11397, 31750, 28442, 4718, -29499, -25148, -56277, -66998, -31544, -28384, -44077, -88326, -86583, -30404, -4585, -40320, -43998, -56826, -56055, -28012, -44683, -29194, -21610, -7364, -31416, -20992, 7380, 51986, 29524, -1930, -17829, 3248, 17719, 36608, 20928, -52377]
15990e2377p342M148P650l2596O591K246J0918P08J0062J424m2852O754K4433
15977f0233J7460k5996L8590K8223k6991J542k2553k521l538J1924M7115J1019
15965A4041J1920K4295o427K9848j5690o218q582l906k9252j9228j0839j0141
15953c0179K6705M0980k3310m1985o1808k7937O8195P8474K6215k8136j2139N694
15941B0769K957k4911l2853q966J5189N0141R576j2304N132j9056p4659p457K3320
15928e3122M1030L3123k0048k086j1482j132K5238k0510j0254L1921k0939k0142
15916b8403k2716j6953L4725L4449L6235k3605J7296O430K9796n074nj1211k4111
15903B6853j6344m2762n804j9148O550L9739K9726j0834o5103N497K7852m310
$$ y = [-52377, -59719, -55571, -47921, -80517, -73926, -71680, -60762, -60054, -49992, -48568, -91420, -84666, -60233, -42773, -68769, -30179, -1956, -28947, -27405, -49958, -52479, -56017, -44093, 3022, 14041, 25961, 50256, 43829, 73677, 57987, 51769, 43187, 39281, 10029, -9199, -20038, -30179, -3474, 37506, 14196, -27789, -89597, -117534, -49339, 29135, 55350, 27214, 15075, 20769, 23726, -1185, -34038, -43004, -27815, 22326, 31902, 19598, 24730, 5674, -68985, -76442, -53122, -12092, 21031, 983, -1103, -12585, -13717, 11521, -8989, -19243, 12678, -8261, -28403, -51119, -68072, -33347, 1102, 37337, 13732, 31028, 37458, 67254, 62180, 62175, 50964, 26853, 10509, -32253, -38057, -57205, -50655, -10916, 18810, 7976, -57127, -51630, -23778, -28088]
15891b8088j7628j8466L9285j5306j8406j3950j4454q7K4004m965l5731M4619
15879e9173O7337k760k0025k605k289k403L870m0529n029j9385j5511P991K7812
15866f2699J8187j1652o793J6650J8662l0838N6742K6111o4586m1170J0091O3680
15854g615P316j9760j5045L7405k8953j443j3087j9483j7480L2349O872o015J0189
15841c4750K4625J9650k1364k7989l7784J2742o570M6291J3230J1761M7035J8822
15829F5699k0274j7948J4349k4442l3497j4195j370Q131l897O630J457k4552k2164
15816f6073L2110K2925j6121m612j4701K7032J6780j157L0358r080l4599k7595
15804d4733N374O4854J7597J4942r509M1974j2997n5109l4862j0165L5075q275
$$ y = [-28088, -45716, -64182, -24897, -40203, -58609, -72559, -87013, -87100, -63096, -68061, -103792, -59173, 8164, 5404, -14621, -17226, -19515, -21918, -18048, -58577, -63606, -82991, -98502, -90511, -62699, -44512, -56164, -62957, -46307, -27645, -58483, -1741, 24370, -40216, -81386, -71295, -7615, -299, -20059, -35104, 2301, -26652, -28095, -41182, -60665, -78145, -45796, -38924, -44939, -34750, -10125, 9525, -11839, -39828, -77612, -64870, -71440, -25149, -11919, -158, 46877, 65699, 45425, 27477, 41826, 17384, -16113, -30308, -31678, -23547, -27444, -20814, -19357, -43909, -66073, -33963, -11038, -27159, -31771, -46472, -19440, -2660, -3817, 26541, 17461, -17138, -44733, -39359, 25495, 43092, 58034, 48525, 90499, 77502, 22393, -12469, -22634, 12441, 4166]
15792D166l3201J1495J8096M3681O003n145Q926l7468k0338k2866K9625K6180
15780B9154r338k9962l893o977P240N543P459j809K1495M164q196j9703q320M792
15766h351k0204R146M7861l6552J8957k1147M802K4674l2912k2776m51L1975j1571
15753a6549p7J9665l6857j6662j688K9238L8584k6978j5904m4773k4636R819l725
15740i0543L9216O2077J398k1680N0751k111j9397j0489l3756l5496l2665M7490
15728d5205N7550o091j2347p608j879M6286J1344j5798r4420n9847K042M5268
15716h0705N0502M8472L5440k2814l2485j9084O2043L1709n2916o411K0009m4612
15704a0852m2991J2228L8287J2746K0973p167k6910K6749J7326j2885k3126j2507
$$ y = [4166, -29035, -17540, 556, 44237, 50240, 45095, 54021, 16553, -3785, -26651, 2974, 29154, 19816, -10146, -14039, -21016, -13776, -8233, -774, -2583, 18912, 23076, 14880, -4823, -13143, -8351, -28555, -19409, 28452, -8100, 10857, -10290, -5488, 19186, -13726, -36502, -36953, -4978, -16549, -16626, 3039, -33818, -50480, -52168, -22930, 15654, -11324, -27228, -72001, -96637, -86818, -90543, -51327, 10750, 12148, -9532, 41219, 39108, 19711, 9222, -24534, -60030, -92695, -45205, 12345, 6254, -6093, -13701, -15580, 30706, 42050, 26252, -68168, -128015, -125973, -80705, -30203, 18269, 53709, 30895, -1590, -20674, 41369, 73078, 20162, 13751, 33760, -10852, -53843, -41615, -3328, 9418, 30391, 23224, -3686, 23063, 40389, 27504, 4378, -8129]
15692h129n451O2045J254j1011m5717j8032L789k5116k8946M1353R448k8477N9323
15679F333K3708m6150n6762J5787J4644j8936L7407k5265k0074K4967K5824J7181
15667a336J6855j3937J3794K5319L974k7451l5019p400l227j1604l6305o057J4930
15654f7464J1234j098J9161J532J320L972L631K8190J7388l2546Q084p726k8476
15641d2798j0341k5921K8657J1578l223J5022J1654R852L6433J0292n6499k9814
15629d5108J8539L233M610l5585m593j9961k0391n973N1988M2387J5757J0644
15617A5547k6677l2817R499J3096K8555k5509l5306O236j9212l1014M21L4789
15605f2392l0174j5037K9548R096k4900J8061J5812K9407L6142j6129J0341L7460
$$ y = [-8129, -13580, 48465, 49719, 38708, -7009, -25041, -21252, -46368, -75314, -33961, -24513, -52990, 6333, 30041, -16109, -72871, -57084, -42440, -61376, -23969, -49234, -69308, -44341, -18517, -1336, 15519, 1582, 15376, 40695, 44669, 17218, -17801, -25201, -28428, -40032, -76337, -82394, -67464, -56230, -57328, -38167, -36635, -35315, -31343, -27712, 478, 17866, -14680, -6596, -14322, -42798, -53139, -79060, -50403, -38825, -42048, -27026, -15372, -5520, 30913, 41205, -15294, -45108, -26569, -23336, -18726, -54311, -58904, -78865, -99256, -105229, -53241, -10854, 4903, 15547, -11130, -43947, -34448, -21352, 7203, -18306, -53612, -47376, -66588, -97602, -97181, -62392, -92566, -107603, -78055, -68959, -93859, -75798, -59986, -30579, 5563, -10566, -225, 37235]
15593C7235K5909l4681k550k3396J4104J1315j7299M47k0045m604J4096L9443
15581C9974M15k9346M13o333J179L5680J279j1306j5982j2032K6598l1286J0133
15568I386L7185q304n6449l16j1533j974J36j1742J0149N0626l8015j6245J7394
15555a9702J7208j733K5027j7267m6948J9399J3185K0414J5011K4145l039J3398
15543E9098m2914j1204j6434K795L2041K0162K9008j3215j3265N416o2761O29
15531a0644l792k7721J4920J5739k0025J1703J781L2496J1560l2868j9633O0484
15519C4000l8029m0881l6879M3082O686j3840N185j8389j8383L2914N0397L9917
15507D5780j7027o0402l1538n515M4765L325j5927L3237K2282k6304K616l804
$$ y = [37235, 63144, 28463, 25913, 2517, 16621, 27936, 10637, 11084, -8961, -13565, 531, 39974, 40389, 11043, 11456, 5123, 6302, 41982, 43261, 31955, 15973, 3941, 30539, -747, 9386, 46571, 38267, -18182, -18498, -30031, -32005, -31869, -43611, -33462, 17164, -20851, -37096, -19702, -2494, -4227, 20800, 3533, -43415, -24016, -10831, 9583, 24594, 48739, 45700, 59098, 16184, 4980, -11454, -8659, 23382, 43544, 72552, 59337, 46072, 51488, -11273, -10644, -14436, -42157, -27237, -11498, -31523, -19820, -18039, 14457, 26017, -6851, -26484, 34000, -4029, -44910, -81789, -38707, -32021, -45861, -40676, -59065, -77448, -44534, 5863, 45780, 28753, -31649, -63187, -68702, -23937, -20612, -36539, -3302, 18980, -7324, -4708, -8512]
15495h512p860l6468o952p103J9578M9073m109k7052m3160J5501L7346N1464K0816
15482E2562l5674k0219M878J9632N130l873L5684n692m5321J2481N638K5925k8938
15469B2213k1479L263N115K471J3991k9064J5947k721K2390j8099n0071K2761
15457a3283K4522J7030l9219k4172L1205R604M2674k1271k5182J5877l1531J7393
15445C647J9322J8300k0819l5235Q01m009l4420j3213l492J0304p173N7800L9987
15432C1800j1829R172l559p008p505m3111K6095K451k7918k2801L7277m970l0641
15419e2547P239O0304l6863o6252J6159Q8371K9735m6246n2828J7731K2190k8240
15407d1247K0586j504K0608J9903J5006j1311k2833q023K3824K8295M5505j1163
$$ y = [-8512, -16372, -52840, -59792, -66895, -47317, 1756, -2353, -29405, -72565, -57064, -19718, 31746, 52562, 16888, -3331, 1547, 21179, 26309, 22436, 58120, 52428, 7107, 19588, 25226, 51151, 22213, 734, 3997, 9112, 11583, 25574, -3490, 12457, 9736, 32126, 14027, -36044, -13283, 11239, 28269, -10950, -35122, -3917, 5687, 48361, 27090, 1908, 17785, -13746, 3647, 22969, 41269, 20450, -14785, -13984, -17993, -52413, -65626, -69118, -58814, -65987, -8187, 31800, 19971, 29143, 25584, 18576, 11071, -32040, -5945, -3494, -31412, -54213, -16936, -21906, -52547, -45308, 14996, -21867, -88119, -71960, 16411, 46146, -100, -52928, -35197, -13007, -41247, -20661, -22165, -1557, 18346, 33352, 22041, -792, -8815, 15009, 43304, 88809, 77646]
15395G7646o7080n4381k3047L55K020L7005O46l4494j8304M2853N9050j5411m2605
15382c5747l2356p312K5140M3812L2402K7203L09j3898j5505J0430K2695k7627
15370B9546J831r236n2536J1979M2797j3183m2197j2489l066L7886O706j4631
15358a6593o953K7686J9833O497o3323l5874K2519P4102M314p60K1273k3931J8240
15345D7030M4203j201m5775j4345k9600m619n773J7051L071j1965K615M0723K796
15332D4211m5217k3583M1321L6166o776p3167l0113k44K3077L7213J4114M958
15320B1960j5337J7347j3372n4167k9977N0009M2353m6986n0196J9432N3798J4968
15308I832k137L746R595k2874k3367l1196P307j8314M3370n933j2211q223l0121
$$ y = [77646, 10566, -43815, -66862, -66507, -64487, -27482, -26836, -61330, -79634, -36781, 22269, 6858, -35747, -68103, -75415, -50275, -6463, 25939, 53142, 53451, 39553, 24048, 34478, 57173, 29546, 31377, 22141, -30395, -18416, 24381, 11198, -30999, -43488, -46554, -8668, -1962, -16593, -23546, 4140, 23973, 30470, -32853, -68727, -46208, 27894, 32208, 31448, 52721, 28790, 47030, 91233, 90032, 44257, 29912, 312, -4307, -10080, 6971, 10042, -1923, 692, 41415, 44211, -1006, -24589, 16732, 52898, 46122, -27045, -57158, -57402, -34325, 2888, 17002, 21960, 6623, 23970, 10598, -43569, -73546, -23537, 18816, -28170, -78366, -58934, -5136, 9832, 7695, 11441, 21036, -1838, -25205, -56401, -49094, -67408, -24038, -29971, -42182, -50405, -80526]
15295h0526n343N5928M7846R954J0590m4137k866L3492J769j6269k4071K4901
15283A1268k90k7122m1178J1698M5297n219l08j817k9798Q191J0908k9830n7381
15270a05581L5043M9469M1368P5679j7564n9482k0187L0837J0867k138L4587k2832
15258E0066k8794j0993p460l975l539k5099L5073M0411K9745j8277m3491m4353
15246c0686K0160J7584r254J1210R979L9970K5270k9330o0160k0303k3129j3921
15234f2610J2612N0468N1523k9073m3352k4487l6804J6235K2449k6294N631Q099
15222e5603k637O2343P6099N003J73j359n0569j7538J699J1660j4662k6845l4802
15209d7038P859K7678j8288k0682J7442K961j5104j890m1159m438J0607p173J8201
$$ y = [-80526, -85869, -29941, 17905, 27859, 38449, -5688, -8554, 24938, 26707, 10438, -13633, 11268, 10978, -16144, -57322, -45624, -327, -5546, -5854, -7671, -37469, -29278, -18370, -48200, -105581, -70538, -21069, 20299, 95978, 78414, 18932, -1255, 29582, 40449, 38311, 72898, 50066, 21272, 10279, 2819, -1156, -4695, -29794, 5279, 45690, 75435, 57158, 13667, -30686, -10526, 7058, -2196, 9014, 18993, 58963, 84233, 54903, -5257, -25560, -48689, -62610, -49998, 470, 51993, 22920, -20432, -44919, -81723, -65488, -43039, -69333, -63702, -55603, -58240, 4103, 80202, 85205, 85378, 84019, 33450, 15912, 17611, 29271, 14609, -12236, -47038, -39179, -11501, -29789, -50471, -33029, -30068, -45172, -47062, -88221, -92659, -82052, -89225, -71024]
15196g1024K620J6318J4819j9489j0719K4851N0870J0523k5903K9512o167k8657
15184a2446Q00J8569L2169j6412k8200m2178o3495J7089M1424L6959L994K4681
15172A2954m3526j6700L5313M2491J2516p329m5454j9758J1832L2006j1334l9212
15160c6201K472J2930k0456p096M9105K4587j3721j4801k8975J135J4133Q831
15148h057j9308J8678j8414l2913M417J8438K1839m548k7898k0578l9675J9537
15136h8482L9790N0878K0906k1570K271J2335k3949j2798R924J1455j7129r317
15124b5686r622k0147J0268L4579k8231j6603R379l8350j9931K2479K6570l167
15112e8462L1323N124k3153p955K3410L5695k888K6374L8021j4507k0361k2238
$$ y = [-71024, -68404, -52086, -37267, -56756, -67475, -42624, 8246, 18769, -7134, 22378, 16211, -12446, -11646, 6923, 39092, 22680, -5520, -47698, -111193, -94104, -52680, -15721, -11727, 12954, -30572, -47272, -11959, 30532, 43048, 35719, -9735, -29493, -17661, 14345, 3011, -36201, -33729, -20799, -41255, -48351, 754, 25341, 11620, -3181, -32156, -31021, -16888, -8057, -27365, -8687, -27101, -60014, -55597, -37159, -15320, -19868, -47766, -68344, -108019, -88482, -48692, 2186, 23092, 1522, 3793, 16128, -7821, -20619, -10695, 760, -16369, -25686, -35308, -55455, -45187, -10608, -38839, -55442, -46063, -84413, -104344, -81865, -55295, -58462, -27139, -22015, -45168, -53123, -29713, 5982, 3094, 29468, 67489, 52982, 32621, 10383]
15100A0383j1576J910r32j3555l701j8225j4906J7113k3097O990N0968K2758J2032
15087C6162O325n954j4826j4794M256P5q7043k4937M1111L8154R3j8955O355k7422
15073f1400J1890J7827J4045n902k2260P48J2768J3840j4606J7773m167L0375
15061A0931k8268J208n70l6604P941K4320K5502j6099k8246l4116K0954J9959
15049c3088M2622j0842l277K9778k1955J845J444o197L505J2220Q287l5551J2526
15036A317M458j6663k5566K9842n318j226o1631k8337J6337P2155j7679l8886
15024g1197m189J5820M8828J0222l0894J6013k67J0387P439l726R122j5921j3416
15011b1779L6604Q3754m655n6264j6342j1849j7680k5123K3633J8593P308j9436
$$ y = [10383, -1193, 717, -215, -13770, -17471, -35696, -50602, -33489, -56586, -49596, 1372, 24130, 36162, 42487, 36533, 21707, 6913, 11169, 11244, -75799, -100736, -59625, -21471, -21378, -40333, -33978, -61400, -49510, -31683, -17638, -23540, -45800, -45052, -32284, -18444, -33050, -15277, -19444, 10931, -17337, -16129, -16699, -53303, -45362, -21042, 4460, -11639, -39885, -74001, -53047, -33088, 9534, -1308, -4585, 25193, 3238, 5083, 6527, 330, 3835, 16055, 24342, -11209, 1317, 5775, -10888, -36454, -6612, -11930, -13156, -74787, -103124, -86787, -14632, -32311, -71197, -75386, -59566, -10738, -516, -31410, -15397, -15664, -5277, 2162, -1564, 7558, -8363, -21779, 14825, 98579, 93924, 37660, 21318, 9469, -8211, -33334, -9701, 8892, 16200, -3236]
14999c236k4941M1852M4436r913l2721m4304L630L5234J9548m4890k8693M040
14987c9958j5245k7010J5543L3924l604n0663k6868K7848L4446N1917K3703l118
14975B0915R875m046K841j5419Q085l5375q994M5237k0212j6930N072j253j2453
14962b2657q575M372k122J5747j7372k2925K2032Q045O979j1898j905L1693k634
14949a220L0408N1321Q914k1728k9473P696k2488l8013K4823p090k7357k7719
14937e1926J4093M3715Q152K1312j453j0159J1202K1203M0601j1532n0164l7354
14925b310k523j9886L057o726O886K190J7226L4019P560J4160J4142r661j5300
14912D2834k2244p907j0968k9652K2812J1734q182K0015o0716n3690K0799K6502
$$ y = [-3236, -28177, 13675, 58111, 48198, 15477, -28827, -25197, 10037, 29585, -15305, -43998, -39958, -55203, -82213, -66670, -32746, -36350, -87013, -113881, -86033, -51587, 330, 24033, 20915, 30790, 26744, 29585, 14166, 22251, -13124, -22118, 23119, 2907, -14023, -8951, -10204, -22657, -31232, -26860, -28982, -13235, -30607, -53532, -31500, -23455, -16476, -28374, -30279, 1414, -1220, 29188, 80509, 89423, 67695, 38222, 45918, 23430, -14583, 10240, 3150, -24207, -51926, -37833, 5882, 14034, 35346, 33893, 23734, 34936, 56139, 96740, 85208, 35044, -2310, -4833, -24719, -21662, -28388, -21502, -19312, -2086, 31933, 39493, 53653, 67795, 58134, 42834, 20590, 12683, 1715, -27937, -5125, 6609, -1573, 18442, -42274, -95964, -75165, -48663]
14900d8663J9011K7615L452p693J3832q507M295J9597K6745o253K584J1529p7051
14887a9507m5267M8986L5451j3407Q588J6890J8466j3674l1968j7376O895k197
14875h120j5413j6359J6414j7916J7740L6543K5187m7122j0442L1907M825P624
14863B4868p276k6684o516K7325J6737J2054m104M045j4585l0866j1200j341j4405
14850c1948J8170J8286k3032l0535j6314M581L6222J0992K238j4905m7119k3254
14838i6618Q409N0416K3626K1206K0164j3414m6500o1200K2294L8638L7137j9669
14826a5511l8384k5401P369N1782J5611k5338k6021N238M5886J4185k8302k1617
14814d0503J730O700R7K186R066j0242j1252K7472m141j1650k1866j1364j1997
$$ y = [-48663, -29652, -2037, 1415, -6278, 7554, -953, 3342, 22939, 49684, 43431, 46015, 57544, -19507, -64774, -15788, 19663, 6256, 14844, 31734, 50200, 36526, 4558, -12818, -5923, -8120, -23533, -39892, -23478, -41394, -23654, 12889, 38076, -9046, -19488, 12419, 17244, 24868, 17592, -9092, -15608, 11717, 28454, 40508, 36404, 40449, 25864, -5002, -16202, -17543, -31948, -13778, 4508, -18524, -49059, -65373, -60792, -24570, -13578, -11340, -26245, -73364, -96618, -88209, -37793, -14167, 7039, 27203, 13789, -32711, -93911, -71617, -32979, 4158, -15511, -53895, -79296, -71927, -20145, -4534, -29872, -55893, -50655, -4769, 9416, -18886, -40503, -38773, -32073, -31976, -29790, -20724, -30966, -42218, -14746, -18887, -30537, -52403, -63767, -75764]
14801g5764l0988M3418K9696M5554J9157q855n2340n5098l1978P395L6408N381
14789f8014q404Q418J9073J1111P687j7983l1291J9086L8982J0661M008M3478
14777C6812L2664m4289n4856K8370J636l3943J4056J5794O777j2098L1855N3523
14765G6301J3068o178N532m2287K0112j1345n1374l5636j9197M1364L9150J3101
14753D2611J8366N774m5688L78J6243l5120k3368Q979l4127j5840J7707N2097
14741H012L260j8154J5719J4504j6528j3941k7767M066n0998k9934L2801K0165
14729e8795L7231P884j6808n169k774J7855M7839K3502k0830k7187k9079j0296
14717c6627M548m654L8032M4723J3985n682R560j6681m7694j9240k9048J757j6742
$$ y = [-75764, -106752, -63334, -33638, 11916, 31073, 22218, -30122, -85220, -117198, -109803, -73395, -68014, -76418, -68000, -48927, -37816, -30129, -48112, -79403, -60317, -21335, -10674, -6666, 36812, 69476, 25187, -29669, -1299, 337, -33606, -19550, -3756, 3021, -9077, 22778, 76301, 89369, 83191, 88723, 46436, 66548, 55203, 3829, -31807, -51004, -9640, 29510, 42611, 60977, 66751, 21063, 21441, 37684, 2564, -20804, -11825, -45952, -61792, -44085, 8012, 11272, -6882, 8837, 23341, 6813, -7128, -34895, -30829, -81827, -111761, -78960, -58795, -21564, -13680, -30488, -35657, -38431, -20576, 27263, 50765, 29935, 2748, -26331, -36627, -32079, -36733, 1299, 46022, 60007, 54325, 63885, 47204, -490, -19730, -48778, -47021, -63763]
14704f3763r815K0172k0908j3293L7049N4843J8730l4397j8493j699P502L2688
14692H616k8833n952L9414k0903j073k0081j2990j3749J7697N0898l0089M421
14680a2624O935p033N6196L1818o826k6809m3546m7856K0564L7744o861J7584
14668A9286j4577k013Q628J4105Q050K379K6569l793p0332o4271j811L7256L8858
14655a666J9024o7175j2846M9837J5969J77J257J996r44K6774j2869j4937K0973
14642B5570O971n3852P858L127j1058L6209P731k4065J4707k2934k7198M124n265
14629c8075J0931m781R60j2594k0731L965O1982M655j5202M298j1299K5583O680
14616A6372j7217k5552N72M0187m685j1161P723j8055k0782R432L505N746N843
$$ y = [-63763, -73578, -53406, -74314, -87607, -50558, 4285, 23015, -11382, -29875, -31574, -24072, 8616, -20217, -26169, 13245, -7658, -8731, -28812, -41802, -55551, -37854, 13044, -17045, -12624, -5689, -12722, 43474, 75292, 68466, 41657, -1889, -49745, -29181, 8563, 1702, 19286, 4709, 2696, 11324, 25429, 33479, 35858, 62427, 58634, -11698, -75969, -77780, -40524, -1666, 17358, -49817, -62663, -12826, 3143, 3320, 4577, 6573, 5629, 32403, 19534, 4597, 25570, 32541, -21311, -13453, -10326, -21384, 14825, 22556, -1509, 13198, -9736, -36934, -32810, -38075, -27144, -31925, -30965, -43559, -64290, -60325, 1657, 6312, -8890, -4592, -15891, 9692, 16372, -845, -26397, -25825, 14362, 9677, -1484, 6239, -11816, -32598, -23166, -19661, -13915, -8072]
14603h072L8368J4372j4200m2611R693j1577J840R930m6757j2744O4081K4539
14591B6862k822m313k3098J0165k599l657l1627o1O822J1503J9825k5132j4916
14578c3048J5608j5252K8625K2936q874R894k0338R228N101R76j713m812M069
14565A2400L0104L516K199j0454j692j4914J6365o638j8971l336j550K9341O683
14552D3053J2278k1154o825m2253K428l052m7454K5407K2386j1887k1803m519
14540e3395J1233M069k1569M8599m990j2113J5217J9450j7946n478j109J0189
14528g843j2618j6531k6959R461J0661j141M0081m3909K0284K4352J9377j1142
14516D073n551R38k8151n2387j7701M8803N5239R971k1902k4283l2714L3400K0037
$$ y = [-8072, 30296, 44668, 30468, -12143, -2450, -14027, -12187, -2257, -49014, -61758, 2323, 26862, 24040, 19727, -3371, 6794, 4195, 538, -31089, -31150, -24328, -12825, 7000, -18132, -33048, -17440, -32692, -4067, 18869, 9995, 19889, -449, 8779, 13880, 14856, 13143, 8331, 12400, 42504, 46020, 48219, 37765, 36073, 21159, 37524, 30886, 11915, 8579, 7029, 36370, 43053, 55331, 34177, 27352, -14901, -12473, -15525, -62979, -37572, -15186, -27073, -48876, -53395, -42162, -38093, -59662, -11063, -16053, -28166, -12949, 6501, -11445, -16923, -18032, -7843, -20461, -36992, -63951, -54490, -43829, -44970, -4889, -48798, -28514, -4162, 15215, 4073, -1478, -540, -28691, -81078, -98779, -49976, 5263, 15234, -6668, -30951, -63665, -30265, -10228]
14503a0228m2896k8178L1442K3080K0039K1853J600O1623o667k2735j4937m8946
14491a4950M391p063k1591N905M1093M6430N384n8229k8658J4574K9757k238R186
14478B3991L5116O25j1101l0401n6124q282L4762K815J1639j9582l138k3273O723
14465c6230J8102J3892J3843K1535j2825l8835M9899K636n6686l0639K1889L0026
14453c393k889J3834M684k976k4121n6015O645r535K1197q305l7597k7128J2647
14440a12952O3911M3796K1577p263m8319j5595j7428J6012J2235J901M8481J9429
14428B5785k4484m8489j2984J4198R415j1841o320J9419L663O583J7109j4600
14416b2546l0903q724K2996Q393L5689j961l9257j2795j8962m278L3170J0935
$$ y = [-10228, -53124, -81302, -49860, -26780, -6741, 15112, 16712, 78335, 71668, 48933, 33996, -14950, -10559, -17622, -39213, -33308, 7785, 54215, 59599, 1370, -27288, -12714, 17043, 14805, 23991, 59107, 59732, 48631, 18230, -37894, -46176, -11414, -8599, 3040, -16542, -19680, -42953, -36230, -18128, -4236, 9607, 31142, 18317, -20518, 29381, 32017, -24669, -55308, -33419, -3393, -6282, 7552, 12236, 9260, -14861, -70876, -64231, -73766, -52569, -60874, -98471, -125599, -112952, -49041, -5245, 16332, 9069, -39250, -54845, -72273, -56261, -44026, -42125, 6356, 25785, 1301, -47188, -60172, -45974, -36559, -48400, -54720, -35301, -31638, -25055, -7946, -22546, -53449, -62173, -39177, -30784, 4905, 2944, -36313, -49108, -68070, -72348, -39178, -28243]
14404b8243L4128K2376k5593m259j4823l7143M334N9192q31q753j361p664l7081
14391d5721M10O8748J480l5365l6089M235L2299L875J0542j4194k6551j3884Q086
14378d2129L5075L1679K005K566k7050m4311j2741K5998j5266M280m277k7049
14366g1220K7942K8447O894K665J1105Q212K4064m035k986Q765j6033m9885m7362
14353g3427j9175J6905l734M3234O5000j3670k2155L04J5461O866L1230R44j0831
14340C6952M704m3091k9157j6033k8662J4329L3789K3751r631K5928J6313q987
14328B0205n3714j1000J0507m8033J1563L9984J6713j4197j7470L012K7899K6522
14316A1991k3041k5477J2015k7078J0206K8911Q605J8754j9199J963J6851J0674
$$ y = [-28243, 5885, 28261, 2668, -1591, -16414, -53557, -49223, 9969, 9138, 385, -976, -8640, -45721, -45311, 23437, 24917, -10448, -46537, -42302, -10003, -6128, 4414, -9780, -36331, -50215, -42129, -7054, 24625, 26630, 29196, 2146, -42165, -54906, -28908, -44174, -39894, -44171, -71220, -43278, -14831, -7937, -5272, 5833, 14045, 38109, 34074, 31088, 39853, 23820, -26065, -73427, -92602, -75697, -79431, -36197, 28803, 15133, -7022, -6718, 8743, 15609, 46839, 47783, 36952, 41656, -1435, -30592, -46625, -75287, -60958, -27169, -3418, -13049, 12879, 29192, 20205, -33509, -44509, -34002, -82035, -70472, -30488, -13775, -27972, -45442, -42430, -14531, 11991, -11050, -36527, -24512, -51590, -41384, -12473, -3868, 14886, -4313, -2350, 14501, 25175]
14304B5175m0911p766K8099K108m3143m13K5456M64k474K4618Q160J5293j6662
14291A8004m1368L7391l920k1365N45k2446N182M0547J7469o585k0110j8932R603
14278e985n908j041j594k4612k4366j3219p95J8576K0378j4873O959J0557j3688
14265d9611K8854K0671k5245P785K578K2936K366m0679j7366J4426P537K5358
14253c90L1751K2110M141M098m5577n8541J6199k0160j0221j103L4238K0634m7196
14240e0017j2210L0820J6066l9278l3125L8209K7121M2575k2872l0091K9167J5520
14228A1885q749N524l6884l2594l9251K2962L4954K4001j7451J5543j833J5602
14216f291j0959j0412Q773L743O2419K198n2383l997L5121o537j7077j2077J640
$$ y = [25175, -15736, -23502, 4597, 6705, -36438, -36851, -11395, -10931, -13405, 11213, 19373, 34666, 18004, -23364, 14027, 10107, -11258, -10713, -33159, -27977, 12570, 30039, 23454, 3344, -15588, -5985, -11893, -12934, -14528, -39140, -63506, -76725, -77520, -58944, -38566, -53439, -46480, -35923, -49611, -20757, -86, -25331, -17546, -14968, 7968, 10334, -30345, -47711, -33285, -25748, -390, 31361, 53471, 57612, 61710, 16133, -42408, -26209, -46369, -56590, -57693, -23455, -2821, -50017, -62227, -31407, -15341, -54619, -87744, -49535, -22414, 20161, -2711, -32802, -3635, 11885, 3136, 8660, -28224, -60818, -100069, -77107, -42153, -18152, -35603, -20060, -21893, -6291, -17250, -27662, -18889, -15146, 47273, 49471, -2912, -6909, 28212, 21675, 4598, -7479, -5839]
14203e839L795q70L574k6911l9227K6255L4455O135k7079k8812m0109j9514J2400
14190a01747L6457L1091q602N977m4113P5559J1043n7593r171o345J8732q246
14178e6958m283l0083J8670K1552k0398J0138J4739k402P096k0217L951N575J5108
14165c7512M9076J0079k9933j1244J0010Q334K4694j7409O606K2252K4731l4541
14153B5143J164p88L1561j8150l3153l558J8303K447j7277q092N941Q523q927
14140C137J2036J2343k5515K9636L3657j0937j9576m2644n4252L7866L8903J9848
14128C4502O175J6237l6382j2157n508p873M2007O8393Q2147P4498L6103L5983
14116C34125K0427J07714J22260R7881N0507K0199N4601Q510m3192l8095l9380
$$ y = [-5839, -2044, -2914, 660, -26251, -65478, -39223, -4768, 1367, -25712, -54524, -94633, -114147, -101747, -65290, -34199, -42801, -36824, -80937, -5378, 5665, -51928, -61099, -67444, -48712, -56958, -61241, -91324, -72654, -51102, -71500, -61362, -46623, -49025, -41929, -62146, -58195, -52620, -37512, 11564, 21643, -8290, -19534, -9524, -1190, 23504, 6095, 12701, 34953, 59684, 25143, 26307, 25519, 57080, 38930, 5777, 2219, 20522, 22969, 5692, -2400, 3541, 12064, 3137, 15173, 27516, 2001, 31637, 65294, 54357, 34781, -7863, -62115, -24249, 14654, 34502, 40677, 56914, 20532, 8375, 2867, -5006, 37001, 105394, 187541, 262039, 298142, 334125, 354552, 462266, 584526, 682407, 732914, 753113, 807714, 816224, 773032, 734937, 695557]
14105F95557p7329j01261r4820o0324m0302m6201n7633l9655k6655j4296l6521
14094A00560p8346K2823k4756j876J5550K1679J12j2156l523j5615j1061J6026
14082B9417l528R446j3460l6111k2173K4226L3259K7806N212p285k8396J8766
14070C7179J8391p509k6617J679K3748j3206l1376j9432P315J032j7618j2300
14058c8714r975L5897n676J2411L6125J6882m4691n647L1729Q366Q60j97K5158
14045F2528K6201p240l4300l031l0126k0340K7633M207j6897k7584J3210J871
14033c868l4697k1491J2613j998N1292L2324N0412l5418p8032j2455r337J8113
14021c2542J5242K1111j2992m293O028q838k0072P198J8241L9561J1044n3522
$$ y = [695557, 618228, 516967, 422147, 361823, 321521, 275320, 217687, 178032, 151377, 137081, 100560, 22214, 45037, 20281, 18405, 33955, 55634, 55746, 43590, 40067, 24452, 13391, 29417, 25889, 35335, 21875, -14236, -36409, -12183, 21076, 48882, 54094, 46809, 18413, 37179, 55570, 48061, 21444, 23123, 46871, 33665, 2289, -17143, -9828, -8796, -26414, -38714, -48689, -12792, -18468, -6057, 30068, 46950, 2259, -3388, 28341, 36707, 37567, 37370, 62528, 88729, 81489, 47189, 44158, 14032, -6308, 21325, 25532, 8635, -18949, -5739, -3868, -38565, -60056, -47443, -49441, 1851, 34175, 84587, 49169, -28863, -41318, -50655, -32542, -17300, 3811, -9181, -13474, -7446, -16284, -36356, -29158, -10917, 28644, 39688, -13834]
14009a3834r427L3248j8597j8628N624R434M7659J4010o171k0323P340K1971k6956
13996B5350N506L7549n5121j1601j3641k8877j7946J8001R216K7764L952j3633
13984a3481M1654K8606j1973k2188k8782j4068J6752K2096r195m269L3175j9404
13972A8923m4898j4080r29M0460J5084l5605l0797k898P034J0937L0638O9490
13960F3359J040j1208M181J5321L8840K6565R777M027Q685k2632m7995p9254J4997
13947B5703J5491J9485J428l2264m2982l7257O428j2014M3074K0391K4385N3300
13935H5168k5224k9903m6910j9740J5493j1784l8824j8377K157N1231j491R230
13923b8974J6390o089R604K4766L1288K1150R855l7590k2073k2141K5948k6262
$$ y = [-13834, -23261, 9987, -8610, -27238, -21614, -12180, 35479, 49489, 43318, 22995, 30335, 52306, 25350, 30856, 68405, 13284, 1683, -11958, -40835, -58781, -40780, -31564, -3800, 152, -13481, 28173, 56779, 44806, 22618, -6164, -20232, -3480, 18616, 9421, 5152, 38327, 18923, -25975, -40055, -40984, -524, 14560, -21045, -51842, -54740, -47706, -36769, -6131, 63359, 64399, 53191, 57372, 72693, 111533, 138098, 147875, 151902, 160587, 137955, 89960, 10706, 25703, 41194, 60679, 62107, 29843, -13139, -50396, -43968, -55982, -12908, 7483, 31868, 85168, 59944, 30041, -16869, -36609, -21116, -32900, -71724, -90101, -87944, -36713, -38204, -28974, -12584, -18673, -9069, 15697, 46985, 68135, 77990, 40400, 18327, -3814, 22134, -4128]
13911d128j8554K5804r711k515k9045J414M6774M8911l484l6458n797n970M506
13898A1747O183j8403J5486P19l2539k55K4435k0988j6236n186L6438O3676j9067
13885D6010m2580l0404P094o501p550J0595O416k8610P755L805j1429O616M9728
13872A0945m62O485l0202m9891P330K4229j2773L4101o419l3820r343R242M439
13859d6139m672L252L3725J2422o321L4066l0707n3897k2191R284L8309K9721
13847c148J0112Q019R839l1802K3966q20k2662q76K3579K5448K581o284l5903
13834B049k58p57j6806k4230J4995J8742P6Q221m057p317J9405q54L28p541j6929
13819a4933K1327k2632K0428K6475J899n11J744j9960l0006l700k4898j3040L3581
$$ y = [-4128, -22682, 3122, -6589, -9104, -38149, -36735, 10039, 58950, 55466, 19008, 13211, 7241, 11747, 17930, -473, 15013, 15732, -16807, -17062, 7373, -13615, -29851, -35037, 1401, 65077, 46010, 3430, -26974, -19880, -26381, -33931, -23336, -16920, -45530, -37775, -33970, -45399, -38783, 10945, 10483, 16968, -13234, -63125, -55795, -31566, -44339, -10238, -16657, -50477, -59820, -50578, -46139, -50811, -47559, -13834, -1412, -7733, 26333, -4374, -58271, -80462, -71178, -32869, -3148, 6964, 14983, 24822, -6980, 16986, 16166, -6496, -7372, 16207, 41655, 44236, 37952, 2049, 1791, 1034, -15772, -40002, -25007, -6265, -6189, 2032, -2025, -9342, 10063, 9209, 9537, 1996, -14933, 6394, -16238, 4190, 30665, 32564, 32053, 33797, 13837, -16169, -19869, -44767, -57807, -24226]
13806b4226N3931K4771p275l8283p249J7558l3154n536O875P899J1009K453J0064
13793A8837k9041j871M1232o132j7646O2976J2773N758l46m9446n5936J4303j1589
13780a6128L7589m6203l972L9626k1356j7499K5203k128K7637r579n869J7702
13768B5023N843K063j0481L2650r819J0314L0906r37l2223o5451j4666K9662L2439
13755C5323R332J7443L0832j4821m3963k0009k4595k3252J3432j5567j6966J5621
13743c7190K7386L6464K4155K9m1702p147j882j384k4871k8333k132J4254K6775
13730a5578J3817j3169j0539k7957N240J5352L5187l332k3359J2542L1007J3392
13718C2603l8228l6073j2728O719l289M1418N2990J104k7890j3696L732O451j5716
$$ y = [-24226, 29705, 54476, 47201, 8918, 1669, 19227, -13927, -19463, -12588, -4689, 6320, 8773, 18837, -10204, -12075, 29157, 23025, 5379, 68355, 81128, 86886, 86540, 37094, -18842, -4539, -16128, 21461, -24742, -28714, 10912, -10444, -27943, -2740, -4868, 22769, 13190, 7321, 25023, 30866, 32929, 22448, 55098, 45279, 55593, 86499, 85562, 53339, -12112, -26778, 2884, 35323, 44655, 62098, 92930, 78109, 34146, 14137, -10458, -33710, -20278, -35845, -52811, -37190, -9804, 26660, 50815, 50844, 9142, 1995, 113, -1271, -26142, -54475, -56607, -42353, -15578, -1761, -14930, -25469, -53426, -48186, -32834, 2353, -979, -24338, -11796, 19211, 32603, -5625, -41698, -54426, -47707, -50996, -9578, 43412, 44516, 16626, 2930, 6662, 13113, -2603]
13705b603j4281K6838K2593K552l8053j0597K0424K1976K4309k1714j7051L3842
13693D8235J9102l0509m298k2148k6498k8442J9490k2464j1616R154P072N3458
13681A0536L3281l3190n4910p747K9698L5552L2265K5519j6840k5753J3369J1190
13669E2970m1351k7868l9308K204L8705J2550l7210M0625M6469n242j2147k1698
13657H699k4371J9002K800l6389j9747l1035K0924K5723J3181P155L924N1534
13645D1400l038j0240k3310J351J9263k141J833K9994j4250l105K139p4972m1707
13632g6783J20K8848m270j02j4534j2579L0290L3545p33m587K5541K773l8468
13619c0939j3766J5052J2402j0343M907K4678M258j7748k9132J267K9828L5776
$$ y = [-2603, -16884, 9954, 32547, 35099, -2954, -13551, 6873, 28849, 53158, 31444, 14393, 48235, 67337, 36828, 32530, 10382, -16116, -44558, -25068, -47532, -59148, -49994, -42922, 10536, 43817, 10627, -44283, -52030, -22332, 13220, 45485, 71004, 54164, 28411, 41780, 52970, 11619, -16249, -55557, -53353, -14648, -2098, -39308, 1317, 47786, 42544, 30397, 8699, -15672, 3330, 6130, -30259, -50006, -81041, -60117, -34394, -21213, -14058, -10134, 41400, 38362, 28122, 4812, 6163, 25426, 23285, 25118, 55112, 40862, 37757, 39896, -35076, -76783, -76663, -47815, -52085, -52187, -66721, -79300, -49010, -15465, -16198, -20785, 4756, 7529, -30939, -44705, -29653, -17251, -27594, -22687, 1991, 6249, -11499, -40631, -39364, -9536, 26240]
13607B6240j5702L314k5792j5085K3547K269k105L3717m449n3827k979J6047K319
13594a2486L2873K6012l3940K1424M452k5565J918r201J468M8854K1340p003k4741
13581D5405n8261p279K2787P532K1354r654O392N009L9205Q3111N514m1867k9499
13568H9749l5899n5999K6914N1688R659m5965l4879k6270P532J0249L402J1562
13556A1743L4252p596J1287M1057j4755j8577l4667j0717J8301k0579l497K875
13544I127j7285m8134j2573L4599K2577J087O4434J0692l9820k8323j4328l7054
13532e5001l0287j1262L0336L0695L4264K679j1945J106O20j8108L0507K0065
13520B3669j8383n381j4159J0009R948J6475l5915j4562j4825J6473L5015Q751
$$ y = [26240, 10538, 13852, -11940, -27025, -3478, -1209, -3314, 30403, 25954, -27873, -30852, -14805, -12486, 20387, 46399, 12459, 33883, 38335, 12770, 14688, 5487, 6955, 55809, 77149, 70146, 45405, -12856, -20135, 2652, 10184, 31538, 21884, 28276, 33285, 72490, 155601, 161115, 119248, 89749, 53850, -2149, 24765, 76453, 86112, 40147, 5268, -21002, -13470, -3221, 181, 11743, 45995, 38399, 49686, 90743, 75988, 57411, 22744, 12027, 30328, 9749, 6252, 9127, -8158, -56292, -68865, -34266, -11689, -10602, 53832, 64524, 24704, -3619, -17947, -55001, -85288, -96550, -66214, -35519, -1255, 1424, -10521, -9415, -8795, -26903, 3604, 23669, 5286, -95, -14254, -4245, 5703, 22178, -13737, -28299, -43124, -26651, 8364, 17115]
13508A7115M713o003N982M5836K0880n0632j8948j9011l3583O3526K5908r930
13496D5853o3271j6047J061J364r70r215K4217K8810l2913p347K4486J6433J4013
13483B6474j3319k8386K7887J6318J2776m60L2571l2200k6725k4587j3776j1863
13471c5290l7714k3236K9611K6587j532j9611K9521O0662r702N40j5732K958N963
13458A3025O689k2105P839K1759l3163m3818J1461Q672J1387K8014L0820O833
13446D7413j4734j9853k86k4565l8217L8912P993l717K1413j4613o922n3086r10
13433f1172K085j5065p918K8475J9560M0454J4200M458l8547k1462L2452M6519
13421D4039k3768n7091k1498k21K5364J5423K6744l8832l7690L2139K0154J1996
$$ y = [17115, 21828, 15825, 21807, 67643, 88523, 37891, 18943, -68, -33651, 29875, 55783, 45853, -17418, -33465, -32404, -31040, -32010, -41225, -17008, 11802, -21111, -28458, -3972, 12461, 26474, 13155, -15231, 12656, 28974, 41750, 41290, 73861, 41661, 14936, -9651, -23427, -35290, -73004, -96240, -66629, -40042, -41574, -61185, -31664, 28998, 19296, 19836, 4104, 7062, 13025, 19714, -2391, 5448, 27207, -5956, -49774, -38313, -29641, -18254, 9760, 40580, 47413, 32679, 12826, 12540, -12025, -50242, -11330, -3337, -7054, 14359, -254, -7176, -60262, -61172, -59087, -74152, -82070, -53595, -34035, 6419, 20619, 25077, -13470, -34932, -2480, 44039, 20271, -36820, -58318, -58539, -33175, -17752, 8992, -29840, -67530, -35391, -15237, -3241]
13409c241J0852M027J4953J7253k3303K894j9932j2032K1179o650l1684j5825
13397d1509r892p493m7115K5619M0425K7603O887L851k114L077j2637n946M2674
13384B3430J3398o202k3229K960M0075j5477k8952R430M892j7540j0759K2567
13372A4593N2724k3116l9958o9357o4630K0849O0203K5304L782o745k6526l9372
13360i2249L6610Q1271l279r270O901r5J8304n5654J377N5629K0799j2549l2960
13347A4835j6449j1970j4825M4947L1865k177m4393l508M4117j2104m5505K396
13335a2771j2253O815p688k0216N205j1970M2997L6771L6274J7823j1269q3158
13323a3440k6757K1523J425J6817J7458M601q937O294n756j6837j2664n176j5525
$$ y = [-3241, 7611, 11638, 26591, 43844, 20541, 23435, 3503, -8529, 12650, 6000, -25684, -41509, -51401, -58894, -106009, -80390, -39965, -12362, -5475, -1624, -3738, -661, -13298, -19244, 23430, 36828, 30626, 7397, 10357, 50432, 34955, 6003, 15433, 20325, 2785, -7974, 14593, 67317, 44201, 4243, -65114, -129744, -108895, -48692, -23388, -19606, -26351, -52877, -92249, -55639, 25632, 22353, 13083, 19984, 19889, 38193, -17461, -16084, 39545, 60344, 47795, 14835, -1614, -13584, -28409, 16538, 48403, 46226, 1833, -1675, 42442, 30338, -15167, -12771, -25024, -18209, -25897, -46113, -40908, -52878, -9881, 26890, 63164, 80987, 69718, -13440, -40197, -18674, -17249, -432, 17026, 21627, 12690, 18984, 13228, -3609, -16273, -21449, -36974]
13310c6974K3699K3131r055L511p133l4858j0711N6032j9157m117k7201M828K0936
13297a7069M7244K0824L946p334m3679k5923m323J3357l3000J0464J7919J1421
13285f153p030o233k6077j1594K6139M0757k0565j0241k860m470k8583J5730M513
13272c6667J2453k5155R293j9590k8569M4142L3122N910J6202q259Q360k1273
13260a0031l985L7398m0554k7273j846O1016O4017j1356k5487k3810j6946q985
13248g842K1658J449m494m5845k8814R971P912K4056j0842n353j6072J4255O071
13235c3890J6210m520J4636J3606N024J4858M4274m919J2486m4272m1884M382
13223d009L0121J0299L3005k855j1994j4284j3954J3823m8393m7730N0235M6923
$$ y = [-36974, -13275, 9856, 801, 4312, -2821, -37679, -48390, 7642, -11515, -15632, -42833, -38005, -17069, 30175, 50999, 54945, 47611, 3932, -21991, -26314, -12957, -45957, -35493, -17574, -6153, -13183, -19416, -45493, -57087, -30948, 9809, -10756, -20997, -23857, -28327, -56910, -41180, -36667, -24214, -49369, -40076, -59666, -88235, -44093, -10971, -5061, 11141, 2882, 11242, -10031, -14016, 23382, -17172, -44445, -46291, 14725, 78742, 67386, 41899, 18089, 1143, -7842, 13816, 15265, 10771, -35074, -63888, -53917, -46005, -21949, -32791, -38144, -54216, -39961, -33890, -17680, -22200, -7564, 6042, 11066, 25924, 70198, 65279, 77765, 33493, -8391, -4009, 26112, 36411, 69416, 66561, 54567, 40283, 26329, 40152, -8241, -55971, -5736, 41187]
13211D1187o059k5976k9117O334O481N5961l2668j7284J6433K760K4822j2354
13199C0520r52o831n2882l16K7838M0308M2250K911n5040l7178K0099K3192K364
13186C6283l6471j1304k2292j7815J8751K1260k739j1388J901j655j5571J1657
13174b9383K738J7364J2621O500j8637l6798K44J7034l5291M279P739J1591j1181
13161e1180K7319L2460k0500Q177J7989k1751P809l4114l8314j8640O2L2062J4685
13148d3936J8023o830l4828L1388L2880M7734j1703n4789J147N0926n431j4116
13136A0465j3911l1863K3340p830l8294L278J9188K7527L8412k8787m0241N725
13124c2991k9314j5589M2180R854M3686J1722j7624m4222k1378j8906M0575J0462
$$ y = [41187, 35128, 9152, -19965, -13631, -7150, 48811, 16143, -1141, 15292, 18052, 42874, 30520, 29568, 22737, -30145, -30461, -2623, 37685, 79935, 82846, 27806, -9372, 10727, 33919, 36283, -188, -11492, -33784, -51599, -32848, -11588, -14327, -25715, -23814, -25469, -41040, -29383, -26645, -9281, 3340, 9840, -8797, -45595, -45351, -28317, -63608, -59329, -51590, -39999, -51180, -23861, 8599, -11901, -3724, 14265, -7486, 323, -33791, -72105, -90745, -90683, -58621, -43936, -25913, -32743, -67571, -36183, -3303, 44431, 32728, -22061, -20914, 30012, 24581, 10465, -3446, -35309, -11969, -19799, -58093, -54815, -35627, -8100, 30312, 1525, -38716, -32991, -62305, -77894, -35714, -25860, 17826, 29548, 11924, -32298, -53676, -72582, -32007, -21545]
13112b1545J557q179k4801Q086K2069K3175m3280o495K4317L774j1267j1837k3926
13099f8352O8251O3623l6101l3680j7562J1579K4236p658m4897j3022Q473J4097
13087c1013k3366L5769L0792K6088Q188o000J3703m088j473k4236j1841j2365
13075A58K135M342l263k4540k0857J3136N7113K269j5665P825K4598P739K6160
13062H1150J7630l2706k6509K6402J2960j5428J9055j0779k9635J5976K0634O7907
13050A46657K6486L0481O4843Q6759J06570O3800Q9033Q2649O0867L3568K6238
13039H17951L259k1163n2753q0499j16433j09975q3317m3082l4456n0895k9990
13028A98647n8424r187J1043o954O874J2862k5059m3334q661L9550M9920j0434
$$ y = [-21545, -19988, -28167, -52968, -44882, -22813, 362, -42918, -49413, -25096, -21322, -32589, -44426, -68352, -101, 63522, 27421, -6259, -23821, -12242, 11994, 4336, -40561, -53583, -45110, -31013, -54379, -18610, 12182, 38270, 46458, 40458, 54161, 50073, 48600, 24364, 12523, 158, 2293, 6635, 3372, -21168, -42025, -28889, 28224, 30493, 14828, 22653, 47251, 54990, 81150, 98780, 66074, 39565, 65967, 78927, 63499, 82554, 71775, 42140, 58116, 78750, 146657, 173143, 203624, 268467, 355226, 461796, 525596, 614629, 697278, 758145, 791713, 817951, 821210, 800047, 747294, 666795, 550362, 440387, 357070, 313988, 279532, 228637, 198647, 140223, 131036, 142079, 135125, 141999, 154861, 129802, 86468, 77807, 117357, 167277, 156843]
13016A56843n3668k303M1803j1313l9537l4650k8351K2103O595J9224k5375j3130
13004C8241l997J3753k424q076L5658k8508K711J7107j6391L4609L7513j3804
12992A06392m2758j1285J3866p096l2753l6312L743K3388k371j1590k5764k2832
12980d5372J8207j7586Q638K0914M836J0219P55K3985j4591k8663J757j2289j1256
12967d0446J9248m230L0025L6497k157l67K4864l3230o1137L0329O544j2375k1501
12954b7936j3686J0662L110O09l3477l297K6580K6851J1173R031K9878m4253L761
12941i94M150k263L8596L5900m8048k8712p734q438l5833p379J8563J1368l7544
12928f8368L519M923l767o094k403K4052J4197q692K0383mJ1672L3882k3914m0375
$$ y = [156843, 103175, 100872, 142675, 131362, 91825, 57175, 28824, 50927, 57522, 76746, 51371, 38241, 34244, 47997, 45573, 37497, 73155, 44647, 47358, 64465, 48074, 82683, 120196, 106392, 63634, 52349, 66215, 59119, 26366, -9946, -6203, 17185, 14814, 3224, -22540, -45372, -27165, -44751, -36113, -15199, -10363, -144, 611, 24596, 10005, -18658, -16901, -29190, -40446, -21198, -25428, 4597, 41094, 38937, 38570, 63434, 30204, -30933, -604, 5940, -6435, -27936, -41622, -30960, -27850, -27241, -60718, -64015, -37435, -10584, 589, 9620, 39498, -4755, -994, 3156, 893, 39489, 75389, 27341, -1371, -9105, -17543, -53376, -60755, -42192, -30824, -68368, -64849, -59926, -63693, -69787, -72190, -48138, -33941, -42633, -22250, -22254, -10582, 23300, -614, -40989]
12914d0989J0783Q9531K6251P415m2078j9659O220N5j3328m8178o7156j2239N5002
12901d8370O4568K0247j3493K919L756J2343K81l1991m158K7209K0940O122k203
12888E8170j6675R008j2114K4231j417j7731j5704L3795O38o833K5584O5065P9189
12875B25206j4603k4119R422j3292o976l0604l821J8810m4762q148J4241l2046
12863H9308m4749j6220M641M3560R504l8885j5287Q752L7133j761o491L1993k20
12850A01278J5906M522k7058j0465j1307M50J2294J4809K278J1969k2181m5558
12838D6937o0638O43L1045J6045p414J7114K169L2623K1274k3551R136K2573l8794
12825F9162j6286k289l0274O793m472m04K1636j6251L541P426k5998K28L478L9447
$$ y = [-40989, -30206, 59325, 85576, 92991, 50913, 31254, 37474, 37529, 24201, -23977, -91133, -103372, -48370, 16198, 36445, 22952, 25871, 29627, 41970, 42251, 10260, 6102, 33311, 54251, 60373, 58170, 41495, 50503, 38389, 62620, 61203, 43472, 27768, 61563, 62201, 55368, 80952, 146017, 225206, 210603, 186484, 195906, 182614, 175638, 145034, 141213, 160023, 115261, 107113, 121354, 89308, 44559, 28339, 32980, 76540, 86044, 47159, 31872, 40624, 77757, 75996, 69505, 101498, 101278, 117184, 121706, 94648, 84183, 72876, 73326, 85620, 100429, 102707, 114676, 92495, 46937, -13701, -13058, 17987, 34032, 26618, 43732, 45901, 78524, 99798, 76247, 85383, 107956, 69162, 52876, 50587, 20313, 27106, 22634, 22230, 43866, 27615, 31156, 38582, 12584, 12812, 16290, 55737]
12811E5737J8304k3613m2745j0127r544o514M9592M9268J9208l0164k0844n8265
12799i707r049K7422L3959j4032k0489L7702J7987L158j9589m532P157j6682J904
12786C5209J8873N4608M1158l0232j1255k8511o145j0129k1719J9486J0906J6173
12774H8422j2556L0264N3k3895l470Q83K6963N299n094o4222m591J4268K4785
12761G7109L0439l5886K5271n415n5398o6570J2433M2090J1549m332N0252N8398
12749A39940M071L7008K8905j429k3841k7436K502M1926q811j7305m335j9681
12737A51514o371L8759j4909J608j0320j6238P0039J8518n6776K4128J6633m6824
12725A69761l668J9270J3534k7460K0336L008l583L536l360n297N727K5606j1245
$$ y = [55737, 74041, 50428, 7683, -2444, -11988, -18502, 31090, 80358, 99566, 69402, 48558, -9707, -18756, 8666, 42625, 28593, 8104, 45806, 63793, 66951, 47362, 42830, 49987, 33305, 35209, 54082, 108690, 149848, 119616, 108361, 79850, 73705, 63576, 41857, 61343, 72249, 88422, 75866, 106130, 106183, 82288, 78818, 79701, 106664, 111963, 106869, 42647, 38056, 52324, 77109, 107548, 71662, 96933, 91518, 36120, -30450, -18017, 24073, 35622, 31290, 81542, 139940, 144011, 181019, 209924, 208495, 184654, 157218, 159720, 201646, 192835, 175530, 171195, 151514, 145143, 183902, 168993, 170601, 160281, 144043, 214082, 232600, 175824, 199952, 216585, 169761, 166093, 185363, 198897, 171437, 191773, 194781, 191198, 194734, 191374, 186077, 191804, 217410, 206165]
12712B06165k3178N956L8934K2281j9199j9767L3058Q464j2972l360L6524M7058
12700C19964j1951l9008l4055M013J8172K6487J7444k0954p684K7841M7186K7296
12688C74751O170j3810L1229K0187j0642P874N7735o933l1086l8733R129N852
12676D11723R084N1125L6466K7568J4886N5013K9579L2396L6148J470O8213N3008
12664H26679L1133L3259P616J1229M4413J05380M1447M5582N4917N1016J01692
12653A354363M4604P3758J04540J02538J34644J68681K17923K21080K62579K90515
12643B975225L73150M89348N82788P04044Q32560R32466J029318J246048J478828
12634A0643775J755785K324586L136183M316599O006372Q069647J0486452J3081566
$$ y = [206165, 182987, 188943, 227877, 250158, 230959, 211192, 244250, 252714, 239742, 236382, 272906, 319964, 308013, 269005, 234950, 238963, 257135, 283622, 301066, 280112, 272428, 300269, 347455, 374751, 380921, 367111, 398340, 418527, 407885, 415759, 473494, 466561, 435475, 396742, 405871, 411723, 420807, 471932, 508398, 535966, 550852, 605865, 635444, 667840, 703988, 705458, 773671, 826679, 857812, 891071, 898687, 909916, 954329, 1059709, 1101156, 1146738, 1201655, 1252671, 1354363, 1398967, 1472725, 1577265, 1679803, 1814447, 1983128, 2201051, 2422131, 2684710, 2975225, 3348375, 3837723, 4420511, 5124555, 5957115, 6889581, 7918899, 9164947, 10643775, 12399560, 14724146, 17860329, 22176928, 28183300, 36252947, 46739399, 59820965]
12626E9820965J5594182J7457731J8068022J7159279J4794321J1065443O222314
12619A60182257P08523n059541j0419812j4172244j6137394j6592331j5970427
12612H2539031j4344780j2087678r581331p057729n139661l811690l056846k580739
12604B4878577k239141j958046j749537j629640j492303j396599j257224j120662
12596A2035425r79140q81116p99275o83403n62758m56163m48265m22882l67603
12587F434820l53238k90277k35261j96451k00868j94194j69135j20746j46989
12578D527661j74645j43672j00451j04089o7927q5143n4262l6347j4275n4635
12568C692215j07454j01859j46955j45896j12617j61228j90342k00302k14669
$$ y = [59820965, 75415147, 92872878, 110940900, 128100179, 142894500, 153959943, 160182257, 160890780, 155831239, 145411427, 131239183, 115101789, 98509458, 82539031, 68194251, 56106573, 46525242, 39467513, 34327852, 30516162, 27459316, 24878577, 22639436, 20681390, 18931853, 17302213, 15809910, 14413311, 13156087, 12035425, 11056285, 10175169, 9375894, 8692491, 8129733, 7673570, 7225305, 6802423, 6434820, 6081582, 5791305, 5556044, 5359593, 5158725, 4964531, 4795396, 4674650, 4527661, 4353016, 4209344, 4108893, 4004804, 3936877, 3851734, 3797472, 3761125, 3746850, 3692215, 3584761, 3482902, 3335947, 3190051, 3077434, 2916206, 2725864, 2525562, 2310893]
12559B310893k01118j89883j50562j29418j46696r0086n686o3211j04120o9910
12549A160203m3736l1082l4713p5111n4508m6368l3671m1302o3754o8935P493
12538F74516m777l4489j0631j9684O312j3847m5282k9564K0310l5750j4554r60
12526D91600k9941J310n0387P043L4582K3525M616j3448j444j3973n9066l6876
12514C57541k7080l6436J6742k7059j9933p283J1812K0755Q051k5749k8115P037
12502B50283N5909K4026K3363p438j9457j8009K8977M577l4918m2361j528L4178
12490B97602j8146K3886N204L443k1509m8077q940K0054j3345r201l2097M2L8497
12477B37413J4940k4585n34Q592m587k1634K1386J6508l0745k0035n957l365N283
$$ y = [2310893, 2109775, 1919892, 1769330, 1639912, 1493216, 1403130, 1397444, 1334233, 1230113, 1160203, 1116467, 1085385, 1050672, 975561, 921053, 874685, 841014, 799712, 735958, 667023, 674516, 669739, 635250, 624619, 604935, 611247, 597400, 552118, 522554, 542864, 507114, 492560, 491600, 461659, 462969, 412582, 419625, 454207, 477732, 482348, 468900, 467456, 453483, 394417, 357541, 330461, 294025, 310767, 283708, 263775, 256492, 268304, 289059, 297110, 271361, 243246, 250283, 306192, 330218, 353581, 346143, 326686, 308677, 337654, 342231, 307313, 264952, 263424, 297602, 279456, 303342, 308546, 311989, 290480, 242403, 233463, 253517, 240172, 230971, 198874, 198916, 237413, 252353, 227768, 227234, 235826, 231239, 209605, 230991, 247499, 216754, 196719, 190762, 187397, 192680]
12464A92680K9568M3247k1215r199M838n4958m3312m007J1524K619l981J4252
12452A62056n661K0677L4253k0566M9046M712l0222j2070m273K3245Q890k6742
12440B03345k0708j4841N3516J0122j1189m3708l5824J4494J6202r089l3821j8119
12428A10380L92k242j1335k6628J5688M050j6304M119j8301K2214K325k0699k299
12415F1360l7689M271N844k128L4972J5628O467M729l6761L9316q49J6914p007
12402A05067n593n7299n2872J5832K5898j7561Q671j8261k0904L6430M3964J3794
12390G7166M15k216K8453j813J167j9043k6029n482p157K368J1753m8381J6732
12377B7933L0830L2610K575l7952o690J1610M4614j9324L5962K9414l0726o8870
$$ y = [192680, 222248, 265495, 244280, 235081, 239919, 184961, 141649, 137642, 149166, 151785, 147804, 162056, 156395, 177072, 211325, 190759, 239805, 244517, 214295, 202225, 197952, 221197, 230087, 203345, 182637, 167796, 221312, 231434, 220245, 176537, 140713, 155207, 171409, 162320, 128499, 110380, 110772, 108530, 97195, 70567, 86255, 90305, 74001, 78120, 59819, 82033, 84358, 63659, 61360, 23671, 27942, 33786, 31658, 66630, 82258, 88725, 93454, 56693, 96009, 95160, 112074, 105067, 99474, 42175, -10697, 5135, 31033, 13472, 22143, 3882, -17022, 19408, 63372, 77166, 77581, 75365, 103818, 102005, 103172, 84129, 58100, 52618, 45461, 47829, 59582, 11201, 27933, 58763, 91373, 93948, 55996, 49306, 60916, 105530, 86206, 122168, 151582, 120856, 51986]
12365E1986O2928O4220k1895m0064n7726L0725J6520J0572O672k2501K73m747
12353I6963n195l3702m281Q823j753O13Q982j368M1864M6998o9572n1654k8060
12340H658K8682M4554j2676m1808L196m545n389J8653L4368L2719N6488j4643
12328A48257j9341j7048l7981K0967l0720k6514j9593R836j0287J1702M7111k272
12316G4117j288K7881l518n8455R641J1716j9134K0920J5089L528Q159n0650K893
12303D0899K6964J3125J098l6849J3871o764j1324k7800k6758L0952L2934k2803
12291B7545l9360L897L0337J1463l057k7545j2630J3847J3946L5415K3337K1074
12279I8269j3640n7006n7566J184M9406k416k4817k8888K7263J1454j4314K8969
$$ y = [51986, 114914, 179134, 157239, 117175, 59449, 90174, 106694, 117266, 123938, 101437, 101710, 96963, 91768, 58066, 53785, 62608, 60855, 61468, 70450, 69082, 110946, 157944, 88372, 36718, 8658, 37340, 81894, 69218, 27410, 30606, 26061, 20672, 39325, 73693, 106412, 162900, 148257, 128916, 111868, 73887, 94854, 64134, 37620, 18027, 27863, 17576, 29278, 76389, 74117, 72829, 100710, 97192, 38737, 48378, 60094, 40960, 61880, 76969, 80497, 88656, 38006, 40899, 67863, 80988, 82086, 45237, 59108, 52344, 41020, 13220, -13538, 17414, 50348, 27545, -11815, -7918, 22419, 33882, 30825, 3280, -9350, 4497, 18443, 53858, 77195, 98269, 84629, 27623, -29943, -28759, 20647, 18231, -6586, -35474, -8211, 3243, -11071, 17898]
12267A7898J6488k8274j261K1198Q191J6271l5777k7286j8867J0247L0781K396
12255A2005J6009M963j9763M898k4222l5628k2017N7545j5557l0920R030J0293
12243c3364M7284N48L208K0493j5886j6386n300k3094m004N789K9157J5648j7784
12230F309J1714O355O927n990q754M2054K6347o144j1607k3998J6M8999l693k4709
12216F3826k2231n711r052j515L4539J0215l3591o5088j9384M6848P4217K6001
12204I9074K2393O1801P7376L4094O0736J08256Q3510P1965R8250Q6407j3373
12193G90489K1764n044l1286k5960o9915q7961q5116j16734j24325r7987n2045
12182A15880n28k5850j9344K7222m35j018j9941l0815K5760J4124J0104k4338
$$ y = [17898, 34386, 6112, 4851, 26049, 34240, 50511, 14734, -12552, -31419, -21172, 9609, 12005, 28014, 32977, 13214, 18112, -6110, -41738, -63755, -6210, -21767, -52687, -43657, -33364, 13920, 14468, 17676, 38169, 22283, 5897, 597, -22497, -26501, -20712, 8445, 24093, 6309, 18023, 24378, 31305, 25315, 16561, 58615, 84962, 78818, 67211, 43213, 43229, 92228, 88535, 63826, 41595, 35884, 26832, 25317, 59856, 70071, 36480, -28608, -47992, -1144, 73073, 99074, 121467, 183268, 260644, 294738, 355474, 463730, 547240, 619205, 717455, 803862, 790489, 812253, 807209, 775923, 749963, 680048, 592087, 506971, 390237, 265912, 167925, 115880, 115352, 89502, 70158, 97380, 96945, 95927, 75986, 45171, 70931, 85055, 95159, 70821]
12170G0821k7553J3524K4363K1651m7535m8002j9852J9965p614J7679j9062R709
12158H094P42l1894L6789p500r046r802L0303j2584O687l0589P740J9102N788
12145A3830q494J5392J2421L3340j6670j4470J484o904k5940K0402L1229p1745
12133a6125m4881o336J8459l448r140K4291O1218M4910N246r975k462K6904N291
12120I3952n397k3689k3100J148K4507K4409k4295m7J6721o907o2913k4702l346
12107a3659M7186K8343k8292K107K5191L8293l4959l8281l4205o704K4940k827
12095G133K3873L3423N1666N4129J0077K3712J1378j228j2951j8155Q915K1207
12083B13179J4827j4953K1150J0660Q102l6891J7868j0575q7576l5253j5046J1840
$$ y = [70821, 43268, 56792, 81155, 102806, 55271, 7269, -12583, 7382, -232, 17447, -1615, 8094, 8836, -23058, 13731, 6231, -2815, -12617, 17686, 5102, 11789, -18800, -11060, 8042, 13830, 5336, 20728, 33149, 66489, 49819, 35349, 36833, 29929, 3989, 24391, 55620, -16125, -61006, -67342, -48883, -52331, -61471, -37180, 24038, 68948, 74194, 64219, 61757, 88661, 93952, 88555, 64866, 41766, 42914, 67421, 91830, 67535, 67488, 84209, 77302, 14389, -10313, -13659, 33527, 61870, 33578, 35685, 60876, 99169, 64210, 25929, -8276, -14980, 9960, 7133, 31006, 64429, 116095, 170224, 180301, 204013, 215391, 214163, 201212, 183057, 191972, 213179, 228006, 213053, 234203, 244863, 252965, 216074, 233942, 223367, 135791, 100538, 85492, 97332]
12071I7332M1573j0937J8657m5791j4198O834L951k078k163k1292m825k3314R392
12058E3141M7719M2115Q833l8423j7621J0168P4133K5437l7409m2436j7775k589
12046A05293r330L4685j250o137l2346o4482l7133J1115N3836J3821J2129J3178
12034I3379k6096K4932O072l5048l2534J6051j0015r33K2690P157R986l903k5181
12021D6557o865K4159K3628K2319j478k0756J5945M8633K1092j7917k7174p985
12009A20158k303R685r685j0920j0717N994J4782J4782l1007m5874k2087K1289
11997E4097K9818Q239j1906L0935k5640l2044m953M0247M0333j0025l5050o430
11985G7621j0705l0662k3317J1942L941j793r054l6334J1554K4558k842p211k1982
$$ y = [97332, 138905, 127968, 146625, 100834, 86636, 93470, 97421, 95343, 93180, 71888, 67063, 43749, 53141, 100860, 142975, 151808, 113385, 95764, 105932, 180065, 205502, 168093, 125657, 107882, 105293, 95963, 130648, 129398, 123261, 90915, 26433, -10700, 415, 54251, 68072, 80201, 93379, 67283, 92215, 98287, 63239, 30705, 46756, 36741, 35808, 58498, 65655, 75641, 71738, 46557, 39692, 63851, 87479, 109798, 108320, 87564, 103509, 152142, 173234, 155317, 128143, 120158, 117855, 127540, 117855, 106935, 96218, 102212, 116994, 131776, 100769, 54895, 32808, 54097, 83915, 92154, 80248, 111183, 85543, 53499, 48546, 88793, 129126, 119101, 84051, 77621, 66916, 36254, 12937, 24879, 28820, 27027, 17973, -18361, -6807, 17751, 14909, 7698, -14284]
11972a4284j9037m2303K8944L8638j8656j7072L0918N9570j8171j5324K5800j4013
11960B5010m8974j982K6922J5161l9091K2674N9725L0669J463J527n300J1214
11948I9018J9730n2993j5587j1618K7560Q717K5594j220j3056J4666k9485l1203
11936D0123k4734l7279J2190N4280k5885l2223j9309l2664L1883L6829j0306m904
11924a1999k9463L7962O083l0254k9552p931K3087J8926K7934K1415r239J7501
11912C4470N9399N7772L8675K7078M6879J4680O918P921p0629j01225l4408P231
11900I4761R701o0567R091K1033q146o038k5803k7268J6221k0784k55N0564M830
11887E7340k210K0159m3596k7154m3038k3155J0506L9843R267j540P87j4927J7363
$$ y = [-14284, -33321, -75624, -46680, -8042, -26698, -43770, -12852, 46718, 28547, 13223, 39023, 25010, -23964, -25946, 976, 16137, -22954, -280, 59445, 90114, 91577, 93104, 87804, 99018, 118748, 65755, 50168, 38550, 66110, 74827, 100421, 99201, 86145, 100811, 71326, 40123, 15389, -21890, -9700, 44580, 18695, -13528, -32837, -65501, -33618, 3211, -7095, -11999, -41462, -3500, 2583, -27671, -57223, -65154, -42067, -23141, 4793, 26208, 16969, 34470, 93869, 151641, 190316, 217394, 264273, 278953, 285871, 293792, 223163, 121938, 87530, 94761, 104462, 43895, 52986, 74019, 65873, 59835, 34032, 6764, 22985, 2201, 1946, 52510, 57340, 55130, 75289, 31693, 4539, -38499, -61654, -51148, -11305, -2038, -3578, -2791, -17718, -355]
11874c55Q775m5740K0886N642j414k0737j3022L8416m6293l8164N0637R039m869
11861c7199L7985J8803r385k1718m4545r41p532j3146M1927K9800q562J3939j5418
11848a5992j6228K9873L3755j0237o614j989M303j673p214M688k3560k1378Q687
11835b3579j0996k3618k6789R771K5399J6629K7240K0198l6497n127r309j5991
11823e2669J2990K857K2898N4151J5363q455K4091L0220j7992l4758J00P050m5122
11810A0724l8803J234M4550p275p081k546M50K2018M5704K0023n2109k8497r852
11797a460l9624O520P2202P739j7836n623k4485O269k5191q823k1940M710K4215
11784b3327M126j3182K1119R639L658K6673L9257k3261l0344k7514k8844l330
$$ y = [-355, 8420, -37320, -16434, -10792, -12206, -32943, -45965, -7549, -53842, -92006, -41369, -32330, -37199, 786, 19589, 10204, -11514, -56059, -57000, -64532, -77678, -35751, -5951, -14513, -574, -15992, -32220, -2347, 31408, 21171, 14557, 12568, 16871, 15198, 7984, 12672, -10888, -32266, -23579, -34575, -58193, -84982, -75211, -49812, -33183, -5943, 14255, -22242, -27369, -36678, -52669, -39679, -36822, -13924, 40227, 55590, 47135, 71226, 101446, 83454, 48696, 48796, 55846, 10724, -28079, -26845, 17705, 10430, 3349, 803, 1253, 23271, 68975, 88998, 36889, 8392, -1460, -41084, -34564, 37638, 45377, 27541, 21918, -2567, 3702, -21489, -30312, -52252, -47542, -23327, -19201, -32383, -11264, -1625, 2033, 28706, 67963, 44702, 14358, -13156, -42000, -45330]
11772d5330o158k8666j5176P306Q015N1442L177L0158K4991O035k5147k7659K9657
11759A2645q608n5130k615L5059L5731k989j45r213l6192o11L6119K4710K400
11746C1161J0614l7257m2129j4405K9875j4494K5693L702J2324k3130m0735M0300
11734a8481M6591j7158K247j6045J1856J9135o480j0093L1947O792j9899j9359
11722A1053j0227Q687J4178j8666M622O556J2817k9424J0658J2199J8511r934
11710C1030k5167l7951j4086K5301o394j3077j5837K6877r929J8237L2981l37
11698A1648m1970l2862M2271N4807K0365J8596k2673k5012K206j505k1955m905
11686i89R145j332n0610j2714K2033K8058M6764K3o5519o373J9790m805K8990
$$ y = [-45330, -51488, -80154, -95330, -88024, -80009, -28567, -25390, 4768, 29759, 35794, 10647, -17012, 12645, 4037, -51093, -53708, -18649, 17082, 14093, 13948, 4735, -31457, -32068, 4051, 28761, 31161, 41775, 4518, -37611, -52016, -22141, -36635, -10942, -7240, 5084, -18046, -58781, -18481, 28110, 10952, 13199, -2846, 9010, 28145, 21665, 11572, 43519, 50311, 30412, 11053, 826, 9513, 23691, 5025, 9647, 16203, 29020, -404, 10254, 22453, 40964, 31030, 5863, -32088, -46174, -20873, -27267, -40344, -56181, -29304, -39233, -20996, 11985, 11648, -30322, -63184, -20913, 33894, 54259, 72855, 50182, 25170, 27376, 25871, 3916, -989, 8156, 6824, -43786, -56500, -34467, -6409, 40355, 40378, -25141, -31514, -11724, -16529, 12461]
11673A2461J3543P548j2202m4443j2627K0060K0400K7091j5206j189N433m8415
11661b7546k7998P805K1453O44k3345r617M1403K7933j1328L208j1630K5635K611
11648A9228R741j779r640L6114p383q971j4805L6242k7664j0603j3050j0983j7087
11635b0640J3430O3759l5352j3404J1799k8754J5609p568o617o899J5293l0526
11623b9870j2156M336m766P919K4475N4320J6561q142m8238Q760J4176l6748o658
11610a6031J4961k8548k9400N0039J6286K8823o123k2317Q391K7887k3330L0610
11598E1248j0402n857k0747K595n777k1890N668j7991K2421K7445o583l0874p6225
11585h6969o251M9795K5652j97K74k2130n6436j2821K4409J2199N3884J1015J585
$$ y = [12461, 26004, 33552, 21350, -23093, -35720, -15660, 4740, 31831, 16625, 15436, 20869, -27546, -55544, -47739, -26286, -25642, -48987, -58604, -17201, 10732, -596, 2612, -9018, 16617, 19228, 28969, 27190, 17550, 53664, 46281, 37310, 22505, 58747, 31083, 20480, 7430, -3553, -20640, -7210, 56549, 21197, 7793, 19592, -9162, 6447, -1121, -7738, -14637, 656, -29870, -42026, -37690, -42456, -34537, -10062, 44258, 60819, 52677, 4439, 13199, 27375, -9373, -16031, -1070, -29618, -59018, -8979, 7307, 36130, 30007, 7690, 16081, 43968, 20638, 51248, 40846, 34989, 14242, 16837, 11060, -10830, -5162, -23153, -732, 26713, 20130, -10744, -86969, -93220, -43425, -17773, -17970, -17696, -39826, -96262, -109083, -84674, -72475, -18591, -7576, -5991]
11572e991j7063l0275k8974L947M8275N854j4815R365n466K4008j115O217m2763
11559d8796l0204J4881n337k4825J7842L4959P0797m756m1122J5940K1960j0868
11547A0471l2714n160q325k6910j3390K1617Q4k4485k7059M4161M3943O1088K936
11534D6257k6946l1291k3174L3373K672j9274M472j2502L9432l895k9221N256
11522a4841L4358L4249j0226j9588j129k5506j107R985K795R974l3748q839N5928
11509C2305J9767J5985J5956j2863k704M7959K7114m9305k4812K1072l4730l7563
11497A8181N219j9912m6023M184J4602K2477J3196p742J0528K5075R142j4336
11485C4591J5623J1010l4923Q567J2259l9614l5564o922M4416j0856K450J7491
$$ y = [-5991, -23054, -53329, -82303, -78356, -30081, -24227, -39042, -29677, -35143, -11135, -12250, -6033, -48796, -79000, -64119, -69456, -94281, -76439, -41480, 29317, 24561, -16561, -621, 21339, 10471, -22243, -27403, -35728, -62638, -76028, -54411, -54327, -78812, -105871, -61710, -17767, 43321, 46257, 19311, -11980, -35154, -1781, 891, -18383, -13911, -26413, 13019, 9124, -20097, -14841, 19517, 53766, 43540, 23952, 22823, -2683, -3790, 6195, 8990, 18964, -14784, -23623, 32305, 52072, 68057, 84013, 71150, 68446, 116405, 143519, 94214, 69402, 90474, 55744, 18181, 23400, 3488, -42535, -38351, -23749, -1272, 11924, 4182, 14710, 39785, 48927, 34591, 50214, 61224, 26301, 34868, 47127, 7513, -28051, -34973, 9443, -1413, 1037, 18528]
11473A8528M87J586n5828k7193J6511P993J4530P3436K5160r334k5333l7400J236
11460D379M9342K1388j3094l7212k5630n696N0634J3120j7751l6264J1097L439
11448A7752k268k0464J754L898J595o918M3176J4603M872m949K4244O1255L7575
11435A76125L0242J2080r307q977J2458j3251n4618k3126j5193j8818j8052R426
11423G8989m0866m9218j2418K1761K7464L5352j2918k8957J8342J3333j0326j8897
11411B1641k447M4235J1481J1848Q218k512M1472O2000j3823j276J3922O033J5917
11398B16709n7238o1674m7197j4043K7604m5866o3159k2136M3276n324j6529J3154
11386c2423K5586J5665r171J5573P629M436M8327J4553l0809k8837l2353j8411
$$ y = [18528, 19015, 20601, -35227, -62420, -45909, -37916, -23386, 50050, 75210, 65876, 40543, 3143, 4379, 53721, 75109, 62015, 24803, -827, -6523, 44111, 57231, 39480, 3216, 14313, 17752, 15484, -4980, -3226, 672, 2267, -4651, 38525, 53128, 58000, 53051, 77295, 138550, 176125, 206367, 218447, 209140, 200163, 212621, 199370, 144752, 121626, 106433, 87615, 69563, 78989, 38123, -11095, -23513, -1752, 25712, 61064, 48146, 19189, 37531, 50864, 40538, 21641, 19194, 63429, 74910, 86758, 94976, 92464, 133936, 195936, 182113, 180837, 194759, 200792, 216709, 159471, 97797, 50600, 36557, 64161, 18295, -44864, -67000, -23724, -29048, -45577, -32423, -6837, 8828, -343, 15230, 22859, 27295, 75622, 90175, 59366, 30529, -1824, -20235]
11374b0235J8409j4669Q860M4912L9208J6574k2973L809p891j4142j2762j5256
11362B3844k4619J862L2971P002O103j4015l3340k4212m1559L4749L1762N515
11350F063o35J8166M592j1378J8636L049j4658M574p714q513j0733l9296R863
11337b7984J9800l4092l986k7085K181N2995J6606j3120l97L407J661N462k4965
11324b9517Q409L0546L2003J7505L2957L086O211J4103J0692n0470o1848l3141
11312a9464k4493j520p929j6749j30L3283J7674p524J5979l1279j2236M968j0841
11299f0261m702k1118J2148J5669K5609J7304L3122k0188J5421P597k9417l8682
11287d7498k5295q396L2999K534L2212K0684J4804j2063o027M451N045J1573Q79
$$ y = [-20235, -1826, -16495, -7635, 37277, 76485, 93059, 70086, 73895, 66004, 51862, 39100, 23844, -775, 1087, 34058, 41060, 47163, 33148, -192, -24404, -65963, -31214, 548, 6063, 5428, 23594, 28186, 16808, 35444, 38493, 23835, 28409, 20695, 12182, 1449, -37847, -27984, -8184, -42276, -46262, -73347, -71166, -18171, -1565, -14685, -15082, -11675, -10014, -4552, -29517, -21108, 9438, 41441, 58946, 91903, 94989, 101200, 115303, 125995, 75525, 13677, -19464, -43957, -45477, -53406, -70155, -70285, -37002, -19328, -26852, -10873, -42152, -54388, -49420, -60261, -64963, -86081, -73933, -58264, -32655, -15351, 17771, -2417, 13004, 20601, -8816, -47498, -72793, -81189, -48190, -45656, -13444, 7240, 22044, 9981, 3954, 8405, 13450, 25023, 25902]
11274B5902l1919M281j4721k9595j0471p220j2339J2819N202M371r214J0326L2141
11261b0437K872j2635j856M5802L6125j0148m0417j9331r578k7143j0750M7592
11249a9904N1396q494l1591r463k4285j4108L4421J2250M5507r865n034j0683
11237A0147j8266j3076L325J3049N2740O288m7887q341k237n412n525j462J3025
11224c632L7878L2014J673k402k6039o6917J947n052J6562J967K9974p140J4043
11211B4876P575k7233l8434M595L9188n587j2027J552j7494O971j6022K0323M8465
11198C6748j3587m84J1120o858J1977P575j7236j0364k1925k0239O937k4701j873
11185d2910K8238K777l5693k4420k685K3891K9599l368J0521J5339n578k7207
$$ y = [25902, -6017, -1736, -16457, -46052, -56523, -63743, -76082, -63263, -58061, -53690, -62904, -52578, -20437, -17565, -30200, -32056, 13746, 49871, 39723, -694, -20025, -29603, -56746, -67496, -19904, 31492, 22998, -8593, -18056, -42341, -56449, -22028, -9778, 35729, 25864, 20830, 10147, -8119, -21195, -17870, -4821, 47919, 54207, 6320, -2021, -4258, -9670, -15195, -16657, -3632, 34246, 66260, 67933, 65531, 39492, -27425, -25478, -30530, -13968, -12001, 17973, 10833, 24876, 32451, 5218, -33216, -28621, 10567, 4980, -7047, -5495, -22989, -16018, -32040, -11717, 36748, 23161, 22677, 33797, 26939, 38916, 46491, 29255, 18891, -3034, -23273, -16336, -41037, -42910, -14672, -11895, -47588, -72008, -74693, -50802, -21203, -24571, -14050, 1289, -4289, -31496]
11173c1496L4388M6780J6544k9400m5561n1622J2597K097J11K9299M1434N84l2640
11160f885q819K7674o090J1660k5938n504J5115j6398l3051L86L3633M0327k6269
11147a59q898l231J2888m5956m263L2175n480m1076K0982K5489L5510L7156R227
11134F4364J43l4566P626M7776j1818m1419k5164K1376J0401k1563l0916M8115
11122C4355L8791L338N639n934k5236k1770k5922L665L3529k8683n345K2757L2815
11109F1999K2246J4517o834o1043m916o094K3610J7301m5045K3170l436m0428
11097d953n13j0351L529O057J8278J3392K8704o006m5648R020l0405l0486j7983
11084f7365O0701N4559j1461J4738j1125j0267K0362J7446l480j3175k078j1041
$$ y = [-31496, 2892, 49672, 66216, 36816, -8745, -60367, -47770, -45673, -45562, -16263, 25171, 25755, -6885, -15704, 11970, 5880, 17540, -8398, -13902, 1213, -15185, -48236, -47850, -14217, 26110, -159, -9057, -12288, 600, -45356, -49619, -17444, -22924, -64000, -43018, -17529, 17981, 55137, 64364, 64507, 29941, 37567, 85343, 73525, 32106, 6942, 28318, 38719, 17156, -13760, 34355, 73146, 76484, 82123, 76189, 50953, 29183, 3261, 6926, 40455, 11772, 6427, 29184, 61999, 84245, 98762, 91928, 30885, 25969, 19875, 43485, 60786, 15741, 38911, 35475, -4953, -5466, -15817, -12288, -6231, 12047, 25439, 54143, 48137, 2489, 11509, -18896, -49382, -67365, -6664, 47895, 36434, 51172, 40047, 29780, 50142, 67588, 64108, 50933, 48855, 37814]
11072C7814j440j7345j11L5769K3643j2235l5887l8320r442L0031L0194J7900
11060F0571r976J6226r910m4992L6706l597j9054m3809L172j457l592M290J2975
11047b447J7941J0457J5648r05l3212k0005J2145m23k5883P0j2501J542K6842
11034a0731n330j1329L2657P04k5811L2035N4538k2916l5547J2144O0815L2138
11022A13367m528k3611m9821m9795j4117N9014K2508m8163l0737K2795l378J6796
11010A0330k2748l703J9014L3292k2662k2533l6998M2748K4094j4647K3171J1509
10998D0867l3327l6711J0747M8234M8298r672k6684r7J7158L4865K4477j4933
10986A03222j466j5374l3566Q433K7277J7319R870j4865l264J9520q970l9300
$$ y = [37814, 36374, 19029, 18918, 54687, 78330, 66095, 30208, -8112, -17554, 12477, 42671, 60571, 50595, 66821, 56911, 11919, 48625, 45028, 25974, -17835, -14663, -16120, -19712, -15422, -2447, 15494, 25951, 41599, 40694, 7482, -12523, -378, -801, -26684, -26614, -39115, -37573, -10731, -16061, -27390, 5267, 5971, -19840, 12195, 66733, 43817, 8270, 20414, 81229, 113367, 108839, 85228, 35407, -14388, -28505, 30509, 53017, 4854, -25883, -3088, -6466, 10330, -12418, -16121, 2893, 36185, 13523, -9010, -46008, -3260, 20834, 6187, 29358, 40867, 7540, -29171, -18424, 29810, 78108, 68436, 41752, 41655, 58813, 93678, 118155, 103222, 101756, 86382, 52816, 61249, 88526, 105845, 115715, 100850, 97586, 117106, 108136, 68836]
10974F8836j1583N0365K3295J1437m158l3286k3595P648j5784j6120m7504Q975
10962A8526J0407j6289P0270O6884j285o777J7340l171r372J4050N9678J26838
10950C47099J11961J52260K45316K25873K07103J99750J74458J05541N077k69107
10940A505331l51512k89890j70488j16632o3384r1454j24489q3140m192q529j6286
10929A85335j3343J0155l4922j4298K0728k3312j0328j790j3812J9188M21l9427
10917H4595j2744k0373P405J1253L357p616O803K7890L0010l4180l7096O581J7192
10904H3077K3108K29k3047M979J4240o580n4018j4105K8523K1911K928j219M779
10891H4805L8229K6849k9234m0327l3848M3981L5366L9308n1862p8446k3718K6718
$$ y = [68836, 57253, 107618, 130913, 142350, 138192, 104906, 81311, 88959, 73175, 57055, 9551, 18526, 28933, 12644, 82914, 149798, 148513, 141736, 159076, 155905, 146533, 160583, 220261, 347099, 459060, 611320, 856636, 1082509, 1289612, 1489362, 1663820, 1769361, 1774438, 1505331, 1153819, 863929, 693441, 576809, 513425, 421971, 297482, 214342, 210150, 201621, 185335, 171992, 182147, 147225, 132927, 153655, 130343, 120015, 118225, 104413, 123601, 124022, 84595, 71851, 51478, 58883, 70136, 73493, 65877, 72680, 100570, 130580, 96400, 59304, 65885, 83077, 106185, 106414, 83367, 88346, 102586, 96006, 41988, 27883, 56406, 78317, 81245, 80026, 84805, 123034, 149883, 120649, 80322, 46474, 90455, 125821, 165129, 113267, 34821, 11103, 37821]
10879C7821n711M372J6365j0843J0486k984m746k0170j0140p526L14j53L2469
10866C9554K2226j917J9843K7220k336r225j3977J9500p625m5338K812j3078j1830
10853B5829K0274K448k9155p404L907M093k1340m036j0656o308L1521K1911j8676
10840A2408m1638R592j8537K7815K6263N2200L1401j7514o3500n9881k5900M0799
10828b6492K2470L0719M3976M3252j0826n9526l1350K0724j2272j6674p511J802
10816a708N4550N8894m2476m7502k9372p943L1088o3471j4223L7941M3050M3789
10804F2617R466j8136n2379J6939O8190R40m8828k2065J4899j1833K4653P228
10792E1691L1247j4831l6040J1297m4234K5778Q6303Q1331o496P599M2375O6277
$$ y = [37821, 32110, 36482, 52847, 42004, 52490, 49506, 44760, 24590, 14450, 6924, 7238, 7085, 39554, 61780, 59863, 79706, 106926, 104590, 95365, 81388, 100888, 93263, 47925, 50737, 37659, 25829, 46103, 48551, 19396, 11992, 15899, 19992, -1348, -5384, -16040, -22348, 9173, 31084, 12408, -29230, -19638, -38175, -10360, 15903, 68103, 99504, 81990, 18490, -41391, -67291, -26492, -4022, 26697, 70673, 113925, 103099, 43573, 12223, 32947, 20675, 4001, -3510, -1708, 52842, 111736, 69260, 21758, -7614, -15557, 15531, -47940, -62163, -24222, 18828, 62617, 72083, 53947, 1568, 18507, 86697, 87637, 38809, 16744, 31643, 19810, 44463, 51691, 82938, 68107, 32067, 43364, -870, 24908, 111211, 192542, 186046, 193645, 236020, 302297]
10780C02297N7182J8700J6057k3259m2673n9755m4597p5412n8349j0641K6386
10769A05936k1940p848j5444j1718K1424N451j3751J4297j7268K9280K1405j6320
10757I3504O339Q075n5009k925l722J5479J4837k0377m1284r301m9625K3237O1008
10744D0236L612K8813J4336k5559q749l3703K8723L1247J168K7784p002r613k3422
10731F7871j1158k0679l299P133j3492l5913J8641Q222j7924o432L4229q39M623
10718C0983k5917K0393k3251o228L9258M3010J2273K868r741l2228J3798L9473
10706A04691J2414j7275k5752l2624j406l6993j3826K7916O9243K0823K1756k7838
10694A01129j6265l8142m035j095L1441j1424l5694o474L1657K4501L5934L3912
$$ y = [302297, 359479, 378179, 394236, 370977, 328304, 268549, 223952, 148540, 90191, 79550, 105936, 83996, 76148, 60704, 48986, 70410, 75861, 62110, 76407, 59139, 88419, 109824, 93504, 99843, 107918, 52909, 49984, 46262, 61741, 76578, 56201, 14917, 5616, -44009, -20772, 40236, 43848, 72661, 86997, 61438, 52689, 18986, 47709, 78956, 80124, 107908, 100906, 91293, 67871, 56713, 36034, 32735, 39868, 26376, -9537, 9104, 17326, -598, -7030, 27199, 26360, 30983, 5066, 25459, 2208, -4020, 35238, 78248, 90521, 93389, 83648, 51420, 65218, 104691, 117105, 99830, 74078, 41454, 40048, 3055, -10771, 17145, 86388, 107211, 128967, 101129, 84864, 46722, 42687, 41592, 73033, 61609, 25915, 19441, 51098, 75599, 111533, 145445]
10682A45445k1224k1413k9679M3346R186j208O066o4031l0265M0641L1628K9973
10670A38465K0568J5684k7779l1869j6399P350J2310K1634J9828j4232J3888K9651
10658A89099l1906j2943K966p854M0081O6737K3388L7096P108j3898P008K6393
10646C33275R20n494l4335m2840P184L2448J1750Q582K0210m6689k5171K1988
10634B81828l8987k3086N4531J4965m14L2506j4737p1538n9022K3275M8439M9128
10622B96888J3348j1624J7846p650P873J3416j8699K4651O2959p979j1933k577
10610C76519r523L5145J427j3140m243j2774N703j2792q94M4915K5754J3039K6825
10597D75961K9402N9471M8920M9861j8054l6064J224J6789j1615L1235J462N287
$$ y = [145445, 124221, 102808, 73129, 116475, 125661, 124453, 130519, 66488, 36223, 76864, 108492, 138465, 159033, 174717, 146938, 115069, 98670, 106020, 118330, 139964, 159792, 145560, 159448, 189099, 157193, 144250, 147216, 139362, 179443, 246180, 269568, 306664, 313772, 299874, 306882, 333275, 334195, 328701, 294366, 251526, 258710, 291158, 302908, 311490, 331700, 285011, 259840, 281828, 242841, 219755, 274286, 289251, 288837, 321343, 306606, 235068, 176046, 199321, 247760, 296888, 310236, 298612, 316458, 308808, 316681, 330097, 311398, 336049, 399008, 391029, 379096, 376519, 366996, 402141, 403568, 390428, 386185, 373411, 379114, 366322, 365428, 410343, 436097, 449136, 475961, 505363, 564834, 613754, 663615, 645561, 609497, 610721, 627510, 615895, 647130, 648592, 653879]
10585F53879K1899J7431Q118J201J7798K3344L7131K5688j0898Q6356P7215M2933
10573A002095K0579K1737N6772M0254K1094Q6823R9569L9992L9668P2102K1612
10562A522297M6577R2674Q1239J24210J33626J43620J34327J96377K02993J86145
10552B864085K24563K61392K99144L41249M45055N22593O19632O73613P71135
10543G022461Q62193Q93943R28835J026008J209100J618298K293457L195023M558275
10534B3607593O671501J0140622J5833035K4113417L3621615M1498052M5358319
10527B00844154M6811147M5686178L7287713K1306166j4072925o3863232p3858758
10520B00140443n2331512l3497076k2787448j6405514j2195129r214394o947928
$$ y = [653879, 675778, 693209, 701327, 702528, 720326, 743670, 780801, 806489, 795591, 881947, 959162, 1002095, 1022674, 1044411, 1101183, 1141437, 1162531, 1249354, 1348923, 1388915, 1428583, 1500685, 1522297, 1568874, 1661548, 1742787, 1866997, 2000623, 2144243, 2278570, 2474947, 2677940, 2864085, 3088648, 3350040, 3649184, 3990433, 4435488, 4958081, 5577713, 6251326, 7022461, 7884654, 8778597, 9707432, 10733440, 11942540, 13560838, 15854295, 19049318, 23607593, 30279094, 40419716, 56252751, 80366168, 113987783, 155485835, 200844154, 247655301, 293341479, 330629192, 351935358, 337862433, 273999201, 200140443, 147808931, 114311855, 91524407, 75118893, 62923764, 53709370, 46761442]
10513D6761442n249456l988322l161295k707949k371134k146468j932370j756088
10505B3448360j757168j806108j712003j498485j319021j107209r57985q70816
10497A2419565p76938o84493n72631n12562m33687m44310m24386l64313l27109
10488G879136k87666k64085k79083k97179k46351k27904j44591q4741o7702l7139
10478E942695n6926m8056l7642l5852n1200r1240j10882j20752j88703k51448
10468D949994k36141l27811l42686l81183l89841l30056k97835l01227j81505
10459B161709j08632j25618q9529q7373o6798p6582j24221q4998n1306l1579m3917
10448A271156k6149l3740n9962l0715p3029m8450m7918l9321k4824k3420k8972
$$ y = [46761442, 41511986, 37523664, 34362369, 31654420, 29283286, 27136818, 25204448, 23448360, 21691192, 19885084, 18173081, 16674596, 15355575, 14248366, 13290381, 12419565, 11642627, 10958134, 10385503, 9872941, 9439254, 8994944, 8570558, 8206245, 7879136, 7591470, 7327385, 7048302, 6751123, 6504772, 6276868, 6132277, 6047536, 5979834, 5942695, 5885769, 5837713, 5800071, 5764219, 5713019, 5621779, 5510897, 5390145, 5201442, 4949994, 4713853, 4386042, 4043356, 3662173, 3272332, 2942276, 2644441, 2343214, 2161709, 2053077, 1927459, 1837930, 1750557, 1683759, 1607177, 1482956, 1397958, 1346652, 1315073, 1271156, 1245007, 1211267, 1151305, 1120590, 1047561, 999111, 951193, 911872, 887048, 863628, 834656]
10437H34656k1781k841k47j2142k0771O658P956l3022n9389l9762p836o429n118
10424F39932j7342j1806n2905l9171l8389P118r969j8718k0594r548j5559M344
10412D17393l3846j1657j839j0971l7361k3920L1470L3117O0619M9582j649j9970
10400D50968J149j4326J4194Q208J0136L0729j2245j4957n1675k1236k0090l5362
10388C45493n2229j457M7422J3270r420j9970l8544k6048j0851n06k0114q750
10376B18296J6736k3417J6199J3341j2404k6179j7548n1066q124J5694M293j4727
10364A31094N2337J9205L0759o098o3660j4287R349J2623K6122N73J0527r982
10352A98562L0889K2280p14K98j2033k7334L9276J0777l2405J0486K237j1827
$$ y = [834656, 812875, 810034, 809787, 797645, 776874, 783532, 791488, 758466, 699077, 659315, 651479, 645050, 639932, 622590, 610784, 557879, 518708, 480319, 487437, 477468, 458750, 438156, 428608, 413049, 417393, 383547, 371890, 370051, 359080, 321719, 297799, 329269, 362386, 423005, 472587, 470938, 450968, 452117, 437791, 451985, 460193, 470329, 501058, 488813, 473856, 422181, 400945, 380855, 345493, 293264, 291807, 339229, 352499, 343079, 323109, 284565, 258517, 247666, 247160, 227046, 218296, 235032, 211615, 227814, 241155, 228751, 202572, 185024, 133958, 125834, 141528, 145821, 131094, 183431, 202636, 233395, 227297, 163637, 149350, 158699, 171322, 197444, 198017, 208544, 198562, 229451, 251731, 251017, 251315, 239282, 211948, 251224, 262001, 229596, 240082, 242319, 230492]
10340B30492m8937k8928J8468K6544j0876k629M1521l1384k3280m316J1370L7246
10328B15291n4394j5904l733l4184m0943j285k9035j7644j497r0K5681M5759L7280
10315A25302K0865J0735m312k1365N088L539k8768m2693k2643K8079m012m2462
10303B7353o4416j7243N0974N0894L0502N205j4051n211J0735j2688k4041k5027
10291A2986P045R0047K1535l9672n3519l082L8939K0435o028K2807L5132O7124
10279B13749n7551q2754j2960M673J1543r80P791l484j7208J3791l3532j2608
10267C0470l2328L8740L4356J5115j0381k1665l2450q743n351j7514q976J5896
10255b831L0714K6336k2168j2769J8798l0989m2284J1478O6374L9113K0541j7505
$$ y = [230492, 181555, 152627, 171095, 197639, 186763, 184134, 225655, 194271, 170991, 166675, 178045, 215291, 160897, 144993, 141260, 107076, 66133, 64848, 35813, 18169, 16672, 16582, 42263, 88022, 125302, 146167, 156902, 152590, 131225, 136313, 139852, 111084, 68391, 45748, 73827, 69815, 27353, -37063, -54306, -3332, 47562, 78064, 83269, 69218, 64007, 74742, 62054, 38013, 12986, 20031, 110078, 131613, 91941, 38422, 35340, 74279, 94714, 88686, 111493, 146625, 213749, 156198, 73444, 60484, 65157, 76700, 75720, 83511, 80027, 62819, 76610, 43078, 30470, -1858, 36882, 71238, 86353, 75972, 54307, 21857, 13114, 7763, -9751, -18727, -2831, 27883, 54219, 32051, 19282, 38080, 7091, -35193, -23715, 42659, 81772, 102313, 84808]
10243H4808o7040o121J2176M8851K0018m2632o1049m3664K0436L7591J5106M0496
10231E8976K6562P402k6838j5742L2144J6040K4261K1150j6562K8883L0918q150
10219A79044r43N1740j1071l1648j4091j6945n3222O690k724J109K7917r163l0540
10206I6153m4850l5179P531N6232L9853M2349k6862j01049q098M0716R762l429
10194G3129K4052J3055k4697P116N5290R7224M7394O6276L3203N823m5038j30197
10182B22630n6066m1982o6014l4763L450M3247K2995j4741l4767K1487k9812l8662
10170b998o554J2647O053P502P42k9146K9978M8723n4658k5585m904K6587K3848
10157C2235K1222k2706P465l2379j215M2787j9763M666L444J4623j5497l4135
$$ y = [84808, 17768, 11647, 23823, 72674, 92692, 50060, -10989, -54653, -34217, 3374, 18480, 58976, 85538, 92940, 66102, 50360, 82504, 98544, 122805, 143955, 127393, 156276, 187194, 179044, 178101, 229841, 218770, 187122, 173031, 156086, 102864, 109554, 106830, 107939, 135856, 126693, 96153, 51303, 16124, 23655, 79887, 119740, 162089, 135227, 34178, 26080, 66796, 76558, 73129, 97181, 110236, 85539, 92655, 147945, 245169, 292563, 358839, 392042, 397865, 352827, 222630, 166564, 124582, 58568, 23805, 27255, 70502, 93497, 78756, 43989, 65476, 35664, -2998, -9552, 3095, 9148, 16650, 17392, -11754, 18224, 66947, 12289, -13296, -18200, 8387, 32235, 53457, 30751, 38216, 5837, 4622, 47409, 27646, 32312, 35756, 50379, 34882, 747]
10145G47o123K2545l0152L602R843l914k2725m778k305q494J0641K3085K7071
10132A9043m0175k4254M8647O8453J8424m8970o8016M1885O1814j5851l6384k9713
10120e097O4886L8014M8826O252k9003q161n163k3079m307j6138J2209P6618P2119
10107B27976R0064J42718J71639J97284K36501K58321K35711J99219J15254j26335
10097A748352l21239l35578k89552j90481j18786n1792p9721j11104l3188j4882
10087B02029l1629j6124j5753j7007l0574k5368j4760J7900L7242l2771k9562
10076D3623n066j6544M539J5102K4990O49L9601K4601n8532k8317r639l8206J1931
10063H732K1402k7222l039L15j9972l3910J6934L3316M7566j9271j2431j906M402
$$ y = [747, -5376, 17169, -12983, -9381, 462, -3452, -26177, -30955, -33260, -41754, -31113, -8028, 19043, -21132, -45386, 3261, 71714, 90138, 41168, -26848, 15037, 76851, 61000, 24616, -5097, 59789, 97803, 146629, 152881, 123878, 115717, 110554, 87475, 83168, 67030, 79239, 155857, 227976, 318040, 460758, 632397, 829681, 1066182, 1324503, 1560214, 1759433, 1874687, 1748352, 1427113, 1091535, 801983, 611502, 492716, 440924, 361203, 250099, 216911, 202029, 170400, 154276, 138523, 121516, 90942, 65574, 50814, 68714, 105956, 73185, 43623, 38557, 22013, 26552, 41654, 66644, 67293, 106894, 131495, 72963, 44646, 35007, -3199, 8732, 30134, 2912, -127, 188, -19784, -53694, -36760, -3444, 44122, 24851, 12420, 10514, 14916]
10050A4916O714l510R421O912L4761L0060j1447n071L1084J760j3952o7536N81
10037C4693P796K3590q799j2473j3764Q700M9222K2243k3085M133l3853l8295
10025B0108K7777P6538M6085l3333k9306M1327k8265o3312k2743O327P00k1469
10013B0434j8070P292L4574K9992j4404M1548M0181K0962J2474l8386o1020n8725
10001A6852k167J2642p42J3869K352j3357k5554q979j1366l2022l022K65J0898
9988d0331J5720L0329o6k0242j0664M6866K6649J9320m2618n6266M907O326o241
9975b6311j6073k9396j2695L9758M0031j4950J8980M6760J1486j2890j1608Q410
9963D1502l5330M036L897j9657q786q908j901K3439J6047j7312j028J6931K3010
$$ y = [14916, 21630, 18120, 27541, 34453, 69214, 99274, 87827, 82756, 113840, 115600, 101648, 34112, 34693, 42489, 66079, 57280, 44807, 31043, 39743, 88965, 111208, 88123, 92256, 58403, 20108, 47885, 124423, 170508, 137175, 107869, 149196, 120931, 57619, 34876, 41203, 41903, 20434, 2364, 9656, 44230, 74222, 59818, 101366, 141547, 162509, 174983, 136597, 75577, 16852, 14685, 27327, 26585, 40454, 42806, 29449, 3895, -5084, -16450, -48472, -51494, -51229, -40331, -24611, 5718, 5652, -14590, -25254, 21612, 48261, 67581, 24963, -31303, -26396, -20070, -26311, -42384, -71780, -84475, -44717, -4686, -19636, -656, 46104, 57590, 44700, 33092, 41502, 6172, 10208, 14105, -5552, -14338, -23246, -25147, -1708, 14339, -2973, -4001, 12930, 35940]
9950C5940J3059J7560J0852m8814l8918j3994n443M3163q480j4857J5615q399
9938b716J5688k3026l3249R579K9281L0522K4653P038k3257J2277k4358J94Q83
9925B3509J7422m3298k3448M5000k149k6819J1013J7662K8888J9889R822l6052
9913D1439k862o635k3478J2204J0667n811j0425n313Q152J2643J2070k3200k6685
9900g234J8064m6000J0249Q348J4355K0906O0923K586l2806J5444j500j5769M0943
9887H8509J7753L3650m7262l8841o712k3201j4968n011r303l6120K2013J8005
9875a488j810l62O261L0450J7781p624K8575j9749k1473k160l835j8119M5079
9862E1526j4254l076L7637J1087j1130l8555k0044l7351n031J5771M8904R216
$$ y = [35940, 48999, 66559, 77411, 28597, -10321, -24315, -29758, 13405, 4925, -9932, 5683, -2716, 12972, -10054, -43303, -33724, -4443, 26079, 50732, 57770, 34513, 46790, 22432, 22626, 23509, 40931, -2367, -25815, 19185, 17036, -9783, 1230, 18892, 47780, 67669, 77491, 41439, 38577, 31942, 8464, 20668, 31335, 25524, 15099, 9786, 17938, 30581, 42651, 19451, -7234, 10830, -35170, -24921, -16573, -2218, 18688, 79611, 82197, 49391, 64835, 63335, 47566, 88509, 106262, 139912, 92650, 53809, 47097, 23896, 8928, 3917, -5386, -41506, -19493, -1488, -3298, -3660, 2601, 33051, 50832, 43208, 71783, 52034, 30561, 28401, 24566, 6447, 51526, 37272, 34196, 71833, 82920, 71790, 33235, 13191, -24160, -29191, -13420, 35484, 44700]
9850D4700k5556j9520q121k6069j4875K9176Q949j3804K7292N5462O585J5602
9838G9821j8784k9528J0275N391l7185n604L1459j4322j6696J4251K8480j5455
9826C2103k7551k0669q930K0331K8632p147K5083k5396J5234K7687L848l7718
9814B5507j8966K8226O2941k7356o2282j9029J2335J2912L1452K5539n0888K52
9802B0643M5983K2330n16R6k9925p598k756j8602j036q05j5088j4360j4914L5668
9788A9120L7216l9645q413L5256k2772k5069J5473N884k8863J8243p871p087o12
9775i140j333J7291m832m1307k6694M8009J7233J9674j6982K0252j4108K4807
9763C2870J6019J6326j2791k1151K455l7336p94O0979J7874N315k6988k324M965
$$ y = [44700, 19144, -376, -8497, -34566, -49441, -20265, -11316, -25120, 2172, 57634, 64219, 79821, 61037, 31509, 41784, 47175, 9990, 4386, 35845, 21523, 4827, 19078, 47558, 32103, 4552, -16117, -25047, -4716, 23916, 16769, 41852, 16456, 31690, 59377, 63225, 25507, 6541, 34767, 97708, 70352, 8070, -10959, 1376, 14288, 45740, 71279, 20391, 20643, 66626, 88956, 88440, 88536, 58611, 51013, 48257, 29655, 28619, 27814, 12726, -1634, -16548, 19120, 56336, 16691, 8278, 43534, 20762, -4307, 11166, 17050, -11813, 6430, -1441, -8528, -9140, -10473, 6818, 1986, -39321, -66015, -18006, -773, 18901, 1919, 22171, 8063, 32870, 48889, 65215, 52424, 31273, 33728, -3608, -4402, 56577, 74451, 79766, 52778, 50454, 55419]
9750E5419j9548j2393L1379k1773j1613k057J2902L0003K4806r140k3670m3419
9738A0896J402N0554M6330l0690l8356j1004K5096l7482r774J1796k0471n732
9726g435O6028J9864l5952l2585j2944K6817j825K3221l7688j0721L721j3168
9714a2667K288j6716l6088O2586K1731j8112m3105L6574M9203J2582N787j6952
9702D7111J3759j4841j6294q842l9002j4128J5554j737O970J176j592R850k9533
9689c1549l1124P4302P5916k790l6738o117N9304k0566k3220j3217k1361m854
9677A7986l298r205K813M6288K6627M687m0014L970J1647Q991m1609m8986K0725
9664F22J1770j5932k7654k828M1408Q965j701J7574N1356l1825m1249j9653O720
$$ y = [55419, 35871, 23478, 54857, 33084, 21471, 19414, 32316, 62319, 87125, 77985, 54315, 10896, 12298, 62852, 109182, 78492, 40136, 29132, 54228, 16746, 6972, 18768, -1703, -7435, 58593, 78457, 42505, 9920, -3024, 23793, 21968, 45189, 7501, -3220, 501, -12667, -10379, -27095, -63183, -597, 21134, 3022, -40083, -3509, 45694, 58276, 64063, 47111, 60870, 46029, 29735, 20893, -18109, -32237, -16683, -18420, -11450, -10274, -11866, -2016, -31549, -62673, 11629, 87545, 84755, 48017, 41900, 101204, 80638, 57418, 44201, 22840, 17986, 14688, 5483, 8296, 54584, 81211, 85898, 45884, 49854, 61501, 70492, 28883, -20103, 622, 12392, -3540, -31194, -34022, 7386, 16351, 14650, 32224, 83580, 51755, 10506, -9147, -2427]
9651b427J9009L6587J9030M5717J2695k2309M0168j8808n9486l11p115m2193j2967
9638G590L7817R450k4928q988l865N664n008l1354m841j795K8108L2162o514k4738
9624H760k2096J9927J7883J1872J6536j9717J1330L7887N4833l3812o4923o22
9612C7858p576l9419j9459J9097J8304L3180O255j2827j0750R280K2277j355l280
9599E1585O84J0478N592r064j0178N7778J7930K968j7614o711j1936J4984k5040
9586H1456j0364J047j0524p730j1330q216k7603q747Q0727J6624N050j1615O806
9573I5581j0659m0738j7565K2145j158n452J132k3610o258j222j5482M5116Q119
9560D9949m567J511o378P933R998K1656n6l1824o3623j9287J967r196j5084L5501
$$ y = [-2427, 16582, 53169, 72199, 117916, 130611, 108302, 148470, 129662, 70176, 69865, 62750, 20557, 7590, 45407, 54857, 29929, 20941, 17076, 22740, 17732, -13622, -18463, -20258, 7850, 40012, 33498, 8760, -13336, 6591, 24474, 36346, 52882, 33165, 44495, 82382, 137215, 103403, 38480, 37858, 30282, -9137, -28596, -9499, 8805, 41985, 48240, 35413, 24663, 33943, 56220, 54865, 51585, 52269, 62747, 68339, 59275, 49097, 106875, 124805, 127773, 110159, 103448, 91512, 106496, 81456, 71092, 72139, 61615, 53885, 42555, 34339, 6736, -2011, 78716, 95340, 100390, 88775, 95581, 84922, 44184, 26619, 48764, 47606, 42154, 43286, 19676, 13418, 12196, -3286, 41830, 49949, 45382, 46893, 40515, 48448, 58446, 80102, 80046, 48222, -15401, -34688, -32721, -41917, -57001, -21500]
9546b1500L2807L0816M415k6194q718K5007j3962j7262J3575J6756L3038J8806
9534H7584l5641l6741L6962q458j7411N4K3620j0213p336L3858o800L9932j1665
9521H7745j0914j1351l4351o863K0816k3362j8226m849K2479j558j8310K063k3815
9508b0496j7871J2905k666J5760N2444L2128j1701j7892J6697o425q18J5347j1734
9495E5678k3092J766K3600J4439m8524J4432j6516l0199j9J4688p894J7842L2906
9482D9107K1146M184m2663K3758M2481o068k4265k1699k5940R789K0115J3650
9470F3595L5669Q666N768m3137m4933m310J9749J4392m2437J2408J6244M1105
9458H2779M3518l5857j4695L6836n0624m2150M6134J010l895l402j7369j0991
$$ y = [-21500, 11307, 42123, 46538, 20344, 11626, 36633, 22671, 5409, 18984, 35740, 68778, 87584, 51943, 15202, 52164, 43706, 26295, 26349, 49969, 39756, 32420, 66278, 59478, 99410, 87745, 76831, 65480, 31129, 24266, 45082, 21720, 3494, -1355, 21124, 19566, 1256, 3319, -20496, -38367, -25462, -28128, -12368, 40076, 72204, 60503, 42611, 59308, 52883, 52065, 67412, 55678, 32586, 34352, 57952, 72391, 23867, 38299, 21783, -8416, -8435, 6253, -1641, 16201, 49107, 70253, 74437, 31774, 55532, 98013, 91945, 67680, 45981, 20041, 29830, 49945, 63595, 99264, 107930, 113698, 70561, 25628, 21318, 41067, 55459, 13022, 25430, 41674, 82779, 126297, 90440, 75745, 112581, 61957, 19807, 65941, 66951, 63056, 59654, 42285, 31294]
9446C1294m5625k1187L0622K6955o833j06R899K3534j3477l7087Q37K7528J7710
9433D4064M87k5986J6141m312M5504K3850O649j6808p770m2356J5146L6737M5716
9420A37062Q187j7733k4003J8876o8732j3095L5485L3174j8833k0165K4539L4105
9408A28867j3868j2677l1393K0357l632j3805k0658k0186m0994j5185J9863K2231
9396A8920K8034K5075j6557l7365l9209J7796M195P7739m36k6012k1623M08m0207
9383i242l2326L8353P3067M5384j2472k5005o150l6871j0901l1194K2454R52l5658
9370a9609l087k0058m255K3458m339l105j6412L9096K9745p147O6336M946l3627
9357E1942m241M1641N0954j9481k1315j5970l4665j2409k756m791K0268J9760
$$ y = [31294, -14331, -35518, -4896, 22059, 15226, 15120, 25019, 48553, 35076, -2011, -1174, 26354, 44064, 44551, 18565, 34706, 30394, 75898, 99748, 106397, 89589, 81819, 39463, 54609, 91346, 137062, 145249, 127516, 103513, 122389, 53657, 40562, 76047, 109221, 90388, 70223, 94762, 128867, 114999, 102322, 70929, 91286, 87654, 73849, 53191, 33005, -7989, -23174, -3311, 18920, 46954, 72029, 55472, 18107, -21102, -3306, 889, 78628, 78192, 52180, 30557, 30965, -9242, -41568, -3215, 69852, 115236, 102764, 77759, 71609, 34738, 23837, -7357, 15097, 16049, -19609, -22696, -42754, -47009, -23551, -27890, -30995, -47407, -8311, 21434, 14287, 80623, 85569, 51942, 47701, 89342, 140296, 120815, 99500, 83530, 48865, 36456, 33700, 28909, 49177, 68937]
9345F8937j8386J7887r123q848L7227j7989k1745L6386J4464j6760J7307K5507
9333A24864k8957l4384j0899J1799j5269p754K615L8054R029L918l683j0147O212
9320H5398J338Q501J2596J7888m2761R16L6419j6182k0422M740N792L820J9026
9307A17069p178l4952M12J7040P2Q583M8151k4492j4995m635N6079k15l4056o0137
9293F6746L4045J5002k1693J9542K3924P678j0194j7027m0612q186L6765M0635
9281A46625j9689k8473P732K7459J8870j1138j4080K3048o541M02k0393J9157
9269A42979N8511j7391N820p052J3760N676K409N078J1785o576N507J4630m9274
9256A85862m2508p841L3046L6385N0699k3946n8841N514J983P417L6866k739l2511
$$ y = [68937, 50551, 68438, 59315, 50467, 87694, 69705, 47960, 84346, 98810, 82050, 99357, 124864, 95907, 61523, 50624, 62423, 47154, 39400, 42015, 80069, 89098, 93016, 89333, 79186, 85398, 86736, 95237, 107833, 125721, 82960, 83876, 120295, 104113, 83691, 88431, 94223, 98043, 117069, 109891, 74939, 75351, 92391, 92463, 101046, 149197, 124705, 109710, 105075, 161154, 160939, 126883, 66746, 100791, 115793, 94100, 113642, 137566, 145244, 135050, 118023, 77411, 69225, 105990, 146625, 126936, 98463, 106195, 133654, 152524, 141386, 127306, 150354, 143813, 144215, 123822, 142979, 201490, 184099, 189919, 182867, 196627, 202303, 204712, 209790, 221575, 214999, 220506, 235136, 185862, 143354, 135513, 168559, 204944, 255643, 231697, 172856, 178370, 180353, 187770, 224636, 221897, 189386]
9243A89386M0081N6310o773K0200j7710j3371l3518k8J860l1012l990n456k5330
9230A70649K1788Q822K688j4558k1544j0161N1936k3739k3789L6584j6882k2590
9218A59204p792J4888K1497m796l1509m8033j9379P958L1307N5692K2186O291
9206B07514L3016J9503k1402j2357k668m1807J0180J7829J959J4636j200j9451
9194B05752j958p360L9665J2619J8401k8995k8535l3622n199J3367J3902K8539
9182B26576j3521l8237Q087M7948r282k468J5943M0821k7844n8017l8675J9526
9170A70857Q965j0747j8181O378L3687j3687n864j4002j5848k3396K0571M1623
9158A80356K856m203K0673j9987l9945l5064L1329L0190M6476m97l0762O681l788
$$ y = [189386, 229467, 285777, 279004, 299204, 281494, 268123, 234605, 234577, 236437, 205425, 201435, 195979, 170649, 192437, 201259, 203947, 189389, 167845, 157684, 209620, 185881, 162092, 198676, 181794, 159204, 151412, 166300, 187797, 183001, 151492, 103459, 84080, 92038, 123345, 179037, 201223, 207514, 240530, 260033, 238631, 226274, 223606, 181799, 191979, 209808, 211767, 226403, 225203, 205752, 203794, 196434, 236099, 248718, 267119, 238124, 209589, 175967, 170768, 184135, 198037, 226576, 213055, 174818, 182905, 230853, 221571, 219103, 235046, 275867, 248023, 190006, 151331, 170857, 179822, 169075, 150894, 157272, 190959, 177272, 171408, 157406, 141558, 118162, 138733, 180356, 183212, 179009, 199682, 179695, 139750, 104686, 136015, 166205, 212681, 212184, 181422, 188103, 184315]
9145A84315J1955p467j0119m969N615k3878m5455M1312M3080j1538K2815n717
9133A99949l3929k8585l180K1419J4824O5768J0110K2804j3553n7117j4728M373
9121A88155j5502j7416K4149k2577k6107N35J9168L5413O9988L0495M973J2795
9109C04069k1385O446O094K1039k9332k3523j1415L9759J6190k4265q805L169
9097B78041j4471l456O241n0287m5199O592L9265N399O292p906r648O6796L7638
9084C15297q005l3595k8299N1101L2275J6095L147o6721l5302J5891K6175J8501
9072C06560L8147J8729m2574m0970j4633K1045L7945K476K082J3406j4658k7631
9060B99924O859J0462k3757k2021k7898K3507N5697j6357R710m155l8587K9128
$$ y = [184315, 196270, 188803, 178684, 173715, 179330, 155452, 109997, 151309, 194389, 182851, 205666, 199949, 166020, 137435, 134255, 155674, 170498, 236266, 246376, 269180, 255627, 198510, 183782, 188155, 172653, 155237, 179386, 156809, 130702, 131237, 150405, 185818, 255806, 286301, 291274, 304069, 282684, 289130, 295224, 316263, 286931, 263408, 251993, 291752, 307942, 283677, 274872, 278041, 263570, 260114, 266355, 216068, 170869, 177461, 216726, 222125, 228417, 220511, 210863, 277659, 315297, 307292, 273697, 245398, 296499, 328774, 344869, 348016, 281295, 245993, 261884, 288059, 306560, 344707, 363436, 320862, 279892, 265259, 286304, 324249, 326725, 328807, 342213, 327555, 299924, 306783, 317245, 293488, 271467, 243569, 267076, 322773, 306416, 316126, 311971, 273384, 302512]
9048C02512M0592K7174k6797J8920J5149l0840J6945K1750N180O159O349n121
9036C97972j0059P597J4796j5112k488l0488k403K3584j9269k5997k4557M618
9024C18194J5558L8599J4047l0586j9246K720n557k103M4661J0625J2764K7621
9012D27297M4884J2201j8738l6626l2442K436K9477J1821L3594L2039n542o6159
9000D34242m8248O860L6798N8888M8591m6350m0609K6785J2966j5534j8337L1149
8988D87201r880N3460r423j4190p836J93l6K1091J281K4348Q0995N1463j7025
8975F61642k5592K3293k211l0456J2804P679k8761K6645K0378j136M3373L1829
8963G39487q890k2338L2715J7841j2110J5944J8145K5504J2853r66m7599j8861
$$ y = [302512, 343104, 370278, 343481, 362401, 377550, 346710, 363655, 385405, 390585, 396744, 403093, 397972, 387913, 395510, 410306, 395194, 392706, 362218, 359815, 383399, 364130, 338133, 313576, 318194, 333752, 372351, 386398, 355812, 336566, 339286, 333729, 331626, 376287, 386912, 399676, 427297, 472181, 484382, 465644, 429018, 396576, 399012, 428489, 440310, 473904, 505943, 500401, 434242, 385994, 392854, 429652, 488540, 537131, 490781, 450172, 476957, 489923, 474389, 456052, 487201, 477321, 530781, 521358, 507168, 499332, 499525, 499489, 520580, 521861, 546209, 627204, 678667, 661642, 636050, 659343, 657132, 626676, 639480, 647159, 618398, 645043, 665421, 664285, 707658, 739487, 730597, 708259, 740974, 758815, 746705, 762649, 780794, 806298, 819151, 818185, 770586, 751725]
8951G51725L4788L5888O6677L1788l4998j084O353n062L8874j1581P778K9436
8939I50582K8422n067K8773M9949L7611K2865N0590L106n041p38k9867j6144Q902
8926A123943O8625M0360j3372P789L9914K619M3516M071L8242K6811p041M4380
8914A419857N0828L0938N2892M7027k6024N463N2664K5784Q53N8481L8819N7705
8902A815287P0024N4500K2245j9074N4529P1102M4179N6649R2511R9114O3619
8891B424685j537J0173J2630J1638M1003J10572P2221R1165Q3654M9174M5272
8880B950650J10247J29255J20747O7287J05328J61147J51194J17690J51921J03580
8870D169046O1474P5333M1432J02436K01216J48603R8919J47285K16635J90328
$$ y = [751725, 786513, 822401, 889078, 920866, 885868, 884784, 891137, 886075, 924949, 913368, 921146, 950582, 979004, 973937, 1002710, 1052659, 1090270, 1113135, 1163725, 1166831, 1161790, 1161052, 1131185, 1115041, 1123943, 1192568, 1232928, 1219556, 1227345, 1267259, 1269878, 1313394, 1317465, 1355707, 1382518, 1375477, 1419857, 1470685, 1501623, 1554515, 1601542, 1575518, 1580981, 1633645, 1659429, 1660282, 1718763, 1757582, 1815287, 1885311, 1939811, 1962056, 1942982, 1997511, 2068613, 2112792, 2169441, 2261952, 2361066, 2424685, 2423148, 2433321, 2445951, 2457589, 2498592, 2609164, 2681385, 2772550, 2856204, 2905378, 2950650, 3060897, 3190152, 3310899, 3378186, 3483514, 3644661, 3795855, 3913545, 4065466, 4169046, 4230520, 4305853, 4347285, 4449721, 4650937, 4799540, 4898459, 5045744, 5262379, 5452707]
8860E452707J64508J63767K16316J54324J82617K12390K33226K24599K49135K88134
8850G541723K64623K24823L35974L17087K62688K76565L46438L90335L93547M09080
8840A0762883M41585M50971M39812M15498M62394M42908L98450M56143M75903
8831A4746547M58323M82054M66382M61184M12577M34594M41244L56932L36189
8822A8596026K81137K34443K29369K13101J42634J10540R6673K4120o4979p4892
8812A9788172j14007j95049k51622k43493k72895l21580l28740l84499m31067
8803A7245220m19071l79252l61374l68573m11176m69755m34302l70512l74980
8794A3656225m27805m41555m17156m03302l65277k85961l43754l65126l41851
$$ y = [5452707, 5617215, 5780982, 5997298, 6151622, 6334239, 6546629, 6779855, 7004454, 7253589, 7541723, 7806346, 8031169, 8367143, 8684230, 8946918, 9223483, 9569921, 9960256, 10353803, 10762883, 11204468, 11655439, 12095251, 12510749, 12973143, 13416051, 13814501, 14270644, 14746547, 15204870, 15686924, 16153306, 16614490, 17027067, 17461661, 17902905, 18259837, 18596026, 18877163, 19111606, 19340975, 19554076, 19696710, 19807250, 19903923, 19928043, 19863064, 19788172, 19674165, 19479116, 19227494, 18984001, 18711106, 18389526, 18060786, 17676287, 17245220, 16826149, 16446897, 16085523, 15716950, 15305774, 14836019, 14401717, 14031205, 13656225, 13228420, 12786865, 12369709, 11966407, 11601130, 11315169, 10971415, 10606289, 10264438]
8785A0264438l12256l09603k75820k66575k89702k73003k82797k53887k05188
8776G795607j99238k05292k18980k32643j88128k12739k04779j84142j91141j99382
8766E759143j76931j36163j94527j84053j18374q6702j25132j50801j49423j41019
8756D296018j19967o7273m5566j57401j34128j00357p4330p5486l7079n7731q7737
8745C338963r9027o4526q6669r6947r4594q9420q1540l2177l6252q7479p6820
8734B493512m1824l2279m8343k4023n4244m9445k2071o5303o5052p9183m5350
8723A966395l6346n935j5081k8504p346m3390l4662o8253m3600q053M728n3411
8711A626542k4251l9046J2990k4171p6149l3912j9268l2494O239J4268l8321n2552
$$ y = [10264438, 9952182, 9642579, 9366759, 9100184, 8810482, 8537479, 8254682, 8000795, 7795607, 7596369, 7391077, 7172097, 6939454, 6751326, 6538587, 6333808, 6149666, 5958525, 5759143, 5582212, 5446049, 5251522, 5067469, 4949095, 4862393, 4737261, 4586460, 4437037, 4296018, 4176051, 4108778, 4063212, 3905811, 3771683, 3671326, 3596996, 3521510, 3484431, 3426700, 3338963, 3239936, 3175410, 3088741, 2991794, 2897200, 2807780, 2726240, 2694063, 2657811, 2570332, 2493512, 2451688, 2419409, 2371066, 2347043, 2292799, 2243354, 2221283, 2155980, 2090928, 2011745, 1966395, 1930049, 1924114, 1909033, 1880529, 1873183, 1829793, 1795131, 1726878, 1683278, 1675225, 1679953, 1626542, 1602291, 1563245, 1576235, 1552064, 1475915, 1442003, 1422735, 1390241, 1396480, 1410748, 1372427, 1319875]
8699A319875j3907m1825l7114m3422l8026m955k3577n658q994N431l1477M1755
8687A118106n490k9513k2891k0866M730k3981j2575m7881k6207j4327P003K4340
8675I50448j960n7327k3886L796q963j5551k4150L506k2689J4455q449r863j4837
8662G84530p155J4743o45j9376n0184j6707r683Q923J2039L647K894m5248p826
8649F69952o57q543M8171O6118o915p178R787N0595l141j7506R254M0617m5839
8636H04715p7545j0501l3410j7216L4964l0853P358q070n6906k3889j769J6082
8624F02960Q828K2719r515m6336l344m482L4599m2044k4748L5876M590j0791N458
8611E73770J7138k604L10J9753N958J9194L6494M1499K3068P884J6226N777J067
$$ y = [1319875, 1305968, 1264143, 1227029, 1183607, 1145581, 1140626, 1117049, 1111391, 1102397, 1107828, 1076351, 1118106, 1112616, 1083103, 1060212, 1039346, 1044076, 1020095, 1007520, 959639, 933432, 919105, 926108, 950448, 948488, 891161, 867275, 871071, 862108, 846557, 822407, 825913, 803224, 817679, 809230, 799367, 784530, 777375, 792118, 791473, 772097, 721913, 705206, 695523, 704446, 716485, 720132, 723026, 677778, 669952, 669295, 660752, 708923, 775041, 768126, 760948, 770735, 821330, 818189, 800683, 809937, 850554, 804715, 727170, 716669, 683259, 666043, 701007, 670154, 677512, 669442, 612536, 588647, 586878, 602960, 611788, 634507, 624992, 578656, 575312, 570830, 605429, 563385, 538637, 574513, 579103, 568312, 573770, 590908, 588304, 588614, 608367, 614325, 633519, 670013, 711512, 734580, 742464, 758690, 764467, 765534]
8598G65534K1417L0328P984R5585N7600M2820O7976K0588J5165j6502m6208l9870
8586A022417j3081j8261o4512q8674o7975j533Q093p6013o8189k9536o299p518
8574E88919j2589K6589o46q831l1294l0829l0809l9274n0999k174m69l1727j9071
8561C56796M8719L781j7415R638l667k3529L5283k5249J184j6072l0225J0913
8549C50157M0630K1886k0925m0295k5801j7020j7246l4353l2338M4421L3157l338
8537B98935k9817K7935N045K2987J9705q766o2996l6132j3694j2383J8086K8454
8525B57359J5608O989O680j4438N6408l8242o932O2129j9284j8909k9763j8776
8513B58829R176K4748k4825m4241J0244J7935J5523l0138l5887k6181l0246L2146
$$ y = [765534, 786951, 817279, 825263, 920848, 978448, 1021268, 1089244, 1109832, 1124997, 1108495, 1062287, 1022417, 1009336, 991075, 926563, 837889, 769914, 768381, 776474, 700461, 632272, 602736, 596437, 588919, 576330, 602919, 602273, 593442, 562148, 531319, 500510, 461236, 410237, 408063, 407594, 375867, 356796, 405515, 409296, 391881, 401519, 397852, 374323, 409606, 384357, 385541, 369469, 339244, 350157, 390787, 412673, 391748, 351453, 325652, 308632, 291386, 257033, 224695, 269116, 302273, 298935, 269118, 297053, 302098, 325085, 344790, 336024, 273028, 236896, 223202, 210819, 228905, 257359, 272967, 279956, 286636, 272198, 328606, 290364, 283432, 345561, 326277, 307368, 277605, 258829, 268005, 292753, 267928, 223687, 233931, 251866, 267389, 237251, 201364, 175183, 144937, 177083]
8501A77083K7762J8990k7511j2302K104J7152L8843p511j0440J7177l0047n8346
8489A52954M244k0809K0122M759j1486k508L4805M047j3707j6480M5911k0389
8477A81463l4823j884n966K531M9753K0830l5089m1597j7510N4520L7210k8776
8465A80662J0196M1307K3249j9363m5216q160k1682L6723m353l588l5657j3620
8453A40498k1833J0027N2916K54m915q571j669J0953k7656k5863J9242K2684j8411
8440A47656m8508J5073l2249K8455K8202k078K5840p72j4572j5954K2645j2995
8428A40743J4950j6591k6044L38q722J3493m022m0974Q082R8598J7983k5700l5319
8415A36815j1348p559J3412j6611m2359M7661K7008L0465K0227J6949k6912m6621
$$ y = [177083, 204845, 223835, 196324, 184022, 186126, 203278, 242121, 234610, 224170, 241347, 211300, 152954, 157198, 136389, 156511, 161270, 149784, 147276, 182081, 186128, 172421, 155941, 201852, 181463, 146640, 144756, 138790, 141321, 191074, 211904, 176815, 135218, 117708, 172228, 209438, 180662, 190858, 232165, 255414, 236051, 190835, 182675, 160993, 197716, 193363, 189775, 154118, 140498, 118665, 128692, 181608, 181862, 176947, 168376, 166707, 177660, 150004, 124141, 143383, 166067, 147656, 99148, 114221, 81972, 110427, 138629, 136551, 162391, 161619, 147047, 131093, 153738, 140743, 155693, 139102, 113058, 113396, 104674, 118167, 114145, 73171, 81253, 179851, 197834, 172134, 136815, 125467, 117908, 131320, 114709, 72350, 120011, 147019, 177484, 197711, 214660, 187748, 141127]
8403A41127K5477K5781j334l4655k6796j8482J9896L0307L174K284k97n9287j4726
8390I2469M772K7864r93n5027K393M0054o13l3076n858P977m641J4409l6757m844
8376D8129J1722J083k9381J8352J2284K5370Q391k4875R295r821k367K3410k4948
8363F6644K4860M6675l9088k0008j381K8455N128j9384p979L5847k555m653l2067
8350H0494m918K9006N110l8715p792M0256m087L2206L7275k7556l9139j1436L0253
8337A20957K3877L059j3863j7399q827n3604n2977K6065P4295J2246j1477P775
8325A10127J2860m2687k7577n9505J8712L5405l1371J5357L2061J2922j4401j825
8313F0078J2193J3352l317m9281l4867k441j856k4603L7888j6952K8715K5179
$$ y = [141127, 166604, 192385, 191051, 156396, 129600, 111118, 131014, 161321, 164495, 166779, 166482, 107195, 92469, 97241, 125105, 124112, 69085, 71478, 111532, 110919, 77843, 71985, 79962, 75321, 89730, 52973, 48129, 59851, 60934, 31553, 49905, 62189, 87559, 95950, 71075, 80370, 70549, 68182, 91592, 66644, 91504, 138179, 99091, 79083, 77702, 106157, 111285, 91901, 83922, 119769, 117214, 112561, 80494, 75576, 104582, 109692, 70977, 63185, 103441, 99354, 131560, 168835, 141279, 102140, 90704, 120957, 144834, 147893, 134030, 116631, 107804, 54200, 1223, 27288, 101583, 113829, 102352, 110127, 122987, 80300, 52723, -6782, 11930, 47335, 15964, 31321, 63382, 76304, 61903, 60078, 72271, 85623, 82306, 33025, -1842, -4283, -6139, -30742, 7146, -9806, 18909, 44088]
8301D4088j9275j2532J6698L4514l2951l496K8012K7310K3974k9005j4537k1199
8289D1601k5443k5013q68M7718N5450K785j3668k5872j193j3759J6022L8310K995
8276I9065k0681K7029R133J4844J6167n8649J7525j2054k2724l1573K3919K8984
8264I0985l035j8137j0811K4138k0071k9799j1450n123J314M3094r229l033j9485
8251B9358L4207K0862n855j6945n6883l0659L1948L3334n8549k0451J3687K9873
8239C927N2324r554n031j6745j0305l8848K8085N9853Q496j6512R207J7378J0845
8226I3120p165k0644k1676m6355J519R289R334K314j152J5470J1500K5232Q643
8213G9429k533K1646j6980n1227L8581N86j8334N70J8904k5286r517P212o027
$$ y = [44088, 24813, 12281, 28979, 63493, 30542, 27046, 55058, 82368, 106342, 77337, 62800, 41601, 16158, -8855, -9723, 37995, 93445, 96230, 82562, 56690, 55497, 41738, 57760, 96070, 99065, 78384, 105413, 114546, 129390, 145557, 86908, 104433, 92379, 69655, 38082, 62001, 90985, 87950, 69813, 59002, 83140, 63069, 33270, 21820, 16697, 18011, 61105, 51876, 48843, 29358, 63565, 84427, 78572, 61627, 4744, -25915, 6033, 39367, -19182, -39633, -25946, 3927, 56251, 46697, 41666, 24921, 14616, -24232, 3853, 63706, 72202, 55690, 64897, 82275, 93120, 85955, 65311, 43635, -2720, -1201, 8088, 17422, 19736, 18584, 34054, 45554, 70786, 79429, 76896, 98542, 81562, 30335, 68916, 69502, 51168, 51738, 70642, 45356, 35839, 43051, 37024]
8200C7024M221J7381j7283j4674R239k124K30J7922K0665qk3382j6989k3587L178
8186A1813N2685L726P106P491J4759K4405L4357l9368k6339L842M006k1207J747
8173G9023k7150O2397m599o2909k3030L7793P683J0072k475J8662j9171k7935
8161D8361q633j0457K8358N237J9423k885j3741j2942J3972M942k2615m12J1036
8148E9644k1983N963L2770n072l8330k2511L8796j2473K9489L4639R139L4991
8136A45062q227J8796k9854P736n3332l3079K468J5747M888m0398m8897k0225
8124c9315K2905M861M7198M6351M3443m447j4878l2099k7203m5358k4767K0721
8112b588L9631K2901k862K0942j9173N6922M4769j0464l4191p663j5589m942p795
$$ y = [37024, 41245, 58626, 41343, 26669, 35908, 33784, 34014, 51936, 72601, 72593, 49211, 32222, 8635, 11813, 64498, 68224, 75330, 82821, 97580, 121985, 156342, 116974, 90635, 94477, 98483, 77276, 79023, 51873, 114270, 109671, 46762, 23732, 61525, 69208, 79280, 76805, 95467, 76296, 48361, 39728, 29271, 57629, 62866, 82289, 79404, 65663, 52721, 66693, 71635, 49020, 48608, 59644, 37661, 43624, 76394, 71322, 32992, 10481, 49277, 36804, 66293, 100932, 110071, 145062, 136835, 155631, 125777, 133513, 80181, 47102, 49570, 65317, 70205, 29807, -19090, -39315, -16410, -11549, 35649, 82000, 125443, 120996, 106118, 74019, 46816, 1458, -23309, -2588, 37043, 59944, 57082, 78024, 58851, 115773, 160542, 150078, 115887, 108224, 92635, 87693, 79898]
8099G9898L3897q574Q383j1699k6072p2248J8783N1968l1811M124K0308q735L2568
8086I0790j8980p1111R206O137l954r863k3184j2215m347J3805O807n434k5937
8073d8280j1261K8961K1168N6639J5025L7230K1299j2870J3323r964k468K5535
8061A34337M089l0072k707Q297L6521P1550Q213m6944Q126R404n8333j9582j6426
8048A06473k1107K965J5973O0652q117m7922j9630K1581L2572j9324j4812p645
8036A01659P605R703J3761J0864k9947Q094P786l0034k7092l6150j7161J2927
8024C2015K1481R145J5745J5695l3025L8393K1682j2417k2122M0690J6026j0574
8012A32734j8988k7900K7030L2670K1797k0333m126J9699J1737j4900q042q342
$$ y = [79898, 113795, 105221, 113604, 101905, 75833, 3585, 22368, 74336, 42525, 46649, 66957, 58222, 90790, 71810, 699, 9905, 16042, 12088, 2225, -20959, -33174, -37521, -23716, -16909, -22343, -48280, -59541, -30580, -9412, 47227, 62252, 99482, 120781, 107911, 121234, 111270, 108802, 134337, 138426, 108354, 105647, 113944, 150465, 222015, 230228, 183284, 191410, 200814, 142481, 122899, 106473, 85366, 88331, 104304, 164956, 156839, 108917, 89287, 110868, 143440, 124116, 109304, 101659, 109264, 118967, 132728, 143592, 113645, 121739, 129525, 99491, 72399, 36249, 19088, 32015, 53496, 62641, 78386, 94081, 61056, 99449, 121131, 108714, 86592, 127282, 143308, 132734, 113746, 85846, 112876, 145546, 167343, 147010, 142884, 162583, 174320, 159420, 151378, 143036]
8000A43036l080K595j4651K06Q045k4M5485M6951N550k3689n1872r57M171n3750
7986A08016o070p93m915M004M600J7966l978k1205m5421k3064M1085J0023j0835
7973F9413j225K8233J0821p384K0691L3556n685j3959j2021k456O007P981J4119
7960A48091K6186K2068J4686M1332J0781m9937k0671k8633Q253Q46j310k5284
7948A46408M384K0916j7561j3428k1656K5371k8237n20J8610R049P146K6096K6971
7935B03549m0749j806p112l4372k294o463j979l614M9061J2354N988o550j8416
7922A47597o051M931r157K1485J960P778K9621K0314j5277l5486j6409n123k9974
7909A16209j0308L4779K6232k2515m3314k3221k84N344j280M0027J6918m0032
$$ y = [143036, 139956, 142551, 127900, 128106, 136151, 136127, 181612, 228563, 234113, 210424, 158552, 157595, 161766, 108016, 101946, 101153, 96238, 100242, 104842, 122808, 118830, 97625, 52204, 29140, 70225, 80248, 69413, 68188, 96421, 107242, 99858, 120549, 154105, 148420, 134461, 122440, 119984, 125991, 133972, 148091, 174277, 196345, 211031, 252363, 263144, 213207, 192536, 163903, 172156, 173002, 171692, 146408, 150792, 171708, 154147, 140719, 119063, 144434, 116197, 115677, 134287, 143336, 150482, 176578, 203549, 162800, 160994, 153882, 119510, 117216, 110753, 108774, 105160, 154221, 166575, 172563, 166013, 147597, 141546, 146477, 137320, 158805, 160765, 168543, 198164, 218478, 203201, 167715, 151306, 146183, 116209, 105901, 140680, 166912, 144397, 101083, 77862, 77578, 82922, 81642, 121669, 138587, 98555]
7897I8555k1080J5789J9317m076n195J1534K4785N17M7806J640o9451R308K8693
7884A58142j6070j1344k3615j5405k6482J5110O2115J186o9484o7824j2067K8421
7872B2683N0892j7249N336K2258l5299j8296J553J8537K0387K0502K23m271r281
7859G7975K3661M2920l6401k5773K9396K0270m2991l5040q090m2353L1957L6070
7847G1601j6993J206K2191j4492J0995k7369Q04M8024k0576m0703n0059k6560
7835d1931L7132j8833O96L2942O981L9575J6008k7404L0066M3604k2122o9804
7823B6910n3724r523l1j4047j6951j0172l638n701L9990N5659K5741j4275o460
7810A3778Q256O501j0808k7350K9285J0199J98J9084j0820j6326j5700K0507R106
$$ y = [98555, 77475, 93264, 112581, 108505, 103310, 114844, 139629, 140146, 187952, 189592, 120141, 129449, 158142, 142072, 130728, 107113, 91708, 65226, 80336, 142451, 143637, 74153, 6329, -5738, 22683, 73575, 56326, 61662, 83920, 48621, 30325, 31878, 50415, 70802, 91304, 91527, 87256, 77975, 101636, 144556, 108155, 82382, 111778, 132048, 89057, 54017, 45927, 3574, 35531, 71601, 54608, 55814, 78005, 63513, 74508, 47139, 47943, 95967, 75391, 34688, -15371, -41931, -4799, -23632, -22936, 10006, 16987, 56562, 72570, 45166, 75232, 118836, 96714, 26910, -26814, -36337, -36368, -50415, -67366, -77538, -81176, -86877, -46887, 8772, 34513, 20238, 13778, 22034, 28535, 17727, -9623, 19662, 29861, 30059, 49143, 38323, 21997, 6297, 26804, 35910]
7797C5910j561J8060j72j6728m9014l6443l876L425k08K4455J7838L9453k9353
7784A786K0925K1795k1465K278k6697K2032K9284q960k3582K4439n205j9064n8919
7771d1353l1190M5881N9538l9446l4662J6276J5200P184j0007L8234J5735n4009
7759a2619J4374N4428J4943R141P230n0018j8494Q913n5715r647K0038R354O909
7746a163J3580m2062k0968o003M8920K5785R255M441k255k0967j4261J2293L3315
7733C9910J9421J2681J0939J675k4699l2127j3126k468j1774j0501j8401K5025
7721c445K9715j9641m5629k4667M7157J4483j7110K128J884K7462J6738L0971
7709F0046M7577n3701n5707N412M4353j051j459m5427l5785k036J0511K9868k0975
$$ y = [35910, 34349, 52409, 52237, 35509, -13505, -49948, -53824, -50399, -50607, -26152, -8314, 31139, 1786, 22711, 44506, 23041, 25319, -1378, 20654, 49938, 40978, 17396, 41835, 36630, 17566, -41353, -72543, -26662, 32876, -6570, -41232, -24956, -9756, -2572, -12579, 25655, 41390, -12619, 1755, 56183, 71126, 80267, 87497, 37479, 18985, 27898, -27817, -37464, -17426, -8072, -1163, 12417, -29645, -50613, -56616, -7696, 18089, 27344, 31785, 29530, 8563, -5698, 6595, 39910, 59331, 72012, 82951, 84626, 59927, 27800, 14674, 12206, 432, -10069, -28470, -3445, 26270, 6629, -39000, -63667, -16510, -2027, -19137, -17009, -15125, 12337, 29075, 60046, 107623, 53922, -1785, 3627, 47980, 46929, 45470, 43, -35742, -37778, -27267, 2601, -18374]
7696a8374L185r36j4823m963J350n588K9629J72l603Q655l5313j5299K3640K7675
7682d593J291m8821L1421M2900o214o5633k4068j5038K6545L7858J8321n724K759
7669h996j0536j6473J7902P184K8295k2213n5007L903L6306M2481p561j2946r243
7656f904O986J811j049k2601M4127K0599m8478J4929n802J000l9923k7599n5907
7643a18811J8868N6826J5308M2057K1974j1164n2621K7572K4554j1327k1607j7049
7631b5420O336p162K0710N862j3680J2341K8512k3k3377O310j6997K2465J0746
7618B6623k9733j8935L7882K6987j0315K2996J3504N459k8734p9832j1493k8K2895
7605b2724L6094K6757j7436j9777j7812J7932o995Q277K2024J7300K155n703p11
$$ y = [-18374, -15189, -16125, -30948, -35911, -34561, -40149, -10520, -10348, -13951, -5296, -40609, -55908, -32268, -4593, -3302, -52123, -20702, 22198, 15984, -49649, -73717, -88755, -62210, -24352, -6031, -11755, -8996, -19532, -36005, -18103, -10919, 17376, -4837, -59844, -55941, -19635, 22846, 15285, 2339, -6904, 82, 1893, 844, -21757, 22370, 42969, -5509, 9420, 3618, 4618, -35305, -62904, -118811, -99943, -43117, -27809, 14248, 36222, 25058, -27563, 9, 24563, 13236, -8371, -25420, -19084, -26246, -5536, 326, -13354, -1013, 27499, 27476, 4099, 10409, -6588, 15877, 26623, -3110, -22045, 15837, 42824, 32509, 55505, 69009, 74468, 45734, -34098, -45591, -45619, -22724, 13370, 40127, 22691, 2914, -14898, 3034, -3961, 4316, 26340, 43640, 45795, 40092, 39381]
7592C9381J0447J2126m9158m3852k5997m0980k0900J649J8478J2354K0295N0505
7580a5652J5992k0646l5951k2711K2122k6687Q679K1480L3254L9652K5125N212
7568D9869j4695k1532j7173J5324R174j0514j6986m5814j5904J4901M9998R832
7556F480k5798n9142j4528L3505Q300K6854j3314q698M521L7373k0133k5951J1923
7543c8608J9290k6066k0314N3802r481m324j4662N4942K9842m3187q9043l9189
7531a26998N1136M9644N6257L7705k2762n4697l3876J6182J0263k8046k4605j6645
7519h6442K7780M9418L3870l5782k6219N012n991l5300j2093O0891M6040J1835
7507C3019j7638k2281J1152j010J4599q68m211j7904K6319j1176j5296p049J3549
$$ y = [39381, 49828, 61954, 12796, -31056, -57053, -98033, -118933, -117284, -98806, -86452, -66157, -15652, 340, -20306, -56257, -78968, -56846, -83533, -74854, -53374, -20120, 19532, 44657, 49869, 35174, 13642, -3531, 11793, 20967, 10453, -6533, -52347, -68251, -53350, -3352, 6480, -19318, -78460, -92988, -59483, -51183, -24329, -37643, -46341, -41820, -4447, -24580, -50531, -38608, -19318, -45384, -65698, -11896, -21377, -25701, -40363, 14579, 44421, 1234, -87809, -126998, -75862, -26218, 30039, 67744, 44982, -9715, -43591, -27409, -17146, -45192, -69797, -86442, -58662, -9244, 24626, -11156, -37375, -32363, -38354, -73654, -85747, -24856, 21184, 33019, 15381, -6900, 4252, 3242, 17841, 16973, 12762, -5142, 21177, 10001, -5295, -12344, 1205]
7494A205j576j4519L111n599J5723M0965J3343l9454j1044k8368o228q789N8615
7481A7385J8703J1839K1004k8199j4164J5626k0134O545K7596J5307K747k8661
7469D5594j2248l232k837m9935k5781J5823K896O92m931m263L192L0115L1316
7456B6401k7302p390K3158n440k0627J4923k2263J2222j0122L9008O93l8275J7555
7443B541l9940n0372J3452P9320m052l9152l2389m0833L7973L5656J1422J9769
7431f605k1045L0141L8762j8595m8155k0352j8029M115L1011j2016l4374K0937
7419e4205L6932J3462j8345K202L7544J9950l573j5667l4081l9313j7224L3871
7407c8447K3882J7580M5149j4812l4788J9129L1637K463k0245k9670k358j9779
$$ y = [1205, -371, -14890, -11779, -17378, -1655, 39310, 52653, 13199, 2155, -26213, -32441, -41230, 17385, 36088, 47927, 68931, 40732, 26568, 42194, 22060, 28605, 56201, 71508, 74255, 45594, 33346, 30114, 27277, -22658, -48439, -32616, -29720, -29028, -33959, -38222, -35030, -4915, 26401, -901, -8291, 14867, 9427, -11200, 3723, -18540, -6318, -16440, 22568, 23261, -15014, 2541, -37399, -87771, -74319, 5001, 949, -38203, -70592, -111425, -73452, -37796, -26374, -6605, -27650, 2491, 41253, 22658, -25497, -45849, -63878, -59763, -28752, -40768, -75142, -54205, -17273, -3811, -22156, -19954, 17590, 37540, 33967, 18300, -15781, -55094, -72318, -38447, -14565, 3015, 48164, 33352, -1436, 17693, 49330, 51793, 31548, 1878, -480, -20259]
7395b0259p399K7336L4798J0688m7422l8576K6420K4844L8318j3328l6888J2812
7383A1344l6150k8082q100M8282J6349J1822M6036L2899M971j5498m3229l4777
7371E867j1422O183r573K1586J5833j2292l6495k2084N160L7713K3723k8675j229
7358e705k388n927P229k0370J3443J3239l4804l6084K2917j6756J2873J2862J3437
7345b6034j061L659k0248l4553K5378L7566l4591R065j2436P48N6612R180l900
7332I385K6372N1785j8471k2567k0953n9185J8499j551J1734K3174j0380k6147
7320a8305r491o547K6361L3924L5438P346k7687m4699k6894j0708j8049O319O756
7307d6236K8015L2155L0654k0082n3705n7175j0873n790n074L4221K7388N4272
$$ y = [-20259, -27658, -322, 34476, 45164, -2258, -40834, -14414, 10430, 48748, 35420, -1468, 11344, -24806, -52888, -60988, -12706, 3643, 15465, 61501, 94400, 99371, 83873, 40644, 5867, -5555, 628, -8945, 12641, 28474, 16182, -20313, -42397, -37237, 476, 24199, -4476, -5705, -8093, -14020, -6791, -27161, -13718, -479, -35283, -71367, -48450, -65206, -52333, -39471, -26034, -27095, -23436, -43684, -78237, -52859, -15293, -49884, -40819, -53255, -52507, 4105, 13285, 9385, 35757, 87542, 69071, 46504, 25551, -33634, -15135, -16686, -4952, 18222, 7842, -18305, -27796, -34343, -7982, 25942, 61380, 68726, 41039, -3660, -30554, -41262, -59311, -52992, -46236, -18221, 13934, 44588, 24506, -29199, -86374, -97247, -103037, -108111, -73890, -46502, 7770]
7295G770K2655J3622k1691j4933p923K6318J0890J3059o1577l3930J3060q240
7283d0920K680M0592J0956J1533L469l3037p060q656j3836k695j9579m1035j527
7270i9115L4418J7426p749O960l876K2314M2072L6085K6382l5093L6630K060l5620
7257D2894r075r317J6156J6638j5969M5k2233l1546l707M2695k121k2833n1583
7244d9956k1113l587J0093K7374R424J8002J4150K2294J3309n6013k0962q633
7232d5618J8462L078l79l0707l276M2952j2150m4615k2649Q531K2133L6190j9116
7219d7164M9487j031j230j069j1571n619k6288k4968J9819L0359R528K2823K0286
7206C3362l4251J3393L3843j1050j2198n5195j5090N063K2682m678k8666N467
$$ y = [7770, 30425, 44047, 22356, 7423, -500, 25818, 36708, 49767, -11810, -45740, -32680, -40920, -38240, 2352, 13308, 24841, 28310, -4727, -11787, -20443, -34279, -36974, -56553, -97588, -99115, -64697, -47271, -55020, -48060, -51936, -29622, 12450, 48535, 74917, 39824, 76454, 78514, 42894, 33819, 24502, 40658, 57296, 41327, 41372, 19139, -12407, -16114, 26581, 24460, 1627, -49956, -71069, -74656, -64563, -37189, -27765, -9763, 4387, 26681, 39990, -16023, -36985, -45618, -27156, -24078, -24457, -55164, -58440, -15488, -27638, -72253, -94902, -86371, -64238, -28048, -47164, 2323, 1292, 62, -1007, -12578, -18197, -44485, -69453, -49634, -19275, -9747, 13076, 33362, -889, 12504, 46347, 35297, 23099, -32096, -47186, -42123, -19441, -24119, -52785, -47318]
7194d7318J8995k1682J4541O727J1437M5136K0943j4679m731m6090M5161K5800
7182E4240k8647j6131k0133l5205n4582J1097J8230K5972L5549K0383K3206K4948
7170E8927r416J4842j7825k3347l2119k6255J0487j3704J7191m83r631K5570J4780
7157I017K5171k8396k6264K5253L9529p367k2592l1801r921J0118L821J0956j0708
7144a3184P211N909L8565J3302K584k3881o2037k4494M5486M8753k317k7693k2720
7131a4516O207j9654J2899J6055N749j9676l5837J9246J6550m026J0843m206R287
7118a079j3840R959O026k6566l7435J7886K1590k0471J4872n639j4812j283J9903
7105c0889M2603J3211L1290n323J4142j9367m9419k31m573k567N476K833j5097
$$ y = [-47318, -28323, -50005, -35464, -28737, -17300, 27836, 48779, 34100, 29369, -16721, 28440, 54240, 25593, 9462, -10671, -45876, -100458, -89361, -71131, -45159, -9610, 10773, 33979, 58927, 49511, 64353, 46528, 23181, -8938, -35193, -24706, -38410, -21219, -21702, -31333, -5763, 9017, 34188, 5792, -20472, 4781, 44310, 36943, 14351, -17450, -27371, -17253, -13432, -2476, -13184, -5973, -64, 38501, 51803, 54387, 30506, -31531, -56025, -10539, 38214, 35897, 8204, -14516, -8309, -27963, -15064, 991, 6740, -12936, -48773, -29527, -12977, -17003, -6160, -10366, -1079, -14919, -4960, 1066, -25500, -62935, -45049, -23459, -43930, -29058, -34697, -49509, -50792, -30889, 11714, 24925, 56215, 50892, 65034, 45667, -3752, -3983, -8556, -11123, -5647, -2814, -17911]
7092a7911k4394J7853q420l8489J0051K1651K8720K948j3796l922m1882K100m725
7079g0216K6966M5269l9962k0861K1868K7378P77k2573k3817p320k2997J8015
7067f7473N5871J3028K258k9507K705K9445O374J2112j8489j7064k1372j2368
7055d4480K2884R639P184L9227m3551k0663j7892J4617J8880J9010m8233k7663
7043g1041m751K5970L9627l1940l8407m6870K8596L5414J8365O171L8695J7986
7031A7815J343j8667L845k2209k4551k1207o954J3293q273J1161q754J5414K5044
7018b2700l8290p2973l9230P4978Q2864O86L1002k268j251p089j3356k7728k87
7005c5642K1382J3137K1935J2645j8985l4583K4473K2232O112n84k1632J1793
$$ y = [-17911, -42305, -24452, -32872, -71361, -61310, -39659, -10939, -7991, -21787, -25709, -67591, -65491, -70216, -43250, 2019, -37943, -58804, -36936, -9558, -8781, -31354, -55171, -62491, -85488, -67473, -11602, 1426, 3684, -25823, -23118, 6327, 12701, 24813, 6324, -10740, -32112, -44480, -21596, -11957, -4773, 34454, -9097, -29760, -47652, -33035, -14155, 4855, -43378, -71041, -75792, -49822, -10195, -42135, -80542, -127412, -98816, -63402, -45037, -38866, -171, 17815, 19158, 491, 4336, -17873, -42424, -63631, -70585, -57292, -65565, -54404, -63158, -47744, -22700, -60990, -133963, -173193, -98215, -15351, -14665, 16337, 14069, 12818, 5729, -7627, -35355, -35642, -14260, -1123, 20812, 33457, 14472, -20111, 4362, 26594, 32706, 32122, 10490, 22283]
6993B2283l833j2746r753j7372l2180q620M1239K5291O575N228k376k6398j3430
6980b6092J1954M862J6535P436J616L1570M5619n476n2749k2314J137j1673K162
6967D587J0252m7767q843L5393K8650L4411q862l3810O880n936l7748j2424J8132
6954a7085J8305j3001K963J3758k447m0403m5641k1912J2352N6939P948n790k122
6941c6136L2686o915J6273m348l235q236l3114j3110J1040O1106K5883p82M070
6928D5182J4402m8303n0406K8295O2057m1072m8351N541J7176M4648k6761l145
6916g37L4868j0628j854R78m0636N4342r880k6750k3207j7170k3271m774J8766
6903d9953O6705k2552l900L1740m5681l7053K8606K4898J8148J6977j5946K2467
$$ y = [22283, 18450, 5704, -4049, -21421, -53601, -62221, -20982, 4309, 10884, 16112, 13736, -12662, -26092, -14138, -9276, 7259, 14695, 16311, 47881, 93500, 88024, 35275, 12961, 14098, 2425, 4587, 14839, -32928, -41771, -6378, 22272, 56683, 47821, 14011, 20891, 14955, -22793, -35217, -17085, 1220, -11781, -8818, 4940, 2493, -37910, -83551, -105463, -93111, -36172, -28224, -34014, -36136, -3450, -10365, 5908, 1560, -1675, -9911, -43025, -56135, -45095, 16011, 41894, 41112, 45182, 59584, 11281, -39125, -10830, 51227, 10155, -38196, -32655, -15479, 29169, 2408, -737, 34131, 23503, 21649, 22627, -18009, 36333, 26453, -297, -23504, -40674, -63945, -68719, -49953, 16752, -5800, -9700, 22040, -23641, -60694, -32088, -7190, 10958, 27935, 11989, 34456]
6891C4456j9248n1255r414m567k7891L7307M8935P201k680O939k1931j4941r843
6878b6932K6804L4149k5457l0307m3526o041J8274J5801K1460J0787N757L4057
6866C4826K080K053j2594l5853N5763K420j8637k7697J769j7237p421M878l755
6853a9405K788O355l4722j6484m18J0167K0068J4809K4948K0799J0632l4367m2828
6840c7658q03M8962J1462J0735J6931M438l9673j4657J3254j9517o1632k5782
6828i3940K1444J2870L6906j3954l5007M893J8203J6621L1212L2285L1038J4328
6816G6899m1292l9708l3616j1788J8270K0220J7281J2147l0827k7678j293p502
6804d8887m5695l4968M1330O7416M6991L5704j5487k5588j2745J8P339l9599o0302
$$ y = [34456, 15208, -36047, -45461, -50028, -77919, -40612, 8323, 15524, 12844, 19783, -2148, -17089, -26932, -128, 34021, 8564, -21743, -65269, -71310, -53036, -37235, -15775, -4988, 769, 34826, 36906, 38959, 26365, -9488, 46275, 48695, 30058, 2361, 4130, -13107, -20528, -15650, -19405, -16617, -10262, -44984, -61468, -61886, -51719, -31651, -16842, 8106, 28905, 39537, 5170, -37658, -38461, 10501, 21963, 32698, 49629, 54067, 14394, -263, 12991, -6526, -68158, -93940, -72496, -59626, -22720, -36674, -71681, -66788, -48585, -31964, -752, 31533, 62571, 76899, 35607, -4101, -37717, -49505, -31235, -11015, 6266, 18413, -12414, -40092, -41385, -48887, -94582, -129550, -88220, -20804, 26187, 61891, 46404, 20816, 8071, 8089, 15428, -24171, -84473]
6791h4473l2092J4410J7294M8087N2965M077J8887l5351o9431j4471J9533O7334
6779F769N3278l869m4239n6556j1425K0924L2111J7070l1596k9021M647J3359
6767b8548N980m427j7758k210J4103N741j5020k947N9488K660j8745L9926J468
6754C9711k5088p436j0854l2710j9912O431K414J1947J6546j4297q401k706m9093
6741i3448K0155L4174l1961q620K8376N1263L0238j0398J097j7609K589j0591
6729d735j1487K491l2420j2780k2017p865K7278L7565j0203J8756o576K2908p214
6716f299j0231K8746k4941l3909K6862m564k0533O039K1431P327O604M756j5541
6703a4253m4564P89R383m68k7164L1516M8222L552J9350M9459L0915j0044l2948
$$ y = [-84473, -116565, -102155, -84861, -36774, 16191, 20268, 39155, 3804, -65627, -80098, -60565, 6769, 60047, 56178, 11939, -44617, -56042, -35118, -3007, 14063, -17533, -46554, -41907, -28548, -22568, -26995, -44753, -46963, -32860, -27119, -42139, -45086, 14402, 17062, -1683, 38243, 39711, 14623, 7187, -3667, -36377, -56289, -49858, -47444, -35497, -18951, -33248, -41649, -44355, -93448, -73293, -39119, -71080, -79700, -51324, -61, 30177, 19779, 20876, 3267, 5856, -4735, -16222, -13731, -46151, -58931, -80948, -88813, -61535, -23970, -34173, -15417, -21993, 915, -6299, -16530, 12216, -12725, -46634, -19772, -24336, -44869, -38830, -17399, -10072, -3468, 1288, -14253, -58817, -58028, -48645, -49113, -76277, -44761, 3461, 7013, 26363, 75822, 106737, 96693, 63745]
6690F3745l9000K2930J4319l2873k8392K9807o6k8377N723n0145J475L2340K0487
6677A1973L5718n3711o2684j5698m720k1120R3N6780P4874L2698r391l453n7676
6664a6317m3025K1040m740j059k74K5632j0022k9741k2561k1143J3043O2316K9607
6651B756L976j7442k3081L1119l22j4314J2583J3804j0069j0536j0637J2301L799
6638f063k8355J0646K8277l5279k9631j1885m4845J9304L5556L9925j2132q5781
6626a20263j0443L8317K1590K1046L8866M7178j3975p110L4244J4844J4840j1719
6614F7415k3767j9586k6769k3764J1706o992q08k9104m758l475R163K5262K2127
6601c350l5085j1245k2460J7674K9891J0619k277j857j0483k606J9121K6557J2476
$$ y = [63745, 24745, 47675, 61994, 29121, 729, 30536, 30470, 2093, 7816, -42329, -40854, -8514, 11973, 47691, -6020, -68704, -84402, -89122, -110242, -110149, -53369, 21505, 54203, 44812, 41359, -16317, -59342, -38302, -43042, -44101, -44375, -18743, -28765, -58506, -81067, -102210, -89167, -26851, 2756, 6732, -10710, -33791, -2672, -2994, -17308, -4725, 9079, -990, -11526, -22163, -9862, -6063, -34418, -23772, 4505, -30774, -60405, -72290, -117135, -97831, -62275, -22350, -34482, -120263, -130706, -92389, -70799, -49753, -10887, 36291, 22316, 15206, 49450, 64294, 79134, 67415, 43648, 24062, -2707, -26471, -14765, -21757, -22565, -51669, -56427, -59902, -50739, -25477, -3350, -38435, -49680, -72140, -54466, -24575, -13956, -16233, -18090, -28573, -31179, -12058, 14499, 26975]
6588B6975j3312o835l6791j2144m34l0963N1838K1723k3938Q526j5241j4784l385
6575d8765L9886l1765n622J2308L7618J3116P935L1990m7528K5300l1829J10L5614
6562C8368M722J069m6517J2278K773o1494l8488K4069K8609M7486J6574j5649
6550A3800k9683k2800J3431Q04j0697l371M2645m255J9658M0083n0783l0196j0623
6537c1987J0331L2413K1645M080l5852o4902J1540J8415n408M4325l012l6836
6525c5248l5051k1608K0086j8882L0596Q378M4504J8356j2718K822j01j8505j790
6512a9161J1677J704M96J515n475o358l4232n0331L2437N3962K4781j2760j3350
6499a5095K141j0747j4667J4953m0014j1864J4920k3762J7315L1858M2663o980
$$ y = [26975, 13663, 6828, -29963, -42107, -42541, -73504, -21666, 57, -23881, -15355, -30596, -45380, -48765, -8879, -40644, -46266, -33958, 3660, 16776, 24711, 56701, 9173, 34473, 2644, 2754, 38368, 43090, 44159, -2358, 9920, 12693, -48801, -87289, -63220, -34611, 12875, 29449, 13800, -15883, -38683, -25252, -24448, -35145, -38516, 4129, -126, 19532, 59615, 8832, -21364, -31987, -21656, 10757, 32402, 36482, 630, -64272, -52732, -34317, -39725, 4600, 1588, -35248, -70299, -91907, -71821, -90703, -60107, -51729, -7225, 11131, -1587, 1235, 1134, -17371, -19161, -7484, -5780, -5284, -3769, -9244, -15602, -49834, -100165, -67728, -13766, 11015, -1745, -15095, -12954, -23701, -38368, -23415, -63429, -75293, -60373, -84135, -66820, -34962, 7701, 721]
6487G21n1720j8595N6888L6467J6811j7056k9621q910P239p79K9674K7798J086
6474E0003j8156m7171j274L2736O817k278J6289L4614m215m7276l7031k244L2266
6461A3080N0497J02m2498j8983J4893J6480J2760j1616o7460j2947J4318N95J1688
6448a9091M8709J3400m7349j3154K7817J1478n0014M113l988N667M296j1176L6627
6435G335L3890k143l7875j1532j7001j6407R868j315K51k4181L052K586K9897
6422b3575M6946j697Q78N436m2805l484m7236l6618L0191P3825N3906k2167j8442
6409A5158l457m4803k703M8118j3216l3224k9145J8566Q94J8142M3834r453o3132
6396e4421j1507J4975k4373K0719Q480L7881M4032k0931l7445j0792P393J4923
$$ y = [721, -50999, -69594, -12706, 23761, 40572, 23516, -6105, -15015, -7776, -8555, 21119, 48917, 50003, 31847, -15324, -16598, 16138, 22955, 20677, 36966, 71580, 67365, 20089, -16942, -19186, 13080, 63577, 63679, 21181, 2198, 17091, 33571, 46331, 34715, -32745, -45692, -31374, -30779, -19091, 29618, 43018, -4331, -17485, 10332, 21810, -28204, -24091, -28079, -22412, -18116, -29292, 7335, 41225, 39082, 1207, -10325, -27326, -43733, -33865, -35180, -34929, -59110, -56058, -53472, -23575, 23371, 21674, 22552, 27988, -14817, -18301, -65537, -102155, -71964, 1861, 55767, 33600, 15158, 11701, -33102, -35805, 12313, -903, -34127, -63272, -44706, -43812, -25670, 18164, 8711, -54421, -65928, -50953, -75326, -54607, -46127, -8246, 35786, 14855, -22590, -33382, -25989, -11066]
6384a1066K8963K1411k0033k5678j4439P309J8495r203j4286M657j4139k6688
6372e4697J2790R931Q085J5066j365j4155J2479j545k5209k4645M0856L4455J735
6359A3781k3265K3423L7665j9473l3995P638Q677j4482l4557j5260O217j3416
6347e7047L300N2222J9579j2413J4216J4759k5312m9622n5116L1029J2196M5533
6335f676Q685j5655j9011K0209m2501j8249J7303L2611l259l3152J3523J8991
6323b7181J3149K7168l707m7025j6755J5912L7597L3441j7791k5518m965K0600
6311D925P970j0055o3297l2476J6694M3501K2907P628K080K1710l0242k3908K43
6298c2320K3703K3366j9787L6117J6047Q860k2728m3819k1510j0250L3249k268
$$ y = [-11066, 17897, 39308, 19275, -6403, -20842, -13533, 4962, -4241, -18527, -13870, -28009, -54697, -41907, -31976, -23891, -8825, -10190, -24345, -11866, -13411, -38620, -63265, -22409, 12046, 13781, -9484, 13939, 51604, 32131, -1864, 5774, 14451, -31, -34588, -49848, -43631, -57047, -53747, -1525, 18054, 5641, 19857, 34616, 9304, -40318, -95434, -64405, -52209, -6676, 2009, -13646, -32657, -12448, -54949, -73198, -55895, -23284, -26543, -59695, -46172, -27181, -14032, 13136, 9429, -37596, -54351, -38439, -842, 32599, 14808, -10710, -15675, 4925, 12895, 2840, -60457, -92933, -76239, -32738, -9831, -2203, -123, 21587, -8655, -32563, -32320, -8617, 14749, -5038, 31079, 47126, 55986, 33258, -10561, -32071, -42321, -9072, -11340]
6286a1340j73J1063K6237K5320m6045m4424L9281N0274R418q75l3463j7284k8397
6273b0408j0827K9760l754j0270N4739P858k6022j6479Q237j3598K2120P632j3787
6260A5201r295l2780l0625L7757N3860L6297l4774n1183O798J6282j4233j0748
6248a7443K0973k0910l3326l0621k1667K9577K3441k3465R273K5390J1985p95
6236b7588L112L9557p040J4922k0484l8408N035Q255K9151J2405j4718j7614l0219
6223d3634J4518Q760j9345k6037K8947J1714j3243j3092J5527K8071K727n387
6211a0474o451K8282j6872K3397K0840m63k4126l6963j0041J7556K1439l0048
6199b3924k9304K2953J2696m997m7313j0645P4323j3022J2330L0115l154p149
$$ y = [-11340, -11513, -450, 25787, 51107, 5062, -39362, -81, 50193, 59611, 58736, 25273, 7989, -20408, -31235, -1475, -5229, -15499, 39240, 47098, 21076, 4597, 12834, -764, 21356, 28988, 15201, 5906, -26874, -57499, -19742, 34118, 70415, 35641, -15542, -8744, 7538, -6695, -17443, 3530, -17380, -50706, -81327, -102994, -73417, -49976, -73441, -64168, -38778, -26793, -27588, -24476, 15081, 8041, 22963, 2479, -35929, -30894, -22639, 6512, 18917, 4199, -13415, -43634, -29116, -20356, -39701, -65738, -36791, -25077, -38320, -51412, -35885, -7814, -5087, -10474, -16925, 11357, -5515, 17882, 38722, 38259, 14133, -22830, -32871, -15315, 6124, -23924, -53228, -30275, -17579, -22576, -69889, -80534, -6211, -19233, -6903, 23212, 20058, 12909]
6187A2909j1097l8492j9941L6818L7001m771N953k016l448J5029q405m8316n0416
6174g9192K3046M1499L3731P513n8258o9027K2943N3555k4851k7016N1796J2023
6162a2238j3923j4401j048j7133K9319K7877j4505l3524R877N119N820j1385k9274
6149f9419L6958M1691j8358l1176J4153k703j2925j2726M2790P3689k3831o9999
6137c1856J4254k247m2072m1648J5355l925L1176K1835L22m024j0516k6951J8154
6124f2143M5839K4662j5716l3624p836k0855K0231K9288Q613q683m1898k5373
6112h7495O736J237K7470M6476L2070k6058k3038l60J914p965j5258N7568J4847
6099B8144k0751l0226j8738n853J1753J9298N9401J3557m4116j0990l2138K9115
$$ y = [12909, 1812, -36680, -56621, -19803, 17198, 12427, 18380, 16364, 12916, 27945, 19540, -28776, -79192, -56146, -14647, 19084, 26597, -31661, -100688, -77745, -24190, -49041, -76057, -24261, -12238, -26161, -40562, -41610, -58743, -29424, -1547, -16052, -49576, -39699, -34580, -28760, -40145, -69419, -32461, 9230, -9128, -40304, -26151, -28854, -41779, -54505, -11715, 61974, 38143, -31856, -17602, -19849, -61921, -103569, -88214, -92139, -60963, -39128, -38806, -42830, -53346, -80297, -62143, -16304, 8358, -7358, -40982, -48818, -69673, -49442, -20154, -11541, -20224, -62122, -87495, -80759, -79522, -52052, -5576, 26494, 436, -22602, -22962, -21048, -29013, -44271, 13297, 28144, 7393, -22833, -41571, -47424, -35671, -16373, 43028, 56585, 12469, 1479, -30659, -1544]
6087a544K101k3281l0027K8201l1906J0627L7152j1617J0794K905j5051K6390
6075D744M0743L22k1289N136k0352j5128j0367k8967K3009K4619J3168k310n3913
6062d0585j8148q565J7647J7740K6476K394j1359L5212J9986k7813m2405j0345
6050c9765J4971K1814L3546k495k752l4623J8267J1044k4781k399J0319K334M2118
6037D7598J3653K0462k4791Q565J6194j928k4726r366k3490j6134l6364l3044
6025f3371L2471R996l8769o2189j9219M4533N5248M4372J4381k0729j664J1562
6013F622j9976j0652k7545L8336K4033J5397j8351q761k141O233Q843K0049j970
6000C0117l2564N553o504l116L3678L9586j8147m0805k0087p506J4820j5286j6459
$$ y = [-1544, 557, -22724, -52751, -24550, -56456, -45829, -8677, -20294, -9500, -6595, -21646, 4744, 45487, 45809, 24520, 29656, 9304, -5824, -16191, -45158, -22149, 2470, 15638, 13328, -40585, -58733, -67298, -49651, -31911, -5435, -3041, -14400, 20812, 40798, 12985, -29420, -39765, -24794, -2980, 30566, 28071, 25319, -9304, 8963, 20007, -4774, -7173, 3146, 5480, 47598, 61251, 81713, 56922, 65487, 81681, 79753, 55027, 45661, 22171, 6037, -30327, -63371, -30900, -20904, -59673, -121862, -141081, -96548, -41300, 3072, 17453, -3276, -4940, 6622, -13354, -24006, -51551, -13215, 10818, 26215, 7864, -897, -3038, 3195, 12038, 32087, 30117, -2447, 3106, -3398, -6514, 27164, 66750, 48603, 7798, -12289, -19795, -4975, -20261, -36720]
5987c6720Q633L8989L1400j9865l3790K2714k024M0830n566k6910o262k5745K389
5974a1927J9003r639J3847J1350Q065K6253N981r960k2720k5216l4779J1089K9940
5961A1287r021k7875M325j7356K3637R22J3755Q903k8337l9283J268J5352K6383
5948a6040j1270P560j5250J2731M5524Q633k1368O050J6269j232J7021J1926L0971
5935I1525m4850m2694J3139j7455k1471J1123J0309j825k681j7204k9048j2037
5923f3169n836q873L0919N0834K9936j0671l0032k0764O60l4001J3816K6830k0445
5910d0796r48n564j3292N673K3795j3755N017M3655J8529J1840q306O721O890
5897C9459N107k5267l0931m7946m2595J6377M8983j1418j8161N961K2656M0787
$$ y = [-36720, -28087, 10902, 42302, 22437, -11353, 11361, 9337, 50167, 44601, 17691, 11429, -14316, -11927, 7076, -2563, 11284, 22634, 30699, 56952, 62933, 52973, 30253, 5037, -29742, -18653, 11287, 2266, -25609, -21284, -38640, -15003, -14081, -326, 8577, -19760, -59043, -57775, -42423, -16040, -27310, -19750, -35000, -22269, 23255, 31888, 10520, 16570, 32839, 31607, 48628, 60554, 91525, 46675, 3981, 17120, -335, -21806, -10683, -374, -2199, -4880, -22084, -51132, -63169, -69005, -77878, -46959, 3875, 33811, 23140, -6892, -27656, -26996, -60997, -47181, -20351, -40796, -41744, -47308, -60600, -54927, -31132, -44887, -39870, 3785, 22314, 34154, 25848, 32569, 39459, 44566, 19299, -11632, -59578, -102173, -85796, -36813, -48231, -66392, -60431, -37775, 3012]
5885C012j0066k2433K2763N9611J2640l6286n0106K4348J1822J6885l933j5574
5873A2683M332L3140K1936P343o078l1364j8730N0556j3980o904j5277o428k237
5860B8992q801N086J199l8252j1754J8718J0101N586k1192m888L1364L874K4650
5847D4683J3344J4532q568j9684o244k2867J7739N389l2465k7801o895L3114L5330
5834C9607P737m7351R761K127K2104o0341o9494J7491L518M271M537Q068R932
5821d8033o041K6743L939k17N214l7927L6055K4948k9328M5238L625J6326k1657
5808A8885l8664k4854K8088K4007K4881j1196m4921j5499k877J3949j1186j177
5796d0564k2213K6918L3249K737k7798j269O333Q352Q311o545j0772Q755L6946
$$ y = [3012, -7054, -29487, -6724, 52887, 65527, 29241, -20865, 3483, 15305, 32190, 28257, 12683, 17015, 50155, 72091, 79434, 73356, 41992, 23262, 73818, 59838, 52934, 37657, 31229, 28992, 20191, 25277, 26476, -11776, -23530, -4812, 5289, 10875, -10317, -15205, 16159, 20033, 44683, 58027, 72559, 63991, 44307, 38063, 15196, 32935, 38324, 5859, -21942, -28837, 4277, 39607, 47344, -7, 9754, 11881, 33985, -26356, -95850, -78359, -74841, -70570, -66033, -57965, -48033, -54074, -27331, -23392, -23609, -18395, -56322, -20267, 4681, -24647, 20591, 24216, 40542, 18885, -19779, -44633, -16545, 7462, 32343, 21147, -23774, -39273, -42150, -28201, -39387, -40564, -62777, -35859, -2610, 127, -27671, -28940, -22607, -14255, -5944, -12489, -23261, -14506, 22440]
5783B2440N747l618j5471L0239K1923k2666k0694O006n009q136j2895K87n905
5770g752J7892o698n768K081N882m61J623l5157k3015O597L1696K7987l009K6696
5756C8594M0502J4271N716k9252k6662p388m549j387j9563r188M22P121J2474
5743B1111j631j6903O602l7631k9842J5N1146L4355j3404k0373R293K222K027
5730F987P726j1313l4584l591K5484J6935j9572j7655j5716L8176J9088o867j4269
5717i171P919n36m2769J0814L1800q213j7538R723K7786k7011L3916R905j0461
5704A6164J6794j8703k8630k8268K6722L550l7575K6667q035p003O705k0r131
5691d0763l7921J0575J4994L7618L454p048K2291K705k5002j5559q650J7555L3485
$$ y = [22440, 28187, 24569, 9098, 39337, 61260, 38594, 17900, 23906, 18897, 10761, -2134, -1847, -7752, 10140, 3442, -2326, -245, 5637, 5176, 6799, -28358, -51373, -44776, -13080, 14907, 11898, 38594, 79096, 93367, 99083, 69831, 43169, 35781, 31232, 29845, 10282, 1094, 1516, 8637, 21111, 19480, 2577, 9179, -28452, -58294, -58279, -7133, 27222, 13818, -6555, 2738, 4960, 6987, 14713, 3400, -31184, -34775, -9291, 7644, -11928, -29583, -45299, -7123, 11965, 5098, -9171, -1252, -1788, -44557, -33743, -1943, -10156, -27694, -17971, 9815, -17196, 16720, 26625, 16164, 32958, 14255, -14375, -42643, -15921, -12371, -49946, -23279, -31314, -38317, -31612, -31632, -40763, -78684, -68109, -53115, -15497, -12043, -19091, 3200, 5905, -19097, -34656, -43306, -25751, 7734]
5678G734k4769j9690O011L0722j1883J0722j3154k3969J5611N6304M2L218J0644
5665D7543K9098l715l7749j9388o165m4636J2989k328J7774J3478j0439l87J9957
5652A6032K3695J650j6040K6621q476k4956J2657k3855j0796J0600j549K1419
5640B7002k1443n6748k2650J7560J8800m583L60K8286M2515k1981o6767M047N4935
5627f67J5767l2932O39J9138l6746j5900L3352M0209K4917J3469j438l5904l7501
5614a3597R004K4326J6732j0693m1825K4435L960J6453J088J0255Q455k9033j6311
5601C249j6355J8854J7210k3475m3312M1556J0253l0178r759n6363k2537r936
5589a20793M6338M7814R242O738K2931j8543k3212l77L584J8155J5847J2487L483
$$ y = [7734, -17035, -36725, -30714, 8, -11875, -1153, -14307, -38276, -22665, 33639, 33681, 36899, 47543, 76641, 72926, 35177, 15789, 9624, -35012, -22023, -24351, -6577, 6901, -3538, -3925, 16032, 39727, 41377, 25337, 51958, 43482, 18526, 31183, 7328, -3468, 7132, 5583, 27002, 5559, -51189, -73839, -56279, -37479, -42062, -41702, -13416, 29099, 7118, -59649, -55602, -667, 15100, -17832, -17193, 1945, -34801, -50701, -17349, 22860, 47777, 61246, 59808, 23904, -13597, -4593, 19733, 36465, 25772, -16053, 8382, 12342, 28795, 29883, 40138, 48593, 19560, 3249, -13106, 5748, 22958, -517, -43829, -2273, 7980, -22198, -31957, -88320, -110857, -120793, -74455, -26641, -17399, -10661, 12270, -6273, -29485, -29862, -26278, -8123, 7724, 20211, 23694]
5576B3694n1480l4476M481K7870L3791m655J441L9948L0684k9027m4366k1693
5564b3788K5181p074J8132o823j9516k138o415M217L2641o918n9104m0434P1320
5551b0719L1375N430j1603l0509l6205j5950M551J3185J325j0903M5158K8154
5539C289o826l4794j2519J2596p692K32M1490K8451l1819k911Q050j3056j6670
5526c2179j5265K8919J8773l0199m3866j3565o993L6335J1083L256N1777M3089
5514E1165q137p861l3308L018O430k1817k8201K3580J712j1283j7551M255m443
5501d2441J0325o842j297N3817O844l0304j6808M1693j7647l5557k1954J2509
5489d7662Q1j8946N70K3592L1129K8771K4721P795j8092P616k613K6791j9038
$$ y = [23694, -27786, -62262, -57781, -29911, 3880, -775, 666, 40614, 71298, 42271, -2095, -23788, 1393, -5681, 12451, 5628, -13888, -16026, -22441, -18224, 14417, 7499, -51605, -92039, -20719, 10656, 16086, 4483, -26026, -62231, -78181, -73630, -60445, -59120, -70023, -24865, 3289, -3537, -38331, -50850, -38254, -45946, -45714, -4224, 24227, -7592, -10503, -2453, -15509, -32179, -47444, -18525, 248, -29951, -73817, -87382, -94375, -58040, -46957, -43701, 8076, 51165, 43028, 35167, 1859, 4877, 11307, -10510, -38711, -15131, -13419, -24702, -42253, -37998, -42441, -32116, -38958, -40255, 13562, 20406, -9898, -26706, 14987, -2660, -38217, -60171, -47662, -47581, -66527, -65957, -42365, -11236, 17535, 42256, 50051, 31959, 39575, 36962, 63753, 44715]
5476D4715k2902k6290m0968M6360n746k2659O1390R572K2144Q287k4949j6856
5464C2098j883l9669R352J1252K6783o640k8104j3000k9696n1820J9885M9467
5452b1975K709l1743K6395N0963r8j5307J1099J771l3532r838L0207K4464K3320
5439E8435l0920m4317l3836j3629k3028J8589M1263J3269K1364L2800o2151j3912
5427c6073j0543K1243J171N393j8626m654K343O596l790k5001j0830K1864L4505
5414a6402j4161k3360J632J947J3790m630k3985M6962j4875K2028J5442m6321
5402d1933M9554J8151l8638r070J1840L8560O18l9741P114L4135N847k8948j0190
5389b701l3676l0058J6861M0704J4075M846j8454M0405J547q118M2986j432o4379
$$ y = [44715, 21813, -4477, -45445, 915, -4831, -27490, 33900, 43472, 65616, 73903, 48954, 32098, 30215, -9454, -102, 11150, 37933, 31293, 3189, -9811, -39507, -91327, -71442, -21975, -19266, -51009, -24614, 26349, 26251, 10944, 22043, 23814, -9718, -19556, 10651, 35115, 58435, 27515, -16802, -50638, -64267, -87295, -68706, -27443, -14174, 7190, 39990, -22161, -36073, -46616, -25373, -24202, -18809, -37435, -42089, -39746, -33150, -36940, -61941, -72771, -50907, -16402, -30563, -53923, -52291, -50344, -36554, -41184, -65169, -18207, -33082, -11054, 4388, -41933, 7621, 25772, -12866, -21936, -10096, 28464, 29082, -10659, -3545, 30590, 36437, 7489, -2701, -36377, -66435, -49574, -8870, 5205, 10051, -8403, 32002, 33549, 25431, 68417, 66985, 2606]
5376B606j0274L156l8153l9940K3085O5032O4907m5577m7295P997N1664J3218
5364E0426j7838p897J8242R026j7989k3584j0937l2070M622L1772K0215k5495
5352a507j8326l0549M0999O1762K6501l679k2648m2828M097K1203k4123l6415
5340b5513k826L0934K187l6144m3180Q051o720K847M6835N305J9207q388n3032
5327f0437q040Q0164K7397Q509J1558m1095K3402M5841J7151j8973m4754p1965
5315c1242n0915K5837K3316k640K2404L8992J3963K326L4455j8954l3479m3023
5303a8960k936P37q724r329j0211k2240J6997P506L2344K4105K2500K1050L538
5290E6377k5955k1566j8825p957k3202j9510L2702j0537P058j1751j2912N886
$$ y = [2606, -7668, -4512, -42665, -82605, -59520, 5512, 70419, 24842, -22453, -14456, 37208, 50426, 32588, 24691, 42933, 51959, 33970, 10386, -551, -32621, -27999, 3773, 23988, -1507, -19833, -50382, -9383, 52379, 78880, 75201, 52553, 9725, 13822, 35025, 10902, -25513, -28339, 2595, 4782, -31362, -74542, -66491, -73211, -70364, -23529, -18224, 983, -7405, -60437, -68477, 11687, 39084, 47593, 59151, 18056, 41458, 87299, 104450, 85477, 40723, -31242, -82157, -56320, -33004, -35644, -13240, 25752, 39715, 42041, 76496, 57542, 24063, -18960, -21896, -21159, -29883, -39212, -49423, -71663, -54666, -47160, -14816, 9289, 31789, 52839, 56377, 30422, 8856, -9969, -17926, -41128, -60638, -27936, -38473, -31415, -43166, -56078, -50192]
5278e0192K1338k0252m6624Q113Q311P669K5942K4774l249J4402M5345P998k1837
5265B1738J147L5830L6740j6068n9851l0421K943M1836J2020J4113l4978j5292
5253I757K293j3793q370l9798l4883j8696N5295K6773Q605J2187L4467k7511n6211
5240d9885l4071M7870L0937j8744o0873K0604L7283p072k8198J578o762Q425L3570
5227b5338M2385j9672l5325J5553K1187N8025j0556j0886K092q251j4598k6257
5215a1641m545j686n905l746L596J1529J9129j8808l7345K2460n740l995J1806
5202b4891J2165K3767L7260p48l2560J3524m2995l5920J7078k7558M367K2651
5190c3860M3169n069R71R353R151k3490r059k289j9767K4367J7865O600j1538
$$ y = [-50192, -28854, -49106, -95730, -87617, -79306, -71637, -45695, -20921, -24170, -9768, 35577, 43575, 21738, 22885, 58715, 95455, 79387, 19536, -10885, -7942, 33894, 45914, 60027, 25049, 9757, 12050, -1743, -10113, -49911, -84794, -103490, -48195, -21422, -12817, -630, 33837, 6326, -49885, -83956, -36086, -5149, -23893, -84766, -64162, -26879, -33951, -62149, -60571, -67333, -58908, -25338, 17047, -2625, -37950, -22397, -1210, 56815, 46259, 35373, 37465, 29214, 14616, -11641, -16186, -17872, -23777, -27523, -23927, -12398, 6731, -12077, -49422, -26962, -32702, -36697, -24891, -12726, 11041, 48301, 47553, 14993, 28517, -14478, -50398, -33320, -60878, -56511, -33860, 9309, 4240, 5211, 14564, 23715, 225, -8834, -11123, -30890, -6523, 11342, 17942, 6404]
5177F404k0359J4582n730l5403l145m582j8060j9199L6930M481l0388m2618J4110
5164a02977N4545n22J7908q207J9115K7775r248r913J1338K6952L617J5939o2296
5151a5974L8492L0213J2237R63m9457k1483K0076M7566j3114J2K753r480o4787
5138b1983k2833q362K0170l3575l5979L3288N8888j9893o439K6039o372j4498
5126c1549l494n573j2340k1177J5475J5214J027m897N0248L0297j4213l279k7814
5113a2075J6814K5873j7379r396R607m555k8865p189N74l1881L1579P8746O0256
5100A12109l3348j2422j9681k8411j7824J0747j0060j9336P353p943L9503M1972
5088F2659p891m5091J3840M3109q685j3700j40j9127L877R077J8398k7789J784
$$ y = [6404, -13955, 627, -5103, -40506, -43651, -48233, -66293, -85492, -48562, -44081, -74469, -117087, -102977, -48432, -48954, -31046, -39253, -20138, 7637, -1611, -11524, -186, 26766, 30383, 46322, -15974, 22518, 52731, 64968, 65931, 16474, -5009, 15067, 62633, 49519, 49531, 52284, 42804, -21983, -44816, -53178, -33008, -66583, -102562, -69274, -10386, -30279, -36718, -10679, -17051, -31549, -35043, -40616, -52956, -74133, -58658, -43444, -42417, -47314, 2934, 33231, 19018, 15739, -12075, 4739, 30612, 13233, 3837, 13444, 8889, -19976, -27165, -26591, -58472, -26893, 51853, 112109, 78761, 66339, 46658, 18247, 423, 11170, 1110, -18226, -10873, -18816, 20687, 62659, 54768, 9677, 23517, 66626, 57941, 44241, 44101, 24974, 28851, 37928, 56326, 28537, 30321]
5075C0321k2340j784n493l1345m6081N407M9855L0253J6012k3461J935l1440R229
5062a8932J2606J7593j5358m476k846k2989O979J0329J5870l0010N840N8903N491
5049C9000m4353O783r340J5827K6954O533l1903l3173j0367k8321l4770M918M6444
5036d5768L9455k693n645K3276L4077J582k5215l9220j0226K8188K9290n1448
5024b4347n5214q433J9310M5306L6578K641l0593j3810m4301l4606j689L4461
5012g4697P874K4792K311r065J1517J6330K4908l7954J1088m877R823L2534k0713
4999f129j4663P690m1193l1364r876J0671J5581N2113L4467M765m3851j1072P535
4986b5326J721k4346Q88l3982j4270M5520N4379J9565j3413Q348m5093k050L8456
$$ y = [30321, 7981, 6197, 704, -30641, -76722, -71315, -21460, 8793, 24805, 1344, 3279, -28161, -18932, -6326, 11267, -4091, -8567, -11413, -34402, -27423, -17094, -1224, -31234, -25394, 33509, 39000, -5353, 1430, -7910, 7917, 34871, 41404, 9501, -23672, -34039, -62360, -97130, -92212, -45768, -6313, -9006, -14651, 8625, 42702, 44284, 19069, -20151, -30377, -2189, 27101, -24347, -79561, -87994, -68684, -23378, 13200, 15841, -14752, -28562, -72863, -107469, -109158, -74697, -66823, -42031, -39720, -48785, -37268, -20938, 3970, -33984, -22896, -27773, -17950, 14584, -6129, -20792, -13102, -54295, -85659, -95535, -84864, -69283, -17170, 17297, 22062, -21789, -32861, -25326, -23605, -47951, -47063, -81045, -95315, -49795, 4584, 24149, 10736, 19084, -26009, -28059, 10397]
4973A0397L58L963n583k3119j8696k628K411L5157L755m0918l4335K4309J3856
4960c1073J7993l207m388M1123j5617J1230m720n1192j6485J3500K9887l8788
4948e1737m1727J8198J2712K1049L3089K3697J4369p099j6434j4692j1735J3968
4936f342m336k5068j1453k7833l0525L6462O1429O3796q624l0625k1258k5883
4924c0260j749j3613j0259J1778L494j3847L1269K7832j8785l3581k005m8375
4912i8101L8002M6317r222j7924J3339K3125l1224n2073N336Q180k57K0318k955
4899e7139m4519M0473J5347J2487J2840L51M3920R637j4152m4685j0799J3550
4887b2689N887K7677P682k3480J4028L8027N913l0352j3338k5983j6882J1000
$$ y = [10397, 10755, 14718, 9135, -13984, -32680, -35308, -32897, 2260, 6015, -34903, -69238, -44929, -31073, -13080, -16287, -20675, 20448, 4831, 16061, 11341, -39851, -56336, -42836, -12949, -51737, -93464, -75266, -62554, -41505, -8416, 15281, 29650, 22551, 6117, -8575, -20310, -6342, -10678, -35746, -47199, -75032, -105557, -69095, -7666, 56130, 47506, 16881, -4377, -30260, -32009, -45622, -55881, -44103, -40609, -54456, -23187, 4645, -14140, -47721, -49726, -98101, -60099, -13782, -23004, -40928, -27589, -4464, -35688, -87761, -82425, -74245, -74502, -54184, -57139, -101658, -61185, -45838, -33351, -20511, -20160, 23760, 33397, 19245, -25440, -36239, -22689, -16802, 10875, 18557, -4923, 9105, 47132, 53045, 22693, 9355, -16628, -33510, -22510]
4875b2510J6945J7465p721k829R149n0644k7922L379M0844O1180l27j8900k1656
4862c547m565j91R416k1460k7569K0863P097l1251k3000K7902M4923l7038M403
4849c4017j4541l7899K773M4693K3285M3085j1630l5445j628M7334L2815k7871
4837C0954n935J8130K9784l4474j2015k1353r974L7989o539j3920q853j3106k2227
4824c1539J8632j3533m0250J3394J8670J6753N6798L5909m5799m5549M976P654
4812c884j452j5727o5320M2751M6386k9311j9097p325J389R778K4381P659q724
4799a8496o223n0106m0878J7384L5444l074L9267L1744J0568R577k520k2447m8131
4786d7891P4251O3728j8261l7515l2146K270m1875K3751L7655n5225m9212L530
$$ y = [-22510, -5565, 11900, 4179, 1350, 10499, -40145, -68067, -64688, -23844, 37336, 37009, 18109, -3547, -8112, -8303, 1113, -20347, -47916, -27053, -19956, -51207, -74207, -46305, -1382, -38420, -34017, -48558, -86457, -83684, -38991, -15706, 27379, 15749, -19696, -21324, 26010, 58825, 30954, 25019, 43149, 72933, 38459, 26444, 5091, -4883, 33106, 26567, 12647, 3794, -9312, -31539, -12907, -26440, -66690, -53296, -34626, -17873, 38925, 74834, 29035, -16514, -11538, -3884, -5336, -21063, -86383, -43632, 2754, -26557, -45654, -52979, -51590, -41812, -17431, -9772, -18496, -24719, -74825, -115703, -98319, -62875, -65949, -26682, 5062, 15630, 25207, 22687, 240, -47891, 26360, 90088, 71827, 34312, 2166, 4436, -37439, -13688, 23967, -31258, -80470, -76940]
4774g6940M4967J5313j7621M351j4436q517K2759J6314l1650m0151k5191k0547
4762a31349M2309N6966j66j3910L2963j872N752K6584J6923p465j3788P178K5542
4749D5667j46n1470j3735j2189k8178L1711N7509K0944k6105m7317O357R206K1783
4736A4037K4521j4742Q521k4245K9945J0649n695m1249J334J9837j209K1635J5715
4723E9054K7945N866j7826j9623J677l0068m1890k5201J0255J7065J8183K6886
4711C2323R958L2589q025k4547j7387M2l448k9799k3733J132K5312j2456M9974
4698C1935J9836m1132n1673K7013o783K5717J9188q719k0136m614K065j3227k1451
4685d1981m4589L1J3927K030K6724P400J3921J6951l5455P422L1679K6290n3711
$$ y = [-76940, -31973, -16660, -34281, -29930, -44366, -52883, -30124, -13810, -45460, -85611, -110802, -131349, -89040, -32074, -32240, -46150, -13187, -15059, -9307, 17277, 34200, 26735, 12947, 20125, 45667, 45521, -5949, -19684, -31873, -60051, -28340, 29169, 50113, 24008, -23309, -16952, -7746, 14037, 38558, 23816, 32337, 8092, 38037, 48686, 42991, 1742, 3076, 22913, 21704, 43339, 59054, 86999, 92865, 75039, 55416, 57093, 27025, -14865, -40066, -29811, -12746, 5437, 32323, 42281, 74870, 66845, 42298, 24911, 24953, 21505, -8294, -32027, -30895, -5583, -18039, 31935, 51771, 10639, -41034, -14021, -20804, 4913, 24101, 15382, -4754, -9368, -7303, -20530, -41981, -86570, -86539, -72612, -70582, -43858, -36458, -22537, -5586, -41041, -33619, -1940, 24350, -29361]
4672b9361j8694j2796l345K1739J1542N730K2307O233J4438l1017m1505r11J3044
4659d2596J7260k334L0964p330J826k506j9812m1216j2393Q37k6150J0757J7160
4646g5533K3133M3959l5179k1015P434n073K057L8265O7549j1775k2370J6532
4634B7984j5357K6795L7173o0227k2596K6780k9078j1517k2461K2594J0202o93
4622a0401k9418K6910m0920j9003K6560J5638M683m493J5010P102k5538J3215
$$ y = [-29361, -48055, -60851, -64196, -42457, -30915, -25185, -2878, 3355, 17793, -13224, -54729, -55640, -42596, -25336, -27670, 3294, -4036, -2210, -4716, -24528, -65744, -78137, -77300, -103450, -92693, -75533, -52400, -8441, -43620, -64635, -57201, -62274, -60217, -21952, 45597, 33822, 11452, 27984, 12627, 39422, 76595, 16368, -6228, 20552, -8526, -20043, -42504, -19910, -9708, -10401, -39819, -12909, -53829, -72832, -46272, -30634, -25951, -30444, -15434, -8332, -33870, -20655]
$$ [...]
##END NTUPLES=NMR SPECTRUM
##END=
