##TITLE=Analysis number 323977
Compound Code cc 41409
Book Reference 467/94
Project Code adrs
Chemist Name benw
##JCAMPDX= 6.0         $$ Bruker NMR JCAMP-DX V2.0
##DATA TYPE= NMR SPECTRUM
##DATA CLASS= NTUPLES
##ORIGIN= Bruker BioSpin GmbH
##OWNER= nmr
$$ XWIN-NMR		Version 3.5
$$ Fri Nov 10 13:27:15 2006 GMT Standard Time (UT+0h)  MAYBRIDGE\nmr@NMR_250MHZ
##.OBSERVE FREQUENCY= 250.131544655141
##.OBSERVE NUCLEUS= ^1H
##.ACQUISITION MODE= SIMULTANEOUS (DQD)
##.ACQUISITION SCHEME= undefined
##.AVERAGES= 16
##.DIGITISER RES= 18
##SPECTROMETER/DATA SYSTEM= dpx250
##.PULSE SEQUENCE= zg30
##.SOLVENT NAME= CDCl3
##.SHIFT REFERENCE= (INTERNAL, CDCl3, 0, 16.522)
##AUDIT TRAIL= $$ (NUMBER, WHEN, WHO, WHERE, WHAT)
$$ ##TITLE= Audit trail, XWIN-NMR		Version 3.5
$$ ##JCAMPDX= 5.01
$$ ##ORIGIN= Bruker BioSpin GmbH
$$ ##OWNER= nmr
$$ C:\u/data/dgb/nmr/ADRS/2650/pdata/1/auditp.txt
$$ ##AUDIT TRAIL=  $$ (NUMBER, WHEN, WHO, WHERE, WHAT)
(   1,<2006-11-10 13:26:54.42 +000>,<MAYBRIDGE\nmr>,<NMR_250MHZ>,
      <created by zg, POWCHK disabled, PULCHK disabled
       configuration hash MD5:
       49 4B E0 1D 92 C2 6B 37 9F E6 65 BC 52 41 86 1D
       data hash MD5: 64K
       D8 50 F2 FC 5F 1D 37 F4 50 84 93 D0 84 9A CD 89>)
(   2,<2006-11-10 13:27:06.61 +000>,<MAYBRIDGE\nmr>,<NMR_250MHZ>,
      <Start of raw data processing
       ef LB = 0.3 FT_mod = 6 PKNL = 1 SI = 32K 
       data hash MD5: 32K
       8B 0A AE 34 85 A0 02 D2 30 FC D3 3C 33 37 E9 76>)
(   3,<2006-11-10 13:27:08.28 +000>,<MAYBRIDGE\nmr>,<NMR_250MHZ>,
      <apk 
       data hash MD5: 32K
       F6 38 B0 1C 71 32 95 A1 68 90 3B A8 40 CF 5F E0>)
(   4,<2006-11-10 13:27:09.06 +000>,<MAYBRIDGE\nmr>,<NMR_250MHZ>,
      <abs ABSG = 5 
       data hash MD5: 32K
       E7 EF 26 9F 9E 65 C9 1B A8 31 1D 41 55 56 C8 64>)
$$ ##END=
$$ 
$$ hash MD5
$$ 1B 0A D1 69 57 D8 0C 75 1A EA 82 A4 3E 45 67 BA
##$RELAX= 
##$RELAX= 
##$RELAX= 
##$RELAX= 
##$RELAX= 
##$RELAX= 
##$RELAX= 
$$ Bruker specific parameters
$$ --------------------------
##$DU= <C:\u>
##$EXPNO= 2650
##$NAME= <ADRS>
##$PROCNO= 1
##$TYPE= <nmr>
##$USER= <dgb>
##$AMP= (0..31)
100 100 100 100 100 100 100 100 100 100 100 100 100 100 100 100 100 100 
100 100 100 100 100 100 100 100 100 100 100 100 100 100 
##$AQSEQ= 0
##$AQ_mod= 3
##$AUNM= <au_zg>
##$AUTOPOS= <32 >
##$BF1= 250.13
##$BF2= 250.13
##$BF3= 250.13
##$BF4= 250.13
##$BF5= 500.13
##$BF6= 500.13
##$BF7= 500.13
##$BF8= 500.13
##$BYTORDA= 1
##$CFDGTYP= 0
##$CFRGTYP= 5
##$CHEMSTR= <none>
##$CNST= (0..31)
1 1 145 1 1 1 1 1 1 1 1 1 1 1 1 1 1 1 1 1 1 1 1 1 1 1 1 1 1 1 1 1 
##$CPDPRG= <>
##$CPDPRG1= <>
##$CPDPRG2= <>
##$CPDPRG3= <>
##$CPDPRG4= <mlev>
##$CPDPRG5= <mlev>
##$CPDPRG6= <mlev>
##$CPDPRG7= <mlev>
##$CPDPRG8= <mlev>
##$CPDPRGB= <>
##$CPDPRGT= <>
##$D= (0..31)
0 1 0 0 0 0 0 0 0 0.06 0 0 0 0 0 0 0.0002 0 0 0 0 0 0 0 0 0 0 0 0 0 0 
0 
##$DATE= 1163165212
##$DBL= (0..7)
120 120 120 120 120 120 120 120 
##$DBP= (0..7)
150 150 150 150 150 150 150 150 
##$DBP07= 0
##$DBPNAM0= <>
##$DBPNAM1= <>
$$ [...]
##$SUBNAM7= <"">
##$SUBNAM8= <"">
##$SUBNAM9= <"">
##$SW= 20.6930455092707
##$SWIBOX= (0..15)
0 0 3 0 0 0 0 0 0 0 0 0 0 0 0 0 
##$SW_h= 5175.983436853
##$TD= 65536
##$TD0= 1
##$TE= 683.16
##$TE2= 300
##$TE3= 300
##$TEG= 300
##$TL= (0..7)
0 120 120 120 120 120 120 120 
##$TP= (0..7)
150 150 150 150 150 150 150 150 
##$TP07= 0
##$TPNAME0= <>
##$TPNAME1= <>
##$TPNAME2= <>
##$TPNAME3= <>
##$TPNAME4= <>
##$TPNAME5= <>
##$TPNAME6= <>
##$TPNAME7= <>
##$TPOAL= (0..7)
0.5 0.5 0.5 0.5 0.5 0.5 0.5 0.5 
##$TPOFFS= (0..7)
0 0 0 0 0 0 0 0 
##$TUNHIN= 0
##$TUNHOUT= 0
##$TUNXOUT= 0
##$USERA1= <user>
##$USERA2= <user>
##$USERA3= <user>
##$USERA4= <user>
##$USERA5= <user>
##$V9= 5
##$VALIST= <valist>
##$VCLIST= <CCCCCCCCCCCCCCC>
##$VD= 0
##$VDLIST= <DDDDDDDDDDDDDDD>
##$VPLIST= <PPPPPPPPPPPPPPP>
##$VTLIST= <TTTTTTTTTTTTTTT>
##$WBST= 1024
##$WBSW= 4
##$XGAIN= (0..3)
0 0 0 0 
##$XL= 0
##$YL= 0
##$YMAX_a= 462811
##$YMIN_a= -326377
##$ZGOPTNS= <>
##$ZL1= 120
##$ZL2= 120
##$ZL3= 120
##$ZL4= 120
##$ABSF1= 16.522
##$ABSF2= -4.171173
##$ABSG= 5
##$ABSL= 3
##$ALPHA= 0
##$AQORDER= 0
##$ASSFAC= 0
##$ASSFACI= 0
##$ASSFACX= 0
##$ASSWID= 0
##$AUNMP= <proc_1d>
##$AZFE= 0.1
##$AZFW= 0.1
##$BCFW= 0
##$BC_mod= 0
##$BYTORDP= 0
##$COROFFS= 0
##$CY= 12.5
##$DATMOD= 1
##$DC= 0
##$DFILT= <>
##$DTYPP= 0
##$F1P= 14.0000005364418
##$F2P= -0.99999901652339
##$FCOR= 0.5
##$FTSIZE= 32768
##$FT_mod= 6
##$GAMMA= 0
##$GB= 0
##$INTBC= 1
##$INTSCL= 1
##$ISEN= 128
##$LB= 0.3
##$LEV0= 0
##$LPBIN= 0
##$MAXI= 10000
##$MC2= 0
##$MEAN= 0
##$ME_mod= 0
##$MI= 0
##$NCOEF= 0
##$NC_proc= -3
##$NLEV= 6
##$NOISF1= 0
##$NOISF2= 0
##$NSP= 0
##$NTH_PI= 0
##$NZP= 0
##$OFFSET= 16.522
##$PC= 1
##$PHC0= -48.51317
##$PHC1= 9.083058
##$PH_mod= 1
##$PKNL= yes
##$PPARMOD= 0
##$PSCAL= 4
##$PSIGN= 0
##$REVERSE= no
##$SF= 250.13
##$SI= 32768
##$SIGF1= 0
##$SIGF2= 0
##$SINO= 400
##$SIOLD= 32768
##$SREGLST= <1H.CDCl3>
##$SSB= 0
##$STSI= 32768
##$STSR= 0
##$SW_p= 5175.98343685301
##$SYMM= 0
##$S_DEV= 0
##$TDeff= 65536
##$TDoff= 0
##$TI= <Analysis number 999999
Compound Code 99
Book Reference 9
Project Code 9>
##$TILT= no
##$TM1= 0
##$TM2= 0
##$TOPLEV= 0
##$USERP1= <user>
##$USERP2= <user>
##$USERP3= <user>
##$USERP4= <user>
##$USERP5= <user>
##$WDW= 1
##$XDIM= 32768
##$YMAX_p= 356272890
##$YMIN_p= -59291
$$ End of Bruker specific parameters
$$ ---------------------------------
##NTUPLES= NMR SPECTRUM
##VAR_NAME=  FREQUENCY,     SPECTRUM/REAL,   SPECTRUM/IMAG
##SYMBOL=    X,             R,               I
##VAR_TYPE=  INDEPENDENT,   DEPENDENT,       DEPENDENT
##VAR_FORM=  AFFN,          ASDF,            ASDF
##VAR_DIM=   32768,         32768,           32768
##UNITS=     HZ,            ARBITRARY UNITS, ARBITRARY UNITS
##FACTOR=    0.157963299565203, 1,           1
##FIRST=     4132.6476996994, 0,             0
##LAST=      -1043.33573715361, 0,           0
##MIN=       -1043.33573715361, -59291,      0
##MAX=       4132.6476996994, 356272890,     0
$$ Real data points
##PAGE= N=1
##DATA TABLE= (X++(R..R)), XYDATA
$$ [...]
23179 24016 22417 9986 -1141 -2283 -6004 3590 8928 19143 10535 -11808 -6416 -9048 -9825 13504
23165 13504 14109 9851 6772 5066 14756 8887 11022 17813 4908 -2294 -2991 -6912 -15003 -15323 -22556
23150 -22556 -23893 -24503 -29381 -31929 -32295 -26545 -14956 -4353 -10677 -17048 -8854 -1725 -10700 -15646
23136 -15646 -17062 -12721 -6318 -4350 903 2455 4119 -916 3809 8432 4308 -8596 -18325 -7829
23122 -7829 98 459 7374 4435 585 -6732 -19714 -19389 -24929 -22959 -13137 44 6298 8633 14183
23107 14183 21084 17721 447 268 4116 7143 3736 -6880 -16766 -12270 1201 -207 -2804 -5328
23093 -5328 9297 23328 20581 16321 12086 6244 6498 3606 8634 14559 23941 16093 8789 -2222
23079 -2222 2009 15851 18033 16268 3505 -436 -4981 -4563 -7102 -18798 -35465 -26333 -27502 -24162
23065 -24162 -29243 -45246 -21664 3134 -151 -5527 -20934 -27983 -28662 -22174 -19733 -15152 -4085
23052 -4085 -12663 -28136 -26371 -21785 -12062 -9984 4536 7359 -2262 3772 16445 7703 1380 -5580
23038 -5580 -8738 -13270 -9603 -16333 -15689 -11767 -5538 -282 1574 12825 8895 6116 16512 23067
23024 23067 21896 21294 12014 4584 1181 596 -9568 -3598 2660 6291 -1158 -12201 -12143 -8466 -10618
23009 -10618 -10791 -6719 6560 11629 10815 10352 16002 8154 3248 -3041 2238 -2574 -7798 -5128 7386
22994 7386 14963 10428 9325 11900 5540 1650 5582 5246 -4919 -4549 -2294 9439 9095 1258 -7124
22979 -7124 -22627 -9385 -6374 -20823 -17431 -16995 -33918 -39597 -27293 -7166 -7365 -15193 -9672 -10308
22965 -10308 -9459 14099 1217 -9094 -10389 -9572 -10095 2679 14850 12891 -476 -18837 -14738
22952 -14738 -14552 -7271 -4680 369 1087 -7737 -2177 -3433 -11601 -9050 -2141 -2904 -16429 -11807 -7991
22937 -7991 -4811 6226 19083 16832 18582 15527 12210 10275 -8463 -14607 -27158 -29269 -16533
22924 -16533 -12173 6613 12039 2694 -3242 4327 14394 27273 27358 22049 13111 -14856 -16035 -11123
22910 -11123 -10964 -8909 -10281 -8492 -9572 -7777 -193 2079 -11673 -20086 -22835 -27348 -27228 -26821 -15176
22895 -15176 713 14879 13694 7568 8016 14070 17411 12065 -8291 -23132 -30080 -22695 -19068 -17688
22881 -17688 -3428 1852 -9653 5490 25430 24117 9749 -2451 -94 -3047 -11035 -16272 -11112
22868 -11112 -4490 -10755 -35751 -39034 -28012 -16622 1776 -11890 -20702 -15902 -13020 -29121 -18591
22855 -18591 -1099 5870 -1908 -19730 -35542 -30965 -20545 -15882 -26986 -22474 -19998 -5226 -9937
22842 -9937 -8657 -3830 -6571 -4317 3674 -9412 -16591 -3651 11192 21039 21123 14462 11611 2933
22828 2933 -6451 -5754 5221 71 -14861 -33094 -39482 -31616 -31072 -18272 -15716 -26543 -31264 -35676
22814 -35676 -29626 -21143 -13682 -7908 -10596 -16284 -7806 -2002 2023 6703 12882 17175 3021 -23024
22800 -23024 -25875 -18426 -27148 -26198 -20350 -22544 -24418 -18011 -24678 -33001 -27656 -17554 -9900 -1265
22786 -1265 -775 -2762 706 16110 21434 6931 10055 14958 15994 13770 15165 8861 2779 -2971
22772 -2971 -6887 7675 403 -367 -10460 -6224 -8325 -15601 -8764 -27845 -26712 -17145 -3449 2388
22758 2388 -12465 -26090 -22829 -11485 -1671 5426 15099 13247 1542 -8284 -3932 -2647 -4988 -3877
22744 -3877 3035 753 5862 15714 12633 12087 84 8123 15648 8007 2384 -5556 -8033 1169 10756
22729 10756 2717 -9672 -10400 -2035 8368 10047 3477 8352 14989 -847 -15699 -19485 -12994 -11599
22715 -11599 -17511 -25607 -27204 -10704 12974 5306 8334 9196 -601 -17523 -11935 -1789 9010
22702 9010 1612 11838 11457 438 6913 10271 18491 12768 -684 5202 5223 5910 795 -864 255
22687 255 -7244 -13419 -8087 -16704 -9931 -10366 -17018 -22357 -10697 8085 21899 10238 -1618 -7489
22673 -7489 4951 16337 12534 12446 10453 2272 -5447 -16236 -10960 -12280 -23169 -32246 -29214 -38872
22659 -38872 -50068 -35108 -12978 2869 1614 -407 -4088 854 2495 -2217 -4502 -15148 -17142
22646 -17142 -21862 -17188 -2848 -833 6078 5732 -4295 -2406 4795 -2453 -13853 -19117 -8641 -9288
22632 -9288 -7228 -1927 6416 15801 17234 7652 3019 4357 5651 2517 -2684 -22363 -27408 -19251
22618 -19251 -12923 -9626 -6371 -966 5685 4175 5515 -17878 -16048 -11680 -22415 -23611 -15097 -2303
22604 -2303 3750 -10878 -12405 -2353 3413 111 -2320 12604 18932 19205 788 -13624 -14890 -4404
22590 -4404 -4314 -5194 -1553 -8370 -7946 7673 7540 -8639 -5326 -126 -2063 -5172 2036 233 -7742
22575 -7742 2558 24646 30682 34792 30642 21810 32264 26475 24220 22289 9991 -8770 2539
22562 2539 18065 7223 4002 -1413 -9175 -5030 -10114 -10257 2281 5655 -4741 -7705 10427 2450
22548 2450 3564 -1983 -5764 -2505 -7256 -10108 -9858 -5787 -5842 -3660 10410 27282 30350 7866 -1815
22533 -1815 6377 -2727 -16863 -6070 143 5603 -3974 -15922 -33650 -32216 -17953 -4004 -1688
22520 -1688 -3122 -107 8240 10151 12719 7079 -10252 -15775 -15716 -22790 -13773 -10454 -8092 -2683 -7777
22505 -7777 -7390 18365 30281 20312 10280 9656 7390 5339 9631 6968 -6747 3354 3908 -1508
22491 -1508 -9805 -10402 -9254 -2144 4016 1480 -11788 -8972 -6190 -11607 -9499 -3592 8912 3997
22477 3997 -4565 -10005 -10616 334 6438 14048 9022 -10663 -14757 -24258 -22699 -1777 12444 16044
22463 16044 -5719 -21350 -17933 -13042 -6479 -20574 -29030 -18751 -14369 -3088 14444 8392 -2438
22450 -2438 -3306 4431 4273 -11043 -12383 -7070 864 -1064 4544 8147 6100 10861 8557 13166 16281
22435 16281 22064 12786 2063 -9960 -3553 -4739 -7657 -2936 -7902 -18533 -19295 -17757 -14324 -12212
22421 -12212 -11251 -16282 -17232 -1559 10195 -3853 -21218 -19198 -9887 2175 9526 17853 34149
22408 34149 36022 28413 25200 15148 22148 28857 30048 16492 -1217 -4224 -1908 6199 3952 3879
22394 3879 -5251 -24076 -12717 -1669 -2374 2131 4531 2131 -1214 -584 1202 17792 17065 11048
22380 11048 8453 5550 7965 7426 8906 27452 37301 23427 3190 1515 18530 15685 19062 19169
22366 19169 -3738 -8917 -6693 1026 7672 14106 15 -3037 3930 12811 8443 -19280 -25162 -16397
22352 -16397 -18575 447 17487 21840 5005 -8386 -7331 6370 16034 12858 5805 14682 20123
22339 20123 21147 24610 11146 4098 -2130 -17603 -26851 -32207 -29734 -34324 -27563 -15289 -6286 5507
22325 5507 11187 7560 7734 11996 13901 25489 20660 13233 -5154 -12007 -10153 6833 21270 11332
22311 11332 4579 8507 17522 8476 2932 3827 -4148 -9449 -14394 -24273 -19952 -17231 -1776 6771
22297 6771 -2966 19 12415 10883 -1455 1654 13793 8043 -2966 -4413 -221 -8398 -9059 -19590
22283 -19590 -3481 15158 8036 10896 23714 21867 11582 -5781 -5477 13230 6861 2131 2860
22270 2860 5476 -3696 -6879 -8632 -2644 -11497 -22774 -15757 -10272 -5013 -7330 -848 8217 7228 -4078
22255 -4078 -3027 1652 -3187 -11657 -5376 -17352 -17661 -2835 2136 5412 5264 -13726 -5449 4436
22241 4436 7541 5431 -3560 -21204 -37238 -44003 -35544 -28569 -20030 -1364 6322 -6298 -8586 -5636
22227 -5636 -3081 2979 -8641 -18816 -21422 -13221 -1558 17942 22390 10001 -2477 -2609 -6478
22214 -6478 -10389 -3137 -13031 -20496 -15440 -19890 -19294 -23379 2923 16824 17738 11111 -14467 -5839
22200 -5839 751 68 -3121 -6281 -5020 5158 8305 1731 5219 -5840 -8367 -20354 -24219 -12728
22186 -12728 -3871 -4706 -11275 -7722 9167 7179 4573 6611 9695 8321 2675 7545 9321 -778
22172 -778 -6321 -14646 -12539 -7035 -9516 -14798 -31366 -37551 -23352 -13111 -16580 -297 1790 2065
22158 2065 -1367 117 6187 735 -12067 -486 2523 -663 -7376 -15692 -17249 4990 30232 28643
22144 28643 14163 7782 9681 -10809 -19595 -18255 7243 24220 21943 10142 -2014 2408 9000
22131 9000 3497 -4289 -13253 -15365 7503 4510 -18350 -34686 -18687 326 14804 11086 2666
22118 2666 -12268 -8785 4443 175 978 -4635 -12474 -2679 4366 5595 8645 21842 27185 10809
22104 10809 7221 5389 6014 10030 10576 17316 33452 32915 3362 -10421 -15133 -14686 -13734 8041 14276
22089 14276 2163 -6609 2942 1632 -453 4569 6490 -504 -8446 -6432 -7215 -2772 4756 10752
22075 10752 19020 23889 15923 9834 -1090 3278 -7602 -22641 -32749 -38168 -22823 -26974 -26504
22062 -26504 -2828 6229 1848 -7604 -23131 -19702 -9900 -9160 9978 10774 13117 11415 4819 1587
22048 1587 -13266 -9481 3681 -3378 -24095 -15373 4870 6401 -688 -19931 -25117 -25156 -18914 6878
22034 6878 14629 3225 2224 4589 -7945 -10827 -1240 -6757 6109 4127 764 857 6877 -4595
22020 -4595 5339 19492 11317 -4731 -10433 -8363 -9298 6104 7418 -6727 -11771 -11599 -2684 -8289
22006 -8289 -7304 -5496 -10847 -4164 4252 5800 10686 13057 13934 8205 3547 7679 4081 473 2628
21991 2628 4551 2174 -3963 -6368 -12631 -11177 -2539 -4193 -4953 -7734 -8781 -14444 -16642 -25395 -20731
21976 -20731 -13574 -6374 -1842 421 -465 -5157 6302 18755 22838 11678 -950 -9848 -2901 342
21962 342 2249 -7440 -12285 -11775 -84 -9065 -8931 -17503 -19617 -10608 1796 12036 26869 17720
21948 17720 4480 735 5836 13551 14628 9306 1837 -3375 5780 11275 16654 12667 11604 16598
21934 16598 4307 -5039 -1658 1908 5039 -1097 -13734 -20030 -16234 -5744 -8811 -3308 6832
21921 6832 5097 -6802 -7608 -1628 4607 -3822 -22705 -20965 -6175 -7624 4379 24944 29296 21811
21907 21811 3640 -4067 1305 6500 7950 1771 10135 4687 9297 12171 4497 -7148 -17578 -11343
21893 -11343 -8325 -14279 -13759 -11033 1156 -1266 -10514 -14045 -14548 -2713 -5254 -12384 -1566 -9855
21879 -9855 -5281 -8323 -8696 -6121 2370 12367 651 -12688 -13777 52 11639 -7685 -14753 -5836
21865 -5836 -12891 -32906 -28918 -14439 -21269 -25573 -18551 -3567 11137 12337 -1696 -13777 -21455
21852 -21455 -17304 -5207 4354 11756 -8967 -6790 -502 -3951 -22807 -12980 -27231 -31211 -20146
21839 -20146 -17988 -30738 -17823 -9422 -2743 9206 7984 -6995 -24954 -23351 -14804 -18070 -6356
21826 -6356 -5192 -18217 -20610 -14308 -26502 -35802 -28945 -22904 -18502 -12856 -9428 -6995 -652 -8971
21812 -8971 -14520 -1887 6335 11445 -2210 -6313 -7000 -3389 4216 5467 2691 1749 5603 9236 5087
21797 5087 10575 9865 6441 1776 -539 -7756 -9640 -8087 -6008 -7494 -15618 -10617 13677 18700 6407
21782 6407 13949 20715 22357 23029 8141 870 -2057 -2877 2694 3296 5207 246 1076 3016 -3018
21767 -3018 -4024 -3429 6147 26592 26488 29758 8218 -4808 -9844 -22367 -26733 -12313 -7116 3731
21753 3731 -887 4927 -4638 2499 10460 5710 243 -1038 6227 -228 -14376 -22932 -14021 -4966
21739 -4966 -40 -5867 -17744 -26352 -28312 -7556 -7969 -6692 3803 4577 5601 7546 18526 33787
21725 33787 18638 6760 -1615 -707 18429 24244 10181 4184 -10481 -21058 -5462 5564 5294
21712 5294 1027 -1829 305 -8141 -28190 -34988 -27862 -34654 -27423 -15012 -21907 -27856 -21414 -15106
21698 -15106 78 -2860 -10221 -13006 -14515 -23701 -13718 -3378 -2470 -2960 -9345 -3456 -4173 4956 8396
21683 8396 3262 11853 20845 15000 -2772 7075 13844 14751 3885 -9693 -10412 -12161 -9243 8525
21669 8525 33304 36733 38551 37087 24050 10198 15360 3745 -1768 -14744 -19767 -15600 -11101
21656 -11101 -2895 -1753 -4312 -1527 4947 6469 -4023 104 20212 29693 10908 -1683 -1066 8085
21642 8085 4661 -2068 -3922 4793 8184 2205 -3825 -9451 8362 15703 11135 9247 1252 -977
21628 -977 5121 10971 10336 6480 13105 -3353 -10538 -5082 -6124 17792 32208 17804 -7264 -13928
21614 -13928 -14648 -9720 -3512 280 5764 51 3615 -2407 -11958 -5362 -995 4275 -5398 6864
21600 6864 14858 16880 10642 -714 -14902 -2345 -7408 -8860 -2951 -6598 -7402 -3430 -14478 -23433
21586 -23433 -22141 -13278 -2100 2570 8864 15261 11229 5476 1545 -4332 -16962 -1436 6437 22153
21572 22153 35355 31482 19777 8230 -3954 -7009 -7431 -812 8985 2467 -8787 -1870 3022
21559 3022 3251 -6303 -11916 -10448 -13403 -25848 -23727 -14053 -5632 -3359 -4189 5532 4211 -9793 -11795
21544 -11795 -1605 -1170 -11330 -7974 -184 -8925 -1316 9772 891 -9342 -1818 13201 20330
21531 20330 14573 2041 -11365 -13019 4690 1284 13236 25708 26292 24421 21606 142 -5994
21518 -5994 -1944 -6785 9718 17214 12924 13437 12955 14293 14136 10898 11901 14031 3384 995 -885
21503 -885 3908 -11521 -14861 -7186 4815 2804 -1891 -6789 -2438 -3377 -5517 -11868 -3091 -2599 1789
21488 1789 10013 16727 166 -250 2327 6414 14631 7659 -9778 -16409 4183 9084 1033 -12483
21474 -12483 -20079 -19607 -17705 -8129 -7868 -4280 -8334 -16061 -13594 -13807 -11095 534 11929 13677 7201
21459 7201 -950 -2046 -4484 -14535 -17338 -13456 -22071 -29234 -29693 -35454 -38563 -30809 -23655 -8913
21445 -8913 801 -7037 -15950 -24349 -26926 -14415 -11785 -3656 4492 -8588 -11974 -22316 -35467 -26606
21431 -26606 -24359 -21053 -22056 -25093 -12143 6944 4048 -1628 -4665 1471 839 4711 -1958 1301
21417 1301 2132 2307 -13794 -1240 520 2879 4492 4716 19262 14007 7381 14642 13752 -6703 -8590
21402 -8590 -6532 -4474 9033 10573 10530 -5501 -11863 -2418 2205 2758 8517 -1727 -7821 -6823 1471
21387 1471 21462 24038 9057 -6207 -13077 -17509 -19991 -15207 -13570 -25379 -31457 -23012 -11095
21374 -11095 -3525 3125 6068 10616 4187 21980 25094 13348 2876 4293 -3673 -5960 6132
21361 6132 2012 -3482 1629 12778 17816 -2624 -13623 -9754 2865 -1874 -10991 -817 4580
21348 4580 4551 4073 -15023 -24030 -20662 -20870 -8304 -1953 2556 10562 5233 -3867 6500 801 -3348
21333 -3348 -2145 -7815 -20903 -6795 -1184 -5143 -6788 3580 8706 3600 -11678 -17444 -14102 -12355
21319 -12355 -13082 -12378 -16092 -6759 2306 6273 8418 18269 15136 4650 1299 -3892 -3561 -3110 5926
21304 5926 14016 -6201 -16684 -17515 -24705 -35669 -33151 -28560 -13186 -10187 -13971 -16427 -20465 -22951
21290 -22951 -21286 -22356 -16154 -17358 -22402 -27065 -23916 -14183 -779 4385 2410 -2081 -16603 -21886
21276 -21886 -14069 692 5532 4935 -9472 -10245 -12081 -12089 -8327 -6896 -10275 -9049 -3265 450 -10771
21261 -10771 -14242 -19712 -9982 -2745 -7102 -17603 -5338 5487 6381 -9857 -6872 2702 9241 21004
21247 21004 -6666 -18861 -15207 -15866 -13363 -4819 -6823 -12761 -18952 -26134 -39455 -38406 -14014 5801
21233 5801 -7191 -6834 2090 -11285 -16377 -18427 -10164 -12596 -14654 -17616 -16075 -13580 -22714 -26766
21219 -26766 -20926 -15654 -15660 -13340 -19009 -19785 -13918 -1742 5673 -2245 -22454 -27713 -23187 -10089 -8943
21204 -8943 -29667 -42956 -30162 -16230 -12754 7324 14958 522 -14546 -17024 -14679 -7211 -11813
21191 -11813 -16809 -22773 -23550 -14737 -6609 -1941 -4988 2598 8496 18236 31486 29074 16370 19832
21177 19832 13714 2326 -16 -9323 -26587 -22993 -16531 -3992 -2675 -12590 -7557 -4930 -11121 -316
21163 -316 -5952 1094 8212 7560 11302 21980 10322 360 4586 4706 4665 -5842 -7872 -19541 -20293
21148 -20293 -15556 -13430 -6703 -5138 -2135 12041 17315 1743 4663 16846 21622 10079 6641
21135 6641 -4156 -2912 8278 1768 -9011 -16178 -14162 -7800 -9485 -2158 5664 5638 3071 -21299
21121 -21299 -21566 -10545 -14955 -13330 -20492 -19915 -10978 -16308 -18397 -29186 -33869 -25630 -18984 -18400 -11985
21106 -11985 -6638 -15246 -22314 -21498 -16371 -26018 -24994 -19709 -737 -15034 -22996 -16488 -14645 -15147
21092 -15147 -12557 -17166 -12021 -14616 -14485 -8650 -13071 -12314 -22677 -26880 -25304 -11562 1176 8714
21078 8714 1053 -2520 -6482 -15197 -24311 -17973 -14033 -17078 -13036 -10052 -9520 397 -1546 -14092 -26048
21063 -26048 -26624 -12939 -24588 -26115 -14869 4351 2884 -4211 -2435 12277 9093 6658 -4095
21050 -4095 -2567 1632 -4308 -8693 -10826 -4609 -5333 -23509 -16982 -11679 -22379 -23973 -4379 6143
21036 6143 8894 13199 2773 -18990 -24555 -33114 -21553 -8582 -10964 -19608 -16815 -3209 32
21023 32 -4664 -13217 -20319 -32358 -32583 -28806 -22342 -20611 -18779 -15786 -4779 1561 -12437 -14849 -22822
21008 -22822 -28714 -23293 -23685 -10935 8444 12806 9477 833 -4361 -2444 7698 13015 -4846 -21142
20994 -21142 -25124 -16634 101 2958 -3623 -16685 -13156 -9940 -6508 -2919 -5562 -11572 8094 9284
20980 9284 -4494 -14141 373 6431 -2382 -17388 -29235 -23320 -11927 -17398 -16485 -11038 -12190 -11646
20966 -11646 -15060 -15488 -14087 -13088 -27187 -26055 -23155 -20726 -22682 -7726 -423 -3083 -4300 2529
20952 2529 -6539 4670 24268 4260 -8907 -9742 -16926 -5820 3424 -4935 -15904 -23041 -13053
20939 -13053 2785 11550 1970 4687 -975 -8659 -15007 -18862 -15045 -13188 -18932 -24593 -17383 -10869
20925 -10869 -7901 172 6762 7473 1094 6752 8675 -1171 -8227 8537 19077 14496 7621 5525
20911 5525 13047 8258 5864 -15708 -22364 -9162 -2177 -14442 -14137 -6123 -329 3537 67 -8408
20897 -8408 -8616 -10395 -4978 -3823 -5818 -14000 -14968 -23391 -31836 -29000 -28327 -35827 -44885 -37284 -37186 -29961
20881 -29961 -10836 -1748 -21982 -14465 1561 -5863 209 -245 -484 -771 -1560 -7834 -14667 -16943 -14045
20866 -14045 6737 11126 18503 15911 12338 5111 -5265 -14011 -12816 -9414 -9950 -3146 -10187 -4863
20852 -4863 1751 5772 -1369 2312 9521 10897 19280 6948 -242 -6831 -9710 3134 758 -13312
20838 -13312 -4626 12875 2519 -6998 -9626 -13262 -11459 -17406 -19912 -22214 -19871 -14853 -7048 -7505
20824 -7505 -17764 -15476 -16770 -14554 -16382 -23819 -13515 -59 8144 4579 -10190 -16677 -16446 -12818
20810 -12818 -23336 -10068 -10509 -12121 4759 18917 6495 -6858 -15898 -9377 -12336 -7426 -2383
20797 -2383 -1916 4085 2670 -12294 -17999 -21111 -32880 -16828 -2803 11857 18304 28016 21226 10256
20783 10256 12285 8429 10343 8207 -6646 -14536 -18695 -29283 -28781 -24033 -12807 -4964 -1358 1252
20769 1252 -7689 -15125 -5623 -11716 -24695 -25155 -12018 12682 14232 7409 -10084 -19563 -10735 -6308
20755 -6308 -1202 8273 10812 18386 6879 -761 -1081 4365 3151 2328 -791 1359 -2678 -9166 -18571
20740 -18571 -17094 -7444 -9436 -11596 -14318 -10441 -3305 -9813 -8023 -12785 -19002 1329 13743 5346
20726 5346 146 -5091 -176 358 -2235 -12494 -21362 -22507 -13175 -1164 1039 -2961 -11690 -9283
20712 -9283 -3187 -5510 9211 -567 1990 13932 497 -7905 2287 7428 14705 13486 764
20699 764 -18745 -15091 -7405 -14103 -18109 -9964 -2343 2891 1693 411 106 2166 -16292 -7845 5024
20684 5024 2558 -1983 -10702 -15007 -19518 -19270 -13055 -13547 -13321 -11203 -18854 -14217 -11428 -22698 -25905
20669 -25905 -32459 -27967 -29497 -33030 -24157 -32008 -35611 -30028 -7843 1071 492 6418 -5156 -1128
20655 -1128 12624 9840 8661 10145 -4471 -10976 2972 -2067 -9973 -9641 -6715 922 17140 15873
20641 15873 -545 -1832 9681 5063 -434 11013 16081 8601 8489 6778 8850 9597 9415 8293
20627 8293 6142 -1656 1234 8850 8606 4311 9438 1032 -12671 -11973 -7318 3913 3526 -3892 -19363
20612 -19363 -29221 -15909 -7697 -9903 -9062 -16756 -18433 -14181 -20262 -22092 -21971 -19166 -14171 -19652 -19951
20597 -19951 -20703 -18696 -17024 -21543 -18964 -14776 -16417 -8691 -11908 981 1140 -18926 -21710 -11932
20583 -11932 -14788 -15277 500 5826 12525 6914 3819 -5259 -10292 414 1402 -559 -23525 -24025
20569 -24025 -15541 -9481 -6265 3079 9308 -60 1294 -1386 -5344 4170 7598 -3117 -6486 3330
20555 3330 -7533 -16925 -18461 -7929 -4223 -9415 7668 9451 10149 10550 -5521 5597 10735 8927
20541 8927 12706 19549 15767 15525 7880 379 -5810 -13521 -34681 -36391 -19558 -15562 -17684 -7123
20527 -7123 -1301 1571 -2025 -7872 -14163 -21912 -11450 -15271 -7812 3799 11013 3378 -6111 -5932
20513 -5932 -10885 -1663 -7118 -20208 -28546 -20519 -13843 -10189 -5094 -2597 -3349 11064 12381 -798
20499 -798 -10352 -23979 -28050 -18071 -21188 -28339 -25276 -10291 -3717 -13139 -22582 -22993 -14690 -1351
20485 -1351 1149 -14224 -18848 -18598 -20098 -4321 4867 -6865 2180 -889 -5993 -9574 -12741 -14804
20471 -14804 -16604 -2653 -1478 -4854 -4868 -1318 1564 -1421 -16938 -14206 4623 19600 12231 892
20457 892 7062 24591 29732 14586 961 8304 13767 16343 7593 11317 16161 20285 10278 13799
20443 13799 24746 10145 11932 13052 6776 -4125 7218 16743 22687 10484 11453 13005 -2582
20430 -2582 -15717 -14932 -13873 2059 5954 8558 14033 2538 -10173 -17568 -5904 4850 -1395
20417 -1395 -2834 -1566 -13164 -15978 -8152 -14706 -6716 -1741 -1693 2827 907 -5959 -12774 -7478 -823
20402 -823 10235 -6464 -11384 5641 529 -7594 -12164 -17697 -16526 -1125 -1237 -8002 -11767 2226
20388 2226 7529 -4406 -7377 -9152 -5017 3080 2772 -714 9586 2914 -926 -13089 -21253 -2504
20374 -2504 122 810 -2895 -1313 6567 2565 -7495 7122 8763 8104 -5031 1325 14408 6354
20360 6354 3394 -1545 -6929 -11671 -22852 -25326 -19631 -25312 -20187 -7650 1188 1895 -1163 -13794
20346 -13794 -22361 -29515 -26698 -19455 -6876 252 1764 -6747 577 -6843 -22336 -18648 -9008 -16813
20332 -16813 -22845 -13267 -8465 -17178 -22178 -13237 -13505 -8218 -5504 -13159 -6958 4846 -2158 -3716
20318 -3716 -5090 583 -78 -7910 3143 -322 -9258 -5642 4705 10365 1833 -11861 -18829 -10077
20304 -10077 -16193 -22237 -21627 -18166 -5559 6175 -1268 -5807 -18881 -34687 -34525 -32413 -34186 -20268
20290 -20268 -13468 -14199 -10420 4947 4104 -2283 -2534 -1638 -9241 -14240 -8662 -1437 8699 4594 7289
20275 7289 10843 -13098 -3926 -461 3275 12786 14127 12767 11847 12021 11209 2148 -15050 -17868 -10933
20260 -10933 -17519 -17137 -2640 1768 -7186 -12845 -13328 -8351 -608 6346 -4474 -9388 -12450 -7497
20246 -7497 -15602 -18596 -15575 -13000 -26807 -27594 -33879 -22603 -15698 -11530 -17288 -7997 -4343 -744
20232 -744 -3546 -6582 8292 20119 15207 3993 -941 9552 15152 6370 6063 -1336 -14688 -16372
20218 -16372 -13971 -12701 -14709 -18210 -15165 -13250 -20304 -23083 -27169 -33304 -17805 -15066 -15209 -7595
20204 -7595 1249 7566 14699 11997 1845 -6234 -9935 137 1344 6737 5023 -1809 8067 12968
20190 12968 14066 14168 8055 -6388 -12278 -11032 -14703 -17917 -17491 -6523 -3794 -5640 -7549 -11996
20176 -11996 336 1942 -4424 -9410 1219 15411 6029 -8439 -8776 -9531 -10782 -8611 174 5159
20162 5159 -7093 -4608 -3503 -2059 496 4764 19995 12554 -858 12062 12152 -2395 -14574 -19189
20148 -19189 -27769 -24852 -17144 -13619 -5304 2472 6163 6152 -4739 -4144 -2831 7998 8983 6555 -14948
20133 -14948 -33375 -29915 -29722 -18481 2704 11435 9015 -9371 -29950 -23200 -6667 -6300 2147
20120 2147 13761 15697 9636 2478 -3958 -5998 -8955 -21455 -26729 -24998 -25152 -16251 -7864 1158
20106 1158 -171 127 3056 10794 10926 6669 -7384 -23056 -21134 -14828 -11047 -13875 -13833 -6938 -9235
20091 -9235 6099 10145 2865 -888 3742 10681 10389 -3639 -17189 -21124 -29283 -20866 -1165 2859
20077 2859 8217 7161 -1287 2013 12380 11538 12785 10685 16102 12897 20053 22105 16752 7780 23377
20062 23377 38311 47418 62639 67045 62148 58628 51523 50217 53034 56185 57875 37702 38599 33356
20048 33356 22671 15332 3069 5222 14578 21524 14265 1036 -2023 -1924 -7648 8889 18878 14413
20034 14413 5843 9100 1384 -2100 781 -2054 -3247 -180 -678 4144 9392 7338 6965 -3385 -10447
20019 -10447 -5100 11102 22315 6334 9939 13898 9721 1146 1377 107 -8955 1389 18579
20006 18579 14125 1841 3390 4253 3766 3807 -1759 -5418 -11190 -3972 -6306 -2916 -8821 -3264 -3586
19991 -3586 5528 -2506 833 11961 4634 -7483 -12682 -15831 -24584 -26047 -22943 -10467 -9638 -6424
19977 -6424 -11956 -17824 -26945 -19007 -7992 1961 9267 2118 141 -3963 -10884 -3705 -3293 -6881 385
19962 385 -3007 -6263 -3466 -18133 -17613 -8154 -17420 -24966 -28145 -20710 -18971 -14362 18 -1067 4666
19947 4666 4058 -8977 -16759 -20572 -24100 -23418 -20666 -12257 -8105 -5513 -10621 -8808 6419 2315 18402
19932 18402 25588 8523 -5468 -641 5098 6583 2424 5605 799 -11545 -11457 2056 -2571 -10511
19918 -10511 -29270 -25642 -15951 -12664 -15115 -20863 -14579 -11990 -4037 -12842 -18558 -16943 -21451 -12359
19904 -12359 -5068 -11454 -20428 -5021 -4088 226 3724 963 -6856 2095 -3262 -19491 -13894 -4777
19890 -4777 3265 49 329 6873 18029 15239 32 -4121 7301 5568 -9351 -14397 -19618 -21627
19876 -21627 -10977 -629 -3773 -3820 -2802 476 -2813 -5158 -509 -4331 882 2641 -4133 -20127
19862 -20127 -23870 -19831 -19375 -15048 -18575 -18174 -11826 3914 9746 7369 7700 3012 8624 13422 15006
19847 15006 5426 14027 10461 -1218 -4112 -1397 -932 -11173 -9784 -2766 -6404 -4580 -4804 -6093
19833 -6093 -13218 -12476 -3939 -5445 -19363 -8398 -8696 -1659 7195 2558 5912 1478 -13366 -3111
19819 -3111 5563 8112 1306 -2365 17706 19364 3107 -2792 13012 17673 11192 6270 4102 266
19805 266 1197 -15458 -30491 -14639 -10235 -10608 612 7424 4905 4810 -8757 -24444 -28826 -32531
19791 -32531 -26766 -12789 -22080 -23303 -19941 -12154 -14388 -9525 -1822 14527 19086 8345 -6709
19778 -6709 -3667 -2275 -11365 -14387 -4421 -3102 274 -1067 -2824 -2447 4548 1879 6813 19042 12939
19763 12939 2064 -2701 -8149 -2255 4741 18159 27785 18639 15659 9995 6221 3565 6485 -2270
19749 -2270 -13263 -25915 -11099 -2823 -1876 -8565 -16118 -19756 -14623 -13722 -13137 -13549 -13324 -9689 714
19734 714 3322 10210 17447 23790 22162 9302 -2323 1443 -10403 -6560 -874 2688 9838 12036
19720 12036 3540 -6870 -11649 -4960 13655 26708 3103 -18791 -8868 2712 -13746 -17496 -6837
19707 -6837 941 -9035 -7465 -5278 -6816 5172 8545 -3147 -9773 -4527 611 6849 3923 3896 -5380
19692 -5380 -16832 -691 20243 6891 -9015 -30706 -34985 -37941 -25685 -20578 -17499 -13088 -7731
19679 -7731 -11929 -7823 2383 5888 -5569 -6824 -4402 -5578 -13598 -21597 -16119 -28350 -25428 -28595
19665 -28595 -23858 -25916 -11122 7448 13654 4204 -6825 -5336 -4404 -5015 -1598 2458 -1965 -7723
19651 -7723 -21999 -23160 -28130 -21180 -15898 -14110 -18841 -9513 -14931 -15822 6731 13567 20512 15110
19637 15110 8941 1065 -4292 2756 5545 8074 -4510 -8473 15338 24614 9997 670 -7585 -2711
19623 -2711 5233 -644 8498 9838 13578 9690 -835 2770 -1248 24874 29609 22391 17040 16728
19609 16728 4082 -7158 8838 18451 17368 23823 15401 -929 -16749 -9754 -11907 -17397 -19372
19596 -19372 -12068 -13455 -18286 -31667 -34106 -34719 -19276 -8311 1131 14489 5674 -595 7687 10387
19582 10387 5404 9633 7537 12285 2697 6699 2641 -5129 11469 15614 13887 10543 12583 18139
19568 18139 19414 23102 17554 6632 -11718 -10943 -2279 -2893 -1393 -558 -11171 -4042 16206 17796
19554 17796 16899 7189 1087 -6092 -13335 -21918 -17813 -5996 1815 -8349 -3637 11576 27066 23115
19540 23115 -32 -6491 4381 10487 1085 -10484 -7944 555 -8749 -7447 6669 18181 20358
19527 20358 -64 -12191 -19143 -2908 4706 14022 10269 9178 4322 -1340 -7371 -1838 7174 -8806
19513 -8806 -22614 -815 8287 3756 7846 5998 -547 -9459 -7886 -417 10781 16433 14345 -2540
19499 -2540 -15933 -14845 -13284 -5496 -5354 -11572 -26497 -21910 -12818 -2825 9823 6864 -5406 -8671
19485 -8671 222 13755 24154 30969 19751 18511 17241 16059 -4261 -13436 -2767 17549 23940
19472 23940 31033 34827 39190 30120 29064 19105 20419 20546 20445 19317 9760 9511 17175 16239 9596
19457 9596 8187 -7681 -21314 -11295 -8481 -9316 -16610 -7827 1523 12641 11550 -1710 882 -4418
19443 -4418 -9449 -12385 -12955 -14550 -5459 6392 19510 28761 28905 16914 10961 4753 3058 4019 -6479
19428 -6479 -7788 -7455 -62 4661 8053 7301 12487 2705 1988 10617 11663 15373 3848 -7184 -9319
19413 -9319 2179 6174 537 -8876 -11085 -2264 13307 26398 14090 -16038 -19588 -18949 -3938
19400 -3938 -1577 -1157 -13113 -18331 -10981 -13618 -5393 -5840 8152 4054 -4000 -704 2084 7310 10595
19385 10595 9773 6755 9802 20584 28548 21895 920 -20511 -12004 -5448 -3206 9347 3479 -3082
19371 -3082 -6714 5644 27760 36695 24900 17875 16901 25042 17717 10174 9922 11538 15954 11357
19357 11357 5917 9634 17635 13901 6172 1871 8129 14918 3052 -1108 4920 -5424 -1157 -1529
19343 -1529 -13565 -3423 9774 19558 18113 10896 15285 12150 6617 21824 4979 -16175 -24141
19330 -24141 -20865 -19817 -8320 -1082 -290 -1841 -4277 5215 6822 -5771 -12844 -11226 -3092 10082
19316 10082 8148 -8263 -12304 -10633 -19350 -10636 -7106 -12037 -15378 2156 20270 -2605 -14892
19303 -14892 -15474 -13055 -11050 -9305 -13878 -17325 -17188 -2698 -2814 -11159 -5693 -6287 -3608 -5921 -26557
19288 -26557 -15782 -13270 -24335 -20409 -9507 -5631 -22728 -25870 -15928 -20453 -15135 -4076 3602
19275 3602 10711 16569 17079 2815 153 13678 11568 -2012 -13808 -8212 373 6522 7818 7051
19261 7051 3614 10744 16395 19876 11203 -12357 -16247 -1724 17419 18805 5349 514 3371 2434
19247 2434 18356 18318 -1843 -5049 1201 -2263 -3701 5161 27164 34087 24540 21772 23370 16214
19233 16214 13360 -740 -6581 -4419 9755 16233 9738 7973 15196 13629 13925 19280 18670 30212
19219 30212 28071 29004 34598 39732 50991 60046 74720 78478 72008 70673 70994 75002 61937 55145
19205 55145 57616 65179 80378 71905 73047 74209 61034 57860 60991 62300 52759 53864 43857 51584
19191 51584 44685 45296 47244 48200 48085 50360 62834 61766 65534 78554 99871 107996 124126 158524
19177 158524 180860 188307 222645 249756 247161 245957 265449 282209 289740 305578 313324 306654 296642
19164 296642 293859 282774 272013 262128 231711 205307 194913 163663 144885 126262 114685 96449
19152 96449 89172 81742 84201 79914 78253 72408 85429 84021 73633 52689 46774 41850 54411
19139 54411 56137 43492 31840 25732 11743 11546 29682 34600 34341 22537 21146 19662 1904
19126 1904 875 15593 35715 35037 25465 13687 25289 36650 30262 12447 1105 5143 20229
19113 20229 35660 29421 9503 11574 27921 17974 19457 21843 9222 6909 11532 13911 13698 3888
19099 3888 15159 23804 16948 26990 38679 31030 24363 19259 -1473 -956 13047 5984 13264 -13163
19085 -13163 -20482 -4068 3444 -2958 -9725 -13148 752 17498 19837 20729 28410 29383 40423 21429
19071 21429 3646 793 4154 -1677 -21984 -19644 -12610 -3634 3692 7495 14817 26829 24898 26168
19057 26168 24070 18102 21158 30650 19271 10179 -1471 -8479 -8818 2761 9820 12858 13632 12202
19043 12202 8295 16759 31966 24936 12081 9813 16355 21983 33955 32927 28573 34101 30914 38841
19029 38841 50810 44625 46388 62874 63746 51193 33638 17935 29225 36643 36904 31125 35096
19016 35096 42990 49145 46606 29817 23811 28046 18257 12146 18037 31129 30512 17681 6152 -4802
19002 -4802 -9773 -9689 4786 4647 664 10054 20650 9804 5423 14451 28304 34103 21798 19077
18988 19077 22866 27599 25371 14784 22034 31920 31155 13691 2556 -177 -1260 11866 30622
18975 30622 42706 38875 21131 26124 40896 44117 47538 37611 45521 41287 40626 49514 44618 45285
18961 45285 54894 54189 41878 42766 50547 49994 62497 39835 26634 27848 22910 21606 29804 15476
18947 15476 15474 28391 38465 42555 48875 48446 55823 68657 62398 53884 57961 64195 74186 90273
18933 90273 106669 112924 119735 107546 102212 106287 108629 112750 114406 118375 107146 84936 90520
18920 90520 84085 67152 61869 73811 77549 60005 41995 31298 38178 52231 76427 78948 70603
18907 70603 72043 67749 68465 61614 64569 71258 59748 49586 41358 40951 56750 64068 56849 49456
18893 49456 37520 38503 33697 27691 19362 15639 14998 14400 23802 21775 15611 9560 15596 31180 49097
18878 49097 45892 34053 30870 13277 2189 18379 35496 39022 36899 26301 22301 20926 13143
18865 13143 22753 32095 46095 48322 36383 34614 59272 57108 57620 49688 55186 51388 41727 40358
18851 40358 35883 49974 53644 55272 45884 32551 25018 25304 24244 25880 17768 23607 27223 49658
18837 49658 48603 43510 45856 31463 28594 32985 41894 30053 42303 49428 57477 58413 47810 34016
18823 34016 50434 70365 64699 61834 59674 53615 62389 58501 51687 50866 71398 82697 88604 100892
18809 100892 90771 75420 82596 92457 120878 127126 139239 134961 127572 133698 136156 134762 140813
18796 140813 154353 162826 153458 144687 145243 149468 147204 146954 145242 145842 150775 151527 151959 154131 149362
18781 149362 126897 114165 121352 120173 117671 127783 131703 137971 143296 160429 181018 199109 218113
18768 218113 211111 197023 187405 182751 164695 144761 144540 142719 149253 160732 164791 178918 192772
18755 192772 210587 235820 251395 262378 286842 312742 334110 358013 389035 413609 428412
18744 428412 414401 414732 419924 415327 402995 381888 352586 345739 338189 316515 301166 298907 305943
18731 305943 322288 334311 340786 350770 364032 372555 360324 357268 376115 387772 406285 427716
18719 427716 452403 463540 486949 517862 547166 585628 617825 670250 727313 796643 870041
18708 870041 948334 1032605 1130822 1228634 1340399 1473797 1608967 1762632 1909113 2067239
18698 2067239 2268522 2496674 2764472 3073178 3462427 3933143 4526882 5334154 6496616
18689 6496616 8179644 10522190 13431108 16688590 20312849 24619980 29533893 34229185
18681 34229185 37977078 41042986 44248152 47646755 50270046 51480366 51917456 52750443
18673 52750443 54178011 55158997 54871276 53677501 52529849 51543720 49771080 46515377
18665 46515377 42300783 38065455 34096505 30113513 26039886 22211176 18990823 16421025
18657 16421025 14341181 12615902 11190159 10060108 9182059 8448241 7817345 7275700 6804743
18648 6804743 6387885 6002143 5636537 5318038 5019914 4729569 4464455 4220215 3993743
18639 3993743 3780306 3565044 3379567 3207497 3027347 2858748 2717889 2604107 2493510
18630 2493510 2387340 2290249 2208247 2125056 2019844 1941181 1851551 1762068 1684641 1622346 1557395
18619 1557395 1488246 1434377 1390829 1359769 1326788 1302957 1278624 1254989 1232568 1227075 1213813
18608 1213813 1190351 1176568 1168183 1146655 1117850 1105202 1072235 1035606 996179 969387 947438
18597 947438 913861 880678 841636 808593 780956 766129 753853 743298 723462 692059 648986
18586 648986 605612 574665 550157 522453 498014 473294 447898 430280 406826 404922 395301 387543
18574 387543 373957 345089 313391 293562 263992 243052 233427 211271 196763 187402 188074 175578
18562 175578 163385 161041 163647 155342 140959 144109 158557 152691 146578 140817 125795 108498 101223
18549 101223 101219 106020 113417 113095 114691 116865 117786 121385 119667 115677 121091 119445 120071 115110 123185 136400
18533 136400 142186 152284 144742 148908 139877 118059 109203 120109 108999 105541 96199 82798 79654
18520 79654 83829 81252 85803 97594 112176 113130 127339 140154 134088 139914 147531 138145 137855 142506
18506 142506 152063 153695 151215 155599 148646 139684 140982 145825 141352 124798 122923 127126 122888 126991
18492 126991 133498 126508 122191 118741 112352 107437 107981 103528 95885 88080 78846 85457 80613 84893
18478 84893 86011 87340 90016 85985 82088 74190 78060 88488 94567 94702 82081 86206 98582 110328
18464 110328 126086 116878 107466 94811 90559 99117 113677 103459 94570 109447 123227 131420 138427
18451 138427 159378 151871 131579 137024 141585 144916 139974 121129 111699 109556 91707 80832 67827
18438 67827 56815 46567 28200 32396 46557 62323 53289 55512 50944 64026 75008 67946 65061
18425 65061 67620 65080 66665 58652 67839 83037 81129 72240 65697 70894 76988 76395 74954 77153
18411 77153 69605 63096 66692 84116 105701 117155 145017 199878 239233 279191 308838 328311
18399 328311 337234 323691 294293 258959 251627 246890 229115 215701 211966 217904 232539 229645 234675
18386 234675 246188 277992 325538 370494 403420 423577 441961 424884 393164 367716 340300
18375 340300 323657 293942 262283 241708 230509 199372 185670 184593 177854 173218 164477 149577
18363 149577 137809 128054 119072 107486 108472 116910 124144 125459 125392 122259 113072 97565 112857 114768
18349 114768 98981 103299 100937 105451 118968 123613 124019 133858 138063 134954 142556 146671 145536 145463
18335 145463 138138 138015 144530 163477 168347 168024 163700 161130 164999 157543 165219 173062 188158 199422
18321 199422 205146 200299 204637 206592 209734 213987 217994 221203 232140 232316 219088 199750 193427 200337
18307 200337 187615 190306 191168 190211 182710 188609 194833 197196 207032 207274 215330 228227 231425 236688
18293 236688 242055 243971 244693 254837 250733 255294 268753 296432 310599 325855 333436 345624 360914
18280 360914 390947 424231 452664 503034 552414 593957 642330 692749 740287 794922 854316
18269 854316 920669 1006510 1088104 1189383 1303640 1437053 1613483 1853073 2223370 2781048
18259 2781048 3620049 4869290 6568014 8582451 10676786 12658297 14587231 16690606
18251 16690606 18946926 20904554 21984696 21982255 21308777 20431838 19495236 18245639 16492544
18242 16492544 14393988 12284140 10425159 8896546 7627089 6577654 5715421 5024441
18234 5024441 4493758 4091830 3763072 3489419 3289700 3125262 2998543 2897293 2813811 2749420
18224 2749420 2704074 2682070 2675848 2679331 2738536 2811250 2887759 2963932 3059496 3185361 3335794
18213 3335794 3521677 3757738 4068146 4468236 5039308 5927019 7255536 9255308 12238528
18204 12238528 16374446 21494612 27018778 32333095 37393629 42684996 48448061 53844347
18196 53844347 57355145 58070852 56585820 54219808 51680316 48556879 44245095 38838760
18188 38838760 33165059 28012583 23707146 20168003 17217888 14796648 12862016 11372574
18180 11372574 10240667 9334877 8605185 8024945 7515296 7060841 6659569 6294580 5957125
18171 5957125 5655032 5396077 5169556 4973164 4802791 4622057 4443338 4296509 4162704
18162 4162704 4050608 3957917 3895904 3857328 3843455 3842559 3834452 3830168 3872044 3937208 4044103 4187895
18150 4187895 4402555 4686516 5058364 5574499 6307998 7431262 9181467 11860889 15716219
18141 15716219 20745015 26610586 32556155 37486773 40719015 41875859 41231156 39614846
18133 39614846 38029390 37282654 37800022 39495508 41863804 43910932 44854634 44136353 41732006
18124 41732006 38064302 33748526 29348871 25241849 21626012 18584764 16143114 14332173
18116 14332173 13184071 12806295 13360577 15106590 18023412 20967897 21872629 20388665
18108 20388665 17739009 15410089 13719421 12265426 10698524 9224313 8037804 7169225
18100 7169225 6553357 6137449 5838462 5630076 5498513 5422242 5388825 5431834 5610068 5983859
18090 5983859 6677090 7806445 9381687 11342439 13484326 15391404 16753758 17372743
18082 17372743 17265363 16681646 15977626 15513465 15539521 16071480 16945756 17815272 18325980
18073 18325980 18228598 17437266 16078455 14373580 12564472 10831543 9266152 7909764
18065 7909764 6783006 5869227 5157432 4612677 4191654 3844632 3540876 3299482 3103143
18056 3103143 2933462 2776739 2642396 2508198 2359336 2231945 2106655 1991066 1897489 1813736
18046 1813736 1731498 1652411 1577821 1515307 1446934 1386113 1320936 1255320 1198284 1137919 1098812
18035 1098812 1068149 1026342 968656 932712 904673 873211 837406 796901 759741 740231 717963
18024 717963 699346 679130 665472 634164 609890 597786 588458 581222 578332 554713 532042 502385
18012 502385 482661 458793 442385 440191 427500 405962 393266 387152 382980 363649 360135 342231
18000 342231 330235 326320 311587 311951 301993 288018 271687 259749 258633 247323 236758 238057 231549
17987 231549 223589 229247 228014 234109 238815 245586 238342 236994 260995 253772 240742 239730 237769 227720
17973 227720 222614 222453 226511 226569 228656 226247 225092 226601 220939 213369 212025 202772 209542 211679 206029
17958 206029 204460 205191 194213 202302 209145 209802 205283 208839 217697 233844 236547 231351 228654 235192
17944 235192 239020 239595 237835 230066 218927 206321 216456 217299 238312 250847 255702 243352 226801
17931 226801 229773 219749 222913 221175 219039 215048 212614 206564 221697 233386 226975 231989 240202
17918 240202 235605 232579 227352 220275 220955 223335 223817 221778 216577 225425 243028 236551 226488 243827
17904 243827 251514 257078 258219 262225 273095 273736 276597 273294 267654 261801 260246 253680 264884 278138
17890 278138 293401 276067 275339 294490 296460 298534 284079 274547 267374 270019 284674 311080 335753
17877 335753 338628 354319 376104 402736 403495 413319 427886 437501 438675 445278 450775 464320 484037
17864 484037 503992 528087 565011 616341 682994 761073 846794 956390 1076450 1212253 1349247
17853 1349247 1474239 1572946 1667266 1748310 1808465 1857934 1922948 2000639 2118246 2274717 2482541
17842 2482541 2778754 3186227 3758370 4548966 5662793 7295704 9731017 13360206 18599867
17833 18599867 25551467 33659852 41653465 47908049 51131159 50899799 47751484 42838981
17825 42838981 37331719 32005104 27223024 23119964 19800812 17355323 15864740 15360284
17817 15360284 15937010 17837509 21391614 26844846 34059306 42136561 49545682 54610737
17809 54610737 56251324 54410922 49946294 44118195 38018084 32258747 27064059 22516531
17801 22516531 18678599 15598494 13242532 11494271 10198038 9207438 8425425 7789646
17793 7789646 7245281 6759442 6338191 5983722 5657361 5373441 5110467 4879454 4664833
17784 4664833 4449893 4218804 3987936 3775125 3579377 3403143 3218769 3061760 2915927
17775 2915927 2779716 2661445 2542306 2417910 2293543 2176518 2059884 1951547 1853954 1780705
17765 1780705 1706020 1636511 1573969 1513382 1457394 1406787 1355859 1303527 1255185 1226510 1189786
17754 1189786 1154887 1111579 1064593 1016825 969447 933076 891685 851770 818414 810546 805477 799123
17742 799123 784355 770859 759002 757336 751666 728833 714413 698864 684460 670288 648461 609621
17730 609621 575288 542738 495514 455372 443826 436835 401049 367750 341242 311832 286176 260934
17718 260934 252358 255855 260026 269206 288077 305350 323290 325730 329900 343850 363514 367151 380027
17705 380027 390158 380638 358361 342121 314984 300370 293636 280922 261412 237772 220201 196947
17693 196947 193934 190940 180232 185621 201610 217421 230816 253038 263287 269468 286056 306375
17681 306375 315197 311277 306685 292092 289292 288482 274720 269014 260762 240279 222123 213166 197391
17668 197391 185718 165651 147118 142974 143637 148963 143062 159256 155969 138405 119564 114583 115258
17655 115258 114909 121893 123753 115610 114482 129811 148417 175926 191920 206450 225689 243052 262504
17642 262504 262513 263472 258405 243743 240518 244063 227700 222458 230426 233667 244407 256440 256180 240393
17628 240393 213979 200395 202048 184773 164832 153442 132232 117913 101239 98634 102570 94111
17616 94111 84580 84872 86407 79098 84731 85519 90388 84954 78944 64487 54906 46086 55080 76714
17602 76714 79339 61117 65159 74548 62155 48432 56310 68685 93416 98011 104223 119515 137958
17589 137958 168969 173547 169296 173614 159029 147519 157091 166493 167246 180310 190732 190138 182638
17576 182638 196211 195218 162103 130827 120462 96964 89157 87078 74087 71155 54300 38301
17564 38301 39811 30245 27571 36391 31501 51311 66971 53773 31366 23291 31229 35670 31812
17551 31812 41930 55962 65390 71693 73859 74233 72521 54787 29706 11519 15099 22364 25817
17538 25817 31891 37847 40458 36149 36115 38622 29882 21579 30065 24797 27097 29912 30070 25920 13357
17523 13357 26566 40892 38804 45320 41543 46117 56265 62611 67400 51389 45106 40922 31864
17510 31864 31017 40706 37344 46290 46288 27397 17524 23795 29430 31868 35146 31504 26078 31461 51172
17495 51172 48692 19579 19237 24332 18947 18667 21426 28912 16670 16877 23601 29204 27861 45172
17481 45172 56713 65464 60726 54279 58935 55571 61982 48762 36274 37066 49079 50738 55791 67766
17467 67766 80729 88287 99804 99627 115154 142183 182142 209363 238509 264445 288745 294388
17455 294388 294939 300449 314413 334962 376209 426584 474489 502742 510318 512742 500343 521665
17443 521665 528541 497834 449193 399589 352136 300955 257687 226196 207810 189185 184709 183132
17431 183132 189684 200735 230230 258652 275829 287666 295937 314241 304624 269860 249359 235534
17419 235534 217528 185898 154500 134984 119295 121694 122745 103582 90815 85385 89873 92424
17407 92424 91447 83058 76033 81571 80573 74177 59102 66694 72280 81635 73970 65943 63476 54556 51121
17392 51121 44738 32439 24926 36448 23382 15386 25939 14464 14417 26969 31105 33246 29600
17379 29600 22722 30751 33257 23046 23564 20959 30301 36915 31444 18754 7175 13664 24645 12005
17365 12005 5326 11640 17837 34921 46961 36973 28085 33912 17087 5945 15991 31289 23350
17352 23350 2422 6116 -1535 -14880 -19750 -18812 -9279 12875 18306 17185 22429 17192 23347 13390
17338 13390 3760 6866 6986 16093 19874 12341 9328 22066 16359 -3208 -8112 1153 12007 11470
17324 11470 10820 5331 18295 23463 19668 27358 27593 16071 15927 20557 17122 8464 9454 11289 4591
17309 4591 5351 -9174 -21871 -31998 -26856 -21421 -8195 -16692 -22548 -17500 -16635 -17631 -15417 -7183
17295 -7183 10440 13769 10455 11586 1650 -11644 -14583 -6202 4804 10689 20044 19858 16063 22298
17281 22298 25509 20293 20555 17043 18529 20551 30023 22736 4436 2550 13409 8563 2312 4400
17267 4400 9685 18850 29979 27984 26934 36924 34378 48305 66065 70001 93135 118163 129164
17254 129164 163541 220421 255382 257376 244978 229102 220766 220852 192395 144306 121805 106825
17242 106825 99683 95981 89577 94454 122212 139290 170619 210193 236537 260214 273752 276675
17230 276675 278574 272468 242703 201315 163696 138022 115460 96970 87601 83351 86027 68636
17218 68636 55445 60412 53566 48745 49579 41620 31550 26323 30611 28384 22520 25623 21664 33844
17204 33844 26235 22806 17970 18894 13848 15556 19999 31325 28099 28536 18312 37041 38799 26069
17190 26069 19554 18687 12437 14690 19338 25953 35545 30694 13789 9821 25405 34591 31495 24211
17176 24211 15108 19958 30446 18361 9202 10915 16714 23500 31504 28072 23153 18153 10511 2392
17162 2392 12373 17291 19221 24173 35180 52687 49796 41109 60802 75887 85260 94494 91435 88989
17148 88989 88225 75790 67041 63497 53564 39357 36872 39288 44553 55369 57425 64846 66501 55445
17134 55445 33212 43910 63902 58640 68448 68206 68286 58876 42839 23309 21797 21544 29063 35211
17120 35211 10137 9126 16021 20053 26337 29285 45429 53192 55455 48243 51713 71195 66325 52938
17106 52938 46640 52998 33556 31008 49122 42266 35764 27855 21598 9995 5344 2634 7123 15294
17092 15294 19414 22863 18731 22352 21665 8327 -6188 -10243 5013 21710 30556 22266 17395 15964
17078 15964 24059 42362 49836 54710 45587 34441 37886 41003 36910 38397 31354 28270 18829 24083
17064 24083 29024 20763 24300 15924 13718 12250 12374 21446 20970 15515 17808 20268 29145 36595 38309
17049 38309 35708 27226 24419 20201 19300 32909 33742 47111 54503 62574 71417 74512 68319 67708 62905
17034 62905 61594 49811 44662 51173 63853 74329 62738 53088 55712 54731 53876 61993 83394 105060
17020 105060 110705 97318 101304 89034 71212 75101 87263 78727 77817 106250 119116 104628 106119
17007 106119 100485 92861 80915 77403 94993 113817 108831 106904 97445 79902 82432 79610 78330
16994 78330 99624 107810 122372 130459 135535 130254 112197 103579 99869 85647 82108 88861 86723
16981 86723 83262 95495 110935 132404 154537 163572 161528 165777 157971 172670 193070 176110 167732
16968 167732 173873 165417 173346 172398 172114 170469 181808 177011 181287 194328 226653 250678 250875 237074
16954 237074 237431 246189 251476 257554 266365 274738 275179 286081 295160 309079 316346 344058 356396 352050
16940 352050 348639 353776 367962 388783 404263 430105 446839 456733 488014 546348 599365 668651
16928 668651 736954 816336 895600 976590 1073201 1192738 1317599 1424748 1514516 1610523 1720728
16917 1720728 1873654 2036547 2204704 2379736 2612848 2927742 3346610 3924574 4718222
16908 4718222 5877147 7636564 10383379 14611226 20682547 27975530 34470097 38313656
16900 38313656 39911802 41399125 44108854 46688629 46428699 42548162 36788007 31336967
16892 31336967 27102073 23745379 20878077 18685526 17513826 17644539 19380241 23043683
16884 23043683 28620246 34905392 39686436 41815864 42483309 43773582 46079021 47322414
16876 47322414 45295104 40193222 34126505 28841264 24633738 21010781 17710880 14884287
16868 14884287 12681454 11038362 9806436 8878732 8144489 7545989 7028744 6532388 6087253
16859 6087253 5692518 5340440 5003041 4702720 4439354 4202133 3989289 3780887 3585259
16850 3585259 3412619 3258500 3129810 2988449 2848335 2702987 2578152 2458518 2329630
16841 2329630 2215294 2114601 2034603 1960608 1896347 1827024 1751006 1683295 1608241 1540130 1481482
16830 1481482 1433935 1380229 1316884 1252347 1192604 1136974 1087360 1057662 1020089 965551 911255
16819 911255 865290 837948 801586 768354 758526 749678 721841 690363 665930 634620 608249 580978
16807 580978 555583 523300 496324 468695 452372 419191 387598 364036 340634 319481 301296
16796 301296 302385 295975 281273 278652 278269 272339 266851 269416 260713 245172 234588 225068 197954
16783 197954 166522 157417 151912 147855 140030 130315 118508 128742 144259 142790 133427 133495 129443 111682
16769 111682 81113 71818 83023 98900 118884 123767 135185 130160 101533 85614 84187 92196
16757 92196 87362 83241 83157 83742 87671 84467 94207 112735 109131 90645 80645 87691 92262 98513
16743 98513 98578 105727 97917 95649 112942 127169 118653 110831 93957 86474 94020 103192 104605 101724
16729 101724 97922 92712 93433 83283 82690 87537 77976 71850 57517 49686 51922 62540 72775 72653
16715 72653 75381 72831 61326 52503 56954 60745 74349 74933 81969 78592 63800 59110 51903 57741
16701 57741 66970 61121 66152 68143 53052 40203 42200 53188 60875 57933 62300 64436 52619
16688 52619 47117 42080 46976 50485 54583 70967 71513 61014 43048 42352 43284 33669 42303 53481
16674 53481 51178 49437 32085 18880 12437 9502 643 6103 5544 21571 42223 42687 35866 26658
16660 26658 28570 21179 26502 27560 22597 3721 -2880 12316 4742 -978 -821 1693 -193 5094
16646 5094 9438 11098 3620 -1221 1854 9659 12537 35062 40313 37532 33233 29957 21085 13970
16632 13970 15432 17823 31538 31992 22850 23867 21183 18970 12099 21894 30619 45712 50067 26294
16618 26294 24411 28019 13736 5409 12273 18614 26995 35198 34632 23793 15705 8459 16102 33195
16604 33195 36239 26722 23260 23428 28985 37865 36221 20058 28465 20833 15980 10577 -8769 -2225
16590 -2225 -1313 -5390 -7361 -7189 7699 19020 17819 25621 25597 20824 27156 30013 41275 44137 34135
16575 34135 35600 41615 25088 23606 31324 25720 30874 26179 29080 20147 17768 27475 33935 31937
16561 31937 31790 40691 46255 26213 -3702 -9170 -2123 1839 3245 -1472 -408 8657 17334 14438
16547 14438 8526 5142 11804 13262 6572 10713 12874 8543 11277 23389 27971 13939 4337 -2541
16533 -2541 4881 6950 11848 7832 -5738 -12617 -1995 2934 1906 301 3345 1074 4134 181
16519 181 6488 12415 27725 23583 10815 -6650 -13833 -11260 -14253 -17470 -8356 -11017 -17565 -5903
16505 -5903 -2569 -9208 -7603 -2253 -5814 -11052 -20785 -17418 -10614 -17632 -29340 -15843 -4443 -15252
16491 -15252 -18399 -2269 12409 6517 3855 6128 4343 7093 644 -2344 3411 -2934 1681 8820
16477 8820 15116 1753 82 -3442 1540 -5587 -8763 -9837 -14335 -11578 -9965 -8487 1512 7978
16463 7978 5444 -903 -11872 3926 15820 24582 15618 7600 -8763 -16413 -13358 -20166 -17429 -20718
16449 -20718 -19934 -7520 1811 10283 5232 -1878 -14054 -23900 -18428 -11090 -16420 -20127 -22123 -27564
16435 -27564 -29242 -25934 -18655 -6964 -5091 -10261 -11113 -20142 -27180 -30648 -28332 -17045 -15502 -13928
16421 -13928 -22251 -22944 -16810 173 9233 12414 15698 18803 20346 11407 13736 18422 4942 12841
16407 12841 19249 18256 1161 -4847 -2262 -10510 -14129 -610 558 -8605 -11334 -11791 -17485 -10039
16393 -10039 -3130 1365 6953 11452 3563 -5705 -9384 -14476 -14902 -11519 -22002 -22507 -13850 -9742 -12494
16378 -12494 -11691 -10748 -1420 -1345 -6789 -10431 -17395 -19673 1900 2884 4213 -957 8562 29884 29269
16363 29269 28637 31183 21673 35175 35048 38513 34883 35898 34484 43020 69019 106461 137684 159918
16349 159918 187590 194596 203254 210427 235736 246577 233010 196655 153212 119877 120555 117084 116160
16336 116160 121432 122004 119281 133146 138231 165300 212600 235743 241694 246569 257144 254977 257002
16323 257002 235396 192562 156387 133818 124891 112253 88321 73829 60242 45262 40517 59268
16311 59268 58173 50007 53614 42763 33923 31411 37821 51633 42100 25039 21417 23901 21227 16818
16297 16818 5509 -1952 -1413 -5687 4329 3762 7278 14699 19258 21770 26826 24383 20872 15789
16283 15789 -898 -481 10388 8383 8185 14893 17838 22564 15712 15414 31827 12737 -14533 -17427
16269 -17427 -8039 -4524 4419 -1453 -7421 -6231 -15663 -20402 -20436 -24223 -9881 -753 -14322 -3348
16255 -3348 -3314 -10896 -11508 -20591 -31076 -31636 -14712 -5007 1362 5454 17195 23983 30304 18386 2846
16240 2846 -6154 -25858 -24925 -19602 -25933 -20123 -15288 -8345 142 3302 11815 12534 3147 -4247 -14513
16225 -14513 -16297 -9235 -8237 -4176 -10562 -13222 -14398 -18987 -12668 -21110 -31786 -19314 -3318 3859
16211 3859 -8465 -10162 -9209 -8524 -9352 2210 8543 8916 14376 8581 9524 2147 859 -15385 -12452
16196 -12452 -22901 -9392 8587 5871 1483 -758 -6543 -8227 -11960 -24602 -27807 -25476 -20760
16183 -20760 -4106 16216 -2234 -25359 -20117 -6638 919 -16020 -26079 -17573 -7800 -1252 -426
16170 -426 -8601 -5636 -3467 8632 10150 -1158 -14196 -7679 -9585 -108 713 1534 -4981 -3174 -13276
16155 -13276 -22979 -16928 -9456 -8553 -1526 -609 -2266 -1577 -8662 -17784 -18900 -18209 -21605 -24161 -10428
16140 -10428 -8855 -26044 -33081 -25762 -26276 -35997 -39892 -27013 -10139 -11749 -19728 -13106 -4440 -10474
16126 -10474 -14308 -15484 -13529 -15990 -30487 -34782 -24446 -12084 -1918 -12259 -22309 -23390 -22145
16113 -22145 -27243 -23202 -23341 -30267 -23663 -29847 -24839 -21858 -23550 -20420 -13702 -9005 5514 7443
16099 7443 -2280 -3192 -1256 14365 4806 -9683 -19110 -17765 -16370 -22560 -24221 -5903 -11487 -11414 -15013
16084 -15013 -8754 -8411 4480 10414 13737 -661 706 9631 9298 -2385 -9108 -12325 -22134 -37236
16070 -37236 -29683 -37542 -47641 -45376 -58416 -58188 -34848 -20161 -26742 -28889 -20819 -27417 -33463 -39576
16056 -39576 -30648 -10216 8902 6509 3094 1766 -6033 -8814 -14784 -8877 168 -6692 -20847 -27015
16042 -27015 -25420 -19521 -15305 -15621 -146 12509 14969 16083 16251 -2165 -21326 -41525 -40477 -26770
16028 -26770 -12255 -4266 -1779 -5239 -2282 9385 -8571 -17314 -19925 -20883 -19079 -17309 -4674 5272
16014 5272 6928 5705 17237 10313 -5206 -2598 -11360 -26093 -23628 -31412 -18381 -1207 10840
16001 10840 -820 -19285 -22329 -13615 -5381 -14188 -14001 -7278 -1556 -94 -7028 -13039 -10291 -11645
15987 -11645 -14204 -13101 -7045 -2916 -377 -3894 -15800 -18721 -6689 -6677 -8997 -2529 2861 5860
15973 5860 4215 10454 12504 -6889 3750 -1230 -167 5987 -10327 -17788 -3043 4573 -6440
15960 -6440 -6384 -4586 -11218 -18494 -21033 -18760 -13259 3955 13095 6726 1359 7217 11914 13871 8408
15945 8408 8156 5229 -1960 -14201 -15718 -6775 1314 -3802 -21011 -29139 -8667 17600 22720 5169
15931 5169 -9327 -23572 -19652 -20052 -22398 -26182 -27024 -18784 -8413 -330 1731 -2402 8981 3269
15917 3269 -8976 -8540 -974 -2195 -12648 -31492 -19244 -7668 -1136 -17470 -10051 -1856 -21542
15904 -21542 -23671 -12187 -15180 -23215 -19552 -21839 -14241 -212 2133 -1410 -696 13074 7969 -1132
15890 -1132 -7996 -15270 -22860 -26604 -23276 -11156 -14216 -13230 -16014 -8273 -6822 -18264 -12502 -14182
15876 -14182 -21974 -26065 -39457 -45089 -40915 -22845 -4996 -3475 -6744 -7539 -11747 -9036 -5715 941
15862 941 -1070 -24238 -30259 -17644 -21923 -31626 -19387 -12526 -15512 -18763 -21241 -28313 -27489 -15273
15848 -15273 -13822 -24114 -23088 -20859 -18074 -12363 -16915 -22617 -13762 1226 2284 -10548 1597
15835 1597 5138 -5765 -3947 374 7934 1422 -5127 -7735 -14693 -13612 -9266 -19145 -20148 -16186
15821 -16186 -14063 -20373 -15048 -11292 -20444 -30062 -31461 -21702 -16803 -17294 -14863 -23541 -4978 316
15807 316 1458 -639 9318 8100 -10582 -20868 -17225 -10671 -7340 -1362 7663 14567 10505 175
15793 175 -7935 -13318 -6502 2226 -7600 -16349 -17650 -4827 -7073 -24299 -17901 -7854 -11983 -13714
15779 -13714 -10797 -4510 -10309 -14063 -4952 -7522 -8628 18427 28439 11519 -531 -2361 -16622
15766 -16622 -21011 -17635 -7331 -15749 -12577 -7230 -5748 -11929 -15248 -19549 -6089 -519 3253 2475
15752 2475 -9093 -24039 -21160 -17974 -28916 -21842 -15026 -17558 -16319 -19779 -20644 -16535 -15692 -9655
15738 -9655 -13742 -10569 -12684 -19731 -20341 -23848 -32519 -26499 -24812 -18365 -7022 -1305 8330 -6437
15724 -6437 -18866 -17838 -15745 -13838 -35906 -27270 -22394 -25190 -26122 -15967 -2854 -8915 -16966 -7294
15710 -7294 1132 1203 2189 11754 17575 12171 -1106 -18180 -13085 -10874 -11831 -220 6490 6024 13198
15695 13198 12120 5657 4379 2526 -18492 -29454 -18739 -11799 -10548 -17842 -35708 -35986 -31045 -22012
15681 -22012 7585 11308 5787 2649 -37 -8803 -19853 -25463 -32395 -32228 -30455 -44944 -46306 -23842
15667 -23842 -11818 -6483 -20084 -23833 -24976 -24053 -15360 1492 2766 -9248 -17455 -23275 -37353
15654 -37353 -23549 -10136 -8352 -1987 -8186 -19760 -14629 -9568 -16856 -19730 -17967 -25234 -17588 -13243
15640 -13243 -13071 -18094 -30573 -40108 -24132 -16351 -27476 -25422 -30353 -41174 -34107 -28477 -22655 -20783
15626 -20783 -21287 -15479 -15720 -29716 -29353 -23960 -14930 -5304 3458 -1869 -14142 -27775 -35330 -25306
15612 -25306 -8258 -3708 -6095 -3172 -10246 -24188 -29562 -38959 -42913 -36515 -35813 -28176 -26975 -24029
15598 -24029 -20381 -39069 -57837 -59291 -40724 -31228 -28658 -23937 -23313 -22119 -21757 -25707 -18340 -21447
15584 -21447 -8095 3372 -564 -13001 -23119 -13109 -818 6390 -3277 -26329 -24661 -17179 -10953
15571 -10953 -8363 1858 11351 3823 -3998 -12377 -12794 1222 10884 22266 18058 -940 -173 -3760
15557 -3760 -3868 -14456 -30186 -30059 -23561 -22936 -18321 -17307 -15248 -15594 -24407 -28574 -23983 -18427 -21604
15542 -21604 -27650 -9277 -9219 -12431 -11445 -5566 1687 -303 -6423 -23556 -24594 -17486 -5438 21
15528 21 -9689 -22230 -7779 5412 -13723 -19196 -20917 -17471 2384 5496 -437 -1463 3658 -2776
15514 -2776 -19015 -30960 -22647 -6247 -18872 -14993 -13917 -6665 -5953 337 -1697 -7717 -15238 -14919
15500 -14919 -21132 -28280 -33520 -22403 -13746 -12284 -18208 -26559 -33605 -34737 -28208 -24186 -17425 -9182
15486 -9182 -10497 -14759 -26505 -35410 -31718 -20083 -2168 -6751 -13385 -10878 -19711 -24776 -25387 -6412
15472 -6412 -8716 -16718 -17468 -19099 -25045 -36879 -32209 -30108 -36629 -48735 -42129 -27776 -17917 -21767
15458 -21767 -35029 -35709 -21474 -2104 -5893 -7628 -5453 -10782 -18483 -11091 -4109 -7680 -3861 -2062
15444 -2062 -4930 -8079 -21333 -29487 -26138 -12816 -18824 -24267 -31071 -29637 -43001 -37133 -20352 -18146
15430 -18146 -25100 -25255 -9068 -5633 -14835 -19005 -18383 -8925 2669 -1652 -8431 -7051 -20377 -25330
15416 -25330 -13835 -1347 -11304 -8697 -3747 -3287 -3946 496 -4376 -13519 5672 6448 3898 -10942
15402 -10942 -5109 -1623 -4438 -14128 -18112 -18566 -18018 -12319 -3838 -3850 -9088 -28956 -27502 -17890 -24883
15387 -24883 -29227 -33764 -22108 -18522 -30509 -12674 751 -1641 -1490 -11900 -24475 -23032 -7895
15374 -7895 5583 12350 -1666 -13713 -13944 -21693 -20354 -551 -4553 -19498 -25647 -25193 -28244 -22913
15360 -22913 -22166 -13097 -14628 -4465 10185 8222 -5517 -18444 -21517 -20261 -8486 -6862 -25555
15347 -25555 -39434 -47071 -40041 -28431 -22085 -8947 -24294 -39845 -47914 -31551 -16000 -5387
15335 -5387 -13391 -24166 -27147 -28482 -24333 -11216 3160 7424 1262 -2746 -10096 -10357 -4339 46
15321 46 6314 -5576 -35656 -39426 -26256 -13478 -24807 -34104 -20122 -12405 -12812 -9063 -29970 -50239
15307 -50239 -40179 -27095 -27599 -35403 -42162 -26140 -12409 -6613 -5064 -4373 -14095 -31476 -33950 -35300
15293 -35300 -28250 -25649 -16959 -11204 -13675 -17285 -19830 -20988 -21358 -35444 -31534 -5688 -4458 -13555
15279 -13555 -14236 -14666 -22885 -29521 -29806 -32797 -35017 -34525 -30125 -30632 -35351 -19353 -6464 3700 11702
15264 11702 8943 -3710 -13257 -8828 -16329 -25012 -19270 -7310 -4108 4264 -1988 -2429 2229 -6724
15250 -6724 -13061 -14312 -5273 -18856 -25627 -6664 13750 9292 -2871 -12471 -14035 -15143 -5008
15237 -5008 -10882 -18994 -30758 -36204 -20571 -1836 1582 -4024 -11283 -13590 -13337 -13677 -10422 -7553
15223 -7553 381 2050 -6078 -15984 -13279 -21500 -11688 -7161 -28149 -30723 -19337 -23151 -22011 -2055
15209 -2055 3759 -7798 -20927 -27409 -25958 -20619 -22217 -20398 -13535 -4288 -3622 -12068 -23930 -19616
15195 -19616 -5889 -3994 -11824 -12270 -8064 3272 -11091 -17146 -7794 -3591 -2795 5234 6117 -2066
15181 -2066 -8011 -12756 -15473 -26869 -21942 -21462 -17569 -26675 -42905 -29502 -34661 -40986 -30092 -19327
15167 -19327 -8272 -2480 -2983 -16518 -27720 -12116 -14602 -16114 -17560 -16799 -19434 -23163 -21141 -12361
15153 -12361 -22435 -36758 -32782 -31385 -15278 -21068 -13264 -10287 -18441 -28030 -29952 -26348 -26224 -33525
15139 -33525 -38385 -45662 -46900 -39780 -32256 -49774 -50232 -39324 -37182 -41000 -41170 -28557 -23317 -27806
15125 -27806 -40332 -26034 -6007 -4996 -17881 -25723 -22857 -16849 -5084 12063 13886 7237 4087
15112 4087 -3545 -9827 -19661 -15575 -26240 -29673 -17013 -15798 -22046 -26656 -39302 -33415 -32512 -27889
15098 -27889 -25066 -27347 -12534 -21572 -35867 -20055 -16415 -19842 -11135 -12078 -20933 -30531 -22784 -12226
15084 -12226 -8299 -1102 9286 -4892 -19405 -25328 -20770 -17016 -878 6683 258 -10341 -25939
15071 -25939 -31288 -24587 -13135 -8981 -13671 -23683 -20181 -23005 -30503 -25322 -27310 -24637 -23199 -16090
15057 -16090 -4947 -15436 -28143 -34454 -30033 -29547 -35798 -25435 -22568 -10179 -12748 -18376 -6302
15044 -6302 -9997 -25634 -37144 -34042 -25742 -15055 -3756 3915 19793 14594 -950 -3310 -1254
15031 -1254 -6898 -26447 -42614 -26392 -16553 -12988 -8883 -16342 -19664 -23720 -19198 -9464 -10492 -10332
15017 -10332 -22840 -23470 -23628 -5549 3812 -2474 -6452 3883 3400 5207 5346 24108 61099 78539
15003 78539 86392 92590 94955 74395 56292 42654 26288 2190 2924 5533 2076 -2062 -6187
14990 -6187 -10127 -13232 -2882 12869 12331 1438 -5001 -9010 -28020 -37011 -49568 -37662 -33622
14977 -33622 -25114 -19478 -8495 -8447 -7950 -9205 -5057 -12413 -25614 -35164 -25487 -11599 -9243 -6445
14963 -6445 -9812 -1671 -10596 -6680 3197 -3324 -6244 -13851 -9352 -3956 2586 -7866 -6058 4126
14949 4126 -6593 -19629 -17771 -13263 -11534 -8193 -20028 -30189 -22655 -18076 -2270 3979 -1366
14936 -1366 -15253 -4478 8536 -12428 -29100 -36371 -45625 -38154 -27493 -17086 -13843 -11051 -16263
14923 -16263 -39669 -45386 -36644 -24221 -13165 -7471 -17913 -13785 9300 10546 -6209 -12047 -8562
14910 -8562 -12156 -10870 -20553 -25953 -21491 -26259 -25258 -20128 -26946 -23692 -18478 -14859 -2229 1929
14896 1929 -6228 -10589 -9742 -22567 -25505 -16727 -21403 -31152 -32646 -16339 -11157 -13117 -12741 -8808 -15423
14881 -15423 -22194 -20540 -19328 -11097 -969 -12549 -13819 -14540 -18948 -21735 -19906 -21707 -22082 -16672
14867 -16672 -15306 -20793 -39831 -40993 -35360 -21200 -14914 -16598 -16879 -22285 -16998 -21564 -22197 -15862
14853 -15862 -21432 -38786 -36230 -36267 -38598 -35734 -21820 -17120 -27721 -18456 -15291 -21406 -18426 -23522
14839 -23522 -27285 -24470 -18786 -14549 -11960 -12794 -18454 -21875 -15316 -29127 -16792 -11789 -2108 -7884
14825 -7884 -20509 -23015 -15383 -15425 -10098 -3847 -4774 -11769 -34237 -32715 -21250 -15102 -7941 -15584 -17268
14810 -17268 -21501 -32626 -15938 -13349 -26064 -25989 -19019 -26121 -35182 -45903 -41403 -29596 -18318
14797 -18318 -29864 -30598 -33267 -50918 -50821 -24822 -11789 -22045 -42894 -50247 -40372 -39408 -32861 -23768
14783 -23768 -23319 -14329 -13226 -16465 -23142 -27091 -31457 -27247 -19932 -21408 -20277 -15387 -9936 -14646 -9598
14768 -9598 -11737 -23057 -36895 -15448 -4985 -27650 -36011 -35757 -32844 -22322 -15291 -12707 -20464
14755 -20464 -12424 9736 7970 11297 8999 4186 -4173 -3205 -5387 -17817 -17942 -18462 -20326 -23033 -20050
14740 -20050 -14881 -15781 -16238 -7691 7994 7143 -2988 -17023 -23295 -19298 -17628 -2760 6857 13377
14726 13377 8313 1043 -13569 -18292 -9594 -12379 -26863 -36019 -24632 -22811 -24395 -28489 -23767 -10085
14712 -10085 -11041 -18185 -8925 -13595 -24448 -26511 -25712 -33867 -42817 -36871 -23076 -12688 -23453 -37318
14698 -37318 -35352 -24204 -22868 -39390 -33851 -22794 -22160 -24471 -31244 -17469 -8874 -1672 -4239 -16028
14684 -16028 -22664 -21879 -9696 -5877 -12729 -14023 -15162 -17332 -25667 -26428 -17316 -11620 -17009 -14566 -1531
14669 -1531 3661 8321 -9779 -23835 -27846 -22282 -13888 -937 -9803 -11566 -18849 -26497 -23403 -7992
14655 -7992 7583 7711 1737 2480 13458 22577 12191 18239 12237 3215 5753 23051 21511 10147
14641 10147 -3364 -11884 -11333 -8910 7411 15594 15581 19646 29033 19563 33075 33065 24533 38810 38800
14626 38800 45980 57974 65173 78387 83723 85818 101217 122040 139174 158584 191273 202381
14614 202381 221087 254572 293694 335123 367066 415446 483296 545615 601839 647137 672553
14603 672553 705231 701947 683028 655753 616694 557500 490097 433984 391825 350653 317133 296355
14591 296355 268958 232514 212253 193695 173946 146487 140928 129765 128674 114004 92034 90373
14579 90373 96804 92632 68359 69434 71368 76342 78092 67679 61543 61463 53591 40116 27362 27943
14565 27943 32379 17630 8165 12999 15814 12292 313 -7249 -2345 4141 15536 7611 2659 -4373
14551 -4373 -12323 -11380 -14633 -20187 -26982 -9191 12794 12982 17121 14514 11885 12911 17176 28313
14537 28313 25448 23510 33659 40684 44924 32521 18161 7545 2512 -133 -11448 -7386 -2134
14524 -2134 8675 10495 9012 10360 2839 -475 7665 1787 -7451 -19706 -21913 -13586 -10677 -12818
14510 -12818 -9015 8391 6803 5758 12269 6889 -2501 -25093 -22026 -16269 -26535 -29079 -16018
14497 -16018 -8051 -15600 -14542 -2049 4933 -2451 -11341 -1415 5855 11477 12505 -4127 -26719 -31382
14483 -31382 -24877 -19836 -19775 -24175 -8701 7680 -9598 -14049 -10522 -8771 -3537 -732 -2618 -9497
14469 -9497 -18021 -14756 -12330 -18866 -6694 -1872 -1047 7273 17307 13406 3515 10690 -953 -10259
14455 -10259 -9311 -3648 7786 12309 6032 18377 37718 52559 45876 67026 79583 70094 82129
14442 82129 98646 110624 133170 147619 138502 142280 149116 133994 124401 124887 120552 123796 114949
14429 114949 104307 108627 108658 113274 104115 105220 107221 97974 89911 89980 96837 112764 137441 139937
14415 139937 154309 171970 167304 155514 151325 145387 143442 142501 148923 136352 124265 132179 137146
14402 137146 130860 120784 109058 101250 100228 78972 57608 57291 66540 66885 57186 49101 58598 47331
14388 47331 47926 40063 31654 24142 16065 13175 15632 16531 25476 31131 28398 17236 4729 8507
14374 8507 -14333 -20251 -20962 -5115 4643 1417 8581 6417 6425 -5586 10507 25441 7081 5657
14360 5657 25833 45508 56795 34646 9071 13023 19712 30027 44054 33725 32538 24377 15066
14347 15066 26637 26202 13709 14477 8358 -3281 -8219 436 -6578 -14115 -4257 -18777 -25054 -1983
14333 -1983 10549 17737 23491 14513 2088 -1678 -4376 4623 14363 9096 8639 18226 30756 27025
14319 27025 37458 51919 48196 42292 48999 47785 40811 46576 57727 71741 80536 86984 91521
14306 91521 101886 106579 94014 93575 100896 107481 125308 140623 143230 149018 152955 150581 153025 159911
14292 159911 167590 169305 153312 150978 165696 169582 170696 182678 191258 206878 206844 200795 213876
14279 213876 232858 244413 247971 249599 242884 234315 222869 227534 239030 252438 246963 254202 255354
14266 255354 253779 260558 267266 266794 271314 268992 247555 251561 264249 269483 274416 276939 273776 291232
14252 291232 305861 300841 310098 318711 334910 340974 364148 374862 385187 385930 396891 421385 439989
14239 439989 447926 453834 464793 494388 520947 546693 577063 608631 644839 665664 696737 725375
14227 725375 761890 784040 809494 836115 860142 892699 921051 953834 982916 1013000 1057015
14216 1057015 1105844 1158715 1204295 1259858 1320845 1383254 1454595 1527814 1611463 1709871 1804580
14205 1804580 1903184 2005594 2115104 2226101 2351238 2497601 2659591 2819643 2984812 3170065
14195 3170065 3370637 3587406 3819786 4076264 4346135 4645135 4977688 5322118 5694156
14186 5694156 6081972 6510834 7001435 7548240 8145839 8804509 9542224 10388491 11361959
14177 11361959 12459762 13712833 15130002 16749096 18622499 20785219 23276920 26188557
14169 26188557 29598554 33600317 38298680 43817574 50219936 57520104 65576261 74122213
14161 74122213 82780686 91064722 98415047 104291622 108306729 110155859 109779328 107292393
14153 107292393 102984029 97286590 90649687 83577637 76430459 69499761 63000787 57059855
14145 57059855 51715378 46967202 42762937 39057850 35796430 32912023 30322263 27986585
14137 27986585 25885000 24008790 22321688 20783767 19389814 18115222 16973867 15932763
14129 15932763 14978863 14112360 13308833 12584792 11904986 11258066 10664338 10117674 9611291
14120 9611291 9123133 8684299 8275995 7877582 7518348 7177843 6865340 6580223 6292127
14111 6292127 6015314 5751383 5513794 5299907 5088666 4885128 4696646 4531240 4373832
14102 4373832 4226223 4075648 3924813 3788122 3662250 3530306 3411785 3294987 3181644
14093 3181644 3068566 2955204 2851598 2737050 2645083 2559274 2464320 2363489 2275002 2193189
14083 2193189 2114712 2018576 1933802 1847850 1759565 1686033 1612655 1549101 1474270 1386772 1323590
14072 1323590 1279728 1229236 1179894 1126729 1066044 1017276 989025 956979 913862 868450 845016
14061 845016 814808 783710 747249 727779 710823 689589 659347 629829 627546 627364 615958 591248
14049 591248 578105 563765 550117 520749 490039 476105 459824 452285 448305 425710 413109 401303
14037 401303 391731 386731 377605 366592 354015 339703 336053 333308 324094 323729 322600 330248 324096 314047
14023 314047 301117 291366 294321 293846 291103 288764 277148 274518 270883 266776 271010 273799 266607 248197
14009 248197 235389 244474 254590 258841 252407 244016 231769 222010 226024 245882 244337 242370 244915
13996 244915 249552 259289 244196 248937 243853 230098 236789 244891 242235 248978 261582 266372 258816
13983 258816 249544 241204 229345 222263 209788 206555 224426 228294 226504 225201 233080 227649 218878
13970 218878 209519 206192 205588 204797 204591 211393 219485 223322 216796 216343 209563 210665 201454 186564 176308
13955 176308 179880 177371 160058 145073 154919 170840 178068 172949 157644 149231 152829 150592 136003
13942 136003 119913 128950 139259 140586 136770 137999 152055 157527 156507 148274 138069 127089 116650
13929 116650 131752 117072 104978 95038 96203 97786 98352 90206 96385 100860 92859 96256 111550
13916 111550 107775 83725 63606 64268 61424 50441 59514 78975 75449 73662 63922 76355 81703
13903 81703 72549 64897 77420 89106 100238 97197 96110 82676 68934 68483 71123 69836 74690
13890 74690 73654 56277 59049 56190 70353 78710 86027 98021 92468 86585 87848 77289 75859
13877 75859 74066 85348 82151 84149 95419 102327 101833 99730 92944 100248 101704 97966 87292 85118
13863 85118 80037 80230 73972 69112 76364 72187 69787 61015 67914 67043 65366 62757 77854 74247 65484
13848 65484 62029 57261 64112 78154 75167 68557 60491 67021 82923 73692 71522 73256 63173 56130
13834 56130 41952 43957 64919 52221 46071 44928 41491 52268 58405 51780 40203 53820 54439
13821 54439 50663 50431 50087 54910 64832 67440 86008 82220 71313 55179 45756 48161 64400 69500
13807 69500 58574 57656 68676 67101 62108 57740 61405 69556 71999 73080 58722 44020 33871
13794 33871 51673 53906 47936 53354 55415 42213 23741 22945 28872 31698 33892 30161 36066 31162
13780 31162 26866 39170 51789 53807 40091 15222 11077 18375 20046 22299 32020 32964 23749 28123
13766 28123 39791 51710 47969 40765 39827 41360 46592 50840 56233 47251 27177 29675 40986 31931
13752 31931 30115 38462 58213 71538 66015 56615 41158 38080 31123 35542 46180 46689 38117 40915
13738 40915 53137 65278 71201 74183 73154 64625 69376 77358 77156 72062 67678 73656 91143 87206
13724 87206 102472 104190 106470 104950 103648 124060 142795 159203 167299 172526 197534 226839 254021
13711 254021 270457 305114 336084 380779 431056 483349 531196 564379 598914 613926 610463 603664
13699 603664 591491 560230 520567 492542 459396 417006 385980 355787 322032 296198 248502
13688 248502 222515 206430 192035 181039 164209 162536 167051 147417 125542 112456 102888 100462
13676 100462 92476 94614 88936 86007 76730 86781 87288 97511 90925 59790 39959 27831 28764
13663 28764 42389 52333 48858 52904 45234 48333 51450 44714 37845 46464 44417 34691 42459 45433
13649 45433 49470 44466 52245 52545 43031 37983 25232 27812 34382 26169 15040 14223 7864 3351
13635 3351 16098 17077 9015 10102 15406 23090 28661 44166 35888 30849 22765 21329 28792 33534
13621 33534 36935 25461 32313 35685 33923 35843 42633 38852 23980 6463 -277 -4008 10354
13608 10354 11480 11110 7147 10455 2356 1308 9307 18881 29481 29278 16057 4336 -9767 -5960
13594 -5960 372 2552 8927 -5482 -23300 -41554 -33729 -15882 -6222 7748 3261 -2903 -3276 1327
13580 1327 11796 9957 -1530 8503 12980 17709 7419 2286 9079 15091 1939 -9164 -6332
13567 -6332 2522 -6702 11279 5676 58 12918 21862 16461 5609 10450 11045 3942 -2705 290
13553 290 -2572 -6363 11740 14737 28356 30938 15929 11963 15962 21397 15344 20565 11678 6070
13539 6070 1398 9066 15587 20403 24071 24211 15728 18790 12595 18545 12769 12606 19667 13835 7060
13524 7060 4327 -7640 -11185 -167 1018 -4668 -10557 -21058 -27224 -29511 -29382 -21213 -32430 -26692
13510 -26692 -19755 -13395 -15273 -2889 4637 6699 9801 15322 15622 9749 7297 10636 16001 14208
13496 14208 11416 9164 13323 11656 2463 1381 9396 29140 38742 26525 18795 8157 6442 -892
13482 -892 -19650 -19285 -19651 -10402 -3951 -6321 -4585 3565 1390 -3097 -8528 4091 5381 3030 -2366
13467 -2366 -11457 -3832 2504 4666 1675 9068 15282 5649 1921 -4161 -8164 -787 6440 11460 10346
13452 10346 9440 7440 1 427 7959 -114 -8062 -7274 3209 1333 -8776 -29742 -47007 -47497
13438 -47497 -30520 -20601 -9662 -8848 -14296 -17088 -20971 -17595 -1274 3357 8736 -770 2468 -9168
13424 -9168 -4700 -4324 -3653 -2802 7394 16430 8868 2799 15449 16039 193 -8827 -10707 -14566 -24058
13409 -24058 -13576 -13653 -4401 1734 -15036 -28392 -22311 -16896 -7433 -14123 -8644 -13298 -20257 -15783
13395 -15783 -12855 -5140 3472 5340 13845 -664 -8353 -13265 -5062 3285 -11705 -11209 -7975 -4243
13381 -4243 -7822 -14273 -20595 -28556 -22905 -7607 -12975 -9258 5169 11559 13395 17207 19650 9156
13367 9156 2950 -10751 -30889 -33946 -28668 -20646 -14800 -14444 -10544 -21234 -14884 -17664 -22619 -12530
13353 -12530 -8496 -2882 5705 8314 10695 10359 6820 -12420 -17647 -15834 -22654 -20621 -9888 -10785
13339 -10785 -21961 -17516 -3499 -8246 -11980 -7764 7260 10569 6430 9546 17233 12364 -2349
13326 -2349 -24809 -16587 -15758 -9279 4466 4808 1074 -2888 -10011 -22190 -22069 -30493 -30973 -18816 -24071
13311 -24071 -19416 -17289 -20224 -16167 -1441 -7433 -10218 -7697 -13940 -23984 -12206 -15605 -7661 8477
13297 8477 7189 7377 11113 6615 4415 5585 -1370 -9399 -4328 -16045 -16860 -9633 -7180 -7027 -6345
13282 -6345 4118 7206 7384 -10707 -15954 -7303 -5805 -16224 -20802 -16583 -1827 9515 -8700
13269 -8700 -9801 -7622 -11813 4877 11346 -8831 -30674 -17392 -16591 -22945 -20531 -18007 -19245 -13695
13255 -13695 -8264 -7591 -7825 7872 -4612 -13404 -2859 965 -7946 -17008 -16725 -13591 -1621 -2403
13241 -2403 -12560 -18749 -9208 -5463 -16798 -22868 -20851 -24652 -23602 -34133 -49087 -40284 -22803
13228 -22803 -1093 -1939 3223 53 -1148 -10024 -11005 -10531 -21546 -23661 -7521 -1054 3370 9330
13214 9330 19403 22491 8458 7581 16886 10635 3220 17071 16324 7035 5511 -7906 -13646 -10672
13200 -10672 -2442 8880 -2899 -30110 -22304 -21174 -18849 -4571 5575 16716 19782 6000 10300
13187 10300 20067 4448 -20527 -19613 -7835 2167 4732 1939 297 -10465 -21323 -29212 -17982
13174 -17982 -10943 -1124 -10586 -32083 -41927 -26828 -3837 -6116 -8981 -21138 -29032 -22695 -3844
13161 -3844 2042 -7199 -15152 -1985 13112 9179 -2060 -2234 -7821 -16907 -17058 -10270 -35 -5578
13147 -5578 -14918 -17173 -15531 -13945 -6005 3984 9700 8704 13220 11757 -3772 -6268 8562 8851 4056
13132 4056 18601 27128 19803 1824 -10775 -5637 -4064 -4167 -10017 -10817 -20177 -22407 -25064 -32160
13118 -32160 -13622 -147 3209 13873 9993 5005 -1309 373 3514 15691 17850 24846 25722 5845
13104 5845 -10053 -12412 -13003 -4433 1059 8962 22893 36562 26918 14008 16202 23470 23065 23770
13090 23770 18397 25557 29310 16495 2624 -9043 -15255 -8813 1322 13542 17146 22577 45176
13077 45176 43860 50409 56625 86690 128647 163112 227355 318650 443223 632875 933309 1294915
13065 1294915 1632458 1828707 1809185 1613253 1386375 1177129 986488 802140 633117 492089
13055 492089 403376 337240 285884 257230 226659 212348 201010 180791 155965 143318 138267 138838
13043 138838 135787 123997 116524 115857 102546 78409 54719 53268 55016 54681 57711 48458 45842 32480
13029 32480 29575 43732 45990 30901 33412 31796 35447 35710 25695 19717 11553 7518 7052 5998
13015 5998 11658 17962 16711 19673 26343 33959 40757 35070 35076 23196 14776 29984 22781 19068 9596
13000 9596 11282 16605 18654 19299 13712 18391 26960 24047 18840 16990 18243 14332 17010 17129 7313
12985 7313 8501 6102 -3189 -7500 -18433 -25867 -29802 -29610 -31097 -32798 -37172 -24327 -16604 -11810
12971 -11810 -28888 -49510 -55034 -56909 -46485 -14843 -8785 -3558 -13181 -19646 -19705 -7467 3761
12958 3761 9337 4323 -8323 -14965 -11959 -6824 -8760 -2426 4514 -3030 -11542 -23815 -27350 -31253
12944 -31253 -35078 -17224 228 6950 6866 4133 -9595 -25576 -41444 -46804 -52291 -47554 -43894 -36630
12930 -36630 -28070 -40349 -53446 -38350 -24374 -19650 -11490 -2160 5239 3146 -571 489 4458
12917 4458 3770 12354 19024 7432 -7301 -14309 -29255 -41274 -42019 -31353 -19078 -21491 -20173 -2068
12903 -2068 -312 4326 1542 -2496 17352 31888 34569 35158 22985 17110 26372 41115 46256 85375
12889 85375 135036 195368 264173 346928 418391 435948 441390 429129 396456 353375 290307 222286
12877 222286 166008 135905 100933 94420 73225 55533 51421 50532 46752 40660 37138 46742 53396
12864 53396 56742 55474 56648 55818 50500 48001 31208 -5666 -11264 -6214 -8762 811 -9075 -16039
12850 -16039 -16863 -15341 -12508 -18417 -27581 -20335 -12248 867 11780 14198 15969 27408 41566 47085
12836 47085 44128 32379 18690 3065 -313 -6457 -17141 -22552 -24659 -21084 -29654 -22045 1586
12823 1586 22478 4919 5246 14444 19372 13642 7984 13170 27104 26364 24799 30084 33426 32112
12809 32112 38021 43116 49076 73925 87690 111357 130087 145442 157121 172856 162433 141529
12797 141529 123944 111783 95504 68452 56169 53796 43650 27042 33382 45781 49233 59319
12785 59319 72370 103629 129594 136624 151751 156434 156030 160080 169375 156942 150471 150855 153996 170783
12771 170783 177199 170678 157844 140129 141120 132355 121305 125970 128638 120957 122964 138908 155889
12758 155889 187707 234697 273463 300576 292152 279112 287912 305355 318309 314348 293528 282923
12746 282923 277633 274927 270447 257249 241184 241239 233537 233932 249641 236343 209839 204150 214250
12733 214250 204870 184967 168434 163333 153430 136836 130170 132925 149527 171259 180144 183241 191091
12720 191091 192086 192983 188910 179524 174422 191510 229165 241770 245477 266958 275237 284956 315671
12707 315671 332529 344745 361430 368999 382248 405851 424599 441101 469808 500260 538268 558382
12695 558382 558163 548581 530315 501943 465012 438321 432729 421827 415152 435633 464480 505697
12683 505697 548972 611546 682773 731621 787401 837363 899203 972477 1041507 1101525 1167910
12672 1167910 1245990 1324731 1400168 1472962 1541891 1611981 1680283 1710290 1724735 1743590 1791345
12661 1791345 1874584 2005153 2153447 2343238 2566879 2805330 3079884 3397285 3730898 4080559
12651 4080559 4443576 4853514 5346775 5954581 6720112 7702288 8986019 10645989 12796504
12642 12796504 15512492 18793417 22704784 27549581 34081849 43811362 59252496 84530307
12634 84530307 125223888 185024631 257755037 322764713 356272890 348879723 312634831
12627 312634831 268175030 228333998 193773893 161297414 130784425 104875338 85123229
12620 85123229 70867843 60562592 52930991 47120764 42544617 38776891 35546389 32655774
12612 32655774 30015071 27628120 25493527 23610656 22000540 20599697 19344149 18189028
12604 18189028 17140757 16219205 15455445 14812460 14200837 13587602 12962107 12328310 11701063
12595 11701063 11113152 10577190 10099888 9672819 9250270 8815869 8376428 7962618 7589892
12586 7589892 7264681 6964662 6695282 6454480 6253070 6068857 5889908 5723236 5585990
12577 5585990 5474717 5357708 5237725 5107343 4951934 4792172 4641481 4505184 4380348
12568 4380348 4261069 4141600 4048605 4000017 3949049 3920526 3894986 3891033 3904323 3887244 3804866
12557 3804866 3660023 3469556 3297669 3150963 2980750 2799687 2604663 2435961 2282382
12548 2282382 2152489 2064045 1989425 1944242 1911235 1840731 1751278 1650336 1580219 1527990 1487660
12537 1487660 1454206 1452925 1489567 1582614 1749192 1979826 2231985 2468621 2607727 2602941 2482952
12526 2482952 2309709 2136768 1993227 1866214 1728510 1599267 1484302 1414304 1387938 1356853
12516 1356853 1295943 1219207 1132396 1051757 973400 906114 864195 822057 778779 732723 722190
12505 722190 720901 720835 706715 696075 690496 684620 699402 718929 730008 733097 716403 691948 679775
12492 679775 672683 654703 655533 639058 623148 599495 585987 597789 582501 552220 539979 540602
12480 540602 518443 491677 469342 450117 441509 440622 449653 450054 457876 471159 475457 474865 497978
12467 497978 518605 522469 531898 529954 505600 477677 480796 478267 464409 455929 450269 448101 439983
12454 439983 435299 451076 471799 480120 488037 489568 488742 487849 507114 518416 506824 507602 516581 519064
12440 519064 510815 490444 471120 457874 461933 470571 470251 466362 469845 471100 449724 434638 436470
12427 436470 437729 428911 427279 427664 435429 447778 462403 445658 434606 435841 424609 425679 438158
12414 438158 474041 501632 537246 595092 649298 681559 705681 705706 694399 673165 650757 600888
12402 600888 558644 513009 490116 461070 443909 427118 424300 415729 392147 386203 376854 381051
12390 381051 382963 364577 348980 330314 319944 317764 323736 333390 331984 326878 319482 326705 332662
12377 332662 333905 331833 328516 322452 324598 334100 336559 341491 349498 344733 329481 309935 282257
12364 282257 248486 242787 246577 244313 228336 225341 217032 209695 217836 203445 205627 215228 212328
12351 212328 209883 183919 173170 163497 158902 163385 149134 145450 145864 147930 146908 158609 162744
12338 162744 174416 165636 148476 147422 146881 157890 167024 156166 161153 163631 175964 190344 189633
12325 189633 180219 172311 153130 145172 138283 139080 146873 154679 153334 158531 154634 153397 141567 139279
12311 139279 142097 126333 118430 107962 113361 105165 97277 106961 119224 119016 111773 115593 122223 125351
12297 125351 130305 137912 142569 145108 135495 136861 126005 122132 133270 136225 132404 127939 130402 137791
12283 137791 145422 136305 133746 123503 122094 116325 110490 99795 96664 102853 106459 100806 101384 100889
12269 100889 98141 99417 101092 97983 102912 104222 122424 118833 95980 83049 86943 93831 86625
12256 86625 73055 81782 90862 99829 80924 86656 98193 89869 80895 86406 101447 99347 96633
12243 96633 102572 111742 105310 101813 104798 110969 116623 123995 123884 120576 115288 116609 117087 107728 111398
12228 111398 109601 113484 123788 126758 106878 105157 101973 98383 97481 94839 83797 75958 76116 76747
12214 76747 73167 76875 73359 82073 94633 94544 96640 120166 131640 144920 157389 175361 194226
12201 194226 204011 201590 211033 240310 288631 350097 426143 569318 816372 1144535 1514014
12190 1514014 1827419 1943549 1847571 1631914 1396104 1203861 1027552 867360 699244 571234
12180 571234 499964 433132 375479 342818 310646 286731 261682 226154 191897 182336 174464 176271
12168 176271 180064 178360 166416 150944 144418 126800 126661 126616 121408 120833 113943 99967 79139 80467
12154 80467 94071 105512 97725 80905 62562 59598 58682 56062 65823 79057 71750 57759 70705
12141 70705 79444 72462 80884 85908 94952 93767 86131 84157 83130 76822 81297 79704 79391 85047 81390
12126 81390 70225 71187 69379 59664 63807 66705 58022 66622 88915 81381 70173 56294 52668 55955
12112 55955 59173 59048 57434 49415 39285 39047 37187 46291 54729 63051 63369 56876 57764 54994 48574
12097 48574 48960 50096 59590 66482 64222 74126 75971 68632 70810 71514 59414 42006 47476 40808
12083 40808 46725 51422 51234 40623 33090 40263 47281 41525 54980 58056 48305 44661 58258 76604
12069 76604 87285 87851 88303 75238 77862 61654 49507 49382 57155 56418 46467 52963 52815 45917 52095
12054 52095 47099 25616 16672 19838 33426 29784 33609 46122 48930 40082 32122 23469 28897 36331
12040 36331 34376 31062 40729 47556 56436 43826 36511 42070 45283 43307 45894 49754 51178 56749
12026 56749 42280 43875 48932 58917 55093 45422 53826 58809 66982 57740 41187 21975 7926
12013 7926 11734 24733 31083 29874 24239 25841 25199 36677 45573 51705 49322 30779 24309 20825
11999 20825 41133 47469 42692 48158 45608 42836 49361 33933 27257 38388 43545 43620 40581 48283
11985 48283 53086 44624 32731 40149 44608 36463 25779 23029 29438 25259 16611 25772 31950 40799
11971 40799 32990 32111 35147 28566 18072 21551 26891 22638 30659 32304 20448 18823 24923 32091
11957 32091 21870 20976 26127 31462 34727 32415 31703 31439 20198 18650 28862 33642 25404 25902 31774
11942 31774 34840 40522 30700 26589 28490 34854 28291 27972 41191 40995 48471 42092 21862 25117
11928 25117 23786 28697 44536 47311 38867 33536 22266 1662 823 10465 20141 18730 28455 27151
11914 27151 34675 40454 51196 42556 33581 31921 40445 41665 31095 37744 34097 26017 23638 20498
11900 20498 18646 10364 11186 24086 34168 43333 48778 39961 30050 26438 26968 25425 23062 32688
11886 32688 17645 2108 4276 12076 11162 1096 -483 2475 7074 15254 29394 21930 10006
11873 10006 -5145 12964 15024 13213 15267 28146 27135 27631 27509 32317 29999 34322 42867 27723
11859 27723 29080 26315 15200 22395 26042 22103 29948 34247 25139 8806 4590 19364 32703
11846 32703 27744 24232 27585 19794 7215 8507 5892 962 -4056 -2593 19796 29204 24871 20052
11832 20052 24670 23182 26043 24655 14294 14434 15796 16945 19854 21438 25692 24309 9657 4006
11818 4006 11877 9372 15558 18328 34341 36705 29891 34059 36796 30686 9891 -10898 -9312 9384
11804 9384 16298 23621 22349 12435 15478 15893 25938 29388 20645 23849 33910 40766 24506 15061
11790 15061 21055 17575 23651 18231 19457 23453 19145 26333 31948 27230 27504 37714 37251 29874 37147
11775 37147 38092 45074 46649 38486 35978 24798 18854 20679 14774 6102 -5670 2894 12477 20715
11761 20715 30753 37131 43312 32208 24390 20422 25690 22343 16358 18775 16314 22827 24565 23382
11747 23382 23170 25875 20105 19460 17568 12248 8752 654 -6376 -1762 15378 9304 9474 8960 24221
11732 24221 24528 40793 44149 23944 21507 17821 22169 26990 37399 31549 28533 13428 20205 21092
11718 21092 10706 10837 10477 13678 20003 4850 -2497 -1700 -2639 10882 14611 7644 -7336 -2477
11704 -2477 688 9247 31062 35849 31752 10938 -9653 -23215 -22121 -7716 8216 5778 4332
11691 4332 -1253 -13082 -16795 -13615 392 16910 11371 25636 20706 16746 5655 -2715 8148
11678 8148 17039 27321 33026 27792 20040 19191 15006 8134 20087 21984 15671 -2616 482 4899
11664 4899 -4667 -632 9374 17695 18187 21283 13653 6604 22248 36017 25863 14645 20208 15319
11650 15319 -872 -4741 -2355 8587 -1686 -10348 -20664 -25395 -13361 9099 10406 5511 13528
11637 13528 8482 -1546 -3683 722 -1617 -151 2939 23068 18412 11541 -10393 -5680 -3248 -881
11623 -881 3383 17488 24353 4711 -6855 -5885 -1058 -2509 714 8888 8307 6280 5504 -4701 5748
11608 5748 12473 19052 22485 14831 5499 487 -426 10202 17686 15133 8455 -59 -9742 -14375 -2942
11593 -2942 14027 14422 10077 -1119 -9780 -19942 -11053 5918 16284 27664 14932 14071 23644
11580 23644 24465 9956 -6755 7800 17739 29186 25775 10057 4256 -8257 -11356 -85 10871
11567 10871 14893 16187 8944 7687 10620 3634 4317 10654 9413 1918 6104 11710 17773 12744 18705
11552 18705 23799 11915 2441 -9792 -2170 16112 20718 6835 -2629 -5720 -511 6921 1514
11539 1514 6694 6144 9568 11181 8272 -5054 -7298 9716 14732 23238 28077 13819 3058 -3616
11525 -3616 -2917 -9129 -9150 -8211 -2005 4354 18976 28914 33898 27299 14577 6243 3231 3774 13092
11510 13092 7587 6205 9994 9736 -142 -608 -1345 -8141 -414 17357 26491 18088 -2345 -9896 -1577
11495 -1577 18928 29566 17456 21684 29787 28919 33393 33021 16912 12784 9731 10721 12780 13005 16619
11480 16619 12202 9907 -512 -12164 -5016 -646 -8986 -3241 -10964 -12915 5567 12118 17382 13662
11466 13662 9017 883 -6886 -4827 2011 -4537 -4072 3361 7612 9625 -952 -2676 -16357 -8855
11452 -8855 1825 2383 10942 6638 10756 29403 23816 17413 21924 25541 5482 -1461 13629 26293
11438 26293 29649 28409 24609 18351 24271 25534 15042 16976 23717 3281 -12414 -2798 2799 4093
11424 4093 3187 -666 2118 6431 6144 -673 10607 23339 20612 9009 -6728 -12443 -17731 -26500
11410 -26500 -11851 7289 15752 8324 3582 3516 6736 492 15841 23643 11630 -4345 3622 950
11396 950 1419 6244 -10610 -24538 -41044 -20583 -1101 8824 21105 29340 29600 28994 29745 26388
11382 26388 26193 10407 -9673 -4212 2527 1031 -2940 8016 13955 3345 11307 22370 39069
11369 39069 39024 40972 25269 15499 5086 -2999 -2249 -6654 -5363 -7057 -22130 -25622 -10813 -1112
11355 -1112 -6786 -395 13553 16042 5733 4518 13195 15612 16233 16349 21386 22047 22808 5960 15820
11340 15820 16726 17512 12812 1465 -2037 -18951 -13183 8223 6153 2709 -5835 -1674 -13308 -22955
11326 -22955 -17224 -10309 -20047 -9731 -696 -6522 -1546 8695 14750 7834 1261 9380 11196 -562
11312 -562 -2329 6399 4771 2160 11503 17849 13104 9196 349 -5598 -13561 -3256 -11359 -9118 -5772
11297 -5772 -852 6049 2849 -3631 -7081 -6419 597 3647 11356 19850 26121 31991 19721 18954 22228
11282 22228 22059 15290 -5187 -13354 -4997 -13410 -12525 -18083 -23496 -18820 -3818 6901 5107 -11862
11268 -11862 -22423 -19868 301 9569 13962 13469 10495 6876 10560 3559 -8634 -7488 -6269 -12000
11254 -12000 -19076 -18346 -16519 -17795 -16902 1882 13086 4962 -9425 -18619 -20161 -14308 -6182 -4338
11240 -4338 12167 13980 18078 25506 34049 29556 19406 14605 23283 28609 20416 12815 -2233 -8795
11226 -8795 -1169 -7688 -4961 240 -7517 -8699 2591 2961 11699 15440 7724 -4129 -8327 -7827 4136
11211 4136 4335 5904 11296 -199 3176 9023 -3054 -9019 -12905 -3778 16856 23127 12256 3730
11197 3730 12746 529 -6127 -1775 -357 11447 17015 24697 37779 41187 39096 23045 20575 17442
11183 17442 15644 5840 2783 4842 13809 3578 -6214 217 10698 8702 375 -5239 -8817 -40
11169 -40 13880 5383 -9956 -15875 -14712 -6382 8371 25478 23295 22703 8125 7125 -934 -13222
11155 -13222 -4008 -299 5394 6301 17775 7682 -3660 -2407 2267 13100 23636 5397 11065
11142 11065 15775 5879 3803 16721 18366 21729 29533 20261 4378 -7044 1790 31655 32370 11370
11128 11370 5489 -152 197 7230 997 14064 21613 24491 25049 19289 9647 5975 -4418 -670
11114 -670 9059 20860 26169 23678 28174 21793 -4041 -3893 15710 39532 40174 36641 23635 24698
11100 24698 24207 19410 15715 6706 -9146 -6306 -3169 8097 12544 1022 4210 8431 14264 9866
11086 9866 837 -4513 -10932 -11043 7567 24285 23752 14255 3478 -44 -1776 -6531 -10402 -3486
11072 -3486 9079 14273 18908 5586 -10931 -17234 -5911 2140 -58 -9858 -3334 -6525 547 4511
11058 4511 -228 3806 11860 7613 -12247 -17917 -5804 13390 18196 18029 15782 12653 758 -14311
11044 -14311 -12591 -1197 5417 5483 -7752 -5014 5162 7615 10621 9901 5856 2862 -9797 -20792
11030 -20792 -7303 6296 12963 16248 3691 -975 -4135 7089 16892 18331 23593 22250 25211
11017 25211 28660 9803 2014 2637 -13365 -7467 247 -11910 -9250 -9494 -1996 -2125 -9416 -12081
11003 -12081 -18661 -30317 -23570 -16167 -12888 -15000 -22694 -24354 -16675 -30364 -27335 -18028 -14825 -9658
10989 -9658 -937 -10128 -11725 -262 -8075 -3704 10545 15761 18290 10535 -3175 -8285 6948 13076
10975 13076 -1069 -385 -11815 -3271 6330 376 10856 13285 8601 4828 1506 -7071 -5763 895
10961 895 12226 11704 3916 13014 13507 -6945 -19508 -4572 -4570 6157 24328 28354 27499 28435 25604
10946 25604 24842 21167 16818 11810 18200 15490 16625 16211 4772 -5610 -5114 2399 8625 17518 21474
10931 21474 11626 1921 -4773 -6319 3527 12691 7522 14637 22173 5986 -12849 -21478 -24379 -21703
10917 -21703 -8532 1250 4653 4538 5055 10703 10859 8079 4625 13464 19750 5693 -5089 3583
10903 3583 8958 -8284 -13735 -14968 -26986 -21546 -12849 -13817 -10480 -3902 506 -3845 2623 2783 9533
10888 9533 20943 9664 6412 4302 25214 25189 10350 10632 15032 15084 14883 7059 12937 12005 1728
10873 1728 -4395 -18456 -16602 -3685 5951 10766 17418 10263 21148 30679 25727 13092 15252 10232
10859 10232 7478 1450 3702 6975 15194 25553 30352 23462 24525 21970 25350 24680 32160 40069
10845 40069 32946 7787 -6941 -2873 11498 13161 10431 -4734 -21664 -21987 -12004 -9018 3905
10832 3905 12260 11634 1904 1718 16553 19187 14863 15274 5491 4731 13965 22279 25100 5070 -11538
10817 -11538 -6489 5734 21856 23748 12677 8864 11748 24339 44133 47591 69925 88058 82918
10804 82918 79661 76669 78072 69869 62790 59141 38663 13683 8379 3434 2552 8040 8484 2724
10790 2724 -3262 -1171 10153 5491 -5082 -11506 -16331 -10755 -2826 -16506 -17418 -10313 -2608 13982
10776 13982 14762 11627 22968 38229 24189 3968 9754 12183 18220 14415 20 6420 10831
10763 10831 18537 17809 9004 6304 12123 11304 16202 16685 17474 25181 21414 20945 8743 -9318 -27202
10748 -27202 -24925 -18877 -7421 -9605 -22492 -24525 -16825 -5646 -16482 -26531 -11331 5633 -2839
10735 -2839 -4803 1081 -11816 -6215 1667 3479 14112 14897 11509 11416 304 -1754 2965 13176
10721 13176 11731 9533 5922 12023 18599 12583 11289 2281 -1223 -5904 -9919 -8119 3352 14116
10707 14116 21871 22280 8870 11313 14651 7104 1347 -3506 -23491 -21702 -2205 7594 12104 11286
10693 11286 2457 -16487 -24976 -15560 -22638 -14747 -6604 56 -3082 -8413 -14587 -9501 -1730 -3939
10679 -3939 -5564 -24214 -34449 -28347 -23900 -4722 -2468 -3885 -6875 -17298 -16044 -12341 -375
10666 -375 5406 9599 9124 9720 -3412 -7273 -4769 -1775 -5806 -7641 2755 -12825 -26598 -14397
10652 -14397 -4054 -7544 -15144 -13252 -2998 2943 -13 -6702 -7807 -612 1805 495 -6796 -6524
10638 -6524 6037 26125 19328 10110 1397 -16610 -23356 -11658 -2158 3353 4230 4804 -11440 -8253
10624 -8253 2824 -4409 -1684 122 -10766 -18042 -18804 -18654 -13113 -4092 1371 -7364 -7100 -8073 -10356
10609 -10356 -17835 -19617 -21716 -1505 1537 4452 -6999 -13542 -20812 -26419 -9080 5018 4008
10596 4008 -10145 -8160 -11247 -7159 -9886 -24639 -15309 4221 4653 6208 12796 4913 5710 13253
10582 13253 22272 20215 9654 7085 -335 -19629 -25062 -10838 10802 21453 8125 728 5432
10569 5432 4560 2433 12303 4885 1710 11093 17739 16107 12289 19345 18091 8790 9146 12984 11991
10554 11991 -1372 -3775 9446 8338 3628 10406 21039 16913 7220 4541 13366 24499 24492 25902
10540 25902 22299 10447 -6471 -1793 10607 12311 10338 12584 17135 1492 3516 6739 4743
10527 4743 6228 10508 23292 21475 13934 4208 256 -118 367 1804 -8692 -3867 3930 4886 -9796
10512 -9796 -8972 -8053 -8727 10534 8491 -319 -8193 -5809 -2268 -10229 -11248 -19949 -21291 -15205 9262
10497 9262 24646 21400 4189 -1864 -5673 -835 -2008 474 -10103 -19933 -12770 -1718 -1716 -456
10483 -456 -2196 -6395 -4932 -9308 1907 -169 -12536 -13319 -22707 -30384 -28237 -26596 -14343 8530
10469 8530 6555 3636 6737 11169 2516 -12996 -10055 -2642 -3527 -658 17523 19983 1975 -10695
10455 -10695 -13308 -15250 -7794 -4321 929 11916 18878 19593 11814 -76 -5968 -6514 -8604 982
10441 982 13531 17165 22838 19071 9652 8719 1865 5023 10118 10777 18483 27203 27878 15107 5576
10426 5576 -222 -4641 -12553 -19924 -20558 -19493 -18711 -25590 -21546 -12020 2246 6337 5577 536 5391
10411 5391 15954 9603 5722 -1749 905 -3226 -3279 -14996 -9142 -12963 946 6407 7539 1130
10397 1130 -1268 3907 594 20740 28117 16180 7320 8755 12511 19720 22770 18943 27235 40214
10383 40214 35400 33898 43098 39978 29041 19789 13470 26821 38533 24572 25633 19720 4029
10370 4029 -2514 -1740 13741 18918 24848 45562 50850 48357 57082 68842 67399 50843 52028 48926
10356 48926 38017 43411 40053 27877 31617 35136 33770 25597 26475 32443 32368 20681 9355 8172
10342 8172 12461 21955 37363 43913 29933 16496 11878 14878 26629 42837 45294 37928 44412
10329 44412 49234 43217 36680 54361 80421 104007 133876 183774 274912 380393 515198 692204
10317 692204 846587 925970 936628 923703 932575 985765 1061025 1099202 1068513 976327 841144
10306 841144 717459 611815 514121 434747 383795 337024 295089 268091 241016 220150 186337
10295 186337 167160 142000 128255 121406 115512 99876 98377 105637 90239 83057 92945 88904 80798
10282 80798 83341 77194 67447 74552 79916 85881 88359 73693 67608 68241 66947 65867 68627 68481 66182
10267 66182 78040 75458 64014 68324 68492 67880 67566 62035 70647 96580 113192 149062 196204 237894
10253 237894 281766 334146 391016 426969 424043 414243 395386 374150 348033 314371 276165 235261
10241 235261 201282 175850 146143 114455 114177 114598 119316 110478 103615 94275 82677 85649 97980
10228 97980 101188 91656 94170 82239 77346 67940 63222 65296 62996 62336 72286 73522 77630 70668
10214 70668 55249 47286 57335 63144 58612 52844 56941 50590 45267 35657 51558 52466 57400 55103
10200 55103 46928 43315 40042 31353 30436 20526 16039 18829 23438 30130 30602 27410 40704 60632
10186 60632 62287 51447 48627 44374 38413 41182 31805 26676 27747 33096 36835 32968 31558 28185
10172 28185 34250 36159 29907 27265 34495 42601 35487 24694 28479 31314 16529 2563 -3536 -1546
10158 -1546 1944 24408 23830 17903 18440 29581 51542 48155 34656 40239 44840 39582 23768 12742
10144 12742 21110 27770 15683 4700 10164 12457 -8880 -3925 15918 20001 22318 17868 14669
10131 14669 -630 2795 9160 18619 19052 14007 30484 30235 24312 18267 30425 28600 19091 21846
10117 21846 18449 21403 41683 36496 25261 18057 19748 10805 8400 6009 6018 10489 8409 8719 15952
10102 15952 9422 -841 1915 6007 6800 9823 9009 5210 13839 24139 25704 23438 21925 12455
10088 12455 24099 30020 25740 35991 40544 31130 24928 15591 19015 22395 30817 17117 9719 20637
10074 20637 32859 40063 45328 39208 41759 67074 85793 97925 131922 192297 297112 440465
10062 440465 552688 576784 525154 431066 349113 303451 248922 202523 162996 136522 106850
10051 106850 78760 77606 84109 81842 82279 78962 76013 80960 68263 61114 61521 53340 60778 56645
10037 56645 27749 24453 40314 51455 50118 36685 27054 33732 32491 19413 35279 38096 33412
10024 33412 26193 30046 38894 41402 43480 27261 18207 17960 15830 20159 21003 21928 24229 29430 22286
10009 22286 24938 24134 31172 30533 22653 22866 30306 47735 41913 44570 37033 26015 25643 24742 26051
9994 26051 38885 32221 38764 39419 42083 34729 30482 38514 32895 29686 25094 24496 28903 28692 34672
9979 34672 15526 14797 21254 15450 10931 21582 34026 33390 40987 33933 27272 19492 9340 7794
9965 7794 17694 11002 12243 22901 2685 -11248 101 15858 17415 10698 9735 -3255 -5607 12067
9951 12067 12500 22240 35951 44834 24554 24749 22113 22859 31771 25847 16938 9893 24605 25321 13412
9936 13412 11017 21251 9257 5910 10505 15580 23104 22584 33532 32445 21082 17949 7102 23041
9922 23041 30554 32163 22443 17669 9950 1724 10409 37834 46361 43841 36661 29681 18248 21434
9908 21434 21853 21958 26638 16187 31378 32730 28338 22395 20287 14378 10026 9308 17526 20447 3094
9893 3094 4946 24562 36799 27096 18410 38087 42298 37156 36765 30685 22078 27510 37484 38314 43200
9878 43200 39917 43736 38878 32122 18935 17260 28748 29859 42501 36022 25980 30447 25684 30059
9864 30059 25988 27069 38221 41765 39729 13908 7712 18125 19643 17378 14640 21409 39689 45200
9850 45200 31203 20796 25764 36522 37592 34704 39114 37886 31243 25800 21654 14281 19401 24712
9836 24712 13954 18096 25534 29457 18974 22317 30263 32804 31356 25283 21189 27467 24289 22764
9822 22764 32951 23490 14745 11759 8793 -473 -11265 -10125 6500 8875 2214 -831 -3461 -7493
9808 -7493 -6003 -6888 3840 16571 35049 39928 25138 13467 6854 5111 10452 5846 5982 12624
9794 12624 7772 10887 589 -4050 -2363 -11871 -8205 5779 26490 30206 24624 12644 2963 2048
9780 2048 8314 12282 22654 26484 26126 31707 34490 27792 34889 27239 25026 18996 27741 39567 20739
9765 20739 25144 33987 24213 2862 -3411 -13792 -1024 4223 9191 8901 -12749 -17640 -14692 -16008
9751 -16008 -24061 -23381 -13637 -10124 6777 8084 7436 -1020 -2421 10794 15841 26040 8994 18059
9737 18059 23549 23623 27216 36063 39182 24208 10501 10406 6043 7215 18867 16056 -1942 2208 -1558
9722 -1558 -13199 -659 6385 12682 15877 19802 11121 9183 16709 9953 13376 12170 10537 6609
9708 6609 5818 9462 16055 21971 14860 15560 26259 30431 12250 6418 894 274 582 -3144 4223
9693 4223 6440 -2551 -9295 -6428 -9133 -7104 6990 15294 10952 -4191 -16291 -4459 10888 18273
9679 18273 25114 21677 22921 16837 985 8797 26124 33325 43975 50521 37747 35032 35767 20425
9665 20425 14104 15076 25659 23056 12848 13158 26211 30729 13061 13354 24491 34886 29695 38198
9651 38198 45025 46739 40189 44529 60522 69047 67978 62449 62937 53711 47198 56880 62287 58015 50654
9636 50654 38755 29585 35759 40242 40040 37853 40070 38406 58785 72468 79039 79064 85391 90279 83664
9621 83664 76300 84621 94565 95939 109636 125354 144595 158699 178850 181765 180078 179989 189334 218054
9607 218054 243280 273759 322585 379551 452154 505578 508984 499278 492699 478638 452132 417676
9595 417676 380079 338645 298076 272704 264325 271102 292982 333792 367851 403936 432938 483701
9583 483701 515484 533349 543809 543302 546723 555123 547278 516512 498330 488963 484571 471567 471343
9570 471343 465429 449354 454500 470498 513931 578764 669318 794707 960130 1155985 1289034
9559 1289034 1313503 1250307 1142770 1020904 915182 806684 717485 651087 608655 581507 549342
9548 549342 523819 516398 513409 513079 527444 555225 575237 592846 607830 627421 643613 655620
9536 655620 644341 624993 610281 566698 511322 465601 428385 397278 378678 363764 364221 376472
9524 376472 386027 406938 443297 476570 516063 556060 581858 582418 541973 489391 460082 450194
9512 450194 430892 393487 361835 351826 350540 350372 331101 310417 290639 276703 274546 279864 280001
9499 280001 290223 290052 275038 267766 271337 264128 268360 281903 288495 284806 282814 290422 302235 305825
9485 305825 300480 293417 299658 312965 327448 340506 345341 344361 344285 368822 380518 373356 375561 377999
9471 377999 371605 372373 369374 368022 367512 371965 381725 392767 405007 411118 427293 426657 436452 446747
9457 446747 457327 457583 457921 472369 496009 511173 519795 544997 567572 582760 584663 592120 618854
9444 618854 647793 676093 702754 722167 731203 744614 765351 794155 824623 837974 866631 897334
9432 897334 930945 951253 981811 1015524 1056248 1078826 1100007 1144672 1180934 1211390 1244752 1298056
9420 1298056 1348622 1385035 1425115 1479426 1563802 1623293 1671654 1748230 1814726 1883864 1961231
9409 1961231 2039423 2116876 2212489 2309996 2409061 2496989 2605238 2715602 2846510 2979335 3121190
9398 3121190 3272666 3425446 3588478 3757249 3942130 4132202 4335238 4572909 4816355 5093182
9388 5093182 5381158 5670442 5994722 6351461 6731328 7142225 7589274 8080776 8615756 9215586
9378 9215586 9848590 10532420 11281697 12101181 13006457 13994994 15064023 16236685 17532138
9369 17532138 18943575 20466298 22130494 23928662 25845177 27864331 29962343 32094045
9361 32094045 34209633 36280197 38224734 39994290 41510990 42670894 43441506 43806189
9353 43806189 43768090 43314831 42481081 41322824 39921399 38327778 36590199 34769303 32935801
9344 32935801 31100158 29323620 27617639 25983418 24419494 22937915 21556495 20265231
9336 20265231 19070566 17972706 16953964 16005739 15117670 14274520 13487591 12767991 12098660
9327 12098660 11482827 10915377 10376472 9862690 9398021 8980669 8564730 8167521 7803859
9318 7803859 7452670 7110215 6800852 6526065 6260151 5994392 5748682 5509719 5294651 5093155
9308 5093155 4906388 4720719 4546879 4367002 4195188 4036062 3885649 3743107 3606913 3473774
9298 3473774 3349569 3231284 3132031 3030542 2919650 2811490 2722289 2637892 2543594 2453888
9288 2453888 2377995 2291570 2208851 2140475 2065232 2000649 1938268 1874880 1809997 1750461 1708784
9277 1708784 1673706 1651198 1623503 1587331 1555675 1530740 1501512 1449663 1397632 1337629 1282462
9266 1282462 1229550 1179992 1132548 1083534 1050984 1036964 1038663 1022843 1005316 992638 973262 965014
9254 965014 959947 948800 926855 911540 896178 880202 866412 829952 799623 791816 771996 764896
9242 764896 742503 716848 721896 739003 785619 842849 897309 959068 1008068 1009742 956865 902492
9230 902492 840678 784067 732927 692958 663897 632763 598672 589869 598570 589714 582605 585453 579529
9217 579529 570652 570005 587163 600460 587602 568907 538762 511901 490192 472597 449308 433756
9205 433756 432813 427288 421568 431317 434900 444819 465333 483858 494071 501649 490105 475281 468499
9192 468499 446739 405316 372975 369428 347109 331335 327663 313176 302543 296972 281690 276183
9180 276183 267078 267477 273725 282640 273038 259233 269357 265111 263722 251947 233757 217783 220693
9167 220693 220813 213351 220348 214919 202080 208748 206920 201987 202434 196643 202649 202483 206562 207726 203890
9152 203890 199221 200852 200850 200129 200284 189744 163851 170174 161119 161396 163046 162504 163963 163840 172657 181153
9136 181153 167512 152594 150686 151855 150816 151134 155123 157763 164629 162545 157871 155570 132805 140978
9122 140978 159247 164623 155913 158753 144639 129879 127424 130703 131508 123216 123159 127116 123469 130382
9108 130382 134886 133313 128052 117621 116306 112503 105310 99340 111599 129796 137145 121245 118536
9095 118536 124689 126840 124160 113554 110500 113574 116316 130387 138277 136202 127812 125170 123663 112009
9081 112009 113852 130592 148741 145428 143210 138680 132850 109673 100907 104887 98025 98942 102023 101322
9067 101322 102328 90424 83034 85904 88239 83552 79312 84041 92491 93952 92043 103553 107945 109861
9053 109861 100598 81149 83289 85882 84333 78436 76251 86362 92859 92260 84903 69608 68800 86902
9039 86902 104353 107251 98471 76532 75088 80384 84066 92095 98911 100083 95738 71423 69234 88105
9025 88105 104362 105769 88952 75181 72339 74610 87311 90897 83505 84950 74525 63408 64774
9012 64774 72125 85509 89318 80035 70729 75199 87694 90506 80474 82902 82859 60065 61642 78448
8998 78448 91904 83317 84369 90124 83207 79567 70832 77100 91359 90391 76431 61058 61744 65490
8984 65490 82173 96592 107794 102191 96140 97235 103792 106710 103686 97331 91268 85271 71979 71301
8970 71301 81375 87074 86446 91943 97613 93808 74884 72786 65371 74902 84687 95196 77006 77715
8956 77715 81220 87255 78202 71609 78313 87939 95063 85904 89662 81599 70248 78081 78455 58669
8942 58669 58449 71563 97194 112072 120889 131891 134351 147772 146157 145846 159450 170971 186075
8929 186075 208166 230279 248766 276277 294810 328920 374840 452003 565088 750336 1053766
8918 1053766 1496645 2064787 2623774 2953239 2923071 2641292 2288164 1986639 1711580 1449485
8908 1449485 1194627 963052 804504 699942 607854 533395 490297 448725 412245 395221 382645
8897 382645 350099 302368 277188 257077 253615 252337 243964 245101 243907 218135 205296 204604 204782
8884 204782 198038 194365 177289 157844 139356 123603 116783 120242 122996 105756 100087 108162 103858
8871 103858 108548 105001 108045 91922 86435 84732 91428 94741 97478 100181 105009 107496 136342 150210
8857 150210 147434 145482 139697 139052 149483 137868 115852 94178 95937 92749 90833 92376 103021
8844 103021 95949 87518 92227 99678 92351 90809 97633 87856 83130 72998 63696 65181 66277 63199
8830 63199 50614 68896 90179 70926 49357 52773 60198 60830 69806 76314 71429 55110 61297
8817 61297 83687 74836 51342 46207 51695 71354 68124 60869 51088 39855 55633 57695 69544
8804 69544 74136 91894 99422 113060 115097 113130 109223 116136 115261 105796 87764 94362 94524 81564
8790 81564 67536 56939 53345 54513 59651 66111 75182 88650 82872 63156 62890 83700 90024 89177
8776 89177 104910 119912 136103 136517 158500 193296 236509 273608 288563 281681 278226 262206 238544
8763 238544 211986 198111 182365 170482 172180 162481 136097 115933 98319 104775 105926 107776 106691
8750 106691 111339 98929 108948 108945 111365 109472 97417 92410 95073 80609 71522 67659 63451 69796
8736 69796 78708 89072 92291 80698 81858 76550 65512 63087 69010 75282 80117 74232 73162 66714
8722 66714 51408 59392 80298 96320 95158 87693 85941 74037 75284 72367 83540 99138 87020
8709 87020 83609 69895 64023 81345 81117 72624 81375 96487 101084 101181 100246 106403 127336 134781 115410
8694 115410 102134 98755 99002 107442 104653 92545 93705 92332 90397 89992 87960 93480 108364 101928
8680 101928 104986 107913 100522 106672 113708 104545 105737 104747 105000 113156 116455 123680 126981 115257 107856
8665 107856 98450 96095 108480 113418 112041 113013 111675 108468 98314 110178 108137 118390 121504 131372
8651 131372 139401 151175 180104 193297 197479 214548 227680 244613 266075 308938 336191 355009
8639 355009 382608 403660 407977 405915 384277 372671 356199 330215 296583 273233 245900 226843
8627 226843 209598 192291 179871 155509 130759 134351 144842 148168 141669 118427 112681 114848 116986
8614 116986 109608 91745 83225 93286 98730 90014 83091 92293 98781 99980 88281 67223 61373
8601 61373 90488 99459 97507 101394 105224 101710 102842 96711 94939 88126 76464 88748 81283 67916
8587 67916 82545 89501 89581 83281 82517 74578 65705 66090 70484 75797 68427 57771 59700 47326 48005
8572 48005 62398 59806 57731 66342 55384 46683 51800 47870 30230 27393 34494 36370 46176 41858
8558 41858 41469 46147 54911 51879 45310 41727 31154 19106 25005 18056 20661 18078 20767 33285
8544 33285 32203 28283 40123 40255 50592 57543 61708 65983 58694 66489 72590 48898 35839 36491
8530 36491 35605 42786 50434 53215 48437 48562 41592 40110 52216 57816 49335 58854 73525 79020 82998
8515 82998 79017 63371 50233 52459 59992 67605 65065 57904 45287 45173 46818 40053 40652 36967
8501 36967 38789 42046 40037 43214 54370 58569 52790 51919 53182 58182 52880 49774 45006 46087 45446
8486 45446 34382 35458 30903 33786 34676 35932 42441 43746 41486 42435 50509 44205 45021 33257 25202
8471 25202 29416 23062 36733 49117 44000 47094 36439 28520 27065 33552 24845 29770 34218 27178
8457 27178 25013 29646 29667 26912 37244 50589 53993 45823 45687 37633 26571 25548 24193 20029 19662
8442 19662 30192 21269 6828 6299 11401 22782 32142 36709 47478 38051 37411 43381 47018 44034
8428 44034 35968 42153 41903 39336 42984 48191 43088 38523 46971 50698 45171 27266 22822 19115 3437
8413 3437 2437 8620 19726 27735 31820 25960 36356 34935 16310 16127 42172 43424 43533 51515
8399 51515 50444 42867 32066 23448 33561 31622 13396 3675 -2186 4946 16907 16856 4537 2367
8385 2367 497 8645 43968 62980 66769 52974 34599 33331 32947 38728 36210 44618 34766 28462
8371 28462 31646 34002 42446 35297 24968 27128 26297 29235 45420 41000 29343 28096 26433 26919
8357 26919 31010 36340 33910 22295 16557 16556 23922 14810 8665 10982 15837 12484 26366 36099 33251
8342 33251 27344 33194 37195 31920 35289 36989 27169 27485 30934 20870 28668 34971 29887 20254 7095
8327 7095 16940 25841 18578 19578 24377 16326 8734 4793 5525 17353 30401 35414 35586 15503 10132
8312 10132 24442 46882 47984 37329 41798 47854 55298 53110 57016 47728 55621 44180 25920
8299 25920 20385 14612 11459 4911 21807 35759 25855 29584 32597 37541 29389 20980 26205 27948
8285 27948 25129 30555 42111 47059 33027 12347 3855 8897 14542 7981 301 1436 4932 14654
8271 14654 35617 38234 43409 47449 50246 42556 38247 37212 24993 10902 5955 12639 12647 14565 16682
8256 16682 24507 25496 20032 21160 23899 19896 14094 5837 18890 15422 2458 12482 18516 12967
8242 12967 22757 20798 3732 6310 16051 15796 11004 19436 31664 33941 38053 29537 15745 6383
8228 6383 28414 19860 15204 14787 18417 24455 19571 23311 28376 34612 28398 22303 34219 28326 25765
8213 25765 18305 20322 12570 7775 13413 29212 26473 7115 -2416 -159 -834 2174 8225 2436
8199 2436 -14563 -14533 -6014 861 7174 18904 26147 31161 43984 34381 36573 32039 26663 20885 14738
8184 14738 15257 28448 44199 47412 42289 30244 11612 20279 23528 24225 24708 15625 18809 32253
8170 32253 40742 41009 42911 42892 43503 50784 47031 49816 48934 56113 55295 44845 27676 31089 26312 21068
8154 21068 21697 21899 14143 14416 16740 8341 13979 26706 20287 17233 21778 11046 13516 12031 3437
8139 3437 5664 8719 -1218 7901 4002 3951 -5210 -1366 11907 31417 22881 25713 26713 19006 14993
8124 14993 14846 17050 30296 37117 47574 54799 57094 68484 84368 95311 71519 57479 51839
8111 51839 43959 37792 47503 52902 71121 77028 66226 48198 34426 44831 58319 42685 34084
8098 34084 27426 20518 13281 23031 39848 36665 42689 53358 40102 27728 36842 53801 49915
8085 49915 46426 42078 39153 33338 33805 48302 62044 74328 77288 74681 52419 48445 44762 55179
8071 55179 62863 68952 74815 78572 67575 67419 65854 68838 69884 63004 57376 58201 60248 56023 47370
8056 47370 48386 59403 49528 47259 55699 61596 77990 77441 71418 69835 64868 62718 67705 72788
8042 72788 63582 48362 46955 68649 71458 69614 67454 62621 51872 41313 35385 52533 48544
8029 48544 37459 37748 35437 34434 44377 63058 68697 67359 73836 73082 56469 56286 63498 67390 82635
8014 82635 72333 75391 83443 84617 83181 81986 95653 100657 104582 107916 114736 114088 93810 99144
8000 99144 104718 105175 107914 103208 105011 99794 89674 89393 89595 97635 104971 96085 100864 92303 77947
7985 77947 70199 70233 65617 70958 72956 78678 74707 65365 65590 68335 67939 62875 62434 66320 78996 85800
7969 85800 92592 100887 105273 100060 96367 82119 74517 68197 77489 80949 88541 93291 83275 76481
7955 76481 67135 62740 62776 69403 68148 51197 46448 45297 51457 73761 82253 85277 81088 68392
7941 68392 65457 67023 67297 66547 74106 63040 53063 51795 51189 58311 64198 73130 71105 63762 58586
7926 58586 53831 47148 48240 50186 44400 46878 40927 35570 39405 50552 50601 55663 54378 58706 58804
7911 58804 53927 44472 27054 27196 25648 17409 12033 17166 22824 33483 40949 32886 17506 24712
7897 24712 40681 35915 39586 39333 48865 49647 39178 35748 32592 19872 4159 17978 15027 21302
7883 21302 26684 29649 38883 40572 33839 20009 11231 8013 30296 29998 32002 33171 25278 27621
7869 27621 31284 31941 34136 26698 18913 9696 -2674 -2049 12410 17788 16516 26030 22343 19995 23190
7854 23190 22832 13808 6133 4213 410 11514 26209 20355 5609 13072 9195 19360 26103 25134
7840 25134 33152 40971 54498 53821 29794 26627 33200 32789 28171 8849 4523 4032 3440 10945 10217
7825 10217 9952 65 -5966 -8690 -2617 -4093 1505 928 14913 18144 5686 -2728 7673 5025
7811 5025 6327 8821 2350 -52 -594 5068 8682 3033 -12499 -21216 -20631 -3369 -1327 1262 -3554
7796 -3554 -21863 -15698 -3467 4606 10075 6235 -4388 -10494 -933 7476 25585 46631 43327 39544
7782 39544 43155 31960 23023 31148 32018 33374 28770 14226 6878 3388 -4532 -12723 -25174 -33555
7768 -33555 -17257 -10415 -12289 -14414 -18871 -29381 -28136 -20246 -7694 2862 3581 4685 -792 -4459
7754 -4459 -7634 -14533 -12299 -16567 -19740 -1970 2796 8245 1686 -4776 -4844 4160 -518 -10112 -3066
7739 -3066 -629 -15640 -22151 -15852 -7733 -10570 -15262 3302 8872 6308 16383 19113 28817 33230
7725 33230 18763 -389 -18773 -12278 -5104 2867 13256 12569 8648 11022 1149 -6977 -18149 -12441
7711 -12441 -4080 -13161 -10419 -11439 -6188 -10138 -11326 4540 9054 -8481 -12094 -15855 -15073 -19964
7697 -19964 -19560 -10205 9779 14886 7449 16486 21093 12547 8764 7418 10822 4046 -2572 -2697 -4520
7682 -4520 -11970 -8370 -6368 -1941 -1256 -22677 -22793 -12041 -5545 -11673 -21125 -9712 2819 6134
7668 6134 -12524 1123 11763 18811 25471 18959 13856 9826 -1683 -2932 11284 9626 -8125
7655 -8125 -4686 -865 -875 5529 16743 23739 17677 16138 8767 1209 -12092 -4491 1484 -3659 -13894
7640 -13894 -1282 9150 10409 4615 -7812 -15586 -16408 -18255 -15169 -9794 -7000 -1430 10978 7889
7626 7889 -3949 -876 -2340 147 -12704 -17041 -3405 -3970 -10166 -27385 -33857 -27978 -23683 -27861
7612 -27861 -22719 -13718 -1830 6626 13782 7264 2169 14464 24466 26063 33279 32437 20869 14514
7598 14514 -849 -594 -5630 -18013 -13427 -16023 -14495 -17013 -19346 -9875 -2786 -6497 -10725 -12039
7584 -12039 -6305 -8818 -19969 -22261 -22056 -14315 -18062 -22640 -14001 -1155 -11218 -7777 -395 2596
7570 2596 -10792 -3936 15460 9116 -2936 5806 16433 14404 9292 15185 388 -13877 -17826
7557 -17826 -11793 -5135 -1123 -5342 -8919 588 2770 11139 17508 22777 19210 2463 -643 -220 8951
7542 8951 5376 8085 17035 20056 9755 3806 4374 16693 16918 7086 8638 11734 17534 10634 7049
7527 7049 13971 -2532 -6384 -6933 -7475 -603 6551 12518 11512 7774 3864 3161 8426 13737 9095
7512 9095 -3346 8052 9465 -6187 -17800 -20936 -12885 -17876 -7801 -2165 8565 3801 -4126
7499 -4126 -1489 -16582 -21685 -8058 6649 14587 23906 17228 4219 -17348 -21094 -22724 -17529 -10091
7485 -10091 -11270 -11448 -1675 3575 -3749 -8353 1297 1461 -2054 6436 14283 11946 -4965 -11366 -6677
7470 -6677 3663 6465 -2100 -20168 -7882 -4588 -17738 -19092 -22098 -12526 -10050 -1774 5822 7897
7456 7897 6875 13661 17413 22665 18460 12682 5862 11789 947 -14565 -13639 -8633 -3714 -3439 -6058
7441 -6058 -7592 -21646 -17606 -11846 -11159 1270 -1105 3425 13945 23330 25255 17037 7378 -1381
7427 -1381 -5169 -4829 -3851 -12895 -14636 -980 -1730 -2980 -14198 -8561 488 931 -5341 5056 4997 12533
7411 12533 14933 12843 12802 7202 -8046 -21408 -14261 -8346 -14370 -14884 -4682 4512 17902 17589 -7993
7396 -7993 -18323 -15797 -7554 -6080 -7983 -16891 -12082 -10490 -12778 -8165 -15070 -15000 -4146 -4633 -10132
7381 -10132 3899 10561 15253 15612 -5130 -21832 -21329 -19389 2264 -3055 -16783 -17323 -23081 -14135
7367 -14135 2664 20221 33258 32660 21895 13428 15135 9409 4729 11712 -2065 -9915 -7793 -805
7353 -805 13429 13192 5442 -5596 -11934 -15453 -2574 -4338 -11295 6178 6203 -5766 -19574 -21778
7339 -21778 -15160 -18838 -16848 -7776 -12955 -6705 6927 10562 4016 -14921 -9757 1178 4248 -7620
7325 -7620 -18285 -24992 -12658 -3129 13995 25456 16307 11822 15637 1535 -18890 -26995 -28958
7312 -28958 -22124 -10193 -9811 -29410 -36921 -21826 -9993 -7868 -3523 -4277 -1803 6202 6798 6149 11047
7297 11047 18000 11874 10476 13498 2569 2671 -14214 -30853 -38328 -41755 -34677 -14565 -1658 -3341
7283 -3341 176 2167 -5819 -25171 -30702 -25400 -24108 -27003 -15816 -12207 -1850 3847 1741 -3338
7269 -3338 -4819 3695 3925 76 -1147 -5164 8021 4471 3021 11894 -3602 -7364 -7049 -8771 -1249
7254 -1249 2456 -2006 -14405 -15815 319 11229 7267 5252 927 -10307 -16409 -12439 -6469 -16989
7240 -16989 -11519 -17138 -9377 4742 -5687 -19110 -21595 -19722 -20457 -20201 -8602 701 9172 14643
7226 14643 18301 13884 1202 5866 4067 -14463 -4698 -9124 -1974 12911 14757 4520 -11674
7213 -11674 -878 5797 -6064 -21110 -18792 -18777 -19741 -6267 6751 4528 -7201 -13302 -28299 -26589
7199 -26589 -9410 -2399 5826 11617 7222 -1011 2029 20474 17273 6149 -1946 -17349 -17016 -6574
7185 -6574 -19003 -23906 -16710 -19737 -13891 -13558 -19915 -13673 -9223 -22224 -25801 -17673 -14844 -19338 -22343
7170 -22343 -22126 -19921 -5659 -12827 -18281 -11192 9745 8305 4041 3949 -3032 -14375 -11126 -14382 -25866
7155 -25866 -31483 -18012 -5216 -4 -12999 -10314 -7738 2143 9571 2970 -12473 -4674 2322 10533
7141 10533 16959 4934 3638 -567 5889 -7504 -19567 -7995 -970 -12078 -14876 -12985 -8565
7128 -8565 -9780 -5299 2312 9826 1064 -5186 -1415 -696 -1445 -8394 1491 731 -13034 -8090 -3839
7113 -3839 -11498 -16497 -9711 -9780 -11803 -14943 -14785 -13094 -10286 -13539 -18497 -17256 -20565 -12574 -14525 -18599
7097 -18599 -7615 -6147 -11052 -6521 -4049 -210 8420 23781 17170 3216 8538 12081 2698 -1840
7083 -1840 -5223 -10759 -9054 -507 5540 -8567 -18271 -843 -1447 -3277 -7093 -4504 -3317 3629 19011
7068 19011 19723 25886 11967 -3335 -4792 9616 21811 22943 1414 -3028 2053 -10379 -22833
7055 -22833 -27594 -18949 -10195 -5810 -645 4937 2020 -4208 1225 966 793 1135 -1472 437 -676
7040 -676 -889 9289 10126 11785 1313 -1807 -2381 -7531 -17164 -17637 -829 -971 4925 10503 17886 15279
7024 15279 14673 14581 -335 -12411 -12923 -1529 -4699 -13073 -11013 -1738 5869 5602 6928 3708 12749
7009 12749 4195 -622 1108 -3678 9242 4449 -6658 -24642 -25765 -13496 -7618 211 2284 47
6995 47 -10857 -11494 3983 1473 5740 -4030 -19913 -30774 -21336 2997 12589 14431 -598 -11479
6981 -11479 -15330 -23461 -30320 -43850 -37983 -27035 -22787 -24346 -19688 -389 12940 14955 21675 18308
6967 18308 14703 16776 12730 300 1382 -2904 -21878 -18654 -15136 -7390 5773 15467 13466 6276
6953 6276 2496 -2124 -4218 -16393 -15742 -13718 -15869 -8508 -4812 -15172 -18691 -2678 14754 19391
6939 19391 21776 1891 6063 13348 8301 11164 12467 13688 9507 1064 867 5782 9584 16378 9191
6924 9191 6469 5456 -5464 -11490 -6540 6536 6894 5061 -8375 -11178 -3445 -10295 -13776 -16967
6910 -16967 -20273 -7123 2022 -504 2100 4156 20551 35048 33631 13069 9234 17377 14715 14838
6896 14838 23020 32085 25461 7594 2431 15101 24014 13187 7659 5100 18877 11682 10027 10676
6882 10676 2861 4361 -9785 -17940 -2634 1223 5189 7809 10098 6329 -244 -11870 -19440 -24141
6868 -24141 -21663 -10958 -4385 -14232 -11212 -733 162 1093 962 10246 2642 -7183 -5648 -4819 -2483
6853 -2483 -988 -1910 518 4836 1936 -6120 -10934 -1374 5023 8453 4179 7206 24113 21091 15412
6838 15412 8280 -6728 -2077 -1992 -5657 -17735 -11802 1153 1925 1711 5094 -1124 -2044 -9855 -10578
6823 -10578 -3242 -2895 -1069 -1652 -3621 -7685 -2198 3766 504 1126 10504 622 -857 4711 3325
6808 3325 3347 167 4298 11925 13367 -5843 -13965 -5837 -1371 2556 1699 -435 14090 17784 11582
6793 11582 -3563 -1563 -68 -1719 2899 16912 11127 12590 19183 21609 17998 1806 -7537 -3629
6779 -3629 1226 12080 17409 2339 -2336 -828 -1445 6417 14001 21013 11139 16442 12419 11762 5125
6764 5125 -6948 684 4988 -2658 -14362 -10753 -15431 -13583 -11156 -16417 -12633 -1309 9020 -1935
6750 -1935 -405 -3064 -5419 7548 4999 -2655 -4432 -6150 -9904 -3929 -51 -7533 1717 4826 -14091
6735 -14091 -20348 -23951 -18991 -33165 -22255 -15240 -23613 -25672 -29001 -27386 -21550 -13039 -1823 4383
6721 4383 -7172 -5223 7657 8812 -4320 3956 -1905 -9712 -13626 -32703 -30135 -10070 5526
6708 5526 -2288 -12344 -6194 -20076 -23241 -15132 -13413 -10740 -17366 -17489 -410 5918 5015 -14484
6694 -14484 -16961 -11556 -1416 -5781 -9925 -16155 -12311 -2044 766 4682 7619 -4900 -15154 -5804
6680 -5804 -6804 -7719 -10905 -18908 -12837 -11059 -8452 -9213 -18742 -19843 -17964 -16979 -7826 -5497 -8550 -10721
6664 -10721 -15657 -15387 -11734 -1794 7654 10472 10353 20105 12621 7147 -6973 -886 2920 7545 -240
6649 -240 -13459 -661 3175 7903 6024 -1977 -9865 -21805 -21149 -9297 11241 -5590 -11268 -4970
6635 -4970 -157 -10529 -3895 -10361 -9197 -6510 -6229 -12107 -2165 2582 -1453 3164 11566 14092 11841
6620 11841 3068 -32 2386 8662 -3774 -13950 -13921 -3841 11259 5403 -1187 -4741 -8306 -8373 -9762
6605 -9762 -8113 5085 4040 4736 10005 12696 13596 25321 13169 7040 14793 16454 16851 24361 17401
6590 17401 9076 8549 -512 4342 2784 -19453 -20503 -13107 1876 7532 5731 -2389 -12704 -16645
6576 -16645 -8310 -5413 4872 -4942 2242 9792 3975 -13762 -21926 -18064 -21583 -16737 -3185 4464
6562 4464 13377 31594 25952 12501 3676 -16254 -25907 -19693 -12866 -9311 -4152 -24368 -21134 -465
6548 -465 -2851 -10310 -17600 -19944 -19484 -13408 -7800 -85 4286 2748 641 7531 9164 7843 5793
6533 5793 1284 -1419 -7650 3530 3456 5090 -2095 11953 9061 6679 -3249 -10177 4558 10465 9254
6518 9254 1893 -2885 -12868 -23911 -21325 -2512 3419 6816 -4053 -9844 -11481 -7695 -6182 -23
6504 -23 2513 -5071 -5830 -4157 1339 2062 -7259 -8929 -16618 -20811 -13459 -12658 -13681 -373 1110 11262
6488 11262 11715 2796 1646 -11289 -22900 -18720 -7434 -4644 -15975 -8370 3656 12362 6763 479
6474 479 -3836 -10437 -12568 -6425 -3762 -8971 -1752 3382 -5118 6936 10143 2575 -8675 -15867 -21040
6459 -21040 -23563 -32773 -27171 -21665 -16360 -10907 -18587 -19836 -17821 -16189 -19377 -13969 -1530 -2462 1007
6444 1007 10736 11654 5695 -1891 -1441 -2245 6650 11875 13287 2980 -2072 -8368 -9718 -12106 -5212
6429 -5212 -9106 -17440 -9553 -8476 -19107 -16834 -9149 -9086 -11545 -8496 -3994 -6716 -15033 -19292 -17381
6414 -17381 -13261 -18064 -24486 -13918 -3787 5462 2071 -15744 -12003 -5236 -5627 -6420 -8656 4004
6400 4004 10029 -3959 -6333 1049 -5015 -12943 -5604 -4702 -22772 -29642 -32230 -25918 -7951 -1081
6386 -1081 -6740 -10745 -908 5917 -1779 290 613 5779 250 -2820 1133 584 2098 2303 11020 13054
6370 13054 5292 1722 9421 14939 -778 -14234 -17444 -17160 -15163 -13082 -21200 -17722 -21420 -29133
6356 -29133 -22900 -16370 -3598 -1319 -5746 -7839 -7689 -88 6623 -254 -17976 -19998 -25838 -20494
6342 -20494 -7630 -16416 -15491 -5078 -3057 6565 5364 3699 7392 -12174 -23508 -6183 14686
6329 14686 6128 -5131 -15316 -27165 -31500 -22071 -21875 -18781 -11273 -5083 10824 6494 -7777 -5617
6315 -5617 -2125 10533 11510 7491 225 -3088 -2538 -6201 146 10388 5804 4418 -405 -13225 -24393
6300 -24393 -21881 -11348 -9305 -19480 -15381 -13561 -17320 -17100 -19584 1851 -631 2965 3190 5528
6286 5528 1268 6682 -3016 -27179 -32556 -13717 -8212 -13672 -6918 -1783 -5038 -5551 591 -5335 -16578
6271 -16578 -15275 -18813 -30508 -21702 -19210 -16128 -12208 -11170 -18431 -12311 -13241 -15833 -9851 -22040
6257 -22040 -26474 -10001 1333 16346 8587 -12493 -34415 -17321 -7284 -5456 -8788 -11118 -5537
6244 -5537 4406 5772 -2647 1629 4777 -2596 -6473 -6972 -9056 -9814 -9207 -3935 9308 9 594 -1300
6228 -1300 4133 2298 -3445 6786 8719 4691 -5246 -22984 -12496 -9944 -15089 -12242 -12844 -19592
6214 -19592 -18851 -20227 -23319 -17075 -9643 -12806 -12503 -3091 -2636 -7263 -12407 -16580 -7548 -12480 -22647
6199 -22647 -19420 -12939 -7478 -2494 4760 12809 20998 8387 -6113 -12432 -10123 -8513 -18765 -24796
6185 -24796 -24059 -26067 -29306 -20982 387 2240 -7860 316 -7833 -17180 -13226 -17416 -12384 -1626
6171 -1626 2453 5823 7876 -3153 1711 -5027 -18928 -22174 -13784 -11588 -13940 -16658 -16403 -6816 -5909
6156 -5909 -8686 -8214 -15765 -24978 -15761 -17699 -13064 -531 4853 -57 -6835 -15949 -20213 -28973 -26084
6141 -26084 -21118 -23219 -16200 -1887 2011 -10841 -24663 -38812 -45878 -49055 -29567 -14323 -6636
6128 -6636 -4467 122 -827 -235 440 -8096 -5987 -4508 -7741 -9989 364 894 2720 6623 -6711
6113 -6711 1034 86 -7276 -15241 -11079 -22591 -32751 -27515 -23595 -30429 -17878 -3376 -8974 -11078
6099 -11078 -7087 -22427 -31203 -32423 -23461 -17610 -15130 -2054 7726 6031 4646 -2432 -272 -2709
6085 -2709 -17174 -26460 -14657 -1667 -1938 -894 12442 15425 4417 2283 -178 -5886 -7877 -2223
6071 -2223 5254 -2521 -7672 2081 11295 4144 -4546 -20541 -18071 -20995 -26519 -28980 -31413 -14709
6057 -14709 396 -10479 -8930 -11089 -18636 -25541 -18310 -10907 2423 -1662 -3084 -7490 -17436 -18874
6043 -18874 -38213 -34388 -27851 -20748 -14268 -7824 -1980 -7517 -21760 -30809 -27050 -19863 -26916 -32356
6029 -32356 -23175 -15275 -10122 -9021 -4040 -9885 -21261 -26961 -27837 -12689 -17760 -22644 -18480 -9309
6015 -9309 -11698 -8563 -2371 -8913 -2085 17827 14441 9043 8677 4490 -6521 -9483 -14693 -11404 -4199
6000 -4199 -8700 968 -3199 -16533 -15341 -18098 -14869 -13631 -19956 -11068 -9476 -514 -4891 -5877 575
5985 575 -12895 -13494 -11515 -13959 -368 -8646 -8677 1834 -1590 -8232 6199 5168 6397 -3263 -1459
5970 -1459 -16 -4718 -20110 -29059 -27237 -33922 -29154 -18027 -4487 -14246 -16312 -11221 -20284 -25722
5956 -25722 -8845 -1703 2689 -17385 -18671 -18302 -11993 -406 -7416 -12079 -16427 -16572 -14772 -17556
5942 -17556 -8080 -5137 -9867 -1267 588 -11727 -20527 -16350 -2460 9435 9713 13035 12093 10456
5928 10456 10856 6375 3315 2986 1835 -7804 -10419 -305 -197 -16045 -16099 -5302 10744 2938 2194
5913 2194 -3220 -6731 -9365 -13127 -23651 -10377 1611 -1342 2205 3407 -737 8927 8388 6602
5899 6602 8754 7555 6376 10343 12647 -2786 5904 8565 8983 12088 18462 28757 16876 8662
5885 8662 -2796 -2246 10729 17412 12434 8246 -1093 -14892 -8810 1912 6892 13091 22309 17497
5871 17497 -6643 -16766 -5771 -5894 -12666 1712 12065 5882 -4325 2381 13379 15088 3635
5858 3635 3600 7106 11009 864 -5538 4761 -4989 -12483 -7290 -405 -7472 -5537 -5092 10973 9100
5843 9100 5811 -9680 -25938 -29019 -12117 266 5298 -5010 -10469 -13246 -10007 -19138 -33746
5830 -33746 -27677 -17318 -3366 7925 11707 2525 -2168 -7552 -14046 -3253 3702 3425 455 -9878
5816 -9878 -10932 -4239 2594 9881 6078 4344 16317 25955 22133 15452 289 -8525 -3176 -5606
5802 -5606 -8234 -9370 -7064 3021 11404 6520 -2547 -185 1205 -3651 -14365 -17971 -14309 -14572 -26179
5787 -26179 -25510 -26223 -31494 -31119 -22211 -19064 -11736 -10911 -10696 -10219 974 -7345 -12785 -14705 -20098 -19886
5771 -19886 -16867 -9421 1073 11402 14148 3665 1095 4014 6325 4418 638 12130 12111 11103
5757 11103 8504 4875 4243 6507 10542 4341 -16166 -19253 -20357 -21905 -18913 -17283 -16936 -19090 -12370
5742 -12370 -10137 -7474 2273 493 -10634 -8406 -6822 -9099 -4578 -16837 -16430 -12731 -6599 8042
5728 8042 12857 24198 15792 4673 -3927 -5352 -5054 -1992 -5143 -6300 4135 5316 10533 5103
5714 5103 -15164 -17460 -10732 -13208 -8637 3180 5490 -1019 -3038 4362 -1515 1544 -8775 3524
5700 3524 11347 -4092 -8181 -18552 -28471 -21632 -25858 -25159 -30244 -33869 -37341 -38005 -27299 -22211 -4523
5685 -4523 2772 -2399 -9792 -661 -13960 -12576 -17319 -10403 1823 6752 10929 6008 750 3818
5671 3818 -4307 8599 9031 2245 -16681 -24193 -17835 -10990 8043 25773 14788 11695 11200 15
5657 15 5430 11010 -1398 -5847 -17617 -14581 -2852 -2755 -14163 -9371 -8190 -960 -12428 -5827 -2986
5642 -2986 8394 9573 13532 12871 11507 10043 11379 7940 2352 7874 2386 -2424 376 17693 21024
5627 21024 20227 8324 -3298 -8438 -8025 -2326 -15683 -18287 -11516 -9648 -18389 -21103 -4492 -9614
5613 -9614 -23622 -10078 -7866 -9185 -6789 -7661 -18065 -30891 -30166 -17176 -9768 -8571 -14640 -8098
5599 -8098 -4017 -2408 4454 13909 18154 12678 -13776 -20385 -15669 -15312 -10514 -4898 -6318 -11424 -24458
5584 -24458 -28720 -23699 -15641 -26828 -29221 -30839 -27153 -10501 -2206 -3908 -2124 1275 -9231 -19585
5570 -19585 -24273 -15735 -10169 -14493 -19119 -9236 -5201 -6077 -12442 -12707 -19841 -25756 -27156 -27494 -15015
5555 -15015 -7715 -6271 -6321 -6246 2813 7184 7364 -47 617 2768 -8356 1698 10238 6209 -8647
5540 -8647 -15306 -16289 -8544 -2438 -4257 -2570 -13456 -17541 -25352 -31615 -29136 -19571 -12806 -11446 -14575
5525 -14575 -17400 -10792 -15483 -18321 -15255 -13226 -8228 3837 9715 6825 12299 19600 16717 7167
5511 7167 -4822 -975 9930 9740 8468 4870 2732 -3362 -394 3693 4347 7049 4321 -5110 -6514
5496 -6514 -4420 -471 -4123 -14257 -11246 -13688 -13292 -1447 -12027 -8116 -6024 -3307 -2740 2907 3660
5481 3660 -23859 -28161 -21102 -15309 -4229 -4718 -12913 -14649 -8524 -23293 -26405 -29622 -23854 -147
5467 -147 12230 14076 3438 -3817 3174 -5124 -17539 -21233 -14743 -6155 -4725 5327 16253 14265
5453 14265 13666 8767 4452 3527 9868 6040 1994 -2164 6246 15011 10271 14236 10196 -3898 -8338
5438 -8338 -10464 -6053 -3785 -15871 -16077 4270 -7475 -11926 2092 1415 -997 10996 1290 -10026
5424 -10026 -21594 -21971 -25342 -31625 -15187 -14701 -21821 -12331 -12755 -18684 -3503 -2463 -11357 -13019 -1701
5409 -1701 3132 6241 3629 5666 -1202 -3632 -207 6317 -1643 1473 14947 20118 10143 -5714
5395 -5714 -4069 -1894 -16268 -17574 -19392 -13722 -5185 -81 7846 19524 8952 2307 -14061 -14744
5381 -14744 -5373 -3603 8476 3453 -9469 -8511 -8176 4203 4573 10513 6914 1803 851 -5626 -144
5366 -144 -5671 -24769 -23946 -2518 7392 4751 -6326 -5655 4083 -73 -593 -1786 -3438 -2579 -10125
5351 -10125 -7907 3532 14704 4336 4467 -5607 -2238 -2733 -6396 -9402 -266 -3655 -1780 9897
5337 9897 21963 32072 19100 18932 22883 4666 -6744 -2648 6385 9729 153 -9330 -4990 -1329
5323 -1329 7562 2921 -14493 -16013 13873 8330 -5529 -30314 -26693 -5290 -607 7835 7252 -9413
5309 -9413 -6934 -2185 -3519 -10458 -1776 610 -18533 -26883 -14596 -10136 -12665 -9779 -2258 5332
5295 5332 1969 -1835 -3812 9095 8346 5299 7931 24153 18681 9642 770 -1882 -8865 -14429 -435
5280 -435 8479 3002 -8224 -15589 -19207 -20460 -17922 -5790 -6135 -12686 -14368 -22229 -19076 -8490 -13171
5265 -13171 -14484 -10472 -19458 -16795 -8970 3531 6446 7907 -710 -17042 -16838 1039 -8141 -15589
5251 -15589 -19049 -27363 -30464 -25012 -9595 -7870 -8700 -15384 -22315 -14457 -3286 -10502 -25745 -27630
5237 -27630 -10247 -8401 -10850 1926 11169 12965 12302 10359 5666 -9090 -18807 -14684 -8207 -6611
5223 -6611 -2794 -10303 -13121 1234 6341 9682 960 2007 -3608 -15513 -11022 38 -4373 1560
5209 1560 2446 1241 5948 -3365 -9511 -6702 -2187 -9214 2290 -3610 -15943 -20043 -20108 -17030 -13530
5194 -13530 -24692 -19637 -10305 1688 10512 12162 560 -13941 -21054 -12745 8570 20875 16202
5181 16202 4272 1434 3513 -10083 -22168 -21373 -17787 -3235 1760 13963 5373 6577 -8935
5168 -8935 -22116 -16179 -7969 -1358 7707 7066 1535 -2272 -7900 -57 3311 7468 15011 9851 -4335
5153 -4335 -9496 -16950 -15330 -15803 -19790 -13896 -6192 -3271 1993 -13424 -22638 -27884 -30206 -25025 -19184
5138 -19184 -8794 3771 7032 4082 7573 8422 3865 9491 10070 11353 863 -540 -11410 -19573
5124 -19573 -11168 -17898 -19505 -11295 -19881 -39928 -19256 10447 693 -15225 -33110 -36720 -29181
5111 -29181 -14090 -7285 -9717 -13381 -10719 -6659 -15624 -22172 -8919 10959 9734 6392 -1890 -12033
5097 -12033 -9650 4232 5557 2003 -11578 -15980 1898 4193 -6633 -1846 11424 8673 -132
5084 -132 7027 4565 1264 -10808 -23931 -20267 -1254 4866 -65 1460 -6572 -11995 -7081 -9024
5070 -9024 -10367 -13086 2285 24503 15126 -3951 -10824 -4493 -8094 -14953 -22663 -19399 -14999 -9379
5056 -9379 -7619 -6474 -10203 -2542 -12605 -27447 -27629 -13090 -14324 -15349 -18076 -21829 -14154 -8548
5042 -8548 -7541 -12752 -9536 -22123 -18236 -8640 6630 14010 -9393 -23158 -12863 -1371 -4338
5029 -4338 -11191 -25939 -28843 -28290 -32252 -18093 1927 -9758 -12732 -18940 -10131 -846 -7513 -20527
5015 -20527 -23799 -19146 -19372 -14533 -3464 -5193 -6163 16772 20016 12845 7609 12941 15094 17280 5151
5000 5151 4110 -4441 -9638 -2883 3365 1148 2908 5358 13526 2364 -6359 -16270 -19411 -21068 -4707
4985 -4707 8818 10928 28175 30980 10465 6207 6164 2425 5275 10294 4224 -2152 -2813 -462 -1702
4970 -1702 -15530 -25842 -26670 -23842 -9960 -7471 -41 641 -1184 -2908 -7609 -7131 -8473 -103 19718
4955 19718 21374 15254 6086 470 368 -5688 -12365 -18201 -3182 3633 11696 8625 21564 30821
4941 30821 22197 14404 11339 3780 -1615 -2728 1162 -5011 -9979 -27209 -27061 -35822 -33863 -24135 -19481
4926 -19481 -20452 -9196 -10202 -14413 -1187 12916 28174 32048 19223 10241 4 5988 18024
4913 18024 15358 8994 7024 10363 -3311 -9527 -6164 5586 3847 -14428 -14294 -1762 7157 -2506
4899 -2506 1390 5438 9149 13459 3997 -21033 -22676 -16066 -20081 -21575 -17225 -12432 -2197 -3417
4885 -3417 -9779 -2038 -6135 -15416 -14338 -9052 -2730 -4227 -15084 -29264 -27839 -14237 -3291 2660
4871 2660 6969 -293 -9530 -8416 -19801 -28975 -31943 -22641 -19878 -8780 -3241 1494 -3227 -15659
4857 -15659 -20249 -6059 -7936 -16325 -3260 6016 5609 -5366 -22147 -26249 -12735 -2701 -6555
4844 -6555 -7776 -15584 -19330 -7927 -4724 -6821 -21064 -31264 -20240 -1741 -2042 2975 9720 8980
4830 8980 -4201 -4261 1402 -1468 -2166 4093 4238 10972 6725 4332 8690 2512 -1299 1677 -1844 6648
4814 6648 6103 -13694 -11029 -1192 12962 13235 17531 10085 2118 4751 6681 3101 3248 519 4382
4799 4382 -9117 -15901 -9977 5092 6856 9530 14565 11490 -5849 -9048 -16045 -24576 -21535 -11110
4785 -11110 -4342 12482 13594 5542 -650 -20201 -15566 -7577 -3658 -9078 -16958 -19427 -15089 -10008
4771 -10008 -10272 -6107 -9354 -13987 -1843 -8028 -17834 -21095 -22139 -26223 -27650 -10042 -7884 -19246
4757 -19246 -4632 10816 10123 726 -6700 8847 6965 -2810 -6301 1363 4711 -7778 -8114 7412
4743 7412 15664 15870 8925 73 -11479 -19480 -20998 -32951 -16641 1622 -4200 -21730 -23341 -9847
4729 -9847 469 -2119 -7821 -5685 6657 4073 8858 9808 -57 -8727 -11598 -8558 -8603 9605 19736
4714 19736 11940 -6600 -9530 -5693 -10168 -14539 -8148 -15156 -21624 -19112 -18784 -22625 -14776 -12699 -14647
4699 -14647 -4712 -6072 2523 7027 2844 313 6724 1775 -8290 -6926 -3603 -29205 -36244 -22129
4685 -22129 -27994 -27449 -21019 -14372 664 7811 -3993 -12721 -20807 -15539 -12173 -17893 -14968 -22135
4671 -22135 -22688 -19588 -23323 -18818 -9493 -19162 -21423 -4234 -3253 -13697 -6388 -4631 -2408 5119 14210
4656 14210 31998 33301 22198 10807 -7806 -14371 -17581 -10525 -4591 -53 -12787 -23057 -26547
4643 -26547 -12876 -1230 -1465 4807 22390 30035 23932 15564 20126 -5769 -11975 -15958 -18512 -22787
4629 -22787 -24933 -15927 -10159 -16629 -15185 -7415 -13054 -22611 -23427 -19474 -12825 -16709 -28748 -33643 -14498
4614 -14498 1197 11956 16777 6084 3336 4680 1279 580 6654 9820 -3553 -2617 6275 14192
4600 14192 6799 -12905 -12314 -8035 -7865 -7261 -8219 -8985 -11048 -4573 249 6880 7290 -4535 -24116
4585 -24116 -21718 -13500 -5306 -14480 -15211 -5082 1175 1499 -1455 7088 13644 610 -4907 798 1703
4570 1703 1231 459 9498 13144 2093 -7453 -4807 -2591 -6918 -4841 -2647 1584 -8849 -8104 -9916
4555 -9916 -8538 -11834 -21852 -21000 -18010 -9091 -20308 -26070 -18090 -16477 -14750 -7083 2196 -523 -3999
4540 -3999 -9029 -10069 -2782 -9043 -15757 -13472 -10732 1200 -2911 -1556 2361 10289 4386 874 11465
4525 11465 26515 27122 24298 11973 -865 5953 35823 37808 26574 19060 11711 3281 3021 -1115
4511 -1115 5398 12952 16051 -2441 -15021 -10812 -17286 -25426 -16787 -12408 -19899 -13471 -11203 -24694
4497 -24694 -36699 -17475 -1808 637 9360 1431 -5947 8546 11311 19256 12875 -353 -3320
4484 -3320 -19912 -32425 -26506 -21901 -24790 -28708 -11347 533 2347 917 -9241 -12560 -6770 -11367
4470 -11367 -5316 -14549 -11831 6818 12472 7807 6470 14294 528 -6909 -16048 -19314 -18924 -10710
4456 -10710 8711 1010 -15509 -29900 -27941 -21297 -8365 655 -241 -6938 -15263 -14562 -8843 -5947
4442 -5947 3697 5791 2807 11576 3664 -245 5355 -1547 -6483 -4562 -9344 -5296 9967 11180 7716
4427 7716 6623 -7221 -10942 -11381 -18624 -14563 -7880 -19000 -18151 -30684 -38129 -30685 -17045 -24734
4413 -24734 -28240 -19635 -5789 1707 12959 19258 14738 11511 13181 10639 12651 18795 24281 11629
4399 11629 7622 5466 9149 9003 4341 857 4007 7204 -747 802 8473 4948 -2506 8852 15196
4384 15196 3243 -880 4755 6684 24098 27291 4728 2227 8132 3938 3521 -16863 -25608 -25244
4370 -25244 -19539 -4254 4018 -248 -2617 2075 3676 -7109 -18536 -20190 -5574 -5901 -5089 -14487
4356 -14487 -8240 5889 636 -14839 -24904 -45010 -55892 -45266 -25589 -23162 -23089 -14576 -14977 -10748
4342 -10748 -4270 -6796 -15005 -19071 -19777 -18822 -12941 4151 7248 5650 7269 6320 17682 13820 13186
4327 13186 14322 10479 1533 -6626 -2043 -2621 -5091 -2785 -1830 -7528 -20230 -14426 2244 8192 -10002
4312 -10002 -19648 -19397 -13040 -9920 1188 25209 10472 -10333 -11513 -4575 -5314 -5589 156 9682
4298 9682 7475 5281 -1046 -14844 -13082 -662 -6403 -12500 -8202 -4506 8116 22104 19010 10330
4284 10330 8940 893 -8437 -6125 -10548 -21307 -30056 -33852 -27627 -10467 720 1205 -11961 -19943
4270 -19943 -10739 -7548 -3894 -11159 632 4177 8416 4713 7410 7207 -10828 -17140 -14882 -15991
4256 -15991 -3745 3846 -5510 -8866 -17751 -23911 -23753 -4509 -7232 -9526 -8816 -15483 840 12889
4242 12889 7636 -2647 5327 14216 15975 -302 4129 11475 9388 10041 12633 19327 9981 312
4228 312 -12876 -8900 -11057 -13566 -14696 -17019 -10226 -3565 7425 14916 6664 7013 9538 4095 -4308
4213 -4308 -22765 -25592 -8957 -187 3559 -6459 -8958 -1155 -5411 -3545 -2714 -10927 -13565 -5355
4199 -5355 138 8189 6523 8985 903 -8157 -14161 -15184 -20934 -13225 -11206 6579 5263 -3267 -6467
4184 -6467 -12729 -15614 -11268 -4061 -2616 1205 12031 18827 14220 -2225 -20680 -20507 -13311 -7058
4170 -7058 -6627 -8296 -198 9128 461 8500 19180 21697 3796 -6168 -594 -17 2913 4493 -8811
4155 -8811 -18510 -8737 -10896 -5757 -7725 -17188 -21137 -18242 -7789 19384 28142 25098 14072 9589
4141 9589 8545 8241 12544 379 3507 15558 6497 -3013 -2718 3961 -745 -1441 5890 -3245 -5205
4126 -5205 -2275 -26 -7544 -25918 -13258 -10955 -6437 -5677 -5124 -2427 692 14198 23787 13336
4112 13336 7290 2417 -5752 -9009 -9633 -1040 -8496 -26808 -37922 -26013 -12486 4804 3840 -3021
4098 -3021 -6733 -11013 -13878 -12333 91 9628 8692 6804 7398 11502 7114 4791 14980 12839 2013
4083 2013 -20812 -18515 -5464 -9814 -541 9906 13290 15826 16766 8595 8922 16707 16507 4941 2911
4068 2911 5759 9957 -557 -11103 -24852 -33336 -26150 -14315 1549 16664 17082 19996 11700 2679
4054 2679 -1609 -2842 424 2491 -8326 -17703 -11652 -840 -4501 -9513 -2896 3802 1978 -2421
4040 -2421 743 4060 6625 4359 7081 10104 8493 -34 66 10147 9455 21795 20914 14158 3956
4025 3956 1559 3608 12076 -257 -463 656 -7443 -8719 -8913 -2646 -10617 -6056 -4374 -1876 2345
4010 2345 -6679 -9865 -10433 -6102 -2564 -2896 -15968 -20626 -590 10322 15290 35717 36391 27694 16188
3995 16188 6087 5000 9352 12719 14460 12982 7235 12271 21009 16110 10264 7179 15878 29609
3981 29609 27526 20574 13533 7603 -3487 -2905 2911 -5038 412 -3845 -3130 -12622 -7955 -14999 -16936
3966 -16936 -16967 -13149 4105 8306 7489 11371 560 13967 24001 14123 2430 -7364 -822 4747
3952 4747 8101 5718 -1966 9088 947 -7591 -8650 -9752 1136 81 7159 15796 11297 4864
3938 4864 -4129 -12957 -8492 -1575 -13019 -14802 -893 -659 -1262 6261 19772 14502 19130 23929 14042
3923 14042 6562 11986 11255 6604 17305 24852 21395 2962 -2758 5077 9134 7144 7345 4685 614
3908 614 2750 10172 22050 19806 23739 16259 19261 38275 38018 10073 -6978 -3260 489 -585
3894 -585 -2460 -1838 8425 10792 14590 23633 13289 2970 394 -7168 -5231 -2720 -3102 -6752 -12016
3879 -12016 -13603 -6547 -5979 3251 11044 735 -10161 -11738 -13991 -10028 3355 7345 -11972 -11965 -7007
3864 -7007 -4595 -3333 -5399 10142 11819 3902 8393 14110 6385 -5998 4466 3952 -177 1667
3850 1667 -14737 -32348 -23240 98 14556 25772 19998 7465 -4774 -8851 -4149 -10371 -17053
3837 -17053 -13903 2425 5119 9333 26391 27412 6063 -2138 15854 8722 2401 4156 2818 6981
3823 6981 4392 5595 -4131 -693 7841 11950 8377 10613 15414 9658 -6009 -9130 -4098 -6245 -10052
3808 -10052 -6859 945 2561 1723 5044 3878 1774 15105 3218 -9658 -19668 -20382 -15408 -6797
3794 -6797 -8414 -3448 -11518 -13343 -30427 -35707 -26075 -10044 2933 1793 -2309 -2268 18129 25587
3780 25587 2491 -11470 -19522 -36518 -34870 -30149 -22755 -14309 -8942 8568 14264 8222 -1068 -3083
3766 -3083 1920 4767 -75 -19562 -24076 -26155 -12261 -6366 2104 646 -2990 1148 -1630 2840
3752 2840 2794 16389 30715 31314 20266 7187 9910 9720 9125 12106 -316 -2008 1691 10681 13387
3737 13387 -2327 -14370 -13769 -11001 -18867 -15234 -8576 -10764 -14705 -15166 -9800 -10211 -4937 1382 -2874
3722 -2874 -12338 -2299 -5013 -17119 -15311 -21033 -11977 -23904 -22361 -5444 -1893 -1297 -9025 -3336
3708 -3336 -2960 -14445 -10206 -12659 -3581 4501 4663 1159 4282 -5591 -5331 5759 16934 10766 5096
3693 5096 -1125 12711 23885 14255 6192 9131 14104 5681 5898 7293 13880 10372 9748 10846 23139
3678 23139 29969 20960 4582 -10938 -20488 -18705 -15230 -20912 -16283 -11531 -13957 -4986 -6007 -13222
3664 -13222 -9301 -4770 -13440 -24747 -16889 -6786 9635 16677 15494 2879 3549 2937 12553 15461
3650 15461 -7459 -18545 1576 -4610 -1849 3826 -12860 -19188 -10109 -20646 -9397 -10609 -17135
3637 -17135 -12742 -4204 490 15781 10043 -15696 -25789 -39085 -43947 -33798 -19373 -8331 -863
3624 -863 8212 12204 1157 -3170 -6827 -17213 -12000 -7470 -8594 -1766 7442 3186 -8114 -5864
3610 -5864 -12385 -7994 -6948 -14186 -9130 5765 15414 14308 18058 25729 31313 22319 10969 9732
3596 9732 6601 974 4052 15803 14470 9431 6739 -1489 -5950 -1939 -1628 900 -12340 -6994 4061
3581 4061 15412 5526 -7396 6816 13226 13064 8386 939 -3769 -12289 -12299 -13578 -11605 -7450 -384
3566 -384 10709 13619 3243 5180 -2707 7160 14824 11889 1243 6440 9380 -4200 1908 10163
3552 10163 -6281 -3516 -1999 -467 -6437 -16738 -10942 -13924 -7179 1890 -2804 -5431 -4719 -8408
3538 -8408 -15452 8322 7211 -1797 6522 2379 -10292 1522 5365 2754 -3915 -10661 2714 14849
3524 14849 3295 -7252 -3028 688 7988 -1682 -10848 -11111 -16452 -26198 -20355 -10904 -7354 -6867 -14319
3509 -14319 -10963 -10866 -11123 -20083 -11878 -15053 -14951 -4911 -2428 4709 -4452 -22065 -7461 1575 -3738
3494 -3738 -1383 -4601 -5246 -6792 6072 12211 7338 9473 6548 7599 2459 -17216 -26470 -11652
3480 -11652 2145 1125 -7482 -7655 -3781 1435 8367 2504 -15675 -28265 -29220 -7530 16059 9261
3466 9261 164 -8729 -8817 -2400 3584 2419 1870 1606 12757 8501 -5088 -8275 1054 4102 14085
3451 14085 20233 16109 24124 12280 -3986 -1697 11100 14835 7609 2962 89 11334 766
3438 766 -7991 -20530 -13025 -4921 -11030 -4872 -7758 -7105 -13001 -8357 4317 14868 -4928 -11230
3424 -11230 -4090 -6636 -15252 -19145 -20111 -12886 -2756 -2250 -3998 -1132 9632 26334 15945 6255
3410 6255 12693 15974 13346 11989 98 -1660 -17614 -3648 2123 -3322 -14860 -7288 3927 6747
3396 6747 5091 7851 9865 1184 706 -8345 -13145 -7097 -11167 -9609 -3388 12380 19311 22782 16645
3381 16645 10718 15877 7620 1288 546 -4935 -6993 -5216 7166 6984 -13535 -22544 -17056 -11837 -8045
3366 -8045 -14783 -21473 -8082 7085 1702 -12914 -13834 -890 12728 14358 9200 15059 18322 4617
3352 4617 1318 -10790 -5088 2093 11382 21837 191 -7960 -4227 -6074 -15640 -11000 -12731 -6936
3338 -6936 2639 14257 22799 19318 6223 78 5232 13692 22131 13063 11470 9351 3721 -8485
3324 -8485 -17473 -15337 -15199 -3485 10465 10702 22798 18302 2809 8426 6463 -3188 -17034 -19385
3310 -19385 -7518 -7371 -16578 -4926 556 13227 22733 10022 2902 14593 18748 5912 -3733
3297 -3733 1510 13232 -9889 -14307 -11477 -13202 -11382 -1045 4014 4358 7538 17574 6899 1284
3283 1284 -2074 3959 1800 -803 -2694 -840 -1814 -3782 640 6524 623 -753 -10284 -14439 -17020
3268 -17020 -6551 -4141 -20680 -14692 -4399 -13345 -21888 -23981 -13410 -5401 -6443 -7107 -5975 -6732
3254 -6732 -2070 7064 8443 5780 -376 5217 3867 -2485 -1782 332 -766 1063 4982 3977 1347
3239 1347 4751 15559 13470 12874 9246 -2259 -18012 -13010 -24394 -19452 -2214 -4996 4866 14779
3225 14779 22155 13344 11096 27039 28029 20411 26424 17546 60 -7773 -1361 -6299 -5468 -1051 138
3210 138 3285 6025 -1770 -4895 -167 -732 -8398 -4426 -1947 758 2381 1682 430 5668 5163 -3094
3194 -3094 -3455 6605 9387 10655 -3170 -1742 7449 -2843 12892 23105 36521 31592 14396
3181 14396 12490 15055 9175 16106 27954 16454 2610 -9453 -9152 -10192 -6237 7342 5118 9433
3167 9433 7360 -6045 -15762 -5795 -9081 -15454 -12261 -7159 -887 778 -5120 7188 13576 14175 4941
3152 4941 -7253 -11301 -22120 -15327 -7932 -14399 705 12708 1960 -11166 -6179 -10385 -4073
3139 -4073 1804 -9207 -9830 -11512 1206 2126 8164 11931 16489 16887 20867 8100 3237 15390 7413
3124 7413 -2634 -9555 -7724 -22491 -8614 -3766 -1572 1069 -11295 -10160 -10502 -2680 -2078 -15089
3110 -15089 -25625 -35541 -31228 -26239 -26364 -13976 -5085 -46 -12250 -19600 -17908 -22716 -18963 -8576
3096 -8576 -5221 -3646 -11385 -19559 -8559 -5139 1651 2113 -2212 -7067 -4149 7318 9336 6249 -1515
3081 -1515 -1886 -13293 -4591 9221 10442 3964 3353 1289 -4802 9549 11723 1639 3606 10602
3067 10602 10233 1434 -4538 1641 12770 7007 9248 14471 10797 -1610 -6975 12481 11276 7132
3053 7132 481 4469 10252 -603 -3525 -12766 -22866 -17838 -3174 8609 12185 114 -16331
3040 -16331 -21214 -22946 -13477 -705 10962 7100 -812 526 7589 5006 -17728 -22900 -7881 136
3026 136 3531 -4109 -9516 -2343 4960 19994 29683 22201 18852 10791 19856 18671 4356 1649 6730
3011 6730 7398 18519 24331 11043 417 -8955 -11053 -10189 944 14626 5833 -9178 -2068 7562
2997 7562 5287 -3024 -11330 -16541 -14313 -14938 -17131 -8245 -3661 -15009 -26701 -18976 -12573 -14778 -18782
2982 -18782 -25122 -14054 -8771 -13015 -5927 -9670 -7199 -8137 -5263 -822 3977 13794 20713 32836
2968 32836 27956 15680 10934 8472 11386 18273 20037 11880 2118 6418 21369 15475 14414 25176
2954 25176 29168 14378 -1294 3113 19576 18162 10680 9944 -1439 -2719 -9210 -16181 -6337 -5428
2940 -5428 11 -116 -6947 -9945 -4199 -4546 -5885 -16589 -27246 -21298 -19533 -27563 -22623 -9821 -719
2925 -719 4339 -3436 -14025 -13358 -7722 2573 9977 11360 11932 2939 2020 3776 15431 17049 12498
2910 12498 7823 15360 9724 16048 18981 24056 17730 195 -520 8492 -1111 -9872 -5502 -514 1002
2895 1002 -4815 -12940 -16315 -23290 -19347 -15487 -14960 -493 -3751 -4712 -176 -6272 -4711 -13440 -11744
2880 -11744 -18445 -21768 -3098 310 -6887 -3718 -9953 0 -5234 673 2613 2160 2451 -9685 -5919
2865 -5919 4727 3831 -12116 -22812 -23347 -24617 -21903 -24634 -25659 -24746 -30533 -32583 -26024 -10473 -7877
2850 -7877 -4861 3338 8320 7556 -575 -13445 -11009 -11948 -7333 1589 124 -7432 -13732 -19488 -18438
2835 -18438 -27765 -40090 -24928 -6320 -10298 -6468 2397 6 -2052 -11499 -18262 -28155 -19372 -6617
2821 -6617 -3351 -2972 -10199 -18486 -22301 -14036 1517 -2034 -9209 -22525 -20199 -19316 352 6029 8106
2806 8106 17673 1797 -6947 -15733 -24261 -10042 -1957 19934 -325 -14422 -22850 -19678 -20012 -3882
2792 -3882 8454 12569 10848 12907 25198 25258 20008 21309 18375 1211 -8967 -9845 -3219 -5628 -29740
2777 -29740 -17854 -4227 5032 5922 19123 18329 14556 13123 22599 24338 23138 8139 -3747 10472
2763 10472 -3187 -23303 -16218 -15708 808 -3509 -8460 4035 3783 7885 9218 13376 22306 18593
2749 18593 9014 3976 11953 972 3515 14242 11528 7532 5552 -9266 -11514 -11230 -1427 -8492
2735 -8492 -24222 -11261 3957 -930 -8742 249 7641 9545 7888 6433 -3692 -23046 -32564 -20266
2721 -20266 -10409 -4218 7087 12864 -4161 -14800 -15449 -16237 -8300 -8283 -13235 -17912 -20213 -9420 -1939
2706 -1939 -11880 -15478 -2615 -1890 -3176 3340 5895 65 -8303 -13364 -15396 -11537 -4173 -11110 -8447
2691 -8447 4173 -142 2235 1674 11538 8330 -6275 2344 6360 4518 6525 -1382 -17147 -26761
2677 -26761 -28965 -16540 -6653 -8025 -6056 -6410 -5927 -2228 1083 -9722 -8725 -11433 -17483 -20736 -13703
2662 -13703 2665 13320 8394 3935 -5681 -8991 -12432 -14707 -23590 -28157 -20245 -13601 -12214 7278
2648 7278 14890 27602 28238 20567 17622 16823 11832 10533 1548 7827 28670 26319 5676 -4547
2634 -4547 -5879 -2577 6226 4396 -53 2381 -1081 -9622 -16106 -28275 -24794 -11013 3367 6032
2620 6032 -2861 -9644 -10121 -12471 -11631 -6130 -5445 720 -7858 -25443 -32516 -34353 -21493 -3923 2553
2605 2553 7612 18510 9800 -9147 -20478 -9005 10791 8974 7958 -790 -10493 -22267 -9766
2592 -9766 2571 7613 13353 16536 23445 21837 -12336 -33271 -44358 -42417 -20155 -13022 -5421 12854
2578 12854 22411 9917 8209 11008 13221 21146 26282 24986 13980 6031 6174 11850 23112 14279
2564 14279 6262 10605 9098 -5325 2749 24186 31316 28742 24095 20316 6681 -5637 -2837 -6671
2550 -6671 -7435 -5062 -10797 -18261 -22869 -15549 -24091 -26473 -15956 -10407 -2618 3323 -5998 876 2234
2535 2234 -17364 -22105 -31115 -30896 -12712 -1364 7351 -2459 -17077 -14815 -10858 -7190 -1679 -2809
2521 -2809 -11156 -18673 -4525 4213 -6959 -12717 -11591 5761 10434 23749 16538 10545 4628 -2474
2507 -2474 5117 -2611 -31 -625 -11069 -3212 -1383 -7422 -9863 -10766 -8189 -6478 -9971 -15901 -20019
2492 -20019 -18489 -20939 -12438 -3148 1942 3247 903 7810 17234 15303 -1203 -4189 -616 -1890
2478 -1890 5966 6826 13532 10892 -582 -4311 1023 4476 -4550 -8038 -6512 4948 1368 4323 5789
2463 5789 13636 21302 25413 21031 19094 27920 21470 -3835 -22354 -12192 -13738 -4799 -11322 -21433
2449 -21433 -30992 -31365 -32281 -27167 -15157 -4056 -4507 -975 14096 13514 5858 9387 5471 -11363 -14206
2434 -14206 -5109 3364 -6246 -19086 -20775 -16661 -22498 -22241 -25268 -11999 -5179 -4898 -6805 -4984 -4362
2419 -4362 8298 24446 26590 20286 7671 6891 -9153 -2108 6582 8005 5524 6262 -2574 -4296
2405 -4296 -6935 881 12563 3051 -931 -4326 -11871 -7316 396 12016 13982 8823 -8156 -19934
2391 -19934 -22595 -5586 866 1233 -12088 -20146 -14178 -13125 -30453 -25373 -14742 -11870 -5810 -4079
2377 -4079 -2078 8622 10891 16896 1479 1163 974 1801 8378 4067 -8936 -15599 1701 3883 7555
2362 7555 10734 7417 953 569 1318 -8551 -21709 -15729 -9892 -8885 6756 15439 -4178 -3952 3770
2347 3770 18306 19535 3728 -2861 5405 11415 9375 18114 17725 14983 3869 -2661 647 5645
2333 5645 -9983 -7291 8005 22665 39478 42342 20611 4514 7795 3095 -8403 -9828 -9912 95
2319 95 5000 1600 4588 -2618 12540 8236 2591 7408 14158 12024 16506 12398 8410 5592 -1836
2304 -1836 -11518 -11727 -5496 -11535 -17720 -5861 120 780 13059 4346 -13585 -28762 -5949 11878
2290 11878 20179 14433 15348 20309 5222 14633 15544 7067 -7028 -10058 -11979 -14690 -2602 742
2276 742 12487 28346 23679 17090 8105 3045 26544 26087 4805 -4840 -17702 -19059 -15663 -18912
2262 -18912 -27534 -19206 -9358 315 6443 6466 1232 4587 19570 23766 13606 5788 4951 5921 6788
2247 6788 -3003 -7091 -3397 -625 -165 3511 9270 -583 -1233 -2119 397 -22515 -35653 -16571 6557
2232 6557 15750 24032 4694 -10115 -10819 -14132 -16994 -12714 -1431 13714 13001 -1036 1590 8453
2218 8453 7546 -4836 -18745 -12748 2750 16400 23220 3777 6605 2101 3382 7403 14068 17246
2204 17246 18331 14776 8759 1310 7221 16873 10395 -796 -3548 7238 19263 10021 -1135 2727
2190 2727 2161 9547 16796 15368 10675 -7386 -17918 -16253 -12034 -10858 -4352 -34 336 -1192 -12086
2175 -12086 -9264 -1536 -2564 4741 6565 -10707 -3740 -8431 -18438 -9669 -3316 -15434 -24661 -23070
2161 -23070 -25017 -20877 -6795 -2299 -14497 -13525 -14096 -14077 -15088 -23998 -33463 -26299 -15182 -6373 -7319
2146 -7319 5362 4406 -9290 -10456 -13286 -9089 4751 15212 10969 -3835 -11147 -1292 5060 52
2132 52 6774 3403 -16196 -17269 -9525 -5200 389 2216 4562 6084 4007 8601 6575 -3358 -15420
2117 -15420 -16810 -6140 -2090 -5453 -13491 -14922 -15879 -8574 3807 9553 5505 621 983 -7269 -3730
2102 -3730 11096 16367 3005 -7166 754 10086 18745 -158 -15457 -27630 -16430 -17136 -3763
2089 -3763 20020 23481 24589 14225 14342 20253 6165 -10252 -25480 -9060 -1380 2585 -3873 -18877
2075 -18877 -23693 -8696 5379 5456 -1205 -4258 -5963 -11049 -9597 -9897 -320 -956 -2656 -4020 -7803
2060 -7803 8969 16455 21558 24089 16332 -4010 -10192 -14542 -3272 2261 -6804 -6687 -3630 12018
2046 12018 20196 17695 19198 25356 21178 3997 -3998 3776 18108 5947 -5395 4174 6951 -1861
2032 -1861 -2818 2326 17658 11960 8779 13340 11571 9428 5032 -12442 2142 2487 2420 3906 11026
2017 11026 18411 19425 20626 28469 42650 32689 27395 19621 13652 18979 28611 27379 27570 26520 16994
2002 16994 13047 2266 2631 9808 13328 11537 -1419 8146 2541 2285 9416 16680 17066 22049 16542
1987 16542 15415 1446 -13102 3558 21018 10071 5054 2209 -7141 -7581 -12739 909 -6310
1974 -6310 -18959 -13816 -23533 -12407 -104 -14396 -24747 -16035 -21418 -30293 -16338 -12429 -13463
1961 -13463 -7778 -2701 10475 11084 3363 12263 7690 -1731 -3770 -7098 -3021 -5739 -17709 -13171
1947 -13171 -4742 8534 20991 16092 5816 -6714 -3410 -6239 3708 12148 19521 12795 7478 -4876
1933 -4876 -19649 -20608 -10765 -903 -2158 14254 13216 9734 6411 -5731 -9074 -12073 -4493 -7662
1919 -7662 -6589 10932 13595 10978 8120 2738 -11860 -10450 -6129 -21950 -13564 4956 9343 13449
1905 13449 20478 13603 -5811 -10292 -2974 -2407 -1844 6544 14933 18684 16305 16710 23289 15654 6254
1890 6254 3419 4744 15435 16421 11958 14161 12305 13706 18519 7452 8813 20042 20604 9497
1876 9497 11843 17859 -5983 -16861 -22397 -17285 -781 17660 24409 11513 2735 -6339 -18280
1863 -18280 -26166 -22812 -23604 -12965 -11270 -21020 -8080 7970 10956 26020 31221 28881 21680 2234
1849 2234 4841 2181 5075 -1588 -1915 -4774 -10244 8738 17023 15716 18782 12284 20504 23204 6038
1834 6038 1207 12115 13023 10128 7966 5434 1258 -4131 9442 20061 22205 36209 45251 39662
1820 39662 25330 21687 20639 7908 -2685 -13920 -12797 -1648 14584 28947 23205 16078 5312
1807 5312 7441 7514 16385 22466 26682 12804 345 -137 2767 11271 1386 -6856 -7132 -1238 -5596
1792 -5596 -19575 -18993 -16861 -3285 3440 9873 4409 2832 -9786 -14348 -9168 -13993 -13906 -15411 -8530
1777 -8530 -2297 -5374 -11617 -5237 -8622 -1863 12270 10790 1837 265 -1468 12611 21154 23511
1763 23511 23001 16450 7029 -6563 -18542 -15493 -5770 626 -3055 -4443 2661 101 -5205 -4630 10417
1748 10417 6762 3635 8764 10597 14654 5916 3052 9054 20750 22738 26641 18979 9565 3565
1734 3565 1597 6094 15126 18169 -8853 -12898 9610 20467 14593 11705 14190 13480 12679 13252 18034
1719 18034 25148 22415 9975 -1015 -11885 -15397 -7681 -3253 750 -6329 -10304 -6641 1595 528
1705 528 3430 4203 10228 18504 25867 19329 -4446 -155 -1262 15359 19367 20370 -7294 -5332 13332
1690 13332 19550 9430 5241 9253 12208 586 -6835 -749 -10869 -21769 -23907 -16097 -6478 -14253
1676 -14253 -22679 -24053 -19908 -23977 -19805 -19873 -13812 -13194 -4132 -6843 -4452 -3370 2137 6045 9094
1661 9094 24011 34342 34817 21563 8876 8880 -285 -2132 7950 14684 13775 14081 24964 26154 26589
1646 26589 18958 10220 8576 19090 3098 -6761 1042 -1492 8410 12080 7350 -5015 -15758 -20075
1632 -20075 -13004 -2759 -15874 -12248 -10903 -4584 5748 14325 21540 28386 25749 13622 9028 9041
1618 9041 -2211 -5247 -7523 -5599 -1974 7291 21800 23313 15455 8591 11275 24558 25468 26233 31681
1603 31681 28530 12726 3705 11597 10024 8837 7530 140 -8180 1751 26052 37375 35026 19857
1589 19857 5953 -180 1379 5144 7319 -2878 -6963 8399 4308 -2559 2788 11398 15805 -9125
1575 -9125 -16361 -4321 7418 16062 20418 15090 10225 14926 18726 15653 10321 821 4758 -3845
1561 -3845 -3367 -5179 -8120 -10770 -5470 -9868 1419 2736 11013 885 -5550 11176 5721 -1784
1547 -1784 16435 13366 10783 6665 -2967 -2704 -9784 -14058 599 5991 -4295 -16331 -18585 -6846
1533 -6846 -4899 -2016 5943 6210 8468 -1454 295 9249 15392 23012 22237 24804 31588 28175 20468
$$ [...]
##END NTUPLES=NMR SPECTRUM
##END=
