##TITLE=Analysis number 323973
Compound Code cc 47504
Book Reference 508/18
Project Code adrs
Chemist Name antons
##JCAMPDX= 6.0         $$ Bruker NMR JCAMP-DX V2.0
##DATA TYPE= NMR SPECTRUM
##DATA CLASS= NTUPLES
##ORIGIN= Bruker BioSpin GmbH
##OWNER= nmr
$$ XWIN-NMR		Version 3.5
$$ Thu Nov  9 17:15:44 2006 GMT Standard Time (UT+0h)  MAYBRIDGE\nmr@NMR_250MHZ
##.OBSERVE FREQUENCY= 250.131544655141
##.OBSERVE NUCLEUS= ^1H
##.ACQUISITION MODE= SIMULTANEOUS (DQD)
##.ACQUISITION SCHEME= undefined
##.AVERAGES= 16
##.DIGITISER RES= 18
##SPECTROMETER/DATA SYSTEM= dpx250
##.PULSE SEQUENCE= zg30
##.SOLVENT NAME= CDCl3
##.SHIFT REFERENCE= (INTERNAL, CDCl3, 0, 16.4564)
##AUDIT TRAIL= $$ (NUMBER, WHEN, WHO, WHERE, WHAT)
$$ ##TITLE= Audit trail, XWIN-NMR		Version 3.5
$$ ##JCAMPDX= 5.01
$$ ##ORIGIN= Bruker BioSpin GmbH
$$ ##OWNER= nmr
$$ C:\u/data/dgb/nmr/ADRS/2610/pdata/1/auditp.txt
$$ ##AUDIT TRAIL=  $$ (NUMBER, WHEN, WHO, WHERE, WHAT)
(   1,<2006-11-09 17:15:16.01 +000>,<MAYBRIDGE\nmr>,<NMR_250MHZ>,
      <created by zg, POWCHK disabled, PULCHK disabled
       configuration hash MD5:
       49 4B E0 1D 92 C2 6B 37 9F E6 65 BC 52 41 86 1D
       data hash MD5: 64K
       BC 8B DE 97 CC 96 11 F8 28 23 1A 88 45 75 5C FC>)
(   2,<2006-11-09 17:15:33.44 +000>,<MAYBRIDGE\nmr>,<NMR_250MHZ>,
      <Start of raw data processing
       ef LB = 0.3 FT_mod = 6 PKNL = 1 SI = 32K 
       data hash MD5: 32K
       D2 3D 16 55 88 50 21 0C 00 74 2D 70 18 F8 48 82>)
(   3,<2006-11-09 17:15:35.08 +000>,<MAYBRIDGE\nmr>,<NMR_250MHZ>,
      <apk 
       data hash MD5: 32K
       EA 75 9D 06 A2 D7 3D 7A DF 8B 40 C8 BB AD C1 8A>)
(   4,<2006-11-09 17:15:35.79 +000>,<MAYBRIDGE\nmr>,<NMR_250MHZ>,
      <abs ABSG = 5 
       data hash MD5: 32K
       64 0E 9F 82 BE 2D 2D A7 81 50 66 01 12 47 1F B4>)
$$ ##END=
$$ 
$$ hash MD5
$$ F0 90 8A 18 7A 4E E7 4E 54 64 A8 50 D8 EF 3C F3
##$RELAX= 
##$RELAX= 
##$RELAX= 
##$RELAX= 
##$RELAX= 
##$RELAX= 
##$RELAX= 
$$ Bruker specific parameters
$$ --------------------------
##$DU= <C:\u>
##$EXPNO= 2610
##$NAME= <ADRS>
##$PROCNO= 1
##$TYPE= <nmr>
##$USER= <dgb>
##$AMP= (0..31)
100 100 100 100 100 100 100 100 100 100 100 100 100 100 100 100 100 100 
100 100 100 100 100 100 100 100 100 100 100 100 100 100 
##$AQSEQ= 0
##$AQ_mod= 3
##$AUNM= <au_zg>
##$AUTOPOS= <6 >
##$BF1= 250.13
##$BF2= 250.13
##$BF3= 250.13
##$BF4= 250.13
##$BF5= 500.13
##$BF6= 500.13
##$BF7= 500.13
##$BF8= 500.13
##$BYTORDA= 1
##$CFDGTYP= 0
##$CFRGTYP= 5
##$CHEMSTR= <none>
##$CNST= (0..31)
1 1 145 1 1 1 1 1 1 1 1 1 1 1 1 1 1 1 1 1 1 1 1 1 1 1 1 1 1 1 1 1 
##$CPDPRG= <>
##$CPDPRG1= <>
##$CPDPRG2= <>
##$CPDPRG3= <>
##$CPDPRG4= <mlev>
##$CPDPRG5= <mlev>
##$CPDPRG6= <mlev>
##$CPDPRG7= <mlev>
##$CPDPRG8= <mlev>
##$CPDPRGB= <>
##$CPDPRGT= <>
##$D= (0..31)
0 1 0 0 0 0 0 0 0 0.06 0 0 0 0 0 0 0.0002 0 0 0 0 0 0 0 0 0 0 0 0 0 0 
0 
##$DATE= 1163092514
##$DBL= (0..7)
120 120 120 120 120 120 120 120 
##$DBP= (0..7)
150 150 150 150 150 150 150 150 
##$DBP07= 0
##$DBPNAM0= <>
##$DBPNAM1= <>
$$ [...]
##$SUBNAM7= <"">
##$SUBNAM8= <"">
##$SUBNAM9= <"">
##$SW= 20.6930455092707
##$SWIBOX= (0..15)
0 0 3 0 0 0 0 0 0 0 0 0 0 0 0 0 
##$SW_h= 5175.983436853
##$TD= 65536
##$TD0= 1
##$TE= 683.16
##$TE2= 300
##$TE3= 300
##$TEG= 300
##$TL= (0..7)
0 120 120 120 120 120 120 120 
##$TP= (0..7)
150 150 150 150 150 150 150 150 
##$TP07= 0
##$TPNAME0= <>
##$TPNAME1= <>
##$TPNAME2= <>
##$TPNAME3= <>
##$TPNAME4= <>
##$TPNAME5= <>
##$TPNAME6= <>
##$TPNAME7= <>
##$TPOAL= (0..7)
0.5 0.5 0.5 0.5 0.5 0.5 0.5 0.5 
##$TPOFFS= (0..7)
0 0 0 0 0 0 0 0 
##$TUNHIN= 0
##$TUNHOUT= 0
##$TUNXOUT= 0
##$USERA1= <user>
##$USERA2= <user>
##$USERA3= <user>
##$USERA4= <user>
##$USERA5= <user>
##$V9= 5
##$VALIST= <valist>
##$VCLIST= <CCCCCCCCCCCCCCC>
##$VD= 0
##$VDLIST= <DDDDDDDDDDDDDDD>
##$VPLIST= <PPPPPPPPPPPPPPP>
##$VTLIST= <TTTTTTTTTTTTTTT>
##$WBST= 1024
##$WBSW= 4
##$XGAIN= (0..3)
0 0 0 0 
##$XL= 0
##$YL= 0
##$YMAX_a= 605197
##$YMIN_a= -385072
##$ZGOPTNS= <>
##$ZL1= 120
##$ZL2= 120
##$ZL3= 120
##$ZL4= 120
##$ABSF1= 16.45643
##$ABSF2= -4.236742
##$ABSG= 5
##$ABSL= 3
##$ALPHA= 0
##$AQORDER= 0
##$ASSFAC= 0
##$ASSFACI= 0
##$ASSFACX= 0
##$ASSWID= 0
##$AUNMP= <proc_1d>
##$AZFE= 0.1
##$AZFW= 0.1
##$BCFW= 0
##$BC_mod= 0
##$BYTORDP= 0
##$COROFFS= 0
##$CY= 12.5
##$DATMOD= 1
##$DC= 0
##$DFILT= <>
##$DTYPP= 0
##$F1P= 14.0000005364418
##$F2P= -0.99999901652339
##$FCOR= 0.5
##$FTSIZE= 32768
##$FT_mod= 6
##$GAMMA= 0
##$GB= 0
##$INTBC= 1
##$INTSCL= 1
##$ISEN= 128
##$LB= 0.3
##$LEV0= 0
##$LPBIN= 0
##$MAXI= 10000
##$MC2= 0
##$MEAN= 0
##$ME_mod= 0
##$MI= 0
##$NCOEF= 0
##$NC_proc= -4
##$NLEV= 6
##$NOISF1= 0
##$NOISF2= 0
##$NSP= 0
##$NTH_PI= 0
##$NZP= 0
##$OFFSET= 16.45643
##$PC= 1
##$PHC0= -36.1832
##$PHC1= -3.096404
##$PH_mod= 1
##$PKNL= yes
##$PPARMOD= 0
##$PSCAL= 4
##$PSIGN= 0
##$REVERSE= no
##$SF= 250.130016399031
##$SI= 32768
##$SIGF1= 0
##$SIGF2= 0
##$SINO= 400
##$SIOLD= 32768
##$SREGLST= <1H.CDCl3>
##$SSB= 0
##$STSI= 32768
##$STSR= 0
##$SW_p= 5175.98343685301
##$SYMM= 0
##$S_DEV= 0
##$TDeff= 65536
##$TDoff= 0
##$TI= <Analysis number 999999
Compound Code 99
Book Reference 9
Project Code 9>
##$TILT= no
##$TM1= 0
##$TM2= 0
##$TOPLEV= 0
##$USERP1= <user>
##$USERP2= <user>
##$USERP3= <user>
##$USERP4= <user>
##$USERP5= <user>
##$WDW= 1
##$XDIM= 32768
##$YMAX_p= 496353222
##$YMIN_p= -335786
$$ End of Bruker specific parameters
$$ ---------------------------------
##NTUPLES= NMR SPECTRUM
##VAR_NAME=  FREQUENCY,     SPECTRUM/REAL,   SPECTRUM/IMAG
##SYMBOL=    X,             R,               I
##VAR_TYPE=  INDEPENDENT,   DEPENDENT,       DEPENDENT
##VAR_FORM=  AFFN,          ASDF,            ASDF
##VAR_DIM=   32768,         32768,           32768
##UNITS=     HZ,            ARBITRARY UNITS, ARBITRARY UNITS
##FACTOR=    0.157963299565203, 1,           1
##FIRST=     4116.24721462125, 0,            0
##LAST=      -1059.73622223176, 0,           0
##MIN=       -1059.73622223176, -335786,     0
##MAX=       4116.24721462125, 496353222,    0
$$ Real data points
##PAGE= N=1
##DATA TABLE= (X++(R..R)), XYDATA
$$ [...]
21079b3162L5856n4913k6907L8798K9486N493N4758L4642j58096n0403R454P1954
21067c3040k0131q1941K193O3004J3415j7578l8532M8034M8232K3694N8330l2253
21055C3427l3872n884n3634Q722O410P130R464n4137L1787J0885m24M682k525
21042c7969o57k7613l5614k4082O0789n3163o27k0059J7982J2447m5183k4771
21030a78520J1231k6911m1439L5330J44827Q25M9864j0250L279J0269k7809N2997
21018B3693O6976M7250o0256j57803k4559L6941J7824J522M2075L4896k7427j6930
21006a5798l5109j2201J7975L8055K3161n9428p2870K0977Q3387J8716K0622L8755
20994F6242j04407q2661j6126K5871R6409J19781L230k4663m2876M204O33j2009
$$ y = [-23162, 12694, -42219, -69126, -30328, -842, 4651, 59409, 94051, -64045, -114448, -104994, -33040, -53171, -135112, -132919, -69915, -56500, -74078, -112610, -64576, -16344, 7350, 65680, 33427, -445, -6329, -59963, -51241, -44831, -37701, -28237, -82374, -50587, -39702, -40126, -35444, -37969, -38626, -66239, -101853, -125935, -65146, -118309, -118936, -138995, -121013, -108566, -153749, -178520, -167289, -194200, -235639, -200309, -55482, -54657, -4793, -15043, -11764, -1495, -29304, 23693, 90669, 137919, 77663, -80140, -104699, -67758, -49934, -48412, -6337, 28559, 1132, -15798, -50907, -63108, -45133, -7078, 16083, -43345, -116215, -95238, -11851, 6865, 27487, 66242, -38165, -120826, -136952, -111081, -14672, 105109, 108339, 83676, 40800, 45004, 45637, 33628]
20982C3628n7812R853R919J0661k1340m7548n4325K5123L9696m3874N2597l0338
20970g3760j3430J11374J065k2232p0323p4766K0392j374M3973K8384p174l1516
20958h9387k5453K4340N7616k3614m2321Q3438J2617o8546j3763l4451j3761J1931
20946a21354m0659j331m160P4060q933l2466P016P9624L0560k6828O8552N9306
20934H3387M9181j19487R814L7667r1223l8360R0614l0245j14151m1862R1216
20923g3449R5305Q3782K2901j4284k7127n5714K1840l0418L135k4066p1404j442
20911g0941L842L5212P7987P379m2605j2875L4347K8756m9755L3089L6139o2223
20899A8352n091L2116l3709k2871q9166o5892P4866Q9728j8057K8072Q1184k3354
$$ y = [33628, -24184, -14331, -4412, 6249, -15091, -62639, -116964, -91841, -52145, -96019, -43422, -73760, -87190, 24184, 25249, 3017, -67306, -142072, -121680, -123054, -79081, -50697, -57871, -89387, -114840, -90500, -32884, -56498, -98819, -15381, -2764, -71310, -85073, -119524, -133285, -121354, -162013, -163344, -167504, -93444, -102377, -134843, -127827, -48203, -17643, -44471, 24081, 83387, 132568, 13081, 22895, 60562, -30661, -69021, 21593, -8652, -122803, -164665, -73449, 21856, 105638, 128539, 114255, 87128, 31414, 53254, 22836, 25971, 1905, -69499, -70941, -67099, -31887, 46100, 53479, 10874, -2001, 32346, 61102, 11347, 44436, 80575, 18352, 13261, 45377, 11668, -11203, -100369, -166261, -91395, -1667, -19724, 8348, 89532, 66178]
20887F6178r6601J8247L6750j1908O8817n5129m0474j0774l6560k7702l5817L9000
20875h5973N4902l3825P1707k4246q4795L3038K1366p1255r0156O8710J00223
20864d0304R7849m6435o492m6371J0051O9320j04524J8174L7049Q7817l3815l5064
20852G255M087l1244m9235P1171L1162n6570K3154K5442K1986L3391K4479q3814
20840B1264r2289O0970L2891l0754l5803k3359m7109O2212L4869j8103K9654N3521
20828D7964J4164n0476J0128j615N602J6532O591j8462l9157n2786L4352O7081
20816C9918n7063q819r316K9297j150J4462L9267r435J4215n1266l9571P5816
20804C6355M0373L6844N8661J8586p0359r6877p656N7718O5500n570q361R1461
$$ y = [66178, -30423, -12176, 24574, 12666, 81483, 26354, -14120, -24894, -61454, -89156, -124973, -85973, -31071, -64896, 6811, -17435, -102230, -69192, -47826, -119081, -209237, -140527, -40304, 57545, 11110, 4618, -41753, -31702, 37618, -66906, -48732, -11683, 76134, 42319, 7255, 11342, -19902, -69137, 2034, 33196, -23374, -220, 25222, 47208, 80599, 105078, 21264, -71025, -10055, 22836, -7918, -43721, -67080, -114189, -51977, -17108, -35211, -5557, 47964, 62128, 11652, 21780, 20165, 25767, 42299, 48890, 30428, -8729, -61515, -27163, 39918, -17145, -25964, -35280, -5983, -7133, 7329, 46596, 37161, 51376, 110, -39461, 36355, 76728, 113572, 172233, 190819, 120460, 23583, 15927, 73645, 139145, 133575, 125214, 216675]
20792B16675M8769j10411k36836K816l0930o1191M4425Q9990J05533M1322k1360
20781H8802J7886m7647q9138L3606L3251k1975L4191q358l6339j4364j0388P614
20769a2859K242n609J3286J51068J1236m2418r0128j5076N2158m6210k7409K7066
20757A7347Q678M9401P7033l288o1803o9603l3503R2203m695N224m6514J09811
20745A40291n673j13289n8258Q3708N2733n0165j6396L9989J8841Q1231J0122
20734A83134m5634l0270m7262O92L571n2975m7849L6914k5208q94o0736J8663
20722f7854N5272O9970l7797p3218J2587L5246k1110n2651P0845K3663p1446l2825
20710h9318O8278K0438L7714q9915j19371L54k415q0007O5763L4965Q5263J31089
$$ y = [216675, 265444, 155033, -81803, -78987, -109917, -171108, -126683, -36693, 68840, 110162, 88802, 106688, 59041, -30097, 3509, 36760, 14785, 48976, 40618, 4279, -10085, -20473, -12859, -10617, -16226, -2940, 148128, 159364, 116946, 26818, 11742, 63900, 17690, -9719, 17347, 26025, 75426, 152459, 149171, 87368, 17765, -15738, 76465, 71770, 76994, 30480, 140291, 134618, 21329, -36929, 46779, 99512, 49347, 32951, 72940, 91781, 173012, 183134, 137500, 107230, 59968, 60660, 64231, 11256, -36593, 321, -24887, -25781, -86517, -67854, -12582, 57388, 19591, -53627, -41040, -5794, -26904, -79555, -8710, 14953, -56493, -89318, -21040, -602, 37112, -52803, -172174, -171820, -174235, -254242, -188479, -153514, -68251, 62838]
20698F2838J3270j7185m9913N5622Q6709j03968O516J2512l8544J9683n7809k6912
20686c7181J7808N7639L6859k25p5610K7105L2148j19624o1587P3048p1499o8367
20674a89486O4771N955K84M8710J18052j3421l6827p4811k3150r952O1627O7521
20662A9273q869j9097n3328N6097N6040L0121J0893M6610p0244o7208J3570M9787
20650F3645M2489n5974q638n9151q4752p373R5672M4233m4994J3864R666L942
20638A2629q2209J4191J17839l1622j08627j30340L5727J13016J1904K7578k4789
20627d4703n6702j5375n364P4038J05149Q8604o7998q397j3527P470l2627l6158
20615e590k1545Q8783k132m2955j9279l2797N1347k7855j9162N9084N632o9649
$$ y = [62838, 76108, 58923, 9010, 64632, 151341, 47373, 53889, 66401, 27857, 47540, -10269, -37181, -19373, 38266, 75125, 74900, -710, 26395, 58543, -61081, -122668, -49620, -121119, -189486, -124715, -118760, -118476, -69766, 48286, 34865, -1962, -76773, -99923, -109875, -48248, 19273, 10404, -8693, -62021, -5924, 50116, 80237, 91130, 137740, 67496, 288, 13858, 63645, 106134, 50160, 41522, -17629, -102381, -109754, -14082, 30151, -14843, -979, 8687, 12629, -69580, -55389, 62450, 30828, -77799, -208139, -172412, -59396, -47492, -19914, -44703, -101405, -116780, -122144, -48106, 57043, 145647, 77649, 69252, 55725, 63195, 30568, -5590, -27135, 61648, 59516, 16561, -2718, -35515, 15832, -12023, -31185, 27899, 33531, -36118]
20603c6118N08O779K3870Q2519K3233j00197q5612R0742L1173n829M2466N9033
20591A32567J11039m6940o3577r975k6706l2307Q566L7823M3281m7282N1756J9551
20579A77796r352n9953L7442Q4569n8544p1927l3100l0489l9191R1624P1851J4892
20567A75618k5731n4589p1924j5667n0115l8093M7328L7284O574J7710j9260o4374
20555e5239l5747k0311k3304K0144N6680K0915m7201Q6867K4319L176M8325k6575
20543E2049j22532N1148R3104N5955l8236n4504N7901K5487J8196j1947o4126
20532F2495N6171n8221o9708n9033n5661K1689J7534J1579J07271O3689k5973
20521G1832q2800M9405m312q4583k892L0398L405P3471P6394k6829o3000n4024
$$ y = [-36118, -35610, -28831, -4961, 77558, 100791, 594, -85018, 5724, 36897, 31068, 73534, 132567, 243606, 196666, 133089, 123114, 96408, 64101, 72667, 110490, 153771, 106489, 158245, 177796, 168444, 108491, 145933, 230502, 171958, 100031, 66931, 36442, -2749, 88875, 160726, 175618, 149887, 95298, 23374, 7707, -42408, -80501, -33173, 4111, 10685, 28395, 9135, -55239, -90986, -111297, -134601, -114457, -57777, -36862, -84063, 2804, 27123, 30299, 78624, 52049, -70483, -19335, 73769, 129724, 91488, 36984, 94885, 120372, 138568, 126621, 62495, 118666, 60445, -9263, -68296, -123957, -102268, -84734, -73155, 34116, 97805, 71832, -10968, 38437, 34125, -50458, -53350, -22952, -19547, 53924, 130318, 103489, 40489, -13535]
20509a3535K5559M0586m4683Q387Q181M009m5092l4888O426O498m7458J07145
20497B1135M2457m1649o6921K2169L6726k7962n3031M4894L2083J2024j4222J136
20485H839O1640M8580j9760m0905l3329k7884r052N6246J11845l645n0786K5758
20473A27547j2605n1762r6379r8881j5305P0537J0654K0168L1317j5473l6878
20462f7060r0590k5227P7257N1359j4680N1121P4999L7912M1557p9823n6246J6715
20450A7294K1478Q795M6711M0610N6912r0624q6326J1761M2350L5681p4288J464
20438C1818K6827M0341l9787J5199n6143l2495l5375O156Q839P3754J02917J4899
20426A56950o3428L6697N2188m778j02934m6645L7234J02369M4333l9683r8101
$$ y = [-13535, 12024, 52610, 7927, 16314, 24495, 28504, -16588, -51476, -45050, -38552, -86010, 21135, 63592, 21943, -44978, -22809, 13917, -14045, -67076, -22182, 9901, 21925, 7703, 8839, 70479, 119059, 99299, 58394, 25065, -2819, -11871, 44375, 156220, 152575, 101789, 127547, 114942, 63180, -33199, -132080, -147385, -76848, -66194, -46026, -14709, -30182, -67060, -157650, -182877, -105620, -54261, -68941, -17820, 57179, 95091, 136648, 56825, 579, 17294, 38772, 47567, 94278, 134888, 191800, 101176, 14850, 26611, 68961, 104642, 30354, 31818, 58645, 98986, 59199, 74398, 18255, -14240, -49615, -43459, -34620, 39134, 142051, 156950, 93522, 130219, 182407, 177629, 74695, 28050, 65284, 167653, 211986, 172303, 74202]
20415G4202j00587m5858m6138J05007K2107J8823M444n0969J4871L0281O9751
20404I5934M3179N9852K3989K8524O1628Q833Q9545M2443J22425O0000k990J73645
20392H07007K02754J72786N2557J08907M2902j26858n6147o4448j54484j36354
20382H48622j28985r2021j60805r3412q720m6922l1085K4808j5208k5654L3347
20371C03965k2833n3713o0033n3401M2104P2147J20567k0121O5201k8868p927
20360C57088J50240J7159j38170n0102j5069J6013P3638P0138p6155j75799j28629
20349A00352k290O7819j2764K8912K4742r397m887k4880m0456L3890n6769p6201
20337B8071R221j7200q7672N9687J09037Q4219L0630j558n6294n1830O0423L4624
$$ y = [74202, -26385, -72243, -118381, -13374, 8733, 27556, 32000, -18969, -4098, 26183, 95934, 139113, 198965, 222954, 251478, 313106, 321939, 411484, 453927, 576352, 636352, 633362, 807007, 1009761, 1182547, 1235104, 1344011, 1386913, 1260055, 1203908, 1139460, 984976, 848622, 719637, 627616, 466811, 373399, 364679, 317757, 286672, 311480, 296272, 270618, 303965, 281132, 227419, 167386, 113985, 156089, 228236, 348803, 328682, 393883, 365015, 357088, 507328, 524487, 386317, 336215, 321146, 337159, 410797, 480935, 404780, 228981, 100352, 98062, 165881, 153117, 182029, 206771, 197374, 192487, 167607, 127151, 161041, 104272, 28071, 37292, 20092, -67580, -7893, 101144, 185363, 215993, 214435, 158141, 106311, 166734, 201358]
20325B01358j8772j28955M876J7733p0932j4465l4798L5725J07035J06976q3792
20314A21989l3024K7802K4272P843m1173O1669N0758r9877q7895l6416L9507j97
20302C5258O9510K9913m4920n2538M7149M3722O7579K2554M0494j58339q0402
20291A9980k3329k4427M4659o378r20M8714n099j22190J8393K3842j8872j6742
20279f2369Q0264o298O5706m7936k6073j8178M2477L47J8167N3165p0193l3395
20267d316N3027P5013Q6406l567p0938K2861j4737J7728r2181l3027J5021n2142
20255h52L0521Q3303k8683L5789M3119L7349M9857q5945p8584m7266k7217p815
20243C576O3844j0600J28343k5603k9959J3775j4798p2717J1416o6962o0176Q0644
$$ y = [201358, 182586, 53631, 58507, 76240, 5308, -9157, -43955, -8230, 98805, 205781, 121989, 88965, 116767, 141039, 148882, 107709, 169378, 220136, 120259, 32364, -4052, 35455, 35258, 104768, 134681, 89761, 37223, 84372, 128094, 195673, 218227, 258721, 100382, 19980, -3349, -27776, 16883, 10505, 9585, 58299, 53200, -68990, -50597, -26755, -45627, -62369, 17895, 11597, 77303, 29367, 3294, -14884, 27593, 27940, 46107, 99272, 29079, -4316, 48711, 123724, 210130, 206563, 135625, 158486, 143749, 161477, 69296, 36269, 51290, -852, 29669, 112972, 84289, 120078, 163197, 200546, 250403, 164458, 85874, 38608, 11391, 3576, 67420, 56820, 185163, 159560, 129601, 143376, 128578, 55861, 67277, 315, -59861, 20783]
20231B0783J2706J5720m0882K5839O9722M3292N8987J19504j7603q0486m6138
20220A81444K1790K7297K8621m7496o5439n1125m406M1813K5574L5363K7445j6046
20208B04835j4584M0693o3895l0201j7215m4784J8921m7636J1334K8498N7128
20197A43094M0918q2073q6097k7651M7286J7958J9372M9329j0746m6832Q5020
20186A49578Q6435m3300l0776O6322q9638l3757L7697j5160J0770K3744j4135
20175A47780k2694m372j4668J5327J1772l6732Q3n9585O1510O3618L4515O7972
20163B64526N6484m4774k8627p9671o8100m994O8372J4918J0003M9160m3136k9651
20151A64510n9423L0619N7193Q210M5653k3014P072n1093q8659L467M114o2204
$$ y = [20783, 33489, 49209, 8327, 34166, 103888, 147180, 206167, 325671, 308068, 227582, 181444, 203234, 230531, 259152, 211656, 146217, 95092, 90686, 132499, 158073, 193436, 220881, 204835, 190251, 230944, 167049, 136848, 119633, 74849, 93770, 46134, 57468, 85966, 143094, 184012, 101939, 15842, -11809, 35477, 53435, 72807, 122136, 111390, 64558, 149578, 236013, 192713, 161937, 228259, 138621, 104864, 142561, 127401, 138171, 161915, 147780, 125086, 120714, 106046, 121373, 133145, 96413, 96496, 36911, 98421, 162039, 196554, 264526, 321010, 276236, 247609, 167938, 99838, 94844, 163216, 178134, 188137, 237297, 194161, 164510, 105087, 135706, 192899, 201109, 246762, 223748, 230820, 179727, 91068, 94535, 98649, 36445]
20139C6445M2637J35744J3639L9817J5324K140J5530m2117o200o8252o221N5222
20127B33708O4773M9054o7792j09919l0969K3966J8083L735Q225l1303o8126o2188
20115C1247N8152P5394M6200l5992J7278k8786o9342O0760n604j7301J0093N227
20103A47326r1297L4167M4345L667m4914r5505q730J32133O6429P2025J6241p5205
20091B00682q9624n716j4470n87N5141J26k5171k750j4066l51M6321L2573P015
20078A89123M5341L542j15580m4715n3710Q3586j5295r064M5877p6897K5759R5647
20066A73614j1338O491K2543m8386L3661m1879j6803O0903k6483j07681K3048
20055F7690N6924L3859m1616p1722j5568o671P367J11071N0238p6J3002m1099
$$ y = [36445, 79082, 214826, 228465, 268282, 283606, 285746, 301276, 259159, 252959, 184707, 178486, 233708, 298481, 347535, 279743, 169824, 138855, 162821, 180904, 184639, 192864, 161561, 93435, 31247, 89399, 164793, 210993, 175001, 192279, 163493, 94151, 154911, 149307, 132006, 142099, 147326, 56029, 90196, 134541, 138208, 93294, -2211, -10941, 121192, 187621, 259646, 275887, 200682, 111058, 105342, 90872, 90285, 145426, 145552, 120381, 117631, 103565, 103214, 149535, 182108, 189123, 234464, 238006, 122426, 77711, 24001, 107587, 92292, 83228, 129105, 52208, 77967, 173614, 162276, 168767, 191310, 142924, 176585, 134706, 117903, 178806, 152323, 44642, 67690, 124614, 158473, 116857, 45135, 29567, 22896, 30263, 141334, 191572, 191496, 204498, 163399]
20043A63399m3081l7725n9618k1312N8600J27058L4245R1974j4537j02762p2765
20032A23476K1540K335p9633n5758R2992K1758J604R3629R5282Q0920m2691p989
20020C47465n2688j7564N009k6497J4579q4547K5301k8528k0539K472N7360p992
20008B13831o9175m9839O2258K680L3250K4720q8222j0063J03068k426K2164P5097
19996C17343O7331K2687o7322p9759k0245k5106m9834J2202P3215R9637N2202
19985D02351j13371o4501L1188N2659Q4852M8710O5190K5922p164j2688j27014
19974C86134p5013O374K5616n6359j5628L5511O714n2685m3332J5503J9206j0563
19962B41478N4393O7226m71P8121n2441j26343j791L7196n8207M72K4378K5805
$$ y = [163399, 120318, 82593, 22975, 1663, 60263, 187321, 221566, 313540, 299003, 196241, 123476, 145016, 147351, 67718, 11960, 104952, 126710, 128314, 221943, 317225, 398145, 355454, 347465, 294777, 277213, 282222, 255725, 270304, 185757, 211058, 182530, 161991, 164463, 221823, 213831, 144656, 94817, 157075, 159755, 193005, 217725, 129503, 119440, 222508, 220082, 242246, 317343, 384674, 407361, 340039, 260280, 240035, 214929, 165095, 177297, 250512, 350149, 402351, 288980, 224479, 255667, 308326, 393178, 441888, 507078, 533000, 525836, 513148, 386134, 311121, 317495, 343111, 286752, 271124, 306635, 313349, 260664, 217332, 232835, 252041, 241478, 295871, 363097, 362626, 440747, 388306, 261963, 260172, 297368, 239161, 239633, 264011, 289816]
19950B89816l6298m614J9405l3141J5223L0651m9348n3439j4077L3093l2909O0175
19938B24537O3797N4114P302l8267L60K1292K6055j2114o4058K7806m127L8380
19926C45077k4949r3498M421J419Q0974J4557q4739p9319j9772M48J20283L1499
19914B96401j4547O1941M1021L5082J2826q3994R147K6335J8852j1406j0135o3311
19902C18212m5423K8936o0943q9096K3586Q0789J9974Q850J7125Q494K8730J2159
19890C51393p8505K0691N882k4407L3434r2879o1974L5184O4930M9032J0250J3424
19878C26455K3109N0727P2070M3058k5750q4170n6877L5319l003m60N8022O8932
19866E07432J25601P4793J01619J92753J62110J89094K13456J37899N5011o8o7725
$$ y = [289816, 253518, 248904, 268309, 235168, 250391, 281042, 231694, 178255, 164178, 197271, 164362, 224537, 288334, 342448, 349750, 311483, 311843, 333135, 359190, 347076, 283018, 310824, 306697, 345077, 320128, 226630, 231051, 232470, 313444, 328001, 243262, 163943, 144171, 144619, 264902, 296401, 281854, 343795, 384816, 419898, 432724, 348730, 357877, 384212, 403064, 391658, 381523, 318212, 272789, 301725, 240782, 151686, 175272, 256061, 276035, 284885, 302010, 310504, 339234, 351393, 272888, 293579, 299461, 275054, 308488, 215609, 153635, 188819, 253749, 302781, 313031, 326455, 349564, 400291, 472361, 515419, 489669, 405499, 348622, 383941, 380938, 380478, 438500, 507432, 633033, 707826, 809445, 1002198, 1164308, 1353402, 1566858, 1704757, 1759768, 1759700, 1691975]
19855A691975r1855j37100k06370j64235l6566k2156j03581Q961l8562j9398m3824
19844H37289n1306p3242o4945k4970O251j4853O1055K8763P610l1443N5219k0906
19832G14522o4214j3338N7123M5248J4307O7656j7514k9180k8253N3510O2243
19821H62110L7374q5628n1445j7419Q264n84n6293K4523K7064o346j6263R1361
19809H16718Q4165M0413n9258l4986k0687Q4355N5838O0177M0977P9521M6744
19798A193977l4076J4649M6574O1215K3447J8658N8119K1026m4797J3520K2165
19787A394477k152K0310L1473L6108n6200P703P3198O5251J13274r08l0024M8939
19775A701449J30374O5714Q7647R0851J64823R7798J52118K77813L70329M21158
$$ y = [1691975, 1600120, 1463020, 1256650, 1092415, 1055849, 1033693, 930112, 939073, 900511, 881113, 837289, 785983, 712741, 647796, 622826, 629077, 614224, 675279, 704042, 711652, 680209, 735428, 714522, 650308, 636970, 694093, 739341, 753648, 821304, 803790, 774610, 746357, 799867, 862110, 899484, 813856, 762411, 744992, 753256, 752672, 696379, 720902, 747966, 741620, 725357, 816718, 900883, 941296, 882038, 847052, 826365, 910720, 966558, 1026735, 1067712, 1147233, 1193977, 1159901, 1174550, 1221124, 1282339, 1305786, 1324444, 1382563, 1403589, 1358792, 1372312, 1394477, 1392325, 1412635, 1444108, 1480216, 1424016, 1431719, 1504917, 1570168, 1683442, 1682534, 1652510, 1701449, 1831823, 1897537, 1985184, 2076035, 2240858, 2338656, 2490774, 2768587, 3138916, 3560074]
19765C560074M36023J98521K25941J94468K33425J62987N70r3455J1383K09001
19755E138938K75087K11994J85898K33745K79705J94703K57715M06582M98055
19746G682422O19840P93591Q91486J004469J219602J491437J780122K173557K742157
19737B0398683L483584M604313O080841Q253264J1222630J5232541K0305918K5770845
19729A15352619L0535054L2610147L0339695K2537680J0263070l968508j7044641
19722B20625116k6033259k9755638k8797319k4975420j9955046j5130549j1239751
19715F4738134q302365o253800n043270m058706l362979k965015k676053k411344
19707B9664602k269228k024481j752282j532995j409585j183510j079399r00883
$$ y = [3560074, 3996097, 4194618, 4420559, 4615027, 4848452, 5011439, 5012009, 4918554, 4929937, 5138938, 5414025, 5626019, 5811917, 6045662, 6325367, 6520070, 6777785, 7184367, 7682422, 8302262, 9095853, 9987339, 10991808, 12211410, 13702847, 15482969, 17656526, 20398683, 23882267, 28486580, 34567421, 42820685, 54043315, 69275856, 89581774, 115352619, 145887673, 178497820, 208837515, 231375195, 241638265, 237669757, 220625116, 194591857, 164836219, 136038900, 111063480, 91108434, 75977885, 64738134, 56435769, 50181969, 45138699, 41079993, 37717014, 34751999, 32075946, 29664602, 27395374, 25370893, 23618611, 22085616, 20676031, 19492521, 18413122, 17512239]
19699A7512239p21329o34066o85664n95956n97930n27096n68720o44783o86048
19690A1850647m84694m81857n22804n13283o73211p74138p76597p39016o73301
19681F211746o87410m78457n07567m35229l18130l17758l06917k27088j59509
19672B773681k34354k35027l0694l3172j53303j52541j69763j48979q3396q3308
19662A449144K6003o4747o2410r7380k1581l9277N7280K6033p2411o4951q649
19651A127054k4993p595l0286o1786l2574p2200m5287j6533k6133K0177P5842
19640I05686n3031r0646j2517L1031m8968r8482l3110M1343o0619J9216k016n1662
19628E46225K1422J8810n5756M2496J9194o624J3625P2313M9583P47o0469o294
$$ y = [17512239, 16790910, 16156844, 15471180, 14875224, 14277294, 13750198, 13181478, 12536695, 11850647, 11365953, 10884096, 10361292, 9848009, 9174798, 8400660, 7624063, 6885047, 6211746, 5524336, 5045879, 4538312, 4103083, 3784953, 3467195, 3160278, 2933190, 2773681, 2539327, 2304300, 2273606, 2240434, 2087131, 1934590, 1764827, 1615848, 1532452, 1449144, 1475147, 1410400, 1347990, 1250610, 1229029, 1189752, 1247032, 1273065, 1200654, 1135703, 1127054, 1102061, 1094466, 1064180, 1002394, 969820, 897620, 852333, 835800, 809667, 829844, 905686, 852655, 762009, 749492, 780523, 731555, 633073, 599963, 641306, 580687, 599903, 597887, 546225, 567647, 586457, 530701, 573197, 592391, 585767, 599392, 671705, 721288, 722035, 661566, 655272]
19616F55272n3700m2677n1946M6335Q9868L6244m6267l8791M9737Q0872K1772
19605G46719l1977o0376p5127o0402k0174J20828K5228j01525m7001n204j6955
19594D74034K8606M8874L6259o1345k2208J70252P6041Q8529N026K2831J616L9786
19582I08301k925p4201P6815j00495j9520q3575p6106N2448N6031Q2824j6197
19571H03400m6215O7598Q2243o1271j38032m3077J42199O8476J3057Q821l2161
19560H65038M8075N201N3495j0698J2233k1686l2041O9803R7211K7196j6232j11183
19548I86412q7335J6048J2104q9808n0263O7695L4633n755N69K7373O1732j6579
19536I56826o0589q4405q519q313N02q9503n3328J09482O5537L3137P6195J52878
$$ y = [655272, 601572, 558895, 506949, 553284, 643152, 679396, 633129, 594338, 644075, 724947, 746719, 714742, 654366, 579239, 518837, 498663, 619491, 644719, 543194, 496193, 490989, 474034, 502640, 551514, 587773, 526428, 504220, 674472, 750513, 839042, 844068, 866899, 868515, 908301, 905376, 831175, 907990, 807495, 787975, 704400, 628294, 680742, 736773, 819597, 803400, 757185, 824783, 907026, 845755, 707723, 664646, 806845, 875321, 888378, 897199, 865038, 913113, 918314, 971809, 961111, 973344, 951658, 919617, 989420, 1086631, 1113827, 1097595, 986412, 899077, 915125, 927229, 837421, 787158, 854853, 889486, 883731, 884300, 911673, 973405, 956826, 896237, 811832, 803313, 795000, 795502, 705999, 652671, 762153, 827690, 860827, 937022, 1089900]
19524A089900J07295L9390k0494r8399r6546j03952q4670o8398r6530r3199j52550
19513D21847K0393O7651J5920j3098r326N1887O1097J0775L5229j1861j9204j9605
19501F11705j26148q3206N8187N3308m7906L4935k072j7152m4465M8177m5372
19490D39991L475Q728p5053m6444J5986J1049p3676m8333K0083P4983m848k8164
19478B97777O7739J04496L9838j7959n2107p4062J3168J20609n5952P5005K795
19467E21347k8031J8371p088K5055J16604N9355J38220P5208j9380O316k0791
19456H85186l6372J9271q7862j50467o6403J4500J3450o5947o8494J2640k2176
19445D47326r2532L6837J1397l6047o0930k9143j8935J3636l5704J5875R9318
$$ y = [1089900, 1197195, 1236585, 1216091, 1117692, 1021146, 917194, 832524, 764126, 667596, 574397, 421847, 442240, 509891, 525811, 512713, 503387, 555274, 616371, 627146, 662375, 650514, 631310, 611705, 485557, 402351, 460538, 513846, 465940, 500875, 498803, 481651, 437186, 485363, 439991, 443466, 452194, 377141, 330697, 346683, 357732, 284056, 235723, 255806, 330789, 325941, 297777, 365516, 470012, 509850, 491891, 439784, 365722, 378890, 499499, 443547, 518552, 521347, 493316, 511687, 504599, 529654, 646258, 705613, 843833, 919041, 899661, 905977, 885186, 848814, 868085, 780223, 629756, 563353, 577853, 591303, 525356, 456862, 469502, 447326, 354794, 391631, 403028, 366981, 306051, 276908, 257973, 271609, 235905, 251780, 351098]
19434C51098N0881K8329m7326P7549M4924q6677n3958o634J1252k2122l4952r149
19422C03215n235N0056O5180J07689M7556o4804n7423m9568l6977P0603N9143
19411D89435k3196J21421K5954r2681n1601j11932p5091J8295N721R7746N3338
19400D57409J2228p1577J8215P7116N047J1209N2179Q054r571k186N0202q3342
19388E24983q45K7730N8102k9706O2684q601j3087m5292k2126o178j5309j5291
19376E17064o585l2610o702N186J9119k7611J3282O7180O6694j9775n6295L429
19364E42376n960M2938J03336m2546m2783K2311K7928l8547J0209Q8721Q8326
19353G96309l8528J2218M2926l4499q5955k7624J2075m9849J09578L4707l624
$$ y = [351098, 401979, 430308, 382982, 460531, 505455, 418778, 364820, 358186, 369438, 347316, 312364, 303215, 297980, 348036, 413216, 520905, 568461, 503657, 446234, 396666, 359689, 430292, 489435, 466239, 587660, 613614, 520933, 469332, 357400, 282309, 300604, 306325, 404071, 457409, 469637, 398060, 416275, 493391, 498438, 509647, 561826, 569880, 560309, 558123, 608325, 524983, 524138, 551868, 609970, 580264, 642948, 634347, 621260, 575968, 553842, 547664, 532355, 517064, 510479, 477869, 471167, 476353, 495472, 467861, 481143, 548323, 615017, 595242, 538947, 542376, 536416, 579354, 682690, 640144, 597361, 619672, 647600, 609053, 619262, 707983, 796309, 757781, 769999, 812925, 778426, 692471, 664847, 676922, 627073, 736651, 771358, 767734]
19342G67734m7439k6680O0460K3058j7849P666K5999L6232j9467p4868l156P898
19330G39588L6220P7933O7970J04923j9051l7388K2412j6789j26714N691o128
19319H48667o6059K1369M6936N4664P5156K9269q0862n8663M8571K5775k047m2982
19307H99794K446R3985Q3669P8390n062K3509O754l2392q7704K0093J36552J4365
19295A234399L5326m2658l869q6150j2949j0246P9271J7543J532K9621q2355P97
19283A160262L5774L94O7018M2460K3803Q0191J70991J3849L7618j8154j9428
19272A594778L9055K8134k393N2635n1458P062Q3945J23601M8522J46725J78470
19261B249076J54238J38757M2721J16367K24528K27788J78300K32998L06830K41396
$$ y = [767734, 720295, 693615, 754075, 777133, 759284, 766950, 792949, 829181, 809714, 734846, 731690, 739588, 775808, 853741, 921711, 1026634, 1007583, 970195, 992607, 975818, 849104, 854795, 848667, 782608, 803977, 850913, 905577, 980733, 1010002, 929140, 870477, 919048, 944823, 942776, 899794, 902240, 996225, 1079894, 1158284, 1153222, 1176731, 1183485, 1151093, 1063389, 1083482, 1220034, 1234399, 1269725, 1227067, 1223198, 1137048, 1124099, 1113853, 1193124, 1210667, 1212199, 1241820, 1159465, 1160262, 1196036, 1196430, 1263448, 1305908, 1329711, 1409902, 1580893, 1594742, 1632360, 1614206, 1594778, 1633833, 1661967, 1659574, 1712209, 1660751, 1667813, 1751758, 1875359, 1923881, 2070606, 2249076, 2403314, 2542071, 2584792, 2701159, 2925687, 3153475, 3331775, 3564773, 3871603, 4112999]
19251D112999J23185J23291N8480N979K0732j4793P930L9750M8526O7895J20867
19240D714841J39790Q1352J89434K58007L63517M18945M97310N21897O13172N66655
19230H364920O08788P51592P12345O60330O90220Q11035R27161J117806J348674
19221A5992871J727811K181318K607798L402489M308763N592475P515352J0136635
19213E3465512J3753018J8636347K4413596L0219586L4037730L3034705K5332612
19206B32893106J1583044n076873j9933480k9139613l1707816k8974432k3885247
19199A05758689j8451704j3751861j0204223p610009n845201m606591l744814
19192D1544286l105735k689055k316224k076523j935861j935724j798008j514435
$$ y = [4112999, 4236184, 4359475, 4417955, 4423934, 4444666, 4429873, 4437803, 4477553, 4526079, 4593974, 4714841, 4854631, 4935983, 5125417, 5383424, 5746941, 6165886, 6663196, 7185093, 7798265, 8364920, 8973708, 9725300, 10437645, 11097975, 11788195, 12599230, 13526391, 14644197, 15992871, 17720682, 19902000, 22509798, 25912287, 30221050, 35813525, 43328877, 53465512, 67218530, 85854877, 110268473, 140488059, 174525789, 207560494, 232893106, 244476150, 239399277, 219465797, 190326184, 158618368, 129643936, 105758689, 87306985, 73555124, 63350901, 55740892, 49895691, 45289100, 41544286, 38438551, 35749496, 33433272, 31356749, 29420888, 27485164, 25687156, 24172721]
19184B4172721j301072j250708j207439j069375r92174r41317r45512q20422p19883
19175A4924819n94119o59612o75028p40774p40547o11982n62217n81514o82271
19166I076755n93495n54264n68828n27168l68518l24794l81063m40504l53186
19157D964935k67698l00620l26886j90592j00678n6048l8585R366j14720j32194
19147C446280p7227m6832k3087j7866J05367j8860j06406r7629n8245m1122j70472
19136B893901j38857k2361L9131K8603J3368m9124j1413K5908J9882J2571Q8177
19125B899786N6129q233n4191n6k274o2103p1290r7943o1065l1054J06368J40935
19113B815009J38213K76659L07334L37864N26097O56246P85032P72004P22349
$$ y = [24172721, 22871649, 21620941, 20413502, 19344127, 18351953, 17410636, 16465124, 15644702, 14924819, 14330700, 13671088, 12996060, 12255286, 11514739, 10902757, 10340540, 9759026, 9076755, 8483260, 7928996, 7360168, 6833000, 6464482, 6139688, 5758625, 5318121, 4964935, 4697237, 4396617, 4069731, 3879139, 3778461, 3722413, 3683828, 3693194, 3578474, 3446280, 3369053, 3322221, 3299134, 3281268, 3386635, 3367775, 3261369, 3163740, 3105495, 3064373, 2893901, 2755044, 2732683, 2771814, 2800417, 2813785, 2764661, 2753248, 2779156, 2799038, 2811609, 2899786, 2955915, 2947682, 2893491, 2893435, 2891161, 2829058, 2757768, 2659825, 2598760, 2567706, 2674074, 2815009, 2953222, 3229881, 3537215, 3875079, 4401176, 5057422, 5842454, 6614458, 7336807]
19104G336807M63035L8030k67729l98829m21315m23309m07209j79587L3801J06279
19094E879974L27253N57948O50018J123336J589869K295213L537433N228917P382457
19085B8572418R575005J0902595J0253051P401139K917875j905655o163146q870877
19077E2682405r223247p764075n156637k425512J76357K556660M490867N489786
19069D0826604M992792K690823n60555l604398n083690n052041l813701j937744
19061B8458090J53443J870131K953072L586575L773963L480621K416054Q53060
19053D7545009m98120k49608J175127L343743N194970M834652J472526k857797
19045E9960502m776753k851935J100784M290802M123786K48887n068102q558959
$$ y = [7336807, 7799842, 7837872, 7570143, 7171314, 6749999, 6326690, 5919481, 5739894, 5773695, 5879974, 6207227, 6765175, 7415193, 8538529, 10128398, 12423611, 15961044, 21189961, 28572418, 38147423, 49050018, 59303069, 66704208, 69622083, 67716428, 61553282, 52682405, 43459158, 35695083, 30538446, 28112934, 28289291, 30845951, 35336818, 40826604, 45819396, 48510219, 47949664, 44345266, 39261576, 34209535, 30395834, 28458090, 28611533, 30481664, 33434736, 37021311, 40795274, 44275895, 46691949, 47545009, 47046889, 46797281, 47972408, 51316151, 56511121, 61345773, 62818299, 59960502, 55183749, 52331814, 53432598, 57723400, 61847186, 62096073, 57027971, 48469012]
19037D8469012q628949o468697l917114j901178l73582J075343K632550M952087
19029C5839472P820374J0979738J3149893J2789756R479797M110364k264648q231345
19021H3673401j2365636j3622532j2449442r885724o932240m663495l149305k255558
19013A8349469j737288j180439r47287q79945p27431n13799m61660m30951l49454
19004A1121215k57300j1753M00600P54601J002548R54967J44529q71783j700369
18995A1537255j895847j424066j032470p27457m71250m26179l99705k90645k83320
18986D586316L086J13594J75417J41908o9804l43398m82125n59406n17281l65351
18976B682956k80459j90203k19619k28979l8204j2609r1966K841r851j6087o485
$$ y = [48469012, 39840063, 33371366, 29454252, 27553074, 27179492, 28254835, 30887385, 35839472, 43659846, 54639584, 67789477, 80579233, 90059030, 94169394, 91904746, 83673401, 71307765, 57685233, 45235791, 35350067, 28417827, 23754332, 20605027, 18349469, 16612181, 15431742, 14484455, 13604510, 12877079, 12363280, 11901620, 11470669, 11121215, 10863915, 10852162, 11252762, 12007363, 13009911, 13964878, 14109407, 13237624, 11537255, 9641408, 8217342, 7184872, 6457415, 5986165, 5559986, 5160281, 4869636, 4586316, 4589402, 4702996, 4878413, 5020321, 4950517, 4607119, 4124994, 3565588, 3048307, 2682956, 2402497, 2212294, 1992675, 1763696, 1725492, 1712883, 1620917, 1623758, 1613907, 1597820, 1591335]
18965A591335j22620j12172j01834q4043q9535q0157j2807J1364N1464j06319
18955I44676k2710J4027k465j83468k3732L7757N2829j2855L6047P65n1841J1099
18943H00129m6347m7264J8706J8899P6265K3555l3071p5898o5534M3063O5346
18932G77849l2126m1322K6420M3500O140o7132o5400N0730K6121K7600J2772P606
18920G72758N3200L5332O5914M0300M9934l3946n4855P0793P5637J44083J33520
18909A352670Q3843R7859J6874j63223k09886j22904j7607n2788l7702o0683j28177
18898G58276j5275L6684j1236O9420J34617J01924L7285N2621P3878R5361q1975
18887A251580l0825K1505l4583j71674j76108r401N6268N1029k109o3892P7984
$$ y = [1591335, 1468715, 1356543, 1254709, 1170666, 1081131, 1000974, 988167, 999531, 1050995, 944676, 921966, 935993, 933528, 750060, 726328, 764085, 816914, 804059, 840106, 840871, 789030, 800129, 753782, 706518, 725224, 744123, 820388, 843943, 810872, 734974, 669440, 712503, 777849, 745723, 704401, 730821, 774321, 780461, 713329, 647929, 698659, 724780, 752380, 765152, 772758, 825958, 861290, 927204, 967504, 1017438, 983492, 928637, 999430, 1075067, 1219150, 1352670, 1436513, 1534372, 1551246, 1388023, 1178137, 1055233, 1037626, 984838, 947136, 886453, 758276, 743001, 779685, 768449, 837869, 972486, 1074410, 1111695, 1164316, 1238194, 1333555, 1251580, 1220755, 1242260, 1207677, 1036003, 859895, 850494, 906762, 957791, 955682, 891790, 969774]
18876I69774M7536P4606O6964J01696K857r0331m8925m0456r5048l8409L474r9477
18864H54261J3131L9827o8344L1656K2992M7294J9375P9066J35913J67560P9268
18853A421999Q5087r1546r5786n4927j01326k1229j0158P178P2655j4802p6699
18842A120446q3181o7206j13545m9881O7355J5553j05962j40366J01185J27570
18832H71968J23149R9140M4078p8709q9017m9823j28758j31801J2619J3704K8994
18821G15544l244K2845O8024m3003p9556N1998K1565Q0206J29800j3814k5091
18810I25274N9568M4276J12636R4306M3625n1462q9919m5392J12491J07328k5297
18799A287434P1157L2802j7835n6874p1417O1578K8049L0500Q4449j3087r3801
$$ y = [969774, 1017310, 1091916, 1158880, 1260576, 1263433, 1173102, 1124177, 1083721, 988673, 950264, 953738, 854261, 867392, 907219, 838875, 870531, 893523, 940817, 960192, 1039258, 1175171, 1342731, 1421999, 1507086, 1415540, 1319754, 1264827, 1163501, 1142272, 1132114, 1139292, 1211947, 1197145, 1120446, 1037265, 970059, 856514, 806633, 873988, 889541, 783579, 643213, 744398, 871968, 995117, 1094257, 1138335, 1059626, 970609, 920786, 792028, 660227, 672846, 686550, 715544, 712300, 735145, 803169, 760166, 680610, 732608, 754173, 834379, 964179, 950365, 925274, 984842, 1029118, 1141754, 1236060, 1279685, 1228223, 1138304, 1092912, 1205403, 1312731, 1287434, 1358591, 1391393, 1373558, 1316684, 1245267, 1306845, 1334894, 1365394, 1449843, 1436756, 1342955]
18788A342955J4319n1643l3459L8581O7055N588n4962K7674k7764n7030r6513
18777A174801m1440n3772l1366J8753M5130R1460J08998J04910Q0164N3382m1645
18766A509375j88185j59085r5380M370o0270j2034M1741l407j221L4549p088j6035
18754A047330J7924r143r368k7430N2402N6053Q8691J09423K6344P2570J99967
18743A624763J04554K7472j7330Q92O2498M0601M8482Q2305O8809N2751R3245
18732B189042J12821P1296P5166J00933J02756J70924L32878M82617P56653J191394
18722E586480J558193J409866M69674p23300j217797j059174p32412l51585J0698
18713D950643L39975O55080J023652J749945K708875L480140L884206K842906
$$ y = [1342955, 1357274, 1305631, 1272172, 1310753, 1377808, 1383396, 1328434, 1356108, 1328344, 1271314, 1174801, 1133361, 1079589, 1048223, 1066976, 1112106, 1203566, 1312564, 1417474, 1497638, 1551020, 1509375, 1321190, 1162105, 1066725, 1071095, 1010825, 998791, 1040532, 1037125, 1035904, 1070453, 1063365, 1047330, 1065254, 1056111, 1046743, 1019313, 1071715, 1127768, 1216459, 1325882, 1352226, 1424796, 1624763, 1729317, 1756789, 1739459, 1740351, 1802849, 1843450, 1891932, 1974237, 2043046, 2095797, 2189042, 2301863, 2373159, 2448325, 2549258, 2652014, 2822938, 3155816, 3638433, 4395086, 5586480, 7144673, 8554539, 9024213, 8300913, 7083116, 6023942, 5291530, 4939945, 4950643, 5290618, 5945698, 6969350, 8719295, 11428170, 14908310, 18792516, 21635422]
18705B1635422N09668k086572l529754l453558k665911j725900j017529o00805
18697G065061k48525n8403K7477R9321K9548m4830M4986L20049L26721M67832
18687H029237M41526N12052N21896P77409R18713J218957J574495K076275L068265
18678A9138825M737652P478806J1412768J6418311J9541901J5629726K961827
18671I7319816j0137472j5334446j2029558n564735R61761P330987J3846498J8958836
18663I5351687J9429377J3510603M118925k490361n419685p492546j1580631j5248642
18655I0178727j6204586j3563279r667410o117592l690288j935245m16565R66043
18647C9549805K406530M469063P660526J2804036K0970075L2219283M2379242
$$ y = [21635422, 22145090, 20058518, 16528764, 13075206, 10409295, 8683395, 7665866, 7065061, 6816536, 6758133, 6785610, 6884931, 6914479, 6869649, 6914635, 7234684, 7561405, 8029237, 8470763, 8982815, 9504711, 10282120, 11200833, 12419790, 13994285, 16070560, 19138825, 23876477, 31355283, 42768051, 59186362, 78728263, 94357989, 97319816, 87182344, 71847898, 59818340, 54253605, 55215366, 62546353, 76392851, 95351687, 114781064, 128291667, 132410592, 129920231, 124500546, 117008000, 105427369, 90178727, 73974141, 60410862, 50743452, 44625860, 40935572, 39000327, 38583762, 39549805, 41956335, 46425398, 54085924, 66889960, 87860035, 120079318, 162458560]
18640A62458560M1176497K0430979j3849772l9905697m4208799l3257118k0907040
18633G1937610j2857366p988750m990268l132429j661551l08121Q53107J977953
18625D3830185L641539O003228Q561421J0561215J1289614J0845586R237783Q914098
18617A12884669J0897663J1504858M416901r075500j8947444j9239763j2259761
18610H0181623l547537M248611R586582R654267L718781o162901j3881851j6112214
18602F7685361j3718827r953557o834339m880371l709343k989962k387961j918305
18594B1292696j546022j190207j026754q47835q57643q08951p78679q33684p52177
18585A2650744o47557n11481m79073l97227l15984j45322R0694L98858Q34171
$$ y = [162458560, 203635057, 224066036, 210216264, 170310567, 126101768, 92844650, 71937610, 59080244, 51091494, 46101226, 42968797, 41307246, 40999125, 41852232, 43830185, 47471724, 53474952, 62036373, 72597588, 83887202, 94732788, 103970571, 112884669, 123782332, 135287190, 139704091, 130628591, 111681147, 92441384, 80181623, 76634086, 80882697, 90469279, 100123546, 103842327, 97679426, 83797575, 67685361, 53966534, 44012977, 37178638, 32298267, 28588924, 25598962, 23211001, 21292696, 19746674, 18556467, 17529713, 16681878, 15824235, 15015284, 14236605, 13402921, 12650744, 12003187, 11491706, 11012633, 10615406, 10299422, 10154100, 10244794, 10643652, 11477823]
18576A1477823J549638K260821K646261K402811J269885m41510j869142k805432
18568A6491155k837040k479722j779896j076802o51698l37713m9624K87635P20774
18559H287069O88754J69865o57127j083349j217830q97903n13150k73127j18720
18550D384482l7427m453K6919M7315P5719M5090N285q5562j77051l35185k02060
18539C743072k09642k75539k92598k36075j50335j91551k09633j76715n9288K9416
18529A971112J2869K4261j20769q7092j05528j5635j1838j06925k3400R2674L4480
18518A664209m8000K3034j5377K3177L6818n4025q7957J7479N0338O4712J26774
18507A801182M3274r3288K7125N2085k4640j5183q625K4023j03381p5999J4190
$$ y = [11477823, 13027461, 15288282, 17934543, 20337354, 21607239, 21165729, 19296587, 16491155, 13654115, 11174393, 9394497, 8317695, 7665997, 7328284, 7278660, 7566295, 8287069, 8975823, 9145688, 8488561, 7405212, 6187382, 5289479, 4776329, 4503202, 4384482, 4347055, 4342602, 4369521, 4416836, 4492555, 4537645, 4542930, 4457368, 4280317, 3945132, 3743072, 3533430, 3257891, 2965293, 2729218, 2578883, 2387332, 2177699, 2000984, 1941696, 1971112, 1983981, 2008242, 1887473, 1800381, 1694853, 1679218, 1667380, 1560455, 1537055, 1629729, 1664209, 1616209, 1639243, 1623866, 1647043, 1683861, 1629836, 1541879, 1559358, 1609696, 1674408, 1801182, 1844456, 1751168, 1778293, 1830378, 1805738, 1790555, 1781930, 1805953, 1702572, 1626573, 1640763]
18496A640763K3339L7297Q375o7052m7055p8044m4802J9795k4776q0328l6874
18485A350638O8811J19328o9699r9241j13582r8642j29436r2073p7360l3085n8331
18474G67328M5119J02142L1010M3674j3094J5060J259p3433j03977J35081J74832
18463A125001J3106k8913n518L2485K3887k1830m7081R2209N9285O179M2046N9823
18451A350679k9538j15911N361K2026l0305M409l7581O6038k3277k5283m9914
18440A136704n0088k9737P1574Q2541m1665n9436j04318j43615r3026L0803j5061
18429G84676p5888R6920j03109o1689K5063P6805k9012k3258L8413K1439l5592
18418G14768q8444r0499o9275k9167J355L4879J32364Q2501J1383K2297n0259
$$ y = [1640763, 1664102, 1701399, 1709774, 1642722, 1595667, 1517623, 1472821, 1492616, 1467840, 1387512, 1350638, 1419449, 1538777, 1469078, 1369837, 1256255, 1157613, 1028177, 936104, 858744, 825659, 767328, 812447, 914589, 945599, 989273, 976179, 991239, 992498, 919065, 815088, 950169, 1125001, 1138107, 1109194, 1103676, 1136161, 1160048, 1138218, 1091137, 1183346, 1242631, 1248810, 1290856, 1350679, 1321141, 1205230, 1210591, 1232617, 1202312, 1206721, 1169140, 1235178, 1211901, 1186618, 1136704, 1086616, 1056879, 1128453, 1210994, 1169329, 1109893, 1005575, 861960, 768934, 799737, 784676, 708788, 805708, 702599, 640910, 665973, 742778, 713766, 690508, 728921, 750360, 714768, 626324, 535825, 466550, 437383, 438738, 473617, 605981, 688482, 699865, 722162, 671903]
18407F71903M5726M6015M6883n4632J6784n6881K6060R412L3027L6210M9954k7230
18395H43231m2252J4634l4704l5928J951L964O4572P2757j3084O663m6050n4392
18383G81362k6378l6711o2102j38672m3177L1754r829M7390j9203q1994M4431
18372D86871L7923j8902K6504k7221K1486O4097k4174J0842M8352j4337J5274
18361F26715j1156O3452Q1376p1384P103j0528r3158n0715J4999L3721k5108J8412
18349E83729M9071O9884p6209k0410L7411R599m583j7851J1875r3128j14228J4523
18337D49683J34493J8897p0090Q172O1577Q9907O537O5136J2506o552n5525j38544
18325E76197o9747P57O3187N6846J5305K724K9882J05328O7961O6569J03323P5779
$$ y = [671903, 717629, 763644, 810527, 755895, 772679, 715798, 741858, 751270, 784297, 820507, 870461, 843231, 800979, 815613, 780909, 744981, 746932, 750896, 815468, 888225, 875141, 881804, 835754, 781362, 754984, 718273, 656171, 517499, 474322, 506076, 496247, 543637, 524434, 442440, 486871, 524794, 505892, 532396, 505175, 526661, 590758, 566584, 577426, 625778, 611441, 626715, 615559, 679011, 760387, 689003, 696106, 685578, 592420, 541705, 556704, 590425, 565317, 583729, 632800, 702684, 626475, 606065, 643476, 653075, 648492, 630641, 642516, 549388, 435160, 449683, 584176, 603073, 532983, 541155, 602732, 692639, 699176, 764312, 776818, 770266, 714741, 576197, 506450, 507207, 570394, 627240, 642545, 645269, 675151, 780479, 848440, 915009, 1018332, 1094111]
18313A094111J16371K6401p0337n4072R2443k7254r8600j8642O7522m9742j11108
18302I67093l9461o43L2111o943l7043q9110l7587M669j2635k099N9795N0656
18290H88803k018o1282N801q6227k2380m218K1003k8875j6923J0333J1169L6716
18278G51902N004R3606Q7735M2410k460K1059M1159O1459L9538L7391M8279L8188
18266A265270j0481R0214l384K8994N1658M5826n314o521k6178j9307p5988r5322
18254A239467j6445q2250m5678l4147l0723j8533j9285P3227J4068l637o0431
18243A015633l571O483m9628J5999k4776j318m7122j60349p2309K9815J25359
18232H34216M3418J01963o11J999N1253j20057k6160L4286j3321j7566n6161N0586
$$ y = [1094111, 1210482, 1236883, 1166546, 1112474, 1204917, 1177663, 1079063, 1060421, 1127943, 1078201, 967093, 927632, 926989, 959100, 952157, 915114, 826004, 788417, 793086, 780451, 778352, 838147, 888803, 886785, 825503, 831304, 745077, 722697, 718479, 739482, 710607, 693684, 704017, 715186, 751902, 756906, 850512, 938247, 980657, 978197, 999256, 1040415, 1101874, 1141412, 1178803, 1227082, 1265270, 1254789, 1345003, 1341619, 1370613, 1422271, 1468097, 1462783, 1456262, 1430084, 1410777, 1334789, 1239467, 1223022, 1140772, 1095094, 1060947, 1030224, 1011691, 992406, 1065633, 1079701, 1076064, 1015633, 1012062, 1018545, 968917, 984916, 960140, 958822, 911700, 751351, 679042, 708857, 834216, 877634, 979597, 978986, 980985, 1032238, 912181, 886021, 920307, 906986, 889420, 833259, 883845]
18220H83845R7914r71J8630m1659K451J5383M492o150l0620M105J1701k7214j3694
18207I18213l1984p407K0061M618n7171J5049k4589n4166N4688M7333K905n4819
18195H32731j8249N3908K0627N6663N4633J8998k4085M9740Q1993l69m7710j02554
18183I76326n3983M6020k1600L2511k0860q3140k6943p8288J7231R3445K2185
18172I02904L5834j5200R6541O9159k9257J4809M8561M7294K1906l9215j8459
18161A134877L018n1773K5993P2267L6851o807k0015J1396P7732Q7295J37387
18150A508221O4915J30314P671Q0141J23720O0666Q4267J0204o0359k2352n7209
18139A930199n7007J13598O6673j354N6786k7932n5949N1150J45733R4234J16207
$$ y = [883845, 981759, 980788, 999418, 957759, 960210, 975593, 980085, 973935, 943315, 947420, 959121, 931907, 918213, 886229, 878822, 898883, 903501, 846330, 861379, 836790, 782624, 837312, 884645, 887550, 832731, 814482, 868390, 889017, 945680, 1000313, 1019311, 995226, 1044966, 1126959, 1126590, 1078880, 976326, 922343, 968363, 946763, 979274, 958414, 875274, 848331, 770043, 787274, 880719, 902904, 938738, 923538, 1020079, 1089238, 1059981, 1074790, 1123351, 1170645, 1192551, 1153336, 1134877, 1137895, 1086122, 1112115, 1184382, 1221233, 1214426, 1194411, 1205807, 1283539, 1370834, 1508221, 1573136, 1703450, 1711121, 1791262, 1914982, 1975648, 2059915, 2070119, 2009760, 1987408, 1930199, 1873192, 1986790, 2053463, 2052109, 2108895, 2080963, 2025014, 2076164, 2221897, 2316131, 2432338]
18128B432338O0575J38355K18778K46822L52977M49756M39792N30409O47866J000619
18118F518287J483790J999942K862802M612846P703651J3234144K1998904L0413624
18110I0827990K6601617p08871k4444300l0762562k0618368j1542845o705809
18103B2646852m066181k689831j868431j226564o98938n42567o45916p10548o15087
18094I582789m55149m19098m84794m76538m47399l83463l53972j94031j64020
18085F204325L6295J98242K08978J05071K3814j02121o9150p3594j63180k51561
18075F117119k87528j88296M0394J68147L83356N02622N85019O76733L73739R8092
18065H469397N4624M513j46996l69593m52956m70073m06390k29005j71970L9162
$$ y = [2432338, 2492913, 2631268, 2850046, 3096868, 3449845, 3899601, 4339393, 4869802, 5517668, 6518287, 8002077, 10002019, 12864821, 17477667, 25181318, 38415462, 60414366, 90827990, 117429607, 116720736, 92276436, 61513874, 40895506, 29352661, 22646852, 18580671, 15890840, 14022409, 12795845, 12096907, 11554340, 10908424, 10197876, 9582789, 9127640, 8708542, 8223748, 7747210, 7299811, 6916348, 6562376, 6368345, 6204325, 6240620, 6438862, 6647840, 6752911, 6776725, 6674604, 6605454, 6531860, 6368680, 6117119, 5829591, 5641295, 5681689, 5849836, 6233192, 6735814, 7320833, 7997566, 8371305, 8469397, 8524021, 8528534, 8381538, 8011945, 7558989, 7088916, 6682526, 6453521, 6281551, 6320713]
18055F320713K07550L38766M34798N34202Q40998J336307K055115K863063L759966
18046A8691478M341700N147557O335217O928121O453791M999466M506956M002618
18038F1406904K014053r47490k551754k639604l441783m562126m570217l221961
18030D1486022j663669p02045J12835J427508K517495K368768J778844J971098
18022D9296856K608631K230116J101913L88708J05401k28599r24810j750438k533533
18013E0294245k760858k180376j462291j293414k029001k429361j624901M5612
18005C6559655R19744K27410p35018j107985q41184j96757R02664J742832J672553
17996C9143914L52439r17289p19010J167618K436957J716249L03736M22472K230099
$$ y = [6320713, 6528263, 6867029, 7301827, 7836029, 8677027, 10013334, 12068449, 14931512, 18691478, 23033178, 28180735, 34515952, 41444073, 47897864, 52897330, 57404286, 61406904, 63420957, 62473467, 59921713, 57282109, 53840326, 49278200, 44707983, 41486022, 39822353, 39120308, 39233143, 40660651, 43178146, 45546914, 47325758, 49296856, 51905487, 54135603, 55237516, 55626224, 55731625, 55503026, 54578216, 52827778, 50294245, 47533387, 45353011, 43890720, 42597306, 40568305, 38138944, 36514043, 36559655, 37479399, 37706809, 36971791, 35863806, 35022622, 34825865, 35728529, 37471361, 39143914, 39496353, 38579064, 37860054, 39027672, 41464629, 43180878, 43484614, 43907086, 46137185]
17987D6137185L788250L432303K010639J339222J508409P51310j423559l125183
17979E4418576l468309m015183n135761n816013n269088m310215l780680l325818
17971A9297509k798205j965630j312124q53978o14441m73388l55402l86585l52055
17962A0185701j44366j56828j59887l97036n78373l74386k97343m47418o28943
17953G001121o43911o06594m53863l81575l30433l14778l57604k75363k71374
17944C365626j84273r7963j08009j48426j58181k24831j86463j37277j14929j18781
17934A886493j45708j56644j45237j24068l2117o2839r2068l5278k3031N080j12414
17923I62169q6222o0681o4210K4319j9450k3913j9511L0232m3689m8886n3157
$$ y = [46137185, 49925435, 53357738, 55368377, 56707599, 58216008, 58967318, 57543759, 54418576, 50950267, 46935084, 41799323, 35983310, 30714222, 26404007, 22623327, 19297509, 16499304, 14533674, 13221550, 12367572, 11753131, 11279743, 10924341, 10537756, 10185701, 10041335, 9884507, 9724620, 9327584, 8749211, 8374825, 8077482, 7630064, 7001121, 6357210, 5750616, 5296753, 4915178, 4584745, 4269967, 3912363, 3637000, 3365626, 3181353, 3083390, 2975381, 2826955, 2668774, 2443943, 2257480, 2120203, 2005274, 1886493, 1740785, 1584141, 1438904, 1314836, 1282719, 1219880, 1127812, 1092534, 1069503, 1074583, 962169, 875947, 815266, 751056, 775375, 755925, 732012, 712501, 742733, 699044, 650158, 597001]
17912E97001p2361l0402p0034n6133p7337o414J9353N0402K3801l6162o4560N3488
17900C30642J4437j0438k6329n4147M7519K0116J4518k3236p6249r5807K7125
17889A68151k1512p5599k8874N7667P5163q4738j0949N2153K2685L8973O3462
17878B56582Q3240j0164j07109j09306Q7739J67938K4642k6580p7740j52001K6827
17867A64068P0924j8133l7903J5390J0099p5102l7437N296N8698O0934P6379j4473
17855B78740q0635j04346j2967j9554l9349O060M6267M3721L5544l6552p3680
17844D3249q865k0648k2168J7278L7981J29184j7453M357P2165O2478l6832K5100
17832B85826M744L8808k9321j05261l6709J3933q0967n6549Q8518k8353j01107
$$ y = [597001, 524640, 494238, 424204, 368071, 290734, 284320, 303673, 354075, 377876, 341714, 277154, 330642, 345079, 334641, 308312, 254165, 301684, 321800, 336318, 313082, 236833, 141026, 168151, 146639, 71040, 42166, 99833, 174996, 90258, 79309, 131462, 154147, 193120, 256582, 339822, 329658, 222549, 113243, 200982, 368920, 393562, 366982, 289242, 137241, 164068, 234992, 216859, 178956, 194346, 204445, 129343, 91906, 97202, 155900, 216834, 293213, 278740, 198105, 93759, 80792, 61238, 21889, 27949, 74216, 117937, 153481, 116929, 43249, 34384, 13736, -8432, 8846, 46827, 176011, 158558, 162915, 235080, 297558, 260726, 285826, 290570, 329378, 300057, 194796, 158087, 172020, 91053, 34504, 123022, 94669, -6438]
17821f438q6656O0234r25K3714L1538J6306o9500J3569M7701o2297l9320l7002
17809a09076k2485K1604j6861j5199k160k3845K2003m5920j8272M475R570P6691
17797a19475N1440J3620k5342J7414L3921J08907m1481j811m7990n2803N5783
17786g817P1386M6982q0196l5363K0562J3342K6216j4049q7100k9448L2473M7774
17774D762O4871r3978M2679O630k5321L4389J9662m2361J0057j9339K8558J3313
17762D3922k0948k5172q434j3125N7856K9498q0524j3466O2109J5769j00571k3850
17750g6936J3010M236o8146M627L5381J36612j8142p7284J1093j0239k3632m6494
17738a15914l627k9769N629O1822l3268l5817O2111P4441N1005M348o8577N10
$$ y = [-6438, -93094, -32860, -33785, -10071, 21467, 37773, -31727, -18158, 29543, -32754, -72074, -109076, -131561, -109957, -126818, -142017, -144177, -168022, -146019, -191939, -210211, -205736, -196166, -119475, -68035, -54415, -79757, -62343, -28422, 80485, 39004, 37193, -10797, -63600, -7817, 63569, 110551, 30355, -5008, 15554, 28896, 55112, 41063, -46037, -75485, -43012, 4762, 69633, -24345, 18334, 24964, -357, 34032, 53694, 11333, 21390, 2051, 30609, 43922, 22974, -2198, -10632, -23757, 34099, 63597, -16927, -30393, 31716, 47485, -53086, -76936, -63926, -59690, -127836, -123209, -87828, 48784, 30642, -46642, -35549, -45788, -69420, -115914, -119541, -149310, -143681, -81859, -115127, -150944, -88833, -14392, 36613, 40961, -27616, -27106]
17726b7106L5885Q776o8426L0365N5234K5992K2884L4856n4591o3997J7498N0912
17714F8282m9606r9197l1697M6441N0400L6907k8435j46688j28034p537J18928
17703a70236J29208o3360j814N3935j467P9703Q5493P591l9361n5965O540m5685
17691a5418n251j1785j3942O8085J6907L0799l9061k1654k863o1551O2104J0702
17679A7072j2460k2554o5967O595k0216O8479K1554r4798j3812M7229K795j9780
17667h5863k2912L2169r0451m3280k0584N742J32896J11591p9943m0185L7232
17656f3588m3523j9112l6819J10353J32451K1905q2556n951m9310M7591K0759
17645C2200J5793n6179k7860M3357k9754n655J8031J8288m8663M4710J1521q2694
$$ y = [-27106, 8779, 17555, -50871, -20506, 34728, 60720, 83604, 118460, 63869, -128, 17370, 68282, 18676, -80521, -112218, -65777, -15377, 21530, -6905, -153593, -281627, -289164, -170236, -41028, -104388, -106202, -52267, -53734, 25969, 111462, 119053, 79692, 23727, 30267, -15418, -20669, -32454, -46396, 21689, 38596, 69395, 30334, 8680, 5817, -55734, 6370, 17072, 4612, -17942, -83909, -77314, -97530, -29051, -7497, -102295, -116107, -68878, -66083, -85863, -108775, -76606, -167057, -210337, -230921, -225179, -92283, 19308, -60635, -100820, -63588, -107111, -126223, -163042, -52689, 79762, 101667, 19111, 13160, -36150, 11441, 32200, 47993, -8186, -36046, 7311, -22443, -28098, -10067, 8221, -40442, 4268, 15789, -66905]
17633f6905K9809j1608n5599P2309K9802m7445O0930M0026l3779j2606n2533k2742
17621g0341N4814L9620J6130M7206O7925k0643L6917j44726j32232L4025P3521
17610B216n3586l4466J17970N7718K2702r0549l8202n0488o8870j0253P9099N7307
17598i402p2348K5862P1634n4357n6896k6729Q2818J2743K3742L744K2160j1343
17586A1628n9509q2406O296K1389K0863N1996k5588j3450m1557J7996K5715J06273
17574C9646j239p865n3392n7352J0041n9895M6105J28432J8948N199j5260k7876
17562B5492k121k2481m7374m9060M9340O9332m7221K3798K3365k2624K356M5185
17550D7987l6939q2750k031Q8182N0673p039m4305m9047j3568K2705R5752M2762
$$ y = [-66905, -37096, -48704, -104303, -31994, -2192, -49637, 11293, 51319, 17540, 4934, -47599, -70341, -15527, 24093, 40223, 87429, 155354, 134711, 171628, 26902, -105330, -71305, 2216, -51370, -85836, 32134, 89852, 112554, 22005, -16197, -66685, -135555, -145808, -66709, -9402, -81750, -55888, 15746, -38611, -95507, -122236, -39418, -26675, -2933, 811, 22971, 11628, -47881, -130287, -123991, -102602, -81739, -29743, -55331, -68781, -110338, -92342, -66627, 39646, 38407, 30542, -22850, -80202, -70161, -130056, -83951, 44481, 63429, 68628, 53368, 25492, 23371, 890, -46484, -95544, -46204, 23128, -24093, -295, 23070, 446, 2802, 47987, 11048, -71702, -73733, 14449, 65122, 58083, 13778, -35269, -48837, -26132, 69620, 112382]
17538A12382R364J2526N8969O9590M5900k7982r86n110q4184K0007M0349J44203
17526C95028k934q6067N5087k2964p9564j31246r0587M0048P8080M9693k9529
17515A75045o4407Q2465J24177M2098n9915k291K9900n8978n5842J5911Q4128
17504C12291q2087o3864j7780J8713O7608k6984j18069j1352p272J00334Q6414
17493B57952k9352k1615k3928l5687N3141O9961K6496j9816p9762k5353N6752
17482B28789N3275j0449p0096k9970K1737N6241l68o7K6314K9085K6316l0109
17470C00698K3022J1103j3003j0842k5014l6747J5553j14263q1367j8634l9881
17459A0625q1592j862J06322N9029P0260l097j6195M3388o0143j12043k5915K9488
$$ y = [112382, 121746, 134272, 193241, 262831, 308731, 280749, 279763, 274653, 190469, 210476, 250825, 395028, 392094, 306027, 361114, 338150, 258586, 127340, 36753, 76801, 154881, 204574, 175045, 110638, 193103, 317280, 359378, 299463, 297172, 327072, 268094, 212252, 228163, 312291, 230204, 166340, 148560, 167273, 234881, 207897, 89828, 78476, 71204, 171538, 257952, 228600, 206985, 183057, 147370, 200511, 270472, 296968, 277152, 197390, 172037, 228789, 282064, 271615, 201519, 171549, 193286, 249527, 249159, 249092, 275406, 304491, 330807, 300698, 323720, 334823, 321820, 310978, 285964, 249217, 264770, 150507, 69140, 50506, 10625, -70967, -72829, 33493, 92522, 162782, 159685, 143490, 186878, 126735, 14692, -11223, 18265]
17447A8265Q1176Q9813K08897J75922Q4677q3881j51042j84540j25345P6178K9826
17436B19946r2307o3802p069q8921N386M9325M0040L4570l6430q874k2202j5373
17424A4289l2862M3003Q3959J0102L7990n4870m9071L3715l3936p7549n3253L3420
17412d5063N0149j6558M8015m1292l2779M887K054j6297J45182j8953M9711k725
17400A26331o1543j4581o6037q1141o8660n4924M5419K6847o574j4207O3999Q3872
17388b1199l3274k466Q0167o2249k761j8808K9292m432k9786l3467J6571K101
17376h0311r006L0029O085K4118K9752o450q9544n638K1753j6544P9604o233P3591
17363E1206K7188N9808p2259k2945k912K8310L3992K6747L5296O0733n6934n4285
$$ y = [18265, 99441, 189254, 398151, 574073, 658750, 574869, 423827, 239287, 113942, 190120, 219946, 127639, 63837, 56768, -32153, -26767, 22558, 62598, 97168, 60738, 51864, 29662, 14289, -18573, 24430, 108389, 118491, 156481, 101611, 52540, 86255, 52319, -25230, -78483, -45063, 5086, -11472, 36543, -4749, -37528, -32641, -30587, -46884, 98298, 79345, 129056, 126331, 64788, 50207, -15830, -96971, -165631, -220555, -175136, -148289, -154863, -169070, -105071, -21199, -54473, -56939, 23228, -39021, -41782, -60590, -31298, -35730, -65516, -98983, -82412, -80311, -89317, -59288, -53203, -29085, 667, -5783, -95327, -100965, -79212, -95756, -16152, -22385, 51206, 78394, 138202, 65943, 42998, 40086, 68396, 102388, 129135, 164431, 225164, 168230, 113945]
17351A13945q6082j2871L0370l8780j4791k3731M6838j02328l0687J06077J22544
17340A10504r113r3760l6021J9704j6729k6543j6015K7970k1049M8382Q3592m2640
17328B8282R995L7091r4874n0156L5673l132O340o083J7866O3750L1971l1086
17316D5637n3679m0890O6422R7058K690o470l6212K3259p2125j9327n4557N2929
17304D735j451j1498l0024p2558j9943j9185N4441J130M4586O5213o053j4306
17292d913J0940R99m6503r5458l0727l4343N5905J44197M8301n6402j9435j3215
17280d0654J5498q604L5831n7026n8595m0023r55j2332j2440M6066L5772L291
17268i4171K8500j1823L6879P899M167m4870J1490n0551n4007J4532m6093j7567
$$ y = [113945, 27863, 14992, 45362, 6582, -8209, -31940, 14898, -87430, -118117, -12040, 110504, 101391, 7631, -28390, -8686, -25415, -51958, -67973, -40003, -61052, -12670, 70922, 28282, 38277, 75368, -19506, -69662, -33989, -37121, -30781, -36864, -18998, 44752, 76723, 45637, -8042, -48932, 17490, 114548, 117238, 110768, 74556, 97815, 25690, 6363, -48194, 4735, 3284, -8214, -38238, -110796, -130739, -149924, -95483, -94353, -49767, 15446, 9393, -4913, 6027, 7026, -39477, -134935, -165662, -200005, -144100, 97, 48398, -8004, -27439, -40654, -25156, -33760, 2071, -54955, -113550, -153573, -154528, -166860, -179300, -133234, -97462, -94171, -65671, -77494, -40615, -32716, -28549, -73419, -61929, -112480, -166487, -151955, -198048, -215615]
17256b15615k9142J5320L4984P5328L166l924l0051p356L1802O5541J5386J04233
17244E9672J5473n5681M0063J0765j05789J5977m4267R38M253m1260K2944O3313
17232a3599O9720m8009Q3069l1070n3278O083o9304k1823K6118N2654o3280m2507
17220a05226N9077K1918L9086j2206R5406M4460j1247q2183r0592K1238P8399
17209E8130R219o1760n1304K7955M5399J9478n491L1462O3159o1378j9931J2948
17197F7886k1437N9130J0624j7669o8650K3413p8965J863L7780l5904r916K7709
17185d136P670j6100p6389k1064P0706Q7212k8666o8624m5035j8601L6295j4429
17173i1161O8768L5240p535l1390m4202p3561l8700K0723N1236Q9535J1238N6581
$$ y = [-215615, -244757, -229437, -194453, -119125, -115959, -119883, -149934, -157290, -125488, -59947, -44561, 59672, 75145, 19464, 59527, 70292, -35497, -19520, -63787, -62849, -58596, -99856, -76912, -13599, 56121, 8112, 91181, 60111, 6833, 12916, -56388, -78211, -52093, 561, -62719, -105226, -46149, -24231, 14855, 2649, 98055, 142515, 131268, 49085, -41507, -20269, 58130, 67349, 5589, -45715, -17760, 27639, 47117, 41626, 73088, 136247, 74869, 54938, 67886, 46449, 105579, 116203, 98534, 29884, 53297, -25668, -23805, 13975, -21929, -31845, -4136, 3534, -12566, -88955, -110019, -39313, 47899, 19233, -49391, -94426, -113027, -76732, -91161, -22393, 12847, 5312, -26078, -70280, -143841, -182541, -161818, -110582, -21047, -9809, 46772]
17161D6772k5459J8496j544q0850n1509o1729L6691N2858L2628N3589P3067k1884
17149G1126O6007J3881o7732L4335m0608j12381j1329k0650k9188N6272Q9364
17138D9097o58n4614n510K9882m9537K0175R038M2773O8906j17861j28873L1971
17126a05211K1502L9919n5663Q725k1204K2838o7417j4118N2186L8304J2808Q3739
17114A6408N9159q2759n022N5527p9345p2149j3344k2995K9923M6150P2167m5967
17102d2247p3807J2135L4579N2986K6810O1673n6801n1646K5624O9964j2849j6627
17090B9794K9772j45789k9378Q8878Q601k8352M5279L7302n296r1496j6682O3010
17078a4357J6739m2097J6632j2572M2491J4238M1090l2667l5390j0123o3324N7967
$$ y = [46772, 21313, 39809, 38265, -42585, -94094, -155823, -119132, -66274, -33646, 19943, 93010, 71126, 137133, 151014, 83282, 117617, 77009, -35372, -46701, -67351, -96539, -40267, 49097, 48439, -6175, -11685, 18197, -31340, -11165, -2127, 40646, 109552, -8309, -137182, -105211, -83709, -43790, -99453, -90728, -111932, -89094, -156511, -170629, -118443, -80139, -67331, 16408, 75567, -7192, -12214, 43313, -36032, -108181, -121525, -144520, -114597, -68447, 3720, -42247, -116054, -103919, -69340, -16354, 10456, 72129, 15328, -36318, -10694, 59270, 46421, 29794, 59566, -86223, -115601, -26723, -18122, -46474, -1195, 36107, 30811, -60685, -77367, -14357, 2382, -39715, -23083, -35655, 6836, 21074, 62164, 29497, -5893, -16016, -79340, -21373]
17066b1373R5721K0897o4843m7097k5592M1196l1278L688n3380J4405o2067N2421
17054g7302m5126j9454J11306L2618M8107o9214K8234K4178m5668Q015N6215N1827
17042A03736p8928n3264O1868N3334l415m415K6234j19489l7843J5702L2829m1059
17030d4710J970j08452M6158p696J6826P9672N3226J6393J2927l9766L3340k0123
17018C9765P7906k0163l1833n1532k6922M6295l3723j0571L7831j9271N0953j08514
17006d9779k9920O4418K6551m9120L0807k706P207J23769m0920p0940K1228l7282
16994f687P57L3700j2950o0012p5030j38687m6554J32972J59750M6724o9962q7740
16982a23719j3500q0000M9786O8240N4776K1098k0830P1768P6434k3161r0316
$$ y = [-21373, 74348, 95245, 30402, -16695, -42287, -1091, -32369, -28681, -82061, -67656, -129723, -77302, -122428, -141882, -30576, 2042, 50149, -19065, 9169, 33347, -12321, -4306, 51909, 103736, 24808, -28456, 33412, 86746, 83331, 78916, 105150, -14339, -52182, -36480, -3651, -44710, -42740, -151192, -105034, -112730, -95904, -16232, 36994, 53387, 66314, 26548, 59888, 39765, 117671, 97508, 65675, 14143, -12779, 33516, -207, -10778, 27053, 7782, 58735, -49779, -79699, -15281, 11270, -37850, -7043, -9749, -2542, 121227, 80307, 9367, 30595, -6687, -5930, 27770, 14820, -45192, -120222, -258909, -305463, -172491, -12741, 33983, -35979, -123719, -137219, -217219, -167433, -99193, -44417, -23319, -44149, 27619, 104053, 80892, -9424]
16971i424p2569m2031J4531K5800k890q815M8928O0189l6527L7308P4716N8685
16959A47901k3367j9890n8404m8846M5198n186j4918n3617J16791J61527J3052
16948B60241j37188m3264k1683k8554O5605l4328O6778o5138j16220l6520J05572
16937A5301L6135m8341k2640R968J1314K5927M1285k908L0014k0916j8019k814
16925E4306j093N1391Q4971p22m1638k8589j32264m3068j09251N0499O7012q373
16913e6819M6049o98L4618J3499m5678J0449K0467J9090j2931n6238l0896o5742
16901a24830L4433J3020j0692J20922L4433K7462M6077K0920K7783p6782p5355
16890C7391j7748M024r0684J2945j6253K6998L3515J32444J08113q1210n6701
$$ y = [-9424, -81993, -124024, -109493, -83693, -86583, -95398, -46470, 13719, -22808, 14500, 89216, 147901, 124534, 104644, 46240, -2606, 42592, 37406, 22488, -31129, 85662, 247189, 260241, 123053, 79789, 58106, 29552, 95157, 60829, 127607, 62469, -53751, -90271, 15301, 51436, 3095, -19545, -9577, 1737, 27664, 68949, 66041, 96055, 75139, 57120, 54306, 53213, 104604, 189575, 188853, 147215, 118626, -13638, -56706, -165957, -115458, -48446, -56819, -10770, -11468, 23150, 36649, -9029, 1420, 21887, 40977, 28046, -28192, -59088, -124830, -90397, -77377, -88069, 32853, 67286, 94748, 140825, 161745, 189528, 112746, 37391, 19643, 23667, -67017, -54072, -70325, -43327, -9812, 122632, 230745, 149535, 92834]
16879I2834k2310o9210r5207L8940L1113L1718Q726N745k4858q489N3626l3922
16867H706m4599k5765l747j0298Q498N9314K9523j6441M1695K0600N7478K2560
16855A47524M3181n2015j01611k8904j4652J05287M3010J0683O4578Q5392J66981
16844D69454K3227l6959p9881j03875j34973m5426j976n0093L2815L1471o5728
16833C8056k1058M7486K7044L9071L068K743m6199l4544q794N0572k1904k7068
16821D8473o0417K9017l9956P7428P969m5672L8048Q7213N8132r9365k2405L1507
16809A09972N8351o5004n7369m054J986K4744M1556k541q6713q9318j9882N927
16797h2345K5706L4602K3216O064n9630K3652N7422n66K3581L825p2910p271N3763
$$ y = [92834, 70524, 1314, -93893, -54953, -23840, 7878, 16604, 22349, -2509, -10998, 42628, 8706, -35893, -61658, -65405, -75703, -67205, -7891, 21632, 5191, 46886, 67486, 124964, 147524, 190705, 138690, 37079, 8175, -6477, 98810, 141820, 152503, 217081, 302473, 469454, 492681, 455722, 375841, 271966, 136993, 91567, 89591, 39498, 72313, 103784, 38056, 16998, 64484, 91528, 130599, 133667, 136410, 90211, 55667, 46873, 97445, 75541, 48473, -11944, 17073, -22883, 54545, 62514, 16842, 54890, 142103, 200235, 100870, 78465, 109972, 168323, 103319, 45950, 41896, 43882, 68626, 110182, 107641, 20928, -68390, -88272, -82345, -56639, -22037, 1179, 7243, -52387, -28735, 28687, 28121, 51702, 55527, -17383, -24654, 29109]
16784B9109K9207o9738q6771N4243j8898m7911O0928L1633P6122K4278M501l2062
16772E4641m8999l1329l6751L0861M3372Q58J02145Q8280r1428j2467J1677m3513
16760F7347N68K279j2668k8194L8021m462m5457L2589K4919N9946L0527n679j1485
16747A48251M0947M0890j14323j38435J7330J5514J685j543J1978K6087O1597
16736A09978k0730r7767j28832N4122J40454N211q5722n489N754L0280M7790K8999
16724H4048o0392J3414j4836n5438M2172N5425J1777l2540K2730L4144J08243
16713B08747J8439m3702j61863p3227r929N2022K0495J5928K2492j3388o0855
16702b4841J4318N4587J25132J42510J5268J9883m1392j22755J12m7210q0139
$$ y = [29109, 58316, -11422, -98193, -43950, -62848, -110759, -49831, -18198, 57924, 82202, 86703, 54641, 5642, -25687, -62438, -31577, 11795, 12653, 114798, 203078, 111650, 99183, 110860, 67347, 67915, 70194, 57526, 29332, 67353, 62891, 17434, 50023, 74942, 134888, 165415, 159736, 148251, 189198, 230088, 115765, -22670, -5340, 10174, 11859, 10316, 22294, 48381, 109978, 89248, -8519, -137351, -83229, 57225, 62436, -23286, -28775, -23021, 7259, 55049, 84048, 23656, 37070, 22234, -33204, 8968, 64393, 76170, 43630, 66360, 100504, 208747, 227186, 183484, 21621, -51606, -61535, -9513, 10982, 26910, 49402, 36014, -24841, -10523, 44064, 169196, 311706, 326974, 346857, 305465, 182710, 182822, 135612, 55473]
16691E5473p2222L3692M543K3472K6953m3784K5725R7271M621M513k230k5255
16679A32772q3838j1639L3461j7227m5934o6745J7444j0333J22496N2198o9143
16668E3512P543o116Q5175N8168M5366R8l6928l8119p5097m2461R673J6196j04029
16655b7019q5384L0922L466j5832K1926L5325J2117O4632O0687l170j49630l6581
16643h8541o786p224J23649J09963r41q5900p0121P1029Q2950k0610j1222J8239
16631A14485l4722k5448K1129j8812k6416M5363L5336L5580l2106l0594J8187
16620A01982q0880j37875j09056Q2508K5020K983Q5304j2598j11952o2767K8991
16609a88340N3439K4194m5018J09152J48883J3779K6n1957K3971R834o1957o5838
$$ y = [55473, -16749, 16943, 21486, 44958, 71911, 28127, 53852, 151123, 155744, 160257, 158027, 132772, 48934, 37295, 70756, 53529, 7595, -59150, -41706, -52039, 70457, 122655, 53512, 61055, 54939, 140114, 198282, 243648, 243746, 206818, 168699, 93602, 51141, 60814, 77010, -27019, -112403, -81481, -78015, -93847, -71921, -36596, -24479, 40153, 100840, 97670, -51960, -88541, -95327, -102551, 21098, 131061, 130120, 44220, -25901, 45128, 128078, 107468, 96246, 114485, 79763, 54315, 75444, 56632, 30216, 75579, 110915, 146495, 114389, 83795, 101982, 21102, -116773, -225829, -143321, -118301, -115318, -30014, -42612, -154564, -217331, -188340, -134901, -110707, -155725, -46573, 102310, 116089, 116115, 64158, 88129, 97963, 36006, -29832]
16597b9832k1960j9748P787L5730J8003P1168J25624J2246p5437q5234P379K8137
16585G3863j6308k4987L2583p0878J2375J0698J12948n2626q1531l285n8036j4671
16573g9855m4772P9372Q7073k9482K2451N71j2067l6096n3526j02235P3442R2303
16561b821j1694l6848L1412N9844J8111o3954j1220N729N7565J1080m9099q4926
16549g6821k9416j5317Q7287M5645O7842J2893J9678m3335L8914J6626j8459k1263
16537H4274q053J8871M3883l4039j5009k8513n5868l9699L2555N419O8574P9228
16525A51623k0471n0548M2888K8478J4836m835j4419m5967o9945o8749M4189R0025
16513I7105K476j6147o0114l1605K9029J30587J9957m3500J9339k8910p8249k3863
$$ y = [-29832, -51792, -71540, -63753, -28023, -10020, 61148, 186772, 199018, 123581, 38347, 45726, 73863, 57555, 32568, 65151, -5727, 6648, 17346, 130294, 77668, -3863, -7148, -65184, -79855, -124627, -45255, 41818, 12336, 34787, 35358, 23291, -12805, -66331, -168566, -95124, -2821, -14515, -51363, -19951, 39893, 58004, -5950, -17170, -11441, 46124, 57204, 8105, -76821, -106237, -121554, -34267, 11378, 79220, 92113, 111791, 68456, 107370, 123996, 105537, 84274, 76221, 95092, 138975, 104936, 89927, 61414, 5546, -34153, -1598, 3821, 72395, 151623, 131152, 80604, 123492, 151970, 166806, 161971, 147552, 101585, 31640, -37109, 7080, 97105, 99581, 83434, 23320, -8285, 20744, 151331, 171288, 127788, 147127, 118217, 39968, 16105]
16501A6105M0138l3658q850J9733J5334j2138m4182N1313K3917L8301j0968L8796
16489A33841l3272j1454l4187M3696Q2144O712o3589J914M99n6444L658L6106
16477A09624l9492k1716L2220K0111K1125n0250m8241O1889J6443J8976K7409
16466A48098m0617q4111k7L6034j1302n7796k0218l3554k5955k4819L1521Q7099
16454D353J392j840Q808Q4968J9820l5398o3019p2384L8602L2629R6988m0225
16442G4694j9182J7547K9564j5841K2300L8498k7087L4720M6697J0113k6308j4405
16430A71310P928k961l5858p656k1575j4387K0530J24720l9308n6494n7795n7221
16418C1233K4005j6315k5338O5066N7165k3070l4313k9892m2181r3240J7005M3153
$$ y = [16105, 56243, 22585, 13735, 33468, 48802, 36664, -7518, 43795, 67712, 106013, 95045, 133841, 100569, 89115, 54928, 98624, 180768, 187480, 123891, 125805, 126304, 69860, 73518, 109624, 70132, 48416, 80636, 100747, 121872, 71622, 23381, 85270, 101713, 120689, 148098, 107481, 23370, 23343, 59377, 48075, -9721, -29939, -63493, -89448, -114267, -82746, 4353, 5745, 3905, 12713, 97681, 117501, 82103, 19084, -53300, -14698, 17931, 114919, 74694, 55512, 73059, 102623, 86782, 109082, 147580, 120493, 155213, 201910, 212023, 185715, 171310, 179238, 176277, 140419, 132763, 111188, 96801, 117331, 242051, 202743, 146249, 88454, 31233, 55238, 38923, 13585, 78651, 135816, 112746, 78433, 48541, 6360, -86880, -69875, -26722]
16406b6722k2767K8723K0365Q5277L5306J9456M136l6289k7324J1632M6565J2199
16394A50557l1789k456l246M3510M8711j10227r1101j37601L1103M3654l5836
16383i4721L4009M8121L9362M5256m3139j15343K965O6862J08065m274n2275J9163
16371E4051O2310J0328l9697J5069k4541k7593J4562j2352o1269Q2208J1989j0962
16359G4103O4911N5355j00947k3144J8720n303l904N8648J4145l690j12843n4438
16347a8387j708J3128P6874J20775m9234k6988q0712K4954R3465P6042M9084p6677
16335B00616l6492m9889J0546N2644j3127k3317K6192r5342j3322M6849P1764
16324A77122n973j11961n8970M8253K9609l2592m0108L1537L3353k1120K4526
$$ y = [-26722, -49489, -20766, -401, 84876, 120182, 139638, 143774, 107485, 80161, 91793, 138358, 150557, 118768, 116312, 113066, 156576, 205287, 95060, 3959, -133642, -102539, -58885, -94721, -60712, -12591, 26771, 72027, 28888, -86455, -83490, -16628, 91437, 87163, 34888, 54051, 116361, 126689, 86992, 102061, 77520, 49927, 64489, 52137, -9132, 73076, 85065, 74103, 139014, 194369, 93422, 70278, 88998, 83695, 79791, 138439, 152584, 148894, 36051, -18387, -20095, -6967, 69907, 190682, 141448, 114460, 33748, 58702, 152167, 228209, 277293, 200616, 164124, 114235, 124781, 177425, 164298, 140981, 167173, 71831, 58509, 105358, 177122, 171149, 59188, 218, 48471, 78080, 45488, 5380, 36917, 70270, 49150, 73676]
16313G3676K5872j2678K7466J9688k6525p59m9096j0250J8857k3114k8005P8423
16301I3555L5988l55P940o915N163K0120O8334J09276O1883l6267J0596J4647
16289C83965m4705j1492O9727J30959J99711K70233L46523L51647L51089K94886
16279B342543K34467J40999o6539j96466j58778j68733j86198k34559k06141k45934
16269A254661k68495j68249j29393p8112n2235K2150o0504o5333J123m4791J8389
16258D29211j6041K1833q6730q5613J840K0936n1067J2503m8134K237k8555K1727
16246A94147q03n3941o9070K8127J34190P0706R236l0985O833j02784l7242M8046
16234A96460L7236j2366J1913J8917k7525l2721l7706m2891l1365J5693m6852
$$ y = [73676, 99548, 86870, 114336, 134024, 107499, 106740, 57644, 47394, 66251, 43137, 15132, 93555, 129543, 129188, 137128, 130213, 135376, 155496, 223830, 333106, 394989, 358722, 369318, 383965, 339260, 327768, 397495, 528454, 728165, 998398, 1344921, 1696568, 2047657, 2342543, 2577010, 2718009, 2651470, 2455004, 2296226, 2127493, 1941295, 1706736, 1500595, 1254661, 986166, 817917, 688524, 610412, 558177, 580327, 519823, 454490, 455613, 410822, 429211, 413170, 435003, 348273, 262660, 264500, 285436, 234369, 246872, 198738, 200975, 172420, 194147, 193344, 139403, 70333, 98460, 232650, 303356, 312592, 281607, 288440, 185656, 148414, 196460, 233696, 221330, 233243, 252160, 224635, 191914, 154208, 111317, 79952, 95645, 48793]
16223D8793N9995M3797l6857r8254J6680j0517J081K9677o411R941J4231M3131
16211A15287M4780O6804m1235p2390K0932p9382M4977o1916K6504K5066k5291
16200F4136j2451K3135o2562n5409j2033P1184J8012K6167L8480l7205N144J4426
16188H1024k374M1916Q2400l3917j25103J6837P5001M6956k9337K214J9098M9226
16176B23941k154l6454N8410m829k8134R559q763L0326o4973q7135j04759K642
16164a2323L9376r830L7357M1055r594J2234O0558p5659l6160J02319L3399J6185
16152A98917m5467M8541Q1050j4282p4031J0924Q6212o1523k0757k5341m4612
16141A39631l5965L0320P4973k8054j2851j7759N7506N4780o8647N2864N1811
$$ y = [48793, 108788, 152585, 115728, 17474, 34154, 23637, 24718, 54395, 47984, 57925, 72156, 115287, 160067, 226871, 185636, 113246, 134178, 54796, 99773, 37857, 64361, 89427, 64136, 51685, 74820, 12258, -43151, -55184, 16000, 34012, 60179, 98659, 61454, 66598, 81024, 78650, 120566, 202966, 169049, 43946, 60783, 135784, 182740, 153403, 155617, 174715, 223941, 221787, 185333, 243743, 238914, 210780, 220339, 211576, 241902, 176929, 89794, -14965, -12323, 27053, 17223, 54580, 95635, 86041, 98275, 158833, 83174, 47014, 149333, 182732, 198917, 153450, 201991, 283041, 268759, 194728, 205652, 291864, 230341, 209584, 184243, 139631, 103666, 133986, 208959, 180905, 168054, 150295, 207801, 262581, 193934, 246798, 298609]
16130B98609k2842J13953k5527l8601K5988J1306r9836l3572J65106R0270l8219
16119D46635j56924n9829O829r825p296j1005J7377J1158o3061K8343L1847K4159
16107B58408k6343n3123p4976k5042q056J9262L4704J19071J1595K5166M6547
16096C27213J7427K4128j6321n2298J1703M4537N1604o336j0544M0712O9596J8436
16084E19857P5145Q9257P2619J6095J1319L9498K6005o0462l1554K0145r1968
16073F85956p7175j25065J5146j8317j32853p8175K5987p5755K8084N7572m7777
16062B57628Q8918K2848L8515m9602o2134P362R9925k956j4430L1774P0009J8663
16050E06520k0381l8823l2863n673K1260J3678L5515L3160J8221n0969j21565
$$ y = [298609, 275767, 389720, 364193, 325592, 351580, 362886, 263050, 229478, 394584, 484854, 446635, 289711, 229882, 236711, 226886, 219590, 208585, 225962, 237120, 174059, 202402, 234249, 258408, 232065, 178942, 103966, 78924, 70868, 90130, 124834, 243905, 255500, 280666, 327213, 344640, 368768, 352447, 300149, 311852, 356389, 407993, 401657, 391113, 431825, 501421, 519857, 595002, 684259, 756878, 772973, 784292, 823790, 849795, 789333, 757779, 777924, 685956, 608781, 483716, 498862, 480545, 347692, 269517, 295504, 219749, 247833, 305405, 257628, 346546, 369394, 407909, 358307, 296173, 303535, 403460, 400504, 386074, 417848, 487857, 506520, 486139, 447316, 414453, 408780, 430040, 443718, 479233, 512393, 530614, 479645, 358080]
16039C58080o7861J53072P2775j3353o2541M1935J05752M815M2092l5591l6074
16028E63101r8186k2447k010M6728O6159L692j12230J6285K7862M4352l319j16077
16016D13910j6254R8984N0576O5571L6144q6795m4377L3412P6605M7986j12345
16005E63417j20174L268k380K3494N6020M8840k5115o4887l5735J513K9481Q0462
15993E58204N424o9894M92O1256j256q1617l6720J09513Q0547r7773n5779j1677
15981D60720j3552q1295K8397J05206O8280k8646n9166Q1391K9687j41588L1742
15970D81176Q2352P8318J36588M2949l509k7920M5806K290M4172R509q1443K0422
15958H30710Q3217R1919M3137L9546p5419l2629J60099l4775p1609n5152o1003
$$ y = [358080, 290219, 443291, 516066, 502713, 440172, 482107, 587859, 592674, 634766, 599175, 563101, 464915, 442468, 440458, 487186, 553345, 557037, 444807, 461092, 488954, 533306, 529987, 413910, 397656, 496640, 547216, 612787, 648931, 562136, 517759, 551171, 627776, 675762, 563417, 443243, 446511, 444131, 467625, 523645, 572485, 547370, 482483, 446748, 448261, 477742, 558204, 563628, 493734, 494226, 555482, 554226, 472609, 435889, 545402, 625949, 528176, 472397, 460720, 447168, 365873, 394270, 499476, 567756, 539110, 479944, 561335, 591022, 449434, 481176, 563528, 641846, 778434, 821383, 817874, 789954, 835760, 838050, 882222, 891731, 810288, 830710, 913927, 1005846, 1048983, 1088529, 1013110, 980481, 1140580, 1105805, 1034196, 979044, 918041]
15947I18041j8438O5021j1903K368Q2584J571n936Q2742k4325j3817l3019J6931
15935A061820m8836k8928R8253M2685K016R869K714L6409k7432j731l5266k0779
15923A090794K9944J8833Q3074K9355L0365L8277n67n3648l0659R1801O1213K4494
15911A413276J0343J5250j7250j17074k8659N3792J23559M4779O2608J5090M386
15900A580100O0307O1883J20087J26496O4219K6834P8493Q3195N9943n804m7952
15889B207801J09109J87887J07066o452P3960Q1691R5930Q3935J49107J31762
15879C221796j6162k8701P8554q053m0096J17735J73077J67659N7518M3536R0315
15868C857178J14320K37924J90365J92499L24348L73452K75703K87986L54897
$$ y = [918041, 899603, 964624, 952721, 955089, 1037673, 1039244, 1033308, 1116050, 1091725, 1077908, 1044889, 1061820, 1012984, 984056, 1082309, 1124994, 1127010, 1136879, 1139593, 1176002, 1148570, 1146839, 1111573, 1090794, 1120738, 1139571, 1222645, 1252000, 1282365, 1320642, 1320075, 1266427, 1235768, 1327569, 1388782, 1413276, 1423619, 1438869, 1421619, 1304545, 1275886, 1329678, 1453237, 1498016, 1560624, 1575714, 1580100, 1640407, 1702290, 1822377, 1948873, 2013092, 2039926, 2118419, 2201614, 2261557, 2255753, 2207801, 2316910, 2504797, 2611863, 2605411, 2679371, 2761062, 2856992, 2940927, 3090034, 3221796, 3205634, 3176933, 3255487, 3247434, 3207338, 3325073, 3498150, 3665809, 3723327, 3766863, 3857178, 3971498, 4209422, 4399787, 4592286, 4916634, 5290086, 5565789, 5853775, 6208672]
15859F208672L69626L74655L16564M98826N29855N76217O29110Q28338R24584
15850A1256447J082912J241511J619085J914392K228796K462904K765929L087263
15842B7659239L561536M119015M974177O476573Q553718J1673182J6697150K4605379
15834A08319969L5835505M9287473O1365588O7613539O5798902N4923005L7365409
15827D80509390J5843832n994208k5372476m0661394n1280085n6420305n5681948
15820B60942806m9423603m0381430l0771006k2361813j5874381j1415059q529060
15813H2186454o792277n856166n257603m772189m605027m294250m013312l774016
15805D2821614l383388l104732k749156k250526j947749j596294j436414j281583
$$ y = [6208672, 6578298, 6952953, 7269517, 7768343, 8298198, 8874415, 9503525, 10331863, 11256447, 12339359, 13580870, 15199955, 17114347, 19343143, 21806047, 24571976, 27659239, 31220775, 35339790, 40313967, 46790540, 55344258, 67017440, 83714590, 108319969, 144155474, 193442947, 254808535, 322422074, 388220976, 443143981, 480509390, 496353222, 490359014, 464986538, 424325144, 373045059, 316624754, 260942806, 211519203, 171137773, 140366767, 118004954, 102130573, 90715514, 82186454, 75394177, 69538011, 64280408, 59508219, 54903192, 50608942, 46595630, 42821614, 39438226, 36333494, 33584338, 31333812, 29386063, 27789769, 26353355, 25071772]
15797B5071772j173726j186323j247757j282677j367457j492503j383907j276517
15789A4660905j300729j229751j202667j141664j025858j015925r06259p80501
15781F057551p08381o92023n64676m21810m72550m52624l68944k41406k70525
15772A864612k04451j29295j47592j43824j40037r4259q0977j22980j42158j10250
15762E48789O3727l6292q0061l814n7424n0774k4300q275l0720m0016p741O5862
15750C38961j5868j04399k3618m6511j8342J036m2112L7919M6328K0001n3324
15739A40071M307n5007n6618j9138k0259Q5547Q6228K92j25754o3456k433R874
15727a6346J11704l7134m4198j2350M034j0781k4770l9393K5860R7389P4546m3113
$$ y = [25071772, 23898046, 22711723, 21463966, 20181289, 18813832, 17321329, 15937422, 14660905, 13360176, 12130425, 10927758, 9786094, 8760236, 7744311, 6838052, 6057551, 5349170, 4657147, 4092471, 3670661, 3198111, 2745487, 2376543, 2135137, 1864612, 1660161, 1530866, 1383274, 1239450, 1099413, 1005154, 924177, 801197, 659039, 548789, 612516, 576224, 496163, 492349, 434925, 384151, 359851, 351576, 320856, 280840, 273099, 338961, 323093, 218694, 195076, 148565, 130223, 131259, 89147, 127066, 173394, 193395, 140071, 144378, 89371, 32753, 13615, -6644, 78903, 165131, 165423, 39669, -23787, -26220, -16346, 95358, 58224, 14026, 1676, 5710, -5071, -29841, -69234, -43374, 54015, 128561, 85448]
15715H5448m4271n2466Q186L4593o5124K7311K2005L9120N7895N7111j542J1119
15703A79385l0185n0901o7085N4947M554q3209r8875k9457m937K4039L3582M2752
15691b5390L6246o5656p7364K2286R9445K5521M6751J1740M0070n2401O8997O2976
15679A93221k6524l6606L1814P524J8112L6664p4146j36819k7K2576l2371l8591
15667c5173m772k1471m649o8228N0777L9214k3348L4392k8977k987j0898k6012
15655a02132n3552K9762K2617j29748m6725M2911M8724j3073p1724l9906k2940
15644c35786N3934J03610j9286k5089J2160J7482l7979M8178K1590l1153J20414
15633g1925L3443j23699r341K6608q0371m1927j2548J05668p4292o9817j211K3047
$$ y = [85448, 41177, -11289, -3103, 31490, -33634, -6323, 15682, 54802, 112697, 169808, 168266, 179385, 149200, 98299, 31214, 86161, 90715, 7506, -91369, -120826, -125763, -101724, -68142, -25390, 10856, -54800, -132164, -109878, -10433, 15088, 61839, 73579, 113649, 61248, 130245, 193221, 166697, 130091, 161905, 169429, 187541, 224205, 150059, 13240, 13213, 35789, 3418, -35173, -39945, -61416, -66065, -134293, -83516, -44302, -67650, -33258, -62235, -65222, -76120, -102132, -155684, -125922, -103305, -233053, -279778, -236867, -188143, -201216, -272940, -312846, -335786, -281852, -178242, -197528, -222617, -210457, -192975, -230954, -182776, -161186, -192339, -71925, -38482, -162181, -171522, -144914, -225285, -267212, -279760, -174092, -248384, -318201, -319412, -296365]
15621b96365K1469K4548L897R0580M5143q1571j6281N611M3275k075k3433J6777
15609a68425N6500M8547M2405N0613M012n9865r8896o109K3512L7846o6659q9758
15597b26277J7857m2123K5026K3144J3127K064J7088R2451K6941o6888o8259J4322
15585a71527J13179L925K7571k824q5041O098q299Q9992L7554j6362n6629m9475
15573a11838M5146M3614m9678l6469L7518r9904l9936M1355J0250o8147J6005
15562b12084O6702O8045J3507L3623Q6162j25335j36840m1164J4925M3133J03837
15551h5489o5332m3265k2391l8901m1296N8432P8896L9648J8747J0292j7636k8370
15539a36665J578L6095o4371j9802l4075m5018M8233M8817P6429O7360J2875j34550
$$ y = [-296365, -274896, -250348, -246451, -155871, -110728, -192299, -208580, -202969, -159694, -161769, -185202, -168425, -111925, -63378, -20973, 29640, 33652, -26213, -125109, -131218, -107706, -69860, -136519, -226277, -208420, -250543, -225517, -202373, -189246, -187182, -170094, -77643, -50702, -117590, -185849, -171527, -58348, -54423, -26852, -29676, -114717, -108619, -116918, -26926, 10628, -5734, -62363, -111838, -66692, -23078, -72756, -109225, -71707, -171611, -211547, -170192, -159942, -228089, -212084, -145382, -77337, -63830, -30207, 55955, -69380, -206220, -247384, -232459, -189326, -85489, -150821, -194086, -216477, -255378, -296674, -238242, -159346, -119698, -100951, -90659, -108295, -136665, -135087, -98992, -163363, -183165, -217240, -262258, -214025, -165208, -88779, -21419, -8544, -143094]
15527a43094j4841L4177J0197p9682n1419n5009L0890R0769K6298J9250R3267
15516c9197N138M332Q8436l1706m4806J7504j7204j06086K4677r23k6059k5810
15504a51704n615L2525J4308j169J944Q338n741q875Q2745Q8843J14788N0145
15492B20532j39993k6121n1114p4077l7805j05001M3010J519P2199M2847J8471
15481c5533M9107r2421j28251M3164J04532O8674l7499r1416R3888R703k8077
15470d4129l3890L721J08082r203n3263m5223l2129n0864M570m3989M4294K2197
15458a29826R13j4925K6143L6597K6760k1081o1364l7816Q6278M1845L8837k0162
15446b7801l0199K5831l6799l6598O7205P817O4738J6988o0926O8302M2669l9306
$$ y = [-143094, -157935, -123758, -113561, -193243, -244662, -299671, -268781, -178012, -151714, -132464, -39197, -34059, -29727, 58709, 27003, -17803, -299, -17503, -123589, -98912, -99835, -125894, -151704, -157319, -124794, -110486, -111655, -109711, -101373, -107114, -115989, -33244, 55599, 170387, 220532, 80539, 54418, 3304, -70773, -108578, -213579, -170569, -169050, -96851, -54004, -35533, 13574, -78847, -207098, -163934, -59402, 9272, -28227, -119643, -25755, -16052, -44129, -78019, -74298, 33784, 24581, -28682, -73905, -106034, -156898, -152328, -196317, -152023, -129826, -128913, -143838, -117695, -81098, -54338, -75419, -136783, -174599, -88321, -46476, -7639, -27801, -58000, -32169, -68968, -105566, -38361, -30544, 34194, 51182, -9744, 58558, 101227, 61921]
15434F1921K1846L0558m5340p1823J09693J16534J00189M7244Q5700P8454J66766
15423G01742L13755L89601L35668K68263K22085J35243J01732n8593j07920k75255
15413B026321k70484l03822l30018k93882k35758r6260n3752M8718m0761l5845
15403D14457m4862p4941k1920M1172k3617n5488q8847j08547j3187P3608J30459
15392B28287k6536r3623l0049l2596J4035K4016p967R7528P3017K7331L051Q3849
15380C60343N3847M2991R4169J46966L06359L27035K70127K57979L09725K17237
15370B386778K6536j04223j22158j89501j81080k82575k72269k22833j76897j40432
15360G21346j30615n1148m3117j47122p2017J3107J4769m2690j54752o0881M9052
$$ y = [61921, 83767, 114325, 68985, -2838, 106855, 223389, 323578, 370822, 456522, 534976, 701742, 1015497, 1405098, 1740766, 2009029, 2231114, 2366357, 2468089, 2409496, 2301576, 2026321, 1755837, 1452015, 1121997, 828115, 592357, 496097, 442345, 491063, 450302, 414457, 369595, 294654, 272734, 313906, 290289, 234801, 145954, 37407, 24220, 97828, 228287, 201751, 108128, 78079, 45483, 59518, 83534, 75567, 173095, 246112, 273443, 276494, 360343, 414190, 457181, 551350, 698316, 1004675, 1331710, 1601837, 1859816, 2169541, 2386778, 2413314, 2309091, 2186933, 1997432, 1816352, 1533777, 1261508, 1038675, 861778, 721346, 590731, 539583, 496466, 349344, 277327, 290434, 305203, 262513, 107761, 46880, 95932]
15349I5932j3091j4098J8767K5934O1489l5123o4592p2134k6543J08508M0985
15338A26034m2350j02469k1470K3144q8002J0529Q6518K2442k5419o0000m0575
15327a11618J6018k9383p854Q6555L3657k7273k4266M9424l6357j9290M9536l945
15315b4796M3959J3871k8958p3940K7856P5000M6578Q6394K3980O7738J1579r6895
15303A72366j63373o6900k257k964L7221J02606P045O744L866J4085J9492j13321
15291A4610p1824l8477J9075P1623p477M1482j4101k9395N881M168N7401o1296
15279h330l0431M3322K5284K538j8497n7909N7340m394n0099m2200j0452m514
15267i8342L8656Q5573L3512q3528n1887j413R5821N2122k6538q414J4074n5928
$$ y = [95932, 82841, 68743, 87510, 113444, 174933, 139810, 75218, 3084, -23459, 85049, 126034, 83684, -18785, -40255, -17111, -105113, -94584, -8066, 14376, -11043, -71043, -111618, -95600, -124983, -132837, -46282, -12625, -39898, -64164, -14740, -51097, -70387, -20851, -24796, 19163, 33034, 4076, -69864, -42008, 32992, 79570, 165964, 189944, 257682, 269261, 172366, 8993, -57907, -60164, -63128, -25907, 76699, 83744, 90488, 94354, 108439, 127931, 14610, -57214, -95691, -76616, -4993, -12470, 29012, 14911, -14484, -8603, -4435, 52966, -8330, -38761, 4561, 29845, 32383, 13886, -44023, 13317, 8923, -41176, -83376, -93828, -98342, -59686, 25887, 59399, -24129, -76016, -77429, 18392, 70514, 43976, 35562, 49636, -6292]
15255f292m1457j9226l6623J9952Q8268Q0831J9192M2022Q109O2902J2316q2017
15243A47977o8959J3556j2010j1544o0099j1655K9286Q3496n051k7697P680l0265
15231E4715p9063j1525m7059J9795l355O1949K4592o7161k604Q9976l741n2227
15219a5708m6004m7561L112J6005j5724l3922L0215N8104L7138j9333q504p1269
15207a13451o425N3354J4676J2072J993o9275R869N166O3847k3572P734L8902
15195e110k1751J66p2028M4231J21472P3736R807j13794j58712L4509J306K8443
15183e7725M2801L6815L9355O7288K7381o9260l5771j3302n3117p4134K7132J25223
15171F2686L3449p2385m3799l8673O0476K7568j486k5375q8722k3476J16190o1561
$$ y = [-6292, -47749, -66975, -103598, -83646, 4622, 85453, 104645, 146667, 154776, 217678, 229994, 147977, 79018, 92574, 80564, 69020, 8921, -2734, 26552, 110048, 104997, 77300, 84980, 54715, -24348, -35873, -82932, -63137, -66492, -4543, 20049, -47112, -49716, 40260, 36519, -15708, -61712, -109273, -106161, -90156, -105880, -139802, -109587, -51483, -14345, -33678, -42182, -113451, -119876, -66522, -51846, -39774, -37781, -107056, -97187, -92021, -28174, -51746, -44012, -5110, -26861, -26695, -98723, -54492, 66980, 140716, 150523, 36729, -121983, -87474, -86168, -57725, -14924, 21891, 61246, 128534, 155915, 86655, 50884, 37582, -15535, -89669, -62537, 62686, 96135, 23750, -20049, -58722, 1754, 29322, 27836, 2461, -86261, -109737, 6453, -55108]
15159e5108o0771k4873l9655J11290M1063o3484J06493J10629N3034j14462r6742
15148c2586m3265l9873N9634l6786j22427k5827M0105L6514R2354p575J2921M1796
15136b5015P7098N0102k895r3224r7471Q053R8359M4748N6090k4359P71L6132
15124A28389K3573m0111j20396o2970Q1716N4154m9378n7685p4066L474J8066
15113i5234M3385j2259k3028J2186M7325l1070J1005N2481M1907K7035j3694N4317
15101A14356r8310k9149m5692m2983Q8971k6026k0774K3065P7227L2673J5378
15090H8736n6482n5434j1842L5090M2974p4691k4248K365K3837M8187J29132P0056
15078B17680K4988O516l8397J8967o72K63J7191P974J1415l6799p1805p1484R8653
$$ y = [-55108, -115879, -140752, -180407, -69117, -28054, -91538, 14955, 125584, 178618, 64156, -32586, -75851, -115724, -56090, -92876, -215303, -241130, -201025, -164511, -72157, -79732, -66811, -25015, 52083, 102185, 99290, 6066, -91405, -83352, 15007, 59755, 115845, 91486, 92257, 128389, 151962, 111851, -8545, -71515, 10201, 64355, 14977, -42708, -116774, -113300, -95234, -51849, -64108, -87136, -74950, -27625, -58695, -47690, 4791, 46698, 73733, 60039, 114356, 16046, -13103, -58795, -101778, -12807, -38833, -59607, -36542, 40685, 73358, 88736, 32254, -23180, -35022, 68, 43042, -31649, -55897, -53532, -29695, 18492, 147624, 217680, 242668, 249184, 210787, 229754, 229082, 229345, 246536, 254510, 265925, 229126, 157321, 85837, 184490]
15065A84490k2191K3409n3335K3185Q7594K0021j8365k4259l5834L1289J20304
15054C36308P8412J67049K02610K28778K14967J04759J35342J46854K31946K37761
15044B084786J77654M7174l9441l50r6751k61302k50055k06979j31842j82841
15034A140053k28944j73520r7804j26739r3919r7180j08286m2200Q9923k0714
15024B40670l9818p026k5810p1379N230n5778k4927k0132j607J2970L8347j5406
15012C5334o6373j6685j7568n6409q371O7760K9272L5667L2800M364r113k2531
15000H147p0762O519L6894R5699J7045p8217M9489k1917q7974k9502P3901n4329
14988e5007m9865N725k458M521O5536m1011r2632L6204Q0329J0190p686j5588
$$ y = [184490, 162299, 185708, 132373, 155558, 243152, 263173, 244808, 220549, 184715, 216004, 336308, 414720, 581769, 784379, 1013157, 1228124, 1332883, 1468225, 1615079, 1847025, 2084786, 2262440, 2309614, 2270173, 2269823, 2173072, 1911770, 1661715, 1454736, 1322894, 1140053, 911109, 737589, 639785, 513046, 419127, 321947, 213661, 171461, 261384, 240670, 200852, 193826, 168016, 96637, 101867, 46089, 21162, 1030, -577, 12393, 50740, 35334, -31039, -47724, -65292, -121701, -130072, -62312, -33040, 2627, 35427, 39791, 30678, 8147, -62615, -56096, -19202, 76497, 93542, 15325, 64814, 42897, -45077, -74579, -678, -55007, -104872, -99147, -101605, -97084, -31548, -72559, -165191, -128987, -48658, -38468, -46154, -61742]
14976f1742l2102M2404M5482J923j4407j3326K14o1556K804K9736r533O591o9963
14963a33475P8670P3340n2019j2300q017j2994N324M6835L2149j3540K548K6055
14951C2576o7018l3957M4928N3024k212j5174p843j1691O6612n7108O352J5213
14939B3702Q209N6636L2606L212O4989Q474q9436n4292l9772K8516K0216L0610
14927I3670N7022k6226j20021r0509k2450m5942J4873L0602l800J9135J08167
14916A4521n1552r3042N666Q4828L6055N6562L7922m6118k3820N770k380j2314
14904A2098j8571l132M028J0345j03359l664n5437M4448O6910K2884m7293m0413
14892a11156O958L6996M9783K4187Q8806O28K7239m7877o2798L9435N5596j3510
$$ y = [-61742, -93844, -51440, -5958, -4035, -18442, -31768, -31554, -93110, -90306, -60570, -70103, -63512, -133475, -54805, 18535, -33484, -45784, -53801, -66795, -61471, -14636, 17513, 3973, 6521, 32576, -34442, -68399, -23471, 29553, 27341, 12167, 4324, -7367, 59245, 2137, 8489, 23702, 31911, 88547, 121153, 124365, 189354, 197828, 108392, 54100, 14328, 42844, 63060, 93670, 150692, 124466, 4445, -86064, -108514, -154456, -139583, -108981, -112781, -93646, 14521, -37031, -130073, -124407, -39579, -3524, 53038, 90960, 44842, 21022, 26792, 24412, 12098, -6473, -9605, -5577, 4768, -98591, -102255, -157692, -113244, -46334, -23450, -70743, -111156, -104198, -67202, -17419, 6768, 95574, 96202, 123441, 75564, 12766, 52201, 107797, 94287]
14880I4287n7781j03575l2717j2121N1327J14504l024J0836j0854L6927n0145
14869C7664q5591m1785Q3471O5675K7095K5706L5766k6867p3827n9477Q0831k2363
14857D6298q7598K4871K7983l2735k0040j3224J8287J99666n4170j08939J9696
14846B0095J5232L5511J8667m4760j05598j11241N5636P4219L1049j3168M9989
14835B5631o9764l0235q736P4140M494P2166M7493N5746L922p0372m5099k2309
14823C7077k3779N6060m2291k2838l4141o694L7313j0850n8602k5891J8996M5421
14811c0219q408m8733k4711l5168n1603O1355N3557L4907j6750M7512P201k5475
14799c6535O4833M7866k7828N51N6220k5957j6586k675o3390j1338n3086M1654
$$ y = [94287, 36506, -67069, -99786, -111907, -60580, 53924, 50900, 61736, 50882, 87809, 37664, -47927, -89712, -6241, 59434, 86529, 112235, 148001, 121134, 47307, -12170, 68661, 46298, -41300, -16429, 11554, -21181, -41221, -54445, -36158, 163508, 109338, 399, 20095, 35327, 70838, 89505, 44745, -60853, -172094, -116458, -42239, -11190, -24358, 25631, -44133, -74368, -83104, -8964, -4470, 67696, 115189, 170935, 174857, 104485, 59386, 37077, 13298, 69358, 27067, 4229, -29912, -36606, 707, -10143, -68745, -94636, -75640, -30219, -38627, -87360, -112071, -147239, -198842, -137487, -83930, -49023, -65773, -18261, -11060, -36535, 28298, 76164, 48336, 48887, 105107, 79150, 62564, 59889, -3501, -14839, -67925, -26271]
14787b6271P7974J6850K3762K6540l469m8219r7290o5423q0150K5376J6331m610
14775a38599m4276N1420K9853q5974K8453K583j1503J13542N8946L6490n3072
14764a2137o159N665p0505o3985J555R8865O9111n7802j16623j8422L3705R7640
14752c9092m8192K4437O9406k6704J9618j0628p4501m3916K959p4132r2994Q5457
14740b08282J47334N5507o7424m2655K5401n898m8610L5657j4493L2585J6162
14729g4716l2567k0803O5020l3981P3254N4663n5885L626K024l3425P991O9487
14717B4688J5210k7926n5957q6750O4530n9901l8503J5202Q957n0001L8329k258
14705a54380O345N9254P4264n1255p4706P4633j0427K1954L3638k4650r887K9333
$$ y = [-26271, 51703, 68553, 92315, 118855, 115386, 67167, -30123, -95546, -175696, -150320, -133989, -138599, -182875, -131455, -101602, -187576, -159123, -156540, -168043, -54501, 4445, 40935, -12137, -18296, -12631, -83136, -147121, -145566, -46701, 22410, -35392, -152015, -170437, -136732, -39092, -87284, -62847, 6559, -20145, -527, -11155, -85656, -129572, -126613, -200745, -293739, -208282, -60948, -5441, -72865, -115520, -90119, -96017, -144627, -108970, -123463, -90878, -74716, -107283, -128086, -63066, -97047, -23793, 30870, -25015, -21389, -19365, -52790, -44799, 24688, 39898, 11972, -43985, -130735, -66205, -126106, -164609, -149407, -140450, -190451, -152122, -154380, -148035, -88781, -14517, -65772, -140478, -65845, -76272, -54318, -20680, -45330, -55217, -25884]
14693b5884j5225K4592p249j0459M233l9460J203J28809k5455M4642l973o8634
14681G140k5374j8786r43P0083j10218m5578L7254j7133m780K6194m6837J6406
14669a12572M1644j5468O219L4518N0795P5286N083K5183m7172n7993q053l5055
14657c7585O1985Q1347k570r4072p4155k6054N2603m675j9679r8887j5084M8014
14645a28812N8095L660l0809o6013J3654K7377P3770j3615n2779k6327N6394N7726
14633b7679l5366O922j254j2535M9589m6808l9602O3043n4868l8944N0654J5747
14621g1101j7594P2433M0324l0307q7543M0156J1333n6752m1042o908M5187R7193
14609d621P256M0074P350j05870m8048k8251J4543Q628k2813J7530J16231q663
$$ y = [-25884, -41109, -16517, -23766, -34225, -29992, -69452, -68249, 60560, 35105, 79747, 75774, 7140, -18234, -37020, -37963, 32120, -78098, -123676, -86422, -103555, -108335, -82141, -128978, -112572, -70928, -86396, -80177, -45659, 5136, 80422, 85505, 110688, 63516, 5523, -2530, -37585, 24400, 105747, 103177, 9105, -65050, -91104, -38501, -43176, -62855, -161742, -176826, -128812, -70717, -67057, -97866, -163879, -150225, -122848, -49078, -62693, -115472, -141799, -85405, -27679, -63045, -56123, -57377, -69912, -20323, -67131, -106733, -43690, -98558, -137502, -86848, -71101, -88695, -16262, 24062, -6245, -93788, -53632, -42299, -99051, -140093, -147001, -101814, -4621, 2635, 42709, 50059, -55811, -103859, -132110, -117567, -108939, -131752, -114222, 2009, -6654]
14597f654n3008k7465J7148j6709P077L9397j4852J2702j0227j6875J701o311
14585g4076M0159j8931j13587k9612M0811n376M1875Q9077L5471m8050M3453r076
14573g862L9028O4657R0219j11337l9723n9159j09128L849M0544P225J8540O5095
14561A948j02053j56787J6176Q1113M6738L8377r7252r930J11994O6279Q5806
14550H2409R5444l436r9330r4376o5006K3010N8201M5152n2417n6234Q288M8162
14538a0133K7772N551r0162L4356L1232o3191o7070m4150M4906M8801P1228R3947
14526H3087k7307M2492o7251r0410Q939n9901l0577J6399J5648j0753J3781K969
14514a02884m5576l3594M6055N7282J5084n6758l2077J62005R767q2343K675N9006
$$ y = [-6654, -59662, -87127, -69979, -86688, -79611, -40214, -55066, -42364, -52591, -69466, -67765, -74076, -33917, -52848, -166435, -196047, -155236, -160612, -118737, -29660, 5811, -42239, 1214, -7862, 31166, 95823, 186042, 74705, 34982, -24177, -133305, -129456, -88912, -81687, -63147, 1948, -100105, -256892, -240716, -159603, -112865, -74488, -171740, -181670, -69676, -3397, 82409, 177853, 174417, 75087, -19289, -84295, -61285, -3084, 42068, -10349, -66583, -58295, -10133, 17639, 23190, -66972, -32616, -1384, -64575, -131645, -175795, -130889, -82088, -10860, 83087, 55780, 98272, 31021, -59389, -50450, -110351, -140928, -124529, -108881, -119634, -105853, -102884, -148460, -182054, -135999, -78717, -63633, -120391, -152468, 9537, 19304, -63039, -60364, -1358]
14502a358K2973n7790o4544M4135K6338l89l0496l1801l367j395j0839K4888K1515
14489f2130J3057j6015P6180j4542m8114m9748q118L3421m0862L7463R1955O6609
14477G9156L4799p4451j23216q3269j9935m373J02121J00918N6549p1228j5592
14466a8521J4783N349k8445j6263m9312L3106K3091J18231O093r9700o4345r3495
14454a69428m3383J0353k3543N7615P6414q807N3929K7027L817k344K1393j7059
14442a4016k4211j4788K9835N062m079M5620J5570q4937m6242j7396L9377k0141
14430i0346n6135N8826N1598K6192j1761N3251k8695j0143L6887J7997m0431j31849
14418a24609J8336J09219K1530K1019L1605L6365j410l7002J9429K7305k153k4230
$$ y = [-1358, 21615, -36175, -100719, -56584, -30246, -30635, -61131, -92932, -96299, -97694, -108533, -83645, -62130, -49073, -65088, 11092, -3450, -51564, -101312, -109430, -76009, -116871, -79408, 12547, 79156, 113955, 39504, -83712, -166981, -186916, -191289, -89168, 11750, 68299, -2929, -18521, -3738, 1611, -26834, -43097, -92409, -59303, -36212, 82019, 88112, -11588, -75933, -169428, -212811, -202458, -226001, -168386, -91972, -100779, -46850, -19823, -16006, -18350, 3043, -14016, -38227, -53015, -23180, -18118, -22197, 23423, 38993, -45944, -92186, -109582, -70205, -90346, -146481, -87655, -36057, -9865, -21626, 31625, 2930, -7213, 29674, 47671, 7240, -124609, -106273, 2946, 24476, 45495, 77100, 113465, 112055, 75053, 94482, 121787, 119634, 95404]
14406I5404r8006q668n0600l5286L0033K8074L6609P8864K6821o9913n7728M0943
14394A6547O4438m9529n3400M2225O7384q0020j13970j3105L2113M6952k7364
14383f7729l7520j1668P1222n3672J9305j668l4569L8418N1961o066n7289J649
14371h7626J4910m8114k0055o2637l8688R329R1197L9425j1239n200N8519m3562
14359a03741p1311K2221Q2778K3608R6561k605R825k4584l9619n3820O633j22116
14347a76170m9203M814L7952J21431J04915R880P947j53832j29826N1614J05137
14336f5341M766K3826O9004k0959k7393r597N2816j5622P860K5010k6635l5262
14324a7527l7248M016J06184L7006k9662n7929o4239L4570N6793o9636l9550o7846
$$ y = [95404, -2602, -11270, -61870, -97156, -67123, -39049, -2440, 76424, 103245, 33332, -24396, 16547, 80985, 31456, -21944, 20281, 87665, 7645, -106325, -119430, -87317, -40365, -67729, -105249, -116917, -45695, -99367, -80062, -81730, -116299, -77881, -25920, -31986, -89275, -87626, -72716, -120830, -140885, -203522, -242210, -232881, -141684, -102259, -113498, -118698, -60179, -103741, -175052, -152831, -70053, -46445, 50116, 47511, 57336, 32752, -6867, -60687, -54054, -176170, -225373, -220559, -182607, -61176, 43739, 53619, 61566, -92266, -222092, -170478, -65341, -60575, -36749, 32255, 11296, -16097, -25694, 27122, 11500, 19360, 44370, 17735, -17527, -54775, -50759, 55425, 92431, 62769, 4840, -59399, -24829, 31964, -37672, -77222, -145068]
14312a45068R306O3766J10355L9712n2996l8014j06285N3348P2681M4394o2476
14301a1277j2636Q8344l8539r5571j3110O520L6323m7585l0001p353j0010R771
14289a25124k8045Q7023K9368M7432Q5690M7110M7563j8108l2114o2935p6810
14278A050p3032J8494l055j0906r711l7592J7595l3865J2404Q158o87K0438J1144
14265g9565n3571Q1410J06751J44772J8442o3005k7923k5394o6096j5560L9962
14254F0223K3824m9300n010N3039l2089k4158P513r613m8733n8358J6506J17620
14242E1464O3494m5737j39655n1347N457k72k4164p798O1947Q5200L2381M6122
14230G7092l2219p1338m9058K8854J9884P8920P8239O6139N755p7236j019j3453
$$ y = [-145068, -135762, -71996, 38359, 78071, 25075, -12939, -119224, -65876, 6805, 51199, -11277, -23913, 64431, 25892, -69679, -82789, -76269, -39946, -87531, -117532, -124885, -134895, -125124, -153169, -66146, -36778, 10654, 96344, 143454, 191017, 172909, 140795, 77860, 1050, -71982, -53488, -56543, -67449, -77160, -114752, -97157, -131022, -118618, -110460, -111147, -90709, -79565, -133136, -51726, 55025, 199797, 218239, 155234, 127311, 101917, 35821, 20261, 60223, 84047, 34747, 29737, 82776, 50687, 26529, 34042, 24429, -24304, -82662, -66156, 51464, 114958, 69221, -70434, -121781, -116324, -116596, -140760, -148558, -86611, -1411, 30970, 77092, 44873, -26465, -75523, -46669, -26785, 52135, 130374, 196513, 202268, 125032, 124013, 110560]
14218A10560l4580J0556k3813J5496m1063N1294p9714m5986R549O2333L6799J0441
14206H1872p6160j9844O8471K7731k6940J9004p115j0557p1651k2701P6049R1535
14194A29694k4935K0463O5949P3553l6374k8336m3712r3592j12099N8714N1174
14183F0499N1350l0332l8643M9781J6291P7669L1036o0946l1128o9540p3990m2858
14171f0811O8285m934k5074M5374K6352r135m1644O5588K2013j5192k7772l2690
14159A0360K8162l19q1488m8704p2392J06333P2326j6796q5216J0405O8368J07468
14147I8507k8231k6678k4905l4868L4160p2257j4576M5328J20313L8775n3361
14136H2207k5481J2616K4481j07299l2256O6616j0133j54326K1794O2301k3182
$$ y = [110560, 75980, 86536, 62723, 78219, 37156, 88450, 8736, -37250, -27701, 34632, 71431, 81872, 5712, -14132, 54339, 82070, 55130, 74134, 67019, 56462, -15189, -37890, 38159, 129694, 104759, 125222, 191171, 264724, 228350, 200014, 156302, 62710, -49389, 9325, 60499, 111849, 81517, 42874, 92655, 108946, 186615, 217651, 156705, 125577, 56037, -17953, -60811, 7474, 2540, -22534, 22840, 49192, 40057, -1587, 64001, 86014, 70822, 43050, 10360, 38522, 38203, -43285, -91989, -164381, -58048, 14278, -2518, -87734, -77329, -8961, 98507, 70276, 43598, 18693, -16175, 17985, -54272, -68848, -23520, 96793, 135568, 82207, 56726, 69342, 93823, -13476, -45732, 20884, 10751, -143575, -121781, -59480, -82662]
14125h2662J25307n732r7446k3732N9828M2091m2644j7285k490M5312J1126r208
14113B465P6848N7251j07652J3073o177l2647j32745N5418L7628J5875P6433K6331
14101H2101l8343l8707r0726j2792O14L4301j2756l3535J00844P481m7394K6528
14089b2384m0590N9204J056n1851J7111J3298N7512J6144J72L1023M1268j02973
14077A8990m4326n8378k8373j6131j920O3398N2916N8493R672r3157m2437L2863
14065d8390n458L1766J8439P011K9952m812K3363J9169n6807r0885n59J45797
14053F8586q956r2364Q656n608J5728J20653N7231l1915p3866J5034L9574N0728
14041A63481m0500j10872p417K4822N1198Q6014J8793p6202l7570R809K4054L1065
$$ y = [-82662, 42645, 36913, -60533, -84265, -24437, 17654, -24990, -42275, -44765, 547, 11673, 2465, 79313, 136564, 28912, 41985, 35808, 3161, -129584, -74166, -36538, -20663, 55770, 82101, 43758, 5051, -85675, -98467, -97853, -63552, -76308, -109843, -8999, -1518, -48912, -22384, -62974, -3770, -2714, -54565, -37454, -24156, 33356, 49500, 49672, 80695, 121963, 18990, -25336, -83714, -112087, -128218, -130138, -66740, -13824, 44669, 54341, -38816, -81253, -48390, -53848, -22082, -3643, 3368, 33320, 28508, 51871, 71040, 14233, -76652, -77211, 68586, 59630, -32734, -24078, -29686, -13958, 106695, 163926, 132011, 58145, 73179, 112753, 163481, 122981, 12109, 4692, 29514, 80712, 166726, 185519, 109317, 71747, 81556, 105610, 136675]
14029A36675k4466n0622p864J6479k0351J9585L5926p3724r800j5260J453K9057
14017C7088K2136j7918O2572Q90k9784p4132J5040K8655M7856k4501j23763r0952
14005a46813Q345J3678q5587r162J65095J6099q8961j8278m7477J7128M3939j7834
13993a49828l3292P2218N5289o3189n2416L5426L5068L9048o172J02633J45939
13982A80724k8493j04088j37397l6352J42550N7639J072q06o7525p442J4403k9727
13970a5442m3470l6412P4045M3153L105Q085m429m5539k3356o6532l369j8469
13958a28630K862L686K8066n265l3378M5146M8500m348J8044P9463K9423J2076
13946I5645m7673j8485k8922Q3988o67j13473m3914L4873K3683j8423r5n4338
$$ y = [136675, 112209, 61587, 53723, 70202, 49851, 69436, 105362, 31638, 21838, 6578, 8031, 37088, 59224, 41306, 103878, 104768, 74984, 852, 15892, 44547, 92403, 67902, -55861, -146813, -138468, -124790, -210377, -219539, -54444, -38345, -127306, -145584, -193061, -175933, -131994, -149828, -183120, -110902, -55613, -118802, -171218, -135792, -100724, -61676, -67848, 34785, 180724, 152231, 48143, -89254, -125606, 16944, 74583, 75655, 74849, 7324, -118, 14285, -15442, -58912, -95324, -21279, 21874, 24979, 33064, 28635, -16904, -40260, -106792, -110161, -128630, -125768, -122082, -94016, -99281, -132659, -87513, -39013, -43361, -25317, 54146, 83569, 95645, 47972, 29487, 565, 84553, 83886, -29587, -73501, -38628, -14945, -33368, -33463, -87801]
13934h7801p6650j7227N9954M2021j5872n606k142J03935M6829l6812j522L5335
13922D4442n0040j08472l0668N9252K3196J9634M6509m882L6992k0189r2766j8613
13910i5605M9355j9665l9803j6203Q4470L5865j034J9384o693j0745J4615J6445
13898C0386j36973k9555j401L2344L0466R382j0221N4907O2109N1457P2119r3283
13886G1737j06567k8264L1727M3579m747m864j9511K7376M1921J00177M7195l1937
13874A67822j5213q1982n4831o882j9734r2999n7649J7657M4838J12853Q774k0355
13862B299L4207p936j14792m2210n97k8954k2911Q0846J02972J3683n4336n839
13850d3568K508n2383n7906M170O1880M1689K4210j04405l7400J2758R2064K4671
$$ y = [-87801, -164451, -181678, -121724, -79703, -95575, -101181, -103323, 612, 47441, 10629, 9107, 44442, -5598, -114070, -144738, -85486, -62290, -42656, 3853, -1029, 35963, 15774, -76992, -95605, -46250, -65915, -105718, -121921, -37451, -1586, -2620, 16764, 10071, -674, 13941, 30386, -106587, -136142, -137543, -105199, -74733, -65351, -75572, -20665, 41444, 92901, 165020, 71737, -34830, -63094, -31367, 12212, 7465, 2601, -16910, 10466, 52387, 152564, 199759, 167822, 152609, 70627, 15796, 8914, -10820, -103819, -161468, -143811, -98973, 13880, 22654, 2299, 36506, 28570, -86222, -128432, -129029, -157983, -180894, -100048, 2924, 16607, -37729, -43568, -41060, -93443, -151349, -147179, -85299, -43610, -19400, -123805, -161205, -148447, -56383, -31712]
13838c1712P5966j4895o1995k1232r66L8745o716m4355K4734P879L2992l9077
13826d0632k6348P6516K1312l4049n0948r2504l1368N3411M4645p0155L4680K6294
13814h9146P1888M539L1800p3506K593o1877L4439k5644n2771k8133N2694M4588
13802h8536J01399R9788N7375K7926j13016L551J3478o6264r9402M9642K9597
13791A5538q5820r8190K2555O9163N583j459p2439o8054N9742K6857J40442Q4738
13779I8656N987r5822L6703k4686r6560N7839k4693o4694L8223M7786j2312R889
13767b3684o4857m7060J5263n0821r100M9034M5750n681K5317m6123j0351p546
13755a29859n2151m875K1555M9797j7886o2814K590p068Q3477L9075R0178L1808
$$ y = [-31712, 44254, 29359, -32636, -53868, -54834, -16089, -22805, -67160, -42426, -34547, -1555, -40632, -66980, 9536, 30848, -3201, -54149, -146653, -178021, -124610, -79965, -150120, -115440, -89146, -17258, -12719, 19081, -54425, -51832, -113709, -79270, -104914, -157685, -185818, -133124, -88536, 12863, 112651, 170026, 197952, 84936, 88487, 101965, 35701, -63701, -14059, 15538, -70282, -168472, -145917, -76754, -71171, -72630, -145069, -213123, -153381, -126524, 13918, 98656, 104643, 8821, 45524, 20838, -75722, -17883, -42576, -107270, -69047, -21261, -33573, -23684, -88541, -135601, -120338, -171159, -180259, -131225, -85475, -91156, -65839, -111962, -122313, -129859, -182010, -186885, -165330, -115533, -133419, -196233, -193643, -200711, -117234, -78159, 12019, 43827]
13743D3827o4241j0479N5923n8652r3426K0869J5526p9576o734J13348K3925K1502
13731a8188K3187M8783K4016r354l0330j1530k8514K7323o0237m3277J4233K0102
13719d3786q4110p5021O0094M6589j12822r9099P0175O8895k71L1527M0854n8069
13707a55044o4554m7074Q6127L3808L4402K952K6112O951N6323N9326k0281M2805
13695F1853K611j56298o2768K8683k784l0841P8204Q6179L4196m5225k4202j04359
13683a34751n0894P917RL004Q0735J11998J37429M508o4568k0075k1937p6602
13671b3227q1343L1834O5935N3639l4580k9542M8456J0850L4952R9472M008r112
13659A71342K9206J8620O998J1710r7935o6937l3530l760N6421J0028q3096M4385
$$ y = [43827, -20414, -30893, 25030, -33622, -127048, -106179, -90653, -170229, -176963, -63615, -39690, -18188, 4999, 53782, 77798, 68444, 38114, 26584, -1930, 25393, -34844, -78121, -63888, -43786, -127896, -202917, -142823, -96234, -209056, -308155, -237980, -169085, -169356, -137829, -96975, -155044, -219598, -266672, -180545, -146737, -112335, -109383, -83271, -76320, -19997, 39329, 19048, 61853, 64464, -91834, -154602, -125919, -128703, -159544, -81340, 4839, 39035, -6190, -30392, -134751, -185645, -177728, -177719, -174715, -93980, 18018, 155447, 159955, 95387, 75312, 53375, -23227, -104570, -72736, -6801, 46838, 12258, -17284, 31172, 42022, 76974, 176446, 180454, 171342, 200548, 219168, 226166, 237876, 139941, 73004, 39474, 35714, 92135, 102163, 19067, 63452]
13647F3452m4251j27965J5579M0658K4475m053L9069r9097j13937o0039J59929
13636a06180J04934N8352q432r0591l4728j421k4040q3603L396J1740N997Q596
13624a55980r320K3792L0362L7535K4526J9219J7567q0905o2924K1819J1604R1388
13612c1317R063q1723j9904N6402k0779J1829J3479L2309k1914K2585N5845N4196
13600H0071j25475q5349l89J2955J22798Q4887m1187q541M7826O899r2098l8219
13588c5822k808k4677J13100q0187l0350M0862n7425j2251P3316N4609K327n0230
13576i536o090J986m950n7613j5539p5725p5287M2447k0958J4088P0385l2994
13564a69786L725M3681L6041K6417k530j105O7278j9569q935o8075J9807L5151
$$ y = [63452, 19201, -108764, -93185, -52527, -28052, -32105, 6964, -92133, -206070, -266109, -106180, -1246, 57106, 48674, -41917, -76645, -78066, -102106, -185709, -182313, -170573, -164576, -155980, -165300, -141508, -111146, -73611, -49085, -29866, -12299, -93204, -156128, -134309, -122705, -31317, -22254, -103977, -123881, -67479, -88258, -76429, -62950, -30641, -52555, -29970, 25875, 80071, -45404, -130753, -131142, -118187, 4611, 89498, 48311, 39770, 87596, 94495, 2397, -35822, -38630, -63307, 49793, -30394, -60744, -19882, -77307, -89558, -16242, 38367, 40694, -9536, -15626, -13640, -18590, -76203, -91742, -167467, -242754, -200307, -221265, -207177, -136792, -169786, -166061, -122380, -86339, -59922, -62452, -63557, 3721, -15848, -24783, -92858, -73051, -37900]
13552c7900O8770K0720o1167o0873q3531k97l7099N5724K1919R7660N7739m6860
13540e195J2112P9486P1997m342o7358r260P951M22m282m1377m1878J24341n7921
13527F4696l7037k6064l9643K2622P0141k9514l1368K9296M5990n984k6277l5319
13515A539n0762N0847k147M061N0034M778j0744M7030l8800m7982k1355N9217
13503D5716l8293l5986M2904k4607l7575j3723K9494L8750J08198N6353p8673
13492I2558K567J28824O8860O0629j21089j03275j03964m4777k023L5918j12633
13481i8405l3905J03774J8553L2828r043l5945L0965L2482j3297L5527O0177L2216
13469A55927r7223q2883k0236j572K6138p6682n068L9293k1960Q5912M0695o282
$$ y = [-37900, 30870, 51590, -9577, -70450, -153981, -154278, -191377, -135653, -113734, -16074, 41665, -5195, 6917, 86403, 158400, 154058, 86700, 77440, 85391, 85813, 81531, 40154, -1724, 122617, 64696, 27659, 1595, -38048, -15426, 54715, 25201, -6167, 23129, 69119, 63135, 36858, 1539, -49223, 1624, -523, 3538, 53572, 58350, 47606, 94636, 55836, 7854, -13501, 45716, 7423, -28563, 14341, -10266, -47841, -61564, -32070, 6680, 114878, 171231, 92558, 95125, 223949, 292809, 353438, 232349, 129074, 25110, -19667, -21690, 14228, -98405, -132310, -28536, -9983, 22845, 13802, -22143, 8822, 41304, 28007, 63534, 123711, 155927, 58704, -24179, -44415, -45987, -19849, -96531, -101599, -62306, -84266, 1646, 42341, 36059]
13457C6059K7777L0666J551n190o0454p6301M3626J05459O2930K4687l8369j3921
13445A38520l1388m615L538n3625n2790l5300q9472l1662J05721O3837k8977m0933
13433e7146j425Q4239J6363p2576M9759L2307p6434m1160n0562M944N5900J4721
13421d1070n8299q9545K0531J30883K7061Q1841L2528k9972k2361o5003l5541
13410d8947n6164n7162P1303J7539l8682Q1359J5754O415O868K2249o705n117
13398H710N527J4131p1287j35213k5819K8987N7461N1209l0027J4524M8688p1932
13386a05041N634M3153O4653r752o8404l7033o5407K7662q442j8499J12599K4097
13374c4780n8182J2457M1657k7491K3597K7632J8997L0252p0131n4702J3786J9832
$$ y = [36059, 63836, 94502, 96053, 90863, 30409, -45892, -2266, 103193, 166123, 190810, 152441, 138520, 107132, 102517, 106055, 52430, -360, -35660, -125132, -156794, -51073, 12764, -16213, -57146, -58571, 25668, 42031, -30545, 19214, 51521, -24913, -66073, -116635, -111691, -55791, -41070, -99369, -188914, -168383, -37500, -10439, 71402, 103930, 73958, 51597, -13406, -48947, -105111, -162273, -90970, -73431, -112113, -30754, -15000, -8585, -1717, 20532, 13827, 8710, 14237, 28368, -42919, -178132, -203951, -174964, -117503, -66294, -96321, -81797, -33109, -105041, -99407, -56254, 8399, -1353, -69757, -106790, -172197, -144535, -152977, -171476, -58877, -34780, -92962, -80505, -38848, -66339, -42742, -15110, 3887, 34139, -35992, -90694, -76908, -57076]
13362e7076J5142K6950p0904q5603k9782P8071l9486L1819M5860l515j7208o005
13350a11737l5537O086J03201N2456k7400q2713l489O1616j9459o141n8747k4929
13338a46793l97j3376J2324j3855J02703Q8866m2049r9979L088j0277M4632N7289
13326a7824J8403n4252J0249q968J9837r5530n7865J5519Q1177N7336K9796m4103
13314d6225o4841j5346N2933K8041L4327m3338j03374j23177P666n484R429M5454
13302b23935J01931M6178k4304O4194r0856k7655m9989R1471K4801l0830Q6169
13291c2825L8051l0628L7416N9705k0988m2193J7848N3040M1201o3435r9279M437
13279c7650k2690L0429j0754p6257m2339R4382N9280L2426m6861M02L3993l7177
$$ y = [-57076, -41934, -14984, -85888, -171491, -201273, -123202, -162688, -130869, -85009, -88524, -105732, -111737, -147274, -141188, -37987, 14469, -12931, -95644, -99133, -37517, -56976, -63117, -121864, -146793, -147190, -160566, -148242, -162097, -59394, 29472, -12577, -112556, -109468, -119745, -75113, -17824, 579, -53673, -43424, -52392, -32555, -128085, -185950, -170431, -89254, -31918, -2122, -46225, -111066, -126412, -73479, -45438, -11111, -54449, -157823, -281000, -273334, -278818, -269389, -223935, -122004, -75826, -100130, -35936, -126792, -154447, -204436, -112965, -88164, -118994, -32825, 5226, -25402, 12014, 71719, 50731, 8538, 26386, 79426, 120627, 57192, -42087, -37650, -60340, -29911, -40665, -116922, -159261, -64879, -5599, 26827, -20034, -19632, 14361, -22816]
13267b2816k7988m4024L2768n444l5220K2618J9661j7770l3466l8716J63312K6946
13255C9861j09428O7212K8398L464q4742j4924k500p853J9857L6775n43j6404
13243d0827r8131K4482J3223K0981L0573M5367N0711n9667l6048j1159j7350j5338
13231i3183J50746J10414p0740j3938l33j16483o4849N4844L6530k3542l4231
13220f4765J6659K1706J902M7973O2002l240n6374K7432j8778M2799j0120o9751
13208b555m3309K5788P3860J5537J8800J3414l9367k6544m8128r553L4413J2320
13196B4676J0908q5712l2732N652n8067o8889R8877K9757q5976m9092Q7464P5897
13184d7237J0849N977P2602o5435K005N1875L7700m1223l0481p5631m1767l5798
$$ y = [-22816, -50804, -94828, -62060, -67504, -102724, -80106, -60445, -78215, -111681, -150397, 12915, 39861, -69567, -2355, 26043, 29507, -55235, -70159, -72659, -80512, -60655, -23880, -24423, -40827, -138958, -114476, -101253, -80272, -49699, -4332, 46379, -13288, -49336, -60495, -77845, -93183, 57563, 167977, 97237, 83299, 82966, -33517, -98366, -43522, -6992, -30534, -64765, -48106, -26400, -24498, 23475, 85477, 82237, 25863, 53295, 34517, 77316, 67196, -2555, -45864, -20076, 53784, 69321, 88121, 101535, 62168, 35624, -12504, -22057, 12356, 24676, 35584, -50128, -82860, -77208, -135275, -204164, -105287, -75530, -161506, -210598, -123134, -47237, -36388, -30411, 42191, -23244, -21239, 30636, 68336, 27113, -3368, -78999, -120766, -156564]
13172a56564N6428M5088l3585M9770Q9469o3008q0155o873L1035J10223L6618
13161G8446P882l8820r3976M81N683k8029M7812l2342m2207p7442k6851M0939
13149a58424L6519p3599O8435k7335p3835m2193N2226P7396O7476m6536O3107
13138e6763N5379K4991N470L1941K1062K9159O9275l8944j20216j22880R238N0782
13126d1506k0167n0914j6793M7441n742J7140P1068q5761K1119l0768N7188j7501
13114e5196o3466r458J7661q891k8453Q118J39449Q1678p558k9920l3590J8260
13102B8634N6364L6466n7014k3599n0722j9727n5535m7014j7278J22187P1862
13091D4624K4029l5081p9292l0949K3455N5521k6206j1178n1141l1701k6328Q622
$$ y = [-156564, -100136, -55048, -88633, -38863, 50606, -12402, -92557, -99430, -68395, 41828, 78446, 86328, 47508, -46468, -45987, -40304, -68333, -20521, -52863, -95070, -172512, -199363, -158424, -121905, -195504, -127069, -154404, -228239, -270432, -218206, -140810, -73334, -119870, -56763, -1384, 23607, 29077, 61018, 82080, 111239, 180514, 141570, 21354, -101526, -92288, -41506, -61673, -112587, -129380, -81939, -87681, -70541, 527, -85234, -64115, -94883, -37695, -55196, -118662, -128120, -110459, -119350, -147803, -139685, -236, 81442, 73884, 43964, 10374, 28634, 84998, 121464, 64450, 40851, -9871, -29598, -85133, -132147, -149425, -27238, 44624, 68653, 33572, -45720, -76669, -53214, 2307, -23899, -35077, -86218, -117919, -144247, -135625]
13079a35625K0695K6274K1395M383r372l785L2376J39792J46916j82709j08887
13068d8547K2815O5187n166l525r219o831o9650p9825M7407N0159k766K1835k0761
13055c8887p2985J6551O0728j0914p5977L5944j7192O1259P0136k7336l1138k4904
13043e4715J9677r3262k2388N0097k4053o967L0339m604K6890J22302n3988n0238
13031f0910J6496J1093N1332N1059l1206k0580K4559L2448n3027m9109l7026q3010
13019a47881Q7644n934J3663P1012p126K1302P2329p4630m0466N7208k4952Q1919
13007A04088m9442o1380n8284K1440n6609K3187K7202j34493O2320L4524j8401
12996a05848J8851L4747j1524l6607J4619o608m4907N620O3557Q908m4084N346
$$ y = [-135625, -114930, -88656, -67261, -62878, -72250, -76035, -43659, 96133, 243049, 60340, -48547, -25732, 39455, 34289, 30764, 21545, 14714, -54936, -134761, -87354, -37195, -39961, -18126, -38887, -111872, -95321, -34593, -45507, -121484, -85540, -102732, -41473, 28663, 1327, -29811, -54715, -35038, -128300, -150688, -100591, -124644, -131611, -101272, -105876, -78986, 43316, -10672, -60910, -44414, -33321, 18011, 69070, 37864, 17284, 41843, 74291, 21264, -27845, -64871, -147881, -60237, -66171, -52508, 18504, 11378, 32680, 105009, 30379, -10087, 47121, 22169, 104088, 54646, -6734, -65018, -43578, -100187, -77000, -49798, -184291, -121971, -87447, -105848, -86997, -52250, -63774, -100381, -85762, -92370, -137277, -131657, -68100, -59192, -103276, -97930]
12984i7930J4643P425j4212j954N5966j9287k5059N7243m2805j0025p434K8257
12972e5172l3775n9909M99J8531J5662R6967N5360Q244Q289j4017l0183n1084
12960d0588l8362J7710N0376Q4118n1833m7281n1097M3774M1818k7329N8039O7829
12948A07174m4502m1342K8605M1602n1360j07861n3287m0359P741L7162P1162
12937d5265r839R804K0160L2579K007N1392J238N4320o6557q1470K6930l0075
12925c4776J141Q132O011o0854J1282M9374K5527J9292p0310p5926j3623J08651
12913b6079K1448j6812N6230L2550L122m935j9323J7131j3090L0964O5758K9962
12901A76926r1719L0974M7452j06334p1229P484m0263l800N7146n1253M0174P9841
$$ y = [-97930, -83287, -75862, -90074, -92028, -36062, -55349, -80408, -23165, -65970, -75995, -83429, -55172, -88947, -148856, -148357, -129826, -114164, -17197, 38163, 46407, 54696, 40679, 10496, -40588, -78950, -61240, -10864, 73254, 21421, -25860, -76957, -33183, 8635, -18694, 39345, 107174, 62672, 21330, 49935, 91537, 40177, -67684, -120971, -161330, -153589, -116427, -45265, -55104, -45300, -25140, 7439, 9446, 60838, 62076, 116396, 49839, -31631, -4701, -34776, -33635, -25503, -19492, -80346, -69064, -19690, 5837, 25129, -45181, -121107, -134730, -26079, -4631, -21443, 34787, 67337, 70459, 65524, 46201, 63332, 50242, 81206, 146964, 176926, 85207, 116181, 163633, 57299, -13930, -6446, -46709, -50509, 6637, -44616, -4442, 75399]
12889G5399j2444M9653p9281j18788K9864j6324k4199J9642J17782J09597n2171
12878I8730O5726q7823m0861m4535p9393J345L6387K5344J5648r987J5387o2020
12866f6052j12437j1248P6138P1344l3796J6795J06616k5066q5980k9178l7726
12855a30590J7635L6364q0686j7180J042k257L8619J4276K0816P6198K516K6285
12843C038k1554J4140n56n7971j642q6189l2130p96l3337O3703M8415N2395O7167
12830A4683Q2432k4490o5428m068K4273j7940j6789N4882J1704p9765N617j3588
12818b8477M631K7103M3705J290k2684j06492l6834O1615R641k9782N3128Q1253
12806E8097j9855l3950m3870r2532l0837Q5062O5353p1652p2879P7373R1257m1096
$$ y = [75399, 62955, 112608, 33327, -85461, -55597, -71921, -96120, -76478, 41304, 150901, 98730, 164456, 76633, 35772, -8763, -88156, -86811, -50424, -25080, -9432, -19419, -4032, -66052, -178489, -189737, -113599, -42255, -76051, -59256, 47360, 22294, -63686, -92864, -130590, -112955, -76591, -157277, -174457, -173415, -175672, -137053, -122777, -101961, -25763, -23247, 3038, -18516, -4376, -4932, -62903, -64545, -150734, -182864, -183660, -216997, -153294, -104879, -52484, 14683, 97115, 72625, 7197, 3129, 27402, 9462, -7327, 47555, 59259, -20506, -14889, -28477, -23846, 3257, 46962, 48252, 25568, -80924, -117758, -56143, -46502, -76284, -23156, 58097, 38242, 4292, -39578, -132110, -162947, -77885, -12532, -84184, -157063, -79690, 11567, -29529]
12794b9529J3428N2146m1933j00703m1877J6783K7993J9998q824M2512J2527j8215
12782e5694q6551n1007N0345R5154O894j1898O2387r527k1177q0009m2603N5354
12770h8332N2817N0715j4440m0122r9345K661P4932R0240N0482M1456m0633k6490
12758E3941l5649l6182M9040l4564K7012M1791O2277j1424o9276o3030j7454m7431
12746h0949l7960M0787O0131j9786M3341P4453j22618r0042Q7703m3975l8609
12735a27524p5779L7233M5407K8881N4951J09455P6968m113j35148L131N6997
12724G0459l4703l3529J2609M4711K1319l9080p8564j203L6394J4853l6434J1932
12712a1236l4532j6185L6274J06048Q0055J4226j3888o6877r7529m4868Q0813
$$ y = [-29529, -16101, 36045, -5888, -106591, -148468, -131685, -103692, -83694, -92518, -50006, -37479, -55694, -142245, -193252, -142907, -47753, -40859, -52757, 9630, 103, -21074, -101083, -143686, -88332, -35515, 15200, 760, -39362, -138707, -136046, -61114, 29126, 79608, 121064, 80431, 53941, 18292, -17890, 31150, -3414, 23598, 65389, 127666, 116242, 46966, -16064, -33518, -80949, -118909, -78122, -17991, -37777, 5564, 80017, -42601, -132643, -44940, -88915, -127524, -203303, -166070, -120663, -91782, -36831, 72624, 149592, 145479, 10331, 13462, 70459, 35756, 2227, 14836, 59547, 80866, 41786, -36778, -37981, -1587, 13266, -23168, -11236, -45768, -61953, -25679, 80369, 160424, 174650, 160762, 93885, -3644, -48512, 32301]
12701C2301J7887n5964p5970j7553k7483L1074O0113J4611j02120k7260M2514
12690a07850Q0327k8981O3677N9801L4838j9124o1004k2939M432k1798j04176
12679a22797j5853n0193j07025J06096Q1759M1464L9029J4521r935N3122o043
12668B4145L7439k3153q6976L6214O0651k7930O7459L9307p6572O672O7199n8918
12656F5537q4336L1952J12458m7550m8327m162L3542K5273q4609j13007l0751
12645a43980J37083O1000J4m7309m5149p1330R343O7544l0340n4884K1586Q308
12633h8114k5164l7980k2158J6543N9392L0402J0573O0682l515n4901j9658k1909
12621i5807K1253K2356P1533j684J5886j3779j8226n2404n3259r077J0529L1689
$$ y = [32301, 50188, -5776, -81746, -99299, -126782, -95708, -35595, -20984, -123104, -150364, -107850, -27523, -56504, 7173, 66974, 101812, 82688, 21684, -1255, 3177, -18621, -122797, -138650, -188843, -295868, -189772, -108013, -66549, -27520, -12999, -22934, 30188, 24145, 61584, 38431, -48545, -12331, 48320, 20390, 87849, 127156, 50584, 57256, 124455, 65537, -18799, 13153, 125611, 78061, 29734, 25572, 59114, 84387, -222, -113229, -143980, -6897, 54103, 54117, 6808, -38341, -109671, -100328, -32784, -63124, -118008, -96422, -88114, -113278, -151258, -173416, -156873, -97481, -67079, -56506, 4176, 661, -54240, -73898, -95807, -74554, -52198, 19335, 17651, 33537, 19758, 1532, -50872, -104131, -113208, -102679, -70990]
12609g0990K1345m7246M0040J3029p798k7O161K4472K3687l0212l3705M0368M632
12596a6244m3661o5197n2627K2435j9627L9672m0887m6951J34086Q5070J193r52
12584c690J8349r656q3070j6093j6211K5820N9773l6185M7022J7126n3469n1150
12572a01434K3070j3242j650l159m461P5844k2880n9938n5513O2440M843k5962
12560a22042m0083J04633j8346k2853O7022l329J27796j8736j14810k1135P6665
12549A4782J9597n5563M083N0039K7091M9033k3272m5466J0864Q675J8600m0755
12537C7708j17100m746N3621N4626k6899P571O6441p3601q4068l2066N7077M4592
12525a6844p2182l0694Q6563J01779r542o4366l8074N4686M5554N0045j2127k778
$$ y = [-70990, -49645, -96891, -56851, -43822, -51620, -51647, -45486, -21014, 2673, -27539, -61244, -20876, -16244, -59905, -125102, -177729, -155294, -174921, -135249, -176136, -223087, -89001, -3931, -2738, -3690, 14659, 5003, -78067, -94160, -110371, -84551, -24778, -60963, -13941, 3185, -50284, -101434, -78364, -91606, -93256, -96415, -100876, -25032, -47912, -107850, -163363, -100923, -96080, -122042, -162125, -57492, -75838, -98691, -31669, -34998, 92798, 74062, -40748, -61883, 14782, 34379, -21184, -17101, 32938, 60029, 109062, 85790, 40324, 51188, 59863, 78463, 37708, -79392, -84138, -30517, 24109, -2790, 4781, 71222, -2379, -86447, -118513, -61436, -16844, -89026, -119720, -33157, 68622, 59080, -5286, -43360, 11326, 56880, 106925, 94798, 92020]
12513I2020J2842m4106N8598J03943n4413r0677l5619k568l2600l1798n3612p6285
12501a54275M7837J24893M7722O2004K5033m002o4665q0829n5817P0602J3692
12490C2195M2129P0098P4956L4351j3286K2105o9418j146j6494l4534m7165r4785
12478i94M1485k3223j0171J3357l4218J9991J41946J08547k3859n4383M481L5947
12466B18906N2230l9386r502q7938n6875M9846k3578n5712M6159P8530k2167k5805
12454A24708J11991J60229M6451O6714L7452o619m1804o8314l5767q7222j03609
12443B04210n688K9620j0027o7301p523J6062P1019L0135m4562j7662Q2567j5282
12431B65568p774J02647K9151p8341n1990n6752K6572K275k2340j02038r327J8950
$$ y = [92020, 104862, 60756, 119354, 223297, 168884, 78207, 42588, 40020, 7420, -24378, -77990, -154275, -106438, 18455, 66177, 128181, 153214, 149212, 84547, 3718, -52099, 18503, 32195, 74324, 144422, 219378, 253729, 240443, 262548, 193130, 191984, 175490, 140956, 93791, -994, 40491, 17268, 7097, 20454, -13764, 6227, 148173, 256720, 232861, 178478, 182959, 218906, 271136, 231750, 222248, 134310, 77435, 127281, 103703, 47991, 94150, 172680, 150513, 124708, 236699, 396928, 443379, 510093, 547545, 540926, 499122, 430808, 395041, 307819, 204210, 198522, 228142, 218115, 150814, 143291, 159353, 230372, 260507, 215945, 198283, 280850, 265568, 257794, 360441, 389592, 311251, 259261, 202509, 229081, 231356, 209016, 106978, 97651, 116601]
12419A16601J08249J03616q3070l4974N5972N1813K2423Q2129j0054k23960m165
12408A84580M9271p7597K9721M7256p0306o0092r6991o1129M7100Q5476J9955
12397I7244M372K8553M0839q0896l5346O8392J5871J6073m0427n7144n6427k8380
12385b7276m0914r564L7137Q1167J7242K0273Q6249j8785j5693n85q9275o7397
12373b7421N7937K5188L0860J7643m0289l6078J1003K6530J09199P9089j14581
12362A39080j22015k7718M955k5221k3683p191j6573M7802J02330L7259n64p1819
12350C6642J0081M579l2722k5631J36792Q25k4838p7814l8637N4007R583M2814
12338I5681j0304k6410j18490m1072M4488O0073q889L8742M8490m0684L6527J9011
$$ y = [116601, 224850, 328466, 245396, 210422, 266394, 318207, 340630, 422759, 412705, 188745, 184580, 233851, 156254, 185975, 233231, 162925, 102833, 5842, -55287, -8187, 77289, 97244, 101616, 130169, 171008, 90112, 54766, 123158, 139029, 155102, 114675, 57531, 1104, -27276, -68190, -77754, -40617, 40550, 57792, 78065, 164314, 145529, 129836, 129251, 39976, -27421, 30516, 55704, 86564, 104207, 63918, 27840, 38843, 65373, 174572, 253661, 139080, 17065, -10653, -5698, -30919, -54602, -61793, -78366, -30564, 71766, 109025, 108461, 36642, 46723, 51302, 18580, -7051, 129741, 130566, 105728, 27914, -10723, 43284, 52867, 95681, 85377, 58967, -59523, -100595, -56107, 3966, -4923, 33819, 82309, 41625, 78152, 97163]
12326I7163q8084n0541M5420J960O7613J315n2778O545M028j3871K8327L8050
12314H5147m3155o8310j7041J5644j6590p9069M8809L7752j583K537l4935L7624
12302c3170m632l7195N397l6350j8653L3293k4567K7640N3316P143r4582J2026
12290a10334J04700N2917O219M3213q8725o9496J1353L2957J4516j612l6292Q3382
12278D2798j4552k4629m220M9115M6364k1175l084R2186N849r2156n0847n5911
12266c0262m9375M8017j9604p193Q2553j165l5878M8107k6125o0095K7322L100
12254b0598k636L0240K4947J4921k5768J501l5314N930M6213R4384l1199m3140
12242E9481n5800m4443m1774K3953N6146K5836k2960l059L4918m6974j655m3143
$$ y = [97163, 9079, -41462, 3958, 5918, 73531, 74846, 22068, 28613, 32641, 18770, 47097, 85147, 41992, -26318, -43359, -27715, -44305, -123374, -74565, -36813, -38396, -35859, -70794, -33170, -37802, -74997, -69600, -105950, -124603, -91310, -115877, -88237, -34921, -27778, -122360, -110334, -5634, 47283, 53502, 96715, 7990, -61506, -50153, -17196, -2680, -4292, -40584, 42798, 28246, 3617, -603, 48512, 94876, 73701, 70617, 162803, 168652, 76496, 25649, -30262, -79637, -31620, -51224, -58417, 24136, 22971, -12907, 35200, 9075, -51020, -23698, -20598, -23234, 7006, 31953, 46874, 21106, 22607, -12707, -6777, 39436, 133820, 102621, 59481, 3681, -40762, -82536, -58583, -2437, 23399, 439, -2620, 32298, -14676, -16331, -59474]
12230e9474R891N7915P490L2724L6027m268R277m7025m8312P2612o402j06327
12218d5872o1243M2464k3998P5080M6053O5101J9177P2358J3253j9470r1561k3005
12206F8337k7489q773p1611l9517K998J695R559J04194j5756m9626k1907L015
12194d4881k1965l9579p6339q3223J18896J04707k0754m463j6947L9655Q3737
12183C8844j013p2969j4614k47m00N5610n9154L1413l5744J07737K6299q607j7446
12170D9709J3209j0808m4960k4537O4940k6088j9565J0879J7454n2934L9139L8153
12158E4591n7277p9314k5095k338J1272P0084J3071j02905M6070O0935K5518m7985
12146c3373p1742K1799m0434j6478J2578N0339J35249P8941k2786Q893p3310j26013
$$ y = [-59474, -49583, 8332, 15822, 48546, 84573, 80305, 89582, 42557, -5755, 66857, 60455, -45872, -107115, -64651, -88649, -13569, 32484, 97585, 116762, 189120, 202373, 182903, 91342, 68337, 40848, 32075, -39536, -79053, -76055, -74360, -64801, 39393, 23637, -25989, -47896, -44881, -66846, -106425, -182764, -265987, -147091, -42384, -63138, -67601, -84548, -44893, 38844, 37831, -35138, -49752, -49999, -50399, 5211, -53943, -22530, -58274, 49463, 75762, 67155, 49709, 62918, 52110, 7150, -17387, 47553, 21465, 1900, 12779, 30233, -22701, 16438, 54591, -2686, -82000, -107095, -109433, -98161, -28077, -15006, -117911, -71841, -10906, 14612, -33373, -105115, -83316, -123750, -140228, -127650, -77311, 57938, 136879, 114093, 122986, 49676, -76337]
12134g6337O909J5154q2807r203K8354j8309J4781K2330N2702M7883q197q9559
12122i6299K4774M4288Q2442K1419p5199q754j6607n3267O2047l6041L635k208
12110d9770L5895N0352k4957L36n6178n2688m4846J6012K30144J4650j06632j3511
12098a193l1114m9086m9257L2685O0850k077J01118J5625j05107m6695N7500l8025
12086e4776j6015K6092j522P345Q1504K739q3016O042J8462J5248j7208r911K0106
12073d910N8311k3486l6823j354J1715j3510J13233O4316n5709n8505p6293l9676
12061f2691O6157J11972L0954k9163j5103L0998o6516r3468o6925j4920L1442
12050g7263J1428N5718l3142k0188Q485L7675N1707n4059p5247l0872J04914L0870
$$ y = [-76337, -69428, -54274, -137081, -146284, -117930, -136239, -121458, -99128, -46426, 1457, -6740, -96299, -71525, -27237, 55205, 76624, 1425, -7329, -23936, -77203, -15156, -51197, -47562, -49770, -13875, 36477, 11520, 11856, -44322, -97010, -141856, -125844, 104300, 118950, 12318, -1193, -32307, -81393, -130650, -97965, -37115, -39192, 61926, 77551, -27556, -74251, -16751, -54776, -70791, -44699, -46221, -38876, 42628, 45367, -37649, -31607, -13145, 2103, -15105, -25016, -4910, 53401, 29915, -6908, -8262, 3453, -10057, 103176, 167492, 111783, 53278, -23015, -62691, 3466, 115438, 146392, 117229, 102126, 133124, 66608, -26860, -93785, -108705, -77263, -65835, -10117, -43259, -63447, -54962, -17287, 34420, -19639, -94886, -125758, -20844, 10026]
12038A0026m0752N6567J4284m6016n4416k2137J59910P0977L941p1871j233k4203
12026E5077l7143m0771P7297K1353m6069l6212k0654R3649N3707j668m0679m4662
12014C3225J0949N450P5886K8064n0200j7107j0987J9409K0900m78m2240j8575
12002E4296L1913k3745p494L537j2255M7063J9013J5256J7742o5456p2277J4655
11990B2248j3609p0834m018K1210O4169K7027m1811k4009l0728O159R5488M6211
11978I7503L7229R7998R0773L2298k869r7675l7005N6687k0971k9397m3929j75451
11966E191p0684l5800n7713Q7151N3105j3565Q0377k1105Q988j7590k4831M8149
11954D1673M8751k6880k5776k006M5299K288K2104p7674l4136l449M943j6436
$$ y = [10026, -30726, 25841, 40125, -5891, -60307, -82444, 77466, 148443, 152384, 80513, 79280, 55077, 17934, -22837, 54460, 75813, 29744, -6468, -27122, 66527, 120234, 118566, 77887, 33225, 44174, 49624, 125510, 153574, 103374, 86267, 75280, 94689, 115589, 115111, 72871, 54296, 86209, 62464, 54970, 58507, 46252, 93315, 112328, 127584, 145326, 79870, 7593, 22248, 8639, -62195, -66213, -45003, 19166, 46193, 4382, -19627, -50355, -44196, 51292, 97503, 134732, 232730, 323503, 355801, 352932, 255257, 218252, 274939, 253968, 224571, 180642, 5191, -65493, -101293, -159006, -71855, -18750, -32315, 48062, 26957, 35945, 18355, -6476, 41673, 90424, 63544, 37768, 35762, 81061, 83349, 105453, 27779, -6357, -9806, -4863, -21299]
11942b1299L6671j1559l5020Q195N4855Q7040q383M5m4355K4398R4845L3244l1694
11929A86983L5266O501N864k9876p1219j05196j0060n5240L0784J6472M9195J3165
11917G2639M3314j10230l0340m6392R703M8615K9451N8939p6524j04560l6711
11906a42096K1816P7203M3851O9457j05943p5922R1596O9637k4518k326L9934
11895F2689K5479k1999l5490o9953K6770J84584P8136n7068p0809n8126j9462
11884D4751j20498j884O2434J24359k076P933K150o6784l5617k6379o4334J2692
11872f3253O7573J5269m9291K8795Q7220P2861J8940L755n509k4677m0585R3978
11860B05076l9887n8943p1689m5331j00367j697J30372J00122m0807K5055j0587
$$ y = [-21299, 15372, 3813, -31207, -23012, 31843, 118883, 110500, 110545, 66190, 90588, 185433, 218677, 186983, 222249, 228750, 234614, 204738, 133519, 28323, 18263, -36977, -6193, 10279, 59474, 72639, 115953, 5723, -24617, -71009, -61306, -12691, 16760, 75699, -825, -105385, -142096, -120280, -43077, 774, 70231, -35712, -111634, -20038, 49599, 25081, 22755, 62689, 88168, 66169, 30679, -39274, -12504, 172080, 250216, 193148, 122339, 64213, 44751, -75747, -77631, -15197, 109162, 107086, 115019, 117169, 50385, 14768, -11611, -75945, -63253, 4320, 19589, -29702, -907, 86313, 159174, 178114, 181869, 176360, 151683, 111098, 205076, 165189, 106246, 34557, -10774, -111141, -112838, 17534, 117656, 76849, 101904, 91317]
11849I1317o8476n0382m2836J8157j3748m6647m7963L3406m677j10049P5660J31741
11837c4497J09716o6961k1736m1621r279q2509j548J6447m3141P1241K7892J8541
11825e7455M6887J8380M4717o7045j17112O9445J01534O2741n9948l4079n8285
11814e0220l4855p7601j2576P4458l386P4220K1213N1109j0528p0462J8045J4289
11802f294n0181k4433L1375l1414P2513K3174m3339K2799K7668N874J0730l0553
11790G919M5982N2974L0478n0821q8982o890J04298q1018k5233O2137o484J1463
11778E5823o0928k7228P819J2875l5023m6936J9606J14549N2641n0339o0964q8635
11766a06740p9849Q5138J47305K5795m0649O9243K7826n8161r0632J8594m5158
$$ y = [91317, 22841, -27541, -70377, -52220, -65968, -112615, -160578, -127172, -131849, -241898, -166238, -34497, 75219, 8258, -13478, -55099, -64378, -146887, -148435, -131988, -175129, -103888, -75996, -57455, -10568, 7812, 52529, -14516, -131628, -62183, 39351, 102092, 42144, 8065, -50220, -85075, -162676, -175252, -100794, -104180, -29960, -8747, 42362, 31834, -38628, -20583, -6294, -56475, -80908, -49533, -80947, -8434, 14740, -28599, -5800, 21868, 27742, 38472, 7919, 53901, 106875, 137353, 86532, -2450, -9340, 94958, 13940, -11293, 50844, 44360, 55823, -5105, -32333, -24514, -11639, -46662, -93598, -73992, 40557, 93198, 42859, -18105, -106740, -186589, -101451, 45854, 71649, 31000, 100243, 128069, 69908, -20724, -2130, -47288]
11755d7288k7047k8895Q8103L1074n3625n7910J4545N5556K4441J4817m1924K5518
11743b635J5123l3636n5491n6423J584j450m5242J1441q829L6286L2360n7390
11731a64302R554q411K8066J22551L6301m2368L4901M6864k9937j38573R5586
11720i768L9691k3517n6186J2484m1282j3616M3293M6092o1110r5257L2629j4121
11708a40668J1097Q3703P2648L1903q3906k0069M7079K4676k7860j11258N3548
11697e9107O3106n4755o5396m0493L7622O0919J6663n763o033M500k1087l0477
11685a00301o0608p402M1524R3707L8943K9105k0509l695O1678J3900L7118M5647
11673A69107j17863n5675j16224K7972J18201n136n8004K2130M396p6191p2798
$$ y = [-47288, -74335, -103230, -15127, 15947, -37678, -95588, -81043, -25487, -1046, 13771, -28153, -2635, 12488, -21148, -76639, -133062, -131478, -132928, -178170, -166729, -175558, -139272, -106912, -164302, -154748, -163159, -135093, -12542, 23759, -18609, 16292, 63156, 33219, -105354, -9768, 29923, 6406, -49780, -37296, -78578, -92194, -48901, -2809, -63919, -159176, -126547, -140668, -129571, -45868, 26780, 58683, -25223, -45292, 1787, 26463, -1397, -112655, -59107, 3999, -50756, -116152, -156645, -119023, -58104, -41441, -47204, -53237, -48737, -69824, -100301, -160909, -168311, -126787, -33080, 5863, 34968, 14459, 10764, 72442, 86342, 123460, 169107, 51244, -4431, -120655, -92683, 25518, 20382, -37622, -15492, -11096, -87287, -160085]
11662a60085k0177O6134k6310m9533J10137L0544n2195o7227q125K5068J24051
11651b7718R6164M4365l6963n2579o7964K2175O5237M1307Q4200Q2699Q3066k4123
11639C09866r7176j37463j84512n1577J7438n2684P8495j6711k7079N7231J3854
11628i0318j127r2189M4448J05304J6131l5036L1619K3993p0979J1379N5010Q4034
11616H2269n6982o3450o0187m1100k8164J6087J13032P8001N4302m2012o5755
11605a3959p9661J5287R853j8570J4268J7500k4614K2461o0884j7168M9048R121
11593g7318k6810M4738j3366J0696l9004k4719j994n684P8744k3999j12752q3987
11581b75455J7121N8655R5622P6060L3489k7189L864L9923m3280j9501J0492R191
$$ y = [-160085, -180262, -114128, -140438, -189971, -79834, -49290, -101485, -168712, -176837, -151769, -27718, 68446, 112811, 75848, 23269, -44695, -22520, 42717, 84024, 168224, 250923, 333989, 309866, 212690, 75227, -109285, -160862, -143424, -196108, -117613, -134324, -161403, -104172, -90318, -91445, -183634, -139186, -33882, -17751, -52787, -21168, 2825, -68154, -56775, -1765, 82269, 25287, -38163, -98350, -139450, -167614, -151527, -38495, 39506, 93808, 51796, -13959, -93620, -78333, -68480, -87050, -72782, -55282, -79896, -57435, -118319, -135487, -86439, -77318, -104128, -59390, -72756, -62060, -101064, -125783, -127777, -133461, -54717, -78716, -191468, -275455, -258334, -199679, -104057, -27997, 5492, -21697, -17833, 22090, -21190, -40691, -30199, -21008]
11569b1008L6958L8601R1735l1922k9069M6754r7406o6855J23620J4133k2683
11558H2858L1951M8845k6681p0318j34574r0154M4564J1770J0981M4968J3563
11547c2227J48127M3883n2655o3018k6484m7859p3671K0831O4921L3193K5144
11536D0185j2702k2661j2572j9782l9333l7391J6033L7668O3414J0059N61j4885
11524H594n2691O0760l9244L3780m1132o1440j6512O934M5805M5093j6030P7357
11512E1274L1028q0202r9145O794Q4747N0277k3010m2780l793M2298j4390M4005
11500D7103l3027k7850M2198j269r398J9957k641m8843j2730l5380j6173l2620
11488a10673M8483L8171O1192J6294n1264r242n4265J1845R4788L1855p9593o6822
$$ y = [-21008, 15950, 54551, 146286, 114364, 85295, 132049, 34643, -32212, 91408, 105541, 82858, 114809, 163654, 136973, 66655, -67919, -158073, -113509, -101739, -90758, -45790, -32227, 115900, 159783, 107128, 44110, 17626, -30233, -103904, -83073, -18152, 15041, 40185, 27483, 4822, -7750, -27532, -66865, -104256, -88223, -50555, 12859, 22918, 23479, 8594, -44097, 16663, -22581, 11199, -29933, -91373, -107885, -100951, -55146, -10053, -26083, 51274, 82302, 2100, -97045, -90251, -5504, 44773, 21763, -21017, -24810, 17488, 3098, 47103, 14076, -13774, 28424, 27155, 17757, 37714, 35073, -13770, -26500, -61880, -78053, -110673, -62190, -24019, 37173, 53467, 2203, -7039, -61304, -49459, 45329, 77184, -2409, -69231]
11476f9231k4365q64L6414R0771N1385l3258r595j1001k8530j7901k5335J2516
11464b8994R4191J3308j07511k9549J1773J5j7965K4248M7397N0422L5617p3672
11452A9280K8233Q9638M9700k2514p9508p3925J8626k7851o6873O9539L1771o0958
11440b4842n4502O8104j6528p3943l4286k3675L8475O479K15K8952O0888L9928
11428A5265l0826q0872o489R3349P3222O0132l1741o3465k1479N2601M0360K8331
11416A28388O904m4338m9247j193M474j9360m22l9410j8237k158P8921K4474p6182
11403g386j974j11866r5071J9413O6908m0500j1658J09232J32918J6487r523j7933
11391D9047j61168m7234K8880P1758l2949j5831M3840j8119p3775R3665o2372
$$ y = [-69231, -93596, -94460, -58046, 32725, 84110, 50852, 41257, 30256, 1726, -16175, -41510, -28994, 65197, 78505, -29006, -58555, -46782, -46767, -64732, -40484, 6913, 57335, 92952, 19280, 47513, 137151, 186851, 164337, 84829, 10904, 29530, 1679, -65194, 4345, 36116, -24842, -79344, -11240, -27768, -101711, -135997, -159672, -121197, -114718, -114503, -85551, -24663, 15265, -15561, -96433, -102922, -9573, 63649, 123781, 92040, 28575, 7096, 59697, 100057, 128388, 135292, 90954, 41707, 40514, 44988, 25628, 25206, -14204, -32441, -34599, 44322, 68796, -7386, -9360, -121226, -216297, -196884, -129976, -170476, -182134, -72902, 60016, 76503, 66980, 49047, -112121, -159355, -130475, -58717, -91666, -107497, -63657, -81776, -155551, -61886, -124258]
11380a24258j9359O8986M5634P5113L9606K8292j3908p6844J8614K0580j2241
11369E0215l2571o6313n7944J6397Q5913O9036q649L918M4183k7036k1463q2982
11357b7296j4010j2120Q6157M377l7563L8100L083l7239o6828k9056Q9367k2259
11345b5287j7551J1048j5185m4387J4365K9521k7026P5192L0851j1207J9022L0146
11333F9502k293k4934o7444l0302k8181K5257k1151q2551J4758M3100J8710K9927
11321e5602l951l0857O437Q9071R2242J8426n2160l8225j3452K6020j6968o3952
11309d2971J3918j10097M0184O1740K8950l2076n3603l3097M574O6425K9947P3951
11297D7845J05327n7841n1545n6867n9781l54N5176k2833K3860q0911k9919l8436
$$ y = [-124258, -143617, -74631, -28997, 46116, 85722, 114014, 100106, 23262, 41876, 62456, 50215, 17644, -48669, -106613, -90216, -4303, 64733, 56084, 60002, 104185, 77149, 55686, -27296, -41306, -53426, 32731, 37108, -455, 37645, 40728, 3489, -63339, -92395, -3028, -25287, -42838, -31790, -46975, -91362, -76997, -47476, -74502, 690, 31541, 20334, 39356, 69502, 67209, 42275, -25169, -55471, -83652, -58395, -79546, -162097, -147339, -104239, -85529, -55602, -59553, -90410, -83973, 5098, 97340, 115766, 63606, 25381, 11929, 37949, 20981, -42971, -29053, -139150, -98966, -37226, -8276, -40352, -93955, -127052, -122478, -56053, -26106, 47845, 153172, 95331, 43786, -13081, -72862, -73216, -18040, -40873, -17013, -97924, -127843, -166279]
11285a66279j2056J23073J11071L9924o1318m6824L1598j2422p6416K4539n4013
11274i9123O413l8146L2868O8702Q2850M4301N668l9864k927r2796m7590R2435
11262A2791O2752j7149l2511l1507r018N406L0636k0064l0025K7148J0911l7734
11250b8364r5444J728O7914M3284k6012N3160M2417j2447n7859J3927M8823j9104
11238C2023O328k2243l1568p241N795N1582J9343J8324k1003j8523M3603j8267
11226E8153k363K793n640q052j12364p4713n992L8476p302j952k1426o757j3499
11213a60638n0120O3724N9664L0232k2976L3883j7162k4199Q1834Q8430p2651
11202A0021j6131k2994J22912J38259o4714p6103k078p6271l2342R172j5493L2231
$$ y = [-166279, -178335, -55262, 55809, 95733, 34415, -12409, 19189, 6767, -69649, -45110, -99123, -92710, -130856, -97988, -29286, 53564, 97865, 103533, 63669, 60742, -32054, -79644, 12791, 75543, 58394, 25883, -5624, -14642, -9236, 21400, 1336, -28689, -1541, 9370, -28364, -123808, -122080, -54166, -10882, -36894, 16266, 58683, 46236, -11623, 2304, 51127, 32023, 38351, 16108, -15460, -22701, -16906, 34676, 54019, 72343, 51340, 32817, 76420, 58153, 55790, 58583, 52943, 44891, -67473, -142186, -148178, -109702, -117004, -118956, -140382, -147139, -160638, -210758, -147034, -87370, -57138, -80114, -46231, -63393, -87592, -5758, 82672, 10021, -6110, -29104, 93808, 232067, 167353, 91250, 89172, 12901, -19441, -10269, -25762, 6469]
11190F469m9935N887O8132J9791J2260j710k2719R410N1765j5816p6716K6540
11178C3358o5114J075J02819M7542p258j6179j04163k2698m8677P1940J0610k5143
11166b1888o8195m9287J3372N2971M5239J6040M9684K7937o6208K0875j1387l4262
11154b5109r7375k7542J346R676M7154K8613R5779L3074j3394K9586r504k2402
11142D9902N2929k0063l0037L9434L880N2110j1477p8890p3908j10125J9566P9844
11130b6835N5852M2886m0956m6721l1023L6167o559O268j7424m8007N3089K0285
11118b978o0496k8558L5115J02482j8045K9939j4648j9374M0289L2800K0887j2469
11106A04944j812K8663K1212n1295l4175j8118m1090K1026O0751m1841J4804N1021
$$ y = [6469, -43466, -37579, 30553, 50344, 62604, 60894, 38175, 47585, 99350, 83534, 6818, 33358, -31756, -30681, 72138, 119680, 112422, 96243, -7920, -30618, -79295, -7355, 3255, -21888, -90083, -139370, -125998, -73027, -27788, -11748, 37936, 65873, -335, 20540, 9153, -25109, -122484, -150026, -148680, -139004, -91850, -63237, 32542, 65616, 52222, 81808, 72304, 49902, 102831, 82768, 52731, 92165, 96045, 148155, 136678, 57788, -16120, -126245, -106679, -26835, 29017, 71903, 30947, -15774, -46797, -10630, -17189, -10921, -28345, -76352, -23263, -2978, -63474, -92032, -56917, 45565, 27520, 57459, 42811, 23437, 63726, 96526, 117413, 104944, 103132, 131795, 153007, 101712, 67537, 49419, 8329, 29355, 90106, 48265, 63069, 114090]
11094A14090Q67p2704j4861O2144J6243q9809j8024m3295n1136M835l0276j775
11082a23701P1869j5549k3016m0694N043P0416j1904J07285k0819q8822j3585
11071h3477L5903L0596M2308J2355M7516j17446K7943J0965j1501Q4996l37J5503
11059I5324M6476m9423n6810j8517M9434L9187l3920q7432q0632L6527k060R846
11047e2000p4717j3010n9571l2710R1684J29752k065o6036J2884M3680m027R796
11035a6340N9104R4751O2303l8577l4713m3698q702O0306l0831n9480k4489n0764
11023c1130n601K5471j8069J2348J19727L5027l8669k6079l0225j9531j5630J3919
11011B1558m7941j1297l9138l4382L1517p793L2339P3425O4404M0882j0920o6703
$$ y = [114090, 114957, 42253, 27392, 89536, 105779, 15970, -2054, -45349, -96485, -91650, -121926, -123701, -51832, -67381, -90397, -131091, -126048, -55632, -67536, 39749, 18930, -69892, -83477, -47574, -16978, 25330, 37685, 85201, -32245, -4302, 6663, -4838, 80158, 79821, 95324, 141800, 92377, 35567, 17050, 66484, 105671, 71751, -15681, -96313, -59786, -61846, -52000, -126717, -139727, -199298, -232008, -140324, -10572, -12637, -78673, -65789, -22109, -26136, -16340, 42764, 137515, 199818, 161241, 126528, 82830, 74128, 134434, 103603, 44123, 19634, -31130, -36731, -11260, -29329, -16981, 102746, 137773, 99104, 73025, 42800, 23269, 7639, 21558, -26383, -37680, -76818, -111200, -79683, -87476, -55137, 18288, 82692, 123574, 112654, 45951]
10999D5951j05679j4563j2858O3646l0659m4944j8005m6866M9081M5640O7856
10988a400R3135m1486m4329M1490n4518l7146Q9890O6156l6038p248k3210N597
10976E0893r4467J8144J3179O344M4243p2660p2564j4306J12633K2588K3340K3688
10964F1055k8939K2617K1882J6527m4470m4804P440k1422n8284j9544P503n5496
10952a35935n83L2248L1605J7311J647k3877j1402j767m372K2228K56K3549N0441
10939A349l5062P7723l4773m8688J042K4526J02752M6355k3684n8885j17439M7054
10927a7730J7148r060M9730Q406Q1065P4096j8469j86465k5469M5829k439M3461
10915F0103q0066q7405K8287j9726M1552l967P4398J741q8994O5585Q9192m7941
$$ y = [45951, -59728, -74291, -87149, -23503, -54162, -99106, -117111, -163977, -114896, -69256, -1400, 91735, 50249, 5920, 47410, -7108, -44254, 45636, 111792, 75754, 68506, 45296, 50893, -43574, -25430, -12251, -5907, 38336, -34324, -106888, -121194, -8561, 14027, 37367, 61055, 32116, 54733, 76615, 93142, 48672, 3868, 11308, -10114, -68398, -87942, -80439, -135935, -136518, -104270, -72665, -55354, -53707, -77584, -88986, -90753, -95125, -72897, -72641, -49092, 1349, -33713, 44010, 9237, -39451, -38409, -13883, 88869, 135224, 111540, 52655, -64784, -17730, -582, -9642, 40088, 48494, 129559, 203655, 185186, -1279, -26748, 19081, 16642, 60103, -19963, -107368, -79081, -98807, -57255, -61222, 13176, 14917, -74077, -8492, 80700, 32759]
10903C2759J3005N2666j05379m1296n539j0864P7287r548m7249o3722J7811J06751
10891A6682P343K1720m5548n5436p4448l5236J0731J07221M2076k313j5011M480
10879a7739L7587k0977k7768K6633m4013R6681R0862N4766J5762m7592p3122N8174
10867A49254l1198p7846o364Q650k0054l1500L467N1630j7657l4039J37372J10330
10855B42045k3130p5384j18574j8382J8203n5884L3656J2456M9189k5177N1215
10844I0233M6092O7808Q8981M3660M4753J58772K8466m653j5506q2898r5477p3702
10832B96529m4046n4127l2433K1183M4817n2712K5174p4969l1671K9456L2980
10821A60181o8352N3939Q302n5825l9213o9545j2948O4994L0583N242l6777J145
$$ y = [32759, 45764, 98430, -6949, -48245, -53784, -64648, 12639, 3091, -44158, -107880, -90069, 16682, 24025, 45745, 197, -55239, -129687, -164923, -154192, -46971, -4895, -7208, -22219, -17739, 19848, -1129, -28897, -2264, -46277, 50404, 141266, 196032, 211794, 164202, 91080, 149254, 118056, 40210, 33846, 42496, 22442, -9058, -5591, 46039, 28382, -5657, 131715, 242045, 218915, 143531, 24957, 6575, 24778, -31106, 2550, 15006, 64195, 39018, 90233, 136325, 204133, 293114, 336774, 381527, 540299, 568765, 564112, 548606, 465708, 370231, 296529, 252483, 198356, 165923, 187106, 231923, 179211, 204385, 129416, 97745, 127201, 160181, 91829, 145768, 154070, 98245, 59032, -10513, -23461, 41533, 72116, 77358, 40581, 41726]
10809D1726L4826J1737R325j14168n2809Q3342q33k1793O3698N3428p9562n307
10797B3610L4099l9147p615n6848P8918R3778l1941k1496m2223m7748N539q068
10785a9142j249l7280K2215J3460k3668K6092k4554j4681K8213J3168K1163r201
10773e464p2145M1718Q0936L451k5530r7183N6521K9798r23l0107L398N3874N087
10760D3431o3907K1044j5262n2684Q022O1887O6774K5741j9542J23277M0785j07092
10748A32474o7104l6380o3643Q9722J06702N3537J7233q517l3098n6087m2724
10737I2115q5699l7277O9095K6831j04174o1385J6248M9156M8160K6193J32592
10726A71855Q060p5198k2829l5312m5921m8896K6379m65M2206R581k424K9063
$$ y = [41726, 76552, 88289, 97614, -16554, -69363, 13979, 13146, -8647, 55051, 108479, 28917, 23610, 57709, 18562, 10947, -45901, 33017, 126795, 94854, 73358, 31135, -16613, -11074, -19142, -20391, -57671, -35456, -21996, -45664, -19572, -44126, -58807, -30594, -17426, 3737, -5464, -77609, -35891, 45045, 48496, 22966, -74217, -17696, 12102, 11179, -18928, -15530, 38344, 43431, -20476, 568, -14694, -67378, -59356, 2531, 69305, 95046, 75504, 198781, 239566, 132474, 65370, 28990, -34653, 55069, 161771, 215308, 232541, 224024, 190926, 134839, 92115, 6416, -30861, 38234, 65065, -39109, -100494, -84246, -35090, 13070, 39263, 171855, 179915, 104717, 81888, 46576, 655, -48241, -21862, -22327, 19879, 29460, 27036, 56099]
10714E6099J524j2554j180p5223m9832j1464Q1254o315P5116l7597o5532K8502
10702a7202K3915R9522Q3791r865o0016l2940n0708j0225n591M2582L8863k9302
10690G2824K9693J18115O120l7836j7339j04601j813P046o0938K5488m0117j4768
10678a8126j1456j7942L0905r705K3166k2710K7278K8392R281r361l4142N3516
10666D9096r8430j31970k2347R4562K3437p300K0188k7539k2759M9505R9561P5026
10654A01030j6386N007n7751p4971k4019J846k3975l0517M042L2711M2042L8144
10642b797n023R1432O0512r406m4151k3745n7058m2353M8500k0387k6616L6101
10630E009P932Q985M257J3108J7271j2203n1271j6290L3398n4395o1643J0987
$$ y = [56099, 57623, 45069, 43889, -31334, -81166, -92630, -11376, -17691, 57425, 19828, -45704, -17202, 6713, 106235, 190026, 180161, 120145, 87205, 36497, 26272, 20681, 63263, 102126, 72824, 102517, 220632, 226752, 188916, 171577, 66976, 65163, 72209, 11271, 36759, -3358, -18126, -29582, -47524, -16619, -26324, -3158, -25868, 1410, 29802, 39083, 29722, -4420, 49096, -49334, -181304, -203651, -109089, -85652, -92952, -72764, -100303, -123062, -73557, 26004, 101030, 84644, 89651, 31900, -43071, -67090, -65244, -89219, -119736, -115694, -82983, -40941, -2797, -7820, 83612, 144124, 134718, 90567, 66822, 9764, -32589, 15911, -4476, -31092, 5009, 12941, 21926, 26183, 39291, 56562, 44359, -6912, -23202, 10196, -44199, -105842, -94855]
10618i4855O3743J25431N3521K8140m772J4953N5221j9526q1521r398j0037o4068
10606E6832j7513J16351j4273q3119j6285P0525J8217o8785m0468p515m7544l4277
10594f7854M0995O3117J4693p5808J3164j1162K8040O722n872K9939j8518j72
10582A7284N5708J4549k9105K6813j21039m8598K7637n5963J6196j4772R603P0060
10570c1627N3193Q9734m4241p6528j4835L1738K1292L2453J0767o383j0348R147
10558F4362K1346J2359M5819p0109p3742K094j6326n5722N0173N9269J6501j03493
10546d7469j16513Q6740Q618J7190J0797O8457m0965m9441L8806P4791M1494L9885
10534A32390n3386o2374r1220n2729K8968O0024J2224J2703L2509L1l9753P6683
$$ y = [-94855, -31112, 94319, 147840, 175980, 171208, 186161, 241382, 221856, 140335, 130937, 120900, 56832, 39319, 155670, 141397, 58278, 41993, 112518, 130735, 61950, 21482, 13967, -33577, -67854, -26859, 36258, 50951, -24857, -11693, -22855, 5185, 11907, 6035, 35974, 17456, 17284, 72992, 87541, 58436, 85249, -35790, -84388, -56751, -112714, -96518, -111290, -101687, -31627, 21566, 111300, 67059, -9469, -24304, 7434, 28726, 61179, 71946, 65563, 55215, 64362, 85708, 98067, 143886, 73777, 35, 2129, -14197, -69919, -19746, 39523, 56024, -47469, -163982, -77242, -68624, -51434, -40637, 27820, -13145, -62586, -23780, 51011, 92505, 132390, 79004, 16630, -74590, -127319, -98351, -38327, -26103, -13400, 19109, 19140, -20613, 56070]
10522E6070J4807k326M0138K3023p7882J2910m0015o0001k4243l2299M3885K6605
10510a9328P3537J7737m6362n8859k2692L7249Q9016P710J1255J91m0109J8669
10498F8014O0492j08544m7031P1759o9580k7085R1738J4161l7510n6727o4399
10487a04712N9747l695N8325K1410N3987L2486J7980o9231m1749O8410n8535j8720
10475A5703j1731K7831l3811j2307l6174p9043j9143M1899j4831P2378p432m255
10463f0916k9548j3976N9131R1344J23228p8529k21494J9407j5198l5497J7631
10452a44417P3683L277k2321J7180n0812K4269O0855k5311R8144j9642n7647j9741
10440f2483K208J18028n526M1919j06324k9186R304N4129J5849n22n8585o059
$$ y = [56070, 70877, 68551, 108689, 131712, 53830, 66740, 26725, -33276, -57519, -89818, -45933, -19328, 54209, 71946, 25584, -33275, -55967, -18718, 70298, 78008, 89263, 89454, 49345, 68014, 128506, 19962, -27069, 44690, -24890, -51975, 39763, 53924, 16414, -40313, -104712, -44965, -48660, 9665, 31075, 85062, 117548, 135528, 66297, 24548, 92958, 34423, 15703, 3972, 31803, -2008, -14315, -50489, -129532, -148675, -106776, -121607, -49229, -56661, -60916, -90464, -104440, -45309, 46035, 169263, 90734, -130760, -111353, -126551, -162048, -144417, -70734, -67457, -89778, -72598, -123410, -99141, -38286, -63597, 34547, 14905, -42742, -62483, -60275, 57753, 52227, 94146, -12178, -41364, -32060, 22069, 37918, 37396, -21189, -27248]
10428b7248q956R424k9363N929M8766J9983l8821P7266N3843j4523J616K5101
10416A23017o1379j3139k944K0120R041k0949p6346P6312K5525r0003j08462J1192
10404a08015K7779L0316j1355l892K873P789l6629P0145l554J1158o2822k1380
10392i7587j9317r375o601R350K7687n942M5198r242L5663n1406o8390P3276N3596
10379b3090K0314l6743m0626N960l0652K882K2678n4926O6293M9186k2615m8769
10367i0108J08792Q3295m5172k5378M854O3777j1599l7697n4845l4180p6023L1140
10355h3144k2553j00419j235J24361Q8395O6155j9641o3243Q54n9526n9086J0568
10343a18514l4494J2569J64527R7321j0496q0825J532J2083N440P1474M6370R4134
$$ y = [-27248, -36204, -26780, -56143, -50214, -1448, 18535, -20286, 56980, 110823, 96300, 97916, 123017, 61638, 48499, 45555, 65675, 74716, 53767, -22579, 53733, 79258, -10745, -119207, -108015, -80236, -49920, -61275, -65167, -62294, -54505, -91134, -20989, -24543, -13385, -76207, -97587, -116904, -126279, -132880, -123530, -95843, -101785, -56587, -65829, -30166, -81572, -149962, -76686, -23090, -2776, -39519, -80145, -74185, -104837, -101955, -79277, -134203, -67910, -18724, -41339, -90108, 18684, 101979, 56807, 31429, 36283, 100060, 88461, 50764, -4081, -38261, -114284, -83144, -105697, -206116, -207351, -82990, 5405, 71560, 51919, -11324, -10470, -69996, -129082, -118514, -153008, -140439, 24088, 121409, 110913, 30088, 31620, 43703, 49143, 120617, 166987, 261121]
10331B61121K3408j7412k3259L8692n127j24427m6216q1649l8332M9366K592o7805
10319b9048K6571Q9639k673j788J5144J6036j02k8146L3772o2888o8314r011O1435
10306D0627L4913K0805l718k5637m8138p7642K0771k3339R64k6278o2617j8398
10294a67687K6963N5510J6885n003J43K1178P2262l721K5462N7863m4053N915
10282F1717M0501j193n5959K9101j7082L9993L568k22Q6184L4342j02754p9703
10270C8493J3981j778N927l0988j02886o2166K5927N7312M2300J21859l2775o69
10258G4537J0530L7412l1204m3206j7573J9921n1933n8742N9380O8493O1765O872
10246A36252O8134N6016N459J1496Q8425O4374K909l0839p5143R361p4869j17708
$$ y = [261121, 284529, 267117, 243858, 282550, 277423, 152996, 106780, 25131, -13201, 36165, 38757, -29048, -2477, 87162, 84489, 82701, 97845, 113881, 113779, 85633, 119405, 56517, -11797, -20808, 40627, 75540, 96345, 92627, 66990, 18852, -58790, -38019, -61358, -60394, -86672, -149289, -167687, -140724, -85214, -68329, -73332, -73189, -52011, 20251, 16530, 41992, 99855, 55802, 61717, 102218, 101025, 45066, 74167, 57085, 97078, 100646, 100424, 186608, 220950, 118196, 38493, 52474, 50696, 56623, 25635, -77251, -139417, -113490, -56178, -13878, 107981, 75206, 74537, 85067, 122479, 91275, 48069, 30496, 50417, -1516, -60258, -878, 67615, 129380, 136252, 204386, 260402, 265861, 277357, 365782, 430156, 433065, 402226, 327083, 336444, 261575, 143867]
10234A43867N1455l2013o1880L2159M3003j6113J1426N021p3855n248o9312n8889
$$ y = [143867, 195322, 163309, 101429, 133588, 176591, 160478, 171904, 176925, 103070, 97822, 28510, -30379]
$$ [...]
##END NTUPLES=NMR SPECTRUM
##END=
