##TITLE=Analysis number 324053
Compound Code cc 47546
Book Reference 508/20/2
Project Code adrs
Chemist Name antons
##JCAMPDX= 6.0         $$ Bruker NMR JCAMP-DX V2.0
##DATA TYPE= NMR SPECTRUM
##DATA CLASS= NTUPLES
##ORIGIN= Bruker BioSpin GmbH
##OWNER= nmr
$$ XWIN-NMR		Version 3.5
$$ Tue Nov 14 11:38:37 2006 GMT Standard Time (UT+0h)  MAYBRIDGE\nmr@NMR_250MHZ
##.OBSERVE FREQUENCY= 250.131544655141
##.OBSERVE NUCLEUS= ^1H
##.ACQUISITION MODE= SIMULTANEOUS (DQD)
##.ACQUISITION SCHEME= undefined
##.AVERAGES= 16
##.DIGITISER RES= 18
##SPECTROMETER/DATA SYSTEM= dpx250
##.PULSE SEQUENCE= zg30
##.SOLVENT NAME= CDCl3
##.SHIFT REFERENCE= (INTERNAL, CDCl3, 0, 16.522)
##AUDIT TRAIL= $$ (NUMBER, WHEN, WHO, WHERE, WHAT)
$$ ##TITLE= Audit trail, XWIN-NMR		Version 3.5
$$ ##JCAMPDX= 5.01
$$ ##ORIGIN= Bruker BioSpin GmbH
$$ ##OWNER= nmr
$$ C:\u/data/dgb/nmr/ADRS/240/pdata/1/auditp.txt
$$ ##AUDIT TRAIL=  $$ (NUMBER, WHEN, WHO, WHERE, WHAT)
(   1,<2006-11-14 11:38:10.39 +000>,<MAYBRIDGE\nmr>,<NMR_250MHZ>,
      <created by zg, POWCHK disabled, PULCHK disabled
       configuration hash MD5:
       49 4B E0 1D 92 C2 6B 37 9F E6 65 BC 52 41 86 1D
       data hash MD5: 64K
       AC 72 13 EB DA F9 CA 1C D7 4C E9 6F 31 8C 07 99>)
(   2,<2006-11-14 11:38:25.94 +000>,<MAYBRIDGE\nmr>,<NMR_250MHZ>,
      <Start of raw data processing
       ef LB = 0.3 FT_mod = 6 PKNL = 1 SI = 32K 
       data hash MD5: 32K
       8B 62 7D FD F4 70 F1 B3 81 44 45 A1 E5 E8 C2 A4>)
(   3,<2006-11-14 11:38:27.87 +000>,<MAYBRIDGE\nmr>,<NMR_250MHZ>,
      <apk 
       data hash MD5: 32K
       AE 3C 0B C4 AB CE 7D B9 30 12 0E 7C F8 94 D4 72>)
(   4,<2006-11-14 11:38:28.61 +000>,<MAYBRIDGE\nmr>,<NMR_250MHZ>,
      <abs ABSG = 5 
       data hash MD5: 32K
       A5 DD FF 3A EB 1C FD 27 5B 64 E1 BB 3A E6 8A 84>)
$$ ##END=
$$ 
$$ hash MD5
$$ D4 83 86 BB 60 D9 38 7B 3E EA 98 D2 B9 68 A3 EE
##$RELAX= 
##$RELAX= 
##$RELAX= 
##$RELAX= 
##$RELAX= 
##$RELAX= 
##$RELAX= 
$$ Bruker specific parameters
$$ --------------------------
##$DU= <C:\u>
##$EXPNO= 240
##$NAME= <ADRS>
##$PROCNO= 1
##$TYPE= <nmr>
##$USER= <dgb>
##$AMP= (0..31)
100 100 100 100 100 100 100 100 100 100 100 100 100 100 100 100 100 100 
100 100 100 100 100 100 100 100 100 100 100 100 100 100 
##$AQSEQ= 0
##$AQ_mod= 3
##$AUNM= <au_zg>
##$AUTOPOS= <27 >
##$BF1= 250.13
##$BF2= 250.13
##$BF3= 250.13
##$BF4= 250.13
##$BF5= 500.13
##$BF6= 500.13
##$BF7= 500.13
##$BF8= 500.13
##$BYTORDA= 1
##$CFDGTYP= 0
##$CFRGTYP= 5
##$CHEMSTR= <none>
##$CNST= (0..31)
1 1 145 1 1 1 1 1 1 1 1 1 1 1 1 1 1 1 1 1 1 1 1 1 1 1 1 1 1 1 1 1 
##$CPDPRG= <>
##$CPDPRG1= <>
##$CPDPRG2= <>
##$CPDPRG3= <>
##$CPDPRG4= <mlev>
##$CPDPRG5= <mlev>
##$CPDPRG6= <mlev>
##$CPDPRG7= <mlev>
##$CPDPRG8= <mlev>
##$CPDPRGB= <>
##$CPDPRGT= <>
##$D= (0..31)
0 1 0 0 0 0 0 0 0 0.06 0 0 0 0 0 0 0.0002 0 0 0 0 0 0 0 0 0 0 0 0 0 0 
0 
##$DATE= 1163504288
##$DBL= (0..7)
120 120 120 120 120 120 120 120 
##$DBP= (0..7)
150 150 150 150 150 150 150 150 
##$DBP07= 0
##$DBPNAM0= <>
##$DBPNAM1= <>
$$ [...]
##$SUBNAM7= <"">
##$SUBNAM8= <"">
##$SUBNAM9= <"">
##$SW= 20.6930455092707
##$SWIBOX= (0..15)
0 0 3 0 0 0 0 0 0 0 0 0 0 0 0 0 
##$SW_h= 5175.983436853
##$TD= 65536
##$TD0= 1
##$TE= 683.16
##$TE2= 300
##$TE3= 300
##$TEG= 300
##$TL= (0..7)
0 120 120 120 120 120 120 120 
##$TP= (0..7)
150 150 150 150 150 150 150 150 
##$TP07= 0
##$TPNAME0= <>
##$TPNAME1= <>
##$TPNAME2= <>
##$TPNAME3= <>
##$TPNAME4= <>
##$TPNAME5= <>
##$TPNAME6= <>
##$TPNAME7= <>
##$TPOAL= (0..7)
0.5 0.5 0.5 0.5 0.5 0.5 0.5 0.5 
##$TPOFFS= (0..7)
0 0 0 0 0 0 0 0 
##$TUNHIN= 0
##$TUNHOUT= 0
##$TUNXOUT= 0
##$USERA1= <user>
##$USERA2= <user>
##$USERA3= <user>
##$USERA4= <user>
##$USERA5= <user>
##$V9= 5
##$VALIST= <valist>
##$VCLIST= <CCCCCCCCCCCCCCC>
##$VD= 0
##$VDLIST= <DDDDDDDDDDDDDDD>
##$VPLIST= <PPPPPPPPPPPPPPP>
##$VTLIST= <TTTTTTTTTTTTTTT>
##$WBST= 1024
##$WBSW= 4
##$XGAIN= (0..3)
0 0 0 0 
##$XL= 0
##$YL= 0
##$YMAX_a= 431869
##$YMIN_a= -320490
##$ZGOPTNS= <>
##$ZL1= 120
##$ZL2= 120
##$ZL3= 120
##$ZL4= 120
##$ABSF1= 16.522
##$ABSF2= -4.171173
##$ABSG= 5
##$ABSL= 3
##$ALPHA= 0
##$AQORDER= 0
##$ASSFAC= 0
##$ASSFACI= 0
##$ASSFACX= 0
##$ASSWID= 0
##$AUNMP= <proc_1d>
##$AZFE= 0.1
##$AZFW= 0.1
##$BCFW= 0
##$BC_mod= 0
##$BYTORDP= 0
##$COROFFS= 0
##$CY= 12.5
##$DATMOD= 1
##$DC= 0
##$DFILT= <>
##$DTYPP= 0
##$F1P= 14.0000005364418
##$F2P= -0.99999901652339
##$FCOR= 0.5
##$FTSIZE= 32768
##$FT_mod= 6
##$GAMMA= 0
##$GB= 0
##$INTBC= 1
##$INTSCL= 1
##$ISEN= 128
##$LB= 0.3
##$LEV0= 0
##$LPBIN= 0
##$MAXI= 10000
##$MC2= 0
##$MEAN= 0
##$ME_mod= 0
##$MI= 0
##$NCOEF= 0
##$NC_proc= -3
##$NLEV= 6
##$NOISF1= 0
##$NOISF2= 0
##$NSP= 0
##$NTH_PI= 0
##$NZP= 0
##$OFFSET= 16.522
##$PC= 1
##$PHC0= -49.37753
##$PHC1= 4.298439
##$PH_mod= 1
##$PKNL= yes
##$PPARMOD= 0
##$PSCAL= 4
##$PSIGN= 0
##$REVERSE= no
##$SF= 250.13
##$SI= 32768
##$SIGF1= 0
##$SIGF2= 0
##$SINO= 400
##$SIOLD= 32768
##$SREGLST= <1H.CDCl3>
##$SSB= 0
##$STSI= 32768
##$STSR= 0
##$SW_p= 5175.98343685301
##$SYMM= 0
##$S_DEV= 0
##$TDeff= 65536
##$TDoff= 0
##$TI= <Analysis number 999999
Compound Code 99
Book Reference 9
Project Code 9>
##$TILT= no
##$TM1= 0
##$TM2= 0
##$TOPLEV= 0
##$USERP1= <user>
##$USERP2= <user>
##$USERP3= <user>
##$USERP4= <user>
##$USERP5= <user>
##$WDW= 1
##$XDIM= 32768
##$YMAX_p= 335375747
##$YMIN_p= -302684
$$ End of Bruker specific parameters
$$ ---------------------------------
##NTUPLES= NMR SPECTRUM
##VAR_NAME=  FREQUENCY,     SPECTRUM/REAL,   SPECTRUM/IMAG
##SYMBOL=    X,             R,               I
##VAR_TYPE=  INDEPENDENT,   DEPENDENT,       DEPENDENT
##VAR_FORM=  AFFN,          ASDF,            ASDF
##VAR_DIM=   32768,         32768,           32768
##UNITS=     HZ,            ARBITRARY UNITS, ARBITRARY UNITS
##FACTOR=    0.157963299565203, 1,           1
##FIRST=     4132.6476996994, 0,             0
##LAST=      -1043.33573715361, 0,           0
##MIN=       -1043.33573715361, -302684,     0
##MAX=       4132.6476996994, 335375747,     0
$$ Real data points
##PAGE= N=1
##DATA TABLE= (X++(R..R)), XYDATA
$$ [...]
16351a2404J6349q903k381j8171P276L0864l33N799J5636k5886j3805L1964M2
16338B6047k1931q94K0609k5423J069m659P865M695q183p670k1003j010L1711
16325A223j7029j0347K8872J0446k5468J418j431P158L6759l2984l1202k8382
16313f0967P68o17m685J4160K9067j4053j5533P81P741J5359R728p984o97k485
16299b9417J7674Q317k595m4043r034l241k388K6673O647k2410L950J163p126
16286e5830J2138J5556R788J6359Q30K4812Q236j4674l4439n557J0293L6337K2127
16273D5976o306m7098m49J1768j8233J389P785J754j0925R492o656k9184j1039
16260e1726J4009K0991r309j5013j1657M322L620L908L0650L1096N057m37k4578
$$ plain form
16351 -12404 3945 -4958 -7339 -25510 -18234 12630 12297 18096 33732 7846 -5959 26005 26047
16338 26047 4116 3222 23831 -1592 -523 -5182 2683 7378 -805 -8475 -29478 -30488 1223
16325 1223 -15806 -26153 2719 13165 -12303 -10885 -12316 -5158 31601 -1383 -32585 -60967
16313 -60967 -60199 -60816 -65501 -51341 -22274 -36327 -51860 -51079 -43338 -27979 -18251 -26235 -26932 -29417
16299 -29417 -11743 -3426 -6021 -50064 -59098 -62339 -64727 -38054 -31407 -53817 -49867 -48704 -55830
16286 -55830 -43692 -28136 -18348 -1989 -1159 23653 31889 17215 -17224 -22781 -12488 23849 45976
16273 45976 39670 -7428 -7877 3891 -14342 -12953 -5168 -3414 -14339 -4847 -11503 -40687 -51726
16260 -51726 -37717 -16726 -26035 -41048 -52705 -48383 -44763 -40855 -10205 20891 25948 25511 933
16247I33L094J5242m414j5012j6951j8759J9686J0515j1584j1366j8648l111K4426
16234b5949J1750J5967q118j5012K1725K2290J041j6419k7637J4752n188k4974
16222c5772n87J4446r749K1870K1441L621j6038J0017J062j0500q070o170k3468
16209c7897j6257J7826K0268j1415K0201J7411K1492k7033j781L7630N621k9782
16197A6284l906n149N130j6278j7147J0357j6141l363P111k047o006Q336j1367
16184c4186j2880O063K343j8325J0445k183j3316N169J3707R282p948J1209R062
16171b1558Q931q957J8614J5157K1218k232j3074m863p593j4322K177J7858J7370
16158B8726m2057k5912J3287L2083L119j2669r985j4426m3866M36J2494N2510
$$ plain form
16247 933 4027 19269 14855 -157 -17108 -35867 -16181 -5666 -17250 -28616 -47264 -50375 -25949
16234 -25949 -14199 1768 -6350 -21362 363 22653 23694 7275 -20362 -5610 -10798 -35772
16222 -35772 -36359 -21913 -31662 -9792 11649 15270 -768 9249 10311 -189 -8259 -14429 -37897
16209 -37897 -54154 -36328 -16060 -27475 -7274 10137 31629 4596 2815 40445 46066 16284
16197 16284 12378 7229 12359 -3919 -21066 -10709 -26850 -30213 -23102 -25149 -31155 -22819 -34186
16184 -34186 -47066 -41003 -38660 -56985 -46540 -48723 -62039 -56870 -43163 -33881 -41829 -30620 -21558
16171 -21558 -12627 -21584 -2970 12187 33405 31173 18099 13236 5643 -8679 -6502 11356 28726
16158 28726 -13331 -39243 -25956 6127 9246 -3423 -13408 -27834 -71700 -71264 -58770 -6260
16146f260K8896l3547p996J5036R357L8502j4597k5129k3414J4964P68k324O010
16133B66K971k0634N974K347J6129J7122N750n901k1582k0792j0102m519m109
16120c7080m283M5630J6288j1212k401K1602l0391k0440j636j4983j335r364J9362
16107c0243Q715j3276l0812k412k823J4861k157K3845J8929j0003l0607q074J1502
16094e2555r527m427P566L0368R040P593Q070Q021j8412l374L941L0323M2215
16081E8842J6878j9399n0981k6838J6448J0182J2948J0853m144l0191j4270R874
16069i798k40Q069N066l3041K5207p85j0156K2206L2773l887R525k9326k8970
16056a3357Q061j6624j3293j0432J4815p472p197j5859K8690K3217K462j7659
$$ plain form
16146 -6260 22636 -10911 -18907 -3871 5486 43988 29391 4262 -19152 -4188 -3420 -5744 266
16133 266 3237 -17397 -11423 -9076 7053 24175 29925 24024 2442 -18350 -28452 -32971 -37080
16120 -37080 -41363 4267 20555 9343 6942 28544 -1847 -22287 -23923 -38906 -40241 -49605 -30243
16107 -30243 -21528 -34804 -65616 -68028 -70851 -55990 -58147 -34302 -15373 -25376 -55983 -64057 -52555
16094 -52555 -62082 -66509 -58943 -28575 -19535 -11942 -3872 4149 -14263 -17637 -13696 16627 58842
16081 58842 75720 56321 5340 -21498 -5050 5132 18080 28933 24789 -5402 -19672 -9798
16069 -9798 -10038 -1969 3097 -29944 -4737 -5522 -15678 6528 39301 35414 44939 15613 -13357
16056 -13357 -5296 -21920 -35213 -45645 -30830 -38302 -45499 -61358 -32668 -9451 -6989 -24648
16044b4648M984K5231K2258J0008j1498q544j3013o902J7208o196L290l535n0951
16031d2308j2448o059m100J6746K9875J177p036P598Q278p870J2971j8888K257
16018a9807J7077L393k2267j9531j7079r748M1366K1787m14L0400J2974j4062
16006B4089l8632k7010J8844j186l956j4635n89J0136O325j0213j1395k3196J8985
15993e2433L3708J0976o674L571K6964O291p716J1090J346r21k5784k1323n938
15980b6843R721L4676j6139j7869J743N548j0763K4875L5672Q984k1206k963Q08
15967B6244J3527k6156l2569l919M3854J8872J1747J1630l5790n585J6230R460
15955D7545r250k6009k452P640J1513j4412k7204Q434K2471J3957J1049l4885
$$ plain form
16044 -24648 -19664 5567 27825 37833 26335 17791 4778 -2124 15084 8888 12178 8643 -42308
16031 -42308 -54756 -60815 -64915 -48169 -18294 -17117 -24153 -16555 -8277 -16147 -3176 -22064 -19807
16018 -19807 -2730 663 -21604 -41135 -58214 -67962 -26596 -4809 -5223 25177 38151 24089
16006 24089 -14543 -41553 -22709 -23895 -27851 -42486 -43075 -32939 -26614 -36827 -48222 -71418 -52433
15993 -52433 -18725 -7749 -14423 -10852 16112 22403 14687 25777 27123 26202 418 -20905 -26843
15980 -26843 -17122 17554 1415 -16454 -14711 -9163 -19926 4949 40621 49605 28399 25436 26244
15967 26244 39771 13615 -18954 -22873 20981 39853 51600 63230 27440 21855 38085 47545
15955 47545 38295 12286 9834 17474 28987 14575 -12629 -4195 18276 32233 43282 8397
15943H397k0072K4913K2381J4860l1397j6568L901J3375Q502j9044q745R17O907
15930H327k3501R066J1891L3227N609j270k3042k4446q572K3423K84p991l240
15917b35o261O236J0722k528l35J7902k77K451j4987k3867n942L718P024J0333
15903C954n771l8717J2856P435j4783J2420L1147K6155r768J3866n792K067j4830
15890B0239k4795k4052P668Q767J51j7110k3039R771K0670Q063K2002K3512j1749
15877B0098L641L531j9906J2477K0983l3444o039j2511l3214k2306K1498N4631
15865I439j0289O103m439k9531K0658Q745K645R52L3345K0272j5033l1455O450
15852A7862L755j2475k9669o366L3544m084L5962L451K4816p47j8174m097Q662
$$ plain form
15943 8397 -11675 13238 35619 50479 19082 2514 6415 19790 28292 9248 503 1420 8327
15930 8327 -15174 -6108 5783 39010 44619 43349 20307 -4139 -12711 10712 10996 3005 -235
15917 -235 -6496 -260 10462 7934 7599 25501 25224 27675 12688 -11179 -17121 -13403 -6379 3954
15903 3954 -1817 -40534 -27678 -20243 -35026 -22606 8541 34696 24928 38794 33002 35069 20239
15890 20239 -4556 -28608 -20940 -12173 -12022 -29132 -52171 -42400 -21730 -13667 8335 31847 20098
15877 20098 23739 27270 7364 19841 40824 7380 1341 -11170 -44384 -66690 -45192 9439
15865 9439 -850 5253 814 -28717 -8059 686 3331 4283 37628 57900 42867 11412 17862
15852 17862 21617 9142 -20527 -26893 6651 2567 38529 41980 66796 66049 47875 43778 52440
15839E2440K4624J7008L8287O6863O1637N2852O7278J03491J24177J32417Q1062
15828H22136L2508J8327o6445o4986r3021j37985r0414p1384r4299m0873l0556
15817A83008l7882k5125l1198j4174r835Q59J5576p623q102n088R493L9184k8133
15804H0960n0126n614J2750J4184K171k4089o777J0198l726Q079O422p704q951
15791B7777L6309L2308k6495j5766j1719k9545O113J6692j0980J604J8634q723
15779C6209m1545m8558L794L4677L7142J9905K1193N829j7080k6982m1112J1693
15767d835K4294q756o950M24K8149K087l5682k4904K4524j0841J865O412M633
15754D20j6028n633K7576j7745j7524K3166L916p867L2487J638j1642J8410K4106
$$ plain form
15839 52440 77064 94072 132359 199222 260859 313711 380989 484480 608657 741074 822136
15828 822136 854644 872971 806526 741540 648519 510534 420120 348736 254437 213564 183008
15817 183008 145126 120001 88803 74629 64794 65653 81229 73606 65504 60416 69909 109093 80960
15804 80960 30834 25220 37970 52154 54325 30236 23459 33657 29931 38010 44432 36728 27777
15791 27777 64086 96394 69899 54133 42414 12869 18982 35674 24694 26298 44932 36209
15779 36209 -5336 -53894 -50100 -15423 21719 41624 62817 68646 51566 24584 -16528 -4835
15767 -4835 19459 10703 3753 4177 32326 34413 -1269 -26173 -1649 -12490 -10625 -4213 420
15754 420 -15608 -21241 6335 -11410 -28934 -5768 -1852 -9719 22768 24406 12764 31174 55280
15741E5280J2299k4447j9368j3490l6638J5336L2252l3900k993J0167m033J5820
15729F285L5004J9090k3218m5089j1522K6752J595j0683n54J9099Q277l742J3039
15716C4333P754J4943j2657n97k9683k0521l513N0327M9099n536Q054q229m561
15703G9213k2528k022L953p017J1848N050J4019o179K4887k0417k7956j7272r895
15690B5684L0007Q210R450j3343L74k3564k6940P656Q828L2262K9224L452R94
15677I2294j6836k4466m908J892R302j9159j7829J7987J7523l4023m656L5250
15665E2371n359k9442J6839j6915j8530J8495K8552k6145k5813j3681J7436K3894
15653B1702J0131j8513Q899O159K1765j3721J8168K0224R873P899O090o902L3111
$$ plain form
15741 55280 67579 43132 23764 10274 -26364 -11028 21224 -12676 -15669 -5502 -9535 6285
15729 6285 41289 60379 37161 -7928 -19450 7302 8897 -1786 -2340 16759 25036 21294 34333
15716 34333 42087 57030 44373 43776 14093 -6428 -9941 40386 89485 83949 92003 83774 79213
15703 79213 56685 54663 58616 51599 63447 68497 82516 76337 101224 80807 52851 35579 25684
15690 25684 55691 63901 73351 60008 60382 36818 9878 17534 26362 58624 87848 91300 92294
15677 92294 75458 50992 46084 47976 57278 38119 20290 38277 55800 21777 17121 52371
15665 52371 47012 17570 34409 17494 -1036 17459 46011 19866 -5947 -19628 -2192 21702
15653 21702 31833 13320 22219 28378 50143 36422 54590 74814 84687 92586 98676 91774 124885
15640A24885L9924K5597K9777L0094K2049l0863k6656l9589j9040J401J367m7128
15628A11818k0150m219k4700p350p378j8564J8867o8m254J2250M314J4737K808
15615G8111j1053l9448j514J3194j2041j8225O7489M225k1706P634n556J7602
15603G8712k1191k4907j7907j4712r511J5481K3338K7675J7928L179k3103j0555
15591D4427l088P072k01l239j845J0562J2659k4166J5945R889L805O57J8498K8899
15577A19874J5389j6618l8604m1521m9941n3239l9383k7257M369P067J092j8439
15565a37211J455K1878L7689L1944K4892O372J7501J9973K6701R494j244K709
15553F2153P321j9636j0156L4329k1016p077J7173n327O866J8271M038J8803k9386
$$ plain form
15640 124885 164809 190406 220183 250277 272326 241463 214807 175218 156178 157579 158946 111818
15628 111818 91668 87449 62749 55399 48021 29457 48324 48256 44002 56252 60566 75303 78111
15615 78111 67058 27610 26096 39290 27249 9024 76513 80738 59032 66666 61110 78712
15603 78712 57521 32614 14707 -5 -9516 5965 29303 56978 74906 78085 54982 44427
15591 44427 41339 48411 48210 44971 43126 53688 66347 42181 58126 68015 71820 72477 90975 119874
15577 119874 135263 118645 80041 38520 -11421 -64660 -104043 -131300 -126931 -119864 -118772 -137211
15565 -137211 -135756 -113878 -76189 -44245 -19353 -12981 4520 24493 51194 60688 59444 62153
15553 62153 69474 49838 39682 74011 52995 45918 63091 57764 64630 82901 86939 105742 76356
15540G6356K817j5008j6353k5418J1382L3901L2020j1890J4670l5590k7821O71
15528C9737M1776N741l955P164J6667K4354J58J6851J3981J3114R68r412J8365
15515A85509L5019K5421J6995o82K768L1098L7694n927j8075N254k0618j8702
15503B75754J101j692m9687m7227n087N927L2156J6555P135j698k8056q501J7858
15490B14538K2866L4883q506m468L8997j2163r798j7858k863l962K1973Q27j4031
15477B60435K6115K08n470j043M74J3078L209J046k9059J6563J6724L0904K7298
15464C60482N570Q068j2601P706J7246K1607L3019K3864k0134L590K6514L4730
15452E09661R233J5803L8299r20P01K1688k6562j67L7682L5221k003J9825p41
$$ plain form
15540 76356 79173 64165 47812 22394 33776 67677 99697 87807 102477 66887 39066 39737
15528 39737 81513 87254 83299 90463 107130 131484 131642 148493 162474 175588 176556 167144 185509
15515 185509 220528 245949 262944 262262 265030 296128 333822 327895 309820 315074 294456 275754
15503 275754 276855 275163 225476 178249 173162 179089 211245 227800 234935 233237 205181 196680 214538
15490 214538 237404 272287 263781 259313 298310 286147 276349 258491 255628 251666 273639 274466 260435
15477 260435 286550 286758 281288 280245 280719 293797 297006 298052 268993 285556 302280 333184 360482
15464 360482 366052 374120 361519 369225 386471 408078 441097 464961 444827 448417 474931 509661
15452 509661 518894 534697 572996 572076 572777 594465 567903 567736 605418 640639 638636 658461 657720
15439F57720L8642P0619N3895L6346L3184j0025M8553M0285J3793N1046M6767
15428A080825L9279K8833N9987O9222P9232Q7706J23056J25568Q4172P1718R9710
15417A949308J22949J34990J18074J18768J05226J13922J34853J93624K28931
15408C220645K89546L51227L58211M67749O00264P11810Q30987R34256J061351
15399H826046J152474J281742J492717J736364K132645K834189L853805N462124
15391B8772106P984422J1417396J5413280J9340064K2465827K3027048J9790435
15384A48210578J4157602O938616l148750j3613951j9746205k2106228k2851787
15377H7839875k0893128j6304996j1437399p761683n351785l817471k853891k250245
$$ plain form
15439 657720 696362 766981 820876 857222 890406 880381 928934 969219 983012 1034058 1080825
15428 1080825 1120104 1148937 1208924 1278146 1357378 1445084 1568140 1693708 1777880 1849598 1949308
15417 1949308 2072257 2207247 2325321 2444089 2549315 2663237 2798090 2991714 3220645
15408 3220645 3510191 3861418 4219629 4687378 5287642 5999452 6830439 7764695 8826046
15399 8826046 9978520 11260262 12752979 14489343 16621988 19456177 23309982 28772106
15391 28772106 36756528 48173924 63587204 82927268 105393095 128420143 148210578
15384 148210578 162368180 169306796 166158046 152544095 132797890 110691662 87839875
15377 87839875 66946747 50641751 39204352 31442669 26090884 22273413 19419522 17169277
15369A7169277j840119j522949j340790j212607j105341r70859q91089p63280
15361G522243o59242n97951m85032m02002l46326l05530k70991k11827j72041
15352D071301j84893k15792j49573j57144j60628j40678j53968j31390j00304
15343B676931l3051j00401j26218j08375j20701j01881o2891o3745r7890n9482
15333A802296n7796l0834m7488m3446n5620q5467o3701n1446l9007n3085n1097
15322A223309l3256m4851m8223k2310q736l9339l7181j4990j7155l2607n6966
15311H67695n5405n0908j5556r837l0470j0295j4417l8386l2014j9469j7210J0184
15299E83912n979o228j5870j7789p565K487j4472o704j0654l2727k2199Q203p209
$$ plain form
15369 17169277 15329158 13806209 12465419 11252812 10147471 9176612 8285523 7522243
15361 7522243 6863001 6265050 5780018 5378016 5031690 4726160 4455169 4243342 4071301
15352 4071301 3886408 3670616 3521043 3363899 3203271 3062593 2908625 2777235 2676931
15343 2676931 2643880 2543479 2417261 2308886 2188185 2086304 2023413 1959668 1861778 1802296
15333 1802296 1744500 1713666 1666178 1622732 1567112 1481645 1417944 1366498 1327491 1274406 1223309
15322 1223309 1190053 1145202 1096979 1074669 1065933 1026594 989413 974423 957268 924661 867695
15311 867695 812290 761382 745826 735989 705519 695224 680807 642421 610407 590938 573728 583912
15299 583912 577933 571705 555835 538046 530481 532968 518496 511792 501138 468411 446212 454415 447206
15286D47206l1074P943J2055j5019k8271l863Q963K7755L3511L1586K7341K7363
15274E45496K4009K8305N4842N4891j2556k2012m3243p9933m5943j3911j1462
15263D78483j8263k9125k011k0432n3466J837K8043k872k1115k0641j0038k4932
15251C05468k0531m373k4343Q495k4427o662J7386j5653j2052j0055m0921k2978
15239A49354K1535j3025K476j1450K0899N43p409L198p976r053j0814j6918m150
15226A17210j7731J8521o743N267q831j5547j3941j2804J4322J9205n619j0020
15214H3289J3922N2011L8771R127J9101J6305L4264K0839K7642L7283K1552J2467
15202C86573L6895J6416k6854m7564m1297l1727k8786l6889l6465j1367l9629
$$ plain form
15286 447206 416132 424075 436130 421111 392840 388977 397940 425695 459206 490792 518133 545496
15274 545496 569505 597810 652652 707543 694987 672975 629732 549799 503856 489945 478483
15263 478483 460220 431095 429084 408652 355186 357023 385066 382194 361079 340438 330400 305468
15251 305468 284937 280564 256221 264716 240289 233627 251013 235360 223308 213253 172332 149354
15239 149354 170889 157864 160340 148890 169789 170332 162923 166121 158145 149092 138278 121360 117210
15226 117210 99479 118000 111257 116524 107693 92146 78205 65401 79723 98928 93309 83289
15214 83289 97211 149222 187993 197120 216221 232526 266790 287629 315271 352554 374106 386573
15202 386573 423468 439884 413030 365466 324169 292442 263656 226767 190302 178935 139306
15191A39306k5310k0928J4551j8701m6537J6722J6945j1701o756L3206O695j0717
15179H6775j33J1526K177K5568O3549m495k3029j3682n0561k4496R762N818J1522
15166A00301k496k4478k6267j4533M5037j2084k0566O534K3782p439l3552j423
15154C2816K2446K1218k0452j3895l6624k437J8561l9373j8196J6239J6502k8998
15142c2193k0807K861J6392K6708K0569K564J441l0139Q242K6274r65k1336K9388
15129B8999K0713l1994p652K084q453n306J6391K1575R542M5458M1053N2270M5899
15116B30579O3727P6091P1597P1414Q1590J5701N337k7200o6724n0295p9840p4233
15104C17744k7971o0667m7775k0099k265L932l2602l0101n526r329K472k6922
$$ plain form
15191 139306 113996 93068 107619 88918 42381 59103 76048 64347 57591 90797 97492 86775
15179 86775 86642 98168 100345 125913 189462 184967 161938 148256 97695 73199 82961 88779 100301
15166 100301 97805 73327 47060 32527 77564 65480 44914 51448 75230 67791 34239 32816
15154 32816 55262 76480 56028 42133 5509 3072 21633 -17740 -35936 -19697 -3195 -32193
15142 -32193 -53000 -50139 -33747 -7039 13530 16094 17535 -12604 -4362 21912 20947 -389 28999
15129 28999 49712 17718 10066 12150 3697 -1609 14782 36357 45899 91357 132410 184680 230579
15116 230579 294306 370397 441994 513408 594998 610699 616036 588836 522112 471817 391977 317744
15104 317744 289773 229106 181331 161232 158967 162899 130297 100196 94670 85341 87813 60891
15092F0891n2919J591k801K6187Q184J4855J3031r298J0123p997r16P014l3963
15079C3982j8537l7684J703O0103k014j6579k1539j3206m4191r427p392J64M1158
15066c3459L002J4780K4534J4566m4822k7021j7388K0568K7625J7844J7908K5427
15054D3564J1007j57K180j933J0543J5782M4100K7654L2184N3756M5599O9030
15042C53309Q4547Q8272J3916K0077p4k8103n6642k3298m8442r5930l7850l8689
15030B31093k2082j9571k8667j4615n848k6186l4944j0844j2304r619k0789r135
15018A6489q906O967k630k9190O018K1178J37J435j3760K8311J9822j7528j6524
15005A1819J5889r33K927l462j0610j586n222j3181M453j827P629J2189N951j3348
$$ plain form
15092 60891 7972 9563 6762 32949 41133 55988 69019 59721 69844 61847 60931 67945 33982
15079 33982 15445 -22239 -20536 39567 37553 20974 -565 -13771 -57962 -67389 -74781 -74617 -33459
15066 -33459 -30457 -15677 8857 23423 -21399 -48420 -65808 -45240 -17615 229 18137 43564
15054 43564 54571 54414 56594 54661 65204 80986 125086 152740 184924 238680 284279 353309
15042 353309 437856 526128 540044 560121 560047 531944 475302 452004 403562 307632 269782 231093
15030 231093 209011 189440 160773 146158 140310 114124 79180 68336 56032 46413 25624 16489
15018 16489 7583 14550 11920 -17270 -11252 9926 10063 11498 -2262 26049 45871 28343 11819
15005 11819 27708 26775 29702 26240 15630 14044 8822 -4359 94 -1733 5896 18085 24036 10688
14991A0688k285j22J9900K0562N915k6738j9775K2310J7024J5121l4438J5909
14979D4071K2363j3960r33m196m1317l1845R723M7948O91k2752j7336J10P753
14966C20M059J2053m523Q428J5493j5045K4617K4658j146k1003j4943K487J0331
14953D5786J3890L9515J0033J5226N5888L1761P267R429j5474J346L8558L8574
14941B91799K1749k9684p000N4742J14155J15130J26488R1757N7526J99j4448
14930H22413K837p0990r6954j25816j17189o7238m8556q2883k6976k0655o946
14919A61047j1121m1737m0710k0726R150o800J9961M873J4815k9836k7282l5494
14907c860k50p534l2529o825J2065J9470o155L876o138j1073J6956M3982K6120
$$ plain form
14991 10688 8403 8281 28181 48743 54658 27920 8145 30455 47479 62600 28162 44071
14979 44071 66434 52474 51541 47345 6028 -25817 -16094 31854 32545 9793 -7543 -7433 320
14966 320 4379 16432 11909 20337 35830 20785 45402 70060 68914 47911 32968 35455 45786
14953 45786 59676 99191 109224 124450 180338 212099 219366 228795 213321 214667 253225 291799
14941 291799 313548 283864 276864 331606 445761 560891 687379 779136 836662 836861 822413
14930 822413 825250 754260 657306 531490 414301 347063 298507 215624 188648 167993 161047
14919 161047 149926 108189 67479 46753 55903 49103 69064 73937 88752 58916 31634 -3860
14907 -3860 -4110 -11644 -44173 -50998 -38933 -19463 -25618 -21742 -27880 -38953 -21997 21985 48105
14894D8105K1966o585k4893j3070j0667p629k8495j8163K465M2499m059k2860
14882b1386q48J0669J888j9919k3714K7988J5382K2311J4663k2324l4308k1469
14870e1067K6926K4363K665K6837R697L310j3090j3670J7359j4484k9011j503
14858a1668r972j5672J6832J2757k4952J2259J5465J9465j1570q008l451q362
14846a6877O545J8086k5446M074J1907M230J6126J561o753j780o142j4406J3501
14833D626N512r415k7080K147N518K6975J152m0896n016j228J6756J9966j6514
14820a7497m693K3779o400K8167J5121J6959k1112k5324k2213J4412k4823l8397
14808f2021N721J5564J2974m764K8580o957k532J0749J9278J2730N703k0043j0008
$$ plain form
14894 48105 70071 63486 38593 25523 14856 7227 -21268 -39431 -36966 5533 1474 -21386
14882 -21386 -22234 -11565 -9677 -29596 -53310 -25322 -9940 12371 27034 4710 -29598 -51067
14870 -51067 -24141 222 2887 29724 39421 42731 29641 15971 33330 18846 -10165 -11668
14858 -11668 -21640 -37312 -20480 -7723 -32675 -20416 -4951 14514 2944 -5064 -8515 -16877
14846 -16877 -10332 7754 -17692 -13618 -1711 2519 18645 20206 13453 11673 5531 -8875 4626
14833 4626 10138 723 -26357 -24210 -18692 8283 9435 -31461 -36477 -37705 -20949 -983 -17497
14820 -17497 -22190 1589 -4811 23356 38477 55436 34324 9000 -13213 1199 -23624 -62021
14808 -62021 -56300 -40736 -27762 -32526 -3946 -10903 -13435 -2686 16592 29322 35025 14982 4974
14795D974j9255j6184p95J940l495N344J9880r977P145j7875J3335L6409K228
14782B3674r250J2573k4864k660l9468j6183j894J5946J3611j0281j3954K2838
14770b9912K7758L1479k0801m7825l70L1261J1399q241j3026O707P141L723Q839
14757H132M764o065l1360o955J2256K1552O794k9455m095O292L299L536j1898
14744b3203j9699J7111L344P618M687o881k3940l992K7624L708Q246J2770j0708
14731c315j4894k1609L9877n633l227K302J8156K4469J2251N804R290l0784l2110
14718E77k770N561J5973j6688j35k6066k9668l865K8884K4514K844N581j1128
14705f386j7785J2938M2291p865q25M329J4153k5588L970l608j9476M909n107
$$ plain form
14795 4974 -14281 -30465 -31260 -29320 -32815 -27471 -7591 -17568 -10423 -28298 -14963 21446 23674
14782 23674 14424 26997 2133 -527 -39995 -56178 -58072 -42126 -28515 -38796 -52750 -29912
14770 -29912 -2154 29325 8524 -39301 -39671 -8410 2989 -5252 -18278 -11571 -4430 -707 8132
14757 8132 12896 6831 -24529 -31484 -19228 2324 9118 -20337 -24432 -18140 -14841 -11305 -23203
14744 -23203 -42902 -25791 -22447 -14829 -10142 -17023 -40963 -44955 -17331 -13623 -5377 7393 -3315
14731 -3315 -18209 -39818 59 -5574 -8801 -6499 11657 36126 48377 54181 63471 32687 577
14718 577 -2193 3368 19341 2653 2518 -23548 -53216 -57081 -28197 -3683 -839 4742 -6386
14705 -6386 -24171 -11233 31058 23193 22368 26697 40850 15262 19232 15624 -3852 1057 -4050
14692d050o06j4043j0147K2730k3062j5443L6239R05k9607j5942O441k565O101
14679d3049K4817J0318k4611N674L4035K3412J565j4840k5409j8544J8191J2478
14667D037q036n598R129j0586j0897m67K085K7428O571j5630m374K0267J608j4261
14653A276O605j9401k148M915k2478j0176L7176q65j485K0178q842R858J6416
14640C1029K1969q78j3502M918k8152m039q962n826l7254R93L2870K2216q462
14627F920j8864j2307j379P84K8597J7211J6079m0358j7794L4261j3831P739M87
14614G545j1487P638o897j2661J0710K464k819K2066N137P130j8424k3962k7759
14601d1319J6962K1163j4114R178p960M655J0983j6614M210k774q889M91K9747
$$ plain form
14692 -4050 -4656 -18699 -28846 -6116 -29178 -44621 -8382 -7477 -37084 -53026 -46585 -49150 -43049
14679 -43049 -18232 -7914 -32525 -26851 7184 30596 32161 17321 -8088 -26632 -8441 4037
14667 4037 -3999 -9597 -468 -11054 -21951 -22418 -20333 7095 13666 -1964 -6338 13929 15537 1276
14653 1276 7881 -11520 -13668 -8753 -31231 -41407 -4231 -5096 -6581 13597 4755 14613 31029
14640 31029 52998 52120 38618 43536 15384 11345 2383 -3443 -40697 -39704 -6834 15382 6920
14627 6920 -11944 -24251 -25630 -24846 3751 20962 37041 -3317 -21111 13150 -681 7058 7545
14614 7545 -3942 3696 -3201 -15862 -5152 -2688 -5507 16559 21696 28826 10402 -13560 -41319
14601 -41319 -24357 -3194 -17308 -8130 -16090 -11435 -452 -17066 -12856 -15630 -24519 -24028 5719
14588E719O233j5190J2288J6683l0508j2414j8769l054K6063K9380k3482r707
14576a6758J6658l09J1595K339j2135j2285M001O432k687r780j005K228J917L896
14562e893j553J3175J9460J2134N877k8652r266l4673q771R661R821N14J1489
14549f677K7263l055j1341M877P609K338j4860j5097k3736k2473k2535N5355O8839
14536D6507q517k1089k5047O314K0238j4228J307J0782J0905j3152k3808P234
14524b554L846k4605J0364K475l897k1043k1537J7149M283J267L9630N586k4662
14511a3698j7697K4992j5648j9973r558M867K784P1R229J1795j351Q280p677n588
14497b9172J62j8775n493Q615J4826L7032K0681n458l3127j5146J0454K624M949
$$ plain form
14588 5719 11952 -3238 9050 25733 -4775 -17189 -35958 -39012 -12949 16431 -7051 -16758
14576 -16758 -100 -409 11186 13525 1390 -10895 -6894 -462 -3149 -12929 -13934 -11706 -9789 -5893
14562 -5893 -7446 5729 25189 37323 43200 14548 5282 -29391 -38162 -28501 -18680 -18166 -6677
14549 -6677 20586 17531 6190 11067 18676 21014 6154 -8943 -32679 -55152 -77687 -22332 46507
14536 46507 37990 16901 -8146 -1832 18406 4178 5485 16267 27172 14020 -9788 -2554
14524 -2554 1292 -23313 -12949 -10474 -14371 -35414 -56951 -39802 -35519 -34252 5378 10964 -13698
14511 -13698 -31395 -6403 -22051 -42024 -51582 -46715 -43931 -43860 -34631 -22836 -24187 -15907 -23584 -29172
14497 -29172 -29010 -47785 -53278 -44663 -29837 7195 27876 22418 -10709 -25855 -15401 -12777 -7828
14484g828j7266r631J7231R601m272J1867K8185J6090J6553P72j7802l2j1910
14471C1558j9649j6572k272m348j9796k2740M983J9317J5919J9398J2541j8812
14459d73k5560J295K4109m6554k1382J1199R389n452o773P30M3980K2115k989
14446C634p417L1945K3671k1421k8190l7701l7625l0731K1125O3717K5651P695
14434A4353n75K6343k045m2306l7115K0251J9599J953k1757l5700K4962K1005
14422a1032J0921k7443k2918j0808K3123P567j869R519J16J7432K1711m972r942
14409A405k5312K520J2489J9719k2542j0733o540l0552J7893M3041j1856k9595
14397d0063j9770P438j8515l13L001L247L4079N865k0468J9611K6889K0870p667
$$ plain form
14484 -7828 -25094 -34725 -17494 -7893 -12165 -298 27887 43977 60530 61302 43500 43468 31558
14471 31558 11909 -4663 -6935 -11283 -31079 -53819 -48836 -29519 -13600 5798 18339 -473
14459 -473 -26033 -24738 -629 -47183 -68565 -57366 -47977 -53429 -60202 -59472 -15492 6623 3634
14446 3634 -3783 28162 51833 30412 2222 -35479 -73104 -103835 -82710 -18993 6658 14353
14434 14353 13778 40121 38076 -4230 -41345 -21094 -1495 458 -21299 -56999 -32037 -11032
14422 -11032 -111 -27554 -50472 -61280 -38157 -30590 -32459 -22940 -22824 -5392 16319 11347 1405
14409 1405 -23907 -21387 -8898 10821 -11721 -22454 -28994 -59546 -41653 1388 -10468 -40063
14397 -40063 -59833 -52395 -70910 -71223 -68222 -64975 -30896 -25031 -45499 -25888 1001 21871 14204
14384A4204R606k0686j6618j9544j9480K7022J3734l5762M327j5118j727J5905
14372d4137K0942j4607n595R285K5065j8091o206P364r069K3795L5882J4184k612
14359C6200J1037J1189m6169n3749j0626P0k682K2559K1770L1363N022l4010j9280
14346b7306L8058L0239n028k1387N628o890m2995q729Q996J4987J8735L774P997
14333A6079J499j493J397j721j1457k961r910j3393K0561K1569j5555R196N990
14320A9801j6933j9869k4750j7939k7740l9767N916L6666L3320R303P259J8736
14308a5997N179n191j1847J7199J5457k1401k1404J6472K4275L053J6211J715
14296B3721j191k2541L26j1055P958L7408Q51l3610N757J154j5627j8245j6826
$$ plain form
14384 14204 23810 3124 -13494 -33038 -52518 -25496 -11762 -47524 -43197 -58315 -60042 -44137
14372 -44137 -23195 -37802 -43397 -34112 -9047 -27138 -33344 -25980 -35049 -11254 24628 38812 36200
14359 36200 47237 58426 12257 -41492 -52118 -52048 -54730 -32171 -10401 20962 25984 -8026 -27306
14346 -27306 10752 40991 35963 14576 20204 13314 -29681 -38410 -29414 -14427 4308 8082 16079
14333 16079 17578 16085 17482 15761 4304 1343 -8567 -21960 -1399 20170 4615 13811 19801
14320 19801 2868 -17001 -41751 -59690 -87430 -127197 -121281 -84615 -51295 -41992 -34733 -15997
14308 -15997 -10818 -16009 -27856 -10657 4800 -16601 -38005 -21533 2742 5795 22006 23721
14296 23721 22530 -11 315 -10740 -2782 34626 35477 1867 7624 8778 -6849 -25094 -41920
14283d1920L557K69j230K3312K8821L6463k047m879j0702j5578j1409j3903j3755
14270b3001j7988L858Q393m866j2025J9142R543j3694p416J0844M539r79q065
14257c1715k5101l903J7190P313j3682J119P2J1027J6619J6774J2964K697l4396
14244b3022k5286k3002j2531K0891L2546J4794P628j746j1598m246K4014J1638
14232A0080m266M678m461n970r702M77J3068j9963J3015O564j7346l153K711K1625
14218G357K4085r189m788j0689N708l342k67K4518r492J1853K5315k7964J033
14205C4138M899J9514j8267R185n233j6211j7831j0037j3321j8796K9268j06J3376
14192A0578j5269l242q550J7490J3400j9916j192P653K126J0839j6986P368L6133
$$ plain form
14283 -41920 -38363 -38094 -39324 -16012 12809 49272 47225 42346 31644 16066 4657 -9246 -23001
14270 -23001 -40989 -37131 -28738 -33604 -45629 -26487 -16944 -30638 -38054 -27210 -22671 -23650 -31715
14257 -31715 -56816 -60719 -43529 -36216 -49898 -48779 -48707 -37680 -21061 -4287 8677 11374 -23022
14244 -23022 -48308 -71310 -83841 -62950 -30404 -15610 -7982 -9728 -21326 -25572 -1558 10080
14232 10080 5814 10492 6031 61 -9641 -9164 3904 -16059 -3044 3520 -13826 -16979 -14268 7357
14218 7357 31442 22253 17465 6776 12484 9142 8875 33393 23901 35754 61069 33105 34138
14205 34138 39037 58551 40284 49469 44236 28025 10194 157 -13164 -31960 -2692 -2798 10578
14192 10578 -4691 -7933 -16483 1007 14407 -5509 -6701 952 3078 13917 -3069 4299 40432
14179D0432j4195j6890J1524j3401L014Q973J4196K7146m92j9435J1740k6337
14167B6275m4107J8260J2793L037J3771j1102Q360J8498m946J432K6311j3638
14155E4944J6884J0036j5488M2577L1258L8081K9853N2030P6352L8432j655o181
14143C67123l0293n9407q3737k8337m9076n6509k0438o527N520Q02k1322K094
14131A9893J3690r947K865Q434j1309k2492q877q812K811O111p839N245p765o747
14117b4739Q733R012o199J048j4503J2389J8253J4334j2351j2106j0435n113m278
14104b5955L209J1082J1934o263q416M110j7975K5660K666k582q165j3186K4457
14091E76r095k7488J7K9100K0132R949l0590k3863L1067N3125j4967k551l753
$$ plain form
14179 40432 26237 9347 20871 7470 10484 19457 33653 60799 60307 40872 52612 26275
14167 26275 -17832 428 13221 16258 30029 18927 27287 45785 40839 42271 68582 54944
14155 54944 71828 81864 66376 108953 140211 178292 208145 260175 336527 374959 373304 367123
14143 367123 336830 277423 193686 165349 116273 59764 39326 32799 38319 39121 17799 19893
14131 19893 33583 23636 26501 34935 23626 1134 -7743 -16555 -13744 -7633 -15472 -10227 -17992 -24739
14117 -24739 -16006 -6994 -13193 -12145 -26648 -14259 3994 18328 5977 -6129 -16564 -21677 -25955
14104 -25955 -22746 -11664 270 -5993 -14409 -10299 -28274 -2614 52 -2530 -10695 -23881 576
14091 576 -8519 -36007 -35990 -6890 13242 23191 -7399 -31262 -195 52930 37963 35412 31659
14078C1659j6899l7696k0626k565P713k069L8599K4487q486p638k934r736r528
14065a5719k9952k3715k5854j0521L8520K6182k478l093M2158p594Q610l4025
14053c7481k6905M871O534M324J0389j023l2681l065L4011J1854O162k2936r266
14040e5212k0935n300J7251K9689L4416r132N319j7345L055O967k6203J2840j7365
14027d1955K3386K3150j4567j1575j939M0497o899j4066k2264L6450J8093P881
14015C6192q821n813J0822l064k1589j4912p010j1189l373Q022j1685j3754p037
14002e3211O232L1032k3587p05J0285J8466N86o749j057M087J2937J2208j3106
13989b582O271j8211R017r614m5808P410J5759J8931K5836J6978L1103k3670k7085
$$ plain form
14078 31659 14760 -22936 -43562 -46127 -38414 -40483 -1884 22603 14117 6479 3545 -6191 -15719
14065 -15719 -45671 -69386 -95240 -105761 -67241 -41059 -43537 -46630 -4472 -12066 -3456 -37481
14053 -37481 -64386 -59515 -52981 -48657 -38268 -39291 -71972 -75037 -41026 -29172 -23010 -45946 -55212
14040 -55212 -76147 -81447 -64196 -34507 -91 -9223 -3904 -21249 -18194 -11227 -37430 -24590 -41955
14027 -41955 -18569 4581 -9986 -21561 -23500 16997 10098 -3968 -26232 10218 28311 36192
14015 36192 27371 21558 32380 29316 7727 -7185 -14195 -25384 -28757 -20735 -32420 -46174 -53211
14002 -53211 -46979 -15947 -39534 -40239 -29954 -11488 -10902 -17651 -18708 -14621 -1684 10524 -2582
13989 -2582 3689 -14522 -5505 -15119 -60927 -53517 -37758 -18827 7009 23987 55090 31420 4335
13976D335k4025k85K3819n004M884J2418r887j1040J0833M842K3995J4170l139
13963D5916m495j453j4532k5168k6214J6510k934k9447j1423N0257L8395J2704
13951D8116k6750r720L171k0900n333J0543M920J8577J2609n1152j877L2252p550
13938F906R763M9445l5445k281q625O552J4374Q20J0716k7177j6306O772k008
13925A3506O169J3145K51j1424j6179j0381k3497k272j8274o258J5101P959M539
13912b7615J2585O062j0107L1844J1703J8925q146j6605j951k3384L1345M8163
13900G2819k576l0575k8959n618m80m574l0020m386K4631J1842J5667Q126k8564
13887b667k5422q1J8739N584l3563K5998K3546l8825n271Q779j2296J9581J1567
$$ plain form
13976 4335 -19690 -19975 3844 -1160 3724 16142 6255 -4785 6048 10890 34885 49055 45916
13963 45916 41421 39968 25436 268 -25946 -9436 -12370 -41817 -53240 -2983 35412 48116
13951 48116 21366 11646 14817 -6083 -11416 -873 4047 22624 35233 -15919 -17796 14456 6906
13938 6906 16669 66114 30669 28388 19763 26315 40689 41509 52225 25048 8742 15514 13506
13925 13506 19675 32820 33071 21647 5468 -4913 -28410 -30682 -48956 -55214 -40113 -32154 -27615
13912 -27615 -15030 -8968 -19075 12769 24472 43397 35251 18646 16695 -6689 24656 72819
13900 72819 70243 39668 10709 5091 4611 37 -29983 -34369 -9738 2104 17771 25897 -2667
13887 -2667 -28089 -28170 -9431 -3847 -37410 -11412 12134 -26691 -31962 -23183 -35479 -15898 -4331
13874d331J0828N008J5575O219J5242j4117n041L3363L796k0155j0792K8752L1578
13861I5925J7153L3l1102K1829M6727L9302L873j4032R638p495m2077j2398l488
13848A23888m938j4408m0600m976L8254L1198l4460n089K5207O535M481K5984
13836A51076R388o800J148j8274k2581l7530j29J4185j0507r581K6779j4698l8806
13823D3670n685j1007K2643k6137j8274j094J3517K568l0909k0382L193L1194
13811C297J1575n066L168j0398n636j0986q637J3161J1153q357j7223O555J9822
13798B428k955J519J222n779j5937Q91r090q617K9577j8283j6202L5063K5868
13785A9705O081N703K394N021j581Q452k4515k204j3571K214L4646q429j4936
$$ plain form
13874 -4331 6497 11505 27080 33299 48541 34424 29383 62746 66542 46387 35595 64347 95925
13861 95925 113078 113111 82009 103838 150565 189867 193740 179708 189346 181851 139774 127376 123888
13848 123888 118950 104542 63942 58966 97220 128418 93958 88869 114076 120611 125092 151076
13836 151076 160464 153664 154812 136538 113957 76427 76298 90483 79976 70395 97174 82476 43670
13823 43670 37985 26978 49621 23484 5210 4116 17633 20201 -10708 -31090 -27897 3297
13811 3297 14872 9806 12974 2576 -3060 -14046 -22683 -9522 1631 -6726 -23949 -17394 2428
13798 2428 -527 992 2214 -3565 -19502 -18611 -27701 -36318 -6741 -25024 -41226 -6163 19705
13785 19705 25786 31489 33883 38904 37323 45775 21260 19056 5485 7699 42345 33916 18980
13772A8980J2698J2171j0972N5748M9254J6078m68K0642M1369K1676n705l6818
13760A94653k2238j6924m1444k2154j2632L492Q945j0345J7246M4849K107j3120
13748A32435M000K7150p683n896k5008r993J8981l75j5334j2728l6929n016M581
13735F8185k9918l4770l2839K76O477k329J7307J5351j7726j1308R749j3370K822
13722b2093J5016o841n146k1337M599j230j3505J3719K2292M377J8644K0832j1435
13709A7892m575j1296o823J0844l104O78k3201m7620k0051Q500K5529K5961q02
13696b8068o536j0366K328m122J0277O436k1677J2705L200j8458n290J0328N2123
13683B880L9162j5525k5490J369M051k3815k2430M2807m813O806M4548q857M579
$$ plain form
13772 18980 31678 43849 32877 88625 137879 153957 153489 174131 215500 237176 231471 194653
13760 194653 172415 155491 114047 91893 79261 82753 91698 81353 98599 143448 145555 132435
13748 132435 136435 163585 155902 150006 124998 115005 133986 133611 118277 105549 68620 63604 68185
13735 68185 38267 3497 -29342 -29066 -22589 -24918 -7611 7740 -9986 -21294 -11545 -24915 -22093
13722 -22093 -7077 -13918 -19064 -40401 -35802 -37032 -50537 -36818 -14526 -10149 8495 29327 17892
13709 17892 13317 2021 -4802 6042 2938 3616 -19585 -67205 -87256 -78756 -53227 -27266 -28068
13696 -28068 -34604 -44970 -42642 -46764 -36487 -30051 -51728 -39023 -35823 -54281 -59571 -49243 2880
13683 2880 42042 26517 1027 2396 6447 -17368 -39798 3009 -1804 5002 49550 40693 45272
13670D5272J0596k0761k2343M898q154l270l629o433j3245Q390p876j1212n581
13657c3348n65L352L4903K085l5935j4798J3020p939n885l99J3924J0288J4500
13644f797K981m0646j8135K311k465L5990j144n838k777m293M173K0993K3651
13631H004j7523q780j6127J6581R45K6833K4499j6392j6270k6013N525K9398L4799
13618D5479j3619k2331j963k823j1433K2025J6524n200p496p311O428K573p743
13605A3110j6223n256J7729J0422q048m51r345k1416o492L9417J0177j8384j3831
13592h591n362j680l0562J63K3855K2359J4647r401K7203n493j8758m67j9922
13579a2009j7303j2467n344K8712J0527r814M513P449k0703k342M0302L764j0243
$$ plain form
13670 45272 55868 35107 12764 17662 9508 6238 2609 -3824 -17069 -8679 -16555 -27767 -33348
13657 -33348 -33913 -30561 4342 6427 -29508 -44306 -31286 -39225 -45110 -45509 -31585 -21297 -6797
13644 -6797 -3816 -44462 -62597 -60286 -62751 -26761 -27905 -33743 -36520 -40813 -36640 -15647 8004
13631 8004 -9519 -18299 -34426 -17845 -16900 9933 34432 18040 1770 -24243 -18718 10680 45479
13618 45479 31860 9529 7566 4743 -6690 15335 31859 26659 19163 11852 18280 20853 13110
13605 13110 -3113 -8369 9360 19782 11734 11283 1938 -19478 -25970 13447 23624 5240 -8591
13592 -8591 -13953 -15633 -46195 -46032 -22177 182 14829 5428 32631 27138 8380 7913 -12009
13579 -12009 -29312 -41779 -47123 -18411 -7884 -17698 -13185 -5736 -26439 -28781 11521 15285 5042
13566E042k0208k8957J505M802R844l0837k3115J0043L6873N668k3157J3554J3422
13553b5521J3203N217Q946O209p981k4663M174n204j91J5408J0509l148m691l4818
13539d2551J0392L3313J6284o617l0065l2644m929L2628J6800j1402l0300q463
13527e7554P621j1971k2595L4860L3760J9282J3238J5571m582m0837k0006q274
13515d1487J4171K4151J6449K8125l431j5238m4381k4775Q821K3616L554j169
13503a1594L680o71k2704O44J0181j0059j593k488m82M151j2921j3486M3710L2269
13489A8637p967m1578k7946J9715J9284j6839j8702K4385L8083j0428j2587l3002
13477d8945k0016L9807L0101k4911Q219J7513j1567J0889j4641k2450k160J7994
$$ plain form
13566 5042 -15166 -44123 -42618 -37816 -27972 -58809 -81924 -71881 -35008 -29340 -52497 -38943 -25521
13553 -25521 -12318 -7101 1845 8054 73 -24590 -20416 -25620 -25811 -10403 106 -3042 -7733 -42551
13539 -42551 -32159 1154 17438 10821 -19244 -51888 -56817 -24189 -7389 -18791 -49091 -57554
13527 -57554 -49933 -61904 -84499 -49639 -15879 3403 16641 32212 27630 -13207 -33213 -41487
13515 -41487 -27316 -3165 13284 41409 37978 22740 -21641 -46416 -37595 -13979 -10425 -11594
13503 -11594 -7914 -8585 -31289 -30645 -20464 -30523 -32116 -34604 -35086 -30935 -43856 -57342 -13632 18637
13489 18637 10670 -30908 -58854 -39139 -19855 -36694 -55396 -31011 7072 -3356 -15943 -48945
13477 -48945 -68961 -29154 947 -23964 -15745 1768 -9799 1090 -13551 -36001 -38161 -20167
13465b0167L6831J7378k5617j3045j9188j826L0786J8796J4725j6899l1453l0480
13453d0159j9752M485M5925k295j7873l7190L2866J4951K4171R544q116j3803
13441g246p883j5250P111J8225J0546n437M561k0376K0650J5359j9468r720P130
13428a798K0199j9136r092J036j3278J2857K2610j1251j9070q271R340K062O226
13415g566j0884Q23M493J9181k8347k791J2345J0499k735J0625J399j4768j6414
13402b4140K2324L2315K2863j9269j0657k2298J5907J066n081j9427k4034l7511
13390f7942K506Q563j864J6708J2966P201J6714j5747m2699j515J1794R955l256
13377d6616Q509J8277J6993o989K144O52M31m609J909J7556k3930K8544K9085
$$ plain form
13465 -20167 16664 34042 8425 -4620 -23808 -25634 5152 23948 38673 21774 -9679 -40159
13453 -40159 -59911 -55426 -9501 -11796 -29669 -66859 -33993 -19042 5129 14673 6557 -7246
13441 -7246 -15129 -30379 -23268 -5043 5503 66 4627 -15749 4901 20260 792 -8928 -1798
13428 -1798 18401 -735 -9827 -8791 -22069 -9212 13398 2147 -16923 -25194 -15854 -13792 -7566
13415 -7566 -18450 -17627 -13134 6047 -22300 -25091 -12746 -2247 -4982 5643 7042 -7726 -24140
13402 -24140 -1816 30499 53362 34093 23436 1138 17045 18111 13030 -6397 -30431 -67942
13390 -67942 -65436 -56873 -58737 -42029 -29063 -21862 -5148 -20895 -63594 -65109 -53315 -43360 -46616
13377 -46616 -38107 -19830 -2837 -9826 -7682 -7030 -6599 -11208 -9299 8257 -15673 12871 41956
13364D1956n181j7509r833j2122J4671O625J3467L020m308l1514j7498K5012j1288
13351d502p555j7954J4175J6022J1087n162j1153J2041k1334j1792K3300J0110
13339G283j388K0226K3983m756r096m396j7309j5141j659O956j6014j0101M79
13326b0933j371j8245k3728L3474K0199P216j544q007k4049P098J4037J3172M0198
13313C7517p633m199k2739j4189L0490r501j9264M353K8745k970m1390n684k5896
13300e2360k348m601J9485K2013N914k0945p91P719j1785r049J6097K9871J5169
13287A4389M917M892j9851J0980j4068k6177Q778k259l22q683j478o76L4331P650
13273A2423l6579L4771J8100l688k6195K2003K6447j468j0743p002j1981K4760
$$ plain form
13364 41956 36775 19266 9433 -2689 11982 18607 32074 35094 30786 -728 -18226 6786 -4502
13351 -4502 -12057 -30011 -15836 186 11273 6111 -5042 6999 -14335 -26127 -2827 7283
13339 7283 5895 26121 50104 45348 36252 31856 14547 -594 -2253 4703 -11311 -21412 -20933
13326 -20933 -22304 -40549 -64277 -30803 -10604 -3388 -4932 -12939 -36988 -29890 -15853 -2681 37517
13313 37517 29884 25685 2946 -11243 19247 9746 -9518 -5165 23580 20610 -20780 -26464 -52360
13300 -52360 -54708 -59309 -39824 -17811 -11897 -32842 -33633 -25914 -37699 -46748 -30651 -780 14389
13287 14389 19306 24198 4347 15327 1259 -24918 -16140 -18399 -18721 -27404 -28882 -29558 4773 12423
13273 12423 -24156 10615 28715 25027 -1168 20835 47282 45814 35071 28069 16088 40848
13261D0848k6234j6589o55R564k2128p287K8802L7271p562m0835M487L3882K336
13248C5900J1763l2720k3420J1756L1891K4829n5220j0325J3674Q469L068N214
13236B4879k1823j4360R250o753J1658k1457m853r055K198K1518O136k709k5275
13223c0646J8120J6943J190K7621J9428k5346k6332j5299j9965m429J9620k99
13211a9394m334N602M939k8759L157J4000K2844q82O1M185j1339Q280k4140j8237
13197d4017M859K6372K2213p494r304q24j3262N536K2485q003k2825J8092K0764
13184A4592J6967k0846J8587L7839j8326k8877j7727m300O964M9919J1725l7507
13172B9010j7658r321K911k444J4860j3843K2842L6774q658r892j9778k0301q80
$$ plain form
13261 40848 14614 -1975 -2630 6934 -15194 -22481 6321 43592 36030 -4805 -318 33564 35900
13248 35900 47663 14943 -8477 3279 35170 59999 4779 -5546 8128 16597 19665 24879
13236 24879 3056 -11304 -2054 -8807 2851 -18606 -23459 -32514 -30316 -8798 -2662 -5371 -30646
13223 -30646 -12526 4417 5607 33228 52656 27310 978 -14321 -34286 -38715 -19095 -19394
13211 -19394 -23728 -18126 -13187 -41946 -38789 -24789 -1945 -2827 -2766 1419 -9920 -1640 -25780 -44017
13197 -44017 -39158 -12786 9427 1933 -7371 -8195 -21457 -15921 6564 -1439 -24264 -6172 14592
13184 14592 31559 10713 29300 67139 48813 19936 2209 -2091 4873 54792 66517 29010
13172 29010 11352 2031 4942 2498 17358 3515 26357 63131 54473 44581 24803 4502 3622
13159C622j3514k5057k7086n469K0062P887M6966K3514K5201k5784m4345n853
13147a9856k4790l11K493J2294M292L3879J6519k1348K4002j655j6486K0134j1527
13134A7640k9490J5827q958k2726L775n44M294J9945l1702J2693K8394P974p717
13121I405n45l7l876Q168k5404l8156J6796J0712M21K6289M0404q925n470L6087
13107F5869r773m1619r409K5951J2241J1745k9930k6474J397L1947O439O71k3896
13094A5159l7064j0755J3719J3620l1821J1286L1354J3849k1927j3202J3176K7108
13082B4502J9978k0797m4919N457L720j3791j976l655Q918J1827j1036K1852j4610
13069a4530n869j2390l046N686R64R012J4874P653J3289L2287j1528l7209J3242
$$ plain form
13159 3622 -9892 -34949 -62035 -67504 -47442 -39555 7411 30925 56126 30342 -14003 -19856
13147 -19856 -44646 -44957 -42464 -30170 -25878 8001 24520 3172 27174 25519 9033 29167 17640
13134 17640 -11850 3977 -4981 -27707 -23932 -24476 -20182 -237 -31939 -19246 9148 17122 9405
13121 9405 8860 8823 4947 13115 -12289 -50445 -33649 -22937 -22516 3773 44177 35252 29782 65869
13107 65869 56096 14477 5068 31019 43260 55005 25075 -1399 -2 31945 38384 39055 15159
13094 15159 -21905 -32660 -18941 -5321 -37142 -25856 5498 19347 -2580 -15782 -2606 24502
13082 24502 44480 23683 -21236 -15779 -12059 -25850 -27826 -31481 -22563 -10736 -21772 80 -14530
13069 -14530 -20399 -32789 -35835 -30149 -29185 -20173 -5299 2354 15643 47930 36402 -807 12435
13056A2435l0672l2016m793Q669R411J0837J2184J4229N632l161k3886k3327n86
13043d5044K888k6182O492L6404R795J435j6710j5603J2713K4723L1109P655j1260
13030A8415P881L54p448l9018k2026Q602j1775j056K3920M2703J8202l2747j9915
13017a3908J5516O871k0998l6377j2103K3899J2040j7090q169K4055M3918m549
13005A3105L111L6412j4018p956K610Q747j1322J9864p046m609J7744J1978l543
12992F5077N717N247j966J3129J5443r734r542K1709j6346m580k047J0802K6363
12979A19272N5991P3308R7433R6179J01119J17963J19109R1897L7142j3694o7664
12968H28055j04329j12546j25445j14399j37439n4746k4296j9906j2351l4058
$$ plain form
13056 12435 -18237 -50253 -55046 -46377 -36966 -26129 -13945 284 5916 2755 -21131 -44458 -45044
13043 -45044 -42156 -68338 -61846 -25442 -15647 -14212 -30922 -46525 -33812 -9089 22020 29675 18415
13030 18415 26296 26650 19202 -19816 -41842 -33240 -45015 -46071 -22151 20552 38754 6007 -13908
13017 -13908 1608 8479 -12519 -48896 -60999 -37100 -25060 -42150 -50319 -26264 17654 13105
13005 13105 16216 52628 38610 30654 33264 42011 30689 50553 43507 38898 56642 68620 65077
12992 65077 70794 76041 74075 87204 102647 92913 83371 105080 88734 84154 82107 92909 119272
12979 119272 175263 248571 346004 442183 543302 661265 780374 872271 909413 895719 828055
12968 828055 723726 611180 485735 371336 233897 179151 154855 134949 122598 88540
12958H8540j4879j5655K3290J7704P3k7768l0516k3873N283R918j0427J1630k1095
12945A2225l5696K2293L7421L5779j4543j8912p756l752j780K5251j2751K803
12933D0582L5317j051j6491k7557m9519j3955p80L550J5837L461K234K1324O38
12920A3590J443j8253M850K538J2734J8065l1389j4023L2613N0599j4718j9749
12908C8300n300J8523L690j5700o687k8033n327J6578N950J1717j6629L3229m369
12895D5942l9242j6787Q074J6024m626l927L9183J0435l9952m049L684q54J3094
12882B6999K0549L4455r542l9424j683K0169L7006O786o27m3930l5845k103P596
12869B0406r497j6324k362J4020K2701J1529K9442J3356J5769N692k0324j5026
$$ plain form
12958 88540 73661 58006 81296 99000 99073 71305 40789 16916 22199 32117 21690 33320 12225
12945 12225 -23471 -1178 36243 72022 57479 38567 30811 27059 25279 50530 37779 40582
12933 40582 75899 74848 58357 30800 -18719 -32674 -33454 -29904 -14067 -10606 -8372 12952 13590
12920 13590 15033 -3220 1630 4168 16902 34967 3578 -10445 22168 72767 58049 38300
12908 38300 33000 51523 55213 39513 32826 4793 -534 16044 21994 33711 17082 50311 45942
12895 45942 6700 -10087 -2013 14011 9385 5458 44641 55076 15124 11075 14759 13905 26999
12882 26999 47548 82003 72461 33037 31354 51523 88529 95315 94688 50758 14913 12810 20406
12869 20406 10909 -5415 -7777 6243 28944 40473 69915 83271 99040 104732 84408 69382
12857F9382M83k0555k2031k2912O681L1450K8802J0123j6137j1481m0599k6314
12845a3108L0626K076N613Q675o382n555K584o773l15k937j364Q879K5071N694
12831E2784r890l0359k4249K619M3574K2540k434q515P40K5327J0420M81K6727
12818A09765J5932o791J6344j5895k3769K2527M267N557L5837N2098J5905Q398
12806B40175M053q789P150q092m2172j5842j9059k1762k341r595p004j6353l0098
12793G0271K9114J116j4623K273r079k2833K757j7176j6261j1030k470O532J5472
12780C4063N357K1456P607k8426j9947J2505L7880j1184r284j0647j5196L690
12768B7874K1837L455j3183j6671k998J7409J8541L332j4236k4037K1454K4314
$$ plain form
12857 69382 69865 49310 27279 4367 11048 42498 71300 81423 65286 53805 13206 -13108
12845 -13108 17518 19594 25207 33882 27500 21945 24529 17756 17441 14504 13140 22019 47090 52784
12831 52784 42894 12535 -11714 -9095 34479 57019 54585 46070 46810 72137 82557 83038 109765
12818 109765 125697 118906 135250 119355 95586 118113 122380 127937 163774 215872 231777 240175
12806 240175 244228 235439 242589 234497 192325 176483 157424 135662 133321 123726 116722 100369 70271
12793 70271 99385 100501 85878 88151 79072 56239 58996 41820 25559 14529 12059 18591 34063
12780 34063 39420 60876 68483 40057 20110 32615 70495 59311 50027 39380 24184 27874
12768 27874 49711 53166 39983 23312 20314 37723 56264 59596 45360 21323 42777 67091
12756F7091M921O141m053j9014J6248J9943j6434K3769N922r872j8739k0565K7460
12743H2818m8505n1565n8598m4294k2823L277J1192K1411K9894J013K4803K4995
12731b6382O860m367K8532K8888P840M257K5416J9434o334k7422l4898j654L722
12718B3892j9140L775K4493J2274l156K7804J5351j9306P153M04j175j4060K3471
12705H1780O851O169K2292P188J2927J1887p800N713l3071J7242K188q57p81J8036
12691A49764J3852J1516N579k1275K0095L3625J545R634L3588J3318J8936M5941
12679C36118k936K8916K2868j4974m0257m3942k5969J4324j086j9060N964r199
12667B50767M400Q308J3834n983o511j0785l0426J0711j0318q778J5534J9238
$$ plain form
12756 67091 72012 78153 74100 55086 71334 91277 74843 98612 104534 94662 75923 55358 82818
12743 82818 34313 -17252 -75850 -120144 -142967 -139690 -128498 -107087 -77193 -76180 -51377 -26382
12731 -26382 -19522 -23889 4643 33531 41371 45628 71044 90478 84144 56722 21824 20170 23892
12718 23892 4752 8527 33020 45294 42138 69942 85293 65987 73140 73544 72369 58309 81780
12705 81780 88631 94800 117092 124280 137207 149094 141294 147007 113936 131178 133366 132509 131728 149764
12691 149764 163616 175132 180711 159436 179531 213156 214701 224335 257923 271241 290177 336118
12679 336118 333182 362098 384966 369992 329735 285793 259824 274148 273062 254002 259966 250767
12667 250767 255167 263475 277309 271326 264815 254030 223604 234315 223997 215219 230753 249991
12655B49991q685q759p881P583K997M901N438l54o827K9490R866l720J0315L5827
12641C20182k119j8052J1863J6268R525P255k163N7832L4896J119p755k3443K5244
12628D30652K1778K2066K7369L6464M1079j9021n466k2045j0570K4820l268R994
12616E53852M4559M7345J8058j8646O72K7266O8055L4358L996l680L9019M4365
12604H59219M7275O5935N7487P3952O0162K8218J5438M4653M5003O3018P0806
12593A431166P1895N8323O2849O5245Q6438J05898R7923Q5472J14467J40713J44832
12582B465221J63735J96894K08788K54783K67776L08846L68431M51890N64825
12573E251189O86604Q34386R74885J093033J198441J335361J446261J572112J698118
$$ plain form
12655 249991 241306 232547 224666 232249 235246 240147 245585 245231 238404 267894 277760 274040 284355 320182
12641 320182 318063 300011 311874 328142 337667 344922 342759 400591 435487 436606 428851 405408 430652
12628 430652 452430 474496 501865 538329 579408 560387 554921 532876 522306 547126 543858 553852
12616 553852 598411 645756 663814 645168 645840 673106 741161 775519 779515 775835 814854 859219
12604 859219 906494 972429 1029916 1103868 1164030 1192248 1207686 1252339 1297342 1360360 1431166
12593 1431166 1503061 1561384 1624233 1689478 1775916 1881814 1979737 2065209 2179676 2320389 2465221
12582 2465221 2628956 2825850 3034638 3289421 3557197 3866043 4234474 4686364 5251189
12573 5251189 5937793 6772179 7747064 8840097 10038538 11373899 12820160 14392272 16090390
12564A6090390J997983K570199L524418N082902P469586J0852781J5215006K0145026
12556H2948291K4654538K6716941K4353228J6840885M653468r441315k0920666
12549A49805370k7126169k7548180k3454840j7605304j2268736q328937n634943
12542B7838261l873082k766197k078610j735014j549535j485316j477956j349657
12534A1522894j224427j064813r05163p59401o34265n30117m72330l96972l64748
12525E170658l24273k60229k00014k04491j96491j77165j88676k02705j70936
12516C245678j30987j16786j28132j20338j09336j02200q6309j07062j11964r3962
12506B138602r6112o3871q8790p6002o7933n9066o1252p0951q8024q2626o0224
$$ plain form
12564 16090390 18088373 20658572 24182990 29265892 36735478 47588259 62803265 82948291
12556 82948291 107602829 134319770 158672998 175513883 180167351 170726036 149805370
12549 149805370 122679201 95131021 71676181 54070877 41802141 33473204 27838261
12542 27838261 23965179 21198982 19120372 17385358 15835823 14350507 12872551 11522894
12534 11522894 10298467 9233654 8328491 7569090 6934825 6404708 5932378 5535406 5170658
12525 5170658 4846385 4586156 4386142 4181651 3985160 3807995 3619319 3416614 3245678
12516 3245678 3114691 2997905 2869773 2749435 2640099 2537899 2451590 2344528 2232564 2138602
12506 2138602 2042490 1978619 1889829 1813827 1745894 1686828 1625576 1554625 1466601 1383975 1323751
12495A323751k5888m5224k7232l2918j7959k6513m5247k7514k3961m6124l9389
12484I65782m4180p1161l5756J40j493k4683o8094m9506J2555K838j5696m0076
12472F30670l1583l669J2834J6145r733J2734k5886j2183J7882o235m5938l3147
12460E21891j7899n1891o9440l2414J4041M161j6157L6924K9379m406l0309j7679
12448C66201k3289r986o19j8626j1203N391J480K329j2654K5j0914N198Q445k936
12434B98842K2947P839r494N817j2514J2796J4471M829L19l55R126j7910k3832
12421C12881l2172k6034j7497j4915k4416P751L216M3K0117K7515J3586j6310
12409B53765j1725m7897m1705l041M1488N7540j0986l7301j8196j3854k3035j2107
$$ plain form
12495 1323751 1297863 1252639 1225407 1192489 1174530 1148017 1102770 1075256 1051295 1005171 965782
12484 965782 921602 850441 814685 814825 813332 788649 720555 671049 683604 686442 670746 630670
12472 630670 599087 595418 608252 624397 614664 627398 601512 589329 607211 600976 555038 521891
12460 521891 503992 452101 382661 350247 364288 368449 352292 389216 418595 414189 383880 366201
12448 366201 342912 332926 332307 313681 302478 307869 309349 311678 299024 299049 288135 293333 301778 298842
12434 298842 321789 329628 320134 325951 313437 326233 340704 345533 345852 345497 354623 336713 312881
12421 312881 280709 254675 237178 222263 197847 205598 208814 208857 228974 256489 270075 253765
12409 253765 242040 194143 152438 149397 190885 248425 237439 200138 181942 168088 145053 132946
12397A32946k0361q637J8894J7432K0000k2766q135L4335O4j9977r280j2170J6448
12384A38793N154j685J3224Q775r374J9143L2182o23j7293j1024o15J471k446
12371A75682M7796K2001P101J0559K4412p93m7441m1440k7293l4748n6232m8437
12359C1167j3027J0411M126J5493J138l3398m117L8379j3314m908N171J791j4205
12346B4707J0053m733j901K4772M6902r641p138p571J1898K7792l6543l4216m691
12333C9690o577J6601N2117J101Q564L187L203K3871L0805L9400n227m126J4630
12320B17239j87j2526l7436l6254k3699o3227p164L511J1237k9267l3250j309
12308a2332M1022M181j6287P057K196k0677l4195J1768M9111k125j1789r665J323
$$ plain form
12397 132946 112585 103948 122842 140274 160274 137508 129373 163708 163772 143795 134515 122345 138793
12384 138793 143947 142262 155486 164261 154887 174030 206212 205589 188296 177272 176657 178128 175682
12371 175682 223478 245479 252580 263139 287551 286758 239317 197877 170584 135836 79604 31167
12359 31167 18140 28551 32677 48170 49308 15910 11793 50172 36858 31950 37121 38912 24707
12346 24707 34760 30027 28126 52898 99800 90159 83021 75450 87348 115140 78597 44381 39690
12333 39690 33113 49714 101831 102932 111496 114683 117886 141757 172562 211962 206735 202609 217239
12320 217239 217052 204526 167090 130836 107137 43910 36746 40257 51494 22227 -11023 -12332
12308 -12332 28690 32871 16584 23641 25837 5160 -29035 -17267 31844 29719 17930 8265 9588
12295I588j6187L26J5532j2813k2718J960J6024K277J0214L666r023j1463K235
12282a0382m732K1885J0064j2851K2343K6355R816j855J2051J9540J0005M787
12270A07026j9927k9994j6756k9579L9539N2074J8004j4524K1701M578K3237M2795
12258A98174L3829n1527k5121r506J032k4750l7775k3260R742O421l4354l2115
12246A0790k4845j0382R314j0629j5191P7J2729K2257L706K7314O0310K3177P814
12233A16441K2596M1754P706o191N775j84K1642m7215n2936j2535o425l1639K452
12220F1241p217J449l2261l5085M100J2713k2557k405R055L3900J9852k7840j1586
12207C359N780J6773L3381N791j5526J9789J9449n480j415N082l763M398j2499
$$ plain form
12295 9588 -6599 -6273 9259 -3554 -26272 -24312 -8288 -6011 4203 7869 -1154 -12617 -10382
12282 -10382 -15114 6771 16835 3984 26327 52682 62498 60643 72694 92234 102239 107026
12270 107026 87099 57105 40349 10770 50309 102383 120387 105863 127564 132142 155379 198174
12258 198174 232003 180476 155355 145849 146881 122131 84356 61096 70838 77259 42905 10790
12246 10790 -14055 -24437 -15123 -25752 -40943 -40866 -28137 -5880 -2174 25140 85450 108627 116441
12233 116441 139037 180791 188497 182306 188081 187897 209539 162324 109388 96853 90428 58789 61241
12220 61241 54024 55473 23212 -11873 -7773 4940 -17617 -20022 -10967 22933 42785 14945 3359
12207 3359 9139 25912 59293 65084 49558 69347 88796 83316 81901 86983 83220 87618 75119
12194G5119K899o2K452r095L999k3004P881J4363O224p327k1342l2396L940M3907
12180F7558J574Q758j4897j5517P618K6063L1468j0523L1135J8768L1182L890
12168A87077j935j0903l3832j8114j665k5225l0126k6777j1862N135K1843k082
12156E1534o854K2829j540j2594k3003l273p103j1163L0652O924M429J3029p952
12143E5915J5554j713J153J9900j6419N003L4328L4515O3432Q5201P9923R0519
12131D67311J24427J14429J08985P7989l306n0336j00900j43969j38372j37098
12121C19160r5877k3033j0762l1715l9425l5776m738o602m045j3391o041j2669
12109C5086j92M1550J2327j7794o691M446j9171j1174q977p337p914j2686J9597
$$ plain form
12194 75119 78018 77956 80408 71313 75312 52308 60189 74552 80776 73449 52107 19711 23651 67558
12180 67558 69132 77890 62993 47476 55094 81157 112625 102102 133237 152005 183187 187077
12168 187077 185142 174239 140407 122293 120628 95403 65277 38500 26638 31773 53616 51534
12156 51534 44680 67509 65969 53375 30372 27099 19996 8833 39485 46409 50838 63867 55915
12143 55915 71469 69756 70909 90809 74390 79393 113721 148236 211668 296869 376792 467311
12131 467311 591738 706167 815152 893141 889835 839499 738599 594630 456258 319160
12121 319160 223283 200250 189488 157773 118348 82572 77834 71232 67187 53796 47755 35086
12109 35086 34894 76444 88771 70977 64286 68732 49561 38387 29410 22073 14159 1473 21070
12096B1070Q906J7652M4358k1880j5527K1025m425l2122q467j2533L223k7528
12084f248K295O493J1420Q527j1380q57j2844q040j6520J2170J0815j0270N675
12071h764J7607J6766M313p293m262J749j3200J6137M3379n213k4129j1890j6752
12058H448k9577k9155L022O910j9383O757Q661K2034J7438J5220j6574k9719j2842
12045d8760M0075L5868m710k9215j8697k5789r546O975R325j3392j9273o223K4871
12032e8491J0949M066J7152o264l729K0801j482K4456j0095k6944K7365K1794
12020A9578j3877k3603j1087M513R111L529l9145K4895M2447L8108j2768j4094
12008B7607k9634k6246J8709R207P065J7534o953J0565N690O946k1910n0399j5200
$$ plain form
12096 21070 29976 47628 91986 70106 54579 75604 71179 39057 30590 18057 21280 -6248
12084 -6248 -3953 2540 13960 22487 11107 10250 -2594 -10634 -27154 -14984 -4169 -14439 -8764
12071 -8764 8843 25609 29922 22629 18367 20116 6916 23053 66432 61219 37090 25200 8448
12058 8448 -21129 -50284 -47262 -40352 -59735 -52978 -44317 -22283 -4845 10375 -6199 -35918 -48760
12045 -48760 -8685 27183 22473 -6742 -25439 -51228 -60774 -53799 -44474 -57866 -77139 -83362 -58491
12032 -58491 -47542 -43476 -26324 -32588 -36317 -15516 -16998 7458 -2637 -29581 -2216 19578
12020 19578 5701 -17902 -28989 -24476 -15365 -11836 -50981 -26086 16361 54469 41701 27607
12008 27607 -2027 -28273 -9564 -357 6708 24242 17289 27854 33544 40490 18580 -31819 -47019
11995d7019J5135J6690K4633J4572O838J840J1473o93J8473O45p2219j8225K7204
11982f53J8662J9850m8116m1329k9787R112K1888K7170p132O221K3488J3688j3844
11969g82J0955J4886L09l4673q101J3096J074R35K2146k459l9182k3135Q271K0731
11955a5929J9489j5465Q814N173K4322k717p845P813P870k9260R374J1911j4107
11942I443O60p521J7562Q2l1794k6090K5782p275j2045j3679K0575K2590N868
11929D158m632K6852j7892j2619j7304k2935l737M698L0372L3364l506N574j8136
11916D257k2679l7607k191N327L1166p381K4135K0423j5629j86o185k0483J046
11903b5987N258J8122n79L3535J8434j8735j3061q790j2649n447L2104j4010R480
$$ plain form
11995 -47019 -31884 -15194 9439 24011 30849 32689 44162 43469 61942 62587 -9632 -27857 -653
11982 -653 18009 37859 -10257 -51586 -81373 -72261 -50373 -23203 -30335 -24114 -626 13062 -782
11969 -782 10173 25059 25368 -9305 -17406 -4310 -3236 -2301 19845 17386 -21796 -44931 -36660 -15929
11955 -15929 3560 -11905 -3091 2082 26404 23687 15842 23655 31525 2265 11639 23550 9443
11942 9443 10103 2582 20144 20226 -11568 -37658 -11876 -19151 -31196 -44875 -24300 -1710 4158
11929 4158 -474 26378 8486 -4133 -21437 -44372 -48109 -43411 -13039 20325 16819 22393 4257
11916 4257 -18422 -56029 -58220 -52893 -21727 -29108 -4973 15450 -179 -365 -6550 -27033 -25987
11903 -25987 -20729 -2607 -3186 30349 48783 30048 16987 8197 -4452 -9899 22205 8195 17675
11890A7675J640l249j9017m1122n291N983j017L2362J2269k9609k4838p373L5133
11877b6454N1547j223j3719l964j0453l0188L199l787l0414K074K1143q526L0063
11864b0702J9797j0921K190P909Q972J1427k5294l9889J2308K2314k6362k8752
11852f7003L2025O1361J3621j8897k4428q906k124J48l960k471j8796j1585L720
11839d7295J7290r073j1472J9302K385N518K6636k4690J7609K2321k48n723j3251
11826f91J7174k7263m3686J1870M6629J2449k2096j7703J1510k101j1183M776
11814b0315j5383O258J2738P151N637k1102K3661K4802k2176m819Q847p359k9964
11801c2024L6725J8138k5062r413K0874J4220K5365N84j2202m500j7354j8843
$$ plain form
11890 17675 19315 16066 -2951 -44073 -49364 -43381 -44398 -12036 233 -29376 -54214 -61587 -26454
11877 -26454 25093 23870 10151 6187 -4266 -34454 -31255 -35042 -65456 -63382 -42239 -50765 -20702
11864 -20702 -905 -11826 -9636 -1727 7245 18672 -6622 -46511 -34203 -11889 -38251 -67003
11852 -67003 -34978 26383 40004 21107 -3321 -12227 -14351 -14203 -18163 -20634 -39430 -51015 -47295
11839 -47295 -30005 -39078 -50550 -31248 -28863 -23345 3291 -21399 -3790 18531 18283 12560 -691
11826 -691 16483 -10780 -54466 -42596 4033 16482 -5614 -23317 -11807 -13908 -25091 -20315
11814 -20315 -35698 -29440 -16702 -9551 -3914 -25016 -1355 23447 1271 -3548 5299 -2060 -32024
11801 -32024 4701 22839 -2223 -11636 9238 23458 48823 49407 37205 32705 15351 -3492
11789c492j4022J0970j4869l8634N356K7383N175j3996K46o97J3998M076K97Q005
11775a0204L6276p384j4338o15n954L1853L71k8630j7241P037P143P665j7454
11762a1475j3895J480J2139K0073k9165k5359J9139P742L3575O820l8560k3851
11750d1337j5553J5013J9769J448l857n976r941k015J3554K3025K25L253n798
11737h190k4978P634J8465K3599O447k3841k2886j09J0278j5717J2508K3150R76
11724G336j8072N030M276q938J6373J4838o553j7091r283j3213K2469m34K866
11711c96j1150q839K7962Q315K0341K3289L200p507k6447j5905k1233o148L2421
11698A7903P292L695k1436K4333O976j1008m7312n992M9788j5896j198R773P583
$$ plain form
11789 -3492 -17514 -6544 -21413 -60047 -54691 -27308 -22133 -36129 -35883 -36580 -22582 -18506 -18209 -10204
11775 -10204 26072 18688 4350 3735 -2219 29634 30005 1375 -15866 -8829 -1686 5979 -11475
11762 -11475 -25370 -23890 -11751 8322 -20843 -46202 -27063 -19321 14254 21074 -17486 -41337
11750 -41337 -56890 -41877 -22108 -20660 -24517 -30493 -40434 -42449 -28895 -5870 -5645 -2392 -8190
11737 -8190 -33168 -25534 -7069 16530 22977 -864 -23750 -23859 -13581 -29298 -16790 6360 7336
11724 7336 -10736 -5706 -1430 -10368 6005 20843 14290 -2801 -12084 -25297 -2828 -3262 -396
11711 -396 -11546 -20385 7577 15892 36233 59522 62722 55215 28768 12863 -8370 -14518 17903
11698 17903 25195 28890 7454 31787 38763 27755 -19557 -25549 24239 8343 7145 16918 24501
11685B4501n164j4456j7087k0030r384N035J0048J473J8239J879j3018Q243K3225
11672A3504j7580k2850N488K9986N569l653j0178k4339m6699j3024P621K891J4212
11659e9052L1470J0924k2057j3733K1891m0495K918J5381M5731L8438q862k0369
11647B185j0556o360j7570j5584J894J821R166K6245L415l4416j060L9386K5193
11634B3759J0120k3128j8226k1668m3216j5203J6472J700J2624j4295l01K8014
11622d3348K8627J4436j3472J1602M767l8307k5170J9229J4872j4223N394J1668
11610b3925J9787n736O631K5820l529J7974J8520j1230l8538j7304L38K9457O202
11597B4467k0908R269R721M016K3324J5640k7652l7010k0305k9726N102K7982
$$ plain form
11685 24501 19337 4881 -12206 -32236 -41620 -36585 -26537 -25064 -6825 -4946 -17964 -9721 13504
11672 13504 -4076 -26926 -21438 8548 14117 10464 286 -24053 -70752 -83776 -76155 -73264 -59052
11659 -59052 -27582 -16658 -38715 -52448 -30557 -71052 -68134 -52753 -7022 31416 22554 2185
11647 2185 -8371 -14731 -32301 -47885 -45991 -44170 -35004 -8759 -5344 -39760 -40820 -1434 23759
11634 23759 33879 10751 -7475 -29143 -72359 -87562 -71090 -69390 -56766 -71061 -71362 -43348
11622 -43348 -14721 -285 -13757 -2155 2612 -35695 -60865 -41636 -26764 -40987 -35593 -23925
11610 -23925 -4138 -9874 -3243 22577 19048 37022 55542 44312 5774 -11530 -11192 18265 24467
11597 24467 3559 12828 22549 26565 49889 65529 37877 867 -19438 -49164 -44062 -16080
11585a6080L2572J490J7397K5401K896k6661o8565j7897M1533K2791p577j4591
11573g291j880J4734j027j0695j2654J580J0221J0322m88Q203J2019k4912j6796
11560a8664j688q08r471J1503p638M852K4990J6283J4206J0534l3868p046J7873
11547B1058o502k0580Q957Q152L891q618P293J2061R259Q75p980p608j6716j0312
11533f770k3957j2491j0525q1J9486L1406J7189p446n823k476N927K5735M8519
11520G8693k4189j5135k2108n872K4160J9709o561l2166K0451l0682o098K1792
11508B1994P385P268O634L9836J798n7496m1415n0216J9990K9804j1868K3857
11496b429O493L269j166k2709j5087J3839O442L235K332j1731n170K9603P292
$$ plain form
11585 -16080 16492 17982 35379 60780 63676 37015 -31550 -49447 -7914 14877 7300 -7291
11573 -7291 -9171 5563 4536 -6159 -18813 -17233 -7012 3310 2822 11025 23044 -1868 -18664
11560 -18664 -20352 -21160 -30631 -19128 -26766 -21914 3076 19359 33565 44099 10231 3185 21058
11547 21058 14556 -6024 2933 11085 14976 6358 13651 25712 34971 35846 27866 20258 3542 -6770
11533 -6770 -30727 -43218 -53743 -53824 -34338 -2932 14257 6811 988 -1488 4439 30174 78693
11520 78693 54504 39369 17261 11389 35549 55258 48697 16531 36982 6300 202 21994
11508 21994 29379 36647 43281 83117 84915 27419 -13996 -64212 -44222 -14418 -26286 -2429
11496 -2429 4064 7333 6167 -16542 -31629 -17790 -11348 -8113 -5781 -17512 -22682 6921 14213
11483A4213J4877j7129l4326j0186R248K2797k2267o831J9629K3432N22j5909
11471a930J4419L4665Q55p215k2047l873l0504k5455P884P400M210l677J993J6594
11457f681L2697J1514j8780k1464j8101m0110M772J4514K4925M4502l427k6856
11445b495j7286o739N126K7436M9361k9858m3236J8132J6518k1779j7048r178
11433c1046L9360m100j0091j6209q082K3125J3073q040l3581K604p092J6233M4117
11420B0271j4339j5103J7544J4051K2617O788Q250J4338j7556K8133j0902n0808
11408B3284j131n049l0058n814P688L8972J5567k6309l180o689L1604J3773j2484
11395D0174k7237k7590J397Q528K704J7242l6276k2713L161L186K1037J1603k2057
$$ plain form
11483 14213 29090 11961 -22365 -32551 -23303 -506 -22773 -29604 -9975 13457 13979 -1930
11471 -1930 12489 47154 48009 40794 18747 14874 -15630 -41085 -33201 -25801 -21591 -25268 -23275 -6681
11457 -6681 26016 37530 18750 -2714 -20815 -60925 -56153 -41639 -16714 27788 24361 -2495
11445 -2495 -19781 -26520 -21394 6042 55403 25545 -17691 441 16959 -4820 -21868 -31046
11433 -31046 8314 4214 -5877 -22086 -30168 -7043 6030 -2010 -35591 -32987 -40079 -23846 20271
11420 20271 5932 -9171 8373 22424 45041 51829 60079 74417 56861 84994 74092 23284
11408 23284 22153 17104 -12954 -18768 -11080 27892 43459 17150 13970 7281 38885 52658 40174
11395 40174 12937 -14653 -13256 -4728 -2024 15218 -21058 -43771 -40610 -37424 -16387 -4784 -26841
11382b6841k656K1966J281K828Q22o338K0947J4545k4258K0622L0643m257k2851
11369B6453j6943K6351j3439j2991O222P741r303P644J3895r580J4603J8055j0782
11356D7926l6556J1625j6056k7104j9222J3680K4660L7240J0729j7963j7291j818
11344I850J9752n923Q392k3098q671J0510L2221k167k3262r705k8225P061K6436
11331A3171J9658J7349J866j0616j7444J3230Q473j347J0063K342q599o407j4689
11318B7050j0244k239j9193J346J6080k0000q80J6989J1170J667o620p492J0915
11305A8549K86o417l2390j230L4742L7633k380j2875k6588k1672j1886J5221O778
11292b229j5311K9535J0639m649R390o009j1144l2345N457R431K785p087j384
$$ plain form
11382 -26841 -29497 -7531 -6250 -3422 -2600 -8938 12009 26554 2296 22918 53561 49304 26453
11369 26453 9510 35861 22422 9431 15653 23394 14091 21735 35630 26050 40653 58708 47926
11356 47926 11370 22995 6939 -20165 -39387 -25707 -1047 36193 46922 28959 11668 9850
11344 9850 29602 23679 32071 8973 302 10812 43033 40866 17604 7899 -20326 -13265 13171
11331 13171 32829 50178 52044 41428 23984 37214 45687 44340 54403 56745 48146 41739 27050
11318 27050 16806 14567 -4626 -3280 12800 -7200 -8080 8909 20079 21746 15126 7634 18549
11305 18549 18835 12418 -19972 -21202 13540 51173 48793 35918 9330 -12342 -24228 -9007 -2229
11292 -2229 -17540 11995 22634 17985 27375 21366 10222 -22123 -16666 -7235 -4450 -11537 -12921
11279a2921L4096L5501l8763j5597J9124L651k2988o103l1464o552m76J4749J2675
11266a5068Q772J4825K956j5694j0282L2661J9956l1003n1181j808J6961K9695
11254G90J7558l5217l0036j8580J1102K3323K1986j686j427j3677M896J2075P383
11241a510j1912P069k74M7518J1137J5480J2080k0454k7389J056K4594j4097n3766
11228a0468j1057J0635P357L0289p985l3098j4274j0743p952L612K9831K8900
11216A5047k2939L565p148N378L8912L2263l7265l1374j1873K80k982p566J864
11203b3838J7660L4748J6601j295n935k0556l1318k1712N861L6177j062J0586
11191A5917K5242J5285m2493N192K4333N379J1085j3370j2465k3303p837j6321
$$ plain form
11279 -12921 21175 56676 17913 2316 21440 25091 2103 -4000 -35464 -42016 -42492 -27743 -15068
11266 -15068 -6296 8529 11485 -4209 -14491 18170 38126 7123 -44058 -45866 -28905 790
11254 790 18348 -16869 -46905 -65485 -54383 -31060 -9074 -10760 -12187 -25864 -20968 -8893 -1510
11241 -1510 -13422 -6353 -6627 40891 52028 67508 79588 59134 31745 32801 57395 43298 -10468
11228 -10468 -21525 -10890 -3533 26756 18771 -14327 -28601 -39344 -47296 -43684 -13853 15047
11216 15047 -7892 -4327 -11475 -6097 32815 65078 27813 -3561 -15434 -15154 -18136 -25702 -23838
11203 -23838 -6178 28570 45171 43876 37941 17385 -13933 -35645 -29784 6393 5331 15917
11191 15917 41159 56444 13951 19143 43476 48855 59940 46570 34105 10802 2965 -13356
11179a3356K3174J7251p361k656J0446q639R844J3586j0308j3961R445R17p630
11166B0752l848j7441l8296P747K5110K3148J2355j0484j7614j1253j412j4388
11154b5624K8305O734j18L0742j885l4997j7107J4969K6625q058j7106j7319N122
11141i717k7906q527K3693Q543o015K5398J9571M234q208p748j2960k042K251
11128E67M061Q850O620J143p473r807R700j4242j5344J3845K8749L8812k5280
11115D0201r851K781j6303k8265p804J7828J5770J0528k043Q143j1829l1014J2879
11102A021R278j5639J9406Q970j7197j5327J6430Q826k398j6955k5398K6432K4077
11089B1526k4961q665K481P287K8460J8514l0492l1622q329K8562K7353J8635
$$ plain form
11179 -13356 9818 27069 19708 17052 27498 18859 28703 42289 31981 18020 27465 28382 20752
11166 20752 16904 -537 -38833 -31086 -5976 17172 29527 19043 1429 -9824 -11236 -25624
11154 -25624 2681 9415 9297 40039 38154 3157 -13950 1019 27644 19586 2480 -14839 -9717
11141 -9717 -37623 -46150 -22457 -13914 -19929 5469 25040 29274 21066 13318 358 -1684 567
11128 567 4628 13478 20098 21241 13768 3961 13661 -581 -15925 -2080 26669 65481 40201
11115 40201 30350 33131 16828 -11437 -19241 -1413 14357 24885 22842 30985 19156 -11858 1021
11102 1021 10299 -5340 14066 23036 5839 -9488 6942 15768 13370 -3585 -28983 -2551 21526
11089 21526 -3435 -12100 -9619 -2332 26128 44642 14150 -17472 -25801 2761 30114 48749
11077D8749n121K932k8926j8416m005j6390j3662j9426k0936J1958L3835K5677
11065c731l214k06R082M273j6715o262k2332Q244k7j0916J1629J6927n45J1955
11051a838K0706K1723l719M096j1102j6352n34j9804J3358k2454K587J7257J149
11038E073k5393K7463K6522n690k740k1532N73K9418J1956L4429O082n3913k7574
11025D674K1692J7244M973r545J0667K9969j2294j4385l8191l4436O323K6235
11013A2926J1693p765k1107k1756l569J4350K2739P709J2923k8759Q333J7221
11001B4938k6002L229K8844K610j6449j7659K760L0481Q638k1936k7018J1032
10989C468L2265j6749j5002L2090L8597N051o523q50q717j5887j204J4732J0306
$$ plain form
11077 48749 43628 46560 17634 -782 -4787 -21177 -34839 -54265 -75201 -63243 -29408 -3731
11065 -3731 -6945 -7151 1931 6204 -10511 -16773 -39105 -30861 -30888 -41804 -30175 -13248 -13793 -1838
11051 -1838 18868 40591 36872 40968 29866 13514 12980 -6824 6534 -15920 -13333 3924 5073
11038 5073 -20320 7143 33665 27975 25235 3703 4276 33694 45650 80079 86161 32248 4674
11025 4674 26366 43610 48583 39038 49705 79674 67380 52995 14804 -19632 -13309 12926
11013 12926 24619 16854 -4253 -26009 -29578 -15228 7511 15220 28143 -616 7717 24938
11001 24938 -1064 2165 31009 33619 17170 -489 2271 32752 41390 19454 -7564 3468
10989 3468 35733 18984 3982 36072 74669 79720 73197 72347 63630 47743 46539 61271 71577
10976G1577o604j7120j6457j5251J1363R092l711l1789j6214R66L1287P695l5188
10963a0354j8784K2005L2549j1182J686j838k9494Q676K9619J9115m0226m5204
10951d3432P395j8805L492J1847q807l900p051K4639J5028J9796k1218r043j588
10938c1647Q765L242K3407K0087L408j4286o242J2381J611N385l406J7013R332
10925D9050P304J7375J8217m891k90K103L058J9607J1770K196L395j104J7980
10912A45770O3497M7400M4087R0955J30883K13023K71220L00565K75005J56183
10902A738588k9962k35455l13362k93459k22204j74310j13313p3473k4821k1815
10892B36414k6323j8081k0011j835J4914K8150j6898j6225O395k3943n585k0805
$$ plain form
10976 71577 64973 47853 31396 16145 27508 36600 32889 1100 -15114 -14148 17139 24834 -10354
10963 -10354 -29138 -7133 25416 14234 15920 14082 -15412 -6736 22883 41998 1772 -43432
10951 -43432 -36037 -54842 -51350 -39503 -48310 -52210 -59261 -34622 -19594 202 -21016 -30059 -31647
10938 -31647 -22882 -19640 3767 23854 27262 12976 6734 19115 20726 26111 22705 39718 49050
10925 49050 56354 73729 91946 87055 86765 88868 91926 111533 123303 125499 128894 127790 145770
10912 145770 209267 256667 300754 391709 522592 735615 1006835 1307400 1582405 1738588
10902 1738588 1708626 1473171 1159809 866350 644146 469836 356523 283050 258229 236414
10892 236414 210091 192010 171999 170164 185078 213228 196330 180105 186500 162557 156972 136167
10880A36167j4305l4370l9752k9319o329N358J0359M732K2120N55O77j23N205
10867F0975m793J1164m2902j8834N247j1426P645N593k4283o751p654K7021K8362
10854B9364O287K7652J764J8343J8993j8334P87k5983J423L137l3076J574J7918
10841D9849J680r507k2553n474J993Q893K2992K795J5807K3498j7984k2314j8664
10828C1011J6357J8675P680J0121j6427l5206k9292J9080J9809K1376K5196k0258
10816F8122j2601J8448K7851Q666J6615l0806k3242j4573j7439J1535q41K734
10804E4469J2542j0048K2750M567k1863K4265L3782P298q273J4323l683r516l1624
10791H8989j7413J4871j4902j7506j8455k5923J457M1519Q177N721j344K001k767
$$ plain form
10880 136167 121862 87492 47740 18421 12092 17450 27809 32541 54661 55216 55893 55770 60975
10867 60975 56182 67346 24444 5610 10857 -569 7076 12669 -11614 -18365 -26019 1002 29364
10854 29364 35651 63303 65067 83410 102403 84069 84856 58873 60296 63433 30357 31931 49849
10841 49849 51529 42022 19469 13995 15988 24881 47873 50668 66475 89973 71989 49675 31011
10828 31011 47368 66043 73723 83844 67417 32211 2919 21999 41808 63184 88380 68122
10816 68122 55521 73969 101820 110486 127101 96295 73053 58480 41041 52576 51735 54469
10804 54469 67011 56963 79713 84280 62417 86682 120464 127762 119489 133812 130129 120613 88989
10791 88989 71576 86447 71545 54039 35584 9661 11118 52637 60814 66535 65191 67192 64425
10778F4425j7356j5437m15K4887n156j5163O488L895Q50j4238n16J7764L0030
10765H0058K4677j8403k3566P527J139j1946L319J7543L8509J0574m260j4498
10753A10673k5052j8088Q346j772N900L2849J2163L0709M5869J2419N6169K0613
10741B90798K1818L1202L4604L585L5415J9332p1777p1312n1944l134j33l9404
10729A99050q363j3781j3528P829J1368l2422m339j1660l0505o676k8802j0643
10717E7528K1623J2791k5999q679j1186J4748M8839K7826k1203o603K100J1657
10705A23442j4080j800k2550p266P931k4706n468J8337O919M0174L2860J0299
10693A64092j6947j246j8878p236R1R054K4121J8691n061j5849j267k7968O962
$$ plain form
10778 64425 47069 31632 31217 56104 50948 35785 42273 46168 47018 32780 32264 50028 80058
10765 80058 104735 86332 62766 70293 71432 59486 62805 80348 118857 129431 125171 110673
10753 110673 85621 67533 75879 74107 80007 112856 125019 155728 201597 214016 270185 290798
10741 290798 312616 343818 378422 382007 417422 436754 364977 293665 241721 238587 238454 199050
10729 199050 190687 176906 163378 171207 182575 150153 145814 134154 103649 96973 68171 57528
10717 57528 79151 91942 65943 57264 46078 60826 109665 137491 116288 109685 111785 123442
10705 123442 109362 107562 85012 77746 85677 60971 55503 73840 80759 120933 153793 164092
10693 164092 147145 145899 127021 119785 119876 128930 153051 171742 166681 150832 149565 121597 128559
10680A28559j7274j4527L987J0931P517l1584k7310p1322p1991r7832j04141j7697
10668c02684N9975Q4494R0038O0933J2324L1100K8927j4608j7708L551M0234m81
10656G6095L7170K2003J5809j1888l422J2106o455j8567j1358p110K4784J799
10644A30966l5406J0887J8044N103o404m48n58M2K9926k1188j5096L3638J5820
10631A65326J4457J2070j7996j1805J361J114N5088p256j5848M758L1201L2285
10619B64755L6565Q190J1185K9640J7822M4047K7583K6971L7428O9542M7078k7992
10607E92814m7520k8063n1471n5863j4097j5819m2551K1876n20o309L4896M0511
10595D27884J7799m845j021m328o867j2009M896j5507l5657K1039K7974K9230
$$ plain form
10680 128559 111285 96758 100745 111676 119193 87609 60299 -11023 -83014 -180846 -284987 -302684
10668 -302684 -242709 -158215 -68177 -7244 5080 36180 65107 50499 32791 36342 76576 76095
10656 76095 113265 135268 151077 139189 135767 147873 141418 122851 111493 104383 129167 130966
10644 130966 95560 106447 124491 129594 123190 122742 122184 122226 152152 130964 115868 149506 165326
10631 165326 179783 191853 173857 162052 163413 164527 219615 212359 196511 201269 232470 264755
10619 264755 301320 309510 320695 350335 368157 412204 439787 466758 504186 573728 620806 592814
10607 592814 545294 517231 465760 409897 395800 379981 337430 359306 358786 352477 387373 427884
10595 427884 445683 440838 439817 435489 428622 416613 421509 406002 370345 391384 419358 448588
10583D48588J7708N588j3243K5834L8076J995M065J806j9455l2967k881J9084
10571D94198M2364N249k8503j036K8869L3708K9837K8634K2234k8751J3884O2801
10559G03488L9523L2605L4391j604K4783L2132J7406M558o409K281r512P958K3457
10546I05057M7410P9486O1090P277K1496J4779J9029P0009O0833M0091M7242O8979
10534A442778R1336P5663M8348O5083M8506N3716N3550R0118R5809J19683R4967
10523B279557O1775J27062J58001J67616J43198J42234J59147J95912K43848K58291
10513C936641K72361K95704L26067L91686M38896N02188N90568P26064Q95612
10504H375787J046282J113995J138214J114577J068609J201317J528768K019555
$$ plain form
10583 448588 466296 471884 458641 484475 522551 524546 528611 530417 510962 477995 475114 494198
10571 494198 536562 541811 513308 512272 541141 574849 604686 633320 655554 626803 640687 703488
10559 703488 743011 775616 810007 808403 833186 865318 882724 887282 880873 883154 873642 881600 905057
10546 905057 952467 1031953 1093043 1100320 1121816 1136595 1155624 1225633 1286466 1326557 1373799 1442778
10534 1442778 1534114 1609777 1658125 1723208 1771714 1825430 1878980 1969098 2064907 2184590 2279557
10523 2279557 2341332 2468394 2626395 2794011 2937209 3079443 3238590 3434502 3678350 3936641
10513 3936641 4209002 4504706 4830773 5222459 5661355 6163543 6754111 7480175 8375787
10504 8375787 9422069 10536064 11674278 12788855 13857464 15058781 16587549 18607104
10496A8607104K756421L712484M984252O743041R335653J3328795J9618822K9131862
10488A08218434M2187902N4930363N8129634M7732576K4176838k2619412o5253310
10481B47503025o8349878n1220605l4534025k2856970j5367123j0587116p506184
10474C7081124n529403m235586l377937k735514k188898j741690j314774j050003
10466A4907319r09758r37277j031063r64964q69209p19914n77293n00652m12027
10457G985162l09037k22863j91471j76370k06399k36738k94112l33794l34219
10448E680159l18454l19490k69204k63853k67870k10344j89946j84885j62147
10439C493966j40429j36420j22033j28871j12861r5857m7989p0422q2621r4091
$$ plain form
10496 18607104 21363525 25076009 30060261 36803302 46138955 59467750 79086572 108218434
10488 108218434 150406336 205336699 263466333 311198909 335375747 312756335 247503025
10481 247503025 179153147 127932542 93398517 70541547 55174424 44587308 37081124
10474 37081124 31551721 27316135 23938198 21202684 19013786 17272096 15957322 14907319
10466 14907319 13997561 13060284 12029221 11064257 10195048 9475134 8897841 8397189 7985162
10457 7985162 7676125 7453262 7261791 7085421 6879022 6642284 6348172 6014378 5680159
10448 5680159 5361705 5042215 4773011 4509158 4241288 4030944 3840998 3656113 3493966
10439 3493966 3353537 3217117 3095084 2966213 2853352 2757495 2709506 2639084 2556463 2462372
10429B462372r3421n9911m6311k8889q116J6752M0345Q4154R2863O9110L8485
10418B567433k0675l9971j14025j52972j31849j65123j79643j09094j17367r7870
10408A438844o5618o9933r2348o0597l3739l2557k9861j0712J7037k2536m0048
10397I97932j2705l6869m3733n5220m3989l6005l7675k7365Q281N59j4332m4030
10385F54849k2170m401k9943l1578j6283k3945J3822N843j8996j1459J7519j1811
10373E21447k3046j7416r367L26L9075J0513j0163m856J9364J9852M566p093J6863
10360E60065j7993j5018K049j1320J2232j1308l0931l9358p176l6687m5091l363
10348C56101m2004J1564L3560j3866j5625j606J7341j2391k2052J0986q325p872
$$ plain form
10429 2462372 2368951 2309040 2262729 2233840 2225724 2242476 2282821 2366975 2459838 2528948 2567433
10418 2567433 2546758 2506787 2392762 2239790 2107941 1942818 1763175 1654081 1536714 1438844
10408 1438844 1373226 1303293 1210945 1150348 1116609 1084052 1054191 1043479 1060516 1037980 997932
10397 997932 985227 948358 904625 849405 805416 769411 731736 704371 712652 713211 698879 654849
10385 654849 632679 628278 598335 566757 550474 526529 540351 546194 527198 515739 533258 521447
10373 521447 498401 480985 471618 471944 511019 521532 511369 506513 525877 545729 550295 543202 560065
10360 560065 542072 527054 529103 517783 530015 518707 487776 448418 441242 404555 359464 356101
10348 356101 314097 325661 359221 345355 329730 328124 345465 333074 311022 322008 313683 305811
10336C05811j5084j6438m066l4609K3247J8913n904M156l405l052J3025R177m0856
10323B50915k2141K162J4620J4890l3944l2389K8426J3366j7786o11Q903L2716
10311B59127p978j9036o131J714n169L0340K7000N2812N7530M7474L6446L2685
10299E06814M793k9453n0859r4273j10444o0281l7478m8907j7115J4256J2867
10288H9920O333Q290j9626K5137L5096L862N431J048j2904p964m3154j2896J740
10275H0313j4966R018K0084K886M292J2638l832J1239k4928l3958N195k74J450
10262F9157Q458r396k459J2574j2193J5998J5471m326K496K5436m889l3662n837
10249G6828j3913k4596j0276L1561Q101m244M681j4433l0794n607J6795k1010
$$ plain form
10336 305811 290727 274289 270223 235614 258861 277774 271870 276026 272621 269569 282594 291771 250915
10323 250915 228774 230936 245556 260446 226502 194113 222539 235905 218119 217508 226411 259127
10311 259127 251149 232113 225982 227696 222527 252867 279867 332679 390209 437683 474129 506814
10299 506814 511607 482154 431295 337022 226578 166297 128819 79912 62797 77053 89920
10288 89920 96253 104543 84917 110054 145150 149012 154443 155491 142587 134623 91469 78573 80313
10275 80313 65347 74365 94449 97335 101627 114265 110433 121672 96744 62786 67981 67707 69157
10262 69157 77615 68219 65760 78334 66141 82139 97610 93284 95780 121216 116327 82665 76828
10249 76828 62915 38319 28043 59604 67705 63461 68142 53709 22915 17308 34103 13093
10237A3093k0000N369J9381j6649k786J0180L1467K4753k9730l8163k2578p844
10225c3507J1382L6825O31J2037N825p155J6300j2387l1605p779o476M021K493
10212i395j103N704L1566N829j9235j033M2380O236q10k8100k01N653P464m76
10198D4479r035k7330m3836L5106M424j103J5642J1796k977K6471P1579r190l6283
10185G9743q209N702r070j4703l4326k0823j0810j7286j3275m9008l0237J7851
10173a04451J6136k553M536j7780K9309L7992J4479R182J6947K156m438J2342
10161A3857O029N60J3692j6284k0803j0000J9284N202k2026r315J0057K0889P901
10148A9043J5486O247m187O486J3108J4510n409l2484l883r137R658p305j0039
$$ plain form
10237 13093 -6907 -1538 17843 1194 -1592 8588 40055 64808 35078 -3085 -25663 -33507
10225 -33507 -22125 14700 15331 27368 33193 26038 42338 29951 -1654 -9433 -15909 -11888 -9395
10212 -9395 -10498 -4794 26772 32601 13366 12333 54713 60949 60139 32039 31838 37491 44955 44479
10198 44479 35444 8114 -35722 -616 3808 2705 18347 30143 27166 53637 125216 116026 79743
10185 79743 71534 77236 68166 53463 19137 -1686 -12496 -29782 -43057 -92065 -122302 -104451
10173 -104451 -88315 -90868 -86332 -104112 -74803 -36811 -22332 -13150 3797 5953 1515 13857
10161 13857 19886 20446 34138 17854 -2949 -12949 6335 11537 -10489 -19804 -9747 11142 19043
10148 19043 34529 40776 36589 43075 56183 70693 65284 32800 28917 19780 29438 22133 12094
10135A2094l261P348K3789M471m219l440L3988J4080j6168k7325n767k1953k3489
10122i852J0772K5035K6544j3991R36L926m0194Q180K2533J8873M953K2720J3690
10109I4125k278k2699k3802l2084R013P503K4242k6280k6167J7736M2258K0930
10097H2497k2066l1737m362l589K5399J7209k9031j2054K5789J1918N17k2705
10085C7785j6620N447J0990J3625J788m336P53K2203J6393L2627K4917M3916M9259
10072B38747L7399J8402M5608J8468n638J7292N6341J10918J24182J94967K74375
10061A131061K86639K42503J40299j22821l48788l47648k64400k18217j20222
10052C78406p7316o6260m2796q878m0024j8511J1106M125l122J6945L483k5408
$$ plain form
10135 12094 8833 16181 39970 44441 40222 36782 70770 84850 68682 41357 35590 13637 -9852
10122 -9852 920 25955 52499 38508 39444 43370 3176 11356 33889 52762 57715 80435 94125
10109 94125 91847 69148 45346 13262 22275 29778 54020 27740 1573 19309 61567 82497
10097 82497 60431 28694 24332 20743 46142 63351 34320 22266 48055 59973 60490 37785
10085 37785 21165 26612 37602 51227 53015 48679 49432 71635 88028 120655 145572 189488 238747
10072 238747 276146 294548 340156 358624 352986 370278 426619 537537 661719 856686 1131061
10061 1131061 1417700 1660203 1800502 1677681 1328893 981245 716845 498628 378406
10052 378406 301090 234830 192034 183156 143132 124621 135727 139852 136730 153675 157158 131750
10040A31750n0001j5342l537L4301k372l672K2735j6330L32J06k1244j6269l346
10027E7111L1054J4366J5279N361l1458M724K8328j3420l301J2266k5152k1706
10015G3452L013L5491J6790K0346J4388k1848j2097k8759k1150K6389O459l646
10003A08828q600J942K0863k8080j0418j5452L791J2086N87O066j8692m4567J8910
9990D7264o909j4480j0018M804J5005j5310j9093K4865O87k1369j1627N218K3131
9977B2168K5606L1830J4820k4329k1766R535l7177J1344K5848o970j004n051M272
9964D9126r288l3423J810J6169n473k7858k2698K3702J8359k816K469P142R833
9951B7054J0929k2313J645Q744O523Q137k3235j1598k804J4513j0649k6166K1173
$$ plain form
10040 131750 81749 66407 62870 97171 94799 91127 113862 97532 97864 97970 76726 60457 57111
10027 57111 88165 102531 117810 123171 91713 96437 124765 111345 108044 120310 95158 73452
10015 73452 76465 111956 128746 149092 163480 141632 129535 100776 79626 106015 112474 108828
10003 108828 100228 102170 123033 94953 84535 69083 72874 84960 85547 91613 72921 28354 47264
9990 47264 40355 25875 15857 20661 35666 20356 1263 26128 26815 5446 -6181 -963 22168
9977 22168 47774 79604 94424 70095 48329 57864 20687 32031 57879 50909 49905 44854 49126
9964 49126 39838 6415 8225 24394 18921 -8937 -31635 -7933 10426 7610 10079 17221 27054
9951 27054 37983 15670 17315 26059 32582 40719 17484 5886 3082 17595 6946 -19220 1953
9938A953N5295N063k7288P122K4630J5594m894m371j3707j4222j6098l2648l8426
9925d1997j8561n669K2631L1828K0747R281R979q716J672P195K3051j1397n271
9912C4773J3927k0557J5184L07O586K2732j6819l5740M113K233J3620j0795l608
9899B5956K5918o45k1052j2358K3857J861K06j4014j4888r41p444L560j3692P810
9885D134K455j4583J3419k280m624L668k2484J678K4465M525o308J1367j3116
9872B316L2133m890o426L0052j7318j4926K781j6989K0215L149j3610o325N96
9859A0758J557L1508J3503l8495k0872Q022j188J1954j4790j4330O670J4657K9362
9846C8316K9883P848O595J054k3659j5617k7972k9000J1190M086M034J8101K663
$$ plain form
9938 1953 57248 62311 35023 42145 66775 82369 77475 73104 59397 45175 29077 -3571 -41997
9925 -41997 -60558 -66227 -43596 -11768 8979 18260 28239 19523 21195 28390 51441 40044 34773
9912 34773 48700 28143 43327 43634 50220 72952 56133 20393 24506 26739 40359 29564 25956
9899 25956 51874 51229 30177 17819 41676 43537 43743 29729 14841 13900 6456 10016 -3676 4134
9885 4134 6589 -7994 5425 3145 -1479 2189 -20295 -18617 5848 10373 4065 15432 2316
9872 2316 34449 29559 23133 53185 35867 20941 23722 6733 26948 30097 16487 10162 10758
9859 10758 12315 43823 57326 18831 -2041 5981 4793 16747 1957 -12373 -5703 8954 38316
9846 38316 68199 76047 82642 83696 60037 44420 16448 -12552 -1362 2724 6758 24859 27522
9833B7522Q119J1996l706J8935p735j4837j751K793J4275l6969j7074N076l1466
9820b4822L1100J9800J4685p558l5135J5930L650j4321q628R412Q404m316K6757
9807C4958J3494O97K268K8924j1161k8278j3063J7268J9213M991l747K226N028
9794G2818j3295p665K5703P770k9133l7771L996Q883J0499q473l208J4184K1079
9781F5387j9926k5183l1979j261K3873N065j6726K3369P79q801n697m787j2817
9768h704R079K6237L2079L892m27J6665j5670l3976j6643K2728J5456q074l6892
9755E750k937l35o347j128K2246J6236O068l8829r529M7557P281L75l490J6601
9741E9519j031k6435k6776k2928O194K2981n309j8892J1573N358L1856M1012l2142
$$ plain form
9833 27522 35641 47637 43931 62866 55131 40294 38543 41336 55611 18642 1568 6644 -24822
9820 -24822 6278 26078 40763 33205 -1930 14000 17650 3329 -5299 4113 12517 8201 34958
9807 34958 48452 49149 51417 80341 69180 40902 27839 45107 64320 69311 65564 67790 72818
9794 72818 59523 51858 77561 85331 56198 18427 22423 31306 41805 33332 30124 44308 65387
9781 65387 45461 20278 -11701 -12962 10911 15976 -750 22619 23398 14597 8900 4113 -8704
9768 -8704 375 26612 58691 62583 62156 78821 63151 29175 12532 35260 50716 42642 5750
9755 5750 2813 2478 -3869 -4997 17249 33485 39553 724 -8805 38752 46033 46408 42918 59519
9741 59519 58488 32053 5277 -17651 -11457 11524 6215 -12677 -1104 4254 36110 77122 44980
9728D4980k0593j3060J2612K1492J3080M871k8881n897J5516k298j0937l1085
9716b00j4704L813j1776K5200K5201J4589P42n365r016K2141J1255K041N876J1816
9702H1613o91j4285l8867j8489J0275p729J122Q563R777K5329k9075j5738j2377
9689e72n611m553N05l498J6323M1176K8848m188k4899k5134k978O086K3606J7300
9675F2411m402j8959J5820k6338k6463J4452L0290P678n64m733m897J0483n28
9662E4250N772p415k1332j4952m373Q579k066J794m613J8906O259k6470J0956
9649B5295J6947O980J4810k4724l952m109j5499K677j4041K5302K2780j7520l15
9636C4631l0408J1J5392k2971J3579K3153j3305j5829P751J2966J1076k3510j0656
$$ plain form
9728 44980 24387 11327 23939 45431 58511 63382 34501 28604 44120 41822 30885 -200
9716 -200 -14904 -11091 -22867 2333 27534 42123 42865 37500 28484 50625 61880 63921 69797 81613
9702 81613 80922 66637 27770 9281 19556 11827 12949 21512 31289 56618 27543 11805 -572
9689 -572 -6183 -10736 -10231 -13729 2594 43770 72618 68430 43531 18397 15419 21505 45111 62411
9675 62411 58009 39050 54870 28532 2069 16521 46811 54489 53925 49192 44295 54778 54250
9662 54250 60022 52607 31275 16323 11950 20529 18463 20257 15644 34550 40809 14339 25295
9649 25295 42242 49222 64032 39308 35356 31247 15748 18425 4384 29686 52466 34946 34631
9636 34631 4223 4234 19626 -3345 10234 33387 20082 4253 12004 24970 36046 12536 1880
9623A880J5380K6518Q946K6722j588J3717M712k5755l1375j4975j1865K541k6521
9610a1663J0321K8631J1058k3108k4364K1154K4829k3521J3666K1688l186Q25
9598D6330J725L278j7187l474J3402J0949j7866j9006j071k0792p788K9610L9835
9585E7945j6369l5169O870J110M853J3775K6770J5354j5740m170m87R202j2627
9572E1317K8328M0006l025j1994N700k8787K3736K114j9237j4503p391k4517j9251
9559B2496r653K1857R522K1164L4711J614p273k4919R686J750l3434k5233j2820
9546I468o942k9085J4656R126K2742M214K038M316k2136M088P724L816J2044J6146
9532E2215m427l173j0259j8932K0777p335l5022L477N8505L3816j9783j3937l536
$$ plain form
9623 1880 17260 43778 52724 79446 77858 91575 96287 70532 39157 24182 12317 14858 -11663
9610 -11663 -1342 27289 38347 15239 -9125 12029 36858 13337 27003 48691 45505 46330
9598 46330 48055 51333 34146 30672 44074 55023 37157 18151 17080 -3712 -11500 18110 57945
9585 57945 41576 6407 13277 14387 19240 33015 59785 75139 59399 55229 54742 63944 51317
9572 51317 79645 119651 116626 104632 110332 81545 105281 107395 88158 73655 66264 41747 22496
9559 22496 12843 34700 44222 65386 100097 101711 94438 69519 79205 80955 47521 22288 9468
9546 9468 2526 -26559 -11903 -2777 19965 24179 26217 30533 8397 12485 20209 24025 36069 52215
9532 52215 47788 44615 34356 15424 36201 28866 -6156 -2679 55826 89642 69859 55922 52386
9519E2386j183M310J6022k0916j4963M3353J9094N048K734k6065k4257N464r83
9506F0044j0113J103m51k2768K346o67m57j4449J4105N3305o33k3248j4516q31
9492D2770l6526l958n712J7984K3831K651o847L5069L797J4254l966j1822j7197
9479E4328l3749J32K9279J5805j75Q074k4473r260K8094r933M393J2404k299J9247
9465I1867R632J425J6497l912j0591j2057k112j7161q33Q747q523O6J0781J187
9451H5013k1324k2916J5857O673J3282k7429k3303r473J9965K3164k1355K3360
9439F1514L0379J3880M96k7249l395O490M906N591L94j4918j19O80K989J6292
9425I7930j681l360l0489l326J6114L750M756l5733k1616J6265n803o008K8683
$$ plain form
9519 52386 51203 55513 71535 50619 35656 79009 98103 103151 105885 79820 55563 61027 60044
9506 60044 49931 51034 50583 27815 30161 29494 29037 14588 28693 81998 81365 58117 43601 42770
9492 42770 6244 2286 -3426 14558 38389 41040 34193 69262 73059 87313 83347 71525 54328
9479 54328 20579 20711 49990 65795 65620 73694 49221 39961 68055 58122 62515 74919 72620 91867
9465 91867 101499 102924 119421 115509 104918 92861 90749 73588 72755 81502 72979 73045 83826 85013
9451 85013 63689 40773 56630 63303 76585 49156 25853 16380 36345 59509 38154 61514
9439 61514 91893 105773 106269 79020 75625 82115 87021 92612 93006 78088 77969 78649 81638 97930
9425 97930 96249 92889 62400 59074 75188 78938 83694 47961 26345 42610 36807 30799 59482
9412E9482P351K3682K8490k4438k2840J0150J0048M466P773J441l8057q948N277
9399F3877j7943L99q706j0927N345K7566J6411j74j7683k6139J3919j1136k775
9386C2034Q827J3720K5891j6058k6685O267J2459L4827J7523k7506j5229k126
9374F3944q106j003j1524m867J8053M9965K1334l3561r107j2698J2406m48j2285
9361G2103p627J5033J4907j9930j2602K007j2586j4301J3881K6683p626K046p570
9348F4418J107p498J4125P036q612q597M2026K8423j8417j6998j3116k4689j0936
9335D8272K1352K4369J964o4289j1580L5755J2826J7594M320J6497J5434o135
9323A16379m1495j5901k8409R640K4900J2728l9400L0085L3289J4188l54j4100
$$ plain form
9412 59482 66833 90515 119005 94567 71727 81877 91925 96391 104164 105605 67548 58600 63877
9399 63877 45934 46333 37627 26700 32045 59611 76022 75848 58165 32026 45945 34809 32034
9386 32034 40861 54581 80472 64414 37729 43996 56455 91282 108805 81299 66070 63944
9374 63944 55838 54835 43311 38444 56497 106462 127796 94235 85128 72430 84836 84388 72103
9361 72103 64476 79509 94416 74486 61884 63891 51305 37004 50885 77568 69942 71988 64418
9348 64418 65525 58027 72152 79188 70576 61979 104005 132428 114011 97013 83897 59208 48272
9335 48272 69624 93993 95957 31668 20088 55843 68669 86263 90583 107080 122514 116379
9323 116379 74884 58983 30574 40214 65114 77842 38442 68527 101816 116004 115650 101550
9311A01550K6632J6456j6470j3159k9963j116j9008j989L0174l023K22N941M312
9298A00559J6010K0083o276k1280j6682k9378k2148K0036J1580J2249l5479J8706
9286F7980J9296J614k0166J2239J8395J1856k9540l863K564p407J416m347k1494
9273D8543P437Q66r572K1823K5726J107J4549L2816P415l9263o929K3902j6780
9260A11640j9214j0629N827r228J1505M572j9443j4572J275J420N894J2114q45
9247H0316k4104J7402K2214q111J1155K560j4109j6877l6497K7440M5724L4354
9235A41467j2865j4701j5617k1683m468J3149J1687l647K2736m791j0565K8281
9223A28983k4750l8405j1472M696P790J0618r281J2654k946Q982o685l012J2679
$$ plain form
9311 101550 128182 144638 128168 115009 85046 83930 64922 62933 93107 90084 90306 96247 100559
9298 100559 116569 136652 130376 109096 92414 63036 40888 60924 72504 84753 49274 67980
9286 67980 87276 88890 68724 80963 99358 111214 81674 77811 80375 72968 74384 70037 48543
9273 48543 55980 56846 47274 69097 94823 95930 110479 143295 150710 111447 104518 128420 111640
9260 111640 92426 81797 87624 78396 89901 94473 75030 60458 61733 63153 69047 81161 80316
9247 80316 56212 73614 95828 87717 98872 101432 87323 70446 33949 61389 107113 141467
9235 141467 128602 113901 98284 76601 72133 85282 96969 93322 116058 111267 100702 128983
9223 128983 104233 65828 54356 59052 66842 77460 68179 80833 77887 86869 80184 77172 89851
9210H9851L2492p541l969K8834K5977l775j1891k8409K901n684J2309J9260L674
9197A54029k7365l6991n479j872J8878J7233j480r939J3354j0624J3336P338J9122
9184A49540k0056l2552j435J019O433j8943J3263J8321j5443p488J8256l477j1565
9171I5873K6570J9928n546k8701p242k6359K5014j526K9904K5067K5675N55k5706
9158A53506P284l2743k7108j2638K5704N193k158L2434R150K8071N492k3971J696
9145A69912j2244N200j2867l3897j1554k535K238q891O245J4707j2055l5577j9229
9132D9453L3597K2350J7366j7857j1806L844K6326J2337k751n421o007K1869q83
9119A42417n439o410K0453L272n849K8263O452m5072o1422Q651M3885K1281j4774
$$ plain form
9210 89851 122343 114802 110833 139667 165644 161869 149978 121569 124470 118786 131095 150355 154029
9197 154029 126664 89673 84194 82322 101200 118433 116953 107014 120368 109744 123080 130418 149540
9184 149540 129484 96932 95497 96516 102949 84006 97269 115590 100147 92659 110915 107438 95873
9171 95873 122443 142371 136825 108124 100882 74523 99537 98011 127915 152982 178657 179212 153506
9158 153506 160790 128047 100939 88301 114005 119198 117040 149474 158624 186695 192187 168216 169912
9145 169912 157668 162868 150001 116104 104550 102015 104253 95362 101607 116314 104259 68682 49453
9132 49453 83050 105400 122766 104909 93103 96947 123273 135610 132859 127438 121431 143300 142417
9119 142417 136978 130568 151021 154293 148444 176707 183159 138087 76665 85316 129201 150482 135708
9106A35708j2199j9603L4667O1565J0737j2568r215Q409J001k3783k4754j1630
9094A38335Q581q004J5531j4688l89m638J1502j3713J2740J7284J2646J0372J8914
9081B04473m22k1328j22K001K278n513m712K486J776L261j1271O031K9703J0617
9067B19258J6836l4276n2807L1656L4925l732j1134j3924J567n182q83J1474l345
9054A90433k0634j8575J2505L0673j3922J960q09L73j54K7869J61k9507j6394
9041A63979P769l047J3531j2090r661J4677j029k7641j344K5948K8368J5411j2069
9028B02802j6883K2940m458J9137M93l509P300j4270l4314J1324N4545K5352l362
9015B67097R212k1017l7358q682o109k4799J8174k875K665M493M013L1507k915
$$ plain form
9106 135708 123509 103906 138573 200138 210875 198307 189092 197501 198502 174719 149965 138335
9094 138335 146916 138912 154443 139755 139366 134728 146230 132517 145257 162541 175187 185559 204473
9081 204473 204051 182723 182601 184602 186880 181367 176655 179141 180917 184178 172907 178938 208641 219258
9067 219258 236094 201818 149011 180667 215592 211860 200726 186802 188369 183187 182304 193778 190433
9054 190433 169799 151224 163729 194402 180480 182440 181631 182004 181850 209719 209880 180373 163979
9041 163979 171748 168701 182232 170142 160481 175158 174129 146488 145144 171092 199460 214871 202802
9028 202802 185919 208859 204401 223538 224031 220522 227822 213552 179238 190562 245107 270459 267097
9015 267097 276309 255292 217934 209252 203143 178344 196518 193643 196308 200801 204814 236321 233406
9002B33406N143j2816j5191o509q558m88L4795J4568j0549k0660J6649j4242l85
8989B15163J9873J1617l9637j535L2746L4796R301r458n824m930o419J4723m071
8976B66345M762l746J7998P840K0445Q324R136O804m392j6945J6039j0129k5546
8963B96935j6906P190J5328J1640K6189J8620L742r179l8123p535j7601q543K4358
8950C06115K347J8051J1564k8451J7551n936L4273K5174j9842J9913P066O374
8938C94199J4795k0276m0245n936R397p316L9298J5539J1368j8145j1025p429
8926C74224j1729Q259K5956K4279j510J2253l1946r447j4052l8814k573L0485
8914C65385p400o105K1863L0670k0593k9800j8406K7186O2708J0157M123N326
$$ plain form
9002 233406 238549 225733 210542 204033 195475 194987 229782 244350 233801 213141 229790 215548 215163
8989 215163 235036 246653 207016 205481 238227 273023 282324 272866 267042 262112 255693 270416 266345
8976 266345 271107 267361 285359 293199 313644 321968 331104 337908 333516 316571 332610 322481 296935
8963 296935 280029 287219 302547 314187 340376 358996 362738 353559 315436 307901 290300 281757 306115
8950 306115 308462 326513 338077 309626 327177 321241 355514 380688 360846 380759 387825 394199
8938 394199 408994 388718 348473 342537 351934 344618 383916 399455 410823 392678 381653 374224
8926 374224 362495 370754 396710 420989 419479 431732 399786 390339 376287 337473 334900 365385
8914 365385 357985 351880 373743 404413 383820 354020 335614 362800 425508 435665 439788 445114
8902D45114k0558J245L0788j3114m2993j8135J7771K1182J4788j585J509P428
8890D43440L5433M3290j4557k7276r886J1773J1083J341k3839K852j8721k1651
8878D33282j5239J7163L7117K3589N104m4071l428L5717K7618P704p784O218M958
8865E27948o676R658m936j6329J2084R460L4436K3145l3532j8722o639j0304J1691
8852E31284P679L61L848K890k2966R537J6872M1737N478K8R801P74r860k760j1122
8837E83581R408j3497l713J9302K1258J2020k0899j0716J4041K6192O102Q652
8825F51731N907o273J236K2353L4633K30m2375j2990J9201J0788R214Q106J8169
8812G19930J2465L7298O011o950M0048J6074l4122k4352M219o538K2637R682L5998
$$ plain form
8902 445114 424556 425801 456589 443475 400482 382347 400118 421300 436088 434503 436012 443440
8890 443440 478873 522163 507606 480330 470444 482217 493300 494641 470802 473654 454933 433282
8878 433282 418043 435206 472323 495912 501016 456945 453517 489234 516852 524556 516772 522990 527948
8865 527948 521272 530930 525994 509665 521749 531209 565645 588790 555258 536536 529897 519593 531284
8852 531284 538963 539324 543172 546062 523096 532633 549505 591242 596720 596748 606549 607323 597463 594703 583581
8837 583581 592989 579492 575779 595081 616339 628359 607460 596744 610785 636977 643079 651731
8825 651731 657638 651365 652601 674954 709587 709817 667442 654452 673653 684441 693655 701761 719930
8812 719930 732395 769693 775704 768754 808802 824876 790754 766402 770621 764083 786720 796402 832400
8799H32400n206M329J262J6846O483Q498R432M679j8456N890j1237J4150J6176
8786H85246L7575N0120R235j1551N845j5150p745m577K0517k0389K9117K1972
8774A000215l172k654J079k2720J8569K9656J9986J8540O731K4249P869k3003
8762A075345k421L0723J6732K6627R187n037J6773J662O245N533J0479K3760J4874
8749A230482K2436J1198K1952l722J6725J5395K2430j2076j1677M1875N0161J6721
8737A421900K9169K4889P689P067K5021k294J5928L2795M4116P373q166J2699
8725A618186N8091J9863o814J7658M960J6916L6123K8237m051J3191J2309L464
8713A818133M6901K7109j2003J0466M5980L0018K0942R108L9384K1885K4849N8225
$$ plain form
8799 832400 827194 831523 832785 849631 856114 864612 874044 878723 860267 866157 854920 869070 885246
8786 885246 922821 972941 982176 970625 976470 961320 953575 948998 969515 949126 978243 1000215
8774 1000215 997043 994389 995468 972748 991317 1020973 1040959 1059499 1066230 1090479 1098348 1075345
8762 1075345 1072924 1103647 1120379 1147006 1156193 1151156 1167929 1169591 1175836 1181369 1191848 1215608 1230482
8749 1230482 1252918 1264116 1286068 1282346 1299071 1314466 1336896 1324820 1313143 1355018 1405179 1421900
8737 1421900 1451069 1475958 1483647 1490714 1515735 1513441 1529369 1562164 1606280 1613653 1605487 1618186
8725 1618186 1676277 1696140 1689326 1706984 1711944 1728860 1764983 1793220 1789169 1802360 1814669 1818133
8713 1818133 1865034 1892143 1880140 1890606 1936586 1966604 1987546 1996654 2036038 2057923 2082772 2140997
8701B140997K7946J1220K1059J9179L7699M0322M98j983L8664Q0342N5466J2991
8689B484400j3974L8236J7097L0188N4624M8983N2206J6508K5870L8082M7727
8678B839947L8150L5606L8529L8864M1646N5112L5322K2752K2525O0196M6042
8667C274691M9290N7479L0887J8992N1294R5559L1822L6117L2093M8737L5497
8656C762458M6288Q0968O3459L1764O6477N3373L3407N9895O4049L8784M9046
8645D349968L7104M3619N7500M1352M7158N0945O5649O0861N5654N3946J5756
8634D879512J1484L6730O9383R5471M5789L2573L8786N4974M9626M9473N5771
8623E419572O3231O1047K2850K3936L5277L5980L6441O8621N4429K8781J3262
$$ plain form
8701 2140997 2168943 2180163 2201222 2220401 2258100 2298422 2298920 2296937 2335601 2415943 2471409 2484400
8689 2484400 2470426 2508662 2525759 2555947 2610571 2659554 2711760 2728268 2754138 2792220 2839947
8678 2839947 2878097 2913703 2952232 2991096 3032742 3087854 3123176 3145928 3168453 3228649 3274691
8667 3274691 3323981 3381460 3412347 3431339 3482633 3578192 3610014 3646131 3678224 3726961 3762458
8656 3762458 3808746 3889714 3953173 3984937 4051414 4104787 4138194 4198089 4262138 4300922 4349968
8645 4349968 4387072 4430691 4488191 4529543 4576701 4627646 4693295 4754156 4809810 4863756 4879512
8634 4879512 4890996 4927726 4997109 5092580 5138369 5170942 5209728 5264702 5314328 5363801 5419572
8623 5419572 5482803 5543850 5566700 5590636 5625913 5661893 5698334 5766955 5821384 5850165 5863427
8612E863427K1494L0524J3731L7816P898J9431N3875K1879j1570r437L7484J5642
8600F102194J7010j4995Q195J1747K3979K3456j8639j2436l8039p411j0498q149
8588F076414j6799j7189n884k1186l2276k9708q232l7953n8489P263j9148k6530
8576E810283j2985l6442q3879m3559l6914n9090o8487n7768m0908l2612l2001
8565E305638l1818m6437n1280n9304j0294l9472l9967l9713n1613n4032o7010
8554D814698r0955p6632m4539n7928q702l2156m9474o1853o6917m9097n2743l8920
8542D184782p1505p2197j2332j7273p2339n8946m7840n3489o1262l6816k0456
8531C660327m0516n2139q2868o3689m2596j4127l2665n8698l0384n5922m6297
$$ plain form
8612 5863427 5884921 5915445 5929176 5966992 5974890 5994321 6048196 6070075 6058505 6049068 6086552 6102194
8600 6102194 6119204 6104209 6112404 6124151 6148130 6171586 6152947 6140511 6102472 6095061 6084563 6076414
8588 6076414 6059615 6042426 6036542 6015356 5983080 5953372 5945140 5907187 5848698 5855961 5836813 5810283
8576 5810283 5797298 5760856 5676977 5633418 5596504 5537414 5468927 5411159 5370251 5337639 5305638
8565 5305638 5273820 5227383 5176103 5116799 5106505 5067033 5027066 4987353 4935740 4881708 4814698
8554 4814698 4723743 4647111 4602572 4544644 4535942 4503786 4454312 4392459 4325542 4276445 4223702 4184782
8542 4184782 4113277 4041080 4028748 4011475 3939136 3880190 3832350 3778861 3717599 3680783 3660327
8531 3660327 3619811 3567672 3484804 3421115 3378519 3364392 3331727 3273029 3242645 3186723 3140426
8520C140426m0383j5778l0768j6032k2310m0518n4404n6749m8048l3364m6383
8509B735689j6820k9937k8870l9683n8537j7410k2268l6643j5547p418l0465j2794
8497B419297o3164m9393l3723k3302k6307j1785m5721m9837o553m5513o3737l08
8485A999954m2136m1151l5893j3103j1010K933k7813l5728n042j5378J3272M908
8473A793813l6061n1535n733k4296n369n126k8987l7766m2774n7237J202M409
8461A504540k7067j3001k7657l7708J0113j807k8452k1329j0867o291L358l661
8449A340171j5310o774L961k4805j6708K0123q772m6794n2639j2067k6610o9853
8437A083923m510Q389J5048N612n266L5221Q774k6995j8056j2025J4271j4875
$$ plain form
8520 3140426 3100043 3084265 3053497 3037465 3015155 2974637 2920233 2863484 2815436 2782072 2735689
8509 2735689 2718869 2688932 2660062 2620379 2561842 2544432 2522164 2485521 2469974 2462556 2432091 2419297
8497 2419297 2356133 2306740 2273017 2249715 2223408 2211623 2165902 2116065 2109512 2063999 2000262 1999954
8485 1999954 1957818 1916667 1880774 1867671 1856661 1859594 1831781 1796053 1791011 1775633 1788905 1793813
8473 1793813 1757752 1706217 1700484 1676188 1670819 1665693 1636706 1598940 1556166 1498929 1500131 1504540
8461 1504540 1477473 1464472 1436815 1399107 1409220 1407413 1378961 1357632 1346765 1340474 1343832 1340171
8449 1340171 1324861 1318087 1322048 1297243 1280535 1300658 1291886 1245092 1192453 1180386 1153776 1083923
8437 1083923 1079413 1087802 1102850 1108462 1103196 1138417 1147191 1120196 1102140 1090115 1104386 1089511
8425A089511k5584r238k8182k8006j168j4972j8793M604L469M37k0923K2234j0556
8412I62833j868j7039j4711l6773J4558m845l228r967j9160J0726K1424j9919
8400H82031l6169n249j2185k0377o599r922l9982k9376J230j0866J4267O78j5944
8387G11537n121j584M118j4693j5447J362j9151k860j8965o685J9382J5982m0474
8374F27401l498J772k9648j4006j0681j220J3678L2555J7213j1020k7870j9339
8362E75337r362k3488k7786j280K6444k6256k8016k510K0874P495j5853O476K218
8349E04293N084K568j5933R721K102N578k7654k6180J3241L9084o765j8106J2307
8336D99340J7651k5909j0637j7356k2662J4703K3088o96k4400m4408q937l117
$$ plain form
8425 1089511 1063927 1054689 1026507 998501 997333 982361 963568 968172 971641 972078 951155 973389 962833
8412 962833 960965 943926 929215 892442 907000 902155 898927 888960 869800 880526 901950 882031
8400 882031 845862 840613 828428 808051 801452 791530 751548 722172 723402 712536 726803 727481 711537
8387 711537 706416 704832 708950 694257 678810 680172 661021 658161 639196 632511 651893 667875 627401
8374 627401 623903 625675 596027 582021 571340 570120 583798 616353 633566 622546 594676 575337
8362 575337 565975 542487 514701 513421 539865 513609 485593 483083 503957 511452 495599 502075 504293
8349 504293 509377 511945 496012 505733 507835 513413 485759 459579 472820 511904 505139 487033 499340
8336 499340 516991 491082 480445 463089 440427 455130 478218 477522 453122 408714 399777 396660
8324C96660j7517k3785L396L4060j870q923k9413N4516L257l4570J2240Q694j8437
8311C78308L931j1017J9913M909k5762l3044J1607j1084j8266J0009L385J1847
8299C44736L773j104J1441q005J0409m351J6325k0796k5379R329k2083l3352p681
8286B73262j0027r170M695K7939J8109l183J4941l123j7739k644j091j8592k8216
8273B45161J531J7311K6079j5607l198K2262J0032k322k8885k5795L347J67L3168
8260B83251j184K997j7757J6197K4231k7579l4581K2272j1417L08J080k9294k2663
8247B05861p31K4133o371L247O062J8782J8130J2768m892j1045m30J0299l473
8234B72340P93k1119p257J3053J0964r680l9566j5358J4431J051J0362O382p544
$$ plain form
8324 396660 379143 355358 358754 392814 390944 382021 352608 407124 410381 375811 388051 396745 378308
8311 378308 382239 371222 391135 396044 370282 337238 348845 337761 319495 329504 332889 344736
8299 344736 348509 347405 358846 350841 361250 356899 373224 352428 327049 336378 314295 280943 273262
8286 273262 263235 254065 258760 286699 304808 301625 316566 313443 295704 293060 291969 273377 245161
8273 245161 246692 264003 290082 274475 271277 293539 303571 301249 272364 246569 249916 250083 283251
8260 283251 282067 285064 267307 283504 307735 280156 245575 267847 256430 256738 257818 228524 205861
8247 205861 205130 229263 222892 226139 232201 250983 269113 281881 276989 265944 265514 275813 272340
8234 272340 273133 252014 244757 257810 268774 259094 219528 204170 218601 219652 230014 236396 228852
8221B28852n441j3605k2405q125L079J9409J5306k3332M12K3907P001j7389l5601
8208A72068J7485K2900q17m3306m731J4101J6810J8612j4131k1794o067P544j06
8195A78568N578j3262Q146J0303k2918K595J1958k2913j6969j6986j5867L4774
8183A43007N676r764j2216J9543M6542P757j770p614P842k771m4129l5197j6891
8170A00015L0756K7370l8223k3878J8778N15r91O068K4986K0590j0038l142j4173
8157A38633l1818k3335o782L6742L1331j2792j9032J4810K0307L1489q601j4521
8145A56431N387k2941k5968j2248j2586K8346J7319K342K1076K5315N673l9407
8133A48739k2975L2139J2332k00j9511J0356k4624k6208J7712K25j6837j3790
$$ plain form
8221 228852 223411 209806 187401 179276 182355 201764 217070 193738 194150 218057 225058 207669 172068
8208 172068 189553 212453 211636 168330 163599 177700 194510 213122 198991 177197 171130 178674 178568
8195 178568 184146 170884 179030 189333 166415 169010 180968 158055 141086 124100 108233 143007
8183 143007 148683 138919 126703 146246 192788 200545 198775 191161 199003 196232 152103 116906 100015
8170 100015 130771 158141 119918 96040 114818 115333 114342 120410 145396 165986 155948 152806 138633
8157 138633 106815 83480 76698 113440 144771 131979 112947 127757 148064 179553 170952 156431
8145 156431 161818 138877 112909 100661 88075 116421 133740 136082 157158 182473 188146 148739
8133 148739 125764 157903 170235 170035 150524 160880 136256 110048 127760 127985 111148 97358
8121I7358M473M7174K4646k891l0759J3527O862k5437n320j7622j7571J0209R942
8108A14591j4307M0230K3264O250k643j4625K0259M98k7804r206K8533L1740j2327
8095A84453n1993m1483j1952M6661j1794m542p699l026J2328m014m2127j8962
8083D5850J3235J3988J7630M48J1408K5890O463K6686M802m9k0083L367n828p154
8069A36653l3829m372J2982J5640j2861j0599k280N663J759m8090m701J8206l4795
8056C9376N769M9051K5173k7777l6429J4940M4402J1875q042l050k1066j1282
8044H2940O620R150p090Q533K9156J2866n093k8131J0538j3664k3176m829J1697
8031H9517k0183l5416J2457K1213J6910M598m1368r489J6364K7943P907n609j3444
$$ plain form
8121 97358 101831 149005 173651 170760 140001 153528 160390 134953 129633 112011 94440 104649 114591
8108 114591 100284 140514 163778 170028 167385 152760 173019 173517 145713 136507 165040 196780 184453
8095 184453 132460 90977 79025 125686 113892 109350 101651 98625 110953 106939 64812 45850
8083 45850 59085 73073 90703 91151 102559 128449 134912 161598 166400 166351 146268 149635 143807 136653
8069 136653 102824 98452 111434 127074 114213 103614 101334 106997 108756 60666 55965 74171 39376
8056 39376 45145 94196 119369 91592 55163 70103 114505 126380 118338 115288 94222 82940
8044 82940 89560 98710 91620 100153 129309 142175 137082 108951 119489 105825 82649 77820 89517
8031 89517 69334 33918 46375 67588 84498 89096 47728 38239 54603 82546 90453 84844 71400
8018G1400L737J2290M475J1101j1671j9767J4660J881K686m10m000J9197k588
8005A02991k6591k0306M2861M6429R878k171j7915j9083m483j8436m623k2212
7993F6339j6283L3969J2724J353L3280P744l583m3154m1073R869R614K382k1633
7980E1548j3162J7604M0542J2865P95k908j2033J9703p875M699N987K320j0782
7967A09303n109j404k839j8225M593L5953j0390Q942q725k9521j8285N144k602
7954F6835J0149J1940K6707K5383r068k6861k9671M998R452j1642p065j0085j1763
7941D9309k0199P476K2527K0385j1383m3789J4960J8195k3470q053K6219J4348
7929F6525K142O64Q215j5629Q588K1308J1554J3753p170j8193L5336k405k0131
$$ plain form
8018 71400 75137 87427 91902 103003 91332 71565 86225 88106 90792 90382 86382 105579 102991
8005 102991 76400 56094 98955 145384 155262 153091 135176 116093 111610 93174 88551 66339
7993 66339 50056 84025 96749 98102 131382 139126 135543 92389 51316 61185 70799 73181 51548
7980 51548 38386 55990 96532 109397 110192 107284 95251 114954 107079 111778 117765 120085 109303
7967 109303 104194 102790 99951 81726 86319 122272 111882 120824 112099 82578 64293 69437 66835
7954 66835 76984 88924 115631 141014 131946 105085 75414 80412 89864 78222 71157 61072 49309
7941 49309 29110 36586 59113 79498 68115 24326 39286 57481 34011 25958 52177 66525
7929 66525 68667 69331 77546 61917 70505 91813 103367 117120 109950 91757 127093 124688 104557
7916A04557j6596j2137K7426r19k5613p402R692k908J4395J6890J3134l4489k4439
7903F1591p232k484J8500R094j8520k2526Q044k107K121R828J4341j2430J0298
7890F8518q510k1627k3738p237K1555K0657m4425N69J0947J0848m2183p882K8259
7877E751J5696j8431n748J4003J3804K3027K145m696N231P85J3621O924P589k3130
7863E6571m5242j9389K0852K3867k161j3370k3101P127R908l2124J8797n024j0315
7850a3604J1680J1495j6028J1954J5455M280l8994r811K3690J7495Q355p285j552
7837A7130k6011K5196N828k543j3548K8253L6196j1330k6716j716K4952K8110
7825H3801l1518q693J6034l0200q649J3776Q290o354j2651m889Q225K1294m002
$$ plain form
7916 104557 87961 75824 103250 102331 76718 69316 79008 76100 90495 107385 120519 86030 61591
7903 61591 54359 51875 70375 79469 60949 38423 46467 44360 46481 56309 70650 58220 68518
7890 68518 60008 38381 14643 7406 28961 49618 5193 5762 16709 27557 -14626 -22508 5751
7877 5751 21447 3016 -2732 11271 25075 48102 50247 45551 50782 51567 65188 72112 79701 56571
7863 56571 11329 -8060 12792 36659 34498 21128 -1973 5154 15062 -17062 1735 -3289 -13604
7850 -13604 -1924 9571 -6457 5497 20952 25232 -13762 -23573 117 17612 25967 18682 17130
7837 17130 -8881 16315 22143 19600 6052 34305 70501 59171 32455 30739 55691 83801
7825 83801 52283 43590 59624 29424 20775 34551 42841 36487 23836 18947 27172 48466 44464
7812D4464l0665J1574L776l6044k8390o575j994M084K3453k903j1969K7383M135
7799C29L181L2345K8392K4730K6187l4478j1182k1300r388J6110m573j9652p008
7786B3693K5341R739j4339j4289j1668O959k561J1526k3497j7856J9644L300l0671
7773a4679j372Q506j1297J1497J1485J7500o551k2560L0655J9385r486l697j9039
7760A0347K0411j0899o587L5632K0967k3286l3048k3750l8923P730K4646J8748
7748A988j4574M498L1886L231j4505J2161n06j7368J8860N189J0842K963k08K7171
7734G1628m048k0653k0611k612k906j1332J4944M4741N795k0687k9722k986k7846
7721f295m2897K1403K5446P552j5121R047J3124M85O372J0666N895j7586k0106
$$ plain form
7812 44464 13799 25373 29149 -6895 -35285 -41860 -43854 -39770 -16317 -19220 -31189 -3806 329
7799 329 3510 35855 64247 88977 115164 80686 69504 48204 38816 54926 50353 30701 23693
7786 23693 49034 58773 44434 30145 18477 25436 22875 34401 10904 -6952 12692 15992 -14679
7773 -14679 -16051 -7545 -18842 -7345 4140 21640 15089 -7471 23184 42569 33083 29386 10347
7760 10347 30758 19859 13272 48904 69871 46585 13537 -10213 -49136 -41406 -16760 1988
7748 1988 -12586 -8088 23798 27029 12524 24685 24179 6811 25671 30860 41702 44665 44457 71628
7734 71628 67580 46927 26316 23704 20798 9466 24410 69151 74946 54259 24537 21551 -6295
7721 -6295 -49192 -27789 -2343 5209 -9912 -865 12259 12744 19116 29782 35677 18091 -2015
7708b015l433r890P160j6381n101K0807j2222j2819L0025J0364o665k286J5559
7695A3103Q81l2566k1105Q402J231K2913J8765j7615l607J6793L831J1977L7879
7682F0882j1146k1675j6153o097K2094M907j3823j1377J0314p718r503j1421n342
7669a6058n81K2564j9828j5767K6334L7073P853k7291k4513O010J1486J7236K1529
7656D6047k2180l470n275P941K7513L671m3539m451L8101K193M920M720k2364
7643C3827P95l250j8839q279p237K1065j0347P403J7023J5431r499P283j2983
7630C2393J177J0018j0582N421k2217p780J9165k1696K2093j967P001N675k2712
7617A5989k9450K731J6119N299j2657m0805r695N919L03J2136K921K8298j7825
$$ plain form
7708 -2015 -5448 -15338 -8178 -24559 -29660 -8853 -21075 -33894 -3869 6495 -170 -2456 13103
7695 13103 13984 -18582 -39687 -31285 -30054 -7141 11624 -5991 -9598 7195 11026 23003 60882
7682 60882 49736 28061 11908 5811 27905 32812 18989 7612 17926 10208 705 -10716 -16058
7669 -16058 -16639 5925 -13903 -29670 -3336 33737 41590 14299 -10214 -4204 7282 24518 46047
7656 46047 23867 20397 15122 23063 50576 54247 10708 6257 44358 46551 51471 56191 33827
7643 33827 34622 31372 12533 4254 -2983 18082 7735 15138 32161 47592 38093 45376 32393
7630 32393 33570 43588 33006 38427 16210 8430 27595 5899 27992 26025 33026 38701 15989
7617 15989 -13461 -10730 5389 10688 -1969 -42774 -52469 -46550 -46247 -34111 -31190 -2892 -20717
7604b0717j7775J5497J0182K8506L106P786O701l75j24J691N004r927j7104O334
7590A8785j4266n309K0817K3705m464j83k3313L3387N02n3412r084J4242q090
7577f683J2518P846k2233k1217j2702R624N257j3287J4679K5941J2241L481M341
7564A9806J3093k2820L820j7163K4140k7438r202k0050J5842K8962j6935J4401
7552F456J8844J6073j6715j2960j6669m5201k0960N531K1686J8126J4200q196
7540a9785j3103L5292K3263j448L036M546N196J96K7834J3249j8250J9877j6880
7527F3023k2978K2548k8917l5483l759n024R904L002j1906J21L2624k4918j0495
7514a2258O507q356l783K2678R791j0572J0458J1231j7462L771l841L0895n203
$$ plain form
7604 -20717 -38492 -22995 -12813 15693 18799 26585 33286 32911 32787 34478 39482 29555 12451 18785
7590 18785 4519 -790 20027 43732 39268 39085 15772 49159 49661 -3751 -12835 1407 -6683
7577 -6683 5835 13681 -8552 -29769 -42471 -32847 -27590 -40877 -26198 -257 11984 15465 19806
7564 19806 32899 10079 13899 -3264 20876 -6562 -15764 -35814 -19972 8990 -7945 6456
7552 6456 25300 41373 24658 11698 -4971 -50172 -71132 -65601 -43915 -25789 -11589 -19785
7540 -19785 -32888 2404 25667 24219 27255 31801 36997 37193 65027 78276 60026 79903 63023
7527 63023 40045 62593 33676 -1807 -5566 -10590 -686 2316 -9590 -9469 23155 -1763 -12258
7514 -12258 -5751 -14107 -17890 4788 14579 4007 14465 25696 8234 12005 8164 39059 33856
7501C3856r003K2285O279l8831j7801K987J783J9037L0617J1875n778m898o850
7488D5558j9014k0095o604K5792N521J3907j0500q677m741q358j4506J7579j1244
7475D618j0495j336j672L8193J8671m529j8790l3665K437n847j4468J8155j780
7462a0508J0472k932L348J0261J9892R424j7901l6471K992j0314P002L642P660
7449c433Q935k6774o746J0680K711M467j7636L741o083l327p530J9018J5615J529
7435d833l202R452j1793N618K7384Q397Km1444J6406K8430j1010j1575k3452k1429
7421c3049P132K3795M951J7617R908l5073k3734J5078J133M72J1524K0135K7083
7408D6972k991R154L624j7950K1667J19m1188k0391J9352J6204p168j1154J8106
$$ plain form
7501 33856 24853 47138 53417 14586 -3215 -228 1555 20592 51209 63084 57306 52408 45558
7488 45558 26544 6449 -155 25637 31158 45065 34565 25888 21147 12789 -1717 15862 4618
7475 4618 -5877 -7213 -8885 29308 47979 43450 24660 -9005 -6568 -12415 -26883 -8728 -10508
7462 -10508 -36 -2968 380 10641 30533 39957 22056 -14415 -11423 -21737 -14735 -11093 -3433
7449 -3433 5502 -21272 -28018 -17338 -14627 -10160 -27796 -24055 -30138 -33465 -40995 -21977 -6362 -4833
7435 -4833 -8035 1417 -10376 -4758 22626 31023 31025 -10419 5987 34417 23407 11832 -11620 -33049
7421 -33049 -25917 -2122 2829 20446 30354 -4719 -28453 -13375 -12242 -11770 -246 19889 46972
7408 46972 43981 53135 56759 38809 60476 60595 19407 -984 18368 34572 27404 16250 34356
7395C4356J0203k3923O788j3597l260K25J809J4298j8688j6342j5780K4381P207
7382G677p697J669j2963l953N430K2941J9055O028l6561L966J2537j266j648k827
7368A2388k109k4679m123O746L449j1390j423J5643M940K002J375n960k4340M816
7354b2665N212J6941L2660J3604n477k0789q31m001J2837L423j7028j2004K1295
7341B3177n968l3727N180l1077j8600J4729L1866j8421J0120J6788l765K419r378
7328a6657K1209k416J3936l861o802J0179J3366l4620n4062j1310M187j6167J0417
7315g2601L9888K2689J0695j3279r552M057N177J8833m850Q563J6958j4985q218
7302C375P34n641j5096k5691O634M703k7270K8923Q2957J5422k4097k6370K1380
$$ plain form
7395 34356 44559 20636 27424 13827 10567 10792 12601 26899 8211 -8131 -23911 470 7677
7382 7677 -20 1649 -11314 -15267 -9837 13104 32159 38187 1626 5592 18129 16863 15215 12388
7368 12388 10279 -14400 -18523 -11777 -8328 -19718 -21141 -5498 -558 1444 2819 -3141 -27481 -22665
7354 -22665 -17453 -512 32148 45752 40275 19486 18655 14654 27491 30914 13886 1882 23177
7341 23177 17209 -16518 -11338 -42415 -61015 -46286 -14420 -32841 -22721 -5933 -9698 -7279 -16657
7328 -16657 4552 2136 16072 12211 5409 15588 28954 -5666 -59728 -71038 -66851 -83018 -72601
7315 -72601 -32713 -10024 671 -12608 -22160 -18103 -12926 5907 1057 9620 26578 11593 3375
7302 3375 4109 -1532 -16628 -42319 -35685 -30982 -58252 -29329 53628 69050 44953 18583 39963
7289C9963j2604j6016K4701J942l59j8663k4749p249j2565K6606M4048J2741k4673
7276C3123L080k8219l7017K0365L9061J456k1364l5737M856m050K0697J9000j3246
7263B005K0046J3288J6131r288j8882j9759L364k6900l5869P173R91J3720K2552
7250a1428N073q374k0219J4374q743k339Q574k4742Q316J492L635K3577L9648
7237B8844l378k3965j4761k0114M163n910l253l953j544n128K5200L5991J1423
7224B3615l0912k5502P302K529Q844J7792k2250j7306J2038K5677j2574o982R410
7211h319J0526j6031q586J0982k3777N029R846M820R433J9623k1220j8669L0354
7198D011J6971q634l942J8456k5508j9142J1608K9808K074k9818j1836q117j4343
$$ plain form
7289 39963 27359 11343 36044 37986 37627 18964 -5785 -13034 -25599 1007 45055 57796 33123
7276 33123 36203 7984 -29033 -8668 30393 31849 10485 -25252 -20396 -24446 -3749 15251 2005
7263 2005 22051 35339 51470 42182 23300 3541 6905 -19995 -55864 -48691 -47700 -33980 -11428
7250 -11428 -6355 -14729 -34948 -20574 -29317 -31656 -23082 -47824 -39508 -38016 -34381 -10804 28844
7237 28844 25466 1501 -13260 -33374 -29211 -35121 -38374 -42327 -43871 -48999 -23799 12192 23615
7224 23615 -7297 -32799 -25497 -22968 -14124 3668 -18582 -35888 -23850 1827 -10747 -17729 -8319
7211 -8319 2207 -13824 -22410 -11428 -35205 -30176 -20330 -15510 -6077 13546 -7674 -26343 4011
7198 4011 20982 12348 8406 26862 1354 -17788 -6180 23628 25702 -4116 -15952 -24069 -38412
7185c8412r38M511j1964M747L5623O694m475n307J4670k332r759J224j2039j5738
7171c3495Q325L950Q179J736M470P669K5012o023Q39m525j1949j8759M318k3197
7157c3450k2347j575R956J4663L7642M3310n63k1829k2794j1922L149M075j356
7144c041K610Q439l1013k1998l307N987J5484n110o20K2199J2904K634k6967j9134
7130d0933M1416K6894R865J046n2523l1743k0059J6598M6699K7043R193n443k3186
7117D867n2957j5534M5165j738j5245L261L6036j7710l9495l4115L776M3173L3197
7104g319Q426J153J9401l449L361O22L2042j0423l5253j7147M039R209m458J0838
7090A1042k6056p116j2746K0665K1938m264m541J1361J503r410j9534j4445j0973
$$ plain form
7185 -38412 -39350 -34839 -46803 -42056 -6433 261 -4214 -9521 5149 2817 -6942 -5718 -17757 -33495
7171 -33495 -25170 -21220 -13041 -11305 -6835 834 25846 19823 20662 16137 4188 -14571 -10253 -33450
7157 -33450 -55797 -57372 -47416 -32753 4889 48199 47636 25807 3013 -8909 -5760 -1685 -3041
7144 -3041 -431 8008 -23005 -45003 -48310 -42323 -26839 -31949 -32569 -10370 2534 5168 -21799 -40933
7130 -40933 483 27377 37242 38288 -14235 -45978 -66037 -49439 -2740 24303 33496 28053 4867
7117 4867 -48090 -63624 -18459 -20197 -35442 -32181 3855 -13855 -53350 -87465 -83689 -40516 -7319
7104 -7319 1107 2260 21661 18212 21573 22195 54237 43814 8561 -8586 -4547 4662 204 11042
7090 11042 -15014 -22130 -34876 -14211 7727 3463 -1078 10283 11786 2376 -17158 -31603 -42576
7077d2576n89J8446q09o783O127L9128K6526J9298m090j6449l3764k739j4738
7064a3012K2879K0957m273k1465M445M81l7194J8269k383r627l078K4927K5693
7051B6619j2933n659k1461p123J2726J7191k0055o952J8155j2583m848P902L02
7038h719O368J8534m334j8346P517J5938J6120J293k2599m8972j690J2030k575
7025b9435j7161k310J3676j9033K700K7348O084m820m281j413J4377J6948k824
7012a44l413O968p920r949l7639J4727K1750j2644l3960r984K7981J4233J1913
6999a8081q592Q364Q070j102k1433k0576K2939O461J9141J2363k648J1666p816
6986H756j473J0600k1457J2841P996K995Q916n74K635j4733R967J4042R906j8178
$$ plain form
7077 -42576 -43165 -24719 -25528 -32311 -26184 12944 39470 58768 54678 38229 4465 1726 -13012
7064 -13012 9867 30824 26551 5086 9531 10012 -27182 -8913 -11296 -20923 -24001 926 26619
7051 26619 13686 8027 -13434 -20557 -7831 9360 -10695 -17647 508 -12075 -16923 -9021 -8719
7038 -8719 -2351 16183 11849 -6497 1020 16958 33078 34371 11772 -37200 -38890 -26860 -29435
7025 -29435 -46596 -48906 -35230 -54263 -51563 -24215 -18131 -22951 -27232 -28645 -14268 2680 -144
7012 -144 -3557 3411 -4509 -14458 -52097 -37370 -15620 -28264 -62224 -72208 -44227 -29994 -18081
6999 -18081 -26673 -18309 -10239 -11341 -32774 -53350 -30411 -23950 -4809 7554 4906 16572 8756
6986 8756 7283 17883 -3574 9267 17263 20258 29174 28600 31235 16502 26469 40511 50417 32239
6972C2239m6000j1984O67N499K3195k692J7173L69l2568J017Q061r787k5580N563
6958c4828K3462M523k0759J394P272J9993J2377K1743m632j7527k3514j0706R578
6945a1624K9062K8363l401O043l661k4952k1384j5963J908M3729k222l4908j3429
6932b2439J7560j6851K1406J2137k5795J6709R501K810j3829p335J4839L3295
6920D2008Q518k972p741J1549K3978O601O889k5937m5815m1898k4706J6861k5147
6907e7812k371R529O789n525k466q72J1993k998L1013Q666j3077p190K1408j574
6893d487J5177O176k0651k6238M516M351j7571K692j0877J1765O797L257R189
6880a5904P531J465j4451r037j1937m863L8772j5494k6385P103j910K4639J0527
$$ plain form
6972 32239 -13761 -25745 -25078 -19579 3616 924 18097 18466 -14102 -13085 -5024 -14811 -40391 -34828
6958 -34828 -11366 -6843 -27602 -26208 -18936 1057 13434 35177 30545 13018 -10496 -21202 -11624
6945 -11624 17438 45801 42400 48443 44782 19830 -1554 -17517 -15609 28120 25898 -9010 -22439
6932 -22439 -4879 -21730 -324 11813 -13982 2727 12228 15038 1209 -6126 8713 42008
6920 42008 50526 47554 39813 51362 75340 81941 88830 62893 17078 -24820 -49526 -32665 -57812
6907 -57812 -60183 -50654 -43865 -49390 -51856 -52728 -40735 -43733 -12720 -4054 -17131 -24321 -2913 -4487
6893 -4487 10690 16866 -3785 -30023 -25507 -21156 -38727 -36035 -46912 -35147 -28350 -25093 -15904
6880 -15904 -8373 -6908 -21359 -30396 -42333 -47196 -8424 -23918 -50303 -43200 -45110 -20471 -9944
6867i944K1328j7083n1972L5253J8282O363J8237o903K4239k1952n9650k413J3616
6854c2599Q338K0134l0597m0297k3763K0972J3859K5209L1832o628J3649j5632
6842a5523m45K5408P068j1727k5609M812J9800k88J6580K5496j1611k9987j8913
6829a4939J1980R53J3848k2523M813K4289K498P309L467l2658P030o674k323k2586
6815b5516o174L5539m042P994k1578k1920r92J2813L3592J5821J404k6593l5738
6802c5390k0442j2594J3809N128k2825K9093K1707j6221o018J3589R55n414P482
6789b7141K5469J7549J0168oj9686K5730k612k0020J3426K910L261J7957j4714
6776C2291k7446l702j8017j8392j0173J9532P112Q540R805j2381j1481j7782L0392
$$ plain form
6867 -9944 11384 -5699 -57671 -22418 -4136 2227 20464 13561 37800 15848 -43802 -46215 -32599
6854 -32599 -24261 -4127 -34724 -75021 -98784 -77812 -63953 -38744 -6912 -13540 109 -15523
6842 -15523 -15968 9440 16508 4781 -20828 -16016 3784 3496 20076 45572 33961 3974 -14939
6829 -14939 -2959 -2006 11842 -10681 -5868 18421 20919 28228 31695 -963 6067 -607 -2930 -25516
6815 -25516 -31690 3849 -193 7801 -13777 -35697 -36689 -23876 9716 25537 26941 348 -35390
6802 -35390 -55832 -68426 -54617 -49489 -72314 -43221 -21514 -37735 -43753 -30164 -29209 -34623 -27141
6789 -27141 -1672 15877 26045 26039 6353 32083 29471 9451 22877 25787 29048 47005 32291
6776 32291 4845 1143 -16874 -35266 -45439 -25907 -18795 -10255 -450 -12831 -24312 -42094 -11702
6763a1702L48k0059K79J0495R854j1732j9481k3916p36N7520K5665j2631o698
6750b794J2349J0395l085k1106L7294K680l4821l203r768j0649l2807J2702L5774
6737g039K4663k4029j0176j9823j0486n472p218L3628L1742m1105l1445L0642
6725c6118L3316L6626J1596J2694k7396k5465Q860l127N059J8467J2369J4160
6713F1041j8835M023k7149J7485J8881K947l6404n2662J8125m525J1407l300J9894
6700A0928J0135k0142M690k9625K0388K9455m482J7098M165K114J3865m7904l3047
6687b2362K9870J7625n306M979p474k1626J5081K0767k8040j9629N270K3806j1835
6674A126k0361L1007j690l1212k97O395M677M818L7258j1898M646p407K1720J5846
$$ plain form
6763 -11702 -11354 -31413 -31134 -20639 -10785 -22517 -41998 -65914 -66650 -9130 16535 3904 -2794
6750 -2794 9555 19950 16865 -4241 33053 35733 912 -2291 -12059 -22708 -55515 -42813 -7039
6737 -7039 17624 -6405 -16581 -36404 -46890 -52362 -59580 -25952 5790 -35315 -66760 -36118
6725 -36118 -2802 33824 45420 58114 30718 5253 14113 10986 16045 34512 46881 61041
6713 61041 42206 46229 19080 36565 55446 58393 21989 -30673 -12548 -17073 -5666 -8966 10928
6700 10928 21063 921 5611 -24014 -3626 25829 21347 38445 42610 44724 58589 10685 -22362
6687 -22362 7508 25133 19827 24806 17332 -4294 10787 31554 3514 -16115 -10845 12961 1126
6674 1126 -19235 11772 10082 -21130 -21427 -15032 -10355 -5537 31721 19823 24469 17062 38782 54628
6660E4628k5493Q655k346j2234m308p000r71l1535j9503o589M870N681O333j2738
6646d2550N504J1288K1010L4235m249k5812r272J4890n504n962J3451K8098j7092
6633A8035n6692k2034K2679J8280K2141J6704r475j7433k2704N516o110M6925
6621A5832K483j2343j7975n036q491J5893J0536j7270l1248K6879R718J3777J245
6608D000l6349j7367m087K2581J7356J4613m6O580r232n27Q747j5280J1881j665
6594A205k1961j2760L3193K3255m0595j1683P84j243M267n840R373j1687k3784
6581e7476M336R991J1776K8676L543J0175j5898l4179p017p640N075K2473L0272
6568D107K442q551j9414k4344R179K8302l869M543k9713m283J799J326K8829K7563
$$ plain form
6660 54628 29135 37790 35444 23210 18902 11902 10931 -20604 -40107 -46696 -41826 -36145 -29812 -42550
6646 -42550 -37046 -25758 -4748 29487 25238 -574 -9846 5044 -460 -6422 7029 35127 18035
6633 18035 -38657 -60691 -38012 -19732 2409 19113 9638 -7795 -30499 -24983 -31093 15832
6621 15832 18315 5972 -12003 -17039 -25530 -9637 899 -16371 -47619 -20740 -11022 2755 4000
6608 4000 -32349 -49716 -53803 -31222 -13866 747 701 7281 -1951 -2478 6269 -9011 2870 1205
6594 1205 -20756 -33516 -323 22932 -17663 -29346 -28562 -29805 -25538 -31378 -22005 -33692 -57476
6581 -57476 -53140 -43149 -31373 -2697 846 11021 -4877 -39056 -46073 -53713 -48638 -26165 4107
6568 4107 6549 -2002 -21416 -45760 -36581 -8279 -12148 -7605 -37318 -41601 -39802 -38476 -9647 17916
6554A7916j9686J5050o892K6090j6140Q58j8657j2353N363K2238j4082m6628k0123
6541f7046M3472J4019k9215j9444J2616L0176K6340J9848J0509j0919l1052P539
6529F843J6379j4971j7636j5363O057R90J0789J3641j6221j0705J1168k61R96
6516h294J5498L0582J9295K167k2884l7160p906j1801O843J5930J2759q858k4548
6503a8377J0681P593K509l2455K4115L139M4880N773m445j6636j5431j9718N304
6490c068J1206J1955O978j6553O934j9164k7165P470R830j3884r182J9993L4152
6477A9502r169l4608p911J1226q184n453J0349M921J860p300n11N862J5476P051
6463C111L2308n732J6768m595m2420l0532j0396O332j009j8724k0124J5629J7767
$$ plain form
6554 17916 -1770 13280 6388 32478 16338 17196 -1461 -13814 -8451 13787 -295 -46923 -67046
6541 -67046 -23574 -9555 -38770 -58214 -45598 -15422 10918 30766 41275 30356 -696 6843
6529 6843 23222 8251 -9385 -24748 -18691 -17701 -6912 6729 -9492 -20197 -9029 -9290 -8294
6516 -8294 7204 37786 57081 59248 36364 -796 -8702 -20503 -13660 2270 15029 6171 -18377
6503 -18377 -7696 -103 2406 -30049 -5934 -2795 42085 47858 43413 26777 11346 -8372 -3068
6490 -3068 8138 20093 27071 10518 17452 -1712 -28877 -21407 -11577 -25461 -34643 -14650 19502
6477 19502 10333 -24275 -32186 -20960 -29144 -34597 -24248 -19327 -17467 -24767 -25278 -19416 -3940 3111
6463 3111 35419 29687 46455 41860 -560 -31092 -41488 -35156 -36165 -54889 -75013 -59384 -41617
6450d1617Q809N451l919l6994N022K2702j5605J635K4911J268K2034K561L896
6437A54p650r503O326K4853j623l3402L3168L0615k2881l4426j7931k455K1704
6424a3051J2807k2633J0780L6181K9190k8642j0345P779n8377k0187j247j4315
6412g2060K4029K5309L5021L029l0066l4021j6905K5216J9766J0605J4285p866
6400c658k0956m784O706J6668N399r35K9458j7101k3851rJ870O174P649j5393
6386a2763j7876L15K0663j2471l1805L6860J3643l4713K841P410k3094L499m077
6373e1568K96K4923K5623m86j2251p517j3480K84L03K6885j3194p208J9045K7853
6359A9508J5683j5449o508l386j4579J3304k0679r531Q046n688K293J4705K0695
$$ plain form
6450 -41617 -32808 -27357 -31276 -68270 -63248 -40546 -56151 -54516 -29605 -28337 -6303 -3742 154
6437 154 -7496 -16999 -10673 14180 12557 -20845 12323 42938 20057 -14369 -32300 -34755 -13051
6424 -13051 -244 -22877 -12097 24084 53274 24632 14287 22066 -36311 -56498 -57745 -72060
6412 -72060 -48031 -22722 12299 15328 -14738 -48759 -65664 -40448 -20682 -10077 4208 -3658
6400 -3658 -24614 -29398 -22692 -6024 -625 -1560 27898 10797 -13054 -13063 -11193 -5019 2630 -12763
6386 -12763 -30639 -30324 -9661 -22132 -53937 -17077 -3434 -38147 -35306 -27896 -50990 -47491 -51568
6373 -51568 -51272 -26349 -726 -1212 -13463 -20980 -34460 -34176 -33873 -6988 -20182 -27390 -8345 19508
6359 19508 35191 19742 13234 9848 -4731 8573 -12106 -21637 -13591 -19279 -16986 -2281 18414
6346A8414q012L761Q652J0838J698m727J3217j3769k2537O997l9796q988j7449
6333e1701k1057L346K2431J6213k299J9818p377J2359J3758l40k4654k0185k5249
6320f4937M396J7347j373J4558P260K838M2203J1533k7336k9303R39K8747K0253
6307B7125K4438j6973j9994k8669r656n850J5637M87j5760o383j9139k6621k0353
6294a01711J4461L4787j535N811r872j2216q500J7105N8642N25j8634l6715M4830
6281a3022R322J634J1333J7946K028n0464j8644K9493P297L1050j336j5859q460
6268B318O042K0765O224j9877k9805k7170j6407r591j2055r61K0655K7717j3459
6255d5604L4023N150k0358j5268L410K322P563J791j5890r212q262Q401j3073
$$ plain form
6346 18414 10402 14163 22815 33653 35351 30624 43841 30072 7535 14532 -25264 -34252 -51701
6333 -51701 -72758 -69412 -46981 -30768 -33067 -13249 -20626 -8267 5491 5151 -19503 -39688 -64937
6320 -64937 -60541 -43194 -44567 -30009 -22749 -19911 22292 33825 6489 -22814 -21875 6872 27125
6307 27125 51563 34590 14596 -14073 -23729 -29579 -13942 -13455 -29215 -35598 -54737 -81358 -101711
6294 -101711 -87250 -52463 -53998 -48187 -58059 -70275 -78775 -61670 -3028 -2503 -21137 -57852 -13022
6281 -13022 -3700 -2066 9267 27213 29241 -21223 -39867 -10374 -3077 27973 26637 10778 2318
6268 2318 8360 29125 35349 15472 -14333 -41503 -57910 -67501 -79556 -80517 -59862 -32145 -45604
6255 -45604 -11581 -6431 -26789 -42057 -38647 -36325 -28762 -26971 -42861 -52073 -60335 -51934 -65007
6242f5007j2358J0062J5171k3665K2474P885p637J0000L4749J1011j9821k4198
6230d1334K9774K5689k0799j3559N417K4534K337l3495k4004Q991O037L5426K2785
6217B7799j4404m9945K169J063k4242K9870L4277k7952k8598j0070N8149M594
6205B710l1099m601r078J175J5602J3352J4034q551l3140L151K3413L7499N217
6192B9684l5213j0759l613J719l07K0349L3838N335Q96j610k1209j3327k8323
6179b2540j7626K8788N52k3786p051M4644J1027L039O778j5002k0684l4153K636
6166d3378K2063J3508J075k2654j9581J4059K4091m650k9857J8455M1811k588
6154A2354l2340o737M022j2393O785J6543J7280n017l6453k1870J9852J0607M663
$$ plain form
6242 -65007 -77365 -67303 -52132 -75797 -53323 -45438 -53075 -43075 -8326 2685 -17136 -41334
6230 -41334 -11560 14129 -6670 -20229 -14812 9722 12059 -21436 -45440 -36449 -30412 5014 27799
6217 27799 13395 -36550 -34381 -33318 -57560 -27690 6587 -21365 -49963 -60033 -1884 2710
6205 2710 -28389 -32990 -42068 -40893 -25291 -11939 2095 -6456 -39596 -36445 -13032 24467 29684
6192 29684 -5529 -16288 -19901 -18182 -18489 1860 35698 41033 41929 40319 19110 5783 -22540
6179 -22540 -40166 -11378 -10826 -34612 -41663 2981 14008 17047 23825 8823 -11861 -46014 -43378
6166 -43378 -21315 -7807 -6732 -29386 -48967 -34908 -10817 -15467 -45324 -26869 14942 12354
6154 12354 -19986 -26723 -22701 -35094 -28309 -11766 5514 497 -35956 -57826 -37974 -27367 -22704
6141b2704p719k6723J9496J1943J0392k9786m754J8311Q318m115K0104j5943L274
6128a9906K2094o258O022j334k9786k803R220j5143p028J8994L9145M352r768
6115G801N637j2199J7195K112k7204j5049j3398J6186J7370J6914j154k217p102
6102D892P809o863K279J3884p28J3867n990p447p998l8424n3190j3214K3271K3977
6088d3875K4615q937j6903R986L6716J1430j1516j5528o537k0136J928K0551J78
6075a8028P289L1493K465m024K499R19J2877j4093j7583l6115j5741L3992K0060
6062F010J7387J19k7830j8600j2392r438J093K2057M0012L0879q264l9425n023
6049c415M7005J0940m5813l8118k2154P479J1575J1720K8510l005K838q932j881
$$ plain form
6141 -22704 -30423 -57146 -37650 -25707 -15315 -45101 -49855 -31544 -23226 -27341 -7237 -23180 -19906
6128 -19906 2188 -4070 1952 618 -29168 -31971 -22751 -37894 -44922 -25928 13217 17569 7801
6115 7801 13438 1239 18434 20546 -6658 -21707 -35105 -18919 -1549 15365 14211 11994 4892
6102 4892 12701 5838 8117 22001 21273 35140 29150 21703 13705 -24719 -77909 -91123 -67852 -43875
6088 -43875 -19260 -28197 -45100 -35114 1602 13032 1516 -14012 -20549 -40685 -38757 -18206 -18028
6075 -18028 -10739 20754 23219 19195 21694 22613 35490 21397 3814 -32301 -48042 -14050 6010
6062 6010 23397 23516 -4314 -22914 -35306 -44744 -43651 -21594 18418 49297 41033 1608 -3415
6049 -3415 43590 54530 8717 -29401 -51555 -44076 -32501 -20781 7729 4724 7562 -1370 -3251
6036c251L6453n703k1776J1527l153k4926k5323L4468L209K3223j495m90j1529
6023A1234k3073N01j4732l1402j273J1001J3923l570J7708J1471J0208J4006j99
6010A5803q815l2448j1147K490J1398j5455k3264Q06M3536l1477k6878J0410K2672
5997d2369m752j1176K4105l833j324O160L7867j6363o582j5806O911K9027j4869
5984a3004j276L5746k446j7001m34J6789q278k2599l2096k507j1387p792J3393
5971e2892j3559J2115N559L6009k787K0750Q090J92K371k8961q423r761J856j9999
5957d9440k895J1514J9305J3699M973j7891l4395K0695J6474M3335j4478k4021
5945a3125j2730j7899P865J1216L4254q834j6655J5751K0498J6793n601n0252
$$ plain form
6036 -3251 33202 27499 5723 17250 14097 -10829 -36152 -1684 1525 24748 23253 22763 11234
6023 11234 -11839 -11338 -26070 -57472 -58745 -47744 -33821 -37391 -19683 -8212 1996 16002 15803
6010 15803 6988 -25460 -36607 -34117 -22719 -38174 -61438 -60632 -17096 -48573 -75451 -65041 -42369
5997 -42369 -47121 -58297 -34192 -38025 -39349 -33189 4678 -11685 -18267 -34073 -27162 1865 -13004
5984 -13004 -14280 21466 19020 2019 1585 18374 10096 -12503 -44599 -47106 -58493 -66285 -52892
5971 -52892 -66451 -54336 -48777 -12768 -15555 5195 13285 13477 15848 -13113 -21536 -31297 -29441 -49440
5957 -49440 -52335 -40821 -21516 -7817 -2844 -20735 -55130 -34435 -17961 25374 10896 -13125
5945 -13125 -25855 -43754 -35889 -24673 9581 747 -15908 -157 20341 37134 31533 -18719
5933a8719m0092M911O356J1330k266l0262L563K2393K5000J2743J744k3806R9
5920b7006R730M6666N2464n441o1593n2783j2689O652N139K3196o04L0199l4086
5907b0156k0347L554k0158k723M0275M7135q930j9305J5160M3344j1492l2544
5895A3813J833j6425m945L403l846j7856j0966k499J7105k3298j7205l658j6179
5882h0723j5151j2483j4000K1169K2903L7163O770p908O687l047K3667N4406n33
5869C8920k4900k9794j9614j724M2141l17j4278J854j0822q430N345K6928p486
5856b177j2330K947j1204O995j7443j5069P75J8745q675K730m502P356Q963K9034
5842F145l287j260m849k8365P694j3952o578K5222M1996J5843Q47p86j9639l866
$$ plain form
5933 -18719 -58811 -53900 -47544 -36214 -38480 -68742 -65179 -42786 -17786 -5043 -3299 -27105 -27006
5920 -27006 -17276 29390 81854 76413 14820 -37963 -50652 -44000 -38861 -15665 -16269 13930 -20156
5907 -20156 -40503 -36949 -57107 -59830 -19555 27580 18650 -655 14505 57849 46357 13813
5895 13813 15646 -779 -5724 -2321 -6167 -24023 -34989 -37488 -20383 -43681 -60886 -64544 -80723
5882 -80723 -95874 -108357 -122357 -101188 -78285 -41122 -34352 -42260 -35573 -38620 -14953 39453 38920
5869 38920 14020 -15774 -35388 -37112 5029 4712 -9566 -7712 -18534 -26964 -21619 5309 -2177
5856 -2177 -14507 -11560 -22764 -15769 -33212 -48281 -47506 -28761 -37436 -34706 -39208 -31852 -22889 6145
5842 6145 2858 1598 -3251 -31616 -23922 -37874 -44452 -19230 22766 38609 39456 38670 19031 15165
5828A5165K0278J4817M037j7315k3421o66K467j8731r776q221o862P306P392K950
5814a0580j9704J5163J9877n69O23k8227L68k040J3345R953Q609M297K4047Q679
5800D3841j2461k8879j5616J1148K161J0160J9843Q175j549j4945L904j1479j2321
5787A982N782M1201n634k877J3730K268l0549p114J8784j0641J1767j927j4748
5774B2024j3611K623k3196l5425J6431L1147N617J8606K7058l7798l2642J507
5762a7659J1079n064P61r784J9871J022P475r934J1558j5313j8968m604Q689j3706
5748c4577o071k527j3097j8046j741L6296J8539Q218j1034K0720J9159J0369j0259
5735A5949k8441r486n3877m77J6680k135L1310K3706L0801r714Q119q033j876
$$ plain form
5828 15165 35443 50260 54297 36982 13561 12895 15362 -3369 -13145 -21366 -28228 -20922 -13530 -10580
5814 -10580 -30284 -15121 4756 4187 4810 -23417 -23049 -25089 -11744 -1791 6818 11115 35162 43841
5800 43841 31380 2501 -13115 -1967 194 10354 30197 38372 36823 21878 25782 14303 1982
5787 1982 7764 48965 43331 40454 54184 56452 25903 18789 37573 26932 38699 36772 22024
5774 22024 8413 11036 -12160 -47585 -31154 -7 5610 24216 51274 13476 -19166 -17659
5762 -17659 -6580 -11644 -10883 -20667 -796 226 7701 -2233 9325 -5988 -24956 -29560 -20871 -34577
5748 -34577 -40648 -43175 -56272 -74318 -76059 -39763 -21224 -13006 -24040 -3320 15839 26208 15949
5735 15949 -12492 -21978 -75855 -76332 -59652 -61787 -30477 -6771 24030 14316 22435 14402 12526
5722A2526M3139j740n8097q704o044J0862r667q39k407R612M822J2124j7550r098
5708b1061J1648j5234k0650O228K981J5251j1783J1789J4978J9426J8151p081
5696B4643k2142K6533L970K746J0907k2108k8153j0930p37K9899q083j1314K747
5683b022r688J811l1146k916J4445p800j994P751M934k1509r078N162J5054J5866
5669b1130K8013p044K6045Q723j5762k9383p245r221r352L7960K1907J215q193
5656A6533l5657K632K3759j5290j1288R401m240N98J5976k1457l3875J3514L2206
5643g188M278j3235K596p507n617j4227J0475J7547K6591m667k3979J9727L296
5630H090l0334j2165K596J0671m244j0962n169J6906K9193J0259k02k0382k4872
$$ plain form
5722 12526 55665 53925 -4172 -12876 -18920 -8058 -17725 -18564 -20971 -11359 -6537 5587 -11963 -21061
5708 -21061 -9413 -24647 -45297 -39069 -36088 -20837 -32620 -20831 -5853 13573 31724 24643
5696 24643 2501 29034 33004 35750 46657 24549 -3604 -14534 -15271 14628 6545 -4769 -2022
5683 -2022 -11710 -9899 -41045 -43961 -29516 -37316 -39310 -31559 -26625 -48134 -57212 -52050 -36996 -21130
5669 -21130 6883 -161 25884 34607 18845 -10538 -17783 -27004 -36356 1604 23511 24726 16533
5656 16533 -19124 -16492 7267 -8023 -19311 -9910 -14150 -13552 2424 -19033 -52908 -39394 -7188
5643 -7188 -2910 -16145 -13549 -21056 -26673 -40900 -30425 -12878 13713 9046 -14933 4794 8090
5630 8090 -22244 -34409 -31813 -21142 -25386 -36348 -41517 -24611 4582 14841 14639 -5743 -30615
5617c0615J1370K8165K6251j6212k4117J133L3525k5469l5989O669n73J7226J5178
5604F542O545j2570n3055q914J9749o085k929P656M949L043M0613J1955j1319
5591F180j7186o152K213J2204L5597K1323Q980k3183l7580O394o350m922N064
5578B582j0763n6917M295K2789p3k1821K393k1501J109K0913L2235j1808N964
5565c0603o143j1173k1620j675L2539N1216J5114j5019k6728k9294J2490N548
5553b5348j724K44n294j71J1939p482J2282K514R410K829j1350J5548P631J2855
5539B3883j8269m603J3257j9723k0468j2855m060Q216J0024K5742J0936o950r721
5526d591j1301q182J2692K4685M027P526r738k8062J6056j370o536l0885J8118
$$ plain form
5617 -30615 -19245 8920 35171 18959 -5158 -4025 29500 4031 -31958 -25289 -25862 -8636 6542
5604 6542 13087 517 -52538 -61452 -41703 -47788 -50717 -43061 -38112 -35069 5544 17499 6180
5591 6180 -11006 -17158 -14945 -2741 32856 54179 63159 39976 2396 8790 2440 -2482 2582
5578 2582 -8181 -65098 -60803 -38014 -38087 -59908 -57515 -79016 -77907 -56994 -24759 -36567 -30603
5565 -30603 -36746 -47919 -69539 -71214 -38675 12541 27655 12636 -14092 -43386 -30896 -25348
5553 -25348 -27072 -26828 -32122 -32293 -20354 -27836 -15554 -13040 -3630 -801 -12151 3397 11028 23883
5539 23883 5614 1011 14268 -5455 -25923 -38778 -42838 -34622 -24598 1144 12080 5130 -4591
5526 -4591 -15892 -24074 -11382 13303 17330 24856 15118 -12944 3112 1742 -4794 -35679 -17561
5513a7561K6018L2364M259j1772j0068J1709O503j3510k0601Q469j2092n6530
5501e2812J030K7597K5139r21n670k33k008l262J4093K6666j1971l3746j4657
5488c0755J4786j2727N471O730K4648L1696k4478k9676k4939P555J3084K5403
5476F798J4037J2160L284J750o986l3645k8998KJ0662K1549k5437k725K2622k2145
5462b7072j7163r881l28L447k828K0107L1406M675Q771j6636j4385K0347q070
5449g610m106r338j0324J8173J412l434L154o41k479J0584K2424K289k9755n423
5435a5074R898l0760k6284Q207J9748k189L5718p466r401J4143m288l3593n829
5422d7170j9432J8932J8477J3851N373k230p234j4495L1882j6746j7436j0203
$$ plain form
5513 -17561 8457 40821 45080 33308 23240 34949 41452 27942 7341 15810 3718 -52812
5501 -52812 -51782 -24185 954 33 -5637 -5870 -7878 -11140 2953 29619 17648 -16098 -30755
5488 -30755 -15969 -28696 -23225 -16495 8153 39849 15371 -14305 -39244 -31689 -18605 6798
5476 6798 20835 32995 36279 38029 31043 -2602 -31600 -31598 -20936 613 -24824 -27549 -4927 -27072
5462 -27072 -44235 -54116 -54444 -50997 -53825 -33718 -2312 2363 11134 -5502 -19887 460 -7610
5449 -7610 -11716 -21054 -31378 -13205 -11793 -15227 -12073 -12714 -15193 -4609 17815 20104 -9651 -15074
5435 -15074 -5176 -35936 -62220 -54013 -34265 -36454 -736 -8202 -17603 -3460 -7748 -41341 -47170
5422 -47170 -66602 -47670 -29193 -15342 -9969 -12199 -19433 -33928 -2046 -18792 -36228 -46431
5410d6431K801L9984L8466j1194k0963r318j8242J5425N664k1403k6227K0446
5398c0992L7399K3595p325l8326j6062N819J0J3537j1501K834K2631j3899R801
5385b479K3919p915J8037J859o834j6227l0508K3559O096J794R776k3102k077
5372d102J5000K1196j5642M131K6563J0248O893n018l4033q276j6498j1296O763
5359d071N806J6999J9988J0291l4321l5623J3229N322P021j3734O02j3176j8191
5346c9858L577K5750r803j8774J424J2670J8636N28k1982k1335J5864K5394J0695
5333B786J7315J0703J1175k4287r651j0753q665q340J3987n771K80j4675j0800
5320c6696J6093m587J3797p420M314K1756q316q571N369j221r35j5714J480J4512
$$ plain form
5410 -46431 -43630 -3646 34820 23626 2663 -6655 -24897 -9472 -3808 -25211 -51438 -30992
5398 -30992 6407 30002 22677 -15649 -31711 -25892 -25882 -12345 -23846 -21012 1619 -12280 -2479
5385 -2479 21440 13525 31562 33421 26587 10360 -20148 3411 9507 11301 21077 -2025 -4102
5372 -4102 10898 32094 16452 20583 47146 57394 64287 59269 25236 16960 462 -10834 -4071
5359 -4071 1735 18734 38722 49013 14692 -20931 -7702 -2380 4641 -9093 -8491 -21667 -39858
5346 -39858 -36281 -10531 -20334 -39108 -37684 -25014 -6378 -5850 -27832 -49167 -33303 -7909 2786
5333 2786 20101 30804 41979 17692 8041 -2712 -11377 -19717 -5730 -11501 -11221 -25896 -36696
5320 -36696 -20603 -25190 -11393 -18813 -14499 7257 -1059 -9630 -4261 -5482 -6417 -22131 -20651 -6139
5306f139m874n929k052M27J27K4938J5151K2988K7907l4213j8879j3795k4905
5293a9248o442J0516K3022M967n5934Q455L0540K0813K0834P421k4889k4831J6176
5280A1400N600j3244j7818N401k1565Q488J1008K3463J7527j0137l0570K021J4010
5267E584Q475J2249J282l5445m0992j0598J7187j0699N700K2234J201j627n992
5254c1441O985P528r894L5126k4909m4600K6693K5565o141j3687j6951o108J4831
5241c7003J9674q456j1096q569r340N3675P158K499j2027j5123l5008j2138K6057
5228c9697J0032L423N944J1854K26M16K0680J2492j4464R964n691o804k5790L395
5214a4020L2572O7l058j636j0323l357J146L524j5404k7549K7693N445k2198K970
$$ plain form
5306 -6139 -11013 -16942 -18994 -18567 -18440 6498 21649 44637 72544 38331 19452 5657 -19248
5293 -19248 -25690 -15174 7848 12815 -43119 -34664 -4124 16689 37523 44944 20055 -4776 11400
5280 11400 17000 3756 -14062 -8661 -30226 -21738 -10730 12733 30260 20123 -10447 -8426 5584
5267 5584 14059 26308 27590 -7855 -48847 -59445 -42258 -52957 -47257 -25023 -23822 -25449 -31441
5254 -31441 -24456 -16928 -26822 8304 -16605 -61205 -34512 -8947 -15088 -28775 -45726 -51834 -37003
5241 -37003 -17329 -25785 -36881 -45450 -54790 -1115 6043 8542 -3485 -18608 -53616 -65754 -39697
5228 -39697 -29665 -26242 -20298 -8444 -8218 -7802 12878 25370 10906 20870 15179 8375 -17415 -14020
5214 -14020 18552 18619 15561 13925 3602 245 1391 4915 -10489 -38038 -10345 -4900 -27098 -24128
5200b4128K6223k1536k5478J519j9531K5124L5851K0491j2317O89k336J2354J986
5187A8911l5326K0966m558j6434O738j7744l0618L4389L8099J7763N82M625j6368
5174B1025P325o897j6259J9582P501j569N372R960k2475k7702P413o002K197M446
5160C917j8990k0340j108p020L8714L9708n413M574L490k1859k6577j1850j5713
5147c8467J7767P292L0692M410j2504j8245J0105n48j7507q853K9377J938l7977
5134c2520j1813J7565j9994M157R871J3259K3249J1842m827l0815k8523K465J7989
5121b8095M1236p463l4365K0035l876q784r013k929J3737k899k988j0262j4392
5108e0058L3831J3576m814p306j7792L1919L8339k601q724j6568J2769J3783q244
$$ plain form
5200 -24128 2095 -19441 -44919 -43400 -62931 -37807 -1956 18535 6218 6907 4571 16925 18911
5187 18911 -16415 4551 -7 -16441 -9703 -27447 -58065 -23676 14423 32186 32768 37393 21025
5174 21025 28350 21453 5194 24776 32277 30708 36080 46040 23565 -4137 3276 -2726 -529 3917
5160 3917 -15073 -35413 -36521 -43541 -4827 34881 29468 34042 37532 15673 -10904 -22754 -38467
5147 -38467 -20700 -13408 17284 21694 9190 -9055 1050 502 -17005 -25858 3519 5457 -32520
5134 -32520 -44333 -26768 -46762 -42605 -32734 -19475 3774 15616 10789 -20026 -48549 -46084 -28095
5121 -28095 13141 5678 -28687 -8652 -12528 -21312 -30325 -33254 -19517 -22416 -25404 -35666 -50058
5108 -50058 -16227 -2651 -7465 -14771 -32563 -644 37695 35094 26370 9802 22571 36354 28110
5095B8110l6740j1747k713K3148j0416j652O687K4187L255k2367K3484K9799j5430
5082C7605j7126j5604l921q712j5480Q782L88J0846K4963K0398J3408N101j5721
5069D4927j4463l3157k8311J2235J250p298j814L429L997m867M2130J6180l2687
5056A551j8111J3720J5004k8683j5217k2347j3431K7995J3104J1909L2l2149J2705
5043c3918L9232J2543j1137J285K606k466j5328j5475J5429j672O202J9627l6001
5030a9073l1236J7845K7014J4592n687J3613J0810j2462j2315L29J012j0883r242
5017a5683O750K284J51J0356k0711k1609J3408K8731k1335J5133m303l3890J2866
5004b7852K3186N17j2197k311J905O470J7959m762R761m927j2407j0571Q801O102
$$ plain form
5095 28110 -8630 -20377 -23090 58 -10358 -12010 -5323 18864 22119 -248 23236 53035 37605
5082 37605 20479 4875 954 -7758 -23238 -14456 -14068 -3222 21741 42139 55547 60648 44927
5069 44927 30464 -2693 -31004 -18769 -17519 -24817 -26631 -23202 -19205 -24072 18058 34238 1551
5056 1551 -16560 -2840 12164 -16519 -31736 -54083 -67514 -39519 -26415 -14506 -14474 -46623 -33918
5043 -33918 5314 17857 6720 8005 10611 8145 -7183 -22658 -7229 -8901 -2699 16928 -19073
5030 -19073 -50309 -32464 -5450 9142 3455 17068 27878 15416 3101 3430 4442 -6441 -15683
5017 -15683 -8933 -6649 -6498 3858 -16853 -38462 -25054 3677 -17658 -2525 -6828 -40718 -27852
5004 -27852 -4666 -4149 -16346 -18657 -16752 -10282 7677 2915 12676 7749 -4658 -15229 -6428 -326
4990c26L95O193k293J6345o459N363k2152r728K1145J3779l3752o888K3957p674
4976b095k8204K7091L2176j2661M230J8624k0647l9656k7826P594J5247M641l2939
4963e4425M075P587j0908K3203O6257O786o926Q094k7691j8969k3668J5531O759
4950d295j6607J0696J9245J9633l1938l0113l734j7808K5463R205p050q582J3212
4937b2673P61J8324J2671j656k0359k2693Q931K8547J7733p080o94q584p32j1308
4923h812j4976O644J4387k13L43J1539n910n304k4062k7815N74n830J0692M0016
4909h727L0085P619j5559k0156j6059J4999K4118j6990r954l52k93j0506O267
4896a5508k8558q696k68J833K2283P880o984L5356j2220n548k864M21p739K1868
$$ plain form
4990 -326 69 6262 3969 20314 13855 19218 -2934 -12662 8483 22262 -11490 -18378 5579 -2095
4976 -2095 -30299 -3208 28968 16307 20537 39161 18514 -21142 -48968 -41374 -26127 -21486 -54425
4963 -54425 -50350 -42763 -53671 -30468 35789 42575 35649 43743 16052 -2917 -26585 -11054 -4295
4950 -4295 -20902 -10206 9039 28672 -3266 -33379 -37113 -54921 -29458 -20253 -27303 -35885 -22673
4937 -22673 -21912 -3588 9083 7427 -12932 -35625 -26694 1853 19586 12506 11812 3228 2496 -8812
4923 -8812 -23788 -17144 -2757 -2970 -2627 8912 3002 -2302 -26364 -54179 -53605 -59435 -48743 -8727
4909 -8727 21358 28977 13418 -6738 -22797 -7798 16320 -670 -10624 -10976 -11269 -21775 -15508
4896 -15508 -44066 -52762 -53030 -51197 -28914 -21034 -28018 7338 -4882 -10430 -13294 -12873 -20612 1256
4882A256l797l4127k7240L6122J5904k4077J624J1214K5185J8749p460j249k9543
4869a7439O522Q600j1272j5008P358K0401J7055m0742l1103J4405J3381J4392
4857a3450j6125Q770j8196K8330L2367J3384j593J6091l2034j5736j3236j0572
4845b2000n310K4391p729p784K0748o832j0584l1013k0504J3498K8142L4676k1217
4832a1518K8978J4639l3432p910m747O711j0428o263k482K0573K950n563J9141
4819A0649m685m649K1806L464k0500j7473K5310N259n3p441J6846q138n201M166
4805A9360k0003j6725m686k1872M38J5571J670J6383K0727M817j8086R276J593
4792H463J2407J1032k8112k7902j4080N624j1552o582p146L65K9306L7246k1261
$$ plain form
4882 1256 -2541 -36668 -63908 -27786 -11882 -35959 -34335 -23121 2064 20813 13353 12104 -17439
4869 -17439 -10917 -2317 -13589 -28597 -21239 -838 16217 -24525 -55628 -41223 -27842 -13450
4857 -13450 -29575 -20805 -39001 -10671 21696 35080 33487 49578 17544 1808 -11428 -22000
4845 -22000 -27310 -2919 -10648 -18432 2316 -4516 -15100 -46113 -66617 -53119 -24977 9699 -11518
4832 -11518 17460 32099 -1333 -9243 -13990 -7279 -17707 -23970 -26452 -5879 -2929 -8492 10649
4819 10649 5964 1315 23121 26585 6085 -11388 13922 19181 19128 11687 28533 20395 15194 19360
4805 19360 -643 -17368 -22054 -43926 -43488 -27917 -26247 -9864 10863 15680 -2406 6870 8463
4792 8463 20870 31902 3790 -24112 -38192 -32568 -44120 -50702 -57848 -57483 -28177 9069 -12192
4779a2192Q084J3323j5995j9138l215o544M000J4748K3714j1860q938N128q48
4766i733N029l0200k1336L0055L5721j1144j432M68O754j5359J8401K8995P551
4753D3770j5165j8948k2227j104r356n793L0817K199L6071n880l1415o363q284
4740a1678R392k9839q139J5611K5001J1423k8886r887J608K9949j5684r268j4193
4727c4590J9627L7526n3o965J3881j9465q845j8759K7034M8615j63j8941l6858
4714B044k203L4063Q162k897P172l1655k9142K01O723j6949k2177k9468J9407
4701e6719K8042l198N2560L5289j5230k6925j3536j079r370o8L6146J3946k2176
4688A7682N695N324k5726j6189j0761J4459J5344j2748j1253J6547J3755K848
$$ plain form
4779 -12192 -4108 9215 -6780 -25918 -29133 -35677 -31677 -16929 6785 -5075 -14013 -8885 -9733
4766 -9733 -4704 -34904 -56240 -26185 9536 -1608 -3040 -2572 4182 -11177 7224 36219 43770
4753 43770 28605 9657 -12570 -13674 -23030 -28823 1994 4193 40264 34384 2969 -3394 -11678
4740 -11678 -2286 -32125 -40264 -24653 348 11771 -17115 -27002 -25394 4555 -11129 -20397 -34590
4727 -34590 -14963 22563 22510 15545 29426 9961 1116 -17643 9391 58006 57843 38902 2044
4714 2044 -159 33904 42066 39169 46341 14686 -14456 -14255 -7532 -24481 -46658 -76126 -56719
4701 -56719 -28677 -31875 20685 55974 40744 13819 283 -796 -10166 -10234 25912 39858 17682
4688 17682 23377 28701 2975 -13214 -23975 -9516 5828 -6920 -18173 -1626 12129 14977
4676A4977k5911p795J6493N172j346l3176p052J3939K9626N680J1137k080p311
4663A2353M950l0689k2356J6153J9597J5664n863j5991k4087J3609J8008j3488
4651a2140j0078l1857J3822K0348K8339j2803j8152R114k8149R541K293J5236
4639a4486L664P95J0784J6423Q147J0268r311j3940m353m697m510l518K6773J5102
4625C7141J9695j5307o4295l0299J1990L1428L402q42J7266j5065k2211L751J5001
4612h345K2694N55J4449k0974J9539K323k7845k8373j3962K4449K5016J6150K716
4599B8392r450m3235m2438Q024J4676R091q336r313K0091K246j1258K657J8919
4586a9934Q560j434j2269J3315l653j6262J9349J9084j1895l916j4195k932k9964
$$ plain form
4676 14977 -10934 -18729 -2236 2936 1590 -31586 -38638 -24699 4927 10607 21744 19664 12353
4663 12353 17303 -13386 -35742 -19589 8 15672 9809 -6182 -30269 -16660 1348 -12140
4651 -12140 -22218 -54075 -40253 -19905 8434 -4369 -22521 -13407 -41556 -32015 -29722 -14486
4639 -14486 -10822 -10027 757 17180 25327 35595 26284 12344 7991 3294 -1216 -4734 22039 37141
4625 37141 56836 41529 -22766 -53065 -41075 -9647 -6245 -7087 10179 -4886 -27097 -23346 -8345
4612 -8345 14349 14904 29353 8379 27918 30241 2396 -25977 -39939 -15490 9526 25676 28392
4599 28392 18942 -24293 -66731 -58707 -44031 -34940 -43276 -52589 -32498 -30252 -41510 -38853 -19934
4586 -19934 -11374 -12808 -25077 -11762 -15415 -31677 -12328 6756 -5139 -9055 -23250 -26182 -56146
4573e6146O444J1156r27K3027J0915O701J3684Q037J3838N666m1292n2391q542
4560e9830J2869M876J2981J2903L2156J429q389l694l66O464J1679k2582l1022
4547c0526K5891K571O577O484L678k9667k749J3476L8q444o996m345p378O858
4533b4532k456R315j101J981J0189J9440L8452k7015m6637K580j4184l3649L1342
4520c6275L5849l677J6331Q589m5058P482R94n44R537m222J0986k0360k6239J2465
4506c4142L3748J9792L312j6012j2604O616J0598j9740j7055K8387j2269k6822
4494c6191o805J094r278J0915j0752J157m94o112L8633L5912M537j2520k872k185
4480E039j4298r151l3237J4924K8332L5272n50j929K9396J7380j9228k3702j5222
$$ plain form
4573 -56146 -49702 -38546 -39473 -16446 -5531 1170 14854 22891 36729 42395 1103 -51288 -59830
4560 -59830 -46961 -42085 -29104 -16201 15955 17384 8995 5301 4935 11399 23078 496 -30526
4547 -30526 -4635 -2064 4513 10997 14675 -14992 -17741 -4265 -4227 -12671 -19667 -24012 -31390 -24532
4533 -24532 -26988 -17673 -18774 -16793 -6604 12836 51288 24273 -22364 -19784 -33968 -67617 -36275
4520 -36275 -426 -4103 12228 20817 -24241 -16759 -15765 -16309 -6772 -10994 -8 -20368 -46607 -34142
4506 -34142 -394 19398 22710 6698 -5906 710 11308 -8432 -25487 2900 -9369 -36191
4494 -36191 -42996 -41902 -51180 -40265 -51017 -49860 -50354 -56466 -17833 18079 22616 10096 7224 5039
4480 5039 -9259 -18410 -51647 -36723 -8391 26881 26331 24402 53798 71178 51950 28248 13026
4467A3026k9297K748K3244O475R213j5057R242m79J9032Q573m9068k4171J1288
4454a5231J6279K0267N910k1370j3171j4528J6103j8520K0683J6370L1226p705
4442C6313j3525k0973N378j7429J9665M641k1571n030k0289M6208K1310k5016
4430I682n569J3216p65K6753q693j4731m439l0954L057j8658M402M81L9439K3104
4416C6325j6539k1928j6834m478J6180L1515P843L382J657k0351K3117K4692l2462
$$ plain form
4467 13026 -16271 -13523 9721 16196 25409 10352 19594 19115 38147 46720 -2348 -26519 -15231
4454 -15231 1048 21315 27225 5855 -7316 -21844 -5741 -24261 -3578 12792 44018 36313
4442 36313 22788 1815 7193 -10236 9429 14070 -7501 -12531 -32820 13388 34698 9682
4430 9682 4113 17329 16564 43317 34624 19893 15454 -15500 -12443 -31101 -26699 -26218 13221 36325
4416 36325 19786 -2142 -18976 -23454 -7274 24241 32084 35466 37123 16772 39889 64581 32119
$$ [...]
##END NTUPLES=NMR SPECTRUM
##END=
