##TITLE=Analysis number 323817
Compound Code cc 50501
Book Reference 451/177
Project Code adrs
Chemist Name evam
##JCAMPDX= 6.0         $$ Bruker NMR JCAMP-DX V2.0
##DATA TYPE= NMR SPECTRUM
##DATA CLASS= NTUPLES
##ORIGIN= Bruker BioSpin GmbH
##OWNER= nmr
$$ XWIN-NMR		Version 3.5
$$ Thu Nov  9 11:46:20 2006 GMT Standard Time (UT+0h)  MAYBRIDGE\nmr@NMR_250MHZ
##.OBSERVE FREQUENCY= 250.131544655141
##.OBSERVE NUCLEUS= ^1H
##.ACQUISITION MODE= SIMULTANEOUS (DQD)
##.ACQUISITION SCHEME= undefined
##.AVERAGES= 16
##.DIGITISER RES= 18
##SPECTROMETER/DATA SYSTEM= dpx250
##.PULSE SEQUENCE= zg30
##.SOLVENT NAME= DMSO
##.SHIFT REFERENCE= (INTERNAL, DMSO, 0, 16.522)
##AUDIT TRAIL= $$ (NUMBER, WHEN, WHO, WHERE, WHAT)
$$ ##TITLE= Audit trail, XWIN-NMR		Version 3.5
$$ ##JCAMPDX= 5.01
$$ ##ORIGIN= Bruker BioSpin GmbH
$$ ##OWNER= nmr
$$ C:\u/data/dgb/nmr/ADRS/2520/pdata/1/auditp.txt
$$ ##AUDIT TRAIL=  $$ (NUMBER, WHEN, WHO, WHERE, WHAT)
(   1,<2006-11-09 11:45:27.44 +000>,<MAYBRIDGE\nmr>,<NMR_250MHZ>,
      <created by zg, POWCHK disabled, PULCHK disabled
       configuration hash MD5:
       49 4B E0 1D 92 C2 6B 37 9F E6 65 BC 52 41 86 1D
       data hash MD5: 64K
       B1 45 BB 29 36 CD 30 54 47 D6 9C 26 99 A1 18 DD>)
(   2,<2006-11-09 11:45:58.05 +000>,<MAYBRIDGE\nmr>,<NMR_250MHZ>,
      <Start of raw data processing
       ef LB = 0.3 FT_mod = 6 PKNL = 1 SI = 32K 
       data hash MD5: 32K
       14 34 82 02 AE 02 CC 52 EC C6 F2 94 EB 17 94 80>)
(   3,<2006-11-09 11:46:02.07 +000>,<MAYBRIDGE\nmr>,<NMR_250MHZ>,
      <apk 
       data hash MD5: 32K
       F7 38 BA 85 D8 53 FF 9E C9 8D CA 47 C0 9C 1F 49>)
(   4,<2006-11-09 11:46:03.51 +000>,<MAYBRIDGE\nmr>,<NMR_250MHZ>,
      <abs ABSG = 5 
       data hash MD5: 32K
       D9 B0 81 56 81 C5 C8 E9 3D 83 BC 5E A5 EA A8 A7>)
$$ ##END=
$$ 
$$ hash MD5
$$ 6B FB CC 8F A6 D0 C1 E2 0C 29 7B A6 2A 20 00 0E
##$RELAX= 
##$RELAX= 
##$RELAX= 
##$RELAX= 
##$RELAX= 
##$RELAX= 
##$RELAX= 
$$ Bruker specific parameters
$$ --------------------------
##$DU= <C:\u>
##$EXPNO= 2520
##$NAME= <ADRS>
##$PROCNO= 1
##$TYPE= <nmr>
##$USER= <dgb>
##$AMP= (0..31)
100 100 100 100 100 100 100 100 100 100 100 100 100 100 100 100 100 100 
100 100 100 100 100 100 100 100 100 100 100 100 100 100 
##$AQSEQ= 0
##$AQ_mod= 3
##$AUNM= <au_zg>
##$AUTOPOS= <24 >
##$BF1= 250.13
##$BF2= 250.13
##$BF3= 250.13
##$BF4= 250.13
##$BF5= 500.13
##$BF6= 500.13
##$BF7= 500.13
##$BF8= 500.13
##$BYTORDA= 1
##$CFDGTYP= 0
##$CFRGTYP= 5
##$CHEMSTR= <none>
##$CNST= (0..31)
1 1 145 1 1 1 1 1 1 1 1 1 1 1 1 1 1 1 1 1 1 1 1 1 1 1 1 1 1 1 1 1 
##$CPDPRG= <>
##$CPDPRG1= <>
##$CPDPRG2= <>
##$CPDPRG3= <>
##$CPDPRG4= <mlev>
##$CPDPRG5= <mlev>
##$CPDPRG6= <mlev>
##$CPDPRG7= <mlev>
##$CPDPRG8= <mlev>
##$CPDPRGB= <>
##$CPDPRGT= <>
##$D= (0..31)
0 1 0 0 0 0 0 0 0 0.06 0 0 0 0 0 0 0.0002 0 0 0 0 0 0 0 0 0 0 0 0 0 0 
0 
##$DATE= 1163072721
##$DBL= (0..7)
120 120 120 120 120 120 120 120 
##$DBP= (0..7)
150 150 150 150 150 150 150 150 
##$DBP07= 0
##$DBPNAM0= <>
##$DBPNAM1= <>
$$ [...]
##$SUBNAM7= <"">
##$SUBNAM8= <"">
##$SUBNAM9= <"">
##$SW= 20.6930455092707
##$SWIBOX= (0..15)
0 0 3 0 0 0 0 0 0 0 0 0 0 0 0 0 
##$SW_h= 5175.983436853
##$TD= 65536
##$TD0= 1
##$TE= 683.16
##$TE2= 300
##$TE3= 300
##$TEG= 300
##$TL= (0..7)
0 120 120 120 120 120 120 120 
##$TP= (0..7)
150 150 150 150 150 150 150 150 
##$TP07= 0
##$TPNAME0= <>
##$TPNAME1= <>
##$TPNAME2= <>
##$TPNAME3= <>
##$TPNAME4= <>
##$TPNAME5= <>
##$TPNAME6= <>
##$TPNAME7= <>
##$TPOAL= (0..7)
0.5 0.5 0.5 0.5 0.5 0.5 0.5 0.5 
##$TPOFFS= (0..7)
0 0 0 0 0 0 0 0 
##$TUNHIN= 0
##$TUNHOUT= 0
##$TUNXOUT= 0
##$USERA1= <user>
##$USERA2= <user>
##$USERA3= <user>
##$USERA4= <user>
##$USERA5= <user>
##$V9= 5
##$VALIST= <valist>
##$VCLIST= <CCCCCCCCCCCCCCC>
##$VD= 0
##$VDLIST= <DDDDDDDDDDDDDDD>
##$VPLIST= <PPPPPPPPPPPPPPP>
##$VTLIST= <TTTTTTTTTTTTTTT>
##$WBST= 1024
##$WBSW= 4
##$XGAIN= (0..3)
0 0 0 0 
##$XL= 0
##$YL= 0
##$YMAX_a= 353779
##$YMIN_a= -333687
##$ZGOPTNS= <>
##$ZL1= 120
##$ZL2= 120
##$ZL3= 120
##$ZL4= 120
##$ABSF1= 16.522
##$ABSF2= -4.171173
##$ABSG= 5
##$ABSL= 3
##$ALPHA= 0
##$AQORDER= 0
##$ASSFAC= 0
##$ASSFACI= 0
##$ASSFACX= 0
##$ASSWID= 0
##$AUNMP= <proc_1d>
##$AZFE= 0.1
##$AZFW= 0.1
##$BCFW= 0
##$BC_mod= 0
##$BYTORDP= 0
##$COROFFS= 0
##$CY= 12.5
##$DATMOD= 1
##$DC= 0
##$DFILT= <>
##$DTYPP= 0
##$F1P= 14.0000005364418
##$F2P= -0.99999901652339
##$FCOR= 0.5
##$FTSIZE= 32768
##$FT_mod= 6
##$GAMMA= 0
##$GB= 0
##$INTBC= 1
##$INTSCL= 1
##$ISEN= 128
##$LB= 0.3
##$LEV0= 0
##$LPBIN= 0
##$MAXI= 10000
##$MC2= 0
##$MEAN= 0
##$ME_mod= 0
##$MI= 0
##$NCOEF= 0
##$NC_proc= -6
##$NLEV= 6
##$NOISF1= 0
##$NOISF2= 0
##$NSP= 0
##$NTH_PI= 0
##$NZP= 0
##$OFFSET= 16.522
##$PC= 1
##$PHC0= -55.369
##$PHC1= 21.16283
##$PH_mod= 1
##$PKNL= yes
##$PPARMOD= 0
##$PSCAL= 4
##$PSIGN= 0
##$REVERSE= no
##$SF= 250.13
##$SI= 32768
##$SIGF1= 0
##$SIGF2= 0
##$SINO= 400
##$SIOLD= 32768
##$SREGLST= <1H.DMSO>
##$SSB= 0
##$STSI= 32768
##$STSR= 0
##$SW_p= 5175.98343685301
##$SYMM= 0
##$S_DEV= 0
##$TDeff= 65536
##$TDoff= 0
##$TI= <Analysis number 999999
Compound Code 99
Book Reference 9
Project Code 9>
##$TILT= no
##$TM1= 0
##$TM2= 0
##$TOPLEV= 0
##$USERP1= <user>
##$USERP2= <user>
##$USERP3= <user>
##$USERP4= <user>
##$USERP5= <user>
##$WDW= 1
##$XDIM= 32768
##$YMAX_p= 442223551
##$YMIN_p= -1387985
$$ End of Bruker specific parameters
$$ ---------------------------------
##NTUPLES= NMR SPECTRUM
##VAR_NAME=  FREQUENCY,     SPECTRUM/REAL,   SPECTRUM/IMAG
##SYMBOL=    X,             R,               I
##VAR_TYPE=  INDEPENDENT,   DEPENDENT,       DEPENDENT
##VAR_FORM=  AFFN,          ASDF,            ASDF
##VAR_DIM=   32768,         32768,           32768
##UNITS=     HZ,            ARBITRARY UNITS, ARBITRARY UNITS
##FACTOR=    0.157963299565203, 1,           1
##FIRST=     4132.6476996994, 0,             0
##LAST=      -1043.33573715361, 0,           0
##MIN=       -1043.33573715361, -1387985,    0
##MAX=       4132.6476996994, 442223551,     0
$$ Real data points
##PAGE= N=1
##DATA TABLE= (X++(R..R)), XYDATA
$$ [...]
$$ plain form
15285 355746 -135120 -104830 -11900 -69512 -181565 -191934 62443 586091 462493 90321
15275 90321 -7717 -49322 126694 317543 824762 630567 190941 250342 508609 355320
15265 355320 356443 563829 568788 962286 1200692 1272464 967106 481535 345776 613038
15255 613038 695825 281898 177680 422941 738230 452652 319627 286943 342849 294667
15245 294667 348652 449364 664802 389014 451136 228079 398361 480439 259514 243015
15235 243015 199532 -27437 -103765 -166035 -35471 -69814 -38244 112437 358802 635698
15225 635698 502552 481336 724188 913186 511162 -11622 36266 129653 300697 299140
15215 299140 461218 350884 -56895 72562 333347 579050 501743 595337 805282 518601
$$ packed form
15285C55746m90866L0290R2930n7612j12053j0369K54377N23648j23598l72172
15275I0321r8038m1605J76016J90849N07219j94195m39626N9401K58267j53289
15265C55320J123K07386M959L93498K38406P1772l05358m85571j35759K67262
15255F13038Q2787m13927j04218K45261L15289k85578j33025l2684N5906m8182
15245B94667N3985J00712K15438k75788O2122k23057J70282Q2078k20925j6499
15235B43015m3483k26969p6328o2270J30564l4343L1570J50681K46365K76896
15225F35698j33146k1216K42852J88998m02024n22784M7888R3387J71044j557
15215B99140J62078j10334m07779J29457K60785K45703p7307R3594K09945k86681
$$ plain form
15205 518601 215824 395980 374932 485759 139371 19428 -133154 -114038 -25185 96244
15195 96244 326492 645052 941758 988372 593804 442933 383588 633760 881176 457927
15185 457927 286523 304699 468341 626317 595010 118845 -207221 15572 170359 195237
15175 195237 321196 527192 773651 1162908 910297 372296 477502 844388 616423 223290
15165 223290 82149 42088 308585 235844 358595 438322 400046 280209 131363 379004
15155 379004 731378 680252 731643 469614 339069 566952 753807 694461 665179 390540
15145 390540 -82395 -146201 -106337 77762 112723 -1444 -394755 -81286 -72391 -178205
15135 -178205 35786 604165 727746 912550 748812 598012 387811 28407 128204 175734
$$ packed form
15205E18601l02777J80156k1048J10827l46388j19943j52582J9116Q8853J21429
15195I6244K30248L18560K96706M6614l94568j50871n9345K50172K47416m23249
15185D57927j71404J8176J63642J57976l1307m76165l26066K22793J54787K4878
15175A95237J25959K05996K46459L89257k52611n38001J05206L66886k27965l93133
15165B23290j41141m0061K66497p2741J22751P9727l8276j19837j48846K47641
15155C79004L52374n1126N1391k62029j30545K27883J86855n9346k9282k74639
15145C90540m72935o3806L9864J84099L4961j14167l93311L13469Q895j05814
15135a78205K13991N68379J23581J84804j63738j50800k10201l59404R9797M7530
$$ plain form
15125 175734 165853 164121 597059 653085 212859 55430 367822 704525 771240 803102 850380
15114 850380 409734 151383 388964 642450 597406 583051 356863 128490 -181664 242810
15104 242810 657242 938887 1087972 1227540 991611 812909 562475 637748 836453 525623
15094 525623 264907 279289 368461 380004 425526 267969 380945 892700 597434 479350
15084 479350 290991 365618 411651 364807 229003 53550 137613 455599 451479 286975 220138
15073 220138 148068 66797 415376 443327 628170 507103 464755 382075 261763 226910 113260
15062 113260 77905 365411 432629 516741 908250 1099188 1106199 1064362 848838 640132 538796
15051 538796 635770 707023 637682 545595 465288 691592 820116 656348 926003 1110531
$$ packed form
15125A75734r881j732M32938N6026m40226j57429L12392L36703O6715L1862M7278
15114H50380m40646k58351K37581K53486m5044j4355k26188k28373l10154M24474
15104B42810M14432K81645J49085J39568k35929j78702k50434P5273J98705l10830
15094E25623k60716J4382Q9172J1543M5522j57557J12976N11755k95266j18084
15084D79350j88359P4627M6033m6844j35804j75453Q4063L17986m120j64504o6837
15073B20138p2070q1271L48579K7951J84843j21067m2348q2680j20312l4853j13650
15062A13260l5355K87506O7218Q4112L91509J90938P011m1837k15524k08706j01336
15051E38796R6974P1253o9341r2087q0307K26304J28524j63768K69655J84528
$$ plain form
15041 1110531 1243917 1176303 1026755 691400 421915 -27988 30572 -55418 99631 397172
15031 397172 363888 470664 722341 807438 823262 860010 876103 695319 329257 795240
15021 795240 516022 552236 692668 613288 499112 714759 1053420 1125466 1121701 825496
15011 825496 836695 974667 898065 595081 651412 787863 991494 880178 821470 844598
15001 844598 816836 537102 261801 525676 1139274 1254644 1121260 951725 1026800 1019173
14991 1019173 1136342 1081410 984742 857365 1153259 1218356 988132 778517 830338 1132827
14981 1132827 1057272 484977 628410 761844 757730 713789 733796 290519 61723 345887
14971 345887 366753 253285 702738 566832 301762 594068 739627 640458 809163 838281
$$ packed form
15041A110531J33386o7614j49548l35355k69485m49903N8560q5990J55049K97541
15031C97172l3284J06776K51677Q5097J5824L6748J6093j80784l66062M65983
15021G95240k79218L6214J40432p9380j14176K15647L38661P2046l765k96205
15011H25496J1199J37972p6602l02984N6331J36451K03631j11316n8708K3128
15001H44598k7762k79734k75301K63875O13598J15370j33384j69535P5075p627
14991A019173J17169n4932r6668j27377K95894O5097k30224k09615N1821L02489
14981A132827p5555n72295J43433J33434m114m3941K0007m43277k28796K84164
14971C45887K0866j13468M49453j35906k65070K92306J45559r9169J68705K9118
$$ plain form
14961 838281 792156 1052856 1007217 752282 673311 593854 250835 74566 525981 681802
14951 681802 475262 366775 388510 414184 292056 172129 183372 514961 496672 318014
14941 318014 152278 -73652 419890 715926 652480 541521 586487 539725 979625 1059637
14931 1059637 985628 720877 862864 607816 760123 980217 964357 763024 878524 668154
14921 668154 675575 856359 630034 441896 624798 669320 384543 224839 323964 21577
14911 21577 -140703 -12208 -6569 138664 131244 108796 174591 152324 485618 869294 871704
14900 871704 557906 660365 909996 932147 859303 838853 618792 729400 938971 1020774
14890 1020774 702118 309496 179942 333878 549387 639116 546281 362412 608352 914210
$$ packed form
14961H38281m6125K60700m5639k54935p8971p9457l43019j76269M51415J55821
14951F81802k06540j08487K1735K5674j22128j19927J1243L31589j8289j78658
14941C18014j65736k25930M93542K96036o3446j10959M4966m6762M39900Q0012
14931A059637p4009k64751J41987k55048J52307K20094j5860k01333J15500k10370
14921F68154P421J80784k26325j88138J82902M4522k84777j59704R9125l02387
14911B1577j62280J28495N639J45233p420k2448O5795k2267L33294L83676K410
14900H71704l13798J02459K49631K2151p2844k0450k20061J10608K09571Q1803
14890A020774l18656l92622j29554J53936K15509Q9729r2835j83869K45940L05858
$$ plain form
14880 914210 1157469 1056851 756834 626416 398145 391910 459133 527941 595482 951957
14870 951957 988514 900284 804385 887426 639690 877372 1115848 893126 990408 1115022
14860 1115022 901907 622051 508274 791674 1074931 1177707 907526 675196 742037 690591
14850 690591 726892 683848 611833 451961 306850 427588 778543 679030 843692 855873
14840 855873 786384 1095944 1347178 1186168 1015377 862988 760615 450496 480410 595993
14830 595993 375116 378994 214084 280189 612807 1221168 1043894 1183890 1335588 1440010
14820 1440010 1274329 720867 721143 993784 905031 1367887 1584296 1534115 1238836 1104437
14810 1104437 1030309 913711 840421 956407 1001865 1026921 971818 1020096 870774 590352
$$ packed form
14880I14210K43259j00618l00017j30418k28271o235O7223O8808O7541L56475
14870I51957L6557q8230r5899Q3041k47736K37682K38476k22722R7282J24614
14860A115022k13115k79856j13777K83400K83257J02776k70181k32330O6841n1446
14850F90591L6301m3044p2015j59872j45111J20738L50955r9513J64662J2181
14840H55873o9489L09560K51234j61010j70791j52389j02373l10119K9914J15583
14830E95993k20877L878j64910O6105L32618O08361j77274J39996J51698J04422
14820A440010j65681n53462K76K72641q8753M62856K16409n0181k95279j34399
14810A104437p4128j16598p3290J15986M5458K5056n5103M8278j49322k80422
$$ plain form
14800 590352 1089687 1417527 1388281 1382372 1163836 913148 952021 1281995 904384 979346
14790 979346 1029587 866900 843680 805252 857922 967903 989488 1085116 1314262 1261828 1390568
14779 1390568 1200661 934564 1172281 1289167 1507073 1477761 606232 641956 878203 914986
14769 914986 718749 633765 595489 746112 504324 562324 703005 1017617 1231685 1319266
14759 1319266 1142754 1225644 1250277 962239 980820 1155304 985572 1000986 780651 756476
14749 756476 804665 440009 312404 656821 799833 1197221 1428110 1301632 1108237 1303169
14739 1303169 1145985 1116619 1294248 1326764 1062543 785353 867102 694609 706041 780503
14729 780503 872123 709609 975266 885431 761538 1263446 1475583 1000444 867894 1176695
$$ packed form
14800E90352M99335L27840k9246n909k18536k50688L8873L29974l77611P4962
14790I79346N0241j62687k3220l8428N2670J09981K1585R5628K29146n2434J28740
14779A390568j89907k66097K37717J16886K17906k9312q71529L5724K36247L6783
14769I14986j96237q4984l8276J50623k41788N8000J40681L14612K14068Q7581
14759A319266j76512Q2890K4633k88038J8581J74484j69732J5414k20335k4175
14749G56476M8189l64656j27605L44417J43012L97388K30889j26478j93395J94932
14739A303169j57184k9366J77629L2516k64221k77190Q1749j72493J1432P4462
14729G80503R1620j62514K65657q9835j23893N01908K12137m75139j32550L08801
$$ plain form
14719 1176695 1161621 1170263 1099347 944465 997794 1440366 1288315 986072 1254807 1256571 1159518
14708 1159518 1388154 1103127 883376 759567 808666 954724 884119 858078 699913 972784
14698 972784 1279353 1039879 1128040 1629008 1515436 1226271 1042255 1047448 1171920 1043003
14688 1043003 1253517 1396438 1052710 1025190 936509 1104305 1216104 1223254 1170902 1314460
14678 1314460 1708849 1539592 1472029 1240933 892395 801177 632878 685067 1009838 1265182
14668 1265182 1186211 1096070 793139 504785 741932 683238 624030 1057977 638130 652805
14658 652805 1423304 1460822 1238731 1023567 1239436 989923 915673 791570 931399 822015
14648 822015 885975 884960 769723 808279 456899 464639 385782 209523 323297 386204 512982
$$ packed form
14719A176695j5074Q642p0916j54882N3329M42572j52051l02243K68735J764r7053
14708A159518K28636k85027k19751j23809M9099J46058p0605k6041j58165K72871
14698I72784L06569k39474Q8161N00968j13572k89165j84016N193J24472j28917
14688A043003K10514J42921l43728k7520q8681J67796J11799P150n2352J43558
14678A314460L94389j69257o7563k31096l48538r1218j68299N2189L24771K55344
14668A265182p8971r0141l02931k88354K37147n8694n9208M33947m19847J4675
14658F52805P70499L7518k22091k15164K15869k49513p4250j24103J39829j09384
14648H22015O3960j015j15237L8556l51380P740p8857j76259J13774O2907J26778
$$ plain form
14637 512982 601833 814110 1110888 1146982 1270629 1587775 1358953 848959 599961 626064
14627 626064 801349 912680 658341 826016 979572 918976 785624 1011801 1592657 1886137
14617 1886137 2230259 2060712 1827018 1508239 1287593 1114640 1140586 1214405 1210425 1569591
14607 1569591 1833206 1895775 1958271 1852747 1613262 1315776 1107166 1120350 1214120 1558864
14597 1558864 1409055 1056876 957098 905407 900405 923221 1052901 1006929 1056982 1018722 948695
14586 948695 854969 1134213 1337195 1315448 1352244 1409132 1985053 1905174 1810446 1951023 1868058
14575 1868058 1462717 1403702 1430987 1352663 1428499 1651168 1791339 1687981 1808639 1582447
14565 1582447 1611023 1935394 1789577 1465269 1460506 1544762 1632545 1480883 1576762 1394403
$$ packed form
14637E12982Q8851K12277K96778L6094J23647L17146k28822n09994k48998K6103
14627F26064J75285J11331k54339J67675J53556o0596j33352K26177N80856K93480
14617A886137L44122j69547k33694l18779k20646j72953K5946P3819l980L59166
14607A569591K63615O2569O2496j05524k39485k97486k08610J3184R3770L44744
14597A558864j49809l52179r9778n1691n002K2816J29680m5972N0053l8260p0027
14586I48695r3726K79244K02982k1747L6796N6888N75921p9879r4728J40577q2965
14575A868058m05341n9015K7285p8324P5836K22669J40171j03358J20658k26192
14565A582447K8576L24371j45817l24308m763Q4256Q7783j51662R5879j82359
$$ plain form
14555 1394403 1001661 1048525 1179747 1287186 1504740 1312360 994741 996555 1204065 1160112
14545 1160112 1166586 1344984 1538524 1595517 1547197 1734310 1589213 1007900 956615 1528685
14535 1528685 1640469 1443376 1194336 1066204 962520 1108480 1241695 997402 879540
14526 879540 990693 1198591 1287712 1656421 1526293 1292373 1040043 1174265 1350314 1631417
14516 1631417 1795517 1634873 1518782 1383364 1232685 929203 785564 916133 934693 693657
14506 693657 1013527 1570203 1290907 1234224 1143904 1216901 1144613 1091781 981593 1311853
14496 1311853 1579961 1514431 1425987 1457538 1267875 941049 1357789 1579780 1473091 1307800
14486 1307800 1479781 1543325 1501416 1631234 1820632 1631236 1280539 1421484 1352912 1368688
$$ packed form
14555A394403l92742M6864J31222J07439K17554j92380l17619J814K07510m3953
14545A160112O474J78398J93540N6993m8320J87113j45097n81313n1285N72070
14535A528685J11784j97093k49040j28132j03684J45960J33215k44293j17862
14526H79540J11153K07898Q9121L68709j30128k33920k52330J34222J76049K81103
14516A631417J64100j60644j16091j35418j50679l03482j43639J30569J8560k41036
14506F93657L19870N56676k79296n6683r0320P2997p2288n2832j10188L30260
14496A311853K68108o5530q8444L1551j89663l26826M16740K21991j06689j65291
14486A307800J71981O3544m1909J29818J89398j89396l50697J40945o8572J5776
$$ plain form
14476 1368688 1242762 1126831 1194105 1301123 1368186 1628796 1799831 1676208 1402162 1413490
14466 1413490 996292 898790 934847 1276428 1297866 1402891 1470686 1274178 1360539 1408921
14456 1408921 1377204 1277558 1558788 1421464 1231091 1206694 1386352 1694899 1647339 1768628
14446 1768628 1810624 1675074 1503427 1385774 1505307 1285683 1220559 1659523 1511428 935971
14436 935971 972607 1433853 1556682 1495131 1545311 1373151 1009037 1306328 1691741 1586490
14426 1586490 1480698 1351789 1541328 1705356 1677270 1478428 1424313 1529251 1984503 2124381
14416 2124381 1873333 1657400 1350625 1125948 1355858 1838611 1994113 1792486 1793139 1877296
14406 1877296 1715271 1612322 1457176 1057088 804710 684579 853643 917875 1168890 1321765
$$ packed form
14476A368688j25926j15931O7274J07018O7063K60610J71035j23623k74046J1328
14466A413490m17198r7502L6057L41581K1438J05025O7795j96508Q6361M8382
14456A408921l1717r9646K81230j37324j90373k4397J79658L08547m7560J21289
14446A768628M1996j35550j71647j17653J19533k19624o5124M38964j48095n75457
14436I35971L6636M61246J22829o1551N0180j72160l64114K97291L85413j05251
14426A586490j05792j28909J89539J64028k8086j98842n4115J04938M55252J39878
14416B124381k51048k15933l06775k24677K29910M82753J55502k01627O53Q4157
14406A877296j62025j02949j55146m00088k52378j20131J69064O4232K51015J52875
$$ plain form
14396 1321765 1612262 2015062 2129593 1968413 1844258 1591381 1517905 1502113 1370431 1546432
14386 1546432 1724748 1822664 1646582 1646493 1431258 1551528 1625046 1439142 1353122 1717005 1804298
14375 1804298 1651321 1695941 1859834 1942755 2002162 2088295 1969582 1525191 1293551 1621178
14365 1621178 1888264 2060616 1870667 1656268 1612645 1714155 1590467 1547025 1630214 1576648
14355 1576648 1505111 1614813 1556487 1557939 1529088 1503355 1395722 1345926 1593908 1763633 2124975
14344 2124975 2096911 1951707 1545642 1334188 1090268 1468657 1408035 1391709 1496630 1396167
14334 1396167 1865538 2030782 2076004 2007499 2115462 1985753 1989172 1865982 2135871 2217092
14324 2217092 2307137 2293825 1871588 1836024 2031902 2056618 2277307 2223377 2121215 2195024
$$ packed form
14396A321765K90497M02800J14531j61180j24155k52877p3476j5792j31682J76001
14386A546432J78316R7916j76082q9k15235J20270P3518j85904q6020L63883Q7293
14375A804298j52977M4620J63893Q2921N9407Q6133j18713m44391k31640L27627
14365A621178K67086J72352j89949k14399m3623J01510j23688m3442Q3189n3566
14355A576648p1537J09702n8326J452k8851k5733j07633m9796K47982J69725L61342
14344B124975k8064j45204m06065k11454k43920L78389o0622j6326J04921j00463
14334A396167M69371J65244M5222o8505J07963j29709L419j23190K69889Q1221
14324B217092R0045j3312m22237l5564J95878K4716K20689n3930j02162P3809
$$ plain form
14314 2195024 2210917 2166013 1941329 1660877 1875428 1723290 1803514 1701312 1905682 1903239
14304 1903239 1632821 1552247 1745922 2053952 1865351 1633609 1720700 1785039 1756105 1905726
14294 1905726 2117283 2274611 2248003 2363966 2326677 2391325 2614399 2637534 2545107 2282932
14284 2282932 2003708 1810656 1882325 1564325 1488563 1559947 1783725 2029255 2122524 2140527
14274 2140527 2060899 2140844 2377158 2400302 2599355 2494563 2593447 2830709 2753439 2196967
14264 2196967 2010941 2170679 2299112 2301422 2531269 2404106 2106437 1913196 2083914 2348490
14254 2348490 2472295 2661716 2697606 2395681 2241341 1839925 1529962 1518194 1847373 1779509
14244 1779509 1967906 2230456 2284827 2275810 2324905 2425986 2393430 2382203 2391748 2542842 2587782
$$ packed form
14314B195024J5893m4904k24684k80452K14551j52138Q0224j02202K04370k443
14304A903239k70418q0574J93675L08030j88601k31742Q7091O4339k8934J49621
14294A905726K11557J57328k6608J15963l7289O4648K23074K3135r2427k62175
14284B282932k79224j93052P1669l18000p5762P1384K23778K45530R3269J8003
14274B140527p9628P9945K36314K3144J99053j04792R8884K37262p7270n56472
14264B196967j86026J59738J28433K310K29847j27163k97669j93241J70718K64576
14254B348490J23805J89421L5890l01925j54340m01416l09963j1768L29179o7864
14244A779509J88397K62550N4371r017M9095J01081l2556j1227R545J51094M4940
$$ plain form
14233 2587782 2487506 2190087 2245838 2138183 1889437 1738829 2005029 2108593 2394847 2679668
14223 2679668 2853523 2734813 2314349 2184237 2255775 2396250 2202136 2410627 2344953 2423967
14213 2423967 2244406 2004936 2219861 2617371 2454597 2146672 2121430 2275147 2182350 2345186
14203 2345186 2291791 2335435 2552708 2521934 2451366 2599081 2706999 2389495 2409011 2129294
14193 2129294 1895677 2415796 2582109 2631832 2779573 2671366 2512447 2680110 2799330 2608721
14183 2608721 2155337 2404489 2361656 2341508 2332567 2441244 2594969 2548670 2195877 2008295
14173 2008295 2143535 2178996 2219532 1971978 1938807 2291635 2341780 2366578 2407839 2526722
14163 2526722 2395228 2460911 2888941 2910868 2716123 2824048 2812428 2851905 2643973 2567902
$$ packed form
14233B587782j00276k97419N5751j07655k48746j50608K66200J03564K86254K84821
14223B679668J73855j18710m20464j30112P1538J40475j94114K08491o5674P9014
14213B423967j79561k39470K14925L97510j62774l07925k5242J53717r2797J62836
14203B345186n3395M3644K17273l0774p0568J47715J07918l17504J9516k79717
14193B129294k33617N20119J66313M9723J47741j08207j58919J67663J19220j90609
14183B608721m53384K49152m2833k0148q941J08677J53725m6299l52793j87582
14173B008295J35240L5461M0536k47554l3171L52828N0145K4798M1261J18883
14163B526722j31494O5683M28030K1927j94745J07925j1620L9477k07932p6071
$$ plain form
14153 2567902 2667823 2616032 2474443 2322457 2360136 2808318 2936064 2600714 2517973 2331525
14143 2331525 2276781 2165226 2363820 2689906 2831895 2942175 2810520 2632417 2492426 2502677
14133 2502677 2794302 2891115 2684246 2682292 2806943 2980916 2756718 2592424 2460437 2633091
14123 2633091 2846521 2783856 2453226 2532726 2616099 2613293 2923738 3244288 2977899 2635019
14113 2635019 2508535 2695940 2833215 2725078 2700031 2824538 2806496 2558867 2706334 2664969
14103 2664969 2616618 2449116 2691773 2925920 3010481 2829112 2815856 3027111 3124612 3294228
14093 3294228 3165882 3140254 3114574 3045391 3112914 3081866 3415903 3497814 3510558 3821987 3428525
14082 3428525 3192742 2989197 3257432 3278794 3464597 3159521 2932570 2979390 2771860 2593338
$$ packed form
14153B567902R9921n1791j41589j51986L7679M48182J27746l35350q2741j86448
14143B331525n4744j11555J98594L26086J41989J10280j31655j78103j39991J0251
14133B502677K91625R6813k06869j954J24651J73973k24198j64294j31987J72654
14123B633091K13430o2665l30630P9500Q3373k806L10445L20550k66389l42880
14113B635019j26484J87405J37275j08137k5047J24507j8042k47629J47467m1365
14103B664969m8351j67502K42657K34147Q4561j81369j3256K11255R7501J69616
14093C294228j28346k5628k5680o9183O7523l1048L34037Q1911J2744L11429l93462
14082C428525k35783k03545K68235K1362J85803l05076k26951M6820k07530j78522
$$ plain form
14072 2593338 3007333 3320973 3377977 3485363 3577669 3733349 3639613 3565670 3678713 3561032
14062 3561032 3620984 3763628 3908495 3967318 3592797 3334654 3271326 3393831 3396794 3417651
14052 3417651 3459199 3392490 3093109 3343385 3268106 2888166 2887014 2979747 3314360 3212760
14042 3212760 2806169 2806373 3264574 3407299 3315069 3392306 3525777 3354335 3195087 3224077
14032 3224077 3278323 3513176 3408329 3248080 3324632 3487263 3576685 3624688 3716010 3704924
14022 3704924 3452819 3487066 3415750 3342174 3377924 3261037 3435691 3696056 3521358 3643464
14012 3643464 3744446 3296870 3183684 3214998 3280017 3491196 3608975 3337722 3399849 3566054
14002 3566054 3865609 4106627 3954975 3832048 3779282 3947653 4237126 4232402 3471073 2866706
$$ packed form
14072B593338M13995L13640N7004J07386R2306J55680r3736p3943J13043j17681
14062C561032N9952J42644J44867N8823l74521k58143o3328J22505K963K0857
14052C417651M1548o6709k99381K50276p5279l79940j152R2733L34613j01600
14042C212760m06591K04M58201J42725r2230P7237J33471j71442j59248K8990
14032C224077N4246K34853j04847j60249P6552J62631Q9422M8003R1322j1086
14022C704924k52105L4247p1316p3576L5750j16887J74654K60365j74698J22106
14012C643464J00982m47576j13186L1314O5019K11179J17779k71253O2127J66205
14002C566054K99555K41018j51652j22927n2766J68371K89473m724p61329o04367
$$ plain form
13992 2866706 2878216 3250979 3500479 3304359 3278812 3666382 3596830 3639754 3571131 3693627
13982 3693627 3874057 3892769 4061004 4224954 4156225 3904218 3718556 3941217 4207365 4289846
13972 4289846 4039842 3990563 3980654 4011365 3886270 3493815 3404343 3187886 3104460 3455680
13962 3455680 3742833 3706753 3895035 4106563 3957706 4066210 4250021 4084579 3814241 3478571
13952 3478571 3525667 3627235 3619278 3673515 3820992 4100473 4280466 4169161 3834041 3740771
13942 3740771 3918075 3975354 4237276 4302060 4196601 4433902 4906569 4790374 4267235 4121308
13932 4121308 4333475 4549161 4427908 4284115 4227726 4188082 4444149 4412748 4304778 3970745
13922 3970745 3814890 4019270 4062911 4144703 4085722 4241004 4632875 4585397 4476599 4454146
$$ packed form
13992B866706J1510L72763K49500j96120k5547L87570o9552M2924o8623J22496
13982C693627J80430J8712J68235J63950o8729k52007j85662K22661K66148Q2481
13972D289846k50004m9279r909L0711j25095l92455q9472k16457q3426L51220
13962C455680K87153l6080J88282K11528j48857J08504J83811j65442k70338l35670
13952C478571M7096J01568p957N4237J47477K79481J79993j11305l35120r3270
13942C740771J77304N7279K61922O4784j05459K37301M72667j16195n23139j45927
13932D121308K12167K15686j21253j43793n6389l9644K56067l1401j07970l34033
13922C970745j55855K04380M3641Q1792n8981J55282L91871m7478j08798k2453
$$ plain form
13912 4454146 4400396 4562789 4586759 4269325 4248842 4436643 4781111 4674167 4285103 4292801
13902 4292801 4323999 4142807 3995339 3900022 4048341 4355707 4535614 4644473 4823628 4983780
13892 4983780 4824457 4614831 4431103 4176245 4331950 4629038 4309101 4233275 4161044 3960456
13882 3960456 4373199 4529102 4678689 4520466 4375804 4035311 3730002 3969154 4139029
13873 4139029 4350653 4173198 3976422 4333678 4486618 4777494 4482990 4099504 4401627
13864 4401627 4323041 4338324 4768221 4714427 4770436 4597289 4496667 4688586 4806269 4402616
13854 4402616 4033542 4071277 4242320 4561206 4594847 4660829 4824577 5117413 5133097 5043525
13844 5043525 4961279 5135698 5028578 4612499 4488364 4626551 4548815 4837389 4917119 4801191
$$ packed form
13912D454146n3750J62393K3970l17434k0483J87801L44468j06944l89064P698
13902D292801L1198j81192j47468r5317J48319L07366J79907J08859J79155J60152
13892D983780j59323k09626j83728k54858J55705K97088l19937p5826p2231k00588
13882C960456M12743J55903J49587j58223j44662l40493l05309K39152J69875
13873D139029K11624j77455j96776L57256J52940K90876k94504l83486L02123
13864D401627p8586J5283M29897n3794N6009j73147j00622J91919J17683m03653
13854D402616l69074L7735J71043L18886L3641O5982J63748K92836J5684q9572
13844E043525q2246J74419j07120m16079j24135J38187p7736K88574P9730j15928
$$ plain form
13834 4801191 4940953 5179213 4912067 4516646 4771322 4861752 4741961 4596983 4704068 4978678
13824 4978678 5298088 5603905 5379329 4762161 4933403 5054474 5253236 5137511 5192827 5239256
13814 5239256 5495879 5634065 5617263 5915833 5978025 5654413 5355264 5349927 5540794 5709321
13804 5709321 5602324 5250044 5279389 5189265 4757988 4592828 4586128 4608996 4750147 5057196
13794 5057196 4924333 4934505 5351629 5534488 5828400 5950920 5114976 4731638 4993970 5478136
13784 5478136 5339681 4964057 4985046 5284380 5537943 5882672 6044050 5842645 5665391 5846913
13774 5846913 5664572 5490905 5873241 6265772 6519180 6609603 5739282 5394591 5607107 5655222
13764 5655222 5526452 5597166 5898296 5902601 5854717 5937425 5976621 5691049 5778042 6078666 5914918
$$ packed form
13834D801191J39762K38260k67146l95421K54676R0430j19791j44978J07085K74610
13824D978678L19410L05817k24576o17168J71242J21071J98762j15725N5316M6429
13814E239256K56623J38186j6802K98570O2192l23612k99149n337J90867J68527
13804E709321j06997l52280K9345r0124m31277j65160o700K2868J41151L07049
13794E057196j32863J0172M17124J82859K93912J22520q35944l83338K62332M84166
13784E478136j38455l75624K0989K99334K53563L44729J61378k01405j77254J81522
13774E846913j82341j73667L82336L92531K53408R0423q70321l44691K12516M8115
13764E655222j28770P0714L01130M305m7884Q2708L9196k85572Q6993L00624j63748
$$ plain form
13753 5914918 5982770 6014700 6185260 6043851 6004506 6176878 6412869 6333671 6054614 5896237
13743 5896237 5946733 6032968 6041722 6210652 6126174 6233091 6166949 6210527 6071617 5972863 6045447
13732 6045447 6298413 6337533 6374322 6744932 6774813 6313719 6243874 6245790 6485393 6577914 6475801
13721 6475801 6547391 6546170 6492630 6660796 6274404 6254670 6431391 6537213 6382943 6316682
13711 6316682 6089762 6336286 6764102 7107990 7168131 6926259 6638191 6664373 6170115 6129018
13701 6129018 6745403 7202387 7322799 7620665 7363228 6987561 7068589 7317522 7524324 7334282
13691 7334282 6977474 6994079 7108133 7074437 7201602 6975743 6798775 6950826 7018711 7020901
13681 7020901 6571371 6725508 7083964 6868081 6815339 6832637 7023517 7100981 7054469 7291605
$$ packed form
13753E914918O7852L1930J70560j41409l9345J72372K35991p9198k79057j58377
13743E896237N0496Q6235Q754J68930q4478J06917o6142M3578j38910r8754P2584
13732F045447K52966L9120L6789L70610K9881m61094o9845J916K39603R2521j02113
13721F475801P1590j221n3540J68166l86392j9734J76721J05822j54270o6261
13711F316682k26920K46524M27816L43888O0141k41872k88068K6182m94258m1097
13701F129018O16385M56984J20412K97866k57437l75667Q1028K48933K06802j90042
13691G334282l56808J6605J14054l3696J27165k25859j76968J52051O7885K190
13681G020901m49530J54137L58456k15883n2742J7298J90880P7464m6512K37136
$$ plain form
13671 7291605 7152359 7308042 7284345 7427955 7559613 7524951 7368675 7287643 7258526 7408086
13661 7408086 7374637 7464360 7357527 7478435 7609066 7715051 7780791 7438247 7167656 7152389
13651 7152389 7654881 7991275 8078713 7746530 7221942 6863039 6794273 7060420 7427547 7721938
13641 7721938 7924877 8027657 7888505 7657850 7687594 7866204 7863774 8197185 8454295 8307573
13631 8307573 8136958 8073925 8088413 7660196 7228631 7443103 7898716 7694370 7752558 8216041
13621 8216041 8323486 8209320 8188645 7888080 7962524 8207530 8364602 8366264 8206116 8017578
13611 8017578 8193464 8178464 8158874 8163232 8301681 8346482 8357662 8432596 8291897 8292563 8753779
13600 8753779 8610437 8394505 8299439 8237187 8439258 8621358 8591177 8140080 8253226 8068810
$$ packed form
13671G291605j39246J55683k3697J43610J31658l4662j56276q1032k9117J49560
13661G408086l3449Q9723j06833J20908J30631J05985O5740l42544k70591j5267
13651G152389N02492L36394Q7438l32183n24588l58903o8766K66147L67127K94391
13641G721938K02939J02780j39152k30655K9744J78610k430L33411K57110j46722
13631H307573j70615o3033J4488m28217m31565K14472M55613k04346N8188M63483
13621H216041J07445j14166k0675l00565P4444K45006J57072J662j60148j88538
13611H017578J75886j5000j9590M358J38449M4801J1180P4934j40699O66M61216
13600H753779j43342k15932r5066o2252K02071J82100l0181m51097J13146j84416
$$ plain form
13590 8068810 8371577 8825152 9125497 9043943 9006249 8778409 8822832 9000510 9094857 8646059
13580 8646059 8301012 8425384 8817203 9028892 9243430 9246677 9141033 9136892 9385862 9237325
13570 9237325 8901316 8489529 8409103 8878756 9410518 9566071 9545890 9389325 9274691 9349460
13560 9349460 9328027 9110014 9593558 9979101 9727856 9068788 8983073 9105757 9264052 9687353
13550 9687353 9955189 9940891 9827476 9784721 9620122 9816491 9696643 9717481 9623139 9858823
13540 9858823 9990336 9875909 10184136 10281934 9642747 9778189 10212413 10310536 10066556 10265204
13530 10265204 9985435 10006788 10330123 10812659 10532718 10299859 10441066 10444177 10508821 10653864
13520 10653864 10891805 10955924 11016362 10894200 10927457 10859982 10575963 10372762 10259880 10438886
$$ packed form
13590H068810L02767M53575L00345q1554l7694k27840M4423J77678R4347m48798
13580H646059l45047J24372L91819K11689K14538L247j05644m141K48970j48537
13570I237325l36009m11787q0426M69653N31762J55553k0181j56565j14634P4769
13560I349460k1433k18013M83544L85543k51245o59068q5715J22684J58295M23301
13550I687353K67836j4298j13415m2755j64599J96369j19848K0838r4342K35684
13540I858823J31513j14427L08227R7798o39187J35442M34224R8123k43980J98648
13530A0265204k79769K1353L23335M82536k79941k32859J41207L111O4644J45043
13520A0653864K37941O4119O0438j22162L3257o7475k84019k03201j12882J79006
$$ plain form
13510 10438886 10681816 10858474 11002650 11149448 11334500 11329312 10942649 10810578 11026302 11112417
13500 11112417 10821819 10449332 10516301 10888058 11065907 11158392 11219955 10853682 11010303 11358676
13490 11358676 11745609 11711283 11863986 11772722 11409551 11225739 11240288 11339114 11515270 11839422
13480 11839422 11832435 11888898 12039314 11749879 11691534 11632070 11358557 11591249 11970901 12258701
13470 12258701 12020051 11946740 12048633 12024581 11971698 11839599 12057359 12299881 12205352 12338335
13460 12338335 12527996 12889497 13273069 13356820 13461661 13352681 13250568 13225278 13021499 13029302
13450 13029302 13034431 13019916 12920425 12628903 12712841 12982059 12753397 12478462 12413232 12707913
13440 12707913 12936637 12872380 12955079 13373654 13432207 13349539 13495783 13354437 13382538 13916508
$$ packed form
13510A0438886K42930J76658J44176J46798J85052n188l86663j32071K15724Q6115
13500A1112417k90598l72487O6969L71757J77849R2485O1563l66273J56621L48373
13490A1358676L86933l4326J52703r1264l63171j83812J4549R8826J76156L24152
13480A1839422o987N6463J50416k89435n8345n9464k73513K32692L79652K87800
13470A2258701k38650p3311J01893k4052n2883j32099K17760K42522r4529J32983
13460A2338335J89661L61501L83572Q3751J04841j08980j02113k5290k03779P803
13450A3029302N129j4515r9491k91522Q3938K69218k28662k74935o5230K94681
13440A2707913K28724o4257Q2699M18575N8553q2668J46244j41346K8101N33970
$$ plain form
13430 13916508 14265774 14172857 14042223 13863411 13672780 13933838 14182781 14272540 14509500 14456361
13420 14456361 14563151 14768452 15013758 15230220 15361921 15455160 15459664 15418580 15079909 15040056
13410 15040056 15054297 15291565 15422727 15388118 15389565 15584477 15779693 15749470 15680049 15444815
13400 15444815 15263694 15276796 15332050 15361832 15292494 15409803 15421180 15514360 15626505 15624617 15629039
13389 15629039 15784128 15962463 16024548 16097660 16559594 16674305 16765032 17154623 16984734 17016026
13379 17016026 16948171 16662494 16863267 16944921 16839529 16947998 16762366 16925519 17178717 17243994
13369 17243994 17128354 16882075 16568839 16927372 16994073 17114585 17003495 17178223 17019568
13360 17019568 17256563 17576051 17574711 17224365 17092996 17595519 17737769 17526634 17407667 17510534
$$ packed form
13430A3916508L49266r2917j30634j78812j90631K61058K48943Q9759K36960n3139
13420A4456361J06790K05301K45306K16462J31701R3239M504m1084l38671l9853
13410A5040056J4241K37268J31162l4609J447J94912J95216l0223o9421k35234
13400A5444815j81121J3102N5254K9782o9338J17309J1377R3180J12145j888M422
13389A5629039J55089J78335O2085P3112M61934J14711R0727L89591j69889L1292
13379A7016026o7855k85677K00773Q1654j05392J08469j85632J63153K53198O5277
13369A7243994j15640k46279l13236L58533O6701J20512j11090J74728j58655
13360A7019568K36995L19488j340l50346j31369N02523J42250k11135j18967J02867
$$ plain form
13350 17510534 17464754 17478767 17493789 17175956 17147757 17294532 17360489 17367213 17933808 18374252
13340 18374252 18582832 18643646 18464872 18302557 17942563 17749020 18101909 18101850 17872696 17779512
13330 17779512 18111744 18069322 17909346 17989545 18273436 18547941 18333542 18129068 18170195 18305484
13320 18305484 18245401 18225832 18088879 18304582 18664314 18920425 18778557 18596594 18561929 18306272
13310 18306272 18617034 18784791 18830374 18868270 19269978 19218574 18934060 19161688 19268679 19299171
13300 19299171 19456299 19228790 19241043 19340367 19438682 19554519 19863725 19800915 19625529 19497254
13290 19497254 19630760 19806715 19973092 19584651 19685718 19874094 20007414 20213021 20058226
13281 20058226 19896857 19883695 20118879 20321693 20509897 20494201 20226128 20502887 20560760 20121463
$$ packed form
13350A7510534m5780J4013J5022l17833k8199J46775O5957O724N66595M40444
13340A8374252K08580O0814j78774j62315l59994j93543L52889n9k29154r3184
13330A7779512L32232m2422j59976Q0199K83891K74505k14399k04474M1127J35289
13320A8305484o0083j9569j36953K15703L59732K56111j41868j81963l4665k55657
13310A8306272L10762J67757M5583L7896M01708n1404k84514K27628J06991L0492
13300A9299171J57128k27509J2253R9324R8315J15837L09206o2810j75386j28275
13290A9497254J33506J75955J66377l88441J01067J88376J33320K05607j54795
13281B0058226j61369j3162K35184K02814J88204j5696k68073K76759N7873m39297
$$ plain form
13271 20121463 19873207 20133181 20449352 20716292 20845490 20766334 20761932 21003917 21262351 21432342
13261 21432342 21280517 21311151 21587753 21912718 21899148 21846124 21832651 22204321 22591733 22837456
13251 22837456 23192901 23183648 22878656 22649611 22614373 22565272 22440524 22799156 22959512 23260158
13241 23260158 23307934 23369713 23018175 23191910 23457132 23416440 23397870 23536618 23578855 24092220
13231 24092220 24490267 24455592 24005798 24160363 24083193 24320986 24341015 24219517 24270836 24238393
13221 24238393 24178795 24056689 24363326 24796064 24687492 24796543 24984832 25371480 25795507
13212 25795507 25587989 25433307 25694985 25988467 26024501 25866123 25910831 25866651 25950106 26175133
13202 26175133 25923192 25515252 25491718 25540018 25965241 26536720 26590487 26740386 26838986 26514297
$$ packed form
13271B0121463k48256K59974L16171K66940J29198p9156m402K41985K58434J69991
13261B1432342j51825L0634K76602L24965j3570n3024j3473L71670L87412K45723
13251B2837456L55445r253l04992k29045l5238m9101j24748L58632J60356L00646
13241B3260158M7776O1779l51538J73735K65222m0692j8570J38748M2237N13365
13231B4092220L98047l4675m49794J54565p7170K37793K0029j21498N1319l2443
13221B4238393n9598j22106L06637M32738j08572J09051J88289L86648M24027
13212B5795507k07518j54682K61678K93482L6034j58378M4708m4180Q3455K25027
13202B6175133k51941m07940k3534M8300M25223N71479N3767J49899R8600l24689
$$ plain form
13192 26514297 26330327 26574469 26750003 26866945 26721211 26977040 27022546 26956072 27519413 27812239
13182 27812239 27697712 27510197 27601313 27630290 27560411 27852766 28222548 28149119 27977932 28125225
13172 28125225 28376350 28743145 28742495 28637240 28722507 28484042 28372707 29134242 29456922 29300802
13162 29300802 29119436 28865684 28922857 28969545 28994483 29103287 29261741 29445907 29607777 29813762
13152 29813762 30049533 30464461 30404571 30502240 30512663 30127859 30001990 29827707 29476603 29588002
13142 29588002 29956138 30203052 30422917 30890869 31231221 30986693 30651654 30482693 30561700
13133 30561700 31130642 31430319 31688960 31743894 31811662 31814192 31609803 31262175 31135548 31574436
13123 31574436 32025265 32254695 32302477 32477916 33057409 33321679 33476636 33437506 33309265 32918267
$$ packed form
13192B6514297j83970K44142J75534J16942j45734K55829M5506o6474N63341K92826
13182B7812239j14527j87515R1116K8977o9879K92355L69782p3429j71187J47293
13172B8125225K51125L66795o50j05255Q5267k38465j11335P61535L22680j56120
13162B9300802j81366k53752N7173M6688K4938J08804J58454J84166J61870K05985
13152B9813762K35771M14928n9890R7669J0423l84804j25869j74283l51104J11399
13142B9588002L68136K46914K19865M67952L40352k44528l35039j68961P9007
13133C0561700N68942K99677K58641N4934O7768K530k04389l47628j26627M38888
13123C1574436M50829K29430M7782J75439N79493K64270J54957l9130j28241l90998
$$ plain form
13113 32918267 32888462 32824114 32930166 33030934 33088285 33184020 33033252 32853226 32842403 33198876
13103 33198876 33672422 33639659 33676496 33814172 33970799 34053932 34454169 34604589 34443801 34562083
13093 34562083 34760088 34871632 34923823 35230855 35365496 35304840 35236741 35591773 35841711 36391014
13083 36391014 36601425 36303021 36493669 36493499 36310719 36459974 36612892 36498960 36180360 36165590
13073 36165590 36357733 36453887 36621401 36927899 36943784 37097476 37614715 37831545 37517114 37938002
13063 37938002 38293099 38498042 38306130 38045174 38204655 37891142 37649389 38263503 38954162
13054 38954162 39270179 38998671 39166051 39292254 39516711 39963034 39925118 39906386 40158341 40526305
13044 40526305 40673449 40517707 40365753 40166780 40077070 40168970 40597246 41127086 41655521 42083470
$$ packed form
13113C2918267k9805o4348J06052J00768N7351R5735j50768j80026j0823L56473
13103C3198876M73546l2763L6837J37676J56627Q3133M00237J50420j60788J18282
13093C4562083J98005J11544N2191L07032J34641o0656o8099L55032K49938N49303
13083C6391014K10411k98404J90648j70j82780J49255J52918j13932l18600j4770
13073C6165590J92143R6154J67514L06498J5885J53692N17239K16830l14431M20888
13063C7938002L55097K04943j91912k60956J59481l13513k41753O14114O90659
13054C8954162L16017k71508J67380J26203K24457M46323l7916j8732K51955L67964
13044D0526305J47144j55742j51954j98973q9710R1900M28276N29840N28435M27949
$$ plain form
13034 42083470 42046735 41801721 41903019 41990938 42117123 42758276 43331775 43740757 44059621 44079744
13024 44079744 44465921 44928838 45007444 45618526 45666391 45885645 46114196 46164262 46311449 46369257
13014 46369257 46971845 47585970 48103176 48595671 49407186 50228334 50483526 50730592 51599870
13005 51599870 52393402 53256364 54174712 55395677 56475437 57257203 58538679 60117310 61972222
12996 61972222 63751642 65605105 67902038 70297761 72753899 75726493 79472012 83564346
12988 83564346 88268277 94152476 100382578 107239242 115548856 125246888 136251463 148746062
12980 148746062 163423080 179454798 196307650 213658368 230600613 246023449 258576779
12973 258576779 267046967 271480825 272114749 268924517 262640835 255201606 247999504 242213299
$$ packed form
13034D2083470l6735k45014J01298Q7919J26185O41153N73499M08982L18864K0123
13024D4079744L86177M62917P8606O11082M7865K19254K28551N0066J47187N7808
13014D6369257O02588O14125N17206M92495Q11515Q21148K55192K47066Q69278
13005E1599870P93532Q62962R18348J220965J079760P81766J281476J578631J854912
12996F1972222J779420J853463K296933K395723K456138K972594L745519M092334
12988H3564346M703931N884199O230102O856664Q309614R698032J1004575J2494599
12980A48746062J4677018J6031718J6852852J7350718J6942245J5422836J2553330
12973B58576779Q470188M433858O33924l190232o283682p439229p202102n786205
$$ plain form
12965 242213299 237985412 235160814 234520369 236197617 239637253 244090693 249091168 253642120
12957 253642120 257073522 259894780 261730999 262252877 262104566 262119934 262014960 263068917 265919197
12948 265919197 270214148 275486515 282589305 290604887 298274074 305144457 310215919 313106742
12940 313106742 312899094 310072906 304834747 297762485 289841462 282166812 274921136 269533744
12932 269533744 265491170 263246509 263087625 263719055 264854227 266775505 268713489 269598620
12924 269598620 269119523 267328090 264593355 261180311 257896881 255522798 253745580 253561044
12916 253561044 255755854 260463654 267016731 274784222 282999207 290774790 296427694 298915254
12908 298915254 297130443 290752678 280217181 265724947 248912647 231047261 213105454
$$ packed form
12965B42213299m227887k824598o40445J677248L439636M453440N000475M550952
12957B53642120L431402K821258J836219N21878j48311J5368j04974J053957K850280
12948B65919197M294951N272367P102790Q015582P669187O870383N071462K890823
12940C13106742k07648k826188n238159p072262p921023p674650p245676n387392
12932B69533744m042574k244661j58884O31430J135172J921278J937984Q85131
12924B69598620m79097j791433k734735l413044l283430k374083j777218j84536
12916B53561044K194810M707800O553077P767491Q214985P775583N652904K487560
12908B98915254j784811o377765j0535497j4492234j6812300j7865386j7941807
$$ plain form
12901 213105454 195870295 180249409 166126617 153712171 143080837 133601072 124797477
12894 124797477 117392915 110905824 104947507 100048186 95852223 91965534 88702010 85569312
12886 85569312 82723167 80437498 78049725 75779120 73857360 72022400 70484444 69054177
12878 69054177 67468638 66257452 65288347 64512539 63922877 62933008 61779060 60851447 59918215
12869 59918215 59041099 58378108 58140217 57395178 56798636 56121730 55570425 54892835 54327919
12860 54327919 54095507 53714545 53300155 53126259 52609680 52313344 51853265 51257514 51133075
12851 51133075 50581567 50125646 49732229 49335180 48916163 48723635 48611564 48448871 48423105
12842 48423105 48125586 47776238 47379000 47242988 47242994 47159559 47159768 46985605 46511904 46159197 46130679
$$ packed form
12901B13105454j7235159j5620886j4122792j2414446j0631334r479765q803595
12894A24797477p404562o487091n958317m899321m195963l886689l263524l132698
12886H5569312k846145k285669k387773k270605j921760j834960j537956j430267
12878F9054177j585539j211186r69105p75808n89662r89869j153948r27613r33232
12869E9918215q77116o62991k37891p45039n96542o76906n51305o77590n64916
12860E4327919k32412l80962m14390j73896n16579k96336m60079n95751j24439
12851E1133075n51508m55921l93417l97049m19017j92528j12071j62693k5766
12842D8423105k97519l49348l97238j36012Oq3435K09j74163m73701l52707k8518
$$ plain form
12831 46130679 45718871 45799964 46044678 45477653 45068995 44933212 44966825 44855680 44111436 43677043
12821 43677043 43594859 43704631 43638257 43477704 43184829 43374490 43080176 42882169 42691335 42591381
12811 42591381 42153429 41698236 41517821 41875857 41998761 41536445 41508576 41307150 41242250 41277779
12801 41277779 40824013 40739700 40380442 40292894 40087022 39849337 39650728 39706656 39766247 39606787
12791 39606787 39451630 39427954 39590656 39590244 39489632 39323023 39185047 39013612 38956060 38929522
12781 38929522 39064421 39179654 38891919 38587892 38570675 38694669 38717248 38537216 38263454 38206441
12771 38206441 37759646 38236295 38344385 38219895 37786082 37714606 37572468 37375663 37196566
12762 37196566 37142480 36914023 36682705 36576564 36525750 36587569 36871044 36708874 36581087 36368749
$$ packed form
12831D6130679m11808Q1093K44714n67025m08658j35783L3613j11145p44244m34393
12821D3677043q2184J09772o6374j60553k92875J89661k94314j98007j90834r9954
12811D2591381m37952m55193j80415L58036J22904m62316k7869k01426o4900L5529
12801D1277779m53766q4313l59258q7548k05872k37685j98609N5928N9591j59460
12791C9606787j55157k3676J62702m12j00612j66609j37976j71435n7552k6538
12781C8929522J34899J15233k87735l04027j7217J23994K2579j80032k73762n7013
12771C8206441m46795M76649J08090j24490m33813p1476j42138j96805j79097
12762C7196566n4086k28457k31318j06141n0814O1819K83475j62170j27787k12338
$$ plain form
12752 36368749 36141176 35955822 35694706 35514532 35338308 35336334 35259135 34869110 34842978 34728769
12742 34728769 34622428 34367573 34163013 34264917 34261168 34250607 34188397 33911361 33744347 33436836
12732 33436836 33302504 33051697 32979775 33012453 33084622 33111441 33084863 32968460 32757853 32477059
12722 32477059 32737562 32569167 31819049 31417666 31576083 31730926 32000291 32118031 32093027
12713 32093027 32249464 32219234 32061817 31805685 31552648 31559350 31619426 31295848 30912361 31107229
12703 31107229 31216440 30726264 30731754 31060330 31263852 31213333 31051217 30943744 31123593 31136490
12693 31136490 30741735 30521320 30622588 30625432 30200102 29785903 29770747 29806918 29873814 29766967
12683 29766967 29447547 29243991 29093599 29230986 29291392 29185383 28871392 29031121 29381874
$$ packed form
12752C6368749k27573j85354k61116j80174j76224j974p7199l90025k6132j14209
12742C4728769j06341k54855k04560J01904l749j0561o2210k77036j67014l07511
12732C3436836j34332k50807p1922L2678P2169K6819k6578j16403k10607k80794
12722C2477059K60503j68395p50118m01383J58417J54843K69365J17740k5004
12713C2093027J56437l0230j57417k56132k53037O702O0076l23578l83487J94868
12703C1107229J09211m90176N490L28576K03522n0519j62116j07473J79849J2897
12693C1136490l94755k20415J01268K844m25330m14199j5156L6171O6896j06847
12683B9766967l19420k03556j50392J37387O0406j06009l13991J59729L50753
$$ plain form
12674 29381874 29302207 28567545 28167260 28503110 28742673 28494446 28819119 28570253 28277351
12665 28277351 28000276 28133596 28149557 27742985 27375991 27503399 27488855 27373044 27267304 27154337
12655 27154337 26951145 26605731 26519688 26512708 26572202 26921723 26586725 26583312 26411231 26251285
12645 26251285 26272577 26223571 26289482 26234962 26226799 25873651 25493953 25477094 25263049 25483977
12635 25483977 25424158 25208454 25512140 25540599 25407000 25361577 25083886 24924497 25089257 25408403
12625 25408403 25495807 25234049 24490321 24292842 24587260 24553781 24510933 24123423 23936453 23929716
12615 23929716 23974296 23792008 23684825 23625730 23885893 24090812 24007847 23685330 23463771 23551096
12605 23551096 23756949 23493113 23255939 23076740 23162623 23425139 23399346 23510490 23432087 23518807
$$ packed form
12674B9381874p9667p34662m00285L35850K39563k48227L24673k48866k92902
12665B8277351k77075J33320J5961m06572l66994J27408j4544j15811j05740j12967
12655B7154337k03192l45414q6043o980N9494L49521l34998l413j72081j59946
12645B6251285K1292m9006O5911n4520q163l53148l79698j6859k14045K20928
12635B5483977n9819k15704L03686K8459j33599m5423k77691j59389J64760L19146
12625B5408403Q7404k61758p43728j97479K94418l3479m2848l87510j86970o737
12615B3929716M4580j82288j07183n9095K60163K04919q2965l22517k21559Q7325
12605B3551096K05853k63836k37174j79199Q5883K62516k5793J11144p8403Q6720
$$ plain form
12595 23518807 23653105 23412055 23228240 23280698 23189033 23094040 23161822 23016744 22634512 22149648
12585 22149648 22136131 21948316 22362440 22288241 22339213 22224264 22392592 22386479 22607894 22408858
12575 22408858 22190149 22043889 21891250 21645627 21594730 21603124 21704150 21613583 21335229 21260865
12565 21260865 20941535 20827316 20856997 20835878 20624040 20682270 20613229 20601055 20782663 20482332
12555 20482332 20503425 20652316 20509898 20580932 20583762 20764300 20782595 20576065 20221769 20180100
12545 20180100 20288729 20134914 20277005 20214386 20219703 20161827 20166942 20333131 20128071 20054806
12535 20054806 19794350 19965318 20218526 19910468 20002903 20243625 20442181 20544418 20265685
12526 20265685 20154653 19897723 19644183 19568317 19902776 19941026 19541805 19366164 19404958 19289070
$$ packed form
12595B3518807J34298k41050j83815N2458r1665r4993O7782j45078l82232m84864
12585B2149648j3517j87815M14124p4199N0972j14949J68328o113K21415j99036
12575B2408858k18709j46260j52639k45623n0897Q394J01026r0567k78354p4364
12565B1260865l19330j14219K9681k1119k11838N8230o9041j2174J81608l00331
12555B0482332K1093J48891j42418P1034K830J80538J8295k06530l54296m1669
12545B0180100J08629j53815J42091o2619N317n7876N115J66189k05060p3265
12535B0054806k60456J70968K53208l08058R2435K40722J98556J02237k78733
12526B0265685j11032k56930k53540p5866L34459L8250l99221j75641L8794j15888
$$ plain form
12516 19289070 19136550 18936417 18642567 18880520 18777349 18725506 19038282 19010138 19025715 18996662
12506 18996662 18774960 18600175 18539430 18478407 18629902 18609892 18343302 18408231 17902575 18071614
12496 18071614 18560055 18788117 18576771 18132470 17982788 17861360 17700369 18109466 17613961
12487 17613961 17053343 17388581 17597422 17414367 17268636 17287545 17242454 17256616 17018168 16767901
12477 16767901 17104184 17333893 17306915 16720454 16762246 16539809 16157649 16268177 16509984 16394318
12467 16394318 16649689 16972080 16975375 17023551 16963298 16650149 16443921 16286927 15945711 15823149
12457 15823149 15866777 16011040 16182384 15997539 16015037 15884440 15793261 15525704 15041356 14803736
12447 14803736 14747609 14601019 14956469 14882530 14677764 14789346 14651118 14641207 14544256 14617900
$$ packed form
12516A9289070j52520k00133k93850K37953j03171n1843L12776k8144J5577k9053
12506A8996662k21702j74785o0745o1023J51495k0010k66590O4929n05656J69039
12496A8071614M88441K28062k11346m44301j49682j21428j60991M09097m95505
12487A7613961n60618L35238K08841j83055j45731J8909m5091J4162k38448k50267
12477A6767901L36283K29709k6978n86461M1792k22437l82160J10528K41807j15666
12467A6394318K55371L22391L295M8176o0253l13149k06228j56994l41216j22562
12457A5823149M3628J44263J71344j84845J7498j30597r1179k67557m84348k37620
12447A4803736n6127j46590L55450p3939k04766J11582j38228r911r6951P3644
$$ plain form
12437 14617900 14558697 14734207 14637430 15002131 15080603 14694396 14256942 14076769 14272279 14313823
12427 14313823 14488795 14466146 14077730 13651768 13684757 13520948 13870942 14142666 14060368 14220487
12417 14220487 14531871 14002430 13747540 13741631 13510297 13665868 13860111 13545006 13568574 13775776
12407 13775776 13358577 13344187 13399480 13171941 13043571 12772792 12800234 12807086 13073412 13413250
12397 13413250 13401730 13183779 13239097 13116886 12906056 12763324 12421595 12450161 12367293 12359322
12387 12359322 12613259 12955500 12910767 12912374 12789809 12496315 12548223 12455748 12501444 12656872
12377 12656872 12608002 12255222 12442851 12503086 12215527 12146047 12062627 11977749 12143524 11928977
12367 11928977 11364907 11442537 11657550 11402226 11202012 11204046 11290346 11648236 11806057 11700095
$$ packed form
12437A4617900n9203J75510r6777L64701P8472l86207m37454j80173J95510M1544
12427A4313823J74972k2649l88416m25962L2989j63809L49994K71724q2298J60119
12417A4220487L11384n29441k54890n909k31334J55571J94243l15105K3568K07202
12407A3775776m17199j4390N5293k27539j28370k70779K7442O852K66326L39838
12397A3413250j1520k17951N5318j22211k10830j42732l41729K8566q2868p971
12387A2359322K53937L42241m4733J607j22565k93494N1908r2475M5696J55428
12377A2656872m8870l52780J87629O0235k87559o9480q3420q4878J65775k14547
12367A1928977n64070P7630K15013k55324k00214K034Q6300L57890J57821j05962
$$ plain form
12357 11700095 11500134 11694428 11474921 11286635 11506852 11491546 11816076 11925130 11475013
12348 11475013 11298006 11465216 11426985 10993348 10771492 10939667 11029472 10993760 11118197 10951913
12338 10951913 10648334 10706858 10765317 10680733 10494289 10452751 10410476 10673197 10583607 10537055
12328 10537055 10172065 10076893 10448989 10741647 10787930 10900871 10792924 10673885 10444436 10158120
12318 10158120 10246467 10245298 9913884 9867547 9971048 10143131 10133050 10230058 10168821 9994757
12308 9994757 10263402 10487264 10083699 9600955 9486426 9579274 9816211 9842578 10037376 10139659
12298 10139659 10323212 10446359 10274843 10226643 9732133 9427704 9527276 9178938 9001735 8850204
12288 8850204 9185612 9462466 9426288 9721489 9720656 9451137 9433248 9539752 9743934 9582709
$$ packed form
12357A1700095j99961J94294k19507j88286K20217j5306L24530J09054m50117
12348A1475013j77007J67210l8231m33637k21856J68175Q9805l5712J24437j66284
12338A0951913l03579N8524N8459q4584j86444m1538m2275K62721q9590m6552
12328A0537055l64990r5172L72096K92658M6283J12941j07947j19039k29449k86316
12318A0158120Q8347j169l31414m6337J03501J72083j0081R7008o1237j74064
12308I994757K68645K23862m03565m82744j14529R2848K36937K6367J94798J02283
12298A0139659J83553J23147j71516m8200m94510l04429R9572l48338j77203j51531
12288H850204L35408K76854l6178K95201q33k69519j7889J06504K04182j61225
$$ plain form
12278 9582709 9444436 9173192 8820258 8871218 8992802 9124723 8915884 8668342 8715007 8556894
12268 8556894 8096136 8403843 8723920 8585418 8969201 8596449 8330375 8486518 8718536
12259 8718536 8483111 8536528 8729543 9027670 9121750 8729357 8669964 8467399 8630057 8689673
12249 8689673 8941306 8631386 8722907 8758352 8467824 8386260 8517072 8467626 8392815 8443210
12239 8443210 8438014 8690115 8615914 8426756 8414923 8371159 8344207 7979889 8013103 7872109 7892943
12228 7892943 8055813 8093749 8148569 7875468 7608162 7716809 7909495 7979252 8234524 8083299
12218 8083299 7748551 7680318 7862912 7987708 8057972 7769914 7508900 7898591 8014951 8003336
12208 8003336 7661627 7729435 7634419 7226885 7248668 7612887 7558615 7519746 7421477 7640052
$$ packed form
12278I582709j38273k71244l52934N0960J21584J31921k08839k47542M6665j58113
12268H556894m60758L07707L20077j38502L83783l72752k66074J56143K32018
12259H718536k35425N3417J93015K98127R4080l92393n9393k02565J62658N9616
12249H689673K51633l09920R1521L5445k90528q1564J30812m9446p4811N0395
12239H443210n196K52101p4201j89158j1833m3764k6952l64318L3214j40994K0834
12228G892943J62870L7936N4820k73101k67306J08647J92686O9757K55272j51225
12218H083299l34748o8233J82594J24796P0264k88058k61014L89691J16360j1615
12208H003336l41709O7808r5016m07534K1783L64219n4272l8869r8269K18575
$$ plain form
12198 7640052 7542248 7643703 7841941 7792557 7485968 7415722 7306549 7486339 7623553 7554664
12188 7554664 7656897 7573158 7550038 7492985 7263689 7253558 6957692 6682789 6912375 7064037
12178 7064037 7003401 6904378 6829277 7024716 7297997 6898418 6747434 7207378 7185379 7197878
12168 7197878 7206786 6915801 6548292 6726401 6503141 6569400 6860824 6889630 7106089 7091376
12158 7091376 7028893 6981327 6764979 6660226 6628852 6772512 6717891 7010817 6877402 6614664
12148 6614664 6426743 6645425 6684517 6767505 6832640 6737550 6517978 6591989 6547087 6558800 6578239
12137 6578239 6382217 6385269 6123175 5718397 5595945 5729798 5916580 5829451 6177857 6591508
12127 6591508 6728081 6682082 7065323 6880844 6641892 6498502 6251263 6282005 6358003 6128930
$$ packed form
12198G640052r7804J01455J98238m9384l06589p0246j09173J79790J37214o8889
12188G554664J02233q3739k3120n7053k29296j0131k95866k74903K29586J51662
12178G064037o0636r9023p5101J95439K73281l99579j50984M59944k1999J2499
12168G197878Q908k90985l67509J78109k23260O6259K91424K8806K16459j4713
12158G091376o2483m7566k16348j04753l1374J43660n4621K92926j33415k62738
12148F614664j87921K18682L9092Q2988O5135r5090k19572P4011m4902J1713J9439
12137F578239j96022L052k62094m04778j22452J33853J86782q7129L48406M13651
12127F591508J36573m5999L83241j84479k38952j43390k47239L0742P5998k29073
$$ plain form
12117 6128930 6284947 6341009 6284365 6023633 5937163 6052751 6102393 6068940 6122916 6219669 6146727
12106 6146727 5774085 5952437 6416731 5952913 5987457 6059488 5631104 5952496 6383434 6949168
12096 6949168 7189240 7084149 6889176 6728979 6579024 6056314 5722464 5837862 6141925
12087 6141925 6179570 5951476 5957656 6236074 6095262 5919682 5900453 5777862 6025890 5860749
12077 5860749 5533322 5304993 5522877 5616805 5132174 4818639 5374374 5756203 5844846 5505084
12067 5505084 5342679 5541180 5726786 5661625 5558601 5745528 5885772 6112209 5947763 6004088
12057 6004088 5697509 5586546 5888102 5884415 5697605 5629813 5727412 5879104 6007835 5872534
12047 5872534 5420129 5510608 5374341 5168011 5158823 5260368 5107604 4838692 4944891 4988109
$$ packed form
12117F128930J56017N6062n6644k60732q6470J15588M9642l3453N3976R6753p2942
12106F146727l72642J78352M64294m63818L4544P2031m28384L21392M30938N65734
12096F949168K40072j05091j94973j60197j49955n22710l33850J15398L04063
12087F141925L7645k28094O180K78418j40812j75580j9229j22591K48028j65141
12077E860749l27427k28329K17884R3928m84631l13535N55735L81829Q8643l39762
12067E505084j62405J98501J85606o5161j03024J86927J40244K26437j64446N6325
12057F004088l06579j10963L01556l687j86810o7792R7599J51692J28731j35301
12047E872534m52405R0479j36267k06330r188J01545j52764k68912J06199M3218
$$ plain form
12037 4988109 4929999 4932403 5065824 5220451 5214563 5027286 4825853 4881230 4947776 5289514 5139146
12026 5139146 5182297 5094908 4565886 4381224 4320595 4246855 4491758 4707744 4754767 4762297 4522975
12015 4522975 4788732 5011677 4907635 5046694 5179983 5253230 5347764 5225433 5106607 4922789
12005 4922789 4842837 4777097 4972387 4842590 4558187 4557454 4306498 4219531 4294567 4064614 4198100
11994 4198100 4526325 4893430 4961225 4622701 4080707 4206549 4807804 5040558 4876549 5265327
11984 5265327 5342226 4890533 4538763 4524126 4794615 4896395 4485354 4515129 4533317 4428360
11974 4428360 4381626 4423711 4157068 4301760 4061652 4322617 4582834 4371209 4240783 4236600
11964 4236600 4507337 4461932 4450714 4588800 4635548 4608801 4550418 4466906 4166937 4283624
$$ packed form
12037D988109n8110K404J33421J54627n888j87277k01433N5377O6546L41738j50368
12026E139146M3151q7389n29022j84662o0629p3740K44903K15986M7023P530k39322
12015D522975K65757K22945j04042J39059J33289P3247R4534j22331j18826j83818
12005D922789p9952o5740J95290j29797k84403p33k50956q6967P5036k29953J33486
11994D198100L28225L67105O7795l38524n41994J25842O01255K32754j64009L88778
11984E265327P6899m51693l51770j4637K70489J01780m11041K9775J8188j04957
11974D428360m6734M2085k66643J44692k40108K60965K60217k11625j30426m183
11964D236600K70737m5405j1218J38086M6748k6747n8383q3512k99969J16687
$$ plain form
11954 4283624 4010306 3827805 3833074 3923348 4083505 4160420 4124824 4115682 4024894 4207318 3873381
11943 3873381 3713340 3865452 3970626 4072935 4006697 4072280 4242267 4394298 4455685 4381554
11933 4381554 4002300 3814186 3597349 3602610 3506596 3455118 3824124 3879863 3538797 3608274
11923 3608274 3861786 4042909 3953835 4040447 4199911 4029959 3793128 3630899 3636054 3547730
11913 3547730 3504520 3565181 3572662 3895384 3723654 3196767 2919466 3244961 3845723 3990226
11903 3990226 3960527 3890779 3996422 3701970 3683067 3560138 3507434 3828237 3990612 3961029
11893 3961029 3736843 3758438 3789192 3746965 3536880 3335400 3101043 3314660 3492138 3641426
11883 3641426 3621413 3230876 3338559 3159490 3198427 3014573 2999074 3181501 3589322 3767858
$$ packed form
11954D283624k73318j82501N269R0274J60157P6915l5596r142r0788J82424l33937
11943C873381j60041J52112J05174J02309o6238O5583J69987J52031O1387p4131
11933D381554l79254j88114k16837N261r6014n1478L69006N5739l41066O9477
11923C608274K53512J81123q9074Q6612J59464j69952k36831j62229N155q8324
11913C547730m3210O0661P481L22722j71730n26887k77301L25495O00762J44503
11903C990226k9699o9748J05643k94452j8903j22929n2704L20803J62375k9583
11893C961029k24186K1595L0754m2227k10085k01480k34357K13617J77478J49288
11883C641426k0013l90537J07683j79069L8937j83854j5499J82427M07821J78536
$$ plain form
11873 3767858 3756031 3449693 3411036 3463920 3490600 3951674 4264416 4519278 4396303 4403795
11863 4403795 4193136 4128984 3805669 3664344 4090218 4068517 3756730 3573614 3453368 3699402
11853 3699402 4000461 4027845 4058230 3894520 3794580 3526467 3335206 3399208 3539307 3583458
11843 3583458 3668168 3874368 3685378 3289624 3207469 3350486 3316048 3337312 3501930 3163752
11833 3163752 2986823 3235385 3440275 3388705 3415104 3459341 3389065 3211509 3137044 2802928
11823 2802928 2830986 2917197 3269938 3750523 3521825 3308367 3141973 2965806 2875443 2811328
11813 2811328 2984117 3235545 3199966 3126258 2781676 2682025 2724776 2826991 2739199 3091968
11803 3091968 3234480 3215416 3338442 3294680 3080854 2872908 2861291 2518862 2487883 2358129
$$ packed form
11873C767858j1827l06338l8657N2884K6680M61074L12742K54862j22975P492
11863D403795k10659o4152l23315j41325M25874k1701l11787j83116j20246K46034
11853C699402L01059K7384L0385j63710r9940k68113j91261O4002J40099M4151
11843C583458Q4710K06200j88990l95754q2155J43017l4438K1264J64618l38178
11833C163752j76929K48562K04890n1570K6399M4237p0276j77556p4465l34116
11823B802928K8058Q6211L52741M80585k28698k13458j66394j76167r0363o4115
11813B811328J72789K51428l5579p3708l44582r9651M2751J02215q7792L52769
11803C091968J42512j9064J23026m3762k13826k07946j1617l42429l0979j29754
$$ plain form
11793 2358129 2220585 2387156 2558079 2881491 2867568 2985132 3155585 3254223 3197887 3213883
11783 3213883 3104828 2877838 2507195 2914156 3043298 3123049 3269873 3231178 3011309 3308215
11773 3308215 3291133 3129178 2774464 2927537 3019232 3285653 3570323 3460968 2914945 2510969
11763 2510969 2555300 2710104 2881381 2946468 2656708 2635918 2666551 2778553 2433934 2342581
11753 2342581 2178846 2248536 2511978 2351857 2321607 2526477 2660248 2562732 2695936 2655524
11743 2655524 2779304 2480714 2512979 2565512 2680003 2537404 3009508 3203627 2938327 2815552
11733 2815552 2828532 2794638 3179322 2907438 2710708 2724367 2672593 2313617 2477286 2730787
11723 2730787 2570416 2634469 2969227 2844603 2832395 2718734 2686417 2430021 2241454 2619488
$$ packed form
11793B358129j37544J66571J70923L23412j3923J17564J70453R8638n6336J5996
11783C213883j09055k26990l70643M06961J29142P9751J46824l8695k19869K96906
11773C308215j7082j61955l54714J53073R1695K66421K84670j09355n46023m03976
11763B510969M4331J54804J71277O5087k89760k0790L0633J12002l44619r1353
11753B342581j63735O9690K63442j60121l0250K04870J33771r7516J33204m0412
11743B655524J23780k98590L2265N2533J14491j42599M72104J94119k65300j22775
11733B815552J2980l3894L84684k71884j96730J3659n1774l58976J63669K53501
11723B730787j60371O4053L34758j24624j2208j13661l2317k56396j88567L78034
$$ plain form
11713 2619488 2610486 2448758 2276238 2083258 2418031 2575611 2578043 2596103 2390233 2437188
11703 2437188 2354684 2228408 2499699 2659973 2722159 2545274 2658184 2615444 2437601 2801596
11693 2801596 2737120 2497536 2552258 2815734 2476621 2872183 3120466 2784718 2580219 2735891
11683 2735891 2666159 2787203 2799910 2625098 2502765 2253443 2242737 2167740 1819570 1777351
11673 1777351 1884411 1960287 1831786 1595118 1728914 1991987 1621259 1934461 1965722 2014980
11663 2014980 2122815 2310680 2490856 2401211 2518394 2845093 2396155 2123786 2265198 2569908
11653 2569908 2655247 2493877 2194827 2060972 2317634 2308512 2173782 2330107 2467112 2398949
11643 2398949 2682986 2803638 2717197 2367899 2291185 2252622 2353180 2338111 2301536 2527814
$$ packed form
11713B619488r002j61728j72520j92980L34773J57580K432J8060k05870M6955
11703B437188q2504j26276K71291J60274O2186j76885J12910m2740j77843L63995
11693B801596o4476k39584N4722K63476l39113L95562K48283l35748k04499J55672
11683B735891o9732J21044J2707j74812j22333k49322j0706p4997l48170m2219
11673A777351J07060P5876j28501k36668J33796K63073l70728L13202L1261M9258
11663B014980J07835J87865J80176q9645J17183L26699m48938k72369J41412L04710
11653B569908Q5339j61370k99050j33855K56662r122j34730J56325J37005o8163
11643B398949K84037J20652q6441l49298p6714l8563J00558j5069l6575K26278
$$ plain form
11633 2527814 2351655 2281810 2384224 2432502 2629849 2569967 2367291 2360422 2479650 2565629
11623 2565629 2697360 2647757 2587422 2568678 2380211 2165435 1915976 1961342 1968113 1832178
11613 1832178 1966550 2355451 2628786 2601759 2633773 2573610 2480570 2668945 2606979 2243586
11603 2243586 2375398 2464006 2235927 2006922 1930811 1723747 1370982 1672600 2102053 2555115
11593 2555115 2560793 1926099 1759280 1814732 1703245 1768766 1673514 1875922 1677998 1710481
11583 1710481 1722605 1820282 2033951 1668106 1542689 1866054 2052048 2159331 1831675 1584839
11573 1584839 1569223 1634058 1706993 2056639 2433460 2453821 2456855 2249291 1996169 1899020 1914231
11562 1914231 1920550 2098767 2132258 2064572 1752712 1545998 1630474 1515648 1543434 2046418
$$ packed form
11633B527814j76159o9845J02414M8278J97347n9882k02676o869J19228Q5979
11623B565629J31731m9603o0335j8744j88467k14776k49459M5366O771j35935
11613A832178J34372L88901K73335k7027L2014o0163r3040J88375o1966l63393
11603B243586J31812Q8608k28079k29005p6111k07064l52765L01618M29453M53062
11593B555115N678o34694j66819N5452j11487O5521r5252K02408j97924L2483
11583A710481J2124R7677K13669l65845j25417L23365J85994J07283l27656k46836
11573A584839j5616O4835P2935L49646L76821K0361L034k07564k53122r7149J5211
11562A914231O319J78217L3491o7686l11860k06714Q4476j14826K7786N02984
$$ plain form
11552 2046418 2144387 2016966 1728172 1227544 1181886 1465870 1891515 1932364 1970615 2004018
11542 2004018 1736820 1485814 1147087 1188183 1271127 1261307 1413927 1275106 1310305 1671409
11532 1671409 2025866 2107385 2079529 2194856 1979513 1805661 1966568 2045565 2153297 2197314
11522 2197314 2074467 2125848 1869928 1873677 1980606 1753208 1363923 1281781 1433219 1685990
11512 1685990 1527000 1246598 1204171 1193852 1333607 1499071 1715395 1266147 940646 1210777
11502 1210777 1428392 1260616 1257954 1281379 1086463 810921 1045155 1069492 1020300 878093
11492 878093 1224951 1224636 1494257 1763801 1889060 1894500 1696499 1410764 1482602 1407135 1163440
11481 1163440 1209585 1483741 1323979 1185261 1456975 1148817 1070847 1467950 1893102 1549854
$$ packed form
11552B046418R7969j27421k88794n00628m5658K83984M25645M0849L8251L3403
11542B004018k67198k51006l38727M1096Q2944r820J52620j38821L5199L61104
11532A671409L54457Q1519k7856J15327k15343j73852J60907P8997J07732M4017
11522B197314j22847N1381k55920L749J06929k27398l89285q2142J51438K52771
11512A685990j58990k80402m2427j0319J39755J65464K16324m49248l25501K70131
11502A210777K17615j67776k662K3425j94916k75542K34234K4337m9192j42207
11492H78093L46858l15K69621K69544J25259N440j98001k85735P1838p5467k43695
11481A163440M6145K74156j59762j38718K71714l08158p7970L97103M25152l43248
$$ plain form
11471 1549854 742949 883227 1015624 791567 715517 850561 1370074 1375387 1249660 1193525
11461 1193525 1613394 1632737 1608865 1911579 1731571 1549013 1580226 1722118 1600288 1509270
11451 1509270 1429053 1496537 1268943 988954 846302 1001292 1320764 1656447 1895212 1774975
11441 1774975 1556979 1594842 1465555 1402628 1425515 1482584 1755145 1628489 1565343 1506143
11431 1506143 1479987 1407227 1223842 1067110 1005479 1063077 1018496 1031201 1102670 782777 619978
11420 619978 1023759 1281862 1314431 1539438 1532992 1505082 1193168 991672 936919 1018174 1292771
11409 1292771 1257403 1163476 1166125 1123930 977607 794025 1161438 1376381 1249627 968157
11399 968157 1072194 1470013 1660093 1532410 1360549 1505041 1325723 1246371 982652 1125825
$$ packed form
11471A549854q06905J40278J32397k24057p6050J35044N19513N313j25727n6135
11461A193525M19869J9343k3872L02714j80008j82558L1213J41892j21830r1018
11451A509270q0217O7484k27594k79989j42652J54990L19472L35683K38765j20237
11441A774975k17996L7863j29287o2927K2887N7069K72561j26656o3146n9200
11431A506143k6156p2760j83385j56732o1631N7598m4581J2705P1469l19893j62799
11420F19978M03781K58103L2569K25007o446k7910l11914k01496n4753Q1255K74597
11409A292771l5368r3927K649m2195j46323j83582L67413K14943j26754k81470
11399I68157J04037L97819J90080j27683j71861J44492j79318p9352k63719J43173
$$ plain form
11389 1125825 1191481 1435053 1580951 1217462 1114708 1273693 1065222 807724 1100043 1171094
11379 1171094 791316 978529 1156711 1414417 1385489 1232112 1224206 1055659 1046806 898736
11369 898736 985724 1208690 1130765 843050 1056934 1141110 1110408 1240654 1431403 1438597 1299939
11358 1299939 923221 1103040 1328758 759058 493749 620613 882385 1095208 985819
11349 985819 882026 1220688 1045422 978992 1228011 1283100 1364298 1400129 1253347 936464
11339 936464 1105119 1170250 918819 1122081 1065312 1238028 1481182 1417726 1740174 1600957
11329 1600957 1279431 978972 984145 1162574 1390722 1410442 1085140 750307 826676 1086484
11319 1086484 1348904 1277468 1446098 1657552 1894036 1785451 1833815 1968254 2284699 2413320
$$ packed form
11389A125825O5656K43572J45898l63489j02754J58985k08471k57498K92319P1051
11379A171094l79778J87213J78182K57706k8928j53377p906j68547q853j48070
11369H98736Q6988K22966p7925k87715K13884Q4176l0702J30246J90749P194j38658
11358A299939l76718J79819K25718n69700k65309J26864K61772K12823j09389
11349I85819j03793L38662j75266o6430K49019N5089Q1198L5831j46782l16883
11339I36464J68655O5131k51431K03262n6769J72716K43154o3456L22448j39217
11329A600957l21526l00459N173J78429K28148J9720l25302l34833P6369K59808
11319A086484K62420p1436J68630K11454K36484j08585M8364J34439L16445J28621
$$ plain form
11309 2413320 2645285 2208649 2096574 2070827 2134613 2084620 1975665 1729665 1858910 2204357
11299 2204357 2139832 1940987 1824288 1895988 2137561 2448883 2074111 1730664 1688164 2093972
11289 2093972 2336584 2126726 2158194 1963878 1990003 1904528 2082739 2362587 2773746 2609227
11279 2609227 2389339 2025717 2115402 2317213 2323287 2210322 2166039 2212843 2167822 1837861
11269 1837861 1710333 1987059 2329129 1999612 1747505 1876319 1874541 2101919 2412651 2320762
11259 2320762 2067056 2384178 2258170 1896027 1919708 1991588 2047732 2248749 2325220 2215801
11249 2215801 2020130 2033677 2212259 2588014 2431138 2525598 2640906 2780138 2538135 2136210
11239 2136210 1986771 1884973 1837847 1581194 1423886 1488605 1443067 1221298 1087153 916672
$$ packed form
11309B413320K31965m36636j12075k5747O3786m9993j08955k46000J29245L45447
11299B204357o4525j98845j16699P1700K41573L11322l74772l43447m2500M05808
11289B093972K42612k09858L1468j94316K6125q5475J78211K79848M11159j64519
11279B609227k19888l63622Q9685K01811O074j12965m4283M6804m5021l29961
11269A837861j27528K76726L42070l29517k52107J28814j778K27378L10732r1889
11259B320762k53706L17122j26008l62143K3681P1880N6144K01017P6471j09419
11249B215801j95671J3547J78582L75755j56876R4460J15308J39232k42003m01925
11239B136210j49439j01798m7126k56653j57308O4719m5538k21769j34145j70481
$$ plain form
11229 916672 907437 683478 706895 959128 772419 865130 1058266 1046121 881552 675552
11219 675552 614759 647756 554579 745302 681143 586674 483175 698457 917123 1034368
11209 1034368 1182950 1171620 995270 621317 292000 195907 419710 515802 629859 578727
11199 578727 537226 500977 637508 543775 194012 194958 145361 279183 513305 543643 691558
11188 691558 679337 412737 78961 265017 344368 42217 283167 555058 678168 578689
11178 578689 669726 695419 773363 941589 817357 605062 523754 498706 478667 461047 556712
11167 556712 895807 911289 660470 757975 869395 561969 476509 739587 886808 803409
11157 803409 807120 863662 762280 417555 202541 155749 633746 790594 520804 241869
$$ packed form
11229I16672r235k23959K3417K52233j86709R2711J93136j2145j64569k06000
11219F75552o0793L2997r3177J90723o4159r4469j03499K15282K18666J17245
11209A034368J48582j1330j76350l73953l29317r6093K23803R6092J14057n1132
11199E78727m1501l6249J36531r3733l49763R46m9597J33822K34122L0338J47915
11188F91558j2221k66600l33776J86056P9351l02151K40950K71891J23110r9479
11178E78689R1037K5693P7944J68226j24232k12295q1308k5048k0039j7620R5665
11167E56712L39095J5482k50819R7505J11420l07426q5460K63078J47221q3399
11157H03409L711N6542j01382l44725k15014m6792M77997J56848k69790k78935
$$ plain form
11147 241869 523330 672976 765104 939694 1129545 945804 762250 966671 1150279 913202
11137 913202 1001404 785215 493638 310431 515925 816259 767068 449867 525617 511547
11127 511547 307944 681012 993647 809255 829767 871503 404533 419189 621799 835667
11117 835667 872216 399337 558772 562002 339584 204335 130602 407000 283277 440214
11107 440214 482525 527139 595994 586776 513382 559654 953621 1153202 1229911 1001601 980655
11096 980655 909614 925725 1158232 686134 544098 1058181 1220869 1020877 887371 892643
11086 892643 437404 423890 193345 146397 121929 222186 392356 264729 -32311 62024
11076 62024 289208 882922 1051338 969316 830114 620125 397116 208776 552331 840169
$$ packed form
11147B41869K81461J49646R2128J74590J89851j83741j83554K04421J83608k37077
11137I13202Q8202k16189k91577j83207K05494L00334m9191l17201P5750j4070
11127E11547k03603L73068L12635j84392K0512M1736m66970J4656K02610K13868
11117H35667L6549m72879J59435L230k22418j35249p3733K76398j23723J56937
11107D40214M2311M4614O8855r218p3394M6272L93967J99581P6709k28310k0946
11096I80655p1041J6111K32507m72098j42036N14083J62688j99992j33506N272
11086H92643m55239j3514k30545m6948k4468J00257J70170j27627k97040R4335
11076F2024K27184N93714J68416q2022j39202k09989k23009j88340L43555K87838
$$ plain form
11066 840169 979733 997617 817345 580072 711301 742004 946551 1194216 961372 829569
11056 829569 1043478 780236 560090 717146 558864 504335 630221 935302 1399720 1412372
11046 1412372 1153678 1136055 922521 1135092 1299993 1377474 1159192 1295257 1661808 1732386
11036 1732386 1755801 1887407 1882672 1934485 1858898 1632314 1707774 1905509 2186478 2426351
11026 2426351 2597181 2436325 2439081 2796053 2931888 2706011 2278947 2380924 2523534 2834048
11016 2834048 3216197 2924971 2971151 3193589 3438515 3346673 3093310 2867033 2494353 2091227
11006 2091227 1959997 1835646 1462156 1311500 1446256 1843003 1819932 1813583 1558848 1405371
10996 1405371 1364219 1404164 1508965 1302250 1114890 1065744 1070463 1121532 1159305 1116453 503370
$$ packed form
11066H40169J39564J7884j80272k37273J31229L0703K04547K47665k32844j31803
11056H29569K13909k63242k20146J57056j58282n4529J25886L05081M64418J2652
11046A412372k58694j7623k13534K12571J64901P7481k18282J36065L66551P0578
11036A732386K3415J31606m735N1813p5587k26584P5460J97735K80969K39873
11026B426351J70830j60856K756L56972J35835k25877m27064J01977J42610L10514
11016B834048L82149k91226M6180K22438K44926r1842k53363k26277l72680m03126
11006B091227j31230j24351l73490j50656J34756L96747k3071o349k54735j53477
10996A405371m1152L9945J04801k06715j87360m9146M719N1069L7773m2852o13083
$$ plain form
10985 503370 255205 201915 87537 192811 435104 472692 592569 586136 727775 886434
10975 886434 1004598 939271 805888 724573 661543 615253 849240 1157578 1430348 1583822
10965 1583822 1524319 1332728 1008763 1265380 1815896 1849489 1784632 1831751 1532968 1338836
10955 1338836 1508838 1471668 1535451 1673371 1672060 1332469 880954 888900 1127132 1699124
10945 1699124 1833587 1703989 1969146 2328960 2299907 2176452 1785716 2126182 2419272 2308499
10935 2308499 2463334 2750377 2919268 2842331 2881006 3011253 3030058 3098807 3199091 3236531
10925 3236531 3409853 3807815 3970061 3806343 3383433 3489212 3861022 4080643 4607184
10916 4607184 5005428 4921078 5063297 5514617 5476871 5780531 6435525 6845597 7196090 7335914
$$ packed form
10985E03370k48165n3290j14378J05274K42293L7588J19877o433J41639J58659
10975H86434J18164o5327j33383q1315o3030m6290K33987L08338K72770J53474
10965A583822n9503j91591l23965K56617N50516L3593o4857M7119k98783j94132
10955A338836J70002l7170O3783J37920j311l39591m51515P946K38232N71992
10945A699124J34463j29598K65157L59814k9053j23455l90736L40466K93090j10773
10935B308499J54835K87043J68891p6937L8675J30247J8805O8749J00284L7440
10925C236531J73322L97962J62246j63718m22910J05779L71810K19621N26541
10916D607184L98244q4350J42219M51320l7746L03660O54994M10072L50493J39824
$$ plain form
10906 7335914 7496198 7943419 8835890 9547229 10086754 10726026 11281294 11898696 12676938
10897 12676938 13849350 15001415 16303818 17798952 19087060 20556255 22457160 24734098
10889 24734098 27246603 30054791 33529896 37428114 41673883 46393013 52036684 58794235
10881 58794235 66986069 76561184 87433084 100267941 114980992 131585234 149841704
10874 149841704 169492436 188723567 207246784 223712415 236367759 244308656 247072023
10867 247072023 245372643 240227466 232759431 224266792 216354078 210373680 206466689 205348165
10859 205348165 206664432 210139494 215319556 221053336 227261583 232300325 235589495 237267801
10851 237267801 236228534 233615073 229752664 226029731 223294955 222521488 223648428 227177421
$$ packed form
10906G335914J60284M47221Q92471P11339N39525O39272N55268O17402P78242
10897A2676938J172412J152065J302403J495134J288108J469195J900905K276938
10889B4734098K512505K808188L475105L898218M245769M719130N643671O757551
10881E8794235Q191834R575115J0871900J2834857J4713051J6604242J8256470
10874A49841704J9650732J9231131J8523217J6465631J2655344P940897K763367
10867B47072023j699380n145177p468035q492639p912714n980398l906991j118524
10859B05348165J316267L475062N180062N733780O208247N038742L289170J678306
10851B37267801j039267k613461l862409l722933k734776p73467J126940L528993
$$ plain form
10843 227177421 233315647 241238295 250276976 259272757 267647904 274049707 277682794 277956098
10835 277956098 274698683 268897645 261469590 253139606 245324662 238962903 234271587 231688863
10827 231688863 231581081 233509445 236197445 238877022 240862290 241188391 239595092 235915885
10819 235915885 230467817 223966766 217527612 211506471 207425361 205558301 206211838 209099199
10811 209099199 214346683 221845065 230453483 238946644 246162633 250393957 250857059 247154211
10803 247154211 238817518 226532965 210958095 193053757 174848134 157180931 140922955
10796 140922955 126238484 113194869 101750605 91720608 83212786 75898794 69439504
10789 69439504 63902866 58895784 54690691 51092491 47691935 44736994 41582852 38905501
$$ packed form
10843B27177421O138226P922648R038681Q995781Q375147O401803L633087K73304
10835B77956098l257415n801038p428055q329984p814944o361759m691316k582724
10827B31688863j07782J928364K688000K679577J985268L26101j593299l679207
10819B35915885n448068o501051o439154o021141m081110j867060O53537K887361
10811B09099199N247484P498382Q608418Q493161P215989M231324M63102l702848
10803B47154211q336693j2284553j5574870j7904338j8205623j7667203j6257976
10796A40922955j4684471j3043615j1444264j0029997q507822p313992o459290
10789F9439504n536638n007082m205093l598200l400556k954941l154142k677351
$$ plain form
10781 38905501 36883015 34791137 33058871 31911038 30602190 29007374 27554973 26447426
10773 26447426 25348057 24241269 23022164 21869398 21111978 20412304 19598956 18875549 18236240
10764 18236240 17968868 17511622 16882013 16267521 15684820 15016149 14335726 14014700 13901866
10755 13901866 13684141 13351734 12960845 12321505 11860848 11534872 11153587 10853406 10852855 10955288
10745 10955288 10717806 10516738 10543559 10402478 10010749 9578104 9087800 8962950 8865225 8687237
10735 8687237 8798096 8763779 8667448 8520595 8179292 7973667 8003637 7837567 7671332 7651822
10725 7651822 7604933 7206972 7288168 7084527 6861764 6811828 6553407 6332818 6603742 6852923
10715 6852923 6645545 6321582 5973556 5824636 6130719 5748246 5670520 5827824 5635883 5388600
$$ packed form
10781C8905501k022486k091878j732266j147833j308848j594816j452401j107547
10773B6447426j099369j106788j219105j152766p57420o99674q13348p23407o39309
10764A8236240k67372m57246o29609o14492n82701o68671o80423l21026j12834
10755A3901866k17725l32407l90889o39340m60657l25976l81285l00181n51J02433
10745A0955288k37482k01068K6821j41081l91729m32645m90304j24850r7725j77988
10735H687237J10859l4317r6331j46853l41303k05625K9970j66070j66235j9510
10725G651822m6889l97961Q1196k03641k22763m9936k58421k20589K70924K49181
10715F852923k07378l23963l48026j48920L06083l82473p7726J57304j91941k47283
$$ plain form
10705 5388600 5219342 5211791 4930057 5166432 5183338 5075828 5082767 4681205 4565272 4599549
10695 4599549 4551123 4494840 4528959 4136085 3754946 3758076 3935185 4103478 4292716 4351015
10685 4351015 4597813 4684418 4809756 4830946 4915017 4510154 4307787 3894214 3549107 3416525
10675 3416525 3892968 3802680 3887057 4051521 4202394 4260907 4319921 4142733 3928442 3716550
10665 3716550 3591425 3722790 3942430 4234420 4429462 4427637 4604524 4702767 4501250 4289863
10655 4289863 4194154 4292247 4322543 4291205 4048680 4186615 4209374 3891965 3723062 3649785
10645 3649785 4016194 4047411 4410336 5029686 5323878 5809057 6480538 6951117 7103058 7738910
10635 7738910 8547150 9467538 10493810 11132362 12500067 14131781 15986964 18101739 21437407
$$ packed form
10705E388600j69258p551k81734K36375J6906j07510O939m01562j15933L4277
10695D599549m8426n6283L4119l92874l81139L130J77109J68293J89238N8299
10685D351015K46798Q6605J25338K1190Q4071m04863k02367m13573l45107j32582
10675C416525M76443r0288Q4377J64464J50873N8513N9014j77188k14291k11892
10665C716550j25125J31365K19640K91990J95042j825J76887R8243k01517k11387
10655D289863r5709R8093L0296l1338k42525J37935K2759l17409j68903p3277
10645C649785L66409L1217L62925O19350K94192M85179O71481M70579J51941O35852
10635G738910Q08240R20388J026272O38552J367705J631714J855183K114775L335668
$$ plain form
10626 21437407 25459508 30804571 37836958 47225612 60141948 76288858 94360522 112548256
10618 112548256 128686806 140081973 145740983 146840250 145773141 145177714 148773160 159618589
10610 159618589 178898916 206710527 239911004 272895301 299817881 315461937 316893292
10603 316893292 305951240 289093053 274967697 269431941 276698331 297807166 330800601
10596 330800601 370540417 408097131 434369967 442223551 428588299 397434326 357818708
10589 357818708 320996342 294800987 282326536 283452190 294718056 311433792 326684910
10582 326684910 333662733 328161536 308440134 278131534 243879176 213166043 190490436
10575 190490436 176259392 169591214 168321740 169380004 169478027 166372933 158221068 144866176
$$ packed form
10626B1437407M022101N345063P032387R388654J2916336J6146910J8071664J8187734
10618A12548256J6138550J1395167N659010J099267j067109n95427L595446J0845429
10610A59618589J9280327K7811611L3200477L2984297K6922580J5644056J431355
10603C16893292j0942052j6858187j4125356n535756P266390K1108835L2993435
10596C30800601L9739816L7556714K6272836P853584j3635252l1153973l9615618
10589C57818708l6822366k6195355j2474451J125654J1265866J6715736J5251118
10582C26684910O977823n501197j9721402l0308600l4252358l0713133k2675607
10575A90490436j4231044o668178j269474J058264R8023l105094q151865j3354892
$$ plain form
10567 144866176 127554383 108821114 91218864 76366373 64704486 56126108 49542128
10560 49542128 44254772 39882915 36476133 33793131 31396272 29568989 27674930 26112117
10552 26112117 24837181 23193244 22158645 21062027 19871890 19264809 18774450 17916287
10544 17916287 17292631 16765848 16093176 15402796 14843631 14270418 14071649 13873048 13445738
10535 13445738 13091169 12720393 12381347 12151068 12025424 12063855 11620286 10988351 10676781
10526 10676781 10391909 10188957 9722923 9158697 9211334 9323593 8908030 8930950 8924511 8895686
10516 8895686 8896425 8425140 8111703 8051883 7926023 7625680 7762432 7557801 7477781 7156274
10506 7156274 6564171 6308856 6368417 6680115 6785813 6752312 6603041 6761480 6677432 6689591
$$ packed form
10567A44866176j7311793j8733269j7602250j4852491j1661887q578378o583980
10560D9542128n287356m371857l406782k683002k396859j827283j894059j562813
10552B6112117j274936j643937j034599j096618j190137o07081m90359q58163
10544A7916287o23656n26783o72672o90380n59165n73213j98769j98601m27310
10535A3445738l54569l70776l39046k30279j25644L8431m43569o31935l11570
10526A0676781k84872k02952m66034n64226N2637J12259m15563K2920o439k8825
10516H895686P39m71285l13437n9820j25860l00343J36752k04631q0020l21507
10506G156274n92103k55315N9561L11698J05698l3501j49271J58439q4048J2159
$$ plain form
10496 6689591 6858538 6766162 6592261 6410019 6296263 6206267 5956633 5827686 5862376 5507982
10486 5507982 5244219 5486773 5556017 5283412 5253521 5273105 5455128 5124571 5265884 5311326
10476 5311326 5110287 4990719 4749724 4872214 4861486 4454670 4695807 4845108 4757532 4888674
10466 4888674 4864710 5104450 5198682 5000175 4648606 4168222 4017729 4040581 4105421 4226863
10456 4226863 4022028 4194766 4090151 4178583 4587710 4630840 4359481 4276820 3984919 4027982
10446 4027982 4461315 4309147 4157166 4462142 4551338 4419308 4382303 4416657 3985003 4098151
10436 4098151 3895566 3725595 3716630 3786006 3916823 4203429 4403910 4240905 3997718 3792456
10426 3792456 4102113 4024689 4159125 4342202 4332489 4056525 3759312 3597806 3826777 4195561
$$ packed form
10496F689591J68947r2376j73901j82242j13756q9996k49634j28947L4690l54394
10486E507982k63763K42554O9244k72605k9891J9584J82023l30557J41313M5442
10476E311326k01039j19568k40995J22490j0728m06816K41137J49301q7576J31142
10466D888674k3964K39740R4232j98507l51569m80384j50493K2852O4840J21442
10456D226863k04835J72738j04615Q8432M09127M3130k71359q2661k91901M3063
10446D027982M33333j52168j51981L04976Q9196j32030l7005L4354m31654J13148
10436D098151k02585j69971q965O9376J30817K86606K00481j63005k43187k05262
10426C792456L09657p7424J34436J83077r713k75964k97213j61506K28971L68784
$$ plain form
10416 4195561 4163049 3996640 4360250 4388143 3880257 3585425 3775219 3876197 4040452 4409674
10406 4409674 4242534 4282228 4518368 4581108 4412953 4252975 4235863 4034566 3808148 3612993
10396 3612993 3670553 3760728 3795509 3655070 3531189 3554064 3633807 3632836 3381944 3358365 3372205
10385 3372205 3109648 2740593 2945698 3122067 3173261 3352509 3169281 3015967 3157358 3160640
10375 3160640 3467415 3083023 2865307 3125075 3079932 2888630 2823992 3001535 3150445 3293894
10365 3293894 3171296 3068130 3299493 3498660 3560281 3643316 3518726 3150707 3104823 3073004
10355 3073004 3188667 3536888 3629323 3495213 3125326 2941229 3122164 2652216 2277011 2104030
10345 2104030 2129010 2299355 2649560 2697726 2527022 2371261 2414367 2293802 2128237 1973428
$$ packed form
10416D195561l2512j66409L63610K7893n07886k94832J89794J00978J64255L69222
10406D409674j67140L9694K36140O2740j68155j59978j7112k01297k26418j95155
10396C612993N7560R0175L4781j40439j23881K2875P9743r71k50892k3579J3840
10385C372205k62557l69055K05105J76369N1194J79248j83228j53314J41391L282
10375C160640L06775l84392k17716K59768m5143j91302o4638J77543J48910J43449
10365C293894j22598j03166K31363J99167O1621Q3035j24590l68019m5884l1819
10355C073004J15663L48221R2435j34110l69887j84097J80935m69948l75205j72981
10345B104030K4980J70345L50205M8166j70704j55761M3106j20565j65565j54809
$$ plain form
10335 1973428 2100093 2087540 2167355 2335201 2256707 2101207 2098575 2256895 2302786 1824559
10325 1824559 1951907 2237171 2154899 2206740 2148774 1794948 1735461 1756310 1733141 1792098 1811101
10314 1811101 1780651 1860462 1826379 1800976 1866906 2134450 2181545 1931418 1745580 1176576
10304 1176576 1186689 1420372 1497976 1662170 1860383 2264839 1986847 1799108 1833558 1815239
10294 1815239 1748246 1661586 1822100 1481675 1544863 1704398 1648981 1682121 2196029 2135301
10284 2135301 1501732 1406438 1663619 1835170 1802644 1597194 1399871 1575481 1837369 2157220
10274 2157220 2040764 1890550 1863731 1832871 1845213 1769790 1864898 2002042 2031573 1944841 1880817
10263 1880817 1901244 1689435 1359878 1633725 1610063 1497556 1506364 1366068 1166186 1169467
$$ packed form
10335A973428J26665j2553P9815J67846p8494j55500k632J58320M5891m78227
10325A824559J27348K85264q2272N1841n7966l53826n9487K0849k3169N8957J9003
10314A811101l0450P9811l4083k5403O5930K67544M7095k50127j85838n69004
10304A176576J0113K33683P7604J64194J98213M04456k77992j87739L4450j8319
10294A815239o6993q6660J60514l40425O3188J59535n5417L3140N13908o0728
10284B135301o33569r5294K57181J71551l2526k05450j97323J75610K61888L19851
10274B157220j16456j50214k6819l0860J2342p5423R5108J37144K9531q6732o4024
10263A880817K0427k11809l29557K73847k3662j12507Q808j40296j99882L281
$$ plain form
10253 1169467 1187253 1230177 1213838 1213000 1395262 1480831 1042545 825342 992345 1159790 1466131
10242 1466131 1902908 1893330 1748343 1701084 1592791 1451935 1564055 1521489 1613658 1596678
10232 1596678 1558134 1408179 1447057 1358877 1423636 1599880 1633126 1530461 1522530 1754594 1945143
10221 1945143 1777303 1707838 1671392 1421520 1315403 1158749 1098347 1477368 1543046 1501439
10211 1501439 1497533 1671146 1733216 1558900 1232068 1086895 1109309 1040097 1208422 1338240
10201 1338240 1216672 1115334 1097316 922454 710178 924264 773515 669493 614870 634569
10191 634569 845996 1071081 1234448 1693249 2107712 1927667 1456962 1669987 1990997 2152186
10181 2152186 2387016 2628803 2446336 2609251 2290258 2187306 2355152 2319249 2309205 2503493
$$ packed form
10253A169467J7786M2924j6339q38J82262Q5569m38286k17203J67003J67445L06341
10242A466131M36777r578j44987m7259j08293j40856J12120m2566R2169j6980
10232A596678l8544j49955L8878q8180O4759J76244L3246j02665p931K32064J90549
10221A945143j67840o9465l6446k49872j06117j56654o0402L79021O5678m1607
10211A501439l906J73613O2070j74316l26832j45173K2414o9212J68325J29818
10201A338240j21568j01338j8018j74862k12276K14086j50749j04022n4623J9699
10191F34569K11427K25085J63367M58801M14463j80045m70705K13025L21010J61189
10181B152186K34830K41787j82467J62915l18993j02952J67846l5903j0044J94288
$$ plain form
10171 2503493 2852386 3045274 3113758 2846907 2858889 3145328 2991040 2830409 2630817 2782339
10161 2782339 3220123 3081723 3071082 3390894 3700173 3654803 3214045 3381192 3470038 3242406
10151 3242406 2873009 2813893 2625235 2362452 2605144 2573145 2490306 2434330 2436923 2677465
10141 2677465 2531808 1969020 1537022 1793522 1788249 1603135 1669989 1694598 1741734 1921210
10131 1921210 1927625 1727266 1573246 1556504 1376854 1308143 1296497 1397046 1356754 998240
10121 998240 923883 769202 790046 665283 728868 866756 1008697 1389565 1426775 1136802
10111 1136802 939228 1238691 1371983 1216771 1176299 1045519 827407 735106 855420 653728
10101 653728 534140 897372 1065535 873679 845038 955101 999948 934259 1067718 1083252
$$ packed form
10171B503493L48893J92888O8484k66851J1982K86439j54288j60631j99592J51522
10161B782339M37784j38400j0641L19812L09279m5370m40758J67147Q8846k27632
10151C242406l69397n9116j88658k62783K42692l1999q2839n5976K593K40542
10141B677465j45657n62788m31998K56500n273j85114O6854K4609M7136J79476
10131A921210O415k00359j54020j6742j79650o8711j1646J00549m0292l58514
10121I98240p4357j54681K0844j24763O3585J37888J41941L80868L7210k89973
10111A136802j97574K99463J33292j55212m0472j30780k18112r2301J20314k01692
10101F53728j19588L63232J68163j91856k8641J10063M4847o5689J33459J5534
$$ plain form
10091 1083252 1226464 1395867 1188741 933603 935902 719672 833776 1045037 1342716 1329517
10081 1329517 910309 955731 967057 750617 954910 1002010 989655 917908 1062046 1314720
10071 1314720 1387483 1307095 1145471 993767 892850 689508 713457 855469 867360 925588
10061 925588 1234996 1080684 758175 836743 826677 777143 950267 882898 946911 705199
10051 705199 636942 936862 768263 608442 545441 536139 556187 897026 891179 781654 501582
10040 501582 540994 542512 670070 1105601 1029238 1103151 1092284 1070605 1159359 1139776 957247
10029 957247 959337 1077067 1008042 628629 1076921 1273244 1431533 1308158 1066219 940386
10019 940386 1099001 946498 785063 648457 589458 469203 605894 761743 984051 964487
$$ packed form
10091A083252J43212J69403k07126k55138K299k16230J14104K11261K97679j3199
10081A329517m19208M5422J1326k16440K04293M7100j2355p1747J44138K52674
10071A314720P2763q0388j61624j51704j00917k03342K3949J42012J1891N8228
10061I25588L09408j54312l22509P8568j0066m9534J73124o7369O4013k41712
10051G05199o8257K99920j68599j59821o3001r302K0048L40839n847j09525k80072
10040E01582L9412J518J27558M35531p6363P3913j0867k1679Q8754j9583j82529
10029I57247K090J17730o9025l79413M48292J96323J58289j23375k41939j25833
10019I40386J58615j52503j61435j36606n8999j20255J36691J55849K22308j9564
$$ plain form
10009 964487 778961 691330 663499 402541 362385 81072 259826 382484 697505 632835
9999 632835 542234 824461 723211 673429 959445 604187 354994 578581 743135 893912
9989 893912 984036 674828 543425 923995 1082053 906010 660973 232130 437659 881475
9979 881475 925254 735959 987929 920791 963027 1074746 1023652 871475 840896 659329 793138
9968 793138 934567 872425 847739 926712 846863 835104 658209 429206 314182 789700 1057652
9957 1057652 1443946 1291889 821495 639424 750037 812453 689109 901947 1245056 1400465
9947 1400465 1144214 1456173 1758407 1697567 1470153 1388784 1690139 2068031 2540831 3153456
9937 3153456 4443781 6249740 9214821 11956911 14231232 16268090 16580016 14710624
$$ packed form
10009I64487j85526q7631k7831k60958m0156k81313J78754J22658L15021o4670
9999F32835r0601K82227j01250m9782K86016l55258k49193K23587J64554J50777
9989H93912R0124l09208j31403L80570J58058j76043k45037m28843K05529M43816
9979H81475M3779j89295K51970o7138M2236J11719n1094j52177l0579j81567J33809
9968G93138J41429o2142k4686P8973p9849j1759j76895k29003j15024M75518K67952
9957A057652L86294j52057m70394j82071J10613O2416j23344K12838L43109J55409
9947A400465k56251L11959L02234o0840k27414q1369L01355L77892M72800O12625
9937C153456J290325J805959K965081K742090K274321K036858L11926j869392
$$ plain form
9929 14710624 11605422 8248688 5918369 4698623 3939802 3396678 2565129 2226445 2174039
9920 2174039 2223056 2150144 1596957 1237712 1321133 1370695 1039815 1183970 1659805 1734742
9910 1734742 1327734 1671001 1652625 1386487 1496931 1467733 1323280 1475061 1199836 1139879
9900 1139879 1353983 1255828 1181200 1000089 892700 1020085 845036 983589 968570 776473
9890 776473 595659 855023 865212 965868 1055472 678585 298647 90353 354280 390551
9880 390551 628731 861102 774153 734465 521751 406845 569821 805189 679875 874463
9870 874463 1074662 1142709 1146812 764369 690266 740518 978612 1183350 1017290 786293 744024
9859 744024 954021 775915 588322 477073 508818 659511 660945 675721 723429 927929 730682
$$ packed form
9929A4710624l105202l356734k330319j219746p58821n43124q31549l38684n2406
9920B174039M9017p2912n53187l59245Q3421M9562l30880J44155M75835P4937
9910A734742m07008L43267j8376k66138J10444k9198j44453J51781k75225n9957
9900A139879K14104r8155p4628j81111j07389J27385j75049J38553j5019j92097
9890G76473j80814K59364J0189J00656Q9604l76887l79938k08294K63927L6271
9880C90551K38180K32371q6949l9688k12714j14906J62976K35368j25314J94588
9870H74463K00199O8047M103l82443p4103N0252K38094K04738j66060k30997m2269
9859G44024K09997j78106j87593j11249L1745J50693J434J4776M7708K04500j97247
$$ plain form
9848 730682 565912 787681 778853 1136052 1078220 998375 1052534 809638 525397 629210 474550
9837 474550 90262 236362 143694 390541 649111 536688 659894 553293 819723 1060510
9827 1060510 1207570 1119053 621773 491470 559650 475781 602186 594714 667044 587667 482409
9816 482409 705737 643139 452766 532844 516719 986584 1109897 1312849 1383542 1406406 1116056
9805 1116056 1101361 1084668 1274246 1599823 1450074 1395881 1046437 1021765 1047823 1083930 1156414
9794 1156414 992569 475198 288515 300308 266583 402448 447164 95644 106549 199821
9784 199821 439951 587380 569699 642347 713815 683795 698196 684191 715969 574710 676406
9773 676406 879685 710371 191833 79497 175781 422273 495403 358372 424293 633572
$$ packed form
9848G30682j64770K21769q828L57199n7832p9845N4159k42896k84241J03813j54660
9837D74550l84288J46100r2668K46847K58570j12423J23206j06601K66430K40787
9827A060510J47060q8517m97280j30303O8180q3869J26405p472P2330p9377j05258
9816D82409K23328o2598j90373Q0078j6125M69865J23313K02952P0693K2864k90350
9805A116056j4695j6693J89578L25577j49749n4193l49444k4672K6058L6107P2484
9794A156414j63845n17371j86683J1793l3725J35865M4716l51520J0905R3272
9784A99821K40130J47429j7681P2648P1468l0020J4401j4005L1778j41259J01696
9773F76406K03279j69314n18538j12336R6284K46492P3130j37031O5921K09279
$$ plain form
9763 633572 959744 1271991 1163184 769510 569359 633597 635318 809204 1123869 1354815
9753 1354815 909996 777550 420367 606819 908014 972058 1067326 603555 486177 874082
9743 874082 1005821 1071472 1169421 951182 929052 1176589 1126086 1164851 1014702 882722 848677
9732 848677 1000953 844491 797717 553100 459702 681888 968272 620241 474497 562298
9722 562298 873996 715260 468686 553402 546923 626044 799584 635786 626718 774827 747786
9711 747786 801782 947875 721496 689914 847910 713137 470506 269232 223837 -96073
9701 -96073 4125 189129 403743 392178 593586 629206 540884 353838 393727 500281 563815
9690 563815 671125 848475 905395 892917 883923 1014726 974970 797739 870456 651379 640536
$$ packed form
9763F33572L26172L12247j08807l93674k00151O4238J721J73886L14665K30946
9753A354815m44819j32446l57183J86452L01195O4044R5268m63771j17378L87905
9743H74082J31739O5651R7949k18239k2130K47537n0503L8765j50149j31980l4045
9732H48677J52276j56462m6774k44617r3398K22186K86384l48031j45744Q7801
9722E62298L11698j58736k46574Q4716o479P9121J73540j63798r068J48109k7041
9711G47786N3996J46093k26379l1582J57996j34773k42631k01274m5395l19910
9701i6073J00198J85004K14614j1565K01408L5620q8322j87046L9889J06554O3534
9690E63815J07310J77350N6920j2478q994J30803l9756j77231P2717k19077j0843
$$ plain form
9679 640536 838443 986207 866332 688897 748653 648981 421984 457085 615113 773804
9669 773804 802097 420366 665005 666263 500237 634350 670681 938330 1070395 1052479 715431
9658 715431 831527 1060803 1744747 2247426 2489270 2557401 2270251 1925462 1576835 1461150
9648 1461150 1263536 755704 1161409 1209962 851179 891007 582756 766416 852070 826773
9638 826773 938945 1055811 975956 881409 789441 347419 365347 708762 994132 1167522
9628 1167522 997420 1000050 906144 786818 327540 207688 575297 783642 659243 554237
9618 554237 417963 316153 601845 675775 592209 562807 721402 557778 606568 510940 697830
9607 697830 856932 725659 500086 246235 59844 275708 389874 303682 189415 213842
$$ packed form
9679F40536J97907J47764j19875j77435N9756r9672k26997L5101J58028J58691
9669G73804K8293l81731K44639J258j66026J34113L6331K67649J32065j7916l37048
9658G15431J16096K29276O83944N02679K41844O8131k87150l44789l48627j15685
9648A461150j97614n07832M05705M8553l58783L9828l08251J83660Q5654k5297
9638H26773J12172J16866p9855r4547r1968m42022J7928L43415K85370J73390
9628A167522j70102K630r3906j19326m59278j19852L67609K08345j24399j05006
9618E54237j36274j01810K85692P3930q3566k9402J58595j63624M8790r5628J86890
9607F97830J59102j31273k25573k53851j86391K15864J14166q6192j14267K4427
$$ plain form
9597 213842 559865 659256 550870 212558 -22227 178343 235239 229908 226477 -4125 -123218
9586 -123218 -4190 370333 630171 733846 869594 863348 604376 318732 331613 451605
9576 451605 414150 303819 -18139 122326 427048 608074 556347 739789 694255 540596
9566 540596 425627 645746 648790 543879 498278 331991 86501 209278 118483 11419
9556 11419 256810 116613 149729 674143 914371 834355 718839 861904 948960 621684
9546 621684 301293 371394 414781 493785 560143 390528 488870 724096 749915 1011793 1265258
9535 1265258 1201781 794944 520178 676977 857699 713426 572181 495994 347649 381614
9525 381614 101781 238175 341858 567606 541855 674660 551112 613120 668652 544649
$$ packed form
9597B13842L46023R9391j08386l38312k34785K00570N6896n331l431k30602j19093
9586a23218J19028L74523K59838J03675J35748o246k58972k85644J2881J19992
9576D51605l7455j10331l21958J40465L04722J81026n1727J83442m5534j53659
9566E40596j14969K20119L044j04911m5601j66287k45490J22777r0795j07064
9556A1419K45391j40197L3116N24414K40228q0016j15516J43065Q7056l27276
9546F21684l20391P0101M3387P9004O6358j69615R8342K35226K5819K61878K53465
9535A265258o3477m06837k74766J56799J80722j44273j41245p6187j48345L3965
9525C81614k79833J36394J03683K25748k5751J32805j23548O2008N5532j24003
$$ plain form
9515 544649 278323 341575 538540 413373 600190 744055 683991 409427 338984 449550
9505 449550 261725 523995 894455 649106 257162 354449 184335 -8801 -169337 -199944
9495 -199944 42709 98573 154191 269524 87800 60876 225249 328134 57910 226465
9485 226465 528381 269913 135286 406990 442136 534220 688722 790413 832478 740638
9475 740638 223430 -37916 123165 299623 187634 533986 526469 735912 469386 469861 430273
9464 430273 244913 360995 544371 683962 442727 386191 603404 940771 1290919 1495343
9454 1495343 1237047 782571 896299 1065253 1042816 1147555 1184537 972246 725286 639513
9444 639513 472576 564172 608827 471934 382602 73226 -10630 240741 515036 244949
$$ packed form
9515E44649k66326O3252J96965j25167J86817J43865o0064k74564p0443J10566
9505D49550j87825K62270L70460k45349l91944R7287j70114j93136j60536l0607
9495a99944K42653N5864N5618J15333j81724k6924J64373J02885k70224J68555
9485B26465L01916k58468j34627K71704L5146R2084J54502J01691M2065r1840
9475G40638n17208k61346J61081J76458j11989L46352p517K09443k66526M75l9588
9464D30273j85360J16082J83376J39591k41235n6536K17213L37367L50148K04424
9454A495343k58296m54476J13728J68954k2437J04739L6982k12291k46960q5773
9444F39513j66937R1596M4655j36893q9332l09376q3856K51371K74295k70087
$$ plain form
9434 244949 50433 -48199 60368 383010 1056343 760246 763412 493585 159457 436121
9424 436121 848883 733994 832442 709436 292034 69756 42819 -192598 -158743 -45528
9414 -45528 279771 470369 797923 890821 842974 1358107 1275927 843794 335279 -226250
9404 -226250 -173650 -207137 -23727 244385 548714 622791 639863 676727 281601 -172577 -251541
9393 -251541 78451 300498 657568 714272 532609 351024 349568 528559 871859 726438
9383 726438 306159 4992 202703 373685 285341 243623 212380 111044 24285 187221
9373 187221 -93688 133494 313207 -829 -97022 -185976 -226401 -407308 -195959 344695
9363 344695 687483 548116 625529 495752 556044 767719 363533 177264 492127 514499
$$ packed form
9434B44949j94516r8632J08567L22642O73333k96097L166k69827l34128K76664
9424D36121M12762j14889R8448j23006m17402k22278k6937k35417L3855J13215
9414d5528L25299J90598L27554R2898m7847N15133q2180m32133n08515n61529
9404b26250N2600l3487J83410K68112L04329P4077J7072L6864l95126m54178p8964
9393b51541L29992K22047L57070N6704j81663j81585j456J78991L43300j45421
9383G26438m20279l01167J97711J70982q8344m1718l1243j01336q6759J62936
9373A87221k80909K27182J79713l14036r6193q8954m0425j80907K11349N40654
9363C44695L42788j39367P7413j29777O0292K11675m04186j86269L14863K2372
$$ plain form
9353 514499 237568 172981 144494 343036 451671 331701 70596 -48504 109593 57793
9343 57793 177139 285553 295913 235717 14676 45062 -170752 -354642 -660973 -624372 -460187
9332 -460187 -289163 -75345 266597 -114208 -320661 -200304 12702 110381 46623 124249
9322 124249 20938 197010 564115 511569 173282 -93796 64591 15320 172024 216685
9312 216685 108016 -16559 125485 -20636 133837 125361 47715 -52334 236712 386214
9302 386214 87589 487517 717170 389913 380190 600787 653940 448369 363258 619455
9292 619455 799743 915196 675266 631163 721848 755425 761784 657184 720277 610617 538048
9281 538048 654231 466893 392933 521486 371952 127401 -189717 -159471 232728 362237
$$ packed form
9353E14499k76931o4587k8487J98542J08635j19970k61105j19100J58097n1800
9343E7793J19346J08414J0360o0196k21041L0386k15814j83890l06331L6601J64185
9332d60187J71024K13818L41942l80805k06453J20357K13006R7679o3758P7626
9322A24249j03311J76072L67105n2546l38287k67078J58387m9271J56704M4661
9312B16685j08669j24575J42044j46121J54473q476p7646j00049K89046J49502
9302C86214k98625L99928K29653l27257r723K20597N3153k05571q5111K56197
9292F19455J80288J15453k39930m4103R0685L3577O359j04600O3093j09660p2569
9281E38048J16183j87338p3960J28553j49534k44551l17118L0246L92199J29509
$$ plain form
9271 362237 300317 38462 -127703 -51707 45148 -20475 126932 45665 -207947 34715 134794
9260 134794 320172 114954 491156 888162 719274 342374 137447 267146 519420 783080
9250 783080 557681 665814 711717 287664 -72027 -153435 -21140 139909 148843 57145 -19582
9239 -19582 152741 51077 -33845 -225971 -422563 -300775 33945 182497 -251424 -481436
9229 -481436 -284126 18708 -85405 87846 420769 478067 496847 421130 215375 -20878
9219 -20878 389668 486408 343010 283182 392785 354479 601345 625298 635326 788441 697560
9208 697560 572628 521012 303191 -50527 -214080 -197722 -47246 9720 -160141 -447662
9198 -447662 -518773 -473181 -382500 -294660 -224283 32678 197903 380842 292089 310495 174826
$$ packed form
9271C62237o1920k61855j66165P5996R6855o5623J47407q1267k53612K42662J00079
9260A34794J85378k05218L76202L97006j68888l76900k04927J29699K52274K63660
9250G83080k25399J08133M5903m24053l59691q1408J32295J61049Q934r1698p6727
9239a9582J72323j01664q4922j92126j96592J21788L34720J48552m33921k30012
9229d81436J97310L02834j04113J73251L32923N7298J8780p5717k05755k36253
9219b0878M10546R6740j43398n9828J09603l8306K46866K3953J0028J53115r0881
9208F97560j24932n1616k17821l53718j63553J6358J50476N6966j69861k87521
9198d47662p1111M5592R0681Q7840P0377K56961J65225J82939q8753J8406j35669
$$ plain form
9187 174826 -53973 -394744 -497711 -221439 10593 252646 404776 314098 359119 120231
9177 120231 -2510 16096 -24882 303340 230921 -35068 320351 510963 482211 601262
9167 601262 902060 778181 414602 351539 394837 211108 -343896 -382901 -205423 46711
9157 46711 95289 -57320 -199607 -177778 -233490 -196196 418820 527571 89314 -302771 -406560
9146 -406560 -3792 124250 222364 405868 353009 339746 201321 -40081 -429938 -73552
9136 -73552 212980 319887 244892 154941 457579 559598 714617 398217 325836 177159
9126 177159 -342749 -569590 -261026 -183778 203616 126407 45260 -38263 11002 7774 54672
9115 54672 295266 -20551 181569 234246 182841 88419 331108 437544 339155 288653 -54175
$$ packed form
9187A74826k28799l40771j02967K76272K32032K42053J52130r0678M5021k38888
9177A20231j22741J8606m0978L28222p2419k65989L55419J90612k8752J19051
9167F01262L00798j23879l63579o3063M3298j83729n55004l9005J77478K52134
9157D6711M8578j52609j42287K1829n5712L7294O15016J08751m38257l92085j03789
9146d06560M02768J28042R8114J83504n2859j3263j38425k41402l89857L56386
9136g3552K86532J06907p4995q9951L02638J02019J55019l16400p2381j48677
9126A77159n19908k26841L08564P7248L87394p7209q1147q3523M9265l228M6898
9115E4672K40594l15817K02120N2677n1405r4422K42689J06436r8389n0502l42828
$$ plain form
9104 -54175 -305311 -269320 -220276 58599 58184 -55877 121086 446431 622663 487425 116569
9093 116569 -29576 -178007 142396 361168 -28672 172597 502812 518218 616560 818699
9083 818699 807499 317655 500941 595216 659370 218454 43748 279270 1189 -52864
9073 -52864 115354 118082 -151328 -422148 -475798 -50243 406242 422450 449635 374636 280687
9062 280687 139812 116735 204708 301435 222296 126723 221966 159917 317200 337925 286747
9051 286747 124072 185525 390800 243237 249760 289842 141613 358724 290444 451120 538949
9040 538949 545640 523359 483244 509284 368252 525619 343496 112378 207833 315945 149046
9029 149046 -133780 -105215 67065 566786 805068 567120 408299 188910 122053 60602
$$ packed form
9104e4175k51136L5991M9044K78875m15j14061J76963L25345J76232j35238l70856
9093A16569j46145j48431L20403K18772l89840K01269L30215J5406R8342K02139
9083H18699j1200m89844J83286R4275O4154m40916j74706K35522k78081n4053
9073e2864J68218K728k69410k70820n3650M25555M56485J6208K7185p4999r3949
9062B80687j40875k3077Q7973R6727p9139r5573R5243o2049J57283K0725n1178
9051B86747j62675O1453K05275j47563O523M0082j48229K17111o8280J60676Q7829
9040E38949O691k2281m0115K6040j41032J57367j82123k31118R5455J08112j66899
9029A49046k82826K8565J72280M99721K38282k37948j58821k19389o6857o1451
$$ plain form
9019 60602 180899 40260 284371 272471 108268 192436 270023 72461 227145 365642
9009 365642 286307 635436 516658 319942 282223 325408 642069 493632 464713 83072
8999 83072 61267 222363 -113141 -27862 -27691 -491260 -440184 -286864 -192923 19671 81558
8988 81558 -76681 -333225 -479422 -268168 35752 135501 112745 66738 -204282 -493826
8978 -493826 -899483 -652783 -476995 -533500 -458970 -241421 -132070 -41356 -205733 -105031
8968 -105031 81054 63621 -143144 -220555 -196733 65390 -60105 -353138 -35701 106125
8958 106125 188319 127060 -223286 -606893 -560879 -433578 -501667 -128664 270523 298186 269056
8947 269056 547442 696621 616323 738861 858312 1035109 946568 314797 163737 204663
$$ packed form
9019F0602J20297j40639K44111j1900j64203Q4168P7587j97562J54684J38497
9009C65642p9335L49129j18778j96716l7719M3185L16661j48437k8919l81641
8999H3072k1805J61096l35504Q5279J71m63569N1076J53320R3941K12594O1887
8988H1558j58239k56544j46197K11254L03920R9749k2756m6007k71020k89544
8978d93826m05657K46700J75788n6505P4530K17549J09351R0714j64377J00702
8968a05031J86085j7433k06765p7411K3822K62123j25495k93033L17437J41826
8958A06125Q2194o1259l50346l83607M6014J27301o8089L73003L99187K7663k9130
8947B69056K78386J49179q0298J22538J19451J76797q8541o31771j51060M0926
$$ plain form
8937 204663 302267 497667 486975 437224 405960 438508 312249 97659 -20500 -32860 82393
8926 82393 33888 1761 231206 110554 -246757 -263713 -133446 219004 748429 783818 296023
8915 296023 -100055 -297937 -267033 -262166 -343428 -198135 -34801 261269 2157 -487687
8905 -487687 -462722 138397 483516 247211 136049 -160314 -643 158798 302050 94448
8895 94448 156121 111429 -241956 -43118 392189 289812 271911 255322 66893 70450 161283
8884 161283 234938 -51016 -242565 75376 386315 515807 382021 252754 -269071 -220830
8874 -220830 -25916 109265 -11783 -7672 329501 186849 144241 93076 -12366 -201378
8864 -201378 -288371 -274173 -391145 -537614 -433690 -499729 -294870 182903 144060 256693
$$ packed form
8937B04663R7604J95400j0692m9751l1264L2548j26259k14590j18159j2360J15253
8926H2393m8505l2127K29445j20652l57311j6956J30267L52450N29425L5389m87795
8915B96023l96078j97882L0904M867q1262J45293J63334K96070k59112m89844
8905d87687K4965O01119L45119k36305j11162k96363J59671J59441J43252k07602
8895I4448O1673m4692l53385J98838M35307j02377j7901j6589j88429L557R0833
8884A61283P3655k85954j91549L17941L10939J29492j33786j29267n21825M8241
8874b20830J94914J35181j21048M111L37173j42652m2608n1165j05442j89012
8864b01378q6993J4198j16972j46469J03924o6039K04859M77773l8843J12633
$$ plain form
8854 256693 548004 593835 692885 847361 681100 712645 754452 589204 179894 19476
8844 19476 273120 466183 325616 444908 726399 578018 -143178 -582925 -440886 -218238
8834 -218238 -189904 -181450 -264046 -349345 -107196 -24999 -291567 -339417 -196896 47619 -50651
8823 -50651 -157172 -176043 60124 392747 292561 80127 82517 -464233 -32084 198620
8813 198620 169097 -24249 20374 425124 303682 258102 190859 -36399 29222 97139 -179820
8802 -179820 -327336 -209442 15376 119087 549384 454605 479746 632166 746211 468268
8792 468268 427853 625860 449282 282718 -6824 -237083 -123423 199254 283066 430893
8782 430893 458944 412424 65728 -64222 188713 684087 867271 610382 674237 528270
$$ packed form
8854B56693K91311M5831R9050J54476j66261L1545M1807j65248m09310j60418
8844A9476K53644J93063j40567J19292K81491j48381p21196m39747J42039K22648
8834b18238K8334Q454q2596q5299K42149Q2197k66568m7850J42521K44515r8270
8823e0651j06521j8871K36167L32623j00186k12434K390n46750M32149K30704
8813A98620k9523j93346M4623M04750j21442m5580o7243k27258O5621O7917k76959
8802a79820j47516J17894K24818J03711M30297r4779K5141J52420J14045k77943
8792D68268m0415J98007j76578j66564k89542k30259J13660L22677Q3812J47827
8782D30893K8051m6520l46696j29950K52935M95374J83184k56889O3855j45967
$$ plain form
8772 528270 288076 359113 754536 577958 492809 297517 23723 202460 343581 305188
8762 305188 -14295 -104793 226566 329591 234175 243749 -202598 -234282 -3838 164119 305300
8751 305300 151524 -23467 -54265 -266070 95891 310818 368136 279189 122136 23760
8741 23760 111493 300631 517380 302577 105588 -62736 -329662 -24928 81905 150543
8731 150543 93340 46288 -3132 -305395 -197333 105114 192042 409281 565836 488109 258414
8720 258414 552926 540562 473889 453054 159829 205433 496219 257781 351572 504505 131055
8709 131055 -126746 6626 148703 354101 139075 -22685 301277 59122 25318 30437
8699 30437 -14978 58708 57187 146225 23923 233919 59108 -268204 14791 213659 -20411
$$ packed form
8772E28270k40194P1037L95423j76578q5149j95292k73794J78737J41121l8393
8762C05188l19483r0498L31359J03025r5416R574m46347l1684K30444J67957J41181
8751C05300j53776j74991l0798k11805L61961K14927N7318q8947j57053r8376
8741B3760Q7733J89138K16749k14803j96989j68324k66926L04734J06833O8638
8731A50543n7203m7052m9420l02263J08062L02447Q6928K17239J56555p7727k29695
8720B58414K94512j2364o6673k0835k93225M5604K90786k38438R3791J52933l73450
8709A31055k57801J33372J42077K05398k15026j61760L23962k42155l3804N119
8699C0437m5415P3686j521Q9038j22302K09996j74811l27312K82995J98868k34070
$$ plain form
8688 -20411 -150423 134242 332674 62390 -272761 -140483 180336 225656 477974 441759
8678 441759 435240 157703 77370 263909 274821 238496 92360 128201 66765 117414 -28087
8667 -28087 -27606 23726 -397265 -403588 90682 157599 -26919 -159078 -128380 -120083 148808 -205289
8655 -205289 -402444 -251476 19630 27913 133652 408274 255554 -122972 14663 287523
8645 287523 338298 300962 386813 225069 -3921 -138865 -153478 160757 468092 607399
8635 607399 678895 436549 638172 669083 628870 503844 497322 200183 -27998 -252793 16184
8624 16184 414350 450798 286003 67753 -17458 -37327 -84557 -101242 -24107 152110 -127113
8613 -127113 -80603 -230909 -243806 -241986 48641 310020 389273 218524 -396557 -743492 -511569
$$ packed form
8688b0411j30012K84665J98432k70284l35151J32278L20819M5320K52318l6215
8678D41759o519k77537q0333J86539J0912l6325j46136L5841o1436N0649j45501
8667b8087M81N1332m20991o323M94270O6917j84518j32159L0698Q297K68891l54097
8655b05289j97155J50968K71106Q283J05739K74622j52720l78526J37635K72860
8645B87523N0775l7336Q5851j61744k28990j34944j4613L14235L07335J39307
8635F07399P1496k42346K01623L0911m0213j25026o522k97139k28181k24795K68977
8624A6184L98166L6448j64795k18250q5211j9869m7230j6685P7135J76217k79223
8613a27113M6510j50306j2897J820K90627K61379P9253j70749o15081l46935K31923
$$ plain form
8602 -511569 -95301 -486561 -819703 -610071 -469578 -476150 -280259 -75779 -87303 319069
8592 319069 363055 84658 -197078 126672 507629 418919 481070 652494 630503 657930 612276
8581 612276 421231 221173 288411 265732 359726 245499 167489 257293 85491 322844 71846
8570 71846 -108646 -250396 -215246 -40134 160144 169436 189962 436498 532302 313429 367113
8559 367113 649233 913007 689671 811705 902144 828809 523681 452833 474459 590611
8549 590611 760928 1047531 965889 965412 854720 704858 345179 -109685 -176534 56844 167453
8538 167453 152545 64435 -49144 86469 268845 18138 -3903 503301 652034 493657
8528 493657 646281 797709 1001566 787994 479683 141563 575413 257123 -82953 245845
$$ packed form
8602e11569M16268l91260l33142K09632J40493o572J95891K04480j1524M06372
8592C19069M3986k78397k81736L23750L80957q8710O2151J71424k1991K7427m5654
8581F12276j91045k00058O7238k2679R3994j14227p8010Q9804j71802K37353k50998
8570G1846j80492j41750L5150J75112K00278R292K0526K46536R5804k18873N3684
8559C67113K82120K63774k23336J22034R0439p3335l05128p0848K1626J16152
8549E90611J70317K86603q1642m77j10692j49862l59679m54864o6849K33378J10609
8538A67453j4908q8110j13579J35613J82376k50707k2041N07204J48733j58377
8528D93657J52624J51428K03857k13572l08311l38120M33850l18290l40076L28798
$$ plain form
8518 245845 338658 448161 470483 460649 341590 334815 394668 626592 643674 532758 375071
8507 375071 267138 124882 227499 405979 390669 563612 694119 580137 437924 315537
8497 315537 473575 415714 451667 337508 511994 709966 928319 658338 175764 306322
8487 306322 506452 288414 41899 145666 463461 732209 493649 169633 -27394 -307243
8477 -307243 -137967 288981 498874 286051 186530 350629 479224 362774 315568 123855
8467 123855 -74927 -144867 109228 317132 305001 345569 213172 73101 169540 282864
8457 282864 -126543 -568344 -263486 221434 601103 424928 26090 -232351 -236496 -6721
8447 -6721 379042 544165 457946 571373 562862 198597 146190 161673 158877 141686 85166 376735
$$ packed form
8518B45845R2813J09503K2322r834j19059o775N9853K31924J7082j10916j57687
8507C75071j07933j42256J02617J78480j5310J72943J30507j13982j42213j22387
8497C15537J58038n7861L5953j14159J74486J97972K18353k69981m82574J30558
8487C06322K00130k18038k46515J03767L17795K68748k38560l24016j97027k79849
8477c07243J69276M26948K09893k12823r9521J64099J28595j16450m7206j91713
8467A23855j98782o9940K54095K07904j2131M0568j32397j40071R6439J13324
8457B82864m09407m41801L04858M84920L79669j76175l98838k58441m145K29775
8447f721L85763J65123q6219J13427q511l64265n2407J5483k796j7191n6520K91569
$$ plain form
8435 376735 652184 792916 406031 -198973 -204644 41489 60302 242206 251745 104604 83820
8424 83820 7683 562946 395967 193948 343567 305970 -23154 -114808 -122659 -113947 149005
8413 149005 438655 534759 276675 375942 513039 213631 1881 18182 5804 -225870
8403 -225870 -222324 -238374 -127048 -171029 -266218 -125579 94257 128099 328123 191935 227255
8392 227255 -79777 -121074 -61509 -103677 -213977 -280822 -101924 17469 -26913 -202400 -336506
8381 -336506 -121151 -95556 -214528 -328687 -533127 -507350 -188748 1441 125683 4399
8371 4399 194092 279388 120832 34409 -292918 -738020 -629590 -282208 -14291 180733
8361 180733 112332 291076 429998 286038 359162 469352 302895 124345 47859 -57482
$$ packed form
8435C76735K75449J40732l86885o05004n671K46133J8813J81904R539j47141k0784
8424H3820p6137N55263j66979k02019J49619l7597l29124r1654p851Q712K62952
8413A49005K89650R6104k58084R9267J37097k99408k11750J6301j2378k31674
8403b25870L546j6050J11326m3981r5189J40639K19836L3842K00024j36188L5320
8392B27255l07032m1297N9565m2168j10300o6845J78898J19393m4382j75487j34106
8381c36506K15355K5595j18972j14159k04440K5777L18602J90189J24242j21284
8371D399J89693Q5296j58556q6423l27327m45102J08430L47382K67917J95024
8361A80733o8401J78744J38922j43960P3124J10190j66457j78550p6486j05341
$$ plain form
8351 -57482 -86604 -30886 -150468 -304316 -338590 -522906 -370546 157333 648174 258136
8341 258136 43573 678483 852449 557581 548939 307118 26807 225133 253975 39771
8331 39771 65638 143067 236359 335215 143675 97822 172234 181440 473919 637640 599339
8320 599339 714525 757715 205874 103194 31090 352181 91830 -167685 -77101 -161892
8310 -161892 -28515 135205 287634 655275 574105 -2144 -395175 -391055 -622457 -502939
8300 -502939 314657 559506 461337 781284 601762 577172 726718 385901 -38201 9102
8290 9102 -58443 251633 573243 938964 964734 809205 717166 396936 321119 227907 165762
8279 165762 124316 44365 198747 40254 -257299 -353137 -344936 -367350 -328784 -128463 -243579
$$ packed form
8351e7482k9122N5718j19582j53848l4274j84316J52360N27879M90841l90038
8341B58136k14563O34910J73966k94868q642k41821k80311J98326K8842k14204
8331C9771K5867P7429R3292R8856j91540m5853P4412R206K92479J63721l8301
8320E99339J15186M3190n51841j02680p2104L21091k60351k59515R0584q4791
8310a61892J33377J63720J52429L67641q1170n76249l93031M120k31402J19518
8300e02939Q17596K44849r8169L19947j79522k4590J49546l40817m24102M7303
8290I102o7545L10076L21610L65721K5770j55529r2039l20230p5817r3212o2145
8279A65762m1446p9951J54382j58493k97553r5838Q201k2414L8566K00321j15116
$$ plain form
8268 -243579 93516 599872 622343 339687 189336 205320 59391 209336 274307 106200
8258 106200 95642 141205 -303588 -127205 265912 575668 499955 450955 452413 223156 -13959
8247 -13959 192455 301473 -215843 -380250 -363564 -50376 110713 331054 32211 -397450
8237 -397450 -412764 -394725 -496227 -359119 -259675 -281869 -272775 -314809 -410837 -493857 -359532
8226 -359532 -291734 -281276 -293851 -356443 -225975 -228124 -572501 -749049 -412220 139 -65019
8215 -65019 -322711 -295918 -48750 -274680 -711367 -471935 -400596 -321472 -230369 -356169 -506615
8204 -506615 -527797 -298669 -82536 -86652 -271479 -171484 109273 115032 -74059 -249472 -247291
8193 -247291 -197132 -33226 -71627 -350045 -88504 -674665 -843054 -666613 -281795 -227619
$$ packed form
8268b43579L37095N06356K2471k82656j50351J5984j45929J49945O4971j68107
8258A06200j0558M5563m44793J76383L93117L09756p5713m9000J458k29257k37115
8247a3959K06414J09018n17316j64407J6686L13188J61089K20341k98843m29661
8237c97450j5314J8039j01502J37108R9444k2194R094m2034r6028q3020J34325
8226c59532O7798J0458j2575o2592J30468k149l44377j76548L36829M12359o5158
8215f5019k57692K6793K47168k25930m36687K39432P1339P9124R1103j25800j50446
8204e06615k1182K29128K16133m116j84827R9995K80757N759j89091j75413K181
8193b47291N0159J63906l8401k78418K61541n86161j68389J76441L84818N4176
$$ plain form
8183 -227619 -131808 360653 369629 244275 217076 142036 216630 281907 138365 -17622 -142292
8172 -142292 7070 70587 -55297 27414 -267378 -337509 950 -74230 -329391 -334015 -224421
8161 -224421 66461 78953 -6348 -152703 -406831 -239936 9681 198278 75720 -426740
8151 -426740 -277313 424165 108606 -89747 -230662 -159700 -148391 50198 87026 -216923
8141 -216923 -159487 -119424 67642 -429146 -54843 334619 479114 595852 469662 146660
8131 146660 -122108 -75651 86986 373174 648971 404341 301442 210620 63191 -263802
8121 -263802 -245860 -179211 -359269 -434182 -348829 -309301 -78920 27598 -89414 -134226 -140021
8110 -140021 -428952 -313465 -321491 -107659 170061 -5482 -2463 -344705 -407328 15598 -104058
$$ packed form
8183b27619R5811M92461Q976j25354k7199p5040P4594O5277j43542j55987j24670
8172a42292J49362O3517j25884Q2711k94792p0131L38459p5180k55161m624J09594
8161b24421K90882J2492q5301j46355k54128J66895K49617J88597j22558n02460
8151d26740J49427P01478l15559j98353j40915P0962J1309J98589L6828l03949
8141b16923N7436M0063J87066m96788L74303L89462J44495J16738j26190l23002
8131A46660k68768M6457J62637K86188K75797k44630j02899r0822j47429l26993
8121b63802J7942O6649j80058p4913Q5353L9528K30381J06518j17012m4812n795
8110a40021k88931J15487q026K13832K77720j75543L019l42242o2623M22926j19656
$$ plain form
8099 -104058 139638 550644 735903 553331 400150 228023 131491 -363369 -214164 -108698
8089 -108698 -184199 -61893 -70880 170494 91194 70086 87262 104687 -141269 -401511 -706494
8078 -706494 -658464 -431855 -112387 271738 110883 -25593 -55169 168987 651768 932590
8068 932590 558242 118383 4876 -195193 -413902 -278106 -184306 27108 271296 273958
8058 273958 158266 483345 640567 560711 413890 -832 -195324 -221190 -423767 -291246
8048 -291246 -171703 -25712 204500 30647 -135411 217783 299869 127146 175208 44740
8038 44740 108079 316570 -85433 -231842 -360244 -226767 -229710 -115192 -55133 -143282 -500947
8027 -500947 -465053 -25802 -104756 -309742 -345010 -321688 -157471 -86599 16822 198424 -56575
$$ packed form
8099a04058K43696M11006J85259j82572j53181j72127r6532m94860J49205J05466
8089a08698p5501J22306q987K41374p9300k1108J7176J7425k45956k60242l04983
8078g06494M8030K26609L19468L84125j60855j36476k9576K24156M82781K80822
8068I32590l74348m39859j13507k00069k18709J35796R3800K11414K44188K662
8058B73958j15692L25079J57222p9856j46821m14722j94492k5866k02577J32521
8048b91246J19543J45991K30212j73853j66058L53194Q2086j72723M8062j30468
8038D4740O3339K08491m02003j46409j28402J33477k943J14518O0059q8149l57665
8027e00947L5894M39251p8954k04986l5268K3322J64217P0872J03421J81602k54999
$$ plain form
8016 -56575 -298664 -492925 -380885 221004 59572 -64192 124430 572288 679658 391439
8006 391439 -5462 -131439 -66901 -131216 -416294 -266109 -313419 -185760 -266993 -406962
7996 -406962 -128502 -202516 -118561 -287683 -384302 -297472 -157175 -31898 -383941 -540402
7986 -540402 -176272 579493 837195 710090 365662 54932 -198068 -136756 159812 130859
7976 130859 -264300 -216351 -278173 -431278 -205787 -104233 159389 253218 121731 -32258
7966 -32258 -300309 -329359 -299349 -370771 18454 -177926 -11416 682 -18121 10700 -93949
7955 -93949 -337662 -87035 122384 10700 38258 -273422 -258796 -115856 51233 43661 -141259
7944 -141259 95516 342791 398367 313109 -27297 -128568 -2390 250738 307209 -31196
$$ packed form
8016e6575k42089j94261J12040O01889j61432j23764J88622M47858J07370k88219
8006C91439l96901j25977O4538o4315k85078J50185m7310J27659q1233j39969
7996d06962K78460p4014Q3955j69122r6619Q6830J40297J25277l52043j56461
7986e40402L64130P55765K57702j27105l44428l10730k53000O1312K96568k8953
7976A30859l95159M7949o1822j53105K25491J01554K63622R3829j31487j53989
7966c2258k68051k9050L0010p1422L89225j96380J66510J2098j8803K8821j04649
7955i3949k43713K50627K09419j11684K7558l11680J4626J42940J67089p572j84920
7944a41259K36775K47275N5576q5258l40406j01271J26178K53128N6471l38405
$$ plain form
7934 -31196 -159612 -159594 -114726 113449 372028 259871 83006 -69933 -35725 -149684 -467592
7923 -467592 -546949 -613259 -452980 -285788 -65806 65712 5459 38286 198786 292719 125713
7912 125713 225724 215927 -322688 -344955 120428 574187 669341 274481 214518 235644 43973
7901 43973 -68942 -140330 -202835 -115040 225285 261699 402248 343495 330766 413168 119394
7890 119394 -270666 -331237 -307306 131948 -40989 -478060 -514492 -408601 -306723 -123287
7880 -123287 -201938 -202970 -61766 24920 23456 91768 193507 80572 -16683 -326082 -425487
7869 -425487 -238937 37644 22464 22611 -13350 -428044 -648174 -604219 -327424 -324829 -113705
7858 -113705 527137 493198 -60610 301186 392795 373918 44754 14971 -95856 -116330 63142
$$ packed form
7934c1196j28416J8M4868K28175K58579j12157j76865j52939L4208j13959l17908
7923d67592p9357o6310J60279J67192K19982J31518o0253L2827J60500R3933j67006
7912A25713J00011r797n38615k2267M65383M53759R5154l94860n9963K1126j91671
7901D3973j12915p1388o2505Q7795L40325L6414J40549n8753j2729Q2402k93774
7890A19394l90060o0571K3931M39254j72937m37071l6432J05891J01878J83436
7880a23287p8651j032J41204Q6686j464O8312J01739j12935r7255l09399r9405
7869d25487J86550K76581j5180J47l5961m14694k20130M3955K76795K595K11124
7858a13705O40842l3939n53808L61796R1609j8877l29164k9783j10827k0474J79472
$$ plain form
7847 63142 377097 539681 247386 165101 189880 84791 -12058 94227 2663 74317 10655
7836 10655 -256734 -532791 -234752 -109966 238793 341316 129193 -4387 -96582 -339674
7826 -339674 -466643 -351940 -276542 -209356 -172099 -77724 -175122 -145754 -145279 -172948 82765
7815 82765 398872 427805 287885 -39432 -64599 27711 -123881 -120740 -118169 -161017 -353813
7804 -353813 -333053 197351 330334 38850 -263135 -549107 -751434 -733732 -481776 -431376
7794 -431376 -424061 -131621 -26628 107147 232420 102899 -2280 235402 180138 -142267
7784 -142267 -287921 -262856 -316977 -105296 74076 62166 -117232 -189664 -158066 -4008 -234773
7773 -234773 -383221 -365858 -461921 -108283 -112768 -211667 -370110 -545971 -359793 -204341 -294033
$$ packed form
7847F3142L13955J62584k92295q2285K4779j05089r6849J06285r1564P1654o3662
7836A0655k67389k76057K98039J24786L48759J02523k12123j33580r2195k43092
7826c39674j26969J14703P5398O7186L7257R4375r7398K9368M75k7669K55713
7815H2765L16107K8933j39920l27317k5167R2310j51592L141K571m2848j92796
7804c53813K0760N30404J32983k91484l01985k85972k02327J7702K51956N0400
7794d31376P315K92440J04993J33775J25273j29521j05179K37682n5264l22405
7784a42267j45654K5065n4121K11681J79372j1910j79398p2432L1598J54058k30765
7773b34773j48448J7363r6063L53638m485r8899j58443j75861J86178J55452q9692
$$ plain form
7762 -294033 -363528 -357140 -307681 -279524 -327004 -538610 -655574 -598588 -348824 -352635 -669941
7751 -669941 -659131 -261109 -279798 -303413 -21871 262870 502286 499456 274859 149442 69681
7740 69681 125362 119094 66051 45126 -85289 -214994 -567206 -741434 -1127868 -748673 -456026
7729 -456026 -171103 -100164 346027 499081 223103 109278 -207 -220361 -476669 -566582
7719 -566582 -303285 -54443 -251333 -127806 102754 189265 264646 201322 413688 322790
7709 322790 269293 -24522 -239554 -381136 -400500 -364504 -36723 -86548 -166190 25812 -28037
7698 -28037 -395810 -532000 -419790 -364246 -343425 -331046 -269165 -155559 -234923 -428455 -825116
7687 -825116 -872502 -924869 -708100 -354818 -261615 -258090 -390070 -435495 -383842 -714871 -413043
$$ packed form
7762b94033o9495O388M9459K8157m7480k11606j16964N6986K49764l811l17306
7751f69941J0810L98022j8689k3615K81542K84741K39416k830k24597j25417p9761
7740F9681N5681o268n3043k0925j30415j29705l52212j74228l86434L79195K92647
7729d56026K84923P0939M46191J53054k75978j13825j09485k20154k56308q9913
7719e66582K63297K48842j96890J23527K30560Q6511P5381o3324K12366r0898
7709C22790n3497k93815k15032j41582j9364L5996L27781m9825p9642J92002n3849
7698b8037l67773j36190J12210N5544K0821J2379O1881J13606p9364j93532l96661
7687h25116m7386n2367K16769L53282R3203L525j31980m5425N1653l31029L01828
$$ plain form
7676 -413043 -127773 200907 236978 618936 551595 -73840 -137802 498581 645943 506727
7666 506727 534509 326943 92909 145583 272785 526211 668912 860110 715064 468552
7656 468552 593718 194270 65074 51415 -82839 194559 369901 194187 -10592 -212563
7646 -212563 -56770 93009 223069 508870 485249 492784 401965 225390 91145 79323 297647
7635 297647 317318 348061 445396 335066 82207 -192560 -466659 -288323 52937 192481
7625 192481 293680 264870 75245 91437 115585 -310280 -308777 -287472 -365775 -372580 -347663
7614 -347663 -549063 -112310 -121978 -718724 -711656 -450758 -452813 -404159 -340310 -127591 -231659
7603 -231659 -331881 -75195 -97888 -328589 237 79750 229264 157547 129654 -145364
$$ packed form
7676d13043K85270L28680L6071L81958o7341o25435o3962O36383J47362j39216
7666E06727K7782k07566k34034N2674J27202K53426J42701J91198j45046k46512
7656D68552J25166l99448j29196j3659j34254K77398J75342j75714k04779k01971
7646b12563J55793J49779J30060K85801k3621P535r0819j76575j34245j1822K18324
7635B97647J9671L0743R7335j10330k52859k74767k74099J78336L41260J39544
7625A92481J01199k8810j89625J6192K4148m25865J503K1305p8303o805K4917
7614c47663k01400M36753r668n96746P068K60898k055M8654O3849K12719j04068
7603b31659j00222K56686k2693k30701L28826P9513J49514p1717k7893k75018
$$ plain form
7593 -145364 -205187 -13443 231589 190072 207346 152551 -467702 -775483 -553225 -377959
7583 -377959 -174722 -12361 181658 139868 -204770 -548461 -648834 -735531 -562443 -30848
7573 -30848 218879 180737 185122 180908 74820 156544 -156060 -411112 -654302 -656777 -444579
7562 -444579 133842 468327 94160 993 89750 48743 -351679 -362395 -245071 70494
7552 70494 -20974 -575795 -483727 -297275 -708798 -698653 -831669 -957237 -653025 -347002
7542 -347002 -290073 -552186 -146261 -323920 -569545 -944844 -603883 -100028 247357 9897
7532 9897 -234368 -371205 -170511 151889 292952 61765 -63878 96562 -17601 -235284
7522 -235284 -611642 -769485 -610244 -415795 -617364 -709470 -633270 -397254 -450789 -602462
$$ packed form
7593a45364n9823J91744K45032m1517J7274n4795o20253l07781K22258J75266
7583c77959K03237J62361J94019m1790l44638l43691j00373q6697J73088N31595
7573c0848K49727l8142M385m214j06088Q1724l12604k55052k43190k475K12198
7562d44579N78421L34485l74167r3167Q8757m1007m00422j0716J17324L15565
7552G0494r1468n54821R2068J86452m11523J0145j33016j25568L04212L06023
7542c47002N6929k62113M05925j77659k45625l75299L40961N03855L47385k37460
7532I897k44265j36837K00694L22400J41063k31187j25643J60440j14163k17683
7522b35284l76358j57843J59241J94449k01569r2106P6200K36016n3535j51673
$$ plain form
7512 -602462 -58610 414893 391581 479365 354195 115838 -209896 -318440 -302369 -89544
7502 -89544 115291 -80959 -177180 -146787 -388766 -272610 65642 263421 365208 157138
7492 157138 85905 272498 -170527 -491046 -501571 -408607 -125017 -373088 -316359 46250
7482 46250 298231 150006 -197020 -479452 -649821 -700396 -785377 -826252 -292326 90070
7472 90070 53905 -236791 -347915 -27609 273487 226949 -62623 -415768 -247188 -36609
7462 -36609 -279530 -354520 -174890 -120398 -172810 -155715 -29381 -249973 -432442 -362237 23189
7451 23189 265955 -314949 -731288 -584922 -438856 -294685 -352356 -388876 -446880 -326524
7441 -326524 -97901 15113 -288792 -354053 -277818 110122 212541 261910 174283 -285799
$$ packed form
7512f02462N43852M73503k3312Q7784j25170k38357l25734j08544J6071K12825
7502h9544K04835j96250r6221L0393k41979J16156L38252J97779J01787k08070
7492A57138p1233J86593m43025l20519j0525R2964K83590k48071N6729L62609
7482D6250K51981j48225l47026k82432j70369n0575q4981m0875N33926L82396
7472I0070l6165k90696j11124L20306L01096m6538k89572l53145J68580K10579
7462c6609k42921p4990J79630N4492n2412J7095J26334k20592j82469P0205L85426
7451B3189K42766n80904m16339J46366J46066J44171n7671l6520n8004J20356
7441c26524K28623J13014l03905o5261P6235L87940J02419M9369q7627m60082
$$ plain form
7431 -285799 -557413 -310114 -283148 -522563 -1027326 -1122009 -716846 -481939 -365555 -71231
7421 -71231 152136 399617 702335 694431 386115 165216 -49571 43870 66072 -41002 272328
7410 272328 397944 75969 29832 167837 329341 137023 -11928 -176852 -102024 -233123
7400 -233123 -187796 -373783 -308617 -228952 -636988 -836366 -452041 -253953 -169831 6703
7390 6703 305009 517344 596625 358729 332245 484721 253987 238370 333803 131333 -209253
7379 -209253 -310030 -104876 167642 118138 -123489 -329390 -404169 -364918 -359576 -532955 -539910
7368 -539910 -702148 -430821 -218486 -42664 -73883 -155961 -110080 -382000 -387786 -347618 -119867
7357 -119867 127479 284103 64074 -20305 -105273 -410077 -257656 241697 410212 302891
$$ packed form
7431b85799k71614K47299K6966k39415n04763r4683M05163K34907J16384K94324
7421g1231K23367K47481L02718p904l08316k20899k14787R3441K2202j07074L13330
7410B72328J25616l21975m6137J38005J61504j92318j48951j64924P4828j31099
7400b33123M5327j85987O5166P9665m08036j99378L84325J98088Q4122J76534
7390F703K98306K12335P9281k37896k6484J52476k30734j5617R5433k02470l40586
7379b09253j00777K05154K72518m9504k41627k05901p4779L9251N342j73379o955
7368e39910j62238K71327K12335J75822l1219q2078M5881k71920n786M0168K27751
7357a19867K47346J56624k20029q4379q4968l04804J52421M99353J68515j07321
$$ plain form
7347 302891 35113 13677 -219039 -172915 220453 26817 -198435 -207707 -143413 -76122 -6995
7336 -6995 57824 216604 153575 73679 -10393 -27390 281744 309376 99630 -2908 40080
7325 40080 56173 -25871 -266707 -264829 -394333 -512693 -820344 -576841 -665535 -546029 -356325
7314 -356325 -426926 -278201 -7500 -112451 -203124 -233259 -209799 113118 233106 172384 23991
7303 23991 -124900 -146536 -217207 -552700 -188290 110048 386746 618273 415554 -27211
7293 -27211 -241530 -22644 -54323 -194634 -411043 -373626 -407423 84379 167069 -63241 23576
7282 23576 50071 283979 93946 -44811 16063 -67926 8477 -44594 -34822 -32167 -186402
7271 -186402 -199125 -43856 151428 438748 468766 496153 274705 -323088 -541318 -240060
$$ packed form
7347C02891k67778k1436k32716M6124L93368j93636k25252r272O4294O7291O9127
7336f995O4819J58780o3029p9896q4072j6997L09134K7632k09746j02538M2988
7325D0080J6093q2044k40836J878j29504j18360l07651K43503q8694J19506J89704
7314c56325p0601J48725K70701j04951r0673l0135K3460L22917J19988o0722j48393
7303B3991j48891k1636p0671l35493L64410K98338K76698K31527k02719m42765
7293b7211k14319K18886l1679j40311k16409L7417l3797M91802Q2690k30310Q6817
7282B3576K6495K33908j90033j38757O0874q3989P6403n3071R772K655j54235
7271a86402j2723J55269J95284K87320L0018K7387k21448n97793k18230L01258
$$ plain form
7261 -240060 -348495 -412343 -132194 162814 182569 258161 356072 1716 38444 -283629 -620266
7250 -620266 -762066 -402168 -214082 -175522 -66238 51598 -30477 22510 -83098 -454509
7240 -454509 -502654 -366001 -28770 238568 132039 -105700 -154020 146353 264320 143108
7230 143108 -21995 -159710 -216831 -78981 4927 -33201 220518 5513 -41196 -188206
7220 -188206 -86784 55863 71946 45179 -139370 -254588 -226080 -439201 -503406 -613994
7210 -613994 -362077 -85587 -103942 -421771 -456632 -244646 67059 80618 -265988 -364475
7200 -364475 -226230 -573519 -1005846 -609785 -146605 119490 -16860 -262517 -288521 -176625
7190 -176625 -144081 -170735 -36476 56021 -104188 -23088 178729 256103 73576 -220313 -282629
$$ packed form
7261b40060j08435o3848K80149K95008J9755P5592R7911l54356L6728l22073l36637
7250f20266j41800L59898J88086L8560J09284J17836q2075N2987j05608l71411
7240d54509m8145J36653L37231K67338j06529k37739m8320L00373J17967j21212
7230A43108j65103j37715n7121J37850Q3908l8128K53719k15005m6709j47010
7220a88206J01422J42647J6083k6767j84549j15218K8508k13121o4205j10588
7210f13994K51917K76490j8355l17829l4861K11986L11705J3559l46606r8487
7200c64475J38245l47289m32327L96061M63180K66095j36350k45657k6004J11896
7190a76625L2544k6654J34259R2497j60209Q1100K01817P7374j82527k93889o2316
$$ plain form
7179 -282629 -117703 -65250 -147268 -244615 -220755 -359777 -266058 25285 -87548 -397768 -634669
7168 -634669 -605342 -286254 -172158 -209914 -242103 107749 142130 367142 239428 223500 534625
7157 534625 174591 -119720 132786 181545 -155379 -476551 -286888 -196290 -114697 30287
7147 30287 -424905 -812871 -596841 -10590 -155092 -377027 -393757 -136011 114671 22058
7137 22058 -103207 -14390 -94303 -178507 -248264 -74947 -111012 -44508 61249 242000 241580
7126 241580 -166079 -230550 -275690 -124487 -27915 85706 -159977 -278507 -314546 -255983 -83828
7115 -83828 -143184 -111902 -20808 239904 348279 344449 539663 200984 200664 103762 252448
7104 252448 118585 80294 125442 38247 117214 85831 -112201 -138725 443837 538864 280342
$$ packed form
7179b82629J64926N2453q2018r7347K3860j39022R3719K91343j12833l10220k36901
7168f34669K9327L19088J14096l7756l2189L49852L4381K25012j27714j5928L11125
7157E34625l60034k94311K52506M8759l36924l21172J89663R0598Q1593J44984
7147C0287m55192l87966K16030N86251j44502k21935j6730K57746K50682r2613
7137B2058j25265Q8817p9913q4204o9757J73317l6065O6504J05757J80751m20
7126B41580m07659o4471m5140J51203R6572J13621k45683j18530l6039N8563J72155
7115h3828n9356L1282R1094K60712J08375l830J95214l38679l20r6902J48686
7104B52448j33863l8291M5148q7195P8967l1383j98032k6524N82562R5027k58522
$$ plain form
7093 280342 57728 -34186 -280184 -212240 -23158 27913 159410 263440 324938 -50300
7083 -50300 -310373 -168134 -166236 -181361 -386661 -560076 -585741 -716743 -840720 -868950 -504217
7072 -504217 -113221 -145436 -331182 -359446 -288490 -353849 -442724 -424927 -132021 -240263 -599097
7061 -599097 -618454 -291951 201137 102786 261658 214982 338167 343468 312625 233580 -38798
7050 -38798 -241124 -63641 -413297 -117233 236719 140092 -713836 -837279 -471398 -421149
7040 -421149 -428689 -579766 -485540 -244203 -240357 -83907 -247611 -531570 -331160 -59312 -131343
7029 -131343 -90060 47111 -46521 -320571 -62517 125966 11816 -216436 -203338 -235892
7019 -235892 -197592 -114078 -42123 -251348 -141886 -149689 -391792 -590696 -538702 -292899 -199259
$$ packed form
7093B80342k22614r1914k45998O7944J89082N1071J31497J04030O1498l75238
7083e0300k60073J42239J898j5125k05300j73415k5665j31002j23977k8230L64733
7072e04217L90996l2215j85746k8264P0956o5359q8875J7797K92906j08242l58834
7061e99097j9357L26503M93088r8351J58872m6676J23185N301l0843p9045k72378
7050c8798k02326J77483l49656K96064L53952r6627q53928j23443L65881N0249
7040d21149p540j51077R4226K41337L846J56450j63704k83959K00410K71848p2031
7029a31343M1283J37171r3632k74050K58054J88483j14150k28252J3098l2554
7019b35892L8300Q3514P1955k09225J09462p803k42103j98904N1994K45803R3640
$$ plain form
7008 -199259 -205552 -56872 -20186 -192215 -466020 -508741 -562678 -195734 199757 182467 94101
6997 94101 -24940 140261 205529 -17484 -44129 -34787 -58923 -70503 -250907 -147969 238053
6986 238053 -15563 -271013 -464502 -451164 -161509 129485 -56794 -99617 -569867 -475505
6976 -475505 -331927 -462346 -913801 -960016 -806243 -982712 -843153 -750513 -580747 -334052
6966 -334052 -184927 -422782 -444772 -365856 -606205 -920258 -1015241 -522025 -98986 -4983
6956 -4983 -269252 -325832 -440739 -558099 -673639 -671223 -617897 -689266 -831394 -559090 -430732
6945 -430732 -375915 -882058 -776759 -604898 -585334 -576255 -293907 -146689 -102537 -157485 -140602
6934 -140602 -359677 -521343 -424757 -365016 -227143 -24916 154318 120534 -116265 -177179
$$ packed form
7008a99259o293J48680L6686j72029k73805m2721n3937L66944L95491j7290q8366
6997I4101j19041J65201O5268k23013k6645R342k4136j1580j80404J02938L86022
6986B38053k53616k55450j93489J3338K89655K90994j86279m2823m70250R4362
6976d75505J43578j30419m51455m6215J53773j76469J39559R2640J69766K46695
6966c34052J49125k37855k1990P8916k40349l14053r4983M93216M23039R4003
6956d983k64269n6580j14907j17360j15540K416N3326p1369j42128K72304J28358
6945d30732N4817n06143J05299J71861J9564R079K82348J47218M4152n4948J6883
6934a40602k19075j61666R6586N9741J37873K02227J79234l3784k36799o0914
$$ plain form
6924 -177179 -9308 13910 -40144 136227 -391287 -461257 -369783 -311920 141309 463818 394335
6913 394335 384429 156688 -37261 -45700 -57520 -82524 -122954 -343647 -414022 -284977 94952
6902 94952 44831 -89935 -76107 -135221 -45567 -23130 331223 266020 197169 140321 -73160
6891 -73160 -330215 -169243 -8991 -114204 -113328 80792 72298 45836 -91160 -283467 -288450
6880 -288450 -292063 -264845 -269357 -74440 20249 -523 -176603 -89422 -139420 -231094 -207904 -206587
6868 -206587 -151648 -346969 -218899 20214 41463 -144465 -362776 -497400 -596405 -605812 -120513
6857 -120513 447076 565852 513891 59166 -142031 -210488 -325870 -189774 108749 -149992
6847 -149992 -586779 -602884 -219468 228768 299492 -51291 -320330 -197470 -84367 -181969
$$ packed form
6924a77179J67871K3218n4054J76371n27514o9970R1474N7863M53229L22509o9483
6913C94335r906k27741j93949q439j1820k5004m0430k20693p0375J29045L79929
6902I4952n0121j34766J3828n9114Q9654K2437L54353o5203o8851n6848k13481
6891g3160k57055J60972J60252j05213Q76J94120q494k6462j36996j92307m983
6880b88450l613K7218m512J94917R4689k0772j76080Q7181m9998r1674K3190J317
6868b06587N4939j95321J28070K39113K1249j85928k18311j34624r9005r407M85299
6857a20513N67589J18776n1961m54725k01197o8457j15382J36096K98523k58741
6847a49992m36787j6105L83416M48236P0724l50783k69039J22860J13103r7602
$$ plain form
6837 -181969 -386847 -320672 -91816 -472237 -216463 -50818 -200215 -94714 80505 59438
6827 59438 -124703 -369173 -493861 -639551 -579372 -364066 -166571 -109459 -244058 -73636
6817 -73636 230199 218060 -296894 -502094 -536069 -265605 -244775 495202 767443 682471 399500
6806 399500 399009 364774 80923 -25208 -18027 -186863 -111904 -101303 -28823 258938 386067
6795 386067 83351 49521 -37757 245791 464099 188919 107544 153348 257504 228876 72558
6784 72558 -130113 -371838 -476251 -67260 169157 297670 537309 262121 -53949 -166591
6774 -166591 333208 235140 5106 -217773 1481 -142703 -297859 -623702 -601528 -436236
6764 -436236 -291944 -483268 -418630 -448514 -340873 -93492 9694 22966 -59032 97340
$$ packed form
6837a81969k04878O6175K28856l80421K55774J65645j49397J05501J75219k1067
6827E9438j84141k44470j24688j45690O0179K15306J97495N7112j34599J70422
6817g3636L03835j2139n14954k05200l3975K70464K0830P39977K72241q4972k82971
6806C99500m91l4235k83851j06131P181j68836P4959J0601P2480K87761J27129
6795C86067l02716l3830q7278K83548K18308k75180q1375M5804J04156k8628j56318
6784G2558k02671k41725j04413M08991K36417J28513K39639k75188l16070j12642
6774a66591M99799r8068k30034k22879K19254j44184j55156l25843K2174J65292
6764d36236J44292j91324O4638k9884J07641K47381J03186J3272q1998J56372
$$ plain form
6754 97340 93473 195414 -49605 -105782 -249842 -450368 -419848 -313428 -244059 -181740 -581700
6743 -581700 -445742 208156 110738 -313919 -302317 100607 -114918 -109477 -192276 -292614 -228458
6732 -228458 -386492 -242224 -417666 -619116 -513475 -92584 221464 301659 488416 587438
6722 587438 437396 197467 -17316 -263298 -438022 -331486 -33669 -73928 -314326 -156928
6712 -156928 275414 139483 71900 -90870 -33906 -80496 -115942 -78861 -85198 265074 87168
6701 87168 -109368 -407184 -301017 149540 135667 -27091 -153300 45421 195223 199650
6691 199650 74543 263163 517780 356881 287774 193108 -78087 -322373 -145040 10584
6681 10584 -100565 -95092 -453270 -653781 -265472 -64530 -69663 -46336 -204899 -342080 -466411
$$ packed form
6754I7340l867J01941k45019n6177j44060k00526L0520J06420O9369O2319l99960
6743e81700J35958O53898r7418m24657J1602M02924k15525N441q2799j00338O4156
6732b28458j58034J44268j75442k01450J05641M20891L14048Q0195J86757R9022
6722E87438j50042k39929k14783k45982j74724J06536K97817m0259k40398J57398
6712a56928M32342j35931o7583j62770N6964m6590l5446L7081o337L50272j77906
6701H7168j96536k97816J06167M50557j3873j62758j26209J98721J49802M427
6691A99650j25107J88620K54617j60899o9107r4666k71195k44286J77333J55624
6681A0584j11149N473l58178k00511L88309K00942n133K3327j58563j37181j24331
$$ plain form
6670 -466411 -636118 -641528 -503390 -442808 -273272 19145 -83000 -296239 173091 270371
6660 270371 48224 -243773 -271749 -342008 -441705 -225944 -290054 -139836 204215 284442 246826
6649 246826 400732 562922 574836 194776 -194500 -357711 -301340 -112657 -40649 -243282
6639 -243282 -256953 108331 428003 335695 476314 208564 79974 485968 571492 381495
6629 381495 216049 72367 173135 117861 -185315 -496070 -432665 -192645 -88125 -237096
6619 -237096 -71794 28010 -439434 -501002 -100898 -282464 -636735 -548889 -390166 -115317
6609 -115317 128412 48470 -288661 -224793 193171 139295 -86931 -227106 -168915 -423903
6599 -423903 -174788 159365 -158290 -574271 -601592 -398925 -136978 95167 225588 377199
$$ packed form
6670d66411j69707n410J38138O0582J69536K92417j02145k13239M69330R7280
6660B70371k22147k91997k7976p0259r9697K15761o4110J50218L44051Q0227l7616
6649B46826J53906J62190J1914l80060l89276j63211N6371J88683P2008k02633
6639b43282j3671L65284L19672r2308J40619k67750j28590M05994Q5524j89997
6629C81495j65446j43682J00768n5274l03176l10755O3405K40020J04520j48971
6619b37096J65302R9804m67444o1568M00104j81566l54271Q7846J58723K74849
6609a15317K43729p9942l37131O3868M17964n3876k26226j40175N8191k54988
6599d23903K49115L34153l17655m15981k7321K02667K61947K32145J30421J51611
$$ plain form
6589 377199 212307 -132797 -131542 -20986 210556 275029 186844 -71871 -249983 2946
6579 2946 -49354 -138403 -434269 -556039 -632203 -960250 -1032500 -1114458 -871069 -459838 72375
6568 72375 -118756 -299817 -188942 -86605 10292 42662 -199362 4490 97539 -52689
6558 -52689 -213983 -130871 502006 450939 355951 309355 525329 440145 -110176 -86727 -234579
6547 -234579 -257217 -189185 -142301 -543639 -818811 -928782 -749725 -311197 -69908 193798
6537 193798 -181946 -656806 -791583 -674119 -336655 36445 -10622 67295 -148992 -469986
6527 -469986 -524421 -601490 -355618 -239937 -855897 -828225 -687746 -246085 -25761 -178131
6517 -178131 129711 55615 -221727 -197333 51938 372769 388240 185226 92876 23473 -376650
$$ packed form
6589C77199j64892l45104J255J10556K31542O4473q8185k58715j78112K52929
6579B946n2300q9049k95866j21770p6164l28047p2250q1958K43389M11231N32213
6568G2375j91131j81061J10875J02337R6897L2370k42024K03852R3049j50228
6558e2689j61294Q3112O32877n1067r4988m6596K15974q5184n50321K3449j47852
6547b34579k2638O8032M6884m01338k75172j09971J79057M38528K41289K63706
6537A93798l75744m74860j34777J17464L37464L73100m7067P7917k16287l20994
6527d69986n4435p7069K45872J15681o15960K7672J40479M41661K20324j52370
6517a78131L07842p4096k77342K4394K49271L20831J5471k03014r2350o9403m00123
$$ plain form
6506 -376650 -483141 -369409 -460151 -498216 -579650 -574064 -472023 -698741 -507843 -253298 -309165
6495 -309165 -388779 -485498 -330102 -266438 -405704 -520780 -563686 -249517 -57426 -24381 -203033
6484 -203033 -333718 -195834 47239 217675 445162 480539 59392 -122349 137431 -97973
6474 -97973 -311119 -398431 -169613 75415 197876 -137309 -452166 -518761 -582292 -526706 -215041
6463 -215041 366203 431110 299515 253780 141458 30321 -59896 -406582 -542054 -453729
6453 -453729 -250292 -387075 -526250 -254960 -299946 -27953 226881 175425 34751 26062
6443 26062 -158302 -358469 -476637 -353510 -451192 -597376 -1086460 -1279364 -738442 -331297
6433 -331297 -311275 -24862 -43028 -389189 -575371 -272486 -514137 -607093 -400049 -298522
$$ packed form
6506c76650j06491J13732r0742l8065q1434N586J02041k26718J90898K54545n5867
6495c09165p9614r6719J55396O3664j39266j15076m2906L14169J92091L3045j78652
6484b03033j30685J37884K43073J70436K27487L5377m21147j81741K59780k35404
6474i7973k13146q7312K28818K45028J22461l35185l14857o6595o3531N5586L11665
6463b15041N81244O4907j31595m5735j12322j11137r0217l46686j35472Q8325
6453d53729K03437j36783j39175K71290m4986K71993K54834n1456j40674q689
6443B6062j84364k00167j18168J23127r7682j46184m89084j92904N40922M07145
6433c31297K0022K86413j8166l46161j86182L02885k41651r2956K07044J01527
$$ plain form
6423 -298522 -100313 55272 76222 12900 -206881 -459502 -187956 -133704 -397848 -420229
6413 -420229 -317893 -40738 57429 250814 431739 432977 594264 522333 -263465 -638763
6403 -638763 -241254 -66780 -201641 -108580 -438042 -656803 -288897 -226191 -184777 -312996
6393 -312996 -335476 -297550 -167850 -242551 -266784 -50311 -420481 -796356 -782797 -485084 110965
6382 110965 226920 266642 112868 33972 4297 -196903 -216628 -99939 -175643 -254130 -512614
6371 -512614 -538093 -543818 -561523 -692531 -377078 -546167 -520046 -590379 -654763 -316777 -134889
6360 -134889 -66877 -34311 -46597 49731 -143732 -115915 -106200 -84260 116585 134974 -12709
6349 -12709 -56256 -371185 -518396 -397512 32214 280612 264794 -48530 -202756 -216802
$$ packed form
6423b98522J98209J55585K0950o3322k19781k52621K71546N4252k64144k2381
6413d20229J02336K77155R8167J93385J80925J238J61287p1931p85798l75298
6403f38763L97509J74474j34861R3061l29462k18761L67906O2706M1414j28219
6393c12996k2480L7926J29700p4701k4233K16473l70170l75875J3559K97713N96049
6382A10965J15955L9722j53774p8896k9675k01200j9725J16689p5704p8487k58484
6371e12614k5479n725j7705j31008L15453j69089K6121p0333o4384L37986J81888
6360a34889O8012L2566j2286R6328j93463K7817R715K1940K00845J8389j47683
6349a2709m3547l14929j47211J20884M29726K48398j5818l13324j54226j4046
$$ plain form
6339 -216802 -695918 -500512 -58952 -304585 -519437 -786897 -833928 -624339 -449077 -449420
6329 -449420 -182120 -377978 -615310 -573761 -616816 -259272 -165591 -216401 -95415 -175017 -208747
6318 -208747 -221507 59029 62154 -71716 -381672 -350765 -560037 -511411 -441719 -115902 80613
6307 80613 -27068 -42827 -174088 -550342 -500490 -169940 -269486 -377300 -331842 63666 -103915
6296 -103915 -398249 -640084 -624209 -111103 -179894 -169609 -63451 -40894 -218102 -33904
6286 -33904 -78509 -119202 -151870 -350680 -378937 -422061 -250815 136040 224158 127787 -4748
6275 -4748 -132891 -152463 -129671 8236 228904 207238 181456 178285 216621 -155935 -309194
6264 -309194 -355082 -1745 109249 169415 114010 -179886 -268372 -195129 -270419 -378918 -257200
$$ packed form
6339b16802m79116J95406M41560k45633k14852k67460m7031K09589J75262l43
6329d49420K67300j95858k37332M1549m3055L57544R3681n0810J20986p9602l3730
6318b08747j2760K80536L125j33870l09956L0907k09272M8626O9692L25817J96515
6307H0613j07681j5759j31261l76254M9852L30550r9546j07814M5458L95508j67581
6296a03915k94334k41835J5875N13106o8791J0285J06158K2557j77208J84198
6286c3904m4605m0693l2668j98810k8257m3124J71246L86855Q8118r6371j32535
6275d748j28143j9572K2792J37907K20668k1666k5782l171L8336l72556j53259
6264c09194m5888L53337J10994O0166n5405k93896q8486P3243p5290j08499J21718
$$ plain form
6253 -257200 -409518 -391154 -411752 -499215 -240223 -21232 40576 -333029 -288064 201633 29847
6242 29847 -186002 -342473 -575673 -200135 -131148 -177828 -123466 26671 176459 226159 -32746
6231 -32746 -74120 41319 138089 224188 -140010 6850 203746 166833 56315 -287709 -17027
6220 -17027 87216 25724 91734 -137562 -255575 -150009 83910 119308 14213 14196 -98933
6209 -98933 -465025 -708237 -736863 -943752 -974567 -857712 -300800 -124786 -478274 -478177 -98515
6198 -98515 105778 -212444 -308165 -349620 -397990 -657769 -810250 -503208 -578730 -418056 -141037
6187 -141037 94249 -75521 -482938 -610244 -430129 -229293 -239850 -261633 -84168 281173
6177 281173 633691 663826 315183 299089 80377 -90216 -29193 34534 201493 -34790
$$ packed form
6253b57200j52318J8364k0598q7463K58992K18991O1808l73605M4965M89697j71786
6242B9847k15849j56471k33200L75538O8987m6680N4362J50137J49788M9700k58905
6231c2746m1374J15439R6770Q6099l64198J46860J96896l6913j10518l44024K70682
6220a7027J04243o1492O6010k29296j18013J05566K33919L5398j05095j7j13129
6209i8933l66092k43212k8626k06889l0815J16855N56912J76014l53488R7L79662
6198i8515K04293l18222r5721m1455m8370k59779j52481L07042p5522J60674K77019
6187a41037K35286j69770m07417j27306J80115K00836j0557k1783J77465L65341
6177B81173L52518L0135l48643j6094k18712j70593O1023O3727J66959k36283
$$ plain form
6167 -34790 -56766 288886 383821 139179 179712 471290 441457 370471 -123747 -131639 -235994
6156 -235994 -533470 -573040 -356559 -114000 207073 -13081 -44574 -102253 -205964 -81879
6146 -81879 -33870 -248620 3651 52092 -147509 107157 210896 -19854 236171 269495
6136 269495 314152 229960 182176 194936 391429 253237 206863 19635 181303 -26876 133013
6125 133013 335615 508165 101883 -313971 -632957 -319124 -195662 -580791 -395480 126002
6115 126002 304582 149397 221053 277835 -52648 -285158 -426727 -333640 -311466 -204073
6105 -204073 -277915 -350201 -113762 -145793 -174804 110592 167355 145527 -342730 -626987 -633100
6094 -633100 -378990 -168481 -439841 -566912 -358627 153375 297849 521108 560624 534100
$$ packed form
6167c4790k1976L45652R4935k44642M0533K91578k9833p0986m94218p892j04355
6156b35994k97476l9570K16481K42559L21073k20154l1493n7679j03711J24085
6146h1879M8009k14750K52271M8441j99601K54666J03739k30750K56025L3324
6136B69495M4657q4192m7784J2760J96493j38192m6374j87228J61668k08179J59889
6125A33013K02602J72550m06282m15854l18986L13833J23462l85129J85311N21482
6115A26002J78580j55185P1656N6782l30483k32510j41569R3087K2174J07393
6105b04073p3842p2286K36439l2031k9011K85396N6763k1828m88257k84257o113
6094f33100K54110K10509k71360j27071K08285N12002J44474K23259L9516k6524
$$ plain form
6084 534100 495383 491389 368369 105021 20350 324700 504902 240120 -19959 -217522
6074 -217522 -261451 -199899 -181085 -177710 -186820 -479299 -624893 -395635 99447 200231 155578
6063 155578 295972 197534 -116609 -160517 280051 201888 -302105 -598834 -397952 -322585
6053 -322585 -129819 -222276 -282689 6301 59703 79591 -95593 -102670 2222 -125590 -191868
6042 -191868 -197309 29417 171014 64333 -94805 -2107 -373594 -653836 -288382 -379115
6032 -379115 -766006 -534380 -49217 148523 141042 -25981 -31795 -83612 -217813 -51231 -252149
6021 -252149 -597890 -563542 -695154 -1015064 -638436 -120990 71497 223723 -148499 -242315
6011 -242315 -453647 -406458 -527559 -618979 -529176 -631501 -420972 -326515 -35642 190577
$$ packed form
6084E34100l8717l994j23020k63348q4671L04350J80202k64782k60079j97563
6074b17522m3929O1552J8814L375r110k92479j45594K29258M95082J00784m4653
6063A55578J40394r8438l14143m3908M40568p8163n03993k96729K00882P5367
6053c22585J92766r2457o0413K88990N3402J9888j75184p077J04892j27812o6278
6042a91868n441K26726J41597j06681j59138R2698l71487k80242L65454r0733
6032c79115l86891K31626M85163J97740p481j67023n814n1817j34201J66582k00918
6021b52149l45741L4348j31612l19910L76628N17446J92487J52226l72222r3816
6011b42315k11332M7189j21101r1420Q9803j02325K10529R4457K90873K26219
$$ plain form
6001 190577 186940 -185038 -551628 -371801 -304830 -293394 -603766 -491276 -343420 -100533
5991 -100533 -147547 -164328 -127814 188563 221853 265194 399827 225152 -101422 -22730 -100538
5980 -100538 -476519 -249117 39060 178270 120662 59543 171280 326810 -51720 -334868
5970 -334868 -424597 -234059 -179089 -266873 -230119 -372807 -437410 -582319 -278678 283449 204949
5959 204949 -90113 107952 383041 304241 310077 551970 503822 166633 185232 355347 167880
5948 167880 -252079 -63403 69957 269960 343325 166802 85649 110956 -178890 -639773
5938 -639773 -456246 -574936 -311481 -304995 -43198 -18868 -36940 -7556 219995 334671 197454
5927 197454 -14929 -399047 -562139 -325433 -404132 -634558 -552720 -658692 -1035376 -1080291
$$ packed form
6001A90577l637l71978l66590J79827O6971J1436l10372J12490J47856K42887
5991a00533m7014j6781L6514L16377L3290M3341J34633j74675l26574P8692p7808
5980a00538l75981K27402K88177J39210n7608o1119J11737J55530l78530k83148
5970c34868q9729J90538N4970q7784L6754j42688o4603j44909L03641N62127p8500
5959B04949k95062J98065K75089p8800N836K41893m8148l37189J8599J70115j87467
5948A67880m19959J88676J33360K00003P3365j76523q1153K5307k89846m60883
5938f39773J83527j18690K63455O486K61797K4330j8072K9384K27551J14676j37217
5927A97454k12383l84118j63092K36706p8699k30426Q1838j05972l76684m4915
$$ plain form
5917 -1080291 -904936 -697563 -319574 329410 385587 267054 88175 -303490 -523935 -318677
5907 -318677 -369147 -307289 -67396 -274622 -507386 -838731 -879061 -629722 -684371 -598606 -423798
5896 -423798 -334774 -736548 -500863 -254755 -13828 205887 54137 37051 -106455 176712
5886 176712 262621 49680 205782 354313 216062 -251850 -355425 181143 213555 -100724
5876 -100724 -47917 -19254 287373 343703 72198 -201425 -479536 -224390 164206 324649
5866 324649 180246 185863 113097 -129043 -97956 -543218 -729817 -215908 18265 48465 -44339
5855 -44339 -302817 -43789 271872 320667 402053 138386 -65523 -236461 -205483 -292441 -359534
5844 -359534 -318202 -400755 -417442 -347889 -24256 38830 -132935 -43876 -239972 -601291 -506097
$$ packed form
5917a080291J75355K07373L77989O48984N6177j18533j78879l91665k20445K05258
5907c18677n0470O1858K39893k07226k32764l31345m0330K49339n4649Q5765J74808
5896d23798Q9024m01774K35685K46108K40927K19715j51750j7086j43506K83167
5886A76712Q5909k12941J56102J48531j38251m67912j03575N36568L2412l14279
5876a00724N2807K8663L06627N6330k71505k73623k78111K55146L88596J60443
5866C24649j44403N617p2766k42140L1087m45262j86599N13909K34173L0200r2804
5855d4339k58478K59028L15661M8795Q1386k63667k03909j70938L0978q6958o7093
5844c59534M1332q2553j6687O9553L23633O3086j71765Q9059j96096l61319R5194
$$ plain form
5833 -506097 -683203 -550597 -248128 105864 83234 -494557 -628511 -458208 -764545 -936735
5823 -936735 -723527 -385825 -308803 -315579 -245881 -135502 -50626 -133075 -402614 -211989 -108923
5812 -108923 274 -254416 -383514 -680768 -739748 -794218 -513724 -491903 -345797 -182419
5802 -182419 -129904 64151 174895 322304 -70657 -147469 -182612 -363097 -99199 -16387
5792 -16387 -96753 -75907 19404 178930 130216 -52919 -22 59276 -17464 -278307 -480603
5781 -480603 -395088 -134990 121376 -1094 -68128 -410415 -471218 -170215 108346 -87358
5771 -87358 -162916 -194765 -102688 142253 192983 159391 27289 -248785 -404606 -310224 -66479
5760 -66479 -94593 -288389 -321662 -288566 -257653 -119547 -132183 -89302 -265757 -687776 -416223
$$ packed form
5833e06097j77106J32606L02469L53992k2630n77791j33954J70303l06337j72190
5823i36735K13208L37702P7022o776O9698J10379Q4876q2449k69539J90625J03066
5812a08923J09197k54690j29098k97254n8980n4470K80494K1821J46106J63378
5802a82419N2515J94055J10744J47409l92961p6812l5143j80485K63898Q2812
5792a6387q0366K0846R5311J59526m8714j83135N2897N9298p6740k60843k02296
5781d80603Q5515K60098K56366j22470o7034l42287o0803L01003K78561j95704
5771h7358p5558l1849R2077K44941N0730l3592j32102k76074j55821R4382K43745
5760f6479k8114j93796l3273L3096L0913J38106j2636M2881j76455m22019K71553
$$ plain form
5749 -416223 185621 147709 -148717 -185104 -378668 -623118 -429354 -310086 -583531 -723720
5739 -723720 -701152 -420465 -489897 -563782 -538801 -628033 -473515 -236663 -326979 -463674 -311225
5728 -311225 -414583 -549108 -412971 -256427 -364403 -558324 -579809 -548212 -301618 -245208
5718 -245208 -268732 -212935 -179762 -159010 -98489 -64489 198028 170208 51470 12242 -280819
5707 -280819 -399641 -331938 -211439 -38757 44199 -213698 -225119 -151865 22928 -220609
5697 -220609 -230471 -349832 -490169 -508433 -466111 -236981 -1098 -115380 -479602 -524923 -495862
5686 -495862 -336089 -234562 142435 486615 863262 717484 524476 405658 186980 -3492
5676 -3492 -105233 154319 474137 521188 267764 74020 196660 17400 -224260 -268911
$$ packed form
5749d16223O01844l7912k96426l6387j93564k44450J93764J19268k73445j40189
5739g23720K2568K80687o9432p3885K4981q9232J54518K36852r0316j36695J52449
5728c11225j03358j34525J36137J56544j07976j93921k1485L1597K46594N6410
5718b45208k3524N5797L3173K0752O0521L4000K62517k7820j18738l9228k93061
5707b80819j18822O7703J20499J72682Q2956k57897j1421P3254J74793k43537
5697b20609r862j19361j40337j8264M2322K29130K35883j14282l64222m5321K9061
5686d95862J59773J01527L76997L44180L76647j45778j93008j18818k18678j90472
5676c492j01741K59552L19818M7051k53424j93744J22640j79260k41660m4651
$$ plain form
5666 -268911 51083 175540 -122521 -326973 -173993 -339861 -80356 74773 -56391 -210987
5656 -210987 -115816 -157486 -42230 359401 223533 248947 113356 252039 -130947 -249899
5646 -249899 -271188 -471268 -47713 95812 6394 36553 263647 480392 502793 383945
5636 383945 132780 -113157 -285260 -175364 -663514 -329229 -88053 -146873 -89045 -310237
$$ packed form
5666b68911L19994J24457k98061k04452J52980j65868K59505J55129j31164j54596
5656b10987R5171m1670J15256M01631j35868K5414j35591J38683l82986j18952
5646b49899k1289k00080M23555J43525q9418L0159K27094K16745K2401j18848
5636C83945k51165k45937j72103J09896m88150L34285K41176n8820N7828k21192
$$ [...]
##END NTUPLES=NMR SPECTRUM
##END=
