##TITLE=Analysis number 323816
Compound Code cc 50513
Book Reference 451/179
Project Code adrs
Chemist Name evam
##JCAMPDX= 6.0         $$ Bruker NMR JCAMP-DX V2.0
##DATA TYPE= NMR SPECTRUM
##DATA CLASS= NTUPLES
##ORIGIN= Bruker BioSpin GmbH
##OWNER= nmr
$$ XWIN-NMR		Version 3.5
$$ Thu Nov  9 11:37:49 2006 GMT Standard Time (UT+0h)  MAYBRIDGE\nmr@NMR_250MHZ
##.OBSERVE FREQUENCY= 250.131544655141
##.OBSERVE NUCLEUS= ^1H
##.ACQUISITION MODE= SIMULTANEOUS (DQD)
##.ACQUISITION SCHEME= undefined
##.AVERAGES= 16
##.DIGITISER RES= 18
##SPECTROMETER/DATA SYSTEM= dpx250
##.PULSE SEQUENCE= zg30
##.SOLVENT NAME= CDCl3
##.SHIFT REFERENCE= (INTERNAL, CDCl3, 0, 16.4855)
##AUDIT TRAIL= $$ (NUMBER, WHEN, WHO, WHERE, WHAT)
$$ ##TITLE= Audit trail, XWIN-NMR		Version 3.5
$$ ##JCAMPDX= 5.01
$$ ##ORIGIN= Bruker BioSpin GmbH
$$ ##OWNER= nmr
$$ C:\u/data/dgb/nmr/ADRS/2510/pdata/1/auditp.txt
$$ ##AUDIT TRAIL=  $$ (NUMBER, WHEN, WHO, WHERE, WHAT)
(   1,<2006-11-09 11:37:20.58 +000>,<MAYBRIDGE\nmr>,<NMR_250MHZ>,
      <created by zg, POWCHK disabled, PULCHK disabled
       configuration hash MD5:
       49 4B E0 1D 92 C2 6B 37 9F E6 65 BC 52 41 86 1D
       data hash MD5: 64K
       B4 78 49 10 A1 BE 6B ED 1B 9A BD DE 22 3F 8A D4>)
(   2,<2006-11-09 11:37:35.99 +000>,<MAYBRIDGE\nmr>,<NMR_250MHZ>,
      <Start of raw data processing
       ef LB = 0.3 FT_mod = 6 PKNL = 1 SI = 32K 
       data hash MD5: 32K
       54 B5 4C C8 D5 2A 83 7E 0C 1E FD C6 EA DD 30 DC>)
(   3,<2006-11-09 11:37:37.68 +000>,<MAYBRIDGE\nmr>,<NMR_250MHZ>,
      <apk 
       data hash MD5: 32K
       10 F1 44 A3 8F DD BD 38 F6 A3 57 D5 59 40 B7 8F>)
(   4,<2006-11-09 11:37:38.51 +000>,<MAYBRIDGE\nmr>,<NMR_250MHZ>,
      <abs ABSG = 5 
       data hash MD5: 32K
       48 F7 A7 58 98 9E FD 90 B3 57 63 F0 6D 57 B8 A4>)
$$ ##END=
$$ 
$$ hash MD5
$$ AC 33 94 50 64 ED 6D C1 0D 37 D2 4D 0F 6B AA A7
##$RELAX= 
##$RELAX= 
##$RELAX= 
##$RELAX= 
##$RELAX= 
##$RELAX= 
##$RELAX= 
$$ Bruker specific parameters
$$ --------------------------
##$DU= <C:\u>
##$EXPNO= 2510
##$NAME= <ADRS>
##$PROCNO= 1
##$TYPE= <nmr>
##$USER= <dgb>
##$AMP= (0..31)
100 100 100 100 100 100 100 100 100 100 100 100 100 100 100 100 100 100 
100 100 100 100 100 100 100 100 100 100 100 100 100 100 
##$AQSEQ= 0
##$AQ_mod= 3
##$AUNM= <au_zg>
##$AUTOPOS= <23 >
##$BF1= 250.13
##$BF2= 250.13
##$BF3= 250.13
##$BF4= 250.13
##$BF5= 500.13
##$BF6= 500.13
##$BF7= 500.13
##$BF8= 500.13
##$BYTORDA= 1
##$CFDGTYP= 0
##$CFRGTYP= 5
##$CHEMSTR= <none>
##$CNST= (0..31)
1 1 145 1 1 1 1 1 1 1 1 1 1 1 1 1 1 1 1 1 1 1 1 1 1 1 1 1 1 1 1 1 
##$CPDPRG= <>
##$CPDPRG1= <>
##$CPDPRG2= <>
##$CPDPRG3= <>
##$CPDPRG4= <mlev>
##$CPDPRG5= <mlev>
##$CPDPRG6= <mlev>
##$CPDPRG7= <mlev>
##$CPDPRG8= <mlev>
##$CPDPRGB= <>
##$CPDPRGT= <>
##$D= (0..31)
0 1 0 0 0 0 0 0 0 0.06 0 0 0 0 0 0 0.0002 0 0 0 0 0 0 0 0 0 0 0 0 0 0 
0 
##$DATE= 1163072239
##$DBL= (0..7)
120 120 120 120 120 120 120 120 
##$DBP= (0..7)
150 150 150 150 150 150 150 150 
##$DBP07= 0
##$DBPNAM0= <>
##$DBPNAM1= <>
$$ [...]
##$SUBNAM7= <"">
##$SUBNAM8= <"">
##$SUBNAM9= <"">
##$SW= 20.6930455092707
##$SWIBOX= (0..15)
0 0 3 0 0 0 0 0 0 0 0 0 0 0 0 0 
##$SW_h= 5175.983436853
##$TD= 65536
##$TD0= 1
##$TE= 683.16
##$TE2= 300
##$TE3= 300
##$TEG= 300
##$TL= (0..7)
0 120 120 120 120 120 120 120 
##$TP= (0..7)
150 150 150 150 150 150 150 150 
##$TP07= 0
##$TPNAME0= <>
##$TPNAME1= <>
##$TPNAME2= <>
##$TPNAME3= <>
##$TPNAME4= <>
##$TPNAME5= <>
##$TPNAME6= <>
##$TPNAME7= <>
##$TPOAL= (0..7)
0.5 0.5 0.5 0.5 0.5 0.5 0.5 0.5 
##$TPOFFS= (0..7)
0 0 0 0 0 0 0 0 
##$TUNHIN= 0
##$TUNHOUT= 0
##$TUNXOUT= 0
##$USERA1= <user>
##$USERA2= <user>
##$USERA3= <user>
##$USERA4= <user>
##$USERA5= <user>
##$V9= 5
##$VALIST= <valist>
##$VCLIST= <CCCCCCCCCCCCCCC>
##$VD= 0
##$VDLIST= <DDDDDDDDDDDDDDD>
##$VPLIST= <PPPPPPPPPPPPPPP>
##$VTLIST= <TTTTTTTTTTTTTTT>
##$WBST= 1024
##$WBSW= 4
##$XGAIN= (0..3)
0 0 0 0 
##$XL= 0
##$YL= 0
##$YMAX_a= 451674
##$YMIN_a= -357886
##$ZGOPTNS= <>
##$ZL1= 120
##$ZL2= 120
##$ZL3= 120
##$ZL4= 120
##$ABSF1= 16.48554
##$ABSF2= -4.207632
##$ABSG= 5
##$ABSL= 3
##$ALPHA= 0
##$AQORDER= 0
##$ASSFAC= 0
##$ASSFACI= 0
##$ASSFACX= 0
##$ASSWID= 0
##$AUNMP= <proc_1d>
##$AZFE= 0.1
##$AZFW= 0.1
##$BCFW= 0
##$BC_mod= 0
##$BYTORDP= 0
##$COROFFS= 0
##$CY= 12.5
##$DATMOD= 1
##$DC= 0
##$DFILT= <>
##$DTYPP= 0
##$F1P= 14.0000005364418
##$F2P= -0.99999901652339
##$FCOR= 0.5
##$FTSIZE= 32768
##$FT_mod= 6
##$GAMMA= 0
##$GB= 0
##$INTBC= 1
##$INTSCL= 1
##$ISEN= 128
##$LB= 0.3
##$LEV0= 0
##$LPBIN= 0
##$MAXI= 10000
##$MC2= 0
##$MEAN= 0
##$ME_mod= 0
##$MI= 0
##$NCOEF= 0
##$NC_proc= -5
##$NLEV= 6
##$NOISF1= 0
##$NOISF2= 0
##$NSP= 0
##$NTH_PI= 0
##$NZP= 0
##$OFFSET= 16.48554
##$PC= 1
##$PHC0= -43.95446
##$PHC1= 1.276523
##$PH_mod= 1
##$PKNL= yes
##$PPARMOD= 0
##$PSCAL= 4
##$PSIGN= 0
##$REVERSE= no
##$SF= 250.130009117207
##$SI= 32768
##$SIGF1= 0
##$SIGF2= 0
##$SINO= 400
##$SIOLD= 32768
##$SREGLST= <1H.CDCl3>
##$SSB= 0
##$STSI= 32768
##$STSR= 0
##$SW_p= 5175.98343685301
##$SYMM= 0
##$S_DEV= 0
##$TDeff= 65536
##$TDoff= 0
##$TI= <Analysis number 999999
Compound Code 99
Book Reference 9
Project Code 9>
##$TILT= no
##$TM1= 0
##$TM2= 0
##$TOPLEV= 0
##$USERP1= <user>
##$USERP2= <user>
##$USERP3= <user>
##$USERP4= <user>
##$USERP5= <user>
##$WDW= 1
##$XDIM= 32768
##$YMAX_p= 492722429
##$YMIN_p= -207666
$$ End of Bruker specific parameters
$$ ---------------------------------
##NTUPLES= NMR SPECTRUM
##VAR_NAME=  FREQUENCY,     SPECTRUM/REAL,   SPECTRUM/IMAG
##SYMBOL=    X,             R,               I
##VAR_TYPE=  INDEPENDENT,   DEPENDENT,       DEPENDENT
##VAR_FORM=  AFFN,          ASDF,            ASDF
##VAR_DIM=   32768,         32768,           32768
##UNITS=     HZ,            ARBITRARY UNITS, ARBITRARY UNITS
##FACTOR=    0.157963299565203, 1,           1
##FIRST=     4123.52836805645, 0,            0
##LAST=      -1052.45506879656, 0,           0
##MIN=       -1052.45506879656, -207666,     0
##MAX=       4123.52836805645, 492722429,    0
$$ Real data points
##PAGE= N=1
##DATA TABLE= (X++(R..R)), XYDATA
$$ [...]
18068G69133j6198n5657j13768l5763l7258l2646l464k1134L9773k2619K1424
18057D91823o3849M555J127l0817k1474l9115L8118J0171o5806l1968k8723m9300
18045B14742k4512m7896J3470M5086L8806J0652k7916n7085p690k5701K9418L806
18033A65180M0431k5773J8748j3969J140k0099L3222M623n5217l2293L5406N579
18021A56978n0069k8137M3832k3710K1095l0372j04680M029M6013M4977l6742
18010D3214O558R5435M8737j2807n8749l407J0641m1352j5161J0717l1520J3206
17998F5512J7083o243j7656l5138j7261k2704Q76N829R782J5764O3535N0181o511
17985A23049n2168K5857K7110N81J6657l0220k6970q448k721k893p398L8791m277
$$ y = [769133, 752935, 697278, 583510, 547747, 510489, 477843, 474379, 453245, 493018, 470399, 491823, 427974, 432529, 433656, 402839, 381365, 342250, 380368, 390539, 324733, 292765, 264042, 214742, 190230, 142334, 155804, 200890, 239696, 250348, 222432, 165347, 157657, 131956, 161374, 165180, 205611, 179838, 198586, 184617, 185757, 165658, 198880, 203503, 148286, 115993, 151399, 156978, 106909, 78772, 122604, 98894, 119989, 89617, -15063, -11034, 34979, 79956, 43214, 49772, 145207, 193944, 181137, 122388, 118981, 129622, 88270, 73109, 83826, 52306, 65512, 82595, 76352, 58696, 23558, 6297, -16407, -15531, -9702, 80, 15844, 79379, 129560, 123049, 70881, 96738, 123848, 124429, 141086, 110866, 83896, 75448, 72727, 69834, 62436, 101227, 96950]
17972I6950l6980m414K3216L5893J2456j9748o6149j9295L386j2183k01K6491
17960C9422K742j2569N0703K2976n2685J3770L3232k8596o6175m8480L2274O5181
17948E1795K7317m9962j10827P293M3975Q2786J3859l2246k5621J51k6012j0535
17936b8027L7210j3050k5086k4760L038K6402L2811L4705n605l194n7562K452
17924b0666J3769l3275J119r770j1921L5966n2285k0439M7378N2063M992l0199
17912b3268l7694j3737O4931N067n989n7342N3337J9762k3306J5470K5727l5618
17900a2660m5211J0849N7839M5859K4548j3947p2020n4302n2756l638L8496L2886
17888d4057K7913j8586m5788M06K4592p795O756j0133k5461K1329L4203M7669
$$ y = [96950, 59970, 55556, 78772, 114665, 127121, 107373, 41224, 21929, 25315, 13132, 12931, 39422, 42164, 29595, 80298, 103274, 50589, 64359, 97591, 68995, 2820, -45660, -13386, 51795, 79112, 29150, -81677, -74384, -30409, 52377, 66236, 33990, 8369, 8520, -17492, -28027, 9183, -3867, -28953, -53713, -50675, -24273, 8538, 43243, 37638, 34444, -23118, -20666, -6897, -40172, -39053, -48823, -60744, -24778, -77063, -97502, -50124, 1939, 6931, -23268, -60962, -74699, -9768, -4701, -10690, -68032, -14695, 5067, -18239, -2769, 22958, -12660, -57871, -47022, 10817, 56676, 81224, 67277, -4743, -59045, -111801, -115439, -76943, -44057, -16144, -34730, -80518, -80112, -55520, -63315, -56559, -66692, -92153, -70824, -36621, 11048]
17876A1048K6355j0644k8019q453J6974o744L477p174L8036J7117m6695k474n1970
17863d9166m4056J0613m7013M1473Q236n5095l0310L9523L5731m115J4403j3139
17851i2915K4575L7685n261M5492o925l3970n839m4024L57R845r819O815J2494
17838f1490O0494O5159l4771m6518l6652K3231Q81M9025J594q909N2334j8407
17826D5971p6535J5333N7130J4605J4105q6967K0161k7039J3605p757m233K215
17814a9406L797N6602j0918k7879k369m3224r459N0768O206k9640K7552M4393
17802D6423k9875j4257M7548j7217m8890l1304L7092K9455l235k6954n2095l9883
17790a03192L1170j9093k568J6460J1662J9471L0265K1905l0223n1387k7466k0564
$$ y = [11048, 37403, 26759, -1260, -9713, 7261, 517, 3994, -3180, 34856, 51973, 5278, 2804, -49166, -93222, -82609, -129622, -88149, -79913, -135008, -165318, -125795, -90064, -94179, -79776, -92915, -68340, -30655, -35916, 9576, 2651, -31319, -37158, -81182, -80825, -70980, -80799, -73984, -61490, -996, 64163, 29392, -17126, -53778, -30547, -29666, 19359, 20953, 12044, 64378, 45971, -30564, -15231, 41899, 56504, 70609, -16358, 3803, -23236, -9631, -17388, -21621, -19406, -15609, 40993, 30075, 2196, -173, -43397, -52856, -2088, 4118, -25522, 2030, 46423, 16548, 2291, 49839, 32622, -16268, -47572, -10480, 18975, 15740, -11214, -63309, -103192, -72022, -91115, -93683, -77223, -65561, -46090, -15825, 6080, -24143, -75530, -102996, -123560]
17778a23560P1770N4049j3882K1617K9338k9074J9679J050j173j3512K4763O7794
17766A08859N026l4045l333k0242j4801Q730l7882j9321Q4778o289J1044k789
17754G9735q9520o739K2307j619m0276p0605K7958P559l9294J145K6183M1438
17742d1728K6389k6200M9549K502J5431k1991n6217N8378Q632J1801l8364J4317
17730B499n12L5150N793m617N3122k3182o8789r705l8962L8537k890j9135n0070
17717h2761N42P1447L3225o801k5676k1506n327L2551L2163O060m2320l90J0815
17704B022P286N6144Q140k907l9453K4940L859r6615n5543q993N5923M1212Q1905
17691G7920J4131Q52j5720n1702J1017R393m0933n3168j7794M6710L2604n7216
$$ y = [-123560, -51790, 2259, -11623, 9994, 39332, 10258, 29937, 30987, 29814, 16302, 41065, 108859, 113885, 79840, 76507, 56265, 41464, 50194, 12312, -7009, 77769, 71480, 82524, 79735, -9785, -16524, 5783, 4164, -36112, -106717, -78759, -71200, -110494, -109349, -83166, -41728, -15339, -41539, 8010, 10512, 25943, 3952, -52265, 6113, 14745, 26546, -11818, 2499, 1987, 37137, 42930, 38313, 91435, 68253, -536, -10241, -49203, -10666, -13556, -32691, -82761, -82219, -10772, 22453, 15652, -10024, -31530, -36857, -4306, 27857, 33917, -8403, -8793, 2022, 9308, 65452, 73592, 70685, 31232, 56172, 60031, -36584, -92127, -101120, -45197, -3985, 77920, 92051, 92903, 77183, 25481, 36498, 45891, 4958, -48210, -66004, -19294, 13310, -43906]
17679d3906j5576O9465O051j7273m7678m1856J6737R073L5595M0701l345K1942
17667B9930K7684j6520K7734k3070m1073m0855J3034Q1061Q2655n211j6066j8533
17655A00770k9711n0843j400O9110L1596J4482N5990O6183Q9156P5508L3132Q163
17643D62136P568Q2049N3778j4903p869l0756p3173j38981q9639l4013p686N000
17631B13511k8392n3594m1279K1337j791k1804p0810n5617L1335R1260Q718J3063
17619A05937k2663L9022j2481K3571K4717l7620R15p67k4090l2413O862K8576
17607I9566l638m4895J1965k6199n2812j6428J5532j6457m2761m837R6754M8517
17595F4307M9213L7889k8972o9015m270L2754J3718j810n586r1079k909P6236
$$ y = [-43906, -59482, 9983, 16034, -1239, -48917, -90773, -74036, -64963, -29368, 11333, 7988, 29930, 57614, 41094, 68828, 45758, 4685, -36170, -23136, 57925, 140580, 135369, 119303, 100770, 71059, 20216, 18816, 87926, 119522, 134004, 189994, 256177, 345333, 420841, 453973, 462136, 469704, 551753, 605531, 590628, 582759, 552003, 478830, 339849, 250210, 216197, 208511, 213511, 185119, 131525, 90246, 111583, 109792, 87988, 17178, -38439, -7104, 84156, 92874, 105937, 83274, 122296, 109815, 133386, 158103, 120483, 121398, 120631, 96541, 64128, 70990, 99566, 95928, 51033, 62998, 36799, -16013, -32441, -16909, -33366, -76127, -80964, 15790, 64307, 113520, 151409, 122437, 53422, 49152, 81906, 95624, 93814, 88228, -2851, -5760, 70476]
17583G0476j2739M088j628j399k0079J7684j8235L0591K4697k9484o3844K810
17571B938J2574k7312J3692N3204o819k3006M4232K0562o192K7477R3664M082
17559B09096j2510L4064M6490j2065L6403K6470J07675R4230J10922L3456M6959
17548G21190J8836L0023J05185N3832M3820L4658J0023k9775m8361n6321r1017
17537G92093j1683p5354r9722m9674l6744n1894o3910L85n0341j12487o3970N98
17525A77297j0025n0005l6318l1824L8121q144L5303n879m1735j1068N3136M0828
17513A49687k9254o3070r070J3034L7941j0200L0804L7211M7767N0071M1788M6066
17501C42775P3983O1052L8215K7461K1070K620k3013K6213M2263N6301k7921m7070
$$ y = [70476, 57737, 61825, 60197, 58798, 38719, 56403, 38168, 68759, 93456, 63972, 128, 2938, 15512, -11800, 1892, 55096, 48277, 25271, 69503, 90065, 83873, 111350, 205014, 209096, 196586, 230650, 277140, 265075, 301478, 327948, 435623, 529853, 640775, 674231, 721190, 740026, 770049, 875234, 929066, 972886, 1007544, 1017567, 987792, 939431, 883110, 792093, 780410, 705056, 605334, 555660, 518916, 467022, 403112, 403497, 353156, 240669, 176699, 177297, 167272, 117267, 80949, 49125, 87246, 79102, 114405, 108526, 66791, 55723, 108859, 149687, 120433, 57363, 48293, 61327, 99268, 89068, 119872, 157083, 204850, 254921, 296709, 342775, 416758, 477810, 516025, 543486, 564556, 567176, 544163, 570376, 612639, 668940, 641019, 593949]
17489E93949l0180p384n3864q4503m0151k8920K9011k8978n1126j9024l9386o7995
17477A71449o4876K3415l434n4782J3033O7148M2713O132R7753O9827M9506Q0555
17465D98439N2715k6546j2810J58J0574J6769n787J9918Q708K2257j5982q2929
17453D85484p6684o0827j02428p0955J7357N1876j569P901J02529N8103J113j4892
17441C97008n1141m6414l2031m5905k8223M6739m6680j6374k0654n5320Q614j9680
17429H9939k1295l8895L0095L1677M439r955m3527o2032m7057M7843O5359N3759
17417A00350n815J724N1185m9495n8017K3835j1668n5474N1195N2345l3960m802
17405F1403k5955M3880l387l8914J5319o994m664j7461L431J00354n776j850M8096
$$ y = [593949, 563769, 556385, 502521, 418018, 377867, 348947, 377958, 348980, 297854, 278830, 239444, 171449, 106573, 129988, 126554, 71772, 84805, 151953, 194666, 200798, 298551, 368378, 417884, 498439, 551154, 524608, 511798, 511956, 522530, 539299, 533512, 553430, 562138, 584395, 568413, 485484, 408800, 347973, 245545, 174590, 191947, 243823, 242254, 250155, 352684, 410787, 411900, 397008, 345867, 299453, 267422, 221517, 193294, 240033, 193353, 176979, 156325, 101005, 109619, 89939, 68644, 29749, 59844, 91521, 95960, 86005, 42478, -19554, -66611, -18768, 46591, 100350, 94535, 96259, 147444, 97949, 39932, 63767, 52099, -3375, 47820, 100165, 66205, 61403, 35448, 79328, 75941, 37027, 52346, 45352, 40688, 23227, 26658, 127012, 121236, 119386, 167482]
17392A67482K0520n9592n1473K0351N34l1180o723k9896r00L097J7460j7314L5020
17379F7386J4851J13q409k3497n3179k4304P7242J9401N1351k5935k1140j6653
17367E7227k3837K7915J5764P3680Q0331j9048o1281m1141m8477k0040m3802n543
17355h252K7407N1212J5379o6691Q981J6858k3253N6251M0770l9699j381j2291
17343F5291m4797j6668j996m6401l2576N2281Q897j0861M0526M7092j2514p806
17331D0468p537m5976M0266L7057N492M5211j1725M7589J0397l2041N370L1684
17319A66255k844K6093J2998L471k5493p247L3109j2257j081k5355j0046J2555
17307A70158J02095J7826O5419J723n3921J6448N8161L5300K7997j0058r5616
$$ y = [167482, 188002, 128410, 76937, 97288, 97822, 66642, 59919, 30023, 29123, 32220, 49680, 32366, 67386, 82237, 82350, 73941, 50444, -2735, -27039, 50203, 69604, 120955, 95020, 73880, 57227, 33390, 61305, 77069, 150749, 231080, 212032, 150751, 109610, 61133, 41093, -2709, -8252, 19155, 70367, 85746, 19055, 28036, 44894, 21641, 77892, 118662, 78963, 77582, 65291, 20494, 3826, 1830, -44571, -77147, -24866, -15969, -26830, 13696, 60788, 48274, 40468, 32931, -13045, 27221, 64278, 69770, 114981, 103256, 150845, 161242, 129201, 134571, 166255, 163411, 189504, 202502, 205973, 180480, 173233, 206342, 194085, 193004, 167649, 157603, 170158, 272253, 290079, 355498, 357221, 303300, 319748, 377909, 413209, 441206, 431148, 335532]
17296C35532r597L8476l1780m7715o8232j6309M5489L8775n0050k5294n3846l1773
17284A23676J1972K7370l1505j0400k5759k820L43K059P226N8459L3209l5309
17272A58521k9382j693k0292K865R073j2138J1338j584K1870O2376J6940k786
17260B15108k360o7892l2896M4219r738m9032n0692K3611J0986j9090k1916P5772
17248A16080M9919N54L4170r14k6484J9971L2051L1415K9750L1878k4971q4908
17236B08511J781K5040K1778N6276k686N643j1292k2684k7748O526j5511L4401
17224B80035Q052J0031j3289J9003k3994l4458J960Q1568M635K1709l7413l6347
17212B81492M3975J7109j0804L0197J4741l1787j8726M2235K7469l83l29j0632
$$ y = [335532, 325935, 364411, 332631, 284916, 216684, 200375, 245864, 284639, 234589, 209295, 155449, 123676, 135648, 163018, 131513, 121113, 95354, 92534, 92877, 94936, 102162, 160621, 193830, 158521, 129139, 127446, 107154, 110019, 119092, 106954, 118292, 116708, 138578, 200954, 217894, 215108, 212748, 144856, 111960, 156179, 146441, 97409, 46717, 70328, 81314, 62224, 40308, 116080, 165999, 166553, 200723, 199809, 173325, 193296, 225347, 256762, 286512, 318390, 293419, 208511, 210292, 235332, 257110, 313386, 310700, 316343, 305051, 282367, 254619, 261145, 245634, 280035, 288087, 298118, 284829, 303832, 279838, 245380, 247340, 328908, 333543, 355252, 317839, 281492, 325467, 342576, 331772, 361969, 376710, 344923, 326197, 368432, 395901, 395518, 395189, 384557]
17200C84557L61O805n0069R092J1449l0376m0353m1953L2284M5617k7436M36Q19
17187C01233M4469j0870j1547k1205K3602J9731n8279j2745Q4316J07460O2766
17176E28931n1499k8666J1446l6477N705M3841M2050Q477J5241j5983o492j3512
17164E03062k3934P313K6277O0352M4731m3132l7486j1098Q319k4343J1034M412
17152E25507R20P258j1113o9586p347P4884J14545J13566L0214j6164n5704l895
17140G03085k593m1180p012N6274K3866J8660O9060R1052K3926l6778j1102M1862
17128I29120M2969O7579N9536P3133K1478O5872K3815O6170M4451N3663Q7610
17117A535396K9666m3368J1908L044L7873j6073k6040j8119K5627K5397L3832
$$ y = [384557, 384918, 391723, 341654, 350746, 362195, 331819, 291466, 249513, 281797, 327414, 299978, 300414, 301233, 345702, 334832, 323285, 302080, 325682, 345413, 287134, 274389, 358705, 466165, 528931, 477432, 448766, 460212, 423735, 429440, 473281, 515331, 523808, 539049, 523066, 516574, 503062, 479128, 486441, 512718, 573070, 617801, 574669, 537183, 526085, 534404, 510061, 521095, 525507, 526427, 533685, 522572, 452986, 445639, 520523, 635068, 748634, 778848, 762684, 706980, 703085, 700492, 659312, 652300, 708574, 732440, 751100, 820160, 911212, 935138, 898360, 887258, 929120, 972089, 1039668, 1099204, 1172337, 1193815, 1259687, 1283502, 1349672, 1394123, 1447786, 1535396, 1565062, 1521694, 1533602, 1536646, 1574519, 1558446, 1532406, 1514287, 1539914, 1565311, 1599143]
17106A599143M9376N6030K4335m045P2806M0218J7949j9119K5516K5516P5276
17095A963001O1829N6160m389J04085J35296P7248J10820J18156J30386J11358
17085B863950J31266J35290K01550J64160K67427K84028J97915K71221K99163
17076D815970M14280M73949M94580N46272N48186O65218Q40578R82442J106885
17067A0888360J216898J503682K052781K641762L437274M573808N914234P229493
17059C9458292Q347156R256462J0178987J1534763J3199399J4250111J3973107
17052A20198277J2628921J0866828R948060R789270R044272P104202M152945Q94084
17044A84626859k037482m902878p369982q424082r055037j0733770j3431856j5645686
$$ y = [1599143, 1648519, 1704549, 1728884, 1724839, 1797645, 1837863, 1855812, 1836693, 1862209, 1887725, 1963001, 2024830, 2080990, 2076601, 2180686, 2315982, 2393230, 2504050, 2622206, 2752592, 2863950, 2995216, 3130506, 3332056, 3496216, 3763643, 4047671, 4245586, 4516807, 4815970, 5230250, 5704199, 6198779, 6745051, 7293237, 7958455, 8799033, 9781475, 10888360, 12105258, 13608940, 15661721, 18303483, 21740757, 26314565, 32228799, 39458292, 47805448, 57061910, 67240897, 78775660, 91975059, 106225170, 120198277, 132827198, 143694026, 153642086, 163431356, 172475628, 179579830, 183732775, 184626859, 182589377, 177686499, 170316517, 161892435, 152837398, 142103628, 128671772, 113026086]
17036A13026086j5387571j3381321j1514030j0442135r807527q781810p294900
17029C6416792n606066m211361l192038k496449k046858j686547j397599j142223
17021A4637651r81599q31305p65394o76294n50112m32254m37625l55263k54157
17012I353648j55356j14672K3189L1884R0570J41097J55401K08769L21656M02273
17002A0458459M86408O30301Q26045J065935J398316J832637K596569L804841
16994B3099511N377550P344965R374020J0954652J1715259J1764924J0434634
16987I0065515Q057053N517505K156051j401742k100138j531362j702889k386645
16979I6673348k848563l358257m723010p623013r544966r225005q602711q192135
$$ y = [113026086, 97638515, 84257194, 72743164, 62301029, 52493502, 43711692, 36416792, 30810726, 26599365, 23407327, 20910878, 18864020, 17177473, 15779874, 14637651, 13656052, 12824747, 12059353, 11383059, 10832947, 10400693, 9963068, 9607805, 9353648, 9198292, 9083620, 9106809, 9138693, 9229263, 9370360, 9525761, 9734530, 10056186, 10458459, 10944867, 11575168, 12401213, 13467148, 14865464, 16698101, 19294670, 23099511, 28477061, 35822026, 45196046, 56150698, 67865957, 79630881, 90065515, 98122568, 103640073, 105796124, 104394382, 102294244, 100762882, 99059993, 96673348, 93824785, 90466528, 85743518, 78120505, 68575539, 59350534, 50747823, 42555688]
16971D2555688p062016n175620l475321k126377j106376l45714L27124J141235
16963B4732623K140556L453715N301055P455324R222518J0231494J0705491J0232109
16955H3474885Q496206O231317L687469J50084j779535j346741j119780j782098
16947I6011807k400119k938239l957254o390271r351782r953119r286670r024868
16939D2709485q422880o787008m896997l443555k545519j901189j514448j246801
16931A1951088j034777r31559q30749p32755n91910m83228n05995m27452m16292
16922E996371l99608k78862k69402k06213j98322k06220j56649j05996j60560
16913D014539j85504j64590j02086j06577r5113j09129j61172j67460j27538n1173
$$ y = [42555688, 35493672, 30318052, 26842731, 24716354, 23609978, 23264264, 23591388, 24732623, 26873179, 30326894, 35627949, 43083273, 52305791, 62537285, 73242776, 83474885, 91971091, 98202408, 101889877, 102039961, 100260426, 98913685, 97793905, 96011807, 93611688, 90673449, 86716195, 80325924, 70974142, 61021023, 51734353, 42709485, 34286605, 27499597, 22602600, 19159045, 16613526, 14712337, 13197889, 11951088, 10916311, 9984752, 9154003, 8421248, 7829338, 7346110, 6840115, 6412663, 5996371, 5596763, 5317901, 5048499, 4842286, 4643964, 4437744, 4281095, 4175099, 4014539, 3829035, 3664445, 3562359, 3455782, 3360669, 3251540, 3090368, 2922908, 2795370, 2744197]
16903B744197j11301q8184j04948j52104j11649l2443L8247J786j9737p1524o6593
16892B025747q0300J171m4320m7981J6834J0759j16884o1575o0073o8836n5319
16881A519223m3729n2889J9980k5555j1659m7214k1200n4019j01957j3342J5700
16870A183339j642m4527k6139o7861L8946J9867m3876j1611p9939l700l9091j9434
16858I04332J9346L7120p744k3704m7803j7568k7844k0590P330m6671p2929n8380
16846F44895k1831j7938J8868j8522n3509j7290n3622L0633O4140l833l2673P656
16834E46974N4496j0197p1901J4880k4522k8668q314Q0092L1523K203l599m2144
16822E40823j4287k9412r290K9520O1276l7448j336o2399p614J71l6024J8042
$$ y = [2744197, 2632896, 2544712, 2439764, 2287660, 2176011, 2143568, 2181815, 2183601, 2163864, 2092340, 2025747, 1945447, 1946618, 1902298, 1854317, 1871151, 1881910, 1765026, 1703451, 1643378, 1574542, 1519223, 1475494, 1422605, 1442585, 1417030, 1405371, 1358157, 1336957, 1282938, 1180981, 1167639, 1183339, 1181697, 1137170, 1111031, 1043170, 1082116, 1101983, 1058107, 1046496, 966557, 962857, 923766, 904332, 923678, 960798, 953054, 929350, 881547, 863979, 836135, 815545, 822875, 776204, 703275, 644895, 623064, 605126, 623994, 605472, 551963, 534673, 481051, 511684, 575824, 571991, 539318, 546974, 601470, 591273, 519372, 534252, 509730, 481062, 472748, 552840, 584363, 586566, 582967, 540823, 526536, 497124, 487834, 517354, 578630, 541182, 539846, 477447, 469833, 470004, 433980, 452022]
16810D52022o3999k4185J714L1037J08l4582m1387q631n2628n8951N5153o805
16798B48866J1436M2182j3302n888J3546J7865J4370J9754J0473J9208R167K2843
16786D10520j3766k8357J7706J6067M0793L7785L2430M1653k0906j6164J6209
16775E33970o084l7955l7626J1597K6396r785L1634o4762p7050m2626J3063j475
16763C39297j7259m8315n2948l7154p547k1244p935j1589j9730J4247k5280L3502
16751A38045M0013m9448k0312K0625N254K938K4148r900m608k122N491q095o0372
16738H1657o854O261m4718k5342K3934M0964J2022J9889L2343J0882k5662j813
16726A23563m5839k9846r178J7088O3321j2223o7186J5361r033M143L204K0280
$$ y = [452022, 388023, 363838, 365552, 396589, 396697, 362115, 320728, 312097, 259469, 200518, 255671, 248866, 260302, 302484, 289182, 283294, 296840, 314705, 329075, 348829, 359302, 378510, 387677, 410520, 396754, 368397, 386103, 402170, 442963, 480748, 513178, 554831, 533925, 517761, 533970, 527886, 489931, 452305, 463902, 490298, 480513, 512147, 447385, 370335, 327709, 340772, 339297, 322038, 273723, 220775, 183621, 176074, 154830, 146895, 135306, 115576, 129823, 104543, 138045, 178058, 128610, 108298, 128923, 134177, 137115, 161263, 151363, 146755, 144633, 150124, 142029, 81657, 74803, 81064, 36346, 11004, 34938, 75902, 87924, 107813, 140156, 151038, 125376, 123563, 77724, 47878, 38700, 55788, 119109, 106886, 39700, 55061, 46028, 50171, 53375, 73655]
16714G3655P2251M4827l6305m9927L1073K2391J1523J703l2771l5456k0642j5713
16702F6609K2413N2974n8599k7887m9310m629O1001Q3629M404o4701l8546K2439
16690F9797R496k3604n9271l8428O2054K8168k9638L3384k4911K0083l4225K5589
16678C8494l275l0919k8160P308N6759k768j9351J1144j3876k785o2348J4393
16666c5384O9867M9835n2538q34P492K2286O707j7223l629L3915J1658l9386p0167
16653a7401l0393K9556l4353k3236M2546J3043N4539J0656O260N1535k0616o9623
16641A2513N5764K3633o6505j4237n3257n5583M0965j1441J616K8614K6301L2543
16629B0926m863j7958l4791L3017K7234K8538m8868k3753K4663N4087L8820m1378
$$ y = [73655, 145906, 190733, 154428, 104501, 135574, 157965, 169488, 171191, 138420, 102964, 82322, 66609, 89022, 141996, 83397, 55510, 6200, 1571, 62572, 146201, 150605, 85904, 47358, 69797, 79293, 55689, -3582, -42010, 20044, 48212, 18574, 51958, 27047, 47130, 12905, 38494, 35219, 4300, -23860, -16552, 40207, 37439, 18088, 29232, 15356, 12571, -49777, -35384, 34483, 84318, 31780, 30946, 38438, 60724, 67431, 50208, 46579, 80494, 92152, 52766, -17401, -47794, -18238, -52591, -75827, -33281, -20238, 34301, 44957, 51217, 102752, 82136, 12513, 68277, 91910, 25405, 11168, -42089, -97672, -56707, -68148, -66532, -37918, -11617, 20926, 16063, -1895, -36686, -3669, 23565, 52103, 3235, -20518, 4145, 58232, 97052, 55674]
16617E5674j6657j2257j6457l6940n1498J261j904M8615K6442j3557L3332M0280
16605E6334j2253J046j0970l7715n6225k7637j6716N0711L4221j7509P675k9738
16593e8776j7406j2885L6949r247K7454R47j0851R668l079n228R29k1452J078
16580f1899J6960M8941M7758j2984n4399N0119J5413n6148j9865K7766K708K998
16568G368k2612r389J5321o318J8718J4375L2824Q493l582R042O7092O1358N0950
16555B43640O1578K8199R4235R8805Q5793J10578M9860m706K4503N2131N3351
16544H97967Q8558O902m42l6295j1223o5340j06340r8231o1349k3913q3280p2735
16532D34279p6460m5056k1277p9697m7672k8702l1278l2311l7156m4902N7677
$$ y = [55674, 39017, 26760, 10303, -26637, -78135, -76874, -78778, -30163, -3721, -17278, 16054, 56334, 44081, 45127, 34157, -3558, -59783, -87420, -104136, -53425, -19204, -36713, -29038, -58776, -76182, -89067, -52118, -61365, -33911, -32964, -43815, -34147, -37226, -42454, -41525, -62977, -61899, -44939, 4002, 51760, 38776, -15623, 34496, 49909, -6239, -26104, 1662, 4370, 7368, -15244, -24633, -9312, -15630, 3088, 17463, 50287, 58780, 55198, 64240, 131332, 192690, 243640, 305218, 333417, 427652, 526457, 612250, 722828, 772688, 767982, 792485, 844616, 897967, 986525, 993427, 992985, 956690, 945467, 880127, 773787, 675556, 614207, 590294, 507014, 434279, 357819, 312763, 291486, 211789, 164117, 135415, 104137, 71826, 34670, -10232, 47445]
16521D7445K6522m3591j9342J731O210l7767K0078R812K9025O2485j7065n1808
16509C3735m9770j0945O594M5606M6341K0902K359J229L912Q413k5920N8839K744
16496A44039l4725m5787o368J8934K7542J7626r6751j02094K1065J8578L9853
16485A912L2356K1843p5812k1895P294K7318N1966K2097K4408O1103Q3311Q9035
16473C24936P5144M2617j5303N6212k7487r420J2606j0951M7526k373n6241k1094
16461D16172L6606l3036m3265l8216m0949m4781p3324k8567P211j9049L0477J257
16449A70536k395J9171m5620p463K9790L8995l4367L3597M6501P2570J2780L3159
16437C67254R3444N4442k1590k810k865k1663m3048M0882l0491M603j4254r0325
$$ y = [47445, 73967, 30376, 11034, 12765, 18975, -18792, 1286, 11098, 40123, 102608, 85543, 33735, -16035, -26980, -20386, 25220, 71561, 92463, 94822, 96051, 99963, 108376, 82456, 141295, 144039, 109314, 63527, 57159, 76093, 103635, 121261, 24510, -77584, -56519, -37941, 1912, 34268, 56111, -19701, -41596, -34302, -6984, 44982, 67079, 91487, 152590, 235901, 324936, 400080, 442697, 427394, 483606, 456119, 446699, 459305, 448354, 495880, 493507, 437266, 416172, 452778, 419742, 376477, 338261, 297312, 252531, 179207, 150640, 157851, 138802, 169279, 170536, 168141, 187312, 141692, 134229, 164019, 203014, 168647, 202244, 248745, 321315, 334095, 367254, 460698, 515140, 493550, 490740, 487875, 466212, 423164, 464046, 433555, 438158, 423904, 333579]
16425C33579q4463j8012j5771o6633o9150l8914l0150L2442J3988Q459j9997j5019
16413C0359l1524l1603k9186j494K2482K7592J4982M2476N5306n7235j07334o164
16401g1343P4621l942o0782L9480M3072k1832K2715k568q190l1886n3191J1215
16389f2631P4647J4972m0314j6077n0726j8303J0128P6481R157o572N5519o494
16377C9787n6720n0819M2043O4780K327J1119k3979k9510m7943K3862M7961Q55
16365B3763l9014J7367K5287l27L881p3836j3437R640L0168L5735K5286J4680
16353E9193R337n2405l7447O630j7160o340J5050l3033q517N7631n5715n2162
16341a14938l896J1685M8115N1005M1449o9769j5772n1907K4960k238M649K0402
$$ y = [333579, 249116, 231104, 215333, 148700, 79550, 40636, 10486, 42928, 56916, 65375, 45378, 30359, -1165, -32768, -61954, -63448, -40966, -13374, 1608, 44084, 99390, 42155, -65179, -71343, 3278, -664, -61446, -21966, 21106, -726, 21989, 19421, 11231, -20655, -73846, -62631, 12016, 26988, -13326, -29403, -80129, -98432, -88304, -11823, -2666, -9238, 46281, 39787, -16933, -67752, -25709, 39071, 41398, 52517, 28538, -972, -48915, -25053, 22908, 23763, -15251, 2116, 27403, 27076, 30957, -42879, -56316, -46676, -16508, 19227, 44513, 59193, 68530, 16125, -21322, -14692, -31852, -38192, -23142, -56175, -64692, -7061, -62776, -114938, -118834, -107149, -59034, -8029, 33420, -36349, -52121, -104028, -79068, -81306, -76657, -56255]
16329e6255m8815n161N0755l6438m0029o350J04066k602j6158r083J5636J4260
16317c6174K468M3405J6166n1311k1844L2322j0894m5334j1483K5562J5840j9280
16305f0557L9114P6829J4378m9491n3603O004j2554M0347M7627l9109k4832m4135
16293e9982r304N9078m537L482Q3170k5089n5475l2944l5196j3450l66K186O955
16280h1472K8793O331l7852N1382N3961m7574q905N4135o0478l7824K6609k4221
16268g7115J0609J8202l4935j354L2312j8143k4351L4712N3848j1610J8480m9765
16256d9110j6644J7241l6716q5234l530N1630L749n832j7085L8995J1224J7266
16244g4046j9292J088l6936j0973N4802N7225l1511M6502l576K6004L8066l9653
$$ y = [-56255, -105070, -110231, -59476, -95914, -135943, -142293, -38227, -40829, -56987, -66070, -50434, -36174, -33706, 9699, 25865, -25446, -47290, -14968, -25862, -71196, -82679, -57117, -41277, -60557, -21443, 55386, 69764, 20273, -33330, -27326, -39880, 467, 48094, 8985, -15847, -59982, -69286, -10208, -14745, -11263, 71907, 46818, -8657, -41601, -76797, -90247, -90613, -88427, -81472, -52679, -46348, -84200, -32818, 21143, -26431, -35336, 18799, -41679, -79503, -52894, -77115, -66506, -48304, -83239, -84593, -52281, -70424, -94775, -60063, -6215, -17825, 655, -49110, -65754, -48513, -85229, -170463, -173993, -122363, -118614, -124446, -141531, -102536, -91312, -74046, -93338, -92250, -129186, -140159, -85357, -28132, -59643, -13141, -16717, 9287, 47353, 7700]
16232G700L0070L5168N05l2103q9430q1589n2470j7337N0197K0240L2646L8108
16220e8295J3401J6242L9999m049k0949o285j2663n4973J0868J01135J5991k2948
16208A7474k6143M4062L9942m1538n5930k6364J8749N9009q638l5917k6165M4232
16196B773j8719k0919j9478J8286l478m1274m6898n0704M2441M6474K4798J9241
16184d7457N2638j3717m1295o688O2225N5453k8972k5698j3190k2973M5754l4222
16172a8142J1393j2549J7288j9499n9270k3363L7458P6003L4515k7214K395R670
16160B8685m1582o0009q339J2986L2569k3436m543J5329m356o879K8153J5195
16148a6227K5129K8050n5143k4162L2762L3564K3301m146k8887m0836j0368l9288
$$ y = [7700, 37770, 72938, 73443, 41340, -48090, -129679, -182149, -199486, -149289, -129049, -96403, -58295, -44894, -28652, 11347, 7298, -13651, -19936, -32599, -87572, -76704, 24431, 40422, 17474, -8669, 35393, 75335, 33797, -22133, -48497, -29748, 29261, 20623, -15294, -41459, 2773, -15946, -36865, -56343, -38057, -41535, -82809, -129707, -180411, -137970, -91496, -66698, -47457, 5181, -8536, -49831, -56519, 5706, 61159, 32187, 6489, -6701, -29674, 16080, -18142, -6749, -19298, -2010, -21509, -80779, -104142, -66684, 9319, 43834, 16620, 19015, 28685, -12897, -72906, -81245, -68259, -35690, -59126, -63669, -48340, -52696, -59575, -31422, -16227, 8902, 36952, -18191, -42353, -9591, 23973, 47274, 43128, 14241, -26595, -36963, -76251]
16136g6251n9649O6202J9125j5592k2393j4471l1075K6370M2528L9861r305p8142
16124a12792k7675M9248K7583L8082l8270j4040L6218L7505n3284k3162O967j3326
16112h6946m905L795j9525o4166l2465Q6146K3218L500M7465J0616K5283L3249
16100B5265n4199m8080m6018K3213P4777L5530m0919n551L736P9531l1694k5433
16088i842n1441N4000N3890J8433K350J0801j5915L707m1747K0308R992J2201
16076F6737j6785o8776j2995j7128r892j8234K567M2911K5248P8904K8674l9876
16064F1355l6876n1743J987l8222o534M7071K9732P3323J8889L2122N9190k6088
16052A64206j21360p6920j5957K7647p938M099O565K2260k2639l8384K0246K6030
$$ y = [-76251, -135900, -69698, -50573, -66165, -88558, -103029, -134104, -107734, -65206, -25345, -34650, -112792, -140467, -91219, -63636, -25554, -63824, -77864, -41646, -4141, -57425, -80587, -73620, -86946, -91851, -88056, -107581, -171747, -204212, -118066, -94848, -91348, -43883, -33267, -7984, 25265, -28934, -77014, -123032, -99819, -25042, 10488, -30431, -35982, -32246, 47285, 15591, -9842, -61283, -7283, 46607, 65040, 67390, 78191, 62276, 65983, 24236, 44544, 54536, 66737, 49952, -18824, -31819, -48947, -58839, -77073, -74506, -31595, -6347, 72557, 101231, 61355, 24479, -27264, -25277, -63499, -70033, -22962, 6770, 80093, 98982, 131104, 190294, 164206, 42846, -34074, -50031, -22384, -30322, -26223, -19658, 2602, -20037, -58421, -38175, -12145]
16040a2145J1385L1390J5789o240m7167J622p832k6505K3099K1979J8052k207
16028B1220J5368j1592K9796k7429p0464k5284o113n2210L7878O1098J5674l971
16016a6029k8082k5875N4417m044l5665l4745Q519J5533m6261j7492J3302M8547
16004f7875K1098l3391J4647p206K8588N1326j676K6323r618j5429j8702k2780
15992c4695P503l490j9470J1120J1779k1113J5803K6845M5055J741k0689J512
15980B1901L7056j8246m1715r133n1121J746r548M1528K7367M9086K6643K5728
15968A01292q4511k9541n083J2304l0124k4118K0786L8480J6242N5756k5797o8357
15956b2671m8218J4039l5470O374O6304J3082K0914K0967k3223J4998k905m1122
$$ y = [-12145, -760, 30630, 46419, 40179, -6988, -5366, -13198, -39703, -16604, 5375, 23427, 21220, 36588, 24996, 54792, 27363, -43101, -68385, -74498, -126708, -88830, -27732, -12058, -16029, -44111, -69986, -15569, -19613, -55278, -90023, -81504, -65971, -112232, -129724, -116422, -67875, -46777, -80168, -65521, -72727, -44139, 7187, 5511, 31834, 22216, 6787, -11915, -34695, -27192, -30682, -50152, -39032, -27253, -48366, -32563, -5718, 39337, 41078, 20389, 21901, 58957, 40711, -1004, -10137, -61258, -59512, -69060, -27532, -165, 48921, 75564, 101292, 16781, -12760, -17843, -5539, -35663, -59781, -38995, -515, 15727, 71483, 45686, -22671, -70889, -56850, -92320, -85946, -19642, -6560, 14354, 35321, 12098, 27096, 24191, -16931]
15944a6931J0172J9590k0353j244m2244j1128N7552L833J189Q086R46K9451p840
15931C1079m4152J252n15K1272k9322p9275M9605m438m900N7029J9022k3427O91
15918f079K4056j0722J1193m5840k1345J5257P7096L0969m7361n5397J3200l0870
15906d5843r2435l5909K1646M5019M7513P6448Q9195R421l4734k8573m2002k4459
15894a4713O68J473K4588M1226j0708l4286j4151j3373j0148N3724k7557m9854
15882e3111J8262M1303L1045N3285o1714q3504j3667j058N966M8675L549j0051
15870b1020K9583J378Q741O793o746L298l3556j5376k662j1667Q618k9101k3432
15857h5149j4124N4339J338L6606K9781o9281n3529n2374J6810O6040M8374k0961
$$ y = [-16931, -6759, 12831, -7522, -8766, -51010, -62138, -4586, -753, 436, 8522, 9468, 38919, 31079, -13073, -11821, -12336, 8936, -20386, -99661, -50056, -54494, -59394, -2365, 16657, -6770, -6079, 17977, 7255, 18448, -27392, -48737, -33480, 43616, 74585, 27224, -28173, -14973, -45843, -138278, -174187, -152541, -107522, -60009, 16439, 105634, 115055, 80321, 51748, 9746, -14713, -14045, -12572, 12016, 53242, 42534, 8248, -5903, -19276, -29424, 24300, -3257, -53111, -34849, 6454, 37499, 90784, 29070, -54434, -68101, -69159, -63193, -14518, -10969, -21020, 8563, 9941, 18682, 25475, 18729, 22027, -11529, -26905, -29567, -41234, -32616, -61717, -85149, -99273, -44934, -43596, -6990, 22791, -46490, -100019, -152393, -135583, -69543, -21169, -42130]
15845d2130n7241P430p305K9563L6774K461k1524m4825J5674j607o0220r444L1116
15832a21278J0180r075j6168M2746j974l076M5585M7423L7146l6123R486K1791
15820B6663l8663k3696K7013L7477J1416k1951O189n9866k6038l292M3189R9217
15808G7658K134o1749n6884k2245k006j1271J0287K2188Q028m5605L72k0411K6299
15795g3205P6872J7946K3158M9333j4814k9152l7689l285m888J9570Q940o0913
15783b8127m5262N261l2417N8258m5843j3608L500K1230P1490k0105n3457J4918
15771f4162O7252n170K2197J5768m5578l2484j1337o9802o919j672K1220N2014
15759e8673M7678J8646J7825m7715n9282L6827M9265L6213L1791k7103r496o191
$$ y = [-42130, -99371, -91941, -99246, -69683, -32909, -30448, -51972, -96797, -81123, -82730, -142950, -152394, -121278, -111098, -120173, -136341, -93595, -95569, -98645, -53060, -5637, 31509, -4614, 4872, 26663, -12000, -35696, -8683, 28794, 40210, 18259, 24448, -35418, -61456, -64748, -21559, 77658, 79792, 18043, -38841, -61086, -63092, -74363, -64076, -41888, -33860, -79465, -79093, -99504, -73205, 3667, 21613, 44771, 94104, 79290, 50138, 12449, 9164, 4276, 23846, 32786, -28127, -73389, -68128, -100545, -42287, -88130, -101738, -98238, -77008, -5518, -25623, -79080, -64162, 3090, -2080, 20117, 35885, -9693, -42177, -53514, -123316, -130235, -131907, -110687, -58673, -10995, 7651, 25476, -22239, -81521, -44694, 4571, 40784, 72575, 45472, 35976, 29785]
15747B9785p1563p4486N38M4246N7456J4604o540P631l1695p4732j9022M7076
15735g6702J6018k3730J6563L4043K7319k6803O166J2186m0228J9856J3641p719
15723b9390P503k2700Q36O903m2558l0515k1073k6242J1390K7110M0007N4038
15711b4691K9782k3477J3092n0565j4095o195m6038j5964J4806l9159k021P7860
15699h6665L6336K8832P1017l1405j2186p693j0574l6329J0307L6604k4617n9035
15687h5408K4653O0799J1530j5350J1062K098j144N616l782N93p111K5033M5483
15674G4072l3366k0521p293l4489k0819k1736Q948L5377J3850o8711m2291L7428
15662g9551M5169k7132P183N4676J6209j5221m4301K2730j0534l372k5651l8982
$$ y = [29785, -41778, -116264, -115726, -71480, -14024, 580, -5960, 1671, -30024, -104756, -123778, -76702, -60684, -84414, -67851, -33808, -6489, -33292, -27126, -14940, -55168, -35312, -21671, -29390, -21887, -44587, -43751, -36848, -79406, -109921, -130994, -157236, -145846, -118736, -78729, -24691, 5091, -18386, -5294, -55859, -69954, -76149, -122187, -138151, -123345, -162504, -164525, -86665, -50329, -21497, 49520, 18115, 5929, -1764, -12338, -48667, -38360, -1756, -26373, -85408, -60755, 44, 11574, -3776, 7286, 9384, 8240, 13856, 10074, 10667, 3556, 28589, 74072, 40706, 20185, 12892, -21597, -42416, -64152, -55204, -19827, -5977, -74688, -116979, -79551, -34382, -61514, -54331, 345, 16554, 1333, -42968, -20238, -30772, -34144, -59795, -98777]
15650i8777L2482N4914N101Pl775k4035m7590K0858N8236N434l395l5409q49R174
15636b7624r056K0705K5476l6234R363L3844O418m2699j5977j8735l3862k9471
15624a17852L3882L0258N473j6562j368J3993j3359J5928j7788l582K3806N2163
15612D992m644j7448q834J1160J346k4375K3823P935K047j2033K2240L8224m7375
15599b942j8340K1239k356o2804k0726J6912L9465q094n0917j4378N161l500j0952
15586a12232l2176M5779Q5765k8419K9583K7508J2611l7175m7910J9286J3483
15575b3897M3443K331n7926k4359K8776J767q0425j3615K6523K8918k4519L7978
15563e5005K0124O002m5281j7701j1173O7719L0172N616N6690m467j6543O562
$$ y = [-98777, -66295, -11381, -6280, -6273, -10048, -34083, -81673, -60815, -2579, 2855, -540, -35949, -36798, -27624, -36680, -15975, 9501, -26733, -17370, 16474, 22892, -19807, -35784, -54519, -88381, -117852, -83970, -53712, -48239, -64801, -66169, -52176, -65535, -49607, -67395, -70977, -47171, 4992, 348, -17100, -25934, -14774, -13428, -37803, -13980, -6045, -3998, -16031, 6209, 44433, -2942, -21282, -43, -2399, -65203, -85929, -69017, -29552, -37646, -88563, -102941, -97780, -101280, -112232, -144408, -98629, -12864, -41283, -11700, 15808, 28419, -8756, -56666, -37380, -23897, 19546, 21877, -36049, -60408, -31632, -29865, -110290, -123905, -97382, -68464, -92983, -55005, -34881, -28879, -74160, -91861, -103034, -35315, -5143, 473, 57163, 52696, 36153, 42715]
15551D2715K7882l9955m5403m3711J4234Q856K450M7060k3686O870K2475j2992
15539F795k3039K8744J519o9949j8409J0031M2689m3312p5505K7373O8035k4064
15527f9092M0938O9429k4416k9873j7191k1109J9856K0019L206O2615j3174n0995
15515i787L0475k9143k8086j4052K4796k599J5555m5686J16K1893j1775j9499
15503f7792K9784R265L3202J3477l5966j2095n1473k8510J7562O0634n500n1430
15491h8842J1301J9483n2693L1277O3696p327o3111N227M2742m3463k3101J5671
15479h9140L1117K3442p151K3466k4660m302M2120m2088j1919L2559l180J1493
15467a8243L4059n7780j3310M7404k5166p9847p687L3892K9288l0418J925J8658
$$ y = [42715, 70597, 30642, -14761, -58472, -44238, -35382, -32932, 14128, -9558, -2688, 19787, 6795, -16244, 12500, 14019, -55930, -74339, -64308, -21619, -64931, -140436, -113063, -45028, -69092, -28154, 41275, 16859, -13014, -30205, -51314, -31458, -11439, -8233, 54382, 41208, -9787, 20688, -8455, -36541, -50593, -25797, -28396, -12841, -58527, -58411, -36518, -48293, -67792, -38008, -28743, 4459, 17936, -18030, -30125, -81598, -110108, -92546, -31912, -37412, -88842, -77541, -58058, -110751, -79474, -15778, -23105, -86216, -80989, -38247, -81710, -104811, -89140, -58023, -34581, -41732, -18266, -42926, -47228, -5108, -47196, -59115, -26556, -29736, -18243, 15816, -41964, -55274, -7870, -33036, -112883, -120570, -86678, -57390, -87808, -85883, -67225]
15455f7225l1594j283K9511M1949n538K4782m9836L827R728m5657K5320O2308
15443c708J2971l9439L5260l1292K1385J230m861J1195j573k358N2880R513l6130
15430B5073l8156k3283l7409Q4491K0846k5568k2295J7242J8427J0710m5992L500
15418a2414P5137n7833j7010R654J4882m9899j1771J0509P011L5924L4721J7367
15406E6278K537n6793j3495o575K6235m0576p8420o0540J0163P456J3250N5379
15394h5101P8036L820o9282J1565R111l2657K3345M498N7929o4113n273N747K877
15381e9498m8647Pq196J6370M8787l7643l1029N0367L8289j3244l955K742j8442
15368f4092J8318K5102M5515J4368k1496n2404o0024K3662j8402J1336O2915J1275
$$ y = [-67225, -98819, -100102, -70591, -28642, -34180, -9398, -59234, -55407, -45679, -91336, -66016, -3708, 9263, -30176, 5084, -26208, -4823, -3593, -8454, 2741, 1168, -1190, 51690, 61203, 25073, -13083, -36366, -73775, 10716, 31562, 5994, -16301, 941, 19368, 30078, -15914, -12414, 62723, 4890, -12120, -2466, 12416, -37483, -49254, -38745, -31734, 4190, 38911, 56278, 58815, 2022, -11473, -18048, 8187, -32389, -110809, -171349, -161186, -153730, -140480, -85101, -7065, -3245, -72527, -60962, -51851, -84508, -61163, -56665, 1264, -62849, -68122, -62375, -59498, -108145, -108138, -116334, -99964, -51177, -88820, -119849, -69482, -31193, -44437, -48392, -45650, -64092, -45774, -20672, 24843, 39211, 17715, -34689, -94713, -71051, -89453, -78117, -15202, -3927]
15356c927J7834o964q5025O5282M8297j4054m0032j6682K3813M1536j455J2305
15344D0928l0534K373M7849K4352n117o131j02351p7986m9021k5424P7820M3942
15332e9300j6352O288n9015K8567M4602q281j5114j4485J8719J6907O4638P3499
15320H0673n3863r1925j9582J2782K550J1118j7068k7021J9828O1216N071n6718
15308g2939l7533J5095k0252l2877L0003P4530N3530j3180n7287j9569M8820o954
15296c8613L1419L3730L889k6025j2108K4458l116o9417q1611R085k7952K651
15284a53610N0881J03536L1013n3962n591J1953k1195q434L4595K862l51P737
15272e66K4162j5887n2941k1779L5167L2858L7060j4300o9628L6153j9824M729
$$ y = [-3927, 13907, 6943, -78082, -12800, 35497, 21443, -18589, -35271, -11458, 30078, 28623, 40928, 10394, 12767, 60616, 84968, 79851, 73720, -28631, -106617, -155638, -181062, -103242, -59300, -75652, -69364, -128379, -99812, -55210, -63491, -78605, -93090, -74371, -57464, 7174, 80673, 26810, -65115, -84697, -71915, -69365, -58247, -75315, -102336, -82508, -21292, -16221, -72939, -110472, -95377, -115629, -148506, -118503, -43973, 9557, -3623, -60910, -80479, -31659, -38613, -7194, 26536, 30425, 4400, -7708, 16750, 13634, -55783, -137394, -128309, -156261, -153610, -102729, 807, 31820, -22142, -27733, -15780, -36975, -45409, -10814, -7952, -8303, -566, 23596, 7709, -45232, -67011, -31844, 1014, 38074, 23774, -45854, -9701, -29525, -24796]
15260b4796Q4989K0182J0251R540m6764k4441j9531k30q953l693M0086L4767l2790
15247C8617o5366m7406j0400K4611j4309j2721n9596q60Q7922L3371l5176K7577
15235c3736O2174j564j7806p953L9723K1870o5296n2524K9887O537m6614q273
15223g3575N48N05Q3119l6083q1074M6095J00741n569m0978l8371k003M8272K2967
15210B4594j4379J5814J7374J3947K4401l5857m8533m208O622J1537L488m8844
15198c4044o646j3094j1061j6028J4563j9224m7606n354N564M2027M0584k5842
15186g6161J6682j0923L1509L7515k2664l2228K6382p419o5158j2335N2585m575
15174f6790k4664K538L3330N0873J4989J8274J4086k3840l4596J1057M1058J2051
$$ y = [-24796, 60193, 80375, 90626, 100166, 53402, 28961, 9430, 9200, 247, -3446, 36640, 71407, 38617, -26749, -74155, -84555, -59944, -74253, -86974, -146570, -147430, -59508, -26137, -61313, -33736, 28438, 26874, 9068, 1115, 40838, 62708, -2588, -55112, -25225, -18688, -65302, -73575, -73027, -72522, 10597, -25486, -106560, -60465, 40276, 34707, -6271, -44642, -46645, 1627, 24594, 10215, 26029, 43403, 57350, 81751, 45894, -2639, -6847, -225, 11312, 14800, -34044, -40690, -53784, -64845, -80873, -66310, -85534, -133140, -138494, -132930, -90903, -50319, -76161, -59479, -70402, -38893, -1378, -24042, -56270, -29888, -37307, -102465, -114800, -62215, -66790, -91454, -88916, -55586, -4713, 10276, 28550, 42636, 18796, -15800, -4743, 36315, 48366]
15162D8366m0568K0192K5264M26j2489q656j1935o9346l5575r80M2702M432L982
15149c4185o2127j8713L0834k3930n1528k6314N8956k5354M378M4964K8495K2749
15137e1775J7262l1243m2648M4215N0563M281o2092l6051j1609L9812K6279j8211
15125g1217J56L2357P346M6394k219j8771k3130k2337k5794K4789J5262k0928
15113e8092K8010K0669Q619M434l5419j8883J26k8131k3426p263Q251K6502L0650
15100d3953K6313J863Q443L6805K0490n8173k3915k759K3145p600l1653L7841
15088a3153N329l8139K8573r006l339l8660m2378Q744M8181n729n9517J1600L5476
15075g2018N896r0J0906L0494m1802k7315M2315n545J9437J0281k6562l0k4602
$$ y = [48366, 7798, 27990, 53254, 53680, 41191, 32535, 20600, -48746, -84321, -85301, -42599, -38167, -34185, -96312, -115025, -84191, -108121, -159649, -185963, -127007, -152361, -147983, -103019, -74524, -51775, -34513, -65756, -108404, -64189, -13626, -9345, -71437, -107488, -119097, -79285, -53006, -71217, -71061, -38704, -31358, 15036, 12817, -5954, -29084, -51421, -77215, -52426, -37164, -58092, -30082, -9413, -794, 3640, -31779, -50662, -50536, -78667, -102093, -109356, -101105, -74603, -43953, -17640, -15777, -7334, 29471, 49961, -8212, -32127, -34886, -11741, -19341, -50994, -13153, -7824, -45963, -17390, -26396, -29735, -68395, -110773, -102029, -53848, -59577, -119094, -107494, -72018, -66122, -66212, -55306, -24812, -66614, -93929, -51614, -57159, -37722, -27441, -54003, -54033, -78635]
15062g8635L8724K4361o6697n3522J7898j5064p2700L2882N0558O7290M7452Q03
15050f650Q985J3436j7374k7108N4505J8064k0479j05659k2894m5708J5774O0677
15038g4431J7916J4006k3499l1750N1110M8733K2880p668k3342l8704K8639J5865
15026b45j2647J9794k1951m8306n3028O883L3899O0622J4200k1062n1605j9460
15014i2906J1392N5114M7098j8846k7738k2905L0794L6249P908l2762m7115J0118
15002d3599K888j0758l0231k0345M2300K7825r812M4370K4621L0189l9157l1586
14990a3295J4672J8270n2767K2250O3665l2414o1230l8463K5041J3629m9041K6436
14978f3247Q603K6848j7430m518l2127j4183L0393k4297j7393j1408J8316P4K9812
$$ y = [-78635, -39911, -15550, -82247, -135769, -117871, -132935, -205635, -172753, -122195, -54905, -7453, -6650, 2335, 15771, -1603, -28711, 25794, 43858, 23379, -82280, -105174, -150882, -135108, -74431, -56515, -42509, -66008, -97758, -46648, 2085, 24965, 17297, -6045, -44749, -16110, -245, -12892, 6902, -15049, -63355, -116383, -109500, -75601, -14979, -779, -21841, -73446, -92906, -81514, -26400, 20698, 1852, -25886, -48791, -17997, 18252, 26160, -6602, -53717, -43599, -40711, -51469, -81700, -102045, -59745, -31920, -41732, 2638, 27259, 57448, 18291, -13295, 1377, 19647, -33120, -10870, 52795, 20381, -40849, -79312, -54271, -40642, -89683, -63247, -54644, -27796, -45226, -49744, -81871, -96054, -65661, -89958, -107351, -118759, -100443, -100369, -70557]
14965g0557M7432O5601K5008o0551j6374k1991L7212N7949m5439m1968J9613j8991
14953b3056O6474N5819N4614R68o5431o5843l6440n8476j8087P2082L5137m7218
14941b9457q013k6584k250k6445o973P9669L6430l279M770N2504k0879l8962k2892
14928a2361l3611J7778p937L802L7969J1029n0509j8559P232M0399J2392J2256
14916A9880l9063n0607l9923o96M5459j906n2379o469J1099J1414j4704P483n108
14903a15520J8345J3094Q8004N7636K0256m0526p379K7979j4932k8168J4298K116
14891C5203k5803p660O002k699K0291r610j2839q003l6969k6497M3393m4651L23
14878f9519K0601N271J0091k1267Q816J4317m2171j9444J7686K9955M4933K2686
$$ y = [-70557, -23125, 42476, 67484, 6933, -9441, -31432, 5780, 63729, 18290, -23678, -4065, -23056, 43418, 99237, 153851, 154819, 89388, 23545, -12895, -71371, -89458, -17376, 17761, -29457, -37470, -64054, -66304, -92749, -99722, -20053, 16377, 13098, 17868, 70372, 49493, 10531, -12361, -45972, -28194, -36131, -32329, 5640, 16669, -33840, -52399, -45167, -4768, 7624, 19880, -19183, -69790, -109713, -110409, -64950, -66856, -119235, -125704, -114605, -103191, -117895, -110412, -115520, -97175, -84081, 3923, 61559, 81815, 41289, 33910, 61889, 46957, 18789, 33087, 35203, 9400, 1740, 7742, 5043, 25334, 15724, 2885, -5118, -42087, -68584, -25191, -69842, -69519, -48918, -43647, -33556, -54823, -46007, -31690, -73861, -93305, -75619, -45664, -731, 21955]
14866B1955K4636J5886l0482N462k113P64q229n101m5211k2823m5988M3305L1266
14853a6673k6458n808J8291j7890j8271K0481J9708j9365K2084R673l9817o9758
14841a23803k5691K4648J5002N3005O8119K6651j7604m6484k223J3863K9333j4712
14829A04j401J2246J795l5547q844P352k3455k0390l616M2356J5355p822l6460
14816e8327J373M0295l6293J4804K9482l1700l0936j1992j1603M1397L286l6061
14804h6275J9750M5284L6462k0912k9976J5236N9822n0063n1030P630J2613K8157
14792a3302J0608j8809O0l0346n5050K2312O0401J4169j1730J5383J3148k6554
14780a9710m2894L1318N2956o638o0156n5499O8571k724K1964q619m7045p6975
$$ y = [21955, 46591, 62477, 31995, 37457, 35344, 36108, 27879, 22778, -22433, -45256, -91244, -47939, -16673, -43131, -48939, -30648, -48538, -66809, -46328, -26620, -45985, -23901, -14228, -54045, -123803, -149494, -124846, -109844, -56839, 11280, 37931, 20327, -26157, -28380, -14517, 14816, 104, -1297, 10949, 12744, -22803, -31647, -24295, -47750, -68140, -71756, -29400, -14045, -21867, -58327, -56954, -16659, -52952, -38148, -8666, -40366, -71302, -83294, -94897, -53500, -50214, -86275, -66525, -21241, 15221, -5691, -35667, -20431, 39391, -10672, -61702, -54072, -41459, -13302, -2694, -21503, -21443, -51789, -106839, -84527, -24126, -9957, -21687, -6304, 6844, -19710, -62604, -31286, 21670, 15032, -45124, -100623, -32052, -34776, -12812, -21431, -68476, -145451]
14768a45451r488O8053M5361K5682K5478k9779k5139j7165n594m7847j9274j5301
14756a50464M7165O9053L7667L0373j639r117p0094k7458l9861J2872P776M8K3090
14743g0589L4207o547o742j063J3518N9513N3472K5600m4674K698n291k2209r541
14730B2352Q589k3575k6264l7126q800J6242n1485j7678j1890K1906O5961j335
14718d3103n066R329J5526Q959m930J8179K7912J4293m8967o0644j2894M8366
14706c3040L5145o5143J3360o31o347L9070J1465L386o665k7537M677J4335Q593
14693i332k8958n3847K8565M2468m132j3043L4225O2744m4946j6916J6478J2566
14681B5872k8362J4025J1341m2153o2268O2082J4800k2627K4914k2067K6046J9573
$$ y = [-145451, -154939, -86886, -41525, -15843, 9635, -20144, -45283, -62448, -68042, -115889, -135163, -150464, -103299, -34246, 3421, 33794, 32155, 23038, -47056, -74514, -114375, -101503, -93727, -93679, -70589, -36382, -42929, -49671, -50734, -37216, 22297, 75769, 101369, 56695, 59393, 54102, 31893, 22352, 30941, 7366, -18898, -56024, -64824, -48582, -100067, -117745, -129635, -107729, -41768, -43103, -48169, -38840, -23314, -14355, -19285, -1106, 26806, 41099, -7868, -68512, -81406, -33040, 2105, -63038, -49678, -50309, -56656, -17586, -6121, -2735, -9400, -36937, -32260, -17925, -9332, -38290, -92137, -63572, -21104, -25236, -38279, -4054, 58690, 13744, -3172, 13306, 25872, -2490, 11535, 22876, -19277, -81545, -19463, -4663, -27290, -2376, -24443, 1603, 21176]
14669B1176n62k9111n983N9735K6238L2412j3105j5431o1774n4530m986k4029
14657f9950j6328j6963K8657q507J1948L2238Q20M6708m8430k9930p748M2133
14645c5352m240p6324Q06K7042j6266p637M6002N6604O732j8313m829P703j803
14632a9875j7205l7826m217M713r893J8452J5318n311qR0028p264n3037m5787
14619g1912l5710K6411M2427J3582j4100n813K4905j022J0024M5193P4363J6748
14607A25096o6099k4979l41l0265m5372n987J2215j4418m4207R398O7994P1994
14595E5029J4666j8486m2820o3915j9949k4907j6311J775L3043P19j6903M5183
14583e2876k1499r916K0446K0974K6276K494n3227k5533L7955k3482J1903M7440
$$ y = [21176, 20614, -8497, -14480, 45255, 71493, 103905, 90800, 75369, 13595, -40935, -45921, -69950, -86278, -103241, -74584, -83091, -71143, -38905, -38085, 8623, -39807, -69737, -77485, -35352, -39592, -115916, -115110, -88068, -104334, -111971, -65969, -9365, -2633, -20946, -25775, -18072, -19875, -37080, -74906, -79123, -74410, -84303, -65851, -50533, -55844, -55852, 34176, 26912, -26125, -71912, -107622, -81211, -38784, -25202, -39302, -45115, -20210, -21232, -11208, 33985, 108348, 125096, 58997, 34018, 33677, 3412, -41960, -47947, -35732, -50150, -94357, -84959, -16965, 55029, 69695, 51209, 8389, -55526, -75475, -100382, -116693, -114918, -81875, -81156, -98059, -52876, -74375, -84291, -63845, -42871, -16595, -14101, -67328, -92861, -54906, -78388, -66485, -19045]
14571a9045k86k476K0164l4744l879K6513j2529J695K095M1536K1903r604N359
14558C6702j7983k5055j5576K959R857L6808M3838J3549m0404m6490k8603M0179
14546I781O4336K5659k9852m3150J3510J7771R688K1554N3950P088l4773o4976
14534E0586q2175K6729O3264L4550K169o0072m4256K6383j6708r131K8706K7717
14522D7762j6269k387K742o30K3509K6965m625j6200P3810m6967n5102r0193K9292
14509b8293o219J1502N9432K4633m0421m0703j5592j4518K3298J8706l5596J2365
14497c1406q997m401Q0867N640r9146J7756M7154J0664l9881k7505R550J515k2519
14484f0709N5759J2467k0243L164k3773O6756R913J0948k0359o7232k4366n345
$$ y = [-19045, -19331, -21807, -1643, -36387, -40266, -13753, -26282, -24587, -22492, 19044, 40947, 31343, 36702, 18719, -6336, -21912, -18953, -9096, 27712, 71550, 85099, 44695, -1795, -30398, 9781, 74117, 99776, 69924, 26774, 40284, 58055, 67743, 89297, 143247, 150335, 115562, 50586, -31589, -4860, 58404, 92954, 95123, 35051, -9205, 17178, 470, -8661, 20045, 47762, 31493, 29106, 31848, 31218, 54727, 81692, 77067, 60867, 134677, 87710, 32608, -57585, -28293, -34512, -23010, 36422, 61055, 20634, -20069, -35661, -50179, -26881, -8175, -43771, -31406, -40403, -44804, 36063, 41703, -57443, -39687, 7467, 18131, -21750, -49255, -39705, -38190, -60709, -4950, 7517, -12726, -9562, -33335, 33421, 43334, 54282, 33923, -33309, -57675, -63020]
14472f3020j0609k2205N1963l708K1977R394J6028K3167j7971m1166J9581L5907
14460A9338j9814J1191J9015N2417Q888q1801l9795L954M164j7117L2702L5732
14448B8874k0458l9797R76M8191J5696Q133n667J080J0350p46o4064n9587J9087
14435e7932J40R023K0551l4527J1785M9045j6215j1444L803n1910N7468N4746
14423C4533L3001j8356J1732L1439j7246o7108j0412m7529l9532J2947N0482j3766
14411c9815m0502L190m4064k4666N8174J00454M2077j2039o3692Q976O3650J2260
14399F4003l5587k6081o0202O922R5674P357j7359j6834m8174K0077J7360P750
14387A4906n494M6309L0775L792k4539K886J9066k0124k4841l3577Q109Q987K076
$$ y = [-63020, -73629, -95834, -43871, -47579, -25602, -16208, -180, 22987, 5016, -36150, -16569, 19338, -476, 10715, 29730, 82147, 91035, 9234, -30561, -26607, -22443, -39560, -6858, 28874, 8416, -31381, -30405, 17786, 33482, 41615, 35948, 37028, 47378, 46632, -17432, -77019, -57932, -57792, -48769, -28218, -62745, -50960, -1915, -18130, -29574, -25771, -77681, -20213, 34533, 67534, 49178, 60910, 92349, 75103, 7995, -2417, -49946, -89478, -76531, -26049, -39815, -80317, -77127, -121191, -145857, -87683, 12771, 54848, 42809, -20883, -11907, 51743, 64003, 28416, 2335, -57867, -50945, 44729, 52086, 34727, 17893, -30281, -10204, 7156, 14906, 9412, 55721, 86496, 90288, 65749, 68635, 87701, 67577, 42736, 9159, 17268, 26255, 28331]
14374B8331j49k5425p360n8310l258J6156K1844k1213l5248m900M4227N8187o861
14361F021q884k0406M124K4673N1172l1397n1545k5490l7691L59K898L013Q005
14348g5148L2070j2343j5790Q7162P3327k7636k1802Q635K0241p811L820m0599
14336B4126o6408k6572M8032M2939J7445M5444j6388N233R767L657k411p697O551
14323H3718j8201n93j3445p7070n4619L0277M2287R729l3709K743m7214p065N3375
14310b9787j6486L9941k0789K6119K4703L897J0728M831q0776m5518J3558q546
14298g8125K8222M3220N0819o102j1217l5026j7208j8519q374M3614l0569N005
14286c4260M1465J6541j4705o3730L2324N6548n7243k1600k7043K1389K3662M8041
$$ y = [28331, 28182, 2757, -4603, -62913, -66171, -50015, -28171, -49384, -84632, -89532, -45305, 12882, 6021, -2863, -23269, -19145, 5528, 56700, 25303, -26242, -51732, -89423, -89064, -86166, -83153, -75148, -43078, -55421, -71211, 15951, 89278, 61642, 39840, 48475, 68716, 60905, 64725, 24126, -42282, -68854, -20822, 22117, 39562, 85006, 68618, 73851, 83618, 87275, 84864, 77167, 83718, 65517, 64924, 51479, -25591, -80210, -49933, -7646, 2083, -31626, -28883, -76097, -83162, -29787, -46273, -6332, -27121, -1002, 23701, 27598, 38326, 43157, -37619, -83137, -69579, -78125, -49903, -6683, 44136, 38034, 26817, -8209, -25417, -43936, -52310, -8696, -39265, -34260, 7205, 23746, 9041, -54689, -22365, 34183, -23060, -44660, -71703, -50314, -26652, 21389]
14274B1389M5845n348n7890n5699J3343M0975p27o915K0816M204l6580L6103K9029
14261D8545n1824P158P2132J8950J6696m0711m2064k6007j0893R364L2783N3895
14249H8024j6479q8645l378J6205N8438m1486j4924j0649k6881K6221M4073K1031
14237E1550r767k9124j5383n080j0318l431N743j7968J3493J2205k7152l4995
14225g0227k3832J5092R874N93l4922Q212L8205L4283J7733l0504l7755M4762
14213b8486N190J5559L655J428j1655M694Q5894K2163N023k7946p5817k2604K3145
14200B43k0885j786K2537j7056K1777K2089J4100l544J9259j5038l6554K2863
14188B8005Q915k5502m9559L864M0405J2741l1169l2155K8420j6028J467O71k8732
$$ y = [21389, 67234, 61886, 3996, -51703, -38360, 2615, 1888, -5027, 15789, 19993, -16587, 19516, 48545, -3279, 3879, 76011, 94961, 111657, 70946, 28882, 2875, -8018, 1346, 34129, 88024, 71545, -17100, -20478, -4273, 54165, 12679, -2245, -12894, -39775, -13554, 30519, 51550, 41783, 12659, -2724, -7804, -18122, -21553, -15810, -33778, -20285, -8080, -35232, -70227, -94059, -78967, -69093, -68500, -103422, -95210, -57005, -22722, -4989, -35493, -73248, -28486, -23296, -7737, -4082, -2654, -14309, -9615, 76279, 98442, 103465, 75519, -298, -22902, 243, -20642, -22428, 109, -16947, 4830, 26919, 41019, 37475, 56734, 41696, 5142, 28005, 36920, 11418, -38141, -34277, 6128, 18869, -12300, -44455, -16035, -32063, -30596, -29925, -58657]
14175e8657J5418L6220N2060L2121k6409k0267J5120k8239m1615j0988L4718J2223
14163A1705l0743j5388N5459N957l9182j1493J0738K2810L1220J7617q086j2431
14151C8183m5519O348J4743L1255m982L1221k5109k2675L3334n770J3218L7981
14139A02228O2959k0815j7201N898m4340k3693M5389L2995l1201l8397j4340L0784
14127I0266l7763m4674n8980j3527J0417J4671K7247o56J3252j0915L4132K0376
14115D3846l1033K0316Q8111j0840j18386j6374R567J1018J4184n0797J1478L3167
14103D257L5983k2052L0366J2133M521J358o3166K8306L0430k1198j9323N3534
14091G5149N7340r791l6974l8240j4087j1937K6586j1769M751o8296n2288M5979
$$ y = [-58657, -43239, -7019, 45041, 77162, 50753, 30486, 45606, 17367, -24248, -35236, -518, 11705, -19038, -34426, 21033, 26990, -12192, -23685, -12947, 9863, 41083, 58700, 50614, 38183, -7336, -988, 13755, 45010, 40028, 71249, 46140, 23465, 56799, 51029, 64247, 102228, 165187, 144372, 127171, 133069, 88729, 65036, 110425, 143420, 112219, 73822, 59482, 90266, 52503, 7829, -51151, -64678, -54261, -39590, -12343, -12999, 253, -10662, 23470, 43846, 12813, 33129, 121240, 110400, -7986, -24360, -14793, -3775, 10409, -40388, -28910, 4257, 40240, 18188, 48554, 60687, 65208, 66566, 3400, 31706, 62136, 40938, 21615, 75149, 132489, 122698, 85724, 47484, 33397, 21460, 48046, 36277, 41028, -27268, -79556, -33577]
14079c3577P9316p060k457k5402L329J8095M0107J7474K443M5886J2930k4107
14067A26977N2354k8796O05L7166m9131m7344p2784r848M8853N5671R616j4909
14055A08430M1961J8067m8664m5675J8040k444j2617O885L8938K4207O680k2699
14043A31109o65k8893q809r987j5956O030n8613j667J1906j6241l4088J5494L6397
14030B6017O767M6298L8405m3266j7961L1864K8778k7139L1200l3145k7535P30
14018F1013L1508J4575k4727p5132j02K822L7317K0933k5575j7492J9986J2205
14006E7331P043j782n0982J5409N2479k7495j8257r801K4312N065k535m4358N23
13993F952K8024j3692j6045k6441l5097l244J0444k1916K6355J1260M3614L3149
$$ y = [-33577, 45739, 38679, 36222, 10820, 14149, 32244, 72351, 89825, 92268, 138154, 151084, 126977, 179331, 150535, 151140, 188306, 139175, 91831, 19047, 9199, 58052, 113723, 123339, 108430, 150391, 168458, 119794, 74119, 92159, 89715, 77098, 83983, 122921, 147128, 153808, 131109, 130444, 101551, 92742, 82755, 66799, 72829, 14216, 12549, 24455, 8214, -25874, -10380, 26017, 32784, 79082, 117487, 74221, 56260, 88124, 116902, 89763, 120963, 87818, 60283, 61013, 92521, 107096, 82369, 7237, 7135, 9957, 47274, 68207, 42632, 25140, 45126, 57331, 64374, 62592, 11610, 27019, 79498, 52003, 33746, 23945, 48257, 53322, 50787, 6429, 6952, 34976, 21284, 5239, -21202, -56299, -59543, -49099, -71015, -44660, -33400, 10214, 43363]
13981D3363M777J3566l6990J0411J8762m4659m786J6268n5770K1053O4066K059
13969E2120o2073m559K3181M0628l5983m9004K8514L1004k0331l8985l1305K9778
13957c7015O5874P3851N0042l328K177n5619l0009j3148n0626q4402q818l0418
13945a21439J1531O1435O9078K8315J1428r622R481J9637r170j5355j516j6246
13933C7557l5349L5344M2323o5863L2272L2908O910K373j3322N1105K1799L8919
13921A86976J4752L716K5290K289p8598r0127m5068m0897K728L0317K834n2032
13909c7820n518N3095J1681M5923j0822K6975k0146j0649k2726l3939L4877j3666
13897A7265l4849m264L8513O0928O546k7715L8885K825m6683k9296N1040M4896
$$ y = [43363, 48140, 61706, 24716, 35127, 53889, 9230, 4444, 20712, -35058, -14005, 50061, 52120, -9953, -14512, 8669, 49297, 13314, -35690, -7176, 23828, 3497, -35488, -66793, -37015, 28859, 102710, 152752, 149424, 151601, 95982, 65973, 52825, 2199, -82203, -91021, -121439, -109908, -48473, 20605, 48920, 60348, 50726, 60207, 79844, 70674, 55319, 53803, 37557, 2208, 37552, 79875, 14012, 46284, 79192, 86102, 88475, 75153, 126258, 148057, 186976, 201728, 205444, 230734, 233023, 154425, 64298, 19230, -21667, -18939, 11378, 14212, -37820, -43338, 9757, 21438, 67361, 56539, 83514, 63368, 52719, 29993, -3946, 30931, 17265, -17584, -21848, 16665, 77593, 84139, 56424, 95309, 98134, 51451, 22155, 73195, 118091]
13885A18091k8821n1514m0626j6638m990L3842K9543M0704N089n467J906k2541
13873E8578j4868O243k5971j649j8775l756k2521J3226L2418N9567j9566K383
13861F5309N5608k2516j7493k9292K5106N0380m283q7580k3633q078K8876j9143
13849A3261k9434l7204j0170P4009k0657o4386J8736P4000M5670m4985k9839K4987
13837A3988N0252L4285k9433k3918N4927K1113j3737j1255L4250l8625j6154n0549
13825B5144o668K7767J7683K4262k1634m1336j595L8335M7828j4016j2145j1482
13813G2143m1386L4586K2111j3248n995J7788l7565j6194k1531K3539O4415J6608
13801A15271j1668N4179n6809n1103k2274r030j1858o8181K4626O9692M8232q983
$$ y = [118091, 89270, 37756, -2870, -19508, -24498, 9344, 38887, 79591, 84680, 79213, 81119, 58578, 43710, 49953, 23982, 22333, 3558, -198, -22719, -9493, 22925, 82492, 62926, 65309, 120917, 98401, 80908, 51616, 76722, 127102, 122819, 35239, 11606, 3528, 32404, 13261, -16173, -53377, -63547, 10462, -10195, -74581, -55845, 18155, 63825, 18840, -10999, 13988, 64240, 98525, 69092, 45174, 100101, 121214, 107477, 96222, 130472, 91847, 75693, 25144, 18476, 46243, 63926, 88188, 66554, 25218, 23623, 61958, 109786, 95770, 83625, 72143, 30757, 65343, 87454, 74206, 68211, 85999, 48434, 32240, 10709, 34248, 98663, 115271, 103603, 157782, 100973, 49870, 27596, 18566, 6708, -61473, -36847, 32845, 81077, 72094]
13789G2094K472J0649N6235l5394p6316o036L0919k6525k5349L9791R4429M4522
13777A81491m3435k7033o415K4280Q884o203l9192l70O0142j9664l5222j71k5146
13764G1946j6880P498K0449J7153m4783k3054L7035L8035O3428K7897j3950p6595
13752A08179k0842o474k227Q551K3327M072j6729K326K9689L0140l2357K526l044
13739A27137j2314K977j0981k9805m7323n9839m7305K1574N0331M175k2300K8147
13727D474M5245L6437K6749k332j0152r41K613n0j3016K8245J6210l968n0069
13714G9445m2542J9537K7919O5975R089l7213j34881m9154Q6155N1498J9727j9209
13702G6346L2728J8143L7099J5284K3064j6821J7356K3439k9304m691k1887K4132
$$ y = [72094, 74566, 85215, 141450, 106056, 29740, 23704, 54623, 28098, 2749, 42540, 136969, 181491, 138056, 111023, 104608, 128888, 137772, 131569, 92377, 92007, 152149, 132485, 97263, 97092, 71946, 55066, 62564, 83013, 100166, 55383, 32329, 69364, 107399, 170827, 198724, 184774, 108179, 87337, 80863, 78636, 87187, 110514, 114586, 97857, 100183, 129872, 160012, 127655, 130181, 127137, 114823, 117800, 106819, 77014, 29691, -30148, -77453, -55879, -5548, -1373, -23673, 4474, 49719, 86156, 112905, 110573, 100421, 99480, 102093, 102043, 89027, 117272, 133482, 129514, 79445, 36903, 56440, 84359, 150334, 159423, 122210, -12671, -61825, 24330, 75828, 95555, 76346, 109074, 127217, 164316, 179600, 202664, 185843, 203199, 226638, 197334, 192643, 170756, 194888]
13690A94888j396M3150J399o6414Q161L4122m1987l6016j087k3215j672L7535
13678A47468J04334K7165j8949J4917m265n6905j7653M3062o789o9630p927K1654
13666A76482l3769j0989K2192N7886j2415J250M2428j2078q396j1531k712n991
13654B02357L8587j021L4067k0052j9950q222L3472N238j9765J0956M0863K453
13642B98983l0221N386k5479O455j1206J7413j2726m0418J1703l2597m0342J3761
13630A60712Q388l6160L251l599k2096J186J7916j0816j9075K243L6740J1216
13618A49906k7873P564J9019P13K0162N5895M1501K5376p1448o9681k989r042
13606A39103K2579L6135K0728N70k2812k3628j7696K8571J4508R675K3268j8645
$$ y = [194888, 193492, 236642, 238041, 171627, 179788, 213910, 171923, 135907, 134820, 111605, 109933, 147468, 251802, 278967, 260018, 274935, 270670, 213765, 196112, 239174, 232385, 162755, 154828, 176482, 142713, 131724, 153916, 211802, 199387, 200637, 243065, 230987, 222591, 211060, 208348, 202357, 240944, 239923, 273990, 253938, 233988, 225766, 259238, 264476, 244711, 255667, 296530, 298983, 268762, 274148, 248669, 255124, 243918, 261331, 248605, 208187, 219890, 187293, 146951, 160712, 169100, 132940, 136191, 132592, 110496, 111682, 129598, 118782, 99707, 101950, 138690, 149906, 122033, 129597, 148616, 149329, 169491, 225386, 266887, 292263, 220815, 151134, 148145, 139103, 161682, 197817, 218545, 219115, 196303, 172675, 154979, 183550, 198058, 207733, 231001, 212356]
13594B12356p467n2334r373l3581k1726M7242l0899l3084M4118J7913k0926l434
13582A08805O7594j4148j7441k6424l6740K1806k1763l7545O7347K1048o5660
13571F6879M5803p620N688M1068L7035j6718l2396K782J8401R045N4992k3443
13559B01516j0917k9125J644J9052j0549R253m3598r057j835j3434l026M3456
13547A53380M4778n756l275j3522k0540j1275L9938k569K2498N3514l3037k5218
13535A98916J6685l78j9161o2899l2676L0460k4592K1061M125N0556R633r372
13523A82358j681J3787K9740M9750K598j9482j9540l8631j3014O6020L8422K5477
13511C15804J5101k4998l1050m321l8626j089P1293K9633J5466k1481k7006l888
$$ y = [212356, 204889, 152555, 143182, 109601, 87875, 135117, 104218, 71134, 115252, 133165, 112239, 108805, 176399, 162251, 144810, 118386, 81646, 103452, 81689, 44144, 111491, 132539, 66879, 112682, 105062, 110750, 151818, 188853, 172135, 139739, 142521, 160922, 169967, 224959, 201516, 190599, 161474, 163118, 182170, 171621, 180874, 137276, 128219, 126384, 112950, 109924, 153380, 198158, 192402, 189127, 175605, 155065, 143790, 183728, 181159, 203657, 257171, 224134, 198916, 215601, 215223, 196062, 133163, 100487, 130947, 106355, 127416, 131541, 182097, 191730, 182358, 180677, 194464, 224204, 273954, 276552, 257070, 237530, 198899, 185885, 251905, 290327, 315804, 330905, 305907, 274857, 270536, 231910, 230821, 302114, 331747, 347213, 325732, 298726, 294838]
13499B94838r40K1559Q629j7895l2975m884k7973m7365K039L3430J3772k1954
13487B20281j7008K1809N1183N1527p811L839N5889P5614J0970k5495J437N237
13475D47472M7816l812k9222o128k7970j05645m3619L1225K2151L9367O8189K9258
13463D69082Q064K2553k0851Q9269J9344q876J3977M2783P9257L6862P7566J9207
13451H48237Q595j1685J2837O4335N3087l203l0290O294k0918k3111l6373j803
13439H66002j2115m8106p843J4175n5318p2126j11428o6138R623j1876j3495k2699
13427D68656n2394l7229n7008k9698K9721J1497J7549k9764K3376J3675j9532
13416C38849j3181K7292r133k4276j0677K229m8070o304O4811L0329l6197N692
$$ y = [294838, 293898, 315457, 324086, 306191, 273216, 268332, 240359, 192994, 195033, 228463, 242235, 220281, 203273, 225082, 276265, 327792, 319981, 323820, 379709, 455323, 466293, 440798, 442235, 447472, 495288, 491476, 462254, 456126, 428156, 322511, 278892, 310117, 332268, 371635, 439824, 469082, 477146, 499699, 478848, 568117, 587461, 578585, 592562, 635345, 714602, 751464, 829030, 848237, 856832, 845147, 857984, 922319, 975406, 972203, 941913, 948207, 927289, 904178, 867805, 866002, 853887, 805781, 797938, 812113, 756795, 684669, 573241, 507103, 516726, 504850, 491355, 468656, 416262, 379033, 322025, 292327, 322048, 333545, 351094, 321330, 344706, 358381, 338849, 325668, 352960, 343827, 319551, 308874, 311103, 263033, 256729, 321540, 351869, 315672, 321364]
13404C21364o0246P638N4885j1829o2793n957n858k0204K4633P4128L2137L1864
13392C79762l7911k1226q130j9408K5082Q479p150j6518K0157l729l754m5879
13380B69775n6986m8772l381N2702K6369L3601L0464J7774k1546K3855M6910r458
13368C61307Q140N68l5060r216r572n093J712j3435k6579K4457Q7075N8204J7232
13355D59740q399o0876n2031J1664O9682L2682n4315J0172L3081J0603l5799R595
13343D25799K8706M6887K4995K9567L7313N4266J39223O5148J27131K21837J80710
13332A381582J42601J50582N9054J1353p9582j28086q9438j70682j26379q4506
13322A066499l9253k4351j3788O27K3825P1385P9667O9502P3444Q4825M7029m5791
$$ y = [321364, 261118, 268756, 323641, 311812, 249019, 243062, 237204, 217000, 241633, 315761, 347898, 379762, 341851, 320625, 312495, 293087, 318169, 326648, 319498, 302980, 323137, 319408, 315654, 269775, 212789, 164017, 160636, 213338, 239707, 273308, 303772, 321546, 300000, 323855, 370765, 361307, 369447, 370015, 334955, 325739, 316167, 311074, 312786, 299351, 272772, 297229, 384304, 442508, 459740, 451341, 390465, 338434, 350098, 419780, 452462, 398147, 408319, 441400, 452003, 416204, 425799, 454505, 501392, 526387, 555954, 593267, 647533, 786756, 851904, 979035, 1200872, 1381582, 1524183, 1674765, 1733819, 1745172, 1665590, 1537504, 1448066, 1277384, 1151005, 1066499, 1027246, 1002895, 989107, 989734, 1013559, 1084944, 1164611, 1234113, 1307557, 1392382, 1439411, 1393620]
13310A393620m8512k0872q6661p2187n4058J02705M2274R6543Q6669N2096M2319
13299A533936R5101J23460N1525k6815k6178j5992j05971j76787r0215r1081k0478
13288A250505L1592j8040q976O1356M2909l9699o7145l1201k2169k4060L7004
13277A212076j1358k3733k4474K4612M3570K9491M1722P1717P1100J12180R8425
13266A645328J42485N9934q872n6934j58041j69808k02553j27193q0160p2060
13256I72126o1065p7631m0756p8894l4109p5891m370J0841k7909n3891l6616J1268
13244E03103L4526M1601p526j4499k5614n0612j5485J4693j9055K3407M1211k8322
13232D97428n1974o839J5022p541J826K9261p1328n6593N681o70Q700M2308L9781
$$ y = [1393620, 1345108, 1324236, 1237575, 1165388, 1111330, 1214035, 1256309, 1352852, 1439521, 1491617, 1533936, 1629037, 1752497, 1804022, 1777207, 1751029, 1735037, 1629066, 1452279, 1362064, 1270983, 1250505, 1282097, 1264057, 1255081, 1316437, 1359346, 1319647, 1252502, 1221301, 1199132, 1175072, 1212076, 1200718, 1176985, 1152511, 1177123, 1220693, 1250184, 1291906, 1363623, 1434723, 1546903, 1645328, 1787813, 1847747, 1838875, 1781941, 1623900, 1454092, 1251539, 1124346, 1044186, 972126, 911061, 833430, 792674, 713780, 679671, 603780, 599410, 610251, 582342, 528451, 491835, 503103, 537629, 579230, 571704, 557205, 531591, 480979, 465494, 480187, 461132, 484539, 525750, 497428, 445454, 438615, 453637, 446096, 447922, 477183, 405855, 349262, 354943, 354273, 362973, 405281, 445062]
13219D45062K3293N9453j1348L352l1616J3425M3095J1812j4505l0625k9306k8164
13207D53928j6510j2498K1105M9307j6423j6771k0970p125M1860L7129m0601p7098
13195C95333M3626P2167m847L3762R891l4532J5694K5069k2902J8808j0676J0992
13183E52385M2325r850L9585J7962K647K987l9483j6821K1201N0493J7537n5934
13171F25034l0629Q497M1398k9891l5931l044K7733m5603R615L8296P2695J9178
13159F97348l8385N328R899q940K6372P8254P7763p995J2482N7975M6872L9678
13147I96651O147q1902l9471O1711l5112k1532q2637j13842r699N4553J0893J8432
13135G64192J4769M4087J6405j4992J7203J8526k5086Q498M7367L2339j1338m8710
$$ y = [445062, 468355, 527808, 516460, 519812, 488196, 501621, 544716, 556528, 542023, 511398, 482092, 453928, 437418, 424920, 446025, 495332, 478909, 462138, 441168, 434043, 475903, 513032, 472431, 395333, 438959, 511126, 506279, 540041, 549932, 515400, 531094, 556163, 533261, 552069, 541393, 552385, 594710, 584860, 624445, 642407, 645054, 648041, 608558, 591737, 612938, 663431, 680968, 625034, 594405, 602902, 644300, 614409, 578478, 575434, 603167, 557564, 567179, 605475, 678170, 697348, 658963, 664291, 674190, 665250, 691622, 769876, 847639, 839644, 852126, 910101, 956973, 996651, 1002798, 920896, 881425, 943136, 908024, 886492, 803855, 690013, 680314, 734867, 745760, 764192, 778961, 823048, 839453, 824461, 841664, 860190, 835104, 843602, 890969, 923308, 911970, 863260]
13123H63260J186k6207N5268J07089R2121J9650k4798j4426k4406m0686k7286
13112I80765j0413k6062J6896K0790M3957l6940k8349m1882l3452l495q002Q839
13100H82652L3510K949K4354n958k4887N1325j5524n6249l019K2109P2868N2995
13088A037125J1427L2070J12321N7456J6908l4450n6668r8736m5495O352m137
13077A034173J0561j5519N2J3147J5880N841O1590P127l1497l5930j7832l4584
13065A013009M0280M3539R545K2421O4486o739j9951M5950R9659Q9333R0689K1211
13053A513432M304O4907P7899J02087O7713K20187K33624K58045L04494L85743
13043C232435L63798L50176K78471J70320J21129J5178o5763j97307k62700k84725
$$ y = [863260, 864446, 838239, 893507, 1000596, 1092717, 1112367, 1087569, 1073143, 1048737, 1008051, 980765, 970352, 944290, 961186, 981976, 1025933, 988993, 960644, 918762, 885310, 881815, 873813, 882652, 916162, 919111, 943465, 937507, 912620, 963945, 948421, 892172, 889153, 911262, 984130, 1037125, 1048552, 1080622, 1192943, 1250399, 1267307, 1232857, 1176189, 1077453, 1031958, 1038310, 1034173, 1044734, 1029215, 1029267, 1042414, 1058294, 1064135, 1125725, 1132852, 1101355, 1065425, 1047593, 1013009, 1053289, 1096828, 1106373, 1128794, 1193280, 1186541, 1166590, 1212540, 1312199, 1401532, 1492221, 1513432, 1517736, 1582643, 1660542, 1762629, 1830342, 2050529, 2284153, 2542198, 2846692, 3232435, 3596233, 3946409, 4224880, 4395200, 4516329, 4531507, 4465744, 4268437, 4005737, 3721012]
13033C721012k65562k99301l55793k29813j75156j75603j02133q3391m158k2552
13023B007550O727n9719J3861K1393q610j7602k7440q5730p9550o237J5787M5343
13011A825773j9371M3568K6474O0875M6801K6527m259m2008L0006j3078l400N5927
12999B033835M0414j745Q729L359p932M118O3768L4159J1350J8527O2315M7926
12987B318823J8582K8364j2752k1584J5199K6355Q9316O3315l4442N3711O9950
12976B614837K1953L2370O6604L6351K3358J9069P1514j4956O8657J25635R0809
12965C156201Q9341J6416k919J3474N5468J44785J12940P5442J04353P9799J19716
12954C965016J39084J10386K1558Q328N7784R5060J26423J27221J52640R1390
$$ y = [3721012, 3455450, 3156149, 2800356, 2570543, 2395387, 2219784, 2117651, 2034260, 2030102, 2007550, 2014277, 1954558, 1968419, 1989812, 1981202, 1963600, 1936160, 1850430, 1770880, 1764643, 1780430, 1825773, 1806402, 1849970, 1876444, 1937319, 1984120, 2010647, 2006388, 1964380, 1994386, 1981308, 1977908, 2033835, 2074249, 2072504, 2081233, 2084592, 2076660, 2080778, 2144546, 2178705, 2190055, 2208582, 2270897, 2318823, 2337405, 2365769, 2353017, 2331433, 2346632, 2372987, 2462303, 2525618, 2491176, 2544887, 2614837, 2636790, 2669160, 2735764, 2772115, 2795473, 2814542, 2886056, 2871100, 2939757, 3065392, 3156201, 3245542, 3261958, 3259039, 3272513, 3327981, 3472766, 3585706, 3661148, 3765501, 3845300, 3965016, 4104100, 4214486, 4236044, 4244372, 4302156, 4397216, 4523639, 4650860, 4803500, 4894890]
12944D894890Q7977J05690J06623J47585J15640J42732J52796J28052K10875K18698
12934F311558J96087K58493K63382L01792K87524K47567L23312L45243M12900
12925H947858M48942M28761M78757N69947O45873O21945O81487Q97804R78844
12916A4700218R97996J144662J311671J521359J765816K136925K568543L124444
12908B9271634L813291M776623N846402P157980Q961088J1378187J4836116J9557639
12900A05598960K5403196L2059425L7343292L8195878L1987366J8687401Q12413
12893B90087931j6286373k7316056l0949881k9218519k4225293j7791243j1400873
12886A32899693n470890j60227M279464P487633R176042R507581Q579876O648455
$$ y = [4894890, 4982867, 5088557, 5195180, 5342765, 5458405, 5601137, 5753933, 5881985, 6092860, 6311558, 6507645, 6766138, 7029520, 7331312, 7618836, 7866403, 8189715, 8534958, 8947858, 9396800, 9825561, 10304318, 10874265, 11520138, 12142083, 12823570, 13721374, 14700218, 15698214, 16842876, 18154547, 19675906, 21441722, 23578647, 26147190, 29271634, 33084925, 37861548, 43707950, 50865930, 59827018, 71205205, 86041321, 105598960, 131002156, 163061581, 200404873, 238600751, 270588117, 289275518, 290087931, 273801558, 246485502, 215535621, 186317102, 162091809, 144300566, 132899693, 127428803, 127268576, 131548040, 139035673, 148211715, 157719296, 166299172, 172947627]
12878A72947627M062935J074537k177549m635711n507495m530753k151231J291734
12870A60374094N707985J0924009J6052767K0260521K2478054K1825478J7659133
12863B75282041J0147856M55705r400035j7418047k1965695k2957471k0967242
12856A93177112j7086118j2198560p052614k237320J801798M823817O743235P071958
12848A75043308N641307K836759p25005m214428o837385q213780q583153p949199
12840A46998424n926259k124712L257485R488796J6160463K2709478K8293836
12833B18857511L1531267L0463148K3215896R526227q085692k5417428l7750113
12826B42340816m1608988l7827223l0561010k3383224j7625727j3259073j0249517
$$ y = [172947627, 177010562, 178085099, 175907550, 171271839, 165764344, 161233591, 159082360, 160374094, 166082079, 177006088, 193058855, 213319376, 235797430, 257622908, 275282041, 285429897, 285885602, 276485567, 259067520, 237101825, 214144354, 193177112, 176090994, 163892434, 156839820, 154602500, 156404298, 161228115, 167971350, 175043308, 180684615, 183521374, 182796369, 178581941, 171744556, 163530776, 154947623, 146998424, 141072165, 138947453, 142204938, 151693734, 167854197, 190563675, 218857511, 250388778, 280851926, 304067822, 313594049, 305508357, 280090929, 242340816, 200731828, 162904605, 132343595, 108960371, 91334644, 78075571, 67826054]
12819F7826054q301137o952097n789278m887035m166084l491733k948713k563036
12811B8726941k227149j950093j701892j538946j302478j128075j038174r76168
12803A6863966q65055p40251o59125o27685n72690n32317n15272m56019m81834
12794A1413718m47426m05007l85065l36972l32232k74705k17409k22965k55295
12785H536642k78811k07266k00696l12955k99647k72038l50145j84335j55953
12776F274796k39110j85315j11287j52179j23691p1528j47980j12649q4914j91079
12766D855064k22655j03362q4631j20844j26278q6436m8202j14197n7314k5903
12756C865242o6638l5385K5994l1196j64948j32134k1635n957K379J7384j8799
$$ y = [67826054, 59524917, 52572820, 46783542, 41896507, 37730423, 34238690, 31289977, 28726941, 26499792, 24549699, 22847807, 21308861, 20006383, 18878308, 17840134, 16863966, 15998911, 15258660, 14599535, 13971850, 13399160, 12866843, 12351571, 11895552, 11413718, 10966292, 10561285, 10176220, 9839248, 9507016, 9232311, 9014902, 8791937, 8536642, 8257831, 8050565, 7849869, 7536914, 7237267, 6965229, 6615084, 6430749, 6274796, 6035686, 5850371, 5739084, 5586905, 5463214, 5391686, 5243706, 5131057, 5046143, 4855064, 4632409, 4529047, 4444416, 4323572, 4197294, 4110858, 4062656, 3948459, 3891145, 3865242, 3798604, 3763219, 3789213, 3758017, 3593069, 3460935, 3439300, 3433343, 3435722, 3453106, 3434307]
12745C434307r505R934n0651j4318M0917n5317j16879q2412l1564L7006m9098
12734C112420p3231j1516n8474q0207o0304o8329n6429M1323J4559k2497j2727
12723B724588L8095M6803K9888j7413k7499J3364O0143K9136L5599N499M6405
12712B984608M2213j1308k9988l3696j7802M3949Q3163P2363j2151l5967m5102
12701C040282L7019J1867O5758N3325M6572R2334J12400Q8596R9079J14510P0101
12690C831843O3327K7461Q5242N6685j28696j40356o9663n9559j9804N0993n854
12679C691619N7552N2127l384j8123L4650J30455J03963Q0649R1277J08893J16729
12668D446407J61504J71779J72587J59932K19089J04778J16411J33711J58675
$$ y = [3434307, 3424802, 3434736, 3384085, 3369767, 3410684, 3355367, 3238488, 3156076, 3124512, 3161518, 3112420, 3039189, 3027673, 2969199, 2888992, 2828688, 2760359, 2703930, 2745253, 2759812, 2737315, 2724588, 2762683, 2809486, 2839374, 2821961, 2794462, 2807826, 2867969, 2897105, 2932704, 2938203, 2984608, 3026821, 3015513, 2985525, 2951829, 2934027, 2977976, 3061139, 3133502, 3121351, 3085384, 3040282, 3077301, 3089168, 3154926, 3208251, 3254823, 3347157, 3459557, 3548153, 3647232, 3761742, 3831843, 3895170, 3922631, 4007873, 4064558, 3935862, 3795506, 3725843, 3666284, 3646480, 3697473, 3691619, 3749171, 3801298, 3797914, 3779791, 3814441, 3944896, 4048859, 4129508, 4220785, 4329678, 4446407, 4607911, 4779690, 4952277, 5112209, 5331298, 5436076, 5552487, 5686198, 5844873]
12659E844873J76705J36626J80510K43672K00672K55958K86028L30852L94896
12650H050792L67153M65021N14830N08582N75186P01958P53205P94436R68446
12641A3699609J099425J179463J370814J636783J948126K367401K715910L152894
12633B9170425L564842M064727M773136N690104O848331Q484517J0945522J4537295
12625H8078899J9743583K7140108L6528912M5925860N2268977N3950385N0700337
12618C74337061M4181253L6323880K6191237J1688998p285842k5940812l8365059
12611D21130716m4083347m7546612n1220233n1986013m6962388l6898399k6768948
12604A15664776j9219482j4131195j0803890q637562p110155o057624n260042
$$ y = [5844873, 6021578, 6158204, 6338714, 6582386, 6783058, 7039016, 7325044, 7655896, 8050792, 8417945, 8882966, 9397796, 9906378, 10481564, 11183522, 11936727, 12731163, 13699609, 14799034, 15978497, 17349311, 18986094, 20934220, 23301621, 26017531, 29170425, 32735267, 36799994, 41573130, 47263234, 54111565, 62596082, 73541604, 88078899, 107822482, 134962590, 171491502, 217417362, 269686339, 323636724, 374337061, 418518314, 454842194, 481033431, 492722429, 485436587, 459495775, 421130716, 377047369, 329500757, 278280524, 226294511, 179332123, 142433724, 115664776, 96445294, 82314099, 71510209, 62872647, 55762492, 49704868, 44444826]
12597D4444826m605571m020293l496314l055638k702160k265383j842252j586432
12589B0870783j404229j229555j138127r37212p96142p95720p23950o18357n34684
12580A2692807n54490n15041m75550m69927m20331m03541m43993m44274l29677
12571H635983l41157m10444l42929l27236l18496k63614k87893k89039k11866
12562E843309j99477j81828j66978j74424j93354k33657j45553j53708j04296
12553D290034j07447j44776j52919q8457j17758j71304j30076j36096j00144q8095
12543C052962j38213j16640j23940j51605r0476j6763k6199l5773p5277j8944
12533B259132k9670o0377q4830n4463p7465k8487P416m6778l0125o657Q297m8561
$$ y = [44444826, 39839255, 35818962, 32322648, 29267010, 26564850, 24299467, 22457215, 20870783, 19466554, 18236999, 17098872, 16161660, 15365518, 14569798, 13845848, 13227491, 12692807, 12138317, 11623276, 11147726, 10677799, 10257468, 9853927, 9409934, 8965660, 8635983, 8294826, 7884382, 7541453, 7214217, 6895721, 6632107, 6344214, 6055175, 5843309, 5643832, 5462004, 5295026, 5120602, 4927248, 4693591, 4548038, 4394330, 4290034, 4182587, 4037811, 3884892, 3796435, 3678677, 3507373, 3377297, 3241201, 3141057, 3052962, 2914749, 2798109, 2674169, 2522564, 2432088, 2415325, 2389126, 2353353, 2278076, 2259132, 2229462, 2169085, 2084255, 2029792, 1952327, 1923840, 1931256, 1884478, 1854353, 1847696, 1855993, 1807432]
12521A807432p8031j00953r5624n0046K4759o8514j5255l2984l2579l4163m0667
12510A283375J8655k0799o1670k2299L0482k2105j3149m8041k4644Q2308O5764
12499A267877M803O2781N228Q70p462k8000O1773N689l6460K363K5846P6011R4308
12486A535627M1756J3231j1143J3082Q9754K4046L7029O3649O4824J62156K14689
12475B248700J88888J75363P6214M0992L8917M126p8438q9633j32655j08099k9646
12464B334729m0196n1218q7403K7074J14862J95459K26910K32409K44518K00972
12454C398116J1517j4638m7015j15495j37543j10966j11571m8559N5008L3994
12444B912848J7944R2588J04648R6685J23939N3688j8149o4020j08609j32423
$$ y = [1807432, 1729401, 1628448, 1532824, 1482778, 1507537, 1439023, 1423768, 1390784, 1358205, 1324042, 1283375, 1302030, 1281231, 1219561, 1197262, 1227744, 1205639, 1192490, 1144449, 1119805, 1202113, 1267877, 1272680, 1335461, 1340689, 1341559, 1334097, 1306097, 1367870, 1373559, 1337099, 1339462, 1365308, 1441319, 1535627, 1577383, 1590614, 1579471, 1592553, 1682307, 1706353, 1743382, 1807031, 1871855, 2034011, 2248700, 2437588, 2612951, 2689165, 2730157, 2769074, 2773200, 2694762, 2605129, 2472474, 2364375, 2334729, 2294533, 2243315, 2155912, 2182986, 2297848, 2493307, 2720217, 2952626, 3197144, 3398116, 3409633, 3394995, 3347980, 3232485, 3094942, 2983976, 2872405, 2823846, 2878854, 2912848, 2930792, 3023380, 3128028, 3224713, 3348652, 3402340, 3384191, 3320171, 3211562, 3079139]
12434C079139j05015j59429q2267m9753J5363J1958O2356Q3889J25526J20179
12424C101946P7833R002k2091m1355j22984j12056j84769j15195m9019l7769K9647
12413B533190M6027J18930J66722K24200J80502R8325K6908l3006r1249j90292
12403C080257j54324j41852k64565k27926j67437j29461j24269p8110o7013O138
12393A731438N9453O6796K7275O2947M0518m7370j83572k38071k28143j71501
12383A119770j31265q1079p2548q4865o8003q6058j7798q7234q3956j1414k5466
12372C70084m461p14r302r492l4864K5284O1322j616j6037o3878n0899j1096n4869
12359A99462k2620k2290K8000M5043l9933l774R448k5699P415M1001J3784J3510
$$ y = [3079139, 2974124, 2814695, 2732428, 2682675, 2698038, 2709996, 2772352, 2856241, 2981767, 3101946, 3179779, 3188781, 3166690, 3125335, 3002351, 2890295, 2705526, 2590331, 2541312, 2503543, 2533190, 2579217, 2698147, 2864869, 3089069, 3269571, 3367896, 3394804, 3361798, 3270549, 3080257, 2925933, 2784081, 2519516, 2291590, 2124153, 1994692, 1870423, 1792313, 1725300, 1731438, 1790891, 1857687, 1884962, 1947909, 1988427, 1941057, 1757485, 1519414, 1291271, 1119770, 988505, 907426, 834878, 750013, 682010, 595952, 578154, 490920, 406964, 395550, 370084, 365623, 364909, 355607, 346115, 311251, 336535, 397857, 396241, 380204, 316326, 265427, 254331, 199462, 176842, 154552, 182552, 227595, 187662, 183888, 193336, 167637, 175052, 216053, 229837, 243347]
12347B43347k4572p334J0959p5186n6157P4146J9166n44j1278J5311k814J954
12335A86998j9880m7624j5375k4259r0987M917M6929m3300J263P9421J049m3023
12323C6129j4820k0553K7226M0459J3337o2825l505K8779m0476k6509q699m0031
12311g1488j6221J4702k1531L6791J0716j8264k0325M2782J5732J744p667J3398
12299a9631K0432l0994m0321J2725k004J1987J4409J5149k3916j0490N8025P0569
12287G5940n419p7536j1896Q6967L5434l8294k2294J6810M3840J7148P37k4704
12275I6733l9034l2842k8631j3217P606l5515N4324O847J319K3399L7848l5430
12263D3407j6590K3098J4763L3450r235J9017j712j6644l5110j8566N0996K5392
$$ y = [243347, 218775, 211441, 222400, 147214, 91057, 165203, 184369, 183825, 172547, 187858, 185044, 186998, 167118, 119494, 104119, 79860, -11127, -6210, 40719, -2581, -1318, 78103, 79152, 36129, 21309, 756, 27982, 68441, 81778, 18953, 15448, 44227, 3751, -22758, -31457, -71488, -87709, -73007, -94538, -57747, -47031, -65295, -85620, -42838, -27106, -25362, -33029, -19631, 801, -30193, -70514, -57789, -59793, -47806, -33397, -18248, -42164, -52654, 5371, 75940, 70521, -7015, -18911, 68056, 103490, 65196, 42902, 59712, 103552, 120700, 121437, 96733, 57699, 24857, -3774, -16991, -9385, -44900, 9424, 16271, 17590, 40989, 78837, 43407, 26817, 49915, 64678, 98128, 88893, 107910, 106198, 89554, 54444, 35878, 86874, 112266]
12251A12266k8253l1865o5846o1558L0568K055j6892J3544J0477O9232L080k5877
12239A0931p527J6063p6530k2054N7571Q251k2359P214L3608K327k4343m7086
12227f3934k91r615J6776J2365K1431M5387K0625P147M5838j3149p0978k43P3799
12214H5158N0082j4115l8526K7949L0143L476J7692l4244K7294K9594P220N5501
12202B47224J7159K9420K537K625K0354m12Q8896J31898J03890J56277K16202
12191A016070K37602K92760K79104K25602J96815K12740J19641j7305n1601j12863
12181B398565j85797k69503k98664k46729k35339k71845k01587j60192n9996l6124
12171D32789n6865l6063n5097k5680p8481n3180L2278j2537l1659K1912j5559
$$ y = [112266, 84013, 52148, -13698, -75256, -44688, -42633, -59525, -45981, -35504, 33728, 36808, 10931, 3404, 19467, -57063, -79117, -21546, -13295, -35654, -28440, 5168, 7495, -16848, -63934, -64225, -73840, -57064, -44699, -23268, 22119, 42744, 49891, 95729, 82580, 11602, 11359, 85158, 135240, 121125, 82599, 110548, 140691, 144167, 161859, 127615, 154909, 184503, 191723, 247224, 264383, 293803, 296340, 298965, 319319, 318907, 407803, 539701, 643591, 799868, 1016070, 1253672, 1546432, 1825536, 2051138, 2247953, 2460693, 2580334, 2563029, 2511428, 2398565, 2212768, 1943265, 1644601, 1397872, 1162533, 890688, 689101, 528909, 468913, 432789, 375924, 339861, 284764, 259084, 180603, 127423, 159701, 147164, 115505, 137417, 121858]
12160A21858J5371K9998k6073l0883j1299n2o3649n626J2309l2338l2983k2230
12148d5597L9714L1112o756J4339R471l4746n3810n395J5690M021L4817J02600
12136A05460M9052m1286n4328m9112n5626n3663J1129N6120J2906r302k626P403
12124b3873q999J6130O343L5053J0447j2737k1351Q125N847K5745J2540m5548
12112G722l0478j34L2640L6441m6941k7228M4410l964k5251o8737J2942k3753
12100i2331m6117O4225L9680k365j5370P086K7271O015r6078J5391Q7609O4126
12088E9142l3682l7444j8486L5370J7296q03R343K4291k4504q118K0460J4111
12076E6976p2816l6018K7917j6795j2509K3950N2538L9154k4788K5843P513n3848
$$ y = [121858, 137229, 167227, 141154, 110271, 98972, 98920, 35271, 29645, 41954, 9616, -23367, -45597, -5883, 25229, 18473, 32812, 42283, 7537, -46273, -51668, -35978, -31957, 2860, 105460, 154512, 113226, 58898, 9786, -45840, -99503, -88374, -32254, -19348, -28650, -31276, -23873, -32872, -16742, -10399, 24654, 35101, 22364, 1013, 9138, 14985, 40730, 53270, 7722, -22756, -22890, 9750, 46191, -750, -27978, 16432, 12468, -12783, -81520, -68578, -92331, -138448, -74223, -34543, -36908, -52278, -45192, -17921, -11906, -107984, -92593, -4984, 59142, 25460, -11984, -30470, 4900, 22196, 21393, 30736, 55027, 30523, 22405, 42865, 56976, -15840, -51858, -23941, -40736, -53245, -29295, 23243, 62397, 37609, 63452, 70965, 17117]
12064A7117O995j5346j52L2105q619j7654o6921k9320L9187O9082K6845k739O195
12051E6775j1419j839J7837l2103p1330J7447P1738M4550k5880M220J4865O919
12039I1780l8622J2787J1735n3306n8423l3121N4400M4936M6320r173n76j463
12027F7274n248n4108k352K8871k0531q008n8688O4532M5399j4814k7141K6968
12015D2154q284j4383L2032K608m6521K1J2791J0411L977N2598M9222l06k2470
12002A13850k4348o3336l175J0826l7615q3021m742P9980O9137K7005m726k3224
11990E6611N921K6603m739j309r0376m6422N5637K4224K719J4765J5142l5206
11978B3570l4532J6661O6484j4275k4140l6556J066l2516k6235q565O0903K2439
$$ y = [17117, 24112, 8766, 8614, 40719, 32100, 14446, -52475, -81795, -42608, 26474, 53319, 50580, 56775, 45356, 43517, 61354, 29251, -42079, -24632, 47106, 91656, 65776, 69996, 84861, 91780, 53158, 65945, 77680, 24374, -34049, -67170, -12770, 32166, 78486, 69313, 68737, 67274, 62026, 7918, 5566, 34437, 13906, 5898, -52790, 11742, 57141, 42327, 15186, 42154, 33870, 19487, 51519, 54127, 7606, 7627, 20418, 30829, 34806, 87404, 136626, 136320, 113850, 89502, 26166, 22991, 33817, -3798, -86819, -91561, -11581, 57556, 84561, 79835, 56611, 62532, 89135, 84396, 83087, -7289, -53711, 1926, 26150, 28869, 43634, 58776, 23570, -10962, 5699, 72183, 57908, 33768, -2788, -1722, -34238, -60473, -69038, -8135, 14304]
11966A4304j7030n161k510M4304l4946k1860N555J164p87K540k9624l7179o6379
11953a47609q170m842K4155P3593N3721j9517N3208L1890K0202k5972k9188j0462
11941A1009m2538l2487p767J5293K5968L9463j9564J6284J3202M0300j1725n346
11929D2092J7632M266R185j3952j600J0486r318J7126l4614M060P979K2754m5796
11916C0300J1722M0408k0683r7487j126O8343K7149r1669n4648N0177P1955k417
11904C2024l4742j6116L3649R534J8479M485K1732L1877K8151J6700K3773j0383
11892A59163j8028L875J15283P3262M6298o929Q422l2649P569J3644K7944P1759
11880D69613P4099L4678j8088j4859o4004q9973m1648K2218N804l0787o138k7362
$$ y = [14304, -2726, -7887, -10397, 33907, -1039, -22899, -17344, -16180, -16967, -14427, -44051, -81230, -147609, -155779, -160621, -136466, -62873, -9152, -28669, 24539, 56429, 76631, 50659, 21471, 11009, -31529, -64016, -71783, -56490, -30522, 8941, -10623, 5661, 18863, 59163, 47438, 42092, 59724, 63990, 73175, 59223, 57623, 68109, 58791, 75917, 41303, 45363, 53342, 76096, 30300, 42022, 82430, 61747, -35740, -36866, 31477, 58626, -33043, -87691, -37514, 34441, 32024, -2718, -18834, 14815, 24349, 42828, 47313, 69045, 100922, 129073, 145773, 169546, 159163, 141135, 145010, 260293, 333555, 379853, 372924, 381346, 348697, 356266, 369910, 397854, 469613, 543712, 578390, 560302, 545443, 481439, 391466, 349818, 372036, 377840, 347053, 340915, 313553]
11868C13553j9367P465K0359m9623m0205o9508J0240M64m3315l9144J4882o038
11856I9763M77J5977N9905N2014j344m1039J5556M8746J9008K2542P0451Q0139
11844D42195N1903L1692L8733M4712L7910J2769k7719n3091o7804m6499p172k8576
11832D29053n0331k3627L725J1514n1924q6891p5556m4840O0632j5223n5663k5257
11820G5612M4515N1501L6859j5411p2234j3677k2036P9611L7510n4963k2459O460
11808A31288R1104K3199n597J0281q352L5848O4313P3408j0796o552k4507R165
11796C82802K6389J04558M0576j9662r4474l077L5240l0785k7809j753q255l1300
11784C72450o5243q6838j725k7669o8839L709M7257J4055N1784k9760J8114k6913
$$ y = [313553, 294186, 301651, 322010, 272387, 232182, 162674, 172914, 173378, 130063, 90919, 105801, 99763, 100240, 116217, 176122, 228136, 226792, 185753, 201309, 250055, 269063, 291605, 362056, 442195, 494098, 525790, 564523, 609235, 647145, 659914, 632195, 579104, 511300, 464801, 457629, 429053, 378722, 355095, 358820, 370334, 318410, 231519, 155963, 111123, 171755, 156532, 100869, 75612, 120127, 171628, 208487, 193076, 120842, 107165, 85129, 164740, 202250, 147287, 124828, 131288, 222392, 245591, 239994, 250275, 241923, 277771, 342084, 415492, 404696, 398144, 373637, 382802, 409191, 513749, 554325, 534663, 440189, 437112, 472352, 441567, 413758, 412005, 403750, 372450, 307207, 220369, 218644, 190975, 122136, 125845, 173102, 187157, 238941, 209181, 227295, 200382]
11772B00382o1381o037J9679M1180j753m1305q977J06581R1472J216o94K4483
11760C64846M6533K9409O7579j0142Q286o451L7391j5770m0380l6546J9008o5501
11748C98262n1275q1769p2706K9510L6714n8607q5143k4688K3772N0098N511j6540
11736A53139J1252N520r474o4446M595N6613k6166N361l8095l0140J1656O7602
11724A47417L1950j7805O2867k8334l2052K2987m1702q9228l386M6191J0546n0271
11712E9180k2297k4600J1728O1655M6250m8894o8101O0286M7087M228k952l6793
11700H6777q719P413N444J2419M0822j4245l9861K9022m0819n751N682K4267J2244
11687A14695q382q8144k227L4355l0194K5153K6992K6845L0713j5157k9686l5828
$$ y = [200382, 139001, 132964, 152643, 193823, 192070, 150765, 141788, 248369, 339841, 341057, 340363, 364846, 411379, 440788, 508367, 498225, 506511, 500060, 537451, 521681, 481301, 444755, 463763, 398262, 346987, 265218, 192512, 222022, 258736, 200129, 114986, 90298, 114070, 164168, 169679, 153139, 164391, 169911, 160437, 95991, 100586, 157199, 131033, 136394, 98299, 68159, 79815, 147417, 179367, 161562, 224429, 196095, 164043, 187030, 145328, 56100, 52714, 98905, 109451, 59180, 36883, 12283, 24011, 85666, 131916, 83022, 14921, 75207, 122294, 126522, 123570, 86777, 78058, 85471, 90915, 103334, 144156, 129911, 90050, 119072, 78253, 72502, 78184, 102451, 114695, 106313, 18169, 15942, 50297, 20103, 45256, 72248, 99093, 129806, 114649, 84963, 49135]
11675D9135k2161k5165L9215M12J8700j7645K5881l5975l7491M2927j3255K9550
11663E4128M1285K6990L5710K5298o2661J2844k8598l2849j7986J0566J6260j8244
11651F2743M2026L744p556l1553l9425K2662K1280o403l0475j062l0152j5867
11639a0038O8905O2156J4012o0540m0841J8930l69J65R887N5130M1875j0685k5497
11626A23090K1890J2028J8856m8758k086k0174n6954j7833J3796J9140j2778n2377
11614b160O4078N3573m9216o1740K9321n265k7313K3963J4035k4721q101O4322
11602G0776N9954o974o9763L3046J8033O1583o388k6772j4774l664o0732l0860
11590B3465K1722N0067J2783P1118J4443l3813m6210L8489K8540J0514l34o1876
$$ y = [49135, 26974, 1809, 41024, 41436, 60136, 42491, 68372, 32397, -5094, 37833, 24578, 54128, 95413, 122403, 158113, 183411, 120750, 133594, 104996, 72147, 54161, 64727, 80987, 62743, 104769, 108513, 100957, 69404, 29979, 52641, 73921, 67518, 37043, 35981, 5829, -10038, 58867, 121023, 135035, 74495, 33654, 52584, 52215, 52380, 62267, 117397, 159272, 148587, 123090, 144980, 157008, 175864, 127106, 125020, 104846, 47892, 30059, 43855, 62995, 50217, -2160, 61918, 115491, 66275, 4535, 33856, 28591, 1278, 25241, 39276, 14555, 6454, 70776, 130730, 123756, 53993, 87039, 105072, 166655, 160267, 133495, 118721, 115057, 54325, 23465, 45187, 95254, 108037, 179155, 193598, 159785, 113575, 152064, 180604, 191118, 190784, 128908]
11578A28908K4994K2301k827j0987O6564M0411N288l9636r4911k6304R437Q190
11566A31428O3115K5261L981J5997O4220N9464J01128R3186N0907P5062N9422
11555G43171Q4058M0673J8235r302j08297j72513r0634m8987J3251R029n162K8830
11543E02352M3424l441J4095J3169J6254M639l4316M5342M0764q1959m5007P5439
11531E90755L3429m1539L109K2609P0054L9022P8387P7201M0309r350k4334n6343
11519H23309j03942m5311n1040p3798o1795j1304n4361k222M4906L5078L2235
11508E31755M4353P0487j5778j8097n5429k2995l3149M5694K0915l4278k7606
11497E05872J0281R0990R3361P2358J26639J05720P7285j8365o2851q7835j64004
$$ y = [128908, 153902, 176203, 173376, 162389, 228953, 269364, 274652, 235016, 140105, 113801, 123238, 131428, 194543, 219804, 223785, 239782, 304002, 363466, 464594, 557780, 608687, 683749, 743171, 827229, 867902, 886137, 876835, 768538, 596025, 505391, 456404, 469655, 478684, 473522, 502352, 545776, 542335, 556430, 569599, 585853, 590492, 556176, 601518, 642282, 560323, 515316, 590755, 624184, 582645, 585754, 608363, 678417, 717439, 795826, 873027, 913336, 903986, 879652, 823309, 719367, 674056, 623016, 549218, 487423, 476119, 421758, 419536, 464442, 499520, 531755, 576108, 646595, 630817, 612720, 557291, 534296, 501147, 546841, 567756, 533478, 505872, 516153, 607143, 700504, 772862, 899501, 1005221, 1082506, 1064141, 1001290, 913455, 749451]
11486G49451r8929k7644K0595q6977r6659k5511n7134j4815r502n3443p1967j6998
11474B10467l2849l5596L5516K1946l2477j9313o178N8828K4562l6296N487J001
11462A95098j5911J8985M8139m2017o0707j0491N6792j7932k6971j542k8795J0171
11450A24819J5302O363M7284N739k9775p5250l289P6402L2602j4597n223O010
11438A86387m7969M7479K0513l305l9565j8676K0791P313J2892J221l5027L0436
11426A82490j0323N0730K1811l0017n0244m299M0092L9568Q715j5531K601L3869
11414B69462N248k0912K821N409j0802N759l6360l4985k5160l1191J3267L7249
11402A79805J4308j7097j2719j5290K1602K0701j0543n5755K9168J3780m5899
$$ y = [749451, 650522, 622878, 643473, 556496, 459837, 434326, 377192, 362377, 352875, 299432, 227465, 210467, 177618, 142022, 177538, 199484, 167007, 147694, 141516, 200344, 224906, 188610, 194097, 195098, 179187, 198172, 246311, 204294, 143587, 133096, 189888, 171956, 144985, 143443, 114648, 124819, 140121, 146484, 193768, 199507, 169732, 94482, 91193, 167595, 200197, 185600, 180377, 186387, 138418, 185897, 206410, 203105, 163540, 144864, 165655, 172968, 185860, 187081, 152054, 182490, 172167, 222897, 244708, 214691, 164447, 160148, 200240, 239808, 248523, 232992, 235593, 269462, 274710, 253798, 256619, 262028, 251226, 256985, 220625, 185640, 160480, 129289, 142556, 179805, 194113, 177016, 164297, 149007, 170609, 191310, 180767, 125012, 154180, 167960, 122061]
11391A22061K0562O1274N0331k2687l6170P736l4665o696K0803L9806J475j755
11379B22075P203J9950k1018O924M0935k3999j4752l2020p880M8831J4594j0340
11367B50503J2107m113l5263k8261O0238M7631L1019n4200j8004J0454j5717K0794
11355B77188K2358J4542L4110M4453L1881m9056m8681k2056J1045j6984p2282
11344B26518k8916M6337m1199N22M1281L7307L5352J7882j2380m1112j3905n1389
11332B16298l9026J9631O8544J6041l4256Q902j5202L29r705L8512L8219M4312
11320C52599K332m528M603J9999J4543l4592j6405J0012o635P6762J1452k9706
11308D00436Q467l342L7720M2923k9363l9189j5672R1997N8504l8415k8064m197
$$ y = [122061, 142623, 203897, 254228, 231541, 195371, 203107, 168442, 161746, 182549, 222355, 223830, 222075, 229278, 249228, 228210, 235134, 276069, 252070, 237318, 205298, 197418, 246249, 260843, 250503, 262610, 258497, 223234, 194973, 255211, 302842, 333861, 279661, 261657, 272111, 256394, 277188, 299546, 314088, 348198, 392651, 424532, 375476, 326795, 304739, 315784, 298800, 226518, 197602, 243939, 202740, 203262, 244543, 281850, 317202, 335084, 322704, 281592, 267687, 216298, 177272, 196903, 265447, 281488, 247232, 256134, 240932, 241261, 231556, 270068, 308287, 352599, 354931, 350403, 355006, 375005, 389548, 354956, 338551, 348563, 341928, 418690, 430142, 400436, 408903, 405561, 443281, 486204, 456841, 417652, 401980, 493977, 552481, 514066, 486002, 481805]
11296D81805l486M6049L5182k1197O8386Q3713J4619L5002R5062J59043J47150
11285A141328J43667J60866J85535J77998R6003o699r0286j61089j53568j15320
11275A378435j52062o8568k9138M478j5260M6378K8846L2689Q6627M7148N6471
11264A416044M8143J0163l9739p1133o1098j00816l4284j711J9284N478P3214
11253A263545J40763J56483J62778J53702P6987l8994m436o9340j47311j41362
11243A552815j44310r5941m7999L9337M5733k7715Q037P5935N1274N298K623M161
11231A469248l5177p3391j06230j23522l9617J7677N9205o923N8229J06298P5561
11220A401358J12659J49725J46206Q7924k5606l9183p0739j99878j74711j37477
$$ y = [481805, 478319, 524368, 559550, 538353, 606739, 690452, 705071, 740073, 835135, 994178, 1141328, 1284995, 1445861, 1631396, 1809394, 1905397, 1898698, 1808412, 1647323, 1493755, 1378435, 1226373, 1157805, 1128667, 1133145, 1117885, 1164263, 1193109, 1225798, 1312425, 1359573, 1416044, 1464187, 1474350, 1434611, 1363478, 1302380, 1201564, 1167280, 1165569, 1184853, 1190331, 1263545, 1404308, 1560791, 1723569, 1877271, 1954258, 1915264, 1910828, 1841488, 1694177, 1552815, 1408505, 1312564, 1264565, 1303902, 1349635, 1321920, 1329957, 1405892, 1457166, 1462464, 1465087, 1469248, 1434071, 1360680, 1254450, 1130928, 1091311, 1108988, 1168193, 1161270, 1219499, 1325797, 1401358, 1514017, 1663742, 1809948, 1897872, 1872266, 1833083, 1762344, 1562466, 1387755, 1250278]
11210A250278j36161r6767j22870r5183j16571l1073P065K7725m7522j3792m7913
11199E77216J2230l5088n6258r918j1943j680L4956K8114P7364n6022n4334K5739
11187E30376K6141N5682l2447k274l6892l2101M1005l6460k1432L0068J0349o9713
11175D62302m80P4658L454q560k761J125m9164m0334l4513L9196n77n705J1427
11162D50068O8959m7329p4256R4319K6578p473K8807j1180L2428L4459p1046J907
11150E26241M4118k0749J4545k5329n2445P844O4638K643n3086m0809k0369L8514
11138D85756k2057L1412O5166R332m0639j7104k9308j3436L0087K6679q0088M2720
11126D88520M5646J2053N9842M5454n3346k7699n2152P3513l739l6910J3100k1109
$$ y = [1250278, 1114117, 1017350, 894480, 799297, 682726, 651653, 658718, 686443, 638921, 625129, 577216, 589446, 554358, 498100, 488182, 476239, 474559, 509515, 537629, 614993, 558971, 504637, 530376, 556517, 612199, 579752, 577478, 540586, 508485, 549490, 513030, 491598, 521666, 532015, 462302, 461822, 536480, 539934, 531374, 528613, 529738, 480574, 440240, 405727, 444923, 444346, 438641, 450068, 519027, 471698, 397442, 491761, 518339, 510866, 539673, 528493, 560921, 595380, 524334, 526241, 570359, 549610, 564155, 538826, 486381, 494225, 558863, 561506, 508420, 467611, 447242, 485756, 463699, 495111, 560277, 569609, 528970, 511866, 482558, 469122, 499209, 525888, 445800, 488520, 534166, 546219, 606061, 651515, 598169, 570470, 518318, 591831, 588092, 551182, 564282, 543173]
11114E43173m2831K6727k810K0170O521J4294M5726R073M7508N1567K8225K4617
11102G71960M7230L8664N3522K4600J9779J0390l892n9849j0405o2450o4963m0887
11090G23699N9647L6488q539k9870M189K4507M6813j8900j121Q414O9428k9579
11078H85176j8381L146L2424J2231N308l6242m1986J7476O9979Q2419N3912k3767
11066A041695l2243M0267J3555l5282n1490N5116l1080q371o710q570k7869p1134
11054H77884l2452M0589M446J270J7032O1692n401k1328j271L7778n0173l6698
11042H93368j5763M2162N6802K1366m442O6976Q9307k2840O275J6654K8924K470
11030A181259r681k754j7010m8094n0359j0733K8652P593J3537p5067k7396K5734
$$ y = [543173, 500342, 527069, 524259, 544429, 550950, 565244, 610970, 620043, 667551, 719118, 747343, 771960, 819190, 857854, 911376, 935976, 955755, 966145, 962253, 902404, 891999, 829549, 764586, 723699, 783346, 819834, 811295, 781425, 785614, 810121, 856934, 838034, 836913, 845327, 914755, 885176, 866795, 869941, 902365, 914596, 919904, 883662, 841676, 859152, 929131, 1011550, 1065462, 1041695, 1009452, 1049719, 1063274, 1027992, 976502, 1031618, 1000538, 992167, 985457, 976887, 949018, 877884, 845432, 886021, 890467, 891737, 908769, 970461, 965060, 943732, 942461, 980239, 930066, 893368, 877605, 919767, 976569, 997935, 993493, 1060469, 1149776, 1126936, 1133211, 1149865, 1178789, 1181259, 1171578, 1168824, 1151814, 1103720, 1053361, 1042628, 1071280, 1078873, 1092410, 1017343, 989947, 1015681]
11018A015681k379K6593N4473K7706M0526k8390j3001k8018N6804L5136O6177
11007A251308M61K7188j7572j9067p302j109O543N016Q404j631r169L0192L4988
10994A308250M7809R3192R0546J04927J71483J86968K03733J75292J21568P8862
10984B582630P2946k2342j00573j34258j75744j48239j04449j4201m4655m1138
10974A869977j9840J6484O5486L996O234J3050P05l9140l4424j9476l1857J5068
10962A846263J0635k8753m0699J1145M5670P0254L0077j0949P9692O0461L2721
10951B106517K932K5264L4703L3018K5697R482K5067P8366R1217P3976J16743
10940B622982J12496J35767J41671J53401J66742J30417J70276J73840Q4816o4649
$$ y = [1015681, 1013302, 1039895, 1094368, 1122074, 1162600, 1134210, 1121209, 1093191, 1149995, 1185131, 1251308, 1251769, 1278957, 1261385, 1242318, 1235016, 1233907, 1240450, 1245466, 1253870, 1252239, 1243070, 1273262, 1308250, 1356059, 1449251, 1539797, 1644724, 1816207, 2003175, 2206908, 2382200, 2503768, 2582630, 2655576, 2633234, 2532661, 2398403, 2222659, 2074420, 1969971, 1955770, 1911115, 1869977, 1850137, 1866621, 1932107, 1936103, 1942337, 1955387, 1956092, 1916952, 1882528, 1863052, 1831195, 1846263, 1856898, 1828145, 1787446, 1798591, 1844261, 1914515, 1944592, 1933643, 2013335, 2073796, 2106517, 2109449, 2134713, 2169416, 2202434, 2228131, 2237613, 2262680, 2341046, 2432263, 2506239, 2622982, 2735478, 2871245, 3012916, 3166317, 3333059, 3463476, 3633752, 3807592, 3892408, 3827759]
10930C827759o3619n4544n1338p1300p9725J2473O6983J466m2176j6802q472j1723
10918C508982K6775J13848Q9633J3635M8081j7463j3062M1328Q4808J43338J44167
10907D184070R6518Q5229N8090J04538O4870J0030O2064J63599J95051J36838
10897E160897Q4802J95045J88597J59224K27338L07282L40395K98360L12407L28167
10887G602514L00618K09962J70157J01184Q3784Q7380N8169J68352K12284J05145
10877I099549J65141K55102K73924L61905N13527N49467M93758O44111P40202
10868A3096686Q69156R18461J002183J124052J313617J416401J629688J884522
10860B3254766K232945K704905L178326L858096M922757O216350P950589J0351834
$$ y = [3827759, 3764140, 3709596, 3658258, 3586958, 3507233, 3519706, 3586689, 3588155, 3545979, 3529177, 3520705, 3508982, 3535757, 3649605, 3739238, 3752873, 3800954, 3783491, 3770429, 3811757, 3896565, 4039903, 4184070, 4280588, 4365817, 4423907, 4528445, 4593315, 4603345, 4665409, 4829008, 5024059, 5160897, 5245699, 5440744, 5629341, 5788565, 6015903, 6323185, 6663580, 6961940, 7274347, 7602514, 7903132, 8113094, 8283251, 8384435, 8468219, 8555599, 8613768, 8782120, 8994404, 9099549, 9264690, 9519792, 9793716, 10155621, 10669148, 11218615, 11712373, 12356484, 13096686, 13965842, 14884303, 15886486, 17010538, 18324155, 19740556, 21370244, 23254766, 25487711, 28192616, 31370942, 35229038, 40151795, 46368145, 54318734, 64670568]
10852F4670568J3706077J8172932K3990958L0933628L7825363M2416303M0956220
10845B72672049L1050689J3687453p266082k5116417l3646520l3842787k9961691
10838A87576694k4263566j7815972j1267113m747465J611048P322575J1959406
10831A50375607J4747458J4716790J1882674O874783N52571n496127j0204993
10824A83448763j2928921j2922897j0216925n494676K85627O560644J2810356
10817A61541971J8715405K3807500K7282198K7856499K4215424J5716080L184587
10810C02319664j0479624k1628462k7656166k8337497k4809403j9045511j2634060
10803A57728941o164552J37947N652116R602634J1295789J0296953O916647J662038
$$ y = [64670568, 78376645, 96549577, 120540535, 151474163, 189299526, 231715829, 272672049, 303722738, 317410191, 310144109, 285027692, 251381172, 217538385, 187576694, 163313128, 145497156, 134230043, 129482578, 131093626, 138416201, 150375607, 165123065, 179839855, 191722529, 198597312, 199149883, 193653756, 183448763, 170519842, 157596945, 147380020, 141885344, 142170971, 148731615, 161541971, 180257376, 204064876, 231347074, 259203573, 283418997, 299135077, 302319664, 291840040, 270211578, 242555412, 214217915, 189408512, 170363001, 157728941, 151564389, 151702336, 157354452, 166957086, 178252875, 188549828, 195466475, 197128513]
10795A97128513m406367r776401j3801056j5766650j4816686j1181207n994617
10788A21385529k1589N968814J1939186J7897079K3747038K8802194L1840666
10781B41558917L0660938K2735352P814627j1014468k8901058m0144125m1283813
10774A81426370l5602375k8100017k1310488j6002284j2027676r161261p261673
10767E1960596n952080m957849m183887l577797l022008k583646k281761j958086
10759B3443482j799736j496059j226428j158496j007273q00758o90189n78967
10751A4685576m95300m13702l21854k27752j63097j77104k73560m06271n30484
10742A1676452n55516n23632m77610l59636k71347k48503k69795k55212k55187
$$ y = [197128513, 192722146, 182945745, 169144689, 153378039, 138561353, 127380146, 121385529, 121363940, 127332754, 139271940, 157169019, 180916057, 209718251, 241558917, 272219855, 294955207, 302769834, 291755366, 262854308, 222710183, 181426370, 145823995, 117723978, 96413490, 80411206, 68383530, 59222269, 51960596, 46008516, 41050667, 36866780, 33288983, 30266975, 27683329, 25401568, 23443482, 21643746, 20147687, 18921259, 17762763, 16755490, 15954732, 15264543, 14685576, 14190276, 13776574, 13454720, 13226968, 13063871, 12886767, 12613207, 12206936, 11676452, 11120936, 10597304, 10119694, 9760058, 9488711, 9240208, 8970413, 8715201, 8460014]
10733H460014k27140k20285j77201j63632j46240k06089j54595j25138j55081
10724F884613j70161k24033j77992j06949j7056R907J4153j2418N2098M7956j9598
10713F280520K2273l5471j20946j67891k10968k54091k14197j75558j17653q5739
10703D920279m9242j6259l1762n4654j43719j56657p1443j38941j83851j33623
10693C940128p0659j06864r0423o9449n0508l8941Q348R6420J40362J51074J11120
10682D020608J50708J41040P9965l2088j48648k96708l29866k60703j61175j11291
10672C051842r8191p9904j85624j73674j66087j97393j97423k32111j59307m3565
10662A518563j8860o944j92n8107p7769n3791n2170m6429j9905Q350R313k7022
$$ y = [8460014, 8232874, 8012589, 7835388, 7671756, 7525516, 7319427, 7164832, 7039694, 6884613, 6714452, 6490419, 6312427, 6205478, 6188422, 6198329, 6212482, 6200064, 6252162, 6300118, 6280520, 6302793, 6267322, 6146376, 5978485, 5767517, 5513426, 5299229, 5123671, 5006018, 4920279, 4871037, 4854778, 4823016, 4768362, 4624643, 4467986, 4396543, 4257602, 4073751, 3940128, 3869469, 3762605, 3672182, 3602733, 3552225, 3513284, 3521632, 3618052, 3758414, 3909488, 4020608, 4171316, 4312356, 4392321, 4360233, 4211585, 3914877, 3585011, 3324308, 3163133, 3051842, 2953651, 2873747, 2688123, 2514449, 2348362, 2150969, 1953546, 1721435, 1562128, 1518563, 1499703, 1492759, 1492567, 1434460, 1356691, 1302900, 1250730, 1204301, 1184396, 1192746, 1202059, 1175037]
10650A175037o94L71j1589J614m822O1010O4910J01996O1414Q4898N8274K5827
10638A618246J9646n7922o4924j35793j30957p3889p0121j18449q1108n74p6671
10627H27484m4535K3438p3344m8244n2977n9082q9718p496J5589K8730k6154m0499
10615D53192j2615l972J9154j5513L884l4710r5548K9264J8863j452m2172J4752
10603C33127N630o1650q689L4081m260k0159K9253L9641j4029l068n1871j8190
10591B59816o561j6334M367k2543j4083L6550k705J8225K731l412M982l5799q4504
10578A40730k1603N3010K2564L4098J7756k0522l215l1021k9236J6166R728J5016
10566B03471Q0731N6327l1520l5180J3833k2097q646k2553l5601l6027q726j757
$$ y = [1175037, 1174343, 1174714, 1163125, 1164739, 1159917, 1220927, 1285837, 1387833, 1449247, 1534145, 1592419, 1618246, 1637892, 1579970, 1515046, 1379253, 1248296, 1174407, 1104286, 985837, 904729, 904155, 827484, 782949, 806387, 733043, 684799, 631822, 572740, 483022, 475526, 491115, 519845, 493691, 453192, 440577, 436605, 455759, 440246, 444130, 409420, 313872, 343136, 361999, 360547, 318375, 333127, 338757, 277107, 268418, 302499, 298239, 278080, 307333, 346974, 332945, 329877, 278006, 259816, 253255, 236921, 241288, 218745, 204662, 241212, 238507, 256732, 259463, 256051, 261033, 225234, 140730, 119127, 172137, 194701, 228799, 246555, 226033, 222818, 191797, 162561, 178727, 188455, 203471, 284202, 340529, 309009, 273829, 287662, 265565, 256919, 234366, 198765, 162738, 154012, 152255]
10554A52255m3289J817N2376k6986q00O1785L5038l8284p0176K4670l26O002j2943
10541A41139n1722Q331j192K3856k3930j0347l101n0298r303j8131L814l0940
10529b1824L9127Q2459L1550m0282m6185j687K133N2687L4202k0596p739L8038
10517A41883J6881k1633j6552k7482L0252M597j0934K3560N6973j9432l0593j6030
10505A31490P2718J04417N2397L2239m05n1058L284l950o3197l659K3135l2463
10493B64948j9374o4373o894o94l2664m4609j93M0135L6492k1716j6851L2237
10481A66444L3642l71k7117k6742k5137m827k0328k886N369K1163K6128j0649
10469A34689O146k8254J6313J7926M9746J20568M4141M8078k4527m9999P193P3315
$$ y = [152255, 108966, 110783, 163159, 136173, 135373, 197158, 232196, 193912, 123736, 148406, 148080, 154082, 141139, 89417, 97748, 96556, 120412, 96482, 86135, 83034, 32736, 23433, 5302, 9116, -21824, 17303, 99762, 131312, 91030, 44845, 43158, 45291, 97978, 132180, 111584, 103845, 141883, 158764, 137131, 120579, 93097, 123349, 127946, 117012, 140572, 197545, 178113, 147520, 131490, 204208, 308625, 361022, 393261, 392856, 341798, 345082, 341132, 277935, 274276, 297411, 264948, 245574, 181201, 174307, 173613, 140949, 96340, 96147, 136282, 172774, 151058, 134207, 166444, 200086, 199715, 172598, 145856, 120719, 115892, 95564, 92678, 98047, 119210, 145338, 134689, 140835, 112581, 128894, 146820, 196566, 317134, 361275, 409353, 384826, 334827, 342020, 415335]
10457D15335K0191l32k7456J2050K0599N388j9666j2835n7502j09343L3765Q1927
10445C62121L630l2001k3298l4649m0908q483K7935K3081k6389p2442l8161J7695
10433A58131L0672L0331L806l9394k9579K9596J8565K1945J7541J9747k1864l1962
10421B07535K3241M0944M9566j4634l3056M4587J9248J05628P6555M7222k0703
10410E46133k4997J56056K31937J29257J91827J32892J78302J78550J06060P0830
10400A896847o6718r7239j60184k21642j32674j23800o8716q6430l0480J7008
10390I25972M9144J01107R3119L579L4245N7260l3703q6139n5595p8959p4229
10379I35801k1043j6970N9017O0438J8572R5774J62771J00125R9616J08360L1941
$$ y = [415335, 435526, 435194, 407738, 419788, 440387, 445775, 426109, 413274, 355772, 246429, 280194, 362121, 365751, 333750, 310452, 275803, 234895, 226412, 254347, 277428, 251039, 178597, 140436, 158131, 188803, 219134, 222940, 183546, 153967, 183563, 202128, 224073, 241614, 261361, 239497, 207535, 230776, 271720, 321286, 306652, 273596, 318183, 337431, 443059, 519614, 566836, 546133, 521136, 677192, 909129, 1038386, 1230213, 1363105, 1541407, 1719957, 1826017, 1896847, 1830129, 1732890, 1572706, 1351064, 1218390, 1094590, 1025874, 939444, 908964, 925972, 975116, 1076223, 1169342, 1172921, 1207166, 1264426, 1230723, 1144584, 1088989, 1010030, 935801, 914758, 897788, 956805, 1017243, 1035815, 1131589, 1294360, 1394485, 1494101, 1602461, 1634402]
10368A634402m7389r4566j27349q3143j12096j37370n4119l888J3540L3069j145
10357A019946l1382L8277Q2974l6803k2992n8054k7784o3529r5910q6458n3246
10346F65039j0838O5472N1055L7376J14876J08848Q7291K10073K25123Q6953N098
10335A646366j30204j94192j60389j92932j52219j06849j52445j30432j03603
10326C23101j3266R684m1598m4224l6123p0231k3404j973P1790J9835k1666K4533
10314A96458k8089m2451l463K3644J1464J7085K6893k0167m4713m1916L0174L0754
10302A55673j3023j4266L4617Q991l1791n1830M282K7581p2957n7098j8188N7277
10290B9268Q4452K5743q1380k6316r694P839j6371L2919N3013J4698M1327m6770
$$ y = [1634402, 1587013, 1492447, 1365098, 1281955, 1169859, 1032489, 978370, 974482, 988022, 1021091, 1019946, 988564, 1026841, 1109815, 1073012, 1050020, 991966, 964182, 900653, 804743, 718285, 665039, 654201, 719673, 770728, 808104, 922980, 1031828, 1119119, 1329192, 1554315, 1641268, 1646366, 1516162, 1321970, 1161581, 968649, 816430, 709581, 557136, 426704, 323101, 309835, 319519, 277921, 233697, 197574, 127343, 103939, 101966, 173756, 193591, 171925, 196458, 168369, 125918, 122455, 146099, 157563, 174648, 201541, 181374, 136661, 94745, 124919, 155673, 142650, 128384, 163001, 171992, 140201, 88371, 92653, 120234, 47277, -9821, -28009, 29268, 113720, 139463, 58083, 31767, 22073, 29912, 13541, 46460, 99473, 114171, 155498, 108728]
10278A08728m8797l207N5169K295J2040j4708p584o344j4252j8646L1523K4976
10266A21193o6586j0432n2124P502N0362K3515q443J4153j9971O779q724k7471
10254B9753J1677n4433K0970O5993L6017m9171m762P872K4310L6991K3486m3409
10242A05294k3588r765j8100M1765j6416m7997K1807M1779k0600n5469L6159N9577
10230A14446N126M400k9651o7530m284L78J5930j6536L3798N0426K8621K8895
10218A64019N61K6864n9956q1499L9275P7502J0055r970j4654q0310m3624K8142
10206E6405Q9065n506k2450L6687r03k2229j4854j8107m2071J4082Q9412O2825
10194B22356R6887P0302L4224O3340J58966J36955J13457J27246O2583j3852m4793
$$ y = [108728, 59931, 56724, 111893, 114188, 126228, 111520, 103936, 97592, 83340, 64694, 96217, 121193, 54607, 44175, -7949, -447, 49915, 73430, 64987, 79140, 59169, 65948, 57224, 29753, 41430, -13003, 7967, 73960, 109977, 60806, 56044, 63916, 88226, 125217, 148703, 105294, 81706, 71941, 53841, 95606, 79190, 31193, 53000, 94779, 74179, 18710, 54869, 114446, 119572, 123972, 94321, 26791, 22507, 22885, 38815, 22279, 56077, 106503, 135124, 164019, 164580, 191444, 131488, 49989, 89264, 166766, 176821, 166851, 152197, 71887, 28263, 56405, 145470, 139964, 117514, 154201, 153298, 131069, 116215, 98108, 56037, 70119, 159531, 222356, 319243, 389545, 423769, 487109, 646075, 783030, 896487, 1023733, 1086316, 1072464, 1027671]
10183A027671j7280o7569j92129j06961r5242j13261r4955m3641J4738L5639M4999
10172C92009J03532J37361R9853P8937O5874R3813Q7367N5438o787j7733j05626
10161I84038k11656j03592k2626j22644j07652p3415m8032j6587k4605n672l2040
10150B15517l8693k8129N749j2281k5655j280n491o071M4220M1994L2987J460
10138B24327o1905J559M1606Q753M240m551l8302o1723J2492K7623M6607K9806
10126B30532K5105J4946j7663k3181j007Q20M1684N8012k8929K0864K9203j5214
10114C35172k5884N67N5992J455K9545P6935J1723K9335Q0383J694K3810J3377
10102F34104N423n645j7271m2883q3197p5799j7619M048R826m6689k4620o9381
$$ y = [1027671, 1010391, 942822, 750693, 643732, 548490, 435229, 340274, 296633, 311371, 347010, 392009, 495541, 632902, 732755, 811692, 877566, 971379, 1058746, 1114184, 1107397, 1089664, 984038, 772382, 668790, 646164, 523520, 415868, 342453, 294421, 277834, 253229, 247557, 215517, 176824, 148695, 154444, 142163, 116508, 115228, 109737, 103666, 147886, 189880, 222867, 224327, 162422, 163981, 205587, 214340, 218580, 214029, 175727, 114004, 126496, 154119, 200726, 230532, 255637, 270583, 252920, 229739, 228732, 229552, 271236, 329248, 300319, 321183, 350386, 335172, 309288, 309855, 365847, 367302, 396847, 473782, 485505, 514840, 595223, 596917, 620727, 634104, 639527, 633882, 616611, 573728, 490531, 414732, 397113, 401161, 410987, 364298, 339678, 270297]
10090B70297m7800j8280P2k0441J8193k018K2055K4411n0755K5965M7358l1929
10078B37128m1391m0215L9139K775l9747Q3051N4441K7547J9846J73L6562J4145
10066C93454K1856N731l886l905M9717m150O3637J3872m1506J5331L9064M3197
10054E92412j0450m6513K6906q9074o6273L1596J0897o2502l8036j3668J8019
10043C53314J5053K8157K2238J2202L2671O9744J43313J06872J05459J77489K72009
10032A338521M33323O85318J079955J591424J685071R47949J39569j285161k205625
10023D410344j489441q24559m77345l17245k17684j28897j31882p1349K0518j9935
10013G52525l337o6375k291K0588M9346L6852j9401J5009o3264L210J7165j09353
$$ y = [270297, 222497, 204217, 204289, 183848, 202041, 200023, 222078, 246489, 195734, 221699, 269057, 237128, 195737, 155522, 194661, 197436, 157689, 240740, 295181, 322728, 342574, 342747, 379309, 393454, 415310, 421041, 417155, 413250, 462967, 458817, 522454, 536326, 494820, 510151, 549215, 592412, 581962, 535449, 562355, 473281, 407008, 438604, 449501, 386999, 348963, 335295, 353314, 368367, 396524, 418762, 430964, 463635, 533379, 676692, 783564, 889023, 1066512, 1338521, 1771844, 2457162, 3537117, 5128541, 6813612, 7761561, 7901130, 6615969, 4410344, 2920903, 2096344, 1618999, 1301754, 1084070, 955173, 823291, 751942, 772460, 752525, 749188, 682813, 680522, 701110, 750456, 787308, 767907, 782916, 719652, 722862, 740027, 630674]
10001F30674r3498P4768K5643j9267l4866q5901o5409n8572k3090Q062l3669n3566
9989B71309o1211j1654O7524Q2082n9554n1440N582M8663j0049l4675j8363l2924
9977A95290N7480P0252J1206L6245N7866k1283o3542p816M2827J3310M0868k7495
9965D05208j9160p575J428O2483N9972L7787J5912q3936R606K6229p278n3229
9953D47447k0708j4288l5997m5099N4153J3941k4405j9614r1965k0822k4226N6617
9941B75034M6440P3501J13456P3228O7394Q2293J51013R7796l2923r9951n5838
9930G91443J0042J27732J90171K11085J72507R0008j32306k47058k49792j43871
9920H19961m0058N3103L0273R29j8765m8267o6310j10489q4545j04072r1686L1956
$$ y = [630674, 537176, 611944, 637587, 618320, 583454, 497553, 432144, 373572, 350482, 358544, 324875, 271309, 210098, 198444, 265968, 348050, 288496, 237056, 242638, 291301, 281252, 246577, 228214, 195290, 252770, 323022, 334228, 370473, 428339, 407056, 343514, 335698, 378525, 391835, 432703, 405208, 386048, 378473, 379901, 442384, 502356, 540143, 556055, 472119, 481725, 507954, 500676, 447447, 426739, 412451, 376454, 331355, 385508, 399449, 375044, 355430, 263465, 242643, 218417, 275034, 321474, 394975, 508431, 581659, 649053, 731346, 882359, 980155, 947232, 847281, 791443, 801485, 929217, 1119388, 1330473, 1502980, 1592988, 1460682, 1213624, 963832, 819961, 779903, 833006, 863279, 864208, 845443, 797176, 730866, 620377, 535832, 431760, 340074, 372030]
9908C72030K6274m4721j6662L0820k5779o6403j3490O2002M3586j0159L4100N4430
9896D46028r145m8913k1133J9805K7562J288R768m6528m6396J9879k8056m0320
9884B83839m354P454m2089l8617j2182N9173N2539K88q709j7710l672j5203J5702
9871B76459O087L1505K3235J6337k4528N2695k7655n9928M735K1790j3386K0508
9859C27854l6455J0789o345M3818J9267K8857N5808j3343j44712m5951L9571Q1557
9847C60715P6274P5550J1830L3766L1656N7325J13659J86624J66462J97700O8540
9836A380101p7643j32418k19119j49487j41052r4931j15741L74j8438j9509J2004
9825D24141J7002K2340l9817l1963K9647P290P5846O4710O7984J02276O9252L8936
$$ y = [372030, 398304, 353583, 336921, 367741, 341962, 275559, 262069, 324071, 367657, 357498, 391598, 446028, 436883, 387970, 366837, 386642, 414204, 415492, 425260, 378732, 332336, 352215, 324159, 283839, 279485, 286939, 244850, 206233, 194051, 253224, 305763, 306051, 297342, 279632, 275960, 260757, 276459, 282546, 314051, 337286, 353623, 329095, 381790, 354135, 294207, 298942, 320732, 307346, 327854, 291399, 302188, 295843, 339661, 358928, 387785, 443593, 430250, 285538, 239587, 279158, 360715, 436989, 512539, 524369, 558135, 589791, 647116, 760775, 947399, 1113861, 1311561, 1380101, 1302458, 1170040, 950921, 801434, 660382, 565451, 449710, 450084, 431646, 412137, 424141, 441143, 463483, 423666, 391703, 421350, 428640, 504486, 569196, 637180, 739456, 808708, 847644]
9813H47644L3443K0254L6309J8100l5274K08q2137j32340p3065n6820r0489r6946
9801C88887l5931l2412K2596q572n8992p798m7700m8055O1043P460M643L0383
9789B75552J9461L3256p87k7909n386L7473K0497k4881m9566k157J0523Q941J2482
9776C07499J1009p9495k4126M7904L0537K5049k1314K538P055L1873r64q1665
9764B55900j3976K5317J2683o834N3133j1493k5795M8180p392J71n573M6912J8794
9751C90027m730J5559j618L5670j6246j0170N97L020N455j1879L7197q6562q0883
9738B75437K4295L9729K6169j3776r799J1250M3119Q919M5019R874L4763R0530
9726E85529R6559L1064J3987o958q5769j31764o5547m8370J3564L7155l2423o2650
$$ y = [847644, 881087, 901341, 937650, 955750, 920476, 920684, 838547, 706207, 633142, 576322, 485833, 388887, 352956, 320544, 343140, 334568, 275576, 267778, 220078, 172023, 233066, 240526, 245169, 275552, 295013, 328269, 327482, 299573, 294187, 331660, 352157, 327276, 277710, 275553, 286076, 295017, 307499, 318508, 239013, 214887, 262791, 293328, 318377, 297063, 299601, 306656, 338529, 337565, 255900, 241924, 267241, 279924, 273090, 326223, 314730, 288935, 337115, 329723, 329894, 324321, 371233, 390027, 385297, 400856, 399238, 434908, 418662, 408492, 409089, 412109, 417564, 405685, 442882, 356320, 275437, 299732, 339461, 365630, 351854, 342055, 353305, 396424, 405343, 450362, 460236, 494999, 585529, 682088, 713152, 727139, 720181, 634412, 502648, 437101, 388731, 402295, 439450, 407027, 344377]
9714C44377Q939P5926L5341n2003K0319K5973L75j3174J6077o0210m0505J1405
9702C72840N8710k060J2252J4601l7278o8832K4987O738r540p4630N3871J1738
9690C63397k7486P409K4875M4078K8724k0071n2873m9814L275P0853M5841K0257
9678D58465n3053j4124m858o897p285L876J355K2969j9342K8629j595k3297j3209
9665C71634k8474N4008P1332n362o161m2731p389M9963M7857Q2111j6412N182
9653E75558j1408j6579j8467K0962K340j4726N4230J20330J75630J62856J60387
9642A211113K04489K13704J14821J15493J18582P7327k653j86974j57824j48117
9632A559961j63732j78233k07857j71927o1189q8258n2778j6691n5475r4494k8676
$$ y = [344377, 353316, 429242, 464583, 412580, 432899, 458872, 459247, 446073, 462150, 401940, 361435, 372840, 431550, 429490, 441742, 456343, 419065, 350233, 375220, 381958, 372418, 297788, 351659, 363397, 335911, 343320, 368195, 412273, 440997, 420926, 368053, 318239, 321514, 392367, 438208, 458465, 405412, 391288, 386430, 379533, 372248, 376124, 377479, 400448, 381106, 409735, 408140, 384843, 371634, 343160, 397168, 468500, 463138, 456977, 414246, 406857, 456820, 504677, 586788, 570376, 575558, 564150, 547571, 529104, 550066, 552406, 537680, 591910, 712240, 887870, 1050726, 1211113, 1415602, 1629306, 1744127, 1859620, 1978202, 2055529, 2052876, 1865902, 1708078, 1559961, 1396229, 1217996, 1010139, 838212, 777023, 688765, 635987, 619296, 563821, 469327, 440651]
9621D40651O6234Q736M575N004j2745K9857j4391l6498k1818m5784r257L4656
9609D49220L1894k8751q553k1169K4900M8112J3221j476l9552k957N7709j1972
9597E10626m5985o091p32K0175J2408L7329K7497N87J5326N3805K0230k6258J989
9584F20906K1900L2311J1765k8196n3549k2442k1281j7432o460n752J5182m804
9572E42148l6915j1887K3050M272J0073l1048Q463j847n2341P638Q395L880j3093
9559D60788j5499P869m400M893o605M8715L7419J4659o5723k566j5052K8717K3709
9546E16924J5397M1019L8960k7304o6337n5460J4357l4P0881k2407m3108k4884
9534D58004N3100O5688q684j0708N0066R551J0953l0780R1088N4701l1885q0038
$$ y = [440651, 506885, 515621, 520196, 525200, 512455, 542312, 527921, 491423, 469605, 423821, 414564, 449220, 481114, 452363, 443810, 422641, 447541, 495653, 508874, 507398, 467846, 464889, 522598, 510626, 464641, 458550, 457818, 477993, 490401, 527730, 555227, 555814, 571140, 624945, 645175, 618917, 620906, 642806, 675117, 686882, 658686, 605137, 582695, 561414, 543982, 537522, 531770, 546952, 542148, 505233, 493346, 516396, 520668, 530741, 499693, 508156, 506309, 453968, 461606, 470001, 473881, 460788, 445289, 453158, 448758, 453651, 447046, 495761, 533180, 547839, 482116, 479550, 464498, 493215, 516924, 532321, 573340, 612300, 584996, 518659, 463199, 477556, 477522, 548403, 525996, 482888, 458004, 511104, 576792, 568108, 557400, 607466, 617017, 627970, 597190, 688278, 742979, 711094, 631056]
9522F31056p7265J263Q0485Q914O484l8640k5341K6439L2195k142p789k5995J4771
9509F24435k6635P32N1923k0057k7539K884p795k5242K7881Q448J4967M2845l191
9496F63656k0537K5797K329q314M3138N0303k0100l9235J7037M9597m5807j3564
9484G04300O1223n1339n4025j4266M0359k6913O8786K0725j1557m6146k5645o5153
9472F00349j2902M913j5033K9216N7000K0368J9414m4474J0158M644Q863M251
9460F86767L3047L1082J274j0329k6707p5204n1808o4502N0745O7607K6461K428
9448F70861j277N4320M1804l5591j2371j6131k5654j7646p935P4912L2374j1032
9436G46634m6768K9774N4695o6409K0125J1602L9210M2794k7042Q289k8879k6974
$$ y = [631056, 553791, 555054, 635539, 644453, 650937, 612297, 586956, 613395, 645590, 643448, 635659, 609664, 624435, 597800, 598532, 650455, 630398, 602859, 605743, 597948, 572706, 600587, 609035, 624002, 666847, 663656, 643119, 668916, 671245, 662931, 706069, 756372, 736272, 697037, 714074, 763671, 717864, 704300, 765523, 714184, 660159, 645893, 686252, 659339, 728125, 748850, 737293, 691147, 665502, 600349, 587447, 592360, 577327, 606543, 663543, 683911, 703325, 658851, 669009, 673653, 682516, 686767, 719814, 750896, 752170, 741841, 715134, 639930, 588122, 523620, 574365, 641972, 668433, 670861, 669584, 723904, 765708, 730117, 717746, 701615, 675961, 658315, 650380, 725292, 757666, 746634, 699866, 729640, 784335, 717926, 738051, 749653, 788863, 831657, 804615, 812904, 784025, 757051]
9424G57051J9129J3502j1246k0498L1980o521N4377j9562o1386m581l3150J5661
9412G34756M3326P1748J5611q488j2523j1517l1965L517j032O554Q102j1316j4923
9399G91850R717K0907M2634j7100K7629J00849M4320j7879o557j7115L998Q312
9387I91565K2637R009p3729p4481j9947k9405J9560Q1570j9886O134K4244K2184
9375I59455K041m6192j5062L2528L9114Q713M1183j6330Q325k5735p3327k8053
9363H86660L1088O2606k9171n204M1407L8407L380o660m2397R262L5384J6080
9351A040842l2895K4471L4386j3144L7518J9999k3639m0208K234k3222N928M27
9339A032697K1750m8386J3210K0245q655K4232N1318L8344k8108k0568L155J01165
$$ y = [757051, 776180, 789682, 778436, 757938, 789918, 783397, 837774, 818212, 756826, 752245, 719095, 734756, 778082, 849830, 865441, 856953, 844430, 832913, 800948, 804465, 803433, 809987, 818089, 806773, 791850, 801567, 822474, 865108, 848008, 875637, 976486, 1020806, 1002927, 996370, 979255, 983253, 991565, 1014202, 1023211, 949482, 875001, 855054, 825649, 845209, 926779, 906893, 913027, 937271, 959455, 961496, 915304, 900242, 932770, 971884, 980597, 1021780, 1005450, 1013775, 988040, 914713, 886660, 917748, 980354, 951183, 945979, 987386, 1025793, 1029173, 1022513, 980116, 989378, 1024762, 1040842, 1007947, 1032418, 1066804, 1053660, 1091178, 1111177, 1087538, 1047330, 1049564, 1026342, 1032270, 1032697, 1054447, 1006061, 1019271, 1039516, 1030861, 1055093, 1106411, 1144755, 1116647, 1096079, 1099234, 1200399]
9327A200399K4546J243l3816k2717N716J414J7692J4543K1410L9342j5753J4833
9315A268852O428n8538k9896R51k7834j782K5481k7475J3914M0968k5070L4930
9303A220929K7428j7555p956K1993m1050k3168K7099R831m5404L9885K7700k6790
9291A212942j6249P7605J0967n5431l6356J5881M1572Q0441P339k7065J975K188
9279A315809m237k1898L2920N1298j0331k0529jl5885J1461K1012L9443L4115
9267A413177M3034j905q837n6034p848O7579J4097n328P129J0312N3685N0995
9255A580056N5035j787o9713r567k503P0731L2730k4281m5003K1202k374M3992
9243A648518R9939j526l3625k0006n4673j6019q304n4061M5657O9299l413j3043
$$ y = [1200399, 1224945, 1226188, 1192372, 1169655, 1175371, 1176785, 1194477, 1209020, 1230430, 1269772, 1254019, 1268852, 1275280, 1216742, 1186846, 1187797, 1159963, 1158181, 1183662, 1156187, 1170101, 1211069, 1185999, 1220929, 1248357, 1230802, 1222846, 1244839, 1203789, 1180621, 1207720, 1217551, 1172147, 1212032, 1239732, 1212942, 1196693, 1274298, 1285265, 1229834, 1193478, 1209359, 1250931, 1331372, 1338711, 1311646, 1313621, 1315809, 1311572, 1289674, 1322594, 1373892, 1363561, 1343032, 1343031, 1307146, 1318607, 1339619, 1379062, 1413177, 1456211, 1454306, 1445469, 1389435, 1381587, 1449166, 1463263, 1457935, 1465064, 1475376, 1529061, 1580056, 1635091, 1633304, 1563591, 1554024, 1551521, 1622252, 1654982, 1630701, 1585698, 1606900, 1604526, 1648518, 1748457, 1746931, 1713306, 1693300, 1638627, 1622608, 1614304, 1560243, 1605900, 1675199, 1671786, 1658743]
9231A658743J1021N9097M9827K0973m6636j4420J5877N6204m3329l5957L0985
9220A762385L8138k825K4446k0643J752L4608n576L4077K6711J1918J9160K1649
9208A945800P5217K3497j8220m609L8511Q764o9902J9497P8316L2439L0674m2696
9196B117288l7550O153K9567j9680O8412J3939j7237j8705L5737L3607L8057N2832
9184B302420l0728l4284L4812m460L5054N5589j3697k023K6401J9493J7420L1672
9172B437669P8309R6002Q8958K7034R0550J28462N9484k8755J0501l2079m093
9161B952042O553n6982o7379M870o0538o7662j0687L2670K5173n25m4486r738
9149B703311L839j5584K612J7840O4145L5789N4197K3323j497J3409q896K1121
$$ y = [1658743, 1669764, 1728861, 1778688, 1799661, 1753025, 1738605, 1754482, 1810686, 1767357, 1731400, 1762385, 1800523, 1797698, 1822144, 1801501, 1803253, 1837861, 1832285, 1866362, 1893073, 1904991, 1924151, 1945800, 2021017, 2044514, 2026294, 2021685, 2060196, 2068960, 1999058, 2018555, 2096871, 2129310, 2159984, 2117288, 2079738, 2085891, 2115458, 2095778, 2164190, 2178129, 2160892, 2142187, 2177924, 2211531, 2249588, 2302420, 2271692, 2237408, 2272220, 2267760, 2302814, 2358403, 2344706, 2342683, 2369084, 2388577, 2405997, 2437669, 2515978, 2611980, 2700938, 2727972, 2818522, 2946984, 3006468, 2977713, 2988214, 2956135, 2952042, 2958595, 2901613, 2834234, 2839104, 2778566, 2710904, 2700217, 2732887, 2758060, 2757535, 2713049, 2703311, 2707150, 2691566, 2694178, 2712018, 2776163, 2811952, 2866149, 2889472, 2887975, 2901384, 2892488, 2913609]
9137B913609M9728J4474J01841Q7583M2391M3382N2782R0162R6400J07386J07218
9126C706956J11646N2743L2330N5668P0149J11030O3116M5894M0781M9026l4101
9115D305238q4783q2733m612l7587m9412m9695j5429j5876o2957o6437N361l1102
9103C809976j7645K3389Q793j4171J112N129k2648N8547Q3651M8655L6543K2937
9091D044268O9751N6547P2342K6032q704Q8269J21323J13262O4816J23341R1954
9080D863201O235L7394Q1183J08179O6468m80j5819Q9942K7421R0768J16587p51
9068E470328n1624J8857k1653k4807j07534q3894J0286k1910j4111M1701j7280
9057E198359l8805O0903j6672l6650L4899r65k4092M733P5994O8798O1499M9970
$$ y = [2913609, 2963337, 2977811, 3079652, 3167235, 3209626, 3253008, 3305790, 3395952, 3492352, 3599738, 3706956, 3818602, 3871345, 3903675, 3959343, 4029492, 4140522, 4203638, 4249532, 4290313, 4339339, 4305238, 4220455, 4137722, 4133110, 4095523, 4046111, 3996416, 3980987, 3965111, 3902154, 3835717, 3841078, 3809976, 3792331, 3815720, 3824513, 3810342, 3811454, 3816583, 3793935, 3852482, 3936133, 3984788, 4021331, 4044268, 4114019, 4170566, 4242908, 4268940, 4260236, 4348505, 4469828, 4583090, 4647906, 4771247, 4863201, 4869436, 4906830, 4988013, 5096192, 5162660, 5162180, 5146361, 5236303, 5263724, 5354492, 5471079, 5470328, 5418704, 5437561, 5415908, 5391101, 5283567, 5199673, 5209959, 5188049, 5173938, 5215639, 5198359, 5159554, 5220457, 5203785, 5167135, 5202034, 5201069, 5176977, 5181710, 5257704, 5326502, 5388001, 5437971]
9045E437971M5471L7671j4717N7610Q0402K4696Q0424J35978l888l662P4197R5845
9033F047998Q9956O8463J09549J15995R0742K9525N4534J2240P8142J0338P1142
9022F778624M5864M2177M9650L2756J1024j8300J4812O4236P1581N6836M7062
9011G196322L7651M2620J02782P1123P4996R7344P9493N6258R1611P668J25323
9000G983191R7841Q2114M6113M4294O2697Q9924J05519P4425J04218J25392P9724
8989H895452J03455J08293J25062P4972P6713J32619J09684N3635O7806J12751
8979I860442J49785J02945J01086R4135J08461J61478J28012J44611J35357J04284
8969A1090596J12325J48611J59140J40735O3252J12241K29824J75929P9409J20886
$$ y = [5437971, 5483442, 5521113, 5506396, 5564006, 5644408, 5669104, 5749528, 5885506, 5881618, 5877956, 5952153, 6047998, 6137954, 6206417, 6315966, 6431961, 6522703, 6552228, 6606762, 6619002, 6697144, 6707482, 6778624, 6824488, 6866665, 6916315, 6949071, 6960095, 6941795, 6956607, 7020843, 7092424, 7149260, 7196322, 7233973, 7276593, 7379375, 7450498, 7525494, 7622838, 7702331, 7758589, 7850200, 7857868, 7983191, 8081032, 8163146, 8209259, 8253553, 8316250, 8406174, 8511693, 8586118, 8690336, 8815728, 8895452, 8998907, 9107200, 9232262, 9307234, 9383947, 9516566, 9626250, 9679885, 9747691, 9860442, 10010227, 10113172, 10214258, 10308393, 10416854, 10578332, 10706344, 10850955, 10986312, 11090596, 11202921, 11351532, 11510672, 11651407, 11714659, 11826900, 12056724, 12232653, 12312062, 12432948]
8959A2432948J89544J88750J22900J24286K06036K20958J43016J37206J72193
8950A3937837K24386J89676J61407J94488J71397J77919J97273K38250K40758
8941A5733391K02415J89095J71909J91051K13830K46779K61881K46726K72242
8932A7729319K35821K74388K15519K96774K51953K44175K48194K90901K63510
8923B0050554L27665L18454K90835K85087L20791L55713K65166K59733L73350
8914B2847348L10307L56026L95026L58233L30180L68218L11696L31112L50979
8905B5959125M00841L80037M31354M60186L98085M08034L96340M16200L76069
8896B9626271L88663M11992M35159L88116M33664N03824M25380M78655M54052
$$ y = [12432948, 12622492, 12811242, 12934142, 13058428, 13264464, 13485422, 13628438, 13765644, 13937837, 14162223, 14351899, 14513306, 14707794, 14879191, 15057110, 15254383, 15492633, 15733391, 15935806, 16124901, 16296810, 16487861, 16701691, 16948470, 17210351, 17457077, 17729319, 17965140, 18239528, 18455047, 18751821, 19003774, 19247949, 19496143, 19787044, 20050554, 20378219, 20696673, 20987508, 21272595, 21593386, 21949099, 22214265, 22473998, 22847348, 23157655, 23513681, 23908707, 24266940, 24597120, 24965338, 25277034, 25608146, 25959125, 26359966, 26740003, 27171357, 27631543, 28029628, 28437662, 28834002, 29250202, 29626271, 30014934, 30426926, 30862085, 31250201, 31683865, 32187689, 32613069, 33091724, 33545776]
8887C3545776M31977M64092M77074M66056M67637M56764M84200M75294M23158
8878C7692028M73607M87007N08421M22977L84924N05574M48578M60122M64528
8869D1847766L85738M20279M46867L82614M57970N15271M32268M35406M69458
8860D5793637N02063O53093P29754R97521J306454J573159J587788J066591K36901
8851E4446961q41239j485749j372637q68569m73316l55216l03459k68147k55911
8842D8222718j71209j20798o5759j33628j81924k16430k59684k99646l38152l49118
8832D6086370k14845k01012k71786l02052l03624l27569l80944l75108l47926
8823D3361504l42140l58154m47947m30007m21159m62192m84865m54298m29118
$$ y = [33545776, 33977753, 34441845, 34918919, 35384975, 35852612, 36309376, 36793576, 37268870, 37692028, 38165635, 38652642, 39161063, 39584040, 39968964, 40474538, 40923116, 41383238, 41847766, 42233504, 42653783, 43100650, 43483264, 43941234, 44456505, 44888773, 45324179, 45793637, 46295700, 46948793, 47678547, 48676068, 49982522, 51555681, 53143469, 54210060, 54446961, 53605722, 52119973, 50747336, 49878767, 49405451, 49050235, 48746776, 48478629, 48222718, 48051509, 47930711, 47864952, 47731324, 47549400, 47332970, 47073286, 46773640, 46435488, 46086370, 45871525, 45670513, 45398727, 45096675, 44793051, 44465482, 44084538, 43709430, 43361504, 43019364, 42661210, 42213263, 41783256, 41362097, 40899905, 40415040, 39960742, 39531624]
8814C9531624m00167m79380m72713m58936m71503n32408m71224m31727n08586
8805C5304980m76183m68711n11460m43866m46057m54404n04370m29439l95305
8796C1175185m30407m60046m55481m19846m17745l99846m96957m25261l97147
8787B7272449l77383l98027m09174m10155l89015l35297l23838l23993l62894
8778B3942673l91197m17742l87893l61098l22694l86265l90866m00383k96568
8769B0587967k23778k69613k28910l31050l38222k81610k66076k75699j92882
8760A8180127k77217l03796k61662l09332k99130k92856k58093j48917k34766
8751A5794358k24416j29121k63855l14778k13214j43039j70300k01785k22638
$$ y = [39531624, 39131457, 38652077, 38179364, 37720428, 37248925, 36716517, 36245293, 35813566, 35304980, 34828797, 34360086, 33848626, 33404760, 32958703, 32504299, 31999929, 31570490, 31175185, 30744778, 30284732, 29829251, 29409405, 28991660, 28591814, 28094857, 27669596, 27272449, 26895066, 26497039, 26087865, 25677710, 25288695, 24953398, 24629560, 24305567, 23942673, 23551476, 23133734, 22745841, 22384743, 22062049, 21675784, 21284918, 20884535, 20587967, 20364189, 20094576, 19865666, 19534616, 19196394, 18914784, 18648708, 18373009, 18180127, 17902910, 17599114, 17337452, 17028120, 16728990, 16436134, 16178041, 16029124, 15794358, 15569942, 15440821, 15176966, 14862188, 14648974, 14505935, 14335635, 14133850, 13911212]
8742A3911212k17153k25437k07403j81118j45127j96951j91644j90204j66980
8733A2189195k05285j50406j25653j35794j32972j09152j50424j87312j10897
8724A0881300j84457j89275j38550j21178j58952j46064r6684j48619j49651r6756
8714I451114j07391j16290p6064r8307j46764j54184j34059j07929r7013j42836
8704H270277j34111p2365k8091p6732o9582m6967q7678j22954j61761j17146p7366
8693G275524j28083j35568r8890l8598P212j43925q5229o2125p2947j34379j01327
8682F281665m5984L596l6510n4829q0577j21049l7062j0338q3498j22188r5940
8671E597286k091k005j01518q1807j06806p4814r2017q740m3426k3443j7178o2449
$$ y = [13911212, 13694059, 13468622, 13261219, 13080101, 12934974, 12738023, 12546379, 12356175, 12189195, 11983910, 11833504, 11707851, 11572057, 11439085, 11329933, 11179509, 10992197, 10881300, 10696843, 10507568, 10369018, 10247840, 10088888, 9942824, 9846140, 9697521, 9547870, 9451114, 9343723, 9227433, 9151369, 9053062, 8906298, 8752114, 8618055, 8510126, 8413113, 8270277, 8136166, 8063801, 8035710, 7958978, 7889396, 7842429, 7754751, 7631797, 7470036, 7352890, 7275524, 7147441, 7011873, 6912983, 6874385, 6881597, 6737672, 6652443, 6590318, 6517371, 6382992, 6281665, 6235681, 6239277, 6202767, 6147938, 6067361, 5946312, 5909250, 5898912, 5815414, 5693226, 5597286, 5595195, 5593190, 5491672, 5409865, 5303059, 5228245, 5136228, 5127488, 5084062, 5060619, 5043441, 4980992]
8659D980992j18357p9459n1978m8100j5096K4794q5631j00108k9954j2724p0768
8648D393611m8596Q130l4238m4803M6947O9826l6809j57669j11247p4449l4385
8637C976318p6897n6380r681m0525o0068q106o0152o9112k4663K038m1431q2399
8625C448942l6480L7439J8647j6150K7058J8930o8634p4771p6252j2446n6145
8614C210138j7559k3204k9332m7213m9398k9226N892J3025Q942j4580n9396n9749
8602B908340o4740K661l6268p4124M7113K2921q589J5732Q857l7190q3237k8155
8590B673321l8107j7744j6413m9187P20n5593J6394M3860r647k9972p5386k9388
8578B412858J7307k0845N4211O4895R549q354m6179N258p0624n1066k2314J0473
$$ y = [4980992, 4862635, 4783176, 4731198, 4683098, 4668002, 4692796, 4607165, 4507057, 4477103, 4464379, 4393611, 4345015, 4353145, 4318907, 4274104, 4321051, 4390877, 4354068, 4196399, 4085152, 4010703, 3976318, 3899421, 3843041, 3833360, 3792835, 3732767, 3724661, 3664509, 3595397, 3570734, 3572772, 3531341, 3448942, 3412462, 3449901, 3468548, 3452398, 3479456, 3498386, 3429752, 3354981, 3278729, 3266283, 3210138, 3192579, 3169375, 3140043, 3092830, 3043432, 3014206, 3020098, 3033123, 3042065, 3027485, 2968089, 2908340, 2843600, 2846261, 2809993, 2735869, 2782982, 2805903, 2797314, 2813046, 2821903, 2784713, 2701476, 2673321, 2635214, 2617470, 2601057, 2551870, 2552590, 2496997, 2513391, 2557251, 2547604, 2517632, 2442246, 2412858, 2430165, 2409320, 2463531, 2528426, 2537975, 2529621, 2483442, 2488700, 2418076, 2367010, 2344696, 2355169]
8566B355169k9546q7489k2366l4673l424k5089J2259l5020q8684k9451l7039K5969
8554B000616L7414n6217p5168J2163L1423L5726n9472j9984p3022n8905n4814
8543A719760K6854p916K0990m3430k0314l3505j9271J456L5441J9172n5998l7737
8531A605502n3968m8285K0690P4577L3031L1255n1554j401l459m4920M207l8538
8519A527137L425K0931k3576l3467o6846n2274l1762k4195M045O8745J7q152n3810
8506A330218J54o688L0764k0836j0156j6628m9952m6922K0909M208N086M9912
8494A290069J2068N851J6312q487j3109l3902j5853j632q1809o7770P047N3511
8482A162296P9871K2275j1916m6677l6684p038p8077m9259Q164J5534k5444L0009
$$ y = [2355169, 2325623, 2238134, 2215768, 2181095, 2177671, 2152582, 2164841, 2129821, 2041137, 2011686, 1974647, 2000616, 2038030, 1981813, 1906645, 1918808, 1950231, 1985957, 1926485, 1906501, 1833479, 1774574, 1719760, 1746614, 1738698, 1759688, 1716258, 1695944, 1662439, 1643168, 1644624, 1680065, 1699237, 1643239, 1605502, 1551534, 1503249, 1523939, 1598516, 1631547, 1662802, 1611248, 1609847, 1606388, 1561468, 1565675, 1527137, 1530562, 1551493, 1527917, 1494450, 1427604, 1375330, 1343568, 1319373, 1323418, 1392163, 1392180, 1384028, 1330218, 1330372, 1323684, 1354448, 1333612, 1323456, 1306828, 1256876, 1209954, 1230863, 1235071, 1240157, 1290069, 1302137, 1307988, 1324300, 1315813, 1302704, 1268802, 1252949, 1251317, 1169508, 1101738, 1108785, 1162296, 1242167, 1264442, 1252526, 1205849, 1169165, 1162127, 1084050, 1034791, 1042955, 1058489, 1033045, 1063054]
8470A063054K8129p0257p6469K1677J5938M75j4774J4281q492K478O426K244J6806
8457A001516K7001j6159j3333O2584j188n3820j2867j8140J7669j3337r188k888
8445I67850K628j8105j3534M9549o490m5467J8112K0394J3462k6630p687n1291
8433I02791m6834J4710L4098l1174n4077m8038J8176L1394Q6126J945R419n3422
8421H65114m7194k430l9805o8662J6785P2467m280j657j3727J0974J7976K6207
8409H31768l5451k4758j109k9278J7723J6478L4700K6511O0919M8466M4071k4256
8397I65784o6237o7760k127n728k9144k7056p0294J7677M4536j5775m1309J0967
8385G13534K8456n1736k0689l9613j5427q804K1197j205k7676M4745K4111k4621
$$ y = [1063054, 1091183, 1020926, 944457, 966134, 982072, 982547, 967773, 982054, 973562, 976040, 982466, 984710, 1001516, 1028517, 1012358, 999025, 1061609, 1060421, 1006601, 993734, 975594, 993263, 979926, 970738, 967850, 970478, 952373, 938839, 988388, 981898, 936431, 954543, 974937, 988399, 961769, 954082, 902791, 855957, 870667, 904765, 873591, 819514, 771476, 789652, 821046, 907172, 909117, 918536, 865114, 817920, 815490, 775685, 707023, 723808, 796275, 791995, 790338, 776611, 787585, 805561, 831768, 796317, 771559, 770450, 741172, 758895, 775373, 810073, 836584, 897503, 945969, 990040, 965784, 899547, 831787, 829660, 823932, 794788, 767732, 697438, 715115, 759651, 743876, 702567, 713534, 741990, 690254, 669565, 629952, 614525, 605721, 626918, 625713, 598037, 642782, 666893, 642272]
8373F42272J3143m8612k8719M7421Q012m0493Q050L0065j0916K781k2556k7172
8361E73276n3622l8154l977L8761r43L8568M2122J5316M0415P9895J881j0532
8349G23006L3784J9497n3969q8599O166m988k3897L9605R513K2688l0896n9511
8337E92399o4612m1972P765K8817N7471m2350n7182J4084N8520K3382m7149j3746
8325E15427M1082K4271k8674m7042L54O749J2598N5420l2479n0241o647Q292l5283
8312D63827k0865L8555K8692k5366m2812j984J7820j646n5615K6759M1490k3411
8300D45444k4772L702M1642k3127m4522j4772K4797R17J2709o949p886j0378j5249
8287C81556J2199P609j5080m2042k0153L1079P2466m171k6669N8646L1296j300
$$ y = [642272, 655415, 606803, 578084, 625505, 633517, 593024, 601074, 631139, 620223, 623004, 600448, 573276, 519654, 481500, 477523, 516284, 515341, 553909, 596031, 611347, 651762, 731657, 733538, 723006, 756790, 776287, 722318, 633719, 639885, 634897, 611000, 650605, 660118, 682806, 651910, 592399, 527787, 485815, 493580, 522397, 579868, 537518, 480336, 494420, 552940, 576322, 529173, 515427, 556509, 580780, 552106, 505064, 505418, 512167, 524765, 580185, 547706, 497465, 490818, 499110, 463827, 442962, 481517, 510209, 484843, 442031, 440047, 457867, 456221, 400606, 427365, 468855, 445444, 420672, 424374, 466016, 442889, 398367, 383595, 408392, 409309, 422018, 415069, 407183, 396805, 381556, 393755, 401364, 386284, 344242, 324089, 355168, 427634, 423463, 396794, 455440, 486736, 485436]
8275D85436p7450p1062j2597N80j1690O6748M467l6210O9762j5627o7542l2986
8263C01829K5621K4904p3055M444N6102P8993j3951j2297J3359o589l6063m8761
8251C14536m335N3916J9829j0016m781p1330j1364L6046J5713k8932Q209j1906
8239C05585j24k6156j2682l9851O22K7965M0160l7439m0704M3205J2066j9186
8227B53461P849P894k2966J4619j7177m8657P55j6081n5151L296R424M2323R701
8214A89290m942K2153L9719J4286m3479j0385l6691P268N2950M0530J3903n2829
8202B31773j07R15N562p625K1599M945j4165k7464J0572K1510L7011n8634j3502
8189B12390K5877J7587L111O3725J7645k4718J829j2789j9539l4064J3952k3918
$$ y = [485436, 407986, 336924, 324327, 324907, 313217, 379965, 384432, 348222, 417984, 402357, 334815, 301829, 327450, 352354, 279299, 283743, 339845, 418838, 404887, 392590, 405949, 399360, 363297, 314536, 310201, 364117, 383946, 373930, 369149, 297819, 286455, 322501, 338214, 309282, 317491, 305585, 305461, 279305, 266623, 226772, 227394, 255359, 295519, 258080, 217376, 260581, 272647, 253461, 261310, 269204, 246238, 260857, 243680, 195023, 195778, 179697, 124546, 127842, 137266, 179589, 189290, 184348, 206501, 246220, 260506, 217027, 206642, 169951, 177219, 230169, 270699, 284602, 231773, 231666, 232581, 238143, 230518, 252117, 257062, 242897, 215433, 226005, 247515, 284526, 225892, 212390, 238267, 255854, 258965, 322690, 340335, 315617, 317446, 304657, 285118, 251054, 265006, 241088]
8177B41088j848j646p2068l0259k2974O133K2717L87k0703J779l595M009k1960
8164A01060M233L1184K982l4264M8688M9981l4948l7898j5568r690L802J5872
8152A25434k2119J7528M1970K0927k6086q7L7319j3404k8327j7871K1378L3864
8140A90526m9583n8049j7902L1867M6159J4002L7202n905j0700K5808J9147n7467
8128A65105r924K2187j0805q042N8062K1479n7461j2049j2685J651k0591M8451
8116A85378k8724J1602K2922J1006l7979p726O7495L0388j3330l3787N511J0843
8104B23599k1577K3575M0361o081m3071l0800j3188j45j5607L364J2861j9564
8092A53727j1163J7640j4613K6594K5156J9778j1266k8216k2760m8412k9325J448
$$ y = [241088, 239240, 237594, 165526, 135267, 112293, 118426, 141143, 141530, 120827, 122606, 119011, 123020, 101060, 105293, 136477, 139459, 105195, 153883, 203864, 168916, 131018, 115450, 105760, 109562, 125434, 103315, 120843, 162813, 183740, 157654, 157567, 194886, 181482, 153155, 135284, 156662, 190526, 140943, 82894, 64992, 96859, 143018, 157020, 194222, 188317, 177617, 203425, 222572, 165105, 155181, 177368, 166563, 158521, 216583, 238062, 180601, 168552, 155867, 157518, 136927, 185378, 156654, 168256, 191178, 202184, 164205, 156479, 223974, 254362, 241032, 207245, 212756, 223599, 202022, 225597, 265958, 259877, 216806, 186006, 172818, 172673, 157066, 160430, 173291, 153727, 142564, 160204, 145591, 172185, 197341, 217119, 205853, 177637, 154877, 106465, 77140, 78588]
8080G8588M3797J1472l7872l4457l112L9334k0456n9815J7493N5048K4978l69
8068A14629p98j8930m0569m1J9199m2352J8736J9320N3372M7220l9789k1204J7320
8055A26113K7560J7453n1315L9858M6683k3002p9111j4988n2673N2012L5203k539
8043A21254m3301k0157L7504M2885o0696K5652j3022l1629L7424P0631J2994R404
8031A88943k9461J2411k8251Q323J7449l3103r663j5204j239m259O0771J6473
8019A83190r3786k7526J6651L3615L1543J420L0693j297m4908K712j812p247j9533
8006A03715l166Q3338m379K281M0145L524n6828k4015K6628J056k6100l0034j4208
7993A01957k1416L6053k2097J1875L6875J0239q956l6295l367o358M6970N4676
$$ y = [78588, 122385, 133857, 95985, 61528, 58416, 97750, 77294, 17479, 34972, 90020, 114998, 114629, 113831, 94901, 54332, 54291, 73490, 31138, 49874, 69194, 122566, 169786, 129997, 108793, 126113, 153673, 171126, 119811, 159669, 206352, 183350, 104239, 89251, 36578, 88590, 123793, 121254, 77953, 57796, 95300, 138185, 77489, 103141, 90119, 58490, 95914, 166545, 179539, 188943, 159482, 171893, 143642, 151965, 169414, 136311, 126648, 111444, 110205, 105946, 166717, 183190, 89404, 61878, 78529, 112144, 143687, 145107, 175800, 174503, 129595, 132307, 130495, 123248, 103715, 100549, 183887, 179508, 181789, 221934, 225458, 168630, 144615, 171243, 172299, 146199, 116165, 101957, 80541, 116594, 94497, 106372, 143247, 153486, 144530, 108235, 104868, 98510, 145480, 200156]
7981B00156l2456j5922L8673k259j7831j2102j6730J4559p336n000k4838k2676
7969I6238j5248m92j222j5600N193J0246j508l7653J2251j1061p099n619K4525
7956E2951K3613J9018M8426n1479r7031o393J7393K6049L7322N2290Q5517K399
7944B10075r0338k5806K7600J0059n524l8907j8188L053J5030j0758p743k262
7932F6291J7060n848Q8976L7917K2799M236j2619n8700m3746J6151j7874K2586
7920A37229k0049m42R982l3641J4184K0300L6520K665m4477r7246L3116N9425
7908A17566o00k8679q598J2110k7881K5360P8714m1474J7423P985p1853m3891
7896C6182m4889k1032Q4700Q4393K1644M7497l4856l7635n6858j8665K5194J1235
$$ y = [200156, 167700, 151778, 190451, 188192, 170361, 158259, 141529, 156088, 148752, 143752, 118914, 96238, 80990, 80498, 79276, 63676, 68869, 79115, 77607, 39954, 52205, 41144, 34045, 28426, 52951, 76564, 95582, 144008, 92529, -4502, -10895, 6498, 32547, 69869, 122159, 207676, 210075, 119737, 93931, 121531, 131590, 126066, 87159, 68971, 72024, 87054, 76296, 68553, 66291, 83351, 77503, 166479, 204396, 227195, 231431, 218812, 160112, 116366, 132517, 114643, 137229, 117180, 116738, 126720, 93079, 107263, 127563, 164083, 166748, 122271, 25025, 58141, 117566, 116966, 88287, 79689, 91799, 63918, 89278, 167992, 126518, 143941, 151926, 80073, 36182, -8707, -29739, 54961, 139354, 160998, 208495, 173639, 136004, 79146, 60481, 85675, 96910]
7884I6910J0455L0393J6892J145j443K1089m5272l1758L3797L8039p439j5353
7872A47455l3182m3222J6357j810n9633o217M3134J4084j0115R921n679L3504
7860A04597K8592J9219j2340j9833Q539k1407l7146K9910L1419m4246p5804m7285
7848c5785L4911L0451K3327Q3823j4006o4160p0061n7865N0853M0876n5943j3883
7836d7462n300K6195P5297j0381k7736O795J1621M070M4381J2275j979J7165K9672
7823A34613m884j6595j1363L757l4431m3990K549k016q287q696k5150J4013J7907
7810A7427J4806K4758M647M8619l3576q510N5789J1701j8814p1218k6152O685
7798B6162L5002L5891j9084k9958J242K8508n46L5500k8210j1018k2590K7861
$$ y = [96910, 107365, 137758, 154650, 155795, 154352, 175441, 130169, 98411, 132208, 170247, 162808, 147455, 114273, 71051, 87408, 85598, 25965, 19748, 62882, 76966, 66851, 76772, 71093, 104597, 133189, 152408, 140068, 120235, 128774, 107367, 70221, 100131, 131550, 87304, 11500, -35785, -874, 29577, 52904, 136727, 122721, 58561, -11500, -69365, -18512, 22364, -33579, -47462, -52762, -26567, 48730, 38349, 10613, 17408, 29029, 33099, 77480, 89755, 87776, 104941, 134613, 129729, 113134, 101771, 105528, 71097, 27107, 29656, 27640, 19353, 10657, -14493, -480, 17427, 32233, 56991, 61638, 110257, 76681, 68171, 123960, 135661, 116847, 45629, 19477, 26162, 61164, 97055, 77971, 48013, 49255, 77763, 77217, 112717, 84507, 73489, 50899, 78760]
7786G8760l1397l5678j7126K386J7104j4774k095J1122L0697K0760P497n3079
7774A4177r701L3155J7573m441k1571j9652k7944l7619K7028q240P1956K6249
7762F0970n4188n6981m6748k2570M8464L6844Q0323K1891k2936l7332J389k9614
7750b0488K2850J63k9943k4040O1721m851N66O1445N5162k2980l8381m9996l4537
7737b3309m1607j6456P836k2134q226M9408J9594j7555k6175j5098N220L8912
7725d9590j524J6995k3425q88k0853M5458L6250L6028K5011l7284o0927R407j2815
7712c8157j7668k7742j0219N312J3215K7090M0432R949m3624L3045P963L3147
7700C2743L1241J7242k3141l2407k7838j4706R157L0050N7841j1315k5533m9956
$$ y = [78760, 47363, 11685, -5441, -3055, 14049, -725, -2820, 8302, 38999, 59759, 67256, 14177, 4476, 37631, 55204, 50763, 29192, 9540, -18404, -56023, -28995, -37235, 34721, 60970, 6782, -50199, -96947, -119517, -71053, -34209, 46114, 68005, 45069, 7737, 9126, -20488, 2362, 2525, -27418, -51458, 10263, 5412, 5978, 67423, 122585, 99605, 61224, 11228, -23309, -64916, -81372, -73536, -95670, -103896, -54488, -34894, -52449, -78624, -93722, -88502, -49590, -51114, -34119, -57544, -58432, -79285, -33827, 2423, 38451, 63462, 26178, -34749, -25342, -38157, -55825, -83567, -93786, -88474, -75259, -48169, -7737, 2212, -41412, -8367, -404, 32743, 63984, 81226, 58085, 25678, -2160, -16866, -7709, 22341, 80182, 68867, 43334, -6622]
7688f622j4503p478k0735J3456q896L2187n247j9907j744j9748K1466Q545J2761
7675a6465O32j1956k3031k224l1300k942L8774l8817j6348J0607O0999O0561N346
7662C3836k192L700n0981j2194l5596n4271j8003K1360N4329N1942J9361j6421
7650e130n3137J0478N2477k7687L99m8217n8259P9871K3503j5574L1925q149K3490
7637E990k7335n8533Q532M1722l3098M3548L0376J925M5639J796m3933l3074K7939
7624A1494K2695J6768q015k8502k5275J9663K1490J9208m0819L968K5640J4756
7612E3071k0399m9031n7690J0240M2807k7258k5062p578M081K646k4977M5941
7600e3209L5976N534r5029j3202L9827l1793J5732J0160L7674O0296O0600Q959
$$ y = [-6622, -21125, -28603, -49338, -35882, -44778, -12591, -17838, -37745, -39489, -59237, -37771, -29226, -16465, -15833, -27789, -50820, -53044, -84344, -87286, -48512, -87329, -103677, -93070, -32071, 28490, 33836, 31644, 35344, -15637, -27831, -63427, -117698, -135701, -114341, -60012, -8070, 11291, -5130, -58267, -47789, 4688, -22999, -22600, -70817, -129076, -49205, -25702, -41276, -9351, -17500, 5990, -21345, -79878, -71346, -29624, -62722, -19174, 11202, 13127, 58766, 60562, 16629, -16445, 11494, 34189, 50957, 42942, 14440, -10835, 8828, 30318, 49526, 8707, 12675, 38315, 53071, 32672, -16359, -74049, -63809, -21002, -48260, -73322, -80900, -76819, -74173, -99150, -53209, -17233, -11699, -106728, -119930, -80103, -111896, -96164, -86004, -48330, 11966, 72566, 81525]
7588H1525j8727o9553O934k8760J4365N05j4845L9636l6571K631N2660l6414K9439
7575B2825r349n3309j7640K1952r431j8145j7967J0391N2617K7747k6794o4843
7563h1946L2172R778p913m774Q983N828Q178N3971M1142J5229o8321l1432j1057
7550c0162J6906K3960m3007j3052J4678O841o4519l914K7428L8852J9349k6448
7538c3088K0789J2149r768j4842Q620J4265m9089M101L5039K8471j8140p2811
7526g4304l984J3418m5307j0469N5957N0248M595m4056L797j486j0078K6200P065
7513b8404n1723k6150l600J094P4566M9924k4917m4223j5907O7096P2410j4990
7501E5176o8126j4203L8248M7193J5544j01390k5622K2072J7067j2294J8799K6940
$$ y = [81525, 62798, -6755, 179, -28581, -14216, -13711, -28556, 11080, -25491, -22860, 29800, -6614, 22825, 13476, -39833, -57473, -35521, -44952, -63097, -81064, -70673, -18056, 9691, -17103, -81946, -49774, -39996, -47909, -52683, -43700, -37872, -29694, 24277, 65419, 80648, 12327, -19105, -30162, -13256, 10704, -32303, -45355, -30677, -23836, -88355, -92269, -64841, -25989, -6640, -33088, -12299, -150, -9918, -24760, -16140, -1875, -50964, -46863, -11824, 16647, -1493, -74304, -78288, -64870, -110177, -120646, -64689, -14441, -9846, -53902, -50105, -51591, -61669, -35469, -28404, -80127, -106277, -109877, -108783, -34217, 15707, -9210, -53433, -69340, -2244, 70166, 55176, -12950, -27153, 11095, 58288, 73832, -27558, -53180, -31108, -14041, -26335, -7536, 19404]
7489A9404o2139l5171q977K743J7976J1686K4494p128r606n5081L3145J1269N1445
7476e940J4868j0530l8847O479J2002l2537J029J3964J5769K1851j3930N287l940
7463a4475J4404q052O505k3129R407k973m6127K9125o679k4871j0882J6967k2195
7450h2975P56K4335l4769L0410j2495M5613L6737j9365o0759l8372J3129K0904
7438g6851K957k909N7084L0176J4287l8819n8100K6781l2186p8438J2915O2237
7426h0866K2219J5382L0736L7585k807p031O300m8227p4024n8481K3797M2128
7414i3289K7794J4959K843j0624K8532M1025r003K997J9707O5171K1546n3870
7402E7788m8715k5047o4579n9957Q4831M9586o7060q2705K4233Q8394J6404k9379
$$ y = [19404, -42735, -77906, -86883, -84140, -66164, -54478, -29984, -37112, -46718, -101799, -68654, -57385, -5940, 8928, -1602, -40449, -33970, -21968, -54505, -53476, -39512, -23743, -1892, -15822, -10535, -14475, -71, -8123, -1618, -24747, -15340, -18313, -64440, -35315, -41994, -66865, -77747, -60780, -82975, -82219, -57884, -92653, -62243, -74738, -29125, 7612, -11753, -72512, -110884, -97755, -76851, -73894, -76803, -19719, 10457, 24744, -14075, -72175, -45394, -77580, -156018, -143103, -80866, -58647, -43265, -12529, 25056, 22249, 15218, 21518, -26709, -100733, -159214, -135417, -93289, -65495, -50536, -47693, -58317, -29785, 11240, 2237, 5234, 24941, 90112, 111658, 57788, 9073, -15974, -80553, -140510, -55679, -6093, -73153, -155858, -131625, -43231, -26827, -56206]
7390e6206k2584n5080j6675K9496L2477J9214J1938J626K0775k8856k1837L1172
7378e4540J15j4887L2834P5426J5298j9721m490K7962p838m9682q636p595r153
7365b4907o19j1926m5084q042N2641L6394m2407k3271J3366n499P1656O950m2585
7352b3333n5606j6691J450N3227N2043p3225k8773L5849K258K4693J1398J9778
7340C068N411J2820J3415k728n2140l6027l2573k2737M3820O622J389K0826N369
7327c3465M1213J0894m2347n1345J7320M2937l426m2132N9186K4016j7080m921
7315H50k3697L4130J1439l768n3690l8906M9135k916j9357O4573O6012K8573j7244
7302I5134o0392l0610o201J2334k8365l5501l253k1711K4880K0720K8053j2060
$$ y = [-56206, -78790, -133870, -150545, -121049, -88572, -69358, -57420, -55794, -35019, -63875, -85712, -54540, -54425, -69312, -36478, 38948, 54246, 34525, 30035, 57997, 50159, 477, -8159, -15754, -24907, -25526, -37452, -82536, -90578, -37937, -1543, -43950, -67221, -53855, -59354, 12302, 19252, -23333, -78939, -95630, -94180, -40953, 11090, -62135, -90908, -55059, -52801, -28108, -16710, 3068, 8479, 21299, 34714, 31986, -20154, -56181, -88754, -111491, -67671, -61049, -59660, -38834, -33465, 7748, 18642, -23705, -75050, -57730, -14793, -18219, -60351, -1165, 22851, 5771, 850, -22847, 11283, 22722, 18954, -34736, -73642, -24507, -27423, -46780, 17793, 83805, 112378, 95134, 34742, 4132, -2069, 10265, -18100, -53601, -56854, -78565, -53685, -32965, -4912, -16972]
7290a6972m5987k828m2020m3781K4599O7565L0218k0584K3336L8602p0359k7852
7278h6063p938j2609R066K9647J8497L3478K2782k222k1787M820L2759m7349q5382
7265a12301K803j2337P198J6811n4877K4460O497K3452N6348K0491L771L400K0224
7252E940l8524j513l5379K706m068O39L6059j6625l7221Q043j2951J9824n7234
7239a30304J420L8048R137o2598m6298N1901K0440j3090j0861L5733k3243k275
$$ y = [-16972, -62959, -65787, -107807, -151588, -126989, -59424, -29206, -49790, -26454, 12148, -58211, -86063, -94001, -106610, -97544, -67897, -49400, -15922, 6860, 4638, -17149, -12329, 20430, -26919, -112301, -109498, -121835, -114637, -97826, -152703, -128243, -121746, -98294, -41946, -21455, -17684, -14284, 5940, -32584, -34097, -69476, -66770, -70838, -70199, -34140, -50765, -87986, -79943, -92894, -73070, -130304, -128884, -90836, -81699, -144297, -190595, -138694, -118254, -131344, -142205, -106472, -129715, -131990]
$$ [...]
##END NTUPLES=NMR SPECTRUM
##END=
