##TITLE=Analysis number 324051
Compound Code cc 50716
Book Reference 494/84
Project Code adrs
Chemist Name craigr
##JCAMPDX= 6.0         $$ Bruker NMR JCAMP-DX V2.0
##DATA TYPE= NMR SPECTRUM
##DATA CLASS= NTUPLES
##ORIGIN= Bruker BioSpin GmbH
##OWNER= nmr
$$ XWIN-NMR		Version 3.5
$$ Tue Nov 14 11:23:18 2006 GMT Standard Time (UT+0h)  MAYBRIDGE\nmr@NMR_250MHZ
##.OBSERVE FREQUENCY= 250.131544655141
##.OBSERVE NUCLEUS= ^1H
##.ACQUISITION MODE= SIMULTANEOUS (DQD)
##.ACQUISITION SCHEME= undefined
##.AVERAGES= 16
##.DIGITISER RES= 18
##SPECTROMETER/DATA SYSTEM= dpx250
##.PULSE SEQUENCE= zg30
##.SOLVENT NAME= CDCl3
##.SHIFT REFERENCE= (INTERNAL, CDCl3, 0, 16.522)
##AUDIT TRAIL= $$ (NUMBER, WHEN, WHO, WHERE, WHAT)
$$ ##TITLE= Audit trail, XWIN-NMR		Version 3.5
$$ ##JCAMPDX= 5.01
$$ ##ORIGIN= Bruker BioSpin GmbH
$$ ##OWNER= nmr
$$ C:\u/data/dgb/nmr/ADRS/220/pdata/1/auditp.txt
$$ ##AUDIT TRAIL=  $$ (NUMBER, WHEN, WHO, WHERE, WHAT)
(   1,<2006-11-14 11:22:50.31 +000>,<MAYBRIDGE\nmr>,<NMR_250MHZ>,
      <created by zg, POWCHK disabled, PULCHK disabled
       configuration hash MD5:
       49 4B E0 1D 92 C2 6B 37 9F E6 65 BC 52 41 86 1D
       data hash MD5: 64K
       31 2E FD 90 AA 98 6D BF 59 CF B0 96 75 59 E1 72>)
(   2,<2006-11-14 11:23:06.55 +000>,<MAYBRIDGE\nmr>,<NMR_250MHZ>,
      <Start of raw data processing
       ef LB = 0.3 FT_mod = 6 PKNL = 1 SI = 32K 
       data hash MD5: 32K
       FB 18 41 E1 F7 0F 80 1C CB 0F 9D D8 38 D6 EE B8>)
(   3,<2006-11-14 11:23:08.33 +000>,<MAYBRIDGE\nmr>,<NMR_250MHZ>,
      <apk 
       data hash MD5: 32K
       39 2A 25 6B 4F CD 22 DB 43 BC 4D A6 65 D0 79 D2>)
(   4,<2006-11-14 11:23:09.08 +000>,<MAYBRIDGE\nmr>,<NMR_250MHZ>,
      <abs ABSG = 5 
       data hash MD5: 32K
       EC E7 A1 31 05 A3 37 32 A3 CB 82 2F A5 27 60 D1>)
$$ ##END=
$$ 
$$ hash MD5
$$ DF EC 3E 3C 1A 80 4D 7D D7 6F 01 7A 43 A4 8C B3
##$RELAX= 
##$RELAX= 
##$RELAX= 
##$RELAX= 
##$RELAX= 
##$RELAX= 
##$RELAX= 
$$ Bruker specific parameters
$$ --------------------------
##$DU= <C:\u>
##$EXPNO= 220
##$NAME= <ADRS>
##$PROCNO= 1
##$TYPE= <nmr>
##$USER= <dgb>
##$AMP= (0..31)
100 100 100 100 100 100 100 100 100 100 100 100 100 100 100 100 100 100 
100 100 100 100 100 100 100 100 100 100 100 100 100 100 
##$AQSEQ= 0
##$AQ_mod= 3
##$AUNM= <au_zg>
##$AUTOPOS= <25 >
##$BF1= 250.13
##$BF2= 250.13
##$BF3= 250.13
##$BF4= 250.13
##$BF5= 500.13
##$BF6= 500.13
##$BF7= 500.13
##$BF8= 500.13
##$BYTORDA= 1
##$CFDGTYP= 0
##$CFRGTYP= 5
##$CHEMSTR= <none>
##$CNST= (0..31)
1 1 145 1 1 1 1 1 1 1 1 1 1 1 1 1 1 1 1 1 1 1 1 1 1 1 1 1 1 1 1 1 
##$CPDPRG= <>
##$CPDPRG1= <>
##$CPDPRG2= <>
##$CPDPRG3= <>
##$CPDPRG4= <mlev>
##$CPDPRG5= <mlev>
##$CPDPRG6= <mlev>
##$CPDPRG7= <mlev>
##$CPDPRG8= <mlev>
##$CPDPRGB= <>
##$CPDPRGT= <>
##$D= (0..31)
0 1 0 0 0 0 0 0 0 0.06 0 0 0 0 0 0 0.0002 0 0 0 0 0 0 0 0 0 0 0 0 0 0 
0 
##$DATE= 1163503369
##$DBL= (0..7)
120 120 120 120 120 120 120 120 
##$DBP= (0..7)
150 150 150 150 150 150 150 150 
##$DBP07= 0
##$DBPNAM0= <>
##$DBPNAM1= <>
$$ [...]
##$SUBNAM7= <"">
##$SUBNAM8= <"">
##$SUBNAM9= <"">
##$SW= 20.6930455092707
##$SWIBOX= (0..15)
0 0 3 0 0 0 0 0 0 0 0 0 0 0 0 0 
##$SW_h= 5175.983436853
##$TD= 65536
##$TD0= 1
##$TE= 683.16
##$TE2= 300
##$TE3= 300
##$TEG= 300
##$TL= (0..7)
0 120 120 120 120 120 120 120 
##$TP= (0..7)
150 150 150 150 150 150 150 150 
##$TP07= 0
##$TPNAME0= <>
##$TPNAME1= <>
##$TPNAME2= <>
##$TPNAME3= <>
##$TPNAME4= <>
##$TPNAME5= <>
##$TPNAME6= <>
##$TPNAME7= <>
##$TPOAL= (0..7)
0.5 0.5 0.5 0.5 0.5 0.5 0.5 0.5 
##$TPOFFS= (0..7)
0 0 0 0 0 0 0 0 
##$TUNHIN= 0
##$TUNHOUT= 0
##$TUNXOUT= 0
##$USERA1= <user>
##$USERA2= <user>
##$USERA3= <user>
##$USERA4= <user>
##$USERA5= <user>
##$V9= 5
##$VALIST= <valist>
##$VCLIST= <CCCCCCCCCCCCCCC>
##$VD= 0
##$VDLIST= <DDDDDDDDDDDDDDD>
##$VPLIST= <PPPPPPPPPPPPPPP>
##$VTLIST= <TTTTTTTTTTTTTTT>
##$WBST= 1024
##$WBSW= 4
##$XGAIN= (0..3)
0 0 0 0 
##$XL= 0
##$YL= 0
##$YMAX_a= 256000
##$YMIN_a= -361254
##$ZGOPTNS= <>
##$ZL1= 120
##$ZL2= 120
##$ZL3= 120
##$ZL4= 120
##$ABSF1= 16.522
##$ABSF2= -4.171173
##$ABSG= 5
##$ABSL= 3
##$ALPHA= 0
##$AQORDER= 0
##$ASSFAC= 0
##$ASSFACI= 0
##$ASSFACX= 0
##$ASSWID= 0
##$AUNMP= <proc_1d>
##$AZFE= 0.1
##$AZFW= 0.1
##$BCFW= 0
##$BC_mod= 0
##$BYTORDP= 0
##$COROFFS= 0
##$CY= 12.5
##$DATMOD= 1
##$DC= 0
##$DFILT= <>
##$DTYPP= 0
##$F1P= 14.0000005364418
##$F2P= -0.99999901652339
##$FCOR= 0.5
##$FTSIZE= 32768
##$FT_mod= 6
##$GAMMA= 0
##$GB= 0
##$INTBC= 1
##$INTSCL= 1
##$ISEN= 128
##$LB= 0.3
##$LEV0= 0
##$LPBIN= 0
##$MAXI= 10000
##$MC2= 0
##$MEAN= 0
##$ME_mod= 0
##$MI= 0
##$NCOEF= 0
##$NC_proc= -5
##$NLEV= 6
##$NOISF1= 0
##$NOISF2= 0
##$NSP= 0
##$NTH_PI= 0
##$NZP= 0
##$OFFSET= 16.522
##$PC= 1
##$PHC0= -50.63306
##$PHC1= 5.453081
##$PH_mod= 1
##$PKNL= yes
##$PPARMOD= 0
##$PSCAL= 4
##$PSIGN= 0
##$REVERSE= no
##$SF= 250.13
##$SI= 32768
##$SIGF1= 0
##$SIGF2= 0
##$SINO= 400
##$SIOLD= 32768
##$SREGLST= <1H.CDCl3>
##$SSB= 0
##$STSI= 32768
##$STSR= 0
##$SW_p= 5175.98343685301
##$SYMM= 0
##$S_DEV= 0
##$TDeff= 65536
##$TDoff= 0
##$TI= <Analysis number 999999
Compound Code 99
Book Reference 9
Project Code 9>
##$TILT= no
##$TM1= 0
##$TM2= 0
##$TOPLEV= 0
##$USERP1= <user>
##$USERP2= <user>
##$USERP3= <user>
##$USERP4= <user>
##$USERP5= <user>
##$WDW= 1
##$XDIM= 32768
##$YMAX_p= 561481754
##$YMIN_p= -235223
$$ End of Bruker specific parameters
$$ ---------------------------------
##NTUPLES= NMR SPECTRUM
##VAR_NAME=  FREQUENCY,     SPECTRUM/REAL,   SPECTRUM/IMAG
##SYMBOL=    X,             R,               I
##VAR_TYPE=  INDEPENDENT,   DEPENDENT,       DEPENDENT
##VAR_FORM=  AFFN,          ASDF,            ASDF
##VAR_DIM=   32768,         32768,           32768
##UNITS=     HZ,            ARBITRARY UNITS, ARBITRARY UNITS
##FACTOR=    0.157963299565203, 1,           1
##FIRST=     4132.6476996994, 0,             0
##LAST=      -1043.33573715361, 0,           0
##MIN=       -1043.33573715361, -235223,     0
##MAX=       4132.6476996994, 561481754,     0
$$ Real data points
##PAGE= N=1
##DATA TABLE= (X++(R..R)), XYDATA
$$ [...]
13731B50592l6231k6058J5705K0308m6868p599K5210j2825k1089L6391K792O304
13719B06632L6039L2235l035K1854P7358R5137J21251P1507P736q6833q4725j07885
13707C87271j09050l1740O2325r602k0144P419k9765m3615m598M0472o0334m1967
13695A46672J7548Q20p750J1216L9355M5144J6892K7905K1252j6616n870L1936
13683C28504L0369N0710L8682k5474k0689N4088N0984N2116K8833J6357J8302
13672F22782J44049R5249N3015J27617K02992J60173m8336k39921k25661j71499
13662G20460j52149j32630p3447K5570K4174M048k0607l2975J626o5236n2656
13651B46178n461K3656K976k58r7663J9783O1988n2725p7319k3381L1942l104
$$ y = [250592, 214361, 188303, 204008, 224316, 177448, 169849, 195059, 182234, 161145, 197536, 200328, 206632, 242671, 274906, 271871, 293725, 371083, 466220, 587471, 658978, 666714, 579881, 495156, 387271, 278221, 246481, 308806, 299204, 279060, 286479, 256714, 213099, 208501, 248973, 188639, 146672, 164220, 165040, 157290, 168506, 207861, 253005, 269897, 297802, 319054, 302438, 296568, 328504, 358873, 409583, 448265, 422791, 402102, 456190, 507174, 559290, 588123, 604480, 622782, 766831, 862080, 915095, 1042712, 1245704, 1405877, 1357541, 1117620, 891959, 720460, 568311, 435681, 362234, 387804, 411978, 416026, 395419, 362444, 364070, 298834, 246178, 240717, 264373, 267349, 267091, 169428, 189211, 251199, 198474, 121155, 97774, 129716, 126612]
13639A26612l0757p055J5368k572K5515K424M0750M6721Q196M1101O4720N2186
13627C83209N572J43055J46721J78310K00662J41663O5014q9014k37512k68286
13617F69394j92648p7842r8632k3174j4098o8793o2478o8288k8550N520L5203
13606G5614j171j9382j4539R230J8449M0587M0881l3623R230l1931n4769n3645
13594a5069O9662O2846j1954p0333m1214k1563k063M1196N0810J8906n777j0425
13582F5022P3265J26907N3253J04276O9307P6799j6596m2535o8215p6605o2891
13571C01987p0215n4031l6625j8285k1851J0423n6550L2796R0N172M559P220j9414
13558H5276N7026M8488O4264k1379n2015l6331k6230l3793j5800J6251L3309K6678
$$ y = [126612, 95855, 88800, 104168, 101596, 127111, 129535, 170285, 217006, 225202, 266303, 331023, 383209, 388781, 531836, 678557, 856867, 1057529, 1199192, 1264206, 1175192, 937680, 669394, 476746, 398904, 300272, 277098, 263000, 194207, 131729, 63441, 34891, 40411, 75614, 74443, 55061, 40522, 49752, 68201, 108788, 149669, 116046, 125276, 93345, 38576, -15069, 54593, 117439, 105485, 35152, -6062, -27625, -29688, 11508, 62318, 81224, 75447, 65022, 138287, 265194, 318447, 422723, 492030, 568829, 552233, 509698, 441483, 364878, 301987, 231772, 177741, 141116, 122831, 100980, 111403, 54853, 87649, 87739, 92911, 97470, 104690, 85276, 142302, 190790, 255054, 233675, 181660, 145329, 119099, 85306, 69506, 85757, 119066, 145744]
13546A45744n9987j2193n0405L1066O7721l6518q5214J2869K1034K4916l413q158
13534D7462o1045l8604N3423J4311K1162N1432J7128j4535n147l5420l3421O0860
13522G7606N0100N2881k9672o6529k1416O3821R6220m5682m5142k325j6302N7133
13510A70693P5009m9690n8863j2473j1144L5537L6162N5003P7046r536o8390j7250
13498B22104L8827j7584m3374P7389N9103j9661j4450r7024j7984M7024j9432
13487B14938J0261J1517j5824l0472l127r478L6840K2942L235R266l2663k7903
13475A89532j6585k9894K4504l5615O1269N7691m035j958O3941K102j987M0835
13463C49800L0979Q5798O4487l3082J9848K3909M7110K09j6094j02998m8882j6816
$$ y = [145744, 85757, 73564, 23159, 54225, 121946, 85428, 214, 13083, 34117, 59033, 55620, 47462, -13583, -52187, 1236, 15547, 36709, 88141, 105269, 90734, 85587, 50167, 16746, 77606, 127706, 180587, 150915, 84386, 62970, 126791, 223011, 177329, 132187, 129862, 113560, 170693, 245702, 196012, 137149, 124676, 113532, 149069, 185231, 240234, 317280, 307744, 239354, 222104, 260931, 243347, 199973, 277362, 336465, 316804, 302354, 205330, 187346, 234370, 214938, 225199, 236716, 220892, 190420, 187293, 177815, 214655, 237597, 240832, 250098, 217435, 189532, 172947, 143053, 167557, 131942, 193211, 250902, 246867, 244909, 308850, 310952, 308965, 349800, 380779, 466577, 531064, 497982, 517830, 541739, 588849, 589058, 572964, 469966, 421084, 404268]
13451D04268l134k4971j1382L7812K9073J4545K4691k4075o7500k2051j405J6340
13439C72211k8334k7580j7595M885J9215N0206L1157j5699J7258l2053m1442n418
13427C26811K96L5781l7091J9939N1159l8513r3061L408Q5066O7737J34211P0666
13415F26409P1116O4465L5882M9010l398m6009k5351J8729l6736k1215j3627l6562
13403F82713N3021N9294k76j4657Q7536P8219j9843M4272L9511O8558N5200k9766
13391A103782l2260K6127M9054N5971Q4291O0341j143M4736Q1795J29875J52036
13380A754605J21283J76031J46681J40416K05760K14421J47811K48466K35831
13371C391305K62985L86396M26021M49901M80388N37472P15394Q72903J026537
$$ y = [404268, 401134, 376163, 364781, 402593, 431666, 446211, 470902, 446827, 379327, 357276, 355871, 372211, 343877, 316297, 298702, 303587, 322802, 373008, 404165, 388466, 405724, 373671, 332229, 326811, 327107, 362888, 325797, 345736, 396895, 358382, 265321, 268729, 353795, 421532, 555743, 626409, 697525, 761990, 797872, 846882, 843484, 797475, 772124, 790853, 754117, 732902, 719275, 682713, 735734, 795028, 794752, 780095, 867631, 945850, 926007, 970279, 1009790, 1078348, 1133548, 1103782, 1071522, 1097649, 1146703, 1202674, 1286965, 1347306, 1346163, 1390899, 1472694, 1602569, 1754605, 1875888, 2051919, 2198600, 2339016, 2544776, 2759197, 2907008, 3155474, 3391305, 3654290, 4040686, 4466707, 4916608, 5396996, 5934468, 6649862, 7522765, 8549302]
13362H549302J282841J700917K168318K576131K851878L071887L140471L021663
13354B8363408K516745K053105J562315J202863R83233Q53965O82732M75674m2221
13345C8651819o09807j218068j674542j969602j935883j554155r95704k28498
13337B8465560O34164J443312K362128L369161M372948N394222O080247O249244
13329E8370986N986279N381311M534675L440691K159136Q46903n20254j795302
13321G8404425k719419l311731l854443m523541n265184n677208n582847n045514
13313D2424538m166790l069757j947527r85708j0817P95158J547030K110630K266397
13304C8963154K163681J711426R88195K96717k77074o72866q48439q98527r48493
$$ y = [8549302, 9832143, 11533060, 13701378, 16277509, 19129387, 22201274, 25341745, 28363408, 30880153, 32933258, 34495573, 35698436, 36681669, 37535634, 38218366, 38694040, 38651819, 38042012, 36823944, 35149402, 33179800, 31243917, 29689762, 28694058, 28465560, 29099724, 30543036, 32905164, 36274325, 40647273, 46041495, 52121742, 58370986, 64357265, 69738576, 74273251, 77713942, 79873078, 80719981, 80199727, 78404425, 75685006, 72373275, 68518832, 63995291, 58730107, 53052899, 47470052, 42424538, 38257748, 35187991, 33240464, 32254756, 32243939, 33039097, 34586127, 36696757, 38963154, 41126835, 42838261, 43826456, 44123173, 43846099, 43173233, 42324794, 41426267, 40477774]
13295D0477774j030075j215616j474667j885730k456653k777338k812366k628632
13287B4196697k283662j834612j455983j053361p39484l75714j2501L31291O16500
13278A7389171R66856J450628J909841K395831K753265L030735L119175K930233
13270C5945735K549127K087794J692664J412512J308043J324447J455775J483565
13262D9259662J264338R34608M81889Q0081j01664J88041J204064L245865O329697
13253F2886581R869504J2741531J4394300J4229657Q883621j735644r425245r190870
13245A02653435n166887j759346M48P50959J026427Q98518K81323q27277k075580
13236I5782020l415615m598010n516549o221425o659169o613073o167654n322152
$$ y = [40477774, 39447699, 38232083, 36757416, 34871686, 32415033, 29637695, 26825329, 24196697, 21913035, 20078423, 18622440, 17569079, 16829595, 16453881, 16441380, 16772671, 17389171, 18356027, 19806655, 21716496, 24112327, 26865592, 29896327, 33015502, 35945735, 38494862, 40582656, 42275320, 43687832, 44995875, 46320322, 47776097, 49259662, 50524000, 51458608, 51940497, 52020578, 51918914, 52106955, 53311019, 56556884, 62886581, 72756085, 85497616, 99891916, 114121573, 123005194, 121269550, 111844305, 102653435, 97486548, 95727202, 95727650, 96478609, 97505036, 98403554, 98684877, 97857600, 95782020, 92366405, 87768395, 82251846, 76030421, 69371252, 62758179, 56590525, 51268373]
13228E1268373m123378k885754j765001o03664L94948J269017K105602K722908
13220D8383051L104438L339890L236628K930810K705979K828294L382605M412530
13212G4324225O024150Q719258J2966809J9378579K7290106L3641240L5850597
13205B18194964L4137043J9966648j6406712n1052123n5673967m1007063k6460771
13198H1698019j6893410j1120197p684601n571470m363680l647465l261555k743579
13190B6412062k163681j654136j372874j122029r34804q11320o65573n02117l82127
13181A6803401l46313j40387J4715J41029L05207N36522O56874R33297J325211
13172B0229556J739249K155602K815561L647612M960420O682377R284003J3599339
$$ y = [51268373, 47144995, 44259241, 42494240, 41890576, 42285524, 43554541, 45660143, 48383051, 51487489, 54827379, 58064007, 60994817, 63700796, 66529090, 69911695, 74324225, 80348375, 89067633, 102034442, 121413021, 148703127, 182344367, 218194964, 252332007, 272298655, 255891943, 204839820, 149165853, 108158790, 81698019, 64804609, 53684412, 45999811, 40428341, 36064661, 32417196, 29155641, 26412062, 24248381, 22594245, 21221371, 20099342, 19164538, 18353218, 17687645, 17185528, 16803401, 16457088, 16316701, 16331416, 16472445, 16777652, 17314174, 17971048, 18904345, 20229556, 21968805, 24124407, 26939968, 30587580, 35548000, 42230377, 51514380, 65113719]
13164F5113719K0217119K8622911L6153559L9486680L8631298K7421880o500926
13157B49146240m5522658n6337885m3296353k7966610j7554954j1276411p532591
13150C9658778n282969m022980l403338l033198k621163k078867j579477j277751
13142A6359035j031666r70106q12033o40331n48197n43005m72773l18033k51389
13133A0771502k01647j37187l2403O994J87162L22409M42226O06521Q31395J113994
13123A3910966J561257K147734K950815M351024O424528Q983159J1416603J2698925
13115F4445011J2510685R099409q68479j3024445j7733599j4843673j0240522
13108B9344387o632348m289847k837732j951166j474098j273880j170918r48180
$$ y = [65113719, 85330838, 113953749, 150107308, 189593988, 228225286, 255647166, 249146240, 203623582, 147285697, 103989344, 76022734, 58467780, 47191369, 39658778, 34375809, 30352829, 26949491, 23916293, 21295130, 19216263, 17636786, 16359035, 15327369, 14357263, 13545230, 12904899, 12356702, 11813697, 11340924, 11022891, 10771502, 10569855, 10432668, 10400265, 10407259, 10594421, 10916830, 11359056, 11965577, 12796972, 13910966, 15472223, 17619957, 20570772, 24921796, 31346324, 40329483, 51746086, 64445011, 76955696, 86055105, 85186626, 72162181, 54428582, 39584909, 29344387, 22712039, 18422192, 15584460, 13633294, 12159196, 10885316, 9714398, 8766218]
13100H766218p48066o07405n40934m57098l99324l36851l39481l22413k36450
13091D778196j84534k20216j96826j67781j14382j47857j26193j35136j48347
13082C336924j05053q0845q8253r3342k6851n2014o8712q2859j27281j18000j35736
13071B357978j9851p4572n4307j06771p8406j7776l6480r0528O781O625l9749
13060A852944o7917p3823k0786K4026k1093m3262m5204K2022r507j2547k8119
13049A576734p0635q7032l2929m286o8508r561n1243o6712n5989m1185L4947j1265
13037A112336k6989Q811M4255J0873M5399p997l3739j2464J3943q6550j73348
13026H94530j07242l368J2241n5473m1551M919j0605Q572q238j898r1138j13573
$$ y = [8766218, 8018152, 7410747, 6869813, 6412715, 6013391, 5676540, 5337059, 5014646, 4778196, 4593662, 4373446, 4176620, 4008839, 3894457, 3746600, 3620407, 3485271, 3336924, 3231871, 3151026, 3062773, 2969431, 2942580, 2890566, 2821854, 2738995, 2611714, 2493714, 2357978, 2338127, 2263555, 2209248, 2102477, 2024071, 2006295, 1969815, 1879287, 1886068, 1892693, 1852944, 1785027, 1711204, 1690418, 1714444, 1693351, 1650089, 1604885, 1626907, 1617400, 1604853, 1576734, 1506099, 1419067, 1386138, 1381852, 1313344, 1303783, 1252540, 1185828, 1129839, 1088654, 1123601, 1112336, 1085347, 1094158, 1138413, 1149286, 1194685, 1186688, 1152949, 1140485, 1154428, 1067878, 894530, 787288, 783920, 796161, 740688, 699137, 704056, 693451, 702023, 693785, 691887, 600749, 487176]
13014D87176J2141J253K2760O1949L688l7884K7123M6790P078k5202J3919r580
13002F11211j4017l0809j6705Q079j4253l1115K997l4412o4043m645L5230L8502
12990D86020K7576L9985j6510K2168j0317j8159l0850L9485K3173l4472r1432
12979D36667m018N1154K0669R828m8010r5307o9052n0153l5372L384J7768M5661
12967B83219M7493P0935o3264q5742M266M2162K4096L1080L5239k4058o9676j2959
12955B82791J3742K326l9387J394Q204m5170m909M3673l5579j7472M9484M9503
12943C08600r501o3751J1035j5204k5860O519J9211k2085L2886N6823J3346l5002
12931B77017k3133J9812m8058l115l093J0978m987k4355o3424j1087N2259o475
$$ y = [487176, 499317, 500570, 523330, 585279, 588967, 551083, 578206, 624996, 632074, 606872, 620791, 611211, 597194, 566385, 549680, 557759, 543506, 512391, 515388, 480976, 416933, 412288, 447518, 486020, 513596, 553581, 537071, 559239, 548922, 530763, 499913, 539398, 562571, 528099, 436667, 432649, 483803, 504472, 514300, 466290, 370983, 301931, 251778, 216406, 219790, 237558, 283219, 330712, 401647, 338383, 252641, 256907, 299069, 323165, 354245, 389484, 365426, 295750, 282791, 296533, 298859, 259472, 260866, 269070, 223900, 218991, 262664, 227085, 209613, 259097, 308600, 299099, 235348, 246383, 231179, 205319, 211838, 231049, 208964, 241850, 298673, 312019, 277017, 253884, 273696, 225638, 222523, 219430, 230408, 225421, 201066, 137642, 126555, 178814, 172339]
12919A72339l6766J7125K3531J4600M5305N6957J7613K2895j7830J7466K0466
12908C53701K9771J0635k1636k0831K5825k8659q534P5437N6794M326j7538j4976
12896D44315k658L1300p2684k1691K2943K8829J01035k1762m2890j3073P324M659
12884D65647K2092K0233K3102k3402k0026n6270K1872j0091L0793J8354n8117
12873D34187J0700K9911k2581l3122m9919l4598M5771N073K8504O0995m6303L966
12861D32584j1107j2623j2632k1176j5569j4625R325K6412J1569l0707k4721l4126
12849C02604k859L4575L0788K0037L2441j3549m6391N062p5770l5360L9473m5441
12837B45610n65r664o2299k7015K2792O5563J3407O1038N3377n070J3647R283
$$ y = [172339, 135573, 152698, 176229, 190829, 236134, 293091, 310704, 333599, 315769, 333235, 353701, 383472, 394107, 372471, 351640, 377465, 348806, 340272, 415709, 472503, 476829, 459291, 444315, 441657, 472957, 400273, 378582, 401525, 430354, 531389, 509627, 466737, 453664, 460988, 465647, 487739, 507972, 531074, 507672, 487646, 431376, 453248, 443157, 473950, 492304, 434187, 444887, 474798, 452217, 419095, 369176, 334578, 380349, 385422, 413926, 474921, 428618, 432584, 421477, 408854, 396222, 375046, 359477, 344852, 354177, 380589, 392158, 361451, 336730, 302604, 299745, 334320, 365108, 385145, 417586, 404037, 357646, 362708, 286938, 251578, 291051, 245610, 245045, 235381, 173082, 146067, 168859, 234422, 247829, 308867, 362244, 357174, 370821, 380104]
12825C80104p380j6327J455m6124k3178R371l747O055M7697M5430m0980k2991
12813C29385m7264J6956O4760j5342l9616L9493M5327l5098k750J7312M4845L8701
12801D56709P0803M0533j7602k2017K950L5709K7940n6742l3334J814J5080M9764
12789E71607r5M0731m4636j9678k9542l1768q505Q146P9807O8276J710M513k2417
12776F18149l4040n8543j12977r6127m6750p317J9074L8194J5551j3566j8653
12765C02995L05K3757j9946o1274m3326l1930L6468J5862K1224k446j129l9916
12753B00644k9032j4612j4988J2426P485Q642J5152K4472L0643J2716j2587O945
12741B47906J5754M2733O9230J32948J33438K30705K21980J16589R8520n3639
$$ y = [380104, 372724, 356397, 357852, 311728, 288550, 297921, 294174, 300229, 347926, 393356, 352376, 329385, 282121, 299077, 363837, 348495, 308879, 348372, 393699, 358601, 355851, 373163, 418008, 456709, 527512, 568045, 550443, 528426, 531376, 567085, 595025, 538283, 504949, 506763, 521843, 571607, 571512, 612243, 567607, 547929, 518387, 486619, 478114, 486260, 566067, 634343, 636053, 640566, 618149, 584109, 525566, 412589, 316462, 269712, 262395, 281469, 319663, 335214, 321648, 302995, 303300, 327057, 307111, 245837, 202511, 170581, 207049, 222911, 244135, 241689, 240560, 200644, 171612, 157000, 142012, 154438, 161923, 170565, 185717, 210189, 240832, 253548, 240961, 247906, 263660, 306393, 375623, 508571, 642009, 872714, 1094694, 1211283, 1309803, 1256164]
12731A256164k19143k85255k07210j38004p7247r1662m3919J0708P637l6853l1481
12720A43735l2814j8609K0697m2562n97J8587l1108j4953L5180j0776K1650L0428
12708A18858P094R809k8142Q619K6464j3848n315L6797K5935J2305O1619O6202
12696C26397J6023k7606O7269J28077J27930J60958J44411J51637J71666l7348
12686A229414j87738k36004k77575j09205m1948o6464N741l8896q9410m3732J9426
12675A63609L9979j4446m5316n3626L2687j1646l477O37m3653K737O593l006j2630
12662E8442N40R3436K6718o2122J1947n304k3317O506m3532m2496J2332K2674
12650E5824P0562L5061M4630J3683K8492M2098O2367L6383j2859L5089n7724j08429
$$ y = [1256164, 1037021, 751766, 544556, 406552, 329305, 237643, 193724, 204432, 212069, 175216, 143735, 110921, 92312, 113009, 70447, 69850, 88437, 57329, 42376, 77556, 66780, 88430, 118858, 125952, 135761, 107619, 116238, 142702, 128854, 123539, 160336, 186271, 198576, 260195, 326397, 342420, 314814, 382083, 510160, 638090, 799048, 943459, 1095096, 1266762, 1229414, 1041676, 805672, 528097, 418892, 376944, 310480, 316221, 277325, 187915, 144183, 163609, 203588, 189142, 143826, 90200, 122887, 111241, 107764, 108401, 64748, 67485, 74078, 71072, 58442, 58982, 152418, 179136, 117014, 128961, 123657, 100340, 106846, 63314, 20818, 33150, 55824, 126386, 161447, 206077, 219760, 248252, 290350, 352717, 389100, 376241, 411330, 353606, 245177]
12638B45177r3767o4017l0212k7367N5296Q8766n706r6975o6385J3555M8570J2180
12626G9115l9167j1887j4358k7047J1896k7083l9154N6117K7157m2449J621K1608
12614c631K2133p562Q971N773j4508K088J2462j1072L873K9800p24k9188l0096
12601a1681K2398L3998J6319m2028J4205J2173k3859j3661n9821l2671l303M3985
12589d3946N1905l0792k0981N7729L7416J2569j8495Q922J6840P680K0602J2333
12577A11782p4778n3106q193M8338N4113k5935l534M7058M1518k2074P345m2659
12565G9875o0920K1411L8382N271k4440o016J0559l6771r151k629m615n3188m4013
12552h6245J2206m245k4824J3708K6771N8143L7416J2409M0012K0865M872N7027
$$ y = [245177, 151410, 87393, 57181, 29814, 85110, 173876, 168170, 71195, 4810, 18365, 66935, 79115, 39948, 28061, 13703, -13344, -1448, -28531, -67685, -11568, 15589, -26860, -25239, -3631, 18502, 10940, 19911, 25684, 11176, 13264, 25726, 14654, 18527, 48327, 47603, 18415, -11681, 10717, 44715, 61034, 19006, 33211, 45384, 21525, 7864, -51957, -84628, -87931, -43946, 7959, -22833, -43814, 13915, 51331, 63900, 45405, 54327, 71167, 78847, 99449, 111782, 37004, -16102, -24295, 24043, 78156, 52221, 48687, 95745, 137263, 115189, 122534, 79875, 18955, 40366, 78748, 84019, 59579, 53563, 64122, 27351, 18200, 15571, 10956, -42232, -86245, -74039, -78284, -103108, -89400, -62629, -4486, 32930, 45339, 85351, 106216, 111088, 168115]
12540A68115J5648j6065j6567l6833m2709m2397L607N1484N9026J6626J224j1729
12528A49430J6314l1631o0902j9203O1305J4514n2101m4778K9413K3019N401l0775
12516F0006L3332K2738o6934L0610J8578J8065l2705k7576j2130l8835K3253K9285
12504E7687j1357J1197M557r068O248K5901K7362p938l7288k7716r92O5565M2113
12491A46271k7035m4833K8000m229n8985N867n1375m2191O5224O2005N4015m9900
12479H2834J1594K3601m826J7623O5467M8039Q7203Q8193R9944J70738K47735
12468I38145K17047J82071L4934k39055l03600k66993j72738j30041r8390l8588
12458A22792j2033j04273l8127K1915n8882L3064M8949J6644j8038k5710L8663
$$ y = [168115, 183763, 167698, 151131, 114298, 71589, 29192, 32799, 84283, 143309, 159935, 161159, 149430, 165744, 134113, 73211, 54008, 115313, 129827, 77726, 32948, 62361, 85380, 90781, 60006, 93338, 116076, 49142, 79752, 98330, 116395, 83690, 56114, 43984, 5149, 28402, 57687, 46330, 57527, 62084, 53016, 59264, 85165, 112527, 104589, 67301, 39585, 38593, 104158, 146271, 119236, 74403, 102403, 98174, 39189, 45056, -6319, -48510, 16714, 78719, 132734, 82834, 94428, 118029, 113203, 130826, 196293, 244332, 331535, 419728, 519672, 690410, 938145, 1155192, 1337263, 1372197, 1133142, 829542, 562549, 389811, 259770, 161380, 122792, 110759, 6486, -31641, -9726, -68608, -35544, 13405, 30049, 12011, -13699, 24964]
12447B4964j9607K286P6305j1984n3861j678L0879N8046k3998k2188k5757k312
12435C1095L1761j803l6269n6663q542o217L8483j0568O8351r212J0405J6661
12423F7482j4653k9381q353p1069m43L5452n4318L14l84k4162J8478O9254n05
12410a2288k2106l060p475L139L9965q611j6442J5331L2357J7180N040L685p687
12397C9028k5328n0865J54L1521J914M3732P1178k610l8176r1882j0792K8007
12385d119R964J0979K07l6396K866L4744J79K4907M9481l32o2952k5025N8695
12372F3198P073K8032j0127k2277l575m8466o3803M6909K9889n8340K8399k4463
12360b7551l7639K3210L5803L921N4178L8582J70l3392k9651j4528J6769J364
$$ y = [24964, 5357, 7643, 83948, 71964, 18103, 16425, 47304, 105350, 81352, 59164, 33407, 31095, 62856, 61053, 24784, -31879, -40421, -46638, -8155, -18723, 49628, 40416, 50821, 67482, 52829, 23448, 15095, -55974, -56417, -20965, -75283, -74969, -75353, -99515, -81037, -11783, -12288, -34394, -37454, -44929, -41790, -1825, -10436, -26878, -11547, 20810, 37990, 43030, 46715, 39028, 13700, -37165, -37011, -5490, -3576, 40156, 111334, 108724, 70548, -21334, -32126, -4119, 5845, 16824, 17031, -19365, -16499, 18245, 18424, 43331, 92812, 92480, 29528, 4503, 63198, 70271, 98303, 88176, 65899, 62324, 13858, -49945, -3036, 26853, -31487, -3088, -27551, -65190, -41980, -6177, -2256, 51922, 90504, 90674, 57282, 27631, 13103, 29872, 31236]
12348C1236n6425j2943K0894n550k4864q760K1627M0900J6567m2361o3451k9196
12336a12326J9093O6215R2821J558j9579p2935J6861P3389K4842o1338k116r324
12324A7161k9177K3180j3044Q668J3045l015o901K5233j6568n96n0983l8097m5247
12311a16341j079P0898N2738K7840Q965m9632m3905J9244q393o9003O521M7507
12299e4640m1501J375K2475M6629j2529m0120M8208K1043J4307P454k1480j9345
12287b8124J33k9360L0099M4639O1548O518j3031m1454R68J8367K9178l4067k8926
12274A6488n0292k1985P7011K1984k3204k6611Q6315J4396o5048l2597l0414l623
12262c7580O5707J1669o7307o0100k5535Q3490N4848p957p4031l451K9271P0468
$$ y = [31236, -25189, -38132, -17238, -22788, -47652, -56412, -34785, 6115, 22682, -19679, -83130, -112326, -93233, -27018, 65803, 67361, 47782, -25153, -8292, 65097, 89939, 28601, 26485, 17161, -12016, 11164, -1880, 6788, 19833, 16818, 9917, 35150, 18582, 17986, -32997, -71094, -116341, -117420, -46522, 6216, 34056, 43021, -6611, -50516, -31272, -39665, -108668, -102147, -54640, -96141, -94766, -72291, -25662, -38191, -78311, -30103, -9060, 5247, 12701, -8779, -28124, -27991, -57351, -27252, 17387, 78935, 85453, 72422, 30968, 31936, 50303, 79481, 45414, 16488, -33804, -55789, 21222, 43206, 20002, -6609, 79706, 94102, 29054, -3543, -33957, -37580, 28127, 39796, -27511, -87611, -113146, -29656, 25192, 17235, -56796, -60247, -30976, 39492]
12250C9492K2917q342m4656m6873M1021o892K320k2903K8137q679l3717M0536
12238B361M6200L0541J1923n7558m7967m441l7553J8421N0997n5586k7582K8028
12226d2216m750M9292O2761k3694K40N70l3008j2879l5988K4027K9549m573P960
12213A7291n384o739m8648K1351N2842K8780j9179k6005M961K7261k825L39m5709
12200a664k6507M1845Q360m8375J5371L873j6704k6396j3590L3843l7783J0620
12188e7107K3518m0717J7238P1550O339q521Q266L0589p1791J4955k0129L1265
12176E455O3076n730p0395j6699O1293J8842m3995j5851l9080m0076L3620K6151
12164b3389M5578o433j7774L764J8576J6345m4570r914j3990J5410O445R047q566
$$ y = [39492, 62409, 54067, 9411, -37462, 3559, -3333, -1013, -23916, 4221, -4458, -38175, 2361, 48561, 79102, 91025, 33467, -14500, -18941, -56494, -38073, 12924, -42662, -70244, -42216, -46966, 2326, 65087, 41393, 41633, 42203, 9195, -3684, -39672, -15645, 13904, 9331, 17291, 11907, 5168, -43480, -22129, 30713, 59493, 40314, 14309, 19270, 46531, 43706, 44045, -1664, -28171, 13674, 22034, -26341, -10970, -7097, -23801, -50197, -63787, -29944, -67727, -57107, -33589, -74306, -57068, 14482, 20821, 12300, 20566, 51155, -20636, -5681, -25810, 5455, 68531, 62801, -7594, -24293, 37000, 55842, 11847, -4004, -43084, -83160, -49540, -23389, 22189, 15756, -2018, 1746, 20322, 36667, -7903, -17817, -31807, -16397, -9952, -905, -9471]
12151i471k3997n93j5598k9531L467n727N9339L5857j8720K1044j6599L705n544
12138b368P757p8883k1605P7858L5646k1302j483M0891L1186k362m486k8276m7637
12125a5064j9435J9263N9447k5405q333N113j4793l3059l5599O057M3955k887
12113b0740Q709l3703J952K4564R463L2696k9211k0429L234k6336j1614J9496
12101d1919k5798K7708N4323M4786N1203p7707n4334Q147O0250j0852n1014N18
12089a4689q872k2230l7652L2280Q6228P4577M416m8384j9423m0446n2851O235
12077d0811k6152L8012L4017r622j3913k2045l5001q019P2902K7589P04j8953
12065a292M32L0375L511q785J6615M6986k3775m5552n6227k4415K5925L7834K5402
$$ y = [-9471, -33468, -34061, -49659, -79190, -75723, -81450, -22111, 13746, -4974, 16070, -529, 3176, -2368, 5389, -73494, -95099, -17241, 18405, -2897, -4380, 36511, 67697, 65335, 60849, 32573, -15064, -34499, -15236, 44211, 18806, 10473, 15586, 793, -32266, -67865, -61808, -17853, -20740, -12031, -45734, -43782, -19218, -9755, 22941, -6270, -26699, -23465, -49801, -61415, -41919, -67717, -40009, 14314, 59100, 110303, 32596, -21738, -13591, 46659, 35807, -15207, -14689, -23561, -45791, -83443, -51163, 35065, 109642, 114058, 65674, 46251, 5805, -47046, -40811, -66963, -28951, 5066, -4556, -18469, -40514, -75515, -83534, -10632, 16957, 17661, -1292, -860, 29515, 33026, 24241, 40856, 87842, 64067, 18515, -37712, -62127, -36202, 1632, 27034]
12052B7034n973m8323K3953j0111q69R289L2894L1845K211m7686j0025K3916j0994
12039A7161m4609r740J222K6446P8242M259r064K2114n7220r3235k4341j8024
12027a06789K3403O7604L391N6525J0076O020o2073m9017K931k4757N629l6633
12015a03690M7229K1459Q889k4526K5243M5442j6607k1841l2287P206P0627N9624
12003H6768j7970n2541q538p082K1797O0876J1197m1800k4080p870j3038j0199
11991b480R504k4897L006r038J0553K842N8504M6131k8105k1147m9806j2785l488
11978b1206L9166n5801Q404o709j9105J1399m095l2248j5858j6122o31P204N3470
11965e2132O72K2297J8039o8899K761M4833O8444M7843J6186l4231k9199l3280
$$ y = [27034, 21061, -27262, -3309, -13420, -14289, -5000, 27894, 59739, 61950, 14264, 4239, 28155, 17161, -27448, -37188, -35966, -9520, 68722, 72981, 63917, 86031, 28811, -64424, -88765, -106789, -83386, -15782, -12391, 44134, 54210, 60230, -1843, -50860, -47929, -72686, -67057, -103690, -56461, -35002, -26113, -50639, -25396, 20046, 3439, -18402, -50689, -43483, 27144, 86768, 68798, 16257, 7719, 637, 22434, 83310, 94507, 52707, 28627, 20757, 7719, -2480, 7024, -17873, -14867, -23905, -13352, -10510, 47994, 94125, 66020, 44873, -4933, -17718, -21206, 17960, -37841, -29437, -36146, -55251, -43852, -47947, -80195, -96053, -112175, -112806, -105602, -52132, -51460, -29163, -11124, -80023, -77262, -32429, 36015, 83858, 100044, 65813, 36614, 3334]
11953C334J3489K5273k4813K1818R040j5760o4346k0415L2112O1122M7321N9044
11941A47219K9114k9913j6027K3453P8944L0894j3485o5490k9355l8508j5092
11930A01754j0133j9404N087N2201P7991O22k5533J6374j0187P210J9248J7579
11918B32809K1068M3909K4131n3550q5828q1957M507K5800k7033l5607K0286L1120
11906A19655n3959m3390l1778M0079k9573j7384k4712k74l4159p460l561Q436
11894g8080N2395k2569q630P0630J3913o6557k217M5607k3941o4527J5271K1705
11882d7000Q641J7657R511J254N2221K4329N4757M3821l0851K3932k9420n5064
11870G3788M5445M6491P2949R4285L5136J5225K4265k7935n4703l8579j5727R564
$$ y = [3334, 16823, 42096, 17283, 39101, 48141, 32381, -31965, -52380, -20268, 40854, 88175, 147219, 176333, 146420, 130393, 153846, 232790, 263684, 250199, 184709, 155354, 116846, 101754, 91621, 72217, 77304, 129505, 207496, 208118, 182585, 198959, 188772, 195982, 215230, 232809, 253877, 297786, 321917, 268367, 182539, 100582, 105089, 130889, 103856, 68249, 88535, 119655, 65696, 22306, -9472, 30607, 1034, -16350, -41062, -41336, -75495, -82955, -86516, -78080, -25685, -48254, -56884, 13746, 27659, -38898, -41115, 4492, -19449, -83976, -68705, -47000, -38359, -20702, -11191, -9937, 42284, 66613, 121370, 165191, 134340, 158272, 128852, 73788, 119233, 165724, 238673, 332958, 368094, 383319, 407584, 379649, 324946, 286367, 270640, 280204]
11858B80204m3845m464k3761Q5637N3569N399n883N6284N0392O0697L1196k4881
11846E20544k4751j1785o720k1773q0346m3657n4044l0754M9473P7411k5631l0150
11834C17817R987K3959q004o9253n9527r93L3594l1991m0092m1348k2450j1503
11822A00196O746J2292n0163o7758m5587J6438P642j1104n687N8415L2419q466
11810D5383m9153q658k2666M4539K4521k0440l1378J2521J9727K6705K7278K5557
11798I3936j1198j04623K3283P131l4128m0188M7473P7876k579j801O3853J7601
11786A36636j7151j9553M0259M0629P7668J02756M614l4932k8471m2377m0418
11775B19660o8328J1094L2581k8046j8813Q825L412J6118L8822O1461R0205j1363
$$ y = [280204, 236359, 231895, 208134, 293771, 347340, 352739, 346856, 403140, 453532, 514229, 545425, 520544, 495793, 484008, 477288, 455515, 375169, 331512, 277468, 246714, 296187, 373598, 347967, 317817, 327804, 351763, 343759, 274506, 214979, 213986, 247580, 215589, 175497, 134149, 111699, 100196, 106942, 119234, 69071, 1313, -44274, -27836, -20194, -31298, -36985, 21430, 53849, 45383, -3770, -12428, -35094, 9445, 33966, 13526, -17852, -5331, 14396, 41101, 68379, 93936, 82738, -21885, 1398, 8529, -25599, -65787, -18314, 59562, 56983, 55182, 119035, 136636, 119485, 99932, 140191, 180820, 258488, 361244, 365858, 330926, 302455, 260078, 219660, 151332, 162426, 195007, 166961, 148148, 156973, 160385, 176503, 215325, 276786, 366991, 355628]
11763C55628j2548k5395j7468l3297l8637j8816j5036R253l3185j2285Q544L6128
11751B02886J8877o6190k8187N8592M1425j2710l2975O528m6892n3440K1672J939
11739A11525k0101K1961k7485K72o3254m070Q122Q561j7759k9440L6790J6445
11727D1567o290O2132K1388L4845j782k3732k9877j6182j7597o6505K1850N0103
11715F9920m822r583N4557j1012l4376J915j1212r896J2379j6401N4844O7655
11703A63968Q042o0413m8592R264P118r516M9392M7983k2742L6497k1542j3882
11691A45577L2997L9343m8853n1120R765m0779K1011K1389N260J9346K8573j1643
11679A70866k1341K1375k909j685j6120M7288r161K6716m04o013l7504k764M3696
$$ y = [355628, 343080, 317685, 300217, 266920, 228283, 209467, 194431, 203684, 170499, 158214, 166758, 202886, 221763, 155573, 127386, 185978, 227403, 214693, 181718, 188246, 141354, 87914, 109586, 111525, 91424, 113385, 85900, 86172, 22918, 18848, 26970, 35531, 17772, -11668, 25122, 41567, 35277, 97409, 118797, 153642, 151860, 128128, 98251, 82069, 64472, -2033, 19817, 69920, 65098, 55515, 110072, 99060, 64684, 66599, 55387, 45491, 57870, 41469, 96313, 163968, 172010, 111597, 63005, 72269, 79387, 69871, 119263, 167246, 144504, 181001, 159459, 145577, 178574, 217917, 169064, 117944, 127709, 86930, 107941, 129330, 134590, 153936, 182509, 170866, 149525, 170900, 167991, 166306, 150186, 197474, 188313, 215029, 214625, 208612, 171108, 168344, 212040]
11666B12040J4843j8570k1898j6420j811m6758k8872M32j8166J3756O2420r062
11654A41934k0568j3816P0203l2484k2806J8618p825J2983L2857o542j9267j4769
11642A38518l7944r573N2584m4753K4400Q1552k5870j1314p194j6894K8539l3089
11630A38962J7899Q41J6923n6492q231J9357K1947J2929q38J9195K6503J7343
11618B26338j5652j5109j4608j8198n105K4841J575n052J9928J2675j5700J4293
11606B10226J3044M1935L9872l0544l5844k4913J1619j1333j6921K1374k038Q81
11594B17358J3793j7777J3479M9129J8989j7529L6574O0163N9273L5895l4988
11583D34359p0636p2470K1010N2470N2485k0209q733N181J6059J8965L6318J0276
$$ y = [212040, 226883, 208313, 186415, 169995, 168184, 121426, 92554, 92986, 74820, 88576, 150996, 141934, 121366, 107550, 177753, 145269, 122463, 141081, 133256, 146239, 179096, 172554, 153287, 138518, 100574, 91001, 143585, 98832, 123232, 204784, 178914, 167600, 160406, 143512, 172051, 138962, 156861, 157702, 174625, 118133, 109902, 129259, 151206, 164135, 163297, 182492, 208995, 226338, 210686, 195577, 180969, 162771, 157666, 182507, 184082, 179030, 198958, 211633, 195933, 210226, 223270, 265205, 305077, 274533, 238689, 213776, 225395, 214062, 197141, 218515, 216477, 217358, 231151, 213374, 226853, 275982, 294971, 277442, 314016, 374179, 433452, 469347, 434359, 363723, 291253, 312263, 364733, 417218, 397009, 388276, 393457, 409516, 428481, 464799, 475075]
11571D75075Q839J6779L6783k4455N663O5304M7489L238J1782l302m0492N4091
11559F56794N2138L428N5546L9942L9028L3161N2327M9049O8670J8136j5867L6251
11547A088603P5993N1674J5890L1210O3729R3657K17677R5576O9735R1626R2391
11536A987761J07538Q0836J63683J74806J70146J74988K66396K63807L70563M32329
11526D192853N24502O91924Q65166J052854J266049J601004J973926K283354K751214
11517A7202846L363402M058492M763707N566575O188428O297820N448717L241718
11509E6131705k253l083034m891485n327225m963753m169229l136977k140694
11501B8417055j029866M6151J104785K192230L240368M159299M789788M960293
$$ y = [475075, 483914, 500693, 537476, 513021, 518684, 583988, 631477, 634715, 646497, 643195, 602703, 656794, 708932, 712360, 767906, 807848, 846876, 880037, 932364, 981413, 1050083, 1068219, 1052352, 1088603, 1164596, 1216270, 1232160, 1263370, 1327099, 1420756, 1638433, 1734009, 1803744, 1895370, 1987761, 2095299, 2176135, 2339818, 2514624, 2684770, 2859758, 3126154, 3389961, 3760524, 4192853, 4717355, 5409279, 6274445, 7327299, 8593348, 10194352, 12168278, 14451632, 17202846, 20566248, 24624740, 29388447, 34955022, 41143450, 47441270, 52889987, 56131705, 56129452, 53046418, 48154933, 42827708, 37863955, 33694726, 30557749, 28417055, 27387189, 27433340, 28538125, 30730355, 33970723, 38130022, 42919810, 47880103]
11493D7880103M515396L538768J925567n46818l212627n170398n853114n489021
11485C7587856m744133m226538l700912l283204k890683k466530k086505j659389
11477A2529962j288918r74040q47521o70178m92823l36467k77970k21023j72617
11468G248405j10362l9553O1079N1423L4253O881q74K1742J06141J07378J40971
11457G627484K79006M21961N56212O95299Q60221J073058J328896J638358J978621
11448A6459116K446392K977071L496805M095707M704247N423615O094910O439022
11440E2136885O351870N273779K919538J13865j864224k623522k392756j872441
11432E8042994r25932L79220K027460L922894N641809O970420P452773O486734
$$ y = [47880103, 52395499, 55934267, 57859834, 57313016, 54100389, 48929991, 43076877, 37587856, 32843723, 28617185, 24916273, 21633069, 18742386, 16275856, 14189351, 12529962, 11241044, 10267004, 9419483, 8749305, 8256482, 7920015, 7642045, 7421022, 7248405, 7138043, 7098490, 7159569, 7210992, 7245245, 7252126, 7251252, 7272994, 7379135, 7486513, 7627484, 7906490, 8328451, 8884663, 9579962, 10440183, 11513241, 12842137, 14480495, 16459116, 18905508, 21882579, 25379384, 29475091, 34179338, 39602953, 45697863, 52136885, 58488755, 63762534, 66682072, 66795937, 64931713, 62308191, 59915435, 58042994, 57117062, 57496282, 59523742, 63446636, 69088445, 76058865, 83511638, 89998372]
11424H9998372M395702K196256O95321j29014q45536k405836m907356p253967
11416H1743942q097207p060679n033198k817188r97849K72190J074695J337912
11408F0422618J248250O87493m25939k156386m165577n743420o139991n652758
11400C8074290m871192m138545l507336l073418k640235k217710j792268j454841
11392A4378745j175163r32929q00109p37609o07432m41494m02193k99462k54323
11383H728031j91984j66797j62046j16912j29807j07493j09912p3587p8647N5830
11373G646676Q6342K04061L12408M35641N62447O94240R01639J180953J600323
11364A3624730K054456K433531K854954L332221L716698M143977M570043M993723
$$ y = [89998372, 94394074, 96590330, 97285651, 97156637, 96311101, 93905265, 88997909, 81743942, 73646735, 66586056, 61552858, 58735670, 57737821, 58010011, 59084706, 60422618, 61670868, 62358361, 61932422, 59776036, 55610459, 49867039, 43727048, 38074290, 33203098, 29064553, 25557217, 22483799, 19843564, 17625854, 15833586, 14378745, 13203582, 12270653, 11470544, 10732935, 10125503, 9684009, 9281816, 8982354, 8728031, 8536047, 8369250, 8207204, 8090292, 7960485, 7852992, 7743080, 7669493, 7590846, 7646676, 7733018, 7937079, 8249487, 8685128, 9247575, 9941815, 10843454, 12024407, 13624730, 15679186, 18112717, 20967671, 24299892, 28016590, 32160567, 36730610, 41724333]
11356D1724333N240298M995890L854579J417528j599305m015953m959177m938752
11348D1719441m598230l957412l005173j888485p22080M04882J464649K531444
11340C1949036L591910M405894M882689M836094M280734K974127O68481k368803
11332E5220162n270286o860278o791694n805593m628523l648444k996364k565833
11324A6653147k093239j778532j576708j345953j134312r10313o55246n82955
11316F575889n14028m43406l66396l24682l00251k32856j60615j45797j48933
11307C938925k11635k09605j49742r6719j78748j93507j16040j16163j09750j05866
11297B451150p5279p3515q6379n0832l0955n8785q7458p0946q9574m3640k4429
$$ y = [41724333, 46964631, 51960521, 55815100, 57232628, 55633323, 51617370, 46658193, 41719441, 37121211, 33163799, 30158626, 28270141, 27548061, 27952943, 29417592, 31949036, 35540946, 39946840, 44829529, 49665623, 53946357, 56920484, 57588965, 55220162, 49949876, 43089598, 36297904, 30492311, 25863788, 22215344, 19218980, 16653147, 14559908, 12781376, 11204668, 9858715, 8724403, 7814090, 7158844, 6575889, 6061861, 5618455, 5252059, 4927377, 4627126, 4394270, 4233655, 4087858, 3938925, 3727290, 3517685, 3367943, 3271224, 3092476, 2898969, 2782929, 2666766, 2557016, 2451150, 2375871, 2302356, 2215977, 2165145, 2134190, 2075405, 1987947, 1917001, 1827427, 1783787, 1759358]
11286A759358j2175o5602q6885l2739o3724o8510m9586k9768k442m905o3710o1010
11274A218302j6519j6493q4056k5836O2857K4951k8754n3199m3100m4909J540
11263I94784o0207j3711L2781k0234m2228l6919l9662J502l2213n638Q110k5054
11251G61311j6460j0219o0740o9567n3154K1880j2652L8767M7300K3256q785m2819
11239F18118j1471m3564l0840K763l071n0482k308k6921L2283m205k709Q842O72
11226D87107R305K8219l606k6859n6817N2004n07l4501n854l0440o0699P118M2964
11213D07434r721R346j9548j1772k1751L3299k1882k7216o2186K4992K3716K7275
11201C51986j1154k4898k4182k2208m0808N1716J2740K5082j7248J2341l448k6777
$$ y = [1759358, 1747183, 1681581, 1594696, 1561957, 1498233, 1429723, 1380137, 1350369, 1347927, 1343022, 1279312, 1218302, 1201783, 1185290, 1101234, 1075398, 1138255, 1163206, 1134452, 1081253, 1038153, 993244, 994784, 934577, 920866, 953647, 933413, 891185, 854266, 814604, 816106, 783893, 778255, 786365, 761311, 744851, 734632, 673892, 604325, 551171, 573051, 560399, 599166, 646466, 669722, 660937, 618118, 606647, 563083, 532243, 535006, 531935, 481453, 479145, 452224, 484507, 480302, 477593, 486435, 487107, 496412, 524631, 521025, 494166, 437349, 489353, 488846, 454345, 448491, 418051, 357352, 364470, 407434, 397713, 407059, 387511, 375739, 353988, 387287, 365405, 338189, 276003, 300995, 324711, 351986, 340832, 315934, 291752, 269544, 228736, 280452, 293192, 318274, 301026, 313367, 309919, 283142]
11189B83142l9061k0815J2828q449O449k477l3883L6319R3033q567m4571J6215
11177B90163M081M6911L8334J759m0270o671O73l6723n5664J9180R727L1880k2107
11164B81273J5745k955r0738J7964N8249k0199q2431L9429j2009k1585Q00o534
11152A77009O6877O7396l6843j0670O7067o9495p2690M6485L167j0193n0877K431
11140A79664K697J0784N28k4846k7302k2712j2673L2001J7878M375Q619k2366
11128A46647M8825K3267L431o875o8888q54K4003L325m9194L0325L7513N4807
11116B46332m991n1401j4301K3990R536k2312M452L1810J0133q980k3511J6477
11104B17234P1588P143j06956o9406k8600J7889J5725k6276J9453K1996j7290
$$ y = [283142, 244081, 223266, 236094, 227645, 234094, 231617, 197734, 234053, 327086, 318519, 273948, 290163, 294244, 341155, 379489, 381248, 340978, 334307, 334980, 298257, 242593, 261773, 271500, 303380, 281273, 297018, 294063, 203325, 221289, 279538, 259339, 176908, 216337, 204328, 182743, 183543, 177009, 243886, 311282, 274439, 263769, 330836, 261341, 188651, 235136, 238303, 228110, 177233, 179664, 182361, 193145, 193673, 168827, 141525, 118813, 106140, 138141, 156019, 160394, 169013, 146647, 195472, 218739, 222170, 215295, 146407, 145553, 169556, 172881, 123687, 154012, 191525, 246332, 241341, 189940, 175639, 199629, 209165, 186853, 191305, 223115, 233248, 224268, 200757, 217234, 288822, 295965, 189009, 119603, 91003, 108892, 124617, 98341, 117794, 139790, 122500]
11093A22500K563l0846M4335R0950L8182L6463l2149M3099R5115L0419O2013P9155
11081E81799j6245l1324j894L2912j4453q5584k9261l6283n096l2560l910p013
11069C51088n1170J1571k7692P321P09k8997M9151L9663Q7103O1691J2325L310
11057E16073J7974j6090p1592p7666l5615j4804o4298l2175j9005r471j8388n1300
11045A23643l1829L1702P003J4992K4057K2632Q299O9167J7211l2122K791J0142
11033B67688J6699j7344m5530l8954K0440M1364J3614o0527m5725k7321n0390
11022G4014o613M0051J0902n708M8846R0634N1581k356K6075M0960K1536J0953
11010D00875L5899K0330k1785K6342N9688j1902M9898L4629o3842j19216j1909
$$ y = [122500, 125063, 94217, 138552, 229502, 267684, 304147, 271998, 315097, 410212, 440631, 502644, 581799, 565554, 534230, 532336, 565248, 550795, 465211, 435950, 399667, 394571, 362011, 358101, 351088, 299918, 311489, 283797, 291118, 291827, 262830, 311981, 351644, 438747, 500438, 512763, 516073, 534047, 517957, 446365, 368699, 333084, 318280, 253982, 221807, 202802, 193331, 174943, 123643, 91814, 123516, 130519, 145511, 169568, 192200, 200499, 269666, 286877, 254755, 257546, 267688, 284387, 267043, 221513, 182559, 202999, 244363, 257977, 197450, 151725, 124404, 74014, 67401, 107452, 118354, 112646, 161492, 252126, 303707, 301351, 327426, 368386, 389922, 400875, 436774, 457104, 435319, 461661, 521349, 509447, 559345, 593974, 530132, 410916, 399007]
10999C99007K9119L7881K3319k8376J1206N9989N8125K7787O26K3535K1834J1347
10987F75399l7156l7848M2757J5952l0408p4107q2037j3831o7520j1624N4976
10976D34553K1951k1811L13N8774L489k6333q3713j16842j08317l6377L4807r946
10964A50548J8343J0608k0462n5474k206k9802k3735K8704j3318j4302N0684L8050
10952A37638K6764R782l5887M1013M7695J1384m2281L948l9679m0467J28n9535
10940F0503L5563K9032l526k6460K6343j2678K4525K9907J124N5111K5042j4700
10928B29786n3577n8226j9595K8120M7737Q3043O5271J04142K3337R861q139P245
10916D59005n9620q9309l3842J0751q109L6686m6355k1972J9069l7653M5423N1084
$$ y = [399007, 428126, 466007, 489326, 460950, 472156, 532145, 590270, 618057, 618683, 642218, 664052, 675399, 638243, 600395, 643152, 659104, 628696, 554589, 472552, 458721, 391201, 379577, 434553, 456504, 434693, 435006, 493780, 497269, 470936, 387223, 270381, 162064, 125687, 160494, 150548, 168891, 179499, 159037, 103563, 101357, 71555, 47820, 76524, 63206, 48904, 99588, 137638, 164402, 174184, 138297, 179310, 227005, 238389, 196108, 200056, 160377, 119910, 120038, 60503, 96066, 125098, 121572, 95112, 121455, 108777, 133302, 163209, 164333, 219444, 244486, 229786, 176209, 117983, 98388, 126508, 174245, 257288, 322559, 426701, 450038, 459899, 451760, 459005, 399385, 310076, 276234, 286985, 278876, 315562, 269207, 247235, 266304, 228651, 274074, 325158]
10904C25158L8571O2821N0362k9884o4457m2759K832o7762p1732O139r228r222
10892A90839l4485k4174M0903Q816j0984o5028n9797k6094L9470M9184K2876j8523
10880A13003R215P918M7185j3104k0157m8744j6855k6231R582N6350P508j4652
10868A11018j0876K7312K5178j1108m7108N373J2914j8683j8368j1928O589m886
10856F5427J115j595J062K7673N0266j6234M729L5620M22j7752l0980P898l1479
10843I6172J3193L9428K0009K2835q137j0066L1549M826l7493L057J7498L6210
10831B29081L3329k8808q0102K9120K3814M3184n617n8126j3029O9369J1567l258
10819B50524l1748l2829j5677L273L4914K2409O1877K6348N2369l3756n6142J0909
$$ y = [325158, 363729, 426550, 476912, 447028, 382571, 339812, 342644, 274882, 203150, 209289, 200061, 190839, 156354, 132180, 173083, 181899, 170915, 105887, 46090, 19996, 59466, 108650, 131526, 113003, 122218, 130136, 177321, 164217, 144060, 95316, 78461, 52230, 61812, 118162, 125670, 111018, 100142, 127454, 152632, 141524, 94416, 99789, 112703, 94020, 75652, 63724, 70313, 65427, 66542, 64947, 66009, 93682, 143948, 127714, 132443, 168063, 168485, 150733, 119753, 127651, 96172, 109365, 148793, 168802, 191637, 183500, 173434, 204983, 209809, 172316, 175373, 192871, 229081, 262410, 233602, 153500, 182620, 206434, 249618, 244001, 185875, 172846, 242215, 253782, 250524, 218776, 185947, 170270, 173543, 208457, 230866, 292743, 319091, 371460, 337704, 281562, 292471]
10807B92471n4662M6204J9791M4390O4166M6260J8000K5538P6406Q2435o801J3823
10795F68021L5837L7928k1704Q4948J25692J15820J63968J21335K00170K43507
10785A775522K55716L01422M36992N50596P30837R35296J180664J391747J546739
10776I105531J560748J330683Q66155J66993o07095j214197j475040j433296j202721
10767G097761r08714o45463l97484j96057j16752K5733K24241L18225M26821M95428
10757F323739P76563J175330J613666K119587K586732L075593L377654L210999
10749B4259863K313412R53224p53363k214179l218028l506233l117403k469782
10741A2247511j919633j375462j006526p16179m52263k18632j17703q6804Q6931
$$ y = [292471, 237809, 284013, 303804, 348194, 412360, 458620, 476620, 502158, 578564, 660999, 654198, 668021, 703858, 741786, 720082, 805030, 930722, 1046542, 1210510, 1331845, 1532015, 1775522, 2031238, 2332660, 2769652, 3320248, 4051085, 4986381, 6167045, 7558792, 9105531, 10666279, 11996962, 12863117, 13030110, 12423015, 11208818, 9733778, 8300482, 7097761, 6189047, 5543584, 5146100, 4950043, 4833291, 4859024, 5083265, 5401490, 5828311, 6323739, 7100302, 8275632, 9889298, 12008885, 14595617, 17671210, 21048864, 24259863, 26573275, 27526499, 26773136, 24558957, 21340929, 17834696, 14717293, 12247511, 10327878, 8952416, 7945890, 7229711, 6777448, 6558816, 6441113, 6354309, 6441240]
10732F441240K44662L94425N87663Q68984J195975J477132J768509J853034J577623
10723A6409247R89566J60946p63159j440886j645584j608918j248561p61163k42493
10714I848995K01651N83062J141708J718306K326727K994349L481253L602363
10706B5898414L120125K062238L37282j555806l003479l675299l499493k894458
10698A6789524k212708j613588j023723n71988k18804N7803L24509N33715Q93460
10689A2958200J298868J814698K485149L408148M600378N895213P081269P740703
10681D7282626P241813N374670K118065j839119n423972p634398q069916p294108
10673C1755661n856951m398453l095972k138719j482048r68003p07588l62772
$$ y = [6441240, 6685902, 7080327, 7667990, 8536974, 9732949, 11210081, 12978590, 14831624, 16409247, 17398813, 17559759, 16796600, 15355714, 13710130, 12101212, 10852651, 10091488, 9848995, 10050646, 10633708, 11775416, 13493722, 15820449, 18814798, 22296051, 25898414, 29018539, 31080777, 31418059, 29862253, 26858774, 23183475, 19683982, 16789524, 14576816, 12963228, 11939505, 11367517, 11148713, 11206516, 11531025, 12064740, 12958200, 14257068, 16071766, 18556915, 21965063, 26565441, 32460654, 39541923, 47282626, 54524439, 59899109, 62017174, 60178055, 54754083, 47119685, 39049769, 31755661, 25898710, 21500257, 18404285, 16265566, 14783518, 13815515, 13107927, 12745155]
10665A2745155r8516Q3914M45454Q02571J225116J822627K413456K996988L490933
10656B5927698L483693K956479J795327Q9590j830494l258023l896964l906485
10648B1360821l365100k570956j799655j185292o46499j37427M59250R14255J430181
10639A4459578J860282K017374J792317J059516j1578j166959k068734k457180
10631A5484616k288462j878507j404718r91639o25936m12793k05594j5697J14882
10622G776152K60968M57955O22984Q72212J362088J926517K524940L213999L950550
10613B2968365M310748M077787L019088J253606r60807k977025m278711m701140
10605B2711911m290249l468181k550885j784396j263776q64655n85932m33097
$$ y = [12745155, 12646639, 12730553, 13176007, 13978578, 15203694, 17026321, 19439777, 22436765, 25927698, 29411391, 32367870, 34163197, 34252787, 32422293, 29164270, 25267306, 21360821, 17995721, 15424765, 13625110, 12439818, 11793319, 11655892, 12115142, 13029397, 14459578, 16319860, 18337234, 20129551, 21189067, 21177489, 20010530, 17941796, 15484616, 13196154, 11317647, 9912929, 8921290, 8295354, 7882561, 7676967, 7661270, 7776152, 8037120, 8495075, 9118059, 9990271, 11352359, 13278876, 15803816, 19017815, 22968365, 27279113, 31356900, 34375988, 35629594, 34668787, 31691762, 27413051, 22711911, 18421662, 14953481, 12402596, 10618200, 9354424, 8489769, 7903837, 7470740]
10597G470740k33078j14114M7488K18721M16555O82632J011247J299183J595040
10588A2394414J850086J881288J595441Q48865p9048j084042j870801k294915
10580A3241288k281122j973998j613592j209779q93165o63902n22642m11957k88427
10571C382704k71917k11641k03701k19158j97587j75512o7395j28187r4753j23663
10561A689190n7410m4991k9915k4980n8162q3542o2096o6226j15270o1186L7410
10550A122822J4292k7359o4090k6956l5854l8428m2533o4501o2315J1328k7325
10539G59081p214Q13o3418l9233l1795Q479l497m4160L1950o304k2420j2771K1454
10526E90965l4965o1882o180l1841p661K4343J0324J6508M327p0376n3832k6739
$$ y = [7470740, 7237662, 7123548, 7171036, 7389757, 7806312, 8488944, 9500191, 10799374, 12394414, 14244500, 16125788, 17721229, 18570094, 18491046, 17407004, 15536203, 13241288, 10960166, 8986168, 7372576, 6162797, 5269632, 4605730, 4083088, 3671131, 3382704, 3110787, 2899146, 2695445, 2476287, 2278700, 2103188, 2035793, 1907606, 1812853, 1689190, 1631780, 1586789, 1556874, 1531894, 1473732, 1390190, 1328094, 1261868, 1146598, 1085412, 1122822, 1137114, 1109755, 1045665, 1018709, 982855, 944427, 901894, 837393, 775078, 786406, 759081, 751867, 752680, 689262, 650029, 618234, 626713, 623216, 579056, 611006, 604702, 582282, 569511, 590965, 556000, 494118, 487938, 456097, 448436, 472779, 483103, 499611, 503938, 433562, 379730, 352991]
10514C52991m1728K5353L9402q946M2529K1297l0924L7972N6087m0213L696j0986
10502D46530m5169l4504N94n831m3032n6885J2653p139j5212k6627m0327n645
10490A79406m6818L1839P2973m3641n5287O5480k531j8720J5765l653l5065k2243
10478A37505L1151M6698j598M7227l3355O347N0948n5064k5486j9387o070L6799
10466B15715p795m8002P206J4593k0778j0795j0131J3719K586m3014K9264p947
10454A34621K6016N2120J1015j5668j5356l0740p1395q6481P747M8491K9165N2478
10442A42013k4709k6725L0687M2750Q283M16m646o5233j7255k0716l5857N3118
10430H2126L1903n4615k5194M3805l1078l2639M9425K1292j3191R422J4140m8162
$$ y = [352991, 311263, 336616, 376018, 367072, 409601, 430898, 399974, 437946, 494033, 453820, 457516, 446530, 401361, 366857, 367451, 361620, 318588, 261703, 274356, 267217, 252005, 225378, 185051, 179406, 132588, 164427, 237400, 193759, 138472, 203952, 201421, 182701, 198466, 194813, 159748, 137505, 168656, 215354, 213756, 260983, 227628, 233975, 284923, 229859, 204373, 184986, 178916, 215715, 207920, 159918, 167124, 181717, 160939, 150144, 140013, 153732, 156318, 113304, 142568, 134621, 160637, 212757, 223772, 208104, 192748, 162008, 90613, 4132, 11879, 60370, 89535, 142013, 117304, 90579, 121266, 164016, 172299, 172715, 168069, 102836, 85581, 64865, 29008, 82126, 114029, 59414, 34220, 78025, 46947, 14308, 63733, 85025, 71834, 81256, 95396, 47234]
10418D7234L3048L0790J6530j1143o198l6118q8758j6266L4515L6678j563m405
10406C4344J7010K8299j0787k5325j3617J0716n2197L8942N2163j0482L8438O420
10394A13924N142J4187J8893O75m0367m1034K1852M2208J4814K3636j8557n4351
10382A01022r3810J6612P1448K1742p390j9971m7701l744L0291j7809J480n515
10370D6655L3778P4398J4136r525J5175J1636J8289k4957J0234Q391l1120n9334
10358A07756m6460k2237K9723R595k9444L8415P6088J3091k4368l577j3938k693
10346A31951p638M5558K830L1580J06411r383o8252q546l688n5794n6169K3188
10334A32048m527l8390l4736N4825k9194n2666r749O303N536L2539N5240K9456
$$ y = [47234, 80282, 111072, 127602, 116459, 110261, 74143, -14615, -30881, 3634, 40312, 38749, 34344, 51354, 79653, 68866, 43541, 29924, 40640, -11557, 27385, 79548, 69066, 107504, 113924, 119066, 133253, 152146, 152821, 112454, 71420, 93272, 135480, 150294, 173930, 155373, 101022, 7212, 23824, 95272, 117014, 109624, 89653, 41952, 38208, 68499, 50690, 52170, 46655, 80433, 154831, 168967, 159442, 174617, 186253, 204542, 179585, 189819, 198210, 167090, 107756, 61296, 39059, 68782, 78377, 48933, 87348, 163436, 176527, 152159, 148582, 134644, 131951, 124313, 169871, 172701, 204281, 310692, 301309, 233057, 224511, 220823, 165029, 108860, 132048, 127521, 89131, 54395, 109220, 80026, 27360, 17611, 23914, 29450, 61989, 117229, 146685]
10322A46685l9490J0827Q7800P2677k0770L750r827m0254n5858J9426m295J6856
10310A87527k6545J2580K9693n919l1116j9427M0404J9861L9647m1887n3518L1688
10298A82988K0977L7901R51l4038r0892l3226L5220O7152j3354j4344j259j2514
10286A45562j3190l7352M025Q1434K3653o1339N045K5068L3496R3516L069l527
10274B99460R2542L2141J6042m1417K7202k3926n5939q8022o1340L2784M9322
10263B78849M7978r468k7780j9946O3471j74K4601P8063j7545M499J4462L209
10251D40219j2427K1770Q3566P5771J1484k4651j5441r6871j3213k1961q3259
10240C64987k3641j1609L963n381j2547L7210O489O615q0887o6164K5627L7357
$$ y = [146685, 107195, 118022, 205822, 278499, 257729, 261479, 251652, 211398, 155540, 174966, 170671, 187527, 160982, 173562, 203255, 197336, 166220, 146793, 187197, 207058, 246705, 204818, 151300, 182988, 203965, 241866, 242817, 208779, 117887, 84661, 119881, 187033, 173679, 159335, 158076, 145562, 132372, 95020, 99045, 180479, 204132, 142793, 147838, 172906, 206402, 299918, 302987, 299460, 392002, 424143, 440185, 398768, 425970, 402044, 346105, 258083, 196743, 229527, 278849, 326827, 317359, 289579, 269633, 333104, 332930, 357531, 435594, 418049, 422548, 437010, 440219, 427792, 449562, 533128, 608899, 620383, 595732, 580291, 483420, 470207, 448246, 364987, 341346, 329737, 333700, 328319, 315772, 352982, 359471, 366086, 285199, 219035, 244662, 282019]
10228B82019M5324j5590k4390L4094J5557n6301k2806R774L5498J0868L4380J0967
10216C59394k4126o5266p9525k9714J6375M181N6242N8568J5181m3628N649M0645
10204C13976p0580M757M9341Q4387J3685l5054l2453r4715j8163K1842K9622K9460
10192B96105K4983R530j3138m1705j4206Q074J6750L0066K2175j7136j7934K065
10180C05629k9434M1516j6876j1770J1861j4408K2597k3810j17745o714N6320
10169B17166O8545L1660J5072L0650K6827K3375k6037J9046L3411K1846l2103
10158D29458M81j632J2603r527k3657l3174O5144J7499k7176J3897L31m7042k7475
10145C69730J9775j5168k266j5435j1441j5096Q172l0571M7034J9596k9665m896
$$ y = [282019, 327343, 311753, 287363, 321457, 337014, 280713, 257907, 267681, 303179, 314047, 348427, 359394, 335268, 270002, 190477, 160763, 177138, 181319, 237561, 296129, 311310, 267682, 273331, 313976, 243396, 248153, 297494, 381881, 395566, 360512, 328059, 233344, 215181, 237023, 266645, 296105, 321088, 330618, 317480, 275775, 261569, 269643, 286393, 316459, 338634, 321498, 303564, 305629, 276195, 317711, 300835, 289065, 300926, 286518, 309115, 285305, 167560, 160846, 217166, 285711, 317371, 332443, 363093, 389920, 413295, 387258, 406304, 439715, 461561, 429458, 429939, 428307, 440910, 431383, 407726, 374552, 439696, 457195, 430019, 443916, 444247, 397205, 369730, 389505, 374337, 372071, 356636, 345195, 330099, 338271, 307700, 354734, 374330, 344665, 339769]
10133C39769j6180l8704l0522n9L0346J4595R219J3308j8281J4681l4865q972
10121B74335n3559J9190J6513o0391j3604L5546k4032J2759l9069l5441K6750
10110A58997j4889K9184K7550l2358j14925L5596M2173k4646r676K9473O501m2676
10098I0304L0578p9O300O5556j2976m4254l0168m3403L3165M7638j3487J238O5945
10085A96357J6973k0687m5238K6842j7912n3371M0348K5551J1695p5317k9327
10074G5914j1610L7630N350R882J8082j3046M597j6705k9198J6333J2167J3607
10062A23003o764j1693m6403M2784K2876J2873J7960M1283l3007j8282K1484l9074
10050A27040M549J5041m9722L098L5340k1209l6793m823K5950R968K5568j0645
$$ y = [339769, 323589, 284885, 254363, 254304, 284650, 299245, 308464, 321772, 303491, 318172, 283307, 274335, 220776, 239966, 256479, 196088, 182484, 218030, 193998, 206757, 167688, 132247, 158997, 144108, 173292, 200842, 168484, 53559, 89155, 131328, 106682, 97006, 126479, 132980, 90304, 120882, 120803, 127103, 192659, 179683, 135429, 105261, 61858, 95023, 142661, 129174, 130412, 196357, 213330, 192643, 147405, 174247, 156335, 102964, 143312, 168863, 180558, 105241, 75914, 64304, 101934, 107284, 117166, 135248, 122202, 126799, 110094, 80896, 97229, 109396, 123003, 116239, 104546, 58143, 100927, 123803, 136676, 154636, 195919, 162912, 144630, 166114, 127040, 131589, 146630, 96908, 100006, 135346, 114137, 77344, 72521, 98471, 108439, 134007, 123362]
10038A23362K2315j434r937k203K5980n5052J9266P5348N589n0084n1907p590
10026I3653J3069J0156L5628m536l0044k1471L4041L7158k2299n7555j2659L6031
10014A11172q743J5450j840j4878J3174N3430O505l2839k9304N470J8388J8931
10002A54916N3668K1108l5390N4755J9947J2960k0744n4039K0263O264k9101j1977
9990A92630L1979J3629P980M975m0430K319M9330K8991M1255J9545m9371o0006
9978B42826j5817L6249J1627n87o9372l6130K0708P3080L2542l523p65o213j7956
9965B66669k4845n72J9258p407k4388J3186l8758j3388R8288k4179q580o242q352
9952B40690k50j2837K9081M2260K3547L7465l0819p201K8827q485k1889K9589
$$ y = [123362, 145677, 144243, 134306, 132103, 158083, 103031, 122297, 197645, 203234, 153150, 101243, 93653, 106722, 116878, 152506, 147970, 117926, 96455, 130496, 167654, 145355, 87800, 75141, 111172, 102429, 117879, 116039, 101161, 114335, 167765, 174270, 141431, 112127, 117597, 135985, 154916, 208584, 229692, 194302, 249057, 269004, 281964, 261220, 207181, 227444, 233708, 204607, 192630, 224609, 238238, 246218, 251193, 210763, 213082, 262412, 291403, 332658, 352203, 302832, 242826, 227009, 263258, 274885, 274298, 204926, 168796, 189504, 262584, 295126, 291603, 290838, 284625, 266669, 241824, 241252, 260510, 253103, 228715, 241901, 203143, 189755, 288043, 263864, 255284, 249042, 240690, 240440, 227603, 256684, 298944, 322491, 359956, 329137, 321936, 350763, 342278, 320389, 349978]
9940C49978N488N795L5157j5441k8769l0927k9708K5040N6154q939l7731k812
9928C23285J1234J4117M8150M6606m7118R124L5460J2288k1199R416P5076L70
9916E16809n2486K3384K8236N8306L3749l3096j3890q654M1499M2445M2543N1599
9904G30444j7498J0826N5837L8984N0599N2649O2680l469M1004R3453R0460L7339
9892A243308L856J1826L4560J06678N3743J0911O5578J15334J14311J44904J98470
9881B103479K03951J81607L05888L08651L15004L74268M51648N75031P19829Q84395
9871F423751J046761J269207J412067J392818J335010J210675J002425Q12874
9863A5905588O30063N23311N90923N69935N26487M71311M50142K44066l5232k97922
$$ y = [349978, 355466, 361261, 396418, 380977, 352208, 321281, 291573, 316613, 372767, 363828, 326097, 323285, 334519, 348636, 396786, 443392, 396274, 405398, 440858, 453146, 431947, 441363, 516439, 516809, 464323, 487707, 515943, 574249, 607998, 574902, 561012, 552358, 593857, 636302, 678845, 730444, 712946, 723772, 779609, 818593, 869192, 921841, 984521, 981052, 1022056, 1115509, 1205969, 1243308, 1247164, 1258990, 1293550, 1400228, 1453971, 1464882, 1530460, 1645794, 1760105, 1905009, 2103479, 2307430, 2489037, 2794925, 3103576, 3418580, 3792848, 4244496, 4819527, 5539356, 6423751, 7470512, 8739719, 10151786, 11544604, 12879614, 14090289, 15092714, 15905588, 16535651, 17058962, 17649885, 18219820, 18746307, 19217618, 19667760, 19911826, 19876594, 19578672]
9853A9578672k63642N0177N10355J066192J651905K199735K644198K908081L047711
9844C3393384K997817L011880K810732K421628J828036J251660O02809P3203m51862
9835D7939287r44045j287995j434864j312229j238122j425755j599283j566936
9827C7130058j223897m80581L97252J209595J847557K073081K043992J755289
9819D4752346J457379J102803Q23265N36793K92369N358m85013q74993j239002
9810D6371305j696620k247927k740838k992353k734544k485761k185278j837866
9802B7450118j518887j069009n53685o8091K84777M64340M37591K50545o3558
9793B5614141k35520l89388k74240K415L05365O76493R78865J370174J446552
$$ y = [19578672, 19315030, 19365207, 19875562, 20941754, 22593659, 24793394, 27437592, 30345673, 33393384, 36391201, 39403081, 42213813, 44635441, 46463477, 47715137, 48317946, 48391149, 47939287, 46995242, 45707247, 44272383, 42960154, 41722032, 40296277, 38696994, 37130058, 35906161, 35425580, 35822832, 37032427, 38879984, 40953065, 42997057, 44752346, 46209725, 47312528, 48135793, 48672586, 48964955, 48970313, 48485300, 47610307, 46371305, 44674685, 42426758, 39685920, 36693567, 33959023, 31473262, 29287984, 27450118, 25931231, 24862222, 24308537, 24240446, 24525223, 24989563, 25427154, 25677699, 25614141, 25378621, 24989233, 24714993, 24717408, 25022773, 25699266, 26678131, 28048305, 29494857]
9784B9494857J361175R24429L45308j38056m22339l40462j914M16178P23879R11967
9774C3275022R44709Q30193O24177K06525k99897n92850p04226l75335M07785
9765C4316103J360523K239821K974176L462125L692778L874787M094961M264286
9757F0279560M122143L430217K418854J562875J029831O07686J3340o23741j105212
9748G1735553j503013j955012k274417k633329k934813k901845k332679j294935
9740E3905510r8390J073146J946563K355651K297417J940782J553843J449429
9732F6423951J510217J505158J114072M98166k24844r07522j794882k868119l764568
9723F1491629m246287m416053m253836m000193l731754l283705k672018j958747
$$ y = [29494857, 30856032, 31780461, 32125769, 31987713, 31565374, 31224912, 31222998, 31639176, 32363055, 33275022, 34219731, 35049924, 35674101, 35880626, 35580729, 34987879, 34283653, 33908318, 34316103, 35676626, 37916447, 40890623, 44352748, 48045526, 51920313, 56015274, 60279560, 64401703, 67831920, 70250774, 71813649, 72843480, 73451166, 73464506, 72840765, 71735553, 70232540, 68277528, 66003111, 63369782, 60434969, 57533124, 55200445, 53905510, 53807120, 54880266, 56826829, 59182480, 61479897, 63420679, 64974522, 66423951, 67934168, 69439326, 70553398, 71051564, 70826720, 69919198, 68124316, 65256197, 61491629, 57245342, 52829289, 48575453, 44575260, 40843506, 37559801, 34887783, 32929036]
9715C2929036j228180n66901k23258J6974o797k97638o60231q83018r46471p76381
9705B7357135o57158o05831o57897q84090j217641j599787j883360k091633k065878
9696A5693860j886832j673627j410673j136742q63271o75348o19518n91344m65721
9687F370784l89334l88496l62055k59618k52592k62256k17880j32241j37462j33807
9677C835043j71481j47933j10048r8961q1277j49531j05338q4153j01792j07210
9667B677319q3124o3318j18360j10961l4281Q03m8480o3169r0520p6520q9708
9656A899681m9046n2879k1316K9567K164o3289q0097p2311l8267K5422R091n0046
9644A538674l9833o4288r1499n7484N79O588n9886L5492J5546k1274r8344q9003
$$ y = [32929036, 31700856, 31133955, 30910697, 30927671, 30920874, 30623236, 29963005, 29079987, 28133516, 27357135, 26699977, 26094146, 25436249, 24552159, 23334518, 21734731, 19851371, 17759738, 15693860, 13807028, 12133401, 10722728, 9585986, 8722715, 8047367, 7427849, 6836505, 6370784, 5981450, 5592954, 5230899, 4971281, 4718689, 4456433, 4238553, 4106312, 3968850, 3835043, 3663562, 3515629, 3405581, 3306620, 3225343, 3075812, 2970474, 2886321, 2784529, 2677319, 2594195, 2530877, 2412517, 2301556, 2267275, 2268078, 2219598, 2156429, 2065909, 1989389, 1899681, 1850635, 1797756, 1776440, 1806007, 1808171, 1744882, 1664785, 1592474, 1554207, 1579629, 1588720, 1538674, 1498841, 1434553, 1343054, 1285570, 1286149, 1292737, 1232851, 1268343, 1283889, 1262615, 1164271, 1075268]
9632A075268m9463O5628L8490j1037n684q66n3381O136n3434o1131R357m964l2153
9619I22766m8810J704M5366m7565r5017m353J636J5632M5832M9685k9734j2841
9607H44301m0300L0018J8467J928j2639p552M107L0894J258l9565j40729p3434
9595F16754r375O4166O6437K9643J0342J3891k498k1215m3013k0146l8606j5379
9583F51001Q072K6756K7686j7529p2056n4596j4416l1731L546J3977L4814M3406
9571F18930k1289n3752M8709O231L6584k1310l7135P456l9619l3239L5810O7214
9559F14590M1580k9945J7305k6421j9431M4342K9028k0023n4230l7303k4617M0732
9547E75607N8094J2269k329n6381j5210M7179O6140J1797p1410K9555Q0936j888
$$ y = [1075268, 1025805, 1091433, 1129923, 1118886, 1113202, 1112336, 1058955, 1065091, 1011657, 950526, 959883, 954919, 922766, 873956, 875660, 921026, 873461, 778444, 774091, 775727, 791359, 837191, 886876, 857142, 844301, 804001, 834019, 852486, 854414, 841775, 834223, 838330, 869224, 870482, 830917, 690188, 616754, 607379, 671545, 737982, 767625, 777967, 791858, 789360, 768145, 725132, 704986, 666380, 651001, 659073, 685829, 713515, 695986, 623930, 569334, 554918, 523187, 526733, 540710, 575524, 618930, 597641, 543889, 592598, 598829, 635413, 614103, 576968, 584424, 544805, 511566, 547376, 614590, 656170, 626225, 643530, 617109, 597678, 642020, 671048, 651025, 596795, 559492, 534875, 575607, 633701, 645970, 643641, 587260, 572050, 619229, 685369, 697166, 625756, 655311, 736247, 734359]
9535G34359j213M765M1258M4819K5997J2379Q608L1488P985M7683K1920r776J4354
9522I84626O2789N8710Q173O738Q7941J10460O2224L4036L5722N3970J72481J24228
9510A802098J36522J40109J46568J64639J92360K94245L17374L29824L47578N16722
9500D388039O31801Q02159J056729J197580J426267J821358K295478K669439L115324
9491A9404174L499007L781407L720763L134075J759383l56775k192406l115409
9483B9634219l334071l082042k768599k423032k030159j675245j278210q69068
9475A2173793m77636j70291J11992M56789Q24062J208540J609907K171811K712209
9466B0621176L083756L264968L194405K720775K003949P74233j053148k581080
$$ y = [734359, 733146, 737911, 779169, 823988, 849985, 862364, 870972, 902460, 910445, 958128, 980048, 970272, 984626, 1047415, 1106125, 1114298, 1121036, 1208977, 1319437, 1381661, 1415697, 1451419, 1505389, 1677870, 1802098, 1938620, 2078729, 2225297, 2389936, 2582296, 2876541, 3193915, 3523739, 3871317, 4388039, 5019840, 5821999, 6878728, 8076308, 9502575, 11323933, 13619411, 16288850, 19404174, 22903181, 26684588, 30405351, 33539426, 35298809, 34942034, 32749628, 29634219, 26300148, 23218106, 20449507, 18026475, 15996316, 14321071, 13042861, 12173793, 11696157, 11525866, 11637858, 12094647, 12918709, 14127249, 15737156, 17908967, 20621176, 23704932, 26969900, 30164305, 32885080, 34889029, 35663262, 34610114, 32029034]
9458C2029034l204707l011480k600757k252050k124485k122164k075281j802098
9450A2836012j508577j170551r10065o66116m75492l51273k42078j06349j00855
9441G304656p2178k1455P1919J37152K00452K83216L35860L76415N03524O49680
9431I769241Q62810J099388J359611J734005K085116K680515L361039M044917
9423B6996642M749879N528969O032291O269607N921561M707037K622619K60476
9415F3089081k112390l917155m438238m104170l493651k787376k196433j607641
9407C8432027r10168o8850P38901J459617J964259K248064K131798J507020R15715
9398D8418383J025902J798842K806337L607197L934005L832519K851907J153146
$$ y = [32029034, 28824327, 25812847, 23212090, 20960040, 18835555, 16713391, 14638110, 12836012, 11327435, 10156884, 9246819, 8580703, 8105211, 7753938, 7511860, 7405511, 7304656, 7232478, 7211023, 7282942, 7420094, 7620546, 7903762, 8239622, 8616037, 9119561, 9769241, 10632051, 11731439, 13091050, 14825055, 16910171, 19590686, 22951725, 26996642, 31746521, 37275490, 43307781, 49577388, 55498949, 60205986, 62828605, 63089081, 60976691, 57059536, 52621298, 48517128, 45023477, 42236101, 40039668, 38432027, 37521859, 37453009, 38191910, 39651527, 41615786, 43863850, 45995648, 47502668, 48418383, 49444285, 51243127, 54049464, 57656661, 61590666, 65423185, 68275092, 69428238]
9390F9428238p84367k806766m518893n209980n016215m497162l788537l190989
9382C9615329k575684j875891j251800p66790m16518j41423p3642l40930j028680
9373C1143971j888507k526556k649601k444169k076068j889032j533644j241122
9365A4895272j028772p85804m81041k30336j35133j1361K74907N07450O94944
9356A3700126J038141J392767J645133K001170K425141K724028K884368K816748
9348C0627622K558161J902126O69867n19967j055970j015217o81803k74879J36507
9339C2346447O60372J271876J794907K412128K901366L199959L235511K813834
9331E0636400J692725K57677r94243j846943k145969j755166j008376l28382K39679
$$ y = [69428238, 68643871, 65837105, 61318212, 56108232, 51092017, 46594855, 42806318, 39615329, 37039645, 35163754, 33911954, 33145164, 32728646, 32587223, 32513581, 32172651, 31143971, 29255464, 26728908, 24079307, 21635138, 19559070, 17670038, 16136394, 14895272, 13866500, 13080696, 12599655, 12369319, 12234186, 12222825, 12497732, 13005182, 13700126, 14738267, 16131034, 17776167, 19777337, 22202478, 24926506, 27810874, 30627622, 33185783, 35087909, 35757776, 35237809, 34181839, 33166622, 32484819, 32209940, 32346447, 33006819, 34278695, 36073602, 38485730, 41387096, 44587055, 47822566, 50636400, 52329125, 52586802, 51592559, 49745616, 47599647, 45844481, 44836105, 44507723, 44747402]
9322D4747402N22993L12622n76719j885437k719648k826183k253550j469359o65744
9313C3186377o550N84729J078593J598483K004636K190754K237194J932592R03852
9304D5710660p39871k553235m039566m682885m606366m159031l475693k856288
9296A8597725k351433j959788j584880j212750j007689q23130o52823n33580m97978
9287G973674l87549l79671l73383k76116k64131j42750r9996j15074j8660Q44
9277E917188M7308R6032J25470K61307M42182N78599O53972Q45040J109908J242563
9267A1319569J384111J463474J436722J498304J553973J453538J266443N68229
9259B1944363n69297j647097k099921k060342j945172j692971j444656j133505
$$ y = [44747402, 45270395, 45583017, 45006298, 43120861, 40401213, 37575030, 35321480, 33852121, 33186377, 33179827, 33764556, 34843149, 36441632, 38446268, 40637022, 42874216, 44806808, 45710660, 44970789, 42417554, 38377988, 33695103, 29088737, 24929706, 21454013, 18597725, 16246292, 14286504, 12701624, 11488874, 10481185, 9658055, 9005232, 8471652, 7973674, 7586125, 7206454, 6833071, 6556955, 6292824, 6150074, 6050078, 5935004, 5916344, 5917188, 5964496, 6060528, 6185998, 6447305, 6889487, 7468086, 8122058, 8967098, 10077006, 11319569, 12703680, 14167154, 15603876, 17102180, 18656153, 20109691, 21376134, 21944363, 21375066, 19727969, 17628048, 15567706, 13622534, 11929563, 10484907, 9351402]
9251I351402p63296n47805l13960q4508R9047K27174M52973P08488Q92650J050696
9241A1072861J403359J649720J812020J927444J887411J556887J030968J93293
9233B2533963q37917j665071j881388j470317o16445N55552K118195M151205N800020
9224B8687797O047206P468251O750727n431625j4020363j0119054n660309l259507
9216A0463123k055593j424328r47633o77072n44954m24906l73971l09094l06530
9207C399042k45084j70273j37080j69658j01637j27713j07634q5710q5781p3294
9197B095178j31418q8211p4849q879k2162o6177o2678p4733p1278m8347o4368
9186A382078j1933j1126j8282n1487o9375n0379o5028m4303l7055l7476R483j8390
$$ y = [9351402, 8588106, 8040301, 7726341, 7641833, 7740880, 7968054, 8421027, 9129515, 10022165, 11072861, 12476220, 14125940, 15937960, 17865404, 19752815, 21309702, 22340670, 22533963, 21696046, 20030975, 18149587, 16679270, 16062825, 16618377, 18736572, 22887777, 28687797, 34735003, 42203254, 48953981, 43522356, 29501993, 19382939, 13722630, 10463123, 8407530, 6983202, 6035569, 5358497, 4813543, 4388637, 4014666, 3705572, 3399042, 3153958, 2983685, 2846605, 2676947, 2575310, 2447597, 2339963, 2254253, 2168472, 2095178, 1963760, 1875549, 1800700, 1791821, 1769659, 1703482, 1640804, 1566071, 1494793, 1446446, 1382078, 1370145, 1359019, 1340737, 1289250, 1219875, 1169496, 1104468, 1060165, 1023110, 985634, 995117, 976727]
9174I76727p0368r818K073k3401n0019m4691l2304m591O3928O7500K8684n1894
9162H51826p6600m1069J4478m828M6458m8995n9000p0376n8578l009J0200O6595
9150F27102Q944j3399k2706k3926l3999J2228j0420k1062J5744J5880n749m0332
9138E08305p412m8379o934O3208k2585k3617N4412k5984n1856Q702m940j9155
9126D23765l5353R611j185Q386k5443J1701j6606l98M2007J8465L2182j7130m1018
9113D08984k1743k8035K9525l0184L18k5443Q762L9366k5389L7976o948m2097
9101C45092k3765M4064k7038m7210l2453M5254J03760J4628m1759m9952k5431
9090C05190k0173J2444K1046q4549n8423L4992O1884M6323q201J5420J5508J8335
$$ y = [976727, 906359, 896541, 898614, 875213, 825194, 780503, 748199, 743608, 807536, 875036, 903720, 851826, 775226, 734157, 748635, 743807, 790265, 741270, 682270, 611894, 553316, 550307, 560507, 627102, 636046, 622647, 599941, 576015, 542016, 554244, 543824, 522762, 538506, 554386, 548637, 508305, 500893, 452514, 445580, 508788, 486203, 462586, 516998, 491014, 439158, 447860, 442920, 423765, 388412, 398023, 396838, 405224, 379781, 391482, 374876, 374478, 416485, 434950, 467132, 450002, 408984, 387241, 359206, 388731, 358547, 358865, 333422, 342184, 381550, 356161, 394137, 387189, 345092, 321327, 365391, 338353, 291143, 258690, 303944, 407704, 422332, 380573, 330621, 305190, 285017, 297461, 318507, 233958, 175535, 210527, 272411, 318734, 310533, 325953, 341461, 359796]
9078C59796K8453N077l2967k9727J6298J00941N5368l312O286q1710r8202j00322
9066B25979N778J1273M6356J1263j6425o034J4627K6115K5493N746M8741N7965
9054D56877J58854K15091J91139K08278K78183K25455M1341j89737l16777k42682
9044A026022j97453j29983l7478o3135n4481m4295j16120q1673K808n8896m2341
9033B02975K3365l1030m4400J2832N2188j679N1522K9600o17M1354j4862L2365
9021C53613j885K1052M2895J7314n5172K388k4927M5023N9714J9695J06486J79191
9009G65387J95522K82499M29926M84888M68569M49616J61468m55585o49942m95067
8999A637281l51352k79009k31136j28072l2254j8966l0247l5937j7079l5519J1895
$$ y = [359796, 388249, 393326, 360359, 330632, 346930, 447871, 503239, 499927, 506213, 424503, 326301, 225979, 231757, 243030, 289386, 300649, 284224, 278190, 292817, 318932, 344425, 350171, 398912, 456877, 615731, 830822, 1021961, 1230239, 1508422, 1733877, 1775218, 1585481, 1268704, 1026022, 828569, 698586, 661108, 597973, 543492, 499197, 383077, 301404, 304212, 245316, 202975, 226340, 195310, 150910, 163742, 215930, 214251, 265773, 295373, 294756, 336110, 321248, 353613, 351728, 372780, 415675, 432989, 377817, 380205, 355278, 400301, 460015, 479710, 586196, 765387, 960909, 1243408, 1673334, 2158222, 2626791, 3076407, 3237875, 2782290, 2132348, 1637281, 1285929, 1006920, 775784, 647712, 615458, 596492, 566245, 530308, 513229, 477710, 489605]
8988D89605O3570j2731K0220j0666j15n130m5501O71R924K6216J6107J4919M8936
8975F16025j107m5491K0361L274l2755k1019m0850n8462N0459L5343R5834J18707
8963G40319J14202J74027K17936J84913J87601J48505j59880l31875l40134k69343
8953F66271j14319k9881n3303m2287m1783p007L0227j4397o4686m7567K2772l4429
8941B69611l069m3700k1554j7021K0364O2889N0714r520q709R859J9940O8436
8929C98240M6412k7317n9210j7816K8657J0438k7046n3914J4433n88L4111N4425
8917D00825N1864M8006K1599j201l7640j2951l6052j6770O0257K4303O0156Q789
8905E71185N8084J02287L3518n5596k0818p3662o9133p0120n2624P752K6825N5821
$$ y = [489605, 553175, 540444, 560664, 549998, 549883, 544753, 499252, 499923, 509847, 536063, 552170, 567089, 616025, 614918, 569427, 589788, 593062, 560307, 539288, 498438, 439976, 490435, 525778, 621612, 740319, 854521, 1028548, 1246484, 1431397, 1618998, 1767503, 1607623, 1275748, 935614, 666271, 551952, 522071, 468768, 426481, 384698, 377691, 407918, 393521, 328835, 281268, 304040, 269611, 266542, 222842, 201288, 184267, 204631, 267520, 318234, 308714, 300005, 309864, 329804, 398240, 444652, 417335, 358125, 340309, 368966, 379404, 352358, 298444, 312877, 312289, 346400, 400825, 452689, 500695, 522294, 521093, 483453, 470502, 434450, 417680, 477937, 502240, 562396, 571185, 629269, 731556, 765074, 709478, 688660, 614998, 545865, 475745, 423121, 430873, 457698, 513519]
8893E13519L887j6607N557r510k7794l0923l5333K2140N597L953l3870M7338N679
8880D53633j8816J5486M862J0029L2856l2371n8413k6616K2255J3758k0137l8554
8868C57972L9371J32256P2196N3902P4562J64484J76808J98745K15307J84120
8858A669723K61049M08765M26478N83242Q25594J085411J189279J229774Q95431
8849H574746m68111j685148j672453j222813p94223m78121k79378k33344j67486
8840A573669k25251j68025q1513j24115p0564q9149p6561l3763n5082j10639p3806
8829D65201m5598K1679J283L4878k1543M7797m2806k7798P4835N1502J0502K5049
8817E94981K1838M399M0972L2854j2434O102n6356j23119m5538p4063j3860J9930
$$ y = [513519, 517406, 500799, 506356, 496846, 469052, 438129, 402796, 424936, 430533, 434486, 400616, 447954, 453633, 434817, 450303, 455165, 465194, 498050, 465679, 407266, 380650, 402905, 416663, 396526, 357972, 397343, 529599, 601795, 655697, 730259, 894743, 1071551, 1270296, 1485603, 1669723, 1930772, 2339537, 2766015, 3349257, 4174851, 5260262, 6449541, 7679315, 8574746, 8106635, 6421487, 4749034, 3526221, 2731998, 2253877, 1974499, 1741155, 1573669, 1348418, 1180393, 1098880, 974765, 904201, 815052, 738491, 704728, 649646, 539007, 465201, 419603, 441282, 442565, 477443, 455900, 503697, 460891, 433093, 507928, 559430, 569932, 594981, 616819, 621218, 662190, 695044, 682610, 688712, 632356, 509237, 463699, 389636, 375776, 395706]
8805C95706l594l0104K6505K7978o6390j2291L4447R2392L7550J031j5059o36
8793D87535j0800k7533j09651j34984q7246l4666M6233N1659L0394l2406N71M6708
8781B25814Q6773J04595J4354J6511j768j2272N871M5163K5260n0490o4555j3827
8769C81429q048m7470j8189q949L0056j6630J0646R997m6325p5755n139J3711
8757B19334l2770R781L1206J15149M9840J9504M5920K5374M9617K6555K1119o1293
8745E19336n9459j8824K9162n3720L3092R1601O3036L3362n580K1710n902Q5171
8733G32985J27250R341O0057L29j13402m6489K3346n41k9049m261j1370r739J1009
8720G49466l9837j6734R43j2534j1030j7919L3493Q7653K9405m3823J1214R2049
$$ y = [395706, 392112, 362008, 388513, 416491, 350101, 337810, 372257, 464649, 502199, 503230, 488171, 487535, 476735, 449202, 339551, 204567, 117321, 82655, 128888, 180547, 210941, 178535, 179106, 225814, 312587, 417182, 431536, 448047, 446279, 434007, 439878, 485041, 510301, 459811, 395256, 381429, 373381, 325911, 307722, 298773, 328829, 312199, 322845, 332842, 286517, 210762, 205623, 219334, 186564, 196345, 227551, 342700, 392540, 412044, 457964, 483338, 532955, 559510, 580629, 519336, 459877, 441053, 470215, 416495, 449587, 541188, 604224, 637586, 632006, 653716, 647814, 732985, 860235, 869576, 929633, 929962, 816560, 770071, 793417, 792876, 763827, 759566, 748196, 738457, 749466, 709629, 692895, 693838, 681304, 670274, 652355, 685848, 773501, 802906, 759083, 770297, 862346]
8708H62346P3394L7050Q840J6962J7096N0483Q8775P9442O5071N599P6723J85229
8696A567010J17899Q1243O0467P9279O8250q61n7095N8917J90408K17602K09085
8685B592204J34617L8719Q8565J45797J59675J74256J79708J59709K32189J63158
8675D068597K00327K23718K30633K90273M48191M76031N49207P93171Q97202J011082
8665I188432J295178J592365J750782J980531K158329K694302L772690N402231
8657B9834840P820757J1587308J7544562K6241633L6043895M1950055M3268345
8650B14291395M2505987J7210106l7914649o4505318n2346872l4153235k1325153
8643F3762261j3560848r035914o285936m513250l148719k338463j795751j280603
$$ y = [862346, 935740, 972790, 981630, 998592, 1015688, 1066171, 1154946, 1234388, 1299459, 1305058, 1381781, 1567010, 1684909, 1766152, 1826619, 1905898, 1974148, 1973287, 1916192, 1975109, 2165517, 2383119, 2592204, 2726821, 2765540, 2854105, 2999902, 3159577, 3333833, 3513541, 3673250, 3905439, 4068597, 4268924, 4492642, 4723275, 5013548, 5461739, 5937770, 6486977, 7280148, 8177350, 9188432, 10483610, 12075975, 13826757, 15807288, 17965617, 20659919, 24432609, 29834840, 37655597, 49242905, 66787467, 93029100, 129072995, 171023050, 214291395, 256797382, 274007488, 236092839, 171587521, 119240649, 85087414, 63762261, 50201413, 41165499, 34879563, 30366313, 27217594, 24879131, 23083380, 21802777]
8635B1802777p63301o31938q41873q69938q03432n64931l61454r7844j241J30328
8625A6997153L77851O53806J014942J370068J683055K154891K560297L085368
8617B9897431L510475L705925M481806O653291R665613J3825176K0494758L1639705
8609A23874180M8772124P0092771Q3927555Q6040143R3265356N5509625o9838999
8602D91642755j38469628j12595676p2288229m4695994k8302422j8640328j2894606
8595F3755872r236942o695784m971532l848308l004175k329089j836206k029980
8587B9803856k318709k048794j636595j233758j030315q07770o63601m50614j71032
8578A9442668n8915J24408M11669O64382Q87758J176968J425771J694980K072926
$$ y = [21802777, 21039476, 20407538, 19565665, 18695727, 17892295, 17327364, 16965910, 16868066, 16866825, 16997153, 17375004, 18028810, 19043752, 20413820, 22096875, 24251766, 26812063, 29897431, 33407906, 37113831, 41595637, 48248928, 57914541, 71739717, 92234475, 123874180, 172646304, 242739075, 326666630, 412706773, 505972129, 561481754, 491642755, 353173127, 240577451, 168289222, 123593228, 95290806, 76650478, 63755872, 54518930, 47823146, 42851614, 39003306, 35999131, 33670042, 31833836, 29803856, 27485147, 25436353, 23799758, 22566000, 21535685, 20727915, 20064314, 19613700, 19442668, 19383753, 19508161, 19919830, 20584212, 21471970, 22648938, 24074709, 25769689, 27842615]
8569B7842615L008931M385925O351209R499302J4397955K1743864L1081739L8441059
8561A56752599M0292562M0927013K8188118j8677907n9644088n7164113l8953187
8554I1720997k4409692j5427649j0137311p010697n060258l707636k726236k158611
8546B1082907j732219j348670j098029j147686j278711j181795j057664q85458
8538A1352675o95742o42116n70950m63034m56874m15919m15214l54123k24427
8529G114276k67540k47111k20240k13338k01143j68731k31422j93693j77034j72878
8519E021146j80046j68193j40077j35888j28380j14420j14126n8957j21461j17552
8509C742046j75982j06662r1967j00791r8522r7088j19415k6397J6870n3412m4837
$$ y = [27842615, 30851546, 35237471, 41588680, 51087982, 65485937, 87229801, 118311540, 156752599, 197045161, 237972174, 266160292, 247482385, 187838297, 130674184, 91720997, 67311305, 51883656, 41746345, 34735648, 29675390, 25967754, 23241518, 21082907, 19350688, 18002018, 16903989, 15756303, 14477592, 13295797, 12238133, 11352675, 10656933, 10014817, 9443867, 8980833, 8523959, 8108040, 7692826, 7338703, 7114276, 6846736, 6599625, 6379385, 6166047, 5964904, 5796173, 5564751, 5371058, 5194024, 5021146, 4841100, 4672907, 4532830, 4396942, 4268562, 4154142, 4040016, 3981059, 3859598, 3742046, 3566064, 3459402, 3367435, 3266644, 3168122, 3071034, 2951619, 2925222, 2942092, 2888680, 2843843]
8498B843843n9317l0855n3938n7927r6904r3833l1972j37835q5906J2572r0770
8487B117158n3629m9223k0558p6093n1072K8438o118k5814K5739N3302N7406L7181
8475B036717l3400j37141j68767j40101m9795K347j0279l1101m7335p8111j3110
8464A329924m2220j1488o2942m3730q714J4847m6341n4626l462j6532M3760M600
8452A103076O125m384M5968O547K369n5800o3109n7360m4406j1607j378Q503k8853
8439I05691r8271j2408M2619O0169M2934k9892L9114M3113L0872O353R947j19510
8427I20731r2714m2334k2976o8618n6301L1100Q680l9566k8285q5854j25384m1829
8415C56650m4830j6149K4135J7680M437K6936L8969O6760j1979r47j8059M7565
$$ y = [2843843, 2784526, 2753671, 2699733, 2641806, 2544902, 2451069, 2419097, 2281262, 2195356, 2207928, 2117158, 2063529, 2014306, 1993748, 1917655, 1866583, 1895021, 1888903, 1863089, 1888828, 1942130, 1999536, 2036717, 2003317, 1866176, 1697409, 1557308, 1507513, 1509860, 1499581, 1468480, 1421145, 1343034, 1329924, 1287704, 1276216, 1213274, 1169544, 1160830, 1175677, 1129336, 1074710, 1071248, 1054716, 1098476, 1103076, 1109201, 1104817, 1150785, 1157332, 1159701, 1103901, 1040792, 983432, 939026, 927419, 926041, 934544, 905691, 807420, 795012, 837631, 897800, 940734, 910842, 949956, 993069, 1023941, 1030294, 1040241, 920731, 828017, 785683, 762707, 694089, 637788, 668888, 677568, 638002, 609717, 523863, 398479, 356650, 311820, 295671, 319806, 337486, 341923, 368859, 407828, 474588, 462609, 461662, 443603, 491168]
8403D91168j9973m0181L5775M7362l0552o9841k8867j1707o714o750P353p403
8391C59670j5093J4220M4691L3570J149k5685J8770J1848o585K1892K2692j3051
8379D68088m8449o952k0103n4299m9756j0627p6183o0629R818P573K9204L6995
8367B24680j0226j8347M8702M5687m5230l6136L5426K464R476J636l4132M3545
8355B67545k1992n0074J1956K9270K5722N5517O082j445p8750q1675N0275O2939
8343B75370R272l0291m5018l2797j5314j0393j8486O0614L5077j9285j4096k1807
8331A72846o9310k0155O2992Q0461J635m7869l0110m852R861K4754J2175m8068
8319A44360l5384K0968N4182P837L1666M6632j2291k6156l1172k5870k931M0088
$$ y = [491168, 471195, 431014, 466789, 514151, 483599, 413758, 384891, 373184, 366470, 359720, 367073, 359670, 344577, 358797, 403488, 437058, 438207, 412522, 431292, 443140, 436555, 458447, 481139, 468088, 419639, 412687, 392584, 338285, 288529, 277902, 201719, 141090, 150908, 158481, 187685, 224680, 214454, 196107, 244809, 290496, 245266, 209130, 244556, 247020, 256496, 258132, 224000, 267545, 245553, 195479, 207435, 236705, 262427, 317944, 324026, 322581, 243831, 162156, 212431, 275370, 284642, 254351, 209333, 176536, 161222, 150829, 132343, 192957, 228034, 208749, 194653, 172846, 103536, 83381, 146373, 226834, 228469, 180600, 150490, 145638, 155499, 180253, 192428, 144360, 108976, 129944, 184126, 191963, 223629, 270261, 257970, 231814, 200642, 174772, 171841, 211929]
8307B11929K8976q880j5359k7689Q779m620j6947l3675j0305K5811J8522O079
8295A82621j269M785J3619k6479n403J6910j7453l042O4350j1076l8066j1334
8283A68163k0233L0249k8998M1844k9644k1913K074j7613P703M3745J3444k6210
8271A62611P673O622K7102P391l2835l8897l9709l1735j0601N3435N0423k7460
8259A34020m5653m916p381K6783O8144R3256N7963J865N4773J27445J46703J54499
8247H07501K09076K37564K45586O0157k29256l39813k74665j35071j10354o2801
8237D07924k6407J7936N1433J4925r0402p2293j3455j0868o109j7621o335o3312
8225A85416p1557K8881Q9989N2647m2745k5412K461L9385O2796M524j9200J7529
$$ y = [211929, 240905, 232025, 216666, 188977, 197756, 193136, 176189, 142514, 132209, 158020, 176542, 182621, 181352, 186137, 199756, 173277, 167874, 184784, 167331, 164289, 228639, 217563, 179497, 168163, 147930, 178179, 149181, 191025, 161381, 139468, 141542, 123929, 131632, 175377, 188821, 162611, 170284, 176906, 204008, 211399, 178564, 139667, 99958, 68223, 57622, 111057, 161480, 134020, 88367, 83451, 76070, 102853, 170997, 264253, 322216, 324081, 378854, 506299, 653002, 807501, 1016577, 1254141, 1499727, 1559884, 1330628, 990815, 716150, 581079, 470725, 407924, 381517, 399453, 450886, 465811, 375409, 303116, 289661, 278793, 272684, 255063, 248728, 185416, 113859, 142740, 232729, 285376, 242631, 217219, 219680, 259065, 321861, 326385, 307185, 324714]
8213C24714J3506j7985K75N320N2383Q4380P7913J51886J98993K57655L40226
8202A489266M26672M10278N04279K42035m33260p16409n59613l54396j99013r3512
8192G16327j39917r6838m3560m1319k9241o2075O97j5233r0584j2562O772k060
8180A90407M6914K3401J0065M738j9441q0173k4384K2557Q07l0130j0055K8567
8168A63273k5349P313K9463M3056j5340j892Q8755P8456J29395J19588J34136
8157G50854J92145K33749K06768J03049j48249k79143k41231j95129j27359n8455
8147D36999l0958n4726o5827n2932k4085l5366J6440L9080o8766p9526m1041M2096
8135H1388L0787N4791l2694k5385M3008J4862L1405R171m4229l4706p4895K8964
$$ y = [324714, 338220, 320235, 320510, 325830, 378213, 462593, 540506, 692392, 891385, 1149040, 1489266, 1915938, 2326216, 2830495, 3072530, 2639270, 1922861, 1363248, 1008852, 809839, 716327, 576410, 479572, 436012, 394693, 365452, 303377, 304074, 288841, 198257, 185695, 192467, 190407, 237321, 260722, 270787, 275525, 256084, 175911, 151527, 174084, 174891, 144761, 134706, 163273, 137924, 145237, 174700, 217756, 202416, 200524, 289279, 367735, 497130, 616718, 750854, 942999, 1176748, 1383516, 1486565, 1338316, 1059173, 817942, 622813, 495454, 436999, 406041, 351315, 285488, 232556, 208471, 173105, 189545, 228625, 159859, 80333, 39292, 81388, 112175, 166966, 134272, 108887, 151895, 166757, 198162, 207333, 163104, 128398, 53503, 82467]
8123H2467M4168p078N7478j3227r813J2847J7577L905k2650n7534n2271m5735
8111A0134L6928m52j0793R775k0227R988j3966k4076R03K2926K6599J0702P3746
8098A32187L5295m3064l4715n3364j8165K6058k8417k2223L0410j07R566L0113
8086F3574n616j00114m5790L1473K4286l6248J865L6561J1988P814p066m113l3237
8073e4623m547M2466l5734J634P5474K8729J9593P817k5714L4913j4958J8698
8061I3748m2548R619K9305j1563r567L3731L2178o6186p0943M6291N4885L0236
8049A29186L4662n7679l1225K6215m0853l5111o863N1112j2261J6373L1424m6229
8037E8751o2799O442L4374L0387L5582J7023m8566k0410J70J1369J1409J4919
$$ y = [82467, 126635, 119557, 177035, 163808, 153995, 166842, 184419, 188324, 165674, 108140, 55869, 10134, 47062, 46610, 35817, 45592, 25365, 35353, 21387, -2689, -1786, 21140, 47739, 58441, 132187, 167482, 124418, 89703, 36339, 18174, 44232, 15815, -6408, 24002, 23895, 33461, 63574, 57958, -42156, -87946, -56473, -32187, -68435, -66570, -30009, -18021, -10207, -17273, -21386, -54623, -59170, -16704, -52438, -50804, 24670, 53399, 72992, 80809, 55095, 90008, 75050, 93748, 51200, 60819, 90124, 78561, 68994, 102725, 134903, 68717, -2226, 44065, 98950, 129186, 163848, 106169, 74944, 101159, 60306, 25195, 18332, 69444, 57183, 73556, 104980, 58751, -4048, 2394, 36768, 67155, 102737, 119760, 71194, 50784, 50954, 62323, 73732, 88651]
8025H8651j3871o633o0841R268K7984k7742k4649J8208M1998L9832j3181q5977
8013f953m2620N2768N3331m3082j332M3340J832o018j1248o5219j3517l5126K4626
8000d9218N7044K3106n9864K8479L5988m0217l2789M5367N4687j031l142k9793
7988B8617p3898k8395L2416R0611K4646J4505j3295m0544M168J0805n505J5770
7976E9901m8l4963k221M6297R398P338K3926j80J284j2310m426m7489n1967m4277
7962d9737K2481k7201P5592j6518J3550Q501O864M3457M064j2754p7720k7487
7950c6908K1566K3759K8812O5918j4659j0834K935N0339j8093l9921k6398k3120
7938B3396K5732J788o516k0638J1200Q2611O3817n97n5742K7248M3580n4895q008
$$ y = [88651, 74780, 68147, 7306, 16574, 44558, 16816, -7833, 10375, 52373, 92205, 79024, -6953, -49573, 3195, 56526, 13444, 12112, 55452, 57284, 51266, 40018, -25201, -38718, -73844, -49218, 7826, 30932, -28932, -453, 35535, -4682, -37471, 7896, 62583, 61552, 58410, 28617, -45281, -73676, -41260, 49351, 73997, 88502, 75207, 34663, 38831, 49636, 44131, 59901, 59853, 24890, 22669, 68966, 78364, 85702, 109628, 109448, 110732, 98422, 93996, 46507, -5460, -49737, -27256, -54457, 21135, 4617, 18167, 26668, 33532, 76989, 81053, 68299, -9421, -36908, -15342, 8417, 37229, 103147, 88488, 77654, 80589, 130928, 112835, 72914, 46516, 23396, 49128, 50916, 44400, 23762, 34962, 117573, 181390, 180793, 125051, 152299, 195879, 140984, 132976]
7925A32976k8400m1185n1025n1940O8856K5334L193k7852l349j491M2743L1318
7913I9178m6053m9327L6767J1450k3733k7723N1097Q1947l7276l6534J9441N152
7901H4386j2424l1470J3383K9149k9730K114k8467J6454O1512l5198r820n661
7889E4228Q2965j2447r4160k2470Q271k6738k6463k5468k167j1422K9852j1305
7877e7324J0434N5943K3721k8412K9507Q7951m09l4911n3336o5238k9613N9231
7865b456J7322O7853K3332n1313q939o1302l5745L3384J7048n9753k0831L889
7853g7511k3879K0104L7496K272l0329r077O0434M7694K992l0110n778j7936j0965
7840c4593K3159L9870l2505n0974N1936L9880j3670l4107o745L8931J1805l7663
$$ y = [132976, 104576, 63391, 12366, -39574, 29282, 54616, 57809, 29957, 26608, 25117, 67860, 99178, 53125, 3798, 40565, 52015, 28282, 559, 51656, 133603, 96327, 59793, 79234, 84386, 71962, 40492, 53875, 83024, 53294, 55408, 26941, 43395, 104907, 69709, 59889, 54228, 137193, 124746, 30586, 8116, 16387, -10351, -36814, -62282, -64449, -75871, -46019, -57324, -46890, 9053, 32774, 4362, 33869, 121820, 121411, 86500, 33164, -32074, -61687, -2456, 14866, 82719, 106051, 54738, 45799, -15503, -51248, -17864, -816, -60569, -81400, -77511, -101390, -81286, -43790, -41518, -71847, -80924, -20490, 27204, 30196, 86, -5692, -23628, -34593, -11434, 28436, -4069, -55043, -3107, 36773, 23103, -11004, -17749, 21182, 32987, -4676]
7828d676K4254k6762k7720L6477Q112j714K8454M7801l5939J368M0183j7631l5771
7815C6436m2694k9930K8150K9571M6815k3229k1624P857j4883l4178Q291J4043
7803D625J3745J7676K5231M013p7497M3839R220k0909j5335J2870M795k1925K0064
7790B0412L8631l9971j5942O3471N6812J5160o1644n9207j8263J1495k500l0407
7778b1953L9283M6612o0798k2468J5295K507q841j587J8328K5009j3463n3371
7766c5447k6646Q517L905M6055K1657r071k8412K996K5506k930k8104k8609k6877
7753g7460P352L7689L4239Q35k5519N306M7452o750j4019l3834K3077J9854j8323
7740a01J6647N2141o8034n9481K1529K2045j7653n6607J657J2587L2844K3627
$$ y = [-4676, 19578, -7184, -34904, 1573, 9685, 7971, 36425, 84226, 48287, 49655, 89838, 72207, 36436, -6258, -36188, -8038, 21533, 68348, 45119, 23495, 31352, 16469, -17709, -9418, 4625, 18370, 36046, 61277, 65290, -12207, 31632, 40852, 19943, 4608, 17478, 22273, 348, 20412, 59043, 19072, 3130, 66601, 123413, 138573, 76929, 17722, -541, 10954, 8454, -21953, 17330, 63942, 3144, -19324, -4029, -1522, -10363, -11950, 6378, 31387, 17924, -35447, -62093, -53576, -49671, -3616, 18041, 8970, -19442, -16446, 9060, 6130, -21974, -50583, -77460, -70108, -32419, 1820, 2655, -22864, -17558, 29894, 23144, 9125, -24709, -1632, 18222, -101, 16546, 68687, 653, -58828, -37299, -15254, -32907, -89514, -87857, -75270, -42426, -18799]
7728a8799K0200l1573l4483Q660L6799k7023M5901L5912l956N9508M6163n2497
7716H4812l7065j4651l5163j5584q253L5365O2385k7580j8515M4907q627n3262
7704H769J6364J6542L475k7119l0714k1623q464L1927M5765K4956j374M040Q3686
7691A46230O4292R16o6899n7892l1200l5842R426Q840L8096k5091M306J0636l5702
7678C0116J0851R447k8209m5239J3341L7145K5197o9401n4207O592K7824N7851
7666B1308m475O759J3769K0764j6105l3249M8252N2388M033m4229M001l7296m8997
7653a3077K2507L8097K8297P612Q012k7383m6920p4689l8388L9934M3183M2527
7641B9712L488K6536j1811l2982J6215m7027N6320N0345N7080K3903l7781n5943
$$ y = [-18799, 1401, -30172, -64655, -55995, -19196, -46219, -318, 35594, 31638, 91146, 137309, 84812, 47747, 33096, -2067, -17651, -25904, 9461, 71846, 44266, 25751, 70658, 62031, 8769, 25133, 41675, 45150, 18031, -12683, -34306, -42770, -10843, 34922, 59878, 58504, 62544, 146230, 210522, 211438, 144539, 86647, 55447, 19605, 29031, 37871, 75967, 50876, 55182, 65818, 30116, 40967, 50414, 22205, -23034, -9693, 27452, 52649, -16752, -70959, -64367, -36543, 21308, 16833, 23592, 37361, 58125, 42020, 8771, 57023, 109411, 113444, 69215, 73216, 35920, -13077, 9430, 47527, 75824, 83436, 91448, 64065, 17145, -57544, -95932, -55998, -12815, 29712, 33200, 59736, 47925, 14943, 31158, -15869, 40451, 90796, 147876, 171779, 133998, 78055]
7629G8055r8632l4870Q961N3426K1042J9269K0689K0615k892k4018k3246K3250
7617F1649J3216p531j2013r406Q525M6878P2434j5213l8393k0627K7007L144k1353
7604A08317k8422J342l5015k3037j4101o218M9016N5458J9640j2652l6865q1832
7592d369k8024K2509L4583N0320j9492o2781k8605R4167J3670m7402n2607l126
7580c1157K6057l7478j1905O4725N471p8988M70M2748N9848j8547j00610n6874
7568a36240m379l3968O0799O0470O3351N429o754K9867L5372j3091o531l8521
7556A5804N2365n172p6670n346j2182M247K5632P6566N3510O40k776k2020q438
7543I6160K8466l3725m5830l4038j300M2142K6019j2172j68l0510l2460n5367
$$ y = [78055, -20577, -55447, -46486, 6940, 27982, 47251, 67940, 88555, 85663, 61645, 38399, 61649, 74865, 67334, 55321, 45915, 54440, 101318, 173752, 158539, 120146, 99519, 126526, 129670, 108317, 79895, 81237, 46222, 23185, 9084, 2866, 51882, 107340, 126980, 114328, 77463, -4369, -32393, -9884, 24699, 75019, 55527, -7254, -35859, 58308, 71978, 24576, -28031, -31157, -5100, -42578, -54483, 10242, 15713, -63275, -62805, -20057, 39791, 21244, -79366, -136240, -140619, -174587, -113788, -53318, 10033, 15462, 8708, 38575, 73947, 60856, 54325, 15804, 68169, 62997, -13673, -19019, -31201, -26954, -1322, 75244, 128754, 129394, 126618, 104598, 96160, 124626, 90901, 45071, 11033, 9733, 51875, 77894, 65722, 65554, 35044, 2584, -52783]
7531e2783P429N4436L5693k054K3023M3848k2452k1216l361q7l0897Qj5178k680
7517A3729n328n761n339L766J2879K3076L4422J4550l3752l5200L2768K238J5451
7504F7499j3931L8398N8987m0905o8376j5584L3155J9557M2505j4964n5659m1277
7492I405k7860q760L985k6158N14L0454j886P8728L3940K7999m8583l2311l0165
7479I302k6399m1918J6661P8342O8517N5823p1911l4056l6940j7978L6438L3834
7467F9715q194l3933k2707k205J8104l3138l8797J3147N4048J6382M0448J3677
7455H6547K6615N449n2882m7071R964R7408L062n0276q702j1540j8587l1253j4160
7442e426M9319M2781o4012l6552M77P0413o678j1709M2177o672j6672K927J0257
$$ y = [-52783, -45354, 9082, 44775, 42721, 65744, 109592, 87140, 65924, 62563, 62476, 31579, 31587, 16409, 13729, 8401, 2640, -2699, 1067, 13946, 37022, 71444, 85994, 52242, 17042, 49810, 52048, 67499, 53568, 91966, 150953, 110048, 41672, 26088, 59243, 78800, 121305, 106341, 50682, 9405, -18455, -27215, -23230, -49388, -48874, -18420, -20306, 58422, 92362, 120361, 71778, 39467, 9302, -17097, -59015, -42354, 35988, 104505, 160328, 88417, 54361, 17421, -557, 35881, 69715, 61521, 27588, 4881, 2676, 20780, -12358, -51155, -38008, 16040, 32422, 72870, 86547, 113162, 118611, 65729, 18658, 28622, 126030, 129092, 78816, 70114, 58574, 39987, 8734, -5426, 43893, 86674, 22662, -13890, -13413, 57000, 50322, 38613, 80790, 74118, 57446, 60373, 70630]
7429G0630l5646n6936q034p0366j341O3028K2658j2788L1871M6101J7305l9850
7417B6632n2159k0809o689q636J2216L1529J4014j5588M0725N1433r970k5309
7405C7389m585j5559J4114o701J3581j4339N294K101k6330n690M253J0575j4367
7392b64N3197m455l0526n2426l107K1690M1320L3016l0713J247k0123k169K7577
7379C4264N0033K4432j14846o7442k4402R522J4860P4798O5565M1781L0268o8121
7367G0712m3461l838l9423m4620L3621K6674K971n228M0510k4375l2212K3416
7355D747N1918K4447n2585m4098K9215M8591J05j6879j1820K2936L528l4678l2643
7342g216r864J5193L4137L912k8277k4132j3756K1048J0582n661M5929K3083K954
$$ y = [70630, 34984, -21952, -29986, -100352, -101693, -38665, -16007, -28795, 3076, 49177, 66482, 26632, -25527, -46336, -53025, -61661, -49445, -17916, -3902, -19490, 21235, 72668, 62698, 37389, 32804, 17245, 31359, 24658, 38239, 23900, 29194, 31295, 4965, -725, 3528, 14103, -264, 52933, 48478, 17952, -34474, -37581, -15891, 25429, 58445, 27732, 28979, 8856, 6687, 34264, 84297, 108729, -6117, -73559, -97961, -88439, -73579, 1219, 66784, 108565, 138833, 70712, 27251, 23413, -16010, -60630, -27009, -335, 2636, -2592, 37918, 13543, -18669, 4747, 56665, 81112, 28527, -15571, 13644, 62235, 62340, 45461, 33641, 56577, 60105, 25427, -7216, -17080, -1887, 32250, 36162, 7885, -16247, -30003, -8955, 1627, -4034, 41895, 64978, 67932]
7329F7932J476l4753k9090J5787j212M1533M0257l9567o3658M0132l7739m6554
7317d5456M0397L4519n6923n494j2194N680L3854K1963K1418J1910j4348k2118
7305A3208m3511k6495o3556K6879N1714P3514n700k3718j0115m9935J6100j0590
7293e2205N265O1334N1516k319q1255k3384l4725L6609J00908J6291j0942j1327
7281E5766k9928m8068n750P3717j2643j8861O498j240j5211m390K316j9506l6510
7268e3810R686L7317K2033p013M7959k8575j8201K9156l206M340K0085K5755m0756
7255D4770l3144k3900J9157L2025L042J972n4857l0906j9243J0105K9998M9288
7243B8307p0987K1856N0228J9456n7126m5747j1008K7973J5861l270K4521k7848
$$ y = [67932, 69408, 34655, 5565, 21352, 20140, 61673, 101930, 62363, -1295, 38837, 1098, -45456, -5059, 29460, -27463, -32957, -45151, -39471, -5617, 16346, 37764, 49674, 35326, 13208, -30303, -56798, -120354, -93475, -41761, 31753, 26053, 2335, -7780, -57715, -41615, -52205, -46940, 14394, 65910, 63591, -17664, -41048, -75773, -39164, 61744, 78035, 67093, 55766, 25838, -22230, -27980, 45737, 33094, 14233, 20731, 19491, 4280, -110, 2206, -17300, -53810, -44124, -6807, 15226, 8213, 56172, 27597, 9396, 38552, 35346, 39686, 59771, 85526, 44770, 11626, -12274, 6883, 38908, 41950, 43922, -10935, -41841, -61084, -50979, -20981, 28307, -42680, -20824, 29404, 48860, -8266, -54013, -65021, -37048, -21187, -24457, 64, -27784]
7231b7784M5256O0679M4266p4164p8717o0437L1283L2473O484K1190J4379k0706
7219e798k0641J4431p62n953j5219J1352Q61O227l7263m7585P485K5050K112J2800
7205e2903J0465j1226J2447L6595k3248l8034N8058L1472R33Q849m108Q6546k2259
7192I3587l728q131l2493m0603M1177k9705J362J1357l451l5456J5720K7533l4613
7179B556m7724r411N3806L6507J7694j0301j681j3036j794o623R407J0256n9462
7166a9806n234J8475k2718k8019M0696J0347l0438J1231l3746j3114k7482M7292
7154e2516R386m0635N4364N3796J6800j0966K5174r967k1030q593K8205l3338
7142A0680m8924M9543K9787l4828l6983K3675L3230L7288L8210k0376p4718q8366
$$ y = [-27784, 17472, 78151, 122417, 48253, -30464, -90901, -59618, -27145, -20661, 529, 14908, -5798, -26439, -12008, -12770, -18723, -33942, -22590, -21729, -15502, -52765, -100350, -92865, -67815, -65703, -52903, -42438, -53664, -41217, -4622, -27870, -65904, -7846, 23626, 24559, 33408, 29300, 115846, 93587, 89859, 81728, 49235, 8632, 49809, 20104, 21466, 32823, 29372, -6084, 9636, 37169, 2556, -45168, -54579, -773, 35734, 53428, 43127, 41446, 28410, 26616, 19993, 29400, 39656, -19806, -25040, -6565, -29283, -57302, -16606, -6259, -36697, -25466, -59212, -72326, -99808, -52516, -43130, -83765, -29401, 24395, 41195, 30229, 55403, 45436, 24406, 15813, 44018, 10680, -38244, 11299, 41086, 6258, -30725, -7050, 26180, 63468, 101678, 81302, 6584, -81782]
7130h1782j3249L1749L1908j3717m0405j8508M2455O191K8266j9104J9551J1976
7118a4669P546J3867l4057j7068K8067J4077K3027l4118l3800J7041K0692k3370
7106c2765q1853J8385R3480Q1932j172k6455n2708K5171k890n5439j4322n2181
7094a00817K0429O2113Q2855K141n3395l2218m9108l7625K2229P9446M5942M8867
7082I0859P832j668N925l7656J0362k437n3484p6264m208N2900L2701q617J5846
7069C2091m9748k3410o265J4327k006N5483l189r434k9551l9803J6050j1954J9544
7056c7865J8504k6834k0650l1479o650K7696k5899j8185o410N5498P7919K330
7044G975j1127j4199m6848M6360j1642K759m246q792K0879J5616k7189k3471k9666
$$ y = [-81782, -95031, -63282, -31374, -45091, -85496, -104004, -61549, -55358, -27092, -46196, -26645, -14669, -7123, 6744, -27313, -44381, -16314, -2237, 20790, -13328, -47128, -30087, -9395, -32765, -114618, -96233, -2753, 79179, 78007, 51552, -1156, 24015, 21125, -34314, -48636, -100817, -80388, -18275, 64580, 66721, 13326, -18892, -68000, -105625, -83396, -3950, 41992, 90859, 98691, 97023, 102948, 65292, 75654, 73217, 19733, -56531, -60739, -7839, 24862, 16245, 32091, -17657, -41067, -47332, -33005, -35011, 20472, 17283, 7849, -21702, -61505, -45455, -57409, -37865, -19361, -46195, -66845, -98324, -104974, -77278, -103177, -121362, -127772, -72274, 5645, 7975, -3152, -17351, -64199, -17839, -29481, -26722, -30968, -39760, -18881, -3265, -30454, -53925, -83591]
7031h3591J0975K352l6320J2103M1636K8178L4486j5563J865j3095k6750N328
7019c8396o252l2358J0083r977J020l6402K3883P9961M3293Q847K006r58n9371
7006a4621o0809k8535L0729K6434J5179K4427R339M5032K7378L2665J8483p2231
6994E3470m3951k057l5807k3355L5466M8186j0729j8393l9187m59l1892M814P7529
6981A3635m212l5607r587N6116o496o9530l6298J6711j3840k6980l0551M1478
6969a05161Q3295J8158p7190l4532O488O6203L2115J0475J02N653k7863M6676
6957B4419N3781m5529j5693k6579N627n1880n669O537P0915K9068j2529m0826
6945h358M2076l5236o4661q616K7306N239J7507R918J1210J982m5996k2425K8762
$$ y = [-83591, -72616, -70264, -106584, -94481, -52845, -24667, 9819, -5744, -3879, -16974, -43724, -38396, -44648, -77006, -66923, -76900, -75880, -112282, -88399, -8438, 34855, 43702, 45708, 44750, -14621, -75430, -103965, -73236, -46802, -31623, -7196, 2143, 47175, 74553, 107218, 125701, 53470, 9519, 7462, -28345, -51700, -16234, 31952, 21223, 2830, -36357, -36816, -68708, -63894, 13635, 9423, -26184, -35771, 20345, 13849, -55681, -91979, -75268, -89108, -116088, -146639, -105161, -21866, -3708, -80898, -115430, -108942, -42739, -10624, -149, -47, 5606, -22257, 24419, 78200, 32671, 16978, -9601, -3974, -55854, -61523, -54986, 15929, 44997, 32468, -8358, 33718, -1518, -66179, -74795, -47489, -42250, -24743, -14825, -3615, -1633, -47629, -70054, -41292]
6932d1292L1746n978O2442m778l7935J2328k362P020J8763K0644K4357n9667n2011
6919b6723M7469K0620k7783j1902q518j6172M2160K1729k1092j15111n8580M0185
6907a13718N9489N7385M8858K031J0990k3n6051n8352K9935M3922k0507m4604
6895d0645K7467k6939m6314O7536N8398m0443j8830J9720M8957M2963m1602j7229
6883C3039L9864K3229l9276j1687k1258J619k8294m87L5821L8151j6009q2932
6871b8220n6092J7543J9006j9033Q1799O3458j4965o0254o4442j794L0736k3961
6859e6219J1499J9342L0832k5322m6555K0396o6737j7220P5953J0032M7789L5972
6847C9762k1180m590k4053m5795Q834K0344J7336j2391K3481M1843N9536q6n5023
$$ y = [-41292, -9546, -15524, 46918, 42140, 4205, 16533, 14171, 21191, 39954, 60598, 84955, 25288, -26723, 20746, 41366, 13583, 1681, -6837, -23009, 19151, 40880, 19788, -95323, -153903, -113718, -54229, 3156, 52014, 54045, 65035, 65012, 8961, -49391, -19456, 24466, 3959, -40645, -13178, -40117, -86431, -18895, 39503, -940, -19770, -50, 48907, 91870, 50268, 33039, 72903, 96132, 56856, 45169, 23911, 25530, -2764, -3251, 32570, 70721, 54712, -28220, -84312, -66769, -47763, -66796, 15003, 78461, 63496, 3242, -61200, -62994, -32258, -56219, -44720, -25378, 5454, -19868, -66423, -46027, -112764, -129984, -54031, -43999, 3790, 39762, 18582, 13992, -10061, -55856, -47022, -26678, -9342, -21733, 1748, 43591, 103127, 103041, 48018]
6834D8018m3225l8275o3034J4582J8961j5486M5123N0903P78l9159K2974L3258
6822C5418k4883n807L4430q643n855K6163J9650j5865k4300j6620M6848K4456
6810H4992k2490n4230j9600K1897k9535L4860Q4280o785k6850l9893o968m47m31
6797A8800p393M0646l4644q0827L2921K9608O028O615K0801J2470k7130k9957
6785a2062n9577j7713K4818J8559N2446R207m9450p85M2302N836m7601n2561J0617
6772g5964Q664l1627q573K2292P024M2006j505j6519j4649k5245L9204j7967k2193
6759i5052K7220N8717L0565o1734p865q835K8607M2459O804o2083j2585L3288
6747b0494J4140K1541M3038q252k5647k8998j7925J2980m070l9144k0516K0186
$$ y = [48018, 4793, -33482, -96516, -81934, -62973, -78459, -33336, 17567, 18345, -20814, 2160, 35418, 10535, 4728, 39158, 30515, 24660, 50823, 70473, 54608, 30308, 13688, 60536, 84992, 62502, 8272, -11328, 10569, -18966, 15894, 100174, 93389, 66539, 26646, 19678, 19231, 18800, 11407, 52053, 17409, -63418, -30497, -889, 5139, 11754, 32555, 45025, 17895, -12062, -71639, -89352, -64534, -45975, 6471, 15678, -33772, -34557, 7745, 13581, -34020, -86581, -75964, -67300, -98927, -107500, -85208, -78184, -36178, -37683, -54202, -68851, -94096, -54892, -72859, -95052, -67832, -9115, 21450, -40284, -48149, -56984, -28377, 14082, 20886, -41197, -53782, -20494, -6354, 15187, 58225, 49973, 24326, -4672, -22597, -9617, -13687, -52831, -73347, -53161]
6735e3161R365q23N47k0304j083L7601j2698k5822L4085M008J9256j269k372j9411
6721c2081k6858j7329L2385K9613P8272j5205p4187k4948k1626R437m076K0641
6709d5962J0268J1788N3787L7925l526k633o9928k6182M1995L5241L6855k2143
6697E7485q6986K1814J4402j6443M9535n983o3922j9404o5405m7284Q2221O6905
6685a3065J2104M7270J1862j6409j6758j8598l2069p0420q81J14210K4485j6741
6673B4990J4235M2315m037j1071m0024m5601j9682k7868K2539o1179n249J5486
6661i5146J9055L0446j0749K4363J1045P510l5899J1851P086N8658J5039j0728
6649C2531N0978m8499N4613K6546j7526l3978q1876n7139o805K4896K0364L7614
$$ y = [-53161, -43796, -44619, -44072, -64376, -65459, -27858, -40556, -66378, -32293, -28285, -9029, -10298, -12670, -32081, -58939, -76268, -43883, -14270, 64002, 48797, -25390, -50338, -71964, -62527, -66603, -45962, -35694, -23906, 29881, 67806, 64280, 61647, -8281, -34463, 7532, 42773, 79628, 57485, -29501, -7687, 6715, -9728, 39807, 33824, -30098, -49502, -114907, -162191, -79970, -13065, -961, 46309, 58171, 41762, 25004, 6406, -25663, -96083, -96964, 17246, 41731, 24990, 39225, 81540, 77503, 66432, 26408, -19193, -38875, -66743, -44204, -105383, -110632, -95146, -76091, -45645, -56394, -32031, -20986, -13476, -49375, -37524, -30438, 28220, 43259, 32531, 83509, 35010, 89623, 116169, 98643, 64665, -17211, -74350, -81155, -56259, -35895, 1719]
6637A719L3060j0207L662O883l4216K4469J750l8258k3641N4540J8182J3307m5111
6624F139m0410O4747O9439m6060m8004j1658p8832L0235J2460J203O94N9912N8363
6611G8228K2875J3679j0056n9707n9012m1698L2238q385n1033l8944J3362M1976
6599f6477p639m7261j6543J8844J6282l6766l7731K9065L2584N1583M1291M0928
6587A8160o4989l3283r576O0372L1610k5462N87L0252k7587R908M0959J6998P4892
6574A22841J4460p6675o5145l710O5740j7404q9086N0961N8289l8524l7446q628
6562b4327m8945j6806K3642O0856K8732K449l8288l6134m6429P737M2621M1482
6550c410j2781n935k529L0474K7657k4845l707O215n8203j1081N4484q393l9941
$$ y = [1719, 34779, 24572, 28234, 35117, 901, 25370, 27120, -11138, -34779, 19761, 37943, 51250, 6139, -34271, 30476, 99915, 53855, 5851, -5807, -84639, -54404, -41944, -40741, -40047, 19865, 78228, 101103, 114782, 104726, 45019, -13993, -55691, -23453, -31838, -82871, -121815, -108453, -66477, -74116, -121377, -137920, -119076, -102794, -139560, -177291, -148226, -115642, -64059, -22768, 18160, -46829, -80112, -89688, -29316, 2294, -23168, -22581, 7671, -19916, -10008, 30951, 47949, 122841, 137301, 60626, -4519, -8229, 57511, 40107, -48979, 1982, 60271, 21747, -15699, -24327, -73272, -90078, -66436, -5580, 23152, 25601, -12687, -48821, -95250, -87513, -44892, -3410, -16191, -22126, -24655, 5819, 33476, 8631, 4924, 11139, -47064, -58145, -3661, -12054, -51995]
6537e1995J0589q279l1768j3704N0818p04K0235L4019L5417K8135L7472J5742
6525A25977n1753o3866J528L113n4564l4659K3163L0387J0292J7209n3829o201
6513e3203K3459k479K0066O7917J9825l391l6743p4263J7796N9899j7859l5255
6501a4231l5346j2700m475O3293L8758L6333K9103k1610m6329m106k8665k1963
6489b1938k0980j2113J9701J5480k8611l0435J2019L1614L3162l2235L4612Q120
6477H396R459O87l1136r0340p6151M5006P8512j257N6904K0757n50k2345L7733
6464C5675o630q2816l3420J01873N0457j7409j7227M363j395j745r669J6754K3618
6451F2429L5597n0401j7127k2880m0182k3208j8901J6334N6919K2556K4124n6399
$$ y = [-51995, -41406, -49685, -81453, -95157, -44339, -45043, -24808, 9211, 44628, 72763, 110235, 125977, 74224, 10358, 11886, 14999, -39565, -74224, -51061, -20674, -10382, 6827, -47002, -53203, -29744, -32223, -12157, 55760, 75585, 72194, 35451, -38812, -21016, 38883, 21024, -14231, -49577, -62277, -66752, -3459, 35299, 71632, 100735, 79125, 32796, 28690, 25, -21938, -42918, -55031, -35330, -19850, -48461, -78896, -66877, -35263, -2101, -34336, 276, 8396, 17855, 18542, -12594, -102934, -179085, -134079, -55567, -56824, 80, 20837, 20287, -2058, 35675, 29045, -53771, -87191, 14682, 65139, 47730, 30503, 34866, 33471, 31726, 22057, 38811, 62429, 98026, 47625, 30498, 7618, -32564, -55772, -74673, -58339, -1420, 21136, 45260, -11139]
6439a1139k4298M8772k37J8609k8737n2652j9839r432R086M1239J4968j9205p0960
6426a03825J5528M9037j017m0009M4048j1972m173N1386L9332l1403p71j6336
6414a0175K9364q14m2001m2949l0411L5199J1378L2271J12p924M0809m236R556
6401B0179l0517J1237k4799j9857l3288K9563q596j0996L1293J8822M6699L750
6389C3490m814O2099j9467m4413k0154l0303K5196m4677k0595N0547L6563l539
6377A9933j7504k2823k9218j9985k973K0012J7305P007n977p217M8057M5587l5
6364E2169n7127L8585K8692m0604m8442m7866n3123r382M756l951M3745P592P142
6351g7814L25K5990k5392O6502J3715p2580N8337J0961K8477O3528n1892j2625
$$ y = [-11139, -35437, 13335, 13098, 31707, 2970, -49682, -69521, -78953, -69867, -28628, -13660, -32865, -103825, -88297, -39260, -40277, -80286, -36238, -48210, -52383, -997, 38335, 6932, 6161, -10175, 19189, 18375, -23626, -66575, -96986, -61787, -50409, -18138, -18026, -25950, 14859, 10623, 20179, -10338, 899, -23900, -43757, -77045, -47482, -56078, -67074, -35781, -16959, 29740, 33490, 28676, 90775, 71308, 26895, 6741, -23562, 1634, -43043, -63638, -13091, 23472, 19933, 2429, -20394, -49612, -69597, -72570, -52558, -35253, -28246, -34223, -41440, 6617, 52204, 52169, -4958, 33627, 62319, 21715, -26727, -74593, -127716, -137098, -132342, -136293, -92548, -84956, -77814, -77489, -51499, -76891, -10389, 3326, -69254, -10917, 44, 28521, 92049, 40157, 27532]
6339B7532l3726l1679J9829L563K2420m909l7356K8954j2274l4595k6992k4326
6327a03559J2772n02k7586L3543M3282M7602M2311R000P099q040k8024l1573j3001
6314a6676O3623K3775p474k3670k8261K2173J6396K3391k7081R58m9986p4370
6302g7202l507K8684J9513k0335m3452K4653k309M5770p173m3656l4374j9663
6290a33051m412M3961N0438K8761k1125r049J0416L2418L9759O659k1180k3001
6278E94o254j3502O119K2656m161P522l2662m448K6322j1852l670O315l5081K267
6264c9835K6955j2279r7K6925M139j070j8320N5755j3720n4642k486J3619j8762
6251c3818J2563R554j178R25M6564k1974j5558M8903L6691l6509n9349p0090l9491
$$ y = [27532, -6194, -37873, -18044, -14481, 7939, 3030, -34326, -5372, -17646, -52241, -79233, -103559, -90787, -91289, -118875, -85332, -42050, 5552, 47863, 56863, 63962, 55922, 27898, -3675, -16676, 46947, 70722, 63248, 39578, 11317, 33490, 49886, 73277, 46196, 47154, -2832, -77202, -80709, -52025, -32512, -52847, -96299, -71646, -73955, -28185, -35358, -79014, -113388, -133051, -137463, -93502, -43064, -14303, -35428, -44477, -34061, -1643, 38116, 44775, 23595, 594, -5660, -19162, -13043, 9613, 5452, 12974, -19688, -24136, 2186, -9666, -13336, -7021, -42102, -39835, -12880, -25159, -25256, 1669, 5808, 4738, -13582, 42173, 28453, -26189, -28675, -15056, -33818, -21255, -11701, -12879, -11954, 34610, 12636, -2922, 45981, 82672, 46163, -13186, -83276, -122767]
6238a22767M9818N8025N4776m464m8471o4855J5466j5320j5150m105J0927L7714
6226d8406L1858O732J0254k7174n2846K2000O076R501m110j1691k3112N0763J349
6213b8806j8558l976o5228J6016N5211N8615L2041J6761N056k9519O65J8071O307
6200F2656n821K631k8746l2884k2980K135k4140J571K0603o362J3615K1257P582
6187A1117O0497j0682l4639m0767k1798J3902L6222j3300k3029K8477L84l6778
6175c0394L7548O5501Q867k4114k4697J819n1241l8610K5546L7502N4366J1761
6163G3854j0936l7604m6582L315L824J3569J2160N551J3288j0423k8660O925L2660
6150C0941k7839n698l7133L6276M008M6994J8262K1149j9507m4311J9916N5204
$$ y = [-122767, -72949, -14924, 39852, 35388, -13083, -77938, -62472, -77792, -92942, -97047, -86120, -48406, -16548, -9816, 438, -26736, -79582, -57582, -51506, -42005, -46115, -57806, -80918, -30155, -28806, -47364, -51340, -116568, -100552, -45341, 13274, 45315, 62076, 67132, 37613, 38278, 56349, 62656, 56835, 59466, 30720, -2164, -25144, -23009, -47149, -45578, -24975, -31337, -17722, 3535, 11117, 71614, 60932, 26293, -14474, -36272, -22370, 13852, 552, -22477, 6000, 6384, -30394, 7154, 72655, 81522, 57408, 32711, 34530, -16711, -55321, -29775, 7727, 62093, 73854, 62918, 25314, -21268, -17953, -14129, -560, 11600, 17151, 30439, 20016, -8644, -1719, 30941, 3102, -2596, -39729, -3453, 555, 47549, 65811, 86960, 67453, 23142, 43058, 98262]
6138I8262n693j9476R98J0563j6353l6926p457J4925m0672n1833P441l4352J6547
6125f4026N1920M2235n2885m9377l328O5520L9308K4672j4064j3655J1944l9030
6113g66J7461l0202k6647k281L0789j7848o4770L8560k8956o079M1941J7796O3737
6100C2735K5519k4071r4080k2509r015K3005P3439P1759k7848l9678j9273J5335
6088E318k8406K6521K7l5201K503m1338o1899n1845M9504P1023K6791M6436L8905
6075D8339n956k7314J6104O419k5654N704K4248o6810m615j3368J2200o2475L934
6062h9244k630l1283L7284r487L8373l9248k3377N43k3408K2681M2130J0968j1557
6049g8255Q089l0941M0945J6608J7708J3191J8888m2326l8826K7246P5323m803
$$ y = [98262, 92569, 73093, 74091, 84654, 68301, 31375, 23918, 38843, -1829, -53662, -46221, -80573, -64026, -12106, 30129, -22756, -72133, -75461, -9941, 29367, 54039, 39975, 26320, 38264, -766, 16695, -13507, -40154, -42435, -11646, -29494, -94264, -55704, -84660, -90739, -48798, -31002, 32735, 58254, 34183, -59897, -82406, -91421, -68416, 5023, 76782, 48934, 9256, -10017, 5318, -23088, 3433, 3460, -31741, -29238, -70576, -132475, -184320, -134816, -63793, -37002, 9434, 48339, 42383, 15069, 31173, 37592, 11938, 17642, 41890, -24920, -29535, -42903, -30703, -93178, -89244, -91874, -123157, -85873, -95360, -56987, -96235, -119612, -119069, -142477, -119796, -77666, -66698, -78255, -70166, -101107, -60162, -43554, -25846, -12655, 6233, -36093, -74919, -47673, 27650, 22847]
6037B2847l2163j5421K0430J8428n6010o713L9773l1701m3173J4004J4031n369
6025f1037k4059J0344K2747N2369M7015M386j4001J1481j9785m8562j8336P1838
6013C4400N9463m6312m3617j2827l2322N6263L9651K3501k5450L5367k9716m8781
6001I620m3040j5851M2375N0786M2256n6267k0595P618m7591k8571k8635R536
5989g8359P606K1554L4810L7423K8567K0319L481k1296n6955j5246j0880K2695
5977f281j368J0088n2410L280P1145k5957l4643p519l0660Q324J0140j864K6995
5964c0730J2709q5871J6933M6601o908k8444M0609L1569L6671m321L016l4131
5952b297l5880M1832L8980K8280l9494n005K8064j4981j3289K6968O154m6734
$$ y = [22847, -9316, -24737, -4307, 14121, -41889, -48602, -8829, -40530, -83703, -69699, -55668, -61037, -85096, -74752, -52005, 364, 47379, 51765, 37764, 49245, 29460, -19102, -37438, 34400, 93863, 47551, 3934, -8893, -41215, 15048, 54699, 78200, 52750, 88117, 58401, 9620, -33420, -49271, -6896, 43890, 86146, 29879, 9284, 16902, -30689, -59260, -87895, -78359, -70753, -49199, -14389, 23034, 51601, 71920, 75401, 54105, -2850, -18096, -28976, -6281, -7649, 2439, -49971, -46691, 24454, -1503, -36146, -43665, -74325, -66001, -55861, -57725, -30730, -18021, -103892, -86959, -40358, -47266, -75710, -35101, -3532, 33139, 28818, 31834, -2297, -38177, 3655, 42635, 70915, 31421, 26416, 54480, 39499, 26210, 53178, 59332, 12598]
5940A2598J7505l1252p609L0185K0843M588k6523K0494p44J8695M848l0318L2886
5927F6196O4566k8257j22053J0158M5131M86J7836Q046l6944l4666L2432k7141
5915d210q898K6656M4403l0302j9756L2500L3763k8886J6058J932j7650L0082
5903G5692j2184k7497m291J2863j601o0325j102J9867L3325j112l9513n3170p1327
5890a30375m6397O658L3184L4129J9158P370M3760N7306K6903n6004k7572J5159
5878a6721j4142L4873k5708L615L6436Q8945L633j07303J3821K4163r878l41m1175
5865i782l0920K5722j3599O4987n054l4433j4790k8405J2021k6766K0676R788
5853c0555Q527j6454j4567J8221o4703M1252K9205K245k0822k6557M0692K3097
$$ y = [12598, 30103, -1149, -8758, 21427, 42270, 46858, 20335, 40829, 40085, 58780, 63628, 33310, 66196, 130762, 102505, -19548, -9390, 35741, 36227, 54063, 62109, 25165, -9501, 22931, -4210, -13108, 13548, 57951, 27649, 7893, 40393, 74156, 45270, 61328, 63260, 45610, 75692, 63508, 36011, 31720, 44583, 42982, -17343, -18445, 1422, 34747, 33635, -5878, -59048, -130375, -176772, -170114, -136930, -102801, -83643, -76273, -32513, 24793, 51696, -4308, -31880, -16721, -30863, 4010, -21698, -18083, 18353, 107298, 110931, 3628, 17449, 41612, 31734, 31393, -9782, -40702, -14980, -28579, 36408, 31354, -3079, -17869, -46274, -34253, -61019, -40343, -30555, -22028, -38482, -53049, -34828, -99531, -58279, -29074, -26829, -47651, -74208, -33516, -10419]
5841a0419j9359O3627o772m8029q667J1241j870R623M3607j4344J206K649r794
5828A2699n0161M2051P4643j1347j6880o6504n8292j6522K7560J8322j9852M863
5816e9420J3321K6124k4683k6538k2956K2446O854j2985K9778L6364o706M6464
5804B8063q595O444J9614K1501k9192m2016m9822L7988j984q3000K5637N1095
5792b4267N87N1879N7l4179m7089r514P2440j3431n8756O1715Q3275k2941m8353
5779A1423L432K7721l3382L3616N894K1459l2360j3583l2079k7205M7414J2841
5767B5191k2101j2260r212J0552r56l9657j2832K2682j0602J2767k6898l2094
5755i5420P2246K0233l4944n802M961l750O838J1153M5522l4243k2528O673J0107
$$ y = [-10419, -29778, 33849, 27077, -20952, -29619, -18378, -20248, -10625, 32982, 18638, 19844, 22493, 12699, -37462, 4589, 79232, 67885, 51005, -15499, -73791, -90313, -62753, -44431, -64283, -59420, -46099, -19975, -44658, -71196, -94152, -71706, -64852, -77837, -48059, -11695, -18401, 28063, 19468, 25912, 45526, 67027, 37835, -4181, -54003, -16015, -17999, -100999, -75362, -24267, -23680, 28199, 28256, -5923, -53012, -62526, 9914, -3517, -62273, -558, 82717, 59776, 11423, 14855, 42576, 9194, 42810, 48704, 70163, 37803, 24220, -7859, -35064, 12350, 25191, 3090, -9170, -18382, -7830, -8786, -48443, -61275, -38593, -49195, -36428, -63326, -95420, -23174, -2941, -37885, -43687, -38726, -42476, -35638, -24485, 21037, -13206, -35734, -29061, -18954]
5742a8954k2572P78N4238J9247p1512l1975L1502O0352K8189k6620p6691J4618
5730c9400M3404l2169p7243N9406L5177J8521L1388l8584l4280M7357M0179K744
5718E6500J8322L0193o9445m6135n1849n073n872j4610K3715K0394L1521J8548
5706F209L4992m1865n1060K0217l485n3568r1743P5650P0394q23m1304l7553J9949
5693i3990L0641j9919R052J6043L2329q922K1143j0799J7660K2405J5030m311
5681B6362j2911J2155j0183k7238m918j379L6753K0469N158l3663j0156j1656
5669a1207K4276o684J5983P370n7316j306q862J0134J6443J5326j4937P957L564
5656G41K1456L1252N348l1020J42O6651N606k7159j1469Q620m2163m5994m2796
$$ y = [-18954, -41526, -40748, 13490, 32737, -38775, -70750, -39248, 21104, 49293, 22673, -54018, -39400, 4004, -28165, -105408, -46002, -10825, 7696, 39084, 500, -33780, 13577, 53756, 56500, 74822, 105015, 35570, -10565, -62414, -67487, -73359, -87969, -64254, -43860, -12339, 6209, 41201, -664, -51724, -31507, -34992, -88560, -180303, -104653, -34259, -35082, -76386, -113939, -93990, -63349, -83268, -74216, -58173, -25844, -34766, -13623, -24422, -6762, 15643, 30673, 26362, 13451, 25606, 15423, -11815, -16733, -18112, 18641, 39110, 44268, 10605, 449, -11207, 13069, 6385, 22368, 29738, -27578, -28884, -37746, -27612, -11169, 4157, -10780, -2823, 741, 22197, 53449, 58797, 27777, 27919, 94570, 100176, 73017, 61548, 70168, 28005, -17989, -60785]
5643f0785l8440j1526J5483K3441L2680J4160j3196n551J1149M8474K5696n828
5631C5757j4531l3519K1278L8986O9347l855j281l4505n9200k9468m8865j7876
5619g7732l8997k8833J3920O8917K3567M5917M8331l7553K9197m2032n1226l6841
5607h3365j0179j6486k02N9826K3646J8276k2893J5991n3918L4181N0445L8726
5595E4048k5425k151o2807m4561j8566Q3711N3404k2278j0804p6115p1371k9525
5583a72440l0128N1641M8548k7028L165K7947O4458K8726j5426M4546L3052k7922
5571B9139o1298k8209l5771M6832K9012J5287J8754j6446J6000j2157n5969j393
5559e6219L9773J3739l9177k2661J8653P0071L4761k7961l027O330J866q645j7411
$$ y = [-60785, -99225, -110751, -95268, -71827, -39147, -24987, -38183, -43734, -32585, 15889, 41585, 35757, 21226, -12293, 8985, 47971, 117318, 113463, 112182, 77677, 18477, -10991, -59856, -77732, -116729, -145562, -131642, -62725, -39158, 6759, 55090, 17537, 46734, 4702, -46524, -83365, -93544, -110030, -110232, -50406, -26760, -8484, -31377, -15386, -69304, -35123, 15322, 54048, 28623, 26472, -36335, -80896, -99462, -15751, 37653, 15375, 4571, -71544, -142915, -172440, -202568, -150927, -102379, -129407, -126242, -98295, -33837, -5111, -20537, 24009, 57061, 29139, -32159, -60368, -96139, -49307, -20295, -5008, 13746, -2700, 13300, 1143, -54826, -56219, -16446, -2707, -41884, -64545, -45892, 24179, 58940, 30979, 27952, 34282, 36148, 27503, 10092]
5546A0092j1319l5781k258j7079j6736N9755N7094l2223l3860L5866k4454j9734
5534c0637j4894M3526L3113j2851o327R381M6920O6215p119o9032o4187J5443
5522I551k1851L2381P0742L0794L1444n8372p6050p2225j2764P3313M167J2945
5510B4075Q977k2762q294o988m0201L5667N9451K8535n0736l2673m1170l0944
5498g7063L6151L5770m350k247j1983l1117n08M3389N1328J9344m7991k1547k0953
5485c1777J3523L1589j3949n1965j3394J414L1315J1173J7476p781n6325j3554
5473h2255P884j9066L3659P2673M5908K7348n5189l5674J5610J6265j1487l9691
5461b4015k5165P801L2694O446l4522n8565P667r844K8483K9943P1699j2533n3845
$$ y = [10092, -1227, -37008, -39266, -56345, -73081, -13326, 43768, 11545, -22315, 13551, -10903, -30637, -45531, -2005, 31108, 18257, 11930, 21311, 68231, 134446, 127327, 58295, -5892, 9551, -12300, 20081, 90823, 121617, 153061, 94689, 18639, -53586, -66350, 6963, 11130, 24075, 33052, 10290, 1996, -4992, -45193, -9526, 49925, 78460, 27724, -4949, -46119, -77063, -40912, -5142, -9492, -11739, -23722, -54839, -55347, -11958, 39370, 58714, 10723, -10824, -31777, -18254, 13335, -614, -52579, -65973, -64559, -33244, -22071, -4595, -12376, -68701, -82255, -74371, -93437, -59778, 12895, 58803, 86151, 30962, -4712, 10898, 27163, 15676, -24015, -49180, -41379, -8685, -2239, -36761, -95326, -87659, -97503, -69020, -39077, 32622, 20089, -33756]
5448c3756k6679l1710l5368k2692L0842L003jj4325M1999P6976o162o299k6086
5435e0258k3689K2181Q8830j241m8775L0329k342m0113L618J8321l3764o9902
5423a06805L6232L3298Q702J8308j1944r4739J3212J01871O2977L003o8169l5030
5411c9084j6731l4357M2237P858L0181J3805J2250L1073p007j5124N74M368m3940
5398a3897j2016J2834k1651K1219J8038k2266n0243k1041J5599K8405M2900j5523
5386a7642j8152K0623j0881k0681j5386L0651Q396L4066R254n9082m4798j8910
5374a02542P480N0635L9752J6727p385m5877K529O915K5179J8851J076o547j0376
5361c583n7929J1669J3832M7275O297o314o1451j01842k4930O0894n032J7061
$$ y = [-33756, -60435, -92145, -127513, -150205, -119363, -116360, -116361, -130686, -88687, -11711, -17873, -24172, -50258, -73947, -51766, 37064, 35823, -12952, 17377, 15035, -25078, -21460, -3139, -36903, -106805, -70573, -37275, -28573, -10265, -22209, -116948, -103736, -1865, 61112, 64115, -4054, -39084, -55815, -90172, -47935, -40077, -9896, 3909, 16159, 47232, 40225, 25101, 25675, 30043, -13897, -25913, -13079, -34730, -13511, 4527, -17739, -67982, -89023, -73424, -45019, -2119, -17642, -35794, -15171, -26052, -46733, -62119, -31468, -23072, 10994, 20248, -38834, -83632, -102542, -95062, -44427, -4675, 12052, 4667, -41210, -38681, -31766, -6587, 12264, 13340, 6793, -3583, -61512, -49843, -36011, 11264, 17561, 11247, -50204, -152046, -176976, -116082, -121114, -104053]
5349a04053k4998K3518P5431j5167k5499J8656O8558J9369K8971k8051m9013l8514
5337e0792J9707L4019k4384l3954k5883K8965L0694O3892k6163l5150p1918r458
5325a00425m1005n9440j7813Q4002J04848j0364l2766j4143O697O8586M0067n3910
5313b5666J2152r213m5232l5135M4396q952j5343M8511P103k1567m1116j6651
5301a06713L3088j4692K3896L4619L7555L5910l9347j20461K4442N3896l3403
5290g1210K0060r291K2135r259l7546r366P4759O9892q5614k2480L5548j2994
5278c5366j7441n93J5692m860M7928M8619n1018j5020K9422J7247l2189J4235
5266A6656k549o6831N4103J4213k5513q690O177m1403p067M3364L3487j1914J9695
$$ y = [-104053, -129051, -105533, -30102, -45269, -70768, -52112, 16446, 35815, 64786, 36735, -12278, -50792, -31085, 2934, -21450, -55404, -81287, -52322, -21628, 42264, 16101, -19049, -90967, -100425, -141430, -200870, -218683, -134681, -29833, -40197, -72963, -87106, -80409, -11823, 28244, -25666, -13514, -22727, -67959, -103094, -58698, -67650, -82993, -34482, -27379, -48946, -90062, -106713, -73625, -88317, -64421, -29802, 7753, 43663, 4316, -116145, -91703, -37807, -71210, -51150, -60441, -38306, -47565, -85111, -94477, -19718, 50174, -35440, -57920, -22372, -35366, -52807, -53400, -37708, -42568, 5360, 53979, 2961, -12059, 17363, 34610, 2421, 16656, 14107, -52724, 1379, 15592, -9921, -18611, -12434, -53837, -60904, -17540, 15947, 4033, 23728]
5253B3728P346m4154N840J4524N1161j0667l8877k324n4394j4307M1674R028k9820
5240d1242O2953n1555o2843R818M2395O7126N0614J0473J1931J7628r9142m9927
5228c1771J0964l2752J5520L7563M1350J4486n4149K0703j6189j5125m1370k3452
5216g4222L5445p276k0343r079k2568R482j5236k1772K4930M4391K5335L0183
5204g30Q09J6660o293N0470K3504m8600n7543j4985k2733J0067P4513P0J6645
5191D1854M088k6956l9142j7220m0435j3605K0776L1172j5909j4156N3967Q6420
5179G0854J5419k7385j6041m2180m1718J0551j7759L466l1898N5313M4975J6152
5167C9749J502j5013j8529m6404k3763J5322J4645M7111P2274M5694k8009q2314
$$ y = [23728, 31074, -13080, -7240, 7284, 58445, 47778, 8901, 6577, -47817, -62124, -20450, -11422, -41242, 21711, -29844, -92687, -82869, -40474, 26652, 77266, 87739, 99670, 117298, 18156, -31771, -20807, -53559, -38039, -476, 40874, 55360, 1211, 21914, 5725, -9400, -50770, -74222, -38777, -46053, -66396, -75475, -98043, -88561, -103797, -125569, -100639, -56248, -30913, -730, 79, 16739, 10446, 60916, 84420, 35820, -21723, -36708, -59441, -49374, 25139, 25209, 41854, 45942, 18986, -20156, -37376, -77811, -91416, -70640, -39468, -55377, -69533, -15566, 70854, 86273, 58888, 42847, 667, -41051, -30500, -48259, -44793, -76691, -21378, 23597, 39749, 41251, 26238, 7709, -38695, -62458, -47136, -32491, 14620, 86894, 132588, 104579, 22265]
5155B2265k1751r450l7074n915m543k5757l0132K073R723J7044k765K4920N3185
5142h177J1039J9373M508R355K4846l3989R047O4m9908l9511Q032M0372N9769
5129E4820n680J5873M1994q0604r5337l1293R275K167J513M7075k7408o4799j0837
5116a43241j791K1259N7446j0072j9891l5746J2384N3881J9360N2221M2542o998
5104D1354n4072J4295j4287L4817L1990J9319o4920j03198n810P3256M7795k3455
5092b916n4366P361J8530N5158L297j8403j9085O1883N1078K8283j09541j21752
5080a00473J2092J819J4041L9656J773N2026J8798J5900M5996q055m5220k284
5068D6069r196m6328m2911J800J7360j1769K0453Q2797J4681j3278K8463n0844
$$ y = [22265, 514, -8936, -46010, -51925, -56468, -82225, -112357, -110284, -100561, -83517, -86282, -61362, -8177, 2862, 22235, 26743, 36098, 60944, 26955, 36002, 36066, -13842, -53353, -45321, -4949, 54820, 49140, 65013, 107007, 26403, -68934, -100227, -90952, -88785, -87272, -40197, -67605, -132404, -143241, -145032, -123773, -66327, -76399, -96290, -132036, -119652, -65771, -46411, 5810, 48352, 41354, -12718, 1577, -12710, 22107, 54097, 73416, 8496, -94702, -100512, -27256, 20539, -2916, -57282, -49921, -31391, 23767, 27064, 8661, -10424, 51459, 102537, 130820, 21279, -100473, -88381, -86562, -72521, -32865, -31092, 20934, 39732, 55632, 101628, 93573, 48353, 46069, 36873, -9455, -52366, -50566, -33206, -44975, -24522, 58275, 72956, 59678, 88141, 37297]
5056C7297l7639N4692L3092k4705J4585K6722p7682o5749M3472J1427q8932J1097
5044f2323L9933q28O665J5325j8450K298l4881p7223L4190J0059q690M1145n156
5031e7936K9659M9310l0158n922o953k3454r052J8097m4885k3936M4603O7821
5019G194k6625M335k1726l2897N4327K5531o593o9798l5724K077M9631J0864K7427
5006a1977L2756M587k1113j6459p9418J2002r381j1174o217K8123J4575M1285
4994b2411k1083R074L7169o41j414m4373l5786j7478k5504q285N9558J9229m5021
4981i6966K219J3308L2969k6564p2146k3294j4000L8201P6186L5815N6340k2017
4969E1j3631J9658K9613m2127m4335J336K0348P264L6661j0646l6228l3403J5290
$$ y = [37297, -342, 54350, 87442, 62737, 77322, 104044, 26362, -39387, 4085, 15512, -73420, -62323, -22390, -23218, -16553, -1228, -19678, -17380, -52261, -129484, -95294, -85235, -93925, -52780, -57936, -28277, 21033, -9125, -15047, -22000, -45454, -54506, -36409, -81294, -105230, -60627, 7194, -19431, -15096, -36822, -69719, -15392, 10139, 3546, -66252, -101976, -99899, -50268, -39404, -11977, 20779, 25366, 4253, -12206, -91624, -79622, -89003, -100177, -106394, -78271, -63696, -22411, -43494, -34420, 2749, 2108, 694, -43679, -79465, -96943, -122447, -130732, -71174, -51945, -96966, -94747, -81439, -48470, -75034, -147180, -170474, -184474, -146273, -70087, -34272, 22068, 51, -13580, 6078, 35691, -6436, -50771, -49435, -29087, -21823, 14838, 4192, -32036, -65439, -50149]
4956e0149L1483l0914j136L5965K668j5964M848l8500k4370L43j4414L4113R244
4943e6783l4375N0995K8547J5879m3920L4726R693j8486k6491L4449L1832L9940
4931F6006K5161O267n5932j666N5287K7410k2083k2038m2178n4060l3937l2249
4919h4012l1525P0195O2358l2316n2091J3494n9252m977l7553l894J00006J08749
4907D9182K6178l0382n5971q1246p4165M711K2525M1662Q1391l8074j0368J3298
4895e1259M1703j2777M3424J4239Q096k3187L8204q701j6237k60n0846l5714L4669
4882a8646J7169r218j5758n743N2496K1152p69M2417m6782j6008R907N1m0998
4869a0730m6504r308J6886J5433Q688J1109q2228j0354N1499J12309J6382m1659
$$ y = [-50149, -18666, -49580, -50716, -14751, -12083, -28047, -23199, -61699, -86069, -85726, -100140, -66027, -56783, -91158, -40163, -11616, 4263, -39657, -4931, 4762, -13724, -40215, -5766, 26066, 66006, 91167, 97434, 41502, 39836, 95123, 122533, 100450, 78412, 36234, -17826, -51763, -84012, -115537, -45342, 17016, -15300, -67391, -53897, -113149, -118126, -155679, -159573, -59567, 49182, 75360, 44978, -10993, -92239, -166404, -161693, -139168, -97506, -16115, -54189, -64557, -51259, -9556, -22333, 21091, 35330, 43426, 20239, 58443, 49742, 33505, 33245, -17601, -53315, -18646, -1477, -10695, -26453, -32196, 20300, 41452, 40683, 83100, 36318, 20310, 30217, 30268, -10730, -57234, -66542, -49656, -34223, -25535, -14426, -96654, -107008, -55509, 56800, 73182, 31523]
4857C1523j9664m9461m5241k6052L013O0230J8452j1104k2828m5102o0543P6605
4845i0172O8494j968m0480N70O2240K782r159K0154j7359k5212l3540l1050M1754
4832e2946M5115k7741k2667K5226M3596q344n6327l5552j7240L1444K0693K0591
4820c4152K5529K5023l3506M0138K3925l506m7355q3180L900N1312L5667l697
4808I8K0620J2222K921O152k0771j9110N583N293J8916m5576k0053J0651L0988
4795G934K979k1058k0786k1961j81O547K7195m4420m7971k8500M7408M8033K2066
4782b2715K0413L9779q436k4894r202K1098j2030K3485Q8166J848J9053n0234
4770H6331n9734k5144j3711L901n7279K9824J710l5794l6480k3359K6201R0467
$$ y = [31523, 11859, -37602, -82843, -108895, -105882, -45652, -27200, -38304, -61132, -106234, -166777, -90172, -21678, -23646, -64126, -63556, -1316, 1466, -7693, 12461, -4898, -30110, -63650, -94700, -52946, -7831, -35572, -58239, -33013, 10583, 2239, -54088, -89640, -106880, -75436, -54743, -34152, -8623, 16400, -17106, 23032, 46957, 43451, -3904, -87084, -83184, -31872, 3795, 98, 20718, 32940, 35861, 42013, 21242, 2132, 7715, 13008, 31924, -13652, -33705, -23054, 7934, 10913, -10145, -30931, -52892, -53073, -46526, -19331, -63751, -111722, -140222, -92814, -44781, -22715, -2302, 37477, 29041, 4147, -5055, 16043, 4013, 27498, 115664, 117512, 136565, 86331, 26597, 1453, -12258, -8357, -65636, -35812, -34102, -69896, -106376, -129735, -103534, -13067]
4758a3067M9947K8888j4902j8160j2577l764J916K574l5163J5554K6190m2622
4746a5186m3105M4648J6517k5878R031K1976m3673k1695N4778M970l2215k8650
4734e8482K565K9883N2352K1328k1917K845L2980k6950j486K5233j0452J2624
4722F0523K1814k8614o0792J1607j2770M5841O0568R507q4967p0054j1562J3358
4710d5541J1395j7555m4338m8305Q4744K1735J6014J1920o945M6895j6477O660
4698B0202j2908N6617L4386o6606k7677J5140j6853M4984K2438N6857r626p3817
4686D3137l3125n8220N9965K5931n1824m1203K4579l2661n5709J9862O507J1222
4674h1539M1917L6863j7723j5454rP550k5158o7360L1783L2517J5121P727j7780
$$ y = [-13067, 36880, 65768, 50866, 32706, 20129, 16365, 18281, 20855, -14308, 1246, 27436, -15186, -58291, -13643, 2874, -23004, -13973, 8003, -35670, -57365, -2587, 2383, -29832, -58482, -55917, -26034, 26318, 47646, 25729, 28574, 61554, 34604, 33118, 58351, 47899, 60523, 82337, 53723, -7069, 4538, -8232, 37609, 98177, 107684, 22717, -47337, -58899, -45541, -34146, -51701, -96039, -144344, -59600, -37865, -21851, -9931, -16876, 30019, 13542, 20202, 7294, 63911, 98297, 31691, 4014, 19154, 2301, 47285, 69723, 126580, 116954, 43137, 10012, -48208, 11757, 37688, -14136, -55339, -30760, -63421, -119130, -99268, -92761, -81539, -39622, -2759, -20482, -35936, -35945, -28395, -53553, -120913, -89130, -56613, -41492, -33765, -51545]
4661e1545L6364J065k9876n9647Q058N0011L166J2250n904Q492K2667k302k7639
4648c4840K4457J0307l312k0499k1298r227r284M6302L0269k5007n0096o4582
4636a26810k380P3335N0408n3461j4314k6778K5522Q1825O495o634J9819q5456
4624e8429n2028M7521N6846M4184k4758k6819n0657J2276N3183l030j1879K6073
4612A2483k5024L9274K1179n2141n3133L945r207L29K4407O894n966l833K6693
4599a4100J584l6017m3785j6268N1766J3583j6362k7900J5162N8517j3122o7671
4587i4613m242L2175R034M3605Q6482J8902l9723p1427k6546J04970k6962p7242
4575d5587M5384N3822j599m897K3704n403n6132n0071L457k7079k310K1648L1861
$$ y = [-51545, -15181, -14116, -43992, -103639, -95581, -45570, -42404, -30154, -36058, -27566, -4899, -7201, -34840, -10383, -76, -3388, -23887, -45185, -54412, -63696, -17394, 12875, -12132, -62228, -126810, -129190, -55855, -5447, -58908, -73222, -100000, -74478, 7347, 13842, 7208, 27027, -58429, -110457, -62936, -6090, 38094, 13336, -13483, -64140, -51864, 1319, -1711, -13590, 12483, -12541, 26733, 47912, -4229, -57362, -53417, -62624, -62295, -37888, -30994, -36960, -40793, -14100, -12516, -48533, -92318, -108586, -56820, -43237, -59599, -87499, -72337, -13820, -26942, -94613, -98855, -66680, -57646, -14041, 72441, 91343, 51620, -19807, -46353, 58617, 31655, -45587, -203, 53619, 52020, 47123, 70827, 65424, 9292, -40779, -37322, -64401, -66711, -45063, -13202]
4562a3202m1j5587j6334l1063P0366N0041K3602j9255n009N8230l0498n6006k3097
4549g853J7231L1258k8964k6921k4200K4424L1458J7953J1943j220m6118j8457
4537a9466K2824j3809J0048L9776J1777k0374j4769n708j2338l1237p636K9095
4525a1817o491j8268k1944l8257L4063M5352Q1866m8361n1342J7551k3724p79
4513d2151N1729M5471M927m5878p346K6805j520j0141P161p997J2178l8735k1129
4500b6626P076M6812J8174j3842l8440m4264k1758l7132j5698K6315l4993O90
4488a33686M5338O8266k8835q961k3482k1189J3772N5756K5555n5098n6902K6778
4476i2688Q510j4992o332L1346Q7663K5394O020k9469n5668j3260k4827j365R1642
$$ y = [-13202, -13243, -28830, -45164, -76227, -5861, 44180, 67782, 48527, 43518, 101748, 71250, 15244, -7853, 9378, 40636, 11672, -15249, -39449, -15025, 16433, 34386, 46329, 45109, -1009, -19466, 3358, -10451, -403, 39373, 51150, 30776, 16007, 10299, -2039, -33276, -40912, -11817, -18308, -36576, -58520, -96777, -62714, -17362, 64504, 16143, -35199, -17648, -41372, -42151, 9578, 55049, 59976, 14098, 6752, 33557, 32037, 21896, 29057, 21060, 33238, -5497, -26626, -19550, 27262, 45436, 31594, -6846, -51110, -72868, -110000, -125698, -99383, -134376, -133686, -88348, -20082, -48917, -57878, -81360, -102549, -88777, -33021, -7466, -62564, -119466, -92688, -84178, -99170, -105502, -74156, 13507, 38901, 44921, 15452, -40216, -53476, -78303, -79668, 11974]
4463A1974M5667j2034l3409P116J292m6132m4255j4558l030j563O7625r056p086
4450c7449N806M0463m625k5853J151N7880Q130o0694n9881M2707P0764L0714k7383
4437D1730K371l5587k511L3209q194m8419K2027j0072j0120m225J5199j7209j7465
4424c9266m8678l2170L6010J3094K6199K6897j844j7945k7036k9575K06M7765
4412d6343N3522k565k5561L5937L5865N919k7935J4494K7558k9086m7640k8958
4400c4793l2609k745J9141J7758m6161r46q523K5364K5285L4084l5511o5652N1212
4387e4096L1402l6193o4302n0471J8763O3116O8082J3570j3479j6979l5485m214
4375h0286n847K5175j3725M8243L2803J8041K5155J6501j6942j9003K6754p384
$$ y = [11974, 57641, 45607, 12198, 19314, 20606, -25526, -69781, -84339, -87369, -88932, -21307, -30363, -37449, -31643, 8820, 4195, -21658, -20507, 37373, 45503, -15191, -75072, -32365, 38399, 69113, 41730, 44101, 8514, 6003, 39212, 31018, -17401, 4626, -5446, -15566, -19791, -4592, -21801, -39266, -87944, -120114, -84104, -71010, -44811, -17914, -19758, -37703, -64739, -94314, -94108, -46343, 7179, 4614, -20947, 14990, 50855, 56774, 28839, 43333, 70891, 41805, -5835, -34793, -67402, -70147, -51006, -33248, -79409, -80355, -88878, -63514, -38229, -4145, -39656, -105308, -54096, -22694, -58887, -123189, -173660, -154897, -91781, -23699, -10129, -23608, -40587, -76072, -80286, -86133, -60958, -74683, -26440, 6363, 24404, 49559, 66060, 49118, 30115, 56869, 49485]
4363D9485N952J278J7265q637p3278k765l7218L8741O6200R576k025n8333Q694
4350A4935R683k6691k9390l2351M7111M2855P741k398o123k4430l2920m0380l656
4337g6014K7699l453j9504N3221Q2674M9936n7601q0121Q74J551k9042J2134j554
4324c9200K8833k4330n5073K6513N3732j4842m2689K8458K2277L3797p264m6756
4312c6544K4048Q7861l745k023m1428m5630O04k819L4071J1409k4585k8744O826
4299b0699K2500k0508n4901o1190m5664J5852N8940N5356N6457q2552k5359k0154
4287a21922M9894N7947J8162l8477L5149O3886J8950o7640m9298J691P653o3629
4275h7634m3400M719N737O2719L0902l1805O0455L5502j0521l7265n5875M5078
$$ y = [49485, 55437, 56715, 73980, 65343, -7935, -10700, -47918, -9177, 57023, 66599, 64574, 6241, 14935, 24618, -2073, -31463, -63814, -16703, 26152, 33893, 31495, 25372, 942, -31978, -72358, -76014, -48315, -51768, -71272, -18051, 64623, 114559, 56958, -23163, -22289, -20738, -49780, -37646, -39200, -10367, -34697, -89770, -63257, -9525, -24367, -67056, -38598, -16321, 17476, 10212, -36544, -12496, 75365, 71620, 69597, 28169, -17461, -16857, -19676, 14395, 25804, 1219, -27525, -20699, 1801, -18707, -73608, -134798, -180462, -164610, -105670, -50314, 6143, -76409, -101768, -121922, -72028, -14081, 4081, -34396, 753, 64639, 83589, 15949, -33349, -31658, -24005, -87634, -131034, -126315, -120578, -57859, -26957, -58762, 1693, 37195, 26674, -10591, -66466, -21388]
4263b1388L9786k9041J3282L6318k6337r148j4406J3929m8518K1968O0075o3058
4251b6538j8391j4991J8757O5333O948n2933m0182P957L7135L3931j2132k1442
4239a6548K220l723K0272O752K1865K815j3806l9218P876M6357q584n9687m247
4226c7656L4902q248j152l5873L163Q85k9987l7990K1810j8842L5943P3455l080
4213b670j7717J3805k6381r838L1596n82j4841r536N354k3548O938k2828O3702
4200f546J1648p7880r559J2406J4745nL9951k879M5425Q068k1498m750l1249K3429
4186A306j7058J7652K773m9020o40O7400O367m4550m2905J1963q703M394J044
4173d9977K4795J4675J9698J9266l5713j4993K687J7763j3869l936J8733L298
$$ y = [-21388, 18398, -10643, 2639, 38957, 12620, 3472, -10934, 2995, -45523, -23555, 36520, -26538, -44929, -59920, -41163, 24170, 31118, -21815, -61997, -54040, -16905, 17026, 4894, -16548, -14328, -18051, 2221, 8973, 30838, 33653, 19847, -19371, -11495, 34862, 26278, -33409, -37656, -2754, -11002, -12154, -48027, -44864, -43979, -73966, -111956, -90146, -108988, -73045, 410, -2670, -20387, -6582, -32963, -42801, -11205, -11787, -26628, -36164, -30810, -54358, -47420, -70248, -6546, 5102, -72778, -82337, -69931, -55186, -55191, -15240, -18119, 27306, 35374, 13876, 9126, -22123, 1306, -15752, 1900, 4673, -44347, -44987, 22413, 28780, -15770, -58675, -46712, -55415, -51021, -49977, -25182, -10507, 9191, 28457, -7256, -22249, -19562, -1799, -15668, -19604, -871, 2427]
4161B427l1177K0875K8754K975k9213J0210O4791l8903l1174l5337n356K3116
4149a8012J6444J1311r697k614j5042k5160k0899L5841O5133o7304j9041l9687
4137h8727n0049J0889N1061K1363N7939L9689j4529J7874o095K0951J7470K1708
4125I9544K8471q5283q3010J1619J8326J3944Q0642j5664l0743l9248p647j1029
4113b0078J5737l32j2787L8765N3374M0428J9453m0383m7993o7256n5239l2514
4101a08825l7653Q189M6944L1341L1277R868L4222j4053n5173k550k0922k8365
4089a05700J2534M6781j2778Q910k1865k5422j1930J7934K2917N3309k0479o9245
4077a05034j7917M0850J1497P538j0319J3449L6141N0015M8083n2688m3525k9659
$$ y = [2427, -28750, -7875, 20879, 23854, -5359, 4851, 69642, 30739, -435, -35772, -41128, -18012, -1568, 9743, 46, -2568, -17610, -42770, -63669, -27828, 37305, -29999, -49040, -88727, -138776, -127887, -76826, -55463, 2476, 42165, 27636, 45510, 39415, 60366, 77836, 99544, 128015, 42732, -40278, -28659, -10333, 3611, 84253, 68589, 37846, -1402, -9049, -20078, -4341, -4673, -17460, 21305, 74679, 115107, 134560, 94177, 46184, -21072, -76311, -108825, -146478, -138289, -91345, -60004, -28727, -18859, 15363, 1310, -53863, -56413, -77335, -105700, -93166, -46385, -59163, -50253, -72118, -97540, -109470, -91536, -68619, -15310, -35789, -105034, -122951, -82101, -70604, -63066, -73385, -59936, -23795, 26220, 74303, 21615, -21910, -51569]
4065e1569o8284l7141L2361J0746p408p745M0858K0356k0489K8385J2494J0970
4053c6466N5073P9621L3688J9833N749K3294k8316j12932q5206j1334J284m1988
4041i7700K3349m086L7089l1989M097M637k7820M8700R736l4319j8511k5814M3550
4028f9081j0647L2337N1145M2694j3202l466L4698m0761j8017k2928j2610r626
4016c9464O1963K348j6902l3080k4714K0368J5115K3305K6921M0736k9665m927
4004D2004L8481L6180J1579m3471k0659n4352l4845j8769K0743M0037L660p1947
3992e1359p8040k6186M9482O1924Q918j2809L4232K1918q200J2566L753l6459
3980b0260M56J4169o7j5449Q526M4499m2593n586j9472m4412L4622J2721l8620
$$ y = [-51569, -119853, -156994, -124633, -113887, -121295, -129040, -88182, -67826, -88315, -59930, -47436, -36466, 18607, 98228, 131916, 151749, 157498, 180792, 152476, 39544, -45662, -56996, -55712, -97700, -74351, -78437, -41348, -73337, -69240, -64603, -92423, -43723, -33987, -68306, -86817, -112631, -69081, -79728, -47391, 3754, 46448, 33246, 29780, 64478, 23717, 5700, -17228, -29838, -39464, 22499, 24847, 7945, -25135, -49849, -29481, -14366, 8939, 35860, 76596, 46931, 42004, 80485, 116665, 128244, 84773, 64114, 9762, -25083, -43852, -23109, 16928, 20588, -51359, -129399, -155585, -106103, -44179, -35261, -48070, -13838, 8080, -120, 12446, 16199, -20260, -19804, -5635, -5702, -21151, -12625, 31874, -10719, -16305, -35777, -80189, -45567, -32846, -71466]
3967g1466m501k2190m3995K2276O5454P8274L9266p3378j09215k2209O8543L8303
3955c4838p0617q0622O0456O5317L0386K4500N2906J1951k8705p210N1264m477
3943G0311o147J5798j1371j5243N8j0173l0346j2521J8694P084Q695K0228k9201
3930B5866j5442q752J7476m2269o7013L2576O9144j906k2840K4911k4148j3614
3918b6011L8716k9255N75J2622J9464r955r577m9999o855K7314k8811k4851O4186
3905b2437K8086k2898j7625k1388P53Q220M7208l533k3174J2568l223J9515k4431
3892b2359K820k3226m2794J5584j8549j9862J247k932K6319L005j4928K8879K435
3879f4361M4815N0693R641j1779p027k4976p1630J6026N9130p36L180N273l348
$$ y = [-71466, -75967, -98157, -142152, -119876, -54422, 23852, 63118, -10260, -119475, -141684, -73141, -34838, -105455, -186077, -125621, -60304, -29918, -5418, 47488, 59439, 30734, 23524, 74788, 70311, 64164, 79962, 68591, 53348, 53406, 43233, 12887, 366, 19060, 26144, 34839, 55067, 25866, 10424, 1672, 19148, -23121, -90134, -57558, 11586, 9680, -13160, 11751, -12397, -26011, 12705, -16550, -15975, -3353, 16111, 6156, -3421, -53420, -60275, -32961, -61772, -86623, -22437, 5649, -17249, -34874, -56262, -55509, -47289, -81, -3614, -26788, -14220, -17443, 2072, -22359, -19539, -42765, -85559, -69975, -88524, -108386, -107139, -110071, -83752, -80747, -95675, -66796, -64361, -19546, 31147, 40788, 29009, 21982, -2994, -74624, -58598, 532, -204, 2976, 8249, 4901]
3866D901j9394K217J2298o5388n4547K6298M1392P130l15K5035O498k1659j0957
3853d6491k8067L7891J6080l9556J0748o208M0060j9103n5253o953m002L0708
3841g0146L7873M9365m130j5729j1075j51L560L3585L9848Q452j360p485L706
3828F6313j5341q6277p1642J5968k0225K4577M3190k0924k3833k9496P245k6153
3816a36598K586K0448N4205j4631N2255N2988O7026k5551j4375k2719j0191M90
3804B5933j5929l5553P1157L4371q985O162J6812l0270k4913l4546m7947q450
3792e2158l1933K9366J8748k1832O448n845p001J4506O862o352l4165M9190L5761
3779A595K311j6298l7698n3252L2767Q4566N4239M0656j5200k800q3302o6549
$$ y = [4901, -14493, -12276, 22, -65366, -119913, -93615, -52223, -45093, -45408, -20373, -13875, -35534, -46491, -74558, -36667, -20587, -60143, -49395, -55603, -15543, -34646, -89899, -96852, -100854, -70146, -32273, 17092, 12962, -2767, -13842, -13993, -10433, 23152, 63000, 71452, 70092, 62607, 66313, 50972, -35305, -106947, -90979, -111204, -86627, -43437, -64361, -88194, -117690, -110445, -136598, -134012, -113564, -59359, -73990, -21735, 31253, 98279, 72728, 58353, 35634, 25443, 25933, 10004, -25549, 45608, 79979, 70994, 77156, 93968, 63698, 38785, 4239, -43708, -52158, -84091, -54725, -35977, -57809, -51361, -57206, -64207, -49701, -42839, -49191, -83356, -34166, 1595, 3906, -12392, -50090, -103342, -70575, 13991, 68230, 108886, 93686, 90886, 7584, -58965]
3767e8965M5423L8865l808l0665L2564j2945j0372Q06l490M0123k2435k1709j1398
3754a8006j9939m1526l7192J1214P1097K2748J2336M9655o3596o3530J5966j7746
3742g8519o3654L2913M2605O7829L1083o216o485r023L7484j3277K0821k9830
3730B5731J5509N2698m4093k6776N51k1544j6088j7091l947k8679m2199k1953
3718a27881L7703L4053K8716j2922j2584l8551k5415N3418M0603j7796p153J0900
3706c6909n6086q284K5109O0086L1058k0113l5551k3781K647J1122j0712J5767
3694d5647J0602k8590k8983L081P895L4964R9269M6n2892o416K511M404m9966
3681d9722K3833K3175L6368J1417p712l8460j3719M951L0994j4248J3765O3694
$$ y = [-58965, -13542, 25323, 21515, -9150, 23414, 10469, 97, 903, -2587, 37536, 15101, -6608, -18006, -37945, -79471, -116663, -105449, -34352, -11604, 732, 50387, -13209, -76739, -60773, -78519, -142173, -109260, -66655, 1174, 32257, 26041, 19556, 10533, 48017, 34740, 55561, 25731, 41240, 93938, 49845, 23069, 23620, 2076, -14012, -31103, -35050, -63729, -105928, -127881, -90178, -56125, -27409, -40331, -52915, -91466, -116881, -63463, -22860, -40656, -47809, -36909, -92995, -101279, -76170, -16084, 14974, -5139, -40690, -64471, -61824, -50702, -61414, -45647, -35045, -63635, -92618, -89537, -81642, -46678, 52591, 52637, -255, -6671, -4160, 244, -49722, -25889, -2714, 33654, 45071, 37359, -1101, -14820, -9869, 21125, 6877, 20642, 84336]
3669H4336p047j276P609l3456k7452j3946k9347J9641m5577J7534K2991P5536
3657F9546n507q0052M5337j0940l0280m512n2585J7151K5274J8680l8166p1698
3645a17752L1726O8559N852l0185O616O0879J2606n2203j513P565o817j6120K5556
3632e231M3885L4365k3277n6561k2618o559K0114M530l9953k2591k7966O522L1913
3619f3427P4062N4987m8389l3562k042J9471j0681l656j6095O122n1034J8943
3607e5301J9228J1276r826K2143L4757j8559k7053L319K3521j3676l5191o427
3595e1789j5657O984J8103M5012Q1821J2857n2375n663p22K8535K612l7715o1877
3582b9874J2737l2806k5160J9905O1287L3572P944N6495L0809m7977l5077o077
$$ y = [84336, 77289, 76013, 83622, 50166, 22714, 8768, -20579, -938, -46515, -28981, -5990, 69546, 64039, -16013, 29324, 18384, -11896, -16408, -68993, -51842, -26568, -7888, -46054, -117752, -86026, -17467, -11615, -41800, -35184, 25695, 38301, -13902, -15415, -7850, -14667, -30787, -5231, 38654, 73019, 49742, -6819, -29437, -35996, -15882, -11352, -51305, -73896, -101862, -95340, -63427, 10635, 65622, 17233, -16329, -18371, 1100, -9581, -13237, -29332, -23210, -74244, -55301, -36073, -24797, -34623, -12480, 22277, 3718, -23335, -20016, 3505, -10171, -45362, -51789, -67446, -60462, -42359, 2653, 84474, 97331, 44956, 39293, 38571, 67106, 69718, 32003, -29874, -17137, -49943, -75103, -55198, 6089, 39661, 47605, 104100, 134909, 86932, 51855, 45778]
3570D5778n6560l2961K9825J4739J3069p2631P465Q886J0268r863L1250M4759
3558C4024k6002J6998j5989l91L265m809j5753J3350K2607l1268k2740J5103j829
3545a3434m3876n0786J4064p123K0479N4150L0931l519m2058j0573J473j4162
3533f4434M8256N4865J4486k9318J1114j4284O683k6138j0684K3952K4233m942
3521C3789O437M6604j9627P033m3031j7884n8565J9454O0190J9777j0821l9223
3509D133n0864k8764L9780M8407J8425l5493K4068O0861P775m9070k3779n3356
3497c7877J6579J7363m4429k4044j6231K0392M1604P051k7514l7194q5491j1268
3485a81059J07822N3774m2297L129N4994L4452K1046k4677l0445K6847j5010k2592
$$ y = [45778, -10782, -43743, -13918, 821, 13890, -58741, -51276, -42390, -32122, -41985, -10735, 34024, 8022, 25020, 9031, 8640, 11905, 7096, -8657, 4693, 27300, -3968, -26708, -11605, -13434, -57310, -108096, -94032, -101155, -80676, -26526, 4405, 886, -41172, -51745, -50272, -64434, -16178, 38687, 53173, 23855, 34969, 20685, 27368, 1230, -9454, 14498, 38731, 33789, 40226, 86830, 67203, 74236, 31205, 13321, -45244, -25790, 34400, 54177, 43356, 4133, -46731, -75495, -35715, 12692, 31117, -4376, 19692, 80553, 88328, 39258, 15479, -37877, -21298, -3935, -48364, -72408, -88639, -68247, -26643, -19592, -47106, -84300, -169791, -181059, -73237, -19463, -61760, -58631, -3637, 30815, 51861, 27184, -3261, 23586, 8576, -14016]
3473a4016M068o115J2986l6473l7981p964J0604M0364N8390J3356n4857m4791
3461f2429n825N908j584m7528J1544J22320J7376m8818o6510k8548M0592K1376
3449d2126Q592L0672O8378j574p5088k3121k1208j8389J6484N823J6604K8271
3437f682J4981J2213n8276l6502j7229m036P4971J7216r370L8097L1544M0794
3425I7721j4651j2204j0891l4023l7773j2054j3816j9629M5258o79j4948j9520
3413d7209J0819M4667l1139L1264L4744j1260n1790M9970M0604l3799j6780k1824
3401a733N83N3422k1288n6636K377q036N3914O2569l0799m8387R744j911j4872
3388a053k6858M4252O5370m341l5983l3497m0481o7621k0980O0368J3850L0269
$$ y = [-14016, -9948, -16063, -3077, -39550, -77531, -85495, -74891, -34527, 23863, 37219, -17638, -62429, -68254, -62346, -63930, -111458, -99914, 22406, 39782, -9036, -75546, -104094, -63502, -42126, -33534, -2862, 65516, 63942, -11146, -34267, -55475, -73864, -57380, -51557, -34953, -6682, 8299, 20512, -37764, -74266, -91495, -95531, -20560, -3344, -12714, 25383, 56927, 97721, 83070, 70866, 59975, 25952, -11821, -23875, -37691, -57320, -12062, -12741, -27689, -47209, -36390, 8277, -22862, 8402, 43146, 31886, -19904, 30066, 70670, 36871, 20091, -1733, -1150, 52272, 30984, -25652, -23275, -31311, 22603, 85172, 54373, 5986, 15730, 13819, -1053, -27911, 16341, 81711, 77370, 41387, 7890, -32591, -100212, -121192, -60824, -46974, -16705]
3376a6705Q3093N797l5403q889J3028n0576m6657l0204K6242k0j0715j8600J3204
3363g6405j4902k3884M5776L3450K2077l0825L7768M4588l47k3491k7182l5744
3351d9121k363J0669k3762O686N2706O3067j2045j0284m3950k4844O7071j9137
3339A4693n6171J8552K4986K9497n70j7579p3683N1222J3037Q386l1998N553o113
3326b0188L3332N4140M10m0866l763q508k4608J2483J529p104j0845m027K059
3313a5956k736j1469j5852N89M0685k7406J985J5962q112L5280J1826J6135o9733
3300b8802m2562J5343L6679j153j3178M0642L2669k9670k870j2912k0424p1603
3288i7841J8566L6197o885K8719O7823p9155n5840N0919K9639M4824K6215J6373
$$ y = [-16705, 66388, 72185, 36782, 27893, 40921, -9655, -56312, -86516, -60274, -60294, -71009, -89609, -76405, -91307, -115191, -69415, -35965, -13888, -44713, -6945, 37643, 37296, 13805, -13377, -49121, -51484, -40815, -64577, -57891, -5185, 57882, 45837, 35553, -8397, -33241, 33830, 14693, -41478, -22926, 2060, 31557, 30987, 13408, -60275, -9053, 3984, 12370, -19628, -14075, -20188, 13144, 67284, 67694, 26828, 23065, 14557, -10051, 2432, 3961, -3143, -13988, -18015, -15956, -18692, -30161, -46013, -45424, -4739, -32145, -30160, -14198, -22310, 12970, 24796, 40931, -28802, -71364, -56021, -19342, -20495, -33673, 6969, 39638, 9968, 7098, -5814, -26238, -97841, -79275, -43078, -49963, -21244, 46579, -32576, -88416, -37497, -7858, 36966, 63181, 79554]
3276G9554J5538l9571p1712J2335O813J2174K0004J080n8337l1568K3163l7372
3264f7899L6102L9552o1102K610L8901L8559J2637N1924j2162m5599J054K316
3252C6893m9688l0952j574j4556k1778J4791O8957Q277n1926N817j4805K0683
3240b9861P550q999m373j7697M3215n5827j6165K2799P8934O8737k3277q1116
3228a6080r4518q635N6037J8554K6621J9867k3777L6245K5192K3861K525j8288
3216D7604j5072j5093k1484l348m2052n3850k7180j9651K3899L5774L4128j154
3204e7479J6979K5752N1547j3548k0104J738j1076j7650J4599j4099n8349o724
3192h8414M679L3407K8717K8500J4699M2970P7534r868q856o3849k9230o805j1524
$$ y = [79554, 95092, 55521, -16191, -3856, 2957, 15131, 35135, 36215, -22122, -53690, -30527, -67899, -31797, 7755, -53347, -50737, -11836, 26723, 39360, 91284, 79122, 33523, 34577, 36893, -12795, -43747, -45321, -59877, -81655, -66864, 2093, 10370, -41556, -35739, -50544, -29861, -22311, -31310, -35683, -53380, -10165, -65992, -82157, -59358, 19576, 88313, 65036, -16080, -110598, -119233, -63196, -44642, -18021, 1846, -21931, 14314, 39506, 63367, 65892, 47604, 32532, 17439, -4045, -7393, -49445, -103295, -130475, -150126, -126227, -90453, -56325, -57479, -40500, -14748, 36799, 23251, 3147, 4885, -6191, -23841, -9242, -23341, -81690, -88414, -83735, -50328, -21611, 6889, 21588, 64558, 142092, 132224, 123368, 59519, 30289, 23484, 11960]
3179A1960P1460M7910k838n7364k9490l8311l9374L7056L4066K1925k4352n1994
3167a9346J8517j2220k655j5680K5841o122K1851M2004o036P141K4655J0727n4292
3154C4385q2432o0229M1777L7224K4102j6106k8626M3286J2279k1389K4555J8530
3142B7356m2418M8452K6570l1683m5624N4873N3818l7848p1430m0746M5734L0881
3130A7935O6607j016R06l6057n3230l1862K2801l108j0766k5978l1384n562M6328
3117d4386J8907J6141L4427l2948l3919L7924K4760k5471m0614J7097L5397p629
3105c14R858L0508J5925r7779j3519K6469R494J2727j3915J5697j2578j8573n976
3092d1976J8247K6224N0818k3149l5770k4594p057p1262N9426O5148m503J8568
$$ y = [11960, 83420, 131330, 128492, 71128, 41638, 3327, -36047, 1009, 35075, 57000, 32648, -19346, -829, -13049, -15704, -31384, -5543, -11665, 10186, 52190, 46154, 53295, 77950, 88677, 34385, -48047, -108276, -66499, -29275, -5173, -21279, -49905, -6619, 5660, -15729, 8826, 27356, -15062, 33390, 59960, 28277, -17347, 37526, 91344, 53496, -17934, -58680, -12946, 17935, 84542, 83526, 84432, 48375, -4855, -36717, -13916, -17024, -27790, -53768, -85152, -90714, -44386, -25479, -9338, 25089, -7859, -41778, -3854, 20906, -4565, -45179, -28082, 7315, -314, 9544, 40052, 55977, -41802, -55321, -28852, -19358, -6631, -20546, -4849, -17427, -36000, -41976, -23729, 2495, 53313, 30164, -5606, -30200, -37257, -108519, -49093, 16055, 11552, 30120]
3080C0120q204k3402K4602K3475J0911L502k4257m1333J8268r927j5472N6842
3068D5125j090p5405j1480N7698N0903o2611K2022L8702O1226m0497m1429k1621
3056B1543r5671m1396L2781P1174N5064r739M237k5440n6061p6748L1011N0693
3044c8552L3005J2090j6354j381J9119k4082j4998J9290Q837l0095J0870L0716
3032H465l5639l8064m8213Q2760L675J4028l6732k2804J1177J2876O1692L0084
3020D3305J4431J3301L5442k4028p3338J592K9623k3929k4527L8760L94k9844
3008A182L875N387O545k9824L6541j7030J0675j5881m0485j6960k8397M8800L3402
2995b170K9365M9032j9568j883K3990j1923L3344K0725k834M6502q5509n8952
$$ y = [30120, 21916, -1486, 23116, 46591, 57502, 61004, 36747, -4586, 13682, 3755, -11717, 45125, 44035, -31370, -42850, 14848, 65751, 3140, 25162, 63864, 125090, 84593, 43164, 21543, -74128, -115524, -82743, -11569, 43495, 33756, 37993, 12553, -43508, -120256, -89245, -38552, -5547, 6543, -9811, -11192, 7927, -16155, -31153, -11863, -3026, -33121, -22251, 8465, -27174, -65238, -113451, -30691, -27016, -12988, -49720, -72524, -61347, -48471, 13221, 43305, 57736, 71037, 106479, 82451, 9113, 10705, 40328, 16399, -8128, 30632, 31026, 1182, 5057, 10444, 16989, -12835, 23706, 6676, 17351, 1470, -39015, -55975, -84372, -35572, -2170, 27195, 76227, 56659, 54776, 78766, 66843, 100187, 120912, 118078, 164580, 79071, 20119]
2983B0119m3137r572J9447O2731K2456p175n0489n2771l5174l5012M7299Q3071
2971B1793L9186n877k4372j3255l3136o7029j4779P9784O4112M1182j0642l0736
2959D6231m7000k3231m2017N7154j641P658l741l9964K7956P9247J9094k771l4868
2946D2107k7282k8403J1376m694J8846L5596j147l4983k1334l626k8380N799j4406
2933e0531k182o454M3770K9342l429m3851k0752K0698J514k7359K0523M8808R893
2920A9990l5766k5736l4407K129O1754L4572l380m1695L052N6301J3035j3402
2908C6447l0757j0224J0045k9005m2039M05L2414N2437M7287J3224l5482l5042
2896I710k0607j6580k1987O9681K0169Q32Q372p670k5646J0040O4525q4503j05853
$$ y = [20119, -23018, -32590, -13143, 49588, 72044, 64869, 14380, -38391, -73565, -108577, -61278, 21793, 60979, 55102, 30730, 17475, -15661, -82690, -97469, -17685, 46427, 87609, 76967, 46231, -769, -24000, -66017, -8863, -10504, -2846, -6587, -46551, -18595, 60652, 79746, 76975, 42107, 14825, -13578, -2202, -6896, 11950, 47546, 46399, 11416, -9918, -13544, -41924, -36125, -50531, -52713, -59167, -15397, 13945, 10516, -33335, -54087, -33389, -31875, -59234, -38711, 10097, 19990, -15776, -41512, -75919, -73790, -12036, 22536, 19156, -22539, -19487, 36814, 49849, 36447, 5690, -4534, 5511, -23494, -65533, -65128, -32714, 19723, 67010, 80234, 44752, 9710, -10897, -27477, -49464, 20217, 40386, 41218, 49590, 41920, 16274, 26314, 90839, 6336, -99517]
2883i9517q731K8405P7667N50j01494n3674K8839Q150K743m668j9755M5086P5160
2870b1239l98p742K4322k6707L4174M1368l8621M396K5041J6659K5319J4467j5281
2857G5758l0699k471K5163K5138k2602r7023J8376l1542J461q60L4413L6734O589
2844C8435n7292k2649J6526L1315N5887k8234M6222P9334k1787m1056J138k1018
2832G6821K670o7267m4790n634L2601K5876L7314J826k7667K8393q992n2792j6111
2819a7752j7297j0508J28250J6853p1101l9307k9097o821K4412o109k8204r219
2807f5900j4426J9567O6926K3440J627K4323j4237j8844Q434J963P050l7183k9951
2794b7211M972M4508K3099n2980n5115K2788Q166k7367k5942M4522O5714K2779
$$ y = [-99517, -108248, -79843, -2176, -1626, -103120, -156794, -127955, -119805, -117062, -121730, -141485, -96399, -21239, -21637, -29379, -5057, -31764, 2410, 43778, 5157, 9553, 34594, 51253, 76572, 91039, 75758, 45059, 42588, 67751, 92889, 70287, -26736, -8360, -39902, -38441, -39301, -4888, 31846, 38435, -18857, -41506, -24980, 6335, 62222, 33988, 80210, 159544, 137757, 96701, 97839, 76821, 79491, 12224, -32566, -38200, -5599, 20277, 57591, 59417, 31750, 60143, 51151, -1641, -17752, -35049, -45557, 82693, 99546, 28445, -10862, -39959, -46780, -22368, -28477, -56681, -65900, -80326, -60759, 6167, 29607, 31234, 55557, 41320, 22476, 30910, 32873, 39923, 2740, -27211, -22239, 22269, 45368, -7612, -62727, -39939, -31773, -59140, -85082, -40560, 25154, 47933]
2782D7933q176P834J3198j8524q096J6671j2725j0524K3854j0883J2900O784n7740
2769B506j7015J8698N4677m5079n2064l8424J9247l004n819k1853k1549N7042
$$ y = [47933, 39757, 47591, 60789, 42265, 34169, 50840, 38115, 27591, 51445, 40562, 53462, 60246, 2506, -14509, 4189, 58866, 13787, -38277, -76701, -57454, -60458, -66277, -88130, -109679, -52637]
$$ [...]
##END NTUPLES=NMR SPECTRUM
##END=
