##TITLE=Analysis number 324416
Compound Code cc 50908
Book Reference 486/80
Project Code adrs
Chemist Name simons
##JCAMPDX= 6.0         $$ Bruker NMR JCAMP-DX V2.0
##DATA TYPE= NMR SPECTRUM
##DATA CLASS= NTUPLES
##ORIGIN= Bruker BioSpin GmbH
##OWNER= nmr
$$ XWIN-NMR		Version 3.5
$$ Tue Nov 21 11:06:13 2006 GMT Standard Time (UT+0h)  MAYBRIDGE\nmr@NMR_250MHZ
##.OBSERVE FREQUENCY= 250.131544655141
##.OBSERVE NUCLEUS= ^1H
##.ACQUISITION MODE= SIMULTANEOUS (DQD)
##.ACQUISITION SCHEME= undefined
##.AVERAGES= 16
##.DIGITISER RES= 18
##SPECTROMETER/DATA SYSTEM= dpx250
##.PULSE SEQUENCE= zg30
##.SOLVENT NAME= CDCl3
##.SHIFT REFERENCE= (INTERNAL, CDCl3, 0, 16.4505)
##AUDIT TRAIL= $$ (NUMBER, WHEN, WHO, WHERE, WHAT)
$$ ##TITLE= Audit trail, XWIN-NMR		Version 3.5
$$ ##JCAMPDX= 5.01
$$ ##ORIGIN= Bruker BioSpin GmbH
$$ ##OWNER= nmr
$$ C:\u/data/dgb/nmr/ADRS/770/pdata/1/auditp.txt
$$ ##AUDIT TRAIL=  $$ (NUMBER, WHEN, WHO, WHERE, WHAT)
(   1,<2006-11-21 11:05:43.89 +000>,<MAYBRIDGE\nmr>,<NMR_250MHZ>,
      <created by zg, POWCHK disabled, PULCHK disabled
       configuration hash MD5:
       49 4B E0 1D 92 C2 6B 37 9F E6 65 BC 52 41 86 1D
       data hash MD5: 64K
       C0 7C 0C 5F F3 2D E6 BD 18 07 5A 68 3C B5 0C 6D>)
(   2,<2006-11-21 11:06:02.54 +000>,<MAYBRIDGE\nmr>,<NMR_250MHZ>,
      <Start of raw data processing
       ef LB = 0.3 FT_mod = 6 PKNL = 1 SI = 32K 
       data hash MD5: 32K
       CA ED 3F 7C C0 FE 63 58 47 24 24 0A 09 6A 8D 12>)
(   3,<2006-11-21 11:06:04.26 +000>,<MAYBRIDGE\nmr>,<NMR_250MHZ>,
      <apk 
       data hash MD5: 32K
       7A 34 D5 EB 9E 80 C6 A4 14 AC 84 28 C6 9B 46 F6>)
(   4,<2006-11-21 11:06:05.01 +000>,<MAYBRIDGE\nmr>,<NMR_250MHZ>,
      <abs ABSG = 5 
       data hash MD5: 32K
       73 8C B4 6E A0 A7 5C 04 A9 1B 5A 31 D3 0C 14 98>)
$$ ##END=
$$ 
$$ hash MD5
$$ 7B 8B 3D 2D 30 05 01 7D 5D 34 CB 96 8C 03 58 81
##$RELAX= 
##$RELAX= 
##$RELAX= 
##$RELAX= 
##$RELAX= 
##$RELAX= 
##$RELAX= 
$$ Bruker specific parameters
$$ --------------------------
##$DU= <C:\u>
##$EXPNO= 770
##$NAME= <ADRS>
##$PROCNO= 1
##$TYPE= <nmr>
##$USER= <dgb>
##$AMP= (0..31)
100 100 100 100 100 100 100 100 100 100 100 100 100 100 100 100 100 100 
100 100 100 100 100 100 100 100 100 100 100 100 100 100 
##$AQSEQ= 0
##$AQ_mod= 3
##$AUNM= <au_zg>
##$AUTOPOS= <54 >
##$BF1= 250.13
##$BF2= 250.13
##$BF3= 250.13
##$BF4= 250.13
##$BF5= 500.13
##$BF6= 500.13
##$BF7= 500.13
##$BF8= 500.13
##$BYTORDA= 1
##$CFDGTYP= 0
##$CFRGTYP= 5
##$CHEMSTR= <none>
##$CNST= (0..31)
1 1 145 1 1 1 1 1 1 1 1 1 1 1 1 1 1 1 1 1 1 1 1 1 1 1 1 1 1 1 1 1 
##$CPDPRG= <>
##$CPDPRG1= <>
##$CPDPRG2= <>
##$CPDPRG3= <>
##$CPDPRG4= <mlev>
##$CPDPRG5= <mlev>
##$CPDPRG6= <mlev>
##$CPDPRG7= <mlev>
##$CPDPRG8= <mlev>
##$CPDPRGB= <>
##$CPDPRGT= <>
##$D= (0..31)
0 1 0 0 0 0 0 0 0 0.06 0 0 0 0 0 0 0.0002 0 0 0 0 0 0 0 0 0 0 0 0 0 0 
0 
##$DATE= 1164107142
##$DBL= (0..7)
120 120 120 120 120 120 120 120 
##$DBP= (0..7)
150 150 150 150 150 150 150 150 
##$DBP07= 0
##$DBPNAM0= <>
##$DBPNAM1= <>
$$ [...]
##$SUBNAM7= <"">
##$SUBNAM8= <"">
##$SUBNAM9= <"">
##$SW= 20.6930455092707
##$SWIBOX= (0..15)
0 0 3 0 0 0 0 0 0 0 0 0 0 0 0 0 
##$SW_h= 5175.983436853
##$TD= 65536
##$TD0= 1
##$TE= 683.16
##$TE2= 300
##$TE3= 300
##$TEG= 300
##$TL= (0..7)
0 120 120 120 120 120 120 120 
##$TP= (0..7)
150 150 150 150 150 150 150 150 
##$TP07= 0
##$TPNAME0= <>
##$TPNAME1= <>
##$TPNAME2= <>
##$TPNAME3= <>
##$TPNAME4= <>
##$TPNAME5= <>
##$TPNAME6= <>
##$TPNAME7= <>
##$TPOAL= (0..7)
0.5 0.5 0.5 0.5 0.5 0.5 0.5 0.5 
##$TPOFFS= (0..7)
0 0 0 0 0 0 0 0 
##$TUNHIN= 0
##$TUNHOUT= 0
##$TUNXOUT= 0
##$USERA1= <user>
##$USERA2= <user>
##$USERA3= <user>
##$USERA4= <user>
##$USERA5= <user>
##$V9= 5
##$VALIST= <valist>
##$VCLIST= <CCCCCCCCCCCCCCC>
##$VD= 0
##$VDLIST= <DDDDDDDDDDDDDDD>
##$VPLIST= <PPPPPPPPPPPPPPP>
##$VTLIST= <TTTTTTTTTTTTTTT>
##$WBST= 1024
##$WBSW= 4
##$XGAIN= (0..3)
0 0 0 0 
##$XL= 0
##$YL= 0
##$YMAX_a= 471167
##$YMIN_a= -414101
##$ZGOPTNS= <>
##$ZL1= 120
##$ZL2= 120
##$ZL3= 120
##$ZL4= 120
##$ABSF1= 16.45047
##$ABSF2= -4.242702
##$ABSG= 5
##$ABSL= 3
##$ALPHA= 0
##$AQORDER= 0
##$ASSFAC= 0
##$ASSFACI= 0
##$ASSFACX= 0
##$ASSWID= 0
##$AUNMP= <proc_1d>
##$AZFE= 0.1
##$AZFW= 0.1
##$BCFW= 0
##$BC_mod= 0
##$BYTORDP= 0
##$COROFFS= 0
##$CY= 12.5
##$DATMOD= 1
##$DC= 0
##$DFILT= <>
##$DTYPP= 0
##$F1P= 14.0000005364418
##$F2P= -0.99999901652339
##$FCOR= 0.5
##$FTSIZE= 32768
##$FT_mod= 6
##$GAMMA= 0
##$GB= 0
##$INTBC= 1
##$INTSCL= 1
##$ISEN= 128
##$LB= 0.3
##$LEV0= 0
##$LPBIN= 0
##$MAXI= 10000
##$MC2= 0
##$MEAN= 0
##$ME_mod= 0
##$MI= 0
##$NCOEF= 0
##$NC_proc= -3
##$NLEV= 6
##$NOISF1= 0
##$NOISF2= 0
##$NSP= 0
##$NTH_PI= 0
##$NZP= 0
##$OFFSET= 16.45047
##$PC= 1
##$PHC0= -40
##$PHC1= 0
##$PH_mod= 1
##$PKNL= yes
##$PPARMOD= 0
##$PSCAL= 4
##$PSIGN= 0
##$REVERSE= no
##$SF= 250.130017891307
##$SI= 32768
##$SIGF1= 0
##$SIGF2= 0
##$SINO= 400
##$SIOLD= 32768
##$SREGLST= <1H.CDCl3>
##$SSB= 0
##$STSI= 32768
##$STSR= 0
##$SW_p= 5175.98343685301
##$SYMM= 0
##$S_DEV= 0
##$TDeff= 65536
##$TDoff= 0
##$TI= <Analysis number 999999
Compound Code 99
Book Reference 9
Project Code 9>
##$TILT= no
##$TM1= 0
##$TM2= 0
##$TOPLEV= 0
##$USERP1= <user>
##$USERP2= <user>
##$USERP3= <user>
##$USERP4= <user>
##$USERP5= <user>
##$WDW= 1
##$XDIM= 32768
##$YMAX_p= 446002307
##$YMIN_p= -210899
$$ End of Bruker specific parameters
$$ ---------------------------------
##NTUPLES= NMR SPECTRUM
##VAR_NAME=  FREQUENCY,     SPECTRUM/REAL,   SPECTRUM/IMAG
##SYMBOL=    X,             R,               I
##VAR_TYPE=  INDEPENDENT,   DEPENDENT,       DEPENDENT
##VAR_FORM=  AFFN,          ASDF,            ASDF
##VAR_DIM=   32768,         32768,           32768
##UNITS=     HZ,            ARBITRARY UNITS, ARBITRARY UNITS
##FACTOR=    0.157963299565203, 1,           1
##FIRST=     4114.75634809238, 0,            0
##LAST=      -1061.22708876063, 0,           0
##MIN=       -1061.22708876063, -210899,     0
##MAX=       4114.75634809238, 446002307,    0
$$ Real data points
##PAGE= N=1
##DATA TABLE= (X++(R..R)), XYDATA
$$ [...]
16206f8685M0945k0004M0660K2642j0808O029J3141j1514J2524j0459M2818K4586
16194H1875p2306l1872L6586l6518K4808L9440J5217k7358m4219o7590J3586O3127
16182e224M9946l3956j6308m5656n1241m6301j1880M174K0430K9036N8584J964
16170d6432K783p869J1667O2827M8854o3295r1166J9692N2095J8123J8917M6525
16158G2721j055k8666J1830k9729j8610K7524K4698N435r103l7221l7679m4728
16146f4583P221Q284J224J3369J5905j7913l0763j9724o932K2133P9158K2241
16134B9620j9836L1890q895l2703K9774R634n1242j6631Q7029M8412K3501k1846
16122A08707k6607k8384k8280p110q249n3794m8222N3110O8034j19L782j1915
$$ y = [-68685, -27740, -47744, -7084, 15558, 4750, 10779, 23920, 12406, 24930, 14471, 57289, 81875, 9569, -22303, 14283, -22235, 2573, 42013, 57230, 29872, -14347, -81937, -68351, -5224, 44722, 10766, -5542, -51198, -102439, -148740, -160620, -156446, -136016, -106980, -48396, -46432, -43649, -51518, -39851, 22976, 71830, 8535, -82631, -62939, -10844, 7279, 26196, 72721, 71666, 43000, 54830, 25101, 6491, 34015, 58713, 64148, 55045, 17824, -19855, -64583, -57362, -49078, -47854, -34485, -18580, -36493, -67256, -86980, -93912, -71779, 7379, 29620, 9784, 41674, 32779, 76, 29850, 39484, -11758, -28389, 58640, 107052, 130553, 108707, 82100, 53716, 25436, 18326, 10077, -43717, -91939, -38829, 29205, 29086, 32868, 20953]
16110B0953j7414K6668K7037j7839k4823N0730n244m737K0855L085j5705l5830
16098B7736q282j2955K8285l2998o8303K6358P3497m0156L0382O948r1163m4378
16086a05029J8157l802N2220j0669j484n0569j1779j0591o450M2582R7673k0150
16074i891k6525K211K9334q435Q045P2120l8505m9808k5218l4869L490P3381K2567
16061A7897k652l4156l9075O4315N457k6274J0734j1842L1899N0904J7642j8466
16049F6383n0551n4504l0873M8188L0464o9465M0939J7295J5220K8147P620j9147
16037B9716k5846m5014K9935M9954J4813k3772o2140p576L3325M2666k2274o8752
16025e4965j4572L6129j3503N516k7429K9377r050N8716j7873k1248j554k4365
$$ y = [20953, 3539, 30207, 57244, 39405, 14582, 65312, 60068, 55331, 76186, 79271, 63566, 27736, 19454, 6499, 34784, 1786, -66517, -40159, 33338, -6818, 23564, 30512, -60651, -105029, -86872, -90674, -38454, -49123, -50607, -101176, -112955, -123546, -129996, -87414, 10259, -9891, -36416, -34205, -4871, -13306, -5261, 66859, 28354, -21454, -46672, -81541, -78051, -4670, 17897, 15245, -18911, -57986, 6329, 11786, -14488, -3754, -15596, 16303, 67207, 84849, 66383, 15832, -38672, -69545, -21357, 9107, -60358, -19419, -2124, 13096, 41243, 48863, 29716, 3870, -41144, -11209, 38745, 53558, 29786, -32354, -39930, -6605, 36061, 13787, -54965, -69537, -33408, -46911, -41395, -68824, -39447, -48497, 10219, -7654, -28902, -30456, -54821]
16013e4821K9674o004J8151n341j1777l1883K2608L536o45n168O1704J688k0305
16000A417n0425j8506p081K9151k332m9328J0523N1135j5679LK3181R198L2452
15987A3709O4989m2592K7691k5328m1329K3442J3538J0197L3798o261k2180l238
15975D6436J5491r090o291k9939l1613q978m0823N435M444j4555m0669K7105M8368
15962c4679L6003J497n6892K9651l5845k284K8797q79j8879j0767L5166P229r888
15949c1770J4745M4674K572n0866o395j3676P386M3530K3504J5472r006k2816
15937A7354K2695K7053k8929n0674j7210j2543L7772R737j6646N029K6317o2928
15925d2973n918l0354J3886M6213K1545l4859j6669J3274K0152j599Q0639L1410
$$ y = [-54821, -25147, -31151, -13000, -18341, -30118, -62001, -39393, -35857, -36502, -41670, 20034, 21722, 1417, -49008, -67514, -74595, -45444, -47776, -97104, -86581, -35446, -51125, -51122, -27941, -18743, 13709, 78698, 36106, 63797, 38469, -2860, 20582, 34120, 44317, 78115, 71854, 49674, 46436, 61927, 52837, 46546, 16607, -15006, -23984, -64807, -59372, -54928, -69483, -110152, -83047, -34679, 1324, 2821, -54071, -24420, -60265, -62549, -33752, -34631, -53510, -64277, -29111, -21882, -31770, -17025, 27649, 30221, -20645, -27040, -40716, -33330, 10200, 33704, 49176, 40170, 17354, 40049, 67102, 38173, -12501, -29711, -42254, -4482, 5255, -11391, -6362, 19955, -42973, -48891, -79245, -65359, -19146, 2399, -32460, -49129, -35855, -15703, -17302, 63337, 94747]
15913I4747j0930q9855r158P5994L9883l031M6216q445p0692l4216k6828j2199
15901h514k5151L772O643M4593n3589J0619J5150j8165k917K3581J1293P7241
15889H4556l072l645l4237p1925M601Q2501K0676j4591r4209R313M5794K7527
15877E3289k102J0039R862m2411J9771K3711k6007O9075M329l5893j2308j6133
15865E5222j4469l254K6284k861L0441M8793j9151m8319l5436J4880m7151m5356
15853d0377j3927m1796R529O1550Q1708p2100o1162J3311P6602L9636l8093j1066
15841C815l3434k6126j8708L0466K7672l4377j9273M5889J4074K5558J3754J852
15829C1162M5340J7218j0152l4181R503j4256j6966j0082j4037K2206j1001K218
$$ y = [94747, 83817, -6038, -15196, 60798, 100681, 97650, 143866, 135421, 64729, 30513, 3685, -8514, -33665, -29893, -23250, 21343, -32246, -21627, -6477, -24642, -27559, -3978, 7315, 84556, 81484, 77839, 43602, -28323, -23722, 58779, 79455, 64864, -29345, -20032, 25762, 53289, 51187, 61226, 71088, 28677, 48448, 72159, 46152, 115227, 119556, 83663, 71355, 55222, 40753, 37499, 63783, 60922, 91363, 140156, 121005, 72686, 37250, 52130, 4979, -40377, -54304, -96100, -86571, -25021, 56687, -15413, -76575, -63264, 13338, 52974, 14881, 3815, -29619, -55745, -74453, -43987, -16315, -50692, -69965, -24076, -10002, 15556, 29310, 31162, 76502, 93720, 83568, 49387, 58890, 44634, 27668, 17586, 3549, 25755, 14754, 16972]
15817A6972l1608J0374M4851l1260R90M8470k9111l0125k5412K7753N3522k6834
15805B8582n8688j1852k6146O954r37J4091K423J7972J0736k2942O4561J8718
15793D3472o1001J1439k171l6308j3887j1189q375K5748n651K592K9052L1421
15781E142R833j234J0730j5264n4046J0170q799m873L0291O1317L0334l205k9601
15768D0795m9393j1511J9729L3360Q483J9806r841j399l4601k9148J132L2606
15756B0018L0760k6933p7670j4457M484j4927K9854k2852k8000K1974K143K1526
15744e4080O4880N4726K6243l7080N3975j7215k8266j3575m0959p1005M9845L2920
15732B0409l4451l8611l1399k4537L2516J06100J9116J5535l3592n1388M7070
$$ y = [16972, -14636, -4262, 40589, 9329, 10319, 58789, 29678, -447, -25859, 1894, 55416, 28582, -30106, -41958, -68104, -61150, -62087, -47996, -45573, -27601, -16865, -39807, 24754, 43472, -17529, -6090, -8261, -44569, -58456, -69645, -78020, -52272, -57923, -55331, -26279, 5142, 14975, 13741, 24471, 9207, -44839, -34669, -43468, -48341, -18050, 43267, 73601, 70396, 40795, -8598, -20109, -380, 32980, 41463, 61269, 51428, 50029, 15428, -13720, -12588, 20018, 50778, 23845, -53825, -68282, -63798, -78725, -48871, -71723, -99723, -77749, -75606, -54080, 10800, 65526, 91769, 54689, 108664, 91449, 63183, 49608, 8649, -62356, -12511, 20409, -14042, -52653, -84052, -108589, -76073, 30027, 49143, 64678, 31086, -20302, 26768]
15721B6768N2278j7056k843j5064N668K8249n2493m0922j9241L2266L1724l6622
15709g288l7438j5778L9308N4049L7637M664l4458k8927l6664J250N967L9086
15697B1408K7291j572l8252l6370j9537m3l8010n70O960N7905N737L467R1524
15684G9938l4226j8177K8379J332n6114n4440K1571j2912M5954L9566N9475J7568
15672A17914m4200l7824j7123N9879Q584p4594m2198l531M9667n474n5051q063
15660e2014O7904k9583j3121l6296k3129J522M7067J4201Q940o0441l7042k1748
15648a33740Q0143J7733j7429K5114L7328j8171N2102J7172O265j7975n9668n106
15636a6232K5469K594n015m7660j5440l4695o4462J4722M4484k8620k7383P7489
$$ y = [26768, 79046, 61990, 59147, 44083, 49751, 78000, 25507, -15415, -34656, -2390, 29334, -7288, -44726, -60504, -21196, 32853, 70490, 75154, 40696, 11769, -24895, -23645, -17678, 21408, 48699, 47127, 8875, -27495, -47032, -47075, -85085, -85655, -78695, -20790, -15053, -11586, 79938, 45712, 27535, 55914, 57246, 1132, -53308, -31737, -44649, 1305, 40871, 100346, 117914, 73714, 35890, 18767, 78646, 87230, 12636, -29562, -33093, 16574, 11100, -43951, -52014, 15890, -13693, -26814, -63110, -86239, -84717, -37650, -23449, -14509, -74950, -111992, -133740, -53597, -35864, -53293, -28179, 9149, -9022, 43080, 60252, 66517, 48542, -11126, -16232, 9237, 11831, 6816, -40844, -56284, -90979, -155441, -140719, -96235, -124855, -152238, -74749]
15624g4749M6309P404l6976N5146j8711p475q277q568J4122J7674q087R895l137
15611a5430J5951M362R066M0374l7454j1207K8752r867o481j4619J5190M135m6386
15598b3614K5289M4582j8393q58k2683L9922M3400j3666j32311l3802L7805N8494
15586D165J6133j6695k4192J519N769M9650J867n6402m2888K2373L8994N4253
15574E4546M7283q163k2667m0001o882J3086n3505o8579L5355K0946l6285l723
15562f8589L5695M5244l6793m7979J2080M666j5263k2152M0500N4677J2821N3594
15550F8501L6368L94j9302n1041j5425K0367M069j3770j1424m7395M926K9195
15538E463j3300j1278l934m0921l1834j8516J8723P2368K1591p8983m7129P359
$$ y = [-74749, -28440, -21036, -58012, -2866, -21577, -29052, -37329, -45897, -31775, -14101, -22188, -12293, -15430, 521, 4883, 13949, 54323, 16869, 5662, 34414, 24547, 18066, 3447, 18637, 22772, -23614, 1675, 46257, 27864, 27006, 4323, 44245, 87645, 73979, -58332, -92134, -54329, 4165, 20298, 3603, -20589, -19070, -13301, 36349, 38216, -18186, -61074, -38701, 293, 54546, 101829, 93666, 70999, 30998, 24116, 37202, -16303, -84882, -49527, -28581, -64866, -68589, -32894, 12350, -24443, -72422, -60342, -55676, -70939, -93091, -52591, 2086, 14907, 68501, 104869, 105263, 85961, 34920, 19495, 39862, 43931, 30161, 18737, -28658, -23732, 5463, -7837, -19115, -23049, -63970, -95804, -114320, -95597, -23229, -1638, -80621, -127750, -120391]
15526a20391N3148P6947L4286L2143o6015l8568j0747k9077M0491J4535m8646
15515f1894p904n99M1790K160j4225M6984k2357j0922l923K1274r189K5663N2329
15502E9187R643K771j1585l5794J0754J4574n7915q622J1636K0481M1823m6389
15490A0564l800Q738P59n655n026J5784j6147l4081M027j2267j7155Q297M749
15477d1213J444N2460K0706l0932N7620k56n7434j8813o878R152k5726o2463L5601
15464f6732k5467O152K7184r755k4831Q1897N9480l3906j1267K3553K3647j6084
15452C3871Q33K4258J5971k5682m7747K0388M4384p7j5788J7701N7901m1818k2333
15439F1862j45605m6077N9034O2064K3369j1869l8588N4354O3042O617J9043n7521
$$ y = [-120391, -67243, 9704, 43990, 76133, 10118, -28450, -39197, -68274, -27783, -13248, -61894, -69798, -70397, -28607, -26447, -40672, 6312, -16045, -26967, -30890, -9616, -18805, 6858, 59187, 68830, 71601, 60016, 24222, 34976, 49550, -8365, -16987, -5351, 15130, 56953, 10564, 6764, 15502, 16261, 10606, 5580, 21364, 5217, -28864, -24837, -37104, -54259, -45962, -41213, -39769, 12691, 33397, 2465, 60085, 59829, 2395, -16418, -23296, -14144, -39870, -102333, -66732, -92199, -86047, -58863, -68618, -93449, -11552, 47928, 14022, 2755, 26308, 49955, 33871, 34704, 58962, 74933, 49251, 1504, 21892, 66276, 66199, 50411, 68112, 126013, 84195, 61862, -83743, -129820, -70786, -8722, 14647, 2778, -35810, 18544, 81586, 88203, 107246, 49725]
15427D9725n5799k4187o05o438K1955M4985L0542k219j4465n4231k2651j5946
15415d9334K934L1297j4556k8207p643O9523M3546k1241r5360J7007L4197j7589
15403c5426k0232q30L3680K275L9551m0439L61N3577L326k47m0489p3645L3326
15390d5212r068k3781k0433m7111N3106q989K5177O3490J3865L7138j1133N96
15378B7645n2077k0806P5906l5385j4927K5154J8545L543r581M0517K1845j3588
15366F6791j5729k8852Q418m5628k8746O1830n606l9546o4523k1825O7137M9734
15354C455L05J462o9156q575Q270N1424M5416N835m5656M5811k8774J1623M032
15341B5472j7k8442J4504O720M3964L8731M0857k7062r8542p8404M6751Q243K6771
$$ y = [49725, -6074, -30261, -30866, -37304, -15349, 29636, 60178, 57959, 43494, -10737, -33388, -49334, -46400, -15103, -29659, -57866, -65509, 4014, 47560, 26319, -69041, -52034, -17837, -35426, -55658, -56488, -22808, -20533, 19018, -21421, -21060, 32517, 35843, 35596, -4893, -78538, -45212, -54280, -78061, -98494, -145605, -92499, -101488, -76311, -12821, 1044, 38182, 27049, 27645, -24432, -45238, 30668, -4717, -19644, 5510, 24055, 27598, 18017, 58534, 80379, 66791, 51062, 22210, 30628, -15000, -43746, 18084, 12478, -27068, -91591, -113416, -46279, 3455, 3760, 5222, -63934, -72509, -64239, -12815, 32601, 38436, -7220, 38591, 9817, 21440, 25472, 25455, -2987, 11517, 18237, 62201, 100932, 141789, 114727, 16185, -62219, -15468, -7225, 19546]
15328A9546J3976k5493p609l9307J639R613R108l9394o0390K751Q0994J7237L9090
15315B1761J5209J9877j8958k3333p929M6548l4910k6133M5517K106L99K982k4615
15302A8521O4574K520o6786j7154k43l5996j976N5727L5418l3641k2576N9467
15290E7855o112o5702o7428L3795K5438K2920m7147J6757N5928J0881N5541j071
15278I1655o9998m1098R808k5176p196N134K7392J5703j8409k101l6952p1775
15266a23013k0305O8092K7165N8380K2314j2836n5536j1782l2852p281N5080K6770
15254e804K7409l8189Q064L6344L844J9205r3834j8138Q452j9415K1096Q270J4234
15241b8462J6574q192M9099M9621P701n991J620k7555m7754L691O968P7367K7259
$$ y = [19546, 33522, 8029, 420, -38887, -37248, -27635, -18527, -57921, -118311, -115560, -34566, -17329, 21761, 36970, 56847, 37889, 14556, 6627, 53175, 18265, -7868, 37649, 39755, 40154, 43136, 18521, 83095, 85615, 18829, 1675, 1432, -34564, -36540, 19187, 54605, 20964, -1612, 57855, 51743, -13959, -81387, -47592, -22154, 766, -46381, -29624, 26304, 37185, 92726, 91655, 21657, -19441, -9633, -34809, -42005, -36871, -9479, 6224, -12185, -14286, -51238, -123013, -143318, -75226, -48061, 10319, 32633, 19797, -35739, -47521, -80373, -87654, -32574, -5804, 21605, -16584, -8520, 27824, 31668, 50873, -42961, -61099, -52647, -72062, -50966, -42696, -28462, -11888, -20080, 29019, 78640, 86341, 80350, 81970, 54415, 6661, 10352, 17320, 94687, 121946]
15228A21946L4913J5083J02509O6997L3992N6111Q9111N7817Q2818K6030K0626
15217G07953J8952Q1307N5160O6457N5433k4273n4487j02445j39152p7343j02479
15206D85083j45230o5728p8666p1638k7930r336k5167K4091K7415K1606l5636
15195I8864m0726M151j5862K4222J2918p6775j8533J5841k6518m4774K673j6504
15183h1023K5708R823L4811k0327L1595L2838N916J6751m453j3982o3P15o7325
15170b9016M132K1518O899M4550K7073j4015L1687p39n3464k2900J9816r854j4349
15157A1338K9879M1736K6243N842o1719k2971K602j8495l024p1872j3302j3929
15145h7672M9750R612R822q72j7300K5803J8848L6311K1754K9378k9303l7774
$$ y = [121946, 156859, 171942, 274451, 341448, 375440, 431551, 520662, 578479, 661297, 687327, 707953, 726905, 808212, 863372, 929829, 985262, 960989, 906502, 804057, 664905, 587562, 485083, 339853, 274125, 195459, 123821, 95891, 86555, 61388, 85479, 112894, 134500, 98864, 58138, 62289, 46427, 70649, 83567, 6792, -11741, 4100, -22418, -67192, -64519, -81023, -55315, -45492, -10681, -31008, 587, 33425, 39341, 56092, 51639, 37657, 37594, 38309, -29016, -24884, -3366, 3533, 48083, 75156, 61141, 92828, 92089, 38625, 15725, 35541, 25687, 11338, 41217, 82953, 109196, 115038, 53319, 30348, 32950, 14455, 11431, -60441, -73743, -87672, -37922, -28310, -18488, -19360, -36660, -10857, 7991, 44302, 66056, 95434, 66131, 28357]
15133B8357J931J8800L9635m9106j7035Q716N7165L4336n6706m516l0292r2277
15121f0992l3182q498j4240l6320M97M9227Q5404j2297n9528L0901J5088N675
15109c8265j233O987K9074O0209k8454j14812q888K0302O3770K8215j0175p9136
15097g2406K0892R3142M662m3879m6358J064k5263K71p572J1592O3195M667l0971
15084b6964Q6528J380o5010L0817K9074k5056o6662k4704L1417q910J62k0279
15072e8207M6477J5416k6425K3967n996p266K8986M3490p9301k8592q817j6670
15060g2938O0967L8683n6175m86K7898J4940k3260k3806j9223l0018J4905K0499
15048d8014K1153o782j960k4117P4746M8892K4286n2661k6758o1693k3822M2545
$$ y = [28357, 30288, 49088, 88723, 39617, 22582, 31298, 88463, 122799, 66093, 61577, 31285, -60992, -94174, -102672, -116912, -153232, -152735, -103508, -18104, -30401, -89929, -59028, -43940, -38265, -39498, -32511, -3437, 56772, 28318, -86494, -95382, -75080, -11310, 16905, 6730, -72406, -51514, 41628, 46290, 2411, -43947, -42883, -68146, -67875, -75447, -63855, -660, 4007, -26964, 59564, 60944, -4066, 26751, 55825, 30769, -35893, -60597, -29180, -38090, -37928, -58207, -11730, 3686, -22739, 1228, -4768, -12034, 16952, 60442, -18859, -47451, -56268, -72938, -11971, 26712, -29463, -29949, -2051, 12889, -10371, -34177, -53400, -83418, -68513, -48014, -26861, -33643, -35603, -59720, 15026, 63918, 88204, 35543, 8785, -52908, -76730, -34185]
15036c4185K1218K716K3982N9711J2417m2598o9060p977P0364k0403J4721J9607
15024E0513k7134n1853o8209L4140O6205M6226n5844j390j6022N1558K1851n3814
15012c773n9385k942J5048J7430J393J1240k4324l159j4107n3691j2212J9974
15000a08508K78N770K727L627J0988N9139N561N413j3806K8440K9460O4220P3433
14987A66742n8890p1386l8403M3987J3422l6063k9020j7949J1708m77Q163L0898
14975B2732L4645j7921M052L7127L1422k9204J3931l9292k8208j5188o46L5551
14963D9001k1787q0758j8519j4772k264l410L6471R7692J6831Q94m5917j6441
14951b979N185n4597Q893K2264O871R1623L9505j6976m0439r3180k4033O9342
$$ y = [-34185, -12967, -10251, 13731, 73442, 85859, 43261, -25799, -33776, 36588, 16185, 30906, 50513, 23379, -28474, -96683, -62543, 3662, 49888, -5956, -7346, -23368, 28190, 50041, -3773, -63158, -66100, -51052, -33622, -32229, -20989, -45313, -48472, -62579, -116270, -128482, -108508, -108230, -102460, -99733, -96106, -85118, -25979, -20418, -15005, -28811, -371, 29089, 93309, 166742, 107852, 36466, -1937, 42050, 55472, 19409, -9611, -27560, -15852, -16329, -8166, 22732, 57377, 39456, 43508, 80635, 112057, 82853, 96784, 57492, 29284, 14096, 13450, 49001, 27214, -53544, -72063, -86835, -89099, -92509, -56038, 41654, 58485, 59379, 13462, -2979, 2206, -52391, -43498, -21234, -14363, 77260, 116765, 99789, 59350, -33830, -57863, 11479]
14939A1479J5613M665K2613l7707o3380N740m4608k4404M5743J1404k1799J2954
14927f1687K4871K0035o095k0640N9015L2372k4755k3892k5452m0096L1440l5639
14915g0523M4949Q3575L733o7738j7110k3207M6024K8412p1974k3069K001K2659
14903d2268L4440L3388P02k7140j1216K1461J5560r985l8613k0649l3394N5599
14891b2115Q284n1361L5045M6986l6077p66J5616M1584K8752K5099n4437m0621
14879d011n2898J0591P0153L3714k4467J8515l581j1076k8881J5728K8543n4570
14867b240l4374O4465K4772N6492n3337l1695M6424J2914j4870k171m9803n26
14855A6051M2267q276k1267m9810j403k5754L924j9309K258M8117L0769m7198
$$ y = [11479, 27092, 31757, 54370, 16663, -46717, -40977, -85585, -109989, -64246, -52842, -74641, -61687, -36816, -16781, -22876, -43516, 15499, 47871, 23116, -776, -26228, -66324, -34884, -70523, -25574, 58001, 61734, -6004, -23114, -46321, -297, 28115, -43859, -66928, -64927, -42268, -7828, 25560, 26262, -878, -12094, 9367, 24927, 14942, -23671, -44320, -77714, -22115, -13831, -65192, -30147, 16839, -19238, -20004, -4388, 37196, 65948, 91047, 36610, -4011, -56909, -46318, 23835, 57549, 33082, 51597, 48016, 36940, 8059, 23787, 52330, -2240, -36614, 27851, 52623, 109115, 55778, 24083, 70507, 83421, 68551, 66380, 16577, 16051, 58318, 50042, 28775, -21035, -22438, -48192, -44268, -63577, -61319, -13202, 17567, -29631]
14843b9631r017J3832N3853m8027k8170P100K3460L908P908n291k4290j9478k4015
14830g7858k6629N6588K082k0731L4952M1986k4712K04J6798J7698K6037n8633
14818a2218m8360K462K7178J8003K4892q467l0840n4221j4906l8506k1619L3488
14806a23114L701M8617O5935K0702l907l8731k5886O75j6580K4219K4205O6096
14794D5932k0264L6889m9434m4260n100Q1005L4468K5147j2991J2306n5695M031
14782E2034O1420n812M65l2230q4441n8175o288L7357j4517k99n086L9176K5557
14769I161m6898l5259N8519M5178M6304L0737o1237J9954L9062M6908o2109p4267
14757A6053l0169J8916K9414k067j3412k8116J2713K364j9962m69J2345l9930
$$ y = [-29631, -38648, -24816, 29037, -18990, -47160, -40060, -16600, -12692, -4784, -10075, -34365, -53843, -77858, -104487, -47899, -45817, -66548, -31596, 10390, -14322, -14118, 2680, 20378, 46415, -12218, -60578, -58116, -30938, -12935, 11957, 3490, -27350, -81571, -96477, -134983, -156602, -123114, -119413, -70796, -4861, 15841, 11934, -26797, -52683, -52008, -68588, -44369, -20164, 45932, 25668, 62557, 13123, -31137, -36237, 44768, 79236, 104383, 91392, 103698, 48003, 52034, 113454, 107642, 108107, 75877, -8564, -66739, -73027, -35670, -50187, -50486, -55572, -16396, 9161, -37737, -72996, -14477, 30701, 77005, 107742, 46505, 66459, 105521, 152429, 90320, 16053, -14116, 4800, 34214, 32147, 18735, -9381, 3332, 5696, -14266, -14735, -2390, -42320]
14745d2320R212K3728O1381K2724J6885n5766n3723l3629M9627N4949N887J8849
14733G7804M859j2319l3600N386m8999j2957M6257q691j8385j6787L0347K963
14721A5878J8883K331J2544j7776o623L897L5902k9502p0805m7779K2712M7631
14709a2707K5305J8989k1890m0662O7198J6603k6581l522M4645k8713l7024K5484
14697B7125J9517J7544n9N4579J8527l2985l7562q4175k520L4269P561l2178n1
14684a0408n899m7429m8886L8635J08433P5324o340o2437o6542k7617l6565k9531
14672a19262L2500O5382O1771N742o3441k7211L7564M5944M5327J6292K593K4083
14660A27284m0600m1823q251j8425l789j8211K0849N4027M6267l6445m8383k653
$$ y = [-42320, -33108, -9380, 52001, 74725, 91610, 35844, -17879, -51508, -1881, 53068, 58955, 77804, 82663, 70344, 36744, 42130, -6869, -19826, 26431, 17740, -645, -17432, 12915, 15878, 34761, 37092, 49636, 31860, 25237, 29134, 65036, 35534, -35271, -83050, -60338, -12707, 12598, 31587, 9697, -30965, 36233, 52836, 26255, 22733, 67378, 38665, 1641, 27125, 46642, 64186, 64127, 118706, 137233, 104248, 66686, -17489, -20009, 14260, 21821, -10357, -10408, -16307, -63736, -112622, -73987, 34446, 109770, 103430, 40993, -25549, -53166, -89731, -119262, -86762, -21380, 40391, 46133, -17308, -44519, -6955, 38989, 84316, 100608, 103201, 127284, 86684, 44861, 36610, 18185, 14396, -3815, 17034, 71061, 117328, 80883, 32500, 29847]
14648B9847K7321l5534l7941k0463l5283l4485J4492M2190R0330j7284o2407J3262
14636b5955Q064j2526j3310L3857L0439m1580o0815k8982L9340N3924L9571p7364
14624e5337N110o619M2956k8466p2091L7256K5975J2798L18O4279k5795j0426
14612a0042J0444j4305O67K3370j02999n2253L6965K194K2311K9994l0047q806
14600i2507L2127M3509N7407j0458n449K8421N343m881l4025m2363k2040m9898
14588i4814J2877M4994Q815k2751J5156J0258k5129K3338K8841j2591l8710l3292
14576h3008J4428j4065M4547J449k0852O1677O0214J3089n5813r2375K350K8842
14564c9517J9998R4825K1493o4319l1816k985j753l7586L8581K1673l5455j4627
$$ y = [29847, 57168, 21634, -16307, -36770, -72053, -106538, -92046, -49856, 40474, 23190, -39217, -25955, -17891, -30417, -43727, -9870, 20569, -21011, -81826, -110808, -71468, -17544, 22027, -55337, -50227, -56846, -13890, -42356, -114447, -77191, -51216, -38418, -38100, 26179, 384, -10042, 402, -13903, -13236, 10134, -92865, -145118, -108153, -105959, -83648, -53654, -83701, -92507, -60380, -16871, 40536, 30078, 24629, 53050, 58393, 53512, 19487, -22876, -44916, -94814, -81937, -36943, -28128, -50879, -35723, -25465, -50594, -27256, 1585, -11006, -49716, -83008, -68580, -82645, -38098, -36649, -57501, 4176, 64390, 77479, 21666, -70709, -68359, -39517, -19519, 75306, 96799, 32480, 664, -2321, -4074, -41660, -3079, 18594, -16861, -31488]
14552c1488L0874L1977m1605l271J5351l0132M5130L4013o374j7902l4577n1615
14540e9619j8817M8669k5764q438j764M9035J2227n9148l887Q2838L3370k0696
14528B8006l7667j9370j6664l51k4534K072N0468R244K1576J3566L5295M8500
14516A10141k6044m3228k1875j3149J0132J2338j7535o2164k3974L3882K2282
14505a9194L5391O3414m6187M1119k6862r3159k3132r570L8449j0152m630K9391
14493b5122L1598j8589j6114l909l9881O6567P0536k253o6229M728p276J0391
14481D447J5815o983q751J5093K2605M2602n2807M5417N6561J7339r4632r9314
14469d2608l5995j9193K4428K3716J2947j409J2886k9406n319J8645O5238J9412
$$ y = [-31488, -614, 31363, -10242, -13513, 1838, -28294, 16836, 50849, 44475, 26573, -8004, -59619, -78436, -29767, -55531, -63969, -65733, -16698, -4471, -63619, -67506, 15332, 48702, 28006, -9661, -29031, -45695, -46046, -70580, -68508, -18040, -8796, 12780, 26346, 61641, 110141, 84097, 40869, 18994, 5845, 15977, 28315, 10780, -51384, -75358, -41476, -19194, 16197, 79611, 33424, 74543, 47681, -45478, -68610, -78180, -39731, -49883, -54513, -25122, 6476, -12113, -28227, -32136, -72017, -5450, 65086, 62833, -3396, 1332, -5944, 4447, 20262, 13279, 4528, 19621, 42226, 84828, 32021, 77438, 133999, 151338, 56706, -42608, -78603, -97796, -73368, -49652, -36705, -38114, -25228, -54634, -59953, -41308, 23930, 43342]
14457D3342j159l6606k3034k0225k0541k2213L2166J8049L5683j79J16l0203m8531
14444g3335m9580N0871L1181r541l9079Q89M3653K4834l318M111M2256J5490M4918
14431H3350R659M8930m005k5796k4833j1182m8216k6170j3580l9938K882k0731
14419f9630P5796K5469O3343l1518j279l154m1171N4222J9067l0133J4200J2137
14407H7349l0313q0474k5562K8762N7054L7946K78n9707p3891j0475J0938l0959
14395h9054O9030R0246M7514O8757k5774r7953p7603K485o305q001k9670l0641
14383h6969K4770l8721N0283O0160K0034j5466l8466m1880j694L3846M4917J1291
14371B2105N3023r426n0687J6057K0606m1224J2707L7172k3174o1642R990K81
$$ y = [43342, 42183, 5577, -17457, -37682, -58223, -80436, -48270, -30221, 5462, 5283, 5399, -24804, -73335, -122915, -72044, -40863, -50404, -89483, -88594, -44941, -20107, -23425, -19314, 22942, 38432, 83350, 93009, 141939, 137934, 112138, 87305, 76123, 27907, 1737, -11843, -51781, -48899, -69630, 6166, 31635, 94978, 63460, 62181, 59027, 17856, 72078, 91145, 61012, 75212, 87349, 57036, -23438, -49000, -20238, 36816, 74762, 75040, 15333, -58558, -69033, -58095, -89054, -20024, 70222, 117736, 186493, 160719, 62766, -14837, -12352, -18657, -26658, -56328, -86969, -62199, -100920, -50637, 9523, 29557, 14091, -24375, -66255, -67949, -34103, 10814, 22105, 75128, 65702, 15015, 31072, 51678, 10454, 23161, 60333, 37159, -24483, -14493, -14212]
14359a4212J3293P4706N5567o3515l9198N0108P871J9009R0197j3882m1836n7044
14347H1064l7164J6942m0497l4648N0832L062n6890m6817O2515k8098J298N6526
14335B8125L9592n5217n1479L9166j459k6009l0429N874l6430J2111l160K1528
14323e7787J655N977J5579j0274M0756M8316P315L42p08n1209Q305N4673P4791
14310A37731L0q6812l1394j9588n4973m1599K4513L6858K426j1920K687l6907
14298g8948O7337M2955j6112k4473K1698N3896n448J8338K2132L9491J7132q7946
14286G0052O403l1665k188K1396j6852P20r498L4361k8349m207K6572K1541N0955
14273A39241P9511J0373j4529J9313m0515j3199K6333k6147l0364O4700J4785
$$ y = [-14212, -919, 73787, 129354, 65839, 26641, 76749, 84620, 103629, 193826, 179944, 138108, 81064, 43900, 60842, 20345, -14303, 36529, 39591, -17299, -64116, -1601, -29699, -28401, 28125, 67717, 12500, -38979, 187, -1272, -27281, -57710, -51836, -88266, -76155, -79315, -57787, -56132, -50155, -34576, -44850, -4094, 44222, 51537, 51879, 51171, -38, 8267, 62940, 137731, 137761, 50949, 19555, -33, -55006, -96605, -72092, -35234, -32808, -44728, -42041, -78948, -11611, 31344, 15232, -9241, 12457, 66353, 60905, 79243, 101375, 140866, 157998, 70052, 76455, 44790, 42602, 63998, 47146, 47866, 38368, 72729, 44380, 40173, 66745, 88286, 139241, 218752, 229125, 214596, 233909, 193394, 180195, 206528, 180381, 150017, 214717, 229502]
14262B29502m0205j2900M3960M6573R5912R8302K12691J86260J68598K07446J82378
14251A418517J78615L0003K0473J4821j23952r5140o4630j22968r9070q7797R213
14240A078085P5523K7301M9874Q2482N7285N8099J06996J10818L0259M1975N6751
14229A775448R4391N1898L5535M8339J07340m6311m5556K2106J3482j09054j13634
14218A833984j08986q3716m5729p0025n9967r1241j36793j9903n963j4619r0431
14207A106611l8961o3476j36283n7416n2910j07279q1153k2511o0882p5284q683
14196D01773J0592m3145l4540k9081J007m9378j6200m7807r157K6504O8257k0448
14184B58377q3821k4149J0774n8602L625J1976j8645m8479K6605J9401m1099k223
$$ y = [229502, 189297, 176397, 220357, 266930, 362842, 461144, 673835, 860095, 1028693, 1236139, 1418517, 1597132, 1627135, 1647608, 1662429, 1538477, 1443337, 1378707, 1255739, 1156669, 1068872, 1078085, 1153608, 1180909, 1230783, 1313265, 1370550, 1428649, 1535645, 1646463, 1676722, 1718697, 1775448, 1869839, 1921737, 1957272, 2005611, 2112951, 2066640, 2021084, 2043190, 2056672, 1947618, 1833984, 1724998, 1641282, 1595553, 1525528, 1465561, 1374320, 1237527, 1217624, 1211661, 1197042, 1106611, 1067650, 1004174, 867891, 810475, 757565, 650286, 569133, 546622, 485740, 410456, 401773, 412365, 369220, 334680, 305599, 306606, 257228, 241028, 193221, 184064, 210568, 278825, 258377, 174556, 150407, 161181, 102579, 106204, 118180, 99535, 51056, 77661, 97062, 55963, 53740]
14172E3740O2316K6632J2393M6729M6476l1132l8687k2674j8339m8269q1004M5055
14160E3236k3246o6205J0344n775K9828O5510J187l4683l6282p6238O2821Q0263
14148F0760N7547l0393m6542o8749r771k4915L3643R5900M749N423M0870J9784
14136A38306k6470m3622l8815j3390k7041k8892k0594M9692K2632J9664j7107
14125A4363Q591l0497J8862O651p438j1477j6175J5457k1373L2660R1965M0904
14113A42493M751j9842l8659J1362J3933Q410k6880n9193J424l3869q366M060
14101c76K861Q169O4776j2355L8802k7562J4506l5999n40m516N4230K9994O313
14088A38303k7483k1041j8249p431N4178n631m9524q894m6632j6183j942o5039
$$ y = [53740, 116056, 142688, 155081, 201810, 248286, 217154, 178467, 155793, 137454, 89185, 8181, 53236, 29990, -36215, -25871, -31646, -1818, 63692, 64879, 30196, -6086, -82324, -19503, 60760, 118307, 87914, 41372, -27377, -37148, -62063, -28420, 67480, 72229, 77652, 118522, 138306, 111836, 68214, 29399, 16009, -11032, -39924, -60518, -10826, 11806, 31470, 14363, 22954, -7543, 11319, 17970, 10532, -945, -17120, -1663, -23036, 9624, 101589, 142493, 147244, 127402, 88743, 100105, 114038, 122448, 95568, 36375, 37799, 3930, -4436, -376, 2485, 10654, 75430, 63075, 101877, 74315, 88821, 52822, 52282, 47766, 101996, 131990, 138303, 110820, 89779, 71530, 64099, 118277, 112646, 63122, 54228, 7596, -8587, -10529, -75568]
14076g5568L321L6682L2541L8037J7205j4795K8446j1307l2686M0288K0090q4278
14064b024k5648K2499J5260N343P6165K8803k1929p627j3284k4229k0886j9283
14052A3160J9408L6127N3927K0446l2029J2219k623j9965M7141n3524o1329J2159
14040D5117N1700J528l0606l0938L633Q032r212M8622N7792J510n071K3623K1204
14027A86934L716J872P5912N3609K8863j4346j4836O955J0261k4611j7229K1228
14015C18328q956l4587k2490n6199n8831p1885l6510K5384J1190M6875K8320l8725
14003A01914O651N5825Q505k6319M5024N863n8786j2217M0451k0252q274p406
13991A30979n0608l3016K7885Q001K1709k7032R355j8517k753L9959M3759L643
$$ y = [-75568, -72247, -35565, -3024, 35013, 52218, 37423, 65869, 54562, 21876, 62164, 82254, -2024, -27672, -5173, 10087, 15430, 91595, 120398, 98469, 90842, 77558, 53329, 32443, 13160, 32568, 68695, 122622, 143068, 111039, 123258, 120635, 100670, 147811, 94287, 32958, 45117, 96817, 98345, 67739, 36801, 40434, 48466, 39254, 87876, 145668, 147178, 142107, 165730, 186934, 190650, 192522, 268434, 322043, 350906, 336560, 321724, 328679, 338940, 314329, 297100, 318328, 309372, 274785, 252295, 196096, 137265, 65380, 28870, 54254, 65444, 112319, 140639, 101914, 108565, 164390, 172895, 146576, 191600, 197463, 138677, 126460, 166911, 146659, 138385, 130979, 80371, 47355, 75240, 83241, 104950, 77918, 87273, 68756, 66003, 105962, 149721, 153364]
13979A53364l0244n9511K4195r72j37996n2402Q196o572L3021L8134P068N1146
13967B7427N2642M3618j0705k1712n4867l758J6014J2655M5411j0480o023N7202
13955A47424N429J7371o3694J6552N4159m377M7571L4151j00580q3079L0470M3054
13943A44451Q8177K018l2512m4854P041j3785k0630J6272k4949j3454P1206M6335
13931B25316L612k6593q411o6921K3728J35808J845p6676m3605K6611Q6701K5155
13919C06570k6159J4005m6166j6754K9945k0009m2455O9676J123m0107j708M5414
13907B73375M0178L3383r653J7652q713k3707k809K8234J9914M3186J981l54O4661
13894D77328J2751j3495K6267k3020m1855q7959m6073j4021k9342q102J0353j9051
$$ y = [153364, 123120, 63609, 87804, 86832, -51164, -103566, -95370, -101942, -68921, -30787, -23719, 27427, 80069, 123687, 112982, 91270, 36403, 32645, 48659, 61314, 106725, 96245, 90222, 147424, 152853, 170224, 106530, 123082, 177241, 172864, 220435, 254586, 154006, 70927, 101397, 144451, 232628, 234646, 202134, 157280, 164321, 150536, 129906, 146178, 121229, 107775, 178981, 225316, 228928, 202335, 193924, 127003, 150731, 286539, 288384, 211708, 168103, 194714, 281415, 306570, 280411, 294416, 248250, 231496, 261441, 241432, 198977, 268653, 269776, 229669, 227961, 273375, 313553, 346936, 337283, 354935, 346222, 322515, 319706, 347940, 367854, 411040, 413021, 412667, 477328, 490079, 476584, 502851, 479831, 437976, 350017, 303944, 289923, 260581, 252479, 262832, 243781]
13882B43781J503k0979l007M1755J4701k1656Q3315q436N1983m670j8776k2352
13870C37162m4175O2180N4145J8288r415j6166K5022j1380l8804m4474J3081m5962
13858B99502K9863K1008L5756L7979J0947k0294p260M058N832J01006P664m7125
13846D78936j5260l1595K1940L5272j3188K9405m7382N5859l5860l5601O7052
13835E09578J59318O2994j405m219K8820L3856J1936O397M2452k1127m0846M0650
13823H28404P0438K3625j9394M7470R5569R1032L6605P1267N2653J971M1977J04513
13811A446130N3708J6224R2528O5892N9289N3194Q3600O7336Q6140O6188J22046
13800B212275J80063K58552K74096K62749K85231L98283L98252M64582N70227
$$ y = [243781, 245284, 224305, 221298, 263053, 277754, 256098, 339413, 330977, 382960, 378290, 359514, 337162, 292987, 355167, 409312, 427600, 418185, 402019, 427041, 415661, 376857, 332383, 345464, 299502, 329365, 350373, 386129, 424108, 435055, 414761, 407501, 411559, 417391, 518397, 526061, 478936, 463676, 432081, 454021, 489293, 476105, 505510, 458128, 513987, 478127, 442526, 509578, 668896, 731890, 730485, 726266, 755086, 788942, 800878, 807275, 849727, 828600, 787754, 828404, 898842, 922467, 903073, 950543, 1046112, 1137144, 1173749, 1245016, 1297669, 1299640, 1341617, 1446130, 1499838, 1516062, 1608590, 1674482, 1733771, 1786965, 1870565, 1937901, 2024041, 2090229, 2212275, 2392338, 2650890, 2924986, 3187735, 3472966, 3871249, 4269501, 4734083, 5304310]
13791E304310O06694P69133Q40858R53093J080990J080726J158704J334291J531556
13782A4660355J915637K632338L576454N224924P985753J2096226J7482116K3657719
13774H9231522K9416842L3091229L3077627K8446989J9210963O831869o832108
13767B32474933j9114797k8139456l2357794l2110223k8628129k2993007j6982682
13760E2148845j1726322p681094m967054l256277k243373j791551j522053j305931
13752A7655190j177100j007391q93422p42905n88611l62393k34575k86007l48498
13743A2014288m40749o69415q08520r15674q94192r14488p71869o13634n03453
13734E482294m49450l20540l33070l13327k65862j50085j98381j73804j70188
$$ y = [5304310, 5911004, 6680137, 7520995, 8474088, 9555078, 10635804, 11794508, 13128799, 14660355, 16575992, 19208330, 22784784, 28009708, 35995461, 48091687, 65573803, 89231522, 118648364, 151739593, 184817220, 213264209, 232475172, 239307041, 232474933, 213360136, 185220680, 152862886, 120752663, 92124534, 69131527, 52148845, 40422523, 32741429, 27774375, 24518098, 22274725, 20483174, 18961121, 17655190, 16478090, 15470699, 14577277, 13834372, 13245761, 12883368, 12648793, 12362786, 12014288, 11573539, 10904124, 10095604, 9179930, 8285738, 7371250, 6599381, 5985747, 5482294, 5032844, 4712304, 4379234, 4065907, 3800045, 3649960, 3451579, 3277775, 3107587]
13725C107587j54093j41090j30577p4257m9236n3251j16363j23825j39724j07289
13715B017882q9595n1789k3552r5059p625o3678q9454n8594J637k2699K3221J04433
13703A645128K25962L19650L16102J56092O3307r2738k67091l50315l22510k72304
13693A421283j77288o0846j02141r4924o0475j0886j8308p2871o0576M3070K414
13682H08452l0884n8378n4825k6468K3137M3994m3019q0562m336R099j8085m0775
13670E27350m4364m4973l8128J0080o478k0530J501p947j0200j9445j614l185
13658C42067o8990l259l3911L1015L1729M0696N3625M8993o7412K1629M2984J2312
13646D51478K1769O0060P5930J1603m3708j12022q8028p2162J0225j1531n9455
$$ y = [3107587, 2953494, 2812404, 2681827, 2607570, 2558334, 2505083, 2388720, 2264895, 2125171, 2017882, 1928287, 1876498, 1852946, 1757887, 1750262, 1686584, 1597130, 1538536, 1540173, 1517474, 1540695, 1645128, 1871090, 2190740, 2506842, 2662934, 2726241, 2633503, 2366412, 2016097, 1693587, 1421283, 1243995, 1183149, 1081008, 986084, 925609, 914723, 896415, 823544, 762968, 806038, 808452, 777568, 719190, 664365, 637897, 661034, 705028, 662009, 581447, 577111, 586210, 568125, 527350, 482986, 438013, 399885, 409965, 403487, 382957, 384458, 376511, 366311, 346866, 345252, 342067, 273077, 269818, 235907, 266922, 298651, 339347, 392972, 441965, 374553, 396182, 439166, 451478, 473247, 533307, 609237, 620840, 577132, 465110, 377082, 304920, 315145, 303614, 244159]
13635B44159q301q6076q0392q640J7515Q179l0015L3766m628k0004J8771M3101
13623A27435N0392p9266k0526R4009K41l7241l4083l4023o151N71k8157l623m0513
13610a0935j6381j8565N2767J7642L0635k4711P66M9705P9088N5605j3555n8500
13598A43561o5585K3033K5006L9350n793n8976L096K841P764j4492l3892m1780
13586B4133k1624m9935K0603J4553j6927J7555N4213M235j407j9452K0599L6234
13574H2780J3946K6927j8986m2404k2278n700o924j3954M5449k698L192n2313
13562G037p2955L9476k066l8702o050L0292J0733M9338M4050k3839j6714O5109
13550H5709p804o3975m6561J6203K6689K9974m3245K9107k2806J4564l3021k1235
$$ y = [244159, 235858, 149782, 69390, 60750, 78265, 86444, 56429, 90195, 85567, 65563, 84334, 127435, 177827, 98561, 78035, 172044, 172285, 135044, 100961, 66938, 60787, 61358, 33201, 29578, -10935, -27316, -45881, 6886, 24528, 55163, 30452, 31218, 80923, 160011, 215616, 202061, 143561, 77976, 101009, 126015, 165365, 159572, 100596, 103692, 106533, 114297, 99805, 65913, 24133, 2509, -47426, -26823, -12270, -29197, -11642, 42571, 46806, 45399, 25947, 46546, 82780, 96726, 123653, 104667, 62263, 39985, 34285, 27361, 13407, 58856, 56158, 59350, 7037, -65918, -26442, -28508, -67210, -73260, -42968, -32235, 17103, 61153, 37314, 20600, 85709, 77905, 13930, -32631, -16428, 10261, 40235, -3010, 26097, 3291, 17855, -15166, -36401]
13538c6401N2894Q4359J043j1402j0453j5299m1555j0647l1925n494m13k9710
13526e5003K0599p949o039O9328M1872o178P196l601k1615o4959L9020j0458l2796
13513c0583j1781J1886J761N46K6497L5096p700j4714O1563J4272K3920l1474
13501G9289p8780K5081O6263l3715l9243L41j5216k0861K7715K1700k4457m1338
13489c3221K1821l1877K1716j663l0243L3368K7294P84l0082l5453k1563O380
13477g2739j9025K0691N1493k1907j8123K9475p264m2087l1476K9290N2495j0477
13465c9654m0144L4244k5955K6840J4051P483Q5369q818q9013J5072K8695J7544
13453B5714L382m5167m7992M7083M4811k4054j9178K983M3641K5040l2317j6224
$$ y = [-36401, 16493, 100852, 101895, 90493, 80040, 64741, 23186, 12539, -19386, -24880, -25293, -55003, -34404, -42353, -48392, 20936, 62808, 56630, 63826, 60225, 38610, -26349, 12671, 2213, -30583, -42364, -30478, -28717, -28171, -1674, 33422, 25722, 11008, 72571, 86843, 110763, 79289, 509, 25590, 91853, 58138, 18895, 19236, 4020, -16841, 10874, 32574, 8117, -33221, -11400, -43277, -21561, -23224, -53467, -20099, 7195, 7979, -22103, -57556, -79119, -72739, -91764, -71073, -19580, -41487, -59610, -30135, -37399, -79486, -110962, -81672, -29177, -39654, -79798, -45554, -71509, -44669, -30618, -23135, 62234, 53416, -35597, -20525, 8170, 25714, 29096, -16071, -64063, -16980, 27831, 3777, -15401, -12418, 31223, 56263, 23946, 7722]
13441G722K2269P0527L9252k5841q9399L987M4653m0824m8093q027M2901Q5859
13429A04986L9026n0700j32785n7003N5283m0470k7651L9176M7318J7058L2746
13418B6984j8249p8756L0783Q0623K7248n061M7767r779n6026m2518l7676k5555
13406f0215R001k009K4639k4930j190K3001J4254K4312P804M713j2964l8152j0414
13393d2150p4915k6465L585O281l6291k1106P0822M3502M2951k2503M910M5257
13381f122K4321P505J2848q726m0810l3658N4843O7833j9537r883K3007K5745
13369I7366K1402l4026l9611m9650l0946j3030J7099K4897l3345j1916M7570L1758
13357B7568m5459J1399M7286k9640m0549j7546M5958J5585L4542m422N2358K3899
$$ y = [7722, 29991, 100518, 139770, 113929, 24530, 28517, 73170, 32346, -15747, -23774, 19127, 104986, 144012, 93312, -39473, -96476, -41193, -81663, -109314, -70138, -22820, -5762, 26984, 8735, -70021, -39238, 41385, 68633, 63572, 111339, 101560, 45534, 3016, -34660, -60215, -51214, -53223, -28584, -53514, -54704, -31703, -17449, 6863, 14667, 19380, 6416, -31736, -42150, -117065, -143530, -139945, -133664, -169955, -191061, -120239, -76737, -33786, -56289, -51379, -6122, 18199, 25704, 38552, 29826, -10984, -44642, 10201, 78034, 58497, 48614, 71621, 97366, 118768, 84742, 45131, -4519, -35465, -48495, -31396, -6499, -39844, -51760, -4190, 27568, -17891, -6492, 40794, 11154, -29395, -46941, -983, 14602, 49144, 44722, 97080, 120979]
13345A20979k0389l0690j3947L5340K5167m7615m9967p606J1977l7180R014J0134
13333E217n8988J5906K8450M511K6126k8671l8695O8978N9926j9476p2424m4536
13321e3676J7111O1001o278m2120J5198L8134J9799L0720k6668n9556m0149Q8086
13309D1602N8845j3917j7395J9807j2587M3514O3389m1778j9783n769r908k654
13297A03366O2517L1463j7792J752K6466J061l3597N2388J13142R9955J39167
13286E79888K06026K38513K04600K39505K01785Q0257l0938j26325k18278k52394
13276A122639k99473k54207j35284m5091p8881m8001r4769N955N0703l6370k691
13265A84530M4871j8778p084L9558N7083l7199n2578l7370l4425K3087k4838L2539
$$ y = [120979, 100590, 69900, 55953, 91293, 116460, 68845, 18878, 11272, 23249, -13931, -4917, 5217, -53771, -37865, -9415, -4904, 21222, -7449, -46144, 22834, 82760, 63284, -9140, -53676, -36565, 24436, 18158, -23962, -8764, 29370, 49169, 79889, 53221, -6335, -46484, 41602, 100447, 86530, 69135, 88942, 76355, 119869, 183258, 141480, 121697, 115928, 106020, 103366, 165883, 197346, 179554, 181306, 207772, 208833, 175236, 227624, 340766, 440721, 579888, 785914, 1024427, 1229027, 1468532, 1670317, 1750574, 1719636, 1593311, 1375033, 1122639, 823166, 568959, 433675, 388584, 309703, 261702, 166933, 172888, 223591, 187221, 184530, 229401, 210623, 203539, 243097, 300180, 262981, 210403, 173033, 138608, 161695, 136857, 169396]
13253A69396L2827J9794K3914O237o806j8373m934N2666K3723J0891k3409J02836
13241C88762J45032J95013K45645K25175J04133P0590m9042j82373j27252j45970
13231H69713j63974j25198q6061K1837P0894O9256J11673l9407k0126M5056O9039
13220H22702O0884R6599J48520N5093n330m9412r1920j53249j17948j11665p6573
13209E77701j04641r4251n7852K320r408n6237k9838R414K4899n621K4055N8679
13197C39220R2875K22627K27528K20134K28587J39442L3869m9967j39253j99694
13187A115368j81853j37815k0843R3441K08205K19220K27624J63331J20577J7818
13177A825073L5616N6737K84550M69954M90399L04948J29387r714j61050l59442
$$ y = [169396, 202223, 222017, 245931, 252168, 245362, 226989, 222055, 274721, 298444, 309335, 285926, 388762, 533794, 728807, 974452, 1199627, 1303760, 1374350, 1325308, 1142935, 1015683, 869713, 705739, 580541, 494480, 516317, 587211, 656467, 768140, 728733, 708607, 753663, 822702, 883586, 980185, 1128705, 1183798, 1178468, 1129056, 1037136, 883887, 765939, 654274, 577701, 473060, 378809, 320957, 323277, 313869, 257632, 227794, 237208, 262107, 256486, 280541, 339220, 432095, 654722, 882250, 1102384, 1330971, 1470413, 1504282, 1454315, 1315062, 1115368, 933515, 795700, 774857, 868298, 1076503, 1295723, 1523347, 1686678, 1807255, 1825073, 1860689, 1917426, 2201976, 2671930, 3162329, 3467277, 3596664, 3586950, 3425900, 3066458]
13167C066458m64347m03736k93666l02262k65697k33854k16832j44619o2061r4357
13157E85027n3922m1433j9734J3185n8489l2877M4204O7588P4690O705M4496J5849
13145F45289j1454j6332j1898J3832M7599M2916J46677J65186K14662K59566K52928
13134A748971J82720Q8984R4397J11826K57163M44199N00194L71453K89703L13108
13124D402718K53892Q179k13812l04335l53818m64831n59627p07618o13744m23075
13114A023929j76278j04390j06180k9931L6824p7095m0546q5901p5196l7934M7088
13103C74390L0975j6005j7722J5521Q283l1175l9859l6021L7161P7607Q1739J12379
13091E97273J24568N1357L2142M8636N6029N3158J16903K44188J84571K64913
$$ y = [3066458, 2602111, 2198375, 1904709, 1602447, 1336750, 1102896, 886064, 741445, 679384, 585027, 531105, 489672, 469938, 483123, 424634, 391757, 435961, 503549, 578239, 584944, 629440, 645289, 633835, 617503, 605605, 619437, 667036, 709952, 856629, 1021815, 1236477, 1496043, 1748971, 1931691, 2020675, 2115072, 2226898, 2484061, 2928260, 3428454, 3799907, 4089610, 4402718, 4656610, 4664789, 4450977, 4146642, 3792824, 3327993, 2768366, 2060748, 1447004, 1023929, 847651, 743261, 637081, 607150, 643974, 566879, 526333, 440432, 365236, 327302, 374390, 405365, 389360, 371638, 387159, 395442, 364267, 324408, 288387, 325548, 403155, 484894, 597273, 721841, 773198, 805340, 853976, 910005, 963163, 1080066, 1324254, 1508825, 1773738]
13081A773738L67377L44326M87458L81810J57454r2420j82626l53685n24612n62918
13071A795902m98109l98569k29332q4295j11279q2656l6410q049o1194O776N4192
13060C46977k4308n9438R527J9857k1206n3766o093l5598j2885m104r0940J5829
13048H3852N6045K4665K4331J6551k4574l8184m6638L1207O8218L5502L4093J1473
13036B76541O3920J54537K25301J76553J10435L6089q6809j09541j50013k39814
13026D57199j44135j15720m3458m6894m2477L7750M3467k5454o0444k7454N106
13015C7486j2658N4224M8300m0323m8330p782N912N7839L6409j1948Q743m2570
13003H5302m2648m2958m0569J4283M1278N7698R1398R236l1115p0040l8742n4380
$$ y = [1773738, 2141115, 2485441, 2972899, 3354709, 3512163, 3419743, 3237117, 2883432, 2358820, 1795902, 1297793, 899224, 669892, 585597, 474318, 391662, 355252, 347203, 286009, 292785, 346977, 322669, 263231, 272758, 292615, 271409, 217643, 211550, 175952, 163067, 158963, 68023, 83852, 139897, 164562, 188893, 205444, 180870, 142686, 96048, 127255, 195473, 230975, 265068, 276541, 340461, 494998, 720299, 896852, 1007287, 1043376, 956567, 847026, 697013, 457199, 313064, 197344, 153886, 106992, 64515, 102265, 145732, 120278, 59834, 32380, 37486, 24828, 79052, 127352, 87029, 38699, 30917, 36829, 94668, 131077, 119129, 127872, 85302, 42654, -304, -40873, -26590, 14688, 72386, 163784, 173020, 141905, 71865, 33123, -21257]
12991b1257j5434M0380k9842J539M0128j928L7883o03j7107q1687j5364P8633
12979A5341L1508M708o0536r7995J4417K2786j3341M4262J5982M1243q313K2163
12967C2225M2688K0126j2292m4792J2881k0637J3808j4375k6504K8242O514l4880
12955C004p4473R54j5626M2535J8370j3177n622M0188L5696J1432n9601J4997
12943a323m5710R554j2158j9981L3806J0738O890K7519o0903m1440O4920k9912
12931e8000M698K2379j4047J2515L8370N000k6045k9806J9894K6805K1572O2005
12919H5340n1453J917K1443k9188p1455k5242k7021K3700q828L786L0147k1521
12907f8375Q760O1251L5719K4281m0303J0207Q032j6383l2980J9920M3879p7080
$$ y = [-21257, -36691, 3689, -26153, -24614, 15514, 13586, 51469, 50866, 33759, -47928, -63292, 15341, 46849, 51557, -8979, -106974, -92557, -69771, -83112, -38850, -22868, 18375, 10062, 32225, 74913, 95039, 82747, 37955, 50836, 30199, 44007, 29632, 3128, 31370, 37884, 3004, -71469, -70515, -86141, -43606, -25236, -38413, -44035, -3847, 31849, 43281, -16320, -1323, -47033, -37479, -49637, -69618, -35812, -25074, -18184, 9335, -51568, -93008, -28088, -58000, -53302, -30923, -44970, -32455, 5915, 10915, -15130, -44936, -25042, 1763, 23335, 85340, 33887, 35804, 57247, 28059, -43396, -68638, -95659, -71959, -80787, -77001, -46854, -68375, -59615, 1636, 37355, 61636, 21333, 31540, 39572, 23189, -9791, 10129, 54008, -23072]
12895b3072j4434P3159M5130Q143j4517L190N2944k4391l2986m4851n5964l7813
12883f5462m8013O7922O4072k2173j9794K3204L647J7402K756n1963j303j511
12871c1216j4212n150l0624K8395L6651K2108K318Q744j1386L404p778p9063l9937
12858a17746J2249Q140r746M9428M1724k6994L8329J9539K830J5351l1103o885
12846d884L4050N9546M2595m2328l2335J4300M0236J2047j7064p0187k5175K412
12834A3213K0108k7317k7026l0644k757J6059l1625J3899j8085m7924K10N1819
12822g0070J0440j5882R174O2459K6382J1624m064Q545L7914M7496j9628j2511
12810I1879K1063l7665m0388m097R166j9554q5997q8871N127L1366J7908L5728
$$ y = [-23072, -37506, 35653, 80783, 88926, 74409, 77599, 130543, 106152, 73166, 28315, -27649, -65462, -113475, -45553, 18519, -3654, -23448, -244, 3403, 20805, 23561, -28402, -29705, -31216, -45428, -50578, -81202, -52807, -16156, 5952, 8270, 17014, 5628, 9032, 1254, -77809, -117746, -105497, -97357, -107103, -57675, -15951, -42945, -4616, 14923, 17753, 33104, 2001, -4884, 29166, 88712, 131307, 88979, 56644, 70944, 111180, 123227, 106163, 35976, 10801, 13213, 33321, 6004, -21022, -51666, -54423, -38364, -69989, -56090, -74175, -122099, -121889, -70070, -59630, -75512, -66338, -3879, 22503, 34127, 30063, 38608, 76522, 124018, 104390, 91879, 112942, 75277, 34889, 30792, 39958, 20404, -65593, -154464, -149337, -117971, -100063, -64335]
12798f4335L7640Q1585k9535m4855j764J110k9405m7060L504k3931l5361J8615
12786a33792K7585L2208l0217k1222K2756k7960M4844O8354j2097R892P814j4324
12774b6159j7674M444P4475N2986p742k1016k8899m9438m7608K886M6021J58802
12762A41078J0035o8083n3986L3991p5827j00668L0069K6330L2858j0191K9827
12751d567J2678Q401k1841J4033J485j8813l7881k8982L7890O96m1309R013m659
12738g3856P170K1348R027n8044j2844K5971p507k5714P653K0843j2719J06278
12726G606L6781m8878n5467P796L2667n1895j4374K2679J1532L308J6450l6573
12714f8368J2608L4132J313L1265M2446m6619n1150o6822J4294J03009M6324n6446
$$ y = [-64335, -26695, 54890, 25355, -19500, -21264, -20154, -49559, -96619, -93115, -117046, -152407, -133792, -106207, -73999, -104216, -125438, -102682, -130642, -85798, -17444, -29541, -19649, -11835, -26159, -43833, -39389, 35086, 88072, 80330, 59314, 30415, -19023, -66631, -63745, -17724, 141078, 151113, 83030, 29044, 63035, -12792, -113460, -83391, -57061, -24203, -34394, -4567, 8111, 16512, -5329, 8704, 10189, -8624, -46505, -75487, -37597, -36901, -78210, -69197, -73856, -66686, -45338, -36311, -94355, -107199, -81228, -88735, -114449, -106796, -85953, -98672, 7606, 44387, -4491, -59958, -52162, -19495, -71390, -85764, -63085, -51553, -48245, -31795, -68368, -55760, -21628, -20315, 10950, 53396, 6777, -44373, -111195, -96901, 6108, 52432, -4014]
12702d014K891j2055J4611J9781M0584L1161n9651m856L6508L1418J0960J6805
12690A24143R102o1186m6925l4379j4040M1545J4279L8253n2637n6135m5593M027
12678g9546J4293R344P6656l6913k3435p992M0145k0623m2230n2425q23M6924
12666g6625L3536l3958M2717P671K4590N4017k669j1059r306n0222L9341N6072
12654G4105j683j9024J0700P440n2942k0188L9268K2511o3038m237P6884J9841
12642H9637k8045k2817J3373k12m7335j8545M1955K3126m3526r561L3986m3589
12630a1553l5114J4116Q3124J6486k5358q0532l1594k7312m5696q263N3275N9465
12618c8956k4047k8523K0355K2650j0367J7292O2196N0478j2597L2317k2131k6896
$$ y = [-4014, -1123, -13178, 1433, 21214, 61798, 92959, 33308, 28452, 64960, 96378, 107338, 124143, 133245, 72059, 25134, -9245, -23285, 18260, 32539, 70792, 18155, -37980, -83573, -79546, -65253, -55909, 20747, -16166, -39601, -47593, -7448, -28071, -70301, -122726, -123549, -76625, -43089, -77047, -34330, -26659, -2069, 51948, 49279, 38220, 28914, -21308, 18033, 74105, 72422, 53398, 64098, 71538, 18596, -1592, 37676, 60187, -2851, -7088, 69796, 89637, 61592, 38775, 52148, 51936, 4601, -13944, 28011, 51137, 7611, -1950, 32036, -11553, -46667, -32551, 50573, 67059, 41701, -38831, -70425, -97737, -143433, -151696, -98421, -38956, -63003, -91526, -71171, -48521, -58888, -41596, 20600, 71078, 58481, 90798, 68667, 41771]
12606D1771k2494n914L9579L7603r068j0516m0183k4625r085R213L0752J9491
12594E6524L1807K3332m7448j13466P718j5147N3318J3859O909r286l1306m6903
12582g0089o8713k2209K6493Q5426O3265K3012K8509k1731l5104j9727j31546
12571a42414o061N7717K9210K1322j1848l1997m1596N0692N2397j2299j7308L49
12559e1836K6235J3260M8395L132O613L5649n790m3343J5943J8084l8254j0987
12547A7101m230J7618m9700n0867J7197L7387K768J6962K2053J1517L24n0853
12535a2723J6680J5771K681M2262l1159l87j1292j7392k6907N1441K4046p1149
12523a8128K8247M3550l6529l2346k0176L1666L9582J2467l5237l6155k4483K5380
$$ y = [41771, 19277, 13363, 52942, 90545, 81477, 70961, 30778, 6153, -2932, 6281, 37033, 56524, 88331, 111663, 64215, -49251, -41533, -56680, -3362, 10497, 17406, 8120, -23186, -70089, -138802, -161011, -134518, -49092, 14173, 37185, 65694, 43963, 8859, -10868, -142414, -148475, -90758, -61548, -40226, -52074, -84071, -125667, -74975, -22578, -34877, -52185, -51836, -25601, -12341, 36054, 39186, 45799, 81448, 75658, 32315, 48258, 66342, 28088, 17101, 12871, 30489, -19211, -70078, -52881, -15494, -12726, 4236, 26289, 37806, 38130, -12723, 3957, 19728, 22409, 64671, 33512, 33125, 21833, 4441, -22466, 28975, 53021, -18128, 10119, 53669, 17140, -15206, -35382, -3716, 35866, 48333, 13096, -23059, -47542, -22162]
12511b2162J3284N236Q40J5951J0855l991n2228k2161J7119M6255K0617k5740
12499C875O397L1910n1988l8189j3645M8090n3867K2991O2390j3108j07152j4100
12487a16396Q5677K1129K0063J0494n5951j0799j6318M78j6274N5090N7427K2810
12475E7430j9145K862j0132J1010K0550k6403k6305L6981j1879J0455K0423j3680
12463E2167k1972k1112m1388k5087p519M50p384L100L5934K6417n4740J1866K0540
12450b8728J821R094O6183K2061J1887K6631l6217n4159o496P216J0637n286N569
12437C0213m8038p687m3070L0282J3098K6517J2056J2579K7254l4371P957j5093
12425A1697L4247m7104n478n598k8849O3653P7103L3679j7746j2393o6369m4856
$$ y = [-22162, -8878, -3642, -2802, 13149, 24004, 20013, -32215, -54376, -37257, 8998, 29615, 3875, 10272, 42182, -9806, -47995, -61640, -13550, -67417, -44426, 17964, 4856, -102296, -116396, -30719, -9590, 10473, 20967, -34984, -45783, -62101, -61623, -77897, -22807, 34620, 57430, 38285, 41147, 31015, 42025, 62575, 36172, 9867, 46848, 34969, 45424, 65847, 52167, 30195, 9083, -32305, -57392, -64911, -64461, -71845, -68745, -32811, -6394, -61134, -49268, -28728, -26907, -17813, 48370, 70431, 82318, 108949, 72732, 18573, 12077, 19293, 29930, 24644, 30213, -17825, -25512, -68582, -38300, -25202, 1315, 13371, 25950, 53204, 18833, 26790, 11697, 45944, -1160, -6638, -12236, -41085, 22568, 99671, 133350, 115604, 103211, 36842, -8014]
12413h014J3962J2005K7213j008l9158l2561N1520J362n890q868P013j0395k9825
12400b2644j4337K9632M4655j2775j3910M9102J9682K1728M844j5495n9904n5615
12388b5037k0479o471N1502o175m654R348r0100J1215n382q469M589k9122k5842
12375a45077M0874J9127q209J1587N5306K8254k0028M9728M5589J7125p2427n3540
12363c1691l5068Q6149N1540q3248L9498M4979N479j3446J5234k147K2059m512
12351I4826l5887Q476M1808n2370q5780m985J9466j6406M0508L7968m0542j8454
12339a1372Q6736J5874k8664r409L8848M014j3423m8973J6712K5744J0687j9889
12327F6885J2961K1325o2620k0854k1985o0627n753M0521P934K7759o0253m5151
$$ y = [-8014, 5948, 17953, 45166, 44158, 5000, -27561, 23959, 25321, 19431, 10563, 17576, 7181, -22644, -36981, -7349, 37306, 24531, 10621, 59723, 79405, 101133, 105977, 90482, 30578, -25037, -45516, -51987, -485, -6660, -11314, -1966, -92066, -80851, -86233, -94702, -90113, -119235, -145077, -104203, -85076, -93285, -81698, -26392, 1862, -18166, 31562, 77151, 94276, 21849, -31691, -66759, 19390, 70930, -12318, 27180, 72159, 77638, 64192, 79426, 77279, 99338, 94826, 58939, 67415, 109223, 56853, -28927, -33912, -14446, -30852, 9656, 47624, 7082, -11372, 75364, 91238, 62574, 53165, 92013, 96027, 82604, 33631, 50343, 76087, 86774, 66885, 79846, 101171, 38551, 17697, -4288, -64915, -70668, -30147, -22213, 5546, -54707, -99858]
12315i9858L9533o8087k9154Q5863J03766K0868R111L2499M0895k371k4759J2791
12303A21097m964P0868K7717J10741J79343J50015N2969k0096Q589m6077p0280
12292E79922r6417j10690j37564k8899J7255n2642K4814o8022n2907l6357J8889
12281E7382Q95M0623l66k8743k9383L2965O4618J4992o0384J1510J9408o4075
12269E9442n7574J1396l413L4241L8829j3396k9301M717p006K2127J0249K7266
12257I7577J9034Q3176Q0497l3064l6663j3146k602J5997L5495m6463j00180l2585
12245F7073m7837o490L3063J8197n1371o681j0209J821M5006N8119L2359J1097
12233A44147r079l4614n9780r406k9234K9263l6335m0193J2880M1144m3999j9958
$$ y = [-99858, -60325, -128412, -157566, -71703, 32063, 52931, 62042, 94541, 135436, 133065, 108306, 121097, 116133, 187001, 214718, 325459, 504802, 654817, 707786, 687690, 696279, 650202, 579922, 483505, 372815, 235251, 206352, 223607, 170965, 195779, 127757, 74850, 38493, 57382, 58277, 98900, 98534, 69791, 40408, 73373, 137991, 152983, 92599, 104109, 123517, 59442, 1868, 13264, 9851, 44092, 82921, 69525, 40224, 44941, 37935, 60062, 70311, 97577, 116611, 199787, 280284, 247220, 210557, 197411, 194809, 210806, 246301, 199838, 99658, 67073, 19236, 12746, 45809, 64006, 12635, 5954, -4255, -2434, 42572, 100691, 133050, 144147, 135068, 100454, 40674, 31268, 2034, 31297, -5038, -45231, -32351, 8793, -35206, -55164]
12221e5164K7780K6986M3481R935K0737K3020l9174j6282l0721l1929J4181P4426
12209F7276O6400J13959O4618K0184l8708m3373m3440j09825j42099P564O8958
12198C1514K8678J0371M2271l9231j2704J8692N2441J42M791J2180J0947K3460
12186A83552J246o75j3326N495n9344n4878o9877J5982M1021j5225j4203L4881
12174E4649l8360m0772o0958l482K8843L7087K2001P5918M4456m4827p0288n784
12162a517N4803J14798J5246p9869m0542L628Q504L9126K191K3054o261M3453
12150A76614n3532p0147M2586Q1182L2894J7747K3478q4093l8274K127Q963O378
12138A45923M921N5521J02558j5180j7884J1257o2403k5118o4166k4071j260l0039
$$ y = [-55164, -27384, -398, 43083, 53018, 73755, 96775, 57601, 41319, 10598, -21331, -7150, 67276, 133676, 247635, 312253, 332437, 293729, 250356, 206916, 97091, -45008, -37444, 31514, 60192, 70563, 112834, 73603, 60899, 79591, 132032, 132174, 136965, 149145, 160092, 183552, 184798, 184123, 170797, 176292, 116948, 62070, -7807, 8175, 49196, 33971, 19768, 54649, 16289, -24483, -85441, -88923, -60080, -22993, -992, 74926, 119382, 74555, 4267, -1517, 53286, 168084, 183330, 103461, 62919, 66547, 75051, 114177, 116368, 139422, 133161, 176614, 123082, 52935, 95521, 176703, 209597, 227344, 250822, 166729, 128455, 130582, 139545, 145923, 150844, 206365, 308923, 293743, 275859, 287116, 224713, 199595, 135429, 111358, 110098, 80059]
12126H0059J7497j3620k1335l9590n193L0806L8860k0458J2128K6458n6818Q405
12114E7199L4928N5111l1221q0953o7512K9624k8699O12N5074j3610m4164n595
12102c9206l5092L5119P3921K4388R0835O2177L3910q0099m392k7061k9655j9394
12090H5451L627K3621k1024R884J5720k8060R320Q058p1542j3538j732O08J6562
12077C6955J8841n0866m4371l1769K9017J7440K4651K1119J1509r087j8618N5601
12065F0422o2003q103J9078k3527l1840K554l0058j5832j0195O7188L0196J3041
12053A0921N914J3173J2310L390K5130j01770m0320N2383L3976J8l1222k8152
12041d4249L0357r705m5556M762J3247L5920K6697r095J4685O071q8N7860m1556
$$ y = [80059, 97556, 83936, 62601, 23011, 17818, 48624, 87484, 67026, 79154, 105612, 48794, 57199, 92127, 147238, 116017, 35064, -32448, -2824, -31523, -30911, 24163, 10553, -33611, -39206, -74298, -39179, 34742, 59130, 149965, 212142, 246052, 165953, 161561, 134500, 104845, 85451, 89078, 112699, 91675, 101559, 117279, 89219, 98539, 106597, 35055, 21517, 19785, 20393, 36955, 55796, 4930, -39441, -71210, -42193, -24753, -102, 21017, 32526, 23439, 4821, 60422, -1581, -9684, 9394, -14133, -45973, -43419, -73477, -89309, -99504, -32316, -2120, 10921, 16835, 30008, 42318, 45708, 70838, -30932, -71252, -18869, 15107, 15125, -16097, -44249, -13892, -23597, -69153, -64391, -51144, -15224, 11473, 2378, 17063, 23134, 23046, 80906, 39350]
12028C9350l5020m8338J7996K0657j6130K0224O0745k00j13465l4337J3013Q709
12016f6796P6507J08288M5988J2849o4452r0661o7024P7O2326J8139K3193j5065
12004D3369j6518K3029K6054L9929k2018K682L0445L1929R8080K4143p9673N3897
11992B55348Q7731m6926m3553q4257l0200n1861l2554K4218O503n0784m2066K025
11980f376Q789j9917L9048K9546O635o2462k3948P5355j9416N873L4037m4874
11968B2290k4919j3295O038L6693j2881l0958k5622M3780l4392k6958j2620P359
11956f5485j2494M2326j4723j2743k0803N442j4422K5982J6953K5131k8481o158
11944e9475p2537l0897N1312m711N3171P8929L1240k7328k959m8501n1213O1925
$$ y = [39350, 4330, -44008, -26012, -5355, -21485, -1261, 59484, 59284, -54181, -88518, -75505, -66796, 9711, 117999, 163987, 176836, 112384, 21723, -45301, -45224, 17102, 35241, 58434, 43369, 26851, 49880, 75934, 115863, 93845, 96527, 126972, 158901, 256981, 281124, 201451, 255348, 343079, 296153, 252600, 168343, 138143, 86282, 53728, 77946, 84449, 33665, -8401, -6376, 2413, -17504, 21544, 51090, 57725, -4737, -28685, 46670, 27254, 33127, 67164, 22290, -2629, -15924, -9886, 26807, 13926, -17032, -42654, 1126, -33266, -60224, -72844, -65485, -77979, -35653, -50376, -63119, -83922, -78480, -92902, -66920, -49967, -24836, -53317, -59475, -132012, -162909, -111597, -116308, -63137, 15792, 47032, 19704, 16745, -31756, -82969, -21044]
11932b1044R373r709p557M3197M2708n7914k653j7797l5142k1802k7854P8345
11920b7849N3490J4991K148j8021m9340j2272L0611j65l043J1010m8586j0842
11908e7868n106P72l8176M6K9523l9868L607Q2607M8236L8365k3967p4541Q933
11895b7437J6536l3942l4084j8417o05J7760L1310M9512r641l1435K7168J045
11883a2230m921K5625M7024L115M7587L816l7451p1604m2575m6224k6051J7088
11871i6801L3477R629K0354k0933o4939K226k0881J1782P8545m322k433L0806
11859b3490l9649k3894J6443R747J2687j5164Q729K0888q0Q134k9680L9196N5783
11846C9650K4749Q199k2446o5836m8479Q3692P2656k0549M83L7742j4395Q805
$$ y = [-21044, -11671, -21380, -28937, 14260, 56968, -946, -3599, -21396, -56538, -78340, -106194, -27849, 25641, 40632, 42780, 24759, -24581, -36853, -6242, -6407, -9450, 1560, -47026, -57868, -62974, -62202, -100378, -100332, -70809, -110677, -107070, -24463, 23773, 62138, 38171, -36370, -27437, -10901, -44843, -78927, -97344, -97949, -80189, -48879, 633, -9008, -40443, -13275, -12230, -17151, 8474, 55498, 58613, 106200, 110016, 72565, 961, -41614, -87838, -113889, -96801, -63324, -53695, -33341, -54274, -119213, -116987, -137868, -126086, -47541, -51863, -54296, -23490, -63139, -87033, -70590, -60843, -48156, -63320, -54591, -33703, -33783, -25649, -55329, -16133, 39650, 64399, 72598, 50152, -15684, -64163, 19529, 92185, 71636, 72119, 109861, 95466, 104271]
11834A04271J8484l2424M8126L130N003K4392m8881l189q18n0985m6909L4413
11822E4613j2908q457M2884r85J8663j1094o3428l1372K7588N0625q893q5852
11810b8616j0973L8292l5603l9318L0465J5636j3223K2479k4708M8279N6747L6158
11798I5615n0161m4019N614k2254K8955M109j4685J3235m2269J9095q140j2205
11786b7110K7530J9798j1467n1790m1277J484J4312Q9119o4675q5159j9686L1871
11774a17050J0423M9945L323k3545J0585L5011m997J9750l2979L8060K2629j6114
11762d959m9328m7711M9206M6707J0584j9702N254J4595Q630J0746J7544Q1k7560
11749A4087m7967J094O8335l3420m7776P5406J11054N6257p4091j1937k8512p484
$$ y = [104271, 122755, 90331, 138457, 141587, 146590, 170982, 122101, 118912, 118094, 67109, 20200, 54613, 41705, 33248, 76132, 75147, 93810, 82716, 19288, -12084, 15504, 66129, 57236, -28616, -39589, -1297, -36900, -76218, -45753, -30117, -43340, -20861, -45569, 2710, 59457, 95615, 45454, 1435, 7049, -15205, 13750, 17859, 3174, 16409, -25860, -6765, -14905, -27110, 420, 20218, 8751, -43039, -84316, -82832, -68520, 20599, -44076, -129235, -148921, -117050, -106627, -56682, -53359, -76904, -66319, -31308, -36305, -16555, -49534, -11474, 11155, -4959, -54287, -101998, -52792, -6085, 4499, -15203, -9949, 4646, 13276, 24022, 41566, 41647, 14087, -33880, -32786, 35549, 2129, -45647, 29759, 140813, 197070, 122979, 111042, 82530, 75046]
11737G5046q2891j635l3814j9663O827q240J440m329N908P367P5400N9422k1981
11724E8857p8833j9770K5363R046L724O8242o156K0858m8161J62r647P606j5663
11711A5628m0837o4080l5039P989M2804J049K3551L3026O5606k2898m0205j5505
11699b8911Q3124M5782k6795n902m618M7161j1158l4794n3909o9218m536K3676
11687d0098N220M5227J7733j3439K8520N8239R388p302j9522K2925J4753m6083
11675G5561r6041j5794M0965K6721l4195J6813M1492P513m8475K9738J301j2583
11663C3016J883k1439Q4815j768l3107k5268p2205n136M4130M7290K5675m9810
11651B8076o4473M6738L7747l9449l8792K0655o259p7344J9260P561m3191M1394
$$ y = [75046, -7845, -9480, -43294, -62957, -56130, -64370, -62930, -67259, -61351, -53984, 21416, 80838, 58857, -19976, -39746, -14383, -5337, -1613, 66629, 60473, 81331, 33170, 33332, 23685, 31291, 15628, -25209, -89289, -124328, -116339, -73535, -72486, -48935, -15909, 49697, 26799, -13406, -28911, 54213, 99995, 73200, 67298, 62680, 109841, 98683, 63889, 9980, -59238, -63774, -40098, -34878, 10349, 28082, 14643, 43163, 101402, 110790, 103488, 83966, 106891, 121644, 75561, -20480, -36274, 4691, 31412, -2783, 14030, 55522, 63035, 14560, 44298, 45599, 33016, 34899, 13460, 98275, 96507, 63400, 38132, -34073, -39209, 4921, 52211, 77886, 28076, -36397, 10341, 48088, 8639, -30153, -9498, -15757, -93101, -73841, -66280, -109471, -68077]
11639f8077Q5247L6090l8553j2030n0434M01j6057o8819K5973J07635p512n4650
11627f0786K4352j1639m0673k3882J9743J5013j7358K0687N899r285L3761O3620
11615A9452k7361o8663Q3430M4878L5967O479m9652l7423n622K4318P883l3683
11603Cl4526L4773N176l9084o6198l268J6398O5565M0655k0315m7190l380N1182
11590b09J3940l1381m9350l6846r122j6323m56M5615P3741N3752l3304L68J9207
11577B9632p007O030N66K78O822J3116L3976j3611k6286M1830q816k7107n5181
11564e758n369R070M933m2702J0254n4623l0034k4897P8443J7902l8247M193O3339
11551a3496O898J7693k7132m6626j3343K2048P9625M2894k0759K1216l2517j6985
$$ y = [-68077, 17170, 53260, 14707, 2677, -47757, -47356, -63413, -132232, -106259, 1376, -6136, -60786, -36434, -48073, -88746, -112628, -92885, -77872, -95230, -74543, -68644, -77929, -44168, 19452, -7909, -76572, 6858, 51736, 87703, 94182, 44530, 7107, 1485, 25803, 33686, 3, -34523, 250, 5426, -33658, -99856, -103124, -86726, -21161, 19494, -821, -48011, -51391, -209, 13731, -17650, -67000, -103846, -112968, -129291, -129747, -84132, -10391, 43361, 10057, 10425, 29632, 22625, 28655, 29221, 29499, 36321, 49437, 83413, 69802, 43516, 85346, 76530, 49423, -5758, -11127, -2057, 2876, -39826, -29572, -84195, -114229, -139126, -60683, -42781, -81028, -76835, -13496, -6598, 11095, -16037, -62663, -76006, -53958, 25667, 68561, 47802, 69018, 36501, 19516]
11539A9516L0150k4685K678Q1274L8766M422l0773m7898m9286k5802j5394j6733
11527c3765k1885l1648J6706l5577N8744L4203N6649l3533k5777k1747J7297J0677
11515i656K97K8047k8690k1930M5791l4285l4928K4853k729K5053K2119o708r246
11502b012n4546L5461K0993p258N975L279l2660k781O2432P338k3562J0608J2819
11489C6086j8148K6796M4894l0297r115j3783j4691r441J9J3881N7776n6970j0999
11476A6008Q135M0432j7060M8084j758p7873r3171o5726J3955N2950O2531L3746
11464B0253J6720M2597o7190k7323O9270J4868r2525P558r008q8627K3660j6248
11452a05995K7398N5272J4825p266J3500n7782J0233l7028M4169N1639K0854l9483
$$ y = [19516, 49666, 24981, 27659, 108933, 147699, 152121, 121348, 73450, 24164, -1638, -17032, -33765, -55650, -87298, -70592, -106169, -47425, -13222, 43427, 9894, -15883, -37630, -20333, -9656, -9359, 18688, -10002, -31932, 13859, -20426, -55354, -30501, -33230, -8177, 13942, 7234, -2012, -56558, -21097, -104, -7362, -1387, 1892, -30768, -33549, 28883, 36221, 12659, 23267, 36086, 17938, 44734, 89628, 59331, 50216, 36433, 21742, 12301, 12320, 26201, 83977, 27007, 16008, 24143, 64575, 47515, 95599, 93841, 15968, -77203, -142929, -128974, -76024, -13493, 20253, 36973, 79570, 12380, -14943, 54327, 69195, -23330, -15772, -24780, -113407, -89747, -105995, -78597, -23325, -8500, -15766, -2266, -60048, -49815, -86843, -42674, 8965, 29819, -9664]
11440i664J141L24k8291m5460O5663M3719M798l2695k9190j6023l8601J9308L3705
11427c1266k0215k4305j7493J0808N4046M1511K7785K0892k3841j0824n3526k7537
11415e3965j4400k0307Q0082L3374K2879J43k1175K7148M6903M372l514q198Q5829
11402A79171L2858l9670q8260l0580M2253N694n82j4446O6576n281l2412J3227
11390A28548L3617l2750k0535l6794l1453l7266J2117j4614k9542j8904L0902
11379a6674p359J576Q2267p2979m1301k8970N2323Q0992N151p038o7514L304r228
11366b5450j9939J6284N480j0183L0012o099J9685M2065J5428L5622N7122j7960
11354A42067l7615J2626o913j0803p395k0160L1031M4802N1269p324n9736m4552
$$ y = [-9664, -8523, -8199, -36490, -81950, -16287, 27432, 32230, -465, -29655, -45678, -84279, -64971, -31266, -51481, -75786, -93279, -82471, -28425, 13086, 40871, 61763, 37922, 27098, -26428, -53965, -68365, -88672, -8590, 24784, 47663, 47806, 26631, 53779, 100682, 105054, 101540, 93342, 179171, 212029, 172359, 84099, 53519, 95772, 101466, 100884, 86438, 153014, 147733, 115321, 128548, 162165, 129415, 108880, 72086, 40633, 3367, 15484, 870, -28672, -47576, -16674, -24033, -22457, 59810, -13169, -54470, -83440, -31117, 49875, 55026, 47988, -19526, -16222, -25450, -45389, -29105, -23625, -33808, -3796, -9895, 9790, 51855, 67283, 102905, 160027, 142067, 104452, 117078, 110165, 99362, 91967, 71807, 102838, 147640, 198909, 191585, 131849, 87297]
11342H7297k2047N6165j293q7275j8490J7922J1906K318J3629l7348j5442J4833
11330B2175K9234j6299n921L104M7583J7474N498J6556m3859k6843l9228Q755
11318A8229J7597j2908o768K6735N9129J1776Q159k0064n7354L0546K5696m5117
11306E5656n349J0659K4886l3400j00904m5799R6055J18657J1860K8128J23156
11295B83605J26797R4376N6619j1487M3461P4786l4923r9663j26749l5848l1842
11284C39132q3204j13431o3127r75n597l5562j9223N2734K4570j0770q888J3k0868
11271E4804j9709J5068J1308J3472p5007O670M40l9841L8679r29m9886o4437p854
11258a17222n392J394K9274M4375K6945K776N1925J615J323K376l4518k0698j1316
$$ y = [87297, 65250, 121415, 120122, 32847, 14357, 32279, 44185, 46503, 60132, 22784, 7342, 22175, 51409, 35110, 29189, 32293, 79876, 97350, 102848, 119404, 75545, 48702, 9474, 18229, 35826, 22918, 16150, 42885, 102014, 113790, 121949, 101885, 44531, 75077, 100773, 55656, 50307, 60966, 85852, 52452, -48452, -94251, 1804, 120461, 132321, 160449, 283605, 410402, 504778, 561397, 549910, 593371, 668157, 633234, 533571, 406822, 370974, 339132, 255928, 142497, 79370, 78395, 72798, 37236, 18013, 70747, 95317, 84547, 75659, 75672, 54804, 35095, 50163, 61471, 74943, -64, 6606, 7046, -32795, 5884, 4955, -44931, -109368, -117222, -122614, -121220, -91946, -47571, -20626, -17850, 34075, 35690, 37013, 39389, 4871, -15827, -27143]
11245b7143k8839M2696N436j0109j7649J6305j2442l0193K8401J9532M5561R482
11233D1038l3480J6848L4726K6626j1197K426J4793M3421l2264o7051k274r546
11221B4066l551J289p3225j2546K0498L0926j6236K4346P3826L2846r717n5957
11209C6565J6331N0575J4644j9713m2345n5442j24972k4771Q5004p034M7821M7577
11197B4240j1154j1740J0387L4606L7973o1522n036j418N239K6262K9197l0581
11185D6453K5954P0970L9459Q4183J18635L9350K3279Q680N8195M728Q394L2525
11173E60805J5498l3825j11047j28705p4650n2105l7283r537o07m7431L1777N0
11161A12940k57m4846j2435k8543l0669l2275l2619j2492O672k4442R7162R7892
$$ y = [-27143, -55982, -13286, -7850, -17959, -35608, -19303, -31745, -61938, -33537, -14005, 31556, 41038, 7558, 24406, 59132, 85758, 74561, 76987, 91780, 135201, 102937, 35886, 33612, 24066, 20515, 21804, -51421, -63967, -43469, -12543, -28779, -4433, 69393, 102239, 92522, 36565, 52896, 103471, 118115, 98402, 56057, 615, -124357, -149128, -64124, -71158, -23337, 24240, 13086, 1346, 11733, 46339, 84312, 22790, 17754, 16336, 21575, 47837, 77034, 46453, 72407, 143377, 182836, 267019, 385654, 425004, 448283, 456963, 515158, 519886, 528280, 560805, 576303, 542478, 431431, 302726, 228076, 175971, 138688, 129151, 128544, 81113, 112890, 112940, 112683, 67837, 55402, 26859, -3810, -36085, -68704, -81196, -74524, -98966, -1804, 96088]
11149I6088Q4823k0119n0017N0364k1148l5149j3472N497N1325l6906m4645j4886
11137E1755o0921O187O7292k6146J408J4306M2999L218p0517K2235O7209n933
11125A13092k9709K2879k0630j4631j2585l9438R350p0975J1969P1117M4052J121
11113H5612k5167L0027N01p8246n6897P7075J4669j2231l871j971j6289L9225
11101E2437R8073K555p95Q567m225j9334l1732j2208j6926K1636k6990m4244j1898
11088A4916J8882n3743o2434K0550K8500K3189L1447j3978n9668n516q775K6353
11076d0277L5901K811J8760Q994l5586j1907R292L7702K1329N3130O6975l8025
11064A29099r9281o2645N2366J2791p3612J2333J2710l2246P3503K9844M8232
$$ y = [96088, 180911, 160792, 110775, 161139, 139991, 104842, 91370, 96867, 148192, 111286, 66641, 51755, -9166, -2979, 64313, 38167, 39575, 53881, 96880, 100098, 29581, 51816, 119025, 113092, 83383, 106262, 85632, 71001, 58416, 18978, 28328, -42647, -30678, 40439, 84491, 85612, 60445, 90472, 90973, 12727, -44170, 32905, 47574, 35343, 31472, 29501, 13212, 52437, 150510, 153065, 152270, 160837, 156612, 137278, 105546, 93338, 76412, 98048, 71058, 26814, 14916, 33798, -19945, -82379, -61829, -33329, -10140, 21307, 7329, -52339, -57855, -66630, -40277, -4376, -1565, 17195, 26189, -9397, -21304, -12012, 25690, 47019, 100149, 167124, 129099, 29818, -32827, 19539, 32330, -41282, -28949, -16239, -48485, 25018, 54862, 103094]
11053A03094P186l2787k5245L0757L5476k2234L0634k3077k1238l1194l6509j1891
11041B972R0844L2554n3377p939l7269j9440k2632k7820L41l3176k203J06368
11029B9223R1609Q482p2650k4618J0596K9492j4966l6552J5494j0786n093J467
11017B1698m3274J1194K5232K7074O760M7081M2248l1396m9862m3439L8447k4418
11005B7345o3229M2095r167O1838O3847n947n9462N907M2048P280j84n985p579
10992I8807M5778j6473P1595L1386n1899o525L8874J6918k2094m9156k6076j7302
10980A13833l2569j9812M831k3562l2353R069L4193J8119J0368K2242j5550K1978
10968A10787r234j9508M1950Q180o4550k7119R159P5008N4564k8529j1005N3630
$$ y = [103094, 110280, 77493, 52248, 83005, 118481, 96247, 126881, 103804, 82566, 51372, 14863, 2972, 93816, 126370, 72993, 65054, 27785, 8345, -14287, -42107, -41766, -74942, -77145, 29223, 120832, 129314, 56664, 32046, 42642, 72134, 57168, 20616, 36110, 25324, 20231, 21698, -21576, -10382, 14850, 41924, 48684, 95765, 138013, 106617, 56755, 13316, 51763, 27345, -35884, 6211, -2956, 58882, 122729, 116782, 57320, 63227, 105275, 112555, 112371, 106386, 98807, 144585, 128112, 199707, 231093, 179194, 172669, 211543, 228461, 206367, 157211, 131135, 113833, 81264, 61452, 66283, 42721, 10368, 19437, 53630, 71749, 82117, 104359, 88809, 110787, 101553, 82045, 123995, 132175, 67625, 40506, 49665, 124673, 179237, 150708, 139703, 193333]
10956A93333N3067Q3743L5758K9560M1582r080P0478J63669J88760L57780M85684
10945A694334M28328K67108J31113k3692k30685m49170m83702m26723l04255j30163
10935D72493k0046m2141r1810l8587m7813j893J1963l2303j00385m7273M5219
10924A07424j6644J7274k1138l1964O4707O9759l4165k136k7927K1320K3099K966
10912A72575j479M3655k2900p1269m3737J7989K8665J6030R0800J1952m2343k0562
10900A79376J2343j8645J0051N1603K7125o6150j07277n9586Q5515m80K4984J2480
10888A51339O242k0238J5810K8923L3631k8603P512n6287k9809K9514J0076j0852
10876A37258N934K1837L97k1140k0083M789j7795J4639j1114K5987j6459p911
$$ y = [193333, 246400, 330143, 365901, 395461, 437043, 427963, 498441, 662110, 850870, 1208650, 1694334, 2122662, 2389770, 2520883, 2497191, 2266506, 1817336, 1333634, 906911, 602656, 472493, 452447, 410306, 318496, 279909, 232096, 230203, 242166, 209863, 109478, 62205, 107424, 90780, 108054, 86916, 54952, 119659, 189418, 155253, 153117, 125190, 146510, 169609, 172575, 171096, 214751, 191851, 120582, 76845, 94834, 123499, 139529, 230329, 242281, 199938, 179376, 191719, 173074, 183125, 234728, 261853, 195703, 88426, 28840, 114355, 113875, 138859, 151339, 157581, 137343, 153153, 182076, 215707, 187104, 194616, 138329, 108520, 138034, 148110, 137258, 143192, 165029, 165426, 144286, 124203, 128992, 111197, 125836, 114722, 140709, 124250, 116339]
10864A16339N917J6563p5237o223O7823Q278M5763M652m39n955m0096o519k7847
10851A03019j8903P877k891j2355k2452O4700P5180K8806K6994K9688k6691n6014
10839A96958K5536K8801m4034n0545o6132K165K3591o497p1772J1819N3006l4289
10827F8607L8761L2679N3797M6576K7646n7674m67M1129m9793o6470k1601P9649
10815A92839l056q723M8069k1390K770j0760o1388K4168j8442k9575L5595J1449
10803A61556N4708J5503n217m0389m0995N1117O4743N5270j4072l2442k1843O1738
10791C09677R4273J56872R7710j1093R133q8717q3753J1429K2307l5179m1649
10780D41010N551m4079n9212k1998J8415K9260j3864K6664k0477J9426K7996N186
$$ y = [116339, 122256, 138819, 63582, 57359, 125182, 133460, 179223, 183875, 183436, 177481, 137385, 130866, 103019, 84116, 91993, 89102, 76747, 54295, 118995, 194175, 222981, 249975, 279663, 252972, 196958, 222494, 251295, 207261, 156716, 90584, 92749, 116340, 109843, 38071, 49890, 102896, 68607, 107368, 140047, 193844, 240420, 268066, 210392, 209925, 251054, 201261, 134791, 113190, 192839, 189783, 181060, 229129, 207739, 210509, 199749, 138361, 162529, 144087, 114512, 150107, 161556, 216264, 231767, 226550, 186161, 145166, 196283, 261026, 316296, 302224, 269782, 247939, 309677, 403950, 560822, 658532, 647439, 656572, 567855, 484102, 495531, 517838, 482659, 441010, 446561, 402482, 343270, 321272, 339687, 368947, 355083, 381747, 361270, 380696, 408692, 413878]
10768D13878L0275J12920O7092R5795Q5145J21784J43870K26319L85279N44182
10758B226539Q77459J173431J152391Q05327L53714j28257n61485j014227j184790
10749C700102j021886p22047n13916l01629j49128j22446q8503r2046r7397k3932
10739E67172l4627k633n2941j6832l8877k6284k2348K0886r615k7323J792L305
10727C61675J1191l6400r788N558o215l309K6628P0814k0408j3165R450l5222
10715C60809J769j441k2977O922k9318R32K9820L6864J09314j0907j6231K7530
10703D93086j9817m8921m522N8866M973n1866L3100N2972J5998m9077k9565K068
10691D57295j4239k5014K3064K4405K2530n9239l236P8853J1682l7157p6534N2729
$$ y = [413878, 444153, 557073, 624165, 719960, 805105, 926889, 1070759, 1297078, 1682357, 2226539, 3103998, 4277429, 5429820, 6235147, 6588861, 6460604, 5899119, 4884892, 3700102, 2678216, 1956169, 1442253, 1140624, 991496, 869050, 780547, 688501, 591104, 567172, 532545, 529912, 476971, 460139, 421262, 394978, 372630, 393516, 383901, 356578, 358370, 361675, 372866, 336466, 326678, 332236, 326021, 322712, 349340, 420154, 399746, 386581, 396031, 360809, 362578, 361137, 338160, 345082, 315764, 316696, 346516, 383380, 492694, 481787, 465556, 493086, 473269, 424348, 419826, 478692, 483665, 431799, 464899, 517871, 533869, 484792, 455227, 457295, 443056, 418042, 441106, 465511, 488041, 428802, 425566, 504419, 516101, 478944, 402410, 455139]
10679D55139P4813q238l0143J4021O8152K1295q043n5354J9709o881L6604L8221
10667F19295O6963Q9643L172P4793K1308L440J8408N1138L5377P543k6459j18285
10655H46336o8400p0067q2321l3366K3343k430l8890j07533l1254Q4912M2780
10644E63110l4086k005N1372P0856j1000L722j5796j4863M3085N9009k2660J8462
10632G09206J173K4202P520J2684L557O7274J1552K8315j6622J049j7509M4978
10620H77379J2055N1056L9581j6794L778k0030j5359j6080M2789Q3279J3752o7119
10608I88287P769J49561Q2746R730O902j0129R0702J46885N9748k2336P124K4090
10596A541079P6855O0451O1615J24914J14633J15123J74004J69389K40682L84096
$$ y = [455139, 529952, 521714, 491571, 505592, 573744, 595039, 586996, 531642, 551351, 544470, 581074, 619295, 686258, 775901, 779073, 853866, 875174, 878614, 897022, 948160, 983537, 991080, 964621, 846336, 777936, 707869, 625548, 592182, 615525, 613095, 574205, 466672, 435418, 520330, 563110, 529024, 527019, 578391, 649247, 638247, 641969, 626173, 611310, 654395, 713404, 690744, 709206, 710379, 734581, 742101, 754785, 758342, 825616, 837168, 865483, 848861, 849910, 832401, 877379, 889434, 940490, 980071, 963277, 967055, 947025, 931666, 915586, 958375, 1041654, 1055406, 988287, 996056, 1145617, 1228363, 1238093, 1244995, 1234866, 1325568, 1472453, 1532201, 1509865, 1516989, 1541079, 1617934, 1678385, 1740000, 1864914, 1979547, 2094670, 2268674, 2438063, 2678745, 3062841]
10586C062841O55582J017729J454045J768390J468480Q21203L38697j67302q64965
10577I554700j494187j508555j021236p02851m13615k23670r4821p1164N0068
10568D074669J04691J46273K39185K74793L22698L19002M18228O33560Q12066
10559G345165R47534R22621P61458O88918O02741M30024L02703L30679N63983
10550A2895826R61894J414949K004782K603489L414687M414281N654796P460157
10542D0824861J0274854J4710229K2517844L7032667O0754902Q6593847Q9695674
10535C62404878N9527319K4070110k214703l4281436p4011330r0814403p4905531
10528A69774904n1440878l2921029k0757446j3404798q870374o161533m563813
$$ y = [3062841, 3718423, 4736152, 6190197, 7958587, 9427067, 10248270, 10586967, 10419665, 9554700, 8060513, 6551958, 5530722, 4827871, 4414256, 4190586, 4095765, 4024601, 4074669, 4179360, 4325633, 4564818, 4839611, 5162309, 5481311, 5899539, 6533099, 7345165, 8292699, 9215320, 9976778, 10665696, 11268437, 11698461, 12001164, 12331843, 12895826, 13857720, 15272669, 17277451, 19880940, 23295627, 27709908, 33364704, 40824861, 51099715, 65809944, 88327788, 125360455, 186115357, 272709204, 362404878, 421932197, 446002307, 443787604, 409506168, 335494838, 244680435, 169774904, 118334026, 85412997, 64655551, 51250753, 42380379, 36218846, 31655033]
10521C1655033l541664k862411k465412k174702j870726j629058j384781j074829
10513A4651450p68718m88897n30539n88317o22162o63334q55762q88387p84596
10504H460738n75892m65242l50637l04476l57227l75365l41785l40014l22108
10495E027992k31815k29200l05649k80771k12995j51676r2005j54027r8577j10179
10485C161098m9145l6578j23252r1260r5777j36992j36296j47635r6962j20987
10475B126214j27763j37561q2385m4040m3471j23237q3212O026J6111o8631J157
10464A439208K0454O225o4964q7040p0047m1248o8227o2976l5846L6724j5897
10453A056366n5921r29l8522j2913Q205j02464m8349Q83n2791k2116J3612Q24
$$ y = [31655033, 28113369, 25250958, 22785546, 20610844, 18740118, 17111060, 15726279, 14651450, 13882732, 13393835, 12863296, 12274979, 11652817, 10989483, 10133721, 9245334, 8460738, 7884846, 7419604, 7068967, 6764491, 6407264, 6031899, 5690114, 5350100, 5027992, 4796177, 4566977, 4261328, 3980557, 3767562, 3615886, 3523881, 3369854, 3271277, 3161098, 3111953, 3075375, 2952123, 2860863, 2765086, 2628094, 2491798, 2344163, 2247201, 2126214, 1998451, 1860890, 1778505, 1734465, 1690994, 1567757, 1484545, 1490571, 1506682, 1438051, 1439208, 1459662, 1465887, 1400923, 1313883, 1243836, 1202588, 1134361, 1071385, 1035539, 1072263, 1056366, 1000445, 999516, 960994, 948081, 956286, 853822, 805473, 806356, 753565, 731449, 745061, 745885]
10441G45885r4692p5404n778j3292l5645O2337J7278k9362q0803k1682m0621O6323
10429D94544j7903Q773m1255k7424Q836L9469M7137j4473l8116r2510j0788j9775
10417C36515r596L223j7398O9138Q4448Q7311P3846J1301R009O7237K9366j7840
10405G26560P68k8715j01589j18630j11187p3109q3499o3977n5100J2646j150
10394A03018j4315l9158l7644k0868n954k0655k9070L9940m0165k0196O0688M6979
10382B2600m807O836J2719j0732J2033k41k6144k8865j5129P5439K2864k5204
10370D1369l7452n697l6247M5533O3046j1820q3631l8294L8433J4161n2985K0087
10358d3497M4836J8140n3787l715J1964l0832J3342M8151N0048j8662m1310R317
$$ y = [745885, 651193, 575789, 570011, 556719, 521074, 583411, 600689, 571327, 490524, 468842, 428221, 494544, 476641, 485414, 444159, 416735, 425571, 465040, 512177, 497704, 459588, 367078, 356290, 336515, 326919, 330142, 312744, 381882, 466330, 553641, 627487, 638788, 647797, 715034, 744400, 726560, 727328, 698613, 597024, 478394, 367207, 294098, 210599, 146622, 91522, 104168, 103018, 88703, 49545, 11901, -8967, -14921, -35576, -64646, -24706, -64871, -85067, -24379, 22600, 17793, 24629, 37348, 26616, 38649, 38408, 12264, -16601, -31730, 43709, 66573, 41369, 3917, -1780, -38027, 7506, 70552, 58732, -24899, -63193, -24760, -10599, -63584, -43497, 1339, 19479, -34308, -38023, -26059, -56891, -43549, 4602, 54650, 35988, -5322, 3995]
10346C995L3647k917O2987M5164q962L0639J01104Q4482j355n0185K0387l6636
10334B82350n9242j003l4906k1711k8159L4180J6018j13306m4023l9400L1637
10323B2435N1637o1683l7654K963M3580Q083k2285M255R485J0929l9719k9930
10311c7904J2055N0047L8373j6313j6317k9983m8672J8082j0392O6087M6735J2191
10299H3989n6133n1929k8206k5103L6624J0085l1191L2292Q0580N9134k2944l3179
10287E4019J3621J0620k0740j78J5838k321j0301o6520P042O8659M054k2438m0505
10274A0850j5902K7163p855K0608L5599L0405m880l1228j7112l2012M6214K3252
10262H5102j2245O912l264O8677k8487p4235k6495k7085K2902M8872M5472K0834
$$ y = [3995, 37642, 34725, 97712, 142876, 133914, 164553, 265657, 350139, 348784, 298599, 318986, 282350, 223108, 222105, 187199, 165488, 137329, 171509, 187527, 74221, 30198, -9202, 22435, 74072, 12389, -25265, -22302, 21278, 29361, 7076, 11331, 20816, 31745, -7974, -37904, -25849, 24198, 62571, 46258, 29941, -42, -48714, -30632, -41024, 25063, 71798, 83989, 27856, -24073, -52279, -77382, -40758, -30673, -61864, -29572, 51008, 110142, 87198, 54019, 67640, 78260, 57520, 57342, 73180, 70859, 60558, -5962, 1080, 69739, 73793, 51355, 10850, -5052, 22111, 14256, 34864, 70463, 100868, 95988, 64760, 47648, 15636, 61850, 85102, 72857, 79769, 76505, 145182, 116695, 42460, 15965, -11120, 11782, 60654, 106126, 126960]
10250A26960L7624L854n6458j1562M7666P8454j1663r6858j6108J7407J5844n2068
10238H3092p5364p010K9872l355k3127M2682M4215l7748N424O1421M2237r7768
10226F4571m8295J0016l993J8208k5071q3067K468K0170L966m3796n0383M2126
10214i3080M9367J9420l6341J4851N2149L5165J5175P7522J516K0935l2519k7009
10202I7151n4554j7312K9285j3406K6489O517j6881M3180j4718n7384L188K5600
10190E7155k2955L863K462k8268M4521j2771j083j1468N2346k4906l5562O74l3981
10177i973k2773L7889K0380L4519k0237L1341N4860o8606o9059O231n5107k890
10165f3425L1857M2789L4553j0896k6640J4042O7992L5661L0033l3203J5197K3910
$$ y = [126960, 164584, 168438, 111980, 100418, 148084, 226538, 214875, 118017, 101909, 119316, 135160, 83092, 7728, 718, 30590, 27235, 4108, 46790, 91005, 53257, 58681, 120102, 162339, 64571, 16276, 26292, 22299, 40507, 15436, -67631, -65163, -44993, -41027, -84823, -135206, -93080, -43713, -24293, -60634, -45783, 6366, 41531, 56706, 134228, 135744, 156679, 124160, 97151, 42597, 25285, 54570, 41164, 67653, 74170, 57289, 100469, 85751, 28367, 31555, 57155, 34200, 38063, 40525, 12257, 56778, 44007, 42924, 31456, 83802, 58896, 23334, 24008, -9973, -32746, 5143, 25523, 60042, 39805, 71146, 126006, 57400, -11659, -5428, -60535, -63425, -31568, 11221, 45774, 34878, 8238, 22280, 90272, 125933, 155966, 122763, 137960, 161870]
10153A61870M6399R871j8345r2891j9278M4679o3785q0567J4128N9771J6626Q964
10141H7442j6261o422M1119O6986m402k6736k0913J063k0288p8864K3768J05629
10129A52121O6937K5546R9387M9624J21192K52132L46985M68238L85066K57959
10119B225187R8462m823j52111l46828m41808m65257l15559j54793j47775j42980
10109A51715l4791R954n871J187L9566K9758j9737n3369k8094N777l8620j9778
10097C7697K259R1622j2738r8462j2625M7592m484m5205m1953J11892P0704J3015
10085A59314j5584k8384m6877k7925m2165l0372j9617J7951K9954j6003m434J7998
10073f144M4547nK1389l99J916M6795K6415m4558k1129o899k1522k2678K0317
$$ y = [161870, 208269, 218140, 199795, 106904, 87626, 132305, 68520, -12047, 2081, 61852, 78478, 87442, 71181, 64759, 105878, 172864, 168462, 141726, 120813, 121876, 101588, 22724, 46492, 152121, 219058, 244604, 343991, 393615, 514807, 766939, 1113924, 1582162, 1967228, 2225187, 2323649, 2318826, 2166715, 1819887, 1378079, 912822, 597263, 442470, 294695, 151715, 116924, 126878, 121007, 122194, 161760, 191518, 171781, 118412, 90318, 96095, 57475, 37697, 39956, 131578, 118840, 20378, 7753, 55345, 50861, 5656, -36297, 75595, 146299, 159314, 143730, 115346, 68469, 40544, -1621, -31993, -51610, -33659, -3705, -19708, -24142, -6144, 38403, 38398, 59787, 59388, 61304, 108099, 134514, 89956, 68827, 61928, 40406, 17728, 38045]
10060C8045Q8013R2813M9828P1709J11521J60427K50692M21132P38947Q33415
10050B856542M18970J75150m5335k74819o12111p25007o36812l90339k40324p7524
10040D48391n7477n6616L216m2518n5597j2525j164j4135m7878q190M8377J8026
10028B21910o9966o5193p7044j3538l5604J2983M8990M2375M2292l1160j6611
10017E9434k968J157J0825K5704J319N4353K0189l2176l5957M745k2548n556M4417
10004A22938k5477j4951m8348m3249L2211m441j1804L698m2116K6864L6481K6881
9992E8687J0347j3274o7988m0736l6538K583N4371M2278k5175n2339m5991K3242
9980i0533K2400L0298J8098K5492J5214N2592m3495m6477K3799j0102K0538k407
$$ y = [38045, 126058, 218871, 268699, 340408, 451929, 612356, 863048, 1284180, 2023127, 2856542, 3275512, 3450662, 3405327, 3130508, 2518397, 1793390, 1156578, 766239, 525915, 448391, 390914, 334298, 337514, 294996, 239399, 226874, 225710, 211575, 163697, 155507, 203884, 221910, 151944, 86751, 9707, -3831, -39435, -26452, 22538, 64913, 107205, 76045, 59434, 56466, 57623, 68448, 94152, 95471, 149824, 170013, 137837, 101880, 106625, 84077, 78521, 122938, 97461, 82510, 34162, -9087, 23124, 18683, 6879, 10577, -31539, -4675, 31806, 58687, 69034, 55760, -12228, -52964, -89502, -86919, -32548, 9730, -15445, -67784, -113775, -90533, -68133, -37835, -19737, 5755, 20969, 73561, 30066, -16411, 7388, -2714, 17824, 15417]
9968A5417l5470K2077K9251m0058k7116m521m1509L9218K1940L1901K8544r516
9956C0158k6713q1075j0045L6992R095l0288M0694J8131J563p0520l7732j6158
9944a35898J1876m068N2293O4652R3570K4057q321n8852j6825M8436Q54J1821
9932H3595k3826l4441k9955n434m3199K3935K6117n2893q8426l5653L6453P0296
9920g3431L7466Q3698Q591P920j1160j5945n6220K218k4653k1558N1764L7550
9908B6240j03315q54N2452j7011l4057L5837N1029l2228j0148j9454L6521N252
9896i736k1479K1105K1884R203q2251n2652P0953k8150O606N585k0297k8960J2005
9883i6184m645M0742P9027M7959k4016P319m316J9330k3820o3315K2226M990l2296
$$ y = [15417, -20053, 2024, 31275, -8783, -35899, -40420, -81929, -42711, -20771, 11130, 39674, 30158, 3445, -77630, -87675, -50683, -41588, -71876, -31182, -13051, -11488, -82008, -119740, -135898, -124022, -128090, -75797, -11145, 82425, 106482, 98161, 39309, 22484, 70920, 71774, 83595, 59769, 25328, -4627, -10061, -53260, -29325, -3208, -56101, -144527, -180180, -143727, -73431, -35965, 47733, 56324, 64244, 53084, 37139, -19081, -16863, -41516, -63074, -11310, 26240, -77075, -77929, -25477, -42488, -76545, -40708, 10321, -21907, -32055, -51509, -14988, -9736, -31215, -10110, 11774, 20977, -61274, -113926, -42973, -71123, -64517, -58932, -79229, -108189, -96184, -100829, -60087, 18940, 66899, 42883, 50202, 45886, 65216, 41396, -21919, 307, 5297, -26999]
9870b6999n5147M791l7368n8257J00676J05397L5810l410o1463n7104J4435k5251
9858f3890n0947N9658L2111O9431Q094l6134n7207l7360N249L9995n515l3469
9846f9984n9028m9484N4991P6651j1370M2329N1090k8777n3903m18j0504K5500
9834c2907k3J8148J4018l9850j6342J7207p697k5790K6135L4379J1517n79L7555
9821C5771J2902n4658l9408K9339l138R380Q285J5051J897j1120l2535K3625J9919
9808A5310j182j6545L3175K4392j6014M1143J3386m3111l0694l6244l5079o698
9796e8161M4016J272k6398M6071r695l2743j5662l1600K3335J9149K9337L1335
9784B0256J6199k879m3493Q700m865l6696j4257N8775n8320k7746J7639o6572
$$ y = [-26999, -82146, -77355, -114723, -172980, -72304, 33093, 68903, 65493, 4030, -53074, -38639, -63890, -114837, -55179, -23068, 46363, 54457, 18323, -38884, -76244, -70995, -31000, -36515, -69984, -129012, -178496, -123505, -46854, -58224, -15895, 35195, 6418, -47485, -47903, -58407, -32907, -32930, -14782, -764, -40614, -56956, -39749, -47446, -73236, -47101, -12722, -1205, -1784, 35771, 48673, -5985, -45393, -16054, -19192, -9812, -1527, 13524, 15421, 4301, -28234, -4609, 15310, 14128, -2417, 30758, 55150, 39136, 80279, 93665, 50554, 19860, -16384, -51463, -58161, -14145, -12873, -39271, 6800, -2895, -35638, -51300, -82900, -59565, -40416, -11079, 20256, 36455, 33576, -9917, -1217, -6082, -42778, -57035, 1740, -56580, -84326, -66687, -133259]
9772a33259J9029L9691p052L6595R032M8343J8488J88r993k0622j6399M4708N8056
9759H6805p455n7788o3254j9803L3886J7652O716P988M6098M1854P642j9341n1366
9746B9634j3061J6324N9011N2703L6716o9081N168k1034J2019M7394L4777n3761
9734A36809k9693K9893J0399p6896j7231j4089P8218P1708j7363L1678K9821L6901
9722B70155P379P956O564L30l833J4976L3407l0213n2665L513r164l0543j8029
9709A99833J011M5137L3112k8599j2952L0488L1325L474n6745K5085N9689O4265
9697C95123n3780n6307J2189J7089k6578l5550N793P84O35l5459l3931M3150N3303
9684B86461j728l9178K1315L1535J971L0110J5677L1252j5307n2551L0678K8144
$$ y = [-133259, -114230, -74539, -81591, -44996, -35964, 12379, 30867, 31055, 21062, 440, -15959, 28749, 86805, 79350, 21562, -41692, -61495, -27609, -9957, -3241, 4747, 50845, 92699, 100341, 81000, 29634, 16573, 32897, 91908, 144611, 181327, 112246, 117414, 96380, 108399, 155793, 190570, 136809, 107116, 137009, 147408, 70512, 53281, 39192, 117410, 189118, 171755, 203433, 233254, 270155, 277534, 285490, 292054, 292384, 288551, 303527, 336934, 306721, 254056, 257569, 248405, 217862, 199833, 200844, 245981, 279093, 250494, 237542, 268030, 299355, 302829, 246084, 271169, 330858, 395123, 341343, 285036, 297225, 314314, 287736, 252186, 257979, 258763, 259398, 223939, 190008, 233158, 286461, 284733, 245555, 266870, 298405, 300376, 330486, 346163, 377415, 362108, 309557, 340235, 368379]
9672C68379n7809n5390M6621O6770L4247j0345k6912m4704M0776L0204q2304j02217
9660B07316m14K1327L5194j0272l7415j8206K9157k2144l8970O643N4997K2533
9648B49746j9443m9850J4507q184p4182K7205K5329j9739J9396J8988M0342n834
9636B18281p5528p4105L031P266L8040L4014K3420P044j7814L0722M805j2129
9624A87047j2239K7367q886k4924L6699j2415M183J3483o1979r0357m0826M2683
9612E9836q09p614k4939k8663P698K0298K0479J636J2156j1265l2462k8942m0443
9599e3034J4832Q9301L3233l7153l1182k1328L64p368M6025L2365p9931N3558
9587C9682J07419K3473m2988l5613n2581k7526q132j554J2767J6096L1402j8683
$$ y = [368379, 310570, 255180, 301801, 368571, 402818, 392473, 365561, 320857, 361633, 391837, 309533, 207316, 206902, 228229, 263423, 253151, 215736, 197530, 226687, 204543, 165573, 172216, 227213, 249746, 230303, 180453, 194960, 186776, 112594, 139799, 165128, 145389, 164785, 183773, 224115, 218281, 142753, 68648, 71679, 78945, 116985, 150999, 174419, 181463, 163649, 194371, 199176, 187047, 174808, 202175, 193289, 168365, 205064, 192649, 196832, 210315, 148336, 57979, 17153, 59836, 59027, 51413, 26474, -2189, 5509, 25807, 46286, 47922, 60078, 48813, 16351, -12591, -53034, -38202, 51099, 84332, 47179, 15997, -5331, -4967, -12335, 33690, 66055, -13876, 39682, 147101, 170574, 127586, 91973, 39392, 11866, 3734, 2180, 14947, 31043, 62445, 43762]
9575D3762L148M7750J6057N146m1492j2431k2817L2300k1902l302J7164k1372
9563D2011l5806m7688J5122N2646K9520k9335L9479O7092j7454l3378j0878p7069
9551e738m801j2940R196L2957P458K8265K9243j968j0482l6228l7515J8012M8398
9538F3857J4339m0255K5656J6847m231M0788l3948j6328m4246J4504k7254q0k7630
9525a7981j6343J6063M9924j846J1229O9810o915r522J2739K9710k7214m5297
9513F4357J9900p9274k6904L9046J18583K6733j7707j2540J6400K8444l2304K1977
9501A66711n2909n5275j9475p475j9760L0738K7620k1834n9576m3497J1264R503
9489c3965K2136l9429r020M0821O401q150K736m3360L0220R6424O056k0376k9662
$$ y = [43762, 46910, 94660, 110717, 115863, 74371, 61940, 39123, 71423, 49521, 46219, 63383, 42011, 6205, -41483, -26361, 26285, 55805, 26470, 65949, 133041, 115587, 82209, 71331, -5738, -10539, -23479, -14283, 18674, 26132, 54397, 83640, 81672, 71190, 34962, -2553, 15459, 63857, 78196, 37941, 63597, 80444, 76213, 117001, 83053, 66725, 22479, 36983, 9729, 9649, -17981, -34324, -18261, 31663, 29817, 41046, 110856, 103941, 94419, 107158, 136868, 109654, 64357, 84257, 4983, -21921, 17125, 135708, 162441, 144734, 132194, 148594, 177038, 144734, 166711, 113802, 58527, 39052, 31577, 11817, 42555, 70175, 48341, -11235, -54732, -43468, -33965, -11829, -51258, -60278, -19457, -13056, -21206, -18470, -61830, -31610, 64814, 70870, 50494, 20832]
9476B0832k8470m3669N0933k0891n7573K2465P3765M598n6878O505q33m130J0323
9463b3023n0153p020o067m8318O061O5368j5540M5399q188N4841Q3105j252k9584
9450F5629l0314m524o2308J85N7028K5973P804n1696n6244k5845j8563k2207J06788
9437h294M0088J2199l2695k9231k2627J8450K1620K5816L0205L2502m1384n1866
9425e217o9767N4106O4881M0469j1021o7966l2659k5095k3390L3823m3743M7754
9413c7825P4891Q3857j020N943o3764o5796N4497J0621L171J6839l6991r402p17
9400C4304M2258k0289m2589P4604J0175o98j630l2684l0477k9083o666J9764K0020
9387C7009R140L0017p8940k6158J3126N034L9399k3033n3349n0178M4094M5149
$$ y = [20832, -7638, -51307, -374, -21265, -78838, -56373, 17392, 21990, -34888, -28383, -29216, -33346, -23023, -73176, -80196, -86263, -134581, -128520, -63152, -78692, -33293, -41481, 13360, 96465, 95213, 65629, 35315, 30791, -31517, -31332, 25696, 51669, 59473, 7777, -48467, -74312, -92875, -115082, -8294, 31794, 43993, 11298, -17933, -40560, -22110, -490, 25326, 55531, 88033, 46649, -5217, -74984, -20878, 44003, 84472, 73451, 5485, -27174, -52269, -75659, -41836, -85579, -37825, 37066, 120923, 119903, 125846, 62082, -3714, 50783, 61404, 64575, 81414, 44423, 35021, 34304, 76562, 56273, 13684, 88288, 98463, 97765, 96135, 63451, 32974, 3891, -2775, 16989, 37009, 46149, 76166, -2774, -28932, -15806, -10772, 28627, 5594, -47755, -97933, -53839, -8690]
9375h690p973J7804L8388M6251K3553J3300o6394j6532L9796J491k0794M7377
9363A07577N53m174j5064k1796K7956J803M926M6970L5170Q539k4283k3850k560
9350A41767Q564k3543n893K0122M895M145n4357p4120J2660N8358j7145q6935
9338a1482n0232J0545N4671r025n006P2285M5717n096l071n1998j2447k0133L7552
9325E2280O4613j500o4975r2158m387K7451K0241k1401j0698J2902J853N5546
9313C9767N1310N5559k1694o4030j0141q115j7651L4594M4435n6063K0049L3374
9301A01394K8835J1691K471L4611j9670r2596K270o3200j5837M8351L2861K284
9289G3465n6604k6645p342J29157N2360l2074J8677O9643M5527j9614k9786l8581
$$ y = [-8690, -16663, 1141, 39529, 85780, 109333, 122633, 56239, 39707, 79503, 80994, 60200, 107577, 108130, 103956, 88892, 67096, 95052, 96855, 101781, 148751, 183921, 192460, 168177, 144327, 141767, 150331, 126788, 120895, 141017, 145912, 150057, 95700, 21580, 34240, 92598, 75453, -11482, -61714, -51169, 3502, -5523, -10529, 61756, 107473, 102377, 99306, 47308, 34861, 14728, 52280, 116893, 115393, 50418, -41740, -46127, -18676, 1565, -19836, -30534, -17632, -15779, 39767, 91077, 146636, 124942, 60912, 50771, 42656, 25005, 59599, 104034, 47971, 68020, 101394, 130229, 141920, 144391, 179002, 159332, 66736, 69006, 5806, -10031, 38320, 71181, 73465, 16861, -9784, -17126, 112031, 164391, 132317, 150994, 220637, 266164, 246550, 216764, 178183]
9277A78183k3252O198O5993p068n3413p038K7581k2946l6048K5993O8859O3310
9265B86352J5413o7467k5509L3124j6060O029J7300j4527J2404M5501l2414q4720
9253A75426m1831R752j102k5417O8587J23924K3347j8861l3552n2732k2724M3613
9241B48430K139j0203N20m580L2898K9222l6273L2979L8480J7733p1432n3762
9229B26151J972n028N9751Q1720l7007N850O9195J6168N956o6909k5808N4682
9217C86693N2250M1704L377J6009k9003k8436l1526J2153R4442J6768k8859L4814
9205E40386o931k2429K1259K0134j9273k8517J3927Q4045R870O6059J8391N2639
9193G49560O7286J2326P3371r972j3185M4287P2904Q1520J5114K1833N2030Q2842
$$ y = [178183, 154931, 161129, 227122, 220054, 166641, 159603, 187184, 164238, 128190, 154183, 223042, 286352, 301765, 234298, 208789, 241913, 225853, 231882, 249182, 234655, 247059, 292560, 260146, 175426, 133595, 143347, 142245, 116828, 185415, 309339, 332686, 313825, 280273, 227541, 204817, 248430, 250569, 240366, 240886, 236306, 269204, 298426, 262153, 295132, 333612, 351345, 279913, 226151, 228123, 223095, 282846, 364566, 327559, 333409, 402604, 418772, 424728, 357819, 332011, 386693, 438943, 480647, 484024, 500033, 471030, 442594, 411068, 423221, 517663, 534431, 505572, 540386, 533455, 511026, 532285, 552419, 533146, 504629, 518556, 602601, 612471, 678530, 696921, 749560, 816846, 829172, 902543, 892571, 879386, 923673, 996577, 1078097, 1093211, 1115044, 1167074, 1249916]
9181A249916K6010J13130P6037K9411L9456J05443Q7220J32993J59309J56327
9171B175252J53909J72815J58891K18138K41402K61996K25774K88182L08364M13290
9161D618013L75623L88997M17036M67384N47736N41676N59308N48885M77535M70894
9151I413087M10544K59261P7779l0284k02043k87050l72704m41206m95317n38011
9141G794056n83435n11066n02064m78998n27692m62370l75150k86563k86381k81214
9131C499123k45644j93140j20229k28851k10591j49827j13171j43824j45179j79593
9121A769074j66312p7177l205o01j00767j27461o1187n5204n9090p9845q4495
9110I53730K2821n3110k5731j6722M9800o5880q7067o2196k6820L9931r297p272
$$ y = [1249916, 1275926, 1389056, 1465093, 1494504, 1533960, 1639403, 1726623, 1859616, 2018925, 2175252, 2329161, 2501976, 2660867, 2879005, 3120407, 3382403, 3608177, 3896359, 4204723, 4618013, 4993636, 5382633, 5799669, 6267053, 6814789, 7356465, 7915773, 8464658, 8942193, 9413087, 9823631, 10082892, 10160671, 10130387, 9928344, 9641294, 9268590, 8827384, 8332067, 7794056, 7210621, 6699555, 6197491, 5718493, 5190801, 4728431, 4353281, 4066718, 3780337, 3499123, 3253479, 3060339, 2940110, 2711259, 2500668, 2350841, 2237670, 2093846, 1948667, 1769074, 1602762, 1525585, 1522380, 1521779, 1421012, 1293551, 1232364, 1177160, 1118070, 1038225, 953730, 976551, 923441, 897710, 880988, 930788, 864908, 777841, 715645, 688825, 728756, 719459, 712187]
9098G12187k6182l8717k3971l1310j3647j3865n87m7803l6878k1586r825N390
9086D53206l3893j5804K8398N6716M0571L5943j7258n6674o9384j1924j6651m3727
9074C49519L3649m5116l2048k6485q876j086m8294p998K1318m3731m4811N9082
9062B05123K2244m4207l6151l7470P7584N8694K9599l4729n4545l3306L8937k8102
9050A63671J4706m6939k3710N6510M395n8365J6530L9031N4765R123l5452k6527
9038A67738n1251j6730M9510M4873j551o5587l5995P566n0202m6267L0908J3343
9026D6355j4220l4692M5059J1800M2578L1844k9605L6692Q9049j0699m5782P119
9014A75498K9091k2186j8300n0806j7836M9272J1278j6805p5158J993N6257L3338
$$ y = [712187, 686005, 647288, 623317, 592007, 578360, 564495, 563908, 516105, 479227, 457641, 447816, 453206, 419313, 403509, 431907, 488623, 529194, 565137, 547879, 491205, 421821, 409897, 393246, 349519, 383168, 338052, 306004, 279519, 270643, 269557, 221263, 213265, 234583, 190852, 146041, 205123, 227367, 183160, 147009, 109539, 187123, 245817, 275416, 240687, 186142, 152836, 191773, 163671, 178377, 131438, 107728, 164238, 168633, 110268, 126798, 165829, 220594, 229717, 194265, 167738, 116487, 99757, 149267, 194140, 192589, 127002, 91007, 98573, 48371, 2104, 33012, 46355, 32135, -2557, 42502, 54302, 96880, 128724, 99119, 135811, 224860, 214161, 168379, 175498, 204589, 182403, 164103, 113297, 95461, 144733, 156011, 139206, 64048, 66041, 122298, 155636]
9002A55636k1389J9567n7918k3829J1269j6579n160M0462J8239n6344k6912O1725
8990I8767P0404l1749J3585j8642J2077J5419L7826j9245o2669l8051K5409K1223
8978A24354Q3417r556m1431j8249K1002K4076q933Q820l2243k5921l8490j0059
8966G6787J628J3733J2250p2802k3069Q7294N6699K018m5856n9561L8248l192
8954H4177j8682n7116j4247O7811L8338k6919K1320R979n5552K8446M9596R454
8942A36605L0494M4303j5291L1005P7752L6330p9558l0743J167N9179P2140N9059
8930D22442O2099P0340M344J7823k746l7390o4526p2806m3733k2796r6450j01408
8918A35193l264L9551K2174R3510M0956k1943K4513K1702q5106k0392j6923r8924
$$ y = [155636, 134247, 153814, 95896, 72067, 83336, 66757, 61597, 102059, 120298, 63954, 37042, 98767, 169171, 137422, 151007, 132365, 144442, 159861, 197687, 178442, 115773, 77722, 103131, 124354, 207771, 198215, 156784, 138535, 159537, 183613, 174680, 183500, 151257, 125336, 86846, 76787, 78415, 92148, 104398, 31596, 8527, 95821, 152520, 154538, 108682, 49121, 87369, 84177, 65495, 8379, -5868, 61943, 100281, 73362, 94682, 104661, 49109, 77555, 127151, 136605, 167099, 211402, 196111, 227116, 304868, 341198, 261640, 230897, 232064, 291243, 363383, 422442, 484541, 554881, 559225, 577048, 574302, 536912, 472386, 399580, 355847, 333051, 236601, 135193, 131929, 171480, 193654, 287164, 328120, 306177, 330690, 352392, 267286, 246894, 229971, 131047]
8906A31047l1963M7254J4137k5460K624J5682J6278K3052L4844j0741p282K5910
8894B35382L6216L2172m7919q7563l3045n054M5805o3716J8925N9943N4710M5112
8882B90968K9749K5080J4182J8352J30645J40169R6002K4879j1491k3181K8350
8871G63704l4317q4107j01614q3401k7567l1897o7690J3008l152k2453l963j6883
8859B99668m7691p2529l3560O1584N423l8529J0496N6043J5275r259j0828J6548
8847B52641m971k7619j6160q35m2919m7519N3302M5378k9960l7608L8220K3658
8835B05608o107K9945M4777L6N8559O0431O9753L8202O8128J24258J15983J81138
8823I90711K92368M32140M67693L61206K33301J2824j41930k45287l67022l98442
$$ y = [131047, 99084, 146338, 160475, 135015, 137639, 153321, 169599, 192651, 227495, 216754, 209472, 235382, 271598, 303770, 255851, 168288, 135243, 130189, 175994, 112278, 131203, 191146, 245856, 290968, 320717, 345797, 359979, 378331, 508976, 649145, 745147, 770026, 758535, 735354, 763704, 729387, 645280, 543666, 460265, 432698, 400801, 333111, 346119, 342967, 320514, 316551, 299668, 251977, 179448, 145888, 207472, 212895, 174366, 184862, 240905, 256180, 246921, 236093, 252641, 247670, 220051, 203891, 203056, 160137, 112618, 165920, 211298, 181338, 143730, 181950, 205608, 199501, 229446, 274223, 274259, 332818, 393249, 463002, 501204, 569332, 693590, 809573, 990711, 1283079, 1715219, 2182912, 2544118, 2777419, 2790243, 2648313, 2403026, 2036004, 1637562]
8813A637562l54367k82016j21460p4283j10660q0263o508p3891L0098K0775l8028
8802E46959m349l3310o2664m6614M1881M8932Q3481K5204M2657M1179m813J11566
8790G90109J26969J28158J80606K69616M61890O63325P54450O70557M79269L73582
8780D898531M63726O34294P01182Q37014P16815M71208Q1488m60742j023599j304398
8770F015519j299921j119783q49550n53075l27098l09691j87874o3784l5062L3729
8760A303410O350n3655q2810p9152n9485j2858J51j381m5882L7259Q5493R9513
8748A196953L9161K4403Q6371J39722K69812L44889N01378Q05538J373183J517664
8738F299074J032787O45110N38493M71063L09753L79235L76328J39353p9455m94421
$$ y = [1637562, 1283195, 1001179, 879719, 805436, 694776, 614513, 608005, 534114, 564212, 584987, 546959, 542610, 509300, 446636, 400022, 441903, 490835, 574316, 599520, 642177, 683356, 678543, 790109, 917078, 1045236, 1225842, 1495458, 1957348, 2620673, 3375123, 4045680, 4524949, 4898531, 5362257, 5996551, 6697733, 7534747, 8251562, 8722770, 8804258, 8343516, 7319917, 6015519, 4715598, 3595815, 2746265, 2193190, 1866092, 1556401, 1368527, 1304743, 1269681, 1303410, 1309760, 1256105, 1173295, 1094143, 1034658, 1021800, 1021951, 1020570, 974688, 1011947, 1097440, 1196953, 1236114, 1260517, 1346888, 1486610, 1756422, 2101311, 2602689, 3408227, 4781410, 6299074, 7331861, 7976971, 8515464, 8986527, 9296280, 9675515, 10051843, 10191196, 10111741, 9617320]
8728I617320j127429j606166j587356j325577r30073o54322l69638k70524k19889
8719A526346q2874o1967m9668r5660r8276m3732m1522k5017p9238m8960o2576
8708H36856q5121M0960M9573l2104n8914j7978k0355L3677N0134J72778K74823
8697A244329L33302M20891O04270O20647M50282K81025J63652P0906R9167M8458
8687D336929m8412j89896k18588k83646m81015o01834o37974m64828k93656j25257
8677I91823j19775p0137o9331j1500K0392j13781q4359J5575j655m1016N8444
8666E74680R8466J0554r038L8118l4475q0468j05337j23910m2755m185m1282k9705
8654B50663R0124L6251j3299J9929k6982j2854O186O076m6760q428m499J2444
$$ y = [9617320, 8489891, 6883725, 5296369, 3970792, 3040719, 2386397, 2016759, 1746235, 1526346, 1443472, 1381505, 1331837, 1236177, 1137901, 1094169, 1052647, 1027630, 948392, 899432, 836856, 751735, 792695, 842268, 810164, 751250, 733272, 712917, 746594, 796728, 969506, 1244329, 1577631, 1998522, 2602792, 3223439, 3673721, 3954746, 4118398, 4189304, 4288471, 4336929, 4288517, 4098621, 3880033, 3596387, 3115372, 2513538, 1875564, 1410736, 1117080, 991823, 872048, 801911, 732580, 721080, 741472, 627691, 543332, 558907, 557252, 516236, 574680, 673146, 683700, 674662, 712780, 678305, 597837, 492500, 368590, 325835, 321650, 280368, 250663, 340787, 377038, 363739, 383668, 356686, 343832, 350018, 356094, 309334, 300906, 296407, 308851]
8642C08851K130J7974j0833l722K3472J7075k3534j4569j7392J6111L0075L6708
8630C82346J2030j69M0049k7336k4688N5179N693n7214P7285M4288J4656M1201
8618E63320l0034o9244o254J608m652O2800M7666N4537m1230O9669M8396L7152
8606G33734j0027J9622K6942R9678J5237K6443N4334P6658P7115K0676o7127R24
8594A074209P3860J09578J5553m8615k3649q0525j09368m7615j7264j8326p8678
8583H49160l4504l0840l4008k6021k3745r7139m9318n1585n6436J4673M8204j5694
8571D92747l7259p0762k4031j0363l358m0192m8704k2609P0321n487M213m828
8559B99688p7539R678K6415k8702K6915k484k299J1769j1028K1102M2187J1879
$$ y = [308851, 310981, 328955, 318122, 314400, 337872, 354947, 331413, 316844, 299452, 315563, 345638, 382346, 394376, 394207, 434256, 406920, 382232, 437411, 443104, 385890, 463175, 507463, 522119, 563320, 533286, 464042, 457788, 459396, 454744, 517544, 565210, 619747, 578517, 648186, 696582, 733734, 723707, 743329, 770271, 869949, 885186, 911629, 965963, 1042621, 1119736, 1140412, 1073285, 1074209, 1148069, 1257647, 1273200, 1224585, 1200936, 1120411, 1011043, 963428, 946164, 927838, 849160, 814656, 783816, 749808, 723787, 700042, 602903, 553585, 502000, 445564, 460237, 508441, 492747, 455488, 384726, 360695, 350332, 346974, 306782, 258078, 235469, 305790, 300303, 304516, 299688, 222149, 231827, 258242, 229540, 256455, 253971, 251672, 263441, 252413, 273515, 315702, 327581]
8547C27581J6272J8573R9372J11528P3105O6975N8251j7793n2775N3978K6417
8536G81484p336n7502o6117p1967p2207o9339j01081l7823k0836K3150L9770n4500
8524B85696q022n0545m0606M2771k0191l3228j681K2768k9361K1994J8378n041
8512B02932N312j4131n9841j6071K3926J0835n457Q8775K9847k1963R3532P0214
8500D07910J57327R2361J28379P1022l8407o0376j21996j8541j7042k9568R686
8489E80755n3071j39924q2711N736L564p532l9472n1938q5595o5293M3393L539
8477A11451k774K1142K261K4213L2092m0285K5726N0553p270j1559j5033M1613
8465B32130m093k0369n9288q1318m235J7350O296M1910N1027P5024L0788L5782
$$ y = [327581, 343853, 362426, 461798, 573326, 646431, 713406, 771657, 753864, 701089, 755067, 781484, 774148, 716646, 650529, 578562, 506355, 437016, 335935, 298112, 277276, 300426, 340196, 285696, 277674, 227129, 186523, 229294, 209103, 175875, 174194, 196962, 167601, 189595, 207973, 202932, 208244, 194113, 134272, 118201, 142127, 152962, 147505, 236280, 266127, 244164, 337696, 407910, 565237, 657598, 785977, 856999, 818592, 758216, 636220, 617679, 600637, 571069, 580755, 527684, 387760, 305049, 310785, 314349, 306817, 267345, 215407, 129812, 64519, 107912, 111451, 108677, 129819, 132080, 156293, 188385, 148100, 173826, 224379, 217109, 205550, 190517, 232130, 228037, 207668, 148380, 67062, 62827, 80177, 86473, 128383, 179410, 254434, 285222, 321004]
8453C21004M7690K5267m5460j0223n1959p5734j072K1318p4715l1729q555K7112
8441A42944N282j2430p6395L524J9830m8578L4586q880l9634j6052J6320m748
8429A5769J5776k240L8954N9250J5434l0070n1665j1417L7417l2725n5283o804
8417g604L8595m32j276M0452P7789n272j8366m2650n8287M634M4384J3771l8171
8404D7567M2754R083k1586p4054M4609O1511k4675J9956j4879J817o4036l1996
8392c929J4387K4715j5835j6302P697K4562M009p1848o378j5052R9465R5509k2745
8379A18255o5650j5255R8654o24l1717J922K1117L9792k8661l603j9013k004m5708
8366F7505j7747k9148K680N1550K662n466R231j1817l9860L358l5108n7887k5373
$$ y = [321004, 368694, 393961, 348501, 338278, 286319, 210585, 209513, 230831, 156116, 124387, 115832, 142944, 148226, 135796, 59401, 62925, 82755, 34177, 68763, 59883, 20249, 4197, 20517, 15769, 31545, 29305, 68259, 127509, 142943, 112873, 61208, 49791, 87208, 54483, -800, -7604, 30991, 30559, 29283, 69735, 147524, 142252, 123886, 81236, 22949, 27583, 71967, 85738, 47567, 90321, 99404, 77818, 3764, 48373, 109884, 85209, 105165, 90286, 92103, 28067, -3929, 10458, 35173, 19338, 3036, 10733, 35295, 39304, -32544, -38922, -53974, 45491, 141000, 118255, 52605, 37350, 136004, 135380, 103663, 105585, 126702, 166494, 137833, 134230, 115217, 113213, 67505, 49758, 20610, 23290, 74840, 77502, 72036, 81267, 69450, 29590, 32948, -2160, -60047, -85420]
8353h5420K1386L8066k4841m6412k9639P1102R1488O206J1125k3419p6846K141
8341d5063L2806P0814N4757O388m0066k1186j7465m3089l2740N4858M3560J7574
8329H1148J2934J1529k9937j5720k0879K697l1995l0278M0527N2421o4131k0142
8317a1826M354R504n208Q01o599l6738k4788J7118P5604M9528r21l1323Q852P2790
8303A21148m2706q4069l4516L7587M7853K4799m5787k4174K0795M2521O2749K553
8291A28753J1748n0431n7423o0940R495M5949n3818k2318J093l6810k6885M9914
8279f1673J5492L7570P3821J204K2610M6304m4364l7745n4090j15252L7173O4494
8267a4456N891K6795k1462l6081j7496L7632K2159Q35l6939R943j2311j0152J7798
$$ y = [-85420, -64034, -25968, -50809, -97221, -126860, -55758, 35730, 41936, 53061, 29642, -47204, -45063, -12257, 58557, 113314, 119702, 79636, 58450, 40985, -2104, -34844, 20014, 63574, 81148, 94082, 105611, 75674, 59954, 39075, 41772, 9777, -20501, 20026, 72447, 8316, -11826, -7472, 2032, -3176, -2375, -8974, -45712, -70500, -53382, 22222, 71750, 70829, 39506, 48358, 121148, 78442, -5627, -40143, -2556, 45297, 70096, 24309, 135, 20930, 63451, 126200, 128753, 140501, 90070, 32647, -28293, -18798, 27151, -26667, -48985, -47892, -84702, -111587, -61673, -46181, -8611, 65210, 66414, 89024, 135328, 90964, 53219, -871, -116123, -78950, -14456, -8565, 18230, -3232, -39313, -56809, -19177, 2982, 3817, -33122, -23179, -35490, -45642, -27844]
8254b7844M9034J9817k7773J7214J6963k4766l0760l0171L5292j2087K5404l702
8242F621K4061k0922o2762M270L0522J7708J1717m4270p1552K1207M1383M685
8230c7332J4484K1620j1986L1390j3340m8040J3673k1757M1406L7668M3190J4574
8218H5550K9951j8381m7640m6822N476m847m5532k0115J0329N3360m2015n7464
8206i8150K0309J8670N6522J0690K5031k8546k2628J8638O0673J915K0898m3204
8194D0818q5420l161K6402j5731j6125K7405J4882J8135P47k0963O734l2543m0827
8181g9647L4530k203L3005J453K6823J069l3444l5888P362J8685M1354O5997L4431
8168A13527Q49n5143q4771m0291K6319o809l347J7394j8749K6496M5641O7136
$$ y = [-27844, 21190, 41007, 13234, 30448, 47411, 22645, -8115, -38286, -2994, -15081, 10323, 6621, 30682, 9760, -53002, -48732, -18210, -502, 11215, -33055, -104607, -83400, -42017, -37332, -22848, -1228, -13214, 18176, 4836, -43204, -29531, -51288, -9882, 27786, 70976, 85550, 115501, 97120, 49480, 2658, 8134, 3287, -42245, -62360, -52031, 1329, -40686, -98150, -77841, -59171, -2649, 8041, 33072, 4526, -18102, 536, 61209, 63124, 84022, 40818, -44602, -47763, -21361, -37092, -53217, -25812, -10930, 7205, 7952, -13011, -6277, -38820, -79647, -45117, -47320, -14315, -12862, 13961, 15030, -18414, -54302, -46940, -28255, 13099, 79096, 113527, 114376, 59233, -25538, -65829, -39510, -46319, -49666, -32272, -51021, -24525, 21116, 88252]
8156H8252J8682k0799L5679K7639k2448o3745j22653n7657O49K9702Q8711J6478
8144A8490l5035l200m3133m3413j8873L8850J8915L8146P3274N6909k6720N713
8132G9923p0933p2155n8175r795K3104L7302J5951O3279J7101K3834K1137p2440
8120a867j5829n4478l5540O5865N8625N1138K4580m0386l9218n2535m7111N559
8108h1197J6055K2928K5077K1170J6820j5809J456M0939k3258L908J1312n5238
8096a5837m85K4163l0077Q1024L3814r1668n5627L8953L8753J8103k5178M3756
8084E9694o806q3224K5997R623l9531q164k3091L984P2003K8359n7177o1199k7226
8071a06758L3001L6341P5805J9372j5241J9201j2890l3672R443m322K4318O4624
$$ y = [88252, 106934, 86135, 121814, 149453, 127005, 63260, -59393, -117050, -116401, -86699, 2012, 18490, -16545, -19745, -62878, -106291, -125164, -86314, -67399, -29253, 44021, 100930, 74210, 79923, 8990, -63165, -121340, -131135, -108031, -70729, -54778, 8501, 25602, 49436, 70573, -1867, -17696, -72174, -107714, -41849, 16776, 67914, 92494, 52108, 12890, -39645, -86756, -81197, -65142, -42214, -17137, 4033, 20853, 5044, 6500, 47439, 24181, 28089, 39401, -15837, -16322, 7841, -22236, 58788, 92602, 934, -54693, -15740, 23013, 41116, 15938, 59694, 52888, -30336, -4339, 5284, -34247, -42411, -65502, -61518, 10485, 38844, -18333, -79532, -106758, -73757, -37416, 38389, 57761, 42520, 61721, 48831, 15159, 24602, 20280, 44598, 109222]
8059A09222m852O011k5403o1721l1536n58O2384R985m8493L2777K7505j6479q815
8046E0027M4921L273k0079M5738M0035l5905J2625K8008n6484n0252K6828L2953
8034A21688j9672L9021Q2192J7601m5805k9923n2435j7056M5948L5627p997j7645
8022A51544J1648k9171J049J2263m8847n0831P1275M7756j7646J559K7398J0728
8010A88725J0302M2639P0965l4719l1228P8921J7556J4858P2343L9756K0585l9473
7998D51230l9757r7490l1329k5942J5425K6788L859l5390k7574n8089j1740L8223
7986B08214p789n4485p0299M1387J7301j998J4848q266k5719M933K2735O738M1182
7973A88782L5312J6121k2713K9545K4069j3140j1873N6271M3150m1612k2806O5079
$$ y = [109222, 104370, 110381, 84978, 23257, -8279, -8837, 53547, 63532, 15039, 47816, 75321, 58842, 50027, 94948, 98221, 78142, 123880, 163915, 128010, 140635, 168643, 112159, 61907, 88735, 121688, 102016, 141037, 223229, 240830, 195025, 165102, 112667, 95611, 141559, 177186, 169189, 151544, 163192, 134021, 135070, 147333, 98486, 47655, 118930, 166686, 149040, 150599, 177997, 188725, 199027, 241666, 312631, 277912, 246684, 325605, 343161, 358019, 430362, 470118, 490703, 451230, 411473, 313983, 282654, 256712, 272137, 298925, 302784, 267394, 239820, 181731, 169991, 208214, 200425, 145940, 75641, 117028, 134329, 132331, 147179, 138913, 113194, 118127, 140862, 147600, 188782, 224094, 240215, 217502, 247047, 271116, 257976, 246103, 302374, 345524, 303912, 281106, 346185]
7961C46185O8888l096J9564L476L9558K8974m2432q3977l9562m0637L0316n3813
7949B73444m1425j5927k2381r278L295R038m3543N725m0764l1193J9743j0280
7937I6454K1459M7150L262M228r744k9594J848K3440L9644n410K1868j1342p017
7924A96246n5577o5689J8232N7898L6306j6452N1324Q8781K3225J0434o1504m8080
7912B35144J6337j408p4942j5441l2856j3383J887K7666J1770m35n8008l8947
7900E7384m3665P1290J11431J8320j27412n7189N3339j9564m5328N3395P9660
7889A51661j3504j3259J4278J8422Q057j659n359L770pj5032l0540k6482o6542
7876B3804K8973k0647L8106l337j2740n4540o2251N4062J4960m0460o808K6370
$$ y = [346185, 415073, 411977, 431541, 435017, 474575, 503549, 461117, 377140, 337578, 296941, 327257, 273444, 232019, 216092, 193711, 184433, 187728, 196766, 153223, 158948, 118184, 86991, 106734, 96454, 117913, 165063, 168325, 172553, 162809, 133215, 135063, 158503, 198147, 192737, 214605, 203263, 196246, 140669, 74980, 93212, 151110, 187416, 170964, 222288, 311069, 334294, 344728, 283224, 235144, 251481, 250073, 175131, 159690, 126834, 113451, 115338, 143004, 154774, 154339, 96331, 57384, 13719, 85009, 196440, 214760, 87348, 30159, 83498, 63934, 18606, 72001, 151661, 138157, 124898, 139176, 157598, 165655, 163996, 158637, 162407, 162400, 147368, 116828, 90346, 23804, 52777, 32130, 70236, 66899, 54159, -381, -62632, -8570, 6390, -34070, -40878, -14508]
7864a4508K7013K7672k6305p264J6741m5763k953K638j6828p5853K6011P6148
7852a3251J1509J6625L6565l9684L6186O179l5325J4561K5403k9279m8372n8894
7840g7777n613J9122N8553O1144k5532k4883N3824l0934k9574k0786J4009k1397
7828b9844l512O3590L4377q282M7662o3753l4511J4660j1599J3591J8791M854
7816D6024k070m9212l4538L9308j6728n2140Q330L4681M4943o458l3988n2256
7804g4104K469J9303J4883J5588j2840K1008M8410m5118k3412K8753J8811j8750
7792d999j9746j0377k4860j0272j3018p225j516K947K211m257L0570R1326N4280
7779H5064m7473k8193n8027M8333l339M5004J627q2596m7471K8089L6325K9425
$$ y = [-14508, 12505, 40177, 13872, 6608, 23349, -22414, -25367, -22729, -39557, -115410, -89399, -13251, -1742, 14883, 51448, 11764, 47950, 54129, 18804, 33365, 58768, 29489, -18883, -77777, -83390, -64268, -5715, 55429, 29897, 5014, 58838, 27904, -1670, -22456, -8447, -29844, -33356, 30234, 64611, 56329, 103991, 40238, 5727, 20387, 8788, 22379, 41170, 46024, 43954, -5258, -39796, -488, -17216, -69356, -61026, -26345, 18598, 12140, -21848, -74104, -71635, -52332, -37449, -21861, -34701, -13693, 34717, -10401, -33813, -5060, 13751, -4999, -24745, -35122, -59982, -70254, -83272, -90497, -92013, -89066, -86855, -91112, -60542, 30784, 85064, 37591, 9398, -48629, -296, -3635, 41369, 42996, -39600, -87071, -58982, -22657, 6768]
7767F768k2553l7616k9825k0608P3004j9615K20n09n3068k7676k4434q858J1520
7754a53250N2366N9801K3587M4838m5760Q33N1095O527J4669j0308o164J1452
7742D9686j7591Q746j8696l2317k5024m672K9400N3925L7128M7759p5185q5623
7730c2464L1081l8340o887K2680l0920j8496j3403r78L3279K4983m2833K3149
7718d9149N7819L410M3265J6994M0342r324N1445l4747l8229j3108j6738n7315
7706e335p6405N0528J4608k298K800K5788k2243l7110k5116j4754p736M9228N3104
7693E059k7775o518l1409j3750K5905O2375l942n4123M4455L6628l4293j5972
7681a3360M8035Q136k4996r492l8044N4383m3264o2486m1716k9893N8414J36045
$$ y = [6768, -15785, -53401, -83226, -103834, -30830, -50445, -50225, -50734, -103802, -131478, -155912, -164770, -153250, -100884, -41083, -17496, 27342, -18418, -17585, 33510, 40037, 54706, 44398, 38234, 49686, 32095, 40841, 22145, -10172, -35196, -39868, -10468, 43457, 80585, 128344, 53159, -32464, -1383, -39723, -46610, -23930, -54850, -73346, -86749, -87727, -54448, -29465, -72298, -49149, 8670, 12080, 55345, 72339, 112681, 103357, 154802, 120055, 81826, 68718, 51980, -5335, -81740, -31212, -16604, -18902, -16102, 9686, -12557, -49667, -74783, -89537, -97273, -48045, 5059, -22716, -29234, -60643, -74393, -48488, 13887, 9945, -44178, 277, 36905, 2612, -13360, 34675, 42811, 17815, 8323, -29721, 24662, -18602, -81088, -122804, -152697, -94283, 41762]
7669D1762l7702l096L5265j5315J4623R53R106l2536k8627J0575M9080M585j7571
7656C1102o2548K839J9123N8053n351l6742j5847n8403k0922J3311J8482r178
7644f6081O078J8186J8257O2550j2731j6431p356j4207K6253j7696l3579K3742
7632a3015n7001m3182L7837N7266K3649p648M1149O6484L9464K1767q0453J0783
7620I7100M2095Q838n9454m2042l9588k7623k2613l6848J2833j1464J47M8423
7608c0196l1134n8132m0460K4008N9426K9213M7657j2678k484O3087K6611m4176
7596C0742k9246J6174n8648o0124j1087n6545M8688M7781M924L7306J7202n5932
7584f8765k9554L7270K3083O328l3317j5922K6410m7047j3787K758L8070K4988
$$ y = [41762, 4060, 964, 36229, 20914, 35537, 36490, 45596, 13060, -15567, -4992, 44088, 48673, 31102, -31446, -28607, -9484, 48569, 43218, 6476, -9371, -67774, -88696, -75385, -56903, -66081, -60003, -41817, -23560, 38990, 26259, 9828, 2472, -11735, 14518, -3178, -36757, -13015, -70016, -113198, -75361, -18095, 5554, -2094, 39055, 105539, 145003, 166770, 86317, 97100, 139195, 148033, 88579, 46537, 6949, -20674, -43287, -80135, -67302, -78766, -78619, -30196, -61330, -119462, -159922, -135914, -76488, -47275, 382, -12296, -14780, 48307, 74918, 30742, 1496, 17670, -40978, -101102, -112189, -168734, -120046, -72265, -67341, -30035, -12833, -68765, -98319, -61049, -37966, -31638, -64955, -80877, -54467, -101514, -115301, -112543, -74473, -49485]
7572d9485L6955j6498N6461o061m2988M6858J392l1412M9785o550n6865M558J6406
7559B556j6249m046l9146m5891M7342N9000L8116l8941q6295P235K2923o642M307
7546e5731J8958n844P252j5567K1928K1264L6314m5246k324m30K2673l431k2262
7533b2446k9867r219k2900p1680R52L8986L5417k9364K4519Q6116j0022K8183
7521A8675M2568n3639m3223j05P7189N0895J1748o8899q1242m3967O578Q361J613
7508g3448o8617k3818M1174k970j2829j2799o035m354l8645N0112O5377K7493
7496e9359L6375M2541L1638j1457j6471l2253j308l6536M7723K8801O2410L7792
7484A29896j9497m9337j3763k8315n7074k4060J2404N252O3135O6453j2807o7536
$$ y = [-49485, -12530, -29028, 27433, 21372, -21616, 25242, 26634, -4778, 45007, 38457, -18408, -13850, 2556, -13693, -17739, -56885, -102776, -55434, 3566, 41682, 2741, -83554, -76319, -53396, -60038, -55731, -36773, -42617, -35365, -50932, -29004, -7740, 28574, -16672, -18996, -19426, 3247, -184, -22446, -52313, -61532, -84432, -156112, -155160, -116174, -80757, -110121, -85602, 514, -9508, 18675, 61243, 7604, -35619, -35724, 41465, 92360, 104108, 35209, -46033, -90000, -83422, -75061, -73448, -142065, -165883, -124709, -127679, -140508, -153307, -159342, -163696, -202341, -152229, -86852, -59359, -22984, 19557, 51195, 39738, 23267, -8986, -10294, -46830, 893, 29694, 92104, 129896, 110399, 61062, 47299, 18984, -38090, -62150, -49746, -44494, 18641, 85094, 72287, 4751]
7472D751J0372l5309j6282j2103K9485O3589m4464o1661j0632J4570P8565M9600
7460G0481o002l7778Q136k42K2163o9597o1184L5462j9709J0597O2717j5798n852
7447f606L1322L8333l1879r0275m9163n330j5452l5828R645R1225N8754k537L4365
7434B6574l7683j9251k1548m1420L1373J2228J0737m0304P88k2882k9418N8789
7422g2017N9809k5287N2623R520j4865r676K5172k0702k0809o4287k0531Q343
7410i2707o835K3516M1827K5473n1351l4361Q827M6983j6811k7375N0502J1142
7398b1170k0811L6631l631m8054j3464L2137K9490J9266l3401P862l2637j5874
7386f3656K3309l5653J1421L0274k5832n9607m1141j060j3119L2149O082N8880
$$ y = [4751, 15123, -20186, -36468, -48571, -19086, 44503, 39, -61622, -72254, -57684, 20881, 70481, 64479, 26701, 34837, 34595, 56758, -12839, -74023, -38561, -58270, -47673, 15044, -754, -6606, 24716, 63049, 31170, -59105, -108268, -113598, -129050, -164878, -155233, -64008, -5254, -7791, 26574, -11109, -30360, -51908, -93328, -61955, -49727, -38990, -79294, -78506, -101388, -130806, -72017, -12208, -37495, 15128, 24648, 9783, 107, 25279, 4577, -16232, -80519, -101050, -92707, -99542, -76026, -34199, -8726, -60077, -94438, -85611, -38628, -55439, -82814, -32312, -21170, -41981, -5350, -8981, -57035, -70499, -38362, -8872, 10394, -23007, -15145, -47782, -63656, -40347, -76000, -64579, -34305, -60137, -119744, -160885, -161945, -175064, -142915, -136833, -77953]
7374g7953L8369j5283o0692J2679L1507M0195K0160k3307l6780j065K0487m1904
7362i3587p124m0069K1090Q5205p278q5570L563J0500M047p793q754N0641J2748
7349f2381l7792o2224N0494J2215K3487k224O1285O4087J8919q5628o5288L6210
7337d8840j549J6101l456m4842M51O0484N8187K239n7624j9610p7087m932N4684
7324f5794N7121j4454M8752J295j3363k7982J4303J2441j1877M6888n4561l7161
7312d4392l2751K837J4297J0862j7046k951p0971N2006M7768L665M1341N4554
7300E9219J6159M275L1743j3506o9195m0460k0776Q229l7595j6029N282L9815
7288c2839J5636l3263j7214j9983K5446K0735j055N2932L2736K6076n2173m7503
$$ y = [-77953, -39584, -54867, -115559, -102880, -71373, -31178, -11018, -34325, -71105, -72170, -51683, -93587, -100711, -140780, -119690, -34485, -41763, -127333, -123770, -113270, -109223, -117016, -125770, -75129, -62381, -100173, -162397, -111903, -99688, -76201, -78425, -17140, 46947, 65866, -19762, -85050, -48840, -50389, -34288, -37744, -82586, -82135, -21651, 36536, 38775, -18849, -38459, -115546, -120478, -65794, -8673, -23127, 25625, 26920, 13557, -14425, -122, 12319, 442, 47330, -7231, -44392, -77143, -74306, -60009, -49147, -66193, -69144, -140115, -88109, -40341, -36676, 4665, 59219, 75378, 79653, 111396, 97890, 28695, -11765, -32541, -24312, -61907, -77936, -72654, -32839, -17203, -50466, -67680, -87663, -62217, -41482, -42537, 10395, 43131, 69207, 17034, -30469]
7276c0469p4543M080L5168n5j6856q375J8838K2943K1267N2141J2499k9207m0780
7263c3349J1556L8210o2124l504M5994L0383m3909k265K4893L4908q531m4702
7251a2440k4928J148J7811k4109n7020J3158M4009L7252p961k9831j8950K2077
7239c9784j2919j6223L3385j6908o1215J6254K4468N7503O3351j2110o9079j7213
7227e0490O960M1663m2093n4734j8454Q377O7525L4519m8948j3620K3126K9455
7215a6714n6886m7053M6442k817l3823N4545K7462l0551j4461P584N0957J14426
7203I9111N1499k6574o9599o4706n2281M0507j2892j5970k7236J6962l5151o172
7191a02502O8275L3102m4683n036k2687j061N2018O000l6280p319J03965l9866
$$ y = [-30469, -105012, -100932, -65764, -65819, -82675, -91050, -72212, -49269, -28002, 24139, 36638, 7431, -33349, -21793, 16417, -45707, -49211, -3217, 27166, -16743, -19008, 5885, 40793, 32262, -12440, -37368, -36220, -18409, -42518, -99538, -86380, -42371, -5119, -13080, -42911, -61861, -39784, -52703, -68926, -35541, -52449, -113664, -97410, -72942, -15439, 47912, 35802, -33277, -50490, -43530, -1867, -43960, -98694, -117148, -108771, -41246, -6727, -55675, -69295, -46169, -16714, -73600, -120653, -74211, -77028, -110851, -56306, -28844, -59395, -73856, -66272, -15315, 99111, 150610, 124036, 54437, -10269, -62550, -22043, -34935, -50905, -78141, -61179, -96330, -102502, -34227, -1125, -45808, -50844, -73531, -74592, -22574, -16574, -52854, -60173, 43792, 3926]
7179C926k3723K5388l216k4041l773j4217j1329M9083n863j4161r775k5262j6328
7166g3291J7333K9297N9452o097l2405o2829r612R342J3840K94P0370p019o6443
7153e7768m1588K3895J6943k0499M4690J9919l0107J4167L2697J7607L2999n9333
7141f378k1255q102J7239M0944m7473j6678k3291l9469K6191P5116m6617l1972
7129h1745k6334M848M9363Q549J1393J2929N8020L8808k4522L3954m7457o0814
7117b3008n7498j0653L4509P250o040J1087r509n6902k0653L3662K9617n5039
7105a23177k8340M3693j1246j3461K7552M2111M9100J2837R40J4886l4241J817
7093a7529n7113j7942P6698N4808k1350q622j1073l2000k2855Q057k0233J1072
$$ y = [3926, -19797, 5591, 2375, -21666, -25439, -39656, -50985, -1902, -7765, -21926, -31701, -56963, -73291, -55958, -26661, 32791, 26694, -5711, -68540, -78152, -68810, -54970, -54676, 15694, 8675, -57768, -99356, -75461, -58518, -79017, -34327, -14408, -44515, -30348, 2349, 19956, 52955, -6378, -27633, -35735, -18496, 22448, -25025, -41703, -64994, -104463, -78272, -3156, -49773, -81745, -108079, -103231, -53868, -45319, -33926, -20997, 37023, 75831, 51309, 85263, 37806, -23008, -80506, -91159, -56650, -49400, -55440, -44353, -53862, -110764, -131417, -97755, -68138, -123177, -151517, -107824, -119070, -132531, -104979, -62868, -13768, -931, 9, 14895, -19346, -17529, -74642, -92584, -15886, 38922, 17572, 8950, -2123, -34123, -56978, -48921, -69154, -58082]
7081e8082K7043j4108m5484K95O0585k003J5019m955q120n89n3723k3100J02895
7068d327J2772j0263J3811k0785n1161m2856J8689K0681r770k1927J8093R1739
7056A4696K4708q267n5925j23055R559O3513M1804K3295k9863r017o251L0636
7044b4167K8961k1186q349K9467L4177K5379L257l0179p9030j7083L9804K1064
7032B115k965l1620j6849p640k6239n6623J925P6873J9091M2159M0901M4299K731
7019H8158m4500m4011k0525m0337J0463m980M997O6910j2497M57J9179j5824P728
7006A5218K0248k7622j8819J6101K6571m7913m9303J1984p613j9694o140l3567
6994a20549N4709Q8304K8390J4229J6870l7523k2706l8710n0035Q110K053k2722
$$ y = [-58082, -31039, -45147, -90631, -90336, -29751, -31754, -16735, -21690, -29810, -30399, -84122, -107222, -4327, 8445, -1818, 11993, -8792, -59953, -102809, -84120, -63439, -73209, -95136, -77043, 14696, 39404, 31137, -24788, -147843, -138284, -74771, -32967, -9672, -39535, -48552, -54803, -24167, 4794, -16392, -24741, 4726, 38903, 64282, 67539, 37360, -41670, -58753, -18949, 2115, -850, -32470, -49319, -56959, -83198, -139821, -137896, -61023, -41932, 227, 41128, 85427, 88158, 43658, -353, -20878, -61215, -50752, -55732, -50735, 16175, 3678, 4135, 23314, 7490, 15218, 35466, 7844, -10975, 5126, 31697, -16216, -65519, -53535, -61148, -80842, -86982, -120549, -65840, 22464, 50854, 65083, 81953, 44430, 21724, -16986, -67021, -58911, -56858, -79580]
6982g9580J4106k5026J9264L3334L3858M6085q550k908L640k730m5214m9057J9141
6969d3637r360k2700J558L4711K4223L8649L7515j0269M475J0302J2508o398j0236
6956F1341l6173j3082K9242o865J2101m7015n1672N930L3577N0728j2574n1701
6944b6163J4910M2926M0026J5605N367k3289m0288l0461k7469j9234O045m1610
6932h3635k5379K3594L9839L4318j0352L4343m8521o4438j3775J49J3733O7998
6920c2126N6735n695M237m3408Q1K9123M830j7286Q5170K4613j1885l1952n4778
6907G659q261K8010k6801J1603J8877J7683N8321n339J7890J7784n7438r0045
6895a0057l3746K9319j0286J896m7917L4810M5159j0869q011J8804K6588j2314
$$ y = [-79580, -65474, -90500, -71236, -37902, -4044, 42041, 33491, 30583, 34223, 31493, -13721, -62778, -43637, -52997, -75697, -74139, -39428, -15205, 23444, 60959, 50690, 55165, 65467, 77975, 71577, 61341, 25168, 12086, 41328, 34463, 46564, -451, -52123, -46193, -12616, 38112, 25538, -26163, -11253, 31673, 71699, 87304, 92671, 69382, 29094, -1367, -28836, -48070, -42025, -83635, -109014, -85420, -45581, -11263, -21615, 12728, -35793, -100231, -114006, -113857, -100124, -32126, 24609, 18914, 23151, -20257, -20176, 8947, 13777, -3509, 81661, 106274, 94389, 62437, 7659, -602, 27408, 607, 12210, 31087, 48770, 107091, 101752, 119642, 137426, 79988, -10057, -43803, -14484, -24770, -22874, -70791, -35981, 9178, -1691, -9702, 9102, 35690, 23376]
6883B3376n3567M2053j7314j4464j8458m7464n22N2332J8806L0925M0393J07906
6871A64002R0966N9316J064M4648l0929p8746j55264r6066j0828M0841O8551n0683
6859D6872o3598j438J2679Q3867j2511j6519K2977l9512k1453J6855J1357P954
6847D7530j2929J8003J8371n635K8464N7320M4812q495m6366r0463k263J4938
6835F3287j3823j6727J700O4633O2875o2066k4226K6553r962l0105m565J1727
6823F9301p7455o2016K3675L2467j5613n8459J018P921K101n4954N7216M5257
6811b9541N9628L737r463L1113m9694P824L0987O888m1224K1664j3210o3605m9644
6798i4540O6773M9845K4224l5852k921Q597K8465L3529L7761r213n1714r478N6250
$$ y = [23376, -30191, 11862, -5452, -19916, -38374, -85838, -86360, -34028, -15222, 15703, 56096, 164002, 254968, 314284, 315348, 359996, 329067, 250321, 95057, -1009, -11837, 29004, 97555, 46872, -16726, -18164, -5485, 78382, 65871, 49352, 72329, 32817, 11364, 28219, 39576, 47530, 34601, 52604, 70975, 65340, 93804, 151124, 195936, 187441, 141075, 50612, 48349, 63287, 49464, 32737, 34437, 99070, 161945, 99879, 75653, 102206, 92244, 62139, 57574, 69301, -8154, -70170, -46495, -14028, -29641, -88100, -87082, -79161, -77060, -132014, -74798, -29541, 30087, 33824, 24361, 55474, 5780, 13604, 44591, 51479, 10255, 31919, 18709, -44896, -94540, -27767, 22078, 46302, 10450, 7529, 16126, 44591, 78120, 115881, 106668, 54954, 45476, 101726]
6785A01726K2562j1388j7570j2286l9213k9053l0258j0262p0417L9058k292J7809
6773d1584K5184K3057o09K0350M0165j2732q712O80J1236K4893j4560K8000n3204
6760D2164k7613K8903m36K9150Q330K5217M8332O844J1816L874j6460J2374O1519
6747B34014Q9765O1065L0616L1686o1263L6234P6977J6359L0409j13842l1135
6736D00885N1088J18673M2575L4050Q7773O6868J07290O6926Q8556J78781K16983
6725A460448L02361M95113Q13229J168871J342353J021901M52559M7892m27387
6716F677340r76460j353946j243164r66344o69993m14864k47029j48518j04180
6707E52842o0651m9321n6169J938l3516l3706j6870K0072j9286L611J1226r921
$$ y = [101726, 124288, 112900, 95330, 83044, 43831, 14778, -15480, -25742, -96159, -57101, -59393, -41584, -16400, 6657, 6048, 26398, 66563, 53831, 45119, 45799, 57035, 81928, 67368, 95368, 42164, 14551, 43454, 43018, 72168, 80498, 105715, 154047, 160891, 172707, 176581, 160121, 172495, 234014, 323779, 384844, 415460, 447146, 385883, 422117, 499094, 515453, 545862, 432020, 400885, 451973, 570646, 613221, 647271, 735044, 801912, 909202, 976128, 1064684, 1243465, 1460448, 1762809, 2257922, 3071151, 4240022, 5582375, 6604276, 7056835, 7104727, 6677340, 5700880, 4346934, 3103770, 2137426, 1467433, 1052569, 805540, 657022, 552842, 492191, 442870, 386701, 388639, 355123, 321417, 304547, 324619, 305333, 308944, 320170, 310249]
6695C10249p0047m7687J4660J8616l7971n6384k6554j9756l1868k3765K0610N6896
6683A06999N2132J7627n3015m4272K3594K5036M6298n4514k1421J6595k5198J0303
6671A00164m5738l2831M2150K7846j03738l98J2152k6287J1693J0091k4396j3940
6659d3232N334N8663M8839L1985j6374l2506m2359R41p22k1441k4363K0744p412
6646b1903k6765l1045K3730L8926P2520J348o6193k0501k2300p020L9412K3876
6634D085m1141m0258k5423N637l491m925O7618M3990j2436j7447K4804k3042J5831
6621f198j7494m1765K1456l4648J0081K0548M4560l5951K5271J2351J9427j2430
6609E208n7940K2903l9039j1192J7752N422l84L8232M8027n5012m4698L6018K1024
$$ y = [310249, 240202, 192515, 207175, 225791, 187820, 131436, 104882, 85126, 53258, 29493, 50103, 106999, 159131, 176758, 123743, 79471, 103065, 128101, 174399, 119885, 98464, 115059, 89861, 100164, 54426, 21595, 63745, 91591, -12147, -12545, -393, -26680, -14987, -4896, -29292, -43232, -37898, 20765, 69604, 101589, 85215, 52709, 10350, 11291, 10569, -10872, -35235, -14491, -21903, -48668, -79713, -55983, -17057, 55463, 56811, -9382, -29883, -52183, -59203, -19791, 4085, -37056, -77314, -102737, -97100, -100591, -105516, -37898, 6092, -6344, -23791, 1013, -22029, -6198, -23692, -65457, -44001, -78649, -68568, -48020, -3460, -39411, -14140, -1789, 17638, 5208, -52732, -29829, -68868, -80060, -62308, -56886, -57270, -19038, 28989, -26023, -70721, -34703, -13679]
6596a3679q648J3838q820r864l6989j0760k1408j9275L6847P5908L8243k8557
6584F836O33m0621J7334O0323K001n4662N2199O5958q9640l6670j5226j1234K9571
6571a3198M0821l1567O126j5262k4922J0259J2328O3936J6565m193J4476p236
6559F8133J0900m7676o7821J751K1704p490l3728K0232K4001j495j2788k1639
6547d5916M6244N0268k2254j3608k0782q3037j7017n0131j0931M047k398N2667
6535a12848l659L9428N0931Q065J7163r809l6488j2945r169L8599N6875p143o6715
6522d7715m3522P0267n5709o586L1285K6194k0890J1842J9396J6140J8590k1737
6510b445O424J7475p8637j1561K8003j4428J413l572M258L4974L2753K4372m0384
$$ y = [-13679, -22327, -8489, -17309, -27173, -64162, -74922, -96330, -115605, -78758, -2850, 35393, 6836, 7469, -33152, -15818, 44505, 46506, -8156, 44043, 110001, 20361, -16309, -31535, -42769, -13198, 27623, -3944, 2182, -13080, -38002, -27743, -15415, 48521, 65086, 60893, 75369, 68133, 79033, 31357, -36464, -34713, -13009, -20499, -54227, -33995, -9994, -11489, -24277, -45916, 328, 50596, 28342, 14734, -6048, -89085, -106102, -156233, -167164, -163117, -165515, -112848, -116507, -77079, -26148, -18083, -920, -10729, -47217, -60162, -69331, -30732, 26143, 19000, -47715, -91237, -20970, -76679, -83265, -51980, -25786, -46676, -34834, -15438, 702, 19292, -2445, 3979, 21454, -57183, -68744, -40741, -55169, -53756, -57328, -53070, -18096, 14657, 39029, -1355]
6497a355k1713k5795o4576k6524N1493J22242l3903k8608J3074n0543j6529L4766
6485d7971P7633K1613J2696m0872l405K2432L1370p4906o1850k1878N9215L1521
6473E598m2014p1735J2747O6070M2188J4359l5187N2403k4697l3971k8988m8545
6461i1772m028L1152O9247J1766Q187q4109l8176j6171M0532j7279k4651L3657
6449h1645O741k3538m1306M9695K4923m751p198J5732N4946l7254j2601m1442
6437i7698R075J1703K51J4736j16813k2618M0950J14168M262m1191J6205J5773
6425e1197P100L1592k0304j0670j9369O645O6686j7873O75J617l8812k0220j7474
6412h1604K3938M9144l0759L7208L9587J1796o357L3319j688q5221K6526O7291
$$ y = [-1355, -23068, -48863, -113439, -139963, -88470, 33772, -131, -28739, -15665, -66208, -82737, -47971, 29662, 51275, 63971, 23099, 19694, 42126, 73496, -1410, -63260, -85138, -25923, 5598, -36416, -108151, -95404, -29334, 12854, 27213, -7974, 44429, 19732, -14239, -43227, -91772, -95800, -64648, 4599, 16365, 24552, -59557, -97733, -113904, -73372, -90651, -115302, -81645, -74904, -98442, -139748, -90053, -65130, -69881, -77079, -61347, -6401, -43655, -56256, -97698, -88623, -76920, -76669, -61933, -178746, -201364, -160414, -46246, -41984, -83175, -66970, -51197, -44097, -12505, -32809, -43479, -62848, -56203, 10483, -7390, -6715, -5098, -43910, -64130, -81604, -57666, -8522, -39281, -2073, 37514, 49310, 42953, 76272, 74584, -10637, 15889, 83180]
6400H3180K3185Q721N911j9360n9358n8810k0378L3L7200K2646l4199k6007L6924
6387c12R717K0558l2096M1552k9673n4040o24m3197j2310O9104K1226n3792j710
6374f5597K6819k4844j0147K235K5881j033k3486l2271N541J09375L0999R610
6362E3082k6871l0144j5978K6753K3513l376q278J5480k5839j4301M6478K264
6350D2783l162j1962k9690o52P7328N216m2164R430N8917L295k8698l0163o470
6337D4008m1159O1026q1036j2205J8527K5927O5198k837p0131m0076q0827Q22
6325a12763Q3354N1533K3367K7902l0198n7218M8974k1895j8725Q40l1012n4418
6313i0259Q499m961j7625L2726l4937j9916P1632N6114k8054p9376q096M6516
$$ y = [83180, 106365, 115086, 120997, 101637, 42279, -16531, -36909, -36876, 324, 22970, -11229, -37236, -312, 9405, 29963, -2133, 39419, 9746, -44294, -44918, -88115, -100425, -31321, -10095, -63887, -65597, -38778, -63622, -73769, -71534, -45653, -46686, -70172, -102443, -96902, 12473, 43472, 53082, 26211, -3933, -19911, 6842, 30355, 26979, 18701, 34181, 8342, -5959, 40519, 42783, 39621, 27659, -2031, -2683, 74645, 79861, 37697, 47127, 106044, 109339, 80641, 50478, 44008, 2849, 63875, -17161, -29366, -10839, 15088, 80286, 77449, 7318, -32758, -113585, -112763, -29409, 22124, 45491, 73393, 43195, -14023, 34951, 13056, -5669, -4829, -35841, -90259, -81760, -86721, -104346, -71620, -106557, -126473, -54841, 1273, -26781, -106157, -114253, -67737]
6301f7737R0671M9211j5601J5398p009J5555m3246n1605m2150j8688O5957k6130
6289c5374q447L9161k1178L2045j718l2759l5316L4500j4832k4901M6909L1881
6277I971k1199p821K2514M754l1571k9848K140K9021q80L433q330r3424L0562
6264i0678J10150L7342l1003J5457K6317N3531n4168o2703K3270j3352n7755k1178
6252f4770K1520j4483K0615N2090m423j326N9581J8080J1214q6128o6001M617
6240d9414k1992o045m4204J4164K0457L9749K4102L6267k9240j6399L465K7122
6228a968k1611m0474M6314j0949N34J2285L698K7614P115k5731k003j5621K317
6215a8480l7751J9473K5333j8289l5482j8118J6930M6216L9498l9935k3072j4245
$$ y = [-67737, 22934, 72145, 56544, 71942, 64933, 80488, 37242, -14363, -56513, -75201, -9244, -35374, -43821, -4660, -25838, 6207, 4489, -28270, -63586, -29086, -43918, -68819, -21910, 9971, -11228, -19049, 3465, 8219, -23352, -53200, -51060, -22039, -22919, -19486, -27816, -121240, -90678, 19472, 56814, 25811, 41268, 67585, 121116, 66948, 4245, 27515, 14163, -43592, -64770, -43250, -57733, -37118, 14972, 10549, 9223, 68804, 86884, 98098, 11970, -54031, -49414, -71406, -77451, -121655, -107491, -87034, -47285, -23183, 13084, -16156, -32555, -29090, -1968, -23579, -64053, -17739, -28688, -28154, -15869, -12171, 15443, 22558, -3173, -5176, -20797, -18480, -56231, -36758, -11425, -29714, -65196, -83314, -66384, -20168, 19330, -20605, -43677, -57922]
6203e7922j5336N5757O3983l9548o1595l989Q66m846L3633K448l9078k2379m60
6190h8466O1583k3611k8118M0445R249j8650k075N6183L3382p22j359R293l208
6177D3926n3721j0126m6815J1771J6500l0922k3709l0471K8187Q1468L5406K7240
6165D8734k0948J6721k9401J3084O306m68l1851j1908M523j9322k3697L4933k3064
6152c6358P232O577n96J7253K6730l1518l0362l7952J5785N8084K7817k7861m9395
6139e4564n2230O0513P6696O685n83o0917K2356J0454m8370N0126J6982l5564
6127h416m7733J622K769J6495l4291M9363K4010m0105J7229l3916l1458q472K8826
6114f4077j7578O4523P494j1598J7013j7534q918J2410J8368k63p1467n5332n595
$$ y = [-57922, -73258, -17501, 46482, 6934, -54661, -58650, -57784, -62630, -28997, -26549, -65627, -88006, -88466, -26883, -50494, -78612, -38167, -28918, -47568, -49643, 6540, 39922, 39200, 37841, 47134, 43926, -9795, -19921, -66736, -54965, -38465, -69387, -93096, -123567, -95380, -13912, 21494, 48734, 27786, 44507, 15106, 28190, 34496, 34028, 2177, -9731, -5208, -24530, -48227, -13294, -36358, -29126, -22549, -23145, -5892, 20838, -10680, -41042, -78994, -63209, -5125, 22692, -5169, -54564, -106794, -46281, 30415, 37100, 36517, -24400, -2044, 8410, -39960, 10166, 27148, -8416, -56149, -54527, -51758, -35263, -69554, -20191, 3819, -36286, -19057, -52973, -84431, -92903, -64077, -81655, -17132, -9638, -21236, -4223, -21757, -30675, -18265, 103, -160, -71627, -126959, -132554]
6101a32554Q7890J3469p2020n0108L2014L1751k8318K1099K2038L3020L5902P1562
6089F5745j0369k7601j6910n814q590R80o1944N924j6660q633M1919J8316m9964
6076g3601j5318Q0748K4440l580k3647k3037L6935m284k5872k075K2786K2832
6064A6327K2630K9087j9867m0779o5642j4647N5606O8387M0897M9466j9378j3033
6052A09054k0418q5400K3067L2518l0661K3225M2500k7408j30908m5100j1476
6041a21007j0978M3371J04096O0490k4897o4111j5982J8891M5041J4436j646K3254
6029G0958j9132l3118P3644M8322k2287J2773k535p4542j31759J0276K1649n344
6017e1095M8474k555K4741l4595q038N5978L9378J508n2748n2611j1975j6835
$$ y = [-132554, -44664, -31195, -103215, -153323, -121309, -89558, -117876, -96777, -74739, -41719, -5817, 65745, 55376, 27775, 10865, 5051, -3539, -2559, -64503, -58579, -75239, -83872, -41953, -23637, -73601, -88919, -8171, 16269, 12689, -10958, -33995, 2940, -1344, -27216, -29291, -6505, 16327, 38957, 68044, 48177, 7398, -58244, -72891, -17285, 51102, 91999, 141465, 122087, 109054, 88636, 3236, 26303, 58821, 28160, 51385, 93885, 66477, -64431, -109531, -121007, -131985, -88614, 15482, 75972, 51075, -13036, -29018, -10127, 34914, 49350, 47704, 70958, 51826, 18708, 92352, 140674, 118387, 131160, 128625, 54083, -77676, -67400, -45751, -51095, -2621, -5176, 19565, -15030, -23068, 32910, 72288, 73796, 21048, -31563, -43538, -60373]
6005f0373K9074K7267P21k7418m0255P396M1224l4497q97L2025K6270l7630K9805
5992g288L600L9461l424q321K86J5087k523j6628n2926j8869N8113L0200p7319
5979d0551K980L7965j3375j104N711n0449j1747j8347J2854m5926j0011M3812
5967h8188O0698K3021m0662N6605O7412n8751p4509j674P4487O1763K5949p2233
5955C3918m5505J513j9034k7343N9229P7200k6209n9232K736N1237l5688m6030
5943c3208j7119Q114O3757l1537k1112j6501l7742K5750O1285Q948o6239M218
5931e1386K1626M2898M0497R233k0164k3192o0997l5233l2328O353j2006O8992
5919d5707p3558L3053O4663M8938J2418O128j1529k8848L0532k5649k8249m2843
$$ y = [-60373, -31299, -4032, -3311, -30729, -70984, -63588, -22364, -56861, -57758, -25733, 537, -37093, -7288, -3688, 35773, 32349, 24028, 24314, 39401, 36878, 20250, -32676, -51545, 6568, 36768, -40551, -37571, 394, -12981, -14085, -8374, -58823, -70570, -88917, -76063, -121989, -132000, -88188, -27490, -4469, -45131, 11474, 78886, 20135, -54374, -56048, 18439, 80202, 106151, 33918, -11587, -10074, -29108, -56451, 2778, 79978, 53769, -5463, -2727, 48510, 12822, -33208, -50327, -42213, 21544, -9993, -31105, -47606, -85348, -59598, 1687, 10635, -55604, -51386, -29760, 13138, 53635, 62868, 42704, 19512, -41485, -76718, -109046, -102693, -114699, -45707, -119265, -86212, -21549, 27389, 39807, 45935, 34406, 5558, 36090, 10441, -17808, -60651]
5907f0651j8015J4294K8379l530K5975K0318n0992N5935K7948M7723k7361r2448
5895c2425m8471K3570K475M1396J3239K6875M3588R64l76l6364K1002J2809N999
5882G4281o581m6152J634L6323R22l1377q7617q256N818P4669J5514l1576J7831
5869A5433L1396m5861K1981L0571k5908L906j4238P959n3574r9227m3869O7609
5857a03822J08472J3518Q20l5629n5819m600J1428J9400N121k0772K3993L6954
5845i36j4302J6801N577l940k7892j328M6439k2190m765Q329j5060n2075k9648
5832i4990J446l9771q595O4355Q3486O2370n669R025k4642n8333j8262l091l0833
5819f3504j8040M5338O2291L4566j8751L551j9571k5245l109k3213J9776k371
$$ y = [-60651, -78666, -64372, -35993, -39523, -13548, 6770, -44222, 11713, 39661, 87384, 60023, -32425, -80896, -57326, -54851, -13455, -216, 26659, 70247, 71211, 70835, 34471, 55473, 68282, 74281, 67700, 21548, 23182, 59505, 60427, 29050, -58567, -66823, -61005, 13664, 29178, -2398, 15433, 46829, 968, 22949, 53520, 27612, 31518, 17280, 25239, -28335, -127562, -171431, -103822, 4650, 18168, 18988, -16641, -72460, -77060, -65632, -46232, -41111, -61883, -37890, -936, -15238, 1563, 7140, 3200, -24692, -26020, 20419, -1771, -6536, 1793, -13267, -65342, -94990, -93544, -133315, -141910, -77555, 5931, 68301, 62632, 71657, 47015, -11318, -29580, -32671, -63504, -81544, -36206, 26085, 60651, 41900, 45451, 25880, 635, -2474, -25687, -5911, -8282]
5807h282n8579j4559k1587K8844M3102K3380L2106K9572m3948k6300K4664P988
5795A6401m6717q7289R0071M1914m2083n3642n1652O3452N3084o26L9654q81J698
5782B3384l3340o421J8650j5032k8539j0810j314O7953P641j6212J3904M264J8294
5769D2422j2797j480l2132k1261R788k5881K936J7472L4887l075m1887K753k7377
5756e5632P2964j8758q6608K9111J24025M3054k4579n4222o291l3417q241J184
5744a7410J8444k4413j1276j6737O9755P086q3868J3472L6949k1406r6O535M945
5731a8020L8564k4988K0748L2087j875k0467K9242J3486N41k2154o3778n0170
5719f6784K7379M5111K9509m644N861K9251k2150o4902N866j3143k2786O389K9985
$$ y = [-8282, -66861, -81420, -103007, -74163, -31061, -7681, 24425, 53997, 10049, -16251, 8413, 16401, -30316, -117605, -27534, 14380, -27703, -81345, -132997, -69545, -16461, -17087, 22567, 21686, 23384, -9956, -16377, 2273, -12759, -41298, -52108, -53422, 14531, 22172, 5960, 19864, 24128, 42422, 29625, 28145, -3987, -25248, -15460, -41341, -38405, -20933, 13954, 10879, -31008, -28255, -55632, 17332, -1426, -88034, -58923, 65102, 108156, 83577, 29355, 23064, -10353, -18594, -17410, 1034, -23379, -34655, -51392, 18363, 25449, -58419, -44947, -7998, -29404, -29500, -22965, -18020, 20544, -4444, 16304, 48391, 46516, 26049, 55291, 68777, 69318, 47164, -16614, -66784, -39405, 5706, 35215, 30571, 36432, 65683, 43533, -21369, -15503, -28646, -51432, -45043, -15058]
5706a5058J6709j295L6543o591k7811k7799O0341M22j7805k196m272k9520j9079
5693c7411k1565N2927j4862L1982L0082n3695p4706k2073L9468O797l3222l5363
5681a31641J2445O1476L3449P96J6667o28L5717j468m9997l778J0739K3470p7903
5668g0656k7088j3231O7312N5059M4926l7674j5017K0377j8366j2020Q511N7502
5656E9635n981l4149n3150l3292j4013n7372K3126L8578J252M656j6817l2192
5644a19719J2870M941J3666p407M4226Q032J5148N2853k0524l0527J22J6469J692
5631h158K1581J1394L298l7567k0027l1081M8710n097l1108J1887L887M4362m259
5618G822J8690J1203n5853M9679j7263j7288l9891q0441l2605j7387L6799N1491
$$ y = [-15058, 1651, 356, 36899, 30308, 2497, -25302, 35039, 35461, 17656, 15460, 11188, -18332, -37411, -58976, -6049, -20911, 11071, 41153, -12542, -87248, -109321, -69853, -63056, -96278, -131641, -119196, -57720, -24271, -23475, -6808, -7436, 28281, 26813, -23184, -26962, -16223, 7247, -70656, -97744, -110975, -43663, 11396, 56322, 18648, 3631, 24008, 5642, -6378, 2133, 59635, 53654, 19505, -33645, -66937, -80950, -138322, -115196, -76618, -75366, -70710, -87527, -119719, -106849, -101908, -88242, -95649, -51423, -43391, -28243, 24610, 4086, -26441, -26319, -9850, -8158, 13423, 24817, 28115, -9452, -29479, -60560, -11850, -16947, -48055, -36168, -32281, 12081, 7822, 26512, 37715, -18138, 31541, 14278, -3010, -42901, -123342, -155947, -173334, -136535, -85044]
5606h5044M7484j2313j3811M7407Q364O379N2570J2797m8515j6995j8669n1100
5594g1446l1221K8383R2395M5468J409J1867Q648n9051j1701M9076k1430m5715
5582c318O1118J7861j4683k1956m064J0948o5088l4414N077K7523K6329L0140
5570C5473k4084K9154K3660L0824n5741n9991K4169M643k3884M5464n578q137
5558A5972K8661l8830K8882q832l8228n1384P3063K9843p3882m3799J8380J5163
5546d4991o037L2214j7913L780J0337j9069j9723M8859M5677j2197j0523j184
5534I230l1030M3738K3146k4772m6154K3284P001j2074j147M851J2065N17j9955
5521a1300o5338l0921q876J765J141k0213O7252M2942o2036k4166N5839L3400
$$ y = [-85044, -37560, -49873, -63684, -16277, -7913, -1534, 51036, 63833, 15318, -1677, -20346, -71446, -102667, -74284, 18111, 63579, 64988, 76855, 85503, 26452, 14751, 63827, 42397, -3318, 57800, 75661, 60978, 39022, 34958, 45906, -19182, -53596, -48519, -20996, 5333, 35473, 11389, 40543, 64203, 95027, 39286, -20705, 3464, 8107, -15777, 29687, 24109, 15972, 44633, 5803, 34685, 25853, -12375, -63759, 9304, 39147, -34735, -78534, -60154, -44991, -51028, -18814, -36727, -32947, -22610, -41679, -61402, -12543, 33134, 20937, 10414, 9230, -21800, 21938, 45084, 20312, -25842, -2558, 4443, -7631, -8778, -3927, 8138, 8655, -11300, -76638, -107559, -116435, -114670, -113529, -133742, -66490, -23548, -85584, -109750, -53911, -20511]
5509b0511P6470L2907k9670J733n8691j5644j473l746L3972j1988l6763M1120
5497G716J1230q326L5523K7825j8295J3258m1085l3501k5284j0034L8000J2927
5485I954M8937L1433L3176m0759n5881m5390J2927J3470l2921k3457M0273N7329
5473D9091l0823k747l0718j8950k7473L316O3713P6344k7848l3266L7534O987
5461F5160J9342O2409j5038q4175l5166K9789N4129n5842K0209K4844n8226j6176
5449A1259Q570j4925l0417J4061k4699j8399L942J0697N3078n763q569N446L6621
5436D0902l1255m4400j485j2701o212k9492J2162M7266O57N8649o8967j5752J8842
5423c1786P114O638J01859q040n8548k9291K440K4619J4804O9118Q482l5935k6077
$$ y = [-20511, 55959, 88866, 59196, 60929, 2238, -13406, -14879, -18625, 15347, 3359, -33404, 7716, 18946, 10620, 46143, 73968, 55673, 68931, 27846, -5655, -30939, -40973, -2973, 9954, 58891, 90324, 123500, 82741, 26860, -18530, -5603, 7867, -25054, -48511, -8238, 49091, 18268, 15521, -15197, -34147, -61620, -58304, 5409, 81753, 53905, 20639, 58173, 65160, 84502, 146911, 131873, 47698, 12532, 42321, 96450, 40608, 60817, 85661, 27435, 11259, 19829, 4904, -25513, -11452, -36151, -54550, -50608, -39911, 13167, 7404, -1165, 4281, 40902, 9647, -34753, -36238, -48939, -55151, -84643, -72481, -25215, -24558, 34091, -34876, -50628, -31786, -24672, -18034, 83825, 75785, 17237, -12054, -9614, 15005, 29809, 98927, 107409, 71474, 45397]
5410D5397P4553l1473o4857j2592l1097m899Q7801M3847l8731o5579j606N521
5398F285j1621l7143j205J5943J0375N9151Q281l01j8187J393k9149K7563k1478
5385I907r0234k7678O9646O3345j5656j0596l1272k7727n5780j0269K9191K3240
5373g3883l0091n599j048l5783J9161P2507Q449N2565k3209j7623k0503k667l8601
5360i6325K2749Q472R495L3295N193L203M314j7605J02509Q8319j9458l1402J2678
5347A25437n3566k8335m8694p3405r469O0523M573N6660J9168k1033N988n1703
5335a3856M10j9893O399J6665p206m429j9454K9664J8741K2223k9643K80j9481
5322a9580O444R8807n141l1238k1627p8382k7782j5380m2377j8974M7590j6401
$$ y = [45397, 119950, 88477, 23620, 11028, -20069, -24968, 62833, 106680, 67949, 2370, 764, 6285, -5336, -42479, -43684, -27741, -17366, 41785, 50066, 49765, 31578, 32971, 3822, 31385, 9907, -80327, -108005, -38359, 24986, 9330, -1266, -32538, -60265, -116045, -126314, -97123, -73883, -103974, -109573, -110621, -146404, -127243, -54736, -46287, 6278, -16931, -34554, -55057, -57724, -96325, -73576, -65104, -55609, -22314, -17121, -13918, -9604, -27209, 75300, 163619, 144161, 112759, 125437, 71871, 43536, -5158, -78563, -88032, -27509, -22936, 33724, 52892, 31859, 37847, -13856, -13446, -33339, -26940, -10275, -17481, -21910, -41364, -11700, 7041, 29264, -379, -99, -19580, -13136, 85671, 80530, 49292, 27665, -50717, -78499, -93879, -136256, -155230, -107640, -124041]
5310a24041m2127m2201N6880J05085M7552J7242P121k2998J2k2587Q826K6340
5298A5104L3032L0725j2426k6218l332q1094o84J8771J2896J1056l0351n7054
5286h9575M9363k7385J0724M8793J4846L2150l0203o6177J9972M7820K5292l4607
5274A013k5491J590j0123K906o2431r402k217J7926J4526K6630J4542o06l0447
5261f1584n479J1780L5839K5740l0754Q299k011K09l8215n1861K1352l2947j9822
5248a39454Q7815L4578P582l2811M586J5788O3699m824r617K2671M9531k6226
5236G3318J238l6667J5143K1453o7026m519l0184k0364L2283Q723k6310l7014
5224f9926J9452J4663L396L988K6993k0210N2425K6684k3823r298l4018j3509
$$ y = [-124041, -166168, -208369, -151489, -46404, 1148, 18390, 25511, 2513, 2525, -20062, -11236, 15104, 48136, 78861, 66435, 40217, 36885, -44209, -44893, -26122, -13226, -2170, -32521, -89575, -40212, -67597, -56873, -8080, 6766, 38916, 8713, -57464, -37492, 10328, 35620, 1013, -24478, -22888, -33011, -30105, -92536, -101938, -104155, -86229, -71703, -45073, -30531, -31137, -61584, -67063, -55283, -19444, 6296, -24458, -16159, -18170, -17961, -56176, -108037, -86685, -119632, -139454, -51639, -17061, -9479, -42290, -37704, -21916, 41783, 36959, 27342, 50013, 99544, 73318, 74556, 37889, 53032, 74485, 7459, 2940, -27244, -47608, -15325, -6602, -32912, -69926, -50474, -35811, -32415, -28427, -1434, -21644, 30781, 57465, 33642, 24344, -9674, -23183]
5212b3183m3494p8553L256N7841n637J0236O7404K167J53k7810j8542J4545M3033
5199A416R9478J9420n6930r4021k891N1361p492J056L2555J1376l1013j7592l4944
5186b8221o3500n6442L0849j0018l3791k1467J8744Q279M8201Q8497M1793l0150
5174g226m8745l1981J8827j8803j7903K145L4954M2932N8106N236j5628j8302
5162C612J907p930M46N3551l5124k3928O1501m801l5002l6001o297K1001P18l6522
5148d2869o4783l3797J9193K3598J4438K6550j2326j1616O3983L0765R261K1577
5136D3974j6841j2761K7974P455N4549M7675n3205k1696j8625j8176k8467l0472
5124a8616n1507N3152m2118J6217M4168R054j07149J9861Q3561K4227j7803l7353
$$ y = [-23183, -66677, -145230, -141974, -84133, -89770, -79534, -12130, -9963, -9810, -37620, -56162, -41617, 1416, 100894, 120314, 63384, -30637, -33528, 17833, 10341, 11397, 43952, 55328, 24315, 6723, -28221, -91721, -148163, -117314, -127332, -161123, -182590, -163846, -155567, -107366, -18869, 22924, -7226, -55971, -87952, -69125, -87928, -105831, -103686, -68732, -25800, 32306, 37542, 21914, 3612, 5519, -2411, -1965, 51586, 16462, -7466, 54035, 49234, 14232, -21769, -28066, -7065, -6347, -42869, -107652, -141449, -122256, -98658, -84220, -57670, -69996, -81612, -17629, 13136, 22397, 43974, 27133, 14372, 42346, 49801, 104350, 152025, 98820, 77124, 58499, 40323, 11856, -18616, -70123, -16971, -59089, -42872, 1296, 10350, -96799, -76938, 6623, 30850, 13047, -24306]
5112b4306J4122N4823O4990j562q0753r381m3451J7901N6716k6738q1516K9445
5100b9710K279k6243N186J8658K13P47N7231r297n6523K9170K8389M3729k217
5087F1612m2715n6134l0491J5737q906J339O1848L099m2146J613J2388O005J7491
5074G40J1214P629j3639m5741M6980J5777p4290K494K5489L4419L0940K953j989
5061D2976j6580K7572o3795l1811l4090k240J5526O3311K1676k1637J7178N0971
5049F9057l3381j6434q820K2752L4804o1617M562L6389K9209K0298j7197J0411
5037I0033Q183l6537k6387n2336m0546K457K6905Q5064Q598l1454j4025j1944
5025H011j2900N0770N3087k3498n9389l6468n5319j9297K1613O9709J4220P284
$$ y = [-24306, -10184, 44639, 109629, 108067, 27314, 17933, -25518, -7617, 49099, 22361, -59155, -29710, -27431, -53674, -48488, -29830, -29617, -28870, 28361, 19064, -37459, -8289, 20100, 63829, 61612, 18897, -37237, -67728, -51991, -60897, -59558, 2290, 5389, -36757, -35144, -22756, -16751, 740, 11954, 19583, 5944, -39797, 7183, 22960, -51330, -48836, -23347, 11072, 42012, 44965, 42976, 26396, 53968, -9827, -41638, -75728, -77968, -62442, 869, 22545, 908, 18086, 69057, 35676, 19242, 10422, 33174, 67978, 6361, 10923, 47312, 76521, 96819, 79622, 90033, 98216, 61679, 35292, -17044, -57590, -55133, -28228, 56836, 65434, 33980, 19955, 8011, -4889, 45881, 98968, 75470, 16081, -20387, -75706, -95003, -73390, -3681, 10539, 17823]
5013A7823O1838K0907o521j8730m0240q1622L474N7045P2398L2898K2401o4478
5001G7193j7984m9756k7118K1553m3372j6018j2690J2245O0721M790m9202n502
4989d5140j3804k4331N1926O5677P905q3250J2978L6950j056P985j8389M332k060
4976b77P64K3610K7573l0266m9338k2084K3878L3197K1863M7467l69k9422j2829
4963C3767m4682k7046o8677K3815k6757k9573j943J7079Q2802K8649M154q9120
4951i7532j4895l5780L941R043J4720K5487P570M7558J1134L1584K5178r473M458
4938B2993j4072k3321k2159k3601L496N9869J7187o6873l9358N936m4385K200
4926a22088N307j4226j0215Q7018K9748k5676N5178J3635J754K743o9672J2202
$$ y = [17823, 79661, 100568, 94047, 75317, 35077, -46545, -43071, 13974, 86372, 119270, 141671, 77193, 59209, 9453, -17665, 3888, -39484, -55502, -68192, -55947, 4774, 9564, -39638, -45140, -58944, -83275, -31349, 34328, 42233, -41017, -28039, 8911, 7855, 15840, -2549, 1783, -277, 487, 24097, 51670, 21404, -27934, -50018, -26140, 7057, 28920, 76387, 76018, 46596, 33767, -10915, -37961, -106638, -82823, -109580, -139153, -141096, -124017, -41215, -12566, -8412, -97532, -112427, -148207, -144266, -135223, -120503, -95016, -87446, -39888, -28754, 2830, 28008, 18535, 22993, 8921, -14400, -36559, -60160, -56664, 3205, 20392, -46481, -85839, -79903, -124288, -122088, -116781, -131007, -141222, -54204, -24456, -50132, 5046, 18681, 20435, 23178, -46494, -34292]
4914c4292O3925m9306k0829K8248K3057N5333J1180m68k667p237p7451L1997M3202
4901F4692n0690p360p3119m6469O0176R5820K4471j7867k7240K3346M2616m1463
4889D6913K8998L0509p676l5028l8535k2053J6969J7844K7306j06386L0031J2855
4877A747o5152q972O0137O4283K4281m845l5460l0190l8301o7900k5878J0338
4865a15912Q7318M8571K8533k2276o6819M3563K078K6916j4462k1673m4364J6138
4853c2389K348J9612M840p8295K1530P7441j0086n5983j05156L2080O0381L3245
4841c0432K3473q552O135M143P204N7170N5735j0887m8870K447J8182m4944k6682
4828D122p0756L2654J6673J3256O1137n7704p3030j1787O4992L298N572L848N3613
$$ y = [-34292, 29633, -19673, -40502, -12254, 10803, 66136, 77316, 76848, 74181, 66944, -10507, 21490, 64692, 14002, 6642, -66477, -112946, -52770, 43050, 67521, 49654, 22414, 45760, 88376, 46913, 75911, 106420, 98744, 63716, 25181, 3128, 20097, 37941, 65247, -41139, -11108, 1747, -63405, -72377, -12240, 52043, 76324, 71479, 36019, 5829, -32472, -100372, -126250, -115912, -28594, 19977, 48510, 26234, -40585, 2978, 5056, 31972, 17510, -4163, -48527, -32389, -30041, -10429, -5589, -83884, -62354, 15087, 5001, -50982, -156138, -124058, -63677, -30432, -6959, -15511, -9376, -5233, 1971, 59141, 114876, 103989, 55119, 57566, 75748, 30804, 4122, -66634, -33980, -17307, -4051, 57086, -618, -73648, -85435, -20443, -17145, -11573, -7725, 45888]
4815D5888k4664n3705j1032m8481K100Q4679L9556m7160K6362K3065o4392j1899
4803c9683M1975K5776K0372O623j8261n3482j2952O5089l6742k784J3703j2805
4791c171l4123O153J9288m030R027L6451P2995k0272j0884k7880m2825k5712j7132
4778d2115R295o607N0728k6010n1293k3317M0273L1445N201k29l9183j2215L9170
4765b4857Q5864K8466M394m4385l8193q668j4806j4269l1390n4236k0248m403
$$ y = [45888, 21224, -32481, -43513, -91994, -89894, -5215, 34341, -12819, 13543, 36608, -27784, -39683, 2292, 28068, 48440, 55063, 36802, -16680, -29632, 35457, -1285, -4069, 9634, -3171, -37294, -31141, -11853, -15883, -6856, 29595, 102590, 82318, 71434, 43554, 729, -24983, -42115, -32820, -39427, 11301, -14709, -66002, -89319, -49046, -17601, -12400, -12629, -51812, -64027, -24857, 61007, 89473, 93867, 49482, 11289, 2621, -12185, -26454, -57844, -112080, -132328, -136731]
$$ [...]
##END NTUPLES=NMR SPECTRUM
##END=
