##TITLE=Analysis number 323674
Compound Code cc 52213
Book Reference 467/98
Project Code adrs
Chemist Name benw
##JCAMPDX= 6.0         $$ Bruker NMR JCAMP-DX V2.0
##DATA TYPE= NMR SPECTRUM
##DATA CLASS= NTUPLES
##ORIGIN= Bruker BioSpin GmbH
##OWNER= nmr
$$ XWIN-NMR		Version 3.5
$$ Thu Nov  2 11:53:42 2006 GMT Standard Time (UT+0h)  MAYBRIDGE\nmr@NMR_250MHZ
##.OBSERVE FREQUENCY= 250.131544655141
##.OBSERVE NUCLEUS= ^1H
##.ACQUISITION MODE= SIMULTANEOUS (DQD)
##.ACQUISITION SCHEME= undefined
##.AVERAGES= 16
##.DIGITISER RES= 18
##SPECTROMETER/DATA SYSTEM= dpx250
##.PULSE SEQUENCE= zg30
##.SOLVENT NAME= CDCl3
##.SHIFT REFERENCE= (INTERNAL, CDCl3, 0, 16.522)
##AUDIT TRAIL= $$ (NUMBER, WHEN, WHO, WHERE, WHAT)
$$ ##TITLE= Audit trail, XWIN-NMR		Version 3.5
$$ ##JCAMPDX= 5.01
$$ ##ORIGIN= Bruker BioSpin GmbH
$$ ##OWNER= nmr
$$ C:\u/data/dgb/nmr/ADRS/2000/pdata/1/auditp.txt
$$ ##AUDIT TRAIL=  $$ (NUMBER, WHEN, WHO, WHERE, WHAT)
(   1,<2006-11-02 11:53:12.37 +000>,<MAYBRIDGE\nmr>,<NMR_250MHZ>,
      <created by zg, POWCHK disabled, PULCHK disabled
       configuration hash MD5:
       49 4B E0 1D 92 C2 6B 37 9F E6 65 BC 52 41 86 1D
       data hash MD5: 64K
       4A 0E AE 04 84 2A 0C C9 5E 8F B9 36 8B AB 93 AB>)
(   2,<2006-11-02 11:53:28.89 +000>,<MAYBRIDGE\nmr>,<NMR_250MHZ>,
      <Start of raw data processing
       ef LB = 0.3 FT_mod = 6 PKNL = 1 SI = 32K 
       data hash MD5: 32K
       CF 7B 32 58 11 54 33 66 1A 30 A2 A7 48 EF 71 70>)
(   3,<2006-11-02 11:53:30.56 +000>,<MAYBRIDGE\nmr>,<NMR_250MHZ>,
      <apk 
       data hash MD5: 32K
       20 BD 5C 70 96 8B 2A C7 5F 99 AE 17 BE C2 1C 17>)
(   4,<2006-11-02 11:53:31.36 +000>,<MAYBRIDGE\nmr>,<NMR_250MHZ>,
      <abs ABSG = 5 
       data hash MD5: 32K
       83 0A 3C DD 29 2B 99 00 36 61 9A A7 BB 11 30 D0>)
$$ ##END=
$$ 
$$ hash MD5
$$ A7 B3 91 14 30 0A 77 B4 92 53 60 D7 CF AF F8 04
##$RELAX= 
##$RELAX= 
##$RELAX= 
##$RELAX= 
##$RELAX= 
##$RELAX= 
##$RELAX= 
$$ Bruker specific parameters
$$ --------------------------
##$DU= <C:\u>
##$EXPNO= 2000
##$NAME= <ADRS>
##$PROCNO= 1
##$TYPE= <nmr>
##$USER= <dgb>
##$AMP= (0..31)
100 100 100 100 100 100 100 100 100 100 100 100 100 100 100 100 100 100 
100 100 100 100 100 100 100 100 100 100 100 100 100 100 
##$AQSEQ= 0
##$AQ_mod= 3
##$AUNM= <au_zg>
##$AUTOPOS= <5 >
##$BF1= 250.13
##$BF2= 250.13
##$BF3= 250.13
##$BF4= 250.13
##$BF5= 500.13
##$BF6= 500.13
##$BF7= 500.13
##$BF8= 500.13
##$BYTORDA= 1
##$CFDGTYP= 0
##$CFRGTYP= 5
##$CHEMSTR= <none>
##$CNST= (0..31)
1 1 145 1 1 1 1 1 1 1 1 1 1 1 1 1 1 1 1 1 1 1 1 1 1 1 1 1 1 1 1 1 
##$CPDPRG= <>
##$CPDPRG1= <>
##$CPDPRG2= <>
##$CPDPRG3= <>
##$CPDPRG4= <mlev>
##$CPDPRG5= <mlev>
##$CPDPRG6= <mlev>
##$CPDPRG7= <mlev>
##$CPDPRG8= <mlev>
##$CPDPRGB= <>
##$CPDPRGT= <>
##$D= (0..31)
0 1 0 0 0 0 0 0 0 0.06 0 0 0 0 0 0 0.0002 0 0 0 0 0 0 0 0 0 0 0 0 0 0 
0 
##$DATE= 1162468391
##$DBL= (0..7)
120 120 120 120 120 120 120 120 
##$DBP= (0..7)
150 150 150 150 150 150 150 150 
##$DBP07= 0
##$DBPNAM0= <>
##$DBPNAM1= <>
$$ [...]
##$SUBNAM7= <"">
##$SUBNAM8= <"">
##$SUBNAM9= <"">
##$SW= 20.6930455092707
##$SWIBOX= (0..15)
0 0 3 0 0 0 0 0 0 0 0 0 0 0 0 0 
##$SW_h= 5175.983436853
##$TD= 65536
##$TD0= 1
##$TE= 683.16
##$TE2= 300
##$TE3= 300
##$TEG= 300
##$TL= (0..7)
0 120 120 120 120 120 120 120 
##$TP= (0..7)
150 150 150 150 150 150 150 150 
##$TP07= 0
##$TPNAME0= <>
##$TPNAME1= <>
##$TPNAME2= <>
##$TPNAME3= <>
##$TPNAME4= <>
##$TPNAME5= <>
##$TPNAME6= <>
##$TPNAME7= <>
##$TPOAL= (0..7)
0.5 0.5 0.5 0.5 0.5 0.5 0.5 0.5 
##$TPOFFS= (0..7)
0 0 0 0 0 0 0 0 
##$TUNHIN= 0
##$TUNHOUT= 0
##$TUNXOUT= 0
##$USERA1= <user>
##$USERA2= <user>
##$USERA3= <user>
##$USERA4= <user>
##$USERA5= <user>
##$V9= 5
##$VALIST= <valist>
##$VCLIST= <CCCCCCCCCCCCCCC>
##$VD= 0
##$VDLIST= <DDDDDDDDDDDDDDD>
##$VPLIST= <PPPPPPPPPPPPPPP>
##$VTLIST= <TTTTTTTTTTTTTTT>
##$WBST= 1024
##$WBSW= 4
##$XGAIN= (0..3)
0 0 0 0 
##$XL= 0
##$YL= 0
##$YMAX_a= 54978
##$YMIN_a= -46383
##$ZGOPTNS= <>
##$ZL1= 120
##$ZL2= 120
##$ZL3= 120
##$ZL4= 120
##$ABSF1= 16.522
##$ABSF2= -4.171173
##$ABSG= 5
##$ABSL= 3
##$ALPHA= 0
##$AQORDER= 0
##$ASSFAC= 0
##$ASSFACI= 0
##$ASSFACX= 0
##$ASSWID= 0
##$AUNMP= <proc_1d>
##$AZFE= 0.1
##$AZFW= 0.1
##$BCFW= 0
##$BC_mod= 0
##$BYTORDP= 0
##$COROFFS= 0
##$CY= 12.5
##$DATMOD= 1
##$DC= 0
##$DFILT= <>
##$DTYPP= 0
##$F1P= 14.0000005364418
##$F2P= -0.99999901652339
##$FCOR= 0.5
##$FTSIZE= 32768
##$FT_mod= 6
##$GAMMA= 0
##$GB= 0
##$INTBC= 1
##$INTSCL= 1
##$ISEN= 128
##$LB= 0.3
##$LEV0= 0
##$LPBIN= 0
##$MAXI= 10000
##$MC2= 0
##$MEAN= 0
##$ME_mod= 0
##$MI= 0
##$NCOEF= 0
##$NC_proc= -7
##$NLEV= 6
##$NOISF1= 0
##$NOISF2= 0
##$NSP= 0
##$NTH_PI= 0
##$NZP= 0
##$OFFSET= 16.522
##$PC= 1
##$PHC0= -42.13302
##$PHC1= 2.929706
##$PH_mod= 1
##$PKNL= yes
##$PPARMOD= 0
##$PSCAL= 4
##$PSIGN= 0
##$REVERSE= no
##$SF= 250.13
##$SI= 32768
##$SIGF1= 0
##$SIGF2= 0
##$SINO= 400
##$SIOLD= 32768
##$SREGLST= <1H.CDCl3>
##$SSB= 0
##$STSI= 32768
##$STSR= 0
##$SW_p= 5175.98343685301
##$SYMM= 0
##$S_DEV= 0
##$TDeff= 65536
##$TDoff= 0
##$TI= <Analysis number 999999
Compound Code 99
Book Reference 9
Project Code 9>
##$TILT= no
##$TM1= 0
##$TM2= 0
##$TOPLEV= 0
##$USERP1= <user>
##$USERP2= <user>
##$USERP3= <user>
##$USERP4= <user>
##$USERP5= <user>
##$WDW= 1
##$XDIM= 32768
##$YMAX_p= 356438836
##$YMIN_p= -865610
$$ End of Bruker specific parameters
$$ ---------------------------------
##NTUPLES= NMR SPECTRUM
##VAR_NAME=  FREQUENCY,     SPECTRUM/REAL,   SPECTRUM/IMAG
##SYMBOL=    X,             R,               I
##VAR_TYPE=  INDEPENDENT,   DEPENDENT,       DEPENDENT
##VAR_FORM=  AFFN,          ASDF,            ASDF
##VAR_DIM=   32768,         32768,           32768
##UNITS=     HZ,            ARBITRARY UNITS, ARBITRARY UNITS
##FACTOR=    0.157963299565203, 1,           1
##FIRST=     4132.6476996994, 0,             0
##LAST=      -1043.33573715361, 0,           0
##MIN=       -1043.33573715361, -865610,     0
##MAX=       4132.6476996994, 356438836,     0
$$ Real data points
##PAGE= N=1
##DATA TABLE= (X++(R..R)), XYDATA
$$ [...]
17711C72102Q3192L5311j75856J18595K51925q7149m26535k2068J23632m0476
17701B32673R688j63497m0564p0834l966J58263Q1667J57J58517k8510k02305
17690A31289j94982Q5111L11438K7934j25353r6594m4322J70693m0824l4697R9443
17679B89136R3587K22778K80668Q21J217P5769K78432R4810N737j95393j38840
17668A008722m6901J2528N3247J53582k2099n2298j38898J07193q4828m066J64132
17657A150314j72894k60848j39018J76684N1419k1067Q0344q9461J75132K86152
17647A236757J02190J31584r9663l10592k09147R5437J45302J85089J3306K06441
17637A496704K34744K69675K46402J50746M10147J00046L24109O76189P82097
$$ y = [372102, 455294, 490605, 314749, 433344, 685269, 598120, 171585, 149517, 273149, 232673, 242361, 78864, 38300, -32534, -36500, 121763, 203430, 203587, 362104, 333594, 131289, -63693, 21418, 332856, 360790, 235437, 138843, 94521, 265214, 224390, 189693, 289136, 382723, 605501, 886169, 886990, 888207, 963976, 1242408, 1337218, 1342955, 1147562, 1008722, 961821, 974349, 1027596, 1181178, 1159079, 1106781, 967883, 1075076, 990248, 986182, 1150314, 977420, 716572, 577554, 754238, 805657, 784590, 864934, 775473, 950605, 1236757, 1338947, 1470531, 1370868, 1060276, 851129, 946566, 1091868, 1276957, 1290263, 1496704, 1731448, 2001123, 2247525, 2398271, 2808418, 2908464, 3232573, 3908762, 4690859]
17628D690859R85596J334983K104316K993648M021335M313154L480860J999025
17620B5923776M02675l73841K2003J223251K226748J654278n94431k645037m223432
17611B3615990m756250l816119k655669k295325j793581j114292q93185m16730
17603E874839m74834k80468k76843k79564k12599p5189o6436j0236J2552L8419
17593D249641J07615K04384J92916l7601j77062n6995J03018K04628L98965O41882
17583E831391O07977R96117J979147K628992L729670N092078O059420O461448
17575C3386240N086276L160734Q86022o9648N03539J848188K977577J774560j264176
17566D8289312m501462o798435p063052o202235m688420l503820k582575j718612
$$ y = [4690859, 5676455, 7011438, 9115754, 12109402, 16130737, 20443891, 23924751, 25923776, 26326451, 25952610, 25974613, 27197864, 29424612, 31078890, 30484459, 27839422, 23615990, 18859740, 15043621, 12387952, 10092627, 8299046, 7184754, 6291569, 5874839, 5400005, 5119537, 4842694, 4563130, 4350531, 4275342, 4208906, 4198670, 4211222, 4249641, 4357256, 4561640, 4754556, 4716955, 4539893, 4482898, 4585916, 4790544, 5189509, 5831391, 6439368, 7435485, 9414632, 12043624, 15773294, 20865372, 26924792, 33386240, 38472516, 41633250, 42519272, 42449624, 42953163, 44801351, 47778928, 49553488, 48289312, 43787850, 36989415, 29926363, 23724128, 19035708, 15531888, 12949313, 11230701]
17558A1230701j454361j270266q79912n77024m38057m49612m08409r2498n14j4222
17548E645826n7360Q9694k31865j02026n4084K0272p1135N6089J15699J40580
17538E551690K02972J67480M07231P12307Q49528J118636J729231K398498L243854
17529A6381427L594385L359910K542477J716521J594321K632842M347599N869856
17521D2039338O184617N162096L132670J192714L5773o79780j122001j421734
17513E4523693j658780k111538k426523k848879l533498m197119m709996m766688
17505B8270672m704688m039255l438603k726241j659843j049613j081346j127426
17497H443657o82597m32076m66885k16308k18744k21938k41090j91361k17640
$$ y = [11230701, 9776340, 8506074, 7626162, 7049138, 6611081, 6161469, 5753060, 5660562, 5660048, 5645826, 5588466, 5678160, 5446295, 5344269, 5290185, 5310457, 5239322, 5295411, 5411110, 5551690, 5754662, 5922142, 6329373, 7041680, 7891208, 9009844, 10739075, 13137573, 16381427, 19975812, 23335722, 25878199, 27594720, 29189041, 31821883, 36169482, 42039338, 48223955, 53386051, 56518721, 57711435, 57747208, 57067428, 55945427, 54523693, 52864913, 50753375, 48326852, 45477973, 41944475, 37747356, 33037360, 28270672, 23565984, 19526729, 16088126, 13361885, 11702042, 10652429, 9571083, 8443657, 7761060, 7328984, 6862099, 6645791, 6427047, 6205109, 5964019, 5772658, 5555018]
17488E555018k82701p7751J09255Q245R112m2284n6120J08122L0767K81133L85735
17477F028531M85105P30345O98819J256332K161535K801762L509638M153051M466329
17468B6291447M286885L668459K943930K394897J372747N84089k81917p53382
17460D0507155j154177k041387k553748l190222l785793m008809m000349l755342
17452A6017328l057090k130289j661590j209895p12254m98738k44344N0633k34234
17443F319527m79723n89667p16841l53058k15777n44083l99023j00407k25325
17434B695623k85931j76058m3715j52007j63084o8319k74120l8009K07083o0823
17424A640640l93053n5095l6621k62094l5644O5380j05608j08911K28461l866
$$ y = [5555018, 5272317, 5194566, 5303821, 5312066, 5321178, 5278894, 5222774, 5330896, 5361663, 5642796, 6028531, 6513636, 7243981, 7942800, 9199132, 11360667, 14162429, 17672067, 21825118, 26291447, 30578332, 34246791, 37190721, 39585618, 40958365, 41542454, 41260537, 40507155, 39352978, 37311591, 34757843, 31567621, 27781828, 23773019, 19772670, 16017328, 12960238, 10829949, 9168359, 7958464, 7246210, 6747472, 6503128, 6553761, 6319527, 5839804, 5250137, 4533296, 4180238, 3964461, 3420378, 3021355, 2920948, 2695623, 2409692, 2233634, 2189919, 2037912, 1874828, 1806509, 1532389, 1494380, 1701463, 1640640, 1247587, 1192492, 1155871, 893777, 858133, 923513, 817905, 708994, 937455, 933589]
17414I33589J14229L9592j5657Q793m6692j47848j68881K8345k0620J03904J50397
17403I79151j05918j28169m5991j09379J73150N1280O1457N2505l975j80330o2707
17392F81074L4704L3053l8470M028n6733j56172J7973n4519k01665o0002J2308
17381B15579J69197r8819r5284K8199R7629l9171k2522l6756M9228J2093K4393
17370C03766p1042l3437m0075k0264L5401K14930L9898j21736M2681J36244R8730
17359E85096k57916l0484k84459J2805K07454j21875j00020P3360O2446N5601
17349B02008J29680q9733j2231Q4934L22493K93872m22424j53204M5733j57080
17339B44048k01413j36330J51790R5823j86891j21687o8851P0239K65481M91749
$$ y = [933589, 1047818, 1087410, 1071753, 1080546, 1033854, 886006, 717125, 745470, 724850, 828754, 979151, 873233, 745064, 699073, 589694, 762844, 814124, 875581, 928086, 924111, 743781, 681074, 715778, 748831, 710361, 714389, 657656, 501484, 519457, 464938, 263273, 203271, 215579, 384776, 285957, 190673, 218872, 316501, 277330, 254808, 218052, 267280, 279373, 303766, 232724, 199287, 159212, 138948, 174349, 389279, 429177, 307441, 350122, 486366, 585096, 327180, 296696, 12237, 25042, 232496, 110621, 10601, 83961, 146407, 202008, 331688, 241955, 229724, 314658, 637151, 931023, 508599, 355395, 401128, 244048, 42635, -93695, 58095, 153918, -32973, -154660, -223511, -153272, 112209, 603958]
17329F03958J59151m88976k59768j06221J16848K84751J18582j89352j73927L4282
17319I9328m636J65381k5590N8908J25691l2970j07687j80288q3190J65028m5105
17308A34870j9292Q188j68663p5726q3073L0404k58447J37357L66271K34808j90668
17297A16029J15114k36337j12576Q6461K7927J17289M4900j8823j97358J36884
17287G9510O4697j73057k8723n8836J67642O0702k1835m3115j680M126K326J11888
17275A63645o6771m5040j20056J89131K56357j08192j49954j1449K24983n5315
17265B77339q3092l6520r3145j62902k08964M6115L38314n5614j57755J29449
17255f775p6386j04828J53842J22568m9478r0106q4979j22347O0285R7914L6922
$$ y = [603958, 763109, 274133, 14365, -91856, 24992, 309743, 428325, 238973, 65046, 99328, 94692, 260073, 234483, 293391, 419082, 386112, 278425, 98137, 14947, 179975, 134870, 115578, 123766, -44897, -120623, -203696, -173292, -431739, -294382, 71889, 306697, 116029, 231143, -5194, -117770, -31309, -3382, 113907, 158807, 139984, -57374, 79510, 144207, -28850, -57573, -116409, 51233, 111935, 90100, 46985, 45305, 49431, 51757, 163645, 96874, 51834, -68222, 120909, 377266, 269074, 119120, 107671, 332654, 277339, 194247, 157727, 64582, -98320, -307284, -261169, 77145, 21531, -136224, -6775, -83161, -187989, -34147, 88421, 38943, -51163, -136142, -258489, -198204, -100290, -63368]
17244f3368J1148j61846R7253J78415l691q5139Q8127K2624k15775L0190L72529
17233B70467J91744j43524j37610k48129j15963j31928j00642j49695Q3077J55538
17223c26665J40352J15454L9835O190J43901o5530K81997J35156k49316j40764
17213H0610j9364k21199j70024K30099K12828Q0935l0242n7624J8301j4737K10307
17202C19890k13751l46964j54652J01176o473R4253J10711J38835j23541M7100
17192c3416R7408K39905J87378j33276l05033l1787j09845j97344k4741J22784
17182a87967K27621j08296j42597J69486L1445j45103m8874K3601j56241j2255
17172c49180R4851K36340J10078r3922k25610n467J34222K0310o530k46173j54218
$$ y = [-63368, -52220, -214066, -116813, 61602, 57911, -27228, 60899, 83523, -132252, -102062, 270467, 462211, 318687, 181077, -67052, -183015, -314943, -415585, -565280, -482203, -326665, -186313, -70859, -31024, -24834, 119067, 53537, 335534, 470690, 221374, 80610, 61246, -159953, -329977, -99878, 112950, 193885, 163643, 106019, 124320, 109583, 319890, 106139, -240825, -395477, -294301, -300774, -206521, -95810, 43025, -80516, -33416, 63992, 303897, 491275, 357999, 52966, 21179, -88666, -286010, -310751, -187967, 39654, -68642, -211239, -41753, -10308, -155411, -204285, -180684, -336925, -349180, -254329, -17989, 92089, -1833, -227443, -232910, -98688, -78378, -84908, -331081, -485299]
17161d85299P0782J80106Q5826k75614j51215J74089J02802R7928L3921L24306
17151A57632j28254k30440k50899o9695j07110n5348q8496K99923P4367J35686
17141b62634N6060n3030j20379m8618O0161K54272J24050p2971P0064j25284k59485
17130c77794k4358R9691K4359J66142j1250k45639j50961q827J47272L21269J34518
17119G4422K6746j37285q2726J53307J03083o5180o0231L821J03338J6401J48858
17108B84554J28464j6389J8089j44492k01291j28153j16792P3216J89608J86356
17098B73170R674j23644k69995j03477R2080k11360J73809K07436j6373k09759
17088a78439J17727J37223p2465r8226n3624n6242j24495Q7007k1673j33280P1986
$$ y = [-485299, -414517, -234411, -148585, -424199, -575414, -401325, -298523, -200595, -166674, 157632, 29378, -201062, -451961, -521656, -628766, -684114, -772610, -472687, -398320, -262634, -206574, -259604, -379983, -428601, -368440, -114168, 9882, -63089, 6975, -118309, -377794, -402152, -302461, -278102, -111960, -123210, -368849, -519810, -528637, -381365, -60096, 74422, 101168, -36117, -118843, 34464, 137547, 72367, 12136, 15957, 119295, 135696, 284554, 413018, 396629, 414718, 270226, 68935, -59218, -176010, -102794, 86814, 273170, 282844, 159200, -110795, -214272, -122192, -333552, -159743, 47693, 31320, -178439, -60712, 76511, 4046, -94180, -147804, -204046, -328541, -241534, -263207, -396487, -324501]
17077c24501K06058K00755K3600P2585j3978q274k2449k12151j5046O4223K74273
17066B45095J33927N971o0588K44649j2295j78482j00645j89154k62764q858m6754
17055b29898J50997L44852O447k02146j6051M6762j4211n6597M9669J04776p4312
17044A10288k02729J34337o0696j67215k2107r7352k7298R6986J7049J41323l35484
17033d12898j61580L21922P0098L1967m7277k1193Q3200j42232J19270J29384
17023b9339n8001J1331P0500p2065L3273j70776j00603M9544J91412J60434N2705
17012A38415M0546N4151N0962J9471p4021J68152r3323q2487n3298j39601J99431
17001B28398J56218R4916j36615k05215j75744N7113m4301o6788Q4705M7144m5941
$$ y = [-324501, -118443, 82312, 105912, 178497, 164519, 156245, 133796, -78355, -93401, -29178, 245095, 379022, 384993, 324405, 569054, 556759, 378277, 277632, 88478, -174286, -183144, -229898, -78901, 265951, 272398, 70252, 54201, 100963, 86752, 30155, 79824, 184600, 110288, -92441, 41896, -18800, -186015, -208122, -305474, -332772, -235786, -218737, -77414, -412898, -574478, -252556, -182458, -150491, -197768, -218961, -135761, -277993, -158723, -29339, -87340, -76009, -5509, -77574, -44301, -215077, -315680, -266136, -74724, 85710, 138415, 178961, 233112, 284074, 303545, 229524, 397676, 304353, 221866, 168568, 28967, 228398, 384616, 479532, 342917, 137702, -38042, 19071, -25230, -92018, -7313, 39831, -6110]
16990f110m2347q0249n3891k10641J02565p409L1179J02185O4096l2965J2164
16979a21423K36074l7821j44593J5120k1329j47714J10572J07804J87456J50212
16969C34358p7481r9289j14300K9510J51727J02951J19723n3559P04j59152j78173
16958E7019p7109J16561K3063p1009J26792k3801j25806j43999K34823O9229l8420
16947A47343K4771l6477o1507n9800p5893L7622L809j3956J16539j29578k84699
16936c31826K2529L65112R6624P7413n7037n3531n6206J62249J17660j17573k31569
16925f155J48442J43490P2760r2162j39484K6526k45604l68326J97672J70105
16915i2736P4416L8266J24669l8424k48094j41995j82945K81822K70899j69546
$$ y = [-6110, -48457, -128706, -182597, -393238, -290673, -298082, -266903, -164718, -100622, -133587, -121423, 114651, 76830, -67763, -52643, -73972, -221686, -111114, -3310, 184146, 334358, 256877, 157588, 43288, 72798, 224525, 327476, 447199, 393640, 394344, 235192, 57019, -20090, 96471, 119534, 48525, 175317, 151516, 25710, -118289, 116534, 185763, 147343, 172114, 135637, 74130, 14330, -61563, -23941, -20132, -34088, 82451, -47127, -331826, -309297, 55815, 152439, 229852, 172815, 119284, 63078, 225327, 342987, 225414, -6155, 142287, 285777, 358537, 266375, 126891, 153417, -92187, -460513, -262841, -92736, -18320, 19946, 144615, 106191, -141903, -283898, -466843, -185021, 85878, -83668]
16905h3668j36788j27028J50265J00864O6764P8950k5553j2461j83016o4808J7836
16894b18643j19476k01456J31134P3339J40210k0855J53935M0622p7482l8778
16884a37450j27455J02919N8265J07911N884k7770p0850N7021J02182M1202k19707
16873a07848j04138J37410J65057j44327o4958M9419J21248k3318j27649N030
16863i4074j46997m4849J14152J13258R2403j83139m7105K33684K9826J68493
16853B35652K13287r4622j19857K7541L2747k01668P2800L5300m6692l03953l9790
16842a89255N8257K08754M4170Q4306K69027L6900k00414l78092k10103J99004
16832g7446n3370m2820M2803j65006j4162J74739J68602M4391j24071k8686Q8673
$$ y = [-83668, -220456, -347484, -197219, -96355, -29591, 49359, 23806, 11345, -171671, -236479, -218643, -338119, -539575, -408441, -335102, -194892, -215747, -61812, -21190, -98672, -137450, -264905, -161986, -103721, 4190, 10074, -17696, -88546, -31525, 70657, 111859, -107848, -211986, -74576, 90481, -53846, -118804, -69385, 51863, 28545, -99104, -94074, -241071, -285920, -171768, -58510, 33893, -149246, -196351, 37333, 67159, 235652, 448939, 354317, 234460, 262001, 294748, 93080, 165880, 201180, 154488, -149465, -189255, -130998, 77756, 121926, 206232, 475259, 512159, 311745, -66347, -276450, -77446, -130816, -173636, -130833, -295839, -310001, -135262, 33340, 77731, -46340, -75026, 13647]
16821A3647p4238j02114K8666M444j22751k2068j04090R3443K12773J0516k66351
16810c28123L2744J68028j00497Q9477K37037K98071r3935l26181p7212O0623
16800c9968o3281n7925M7567L25097L7692p844m1515p4824p2705J86399j22423
16789A16270n8808P0360L00686o133l13484o18j14744o8865L4719K42516N5946
16778B57845j52096L2227N5659o6824q3799j56286j57987J25163J81620L0367
16768F5889j36519q8486n9051J1502J10683J47746O2103J37251j27594Q5216j76853
16757C1887j46241Q9728O832L7734P785J4119O2823J90865p1274M5624r7603k38835
16745f6556k58593m1871J32471N2909J00293K90231Q5899p6325o2143r1312j82539
$$ y = [13647, -60591, -162705, -134039, -129595, -252346, -274414, -378504, -285061, -72288, -61772, -328123, -295379, -127351, -227848, -138371, 98666, 396737, 302802, -23379, -100591, -39968, -103249, -161174, -113607, 211490, 249182, 241338, 199823, 124999, 52294, 238693, 116270, 57462, 127822, 428508, 422375, 108891, 108273, -6471, -75336, -40617, 201899, 257845, 105749, 137976, 193635, 126811, 43012, -113274, -271261, -146098, 35522, 65889, -70630, -159116, -218167, -206665, -95982, 51764, 113867, 251118, 123524, 208740, 31887, -114354, -24626, -17794, 19940, 27725, 41844, 104667, 295532, 224258, 269882, 172279, -66556, -325149, -367020, -234549, -181640, -81347, 208884, 294783, 218458, 156315, 65003, -117536]
16734a17536m9439K70060P5324L6353k7543r6741p8994K5325j08250J97201j44058
16723a8298j17479J94233J67515q3679j37158L5166L0060n1504m7048j46912k43092
16712d18196m3989K27091L66007J01155j78894q3987M7654N3358k1357j15349
16702f6507J6632J51227m6105k7350P2969p728K0120m6080l69825o1359J71098
16691a92908K27990N7681j39893n9498N1921O3511o267k7226r2774q9309l9399
16680b46171p5257r3665K00576K43511N9027O389k50655j12773J88869K35420
16670A55271J65204j24127k19061j42113O7115Q3218O4164k24371j09414P333
16660b76781J75355k9815P3254J05544p4746q3499M3964K7527K8437M0001J09911
$$ y = [-117536, -166975, 103085, 178409, 214762, 187219, 90478, 11484, 36809, -71441, 125760, -18298, -135777, 58456, 225971, 142292, 5134, 40300, 70360, 18856, -28192, -175104, -418196, -462185, -235094, 130913, 232068, 53174, -30813, 16841, 70199, 48842, -66507, -49875, 101352, 55247, 27897, 100866, 93138, 113258, 67178, -302647, -364006, -192908, 35082, 92763, -47130, -106628, -54707, 8804, 2537, -24689, -117463, -206772, -246171, -321428, -415093, -214517, 28994, 88021, 94410, -156245, -269018, -80149, 155271, 320475, 196348, -22713, -164826, -97711, -14493, 49671, -174700, -284114, -276781, -101426, -131241, -57987, 47557, -27189, -110688, -66724, -39197, -10760, 29241, 139152]
16649A39152R048P7742j26476r9285L0716o2925k09833Q1313J03903J48797l4589
16638E7563r8095l6329N9238J09987Q8298j54765j44606q6078O9258K48715L13543
16627D26729k9224l39900l84077K4863M7316J422P6420m0196j48405K7751k8336
16616c65637P1657O5635j786K4412N4263L1270j9612R8465m9492K22037K16044
16605C47256j06461j16630j7n5631j54153k20286L6693J87700J45594p935j18438
16594f2308L9091M7642J33511j30892l51138J3136J53086L08405P0768j45411
16584G5890j56453j45822J55353K13480K5703R8628l1117j62116r9182k43392
16574b69028p0283R8628J98767Q5368j41320j38349O8329K8679q8877J81904o6489
$$ y = [139152, 148200, 225942, 99466, 181, 30897, -32028, -241861, -160548, -56645, 92152, 57563, -40532, -76861, -17623, 92364, 180662, 25897, -118709, -204787, -135529, 113186, 426729, 397505, 57605, -326472, -301609, -254293, -252871, -176451, -216647, -365052, -337301, -365637, -293980, -228345, -230131, -205719, -151456, -120186, -139798, -41333, -90825, 131212, 347256, 240795, 124165, 124148, 68517, -85636, -305922, -269229, -81529, 64065, 56130, -62308, -23217, 24425, 157936, 27044, -324094, -310958, -157872, 150533, 221301, 75890, -80563, -226385, -71032, 142448, 168151, 266779, 235662, 73546, -25636, -269028, -339311, -240683, -41916, 43452, -97868, -236217, -167888, -139209, -228086, -46182, -112671]
16563a12671J1589J19456J4941j97175N9288J71343n4998J13414R7796M3128j46987
16552A19124j4242q1514j14921J31482j24498p1577L6302N2515L19606L4906j53215
16541A33968M5245k3099M0102n6634j51251o7061M1462R4572j4780j05977R6687
16530C3234q0891j50824O9576L61302J96611p4829k26253j45499k9209k58845
16520c05627n8210j0882n5326J6496J71346K75481j41613q6981J8405m6344j05461
16509c28716R6241Q49Q2885K2432j27573j2261K12376r6614k7323J15788J88713
16498A26797o390j67907k77573J24715j02593J2818K56037J45184j05115o2476
16488e6503J05408P6465o8146r649R388Q6936r7661l0791J7421J07540N3616m6878
$$ y = [-112671, -101082, 18374, 33315, -163860, -104572, 66771, 11773, 125187, 222983, 266111, 119124, 104882, 23368, -91553, 39929, -84569, -156146, -119844, -67329, 252277, 287183, 133968, 179213, 156114, 196216, 139582, -11669, -78730, -37268, 57304, 42524, -63453, 33234, -47657, -198481, -128905, 232397, 429008, 354179, 127926, -17573, -46782, -305627, -363837, -374719, -430045, -413549, -242203, 33278, -108335, -195316, -176911, -223255, -328716, -232475, -231626, -148741, -126309, -253882, -266143, -53767, -150381, -177704, -61916, 126797, 120407, -47500, -325073, -200358, -302951, -290133, -34096, 111088, 5973, -56503, 48905, 125370, 57224, 47575, 56963, 143899, 46238, 15447, 32868, 140408, 194024, 147146]
16476A47146j66866j8574k39642J5218K39716k5905o2531M5969j6495J3235k5840
16465i4569j07011r9281R2202N215j88470j7471J65094P1986l8411O1017p506
16454a57205q6523L333R6808J23151L7597r4247j00783K52384j07640q8105M8695
16443g2535O2131O0799o8632J07893r6505j1002K03350J49j33578j29143n607
16432h2680K85176J34439j46315o8165j53768m7333J69254J43939j31917j15256
16422a2626Q6498o5762l39102j2058j2142j22947L18065Q9364N811J9182o0454
16411a06171J32406n1113k66316k4228J73858K37014r0622j41719l4444J37378
16401c3957Q5132j46301k20375p3703j1094l5417K88517J60426o1766l2709j34440
$$ y = [147146, -19720, -38294, -277936, -262718, -23002, -48907, -111438, -65469, -81964, -68729, -94569, -201580, -300861, -208659, -203444, -391914, -409385, -244291, -172305, -210716, -149699, -157205, -243728, -240395, -143587, -20436, 17161, -77086, -177869, 74515, -33125, -121230, -72535, -10404, 50395, -18237, 89656, -6849, -17851, 185499, 185648, 52070, -77073, -82680, 202496, 336935, 190620, 122455, -31313, -78646, 90608, 234547, 102630, -12626, 73872, 8110, -330992, -343050, -355192, -478139, -160074, -70710, -64899, -45717, -106171, 26235, -24878, -291194, -315422, -141564, 95450, 4828, -136891, -171335, -33957, 51175, -95126, -315501, -389204, -400298, -435715, -147198, 13228, -48538, -81247, -215687]
16390b15687j06122J94895R9618m56518r8787K39337J01828J22448K46934j90528
16380f2582M3408L00261k7166j6370J814j42296K2887P5327j36757k36647j19841
16369b97962J35284R9447J63534J7733k40199k16042J13904K3978J32880J40049
16359G2606K5009k73818r9546K37194J57836j20221M303J15167N7652p2247M663
16348A08598k11079M5189J51000J7096k8485j23541L9748j7240j74668q1684Q0140
16337a94926J21549j7928o6346j87497L876K9219P6474j46616J37761J31094j60845
16326b74185N2454K49134J24574l8476q3580J36218P6150N3443J0468j57603m6030
16315A02567J43294N9062k2210k68402j55415M9563p8563Q7696Q1626p1092J27842
$$ y = [-215687, -321809, -126914, -27296, -483814, -582601, -343264, -241436, -118988, 127946, -62582, -19174, 281087, 253921, 237551, 239365, 97069, 119956, 195283, 58526, -178121, -297962, -162678, -63231, 100303, 118036, -122163, -338205, -224301, -200323, -67443, 72606, 97615, -176203, -275749, -38555, 119281, -940, 3363, 118530, 176182, 103935, 108598, -102481, -57292, 93708, 110804, 82319, -41222, -1474, -18714, -193382, -275066, -194926, -73377, -91305, -157651, -345148, -341272, -312053, -235579, -382195, -244434, -113340, -274185, -221731, 27403, 151977, 113501, 29921, 166139, 242289, 295732, 306200, 148597, 102567, 245861, 304923, 282713, 14311, -141104, -91541, -170104, -82408, -782, -71874, 55968]
16304E5968M9585L8068O2199J33007o524K1900r8440k54236q1789O276P7455o6628
16292f3159k4926L2784j33661K07135J23717o5101j34998p8689j2311l7584Q2709
16281a04084j07624k42862n6904p4720K02230O0792J20414J96389K4666K8250
16271D6547L675J3464j74027M0894J33648m8448r3311j00628o5319j08149K0622
16260c31032j83218K17512J81676l3167j24846N6310l1038P0924J40626l15066
16250c51319j49919J37263Q5868K25356p5054n9634o9380J99249L0239k70457
16240b97788M0891J57488L5351m7348j25564J56019J91450n9121m9586k9635k26447
16229b54290m6897k9643j04510K37419J31090r7516J41870J13477j11577L159
$$ y = [55968, 105553, 143621, 205820, 338827, 332303, 354203, 255763, 1527, -80262, -73986, 3469, -63159, -88085, -55301, -188962, 18173, 141890, 76789, -58209, -136898, -149209, -186793, -104084, -211708, -454570, -511474, -586194, -383964, -323172, -202758, -6369, 18297, 46547, 50222, 63686, -110341, -69447, 64201, 15753, -77558, -178186, -243505, -351654, -331032, -514250, -296738, -115062, -148229, -273075, -216765, -247803, -176879, -36253, -351319, -501238, -363975, -278107, -52751, -127805, -187439, -256819, -57570, -27331, -297788, -256897, -99409, -64058, -111406, -236970, -80951, 110499, 51378, 1792, -27843, -254290, -301187, -330830, -435340, -197921, -66831, -164347, -22477, 91000, -20577, -17418]
16219a7418J15659J76090j66559j24374j9145q5946J00864J46151J66507J26935
16209D18764m9054J08412p5148j48819j51393k07097L9235J49963n5926j34122
16199a05185K02020R5988L8727j44203k34151M1378j3039m2536o4822N6106L30817
16188A61100R4425j00483n2265k9697p3895j70279P4338L20388K4518r516l4251
16177B04383K4022j21789k13714q1104O8859J40428J24468j84503M1953m7023
16167d4020r143K43039J07385j19304k06655p4537k0373k7331N1425L2582j0082
16156g7014M1323R308q4851j44105m0246o1202J93880J39903P7020j40534j75974
16145b62492j04395R772J61023J76691m9000j71289K64935L44513M8686j01292
$$ y = [-17418, 98241, 274331, 107772, -16602, -35747, -121693, -20829, 125322, 291829, 418764, 369710, 478122, 402974, 254155, 102762, -104335, -65100, 84863, 28937, -105185, 96835, 192823, 231550, 87347, -146804, -105426, -118465, -161001, -225823, -169717, 161100, 255525, 155042, 102777, 73080, -815, -171094, -96756, 223632, 248150, 238634, 204383, 228405, 106616, -107098, -188202, -119343, 21085, 145553, -38950, 3003, -44020, -53163, 189876, 297261, 177957, -28698, -103235, -123608, -150939, -99514, -66932, -77014, -35691, -26383, -111234, -255339, -295585, -356787, -162907, -23004, 54016, -86518, -262492, -366887, -357115, -196092, -19401, -68401, -239690, 25245, 369758, 418444, 317152]
16135C17152M1763j40247k32880n7627K52753j11362L4947J37728j41774j63415
16125f2962k0662o9053K0560Q9855K5265P6954j09942p3896R5434J03635r9131
16114b3943j37939J31015j71786p8656N0579K08094J16629R015m1034R381P44
16103G2099j22790K9654p0430l8033Q6885K5481J74249P8755q8190j535J32591
16092B78736O6247r4262j7488j19009j94009j37249R1739J56960K64319J8287
16082C14271j75046l0641k11657L9219L98155J72231j73613Q0357L5894K2233
16072D71403j12963k3981J6397j10287k43105k27646N3298J33700p1048j10590
16062b24822j20777J83183P0085J12080Q7046m8346q5203J9128j8334p7314j086
$$ y = [317152, 358915, 218668, -14212, -71839, 180914, 69552, 104499, 242227, 100453, -62962, -83624, -152677, -132117, -42262, -16997, 59957, -49985, -123881, -28447, 75188, -23943, -161882, -30867, -202653, -281309, -230730, -22636, 93993, 103008, 61974, 71355, 72099, -50691, -21037, -91467, -129500, -42615, -17134, 157115, 235870, 147680, 146145, 278736, 344983, 250721, 233233, 114224, -79785, -217034, -125295, 31665, 295984, 314271, 139225, 108584, -103073, -63854, 334301, 506532, 332919, 413276, 449170, 471403, 358440, 334459, 350856, 240569, -2536, -230182, -176884, -43184, -114232, -224822, -345599, -162416, -92331, 19749, 106795, 58449, -26754, -7626, -25960, -103274, -104360]
16051a04360K08411M9966j30542J06642O3930k5886l59623k14933j15046J21958
16041c99483J62010J33893J32965j33236P7417j7304k01000j67649L29335K02731
16031A19679l1285J4306q3442j6198m252k6646K24082p5552j7414j59500L2972
16020b3250K94714K26072J37299p6298k10090m18196q4280n0878O9074J8025J36293
16009A8485k8557M3300J17298l3553j77065j31251J28453J30070j4696j10925
15999e8441N6887K2696q7741R4894k3408k4527l9966K7904O5416j7095j60437
15988a43818j62960M1124J01873J30699j18460j1830j668O9580J38516R1679J09840
15977B44575j2236L9460J14251R7114j87970p0889j49384M998J49767K5120j02777
$$ y = [-104360, 104051, 154017, 23475, 130117, 194047, 168161, -191462, -406395, -521441, -399483, -237473, -103580, 29385, -103851, -26434, -43738, -244738, -412387, -83052, 119679, 88394, 102700, 19258, 3060, -1192, -27838, 196244, 120692, 103278, -56222, -23250, 271464, 497536, 634835, 558537, 348447, -69749, -154029, -204907, -135833, -117808, 18485, -10072, 33228, 150526, 116973, -60092, -191343, -62890, 67180, 52484, -58441, -1554, 21142, -66599, 28295, 4887, -19640, -59606, -31702, 33714, 16619, -143818, -306778, -265654, -163781, -33082, -151542, -163372, -165040, -95460, 43056, 134735, 244575, 232339, 271799, 386050, 483164, 295194, 224305, 74921, 79919, 229686, 254806, 152029]
15966A52029j41467j48876J22794K01891P0907j66905L5293M7987R9196P4118
15956C46967p8233R070j55833L5122j04035L2331K89154J48868j53074k89476
15946H0861n6986J26507J5429M0142r9535o4713L925m5324j40667L1261j15473
15935b24573j54504R1964J6502p8303l9679J51564P0242Q5012J68047L4281L0738
15924A51291j33801M797M7784n0634j40066k791J90961J28381j55994J59469J41023
15913C40420k05978o4241K4355j25821l6971m6679j83770O1353J23349N1216L4378
15902b8389P2171j39313l33023L8559L13605L574j45150O2803K3858j45680j0709
15891b87694j77388K5579o7838l2311J96685J99109J08166O2873l7792o7836n9112
$$ y = [152029, 10562, -138314, -15520, 186371, 257278, 90373, 125666, 173653, 272849, 346967, 268734, 277804, 121971, 157093, 53058, 85389, 374543, 523411, 370337, 80861, 23875, 150382, 165811, 205953, 106418, 41705, 45630, 306, -140361, -109100, -224573, -379077, -287113, -270611, -348914, -388593, -237029, -166787, -81775, 86272, 120553, 151291, 17490, 22287, 70071, 19437, -120629, -123420, 67541, 195922, 39928, 199397, 340420, 134442, 70201, 94556, -31265, -68236, -114915, -298685, -237332, -113983, -62767, -28389, 43782, -95531, -428554, -389995, -76390, -72816, -217966, -155163, -131305, -276985, -287694, -465082, -439503, -507341, -539652, -342967, -143858, -35692, 27181, -10611, -78447, -137559]
15880a37559r7166J27825l9386o9310j3229K7056J4477P441J8367j47387J34384
15869a74487O9383p6829r0731j01750k6911j671J21355R5078L1382J74781K2829
15858D2429j38269R2636n1139j82200J19179L44561o9446o8161k16272l45292
15848d71974J1758R2265j16989j811L09496K38876j84914j02647J33172N8233
15838c4535k91977k52662K1966P8517R9612M10247K29590j13990k84958L4437
15828a03753M1788K9853m3431J06336n0767J97085o5041o6609o4749J8174R621
15817H507P6816J52270j09155j50716j10252O1532J98923L7331k9121L705J05309
15806B45149J30147j16111l67755R0546n7498o5361J43697J86279r2936j62765
$$ y = [-137559, -234725, -106900, -146286, -215596, -228825, -201769, -187292, -179851, -161484, -308871, -174487, -105104, -181933, -272664, -374414, -401325, -402996, -281641, -186563, -155181, 19600, 42429, -95840, -3204, -54343, -236543, -117364, 227197, 157751, 89590, -126682, -471974, -460216, -367951, -484940, -486751, -177255, 61621, -123293, -225940, -92768, -34535, -326512, -579174, -557208, -478691, -379079, 31168, 260758, 146768, -138190, -103753, -61965, -32112, -75543, 30793, -19974, 177111, 112070, 45461, -19288, -1114, 8507, 85323, 237593, 128438, -22278, -132530, -70998, 127925, 165256, 136135, 139840, 245149, 375296, 259185, -108570, -18024, -75522, -140883, 2814, 189093, 96157, -66608]
15796f6608r8009o1854j21277M7091j55102j6663P7882P5611K66178J81600J42511
15785B71360k3722m8153j87617m0943r2138q7993J69200j66647j7023J254o1231
15774b83653P7111L9587P6433J01849J39463L2602J34487j67497k11111k39641
15764c00370P4912j3984L3085q8937k5933n3429P5722K63697K69422p8514K3267
15753A78938m07197J18222J73160m6955k42917l0304L5954N9863Q0485R6997n075
15742A1171O6357j80127j54032Q8954n7620M1040L6400J0521j15712j01210K92105
15731f2153J14535j91708k4450J53424N8100J19033J44702q1027m3342j28246
15721E8868k79357J74896K64774Q1944m4923J5603k32669j02735j32730L53276
$$ y = [-66608, -164617, -226471, -347748, -300657, -455759, -472422, -394540, -318929, -52751, 128849, 271360, 247638, 199485, 11868, -29075, -121213, -209206, -40006, -206653, -223676, -222422, -283653, -206542, -166955, -90522, 11327, 150790, 183392, 317879, 150382, -60729, -300370, -225458, -239442, -206357, -295294, -321227, -374656, -298934, -35237, 234185, 155671, 178938, -228259, -110037, 63123, 16168, -226749, -257053, -221099, -161236, -80751, 16246, 11171, 77528, -102599, -256631, -167677, -225297, -184257, -147857, -137336, -253048, -354258, -62153, 52382, -139326, -163776, -10352, 47748, 166781, 311483, 230456, 187114, 58868, -220489, -45593, 219181, 301125, 256202, 271805, 39136, -63599, -196329, 156947]
15711A56947J76414j57380p694M310L6992k73525K8714J63568J60037k2065j53003
15700A13315k66388Q7743j69070n445p4806p8153J75191j5301J43433j7108J87554
15689H0965J12451q0045j41471q2379j48538L35441J90250l5619K23772j56852
15679B97975j66488q752j22437j29793j93484P3817J35371o5132K1793r1804j08142
15668c57076J99029K66679N3097Q6085k69798j06425J15231p5081K02025N8790
15658A72556k35383r9431K04895j13715k24084K05597q8416k2931M6258m7179
15648b01833K65443J56054k9781j54649n1597j15220j36752J7766J16904K21926
15638H8261J87303M2725p5664r3628Q7365k09644j39930m112Q0855N6891P930
$$ y = [156947, 333361, 175981, 168287, 172597, 209589, -63936, -35222, 128346, 288383, 266318, 113315, -153073, -65330, -234400, -239845, -314651, -392804, -217613, -232914, -89481, -106589, 80965, 193416, 113371, -28100, -110479, -259017, 76424, 266674, 231055, 454827, 297975, 131487, 122735, 298, -129495, -322979, -249162, -113791, -178923, -157130, -248934, -357076, -158047, 108632, 161729, 247814, -21984, -128409, -13178, -88259, 113766, 172556, -62827, -162258, 42637, -71078, -295162, -89565, -177981, -200912, -154654, -201833, 63610, 219664, 189883, 35234, -16363, -131583, -268335, -250569, -133665, 88261, 275564, 318289, 242625, 148997, 236362, 26718, -113212, -117324, -36469, 20422, 28352]
15627B8352J23397J30775k17890k08949n2789K41706m6381p2107J25968m2812
15617I270O4727P0052k74903J14863K82824K17897o4264p5227M6958K04653j33909
15606D62941m5326J22245k38686j3435K00357Q7882j59249r1041j58619k45370
15596g8301j7423K57083m7812k27794k06485o1313J0408Q0746L0870J6597J58986
15585h4438l3728O5589M0548K9690J18510j39952J72737J79810k23944m76522
15575c51700j94184K53235j8951j25783J9280J0874O5014J19766Q8106K2929J21664
15564A0250q5405l48330n5669L82081O1696j04758Q3638j28333J66251J28176
15554A09597P2281p9708l7288j28094R1981J59973j54289j68063K09528J74418
$$ y = [28352, 151749, 282524, 64634, -144315, -197104, 44602, -1779, -73886, 52082, 9270, 73997, 144049, -130854, -15991, 266833, 484730, 420466, 345239, 392197, 596850, 462941, 417615, 539860, 301174, 287739, 488096, 575978, 416729, 325688, 167069, -78301, -95724, 161359, 113547, -114247, -320732, -382045, -371637, -290891, -260021, -243424, -84438, -118166, -52577, -12029, 17661, 136171, -3781, 168956, 348766, 124822, -351700, -545884, -292649, -311600, -437383, -418103, -407229, -342215, -222449, -134343, -111414, 10250, -75155, -423485, -479154, -97073, -35377, -140135, -56497, -184830, -18579, 109597, 181878, 102170, 64882, -63212, 28769, 188742, 34453, -133610, 75918, 250336]
15544B50336m6222k66551j52751K01735J08957q3948m5638Q7605j42432J0003
15534g8906J53312j67449n2638K7641P2357j47992J08582K11357j5316l57672
15524b46724l09002J40527J35530R9567M5179k7103j00658p7414J78713J27373
15514c4012P2446R1652J0396p5545k7249P0091P7040r0474p2380m9380j02512
15503a29927K65135J06187j21831k1250k44650L2732J52948r0928j44192Q5881
15493a09895O5221J4211O5834K35376o7946l06458k1055j4001n0844Q2812j49248
15482b55993K06460L9036K24900j18611k70222N1497M2962n0370j5568K27973
15472H2064j84927k37632M1731J49929L22181Q417k33134j39904J58588q4912
$$ y = [250336, 204114, -62437, -215188, -13453, 95504, 11556, -34082, 53523, -88909, -78906, 74406, -93043, -145681, -118040, -45683, -193675, -85093, 126264, 110948, -246724, -555726, -415199, -279669, -180102, -134923, -162026, -262684, -340098, -161385, -34012, 38434, 130086, 140482, 64937, 37688, 107779, 184819, 94345, 21965, -27415, -129927, 135208, 241395, 119564, 98314, -146336, -113604, 39344, -51584, -195776, -109895, -44674, -30463, 35371, 270747, 202801, -103657, -124712, -138713, -189557, -106745, -255993, -49533, -10497, 214403, 95792, -174430, -122933, -79971, -130341, -145909, 82064, -102863, -340495, -298764, -148835, 173346, 181763, -51371, -191275, -32687, -117599]
15462a17599J196j00812p7181R9071J82247k27913K37189O3320k2889R5855p572
15451A24912j86716n2536L1241j57260n5569J29727R2000m0933k26008o1916J03110
15440b99948j90377o4765P3666J09123Q8724J56408J28309R2239m6606N5997j35570
15429c2800O8060P5267j62763m6252L9397q5320r6754k1319j0915M0405M5160
15418a87834k20208n3383J38262J6228r6799N0857K63106j28267j88275K13343
15408a92970N1451Q18r5275J00005j75119k2296K7148m3752J7020J36484M7452
15397a49034j11827n5191J4124K39278J1286P33j6714l1664O6354k85766M7576
15386b70845K38566k1945K11180K2298j4375o8220n8305j69747R5449K7794K365
$$ y = [-117599, -116403, -217215, -294396, -195325, -13078, -240991, -3802, 59518, 36629, 132484, 124912, -61804, -114340, -83099, -240359, -295928, -166201, -74201, -115134, -341142, -403058, -299948, -490325, -555090, -481424, -372301, -283577, -127169, 1140, 93379, 46773, 102770, -32800, 35260, 110527, -52236, -98488, -59091, -144411, -241165, -262484, -273399, -232994, -187834, -408042, -461425, -323163, -306935, -403734, -352877, -89771, -218038, -406313, -192970, -141519, -140701, -235976, -135971, -311090, -333386, -306238, -349990, -332970, -196486, -149034, -260861, -316052, -301928, -62650, -51364, -50631, -67345, -99009, -32655, -318421, -270845, -32279, -54224, 156956, 179254, 164879, 96659, 38354, -131393, -35944, -8150, -5785]
15375e785J61750O319O4156j79279j68400Q0966Q6390K4564j77952M6212K16303
15364A55244J45318j46748j6992j30994j39680l7651j07757M8416M5103J31187
15354e4554k982Q7093K6912j79162J20892J33946J05848J16673j45629r1492l9585
15343G7960p0398k19306k56239o4799K38499J59944J36030Q7455p8787l5833j08000
15332a33474r7822K7734O9849J81619J31061O7109j92056J250K4610j08438L6373
15321G815K66714J78625k10367k58011l07136j0532M1787L513j26616L4467j4055
15310c93796k82931j31037L00880K09086M0717J63588J71112j17661j34731J72154
15300b619k3036j8041J07980K44622J42830P8131n5846k74046o9689o3415k12275
$$ y = [-5785, 155965, 162284, 226440, 47161, -121239, -40273, 46117, 70681, -107271, -61059, 155244, 300562, 153814, 136822, 5828, -133852, -171503, -279260, -230844, -185741, -54554, -57536, 29557, 56469, -122693, -1801, 132145, 237993, 354666, 209037, 117545, 77960, 7562, -211744, -467983, -532782, -294283, -134339, 1691, 89146, 10359, -25474, -133474, -231296, -203562, -133713, 47906, 178967, 246076, 54020, 55270, 79880, -28558, 7815, 274529, 453154, 242787, -15224, -322360, -332892, -291105, -287592, -414208, -379741, -393796, -676727, -807764, -506884, -297798, -257081, -93493, 77619, -40042, -174773, -2619, -25655, -43696, 64284, 308906, 451736, 529867, 474021, 199975, 130286, 66871, -145404]
15289a45404j49650o5128K29024J24852j84073j16433M7228j69225j10945k6829
15279e66583Q6752J46650R9788K99721J37762Q413o6182j52045j95325J76557
15269b4492K9206o6095j08036m5929O2841J04314O7402l4228m9326M1163N2226
15258B9046J33801J31646j62220k47368J03357J63785k4747k10888k2648j1467
15248a17703R4413P5482q8158n2385J29572K48797j21357n3924J7914l2212l7134
15237F3305o8153P3201J13899j45119l3018O856m4506O5557j0373k9904O4469
15226E6214J16884J38955L265l3148j28585J36150N9327J32254l5913k67516l03110
15215a25223k53777k690K18993K36435J08127r0247j21012M0820O0991Q3975J33282
$$ y = [-145404, -295054, -360182, -131158, -6306, -190379, -306812, -259584, -428809, -539754, -566583, -479831, -333181, -233393, 66328, 204090, 212503, 146321, -5724, -201049, -24492, 4714, -61381, -169417, -215346, -152505, -48191, 19211, -15017, -64343, -23180, 29046, 162847, 294493, 132273, -115095, -11738, 152047, 127300, -83588, -106236, -117703, -23290, 52192, -35966, -88351, 41221, 290018, 168661, 114737, 132651, 100439, 63305, -4848, 68353, 182252, 37133, 4115, 10971, -33535, 32022, 21649, -8255, 56214, 173098, 312053, 315318, 282170, 153585, 289735, 349062, 481316, 445403, 177887, -125223, -379000, -381690, -162697, 73738, 181865, 91618, -29394, 11426, 72417, 156392, 289674]
15204B89674J09973l41256k63847l3250o2376r4512L02492R5399n1184P7121m8523
15193b0289R1354p0008J96101o6831j05944K03233N9536j47541M1121j80080K2481
15182B3133k2781l25831p635J29687M208K05700q4426j20164K9939J77899R7519
15171A07248j50475j03522Q6541J56458n8507J01445J09534L0028r2343M6468
15161B32875o869M6821m9579O5406k26794j08034Q6479j01159O585J35352j3382
15150F7701p4184P4887J40453k38325n0142J41753j09412k5682N5847J02635j12558
15139b7027L8031K82921K12415M4798k78994j31126p6731j20059J08291n1458
15129A061k6775p655N1083O2869n3791j27077l2517J15122P8868J52534J97164
$$ y = [289674, 399647, 58391, -205456, -238706, -301082, -395594, -93102, 2297, -48887, 28234, -20289, 71065, 1057, 197158, 130327, 24383, 227616, 287152, 139611, 180732, 652, 23133, 352, -325479, -333114, -203427, -199219, 6481, -77945, -198109, -168170, 9729, 107248, -43227, -146749, -60208, 96250, 37743, 139188, 248722, 278750, 186407, 232875, 226006, 272827, 223248, 288654, 61860, -46174, 40305, -60854, -54269, 81083, 67701, -6483, 68404, 208857, -29468, -79610, 62143, -47269, -72951, -17104, 85531, -27027, 11004, 293925, 506340, 551138, 272144, 141018, 64287, -55772, 52519, 1061, -25714, -33369, 17714, 80583, 26792, -100285, -132802, -17680, 61188, 213722, 410886]
15118D10886o4423l54980j84069j5532J00170J50822J14609j22711k18786K7902
15108a56112L6778K1782K40431o4128k40552l5591N9970R8236P8569q1396k53217
15097b95230l9450K49536L87232P267l3781n2571k20474j00000K01647l276k289
15086I8611j24804P3562K76694P3572j33503q7668n5981L0262k9365Q634M0166
15075A70180Q7973q948j14131m54006k8809J76439j13104j84580o7588M2017J46236
15064c48321K84652J84907j06968j24832J96420m4730n5634J83956j49643M3661
15054F3468K14451p2294j56329J4902m4846k08281j833J89651J36491R7228J34244
15043C66852r8207j10240q8664k5183K6035k74619J2653J61695r9656J50260J76631
$$ y = [410886, 346463, -8517, -192586, -208118, -107948, 42874, 157483, 34772, -184014, -156112, -119334, -97552, 142879, 78751, -161801, -197392, -137422, -39186, 39383, -42013, -295230, -334680, -85144, 302088, 309355, 275574, 223003, 2529, -97471, 104176, 100900, 98611, -26193, 47369, 324063, 397635, 264132, 176464, 120483, 150745, 121380, 130014, 170180, 258153, 249205, 135074, -318932, -347741, -171302, -284406, -468986, -536574, -494557, -348321, -63669, 121238, 14270, -110562, 85858, 41128, -14506, 169450, 19807, 63468, 277919, 205625, 49296, 64198, 19352, -188929, -190762, -1111, 135380, 232608, 366852, 268645, 158405, 69741, 44558, 70593, -204026, -191373, -29678, -129334, 20926, 197557]
15032A97557j0855q9268K8379J06044J48418j11017j49985q0679J90147P4808
15022C03549J693K48100J63873K32151J60738J24196J30221L07405M81399Q33119
15012B986444J042226K016965L705333N310687N009782Q72189k842480m517895
15004A3583251m121375k863004j763493j219815q54099n47765k32484m22696m37099
14995A121421k37188j29025N6755J24105j0238j59592j478J39521k17225K1653
14985G08709p9233j32119k8935k930j460l08030p1418J63792O6916k2014N93l2130
14973B61741j84840j18784J31997R6817K6941J20746k1209o222l54727j6411K39412
14962A75461N9795N1732J19997J79008n4321q5776j40907p9669J28026J19050
$$ y = [197557, 186702, 97434, 125813, 231857, 380275, 269258, 119273, 38594, 228741, 303549, 305242, 553342, 717215, 949366, 1110104, 1234300, 1364521, 1671926, 2153325, 2986444, 4028670, 6045635, 9750968, 15061655, 20071437, 20943626, 18101146, 13583251, 9461876, 6598872, 4835379, 3615564, 2761465, 2213700, 1981216, 1558520, 1121421, 884233, 755208, 811963, 936068, 925830, 766238, 764760, 904281, 687056, 708709, 629476, 497357, 468422, 465492, 464032, 156002, 84584, 248376, 315292, 293278, 293871, 261741, 76901, -41883, 90114, 186931, 213872, 334618, 313409, 307187, -47540, -63951, 175461, 235256, 286988, 406985, 585993, 531672, 445896, 304989, 225320, 353346, 472396]
14952D72396J46430m9252L4193r872k32356J8536L8881N6363k64037L0405K65131
14941E06818p9597k56401l5999J59948j16176r2608j34521j23296P7728J41338
14931D7234N3495M138l7597K3940R8958j00045k33315k4788l8269O3398L0674
14920a12177J27552m8524j53406m1791K14104J89470O9735k38240k5299K9360
14910A0784j29855K09606P871k27009j26451j3199K8639n0766J3055L91512R3781
14899B07968j15864k4327L0381p9810j47640K9732l3437r0238P389k6064J03788
14888a38122m1590j39406j84209j08830k3975K43490J65931k403o567M2347Q3659
14877a09675N8212Q9761n4864j49134k8160J62892o46K1808l8199J93529n0817
$$ y = [472396, 618826, 569574, 603767, 593895, 361539, 380075, 418956, 475319, 211282, 241687, 506818, 427221, 170820, 134821, 294769, 178593, 85985, -48536, -171832, -94104, 47234, 100729, 104867, 67270, 91210, 190168, 90123, -143192, -167980, -206249, -142851, -112177, 15375, -33149, -186555, -228346, -14242, 175228, 244963, 6723, -18576, 10784, -119071, 90535, 98406, -128603, -255054, -268253, -239614, -290380, -277325, 114187, 207968, 92104, 67777, 98158, 18348, -129292, -99560, -132997, -223235, -215846, -241910, -138122, -179712, -319118, -503327, -612157, -636132, -392642, -226711, -229114, -235681, -193334, -109675, -51463, 38298, -16566, -165700, -193860, -30968, -31614, -9806, -48005, 145524, 94707]
14866I4707l97963j94205K34830j6337L4387O5621o6020J49388J59534n3650j50880
14855a40588q8608Q472n0021j0834j7404p3722J84518K08179j00182o664K71596
14844A84742J38679L6513r2364r9580j97886R8915j2138j943j38182l39391J16899
14833c05736J38551M4196J44419K44628j98268o2179j77567J84185K41148L0773
14823B84150j56241j80154J33380q2186o5081r6725p9132l2674J93076J39571
14813E7984k8763j6005q9265p1463m2271m5429k25150j06392Q3755J89433J02163
14802a91403p7034J60815j26347j4476O8171Q0582o3379M3806J11670J49922k29601
14791h7274j78705J0261J1015K55965K45854o2967k2331J57279K2224k3094m8515
$$ y = [94707, -303256, -497461, -262631, -278968, -244581, -178960, -244980, -95592, 63942, 10292, -140588, -229196, -220724, -270745, -281579, -298983, -372705, -188187, 19992, -80190, -86854, 184742, 323421, 359934, 267570, 167990, -29896, 69019, 56881, 54938, -83244, -422635, -305736, -167185, -122989, 21430, 266058, 67790, 5611, -171956, 12229, 253377, 284150, 127909, -52245, 81135, -1051, -66132, -162857, -241989, -274663, -81587, 57984, 29221, 13216, -76049, -147512, -189783, -235212, -460362, -566754, -482999, -293566, -191403, -268437, -107622, -233969, -248445, -180274, -99692, -163071, -119265, -7595, 142327, -87274, -265979, -255718, -244703, 11262, 257116, 194149, 171818, 329097, 351321, 328227, 279712]
14780B79712k94480r4910j9079M3789L69395J37386j12004l32537j62159j38260
14770c23147l4887l2294o6493n6241J27597k2118r3461j45066L3330K40542J62989
14759b09249J9982Q8610K40375J2911l9357R638j9239N7785K28799J08582k36291
14748B62546j20654l02464r9900K4330j17622j42808j70488N6832p9616J25335
14738e64509K17202K8014k01358R2718J50356o5360m9414J13505J0668N1650M2353
14727a74175J37516J32667r7380l5218l5471n1257j45595N9044k6898K21582L00149
14716B84964M5415j81398j98095O4850K84375k08719l71350K9789M1300j46370
14706c55239J41300J41781m1684J74198J21168q3622m1432j17044j45527j41747
$$ y = [279712, -14768, -109678, -128757, -84968, 284427, 421813, 309809, -22728, -184887, -323147, -358034, -390328, -456821, -513062, -385465, -407583, -501044, -646110, -612780, -372238, -209249, -189267, -100657, 139718, 152629, 113272, 122910, 103671, 161456, 390255, 498837, 262546, 141892, -160572, -260472, -236142, -353764, -496572, -667060, -610228, -689844, -564509, -347307, -319293, -520651, -427933, -277577, -342937, -392351, -278846, -268178, -216528, -174175, -36659, 96008, -1372, -36590, -72061, -123318, -268913, -209869, -236767, -15185, 284964, 330379, 148981, -49114, 15736, 300111, 91392, -279958, -250169, -208869, -355239, -213939, -72158, -113842, 60356, 181524, 97902, 56470, -60574, -206101, -347848]
14696c47848r8001p6232M09265K95037j77591k63727o9258K10705L1866L58924
14686B73140Q4803k25781j56153O2848m2754k29478L2420K06346J8625j40546
14676a16530p467K49283j38701n0743O818j2613j41684K34490J99768j41638M0226
14665A21209N4192j77208L1511j14910j95967K20346p8488j89269k0421Q6431
14655b62574K05698m1620R0138J17524q3322k18788P5909J19593J11625n9992
14645E4191j49718j98911K8985J33716P5540Q9753L57278L8104k36079j79784
14635A3075j08345M6356J38823j3538q0886J37683J54650N0857K4250L7484j05625
14624B94784j24507J36229J6953j19640R928J8149n7194j75855k98642J93070
$$ y = [-347848, -445849, -522081, -112816, 182221, 4630, -259097, -328355, -117650, -85784, 273140, 357943, 132162, -23991, 38857, -3897, -233375, -200955, 5391, 24016, -116530, -123997, 125286, -13415, -64158, -57340, -69953, -211637, 22853, 222621, 80983, 121209, 175401, -1807, 29704, -85206, -281173, -60827, -139315, -328584, -349005, -262574, -56876, -98496, -8358, 109166, 25844, -192944, -117035, 2558, 114183, 54191, -95527, -294438, -265453, -131737, -56197, 33556, 390834, 428938, 192859, 13075, -95270, -48914, 89909, 76371, -4515, 133168, 287818, 338675, 362925, 400409, 294784, 170277, 306506, 323459, 203819, 213747, 231896, 174702, -1153, -299795, -106725]
14614a06725K57618k00245j89737R4704R9280J19055n4517R4056l6772j20162
14604d3445O9271q4920l9512l9375P2302K0700j4889J17292J29754j25782q726
14593E2670o04q48R3445j9987k25947j09685j06314M2349j92752l1518N1553J48342
14581b99296J14971O2930K417K36424M9487j6747o6831J76740N6471j40770J35635
14570C11431j1815j35521O1832l9428m426j6346m2575K16989J41125j65946r4011
14559B21309n9850j0992p6862j34570J5056k5027j43893J2405J29436k4251p3320
14548a70559j79567n768Q9193J90852J87685J3672p6447k21332p1873N2645J86742
14537d757J98268o3466k29029R3537k2595j0147J61025J38440p0199J14705m9523
$$ y = [-106725, 150893, -49352, -239089, -144385, -45105, 73950, 19433, 113489, 76717, -43445, 25826, -59094, -98606, -137981, -65679, -44979, -59868, 57424, 187178, 61396, 52670, 52066, 51218, 144663, 124676, -101271, -210956, -317270, -274921, -467673, -499191, -447638, -299296, -184325, -121395, -118978, 117446, 166933, 150186, 83355, 260095, 316566, 175796, 311431, 299616, 164095, 225927, 186499, 182073, 165727, 123152, 340141, 481266, 315320, 221309, 161459, 150467, 73605, -60965, -45909, -70936, -214829, -202424, -72988, -97239, -170559, -350126, -355894, -266701, -75849, 111836, 125508, 49061, -172271, -244144, -191499, -4757, 193511, 130045, -98984, -5447, -28042, -38189, 122836, 261276, 191077, 305782, 256259]
14526B56259n33734k38701l6J63041K26846J66661R312K8181N8218K0525r4714
14515F1858j81462j4904m407P8663K0701J62684j02401j15808j2524j49256K9511
14504b27345L37844j00254j84957n4310K42019J83131j35745O8070n0164L0728
14494A09017J73303L1901j23803k77956Q7246N4795k40261L9798R2980j01598
14484a54578P6397Q4427J12072M357m8721j02773M8405K2949O9899J58521o0905
14473B10050m72492l5438P0998L8346P9208K17216J48843m434R5247p2181j63906
14462A11457M2571r0675j04634j91116K46572O729N353j01532R7999j2606j31327
14451a21209m4991Q459J10256j44450j08043K0674j6487K20352Q7504J8353P0578
$$ y = [256259, -277475, -516176, -516212, -353171, -126325, 40336, 49648, 77829, 136047, 156572, 61858, -119604, -134508, -138915, -60252, -39551, 123133, 20732, -95076, -107600, -256856, -227345, 110499, 10245, -174712, -229022, 12997, 196128, 60383, 128453, 78289, 109017, 282320, 314221, 190418, -87538, -292, 54503, -185758, -145960, -52980, -154578, -78181, 6246, 118318, 122675, 73954, -28819, 19586, 42535, 112434, 270955, 210050, -262442, -297880, -226882, -188536, -109328, 107888, 256731, 252297, 347544, 275363, 111457, 154028, 63353, -41281, -232397, 14175, 20904, 26257, -75275, 22724, 10118, -121209, -166200, -157741, -47485, -191935, -299978, -279304, -295791, -75439, 12065, 30418, 100996]
14440A00996J00765o6754k10343j15717q3522k45569N5572M94119K41631r4466
14430A76712k2448j45750l1196j79643k7543m0247q7288p5180J40789J19457k11049
14419c83386O6319K51328J73362j82565k1201J96738K37450Q4160k05657k77104
14409f0556J31282J15033n2745j05772R0644M0362k5150j5816N6107q2651q5335
14398E403J98129L6606j01310j07864M9309r6251p7928J75960j26137j0111k6100
14387h0294J65599K33658O1897j01189J3614k4603m1142J37287J6997k20420k90148
14376a28744q3886J86459j73067O6838J00340Q1561J97725k2513k23226j29343
14366a27856Q3340Q2646p6905O8964J39731j13171k45093L5108J40126N8974J33191
$$ y = [100996, 201761, 135007, -75336, -191053, -274575, -520144, -464572, 29547, 271178, 176712, 154264, 8514, -22682, -202325, -229868, -270115, -357403, -432583, -291794, -172337, -383386, -317067, -65739, 107623, -74942, -96143, 100595, 338045, 422205, 216548, -60556, 70726, 185759, 133014, 27242, 117886, 158248, 133098, 117282, 173389, 90738, 5403, 203532, 240138, 138828, 30964, 80273, -15978, -93906, 82054, -44083, -54194, -80294, 85305, 318963, 380860, 279671, 293285, 268682, 227540, 364827, 381824, 161404, -128744, -212630, -26171, -199238, -132400, -32060, 49501, 247226, 224713, 1487, -127856, -44516, 38130, -38775, 30189, 169920, 56749, -188344, -153236, -13110, 45864, 179055]
14355A79055J69779J21380j54905r9109r263J00976N4746k1618k09262m79737
14345c47958j10226k5881K16213K31944J75868J94454O1429l9490M8041j06341
14335B98053k1995O3380L11247p5356J12893M9223j24245j28254k12303K06492
14325D79135N6076M7500J2392j38512j7434J36303J21232R251j04622r0800j01380
14314D09141j57129m5338O8918O5721J37571J52585r2347j22423k5778P0110j56919
14303C04112k08158j09619J81430M4425j22000K3077k0170j16323j8919l3810
14293g5955J14013J54742j79556j61255J48148j0455J4069j09315k66550P2323
14283b99791J73352J98173J27859j06769q9747o8832m9722P32M0178Q2140J74650
$$ y = [179055, 348834, 470214, 315309, 216200, 206937, 307913, 362659, 341041, 131779, -347958, -458184, -484065, -267852, -35908, 139960, 334414, 395843, 356353, 404394, 298053, 276058, 339438, 650685, 575329, 688222, 737445, 613200, 484946, 272643, 479135, 535211, 582711, 595103, 456591, 439157, 575460, 696692, 705943, 601321, 510521, 409141, 252012, 206674, 275592, 341313, 478884, 631469, 539122, 416699, 390921, 461031, 304112, 95954, -13665, 167765, 212190, 90190, 113267, 93097, -23226, -42145, -75955, 38058, 192800, 13244, -148011, 137, -10318, 3751, -105564, -372114, -299791, -126439, 71734, 199593, 92824, 3077, -65755, -115477, -114745, -74567, 7573, 182223]
14272A82223J17933j31653k11817K6931R9438l5213k9022q9001L1074k289J08282
14261F6886j41022k53136J90470J87665K5966R4432R0631K4531j637r4314j04264
14250H6208N4849Q7645J9237j44528n4422p307N8541R7492J39024j33730J1538
14239B14547r381J8398J35538r0801L7133m3807k29287K12081j26711j95968M3906
14228c4352j6245j6234K7672K4861m3111P668K84822M8072J6401J79902p2513
14217D06943k07575j85732r2818m4258n8716J04287J43068o9931J17787K56121
14207C69176R2299l92130k35610L5671o4041j35093J87373Q0851K01071K86116
14197D25683J92923k62875l07436k15683K03660K8847o4240j99734J98J91649
$$ y = [182223, 300156, 168503, -43314, -16383, 83055, 47842, 18820, -70181, -39107, -41396, 66886, -74136, -327272, -136802, 50863, 76829, 171261, 261892, 286423, 284786, 190472, 86208, 141057, 228702, 247939, 103411, 48989, 41682, 100223, 197715, 336739, 203009, 214547, 205166, 223564, 359102, 268301, 305434, 261627, 32340, 244421, 117710, -78258, -34352, -50597, -66831, -39159, -14298, -57409, -49741, 235081, 283153, 299554, 479456, 406943, 199368, 13636, -79182, -123440, -182156, -77869, 65199, -4732, 113055, 369176, 461475, 69345, -166265, -130594, -194635, -329728, -142355, -61504, 139567, 425683, 618606, 355731, 48295, -167388, 36272, 65119, 879, -198855, -198657, -7008]
14187g008K44899k12321n9804P3735j9056K6000o5419J9083J4951k01263j83307
14176c69510N7131J71434O3084J73539q112j09525n0954J6535r6723k32223R0178
14165b95146L018j93043J19551j65167J86601M35617N7873j59720J8753J57062
14155A65399n7946j83264K05521J9820j61895k61756j75410n1060Q0157m5155
14145d65589J58721K58961q1198j8780o3736j9285P9282m0083N2354m0466J01587
14134g8232J29243J20092m5374j55970j16752j04682k1899J18374K08528j5102
14124C8226j00867k465k6139o439J39472R125r1j04167q4702L16908M4137L4803
14112B57801J30310J5500j33751k37354J10262J06540n8486j80146j29142J056
$$ y = [-7008, 237891, 25570, -34234, 39501, 20445, 46445, -18974, 109, 15060, -186203, -369510, -312379, -140945, -77861, 95678, 87566, -21959, -72913, -56378, -153101, -385324, -295146, -292128, -485171, -365620, -530787, -344186, 91431, 149304, -10416, 8337, 165399, 107453, -75811, 129710, 149530, -12365, -274121, -449531, -500591, -420434, -465589, -306868, -47907, -129105, -147885, -211621, -230906, -151624, -191707, -139353, -179819, -78232, 51011, 171103, 125729, -30241, -146993, -251675, -273574, -155200, 53328, 38226, -62641, -65106, -91245, -97684, 41788, 50913, 50822, -53345, -138047, 178861, 222998, 257801, 388111, 403611, 269860, 32506, 142768, 249308, 190822, 10676, -118466, -117410]
14102a17410J11796N3155j06525k2418p1333j70824l2914J24173j10613k70514
14092f13427N9024K21833k1909J41795J22691Q4504l8785J10194m453j61901K07928
14081A07494o7739j39336k10403q1997K46567K15060O5118j64384M9024R5882
14071A15286j09628J15008N2851k04330j56052j2125J23583P5958j1756r6156
14061a07361j09899O1589J14125p3186j417J06925q8106k82431J23904L09720
14051E3863K46643j03303k31796l2003J57544O9501N5965K7938J27718J07300
14041D79370k6282k09239L50j67410l64381r4651O7523J26957J75670J92640K84217
14030D64764m118n02066k41051j46180J74948J52283j44995m127j32358J17974
$$ y = [-117410, -5614, 47541, -58984, -81402, -152735, -323559, -356473, -232300, -342913, -613427, -554403, -332570, -354479, -212684, -89993, -5489, -44274, 65920, 61467, -100434, 107494, 39755, -99581, -309984, -391981, -145414, 69646, 134764, -29620, 19404, 115286, 5658, 120666, 173517, -30813, -186865, -198990, -75407, 551, -11205, -107361, -217260, -155671, -41546, -114732, -116149, -9224, -97330, -379761, -255857, 53863, 300506, 197203, -34593, -66596, 90948, 160449, 216414, 244352, 372070, 479370, 453088, 243849, 244199, 76789, -287592, -382243, -314720, -187763, -12093, 180547, 464764, 460646, -41420, -282471, -428651, -253703, -101420, -246415, -250542, -382900, -264926]
14020b64926L55419K19505J27091j19697O6355J44125J64624r1205k49480p3226
14010B78585N9490J33755m2770J37701M289k6795j91425J01707K17276M0149m7173
13999F64789j32490l6996R2937J44916q1917l74747n3072l2590r7037P323M3196
13988A44312Q4877n0526Q3133l5741R9268j35360j02122K57384J8018k26373q1146
13977E5724K73801K50100q73m0086k28599R6136r5113K4355k35704o2707J62861
13966A99895J04902M8754j19542M6410j58817N1981J99933Q0360m60K34484R1254
13955G79154j65836m05396J08266K68972o8204k8719n205K5747j13410j72460
13945B22909K01637P2493p3546J85024L34692J78361R3785L06957M53615M50576
$$ y = [-264926, 90493, 309998, 437089, 317392, 383747, 527872, 692496, 601291, 351811, 278585, 338075, 471830, 429060, 566761, 571050, 544255, 352830, 454537, 671813, 711962, 664789, 532299, 495303, 588240, 733156, 651239, 276492, 223420, 190830, 93793, 101116, 144312, 229189, 178663, 261796, 226055, 325323, 189963, 87841, 345225, 363243, 136870, 55724, 329525, 579625, 578752, 538666, 310067, 406203, 311090, 335445, 99741, 37034, 199895, 304797, 353551, 234009, 280419, 121602, 173583, 373516, 453876, 453416, 687900, 779154, 613318, 207922, 316188, 585160, 516956, 488237, 483032, 508779, 395369, 222909, 424546, 497039, 423493, 608517, 943209, 1121570, 1215355, 1522312, 1975927, 2426503]
13935B426503O95489N81474P89560P33556N26010L44715K37370J27401M228k53784
13925F212522l32191n93204m79685l37495l00825k96523k83693l22368j01329
13916C165209K75187L02496O43306Q19993Q83661R07458R81025J284109J411946
13907A0674390J036372O44207M86880Q2063j13176m56939j024866j191089j321793
13898H816049j007102o84264n35512k82491r9491J22241J54219K93097P68992
13889G545738R45815J310246J767793J859295K106052K013744J418611J034205
13881B0001499L53540q9989q52461j288907j504378j594142j686380j517276j188054
13872A0633452q40996q39172m69021J238K79611N50785J261462J453504J748563
$$ y = [2426503, 3121992, 3703466, 4493026, 5226582, 5752592, 6097307, 6334677, 6462078, 6466306, 6212522, 5880331, 5287127, 4807442, 4469947, 4169122, 3872599, 3588906, 3266538, 3165209, 3440396, 3742892, 4386198, 5206191, 6089852, 6997310, 7978335, 9262444, 10674390, 11710762, 12354969, 12841849, 12923912, 12810736, 12353797, 11328931, 10137842, 8816049, 7808947, 7124683, 6589171, 6306680, 6207189, 6329430, 6483649, 6776746, 7545738, 8491553, 9801799, 11569592, 13428887, 15534939, 17548683, 18967294, 20001499, 20355039, 20265050, 19412589, 18123682, 16619304, 15025162, 13338782, 11821506, 10633452, 9792456, 8953284, 8484263, 8485501, 8765112, 9315897, 10577359, 12030863, 13779426]
13863A3779426K078377K456962K447671K269879J902609J118094M09943k06051
13855B6256910q87540j852588k402048k520414k202800k090411j860526j426891
13847A1013692r57032o35636k66197Q469M9757L16315R86493J486670J798535
13838A3801066J864516J715566J413150J511947R34330K34945m81396r72257j614120
13829A8407747j923803j769234j762552j853255j326156j093780q82331n07342
13821G289294R88J72748Q8647L57614O40987N75145R56350J273175J441176J065179
13811A3861303O72033J98793j52094m17512q98316j130695j216505j444386j249992
13802H222629q54059p73689q25834p05689k67384k87157k42690m5232K98379N43454
$$ y = [13779426, 15857803, 18314765, 20762436, 23032315, 24934924, 26053018, 26462961, 26256910, 25369370, 23516782, 21114734, 18594320, 16391520, 14301109, 12440583, 11013692, 10056660, 9421024, 9154827, 9163296, 9213053, 9529368, 10515861, 12002531, 13801066, 15665582, 17381148, 18794298, 20306245, 21240575, 21475520, 20994124, 20021867, 18407747, 16483944, 14714710, 12952158, 11098903, 9772747, 8678967, 7796636, 7289294, 7290282, 7463030, 7551677, 7909291, 8550278, 9125423, 10081773, 11354948, 12796124, 13861303, 14533336, 14732129, 14580035, 14162523, 13264207, 12133512, 10917007, 9472621, 8222629, 7368570, 6594881, 5769047, 5063358, 4795974, 4508817, 4266127, 4220895, 4519274, 5062728]
13792E062728O06544L82110M50312N48530M34693L33135K3245j29926k81754m71893
13782F957724o48106p58895p39807o36299o83502k39527r6445k02976k99875m66870
13772B185422l82163j25206j23677q5196l402n3254j89445R253J36041k68488
13762A099885j27903j00335p7713J63431j24679j44774j09816Q0268J89025L1901
13752H79290O4654j69762p5470n7621o8456J64315O2138j32061J6659J3629j61694
13741E35621k319n4320K7500J98073j72653k05664j01670J83585Q6826j04915
13731C90064j72790r8167k0092J03960M4040R6955J31318p5954n9549l4609m8414
13720B56762j4063O6318N359k33495p7029j21127o7717n4893L9528M6801K37145
$$ y = [5062728, 5669272, 6051382, 6501694, 7050224, 7484917, 7818052, 7841297, 7711371, 7429617, 6957724, 6309618, 5550723, 4810916, 4174617, 3491115, 3251588, 3155143, 2952167, 2652292, 2185422, 1803259, 1678053, 1554376, 1469180, 1465778, 1412524, 1223079, 1232332, 1368373, 1099885, 971982, 871647, 793934, 957365, 832686, 687912, 578096, 658364, 847389, 879290, 943944, 774182, 698712, 641091, 572635, 736950, 799088, 667027, 683686, 697315, 535621, 533302, 478982, 506482, 704555, 531902, 326238, 224568, 408153, 494979, 390064, 217274, 119107, 99015, 202975, 247015, 343970, 475288, 399334, 339785, 305176, 256762, 242699, 309017, 314376, 80881, 3852, -117275, -184992, -239885, -200357, -153556, 83589]
13709H3589L8450o3913N508O5686r7174j06803n2405j221J8594K02513j06898
13698a4074j79279j76705J47114J76416P9633J80495j04442l3897M2996J82858
13688C01115L2772j06715j26318J04740O9786j5207j50248K9401P6722L6441k79153
13677b6664k6231M4732n4688K13259L28564j61203q4849n7847R447M0034j01290
13666A23264k54380Q3532J97070m0464k70697j82429J91378K74338O8202M6437
13656B36251N3755k11839j32443J08601O307k1482K6065K9951k45489n8387k611
13645b11321m8194Q5172j46897q608O0430J03736K77745k6731r0195j69883j565
13634a76311P0481P2748r8000J18360L34321j0221j90676j71228J42406o1036
$$ y = [83589, 122039, 58126, 63634, 129320, 32146, -74657, -127062, -128283, -109689, 92824, -14074, -193353, -370058, -222944, -46528, 33105, 213600, 109158, 75261, 118257, 301115, 333887, 227172, 100854, 205594, 275380, 260173, 109925, 139326, 216048, 252489, -26664, -52895, -8163, -62851, 150408, 478972, 317769, 232920, 175073, 184520, 224554, 123264, -131116, -47584, 149486, 109022, -161675, -344104, -152726, 121612, 189814, 236251, 290006, 78167, -54276, 54325, 60632, 39150, 65215, 95166, -150323, -208710, -211321, -259515, -174343, -321240, -329848, -269418, -165682, 112063, 85332, -4863, -174746, -176311, -105830, -33082, -131082, -12722, 321599, 311378, 120702, -50526, 91880, 30844]
13624C0844j05456r5598J10899J58066j53653j07751J06392L10315R916L1743
13614B95717j35663j27435o747J13117Q984k08054q0603L6368J14550L29208M1596
13603C81038r6185r8901o1028P1434o9714j04388K07335o1184N5300J47134r0616
13592B80225k18588L2855K45703o2160k50404l03737j17935P5875M0286R0766
13582a87114J25928J74194j1147Q7693Q5223j35514J30523M4337K1400r1500j78810
13571F5213j84381o3868J33839J46276j54424L9494o0795l8668L4896q2542P5703
13560h9257K28760K094j30724J94977J45426L4709j22165K0818K9927L846l1260
13549B87151j81942j16115j38715J1774J72987Q0246p8762k37267o3859K94235
$$ y = [30844, -74612, -170210, -59311, 98755, -54898, -162649, -56257, 254058, 263974, 295717, 160054, 32619, 25872, 138989, 147973, -60081, -140684, -104316, 10234, 339442, 381038, 284853, 185952, 124924, 196358, 126644, 22256, 229591, 168407, 223707, 370841, 280225, 61637, 94492, 340195, 278035, 27631, -276106, -394041, -318166, -277880, -187114, -61186, 113008, 101861, 189554, 274777, 139263, 269786, 314123, 335523, 244023, 65213, -119168, -183036, -49197, 97079, -57345, -17851, -78646, -117314, -82418, -164960, -89257, 139503, 141597, 10873, 205850, 351276, 385985, 263820, 284638, 314565, 318411, 287151, 105209, -10906, -149621, -137847, 35140, 115386, 36624, -200643, -264502, 29733]
13539B9733M05350k46641l17646J71921J69859j27342N3970O753R2820J89535
13529D28312K3402j33867o7542L08869j30030q6628j6400M7661M6422J05995j31125
13518C95069j39584K34202j66327p4376p4526N0984m9419j68464j5544J1997O3247
13507F7259M9732j65428m8499l6341K4199P3422j29081j02654J18883p9315j49390
13496c77213J63860K94628K17511j32762k98222k61713n125J79459J57049r1115
13486a53643K0465J20224j77219P5685r1803k0059O5989K34772k0503j62099j39104
13475b47295J0151Q8758p0699J24935R5255j18046J06719J32408J38927k5782
13465B35331K9349J15086O1442j93205k1446N9316r6195j21931R2745j59405P6096
$$ y = [29733, 435083, 188442, -129204, 42717, 212576, 85234, 139204, 145957, 238777, 428312, 451714, 317847, 250305, 559174, 429144, 342516, 326116, 373777, 420199, 526194, 395069, 255485, 489687, 323360, 248984, 174458, 225442, 176023, 7559, -7985, 4012, 67259, 116991, -48437, -96936, -133277, -109078, -35656, -164737, -267391, -148508, -227823, -377213, -213353, 81275, 298786, 166024, -132198, -393911, -399036, -219577, -62528, -153643, -133178, -12954, -190173, -114488, -206291, -226350, -160361, 74411, 53908, -108191, -247295, -237144, -148386, -219085, -94150, 1105, -116941, -10222, 122186, 261113, 235331, 264680, 379766, 441208, 248003, 226557, 285873, 189678, 67747, 160492, 1087, 77183]
13454G7183Q6410J79798j2892J46879l6798j40806K79590j26987k8135r1313j23896
13443B09033r8618j61189K43549J87936K37780l99699k24412K12126K7608N7540
13433B91654m6347j92704j67930K44830K23169J59267j26347j12284M9865p4560
13423B48613j59768j3909j80405R6151N839R4284J8169M6658J11517J04424R213
13412C80786K5429K9734k6854K3039O5222m1874J20824k0364q2873j783M155p4592
13400D00849l2009j2683J5363k23213j25436J3922L4647r8802J21489p9895L1690
13389D5922K15932q4031l6241L61480o4448l34797k99328P6827P2609l5311J30223
13378D8837K0660l30733J05003O7401J53454J17713L2195L7594k6107J18036p9885
$$ y = [77183, 163593, 343391, 330499, 477378, 440580, 299774, 579364, 452377, 424242, 332929, 209033, 110415, -50774, 192775, 380711, 618491, 218792, -5620, 206506, 234114, 291654, 245307, 52603, -115327, 129503, 352672, 511939, 385592, 273308, 323173, 248613, 88845, 74936, -105469, -9318, -3479, 90805, 108974, 155632, 267149, 371573, 380786, 406215, 435949, 409095, 432134, 497356, 455482, 576306, 555942, 473069, 471286, 475441, 400849, 368840, 356157, 371520, 148307, 22871, 36793, 71440, -27362, 94127, 14232, 45922, 261854, 177823, 141582, 503062, 438614, 103817, -195511, -118684, -46075, -81386, 48837, 69497, -261236, -156233, -88832, 64622, 182335, 214530, 252124, 226017, 344053, 264168]
13367B64168J06289J14685q9939K26169Q8470j69444k15720j61304J91100P2725
13357D27199j52492j70581K1284k01248o3639Q3666M8937q0988r8551J73326J29624
13346A16537j12154P2350K10216k05283l96196L4759M06528J85424l3677q2207
13336A96297j51106r2934k0881j23128J64315J52233J07815j41654j64575k5344
13326i8962Q9100K54219P8546r8968J84702j96059j8177l0421L0779p5397o8305
13315E1057L0992J32122l8605q6246r3343j54220Q0404J11105Q6615J83255o661
13304B96475q0207m7842o7298O3433P0955j64353K3359n1129K5448j08575j18506
13293a58240r5417M4645P4385K48564O8816R4298j35147r4908L7171J79741l6984
$$ y = [264168, 370457, 485142, 395203, 621372, 709842, 540398, 324678, 163374, 354474, 427199, 274707, 104126, 125410, -75838, -139477, -55811, -6874, -87862, -186413, -13087, 116537, 4383, 76733, 286949, 81666, -314530, -279771, 126757, 312181, 278504, 196297, 45191, -47743, -68624, -191752, -27437, 124796, 232611, 90957, -73618, -98962, -9862, 244357, 322903, 223935, 408637, 212578, 194401, 163980, 194759, 119362, 51057, 82049, 214171, 175566, 89320, -4023, -158243, -77839, 33266, 119881, 303136, 296475, 216268, 168426, 101128, 164561, 235516, 71163, 94522, 43393, 68841, -39734, -158240, -253657, -209012, -134627, 113937, 182753, 277051, 141904, 46996, 84167, 263908, 226924]
13282B26924R3151o0334j45323J32098l71557j06224P6431K71828O0576K3785
13272B01355J26296j23295k26116q2203k24190L5566J65639q5320K45497J28454
13262A61683q0153P5776K0875J17547J6384l0427j3580p6978m2046k0343O2188
13251A90926j2946N0468l7497P5591K4740l8412o5485P2648L6217o6546K4734
13240B54438j02545q1636L853p9098K85249J52147k40334k54928j28527k2966
13230b14347k01141J22304L65569J92849P2634k36493j08543J49134J91149n4836
13220B78279k86399j01272k760j06119K6435J75024J4168o3727j1210j82745K05550
13209e4776K78571O4995j2836k99359j91565J5946L02335L62430k18331j04529
$$ y = [226924, 320075, 259741, 114418, 246516, -125041, -231265, -154834, 116994, 177570, 201355, 327651, 204356, -21760, -103963, -328153, -292587, -126948, -212268, 33229, 161683, 81530, 157306, 178181, 295728, 312112, 281685, 268105, 191127, 149081, 128738, 190926, 177980, 228448, 190951, 266542, 291282, 252870, 187385, 260033, 296250, 229704, 254438, 151893, 70257, 74110, -4988, 280261, 432408, 192074, -62854, -191381, -214347, -415488, -293184, 72385, 265234, 337868, 101375, -7168, 141966, 333115, 278279, -8120, -109392, -112152, -218271, -191836, -16812, -2644, -66371, -77581, -260326, -54776, 223795, 288790, 275954, -23405, -214970, -199024, 103311, 465741, 247410, 142881]
13199A42881j97824j55697L3274K31559J23080j1975K6947l11144j30553J5072
13189b34380M1053J59013m3466q5786L2875l2794P1249J32766p6324j18883j2654
13178a67331P5238J12893J65452L5293j36969J26155l2801k5658N2711J30381
13168C35364J4944r4379k711N8297o449k08542K075j4219q9478k334M6800J21889
13156A61257J5942N897q0911q1665j09754K58618M22952p1114P792K26009j56582
13145E98441j56340K06520n2566j20085m286k26936J07161M87076J47558K7741
13135A014284J05333O9258j38213k16192K43978J30284m1813k07036R70r0903
13125H69950j7579j48625l22198j78646r6390m9668q9415k9250J85654J26462
$$ y = [142881, -54943, -210640, -177366, 54193, 177273, 165298, 192245, -118899, -249452, -234380, -193327, -34314, -77780, -163566, -130691, -163485, -92236, 40530, -35794, -154677, -167331, -92093, 20800, 186252, 221545, 84576, 210731, 177930, 152272, 204983, 335364, 350308, 255929, 253218, 311515, 305066, 96524, 98599, 84380, -5098, -7432, 39368, 161257, 177199, 183096, 102185, 20520, -89234, 169384, 592336, 521222, 529014, 755023, 598441, 442101, 648621, 596055, 475970, 471684, 244748, 351909, 838985, 986543, 1014284, 1119617, 1188875, 1050662, 834470, 1078448, 1208732, 1166919, 959883, 960853, 869950, 852371, 703746, 381548, 202902, 106512, 56844, -32571, -61821, 123833, 250295]
13115B50295J42068M6506k3294k40465M4753J18589j32296M5629k9248p5344p1346
13104G5847J47100K81188J0677j76701P1413j26753m9650n9171k48009k9989N9268
13093d4780K50982J72532m5329N2637k86832k39768Q2709J66088Q213r5251J62767
13082A83968L10727Q6392m7008k68830r167J29675K26585j50612j44437j3083
13072C04210j442l497M4304r3992k10685N0164N0587J1509R1548J3806j32702
13061A23810j87773J75004J64578P2610J50006L1820L7158j46968M2884J45274
13051F08403R1403L0627R5530j467j81520q6414M7308j23992j5019L0611q3460
13040D12010J9511n5091r8530Q7129j00508K42073J2969k56351K2372j32700m7962
$$ y = [250295, 392363, 438869, 415575, 175110, 219863, 338452, 206156, 251785, 222537, 147193, 75847, 222947, 504135, 514812, 338111, 409524, 282771, 233121, 173950, -74059, -104048, -44780, 206202, 378734, 333405, 386042, 99210, -140558, -57849, 108239, 116452, 21201, 183968, 494695, 581087, 534079, 265249, 256082, 385757, 612342, 461730, 317293, 304210, 302768, 299271, 343575, 249583, 38898, 89062, 139649, 151158, 242706, 256512, 123810, -63963, 111041, 275619, 348229, 498235, 530055, 567213, 420245, 463129, 608403, 699806, 730433, 825963, 824496, 642976, 556562, 603870, 479878, 464859, 495470, 412010, 431521, 376430, 277900, 365029, 264521, 506594, 519563, 263212, 285584, 152884, 104922]
13029A04922K37956J15817L4323K21911J10822L3775n7136j38992M1081K15944
13019I20423n4013q4862p8875j82039O4512M4500M06913J52121k85603k36890
13009F66187K79448O9595m2459J03019L99347k7323m6773J17084J24170m1193
12999A601102K3206K20048N6546k2812O1552J05759J57592J43131J66283L40141
12989B852548M05953M91350P19785Q19471J018592J155282J452061K030645K520119
12980A3465806K600549K359936K032452J126242M92383j79147p19525j327105
12972A9851591j607574j914816j995040j787923j338063j191382r22905m82153
12964H611735p8928K81141R48800Q65793R82731J798315K372290K573780K380810
$$ y = [104922, 342878, 458695, 493018, 714929, 825751, 859526, 802390, 663398, 704479, 920423, 866410, 781548, 702673, 520634, 585146, 629646, 1036559, 1188680, 903077, 666187, 945635, 1015230, 972771, 1075790, 1475137, 1447814, 1401041, 1518125, 1642295, 1601102, 1624308, 1844356, 1900902, 1878090, 1939642, 2045401, 2202993, 2346124, 2512407, 2852548, 3258501, 3749851, 4469636, 5289107, 6307699, 7462981, 8915042, 10945687, 13465806, 16066355, 18426291, 20458743, 21584985, 22077368, 21898221, 21178696, 19851591, 18244017, 16329201, 14334161, 12546238, 11208175, 10016793, 9093888, 8611735, 8532807, 8813948, 9762748, 10628541, 11611272, 13409587, 15781877, 18355657, 20736467]
12955B0736467K101446J976650J238229N40918m26913j113591j831033k024533
12947B1197640j848181j622201j199895m29469k41963K32878Q60868J289281J649391
12938A9888349J887362J746509J130048L41718J75442n44138q47697j077486j741634
12929B0958473j678895j888802j585738j364563r99052o97219k97051r4674J27589
12920A2480068Q89125J176832J685651J913669J929678K196366K320552K284539
12912B6876480K309397J981027J625024J465800J176688R96576N96917O14376
12904C7642285J27727o03925p83319j147617k032137k431557k777800k616892
12896B5376765k341510k324423k048512j745339j143115q42192m02829j00830
$$ y = [20736467, 22837913, 24814563, 26052792, 26593710, 26166797, 25053206, 23222173, 21197640, 19349459, 17727258, 16527363, 16097894, 15855931, 16088809, 16949677, 18238958, 19888349, 21775711, 23522220, 24652268, 24993986, 25169428, 24625290, 23777593, 22700107, 20958473, 19279578, 17390776, 15805038, 14440475, 13441423, 12744204, 12447153, 12352479, 12480068, 13369193, 14546025, 16231676, 18145345, 20075023, 22271389, 24591941, 26876480, 29185877, 31166904, 32791928, 34257728, 35434416, 36430992, 37027909, 37642285, 37770012, 37166087, 36382768, 35235151, 33203014, 30771457, 27993657, 25376765, 23035255, 20710832, 18662320, 16916981, 15773866, 14931674, 14528845, 14428015]
12888A4428015O46378J507923K037007K207414K249252K227847K236350K021716
12880B9561902J547610J201478M45157n03592j351806j671730j899636k231356
12872B5098027j992861j504169q87622j63238N68342J648286K343321K548151
12864B7658237K536090K046821J597480Q45418k04050r02310j866346k650643
12856B9060697k902303k776615k693220k319819k043702j692047r42843k02793
12848A3487355J19751K66482N90370R73850J820033K550671K554474K436781K240422
12839B7040189K039270J676216P01176l50449j163052k033989k953212l043654
12831B1912495l011136k917035k274713j749396j450165j389934j093201p43834
$$ y = [14428015, 15074393, 16582316, 18619323, 20826737, 23075989, 25303836, 27540186, 29561902, 31109512, 32310990, 32756147, 32252555, 30900749, 29229019, 27329383, 25098027, 23105166, 21600997, 20713375, 20550137, 21118479, 22766765, 25110086, 27658237, 30194327, 32241148, 33838628, 34684046, 34479996, 33577686, 31711340, 29060697, 26158394, 23381779, 20688559, 18368740, 16325038, 14632991, 13690148, 13487355, 13607106, 13873588, 14463958, 15437808, 17257841, 19808512, 22362986, 24799767, 27040189, 29079459, 30755675, 31456851, 31106402, 29943350, 27909361, 24956149, 21912495, 18901359, 15984324, 13709611, 11960215, 10510050, 9120116, 8026915, 7283081]
12823G283081n09434o30486m59913l35452m50050m20271l24896k33237k38485
12814C680857l06683q0491l7707k98784j72416J71729k18580l70235O7691j34778
12804B300603m4989k19690K07178n4259k87926j4241K43243Q9666r0061j61042
12794A968482o6552J09637J5962j52723l1151K20847Q5074j75241j52741O0218
12784A881812N6909j02107k6604N5138q376P780m9654j72939J3431L56785n6683
12773A955492J78404j00946r3596J48706K44894j51793l03788j17053O8092J64137
12763A992549M6248J42716R4049J60434K89825M6116p3002k861K64588K66475
12753C227137M29296K22694n3006J49130j37600l1531j71329j21355n9404j32608
$$ y = [7283081, 6773647, 6143161, 5683248, 5347796, 4897746, 4477475, 4152579, 3919342, 3680857, 3374174, 3293683, 3255976, 2957192, 2784776, 2956505, 2737925, 2367690, 2435381, 2300603, 2255614, 2035924, 2243102, 2188843, 1900917, 1886676, 2129919, 2219585, 2129524, 1968482, 1901930, 2011567, 2027529, 1874806, 1843655, 2064502, 2149576, 1974335, 1821594, 1881812, 1938721, 1836614, 1810010, 1865148, 1856772, 1864552, 1814898, 1641959, 1655390, 2012175, 1955492, 2133896, 2032950, 1939354, 2088060, 2332954, 2181161, 1877373, 1760320, 1828412, 1992549, 2038797, 2181513, 2275562, 2435996, 2725821, 2771937, 2698935, 2696074, 2960662, 3227137, 3656433, 3879127, 3826121, 3975251, 3837651, 3806120, 3634791, 3513436, 3454032, 3321424]
12743C321424N9345q3944l6237N4400J71476K0216N2009J31358K82001M78817
12733D450865R8113j05122K27945K24246K25513O69979P96293O11656N40917N98374
12723H338779Q32294J094094J563257J566103J702786J849970K015047K531528
12715B1493858L101940M269032O203995Q652993J2828355J8371521K4219128K9362197
12707A28503019L2018261L0532037K5072726J6012156N082026o841431j7771242
12700B12607552k6019715l0261327l0329624k6971380k1176018j6008723j1936601
12693D9904164q669744o196638m319849l316147k945922k555507k158627j994934
12685A7746796k067902j474963j137638j056979r22784r22839p16790m26756o08411
$$ y = [3321424, 3380769, 3296825, 3260588, 3314988, 3486464, 3506680, 3558689, 3690047, 3972048, 4450865, 4548978, 4443856, 4671801, 4896047, 5121560, 5791539, 6587832, 7199488, 7740405, 8338779, 9171073, 10265167, 11828424, 13394527, 15097313, 16947283, 18962330, 21493858, 24595798, 28864830, 35068825, 43721818, 56550173, 74921694, 99140822, 128503019, 160521280, 191053317, 216126043, 232138199, 237220225, 230378794, 212607552, 186587837, 156326510, 125996886, 99025506, 77849488, 61840765, 49904164, 41234420, 35037782, 30717933, 27401786, 24455864, 21900357, 19741730, 17746796, 15678894, 14203931, 13066293, 12009314, 11086530, 10163691, 9446901, 9020145, 8411734]
12676H411734n20565o02610n78332k95390l02923l97877j76707k67259l6126Q5734
12666E319679k80786l40983k42253r4875R3577J8199m39595r409J91121R988K96442
12655D521105N46902J70181L4623N8697J88494J18225l20222n45272m20759m55894
12645C896080o08349m31826k17418j52114n0506n6044j88060p4990M9996J53380
12635B320149n2186n8319o937O1801k5161j65568m07736j51432j80172P1317J9670
12624A425426J80610R1344j17340q6769k05182M5044J09171j49191K9761P056
12614A329930j07055K4323N0779m9860j62645J7841K06363q8165j29905O0308
12604A151914J27073J49416J07545o6533K7281j28247O5543j3949q8234J40897
$$ y = [8411734, 7891169, 7288559, 6710227, 6414837, 6111914, 5714037, 5537330, 5270071, 5233945, 5319679, 5038893, 4697910, 4455657, 4360782, 4454359, 4472558, 4032963, 4023554, 4214675, 4224663, 4521105, 5068007, 5238188, 5272811, 5331508, 5520002, 5638227, 5318005, 4772733, 4351974, 3896080, 3287731, 2855905, 2638487, 2486373, 2435867, 2379823, 2191763, 2116773, 2166769, 2320149, 2267963, 2209644, 2202707, 2264508, 2239347, 2073779, 1666043, 1514611, 1334439, 1405756, 1425426, 1606036, 1697380, 1580040, 1493271, 1288089, 1333133, 1442304, 1293113, 1322874, 1329930, 1222875, 1247198, 1297977, 1248117, 1085472, 1103313, 1309676, 1221511, 1091606, 1151914, 1278987, 1428403, 1535948, 1469415, 1496696, 1368449, 1433992, 1420043, 1331809, 1472706]
12594A472706K09431O4474J96478M90317K63768L52203J67669k26612l24186L4720
12584B700968L3202L9998K7070j55241l56626k91421j87439k8557J64596J01423
12574B047973l7664M7009J11964P4447k387j97806j0554n0314R544L16174K24424
12563B532810J35642k9368p7496O87J52956K25917n607o5265j3599J56580J35106
12552C148363J29182J47620K28023M71774O47420O96990J72551k97886m14059
12543D929978k00011j65663m94774m65720k32176m24240j16395k20368j93378
12534B417253K11428K46082N8276p676m3258k78452n30726l8867J67113M1831
12524B243004J05275j43228J20496m6330k43271j56258r0586J06963r952q4375
$$ y = [1472706, 1682137, 1746611, 1943089, 2433406, 2697174, 3049377, 3217046, 2990434, 2666248, 2700968, 2734170, 2774168, 2801238, 2645997, 2289371, 1997950, 1810511, 1781954, 1946550, 2047973, 2010309, 2057318, 2169282, 2243729, 2241342, 2043536, 2032982, 1982668, 1992212, 2308386, 2532810, 2668452, 2639084, 2561588, 2562275, 2715231, 2941148, 2935541, 2870276, 2856677, 3013257, 3148363, 3277545, 3425165, 3653188, 4124962, 4772382, 5469372, 5641923, 5344037, 4929978, 4729967, 4564304, 4069530, 3603810, 3371634, 2947394, 2830999, 2610631, 2417253, 2628681, 2874763, 2933039, 2925363, 2882105, 2603653, 2072927, 2034060, 2201173, 2243004, 2348279, 2205051, 2325547, 2279217, 2035946, 1879688, 1789102, 1896065, 1886113, 1801738]
12514A801738j78117k4015K17940Q9580K03769M20094Q8339j40052J40815L35172
12504B955263J92769k3706l54261m44440k89131l44255k11818N9832J12863j12247
12494A540869o4692q1360j26690J51640K10190m5292j93681j60484J3250r5740
12484A148010j18368J9495k7487j52163o040k1773N4500M4786N2162K5139L6966
12473A055227k380L6350m7413j24234q5305J29727J32450j12823j72278J10974
12463I20295P7056k15069r4753m2099N3291J60819j70026J6729M7435J88917P7791
12452A020386j13987Q2248J21142J05060J35225q3037R9336l0925J40576J48386
12442A624410O056J29787J14264O2106j43772J40026J14109R7284L6889M83989
$$ y = [1801738, 1623621, 1599606, 1817546, 1907126, 2110895, 2530989, 2619328, 2479276, 2620091, 2955263, 3148032, 3124326, 2770065, 2325625, 2036494, 1692239, 1480421, 1540253, 1653116, 1540869, 1476177, 1394817, 1268127, 1419767, 1629957, 1584665, 1390984, 1230500, 1243750, 1148010, 1029642, 1049137, 1021650, 869487, 863447, 841674, 896174, 940960, 993122, 1018261, 1055227, 1052847, 1089197, 1041784, 917550, 832245, 961972, 1094422, 981599, 809321, 920295, 997351, 782282, 687529, 645430, 698721, 859540, 689514, 706243, 753678, 942595, 1020386, 906399, 988647, 1109789, 1214849, 1350074, 1267037, 1366373, 1335448, 1476024, 1624410, 1630466, 1760253, 1874517, 1936623, 1792851, 1932877, 2046986, 2144270, 2181159, 2665148]
12432B665148L48222L35566K89051L14170L46755O35495Q80257J007161J217139
12423H038964J650467J803710K519714L235695L963310L977514L751734K716284
12415C1657392J134095p66540k378202l415708m026979l208035k324776j979332
12407A4691915j731501r79944m60918j06685P28905J045207J317642K210523K605312
12398A9320456L073906L557556L392091K898809K014331L04579j160474k520819
12390C0880435l600554l820902l627834l042238k311655j672553j439411j154542
12382A0210746n37149j25727j13632q4946J6636J12650P96833J127645J548146
12373A2951202K233097K625174L063312L609563L681461L523252K770741J365353
$$ y = [2665148, 3013370, 3348936, 3637987, 3952157, 4298912, 4934407, 5814664, 6821825, 8038964, 9689431, 11493141, 14012855, 17248550, 21211860, 25189374, 28941108, 31657392, 32791487, 32024947, 29646745, 26231037, 22204058, 18996023, 16671247, 14691915, 12960414, 11980470, 11519552, 11412867, 12141772, 13186979, 14504621, 16715144, 19320456, 22394362, 25951918, 29344009, 32242818, 34257149, 34561728, 33401254, 30880435, 27279881, 23458979, 19831145, 16788907, 14477252, 12804699, 11365288, 10210746, 9673597, 9547870, 9434238, 9349292, 9365928, 9478578, 10275411, 11403056, 12951202, 15184299, 17809473, 20872785, 24482348, 28163809, 31687061, 34457802, 35823155]
12365C5823155n43661j771202k964766l380350l328328k957799k324928j932875
12357A6619246j199203p12849q8211P79414J548854J965457K584878L566367M524827
12348B9588780N185825N427348N146828M358167L327214J284294j170163l067260
12340E0081033m201290m831328m908074m893044m524810l773628k940891k183458
12332A7824510j812468j376320o70548j27440K56567O86176J189723J984125K552774
12323B0507099K740891K357110J833054J072441l32375j559091k416160k434120
12315B1768849k777737k383423j967661j761212j620154j118490o75573o52768
12307H811831m00974k36425j24900k3597K14586M86909O97978J014114J660381
$$ y = [35823155, 35279494, 33508292, 30543526, 27163176, 23834848, 20877049, 18552121, 16619246, 15420043, 14707194, 14618983, 15398397, 16947251, 18912708, 21497586, 25063953, 29588780, 34774605, 40201953, 45348781, 49706948, 53034162, 54318456, 53148293, 50081033, 45879743, 41048415, 36140341, 31247297, 26722487, 22948859, 20007968, 17824510, 16012042, 14635722, 13965174, 13837734, 14094301, 14780477, 15970200, 17954325, 20507099, 23247990, 25605100, 27438154, 28510595, 28178220, 26619129, 24202969, 21768849, 18991112, 16607689, 14640028, 12878816, 11258662, 10140172, 9464599, 8811831, 8410857, 8174432, 8049532, 8025935, 8240521, 8727430, 9425408, 10439522, 12099903]
12298A2099903K256180K469328L001854L250723K918537K087994N77159p72813
12290B7888865j641797k406205k779955k514448k279186j765282j546948j322108
12282A1632936r52338n78232j58852M77457R78160J358855J753567K409867L318829
12273B0240249L725304L084156J689055O3759j549745k382510l032422l227796
12265A8610050k832034k355369j915448j725948j487759j012606r59884p52957
12257E568045n03225k19981o30065n38250l09194k08981j96698j56390r0357m056
12247B710848j31498j62138k45172j79500n951m2785k11055J36381j58538k90788
12237A419804r8889k7716N438j5634J07729k3748K4391O8559L7874j2215k39843
$$ y = [12099903, 14356083, 16825411, 19827265, 23077988, 25996525, 28084519, 28661678, 27888865, 26247068, 23840863, 21060908, 18546460, 16267274, 14501992, 12955044, 11632936, 10680598, 10102366, 9943514, 10420971, 11399131, 12757986, 14511553, 16921420, 20240249, 23965553, 27049709, 28738764, 28802523, 27252778, 24870268, 21837846, 18610050, 15778016, 13422647, 11507199, 9781251, 8293492, 7280886, 6321002, 5568045, 5064820, 4844839, 4214774, 3676524, 3367330, 3158349, 2961651, 2805261, 2714904, 2710848, 2579350, 2417212, 2172040, 1992540, 1986589, 1943804, 1732749, 1869130, 1710592, 1419804, 1320915, 1293199, 1298637, 1283003, 1390732, 1366984, 1391375, 1459934, 1497808, 1485593, 1245750]
12226A245750l8722j77108m4949K7894j872q4388O0623K31244k05180j85130r1713
12215G36449L2638p8206P3076J92302J07815j52183p2155J49866J14686j77392
12205I26896r8398j39261j78773l9019O1343N4606J64980K39455Q512j42741j09386
12194G48214J77460J771J13048j65378k47097q4716J74434p8201k59864j0584
12184C69087Q8150K48175J35851M1999n0613k22635j01997j32349l0048L63969
12174G09589j00408k65219M3955J20277j20841l49919M6847L51581Q4094j54894
12164C65062m9836J2133l8694J96361j5302k7824n7621k16990J7660J8739J17073
12153C20761J14117q5080j59985l5818N8112p1208J97147L23061k59706l20899
$$ y = [1245750, 1207028, 1029920, 984971, 1012865, 1010993, 926605, 987228, 1218472, 1013292, 828162, 736449, 769087, 690881, 763957, 956259, 1064074, 911891, 839736, 989602, 1104288, 926896, 828498, 689237, 510464, 471445, 532788, 587394, 752374, 991829, 1000341, 857600, 748214, 925674, 927445, 1040493, 875115, 628018, 543302, 717736, 639535, 379671, 369087, 457237, 705412, 841263, 883262, 832649, 610014, 508017, 375668, 345620, 709589, 609181, 343962, 387917, 508194, 387353, 37434, 84281, 435862, 519956, 365062, 315226, 327359, 288665, 485026, 469724, 441900, 384279, 167289, 184949, 203688, 320761, 434878, 349798, 189813, 153995, 212107, 140899, 338046, 661107, 401401, 80502]
12143H0502o0356Q2165Q9401q2650J3568j4311O9246J82307Q2430m7185J9826
12132D14943p3258l82229j34723J48411j7422J28266K49943o4194j14211q4588
12122G0938j1965K46240o9277o0911q121r8116P7773r2714j49561Q329K20345
12111A32960n2278R3680M0277l9952n2555J24174O8782j6941j67733m7386J84281
12100B67309j83188k63758N4224O3498R5262R1726J14141p9658J8812K04175J43349
12089E25892j760l0093j23598j37740J51721j6985k2639l23378P0012J6192N2530
12078A60154J72470O1845R0644J0772n2872j80919N6911q2219k80694j15352P6624
12067h2636P2421j14303J25912J72607l7072j02293P5323J29287J9703M9013J22802
$$ y = [80502, 20146, 102311, 191712, 109062, 122630, 108319, 177565, 359872, 442302, 395117, 414943, 341685, -40544, -175267, -26856, -44278, 83988, 333931, 269737, 155526, 70938, 58973, 305213, 235936, 175025, 166904, 68788, 146561, 53847, -95714, -87385, 132960, 80682, 174362, 214639, 174687, 122132, 246306, 315088, 298147, 130414, 83028, 267309, 84121, -179637, -125413, -61915, 33347, 125073, 239214, 159556, 178368, 382543, 525892, 524132, 494039, 370441, 232701, 384422, 367437, 344798, 21420, 91432, 107624, 160154, 332624, 394469, 485113, 495885, 443013, 262094, 319005, 236786, -43908, -159260, -82636, -10215, -124518, 1394, 174001, 136929, 34636, 109959, 239246, 258949, 307962, 430764]
12056D30764o2898k61484j63784O8489j63126J8367K38166J27008k5874O5680
12046B71308l9741j34955J50663K61514O7643j98042p4727j65470j66937m9974
12036g8718P0170J1139J13929J23817J11539o7647j05867l14110j19987n1268
12026c07003R7448K14162J1718K34787j5952J36443j15285k44311o643J14129
12016A19493J00609j70245Q6246J02773N4830P9218r0321j55714k87094j60315
12006c20520J35497J56117j27691k5342K87025O9057Q2967J86311j83250j21818
11996A38353m9786L1947M548K1751J71981j05061k12219N8723L47747J02012o5160
11985D44836j03376k28840l50115M9195J71930n7553j11979L0367P96J7899L1064
$$ y = [430764, 367866, 106382, -57402, 11087, -152039, -133672, 104494, 231502, 205628, 271308, 231567, 96612, 247275, 508789, 576432, 378390, 303663, 138193, -28744, -78718, -8548, 2591, 116520, 240337, 351876, 284229, 178362, -135748, -255735, -307003, -209555, 4607, 16325, 251112, 235160, 371603, 256318, 12007, 5364, 119493, 220102, 49857, 136103, 238876, 293706, 372924, 282603, 126889, -160205, -320520, -185023, -28906, -156597, -181939, 105086, 174143, 257110, 443421, 260171, 138353, 88567, 120514, 125062, 146813, 318794, 213733, 1514, 60237, 407984, 509996, 444836, 341460, 112620, -237495, -188300, -16370, -73923, -185902, -155535, -154739, -136840, -105776]
11974a05776j62527j82201N469J36131J92461O1500p9559j57176J59226J18945
11964a3507o303p3526J81225k6570n7535O4910Q6605Q7384k08307j98615k1722
11953a85961O8446j65148R1420Q5439m9382L2871R0090j60951j00250m6670P8226
11942b61870R5903R6274Q6739k62409j3791J56624M1246J04022K27812p963J51117
11931D13704J35897l46525j40569M0871J57576j27634r5660J44400J634K3563
11921B07257r6033j33727k04035r5080K77493J01202M495L47639P5623q2938l14954
11910H6942m3764j85238j99119j07672J10063L00810K29420j85214J20970p3688
11900E3510J44838J09112m3262r8570q0550r9652K5298J91900N6107p9905k1945
$$ y = [-105776, -268303, -450504, -445035, -308904, -116443, -54943, -134502, -291678, -132452, -13507, -19810, -93336, 87889, 61319, 3784, 68694, 155299, 242683, 34376, -164239, -185961, -117515, -282663, -191243, -105804, -155186, -122315, -32225, -193176, -293426, -340096, -261870, -165967, -69693, 17046, -245363, -259154, -102530, -61284, 42738, 270550, 262587, 413704, 549601, 203076, 62507, 103378, 260954, 133320, 37660, 182060, 183694, 207257, 111224, -22503, -226538, -321618, -44125, 57077, 61572, 409211, 484834, 401896, 86942, 43178, -142060, -341179, -448851, -338788, -37978, 191442, 6228, 127198, 53510, 198348, 307460, 264198, 165628, 85078, -14574, 10724, 202624, 258731, 178826, 156881]
11889A56881R0215L8346o3971m7625k02586n0789O3559L9125K78067q3914n6959
11878A60349R4813q3767l6302P7926j25578j15101J89765j26526R2052K41388
11868C69019j37591k18723J66903M6173o1113l49669k28430K35328r6257j33524
11858d07884J45639j16637m3677N4074K668J12519P4107L41525K7320o1691k17816
11847h9853J6558O3943k39929n5842J18302J03093L37777N3236m6241p337l2291
11836B21416j60744J9208J24986O2157J43836J96253j98828l20487j6372L4114
11826A05539j08605k58703r3758K17881K86299L4705r1676L5454r1361o9518J61190
11815A27447o5419J16111R0309j26657j61178J46368K8157k68334j86444L49207
$$ y = [156881, 247096, 285442, 221471, 173846, -28740, -79529, -15970, 23155, 301222, 217308, 160349, 255162, 171395, 135093, 213019, 87441, -27660, 162105, 35579, 127631, 369019, 231428, 12705, 179608, 225781, 164668, -185001, -413431, -178103, -274360, -407884, -262245, -378882, -422559, -368485, -365817, -253298, -179191, 162334, 189654, 127963, -89853, -73295, -9352, -249281, -305123, -186821, -83728, 254049, 307285, 261044, 253707, 221416, 60672, 79880, 204866, 267023, 410859, 607112, 408284, 87797, 71425, 105539, -3066, -261769, -355527, -137646, 148653, 183358, 91682, 127136, 35775, -33743, 127447, 62028, 178139, 268448, 141791, -19387, 126981, 155138, -113196, -299640, 49567]
11805D9567O7341j98995O5388j6005n9518m0483r0442M7788K9220K20439M1353
11794A15653k90560J54921K27423J75180l11269k18682Q5206L9758q988j63908
11784a95266K1869L1705j1490N2368j30514o6878J35219p5321k15832k3300K09400
11773b68040r5938j40809J68037J42846n4054L9371J2774P6685M7196Q7669J61304
11762A77041r1887j53973L07619O5027q1231r1783l25490k3012J61877K8697R2004
11751F4889K6199j17211k6291k2802o5221j26021m0077K46066J00212O1924K995
11740A04662j42377P461J1430o1192q3290j03797R3618o445k7827j45895j47527
11729e01179R412K2760K43851L02053P8665J01320J90437R4531j63544j7671r8402
$$ y = [49567, 116908, -82087, -16699, -32704, -92222, -132705, -223147, -175359, -146139, 74300, 115653, -174907, -19986, 207437, 382617, 71348, -147334, -62128, -22370, -31358, -195266, -173397, -141692, -153182, -100814, -231328, -298206, -162987, -238308, -454140, -477440, -268040, -363978, -504787, -336750, -193904, -247958, -208587, -195813, -119128, -71932, 15737, 177041, 85154, -68819, 238800, 303827, 222596, 130813, -194677, -217689, -55812, -27115, 64889, 91088, -26123, -52414, -75216, -140437, -266458, -306535, -60469, 39743, 101667, 104662, -37715, -30254, -18824, -80016, -163306, -267103, -173485, -179930, -207757, -353652, -501179, -491767, -469007, -225156, 76897, 155562, 256882, 447319, 541850, 378306, 360635, 262233]
11718B62233K5811o5516j19480q97l3525k34546j03478k1537J55679J10070l2240
11707e7426k38258p7117O9410L28399K18943j58040j70260o5303J92479r1193
11697d8366j45374J66897L0528p3289j15315J94970j9850R7025q6631m6979o6818
11686a13202l6544r8701J28784M5694j24378O5780m2477J59141P3875j15760K363
11675e5425p141r8351Q825j66843l2682N3653L15752j1467k02816K05338J41621
11664A50464L3976n8214J20618o3782j22664J5414J5718r8183K57764J82067k32303
11653B00875l1921O2050q7815J81247j1533J4243k29871n7626J4088k55298j58617
11642c60178P0086j1890K00631p1420q1757K31383m9487j17706q3731R6224M2865
$$ y = [262233, 288044, 222528, 103048, 102151, 68626, -165920, -269398, -290935, -135256, -25186, -57426, -295684, -372801, -303391, 25008, 243951, 85911, -84349, -149652, 42827, -48366, -193740, -26843, 3685, -69604, -184919, 10051, -9799, 87226, 595, -46384, -113202, -149746, -248447, -119663, -73969, -198347, -132567, -175044, -15903, 57972, -57788, -55425, -62566, -160917, -152092, -318935, -351617, -297964, 17788, 6321, -196495, 8843, 150464, 184440, 126226, 246844, 183062, 60398, 75812, 91530, -6653, 251111, 433178, 200875, 168954, 231004, 143189, 324436, 312903, 327146, 97275, 39649, 53737, -201561, -360178, -290092, -301982, -101351, -172771, -254528, -23145, -72632, -190338, -274069, -177845, -134980]
11631a34980k39503j93977N7029J88794N2889j0614k1895K55459k3266n2654J10277
11620a2441j29328M7168p1063l3850j42564J044L24311J19005k5593j9775j20341
11609f3427j54768j34680o7055k1555R3346O4957K6519K7184j85686m5270K07069
11598b53366N6752J1109p0770K16305j28466m0239Q6442J39443j0499k41968o5519
11587c00776M8334k57235J12377k8914R0093k9409P6905J54835j65354J8443K12566
11576f8135J47488m6672j38049L384K24476J34657j08081l22077j24042j10756
11566d07807j4989L9809k4177J11275j33505J85910J97196M3926Q7201o3R750
11555I4526K6192N9410q1672k82668M1793j68680k1703R9637P740K43341q9045
$$ y = [-134980, -374483, -568460, -511431, -322637, -269748, -280362, -302257, -46798, -70064, -122718, -12441, -141769, -94601, -165664, -199514, -342078, -341034, -16723, 102282, 76689, 56914, -63427, -218195, -352875, -419930, -441485, -348139, -283182, -256663, -229479, -415165, -460435, -253366, -196614, -185505, -256275, -39970, -168436, -208675, -122233, 17210, 6711, -235257, -300776, -252442, -509677, -397300, -426214, -336121, -365530, -288625, -133790, -299144, -280701, -68135, 79353, 32681, -105368, -101984, 122492, 257149, 149068, -173009, -297051, -407807, -422796, -382987, -407164, -295889, -429394, -243484, -46288, -2362, 84839, 84776, 94526, 120718, 180128, 98456, -184212, -142419, -311099, -332802, -233165, -225425, 17916, -71129]
11544g1129K9047j46830j04776K96130J32803J13424o9330j68268r2523j02138
11534a83590O8699m9319J262l9430j09941J10754r6926N4857M0712j93583O6062
11523c30443L9170N4149j35470P1030K37893O8300J73992J27508M1912j42979
11513B05062j39012j08796p6161n6023k1636j09663R2574M3755n8145k1942j1978
11502b61965K20309R2917P1029J09051J03900k07847k41491J08758K1829j88628
11492a72138k38984K18747P9755q0300p8380O3065j07938L494J55943K33378R0456
11481A67098j08921m1488j99539k6356J43457K03371K8089N605K60434J5960M9149
11470D96859k54456j50274q1450k01123j6061j29546j55667K6607J33729N1381
$$ y = [-71129, -42082, -188912, -293688, 2442, 135245, 248669, 179339, 11071, -81452, -183590, -114891, -164210, -162948, -202378, -312319, -201565, -298491, -243634, -202922, -396505, -330443, -291273, -237124, -372594, -301564, -63671, 4629, 178621, 306129, 348041, 205062, 66050, -42746, -118907, -174930, -196566, -306229, -213655, -169900, -228045, -249987, -261965, -41656, 51261, 122290, 231341, 335241, 127394, -114097, -5339, 16490, -172138, -411122, -192375, -112620, -192920, -271300, -208235, -316173, -312679, -156736, 76642, 167098, 58177, 16689, -182850, -209206, -65749, 137622, 165711, 171316, 431750, 447710, 496859, 242403, 92129, 10679, -190444, -206505, -336051, -491718, -465111, -331382, -280001]
11460b80001J86031K04271k05638o5060M2346O8045l0178P9609N1198N3546j14189
11449a0020K7514N6846p6543J18704P4060J27974j33584j05260j04005p7843J03428
11438A271J06844K15346O5942j57423Q9442L114m8309j43188k13095R2168p5378
11427f3266j28078n5330J99351j57746k54949M9495J58586K13022Q4384j12159
11417f6690n0000L534o6073r4777J02058J36975J16195k03249j13304L4883J99677
11406g71K2207l2389j68718p7172j91903j02881l6832J10467Q9136N8468Q2050
11395b48338K25747J82470j15095j16418n4318J45301J0802j75845k2927J25558
11385d3063N6097J26080k56118o3449Q8481l9688K16980M4697m7618p5745j4917
$$ y = [-280001, -93970, 110301, -95337, -160397, -118051, -50006, -80184, -575, 50623, 104169, -10020, 17494, 74340, -2203, 116501, 190561, 318535, 184951, 79691, -24314, -102157, 1271, 108115, 323461, 389403, 231980, 321422, 324536, 276227, 133039, -80056, 12112, -63266, -191344, -246674, -47323, -205069, -460018, -410523, -251937, -38915, 45469, -66690, -116690, -113156, -179229, -274006, -171948, -34973, 81222, -122027, -235331, -200448, -771, 21436, -10953, -179671, -256843, -448746, -551627, -588459, -477992, -388856, -330388, -248338, -22591, 159879, 44784, -71634, -125952, 19349, 30151, -145694, -168621, -43063, 13034, 139114, -117004, -180453, -91972, -131660, 85320, 130017, 82399, 6654, -8263]
11374h263J31252N9740k35113K22534N5548J37243l9529j79810k79423j30111
11364b65932J17718L16363J18122N9448n147j63988l0797j67920j46874P0915
11354i8092J07295J63863j34082j86490q4930J45145K39074Q2879M9373o2962
11344B21073j1859J38729J52080M6708m2932j57528k7828j04032l6315j37157
11334D0939j79112K33623P0467j17387j70326J20986J17271K1838j1006n7229
11324G0064R8861j06005J83205N1544k18076n5898L3473j01830j29381J7060K34667
11313G7684J5848J02567J379j86931j09043r0343k1793k6138N5446k8992K12994
11302B678R7402j43347k65688J3593J16838J67341J25065J06515k74665l51520
$$ y = [-8263, 122989, 182729, -52384, 170150, 225698, 362941, 323412, 143602, -135821, -265932, -148214, 168149, 286271, 345719, 340572, 176584, 145787, -22133, -169007, -98092, 9203, 173066, 38984, -147506, -232436, -87291, 151783, 234662, 284035, 221073, 209214, 347943, 500023, 546731, 503799, 346271, 318443, 214411, 178096, 40939, -138173, 95450, 165917, 48530, -121796, -810, 116461, 138299, 127293, 70064, 168925, 62920, 246125, 297669, 79593, 23695, 57168, -44662, -174043, -156983, 77684, 93532, 196099, 197478, 10547, -98496, -188839, -210632, -236770, -181324, -210316, 2678, 100080, -43267, -308955, -295362, -178524, -11183, 113882, 220397, -54268, -405788]
11292d05788k15862R5407K37045P8938P2018n3015r0679J71595O778K07798N4192
11281A58427k3041O085j23412k80938q6279P8347l6607J18257k8156P130J67485
11270d2702K01679j35588j5752o6265J170J64076M4663J26903j9306j43218l00533
11259a84873k91878M4790K44223J7054m7989Q0427J01442P9664O1572K23315J57357
11248D85104j07379k037J5563q3306j74776N9872Q8732m8874O6412k10754j68239
11237g9682j23709R3809j6961j32037K50931K4887m6425p9723k7582Q6785J72719
11226A23012K9456l0784k9613l6216j06885l5519J15873j96178N9962o3504o5286
11215b35682n623L69572J81093p9337l418j68695r3902R5758Q6617O5545k46459
$$ y = [-405788, -621650, -526243, -289198, -210260, -138242, -191257, -281936, -110341, -103563, 104235, 158427, 135386, 141471, 18059, -262879, -349158, -270811, -307418, -189161, -217317, -210187, -42702, 158977, 23389, 7637, -58628, -57458, 106618, 151281, 278184, 258878, 115660, -184873, -476751, -431961, -187738, -170684, -218673, -138246, -36804, 42860, 104432, 327747, 485104, 377725, 375688, 391251, 307945, 133169, 193041, 281773, 232899, 299311, 88557, -79682, -203391, -109582, -126543, -258580, -7649, 17238, -29187, -108910, -136492, -49707, 123012, 152468, 121684, 92071, 55855, -51030, -86549, 29324, -166854, -106892, -170396, -235682, -241305, 128267, 309360, 230023, 226605, 57910, -35992, 59766, 146383, 211928, -34531]
11204c4531p8689k25262j36310K09607r661m5633K1430M4203J086K02068Q0900
11193B9208k6441j20288R2640J10999m5253j69936o0024N4188J57973k6495j16088
11182a19517r3981k24862p8437L47102J48090j19536o0920k4835J24725J38607
11172C6436O841j39495J6282J83188j4812j70954k9027o5999k13380L8605K66926
11161h5389o7933L35p4801K7037R3136Q3171k9285p1754p130K07508J28473L1863
11149B35231k81324j12129J06770J3964n3981R0L9787K20392J67087m0306k22964
11138G2617r430K0903j58267n7186J4674n9720r4265J88495J28161K70327K7831
11127C44140n2441J71643J06221j10754j07701l00635n1789j03367Q6748P3521
$$ y = [-34531, -113220, -338482, -474792, -265185, -274846, -320479, -299049, -254846, -253760, -51692, 29208, 2767, -117521, -24881, 86118, 40865, -129071, -189095, -134907, 23066, -3429, -119517, -213498, -438360, -516797, -169695, -21605, -141141, -202061, -226896, -102171, 36436, 43277, -96218, -79936, 103252, 88440, -82514, -111541, -177540, -390920, -352315, -85389, -153322, -152987, -227788, -200751, -107615, -24444, -53729, -125483, -132613, 74895, 203368, 235231, -46093, -158222, -51452, -37488, -91469, -91379, -51592, 168800, 335887, 295581, 72617, 63187, 84090, -74177, -131363, -116689, -176409, -270674, -82179, 45982, 316309, 344140, 291699, 463342, 569563, 458809, 351108, 50473, -1316, -104683, -17935, 55586]
11117E5586j21760j25419j38343O2305Q9779J8184k87859J8604Q6962L6263K54976
11106e0722M2358J06851j81475l6782k6655j38859n9477J71693K07547K5591j16420
11095e6350q3934O3223m025J45298K1433j67496p6858o2513Q2767L57762j79453
11084C9854k01047K06339J39758j33084k55753J52368J55977k24347O9611K38991
11074A88667r2893k18531R9409l9710k8311j06458O8739L11184J24653j4090j39290
11063A53369j82420O3635O3740J5345p1625j26640q5165J38183K09720j02072
11053G6070j90575O9007N2761j06576L6370j61257l1971l7619Q0802j5420j5051
11042b43459J00413J64529k8975J3923q1871J0200J74635q6396K6168J11978r4170
$$ y = [55586, -66174, -191593, -329936, -267631, -177852, -159668, -447527, -428923, -341961, -305698, -50722, -8364, 98487, -82988, -119770, -146425, -285284, -344761, -173068, 34479, 60070, -56350, -140284, -77061, -81086, 64212, 85645, -81851, -158709, -221222, -138455, 219307, 39854, -161193, 45146, 184904, 51820, -203933, -51565, 104412, -119935, -50324, 188667, 95774, -122757, -23348, -63058, -91369, -197827, -129088, 182096, 306749, 292659, 153369, -29051, 34584, 98324, 113669, 42044, -84596, -169761, -31578, 178142, 76070, -114505, -45498, 7263, -99313, -62943, -224200, -256171, -293790, -212988, -228408, -243459, -143046, 21483, -7492, 6431, -75440, -65240, 109395, 22999, 49167, 161145, 66975]
11031F6975o6547L7353J33621j61318j28211j13015m8490J25249K55488P9052
11021A80157k45771o9452o5572r888J31571J34362k71867k01696J88831K34216
11011D891n9747J3711K55411P9012j68441k1107j26134o9551L5399O5270L5221
11000D3935l1196K18381L2233k15544n1936j22986J06168j1207q609J09621p4021
10989e161P0961o4299l4520o5395j32747L2170J11735J89214O3015J47196m4450
10978B67719l6216m4541n8144L5792J32462j76316j23134j02053J56528m5345
10968F752q8132k9795p5364J21733M9533L2611l48574k93499K39824J72269L62914
10957A50272r969k56712k13567J87306L68665K4616j18006K2721l5915K702j34985
$$ y = [66975, 428, 37781, 171402, 10084, -118127, -231142, -279632, -154383, 101105, 180157, -65614, -135066, -200638, -210526, -78955, 55407, -216460, -418156, -229325, 4891, -54856, -41145, 214266, 293278, 124837, 103730, -22404, -91955, -56556, 8714, 43935, 12739, 231120, 263353, 47809, -4127, -127113, -20945, -32152, -40761, 68860, -5161, 65800, 1501, -33019, -98414, -231161, -198991, -87256, 101958, 164973, 312169, 267719, 231503, 186962, 128818, 164610, 297072, 120756, -2378, -104431, 52097, 6752, -81380, -111175, -186539, -64806, -15273, 17338, -331236, -624735, -384911, -212642, 150272, 140303, -116409, -329976, -142670, 225995, 250611, 132605, 155326, 119411, 122113, -12872]
10946a2872j03730n8459J67115L6554o4997K5755j00241r3777R5621J84263K88023
10935C63255p9967j69559q8476K42405R8026k83994j50459j65721J74430K18030
10925A57970J19450L3793j65536r0343o6932R8094M795N9030m0414j7430l0036
10914F2441l25684k90656P2791M5983J16864J89567J10838m0509l9757J3387K41171
10903A56436J5234o7206q8818j03955q4100k7462n1796J82323l18179j92361P3739
10892e06145N6215q1441L83803K45026J86502O4871N2336k28959r2062J29230
10882B09376J18041P8756j43793j95910J29578l4263j66822o8258o3461K2382
10872a14374j2225J39352J30719r7645j17758j27481r6356L02948J17015k28668
$$ y = [-12872, -116602, -175061, -7946, 28608, -36389, -10634, -110875, -204652, -109031, 75232, 363255, 283288, 113729, 25253, 267658, 365684, 81690, -68769, -234490, -60060, 157970, 277420, 311213, 145677, 55334, -11598, 86496, 91291, 150321, 109907, 92477, 62441, -263243, -553899, -481108, -435125, -318261, -128694, -17856, -58365, -98122, -84735, 156436, 171670, 104464, 15646, -88309, -172409, -199871, -251667, -69344, -387523, -579884, -506145, -449930, -531371, -147568, 97458, 283960, 348831, 401167, 172208, 80146, 209376, 327417, 406173, 262380, 66470, 196048, 161785, -5037, -73295, -136756, -114374, -126599, 12753, 143472, 45827, -71931, -199412, -295768, 7180, 124195, -104473]
10862a04473L376Q3687o9084K4529o6465j65540J00929j003m0851K31868J03563
10851A00536M6710j54187k37418m1874k08243n6016O7597m5599L0196N1565K31815
10840b14918p276k32893J34968R9060j5335L5470L5693P3283Q2667l38321q1091
10829d28693J27205J73169O1367P3977k5687J14338R0373k703r7032O9988J7590
10818A73892J3745L3304K5260j03741Q1177k47358j37679K69108k6875j7251k3735
10807C9847n8910J71728O5436j09639j21578k96807q6477J5562m2566L64188J62767
10796A03551m9193J49019J46761j2095l40446j79168P2308K45487n5406j77720
10786i6902m2628J25718J95226J70600j00801j19366k68871j40860N1138J45959
$$ y = [-104473, -101097, -17410, -86494, -61965, -128430, -293970, -193041, -194044, -234895, -3027, 100536, 147246, -6941, -244359, -286233, -494476, -550492, -482895, -528494, -498298, -446733, -214918, -222194, -455087, -320119, -221059, -236394, -200924, -165231, -91948, -9281, -347602, -428693, -301488, -128319, -66952, 7025, -18662, 95676, 186049, 183346, 86314, 156302, 173892, 187637, 220941, 246201, 142460, 223637, -23721, -161400, 107708, 80833, 63582, 39847, -19063, 152665, 218101, 108462, -13116, -309923, -396400, -380838, -423404, -59216, 103551, 54358, 203377, 350138, 338043, -2403, -181571, -109263, 136224, 80818, -96902, -139530, -13812, 181414, 352014, 251213, 131847, -137024, -277884, -226746, -80787]
10776h0787K77202j1820j18330l2639N529J13892P1676j3237P9104k06086j23098
10765c8594r7584k18436K7323L57237K2490k37058k02378j9739j4586J70245M39952
10754A88872R1795k06982p2265Q66p4491j101k1000r8232P0730j4921j44451j9545
10742c00725J40404j14404n0028J25833J36682J89525j589m9397j5374J2599N2942
10731A26468r1984j09626J20826J79601J22174j2533j35329r4785J23015L1260
10721B59087j24555Q7591k6294J0424J38496j97228j39930J0098J55489M1090
10711B14268j51397J38601J48732q2132p3461J92659L2616l4654J66426k42938
10701C08720j50144m2240J63680q8202p8674j3848J58664K1784j66259l14942
$$ y = [-80787, 196415, 184595, 66265, 33626, 39155, 153047, 224723, 211486, 290590, 84504, -38594, -136178, -354614, -327291, 29946, 52436, -184622, -387000, -406739, -421325, -251080, 188872, 280667, 73685, 1420, 2286, -72205, -73306, -94306, -192538, -121808, -136729, -281180, -300725, -160321, -274725, -324753, -198920, -62238, 127287, 125698, 76301, 60927, 73526, 126468, 34484, -75142, 45684, 225285, 347459, 334926, 199597, 104812, 227827, 259087, 134532, 222123, 195829, 206253, 344749, 147521, 7591, 17689, 173178, 214268, 62871, 201472, 350204, 268072, 194611, 387270, 419886, 385232, 551658, 308720, 158576, 116336, 280016, 191814, 113140, 99292, 257956, 279740, 113481, -201461]
10691b01461j47067Q8817K70149M9120N6416K36693M3762j34466j49130j28220
10681a5387j1796k52440m5888n0147Q5358J70981K57281r7746p0594R6738k2497
10670D3863O0413k078j5492M8043J10140j69316p1534n1105j33962j39936q751
10659c29715J49609J58540o5458N9515O1784j31049m8684J2994J46125J20730
10649A34391J74741N3868j66309O9835k12238j7941m4678l9744K239l9450k20057
10638c05343K97090J47418r15j29486K9779J7169j56777n0522j8692j47367j31865
10627d49511M1578J80409K00391R2739r8074J25292J2192J09486Q1233k48572
10617D7163j26050P2807L2696j22137j10425L9569J20880j0987j53411O3508k9123
$$ y = [-201461, -348528, -259711, 10438, 59558, 115974, 352667, 396429, 261963, 112833, -15387, -27183, -279623, -325511, -375658, -290300, -119319, 137962, 40216, -30378, 66360, 43863, 104276, 102198, 86706, 134749, 244889, 75573, 4039, -47066, -181028, -320964, -329715, -180106, -21566, -87024, -27509, 34275, -96774, -145458, -132464, 13661, 134391, 309132, 363000, 196691, 266526, 54288, 36347, -8331, -48075, -45836, -85286, -305343, -8253, 139165, 138250, 8764, 38543, 55712, -101065, -151587, -170279, -317646, -449511, -407933, -227524, -27133, 65606, -32468, 92824, 105016, 214502, 295735, 47163, -78887, -6080, 26616, -95521, -205946, -166377, -45497, -56484, -209895, -146387, -175510]
10606a75510O1706M053m6566o2284p8009o8108J34054J29680J9197j35444q0953
10595b98184J96574J42087K3415K2131l9245n0733j53249r6489J49169j6263j78167
10584b98954l3422j8552P0564j89J09594j12229m0261L6216J25908K26629n3732
10573A1572j9900K7236m932k4185O0944J13289j4176j89576P1037j00027J05324
10562C6606O4074j28131J77555p2983N8084R1801j52752j87817j28249K7084L2620
10551a82108R42P1166N4342J3334K15192J71990l00095j94800J26256J85794O7689
10540B29702k5640J23927j96065j11620J18700J39701j0258p5681Q4637k235L2709
10529C07877O314k72353j01717M9970J278n2044j12796K10621L1469k60970j51916
$$ y = [-175510, -113804, -109751, -156317, -218601, -296610, -364718, -230664, -100984, -81787, -217231, -298184, -101610, 40477, 63892, 86023, 46778, -3955, -157204, -253693, -104524, -120787, -298954, -332376, -350928, -280364, -280553, -170959, -283188, -323449, -287233, -161325, 65304, 11572, -8328, 18908, 13976, -10209, 50735, 164024, 149848, -39728, 31309, -68718, 36606, 100680, -27451, 150104, 77121, 135205, 227006, 74254, -113563, -241812, -214728, -182108, -181166, -110000, -55658, -42324, 172868, 344858, 44763, -150037, -23781, 162013, 229702, 204062, 327989, 131924, 20304, 139004, 278705, 268447, 192766, 277403, 275168, 307877, 314191, 41838, -59879, -9909, -8631, -60675, -173471, 37150, 68619, -192351, -344267]
10518c44267P9411L04750J09473j30538j5254N4559o0720L2462O4812p2703j19940
10507i7955P8266P7739l5765N3755m1501n9136M0660p2973j29911l9299j1051
10496b37171K22144Q7983O5700O5639P3630m101k13436k63654j00485J75352K08546
10485H0147J05332k51627j76881p8135J17266L0748J40836l9359l37198k70873
10475f79744J12384K95465Q0614P1087R7286l0161O7447r8652j1214J49853j64071
10464a09706r5437J88111R2642J45168j04846k54396L3384q1978k72830J26885
10454c33003J41840K02763k2979j23261O5356J91925o1897j26857N5856K89817
10444B79560r6726q1608J26631L1505j96377l04820M3647L14275k3220R136p7390
$$ y = [-344267, -264856, 39894, 149367, 18829, 3575, 58134, -2586, 29876, 94688, 21985, -97955, -19689, 58050, 22285, 76040, 34539, -24597, 16063, -56910, -186821, -226120, -237171, -15027, 72956, 138656, 204295, 277925, 273824, 60388, -203266, -303751, -128399, 80147, 185479, -66148, -243029, -321164, -203898, -173150, -32314, -71673, -408871, -679744, -567360, -271895, -191281, -120194, -22908, -53069, 14378, -84274, -95488, 54365, -109706, -205143, -17032, 75610, 220778, 115932, -138464, -105080, -187058, -459888, -333003, -191163, 11600, -11379, -134640, -69284, 122641, 60744, -66113, -10257, 279560, 182834, 101226, 227857, 259362, 62985, -241835, -198188, 116087, 92867, 102003, 24613]
10433B4613j4357J85858m5419K2131j21381N2396j80592k04557J51563J74235
10423D4490L7199L1108R0418L40696r7133j92298k17267r6122l7387M8228J82710
10412A34642K49294J83390k66438k29680M1397J65958r8347K6961J25100K6609
10402C58886k7074k34946l0661L66604L7658j36792r4731r4096j06852P2325K50880
10391C61201k73426k24554J6690L5131J64951K819k22768m3128R1485K36274q4952
10380E9723j81169j6247J32956J19096k29365L1338K87542P2454p4990r1862q0602
10369B8874J56526J04232n3933n524j26006J55982l61956m2582J85956L00860
10359C42429p523O0737m8869k27789m7029M2499N78K5026K14751M3208j27067
$$ y = [24613, 10256, 196114, 150695, 172826, 51445, 103841, -76751, -281308, -129745, 44490, 81689, 112797, 203215, 543911, 446778, 254480, 37213, -58909, -96296, -48068, 134642, 383936, 567326, 300888, 71208, 112605, 278563, 180216, 207177, 332277, 358886, 331812, 96866, 66205, 432809, 470467, 333675, 238944, 144848, 37996, 110321, 361201, 87775, -136779, -120089, -84958, 79993, 82812, -139956, -183084, -91599, 144675, 59723, -121446, -137693, -4737, 114359, -115006, -83668, 203874, 276328, 201338, 109476, 28874, 185400, 289632, 235699, 230175, 104169, 260151, -101805, -144387, 41569, 342429, 334906, 395643, 346774, 118985, 71956, 114455, 115033, 140059, 354810, 398018, 270951]
10348B70951r9698j78564r1722J93641L54283N8365j52912j53077o8067J45447
10338B78647n491l7777J82256j54245j04244k37032o9778K79894J8367k33387
10328h2790j20061p4272j16804j8853J62960k7310q5271O0411J9881R0489J92876
10317A256J15354j30522J05123J11213q962r562m4047J3792K4389J199P2869j39294
10305A12808o3636j88045K79614J48568J600j12119k88931j29203J62471K46038
10295A69165J53210O9233P143k43574J71504J76993l23929k12426Q0869L03791
10285C51979J15981k67580k44478O5422m7451o9148j38636q1216K03620M3892
10275f7615j02660J14601J35768J92825J37610M8669J7922o2357j83488k78498
$$ y = [270951, 171253, -7311, -99033, 94608, 448891, 507256, 354344, 201267, 133200, 278647, 273156, 235379, 417635, 263390, 159146, -77886, -147664, 132230, 150597, -82790, -202851, -277123, -393927, -412780, -249820, -277130, -362401, -301990, -282109, -191620, 1256, 116610, -13912, 91211, 202424, 193462, 183900, 139853, 153645, 178034, 179233, 252102, 112808, 49172, -138873, 140741, 289309, 290909, 178790, -110141, -239344, -76873, 169165, 322375, 391608, 398751, 155177, 326681, 503674, 179745, -32681, 48188, 351979, 467960, 200380, -44098, 21324, -26127, -95275, -233911, -315127, -111507, -67615, -170275, -55674, 80094, 272919, 410529, 459198, 477120, 414763, 231275, -47223]
10265d7223r4485R3765o4602j33547l9850J62994J34610M9059K42194K21989K81348
10254H06252o7159r5914p5799j78775P1264O8712M8872o6271k04596p4444J80796
10243D12938m9738j60713j8925r7954r7897J19260P7652j43845m6463p3519k48800
10232c28004M2928J54595J42766r645K81032O2998j42477j22412o4504L12074
10222C29351J14353j75342l5337k3037J00434J28469k1141m7192K8840O0309j73308
10211B86399n3742Q1474m5293j04498j33402J73297j6766o6982K06418M0001j73268
10200A93638k29077j02380Q3081Q361r6193j04050L3761K32822K0154j86070P8608
10189f7345K10299P9640r9802k50771r4304O8776L26624k6269J0448K4999k36023
$$ y = [-47223, -141708, -47943, -112545, -246092, -285942, -122948, 11662, 60721, 302915, 524904, 806252, 739093, 643179, 567380, 388605, 459869, 528581, 577453, 511182, 306586, 232142, 412938, 363200, 202487, 183562, 85608, -12289, 106971, 184623, 40778, -5685, -79204, -328004, -285076, -130481, 12285, 2640, 283672, 346670, 204193, 81781, 17277, 329351, 443704, 268362, 233025, 209988, 310422, 438891, 417750, 370558, 399398, 459707, 286399, 232657, 314131, 268838, 164340, 30938, 204235, 187469, 120487, 326905, 366906, 193638, -35439, -137819, -54738, -46377, -142570, -246620, -212859, 19963, 40117, -145953, -67345, 142954, 222594, 122792, -127979, -222283, -153507, 173117, 146848, 157296, 182295, -53728]
10178e3728o844M6896j80892J55491K53186P3056M0250K45946N533k13815J15796
10167D80875K04634O2471m64572j60080J43977m4097q4036p6903N9472M0428M10
10156A62579j11833K5145Q1212J8311m0415l5371j41202j52848J47814j41754
10146a88362J25473Q775N7121l906o0636J49749l4700J39979J13356K5239M7774
10135C79862J76656j6814l03898j95047K81862K56911n6595l26043k88782J85897
10125I4009K02735j58021j63628R1455J95783J08264m0214k35117j12029R1380
10115G4617j16759l2478K7934j65640L2509R3616J20366K30235k01553P8153K7781
10104A68781O3067J80557n8596l51128k9701j26J2857m0471j07038N2218P8551
$$ y = [-53728, -60572, -13676, -194568, -39077, 214109, 287165, 327415, 573361, 578894, 365079, 480875, 685509, 747980, 283408, 123328, 267305, 223208, 139172, 62269, 121741, 162169, 162579, 50746, 75891, 157103, 175414, 134999, 99628, -41574, -194422, -46608, -188362, -62889, -54114, 3007, -899, -61535, 88214, 53514, 193493, 306849, 332088, 379862, 556518, 539704, 235806, 40759, 322621, 579532, 522937, 196894, -91888, 94009, 296744, 138723, -24905, 66550, 262333, 370597, 330383, 95266, -16763, 74617, -42142, -74620, -46686, -212326, -179817, -86201, 34165, 264400, 62847, 141000, 168781, 231848, 412405, 353809, 2681, -27020, -27146, -14289, -54760, -161798, -109580, -31029]
10093c1029O2442N9833j89858J9564J182J09288N2479K16707j72455M5628P8761
10082B52542j191j25930J47424j998Q9491R4550j44792M5736N7916Q1187j44332
10071C50603P0519l53954j69102k45564J53003K67407L004P3896K37645r3994
10061B93463n0834O8660L5867J04041p8943R6206K0682Q9665k3312k03566j62691
10050A89238k8243k416O6980J86592j64005o512r6006k6435K09285J17444p220
10039D38702k9118n1964O7210R7894n7643j87513J19745K17115o0406N4802P1249
10028F80073j15715j44101r0795N0546Q4310O4364K0051j48616N7980j10433K6441
10017C74105J46397L1453j36269k52242k0895k0143N5073J10164K50916K75434
$$ y = [-31029, 31413, 91246, -98612, -79048, -77866, 31422, 83901, 300608, 128153, 173781, 252542, 251351, 125421, 272845, 270847, 360338, 454888, 310096, 355832, 413748, 494935, 350603, 421122, 67168, -101934, -347498, -194495, 72912, 75916, 149812, 387457, 293463, 242629, 311289, 347156, 451197, 372254, 468460, 489142, 578807, 555495, 351929, 189238, 160995, 158579, 225559, 412151, 248146, 241634, 145628, 119193, 328478, 445922, 438702, 409584, 357620, 424830, 522724, 465081, 277568, 397313, 614428, 554022, 608824, 680073, 564358, 420257, 329462, 380008, 464318, 528682, 548733, 400117, 458097, 347664, 374105, 520502, 551955, 415686, 163444, 142549, 122406, 177479, 287643, 538559, 813993]
10007H13993L5640j75845p2267p6768K39788J46171k9070j25105p5980p1776j07151
9996E01630j2330J22928l19777j39399K88463J94770J25976K02846N7325M6055
9986A068487j08482k63990k1584L5229J98208R09J13448J60345n0352l6806K9648
9975A125060m1204J37585J63683K56159J7151J57942L37151M11024L73190J17800
9965C055541J80885N08243Q23954N57748N52046Q92316P59176N61362K79704J79868
9955H350843J60004J27154M85534J65544M9937j97914l13639o46251p41475l12186
9945G127551k27284J40489L06818O39676J124453J128200J057146J028395J273427
9936A3598871J286125Q53305K36330M07527L62389L97132N44242N70203K59027
$$ y = [813993, 849633, 673788, 601521, 524753, 764541, 910712, 881642, 756537, 680557, 608781, 501630, 489300, 612228, 292451, 153052, 441515, 636285, 762261, 965107, 1022432, 1068487, 960005, 696015, 674431, 709660, 907868, 908777, 1022225, 1182570, 1132218, 1095412, 1125060, 1083856, 1221441, 1385124, 1641283, 1658434, 1816376, 2153527, 2564551, 2937741, 3055541, 3236426, 3744669, 4568623, 5126371, 5678417, 6570733, 7329909, 7891271, 8170975, 8350843, 8510847, 8638001, 9123535, 9289079, 9339016, 9141102, 8827463, 8181212, 7439737, 7127551, 6900267, 7040756, 7347574, 7987250, 9111703, 10239903, 11297049, 12325444, 13598871, 14884996, 15738301, 15974631, 16382158, 16744547, 17141679, 17685921, 18256124, 18515151]
9927A8515151k52094o91149j049812j228300j051457p14800l06261P8685M50092
9918A3750055O15299N30314O17115O04144N57545P56093M14470N30897L09223
9909A8685155j09505l30397k59269k06583n27837m51855q33390n82260n85304
9900A4798755k93264J95072L04424M73209O59714M79077O68176o684o116K01817
9890A7474180M78434L38141M22789K09129J98762l51598q54843j010224j095562
9881A5809208r93254p7207L75986Q13098J124300J091192J363842J140816P35785
9872B1383766N75448L76748j11750l08060J10612M28323M58023J26898j00178
9863B2939830n36310j178077j246811j119683r07267l48626L13888Q88110J449615
$$ y = [18515151, 18263057, 17571908, 16522096, 15293796, 14242339, 13527539, 13221278, 13299963, 13750055, 14365354, 14895668, 15512783, 16116927, 16674472, 17430565, 17845035, 18375932, 18685155, 18575650, 18245253, 17985984, 17779401, 17251564, 16799709, 15966319, 15384059, 14798755, 14505491, 14700563, 15004987, 15478196, 16137910, 16616987, 17285163, 17278479, 17272363, 17474180, 17952614, 18290755, 18713544, 18922673, 19121435, 18769837, 17914994, 16904770, 15809208, 14815954, 14738747, 15114733, 15927831, 17052131, 18143323, 19507165, 20647981, 21383766, 21959214, 22335962, 22224212, 21916152, 22026764, 22455087, 22913110, 23040008, 22939830, 22403520, 21225443, 19978632, 18858949, 17951682, 17603056, 17916944, 18805054, 20254669]
9854B0254669J906156J941412J729483J122350P62393J34267m17578m26389q7251
9845B6919512K70071L27243J08053l76240p38823r37885j208573j238294q24541
9836B2300523l4050O45923J028882Q91941Q07337P89893N38038N48852N51124
9827B8068463L13375J14305l0197m16726j076016r14292o71284q20066q89499
9818B3678063p94792q94936p80470j78282N64991J293726J835790J996995J605457
9809B8326542N12837P0826n04104p19475m71218k97351j42065m86685j099000
9800B5190307j269949j581447k094783k114498j906577j577778j062598o55301
9792A2927376m59030L61172O92321M35269N16895Q35678M62507k45637k70827
$$ y = [20254669, 22160825, 24102237, 25831720, 26954070, 27716463, 27850730, 27433152, 27006763, 26919512, 27189583, 27516826, 27624879, 27248639, 26509816, 25571931, 24363358, 23125064, 22300523, 22266473, 22912396, 23941278, 24833219, 25640556, 26430449, 26968487, 27517339, 28068463, 28381838, 28496143, 28465946, 28049220, 26973204, 26058912, 25387628, 24567562, 23678063, 22883271, 21988335, 21207865, 21029583, 21594574, 22888300, 24724090, 26721085, 28326542, 28839379, 28910205, 28406101, 27686626, 27215408, 26918057, 26775992, 26289307, 25190307, 23920358, 22338911, 20244128, 18129630, 16223053, 14645275, 13582677, 12927376, 12468346, 12829518, 13521839, 13957108, 14474003, 15309681, 15772188, 15526551, 15255724]
9783A5255724n04953l02260k07687j02685l73193n10988p64299j110722j051714
9774A0327223j292159j056569j144025q98521m92961m95094n41363n08575k69471
9765C628485l76336k00306j92220k91082l17245j04616J28216J72443p0689r8935
9755B277715J65037n7836l98303k34703r7101l5257j33893k10954o3674K2478
9745A233509R8533L6982Q9555q8517j46486L3705O1219J37591J05625j6272p4413
9734A471031o0753j73346k7698L6662l9327j99919k31088p5012K1559k1103J16589
9723H17595l0797o3931j29J46908M3054r7504j29724N7490p1088R0049j3300j75092
9711E73531J65314J35913R866j59146J06034j15416j02564K20386k1673k56210
$$ y = [15255724, 14750771, 14448511, 14240824, 14138139, 13764946, 13253958, 12489659, 11378937, 10327223, 9035064, 7978495, 6834470, 5935949, 5442988, 4947894, 4406531, 3897956, 3628485, 3252149, 3051843, 2859623, 2568541, 2251296, 2146680, 2274896, 2447339, 2376650, 2277715, 2442752, 2384916, 1986613, 1751910, 1654809, 1619552, 1485659, 1274705, 1211031, 1233509, 1332042, 1369024, 1458579, 1370062, 1223576, 1257281, 1318500, 1456091, 1561716, 1545444, 1471031, 1410278, 1236932, 1209234, 1245896, 1206569, 1006650, 775562, 700550, 722109, 701006, 817595, 786798, 722867, 722738, 869646, 912700, 815196, 685472, 742962, 671874, 761923, 748623, 573531, 738845, 874758, 884624, 725478, 831512, 716096, 613532, 833918, 812245, 556035]
9701E56035j29567j1186M29267K41298l8686m5817r1045J92137K4465k36112j83784
9690G07005R0109J3423M2843m0258J41042N3240j47182q9276N6258j09094j38221
9679E79889K33100P6298k848J46888k76308M3303p2147J1764j04543k36770O6911
9668D65537K36629J54070J3646k72102p6122J09010K11512J01540N0760j63799
9658H30681j22316J36688K8061p9067l0577K52660K76764k44430k81921k93754
9648D72789M648L53367J74211k639m3743j61371J8826K16407L2552L05l2775K01398
9636A233975l1159K08651J58226k516j11959m5187k4167K38979l1857j34771M2660
9625A500875K47138j63421K26417J77075Q4905O2469L20271L14457K74608K16862
$$ y = [556035, 426468, 415282, 844549, 1085847, 1047161, 1001344, 910299, 1102436, 1126901, 890789, 707005, 797114, 810537, 853380, 813122, 954164, 1007404, 860222, 770946, 827204, 718110, 579889, 812989, 889287, 886439, 1033327, 757019, 800322, 728175, 739939, 635396, 398626, 465537, 702166, 856236, 869882, 597780, 521658, 630668, 842180, 943720, 994480, 830681, 708365, 845053, 873114, 794047, 763470, 1016130, 1292894, 1048464, 766543, 472789, 477437, 830804, 1005015, 1002376, 958633, 797262, 816088, 1032495, 1065047, 1065352, 1032577, 1233975, 1202816, 1411467, 1569693, 1567177, 1455218, 1410031, 1385864, 1624843, 1592986, 1458215, 1500875, 1748013, 1584592, 1811009, 1988084, 2072989, 2135458, 2455729, 2770186, 3044794, 3261656]
9615C261656L40534M35861M58767M90570R46851J088296J197705J795590J861563
9606A1877393K163949J839616J023517P61238J494o13794q34495j453491j861909
9597A2903518j723732j214442r23085n69207q8916m7716L89181O11126N33931
9588I870658O55170N15391O55344R76332J440112J491438J505857J267026O79202
9579A9056530K17364j38769m60238o12738q76488j093547j038804j304319q94380
9570A2854611l57277k83881j80088j98985K38281P15406J015794J136380J474950
9561A6415191K119965L138505L404797L258816K584231K069794J586047M86054
9553C5063400l41708j018638j821091k153326j837651j704894k045791k296544
$$ y = [3261656, 3602190, 4038051, 4496818, 4987388, 5934239, 7022535, 8220240, 10015830, 11877393, 14041342, 15880958, 16904475, 17665713, 17667207, 17053413, 16218918, 14765427, 12903518, 11179786, 9965344, 9042259, 8473052, 8384136, 8336420, 8725601, 9336727, 9870658, 10525828, 11041219, 11696563, 12672895, 14113007, 15604445, 17110302, 18377328, 19056530, 19273894, 19135125, 18674887, 18062149, 17185661, 16092114, 15053310, 13748991, 12854611, 12497334, 12213453, 12033365, 11834380, 12072661, 12788067, 13803861, 14940241, 16415191, 18535156, 21673661, 25078458, 28337274, 30921505, 32991299, 34577346, 35063400, 34721692, 33703054, 31881963, 29728637, 27890986, 26186092, 24140301, 21843757]
9545B1843757j989721j521551j082282n07665N9481N08587J006265J804370K499156
9536B2620397K737814L039791K415028J819853J345021P63556K65119p2431p60832
9527C4173316j469256k047139j996835k015323j674060j228049o22744m98204
9519B2621706j022801r06789o16639l08939j0967J35208M5376K47017O52720P75765
9509B1611657Q37755J067315P15987K10896Q313m87859j170753j378401j246455
9500B0168455j113519j75144J65475L63740K43100k48556l18352l69238l51959
9491A8364002j02366J45250M20386K91385N11692L28440M2482J63501M84735N54849
9481B1204356J58468k29801k06850r9150j6102N0895O00565R54531Q14687O90000
$$ y = [21843757, 19854036, 18332485, 17250203, 16742538, 16802019, 17310606, 18316871, 20121241, 22620397, 25358211, 28398002, 30813030, 32632883, 33977904, 34741460, 35006579, 34934148, 34173316, 32704060, 30656921, 28660086, 26644763, 24970703, 23742654, 23119910, 22621706, 21598905, 20692116, 20075477, 19766538, 19755571, 19890779, 19936155, 20183172, 20835892, 21611657, 22449412, 23516727, 24232714, 24443610, 24451923, 23964064, 22793311, 21414910, 20168455, 19054936, 18879792, 19045267, 19409007, 19652107, 19403551, 19085199, 18715961, 18364002, 18261636, 18406886, 18827272, 19118657, 19630349, 19958789, 20001271, 20164772, 20649507, 21204356, 21362824, 21133023, 20926173, 20827023, 20810921, 20861816, 21462381, 22416912, 23231599, 23921599]
9471B3921599K80128k28960n34370m48125p91033j361432j642081j750003j817578
9462A5628145j947897j442663r85035o33157l48968j51166O223M37403O85740
9453A1248625J195942J264888J479976J986702K112260J461733Q33191K43837
9445B1827154o3663p98629j701431j939891j856961j911232j693934j495326j248382
9436I117705p77113l07402n38098m16839l55703j33091K91357K61041P85627J078498
9426I005982J057630R80923M03467L78151L43426r6950j43604n07793o88989p63197
9416I969046q92619p17649p76207j084479o99368j91608J7824j13526j94681K17435
9406E534168J02456N36216P03517Q41499Q57299Q91488O97100P15276N06264J20267
$$ y = [23921599, 24201727, 23972767, 23438397, 22990272, 22199239, 20837807, 19195726, 17445723, 15628145, 13680248, 12237585, 11252550, 10619393, 10270425, 10119259, 10125482, 10562885, 11248625, 12444567, 13709455, 15189431, 17176133, 19288393, 20750126, 21583317, 21827154, 21763491, 20964862, 19263431, 17323540, 15466579, 13555347, 11861413, 10366087, 9117705, 8340592, 8033190, 7495092, 7078253, 6722550, 6589459, 6880816, 7141857, 7927484, 9005982, 10063612, 11044535, 11448002, 11826153, 12169579, 12072629, 11929025, 11421232, 10732243, 9969046, 9076427, 8358778, 7582571, 6498092, 5798724, 5607116, 5624940, 5511414, 5316733, 5534168, 5636624, 6172840, 6876357, 7717856, 8575155, 9466643, 10163743, 10879019, 11385283, 11505550]
9396A1505550m85073p86650q66796j184388j094052r85336q18591p66281n51772
9387C966611k79975k75615l11512k94522k86195J1327k38039j12930m7535J7825
9377B149440j06819J16905l41427k25587k01133N2709J56904J41392q5526j84695
9367A472163k40729l4023J57569K5067M2672l2567L1724j06425j30002L1017N5101
9356A271567j14552L9962p511J00131R145j31542L756M0143L2750j66764J14673
9345A191758K23329K48013O1154j26264q3060k3144k06892j72454P5062J10J10480
9334A298092J62108j13394j15025N36j0829P8763Q9905J36081N7087j4372J67944
9323A736896L5914q7389k8962n3493J66129L3471q1421j39487k14747Q2590n4063
$$ y = [11505550, 11020477, 10233827, 9367031, 8182643, 7088591, 6103255, 5284664, 4518383, 3966611, 3686636, 3411021, 3099509, 2804987, 2518792, 2530119, 2292080, 2179150, 2131615, 2149440, 2042621, 2159526, 1818099, 1592512, 1391379, 1444088, 1600992, 1742384, 1656858, 1472163, 1231434, 1197411, 1354980, 1380047, 1422719, 1390152, 1421876, 1315451, 1185449, 1216466, 1271567, 1157015, 1196977, 1189466, 1289597, 1298742, 1167200, 1170956, 1211099, 1243849, 1077085, 1191758, 1415087, 1663100, 1724254, 1597990, 1514930, 1491786, 1284894, 1112440, 1187502, 1187612, 1298092, 1460200, 1346806, 1231781, 1232317, 1221488, 1300251, 1390156, 1526237, 1583324, 1568952, 1736896, 1772810, 1685421, 1656459, 1602966, 1769095, 1802566, 1721145, 1581658, 1366911, 1449501, 1395438]
9312A395438J75097l4078P7461l8369R8899J12353l02459O1218J17776K22462
9302A885798K04116O4363o6377j50986m3942p1663K30389M20405L3859k50877
9292B255085j29836J06888L4065K2699q8909L0627J90896j38389L2052J36298
9282B451476J05197J80258O0921Q3083O993N2314J20426J06258K38821R7528L7274
9271C540549J04809K07235J16476j49885J93114K15627J70658L6618Q3677K80286
9261D799164J88179K66373L01152M1104K339K12280J93636J61886L58076L36043
9251F860232K80844L52429M61699M94097M84703K71249K70737M28173O14301L60212
9241A0878676M99810O87008Q50041R11105J002359R34356J062501R72018R55198
$$ y = [1395438, 1570535, 1536457, 1613918, 1575549, 1674448, 1786801, 1484342, 1545560, 1663336, 1885798, 2089914, 2154277, 2087900, 1936914, 1892972, 1821309, 2051698, 2472103, 2505962, 2255085, 2125249, 2232137, 2266202, 2288901, 2199992, 2230619, 2421515, 2283126, 2315178, 2451476, 2556673, 2736931, 2797852, 2880935, 2887928, 2940242, 3060668, 3166926, 3405747, 3503275, 3540549, 3645358, 3852593, 3969069, 3819184, 4012298, 4227925, 4398583, 4435201, 4518878, 4799164, 4987343, 5253716, 5554868, 5595972, 5598311, 5810591, 6004227, 6166113, 6524189, 6860232, 7141076, 7493505, 7955204, 8449301, 8934004, 9205253, 9475990, 9904163, 10518464, 10878676, 11378486, 12065494, 12915535, 13826640, 14828999, 15763355, 16825856, 17797874, 18753072]
9232A8753072J169041J700183K051844K127901K230964K344180K744997K986068
9224C6108250L574778M478887M774712N473953O295917P410970Q612800R741527
9216H6471794J1258522J2587950J4146611J5104688J5109935J3840728J1066238
9209A79586466P197484K343370k712580p312295j1085200j3430661j4247106j3761025
9201A26578453j3033726j2061141j0950702r571568q187095p410205o426958n791290
9193E3145768m964261l899310l541820l197727k979698k748404k300084j984296
9185B7530168j928857j630732j423383j498667j171500r95259r61923q61210j221187
9176A5837450j093367q27825n33814l55094m14437p65462o44145o06685k47069
$$ y = [18753072, 19922113, 21622296, 23674140, 25802041, 28033005, 30377185, 33122182, 36108250, 39683028, 44161915, 48936627, 54410580, 60706497, 68117467, 76730267, 86471794, 97730316, 110318266, 124464877, 139569565, 154679500, 168520228, 179586466, 186783950, 189127320, 186414740, 179102445, 168017245, 154586584, 140339478, 126578453, 113544727, 101483586, 90532884, 80961316, 72774221, 65364016, 58937058, 53145768, 48181507, 44282197, 40740377, 37542650, 34562952, 31814548, 29514464, 27530168, 25601311, 23970579, 22547196, 21048529, 19877029, 18881770, 17919847, 17058637, 15837450, 14744083, 13916258, 13382444, 13027350, 12612913, 11847451, 11203306, 10596621, 10349552]
9167A0349552m04694m88740n30935k98418m24295k69412l05979j58696j65983
9158G302400m35764l17634j03783k40566l45707P7m7821j16799j33303j61306
9148E399794P972j94016l07876q8340p2989j70299r9052k24076j23368o4408r4648
9137C968694l34504k95911R898q6051J26240N3901M6754j59830p4647k7420j48805
9126C078319Q6182O4035k6592j15392k30128m001K72973l14971p9310k9022k00051
9115B502042J63487Q7537o3214j66053k14790j15771j49486j33378J95638M4007
9105B150019j0851j75992k15478k91815j55215K16096J39572K13715j50777r4673
9095A624601P5861K52370J09872k11508k77480j37006j23289j64757j25737k1079
$$ y = [10349552, 9944858, 9456118, 8925183, 8626765, 8202470, 7933058, 7627079, 7468383, 7302400, 6866636, 6549002, 6445219, 6204653, 5858946, 5859023, 5811202, 5694403, 5561100, 5399794, 5407766, 5213750, 4905874, 4817534, 4744545, 4574246, 4475194, 4251118, 4127750, 4063342, 3968694, 3634190, 3338279, 3348177, 3262126, 3388366, 3442267, 3489021, 3329191, 3254544, 3227124, 3078319, 3164501, 3228536, 3201944, 3086552, 2856424, 2852423, 3125396, 2810425, 2731115, 2702093, 2502042, 2665529, 2753066, 2689852, 2523799, 2309009, 2193238, 2043752, 1910374, 2106012, 2150019, 2139168, 1963176, 1747698, 1455883, 1300668, 1516764, 1656336, 1870051, 1719274, 1624601, 1700462, 1952832, 2062704, 1851196, 1573716, 1436710, 1313421, 1148664, 1022927, 1001848]
9085A001848J40285k7899P6641J1357J67253j34968k30479q1065N7100K48398
9075A228471Q7064p0691j26167k93640j4322L1852o5736k2703K07064Q7597l9397
9064A009392P4528M4038k22532K7930L9100J09587K04724l2539q7802j57540j63398
9053H45488K7382m5460m3307q1524k56514n5990j16813K07414R1282n7839k02566
9042C11553j55850K08031J92067q8593n0527n0579K60198J34266K3157J6755J26693
9031I27171j08576k8905q1568j50697J314N7594j44894j90889j60781K4926J61733
9020C06428K8081m5252q198m5476q4819P2693Q6752n0556L5739M6417N3945N1859
9008D47613l5773J06714O9587J03271r3600k59197q8831j4693K52057J27442j45159
$$ y = [1001848, 1142133, 1114234, 1190875, 1202232, 1369485, 1234517, 1004038, 922973, 980073, 1228471, 1315535, 1244844, 1118677, 825037, 810715, 842567, 776831, 754128, 961192, 1048789, 1009392, 1083920, 1127958, 905426, 933356, 972456, 1082043, 1286767, 1254228, 1166426, 1008886, 845488, 872870, 827410, 784103, 702579, 446065, 390075, 273262, 480676, 571958, 514119, 311553, 155703, 363734, 555801, 467208, 416681, 366102, 626300, 760566, 783723, 800478, 927171, 818595, 789690, 708122, 557425, 558739, 616333, 471439, 280550, 119769, 144695, 306428, 334509, 289257, 281059, 235583, 150764, 223457, 310209, 259653, 295392, 341809, 395754, 447613, 411840, 518554, 588141, 691412, 597812, 338615, 249784, 235091, 487148, 614590, 469431]
8997D69431Q3847K05375j68585j59485k11181O2231L965j34829k0175L4018J6821
8986A81433j5005K05191K34220P5734j81678m3985j13228j69979L58907j57611
8976C73999l41546J0329r943r6486J78656j60008J77632Q4481N2928r3766L0076
8965B06352m1885j72266l5776K20261j05509m199J91968k7305R0444j03004j01806
8954A17275k31139n821K62825K03501O1566j843K20083J17330J30164j01411n16327
8943B56203j47108O0816k9433Q2804J6124L136K75441m3203j58477O5880J68270
8932E50453o602j92652m1528m4951P8147j63009j67044p5164R6070n7693k9308
8921e3281J95972K93021n0159k82367p8048K36433j35248m3413j85491o7243O2930
$$ y = [469431, 553278, 758653, 590068, 430583, 219402, 281633, 285598, 150769, 130594, 164612, 181433, 166428, 371619, 605839, 681573, 499895, 455910, 342682, 172703, 531610, 373999, 32453, 42782, 32839, -63647, 115009, -44999, 132633, 217114, 270042, 176276, 206352, 164467, -7799, -43575, 176686, 71177, 66978, 258946, 231641, 322085, 219081, 117275, -113864, -119685, 143140, 346641, 408207, 406364, 626447, 743777, 873941, 772530, 256203, 109095, 169911, 140478, 223282, 239406, 242542, 517983, 474780, 316303, 382183, 550453, 543851, 351199, 309671, 264720, 342867, 179858, 12814, -62350, 33720, -23973, -53281, 142691, 435712, 385553, 103186, 25138, 261571, 126323, 82910, -102581, -169824, -106894]
8910a06894J88903l0799J60884N8285o1682M720J86657n4847o8697m1417J84837
8899D19950K39304J54256P9397K5570K91411J74707L4670J46257K60498J60277
8889A986297K02486N19689Q40728J388270K332358L470947M609926L932399N70142
8880A9853242k363615l421830l346586k502364j750584j513102j204591p76367
8872B974203n10285k69210l73771l44800j82662j18221r1991R395K93585R2774
8862A479017l79469l78412k12330j22894N2346P249M7832j49771j7261J44527
8852D70834J50848l8996o5883j34108k04423j39004K28575K08795j4001j57196
8842C05441j19973R1050J56075J38034k1176r5359K06004Q845o376j04778k26332
$$ y = [-106894, 82009, 51210, 212094, 270379, 208697, 213417, 400074, 345227, 276530, 235113, 419950, 659254, 813510, 892907, 918477, 1209888, 1384595, 1419265, 1565522, 1826020, 1986297, 2188783, 2708472, 3549200, 4937470, 7269828, 10740775, 15350701, 19283100, 19853242, 17489627, 14067797, 10721211, 8218847, 6468263, 4955161, 3750570, 2974203, 2463918, 2194708, 1820937, 1476137, 1293475, 1175254, 1083263, 1092658, 1386243, 1479017, 1099548, 721136, 508806, 385912, 438258, 445507, 493339, 343568, 326307, 470834, 621682, 582686, 516803, 382695, 178272, 39268, 267843, 476638, 462637, 305441, 185468, 276518, 432593, 570627, 549451, 454092, 660096, 668941, 662565, 557787, 331455]
8831C31455j74891j51384J26220R1514l1240Q98k1988J11184l6706k80305L3428
8820a815M7489J06567K37119M0789j01858J40508P8517o6325k86235n8853J5199
8809A51102n7647P5125Q7001l1942q7550o9021j49621p2510j9493J40764K21246
8798A87454J0679J04070o3184j4626j31325K07621L4713J11474K09235o4837j90812
8787D00462j53170j14834J50968L3964j13890j75022q5234j19734p8574R1714
8777a63350J58031K17845k9041J26508J33602j20458j24090K8389n0743j3076
8767A63617j93973j29909p0022j10880K08078K59802O5830J28417o2597l8958
8757B19405j64491j68643J296J587J06645K50037j85357q8549K33147K80920K21553
$$ y = [331455, 156564, 5180, 131400, 222914, 191674, 192572, 170584, 281768, 245062, -35243, -1815, 45674, 152241, 389360, 430149, 328291, 468799, 547316, 480991, 194756, 135903, 151102, 93455, 168580, 255581, 223639, 136089, 67068, -82553, -155063, -174556, -33792, 187454, 198133, 302203, 239019, 224393, 93068, 300689, 335402, 446876, 656111, 591274, 400462, 247292, 132458, 283426, 317390, 203500, 28478, -56756, -176490, -255064, -163350, -5319, 212526, 183485, 309993, 443595, 323137, 199047, 227436, 176693, 163617, -30356, -160265, -230287, -341167, -133089, 126713, 192543, 320960, 258363, 219405, 54914, -113729, -112433, -110846, -4201, 245836, 60479, -28070, 205077, 485997, 707550]
8746G07550N764j87608j99014m3314K08037o370k16981l7976J5470K41863O7219
8735E54640r6583j7356k30331j89558P248L4694J73154p9318k81069n0377J02215
8724g2641P5682R2141L53089J70238k25037r2220m2475j02786j23028J6938J65587
8713B15488K5127k22762J32371K4849O0791J84159J6290j10898M6153j96531L3702
8702B08739J26228n9832l2854p3425j76320P0947Q6155M4191k10227k3487m0792
8691h0677O2512P2297K3214j18619O6408L29791P2203j95563J11740o9522k0202
8680B53582J11288K2330m572K63004j01073j68898R2610N2234l15062j42275K78340
8669C41508P0358o5759k27605j70420J8386J36279K93753k02j33118p3657O2698
$$ y = [707550, 713314, 525706, 326692, 283378, 491415, 485045, 268064, 230088, 245558, 487421, 554640, 458057, 440701, 210370, 20812, 28060, 62754, 235908, 156590, -124479, -174856, -72641, 3041, 95182, 448271, 618509, 393472, 301252, 258777, 155991, 32963, 49901, 215488, 240615, 17853, 150224, 175073, 235864, 420023, 436313, 325415, 371568, 175037, 208739, 334967, 275135, 242281, 168856, -7464, 63483, 149638, 193829, -16398, -39885, -80677, -18165, 54132, 77346, -41273, 25135, 354926, 427129, 231566, 343306, 273784, 253582, 364870, 387200, 382628, 645632, 544559, 375661, 468271, 520505, 205443, 63168, 341508, 411866, 346107, 118502, -51918, -33532, 102747, 396500, 396298, 263180, 189523, 252221]
8658B52221j65746r7880J69193K31376j8443j19411j80774P7688R8398J91634
8648D38256K64903n2298m28139L3730J10990k7715j44944J42915J19024J09217
8638E65939N4086q6690j06498K0492J09368j14989P5068L1313j54069P794L9260
8627D41074N3856K81753K78170j80289l10456n9278n0892J3867n2142J2720Q8730
8616E17113j67000j9385O6899R2319J8218j0017O4026J01229K86105j2799K3924
8605I60632r7340p5900J57533K83508K5576J23938J27127J73421L916M8572J65145
8594A896128J58357K19700L53764P4078p9963J59405J9901k23281m15046l55235
8584A807808l96517k63050j26510j73752j77671j02341j38435o8470J57548K51961
$$ y = [252221, 86475, -11405, 157788, 389164, 370721, 251310, 70536, 148224, 246622, 438256, 703159, 650861, 222722, 256452, 367442, 339727, 194783, 337698, 456722, 565939, 620025, 533335, 426837, 447329, 556697, 441708, 516776, 548089, 394020, 401814, 441074, 494930, 776683, 1054853, 874564, 564108, 504830, 453938, 467805, 415663, 428383, 517113, 350113, 330728, 397627, 489946, 508164, 498147, 562173, 663402, 949507, 936708, 960632, 863292, 787392, 944925, 1228433, 1254009, 1377947, 1505074, 1678495, 1682411, 1730983, 1896128, 2054485, 2274185, 2627949, 2702027, 2622064, 2781469, 2801370, 2578089, 2163043, 1807808, 1411291, 1148241, 1021731, 847979, 670308, 567967, 429532, 361062, 518610, 770571]
8574G70571Q3893K5426k0127q0472k14780j39970p4953p6215K0944L19945r913
8563F04349p0328j41750J3529J33017k30853j82479M7401J46236j82168N5092
8553A92046K50094R8511K1489j39463N1184k92753j03806J42716J3455o8174p4422
8542I0877J1875K24560J7025N4311n9977j87584n4667J54674O9832l436j64386
8531A53104j54147q0283K26812K04802M1938k64388j47681L07965K4109m0140
8521B72091M6126L9895k2408k00617m3912p658k67913N9171k1856Q4700O8951
8510F570J16349K49103q1074J39560j84991p3891K14275k78416k85657J17170
8500f1002q6069j67502j56913Q4951L31647K71006m853l3136N0361r3052n4937
$$ y = [770571, 854464, 879890, 859763, 779291, 564511, 424541, 349588, 273373, 294317, 614262, 604349, 534021, 392271, 405800, 538817, 307964, 125485, 172886, 319122, 136954, 192046, 442140, 540651, 562140, 422677, 473861, 181108, 77302, 220018, 233473, 165299, 90877, 102752, 327312, 344337, 398648, 338671, 151087, 96420, 251094, 320926, 317490, 153104, -1043, -81326, 145486, 350288, 392226, 127838, -19843, 288122, 312231, 272091, 318217, 358112, 335704, 135087, 91175, 83517, -184396, -125225, -147081, -62381, 6570, 122919, 372022, 290948, 430508, 245517, 171626, 385901, 107485, -178172, -61002, -147071, -314573, -471486, -386535, -54888, 216118, 211265, 178129, 228490, 135438, 80501]
8489H0501o8337k3358j04568J32380K20802J98351Q9082p3587k20673j98557n5338
8478b3302k32724l1663Q3876Q8461K67882J46005R5544N4972L757j4184k04099
8467B34525r2447j70007q6195J3113R3236J97041J07078R390j69089J51866J14706
8456D03217k62891l3589J13193j86721j35431l7802j22246J55458O4598n7214
8446i9428k6788K19755k00053j35010K2289j23638J29760J86570N69j18285J3803
8435a30456L5954L13296K25314K88j09406j72690j31369J32688J79175j0869k02981
8424A28944k90124J77942N02L2170J28195K043j49455L023Q0285M8445m7512p8507
8412C5951j08333q7756R5142R5357M2067j40452j81296j32053J05553J62504J46280
$$ y = [80501, 12164, -11194, -115762, 16618, 237420, 435771, 524853, 451266, 230593, 32036, -23302, -256026, -287689, -203813, -115352, 152530, 298535, 394079, 449051, 452808, 438624, 234525, 142078, -27929, -114124, -101011, -7775, 189266, 296344, 305734, 136645, 288511, 403217, 140326, 106737, 219930, 33209, -102222, -140024, -262270, -106812, -42214, -99428, -126216, 93539, -106514, -241524, -219235, -342873, -213113, -26543, -25974, -144259, -130456, -94502, 218794, 444108, 444396, 334990, 162300, 30931, 163619, 342794, 331925, 128944, -161180, 16762, 17264, 49434, 177629, 179672, 30217, 33240, 113525, 161970, 114458, 35951, -72382, -160138, -64996, 30361, 72428, -68024, -249320, -381373, -275820, -113316, 32964]
8401C2964m592j13374O9778N1784O3451R031m0246N0683j01706K47183J83865
8390D48821k50473j55293k9048p1199k4079K03336J18711Q8385K27104k33395
8380C22870k11663k817L5114j67900P8047J6007j15316o4302L7170q7314m0764
8369b00868L61569J1032j54385R8135J16271J6964K5771o5089n8628R327o4020
8358I6079k15581J25552N0264j54668Q403J41052j20824k19538j06372M18485
8348B2852L23001k61841k08487N0892K19125N3420j51371q1075j1675j0487j31371
8337a87017m4800K31183K26599j68496k06136J49285J29889q2599K11380J8683
8327B77971k79955j25904P8223j3039K08505J80409l6301J6379K14393J6325k92230
$$ y = [32964, 28372, -85002, -15224, 36560, 100011, 109042, 68796, 119479, 17773, 264956, 448821, 198348, 43055, 14007, -57192, -81271, 122065, 240776, 329161, 556265, 322870, 111207, 108390, 143504, -24396, 53651, 69658, -45658, -109960, -72790, -160104, -200868, 160701, 171733, 17348, 115483, 231754, 248718, 274489, 209400, 150772, 160099, 96079, -119502, 6050, 56314, -98354, -89951, 51101, -69723, -289261, -395633, 22852, 345853, 84012, -124475, -73583, 145542, 198962, 47591, -33484, -45159, -55646, -187017, -231817, -634, 225965, 57469, -148667, 618, 130507, 47908, 259288, 277971, -1984, -127888, -49665, -62704, 145801, 326210, 289909, 306288, 520681, 537006, 244776]
8316B44776j21436l24585O8725J46602m7934J80839k80579j22846K51091K19730
8306B14383j60130k34263J36336l2403Q7953O4429m8205m0056p4407R8945N7843
8295G0425N3314N3634j83069j20434J64600J95322p6219k95326J19712Q6649J14211
8284A82819j1050j04287k7520L4933K0804K9167k01675n1786J306R1433K42002
8273B06146N8970k79050k57639j46605n2423L37097L63771k656k93041k37257
8263c02687Q4145R6597M6402Q696o2634n1466L937J2407q0844J3459K18358M6612
8251C2982o209k29806j21676p982J04701K43862M7793j09691L5029j01580j78565
8240b91142J7414O5074J9477N5205J31342j6737q282J30908N8956Q4970J05377
$$ y = [244776, 123340, -201245, -132520, 14082, -33852, 146987, -133592, -256438, -5347, 214383, 54253, -180010, -43674, -76077, 11876, 76305, 28100, -11956, -86363, 12582, 70425, 123739, 177373, -5696, -126130, 38470, 233792, 157573, -137753, -18041, 68608, 182819, 171769, 67482, 39962, 74895, 95699, 124866, -76809, -128595, -127289, -35856, 206146, 265116, -13934, -271573, -418178, -470601, -133504, 230267, 227611, -65430, -302687, -218542, -121945, -75543, -66847, -129481, -180947, -177010, -164603, -245447, -231988, -13630, 32982, 26773, -203033, -324709, -332691, -227990, 15872, 63665, -46026, -10997, -112577, -291142, -273728, -208654, -189177, -133972, -2630, -19367, -27649, 103259, 162215, 247185, 352562]
8229C52562j68319Q0598N8636n9900Q9267o5092q4160J6968J27689j37068q8001
8218A23180p6339k03865P7198K35254M8759n2880M0413N3450j27016o2511J49702
8207B05345J36978k25943l02534o2649J98253k0498j43106M4254K47172N5764
8197A33036L9459J0448p8229l58145o0007J32000J56079O1354j1157P7457l5650
8186F6645j54458j08473j51060K41137J25215J30601p0321j34096k7269l8473
8176a20552J41653m1729n8179j9224K155K3123J82944q9299r6932J6668J40924
8165H1552l7013K947L6966j70378j82421K1286L6556k7750J11659L1912L4447
8154f0237J51381q8095j41210k52450o1800o4248N6102L6536M8903K48446O0944
$$ y = [352562, 184243, 264841, 323477, 263577, 352844, 287752, 203592, 220560, 348249, 211181, 123180, 46841, -157024, -79826, 155428, 204187, 151307, 191720, 245170, 118154, 55643, 205345, 342323, 116380, -186154, -248803, -50550, -71048, -214154, -169900, 77272, 133036, 172495, 182943, 104714, -253431, -313438, -181438, -25359, 35995, 24838, 102295, 66645, -87813, -196286, -347346, -106209, 19006, 149607, 79286, -54810, -82079, -120552, 21101, -20628, -78807, -98031, -95876, -72753, 110191, 20892, -76040, -59372, 81552, 44539, 47486, 84452, -85926, -268347, -247061, -210505, -238255, -126596, -94684, -60237, 91144, 3049, -138161, -390611, -452411, -516659, -460557, -424021, -375118, -126672, -65728]
8143f5728M7912r2558o3627Q3298N1494j6711J84510M6557j77753r2317L083J77615
8131H5775Q1221o6153o0792j5141j50732J02238Q913k66698K1846J62263o9999
8120a67259r6955K18931K2431n4135J41703J1347j45915J09254K17348M290k40050
8109B0990o4733j1082j2939j9918j42139K73300K03113k09340p0995J54480J2376
8098A33113j06117J85887J34497Q5728N744j94276k87591j75549R511P8039R4563
8087c6451J0387N3562r6400K043P3988N9688o3226l7651M1427K89788j4242J0638
8075B93551P5145k9772m6004j29426N8748K6964K9881N2210k33512l05222J8841
8064a88596N9807K51984L08760j32855k67770j61591J55900N661k94102N5004
$$ y = [-65728, -17816, -110374, -174001, -90703, -39209, -55920, 128590, 175147, -2606, -94923, -91840, 85775, 166996, 100843, 40051, 24910, -125822, -23584, -14671, -281369, -259523, -97260, -167259, -264214, -45283, -22852, -76987, 64716, 76063, -69852, 39402, 256750, 261040, 20990, -43743, -54825, -67764, -87682, -229821, 43479, 246592, 37252, -33743, 120737, 133113, 26996, 212883, 347380, 433108, 438852, 244576, -43015, -218564, -209053, -131014, -36451, -26064, 27498, -68902, -66859, 7129, 66817, 3591, -34060, 7367, 297155, 282913, 293551, 368696, 338924, 292920, 163494, 222242, 249206, 279087, 331297, 97785, -207437, -188596, -128789, 123195, 431955, 299100, 31330, -130261, 25639, 31300, -262802, -207798]
8054b07798J89877K9468K67129N2479j19027k8014j02161n3368K5446j77320L15988
8043A92699J33675j0744K3454l1017J95492o1505k26595K6497J77151J13229J32562
8032F64898J19767r9335n7791m6334k94668r0785Q719L6820k37298n4068K23069
8021A72994L40781j1882j04928n7230k27555j42420J12035Q2644j23738l5355
8011E346M33799J95390p0146o2564r9384k2124M525n1604j4827L6196N5258j78637
7999B31228m3424O0906n9645O0507K1601o7494J25520j52105L7144n4555P7695
7988B37378J1418q3827j5962L9061k0465J32210M0900K63010J39100k18860k68159
7977B55804j24450K44833O9615P0461N1j23362j08082O5089N6280l36253J18988
$$ y = [-207798, -17921, 11547, 278676, 331155, 212128, 184114, 81953, 28585, 54031, -123289, 192699, 326374, 315630, 339084, 308067, 503559, 442054, 215459, 241956, 419107, 532336, 664898, 784665, 685330, 627539, 581205, 286537, 195752, 204471, 241291, 3993, -50075, 172994, 513775, 501893, 396965, 339735, 112180, -30240, 81795, 164439, 40701, 5346, 439145, 634535, 564389, 501825, 402441, 380317, 384842, 333238, 318411, 354607, 409865, 231228, 187804, 248710, 189065, 249572, 271173, 203679, 329199, 177094, 214238, 159683, 237378, 248796, 164969, 149007, 188068, 167603, 299813, 340713, 603723, 742823, 523963, 255804, 131354, 376187, 445802, 516263, 516314, 392952, 284870, 349959, 406239, 69986, 188974]
7966A88974J75754n6526R9980j42810m559M0486K13788J66507l5796p341M7350
7955F85807o9432m0467q9233q1624k9467j30317j8412K74826p5021J06661K08961
7944G42282p9445j40178j95372M9263Q2834J0057k2306j77289k39517J54255N3279
7933B37863L8214J51208n3983L48381r3327o9740J53739j48251l90804N359k0616
7922A58043m8581J42630K33412K60209P3018J8302q4524l39377j46668P9203j06162
7911B39505J28668j16326L8508M3313L316j00511j56829K20989Q2495j20648l9763
7900B22717J41595R5015J82808K485n6677p6037j65635l0913J821l91844k1203
7889i5868K16966j5908n8861J31653o3292j12989l4288K67437P2498J44009k4762
$$ y = [188974, 364728, 308202, 408182, 265372, 260813, 301299, 515087, 681594, 645798, 638457, 685807, 616375, 575908, 486675, 405051, 375584, 245267, 226855, 501681, 426660, 533321, 742282, 662837, 522659, 327287, 376550, 459384, 469441, 447135, 269846, 30329, 184584, 237863, 276077, 427285, 373302, 721683, 628356, 558616, 712355, 564104, 173300, 178659, 158043, 109462, 252092, 485504, 745713, 818731, 837033, 752509, 413132, 266464, 345667, 239505, 368173, 251847, 290355, 333668, 336984, 236473, 79644, 300633, 383128, 262480, 222717, 364312, 459327, 642135, 644620, 587943, 511906, 346271, 315358, 317179, -74665, -95868, 121098, 105190, 46329, 177982, 114690, 1701, -32587, 234850, 307348, 451357, 426595]
7878D26595r6271J71932J6986k64975L1031L9594K16692n3633J0880r7966l03678
7867I7187p1869K10929J04681j2115n2461k8880K3184k2197K3107K4436l8603
7856B57399p2358J11296j37835k7589j5803J03313R3183m9501p4034j00668K0283
7845A07686M3483j59992j07844l2062R6237O6724r2049J9220P8892k83922M8525
7834b15102L54471K08110k323j28925j46541j10827k63781J31794J55884j5041
7824c2281L5554L5872j9542m7546J43898R6077l4246M3949j85204l12119l133
7813b78721k9875J33938K08046O7905j7996o1371J3112P2674K23607J36722o0983
7802D07058q1766k6915N8235J71149q4642l18741L5462j11947m30084q0929J64636
$$ y = [426595, 330324, 502256, 519242, 254267, 285298, 324892, 541584, 487951, 498831, 400865, 97187, 25318, 236247, 340928, 328813, 276352, 247472, 270656, 248459, 271566, 296002, 257399, 185041, 296337, 158502, 130913, 115110, 218423, 311606, 262105, 188071, 87403, 107686, 151169, -8823, -116667, -148729, -52492, 14232, -77817, -58597, 20295, -263627, -215102, 139369, 347479, 345156, 216231, 69690, -41137, -304918, -173124, -17240, -32281, 3273, 39145, 19603, -27943, 115955, 212032, 177786, 221735, 36531, -275588, -278721, -308596, -174658, 33388, 101293, 83297, 21926, 35038, 107712, 331319, 468041, 407058, 325292, 298377, 356612, 527761, 443119, 124378, 159840, 47893, -382191, -463120, -298484]
7791b98484K29599j28053l8897Q3225m3443k4393p7937K51025O0425k99546l4419
7780c20898J76998K19987l2986r9626l6500k15591R5440k06707O1348L43789N6589
7769D1843j75005r721J84728j08362j58369K37545K5148j22163J06280L3341J604
7758E6869J90289K9747k6779j15347m6278q0830l108j92202l1560L1753M7421
7747a40025K4500k1848m2707J15019k33043L00258J66518o8930Q4397Q6248o1324
7736B09063R1867R25k0406j49202j0636j4912j07491q486q7411J17217Q8369L4197
7724A43094l1220N8919j60640j38547J20553J10559j59956j21286M4105k03009
7714c37428J09152J57829P628J29023R2657o1012k24115J8168j37297n5254J72833
$$ y = [-298484, -68885, -196938, -235835, -152610, -196053, -220446, -298383, -47358, 13067, -286479, -320898, -143900, 76087, 43101, -56525, -93025, -308616, -213176, -419883, -358535, -14746, 41843, -133162, -142883, 41845, -66517, -224886, 12659, 37807, -84356, 21924, 55265, 56869, 247158, 276905, 250126, 134779, 88501, 7671, 4563, -187639, -219199, -187446, -140025, -115525, -137373, -180080, -65061, -298104, 2154, 168672, 99742, 184139, 270387, 209063, 300930, 301855, 281449, 132247, 121611, 106699, -792, -9278, -96689, 20528, 108897, 143094, 111874, 170793, 10153, -128394, -7841, 102718, -57238, -178524, -134419, -337428, -228276, -70447, -62819, 66204, 158861, 97849, -126266, -108098, -245395, -300649, -127816]
7703a27816J87164J47881j25735l8544J28989j13375k11513J58976N7057k46268
7693a83184k39472K60819J27241j8390n0002J9197l6184J23785J61218N7406k2199
7682B00235J40898j39139k58948j39894L09831L16828J40251l0572k36082l37696
$$ y = [-127816, 59348, 207229, 81494, 42950, 171939, 58564, -152949, 6027, 63084, -183184, -422656, -161837, -34596, -52986, -102988, -83791, -119975, 3810, 165028, 222434, 200235, 341133, 201994, -56954, -196848, 112983, 429811, 570062, 539490, 303408, -34288]
$$ [...]
##END NTUPLES=NMR SPECTRUM
##END=
