##TITLE=Analysis number 323872
Compound Code cc 54613
Book Reference 494/76
Project Code adrs
Chemist Name craigr
##JCAMPDX= 6.0         $$ Bruker NMR JCAMP-DX V2.0
##DATA TYPE= NMR SPECTRUM
##DATA CLASS= NTUPLES
##ORIGIN= Bruker BioSpin GmbH
##OWNER= nmr
$$ XWIN-NMR		Version 3.5
$$ Thu Nov  9 16:11:52 2006 GMT Standard Time (UT+0h)  MAYBRIDGE\nmr@NMR_250MHZ
##.OBSERVE FREQUENCY= 250.131544655141
##.OBSERVE NUCLEUS= ^1H
##.ACQUISITION MODE= SIMULTANEOUS (DQD)
##.ACQUISITION SCHEME= undefined
##.AVERAGES= 16
##.DIGITISER RES= 18
##SPECTROMETER/DATA SYSTEM= dpx250
##.PULSE SEQUENCE= zg30
##.SOLVENT NAME= CDCl3
##.SHIFT REFERENCE= (INTERNAL, CDCl3, 0, 16.522)
##AUDIT TRAIL= $$ (NUMBER, WHEN, WHO, WHERE, WHAT)
$$ ##TITLE= Audit trail, XWIN-NMR		Version 3.5
$$ ##JCAMPDX= 5.01
$$ ##ORIGIN= Bruker BioSpin GmbH
$$ ##OWNER= nmr
$$ C:\u/data/dgb/nmr/ADRS/2550/pdata/1/auditp.txt
$$ ##AUDIT TRAIL=  $$ (NUMBER, WHEN, WHO, WHERE, WHAT)
(   1,<2006-11-09 16:11:28.55 +000>,<MAYBRIDGE\nmr>,<NMR_250MHZ>,
      <created by zg, POWCHK disabled, PULCHK disabled
       configuration hash MD5:
       49 4B E0 1D 92 C2 6B 37 9F E6 65 BC 52 41 86 1D
       data hash MD5: 64K
       71 C7 31 86 52 9F 17 F7 CF 7A A9 1C 00 3C 45 41>)
(   2,<2006-11-09 16:11:42.62 +000>,<MAYBRIDGE\nmr>,<NMR_250MHZ>,
      <Start of raw data processing
       ef LB = 0.3 FT_mod = 6 PKNL = 1 SI = 32K 
       data hash MD5: 32K
       67 1B 8B CC 9C A7 A8 C9 05 2F C8 E7 F5 B7 F0 EE>)
(   3,<2006-11-09 16:11:44.46 +000>,<MAYBRIDGE\nmr>,<NMR_250MHZ>,
      <apk 
       data hash MD5: 32K
       D2 67 EA 1C 7D 27 F7 47 A1 60 8C 4C 20 9A EB B9>)
(   4,<2006-11-09 16:11:45.23 +000>,<MAYBRIDGE\nmr>,<NMR_250MHZ>,
      <abs ABSG = 5 
       data hash MD5: 32K
       78 AB 72 C5 D0 FF 6C 27 E7 17 7E 85 5B 5B BE 88>)
$$ ##END=
$$ 
$$ hash MD5
$$ A1 76 5D 9C 3A C1 64 9C CE D8 13 9F 57 8E BD EE
##$RELAX= 
##$RELAX= 
##$RELAX= 
##$RELAX= 
##$RELAX= 
##$RELAX= 
##$RELAX= 
$$ Bruker specific parameters
$$ --------------------------
##$DU= <C:\u>
##$EXPNO= 2550
##$NAME= <ADRS>
##$PROCNO= 1
##$TYPE= <nmr>
##$USER= <dgb>
##$AMP= (0..31)
100 100 100 100 100 100 100 100 100 100 100 100 100 100 100 100 100 100 
100 100 100 100 100 100 100 100 100 100 100 100 100 100 
##$AQSEQ= 0
##$AQ_mod= 3
##$AUNM= <au_zg>
##$AUTOPOS= <58 >
##$BF1= 250.13
##$BF2= 250.13
##$BF3= 250.13
##$BF4= 250.13
##$BF5= 500.13
##$BF6= 500.13
##$BF7= 500.13
##$BF8= 500.13
##$BYTORDA= 1
##$CFDGTYP= 0
##$CFRGTYP= 5
##$CHEMSTR= <none>
##$CNST= (0..31)
1 1 145 1 1 1 1 1 1 1 1 1 1 1 1 1 1 1 1 1 1 1 1 1 1 1 1 1 1 1 1 1 
##$CPDPRG= <>
##$CPDPRG1= <>
##$CPDPRG2= <>
##$CPDPRG3= <>
##$CPDPRG4= <mlev>
##$CPDPRG5= <mlev>
##$CPDPRG6= <mlev>
##$CPDPRG7= <mlev>
##$CPDPRG8= <mlev>
##$CPDPRGB= <>
##$CPDPRGT= <>
##$D= (0..31)
0 1 0 0 0 0 0 0 0 0.06 0 0 0 0 0 0 0.0002 0 0 0 0 0 0 0 0 0 0 0 0 0 0 
0 
##$DATE= 1163088687
##$DBL= (0..7)
120 120 120 120 120 120 120 120 
##$DBP= (0..7)
150 150 150 150 150 150 150 150 
##$DBP07= 0
##$DBPNAM0= <>
##$DBPNAM1= <>
$$ [...]
##$SUBNAM7= <"">
##$SUBNAM8= <"">
##$SUBNAM9= <"">
##$SW= 20.6930455092707
##$SWIBOX= (0..15)
0 0 3 0 0 0 0 0 0 0 0 0 0 0 0 0 
##$SW_h= 5175.983436853
##$TD= 65536
##$TD0= 1
##$TE= 683.16
##$TE2= 300
##$TE3= 300
##$TEG= 300
##$TL= (0..7)
0 120 120 120 120 120 120 120 
##$TP= (0..7)
150 150 150 150 150 150 150 150 
##$TP07= 0
##$TPNAME0= <>
##$TPNAME1= <>
##$TPNAME2= <>
##$TPNAME3= <>
##$TPNAME4= <>
##$TPNAME5= <>
##$TPNAME6= <>
##$TPNAME7= <>
##$TPOAL= (0..7)
0.5 0.5 0.5 0.5 0.5 0.5 0.5 0.5 
##$TPOFFS= (0..7)
0 0 0 0 0 0 0 0 
##$TUNHIN= 0
##$TUNHOUT= 0
##$TUNXOUT= 0
##$USERA1= <user>
##$USERA2= <user>
##$USERA3= <user>
##$USERA4= <user>
##$USERA5= <user>
##$V9= 5
##$VALIST= <valist>
##$VCLIST= <CCCCCCCCCCCCCCC>
##$VD= 0
##$VDLIST= <DDDDDDDDDDDDDDD>
##$VPLIST= <PPPPPPPPPPPPPPP>
##$VTLIST= <TTTTTTTTTTTTTTT>
##$WBST= 1024
##$WBSW= 4
##$XGAIN= (0..3)
0 0 0 0 
##$XL= 0
##$YL= 0
##$YMAX_a= 574075
##$YMIN_a= -576314
##$ZGOPTNS= <>
##$ZL1= 120
##$ZL2= 120
##$ZL3= 120
##$ZL4= 120
##$ABSF1= 16.522
##$ABSF2= -4.171173
##$ABSG= 5
##$ABSL= 3
##$ALPHA= 0
##$AQORDER= 0
##$ASSFAC= 0
##$ASSFACI= 0
##$ASSFACX= 0
##$ASSWID= 0
##$AUNMP= <proc_1d>
##$AZFE= 0.1
##$AZFW= 0.1
##$BCFW= 0
##$BC_mod= 0
##$BYTORDP= 0
##$COROFFS= 0
##$CY= 12.5
##$DATMOD= 1
##$DC= 0
##$DFILT= <>
##$DTYPP= 0
##$F1P= 14.0000005364418
##$F2P= -0.99999901652339
##$FCOR= 0.5
##$FTSIZE= 32768
##$FT_mod= 6
##$GAMMA= 0
##$GB= 0
##$INTBC= 1
##$INTSCL= 1
##$ISEN= 128
##$LB= 0.3
##$LEV0= 0
##$LPBIN= 0
##$MAXI= 10000
##$MC2= 0
##$MEAN= 0
##$ME_mod= 0
##$MI= 0
##$NCOEF= 0
##$NC_proc= -2
##$NLEV= 6
##$NOISF1= 0
##$NOISF2= 0
##$NSP= 0
##$NTH_PI= 0
##$NZP= 0
##$OFFSET= 16.522
##$PC= 1
##$PHC0= -45.36974
##$PHC1= 6.244764
##$PH_mod= 1
##$PKNL= yes
##$PPARMOD= 0
##$PSCAL= 4
##$PSIGN= 0
##$REVERSE= no
##$SF= 250.13
##$SI= 32768
##$SIGF1= 0
##$SIGF2= 0
##$SINO= 400
##$SIOLD= 32768
##$SREGLST= <1H.CDCl3>
##$SSB= 0
##$STSI= 32768
##$STSR= 0
##$SW_p= 5175.98343685301
##$SYMM= 0
##$S_DEV= 0
##$TDeff= 65536
##$TDoff= 0
##$TI= <Analysis number 999999
Compound Code 99
Book Reference 9
Project Code 9>
##$TILT= no
##$TM1= 0
##$TM2= 0
##$TOPLEV= 0
##$USERP1= <user>
##$USERP2= <user>
##$USERP3= <user>
##$USERP4= <user>
##$USERP5= <user>
##$WDW= 1
##$XDIM= 32768
##$YMAX_p= 361097318
##$YMIN_p= -30246
$$ End of Bruker specific parameters
$$ ---------------------------------
##NTUPLES= NMR SPECTRUM
##VAR_NAME=  FREQUENCY,     SPECTRUM/REAL,   SPECTRUM/IMAG
##SYMBOL=    X,             R,               I
##VAR_TYPE=  INDEPENDENT,   DEPENDENT,       DEPENDENT
##VAR_FORM=  AFFN,          ASDF,            ASDF
##VAR_DIM=   32768,         32768,           32768
##UNITS=     HZ,            ARBITRARY UNITS, ARBITRARY UNITS
##FACTOR=    0.157963299565203, 1,           1
##FIRST=     4132.6476996994, 0,             0
##LAST=      -1043.33573715361, 0,           0
##MIN=       -1043.33573715361, -30246,      0
##MAX=       4132.6476996994, 361097318,     0
$$ Real data points
##PAGE= N=1
##DATA TABLE= (X++(R..R)), XYDATA
$$ [...]
$$ plain form
17345 231895 257137 273769 298866 328759 362550 406503 472838 525683 558590 586391 616900
17334 616900 679088 751584 778853 772084 719338 670022 664620 664882 645735 616374 581506 555550
17322 555550 546911 554763 564497 581013 605281 640086 678579 720265 772297 840214 916392 1025313
17310 1025313 1162279 1292590 1427751 1589198 1777054 2004590 2227721 2418027 2597915
17301 2597915 2814380 3106293 3454465 3852992 4349928 5055580 6088587 7618199 9985446
17292 9985446 13774799 19820725 28477290 37853885 44635963 49416945 53807089 61405828
17284 61405828 72008784 76889236 74500316 65750178 55306453 50463520 46827091 41094772
17276 41094772 32859678 23232732 16196145 11895464 9253378 7532076 6346569 5522804
$$ packed form
17345B31895K5242J6632K5097K9893L3791M3953O6335N2845L2907K7801L0509
17334F16900O2188P2496K7269o769n2746m9316n402K62j9147k9361l4868k5956
17322E55550q639P852R734J6516K4268L4805L8493M1686N2032O7917P6178J08921
17310A025313J36966J30311J35161J61447J87856K27536K23131J90306J79888
17301B597915K16465K91913L48172L98527M96936P05652J033007J529612K367247
17292I985446L789353O045926Q656565R376595O782078M780982M390144P598739
17284F1405828J0602956M880452k388920q750138j0443725m842933l636429n732319
17276D1094772q235094r626946p036587m300681k642086j721302j185507q23765
$$ plain form
17268 5522804 4926770 4469301 4106609 3822586 3611959 3434220 3265936 3061933 2831821
17259 2831821 2604428 2401801 2234693 2077444 1908269 1745347 1601747 1485499 1397897 1323985
17249 1323985 1252393 1180508 1112751 1056858 1014117 972084 929354 890322 853237 811374 772424
17238 772424 738337 714075 685742 657927 632972 617233 600533 582980 558781 534331 516603
17227 516603 498014 486560 468488 448004 432088 425009 414365 398649 387452 377859 364210 348025
17215 348025 337811 323159 313601 306734 298999 290595 287259 284447 284606 277923 268762 257312 253274 247698
17201 247698 234312 222674 221453 224318 221914 215244 212557 206496 202382 200690 203499 213020 223121
17188 223121 227113 229888 230439 231199 235532 226487 221082 211812 208869 195563 185887 172622 159958 152574
$$ packed form
17268E522804n96034m57469l62692k84023k10627j77739j68284k04003k30112
17259B831821k27393k02627j67108j57249j69175j62922j43600j16248q7602p3912
17249A323985p1592p1885o7757n5893m2741m2033m2730l9032l7085m1863l8950
17238G72424l4087k4262k8333k7815k4955j5739j6700j7553k4199k4450j7728
17227E16603j8589j1454j8072k0484j5916p079j0644j5716j1197r593j3649j6185
17215C48025j0214j4652r558o867p735q404l336k812J59o683r161j1450m038n576
17201B47698j3386j1638j221K865k404o670k687o061m114j692K809R521J0101
17188B23121L992K775N51P60M333r045n405r270k943j3306r676j3265j2664p384
$$ plain form
17174 152574 148083 136604 124893 116627 106204 104513 102069 101811 96076 88844 87840 85224 80601 73824
17160 73824 63805 62782 62355 62155 58016 53167 49542 57331 58288 61217 64729 63538 60247 60259 52536
17145 52536 58541 54305 44206 43467 42039 37076 37147 31595 29677 39106 38580 27917 23295 22540 24193
17130 24193 32494 32120 26886 30615 31353 37137 37604 35441 33841 27355 24081 25349 27693 18284 22234
17115 22234 28139 28641 21291 13608 13883 9682 4392 -3367 2805 2045 5997 4205 2869 -1402 -223
17100 -223 3126 5582 9617 25485 43125 49807 48292 55237 59014 63172 61541 60010 58302 53974
17086 53974 51827 56775 56529 58626 61777 65338 51417 46130 42922 37179 33660 35548 35705 31961 25238
17071 25238 23318 17445 6476 -2581 -660 3399 1709 5227 13593 16251 18070 17641 15398 12059
$$ packed form
17174A52574m491j1479j1711q266j0423j691k444k58n735p232j004k616m623o777
17160G3824j0019j023m27k00m139m849l625P789R57K929L512j191l291J2p723
17145E2536O005m236j0099p39j428m963P1n552j918R429n26j0663m622p55J653
17130B4193Q301l74n234L729P38N784M67k163j600o486l274J268K344r409L950
17115B2234N905N02p350p683K75m201n290p759O172p60L952j792j336m271J179
17100b23L349K456M035J5868J7640O682j515O945L777M158j631j531j708m328
17086E3974k147M948k46K097L151L561j3921n287l208n743l519J888J57l744o723
17071B5238j920n873j0969r057J921M059j690L518Q366K658J819m29k243l339
$$ plain form
17057 12059 9725 10662 15095 19469 18248 18464 14596 15949 22140 19180 13779 15166 16521 12148 16266
17042 16266 13968 9869 13338 17596 22962 17086 13643 16818 17425 16294 15811 11301 11719 13671 14625
17027 14625 13641 16091 12575 1108 -3081 7000 15207 19369 18342 21510 24955 19000 16854 16020
17013 16020 16166 18285 11579 3695 1449 1615 2491 4170 2913 -2580 -2280 -3985 -1173 674 -4689
16998 -4689 -3495 -519 2268 7159 8596 11642 16513 13434 8538 13667 12971 11650 5280 5576 2046
16983 2046 3711 4441 -919 -10077 -5854 517 -4830 -4852 -2039 6693 5507 4136 2614 -309 -6643
16968 -6643 -8495 -11561 -14488 -10443 -3514 -4118 -7166 -5222 -1811 -8808 -14277 -9425 -1272 1647 16
16953 16 -1005 -343 -2430 -4220 -2665 -1159 2529 2969 3162 6120 4235 6890 -811 -2182 2030 4365
$$ packed form
17057A2059k334R37M433M374j221K16l868J353O191k960n401J387J355m373M118
17042A6266k298m099L469M258N366n876l443L175O07j131m83m510M18J952R54
17027A4625r84K450l516j1467m189J0081Q207M162j027L168L445n955k146q34
17013A6020J46K119o706p884k246J66Q76J679j257n493L00j705K812J847n363
16998d689J194K976K787M891J437L046M871l079m896N129o96j321o370K96l530
16983B046J665P30n360r158M223O371n347k2K813Q732j186j371j522k923o334
16968f643j852l066k927M045O929o04l048J944L411o997n469M852Q153K919j631
16953A6j021O62k087j790J555J506L688M40J93K958j885K655p701j371M212K335
$$ plain form
16937 4365 1654 154 2596 -43 1365 6562 4902 3075 -6193 -12551 -16964 -12836 -6523 -7667 -3438
16922 -3438 3368 2611 5002 11265 9846 7758 5628 1866 390 245 1273 2435 4417 -3703 -2112
16907 -2112 -4557 -1440 -1391 967 2659 3409 4240 917 -3244 -859 1796 7724 16598 11355 5010 2211
16891 2211 -496 -7043 -8522 -8506 -299 8489 7515 8056 5818 -1012 1662 324 -4113 -2275 1572 1601
16875 1601 317 4371 3400 -4592 -10917 -14956 -9721 -2932 -3371 -8525 -13330 -7519 -7009 -2276 7406
16860 7406 1490 -4454 -4125 -2856 -6423 -14057 -9929 -6719 -8321 142 -1283 1805 6512 5770 3796
16845 3796 -2921 -3731 403 6345 8220 9044 3399 -3072 -6646 -10473 -9315 -8121 -3880 3629 -1076
16830 -1076 -9974 -6401 1414 3564 2288 3 -1980 -1646 -6312 -4315 -2577 2522 4540 9176 15172
$$ packed form
16937D365k711j500K442k639J408N197j660j827r268o358m413M128O313j144M229
16922c438O806p57K391O263j419k088k130l762j476j45J028J162J982q120J591
16907b112k445L117M9K358J692P50Q31l323m161K385K655N928Q874n243o345k799
16891B211k707o547j479J6Q207Q788r74N41k238o830K674j338m437J838L847K9
16875A601j284M054r71p992o325m039N235O789m39n154m805N811N10M733R682
16860G406n916n944L29J269l567p634M128L210j602Q463j425L088M707p42j974
16845C796o717q10M134N942J875Q24n645o471l574l827J158J194M241P509m705
16830a076q898L573P815K150j276k285j983L34m666J997J738N099K018M636N996
$$ plain form
16815 15172 10024 614 -2959 -356 -1587 -3414 -7419 -7511 -5203 -4956 -5677 -6350 -3039 749 -5208 -6801
16799 -6801 -12165 -9480 -4663 -197 2983 8513 8123 1505 -1489 -5215 -12395 -14184 -10876 -15643 -15190
16784 -15190 -11243 -8743 -2709 376 -8161 -11946 -14207 -16208 -8506 -1409 -25 -4942 -13504 -13406 -3497
16769 -3497 -632 -3430 1014 6063 3204 1775 -6342 -5271 -3616 -7101 -11317 -8414 -4435 -2401 -4175
16754 -4175 -7472 -907 4469 3984 -1971 -10482 -14233 -12386 -5777 -90 -4061 -10001 -5869 5176 11945
16739 11945 14475 15695 6676 8284 8684 4744 3341 7720 6707 11557 16333 16449 11407 7540 3639
16724 3639 6615 5992 5241 5056 1663 -4056 -9685 -5451 -176 1652 -165 4488 13812 10902 10067 16974
16708 16974 18879 12671 6551 10009 20064 17121 23747 31715 37257 50573 77397 112379 161446
$$ packed form
16815A5172n148r410l573K603j231j827m005r2K308K47p21o73L311L788n957j593
16799f801n364K685M817M466L180N530l90o618k994l726p180j789L308m767M53
16784a5190L947K500O034L085q537l785k261k001P702P097J384m917q562R8R909
16769c497K865k798M444N049k859j429q117J071J655l485m216K903L979K034j774
16754d175l297O565N376m85n955q511l751J847O609N687l971n940M132J1045O769
16739A1945K530J220r019J608M00l940j403M379j013M850M776J16n042l867l901
16724C639K976o23p51j85l393n719n629M234N275J828j817M653R324k910q35O907
16708A6974J905o208o120L458J0055k943O626P968N542J3316K6824L4982M9067
$$ plain form
16695 161446 210387 239546 265361 288166 332336 389955 418481 405515 357343 301218 273552
16684 273552 255564 225612 180261 123058 79865 58716 45897 32230 24202 17572 18561 20712
16672 20712 20073 19526 20208 22698 20458 13832 11744 11561 12225 16684 22908 22906 20046 19802 17856 10073 7307
16655 7307 5029 7584 12553 11896 4083 2632 409 2910 3460 1699 5366 5923 3104 3259 1547 828
16639 828 0 714 6088 9832 8664 -16 -4278 919 1087 -6060 -7070 -8465 -9087 -11995 -6131 -125
16623 -125 -1827 -4117 -4143 -1053 -1689 -3769 -6594 -9012 -9654 1650 3324 2389 2182 -1917 -6421 -2538
16607 -2538 3108 4966 -210 -4060 -4108 -2600 -9905 -18417 -12396 -12752 -129 -2379 -10149 -2572 3512
16592 3512 4287 4473 -176 -2082 6217 2794 -7065 -8409 -5187 -4070 -3463 -4969 -5692 -7152 -8115 -8748
$$ packed form
16695A61446M8941K9159K5815K2805M4170N7619K8526j2966m8172n6125k7666
16684B73552j7988k9952m5351n7203m3193k1149j2819j3667q028o630R89K151
16672B0712o39n47O82K490k240o626k088j83O64M459O224kk860k44j946p783k766
16655G307k278K555M969o57p813j451k223K501N50j761L667N57k819J55j712p19
16639H28q28P14N374L744j168q680m262N197J68p147j010j395o22k908N864O006
16623a25j702k290k6L090o36k080k825k418o42J1304J674r35k07m099m504L883
16607b538N646J858n176l850m8J508p305q512O021l56J2623k250p770P577O084
16592C512P75J86m649j906Q299l423r859j344L222J117O07j506p23j460r63o33
$$ plain form
16576 -8748 -2381 3295 2305 -7287 -3953 -4726 497 1343 1184 2868 -3510 -3848 -1886 -8157 -12069 -12048
16560 -12048 459 5080 265 888 -794 5689 845 -7532 -8416 -8490 -4012 2921 5584 9101 4728
16545 4728 3500 1347 525 -2006 -2449 -4101 -4436 785 -6758 -12591 -12126 -13095 -10807 -14435 -7583 -1891
16529 -1891 1407 2126 -5275 -4750 -1026 -5269 -5867 1690 -1286 -4914 -7323 -7413 -3234 -2554 -205 -4064
16513 -4064 -3185 1168 -6396 -9784 -14320 -13401 -10636 -4112 -3830 -601 -1039 -4615 -1513 -4394 -10969 -9699
16497 -9699 -3300 -3096 -2921 -722 2726 5345 -1379 -2622 -2301 -5014 3016 6260 9463 6332 3377
16482 3377 1658 8843 6476 -551 -2577 -4250 -3005 -2243 -8318 -6625 -8556 -7705 -5672 -2803 -6553
16467 -6553 -4720 -5451 -5904 -4825 -2025 258 -2855 2545 6500 4285 -5514 -10406 -3320 -473 -1899
$$ packed form
16576h748O367N676r90r592L334p73N223Q46j59J684o378l38J962o271l912K1
16560a2048J2507M621m815O23j682O483m844q377q84p4M478O933K663L517m373
16545D728j228k153q22k531m43j652l35N221p543n833M65r69K288l628O852N692
16529a891L298P19p401N25L724m243n98P557k976l628k409r0M179O80K349l859
16513d064Q79M353p564l388m536R19K765O524K82L229m38l576L102k881o575J270
16497i699O399K04J75K199L448K619o724j243L21k713Q030L244L203l131k955
16482C377j719P185k367p027k026j673J245P62o075J693j931Q51K033K869l750
16467f553J833p31m53J079K800K283l113N400L955k215r799m892P086K847j426
$$ plain form
16452 -1899 -9386 -15091 -15000 -14297 -14871 -10666 -9162 -8876 -9594 -14676 -12446 -349 3563 526 -7883 -11832
16436 -11832 -5804 1044 1775 3099 2534 104 -1217 2703 -5864 -17447 -17561 -13044 -10619 -5651 -4788
16421 -4788 -9376 -13756 -16300 -18199 -16155 -8423 62 -867 -6163 -11853 -7656 -6243 -8225 -8293 -7561 -6165
16405 -6165 -1088 3120 -28 129 -3465 -10172 -10867 -8754 -5377 -8641 -6791 -5099 -2436 -4090 -7150
16390 -7150 -5735 3 10468 6645 4350 2805 -1412 3672 7330 9222 6193 3720 -1970 904
16376 904 579 2206 2398 -500 -5944 -2792 2000 3025 -1212 5642 5001 2292 -3541 -7849 -4673 -3126
16360 -3126 -6673 -11287 -6616 -637 2013 -2562 -9423 -12748 -14484 -6936 -3599 -6985 -6157 -4124 -9974
16345 -9974 -14615 -11669 -5999 -4553 -4893 -9813 -11751 -16505 -22724 -15696 -6997 -8142 -8961 -8254 -6418
$$ packed form
16452a899p487n705R1P03n74M205J504K86p18n082K230J2097L912l037q409l949
16436a1832O028O848P31J324n65k430j321L920q567j1583j14M517K425M968Q63
16421d788m588m380k544j899K044P732Q485r29n296n690M197J413j982o8P32J396
16405f165N077M208l148J57l594o707o95K113L377l264J850J692K663j654l060
16390g150J415N738J0465l823k295j545m217N084L658J892l029k473n690K874
16376I04l25J627J92k898n444L152M792J025m237O854o41k709n833m308L176J547
16360c126l547m614M671N979K650m575o861l325j736P548L337l386Q28K033n850
16345i974m641K946N670J446l40m920j938m754o219P028Q699j145q19P07J836
$$ plain form
16330 -6418 -6384 4998 14733 5470 733 -4792 -11207 -13492 -14807 -14499 -5549 2159 4727 1540 -2590
16315 -2590 -1617 -2788 684 6042 2843 -4326 -9932 -11863 -10014 -2174 -1735 -5032 -6620 -3014 560
16300 560 6725 9454 4760 2387 -6364 -10967 -9261 -5868 -8840 -2249 1669 1893 -752 449 -2181
16285 -2181 -9542 -9202 -2021 -4611 -8034 -9023 -9550 -9935 -6147 -10217 -8544 -5389 -5940 4250 7811 934
16269 934 -3085 -5244 -1405 2955 -1654 -2532 -3169 -9278 -5198 -1159 680 -90 618 -6257 -8847 -8041
16253 -8041 -3747 -113 864 -2233 -12213 -20354 -18365 -17018 -17810 -12927 -11548 -5576 -3983 -702 2394
16238 2394 10740 13886 9164 2525 6075 2284 -5361 -9744 -9102 325 5681 4189 3029 -4504 -4405
16223 -4405 -6387 -3567 420 -284 -6927 -4868 -2676 2633 2459 -406 -3814 -7025 -5765 -2688 -4239
$$ packed form
16330f418L4J1382R735r263m737n525o415k285j315L08Q950P708K568l187m130
16315b590R73j171L472N358l199p169n606j931J849P840M39l297j588L606L574
16300E60O165K729m694k373q751m603J706L393k972O591L918K24k645J201k630
16285b181p361L40P181k590l423r89n27l85L788m070J673L155n51J0190L561o877
16269I34m019k159L839M360m609q78o37o109M080M039J839p70P08o875k590Q06
16253h041M294L634R77l097r980q141J989J347p92M883J379N972J593L281L096
16238B394Q346L146m722o639L550l791p645m383O42R427N356j492j160p533R9
16223d405j982K820L987p04o643K059K192N309j74k865l408l211J260L077j551
$$ plain form
16208 -4239 -4880 -4125 -5968 -3881 -9079 -5000 -662 -5693 -8706 -13451 -16085 -11775 -11170 -6087 -5048
16193 -5048 -2056 -2492 -7028 -930 455 -1883 -2659 -2810 3067 1519 -8159 -11950 -9269 -9703 -5472 -6910
16177 -6910 -9198 -11999 -11324 -10369 -8437 -7649 -3359 1338 -8007 -4836 2832 4716 5275 5081 6248 172
16161 172 -1988 -2454 -1608 2624 -6956 -12261 -8988 -5306 -3210 958 8616 8512 3923 1818 5278 4795
16145 4795 367 -2651 3751 3210 3998 2546 6247 3497 7184 12191 11230 6410 3798 1871 -2955
16130 -2955 -11421 -4196 2626 8291 7609 -1300 -2101 -3840 -1853 -579 -1478 -1904 570 3333 6672 149
16114 149 -6100 -9137 -3731 -6785 -4828 1075 4038 8257 4456 -5304 -7029 -1140 1508 -1740 -1796
16099 -1796 -5746 -5271 -2614 4084 11298 18972 14147 7253 177 -7932 -7957 -4613 -1224 2415 -741
$$ packed form
16208d239o41P55j843K087n198M079M338n031l013m745k634M310O05N083J039
16193e048K992m36m536O098J385k338p76j51N877j548r678l791K681m34M231j438
16177f910k288k801O75R55J932P88M290M697r345L171P668J884N59j94J167o076
16161A72k160m66Q46M232r580n305L273L682K096M168P658j04m589k105L460m83
16145D795m428l018O402n41P88j452L701k750L687N007r61m820k612j927m826
16130b955q466P225O822N665o82q909q01j739J987J274q99m26K474K763L339o523
16114A49o249l037N406l054J957N903K963M219l801r760j725N889K648l248n6
16099a796l950M75K657O698P214P674m825o894p076q109k5L344L389L639l156
$$ plain form
16084 -741 4235 3485 2779 1277 -4166 -2631 -3494 -7570 -11090 -9116 -4110 -3345 -358 2838 3949 -1949
16068 -1949 1262 2220 -1220 -4195 -6023 -7427 -8484 -7219 -9893 -10818 -4929 -2881 -693 -3328 -7047
16053 -7047 -3683 515 4417 -3339 -14803 -13711 -7486 -9881 -11655 -9840 -7488 -13382 -3575 548
16039 548 -3676 -8682 -12066 -14082 -18814 -29063 -30246 -20880 -13035 -14811 -16685 -15771 -6161 3468 1518
16024 1518 575 4711 2445 2490 3417 4919 1909 -6372 -7386 -5370 -3686 -3375 -1518 -428 -6726 -9283
16008 -9283 -11047 -10428 -10226 -7395 -10075 -13120 -14299 -15723 -12509 -9923 -7239 -6659 -7191 -7102 649 3575
15992 3575 -5015 -6439 -3174 -5659 -6506 -4253 -3054 670 1709 -3602 -5702 -4591 -3873 -4339 -5959
15977 -5959 -8446 -3252 4103 852 3943 789 3556 5170 605 -448 2199 3757 76 2815 5020
$$ packed form
16084g41M976p50p06j502n443J535q63m076l520J974N006P65K987L196J111n898
16068a949L211R58l440k975j828j404j057J265k674r25N889K048K188k635l719
16053g047L364M198L902p756j1464J092O225k395j774J815K352n894R807M123
16039E48m224n006l384k016m732j0249j183R366P845j776j874R14R610R629j950
16024A518r43M136k266M5R27J502l010q281j014K016J684L11J857J090o298k557
16008i283j764O19K02K831k680l045j179j424L214K586K684N80n32Q9P751K926
15992C575q590j424L265k485q47K253J199L724J039n311k100J111P18m66j620
15977e959k487N194P355l251L091l154K767J614m565j053K647J558l681K739K205
$$ plain form
15962 5020 7745 5005 1831 -5103 -9390 -12612 -13138 -1415 -8764 -9244 -6570 -1959 -8172 -14559 -12146
15947 -12146 -2629 -3023 -2837 496 5072 1748 3761 2218 -1724 -3449 -2815 -4514 -6400 -11742 -8573
15932 -8573 -5076 -1241 -8788 -12205 -6234 2938 4599 -431 -1426 -2495 4192 3311 -3773 -3491 -655
15917 -655 4440 6663 6068 4021 726 -3364 -3864 -3215 1890 -2182 -4334 -3568 -2130 -2292 -5026 -3442
15901 -3442 -2334 -2954 -5272 -4706 -3288 -2498 8398 10587 664 -1119 -5255 -3922 -4099 -4084 1256 1780
15885 1780 -4942 -8297 -5856 -5055 2542 3682 -11400 -19359 -16325 -9200 -4263 -102 -1328 -1879 4714
15870 4714 8864 9713 4543 -3980 -1026 5891 1 -1301 -4819 -8653 -6362 -5619 -8875 -8159 -8697 -5093
15854 -5093 -10280 -14034 -12399 -11040 -9462 -10062 -10547 -6627 1369 3013 118 -10764 -14913 -10847 -14048
$$ packed form
15962E020K725k740l174o934m287l222n26J1723p349m80K674M611o213o387K413
15947a2146R517l94J86L333M576l324K013j543l942j725O34j699j886n342L169
15932h573L497L835p547l417N971R172J661n030r95j069O687q81p084K82K836
15917f55N095K223n95k047l295m090n00O49N105m072k152P66J438j62k734J584
15901c442J108o20k318N66J418P90J0896K189r923j783m136J333j77J5N340N24
15885A780o722l355K441Q01P597J140j5082p959L034P125M937M161j226n51O593
15870D714M150Q49n170q523K954O917n890j302l518l834K291P43l256P16n38L604
15854e093n187l754J635J359J578o00m85L920P996J644k895j0882m149M066l201
$$ plain form
15839 -14048 -11288 -9837 -7008 -5763 -5203 -3303 -3205 -3818 -7301 -6631 -6866 -6642 -7936 -5450 -1056 2956
15823 2956 457 -356 1597 -2024 -1899 -5717 -4490 -2551 -2068 -4284 -119 -1910 -3155 -2559 -6133 -13490
15807 -13490 -14963 -15868 -20507 -19344 -20061 -18643 -17070 -18534 -16415 -10879 -5496 -7421 -12461 -13374 -10116
15792 -10116 -6472 -7555 -11049 -15610 -13746 -4239 -1498 -7185 -5561 -2397 2489 5442 -654 347
15778 347 798 -1822 -5784 -7742 -861 4532 2922 4838 -1287 -2423 -5108 -6755 -4575 -10431 -15487
15763 -15487 -9872 -11010 -11030 -6539 -7134 -6286 -5680 -5021 -5349 -8239 -4104 5833 176 -4682 -6171 -5502
15747 -5502 -705 8270 10806 7378 1274 -2435 568 3381 -1788 -6722 -5131 -5090 -3604 -8450 -8471 -7392
15731 -7392 -10582 -7081 -3217 -2414 -4724 -9162 -11641 -15417 -15696 -7323 -1261 -675 1096 -2545 -5571
$$ packed form
15839a4048K760J451K829J245N60J900R8o13l483O70k35K24j294K486M394M012
15823B956k499q13J953l621J25l818J227J939M83k216M165j791j245N96l574p357
15807a3490j473r05m639J163p17J418J573j464K119N536N383j925n040r13L258
15792a0116L644j083l494m561J864R507K741n687J624L164M886K953o096J001
15778C47M51k620l962j958O881N393j610J916o125j136k685j647K180n856n056
15763a5487N615j138k0M491n95Q48O06O59l28k890M135R937n657m858j489O69
15747e502M797Q975K536l428o104l709L003K813n169m934J591M1J486m846k1J079
15731g392l190L501L864Q03k310m438k479l776k79Q373O062N86J771l641l026
$$ plain form
15716 -5571 -2851 -2059 3253 8987 12861 8877 4819 12439 8531 5546 2826 5096 3255 5776 6150
15701 6150 8003 6305 3001 3708 -3282 -8387 -10015 -6713 -3365 -4300 -9332 -10454 -13336 -11671 -9937
15686 -9937 -11924 -13053 -12306 -8662 -6641 -5695 -3363 -4544 -4409 -4280 -3083 1056 3196 1452 686 3216
15670 3216 -3333 -3851 -8673 -9147 -6389 -2884 -3086 -1362 442 9029 4201 -1790 -2721 -4187 -5931 -12450
15654 -12450 -16647 -19509 -5569 -866 -1564 -3039 -13847 -8212 2449 3621 392 -365 -641 -418 2925
15639 2925 510 -5372 -3774 -4144 -1766 -2885 -2647 -3586 -10513 -15797 -16614 -12087 -7209 -8146 -13217 -12069
15623 -12069 -12017 -8639 -8298 -6504 -1859 -142 4957 903 -2553 1631 3667 -2387 3177 6385 1328
15608 1328 489 -738 3746 -39 173 -923 3483 883 2063 -1181 -12331 -8410 -1364 -691 -3174
$$ packed form
15716e571K720P92N312N734L874l984m058P620l908k985k720K270j841K521L74
15701F150J853j698l304P07o990n105j628L302L348r35n032j122k882J665J734
15686i937j987j129P47L644K021R46K332j181J35J29J197M139K140j744p66K530
15670C216o549n18m822m74K758L505k02J724J804Q587m828n991r31j466j744o519
15654a2450m197k862J3940M703o98j475j0808N635J0661J172l229p57k76K23L343
15639B925k415n882J598l70K378j119K38r39o927n284q17M527M878r37n071J148
15623a2069N2L378L41J794M645J717N099m054l456M184K036o054N564L208n057
15608A328q39j227M484l785K12j096M406k600J180l244j1150L921P046O73k483
$$ plain form
15593 -3174 36 138 2073 2396 345 -1987 -5579 -12826 -11627 -11660 -11686 -8426 -3580 -724 3254 4919
15577 4919 3414 208 -2100 -4407 -2467 1703 6345 5039 -2861 -17139 -18291 -9028 -1724 -6092
15563 -6092 -4276 -7656 -7497 -4389 -4341 -7668 -7848 -9515 -9551 -9753 -16109 -17819 -11464 -6720 -11026 -14071
15547 -14071 -10404 -3889 -4263 -11897 -13498 -18442 -14878 -7936 -12218 -13757 -10890 -9583 1003 5815
15533 5815 4874 471 -2138 426 877 -503 -331 3555 2936 -3171 -7467 -12694 -11637 -6515 -1827 -391
15517 -391 1128 527 -6330 -5685 -4019 -4625 -6458 -3101 -3046 -11635 -17184 -19294 -15471 -15276 -16677 -19593
15501 -19593 -24146 -18910 -13900 -8697 -3844 -968 -3469 -10016 -13003 -15343 -16146 -12555 -11886 -12417 -13624
15486 -13624 -13042 -14723 -9603 -4429 -4319 -5131 -10639 -16106 -17632 -14975 -10582 -13082 -14387 -6164 -7072
$$ packed form
15593c174L210J02J935L23k051k332l592p247J199l3k6L260M846K856L978J665
15577D919j505l206k308k307J940M170M642j306p900j4278j152R263P304m368
15563f092J816l380J59L108M8l327j80j667l6k02o356j710O355M744m306l045
15547a4071L667O515l74p634j601m944L564O942m282j539K867J307J0586M812
15533E815r41m403k609K564M51j380J72L886o19o107m296n227J057N122M688J436
15517c91J519o01o857O45J666o06j833L357N5q589n549k110L823J95j401k916
15501a9593m553N236N010N203M853K876k501o547k987k340q03L591O69n31j207
15486a3624N82j681N120N174J10q12n508n467j526K657M393k500j305Q223r08
$$ plain form
15471 -7072 -5350 -3327 2811 5063 4325 7000 6187 -241 -4530 -8569 -13861 -9679 -2088 -92 -2058
15456 -2058 -6133 -4946 -3675 1354 -163 3325 4976 1255 -3879 -9120 -11247 -3752 536 2278 4376
15441 4376 3672 2598 -2140 -5321 -2815 -478 -3925 -9320 -15917 -16862 -11101 -15423 -8741 -4353 -3014
15426 -3014 464 4784 5596 3388 -5005 -10995 -5597 2822 -5918 -11933 -10301 -7017 -10341 -15763 -18268
15411 -18268 -14983 -3200 2875 4188 -2091 -3977 -2492 -119 4095 6601 2154 969 -7495 -7658
15397 -7658 -4616 -2521 -12177 -15677 -8626 -9140 -10513 -2556 1469 -5936 -6820 -3305 4222 -345 4752
15382 4752 5113 -2679 -11852 -8421 -7666 -12864 -11137 -5789 188 1384 -4000 -7500 -3777 -1486 693
15367 693 3374 974 4220 -94 -9702 -14428 -13032 -15159 -11248 -8997 -7337 -7327 -8150 -10976 -11464 -9115
$$ packed form
15471g072J722K023O138K252p38K675q13o428m289m039n292M182P591J996j966
15456b058m075J187J271N029j517L488J651l721n134n241k127P495M288J742K098
15441D376p04j074m738l181K506K337l447n395o597r45N761m322O682M388J339
15426c014L478M320Q12k208q393n990N398Q419q740o015J632L284l324n422k505
15411a8268L285J1783O075J313o279j886J485K373M214K506m447j185q464j63
15397g658L042K095r656l500P051n14j373P957M025p405q84L515P527m567N097
15382D752L61p792r173L431P55n198J727N348N977J196n384l500L723K291K179
15367F93K681k400L246m314r608m726J396k127L911K251J660J0q23k826m88K349
$$ plain form
15351 -9115 -2422 6183 6687 8095 7797 3641 5548 3476 -4506 -4153 -5540 -11507 -9759 -12585 -10818
15336 -10818 -8067 -9950 -5827 -10981 -19050 -20950 -12624 -6681 -3528 -4237 -6917 -5998 -9113 -12747 -6862
15321 -6862 -4620 -8740 -5951 1355 2687 2233 -2466 -9104 -9203 -7688 -6713 -4770 -1859 -10910 -11724 -5091
15305 -5091 -6520 -10119 -9351 -7378 -3638 -3582 -5292 -700 -541 -3319 -10952 -10336 -4893 -5198 -5826 -9519
15289 -9519 -15136 -17112 -19486 -15768 -10549 -5949 -4209 -10531 -17009 -15600 -13046 -9970 -7771 -11986 -10632
15274 -10632 -5309 -857 2279 5360 3058 -5058 -8762 -8698 -8079 -4385 326 -5983 -8249 -8468 -13138
15259 -13138 -12358 -4844 -489 -3818 -14351 -12858 -7029 -4012 -5484 -667 -7492 -10141 -9884 -14193 -17913
15244 -17913 -18304 -14150 -6757 -51 951 258 5614 8122 -3255 -5950 3930 4026 845 -1778 -5922
$$ packed form
15351i115O693Q605N04J408k98m156J907k072p982L53j387n967J748k826J767
15336a0818K751j883M123n154q069j900Q326N943L153p09k680R19l115l634N885
15321f862K242m120K789P306J332m54m699o638r9J515R75J943K911r051q14O633
15305e091j429l599P68J973L740N6j710M592J59k778p633O16N443l05o28l693
15289i519n617j976k374L718N219M600J740o322o478J409K554L076K199m215J354
15274a0632N323M452L136L081k302q116l704O4O19L694M711o309k266k19m670
15259a3138P80P514M355l329j0533J493N829L017j472M817o825k649K57m309l720
15244a7913l91M154P393O706J002o93N356K508j1377k695R880R6l181k623m144
$$ plain form
15229 -5922 -4523 -5835 -4778 -6278 -3220 -3676 -2406 -5466 -8194 -7495 -784 -7 -5480 -10992 -12490
15214 -12490 -9920 -14464 -14093 -10445 -10376 -11064 -11652 -10059 -5536 503 7795 3414 4782 -3449 -6587 -3135
15198 -3135 -2071 -7971 -7559 -7074 -7810 -5007 -1017 -73 -4873 4746 4652 -310 1993 585 6734 4819
15182 4819 7 2450 3705 2984 -6033 -7447 -6098 -2364 -4195 -7681 -4062 -6098 -4345 -7808 -7134
15167 -7134 -9377 -3971 -4943 -9566 -7633 -1416 6634 2669 -4208 -5999 -5732 -9207 -3485 2464 -939
15152 -939 -3699 -8139 -14151 -13579 -8836 -3260 -5595 -7533 -6735 -7645 -4845 -2857 -1985 -6497 -8754 -8912
15136 -8912 -13671 -12033 -11389 -11206 -7266 -13770 -15512 -22232 -24933 -21969 -21108 -12520 -2134 -88 -9520
15121 -9520 -6928 -3583 -5517 -5751 -466 5801 7252 882 -10551 -11528 -4465 412 6254 8784 303
$$ packed form
15229e922J399j312J057j500L058m56J270l060k728O99O711P77n473n512j498
15214a2490K570m544L71L648O9o88n88J593M523O039P292m381J368q231l138L452
15198c135J064n900M12M85p36K803L990R44m800R619r4m962K303j408O149j915
15182D819m812K443J255p21r017j414J349L734j831l486L619k036J753l463O74
15167g134k243N406r72m623J933O217Q050l965o877j791K67l475N722N949l403
15152i39k760m440o012N72M743N576k335j938P98r10K800J988Q72m512k257j58
15136h912m759J638O44J83L940o504j742o720k701K964Q61Q588J0386K046r432
15121i520K592L345j934k34N285O267J451o370j1433r77P063M877N842K530q481
$$ plain form
15106 303 -2907 -7889 -8561 -3525 5684 9444 2682 -1219 -3801 -4477 -6830 -5511 -5084 -6514 -2883 -2980
15090 -2980 -6034 -2934 -5089 -2322 -5304 -7669 -9848 -5983 -4619 -3432 -6440 -13882 -14272 -13285 -11271
15075 -11271 -2508 4531 -900 -2829 -3443 -6570 -3628 -3807 -2595 310 -6094 -6416 -7780 -6671 -2854
15060 -2854 8297 10105 7026 391 -7458 -10682 -7254 -794 -840 -8123 -10738 -10092 -6729 -1279 -1611
15045 -1611 -4861 -8595 -4813 -8183 -11751 -8071 -4465 593 479 -2053 -7039 -7689 -6206 -2007 -5379
15030 -5379 -1596 -571 10 -2803 1126 -1941 -5620 -729 1716 -6853 -6886 -2379 -690 -1816 -2268 -159
15014 -159 78 -228 -941 -1508 -2030 -5927 -5457 -69 -6843 -9402 -8549 -6530 2469 3457 -3484 -4812 494
14997 494 -3089 1795 3915 1472 2002 -389 -1809 -1873 -2383 -5109 -6642 -5387 667 407 -5286 -7154
$$ packed form
15106C03l210m982o72N036R209L760o762l901k582o76k353J319M27j430L631r7
15090b980l054L100k155K767k982k365k179L865J364J187l008p442l90R87K014
15075a1271Q763P039n431j929o14l127K942j79J212K905o404l22j364J109L817
15060b854J1151J808l079o635p849l224L428O460m6p283k615O46L363N450l32
15045a611l250l734L782l370l568L680L606N058j14k532m986o50J483M199l372
15030e379L783J025N81k813L929l067l679M891K445q569l3M507J689j126m52K109
15014a59K37l06p13n67n22l897M70N388o774k559Q53K019Q999R88o941j328N306
14997D94l583M884K120k443N30k391j420o4n10k726j533J255O054k60n693j868
$$ plain form
14981 -7154 -4123 1572 2035 -2242 -3635 -11030 -13646 -6138 -5788 449 2316 1670 362 -3875 -4282 145
14965 145 5281 5008 197 854 -535 -335 2932 -3773 -9658 -8019 -6237 -4666 646 6385 5334 1507
14949 1507 -571 -752 -4261 -11701 -11956 -8821 -5039 -9200 -8699 -3307 -7689 -6204 -290 2096 -4547
14934 -4547 -13457 -16406 -11528 -11076 -7001 -4741 -10350 -12476 -13202 -12782 -12324 -9128 -7604 -5556 -1926 -2311
14918 -2311 -2010 -10300 -8758 -5401 -1155 -728 -6911 -8731 -2479 1550 2859 8998 8616 2591 -1411
14903 -1411 -1884 2354 6446 8574 10768 14102 14047 6563 -1618 -2834 -7174 -8913 -10570 -10032 -9889 -5761
14887 -5761 -9696 -11720 -7995 1213 4010 4468 6110 6980 3788 -444 828 2442 2044 -353 -2204
14872 -2204 -8417 -2183 1092 -999 -2105 -8753 -10590 -4115 -2012 -6947 -10568 -11872 -11725 -14556 -18687
$$ packed form
14981g154L031N695M63m277j393p395k616P508L50O237J867o46j308m237m07M427
14965A45N136k73m811O57j389K00L267o705n885J639J782J571N312N739j051l827
14949A507k078j81l509p440k55L135L782m161N01N392m382J485N914K386o643
14934d547q910k949M878M52M075K260n609k126p26M20M58L196J524K048L630l85
14918b311L01q290J542L357M246M27o183j820O252M029J309O139l82o025m002
14903a411m73M238M092K128K194L334n5p484q181j216m340j739j657N38J43M128
14887e761l935k024L725R208K797M58J642Q70l192m232J272J614l98k397j851
14872b204o213O234L275k091j106o648j837O475K103m935l621j304J47k831m131
$$ plain form
14857 -18687 -19197 -17254 -11213 -9471 -15209 -17816 -15005 -14536 -15162 -18188 -16758 -8264 -4327 -4099 -4832 -5084
14841 -5084 -3566 859 -310 2077 4608 789 624 2029 -252 -9592 -13305 -9132 -5986 -181 -4809
14826 -4809 -5692 595 8377 9390 7061 5874 1951 -10347 -12758 -12097 -9358 -9377 -9590 194 3309 402
14810 402 2936 5144 -275 -11287 -16403 -11475 -8323 -10508 -18042 -14309 -10028 -10847 -4626 -5057 -2861
14795 -2861 -4165 -2449 -10462 -11907 -9088 -7791 -5249 1352 9311 7452 329 -3540 -1622 -2103 -6386
14780 -6386 -2976 -4650 -6680 -12202 -7170 -5622 -11486 -17914 -13626 -10112 -8246 -7122 -10178 -20314
14766 -20314 -26197 -22816 -21978 -17103 -15485 -12289 -8479 -6726 -6188 -6427 -7152 -8555 -9996 -4697 -7966
14751 -7966 -10235 -7278 -2381 602 -2660 -7543 -3431 -1382 -3739 -1386 -3966 -4559 1919 5803 4398
$$ packed form
14857a8687n10J943O041J742n738k607K811M69o26l026J430Q494L937K28p33k52
14841e084J518M425j169K387K531l819j65J405k281r340l713M173L146N805m628
14826d809q83O287P782J013k329j187l923j2298k411O61K739j9k13R784L115k907
14810D02K534K208n419j1012n116M928L152k185p534L733M281q19O221m31K196
14795b861j304J716q013j445K819J297K542O601P959j859p123l869J918m81m283
14780f386L410j674k030n522N032J548n864o428M288L514J866J124l056j0136
14766b0314n883L381Q38M875J618L196L810J753N38k39p25j403j441N299l269
14751g966k269K957M897K983l262m883M112K049k357K353k580n93O478L884j405
$$ plain form
14736 4398 -2773 -915 2697 -1240 -2343 -1664 98 625 1364 -3676 -8285 -7626 -1680 5570 6416 1983
14720 1983 -5153 -1266 8529 12518 14945 6631 -2455 -6387 -5205 -8854 -10880 -1283 1740 -1184 -10089
14705 -10089 -14313 -9087 -3763 3424 9143 3277 2514 -1578 -4893 -7909 -10853 -10774 -12642 -13844 -10490
14690 -10490 -13051 -6420 -4282 -7243 -7367 -2736 -5811 -10772 -8949 -8213 -5384 -6630 -7477 -11038 -13043
14675 -13043 -9823 -14308 -21377 -17548 -14414 -15970 -13681 -15417 -17198 -13258 -12644 -8963 -10243 -13785 -8080
14660 -8080 -2971 -1135 104 4987 204 -6503 -14265 -9948 -4679 -10152 -11074 -10488 -7827 -3916 -10180
14645 -10180 -13912 -8815 -1686 1761 752 -6552 -5623 -7227 -7711 -10135 -5879 -4234 -1324 -1181 -11425
14630 -11425 -18415 -17098 -14901 -15448 -18770 -17296 -17920 -18468 -8572 -3364 -6608 -9948 -4466 -2688 4371
$$ packed form
14736D398p171J858L612l937j103O79J762N27P39n040m609O59N946P250Q46m433
14720A983p136L887R795L989K427q314r086l932J182l649k026R597L023k924q905
14705a0089m224N226N324P187N719n866p63m092l315l016k944P9j868j202L354
14690a0490k561O631K138k961j24M631l075m961J823P36K829j246q47l561k005
14675a3043L220m485p069L829L134j556K289j736j781L940O14L681j280l542N705
14660h080N109J836J239M883m783o707p762M317N269n473r22N86K661L911o264
14645a0180l732N097P129L447j009p304R29j604m84k424M256J645K910J43j0244
14630a1425o990J317K197n47l322J474o24n48R896N208l244l340N482J778P059
$$ plain form
14615 4371 6228 2036 -2621 790 1887 -4307 -333 -4122 -8186 -1354 8654 4808 1092 -3336
14601 -3336 -4672 -667 447 49 -5275 -8502 -9970 -11647 -4135 -4817 -8546 -16239 -20970 -23021 -15483
14586 -15483 -14374 -10773 -2300 3503 8092 3843 707 1566 1286 3577 8863 6328 1998 -7512 -12988
14571 -12988 -12375 -10460 -9119 -4510 115 -8480 -14285 -5045 -3720 -8097 -9643 -7657 -8885 -8241 -7467
14556 -7467 -4307 -3853 -327 4832 -2287 -4417 -5276 -2812 -5333 1834 6469 5389 2374 1143 -8648
14541 -8648 -18420 -13460 -13635 -3288 2824 -150 717 5999 1181 -266 3764 4631 817 1699 1543 -3230
14525 -3230 -4866 -7236 -10457 -11286 -5480 -991 -2332 -6896 -4351 1697 -2646 -1409 -220 2241 605
14510 605 -351 -5291 -1363 -6785 -9128 -11521 -9448 -12043 -16329 -9980 -3585 4156 -28 -5962 -2130
$$ packed form
14615D371J857m192m657L411J097o194L974l789m064O832J0008l846l716m428
14601c336j336M005J114l98n324l227j468j677P512o82l729p693m731k051P538
14586a5483J109L601Q473N803M589m249l136Q59k80K291N286k535m330r510n476
14571a2988O13J915J341M609M625q595n805R240J325m377j546J986j228O44P74
14556g467L160M54L526N159p119k130q59K464k521P167M635j080l015j231r791
14541h648r772M960j75J0347O112k974Q67N282m818j447M030Q67l814Q82j56m773
14525c230j636k370l221q29N806M489j341m564K545O048m343J237J189K461j636
14510F05r56m940L928n422k343k393K073k595m286O349O395P741m184n934L832
$$ plain form
14495 -2130 -1147 -4375 -551 -6193 -6987 -6859 -1994 -2682 -517 1388 -3095 -7350 2634 10573 4899 129
14479 129 1741 -4033 -8302 -4092 -1081 1340 -1648 1825 -1921 -9305 -6135 623 5862 14303 16037
14464 16037 7850 4762 840 -1820 2781 -2081 -6891 -6703 -467 -915 -5759 -11372 -12731 -17411 -21375
14449 -21375 -20141 -16906 -12128 -12482 -16014 -11589 -10522 -7184 -3606 -3335 -53 -2817 -6373 -8250 1039
14434 1039 1444 -7336 -8935 -4691 -1323 5520 10684 5392 1953 7347 10032 6007 4606 3433 3225
14419 3225 343 -2661 733 1273 3657 4806 9578 11764 3317 -3517 -6924 -9313 -5539 -7638 -3162
14404 -3162 -400 -2773 -945 6516 1751 7410 10915 7454 -1166 -1977 -1988 -9355 -6909 -1940 1304
14389 1304 -370 -4016 -8012 -5617 3973 5107 1573 2596 5440 10762 11071 7551 4063 3429 1595
$$ packed form
14495b130R83l228L824n642p94J28M865o88K165J905m483m255R984P939n674m770
14479A29J612n774m269M210L011K421k988L473l746p384L170O758N239Q441J734
14464A6037q187l088l922k660M601m862m810J88O236m48m844n613j359m680l964
14449b1375J234L235M778l54l532M425J067L338L578K71L282k764l556j877R289
14434A039M05q780j599M244L368O843N164n292l439N394K685m025j401j173k08
14419C225k882l004L394N40K384J149M772K186q447o834l407k389L774k099M476
14404c162K762k373J828P461m765N659L505l461q620q11j1p367K446M969L244
14389A304j674l646l996K395R590J134l534J023K844N322L09l520l488o34j834
$$ plain form
14374 1595 -225 1942 3961 997 54 2593 7276 6109 2313 6148 6748 -901 1888 5322 -3296
14359 -3296 -4887 -3554 -450 827 5699 8529 6064 2426 21 3282 8885 12250 10910 5581 13915
14344 13915 15464 5995 1428 5102 6050 5478 5816 6074 5281 5875 -1242 -3974 -3514 -7036 -8589 -2789
14328 -2789 2073 1222 2744 -743 -304 -1308 -2771 -3133 -5688 -8229 -9349 -4797 -3467 1346 2604
14313 2604 1028 2646 6811 3954 3280 6981 3580 2841 3952 3572 5527 7611 977 -6402 -2176
14298 -2176 -248 -3577 -4325 -1742 1679 -641 -5742 -5230 -1442 5491 4923 3394 6766 5811 7840 8047
14282 8047 8983 10159 8068 5553 3589 -2603 -4109 -3025 -2865 -5782 -5880 -11101 -10127 -1354 -344 5147
14266 5147 -1913 -4598 -1866 47 4047 8898 9742 8412 8325 14028 16280 13051 7584 6348 5762 6474
$$ packed form
14374A595j820K167K019k964r43K539M683j167l796L835O00p649K789L434q618
14359c296j591J333L104J277M872K830k465l638k405L261N603L365j340n329Q334
14344A3915J549r469m567L674R48n72L38K58p93N94p117k732M60l522j553N800
14328b789M862q51J522l487M39j004j463l62k555k541j120M552J330M813J258
14313B604j576J618M165k857o74L701l401p39J111l80J955K084o634p379M226
14298b176J928l329p48K583L421k320n101N12L788O933n68j529L372r55K029K07
14282H047R36J176k091k515j964o192j506J084J60k917r8n221R74Q773J010N491
14266E147p060k685K732J913M000M851Q44j330q7N703K252l229n467j236n86P12
$$ plain form
14250 6474 4342 4793 3704 -398 -7692 -9885 -7277 -9603 -2237 -1469 -2578 -3647 -6062 -3879 2085
14235 2085 6786 4876 9320 7320 -2253 -871 -1981 -4941 -6389 -1583 3735 3538 4399 1021 -1670
14220 -1670 -513 -5277 1374 6126 7653 5960 -3202 -11444 -10176 -6416 -2160 1446 4387 5965 12163
14205 12163 4305 -8654 -10180 -7785 -5719 1875 8010 -55 -9448 -14458 -13086 -9626 -1646 2364
14191 2364 3473 6753 -79 -522 5805 11132 5484 2314 -2606 -1180 1723 4919 5981 4910 -2680
14176 -2680 -5520 -5505 -4571 -5060 -3648 -6916 -9189 -13201 -13856 -16898 -11815 -3230 3492 3423 4447 6446
14160 6446 1282 2423 8578 7966 2855 2290 -1646 517 -4351 -1661 -1702 -9436 -2769 2748 3941 -267
14144 -267 -140 3807 5555 3390 3121 5575 6788 -1632 -5781 -3813 1639 1617 -7301 -10236 -4602 -444
$$ packed form
14250F474k132M51j089m102p294k193K608k326P366P68j109j069k415K183N964
14235B085M701j910M444k000r573J382j110k960j448M806N318j97Q61l378k691
14220a670J157m764O651M752J527j693r162q242J268L760M256L606K941J578O198
14205A2163p858j2959j526K395K066P594O135q065r393n010J372L460P980M010
14191B364J109L280o832m43O327N327n648l170m920J426K903L196J062j071p590
14176b680k840J5R34m89J412l268k273m012o55l042N083Q585O722o9J024J999
14160F446n164J141O155o12n111n65l936K163m868K690m1p734O667N517J193m208
14144b67J27L947J748k165k69K454J213q420m149J968N452k2q918k935N634M158
$$ plain form
14128 -444 616 -1398 -6742 -4116 -1004 -10138 -14149 -10808 -12622 -11571 -35 1594 3668 -4607 -951
14113 -951 10 -2248 -3085 -3647 -4832 -1705 2396 -920 2997 694 -1256 -4246 -9321 -6776 -8365 -4028
14097 -4028 -1236 -2629 1170 6156 2954 -5050 -1890 -571 -187 -7651 -9864 -11536 -8473 -3764 -4455
14082 -4455 37 -79 -7145 177 4508 4933 3598 3300 462 -8864 -6189 -1926 -3087 -3715 3856 2660
14066 2660 -1733 -6141 -5095 -4370 -2639 7241 8747 5667 2939 1656 -695 1449 -644 1287 -1033
14051 -1033 -1949 614 -717 -5740 -9450 -3890 24 -2975 -13379 -12553 -9466 -7140 -7192 -7034 -3350 -1867
14035 -1867 715 -4210 -12479 -6220 -3455 -1860 -5101 -6307 -5962 -3194 -3825 -302 295 3150 -1874
14020 -1874 -4918 -8555 -11018 -17623 -9793 -5388 -7216 -2113 -2039 -3124 -3128 -5812 655 3806 -2064 -5706
$$ packed form
14128d44J060k014n344K626L112r134m011L341j814J051J1536J629K074q275L656
14113i51R61k258q37n62j185L127M101l316L917k303j950k990n075K545j589M337
14097d028K792j393L799M986l202q004L160J319L84p464k213j672L063M709o91
14082d455M492j16p066P322M331M25j335k98k838r326K675M263j161o28P571j196
14066B660m393m408J046P25J731R880J506l080k728j283k351K144k093J931k320
14051a033r16K563j331n023l710N560L914k999j0404Q26L087K326n2J58L684J483
14035a867K582m925q269O259K765J595l241j206L45K768o31L523N97K855n024
14020a874l044l637k463o605P830M405j828N103P4j085mk684O467L151n870l642
$$ plain form
14004 -5706 -8608 -13911 -14710 -12952 1151 10949 6534 4044 -2512 -5975 -1052 -3260 -6848 -4743 -1615
13989 -1615 -2034 -5448 -4770 -2529 1149 7184 8139 8260 43 -9269 -8441 -7942 -7249 -4946 -8262 -12917
13973 -12917 -16914 -12063 -9514 -8712 -8958 -6727 -3285 -3396 -6430 -16202 -21477 -16953 -9440 -5486 -4701
13958 -4701 -11267 -9456 -2937 -2338 -6001 -3945 -6904 -8077 -16274 -15532 -9483 -5146 -7539 -6698 -600
13943 -600 4647 4603 -1092 -8509 -11967 -10346 -2457 1198 10508 12706 5154 -1175 618 -3244 -7124
13928 -7124 -12009 -7848 -9394 -11101 -8306 -6985 -5643 -1714 -1043 -2594 -4392 -4801 -6398 -12455 -6576
13913 -6576 -5449 -12838 -17743 -17993 -18340 -13343 -13905 -8821 -10047 -11641 -10684 -6723 -7919 -3384 -3115 -8033
13897 -8033 -10362 -6816 -4439 -10288 -12829 -10514 -8011 -5190 -1076 -4509 -12695 -15068 -12321 -14491 -11990
$$ packed form
14004e706k902n303p99J758J4103R798m415k490o556l463M923k208l588K105L128
13989a615m19l414O78K241L678O035R55J21q217r312Q28M99O93K303l316m655
13973a2917l997M851K549Q02k46K231L442j11l034r772n275M524P513L954P85
13958d701o566J811O519N99l663K056k959j173q197P42O049M337k393Q41O098
13943f00N247m4n695p417l458J621P889L655R310K198p552o329J793l862l880
13928g124m885M161j546j707K795J321J342L929O71j551j798m09j597o057N879
13913f576J127p389m905k50l47M997n62N084j226j594R57L961j196M535K69m918
13897h033k329L546K377n849k541K315K503K821M114l433q186k373K747k170K501
$$ plain form
13882 -11990 -5490 -4082 -5572 -8150 -9323 -2063 2339 3401 2165 -8636 -15321 -8184 -3543 2348
13868 2348 2605 -604 -417 -1063 -753 -9142 -8852 -4246 1139 5989 8195 6185 1798 6379 5579 -4542
13852 -4542 -6732 -8829 -6902 -7140 698 5872 4876 -3934 -2630 -3340 -16498 -17594 -5618 3749 -271
13837 -271 -9754 -7401 -3850 -8019 -13610 -13141 -12653 -13048 -13176 -12331 -4718 6838 7264 3233 2938 1585
13821 1585 -4123 -4093 -416 -2267 -8030 -8460 -10510 -13248 -15731 -19337 -20595 -16933 -14049 -8231 -6609
13806 -6609 -2991 527 -830 -2850 -6908 -12827 -4488 3808 2029 -290 -5611 -8050 -8832 -236 5737
13791 5737 1820 2466 -2590 -7777 -8077 -8092 -10241 -10822 -10327 -5658 -1809 -4511 -5224 -2069 -3830 -2479
13775 -2479 -4262 -2003 683 -1016 -5631 -3218 -1734 -1311 -1311 -5865 -9386 -9344 -4105 -8705 -10334 -4887
$$ packed form
13882a1990O500J408j490k578j173P260M402J062j236j0801o685P137M641N891
13868B348K57l209J87o46L10q389K90M606N385M850K206k010m387M581q00j0121
13852d542k190k097J927k38P838N174r96q810J304p10j3158j096J1976R367m020
13837b71r483K353L551m169n591M69M88l95j28Q45P613J1556M26m031k95j353
13821A585n708L0L677j851n763m30k050k738k483l606j258L662K884N818J622
13806f609L618L518j357k020m058n919Q339Q296j779k319n321k439p82Q596N973
13791E737l917O46n056n187l00j5k149n81M95M669L849k702p13L155j761J351
13775b479j783K259K686j699m615K413J484M23%m554l521M2N239m600j629N447
$$ plain form
13759 -4887 263 -3055 -10304 -12791 -13790 -12280 -14 303 -6398 -5586 -10001 -11832 -11508 -12031 -13739 -13212
13743 -13212 -8485 -4811 -4979 -2761 -4997 -1799 -5887 -7215 415 -2374 -7879 -11097 -10836 -8426 -10361
13728 -10361 -10130 -3606 -849 -1802 -3136 -7738 -6972 -4361 -7747 -9444 -9822 -13356 -16248 -12923 -10548
13713 -10548 -13191 -8933 -5056 -6759 -6672 -6713 -9409 -17918 -18470 -10777 -2109 2382 374 -824 -2674 -8953
13697 -8953 -12822 -10330 -2906 -4026 -7461 -5119 -63 1247 1057 -9916 -15613 -15117 -14754 -6297 -6431
13682 -6431 -2303 3483 -3218 -10445 -14070 -13283 -13233 -7709 -807 926 7383 3640 -8516 -9809 -2903
13667 -2903 3642 2757 -507 -5997 -11134 -16409 -10948 -9625 -11923 -11436 -9810 -16436 -18425 -22257 -18157
13652 -18157 -12768 -15270 -17248 -17188 -15299 -13997 -11449 -9737 -8453 -4102 327 5058 4254 4625 4440 -380
$$ packed form
13759d887N150l318p249k487r99J510J2266L17o701Q12m415j831L24n23j708N27
13743a3212M727L674j68K218k236L198m088j328P630k789n505l218K61K410j935
13728a0361K31O524K757r53j334m602P66K611l386j697l78l534k892L325K375
13713a0548k643M258L877j703Q7m1k696q509n52P693Q668M491k008j198j850o279
13697h953l869K492P424j120l435K342N056J310j90j0973n697M96L63Q457j34
13682f431M128N786o701p227l625P87N0N524O902J733O457l743j2156j293O906
13667b903O545q85l264n490n137n275N461J323k298M87J626o626j989l832M100
13652a8157N389k502j978O0J889J302K548J712J284M351M429M731q04L71j85m820
$$ plain form
13636 -380 5506 9655 -3052 -12376 -10733 -9167 -9150 2831 3129 -408 1661 498 -9276 -2841 5312
13621 5312 2864 -506 -3139 -2646 -2761 3970 6185 3223 -2892 -11755 -15597 -7557 -2194 -1132 -8063
13606 -8063 -12481 -10547 -12896 -21574 -21117 -15960 -12356 -11389 -20849 -20436 -11519 -7756 -14539 -15181 -14350 -17859
13590 -17859 -16335 -8998 -11486 -12045 -7360 -7728 -7496 -8527 -9253 -5063 1450 -7843 -15553 -13337 -9387
13575 -9387 -6518 1693 4110 2071 -200 1680 177 -7171 -15416 -11989 -11605 -9601 -4922 -1800 1240
13560 1240 -167 -2831 -5454 -2924 -415 -1267 1808 5119 6499 6090 2187 -4770 -10471 -9094 -6514
13545 -6514 -7557 5566 8941 -277 -3445 -54 1017 -2598 -11806 -13146 -13015 -13175 -14034 -14129 -15413 -14833
13529 -14833 -9021 -5917 -6290 -6051 -8669 -14468 -13899 -5508 -346 -8013 -15304 -15821 -7495 -4785 -6881
$$ packed form
13636c80N886M149j2707r324J643J566J7J1981K98l537K069j163r774O435Q153
13621E312k448l370k633M93j15O731K215k962o115q863l842Q040N363J062o931
13606h063m418J934k349q678M57N157L604R67r460M13Q917L763o783o42Q31l509
13590a7859J524P337k488n59M685l68K32j031p26M190O513r293p710K216L950
13575i387K869Q211K417k039k271J880j503p348q245L427L84K004M679L122L040
13560A240j407k664k623K530K509q52L075L311J380m09l903o957n701J377K580
13545f514j043J3123L375r218l168L391J071l615r208j340J31j60q59r5j284N80
13529a4833N812L104l73K39k618n799N69Q391N162p667p291n17Q326K710k096
$$ plain form
13514 -6881 -3171 3255 -1120 -10140 -13395 -8943 -10650 -10603 -4323 -6413 -8914 -10585 -6060 -5305 -5434 -4897
13498 -4897 -5104 -4514 -2836 -4297 -7629 -8379 -5571 -1748 -5455 -7417 -11010 -17086 -13877 -7796 -7945 -2431
13482 -2431 4458 734 -3373 -3337 228 1682 4728 -3028 -12250 -8470 -2504 1752 1788 -5591 -7897 -8625
13466 -8625 -12559 -10056 -8531 -13338 -11389 -4493 -2604 -3302 -513 1883 3333 6525 1957 -2795 -8334
13451 -8334 -5064 533 351 -5351 -15237 -13662 -10403 -5740 2531 154 -7239 -9153 -8623 -1542 -6286
13436 -6286 -14156 -6934 -6197 -10809 -6393 40 -4844 -3372 236 9464 10877 8885 10514 12314 3229
13421 3229 -6140 -4681 -10074 -12927 -8329 -6648 -6512 -5003 -2204 -7275 -6403 -4251 -9490 -8332 -5224
13406 -5224 -9481 -9301 -3442 -5679 -4975 -7959 -8070 -7865 -2693 -2386 -13797 -22605 -18793 -13935 -8641 -6031
$$ packed form
13514f881L710O426m375r020l255M452j707M7O280k090k501j671M525P55j29N37
13498d897k07N90J678j461l332p50K808L823l707j962l593o076L209O081j49N514
13482b431O889l724m107L6L565J454L046p756r222L780N966M256L6p379k306p28
13466h625l934K503J525m807J949O896J889o98K789K396J450L192m568m752n539
13451h334L270N597j82n702r886J575L259M663Q271k377p393j914N30P081m744
13436f286p870P222P37m612M416O433m884J472L608R228J413j992J629J800r085
13421C229r369J459n393k853M598J681J36J509K799n071Q72K152n239J158L108
13406e224m257J80N859k237P04k984j11K05N172L07j1411q808L812M858N294K610
$$ plain form
13390 -6031 -5525 -10849 -11709 -9115 -16198 -14083 -12755 -14111 -13263 -13886 -19648 -14175 -13433 -16198 -12721 -9229
13374 -9229 -16030 -19865 -20831 -16668 -10454 -5095 -1707 -4419 -5722 -6151 -12131 -12026 -8903 -4332 -4841 -5412
13358 -5412 2714 -3782 -1805 -4502 -5678 -3049 -7229 -7083 -3785 -6061 -14638 -17482 -9975 -5156 -5418
13343 -5418 -7485 -5547 -7439 -8060 -2760 1473 1824 3574 3553 5011 5874 3696 881 -7007 -11223 -13834
13327 -13834 -10455 -3251 2135 1306 -8310 -13211 -11964 -7622 -9650 -5944 -6744 -10300 -9154 -11725 -14500
13312 -14500 -11344 -5389 -4907 -10471 -10150 -9166 -6066 -1172 8072 10367 4515 2815 3631 3695 3743 -1300
13296 -1300 -6376 -5901 -2570 -4933 -886 3068 -1204 -3420 -3085 -4004 -7999 -10774 -6267 1697 17379
13281 17379 18313 12935 4602 -305 -2142 -3198 -8147 -9690 -12767 -2817 2313 2672 -1851 -8024 -7406
$$ packed form
13390f031N06n324q60K594p083K115J328j356Q48o23n762N473P42k765L477L492
13374i229o801l835r66M163O214N359L388k712j303m29n980J05L123M571n09n71
13358e412Q126o496J977k697j176K629m180J46L298k276q577k844P507M819k62
13343e418k067J938j892o21N300M233L51J750k1J458Q63k178k815p888m216k611
13327a3834L379P204N386q29r616m901J247M342k028L706q00l556J146k571k775
13312a4500L156N955M82n564L21R84L100M894R244K295n852j700Q16O4M8n043
13296a300n076M75L331k363M047L954m272k216L35r19l995k775M507P964J5682
13281A7379R34n378q333m907j837j056m949j543l077R950N130L59m523o173O18
$$ plain form
13266 -7406 -5802 -3348 -2251 -3307 1263 6947 6788 6962 7983 830 -7620 -5830 -852 7513 10657
13251 10657 8235 2892 -2138 -1995 -2229 -7422 -17618 -13273 -8183 -15817 -15175 -12712 -12830 -1758 1963
13236 1963 -5836 -4127 2814 5863 5474 3660 3596 8227 10654 5237 4643 59 -6256 -6544 -4144 -6357
13220 -6357 -10911 -6099 -8847 -14365 -16191 -13652 -3902 -2529 -6693 -11274 -13073 -11168 -7423 -6817 -10867
13205 -10867 -7470 -1547 -3448 -9658 -13280 -16617 -14850 -13107 -14359 -10757 -4551 -9605 -8631 -5816 -5164
13190 -5164 -2793 2133 5571 9171 6839 -650 -861 6 -5870 -6659 -1328 3166 2199 3197 185 -6150
13174 -6150 -5247 -3017 -6316 -6577 5073 8429 2145 -2033 -4549 -5757 41 1204 -3811 -7180 -6655
13159 -6655 2907 2402 1871 -76 -801 -3211 -5410 -1817 -2126 -2367 -4864 -10048 -7038 -10056 -6870 -11766
$$ packed form
13266g406J604K454J097j056M570N684j59J74J021p153q450J790M978Q365L144
13251A0657k422n343n030J43k34n193j0196M345N090p634O42K463j18J1072L721
13236A963p799J709O941L049l89j814o4M631K427n417n94m584o315k88K400k213
13220f357m554M812k748n518j826K539R750J373m164m581j799J905L745O06m050
13205a0867L397N923j901o210l622l337J767J743j252L602O206n054R74K815O52
13190e164K371M926L438L600k332p489k11Q67n876p89N331M494r67R98l012o335
13174f150R03K230l299k61J1650L356o284m178k516j208N798J163n015l369N25
13159f655R562n05n31j947p25k410k199L593l09k41k497n184L010l018L186m896
$$ plain form
13143 -11766 -19333 -21710 -30118 -29884 -28242 -26060 -13677 -3468 231 4211 2204 -6249 -1549 -1942
13129 -1942 -4651 -8932 -10954 -7836 -9532 -10340 -7001 -5509 -3592 1862 3861 -419 -1689 -1558 3856
13114 3856 2581 -2206 -12057 -9781 -5742 -5427 -8584 -10888 -9882 -8603 -15605 -15292 -10592 -2398 -3442
13099 -3442 -1510 9403 9286 2447 1389 -2816 -8159 -9067 -2833 -3205 5288 6116 -1345 -3760 -5971
13084 -5971 1943 99 -1416 1190 -2004 9342 9747 10658 5311 3140 6910 11428 8367 3136 -2149
13069 -2149 -6692 -6937 -6916 -7865 -6437 -1061 3925 3076 4996 8955 4250 1104 6283 9055 12862 13574
13053 13574 9782 4360 3307 7534 13560 6322 4670 4549 8455 12294 8177 6378 2122 -1100 -1201
13038 -1201 -2910 -4648 -7108 -9514 -6559 -6897 -6328 -6417 -3260 45 -586 4350 6667 2908 -3092 -1371
$$ packed form
13143a1766p567k377q408K34J642K182J2383J0209L699L980k007q453M700l93
13129a942k709m281k022L118j696q08L339J492J917N454J999m280j270J31N414
13114C856j275m787r851K276M039L15l157k304J006J279p002L13M700Q194j044
13099c442J932J0913j17o839j058m205n343r08O234l72Q493Q28p461k415k211
13084e971P914j844j515K606l194J1346M05R11n347k171L770M518l061n231n285
13069b149m543k45K1r49J428N376M986q49J920L959m705l146N179K772L807P12
13053A3574l792n422j053M227O026p238j652j21L906L839m117j799m256l222j01
13038a201j709j738k460k406K955l38N69q9L157L305o31M936K317l759o000J721
$$ plain form
13022 -1371 -3014 -7409 -11322 -11522 -4013 -1539 -3241 -6198 -2605 -1197 594 -569 446 6474 670
13007 670 -7868 -7682 -6389 -16449 -16831 -8035 -4659 -9478 -8606 -2034 -3337 -16274 -14609 -10103 -2213
12992 -2213 5714 13142 12103 9516 706 -454 159 -3282 -3167 -3879 3123 5261 7033 8980 6582
12977 6582 2088 3238 5758 9435 6167 424 1979 -1204 378 5152 3486 3278 -1758 -9436 -16625
12962 -16625 -12113 -8844 -7266 -4753 -5281 -11701 -17734 -5508 1837 -2629 -12491 -21039 -10822 -6540
12948 -6540 -8759 -12396 -12796 -10282 1972 1821 317 3529 3920 2914 6907 8823 9130 6652 8405
12933 8405 10313 10102 14815 13390 11091 4026 2631 2266 -621 -1667 -2259 -3401 -4578 -3853 -4268 -7784
12917 -7784 -11472 -11683 -4521 -4564 -9093 -3966 3443 6348 1147 -6335 -10066 -8533 -10501 -10190 -8982 -2420
$$ packed form
13022a371j643m395l913k00P509K474j702k957L593J408J791j163J015O028n804
13007F70q538J86J293j0060l82Q796L376m819Q72O572j303j2937J665M506P890
12992b213P927P428j039k587q810j160O13l441J15p12P002K138J772J947k398
12977F582m494J150K520L677l268n743J555l183J582M774j666k08n036p678p189
12962a6625M512L269J578K513n28o420o033J2226P345m466r862q548J0217M282
12948f540k219l637m00K514J2254j51j504L212L91j006L993J916L07k478J753
12933H405J908k11M713j425k299p065j395l65k887j046n92j142j177P25m15l516
12917g784l688k11P162m3m529N127P409K905n201p482l731J533j968L11J208O562
$$ plain form
12901 -2420 2153 2037 1732 3248 -307 1411 6283 5868 2410 -3955 -10659 -9835 -5342 726 -1274 1703
12885 1703 3787 6281 2341 -6382 -12354 -8814 3040 5406 5637 7268 11221 9029 5546 5213 1930
12870 1930 -3283 -7317 -10832 -10347 -4252 -5641 -9056 -7900 -8369 5562 10884 5474 1460 482 4430
12855 4430 6990 456 752 -4058 -4874 -6436 679 -1674 -1506 3422 1093 1357 -2018 1501 5033 6356
12839 6356 6279 4567 3155 7889 10981 11199 11015 7933 1492 4280 -3395 -4974 -2233 766 5368 6754
12823 6754 2664 3290 7741 1928 -497 3145 8388 14656 11258 7090 5191 6805 2931 1565 5886
12808 5886 3421 1913 7373 10671 15836 11968 1477 -2726 -43 1270 4479 1678 -4392 -2377
12794 -2377 4503 5350 860 2267 -1227 -1032 6970 10426 10206 17289 25400 29216 36127 51642 78898
$$ packed form
12901b420M573j16l05J516l555J718M872m15l458o365o704Q24M493O068k000K977
12885A703K084K494l940q723n972L540J1854K366K31J631L953k192l483l33l283
12870A930n213m034l515M85O095j389l415J156m69J3931N322n410m014r78L948
12855D430K560o534K96m810q16j562P115k353J68M928k329K64l375L519L532J323
12839F356p7j712j412M734L092K18j84l082o441K788p675j579K741K999M602J386
12823F754m090O26M451n813k425L642N243O268l398m168j899J614l874j366M321
12808E886k465j508N460L298N165l868j0491m203K683J313L209k801o070K015
12794b377O880Q47m490J407l494J95Q002L456k20P083Q111L816O911J5515K7256
$$ plain form
12779 78898 117588 171744 236605 287673 302614 279807 220439 150861 102992 71096 52625 47299
12767 47299 45262 39018 32531 32084 28521 23958 26628 31560 22478 17349 27706 30629 38033 36105
12753 36105 27004 26847 19563 23502 32633 36253 47176 69015 91598 118216 159607 227236 326858
12740 326858 449282 554172 598881 578921 506380 403998 307697 221439 160448 123828 95624
12729 95624 71903 59879 47671 42093 33583 40989 45102 40168 37873 34618 31730 30383 26138 25260
12715 25260 21725 13666 18320 19554 20638 32844 42969 51252 58930 67949 95249 132803 187605
12702 187605 268757 338001 362993 335830 267392 196086 136233 98276 72226 65896 58461 45635
12690 45635 34842 23507 17599 19705 23133 23274 27498 23500 13044 9350 8390 5433 5385 3524 6447
$$ packed form
12779G8898L8690N4156O4861N1068J4941k2807n9368o9578m7869l1896j8471n326
12767D7299k037o244o487m47l563m563K670M932r082n129J0357K923P404j928
12753C6105r101j57p284L939R131L620J0923K1839K2583K6618M1391O7629R9622
12740C26858J22424J04890M4709j9960p2541j02382r6301q6258o0991l6620k8204
12729I5624k3721j2024j2208n578q510P406M113m934k295l255k888j347m245q78
12715B5260l535q059M654J234J084J2206J0125Q283P678R019K7300L7554N4802
12702A87605Q1152O9244K4992k7163o8438p1306n9853l7957k6050o330p435j2826
12690D5635j0793j1335n908K106L428J41M224l998j0456l694r60k957m8j861K923
$$ plain form
12675 6447 1364 -5177 -4763 2498 15617 20738 18835 13527 9253 10008 9303 9237 5856 1402 -4324 -6562
12659 -6562 -4772 -9678 -5354 6533 13966 11081 1250 -4227 -7432 -6881 -5476 -3074 -5394 -3147 -3211
12644 -3211 3515 4614 10732 10803 8436 7289 5135 -1062 -1931 3979 3781 -2293 -3521 -6819 -3251 40
12628 40 -2296 3060 5823 -2118 -4209 2526 2616 2471 4823 1670 2260 659 3500 6174 8720 7454
12612 7454 8160 9416 7033 9426 14378 14824 11972 2011 -4602 -6769 -5195 -2281 -4317 -9593 -7789
12597 -7789 2278 2674 3129 6963 5168 6910 10098 9542 -724 -7511 -2223 1049 -1915 -6347 -7414
12582 -7414 -3254 -1087 4030 7358 -7055 -7137 2733 8729 10950 6527 4016 -1431 2887 3757 -1378
12567 -1378 -2464 -4783 -5053 -2384 6338 7381 2791 -943 -899 1546 332 3552 7148 7302 6683 3709
$$ packed form
12675F447n083o541M14P261J3119N121j903n308m274P55p05o6l381m454n726k238
12659f562J790m906M324J1887P433k885r831n477l205N51J405K402k320K247o4
12644c211O726J099O118P1k367j147k154o197q69N910j98o074j228l298L568L291
12628D0k336N356K763p941k091O735R0j45K352l153N90j601K841K674K546j266
12612G454P06J256k383K393M952M46k852r961o613k167J574K914k036n276J804
12597g789J0067L96M55L834j795J742L188n56j0266o787N288L272k964m432j067
12582g414M160K167N117L328j4413q2R870N996K221m423k511n447M318Q70n135
12567a378j086k319k70K669Q722J043m590l734M4K445j214L220L596J54o19k974
$$ plain form
12551 3709 8103 8644 9850 12007 10903 2158 5810 7322 926 -3043 -12975 -10769 -3774 -2949 -2592
12536 -2592 1343 14 -4576 -1571 2444 5478 4395 1444 1674 1822 -3045 -2808 1856 -300 684 1169
12520 1169 4792 5048 -1035 -6320 -1105 -1710 1739 -4154 -2510 -2797 -3128 -3426 -2907 -12497 -12146 -8220
12504 -8220 -8007 -5999 -7033 -7102 233 4575 -4400 -4530 -4265 -461 -279 -2150 -9499 -9347 -2939 -10702
12488 -10702 -11279 -6517 -4895 -10845 -5753 118 977 -318 -2461 -6776 -4697 -2159 -1914 3048 5710
12473 5710 -422 -203 5922 3720 -3039 -5017 -8551 -7382 -8687 -11735 -7719 3222 1283 3131 6767
12458 6767 5487 1670 1304 4800 4911 4551 1295 -4723 -5654 -4286 -342 5118 3219 2157 -1187 1626
12442 1626 6470 1460 -1394 2500 4490 881 -2339 -8580 -11399 -6056 424 -2962 -212 1284 2986
$$ packed form
12551C709M394N41J206K157j104q745L652J512o396l969r932K206O995Q25L57
12536b592L935j329m590L005M015L034j083k951K30J48m867K37M664k156R84M85
12520A169L623K56o083n285N215o05L449n893J644k87l31k98N19r590L51L926
12504h220K13K008j034o9P335M342q975j30K65L804J82j871p349J52O408p763
12488a0702n77M762J622n950N092N871Q59j295k143m315K079K538K45M962K662
12473E710o132K19O125k202o759j978l534J169j305l048M016J0941j939J848L636
12458F767j280l817l66L496J11l60l256o018r31J368L944N460j899j062l344K813
12442A626M844n010k854L894J990l609l220o241k819N343O480l386K750J496J702
$$ plain form
12427 2986 9664 9353 8650 7222 4476 5618 4911 8342 11637 7314 -219 1928 2447 5176 3776 -1016
12411 -1016 -3811 38 4308 4049 3993 791 -1141 3275 289 1737 2313 3774 473 8515 12741 5868
12395 5868 4429 -67 -5277 -6681 -2458 620 2538 3744 10549 8464 6213 3413 -914 2462 3538
12380 3538 2182 4574 3463 -2862 -6011 -3332 7686 12168 12880 15836 16137 14115 13287 8132 8624
12365 8624 6940 6073 10369 12130 6819 -2910 -4753 1038 853 6924 8941 8692 7709 462 -4704 -5671
12349 -5671 467 -209 -639 460 4142 7129 627 -3827 -2441 -2573 -2855 -8190 -10808 -10300 -14034 -8884
12333 -8884 -7068 -7265 -9630 -6665 -5853 -3828 -7759 -6698 2023 1441 4612 5410 6619 5769 3535 5607
12317 5607 13623 15182 13172 9423 7197 16068 16753 18031 12676 6492 2820 -790 2595 4815 9281
$$ packed form
12427B986O678l11p03j428k746J142p07L431L295m323p533K147N19K729j400m792
12411a016k795L849M270k59n6l202j932M416k986J448N76J461l301Q042M226o873
12395E868j439m496n210j404M223L078J918J206O805k085k251k800m327L376J076
12380C538j356K392j111o325l149K679J1018M482P12K956L01k022q28n155M92
12365H624j684q67M296J761n311r729j843N791j85O071K017k49r83p247n166r67
12349e671O138o76m30J099L682K987o502m454J386j32k82n335k618N08l734N150
12333h884J816j97k365K965Q12K025l931J061Q721n82L171P98J209q50k234K072
12317E607Q016J559k010l749k226Q871O85J278n355o184l672l610L385K220M466
$$ plain form
12302 9281 11000 6268 6843 8616 12994 15075 7297 4494 -3828 -13807 -9405 -2997 2051 8752 18605
12287 18605 26517 22219 17195 14798 7547 -1702 2069 5933 7022 8410 4979 8045 11964 14096
12273 14096 22706 35977 42204 39631 34425 29003 26045 18912 11407 7888 3470 6018 15280 15441
12259 15441 11931 10464 6918 6330 12123 16159 8645 10068 11699 7440 5652 11065 17553 25239 31267
12244 31267 27153 30194 40751 44558 56492 68824 72488 72831 70769 68444 65955 53177 36990
12231 36990 31859 31368 28198 27685 27325 26768 22935 17900 17392 15882 7939 11283 13328 5844 641 -16
12215 -16 3745 11885 11930 9332 12035 11614 9812 10961 16356 20934 29670 37447 46302 55970 51907 48537
12199 48537 43549 32140 19727 10178 10685 18820 22904 25996 26800 18820 20045 15490 9065 13658
$$ packed form
12302I281J719m732N75J773M378K081p778k803q322r979M402O408N048O701R853
12287A8605P912m298n024k397p251r249L771L864J089J388l431L066L919K132
12273A4096Q610J3271O227k573n206n422k958p133p505l519m418K548R262J61
12259A5441l510j467l546n88N793M036p514J423J631m259j788N413O488P686O028
12244C1267m114L041J0557L807J1934J2332L664L43k062k325k489j2778j6187
12231C6990n131m91l170n13l60n57l833n035n08j510p943L344K045p484n203o57
12215a6L761Q140M5k598K703m21j802J149N395M578Q736P777Q855R668m063l370
12199D8537m988j1409j2413r549N07Q135M084L092Q04p980J225m555o425M593
$$ plain form
12185 13658 15443 16343 20368 20916 16812 12223 10893 9414 10783 18590 19495 17913 21971 17118 22524
12170 22524 23243 16995 19241 13153 11077 12539 13966 17518 13070 14662 13716 15958 22169 23312 18556
12155 18556 15934 14563 8835 6230 2293 2354 4900 13855 21287 20160 23060 21372 14071 14131 18198
12140 18198 30644 32986 30794 24063 18966 19801 15754 15897 20743 24072 26098 24385 19823 23782 23830
12125 23830 20727 20955 17981 19401 22727 24109 23975 20935 14275 15244 17388 23460 26373 26857 20119
12110 20119 18204 16219 13571 9942 13784 31059 26402 20431 24043 25706 16946 22407 24055 20355
12096 20355 24821 25463 22669 18210 13687 10413 11163 16888 23806 26137 32275 28651 27655 32851 29435
12081 29435 27772 28386 30812 34676 35270 40822 41964 34820 34447 36810 39490 42630 43571 38883 36292
$$ packed form
12185A3658J785R00M025N48m104m589j330j479J369P807R05j582M058m853N406
12170B2524P19o248K246o088k076J462J427L552m448J592r46K242O211J143m756
12155A8556k622j371n728k605l937O1K546Q955P432j127K900j688p301O0M067
12140A8198J2446K342k192o731n097Q35m047J43M846L329K026j713m562L959M8
12125B3830l103K28k974J420L326J382j34l040o660R69K144O072K913M84o738
12110B0119j915j985k648l629L842J7275m657n971L612J663q760N461J648l700
12096B0355M466O42k794m459m523l274P50N725O918K331O138l624r96N196l416
12081B9435j663O14K426L864N94N552J142p144l73K363K680L140R41m688k591
$$ plain form
12066 36292 35599 32737 31119 31974 27815 22630 21878 29322 32837 30136 23492 30048 42199 39594 39623
12051 39623 30784 28869 28525 30386 31901 34971 38357 33480 33761 30434 25861 34868 32427 30927 32346
12036 32346 32236 34769 32848 36952 42971 40006 36825 36573 38611 37354 32907 26680 28314 32915 38647
12021 38647 33082 32311 30949 26831 29766 36363 38489 33857 30482 34406 31502 38836 39755 31357 21732
12006 21732 18907 15211 14733 17880 16309 16414 21053 27782 35678 37784 37906 36192 28206 26681 33307
11991 33307 32861 29541 38185 34884 37378 35559 32253 31109 28021 28598 25920 23512 26496 29355 30543
11976 30543 28522 33384 31297 30706 31413 32470 34925 34464 32137 26677 21797 17944 19451 24677 24932
11961 24932 16585 18852 26207 21834 10361 16124 25148 34454 39672 35812 32151 38654 34411 32094
$$ packed form
12066C6292o93k862j618Q55m159n185p52P444L515k701o644O556J2151k605K9
12051C9623q839j915l44J861J515L070L386m877K81l327m573R007k441j500J419
12036C2346j10K533j921M104O019k965l181k52K038j257m447o227J634M601N732
12021C8647n565p71j362m118K935O597K126m632l375L924k904P334R19q398r625
12006B1732k825l696m78L147j571J05M639O729P896K106J22j714p986j525O626
11991C3307m46l320Q644l301K494j819l306j144l088N77k678k408K984K859J188
11976C0543k021M862k087n91P07J057K455m61k327n460m880l853J507N226K55
11961B4932q347K267P355m373j1473N763R024R306N218l860l661O503m243k317
$$ plain form
11947 32094 35904 34902 34570 31906 27905 23847 23732 30954 39708 35684 26261 21656 22414 24905 25775
11932 25775 28585 24660 20900 23809 28172 29732 32971 27624 19964 21535 24759 29600 28009 14362
11918 14362 14418 12291 12579 18711 25976 27613 29363 28279 25229 18452 13096 11250 24194 26773 26419
11903 26419 29121 29459 35636 34059 29870 27566 27911 32176 33555 26340 23249 28947 34878 31603 30951
11888 30951 35858 36757 37821 39484 33714 28838 22206 22481 22710 18952 18166 16129 19607 25951 32093
11873 32093 33601 26512 26568 28284 26988 27132 28922 31594 32228 28226 31885 28276 22659 31861 40224
11858 40224 36259 36501 32231 27623 29272 28635 24485 19525 18653 31352 44296 42281 38387 43694 47021
11843 47021 52343 62396 67523 76095 90802 106387 136023 169232 208801 243812 256645 237900
$$ packed form
11947C2094L810j002l32k664m001m058j15P222Q754m024r423m605P58K491Q70
11932B5775K810l925l760K909M363J560L239n347p660J571L224M841j591j3647
11918A4362N6k127K88O132P265J637J750j084l050o777n356j846J2944K579l54
11903B6419K702L38O177j577m189k304L45M265J379p215l091N698N931l275o52
11888C0951M907Q99J064J663n770m876o632K75K29l758p86k037L478O344O142
11873C2093J508p089N6J716j296J44J790K672O34m002L659l609n617R202Q363
11858D0224l965K42m270m608J649o37m150m960q72J2699J2944k015l894N307L327
11843D7021N322J0053N127Q572J4707J5585K9636L3209L9569L5011J2833j8745
$$ plain form
11831 237900 201365 162081 129997 96886 77214 62482 56303 47909 41052 45941 51770 57737 54317
11818 54317 45554 46043 44301 37965 37022 42260 43170 41053 45411 43010 40751 46766 52756 63347 67610
11803 67610 71463 81211 91230 93906 110690 135488 165287 211413 282938 367015 456880 527652
11791 527652 544293 507922 429423 332824 246333 189112 147519 116199 96823 86246 85089 85620
11779 85620 79322 68957 64050 59680 55494 46844 50278 50304 50927 45780 40289 46231 48267 49079 53656
11764 53656 50949 48637 48024 49806 55450 59845 72901 89260 101573 119161 150094 191452 244244
11751 244244 293339 320652 323950 299048 249245 194440 157915 131980 110291 91867 73072 59505
11739 59505 57507 63304 65258 59108 51093 41326 35627 38915 43684 41477 44257 46044 47040 47686 43700
$$ packed form
11831B37900l6535l9284l2084l3111j9672j4732o179q394o857M889N829N967l420
11818E4317q763M89j742o336r43N238R10k117M358k401k259O015N990J0591M263
11803F7610L853R748J0019K676J6784K4798K9799M6126P1525Q4077Q9865P0772
11791E27652J6641l6371p8499r6599q6491n7221m1593l1320j9376j0577j157N31
11779H5620o298j0365m907m370m186q650L434K6O23n147n491N942K036Q12M577
11764E3656k707k312o13J782N644M395J3056J6359J2313J7588L0933M1358N2792
11751B44244M9095K7313L298k4902m9803n4805l6525k5935k1689j8424j8795j3567
11739E9505j998N797J954o150q015r767n699L288M769k207K780J787R96O46l986
$$ plain form
11724 43700 36777 32965 40978 41796 42408 37780 37036 37874 39485 33844 28074 28211 21734 28027 33884 36812
11708 36812 38982 44885 49102 45619 43164 34954 29213 24371 21501 31570 32690 31981 32897 29542 33971
11693 33971 36679 38982 34629 26956 17443 20677 30826 32813 30560 33051 34245 28712 20783 24019
11679 24019 30362 30210 29761 29501 30173 27522 30873 32586 33700 29176 28155 25796 20093 18434 26788
11664 26788 33952 35850 35721 38908 43455 42189 37463 29906 29708 35888 40448 40204 40088 36315 37314 48217
11648 48217 49731 44547 45082 37635 38775 38063 38300 40434 45795 44093 46965 47396 42631 40790 37226
11633 37226 29846 33842 34005 41172 47283 48802 58778 64181 65113 68268 73686 69705 64126 64455 60999
11618 60999 59047 61082 59539 57607 51456 40438 34812 32005 39353 49566 52905 50034 52420 49149
$$ packed form
11724D3700o923l812Q013Q18O12m628p44Q38J611n641n770J37o477O293N857K928
11708C6812K170N903M217l483k455q210n741m842k870J0069J120p09R16l355M429
11693C3971K708K303m353p673r513L234J0149J987k253K491J194n533p929L236
11679B4019O343j52m49k60O72k651L351J713J114m524j021k359n703j659Q354
11664B6788P164J898j29L187M547j266m726p557j98O180M560k44j16l773R99J0903
11648D8217J514n184N35p447J140p12K37K134N361j702K872M31m765j841l564
11633C7226p380L996J63P167O111J519R976N403R32L155N418l981n579L29l456
11618F0999j952K035j543j932o151j1018n626k807P348J0213L339k871K386l271
$$ plain form
11604 49149 47189 49535 52698 54854 60331 59219 55883 48111 53122 54743 51047 43347 42822 49988 50429
11589 50429 49009 54977 58378 65952 73611 76635 80318 81420 70932 65984 70571 70874 69158 66496
11575 66496 67514 71520 70799 65681 69791 69972 64697 67928 78574 83624 85914 84244 86018 93218 92994
11560 92994 89471 83004 79670 86004 88516 91921 92151 89126 84732 81811 88202 104346 117053 117303
11546 117303 118247 118831 124426 132421 132301 135989 137104 130601 125316 122881 126662 129312 130106 135477 135580
11531 135580 134349 144392 155987 160597 166672 176929 182071 185948 190559 198399 195135 186934 180160
11518 180160 172253 168357 165799 172161 181250 197893 222193 228819 232985 246579 253662 261939 267647
11505 267647 260393 254214 250593 249076 245715 238068 227173 226849 230117 234739 247472 257544 261859 268373
$$ packed form
11604D9149j960K346L163K156N477j112l336p772N011J621l696p700n25P166M41
11589E0429j420N968L401P574P659L024L683J102j0488m948M587L03j716k662
11575F6496J018M006p21n118M110J81n275L231J0646N050K290j670J774P200k24
11560I2994l523o467l334O334K512L405K30l025m394k921O391J6144J2707K50
11546A17303R44N84N595P995j20L688J115o503n285k435L781K650P94N371J03
11531A35580j231J0043J1595M610O075J0257N142L877M611P840l264q201o774
11518A80160p907l896k558O362R089J6643K4300O626M166J3594P083Q277N708
11505B67647p254o179l621j517l361p647j0895l24L268M622J2733J0072M315O514
$$ plain form
11491 268373 277109 278352 268411 254691 252097 251696 254596 267033 274682 279784 292630 306702 327147
11478 327147 346039 374579 409734 447638 491328 537822 576676 602552 614566 618638 605486 589408
11466 589408 578825 562857 530192 496533 481627 474560 464462 451813 444973 441471 445939 447798
11454 447798 449954 453279 456778 469216 482641 494320 516784 545050 577639 618997 669189 717936
11442 717936 759938 794688 835586 875107 924341 971075 1004911 1031200 1060059 1094392 1136303
11431 1136303 1179746 1222715 1273733 1348653 1444437 1563763 1707495 1871946 2058974 2278399
11421 2278399 2571912 2954132 3449436 4114093 5056539 6428322 8497310 11561838 15727360
11412 15727360 20286399 23590664 24691178 23925545 22429671 22257926 23856781 25601129
$$ packed form
11491B68373Q736J243r941j3720k594m01K900J2437P649N102J2846J4072K0445
11478C27147J8892K8540L5155L7904M3690M6494L8854K5876J2014M072j3152j6078
11466E89408j0583j5968l2665l3659j4906p067j0098j2649o840l502M468J859
11454D47798K156L325L499J2438J3425J1679K2464K8266L2589M1358N0192M8747
11442G17936M2002L4750M0898L9521M9234M6734L3836K6289K8859L4333M1911
11431A136303M3443M2969N1018P4920R5784J19326J43732J64451J87028K19425
11421B278399K93513L82220M95304O64657R42446J371783K068988L064528M165522
11412A5727360M559039L304265J100514p65633j495874j71745J598855J744348
$$ plain form
11404 25601129 25516786 23109076 18780567 14109185 10565696 8225141 6707205 5691798
11396 5691798 4991962 4498256 4158556 3941539 3819807 3778764 3808983 3864262 3931827 4004825
11386 4004825 4117600 4298926 4558964 4890216 5288968 5770815 6383534 7204276 8316623
11377 8316623 9836632 11953562 14945292 19217122 25179779 32637363 40342452 46981228
11369 46981228 52191317 55595920 57881080 61077276 66371737 72340284 74032936 68786335
11361 68786335 57081218 41627558 29284147 21408176 16512776 13372510 11290287 9868396
11353 9868396 8863320 8102086 7485393 6956961 6481509 6032117 5642314 5311345 5052495
11344 5052495 4888418 4831162 4870756 4969054 5132559 5353346 5664801 6101118 6705342 7535475
$$ packed form
11404B5601129q4343k407710m328509m671382l543489k340555j517936j015407
11396E691798o99836m93706l39700k17017j21732m1043L0219N5279O7565P2998
11386D004825J12775J81326K60038L31252L98752M81847O12719Q20742J112347
11377H316623J520009K116930K991730M271830N962657P457584P705089O638776
11369D6981228N210089L404603K285160L196196N294461N968547J692652n246601
11361F8786335j1705117j5453660j2343411p875971m895400l140266k082223j421891
11353I868396j005076p61234o16693n28432m75452m49392l89803l30969k58850
11344E052495j64077n7256L9594R8298J63505K20787L11455M36317O04224Q30133
$$ plain form
11334 7535475 8686569 10336224 12787627 16490364 21983810 29513943 38067770 45108503
11326 45108503 49076769 50431891 50383591 50328896 48925720 44540511 37159973 28316702 20803146
11317 20803146 15562457 12094010 9767138 8150567 6981388 6085170 5379380 4814059
11309 4814059 4357889 3979079 3646254 3336008 3052767 2805122 2591276 2407907 2254188
11300 2254188 2130275 2027942 1941134 1861568 1773477 1684933 1602204 1523823 1458882 1396272 1345055
11289 1345055 1298316 1246369 1203293 1158192 1122088 1083387 1046497 1017291 977520 938346 902618
11278 902618 867711 834679 811711 795062 779071 760467 745944 734750 722825 712933 701010 687762
11266 687762 677748 676102 673545 662562 645850 620956 596100 577681 564111 549080 545835 542968
$$ packed form
11334G535475J151094J649655K451403L702737N493446P530133Q553827P040733
11326D5108503L968266J355122m8300n4695j403176m385209p380538q843271p513556
11317B0803146n240689l468447k326872j616571j169179q96218p05790n65321
11309D814059m56170l78810l32825l10246k83241k47645k13846j83369j53719
11300B254188j23913j02333q6808p9566q8091q8544q2729p8381o4941o2610n1217
11289A345055m6739n1947m3076m5101l6104l8701l6890k9206l9771l9174l5728
11278I02618l4907l3032k2968j6649j5991j8604j4523j1194j1925r892j1923j3248
11266F87762j0014j646k557j0983j6712k4894k4856j8419j3570j5031l245k867
$$ plain form
11254 542968 538467 557715 592688 625775 644477 649070 645981 642016 631635 630587 623219 604930 581384
11241 581384 553671 523120 500953 482795 466939 461834 450379 446217 441547 449523 456088 450371 449716
11228 449716 464707 470042 476108 494162 518716 547769 576970 614011 674307 773520 951104 1247297
11216 1247297 1682034 2198763 2593444 2694349 2490232 2054525 1623234 1335328 1160768
11207 1160768 1053999 972164 889412 804592 716183 638826 585413 540775 506830 479168 460225
11196 460225 438203 426601 420573 418920 412713 402523 403945 397196 393232 389788 389491 390361 390122 401243
11182 401243 417108 436252 451035 463837 492841 531872 572629 605329 632588 647096 656728 665029
11170 665029 676322 689546 685688 674070 666461 647316 628917 620914 610425 601743 601215 606213 606646
$$ packed form
11254E42968m501J9248L4973L3087J8702M593l089l965j0381j048p368j8289k3546
11241E81384k7713l0551k2167j8158j5856n105j1455m162m670P976O565n717o55
11228D49716J4991N335O066J8054K4554K9053K9201L7041O0296R9213J77584K96193
11216A247297M34737N16729L94681J00905k04117m35707m31291k87906j74560
11207A160768j06769q1835q2752q4820q8409p7357n3413m4638l3945k7662j8943
11196D60225k2022j1602o028j653o207j0190J422o749l964l444k97Q70k39J1121
11182D01243J5865J9144J4783J2802K9004L9031M0757L2700K7259J4508R632Q301
11170F65029J1293J3224l858j1618p609j9145j8399q003j0489q682n28M998M33
$$ plain form
11157 606646 605573 603679 594334 596790 604065 615506 625360 634134 647928 655306 675387 701518 733544
11144 733544 764920 797248 835785 878791 931867 997204 1058858 1122609 1192650 1266248 1350492
11133 1350492 1446753 1549900 1667015 1805071 1972865 2168396 2387720 2622431 2875224 3162853
11123 3162853 3496321 3917230 4454261 5140518 6048043 7333579 9211087 11940197 15715448
11114 15715448 20350012 25156226 29402831 33016392 36505480 40262991 43638271 45139031
11106 45139031 44019081 40846062 37035613 33540187 30046273 25972826 21334809 16840332
11098 16840332 13243724 10710196 9004496 7853146 7076508 6545093 6180829 5933719 5768774
11089 5768774 5669327 5644094 5682910 5760829 5874409 6033016 6241068 6543744 6970580 7547736
$$ packed form
11157F06646j073j894r345K456P275J1441R854Q774J3794P378K0081K6131L2026
11144G33544L1376L2328L8537M3006N3076O5337O1654O3751P0041P3598Q4244
11133A350492R6261J03147J17115J38056J67794J95531K19324K34711K52793K87629
11123C162853L33468M20909N37031O86257R07525J285536J877508K729110L775251
11114A5715448M634564M806214M246605L613561L489088L757511L375280J500760
11106D5139031j119950l173019l810449l495426l493914m073447m638017m494477
11098A6840332l596608k533528j705700j151350p76638n31415l64264k47110j64945
11089E768774r9447k5233L8816P7919J13580J58607K08052L02676M26836N77156
$$ plain form
11079 7547736 8344170 9477276 11152221 13735667 17732557 23592169 31062655 38599701
11071 38599701 44471298 48424503 51518100 55219242 59496919 62288867 61957615 58422082
11063 58422082 53050356 47574723 42584198 37936085 33362635 28750064 24149237 19763112
11055 19763112 15998772 13140231 11106621 9665642 8618238 7826063 7202376 6684999
11047 6684999 6243189 5871866 5550842 5276218 5057870 4892844 4795276 4772533 4838685 5015819
11037 5015819 5314766 5781109 6524891 7694413 9421569 11684961 14128146 16197450 17620980
11028 17620980 18654841 19880045 21699675 23684206 24822081 24434512 22683572 20475630
11020 20475630 18674767 17380263 16028360 14161721 11784481 9324904 7304735 5871446
$$ packed form
11079G547736P96434J133106J674945K583446L996890N859612P470486P537046
11071C8599701N871597L953205L093597L701142M277677K791948l31252l535533
11063E8422082n371726n475633m990525m648113m573450m612571m600827m386125
11055A9763112l764340k858541k033610j440979j047404p92175o23687n17377
11047F684999m41810l71323l21024k74624k18348j65026r7568k2743O6152J77134
11037E015819K98947M66343P43782J169522J727156K263392K443185K069304J423530
11028A7620980J033861J225204J819630J984531J137875l87569j750940k207942
11020B0475630j800863j294504j351903j866639k377240k459577k020169j433289
$$ plain form
11012 5871446 4896535 4233699 3769529 3408242 3109640 2861669 2654876 2476305 2301937
11003 2301937 2145302 1994562 1854450 1718905 1585054 1461238 1340588 1227778 1134258 1079058
10993 1079058 1064165 1077729 1089938 1091936 1064450 1020946 985114 958425 931556 901971 872209
10982 872209 838705 807534 780458 760193 751154 739018 733123 729092 725923 730031 737748 754214 777065
10969 777065 810278 840893 853134 835741 806705 779781 761057 768146 782768 793040 781796 745398
10957 745398 700299 661224 623272 600808 579993 558909 548608 532969 514846 498892 485558
10946 485558 471355 453051 439915 439933 443179 439930 433554 428440 431500 431796 435824 447072 474090 504269
10932 504269 544346 602843 663258 706871 725497 708921 681809 665673 654807 627214 596077
$$ packed form
11012E871446r74911o62836m64170l61287k98602k47971k06793j78571j74368
11003B301937j56635j50740j40112j35545j33851j23816j20650j12810r3520n5200
10993A079058j4893J3564J2209J998k7486m3504l5832k6689k6869k9585k9762
10982H72209l3504l1171k7076k0265r039j2136n895m031l169M108P717J6466K2851
10969G77065L3213L0615J2241j7393k9036k6924j8724P089J4622J0272j1244l6398
10957G45398m5099l9075l7952k2464k0815k1084j0301j5639j8123j5954j3334
10946D85558j4203j8304j3136J8L246l249o376n114L060K96M028J1248K7018L0179
10932E04269M0077N8497O0415M3613J8626j6576k7112j6136j0866k7593l1137
$$ plain form
10921 596077 569212 548071 540235 536767 548312 561142 585736 620581 640690 648170 660958 668251
10909 668251 680995 706094 732192 759659 814459 852794 831255 784296 722217 663703 613510
10898 613510 580667 547449 533237 526067 524580 527632 530921 531575 535122 533312 530139 527834 522396 527530
10884 527530 548997 576535 602627 624861 648112 683994 728497 767978 787747 784785 765433 747201
10872 747201 734594 734970 735227 750132 783453 815821 844676 870024 877374 869673 881915 903821 929894
10859 929894 954734 990766 1023241 1056208 1098977 1149310 1197621 1236034 1269911 1310572 1342245
10848 1342245 1375891 1410722 1451046 1515160 1590518 1669830 1759147 1853348 1949349 2048877 2151476
10837 2151476 2271233 2430569 2649469 2959662 3353006 3848405 4490047 5258228 6017814
$$ packed form
10921E96077k6865k1141p836l468J1545J2830K4594L4845K0109P480J2788P293
10909F68251J2744K5099K6098K7467N4800L8335k1539m6959o2079n8514n0193
10898F13510l2843l3218j4212p170j487L052L289O54L547j810l173k305n438N134
10884E27530K1467K7538K6092K2234K3251L5882M4503L9481J9769k962j9352j8232
10872G47201j2607L76K57J4905L3321L2368K8855K5348P350p701J2242K1906K6073
10859I29894K4840L6032L2475L2967M2769N0333M8311L8413L3877M0661L1673
10848A342245L3646L4831M0324O4114P5358P9312Q9317R4201R6001R9528J02599
10837B151476J19757J59336K18900L10193L93344M95399O41642P68181P59586
$$ plain form
10828 6017814 6546114 6794675 6804784 6789051 6986930 7474608 8247487 9264136 10538303
10819 10538303 12150660 14194100 16805717 20231736 24741818 30789480 39352586 52297264
10811 52297264 73162451 107473652 162021023 238435928 317393032 361097318 354184165
10804 354184165 300798387 216926319 144371375 98031823 70051857 52731138 41575364
10797 41575364 34017466 28696302 24911375 22153916 19927998 17926858 16014274 14160359
10789 14160359 12589335 11378053 10446155 9729002 9240179 8998897 8915599 8744324 8325428
10780 8325428 7684752 6923488 6273732 5801866 5430659 5094849 4773601 4470735 4211480
10771 4211480 3992181 3795237 3626045 3480122 3341676 3206453 3061208 2906855 2767538
$$ packed form
10828F017814N28300K48561J0109j5733J97879M87678P72879J016649J274167
10819A0538303J612357K043440K611617L426019M510082O047662Q563106J2944678
10811E2297264K0865187L4311201N4547371P6414905P8957104M3704286o913153
10804C54184165n3385778q3872068p2554944m6339552k7979966j7320719j1155774
10797D1575364p557898n321164l784927k757459k225918k001140j912584j853915
10789A4160359j571024j211282r31898p17153m88823k41282q3298j71275m18896
10780H325428o40676p61264o49756m71866l71207l35810l21248l02866k59255
10771D211480k19299j96944j69192j45923j38446j35223j45245j54353j39317
$$ plain form
10762 2767538 2632713 2515782 2405707 2305337 2217798 2135571 2074848 2020885 1964261 1911965
10752 1911965 1857546 1804032 1748851 1681629 1611776 1545393 1488605 1448257 1414662 1391567 1367205
10741 1367205 1325935 1280800 1228119 1168307 1112979 1071080 1036914 1014703 991519 970425 951059
10730 951059 928298 915023 915865 918625 919782 900727 878170 851593 819475 788532 762570 744415
10718 744415 730857 727976 722347 722130 723013 732137 749703 773040 808939 856994 940488 1031062 1070762
10705 1070762 1059156 1028595 965826 890086 828842 783345 737092 677830 625982 579493 535239
10694 535239 496900 461578 426910 405180 387818 366189 353234 341797 333105 332029 335376 332854
10682 332854 333255 324319 317316 310380 300153 291481 284843 284555 292381 295084 303594 308885 325149 352686
$$ packed form
10762B767538j34825j16931j10075j00370q7539q2227o0723n3963n6624n2296
10752A911965n4419n3514n5181o7222o9853o6383n6788m0348l3595k3095k4362
10741A367205m1270m5135n2681n9812n5328m1899l4166k2211k3184k1094j9366
10730I51059k2761j3275Q42K760J157j9055k2557k6577l2118l0943k5962j8155
10718G44415j3558k881n629k17Q83R124J7566K3337L5899M8055Q3494R0574L9700
10705A070762j1606l0561o2769p5740o1244m5497m6253n9262n1848m6489m4254
10694E35239l8339l5322l4668k1730j7362k1629j2955j1437q692j076L347k522
10682C32854M01q936p003o936j0227q672o638k88P826K703Q510N291J6264K7537
$$ plain form
10668 352686 389688 426983 474261 510185 529637 540482 547582 548428 534465 514496 471543 413965
10656 413965 346690 281917 244576 223271 217671 223565 231545 240625 240944 232492 212141 193705 183790
10643 183790 175273 167590 171032 166134 158507 151934 151186 152833 150061 137484 133532 134260 138177 132502
10629 132502 126529 116856 117480 127760 133727 150388 168380 186594 209840 268027 336453 395497
10617 395497 433907 419609 377036 335986 311094 294268 288881 292680 302880 303707 290138 262501
10605 262501 243953 230926 227463 233004 236522 230281 216261 198332 187208 174251 164806 157727 135180
10592 135180 104078 79655 67197 69665 76918 84563 83795 85727 92576 99911 117908 136982 132310
10579 132310 116516 100853 83967 73445 72596 78084 86021 95420 104776 105299 104101 105133 96739 87011
$$ packed form
10668C52686L7002L7295M7278L5924J9452J0845P100Q46j3963j9969m2953n7578
10656D13965o7275o4773l7341k1305n600N894P980R080L19q452k0351j8436r915
10643A83790q517p683L442m898p627o573p48J647k772j2577l952P28L917n675
10629A32502n973r673O24J0280N967J6661J7992J8214K3246N8187O8426N9044
10617C95497L8410j4298m2573m1050k4892j6826n387L799J0200Q27j3569k7637
10605B62501j8548j3027l463N541L518o241j4020j7929j1124j2957r445p079k2547
10592A35180l1102k4423j2458K468P253P645p68J932O849P335J7997J9074m672
10579A32310j5794j5663j6886j0522q49N488P937R399R356N23j198J032q394r728
$$ plain form
10565 87011 86470 80925 70475 76708 89512 99302 105131 113611 119014 109104 93201 81258 74564 66327
10551 66327 66159 63729 60276 59403 65169 70973 79545 79093 81280 89064 93837 95438 93792 88063 75660
10536 75660 72505 70248 61913 64828 59080 53187 50674 51542 55021 57436 55741 51105 46928 41714 40425
10521 40425 53086 61108 60672 63916 71554 69840 61679 59370 59207 61016 59034 57646 59648 54222 47248
10506 47248 44090 40074 32177 30056 28245 35587 47698 47239 39208 26663 16552 15560 20261 21964
10492 21964 20726 16178 15249 14670 16312 22557 24310 21644 26643 34310 41552 41734 35466 31555 24939
10477 24939 24769 26439 26720 27222 22048 18089 26249 35611 42819 41916 34886 29003 21928 15225 16109 22293
10461 22293 28632 35251 34448 28901 26172 29400 38939 39576 37326 33659 26192 26621 24481 28074 36371
$$ packed form
10565H7011n41n545j0450O233J2804R790N829Q480N403r910j5903j1943o694q237
10551F6327j68k430l453q73N766N804Q572m52K187P784M773J601j646n729j2403
10536G5660l155k257q335K915n748n893k513Q68L479K415j695m636m177n214j289
10521D0425J2661Q022m36L244P638j714q161k309j63J809j982j388K002n426o974
10506D7248l158m016p897k121j811P342J2111m59q031j2545j0111r92M701J703
10492B1964j238m548r29n79J642O245J753k666M999P667P242J82o268l911o616
10477B4939j70J670K81N02n174l959Q160R362P208r03p030n883p075o703Q84O184
10461B2293O339O619q03n547k729L228R539O37k250l667p467M29k140L593Q297
$$ plain form
10446 36371 36724 31406 33038 39635 39018 40157 40477 40578 41951 38665 37959 37985 37808 37622 33682 37133 37802
10429 37802 49496 57410 57414 49865 42539 34541 24190 17887 20082 25561 30137 35746 41089 47576 53360
10414 53360 57605 57563 53589 56892 62289 65354 67375 78475 88857 95208 105830 124588 145190 173079
10400 173079 211815 265877 362435 520590 783356 1175306 1645407 1989550 2044922 1815540
10390 1815540 1365609 922313 631462 453371 342589 270759 228522 192846 161939 139021
10380 139021 128173 118855 106068 103199 98440 90890 83513 74229 72240 74649 74890 76204 71183 71769
10366 71769 62797 51408 42672 38250 31957 32728 35881 39105 42881 36934 33795 32001 37045 40001
10352 40001 39445 37197 43189 48712 47590 47197 40580 39866 45888 48186 44133 43023 39822 38241 42734
$$ packed form
10446C6371L53n318J632O597o17J139L20J01J373l286p06K6j77j86l940L451O69
10429C7802J1694P914Mp549p326p998j0351o303K195N479M576N609N343O487N784
10414E3360M245m2l974L303N397L065K021J1100J0382O351J0622J8758K0602K7889
10400A73079L8736N4062R6558J58155K62766L91950M70101L44143N5372k29382
10390A815540m49931m43296k90851j78091j10782p1830m2237l5676l0907k2918
10380A39021j0848r318j2787k869m759p550p377r284j989K409K41J314n021N86
10366G1769q972j1389q736m422o293P71L153L224L776n947l139j794N044K956
10352D0001n56k248N992N523j122l93o617p14O022K298m053j110l201j581M493
$$ plain form
10337 42734 35810 30894 26451 20945 23784 20405 23672 22322 21988 22615 20957 16052 17610 19895 20603
10322 20603 19527 24642 25751 20413 21843 26928 24748 24117 27528 30999 31820 29915 24112 10727 10745
10307 10745 14722 21882 30468 38579 34727 31827 32740 34331 31650 27295 22574 17718 8302 9756 7323
10292 7323 11712 13952 17728 21183 20917 21186 19695 21721 25001 28080 25966 16321 11699 15546 20882
10277 20882 28623 35211 32017 26740 19594 20232 21095 20419 12836 9262 6420 -1518 77 7588 10858
10262 10858 13376 11929 13123 11497 16833 13709 11436 1330 -3516 -2053 3551 11800 15389 20019
10248 20019 22749 25264 18444 13303 7193 12432 21662 19145 7589 9745 12723 20461 31059 28378
10234 28378 21900 17629 10787 11410 13845 15592 12455 7238 8608 5473 12265 23115 32184 39019
$$ packed form
10337D2734o924m916m443n506K839l379L267j350l34O27j658m905J558K285P08
10322B0603j076N115J109n338J430N085k180o31L411L471Q21j905n803j3385J8
10307A0745L977P160Q586Q111l852k900R13J591k681m355m721m856r416J454k433
10292G323M389K240L776L455k66K69j491K026L280L079k114r645m622L847N336
10277B0882P741O588l194n277p146O38Q63o76p583l574k842p938J595P511L270
10262A0858K518j447J194j626N336l124k273j0106m846J463N604Q249L589M630
10248B0019K730K515o820n141o110N239R230k517j1556K156K978P738J0598k681
10234B8378o478m271o842O23K435J747l137n217J370l135O792J0850R069O835
$$ plain form
10220 39019 46613 58492 73215 85726 95054 91299 93368 91299 80455 66076 55306 44483 41074
10207 41074 44584 42470 32840 27562 25665 17877 15210 17718 15519 12526 15204 12978 9992 7653
10193 7653 7096 9742 14857 14519 15104 15494 17572 14767 13483 16844 21571 18939 21234 19806 14412 15828
10177 15828 16277 8715 9074 5686 9814 14046 15338 19395 11474 12598 14185 12329 14392 21954 25103
10162 25103 26662 24370 13532 1381 1265 3541 5610 6256 6437 10996 9014 7179 8540 7765 4396
10147 4396 1412 -5465 -3518 862 5243 2880 5029 6895 6058 12465 18043 15121 14026 14355 10075
10132 10075 6904 3871 537 2788 15305 13866 5582 2049 5687 4878 1477 3792 4439 6101 5708
10117 5708 10221 6850 223 1818 10039 13912 10483 8889 9977 9981 8743 9758 10200 8301 237 5741
$$ packed form
10220C9019P594J1879J4723J2511R328l755K069k069j0844j4379j0770j0823l409
10207D1074L510k114r630n278j897p788k667K508k199k993K678k226k986k339
10193G653n57K646N115l38N85L90K078k805j284L361M727k632K295j428n394J416
10177A5828M49p562L59l388M128M232J292M057p921J124J587j856K063P562L149
10162B5103J559k292j0838j2151j16K276K069O46J81M559j982j835J361p75l369
10147D396k984o877J947M380M381k363K149J866q37O407N578k922j095L29m280
10132A0075l171l033l334K251J2517j439q284l533L638q09l401K315O47J662l93
10117E708M513l371o627J595Q221L873l429j594J088Mj238J015M42j899q064N504
$$ plain form
10101 5741 14642 12518 13538 6891 412 7009 5443 5925 8724 13982 20837 14804 16441 14918 11002
10086 11002 11635 13186 12368 11487 12190 10821 7393 4867 9403 16469 24268 21652 13525 7151 5627
10071 5627 5952 5981 14832 20712 19542 19187 20396 23260 19148 17795 20631 22969 15793 10481 14411 19830
10055 19830 12757 10693 10410 13577 13014 18100 18681 16738 14683 12207 14749 15674 16788 16704 12506 16945
10039 16945 21841 20275 16000 14054 5884 -1054 3376 7236 10458 2916 -2039 -5747 1071 14558
10025 14558 24384 23656 18086 17792 12293 11137 11684 12981 17313 15659 16889 13390 10495 15211 15919
10010 15919 8724 4253 8990 14958 13012 9437 4841 15029 18665 25303 25880 24617 22143 16429
9996 16429 22466 19963 25149 22384 26166 20535 17589 23473 35125 42865 53172 71072 99950 140974
$$ packed form
10101E741Q901k124J020o647o479O597j566M82K799N258O855o033J637j523l916
10086A1002O33J551q18q81P03j369l428k526M536P066P799k616q127o374j524
10071E627L25K9Q851N880j170l55J209K864m112j353K836K338p176n312L930N419
10055A9830p073k064k83L167n63N086N81j943k055k476K542R25J114q4m198M439
10039A6945M896j566m275j946q170o938M430L860L222p542m955l708O818J3487
10025A4558R826p28n570k94n499j156N47J297M332j654J230l499k895M716P08
10010A5919p195m471M737N968j946l575m596J0188L636O638N77j263k474n714
9996A6429O037k503N186k765L782n631k946N884J1652P740J0307J7900K8878M1024
$$ plain form
9982 140974 213534 340309 521018 683721 710946 633992 442065 267957 179958 126118 98510
9971 98510 80032 69338 56581 48815 47304 41310 36289 35708 39169 37733 35003 32252 30193 33993
9957 33993 30669 31971 29414 22560 21885 20662 12582 19210 22898 19031 16051 18948 20847 19108 16634
9942 16634 18206 17338 13988 18403 21889 19525 21672 21432 11941 3145 9795 16930 20436 17365 12310
9927 12310 9657 7642 11184 16358 14672 14215 16871 25207 22105 20266 18044 19155 18768 18531 13624
9912 13624 11705 11832 7184 6670 9318 15054 17202 15318 12451 11997 15231 15126 16312 14500 11023 6185
9896 6185 11680 14288 7961 5513 6298 6108 6900 7325 3106 3719 9704 10863 10090 12354 8985 7691
9880 7691 11052 16618 21757 13433 6127 11747 18746 15803 14909 11615 12835 14254 14445 5327 -116
$$ packed form
9982A40974P2560J26775J80709J62703K7225p6954j91927j74108q7999n3840k7608
9971I8510j8478j0694j2757p766j511n994n021n81L461j436k730k751k059L800
9957C3993l324J302k557o854o75j223q080O628L688l867k980K897J899j739k474
9942A6634J572q68l350M415L486k364K147k40r491q796O650P135L506l071n055
9927A2310k653k015L542N174j686m57K656Q336l102j839k222J111l87k37m907
9912A3624j919J27m648n14K648N736K148j884k867m54L234j05J186j812l477m838
9896F185N495K608o327k448P85j90P92M25m219O13N985J159p73K264l369j294
9880G691L361N566N139q324p306N620O999k943q94l294J220J419J91r118n443
$$ plain form
9865 -116 6333 11545 8607 5280 11095 5709 2051 10263 7877 16802 31225 33489 30468 26052 17626
9850 17626 13938 20383 25933 26200 25286 17650 9974 7850 6676 14627 18039 12127 5793 4561 6443
9835 6443 11312 7996 11941 14335 12029 10230 11266 14930 17830 12237 8693 11627 16075 18908 18505
9820 18505 17712 9822 9362 11369 13004 14041 16114 13306 14145 10226 9631 8121 8561 10156 7223 6845
9804 6845 6403 4884 10724 10605 12284 12257 11842 7293 4522 4129 4980 10046 7999 9078 9112 8434 8265 10406
9786 10406 14768 11740 10729 10499 7569 11274 22212 26839 25531 19417 9812 10054 13136 11746 15660
9771 15660 16166 10782 10865 11213 15083 18301 21021 18407 12310 11672 8001 9037 6098 1895 839 8294
9755 8294 8757 6137 5458 9002 10044 9237 4443 1198 4255 952 5545 8804 14623 19264 10161 12235
$$ packed form
9865a16O449N212k938l327N815n386l658Q212k386Q925J4423K264l021m416q426
9850A7626l688O445N550K67r14p636p676k124j174P951L412n912o334j232J882
9835F443M869l316L945K394k306j799J036L664K900n593l544K934M448K833m03
9820A8505p93p890m60K007J635J037K073k808Q39l919n95j510M40J595k933l78
9804F845m42j519N840j19J679k7m15m549k771l93Q51N066k047J079L4o78j69K141
9786A0406M362l028j011k30k930L705J0938M627j308o114r605K42L082j390L914
9771A5660N06n384Q3L48L870L218K720k614o097o38l671J036k939m203j056P455
9755H294M63k620o79L544J042q07m794l245L057l303M593L259N819M641r103K074
$$ plain form
9739 12235 12462 10988 14977 10809 9023 8126 5514 2240 2323 15623 21583 17992 13400 15217 15886 20890
9723 20890 17004 5564 6674 10505 7443 13164 6717 763 2106 2316 5212 11750 12045 12904 9562
9708 9562 7682 6282 1457 -3166 897 9460 15792 22718 20810 23563 24521 20901 16824 12456 13670
9693 13670 19076 24312 31119 31145 24967 26004 25516 18332 5248 6836 16102 19246 16223 17291 20812
9678 20812 20013 20729 22545 13295 12319 17660 20610 16451 14453 14727 12232 9442 11091 14649 17925 14537
9662 14537 12128 16434 19284 20476 12215 7803 16418 18884 20869 21681 16213 12624 13233 12437 13870
9647 13870 10668 14960 20060 34264 50719 61119 59640 55732 52459 47336 36852 33469 48121
9634 48121 60314 72988 97200 135394 161566 165044 146718 101189 69439 52691 45978 42316
$$ packed form
9739A2235K27j474L989m168j786q97k612l274Q3J3300N960l591m592J817O69N004
9723B0890l886j1440J110L831l062N721o447n954J343K10K896O538K95Q59l342
9708I562j880j400m825m623M063Q563O332O926j908K753R58l620m077m368J214
9693A3670N406N236O807K6o178J037m88p184j3084J588R266L144l023J068L521
9678B0812p99P16J816r250r76N341K950m159j998K74k495k790J649L558L276l388
9662A4537k409M306K850J192q261m412Q615K466J985Q12n468l589O09p96J433
9647A3870l202M292N100J4204J6455J0400j479l908l273n123j0484l383J4652
9634D8121J2193J2674K4212L8194K6172L478j8326m5529l1750j6748o713l662
$$ plain form
9622 42316 34460 30044 22993 20904 21975 20224 11156 11254 14054 22126 20314 14320 14440 19212 23195
9607 23195 16261 16533 19931 27283 17090 14532 17361 22225 22722 13177 9944 13562 16926 20083 23793
9592 23793 35604 42900 35511 40280 45527 55619 66832 81634 91216 96962 94005 84836 73906
9579 73906 60608 50703 39026 30157 26751 18751 18186 19878 22330 23272 19507 19535 19640 18578 22265
9564 22265 27203 21091 20198 17123 14739 14446 8109 10889 19379 24853 21696 19860 23237 21916 22819
9549 22819 22236 16268 10497 6418 8142 11053 17728 19419 13048 15580 15734 14216 10483 4634 9851
9534 9851 11149 11573 15775 24353 21252 16510 18486 16768 16468 21393 22238 27042 28970 25818 18013 9046
9518 9046 10850 13614 9167 8445 6449 6415 13388 17384 17296 18557 18932 17610 16302 16402 20516 25316 25636
$$ packed form
9622D2316p856m416p051k089J071j751r068R8K800Q072j812n994J20M772L983
9607B3195o934K72L398P352j0193k558K829M864M97r545l233L618L364L157L710
9592B3793J1811P296p389M769N247J0092J1213J4802R582N746k957r169j0930
9579G3906j3298r905j1677q869l406q000n65J692K452R42l765K8J05j062L687
9564B2265M938o112q93l075k384k93o337K780Q490N474l157j836L377j321R03
9549B2819n83n968n771m079J724K911O675J691o371K532J54j518l733n849N217
9534I851J298M24M202Q578l101m742J976j718l00M925Q45M804J928l152p805q967
9518I046J804K764m447p22j996l4O973L996q8J261L75j322j308J00M114M800L20
$$ plain form
9501 25636 24230 20495 14247 16358 15807 12665 13676 10259 7091 14326 17761 12053 10829 10531 5258
9486 5258 7855 17016 20883 14563 7887 8354 12332 12876 11920 4279 5347 17127 17329 13097 6519 9038
9470 9038 20071 24993 21473 19660 21398 18376 17787 19480 15815 11387 12797 17216 19986 16691 20015
9455 20015 18272 12097 8271 15746 15632 16338 17584 15372 15062 8012 6533 9468 14649 12479 13541
9440 13541 12073 7405 2966 9080 8350 10143 16639 20571 25214 21633 22765 24149 27163 31616 32968
9425 32968 25069 19260 14181 10319 12134 17951 16048 9777 6960 1317 9156 9659 14674 16165 18894
9410 18894 17828 20681 10713 8862 13227 10337 9898 9918 6352 5970 12761 13229 17724 26665 21979 18520
9394 18520 17226 21077 21073 16755 14903 20165 26285 27096 19597 17913 16803 19453 23710 29199 25708 20972
$$ packed form
9501B5636j406l735o248K111n51l142J011l417l168P235L435n708j224k98n273
9486E258K597R161L867o320o676M67L978N44r56p641J068J1780K02m232o578K519
9470I038J1033M922l520j813J738l022n89J693l665m428J410M419K770l295L324
9455B0015j743o175l826P475j14P06J246k212l10p050j479K935N181k170J062
9440A3541j468m668m439O114p30J793O496L932M643l581J132J384L014M453J352
9425C2968p899n809n079l862J815N817j903o271k817n643P839N03N015J491K729
9410A8894j066K853r968j851M365k890m39K0l566l82O791M68M495Q941m686l459
9394A8520j294L851mm318j852N262O120Q11p499j684j110K650M257N489l491m736
$$ plain form
9378 20972 24963 20255 13812 15646 21768 20763 16701 20421 22437 14203 11265 9233 5815 16700
9364 16700 19046 21074 20464 19800 17458 18468 20850 19420 22669 21642 22897 22744 19074 24646 27369
9349 27369 28969 26494 14219 16724 26476 31439 38073 48874 67990 92492 110762 122139 116587
9336 116587 98181 79225 66271 55926 44527 32380 26338 28830 28377 22527 21365 21199 21679 24540
9322 24540 21545 27243 28348 27507 29478 28575 25227 28010 26604 22658 18069 13219 12445 14342 18105
9307 18105 17511 22110 26308 30278 34124 30368 23150 24177 28216 27068 27306 24245 28320 36629 34920
9292 34920 30753 23069 22953 22560 24028 23780 26044 23478 21501 22761 22915 28574 28112 27812 30926 28092
9276 28092 21317 16590 15398 20187 22145 24002 23954 18678 16112 13459 20028 20540 19065 24231 25796
$$ packed form
9378B0972L991m708o443J834O122j005m062L720K016q234k938k032l418J0885
9364A6700K346K028o10o64k342J010K382j430L249j027J255j53l670N572K723
9349B7369J600k475j2275K505R752M963O634J0801J9116K4502J8270J1377n552
9336A16587j8406j8956j2954j0345j1399j2147o042K492m53n850j162j66M80K861
9322B4540k995N698J105q41J971r03l348K783j406l946m589m850p74J897L763
9307A8105n94M599M198L970L846l756p218J027M039j148K38l061M075Q309j709
9292C4920m167p684j16l93J468k48K264k566j977J260J54N659m62l00L114k834
9276B8092o775m727j192M789J958J857m8n276k566k653O569N12j475N166J565
$$ plain form
9261 25796 26091 27074 28333 31265 32679 32961 30279 28920 27475 28965 35304 39813 33989 35274 31877
9246 31877 22626 19726 26717 31517 33509 32576 34734 36185 31861 26650 22984 23029 29186 25926 21687
9231 21687 20323 16359 21527 20626 19485 24516 28339 33082 35452 36835 31740 28239 30677 33418 35324
9216 35324 36848 39373 39614 36420 38952 45940 46105 39508 32004 32902 37885 41985 47456 46203 44219
9201 44219 38248 37300 44910 57287 56868 52850 44906 35982 36791 40899 32425 29481 33574 37372 39718
9186 39718 44414 38149 34931 37660 40323 44495 50485 44928 41274 45240 43803 43222 44113 49316 54519
9171 54519 53720 61799 63591 58996 62074 62207 61093 60272 58073 55203 51896 46066 36101 29896 33901
9156 33901 34431 35374 38908 35573 45324 50304 52759 48067 41713 43874 39407 33030 32417 39459 45561
$$ packed form
9261B5796K95R83J259K932J414K82k682j359j445J490O339M509n824J285l397
9246C1877r251k900O991M800J992r33K158J451m324n211l666M5O157l260m239
9231B1687j364l964N168r01j141N031L823M743K370J383n095l501K438K741J906
9216C5324J524K525K41l194K532O988J65o597p504Q98M983M100N471j253j984
9201D4219n971r48P610J2377m19m018p944q924Q09M108q474k944M093L798K346
9186C9718M696o265l218K729K663M172N990n557l654L966j437n81Q91N203N203
9171E4519p99Q079J792m595L078J33j114q21k199k870l307n830r965o205M005
9156C3901N30R43L534l335R751M980K455m692o354K161m467o377o13P042O102
$$ plain form
9141 45561 44204 40831 40356 44431 47211 57389 62609 66258 68840 69668 68893 64728 69037 72179 71066
9126 71066 68178 61996 58504 54546 54353 51818 43826 37482 40170 38002 42948 46837 54340 48548 50036
9111 50036 52418 57083 53042 49847 55935 58090 55737 56060 54575 58197 63847 69867 70986 68358 61759
9096 61759 54639 50601 59944 61395 66888 63372 59274 55151 54636 53991 56005 50271 40646 37117 41794
9081 41794 42644 43435 49404 47581 46153 42158 47957 48884 51847 51812 55085 57007 56678 54251 50178 52030
9065 52030 53019 60944 62527 63046 73592 81204 84020 81007 82940 87520 86638 76239 63217 58881 56565
9050 56565 59081 65657 65943 68795 68603 68133 63563 58334 50833 47440 54799 58103 58760 57997 56178 53659
9034 53659 51971 50745 48394 55511 59631 59957 58324 65442 70667 68544 70702 77179 76893 76989 78661 80401
$$ packed form
9141D5561j357l373m75M075K780J0178N220L649K582Q28p75m165M309L142j113
9126G1066k888o182l492l958j93k535p992o344K688k168M946L889P503n792J488
9111E0036K382M665m041l195O088K155k353L23j485L622N650O020J119k628o599
9096F1759p120m038R343J451N493l516m098m123n15o45K014n734r625l529M677
9081D1794Q50P91N969j823j428l995N799R27K963l5L273J922l29k427m073J852
9065E2030R89P925J583N19J0546P612K816l013J933M580q82j0399j3022m336k316
9050E6565K516O576K86K852j92m70m570n229p501l393P359L304O57p63j819k519
9034E3659j688j226k351P117M120L26j633P118N225k123K158O477k86R6J672J740
$$ plain form
9018 80401 74650 68047 63308 57235 53292 55001 57021 59971 63715 62179 65206 67961 65753 64388 58122
9003 58122 57065 55459 55285 54453 55660 69436 70253 68300 70298 71638 71744 77101 79622 79304 77359 75203
8987 75203 74890 69942 69876 73883 73910 72319 65235 62585 66440 73448 70698 69839 64113 63257 74218 75563
8971 75563 75768 79521 72559 73052 69646 73028 74993 71599 64829 64732 66244 67256 64805 56753 55498 63148
8955 63148 69196 75853 76493 71509 64794 60453 68447 75146 80012 85372 87656 86856 84299 83695 83222 77152
8939 77152 73388 73789 76104 82280 81566 84479 86038 86341 78650 77529 79972 77387 75005 79783 86786
8924 86786 79452 83897 92407 92250 90301 87029 86466 84738 89999 92884 91288 93072 94212 87600 80733
8909 80733 87778 92588 94566 90459 89201 87444 88348 87069 87820 82482 86174 90498 91057 91448 87955 84160
$$ packed form
9018H0401n751o603m739o073l943J709K020K950L744j536L027K755k208j365o266
9003E8122j057j606j74q32J207J3776Q17j953J998J340J06N357K521l18j945k156
8987G5203l13m948o6M007K7j591p084k650L855P008k750q59n726q56J0961J345
8971G5563K05L753o962M93l406L382J965l394o770r7J512J012k451q052j255P650
8955F3148O048O657O40m984o715m341P994O699M866N360K284q00k557o04m73o070
8939G7152l764M01K315O176p14K913J559L03p691j121K443k585k382M778P003
8924H6786p334M445Q510j57j949l272n63j728N261K885j596J784J140o612o867
8909H0733P045M810J978m107j258j757R04j279P51n338L692M324N59L91l493l795
$$ plain form
8893 84160 87020 81817 80560 85969 88149 95312 97092 94105 93668 93007 93434 94686 101637 100921 101882 103757
8877 103757 102814 105429 110628 116463 104802 96990 100828 101175 107106 108582 100301 102406 102375 102406 103926 111180
8861 111180 113327 110766 112802 119070 116332 118003 129034 127827 121950 122699 117824 121698 131086 134697
8847 134697 134048 125415 122821 124548 122145 126105 126820 127361 126295 120875 118716 121392 132118 135413 134145
8832 134145 137071 134093 131254 135912 129682 123570 127020 136655 146673 145998 142841 137396 129615 136641
8818 136641 146422 146918 142893 144844 151026 147474 143993 146122 148973 151632 157233 158052 162721 166610 168179
8803 168179 168745 165757 163204 166314 171341 174045 168556 164143 169860 173699 179363 177936 181183 184856 180207
8788 180207 177136 174797 177118 182367 186769 194956 195744 197467 198273 193232 196439 200865 202977 210714 217687
$$ packed form
8893H4160K860n203j257N409K180P163J780k987m37o61M27J252O951p16R61J875
8877A03757r43K615N199N835j1661p812L838L47N931J476q281K105l1L1J520P254
8861A11180K147k561K036O268k738J671J1031j207n877P49m875L874R388L611
8847A34697o49q633k594J727k403L960P15N41j066n420k159K676J0726L295j268
8832A34145K926k978k839M658o230o112L450R635J0018o75l157n445p781P026
8818A36641R781M96m025J951O182l552l481K129K851K659N601Q19M669L889J569
8803A68179N66k988k553L110N027K704n489m413N717L839N664j427L247L673m649
8788A80207l071k339K321N249M402Q187P88J723Q06n041L207M426K112P737O973
$$ plain form
8773 217687 224129 229846 229013 228782 227256 228192 236378 240801 242241 243574 249066 251400 248247 251317 252586
8758 252586 251230 251418 259549 264996 261844 265644 267772 267248 273651 273263 280067 288611 295415 293834 293491
8743 293491 295249 299786 308729 316307 318642 322044 329001 340006 343939 338987 342851 346707 349789 353535
8729 353535 359449 367846 371246 367583 364914 373373 386189 387590 393982 399262 401198 406577 407292 410763
8715 410763 418817 425114 429806 428990 436996 447368 453167 449300 453621 469457 478891 486697 492232 497396
8701 497396 505475 507812 509742 516668 523167 529802 539000 544660 554362 561675 563904 575459 581225 588466
8687 588466 597752 607509 620950 627861 637151 650899 658656 666961 677570 688009 699905 710635 719609
8674 719609 734780 753065 771897 789684 801719 811901 831843 850776 866351 882698 898994 910568
$$ packed form
8773B17687O442N717q33k31j526R36Q186M423J440J333N492K334l153L070J269
8758B52586j356J88Q131N447l152L800K128n24O403l88O804Q544O804j581l43
8743B93491J758M537Q943P578K335L402O957J1005L933m952L864L856L082L746
8729C53535N914Q397L400l663k669Q459J2816J401O392N280J936N379P15L471
8715D10763Q054O297M692q16Q006J0372N799l867M321J5836R434P806N535N164
8701D97396Q079K337J930O926O499O635R198N660R702P313K229J1555N766P241
8687E88466R286R757J3441O911R290J3748P757Q305J0609J0439J1896J0730Q974
8674G19609J5171J8285J8832J7787J2035J0182J9942J8933J5575J6347J6296J1574
$$ plain form
8662 910568 931692 949402 968933 995668 1021865 1048142 1068681 1090296 1112884 1126361 1141848 1159622
8650 1159622 1180519 1203238 1216694 1229119 1251304 1267259 1287828 1314432 1346231 1369344 1394333
8639 1394333 1418961 1449282 1480305 1503007 1532530 1569370 1609466 1651071 1694411 1737506 1785270
8628 1785270 1826917 1870680 1916966 1971357 2028572 2083711 2142836 2205531 2276741 2343783 2410622
8617 2410622 2477661 2547840 2631034 2709079 2790425 2886169 2983146 3080599 3173562 3281682 3407156
8606 3407156 3534628 3660330 3794592 3941526 4093490 4255198 4430007 4610804 4797953 5002975
8596 5002975 5220245 5456744 5707314 5975634 6260824 6563990 6897769 7248463 7631469 8049220
8586 8049220 8492595 8973465 9497879 10063400 10681463 11349771 12082650 12880141 13753755 14704752
$$ packed form
8662I10568K1124J7710J9531K6735K6197K6277K0539K1615K2588J3477J5487J7774
8650A159622K0897K2719J3456J2425K2185J5955K0569K6604L1799K3113K4989
8639A394333K4628L0321L1023K2702K9523L6840M0096M1605M3340M3095M7764
8628A785270M1647M3763M6286N4391N7215N5139N9125O2695P1210O7042O6839
8617B410622O7039P0179Q3194P8045Q1346R5744R6977R7453R2963J08120J25474
8606C407156J27472J25702J34262J46934J51964J61708J74809J80797J87149K05022
8596E002975K17270K36499K50570K68320K85190L03166L33779L50694L83006M17751
8586H049220M43375M80870N24414N65521O18063O68308P32879P97491Q73614R50997
$$ plain form
8576 14704752 15752127 16898022 18151904 19533937 21047898 22710148 24527209 26507637
8568 26507637 28659288 30992477 33507265 36184673 38997287 41912913 44878289 47802532
8560 47802532 50585393 53103027 55242002 56884784 57929940 58321397 58031552 57073182 55516858
8551 55516858 53466811 51038149 48365836 45546151 42682211 39857330 37129562 34533697
8543 34533697 32079175 29791013 27675922 25724954 23942483 22305806 20809280 19441148
8535 19441148 18191449 17049088 16007927 15053404 14169344 13359508 12611092 11922791 11299213
8526 11299213 10720099 10173929 9671030 9197371 8758701 8346432 7958166 7602008 7263552
8517 7263552 6950556 6657273 6381367 6120374 5876427 5648658 5422323 5215734 5022971 4835692
$$ packed form
8576A4704752J047375J145895J253882J382033J513961J662250J817061J980428
8568B6507637K151651K333189K514788K677408K812614K915626K965376K924243
8560D7802532K782861K517634K138975J642782J045156L91457k89845r58370j556324
8551E5516858k050047k428662k672313k819685k863940k824881k727768k595865
8543C4533697k454522k288162k115091j950968j782471j636677j496526j368132
8535A9441148j249699j142361j041161r54523q84060q09836p48416o88301o23578
8526A1299213n79114n46170n02899m73659m38670m12269l88266l56158l38456
8517G263552l12996k93283k75906k60993k43947k27769k26335k06589j92763j87279
$$ plain form
8507 4835692 4668921 4508257 4349660 4195379 4053343 3913412 3787664 3665247 3552660 3439545
8497 3439545 3328879 3235025 3143154 3048167 2953178 2872403 2789966 2715439 2638235 2563390 2490121
8486 2490121 2432441 2371310 2304314 2249513 2196951 2142836 2084031 2031253 1987905 1939396 1891011
8475 1891011 1849430 1804787 1757350 1714890 1683888 1648850 1614544 1584299 1557741 1523219 1490935
8464 1490935 1464011 1431999 1403082 1379689 1355894 1333992 1321818 1303056 1270002 1236149 1212751
8453 1212751 1188944 1167680 1142834 1120387 1093339 1066131 1039672 1025184 1011137 986277 966255
8442 966255 944092 926640 903965 887475 874284 854125 833974 820205 803300 788393 779044 765407
8430 765407 750624 733499 717910 705484 692654 683607 675347 661347 645330 629170 620021 616252
$$ packed form
8507D835692j66771j60664j58597j54281j42036j39931j25748j22417j12587j13115
8497C439545j10666r3854r1871r4987r4989q0775q2437p4527p7204p4845p3269
8486B490121n7680o1131o6996n4801n2562n4115n8805n2778m3348m8509m8385
8475A891011m1581m4643m7437m2460l1002l5038l4306l0245k6558l4522l2284
8464A490935k6924l2012k8917k3393k3795k1902j2174j8762l3054l3853k3398
8453A212751k3807k1264k4846k2447k7048k7208k6459j4488j4047k4860k0022
8442I66255k2163j7452k2675j6490j3191k0159k0151j3769j6905j4907r349j3637
8430G65407j4783j7125j5589j2426j2830r047q260j4000j6017j6160r149l769
$$ plain form
8418 616252 603830 593270 588185 582624 574815 560166 548728 538446 525777 515952 511728 506315 503696
8405 503696 491639 482966 482356 481367 476582 469482 467544 462848 460605 452553 439854 435182 427133 421990
8391 421990 418981 408011 395684 389947 385942 376634 370082 366939 359374 358143 354397 353043 357482 360130
8377 360130 353034 346432 343682 348713 354824 346556 344187 345042 338112 339077 342876 344808 348261 339113 329890
8362 329890 328376 332415 325206 320068 316631 318789 313269 311483 320172 315000 303640 301957 298646 295145
8348 295145 296309 291906 292247 292322 288509 288947 288041 278824 268116 265313 263964 258143 260016 256619 248517
8333 248517 244040 245712 250271 248371 246098 242513 238778 230303 229362 229956 224805 221015 214021 217064 217748
8318 217748 215388 219376 222869 219866 215001 204696 202981 195339 194845 195659 195539 193996 196055 199886 193780
$$ packed form
8418F16252j2422j0560n085n561p809j4649j1438j0282j2669r825m224n413k619
8405E03696j2057q673o10r89m785p100j938m696k243q052j2699m672q049n143
8391D21990l009j0970j2327n737m005r308o552l143p565j231l746j354M439K648
8377C60130p096o602k750N031O111q268k369Q55o930R65L799J932L453r148r223
8362C29890j514M039p209n138l437K158n520j786Q689n172j1360j683l311l501
8348B95145J164m403L41P5l813M38r06r217j0708k803j349n821J873l397q102
8333B48517m477J672M559j900k273l585l735q475r41N94n151l790o994L043O84
8318B17748k360L988L493l003m865j0305j715p642m94Q14j20j543K059L831o106
$$ plain form
8303 193780 188271 185423 180873 181064 179851 178816 178010 175850 172475 173750 173810 168911 167290 165142 163523
8288 163523 163769 162963 168025 164540 160020 164052 163089 159063 157015 150196 147926 146274 140841 141883 138937
8273 138937 136134 128868 126687 127028 128907 129968 132334 130351 127165 125267 113238 105374 111675 125688
8259 125688 135788 134570 130663 131263 134336 128844 126155 120687 110362 114758 120431 120025 113599 115192
8245 115192 111790 107652 107824 107114 104776 101109 100316 105680 103352 102536 109137 107498 106403 107862 102785
8230 102785 96847 98766 97924 96087 95971 89721 86108 83190 85222 93102 96343 94979 86732 83964 89631
8215 89631 88373 85933 86834 85786 88618 89229 94112 96818 90644 86313 84847 93237 95233 89202 83597
8200 83597 80248 79478 78384 76797 81177 87119 80453 83151 82916 79706 75082 77455 78628 82633 79584
$$ packed form
8303A93780n509k848m550J91j213j035q06k160l375J275O0m899j621k148j619
8288A63523K46q06N062l485m520M032r63m026k048o819k270j652n433J042k946
8273A38937k803p266k181L41J879J061K366j983l186j898j2029p864O301J4013
8259A25688J0100j218l907O00L073n492k689n468j0325M396N673m06o426J593
8245A15192l402m138J72p10k338l667p93N364k328q16O601j639j095J459n077
8230A02785n938J919q42j837j16o250l613k918K032P880L241j364q247k768N667
8215H9631j258k440R01j048K832O11M883K706o174m331j466Q390J996o031n605
8200H3597l349p70j094j587M380N942o666K698k35l210m624K373J173M005l049
$$ plain form
8185 79584 83069 81545 75053 72746 70676 76806 84136 80101 72098 67585 66308 66351 67066 69690 64923
8170 64923 66967 66135 66367 68603 70801 68080 72152 73181 72369 69804 67540 65884 62768 64992 68839
8155 68839 73023 71066 71322 69635 77850 81204 77204 77170 73635 69401 70347 65949 57015 54384 60935 68361
8139 68361 71750 68403 62033 59881 59973 60266 62511 62303 62832 61055 57874 55315 52013 51340 51155 43829
8123 43829 42336 46729 44026 46328 46158 45403 44292 47627 51798 53778 53794 55608 59474 56696 60876 65233
8107 65233 59301 52686 60903 59611 58283 59052 51100 43553 46533 57897 63769 58728 53854 50143 51646
8092 51646 54030 51858 55015 59360 59831 55639 48975 45074 48759 49398 50562 48687 47681 50290 47459
8077 47459 43375 39745 38385 47977 55197 51713 51108 50722 49793 53677 50638 45651 44144 40850 46201
$$ packed form
8185G9584L485j524o492k307k070O130P330m035q003m513j277M3P15K624m767
8170F4923K044q32K32K236K198k721M072J029q12k565k264j656l116K224L847
8155F8839M184j957K56j687Q215L354m000l4l535m234R46m398q934k631O551P426
8139F8361L389l347o370k152R2K93K245k08N29j777l181k559l302o73j85p326
8123D3829j493M393k703K302j70p55j111L335M171J980J6J814L866k778M180M357
8107F5233n932o615Q217j292j328P69p952p547K980J1364N872n041m874l711J503
8092E1646K384k172L157M345M71m192o664l901L685O39J164j875j006K609k831
8077D7459m084l630j360R592P220l484o05l86r29L884l039m987j507l294N351
$$ plain form
8062 46201 44657 38237 36000 38860 42268 45799 48602 51508 59457 59323 61925 58153 43716 42806 51368
8047 51368 52548 48756 46478 38251 36319 32749 33751 35676 27679 27258 30654 30669 32532 40832 46165
8032 46165 50842 43636 36515 34674 37369 32431 35583 38734 38218 36370 36874 37895 40702 42854 34766
8017 34766 36785 49126 54947 48680 44101 40153 41131 43037 46206 48093 44544 44114 41705 36100 36626
8002 36626 44933 53641 52890 43997 36712 38507 46331 45439 41443 45977 44194 42733 39886 36014 40433
7987 40433 48417 55223 50534 45163 43046 43818 41776 31521 27338 31946 31734 29886 31755 32213 38927
7972 38927 41807 47101 50052 51595 47346 49478 50558 48356 48805 45991 46961 43077 46680 47361 47667 48325
7956 48325 36703 32291 32123 28718 33649 31976 27980 31771 39892 46168 44428 43045 40319 30478 28837
$$ packed form
8062D6201j544o420k237K860L408L531K803K906P949j34K602l772j4437r10Q562
8047E1368J180l792k278q227j932l570J002J925p997m21L396J5J863Q300N333
8032D6165M677p206p121j841K695m938L152L151n16j848N04J021K807K152q088
8017C4766K019J2341N821o267m579l948R78J906L169J887l549m30k409n605N26
8002C6626Q307Q708p51q893p285J795P824q92l996M534j783j461k847l872M419
7987D0433P984O806m689n371k117P72k042j0255m183M608k12j848J869M58O714
7972C8927K880N294K951J543m249K132J080k202M49k814R70l884L603O81L06O58
7956D8325j1622m412j68l405M931j673l996L791Q121O276j740j383k726r841j641
$$ plain form
7941 28837 32363 37471 44299 42334 46903 46401 47623 61443 54740 48144 42406 43494 49684 49609 47404
7926 47404 42492 44209 44651 51323 58821 59031 53850 54887 55614 57112 55056 48368 51004 51698 45070 38354
7910 38354 35936 36951 39438 40956 44152 45264 43319 37606 35548 34813 41315 43274 48338 56714 58364
7895 58364 52888 51753 54537 62105 65929 57812 52265 52467 51906 53923 57345 61348 57167 47146 47749
7880 47749 51066 46680 34391 27058 32748 37725 38590 43390 42536 45832 46529 48108 40759 42091 42947
7865 42947 46469 48358 39729 40922 41483 39337 43227 38984 37571 42478 51062 49987 47641 47318 47052
7850 47052 44219 43894 48640 48016 44659 43570 44763 44042 45905 46854 38865 35087 39716 37135 38947 42383
7834 42383 44117 37712 35223 35394 36503 38556 38336 38948 42996 42760 37146 29757 25471 20198 20077 22155
$$ packed form
7941B8837L526N108O828j965M569n02J222J3820o703o596n738J088O190p5k205
7926D7404m912J717M42O672P498K10n181J037P27J498k056o688K636O94o628o716
7910C8354k418J015K487J518L196J112j945n713k058p35O502J959N064Q376J650
7895E8364n476j135K784P568L824q117n547K02n61K017L422M003m181j0021O03
7880D7749L317m386j2289p333N690M977Q65M800q54L296O97J579p349J332Q56
7865D2947L522J889q629J193N61k146L890m243j413M907Q584j075k346l23k66
7850D7052k833l25M746o24l357j089J193p21J863R49p989l778M629k581J812L436
7834D2383J734o405k489J71J109K053k20O12M048k36n614p389m286n273j21K078
$$ plain form
7818 22155 26254 25217 25313 23750 26235 29926 27677 28886 28418 26844 24516 23850 26484 22844 18424 17460
7802 17460 15196 16535 18897 18348 25987 24830 27608 25786 34019 34294 31870 26542 26085 32292 32160 29142
7786 29142 28784 28558 32398 35915 34018 24862 24070 24452 24282 26117 27832 23369 23407 31205 32037 25155 19907
7769 19907 19582 17706 15229 11193 13837 17338 28887 24231 18607 15664 15026 15736 17080 21770 24210
7754 24210 15486 12874 16514 10096 8777 13645 11933 6924 5504 8906 9920 12438 21553 23275 19047
7739 19047 18815 19765 18898 21609 18222 18625 12672 11935 20604 21999 20042 22303 18756 20537 19239 8677
7723 8677 8442 12122 9311 12051 14199 13447 16925 14932 21367 24349 27212 27557 27258 29051 27906 21460
7707 21460 16704 14694 13032 12583 14805 12617 13742 12727 9454 13383 13647 13677 11373 8552 8181 6337
$$ packed form
7818B2155M099j037R6j563K485L691k249J209m68j574k328o66K634l640m420r64
7802A7460k264J339K362n49P639j157K778j822Q233K75k424n328m57O207j32l018
7786B9142l58k26L840L517j897r156p92L82j70J835J715m463L8P798Q32o882n248
7769A9907l25j876k477m036K644L501J1549m656n624k943o38P10J344M690K440
7754B4210q724k612L640o418j319M868j712n009j420L402J014K518R115J722m228
7739A9047k32R50q67K711l387M03n953p37Q669J395j957K261l547J781j298j0562
7723H677k35L680k811K740K148p52L478j993O435K982K863L45k99J793j145o446
7707B1460m756k010j662m49K222k188J125j015l273L929K64L0k304k821l71j844
$$ plain form
7691 6337 9971 12796 14027 11083 7820 6902 7034 9134 8360 499 6920 8747 7959 4455 3269 3983
7675 3983 7774 10574 12526 12113 14471 16047 15279 16368 16792 16534 7267 2470 1335 -39 18 3254
7659 3254 8350 2462 -3714 1843 5232 2117 6338 10083 5096 4460 14090 11835 10770 14622 18365
7644 18365 19487 15537 6688 -1031 -2300 4964 10993 3494 -676 2916 1520 5282 9553 736 688
7629 688 8830 7482 1115 -6497 -4835 -432 -1939 -3382 5406 11915 10564 6260 9364 7367 2892
7614 2892 6211 12963 16032 18803 17102 12770 10544 12841 14446 15020 14200 13179 8195 10786 13734
7599 13734 12714 16000 24653 18298 13182 12347 9038 10801 18533 20770 18612 19485 17696 12003 3654
7584 3654 2806 6323 12158 10026 12033 10149 8018 7534 11485 11218 10916 10670 6926 3330 6942 14620
$$ packed form
7691F337L634K825J231k944l263r18J32K100p74p861O421J827p88l504j186P14
7675C983L791K800J952m13K358J576p68J089M24k58r267m797j135j374N7L236
7659C254N096n888o176N557L389l115M221L745m987o36R630k255j065L852L743
7644A8365J122l950q849p719j269P264O029p499m170L592j396L762M271q817m8
7629F88Q142j348o367p612J662M403j507j443Q788O509j351m304L104j997m475
7614B892L319O752L069K771j701m332k226K297J605N74q20j021m984K591K948
7599A3734j020L286Q653o355n116q35l309J763P732K237k158Q73j789n693q349
7584C654q48L517N835k132K007j884k131m84L951k67l02k46l744l596L612P678
$$ plain form
7568 14620 15813 16435 14762 10773 16053 13588 10028 6242 6380 1314 -8915 -4702 -1680 -2620 946
7553 946 3278 3558 3553 6546 3037 6459 10111 17709 12955 5924 -3643 -2618 -1753 -3133 2499 2458 5080
7536 5080 8585 9804 4850 4291 6687 14798 17302 8839 -1572 -3519 -4207 -3564 -4294 -4587 3197 8488
7520 8488 7284 10710 3008 -996 -641 943 -4844 -676 5987 7057 5516 5901 8942 8514 8300 8999
7504 8999 7946 6538 7246 5461 5388 10778 9005 11611 17252 20742 19601 16115 16924 10654 8436 16713
7488 16713 19607 11389 4275 8150 9487 4854 3457 6551 6740 10317 15353 17832 14106 10772 8731
7473 8731 10255 5740 -4 2820 5834 7653 12047 10658 7690 4036 1194 -2288 -3796 -4762 5835
7458 5835 13164 13596 9581 4525 3961 3182 2876 10301 8063 128 -1579 431 -2040 1916 2450 -239
$$ packed form
7568A4620J193O22j673l989N280k465l560l786J38n066j0229M213L022r40L566
7553I46K332K80nK993l509L422L652P598m754p031r567J025Q65j380N632m1K622
7536E080L505J219m954n59K396Q111K504q463j0411j947o88O43p30k93P784N291
7520H488j204L426p702m004L55J584n787M168O663J070j541L85L041m28k14O99
7504H999j053j408P08j785p3N390j773K606N641L490j141l486Q09o270k218Q277
7488A6713K894q218p114L875J337m633j397L094J89L577N036K479l726l334k041
7473H731J524m515n744K824L014J819M394j389k968l654k842l482j508r66J0597
7458E835P329M32m015n056n64p79l06P425k238p935j707K010k471L956N34k689
$$ plain form
7442 -239 -5147 -5645 3330 11038 16093 12900 10563 8239 378 -5888 -9476 -13164 -6538 -5403 -1289
7427 -1289 -1506 -8794 -5454 10990 13626 6640 1713 2565 4933 10141 10215 7850 5323 8026 4313 2418
7411 2418 1795 914 -1193 6616 11644 12425 12401 7632 622 -697 4839 6480 2705 -2117 2802 10861
7395 10861 11466 8924 230 -2597 -4777 -7847 -3566 -2056 1952 3174 196 -3227 1022 3196 3951
7380 3951 6066 6116 5803 1490 -1141 -2890 -2479 -7222 -8671 -6074 -9204 -10578 -3931 1126 -424 -3033
7364 -3033 -3394 -4559 1854 4377 3441 5087 1229 -4635 -11057 -10998 -6567 -8311 -8924 -9579 -11535 -404
7348 -404 8610 10303 8564 11222 11942 6640 -3170 -9006 -10118 -4541 3157 4414 1747 2425 4466 5717
7332 5717 -1067 -3014 1694 2868 314 3225 3645 5878 3834 2413 4654 -704 -2871 -6078 -4885
$$ packed form
7442b39m908m98Q975P708N055l193k337k324p861o266l588l688O626J135M114
7427a289k17p288L340J6444K636o986m927Q52K368N208P4k365k527K703l713j895
7411B418o23q81k107P809N028P81k4m769p010j319N536J641l775m822M919Q059
7395A0861O05k542q694k827k180l070M281J510M008J222k978l423M249K174P55
7380C951K115N0l13m313k631j749M11m743j449K597l130j374O647N057j550k609
7364c033l61j165O413K523r36J646l858n864o422N9M431j744o13o55j956J1131
7348d04R014J693j739K658P20n302r810n836j112N577P698J257k667O78K041J251
7332E717o784j947M708J174k554K911M20K233k044j421K241n358k167l207J193
$$ plain form
7317 -4885 -1651 6368 9459 11994 11008 11212 10808 8235 7882 7544 5794 8648 10445 5625 -1132 247
7301 247 1076 3195 -1780 -4982 358 937 989 -1311 -1568 -1514 -5206 -9886 -7248 -5695 -3276 -1441 5415
7284 5415 9064 10772 10090 17114 18168 10604 3680 -228 -238 -1291 -695 -623 653 4255 3563 -2339 -1682
7267 -1682 4458 6208 9951 7992 10097 7942 10628 11085 8400 5150 9082 15928 11605 -2089 -4054
7252 -4054 -4899 -2767 -138 -459 -7492 -7509 -949 -2119 1696 12391 17334 9163 2300 1016 1589 4496
7236 4496 1826 4953 7912 8711 7584 1432 4586 8614 11075 9151 3481 322 1074 -949 -2436
7221 -2436 1930 -3098 -11522 -7517 -13268 -10372 -780 4702 5341 8584 4150 2858 5789 11547 11690
7206 11690 8802 3578 -901 -4939 -5040 -3177 -3403 -853 2340 2390 263 2111 312 3784 5924 4168
$$ packed form
7317d885L234Q019L091K535r86K04m04k573l53l38j750K854J797m820o757J379
7301B47Q29K119m975l202N340N79N2k300k57N4l692m680K638J553K419J835O856
7284E415L649J708o82P024J054p564o924l908j0j053N96P2J276L602o92n902O57
7267a682O140J750L743j959K105k155K686M57k685l250L932O846m323j3694j965
7252d054q45K132K629l21p033j7O560j170L815J0695M943q171o863j284N73K907
7236D496k670L127K959P99j127o152L154M028K461j924n670l159P52k023j487
7221b436M366n028q424M005n751K896R592N482O39L243m434j292K931N758J43
7206A1690k888n224m479m038j01J863k26K550L193N0k127J848j799L472K140j756
$$ plain form
7190 4168 8434 3038 -543 -3652 -3284 -1721 3803 10160 16851 13465 11162 5900 2552 2221 350
7175 350 1722 5569 4997 6941 6269 -571 -5966 -6240 -2228 -1982 1186 4435 6560 8777 8565 8586 2269
7158 2269 -3441 -427 6988 11090 4386 937 -227 1593 2045 -880 -2529 -1981 -142 174 3520 3838
7142 3838 5641 7195 9608 10928 3934 -1512 -4788 -4409 -8086 -8074 -1909 1620 559 4310 6302 9447
7126 9447 10976 8631 5532 6247 6223 8548 15471 14743 12586 3486 -7853 -10176 -4568 -330 -106 -2402
7110 -2402 -1451 -967 -1638 -4603 -5455 -825 -1200 5098 7333 12668 9258 1076 -8510 -9453 -2773 2601
7094 2601 5224 2759 6617 6358 4727 -2609 -8292 -1966 1212 -1927 -11390 -18480 -14266 -7876 -7004
7079 -7004 -9991 -12242 -12010 -10239 -569 1290 1463 7172 10985 8214 7754 4335 1757 -650 -2216 -1953
$$ packed form
7190D168M266n396l581l109L68J563N524O357O691l386k303n262l348l31j871
7175C50J372L847n72J944o72o840n395k74M012K46L168L249K125K217k12K1o317
7158B269n710L014P415M102o704l449j164J820M52k925j649N48J839L16L346L18
7142C838J803J554K413J320o994n446l276L79l677J2O165L529j061L751J992L145
7126I447J529k345l099P15k4K325O923p28k157r100j1339k323N608M238K24k296
7110b402R51M84o71k965q52M630l75O298K235N335l410q182r586r43O680N374
7094B601K623k465L858k59j631p336n683O326L178l139r463p090M214O390Q72
7079g004k987k251K32J771R670J859J73N709L813k771m60l419k578k407j566K63
$$ plain form
7063 -1953 -758 1960 351 368 3100 3359 884 -2927 -4032 -7099 -8266 -7513 -4183 -1158 1970 4113
7047 4113 3985 -385 -3843 -5421 -11326 -6907 273 1662 3341 5203 -348 -1632 533 -4672 -6218
7032 -6218 -4918 -5800 2989 6120 3369 4782 4920 -6261 -6026 2260 133 -4262 397 3457 2995 1648
7016 1648 -3378 -2819 -2183 -5209 -7321 349 2327 -2768 -7242 -5124 -4118 -2093 -8772 -14286 -12936
7001 -12936 -12591 -12638 -6320 -4538 -5669 -6399 -3198 857 626 2255 4026 1640 -629 -3714 -7438 -15435
6985 -15435 -10370 -7441 -12807 -11810 -8296 -3580 -4215 -2801 -4694 -3233 -679 -2531 -4241 -3411 -2327
6970 -2327 169 2754 5829 8451 4040 329 -2649 -5262 -3692 -1157 6451 3042 42 -211 1993
6955 1993 5451 1871 2156 1499 -1090 -7578 -14607 -5798 -3805 -3234 -811 -1845 -1595 -5290 -2482 -2450
$$ packed form
7063a953J195K718j609J7K732K59k475l811j105l067j167P53L330L025L128K143
7047D113j28m370l458j578n905M419P180J389J679J862n551j284K165n205j546
7032f218J300q82Q789L131k751J413J38j1181K35Q286k127m395M659L060m62j347
7016A648n026N59O36l026k112P670J978n095m474K118J006K025o679n514J350
7001a2936L45m7O318J782j131p30L201M055k31J629J771k386k269l085l724p997
6985a5435N065K929n366R97L514M716o35J414j893J461K554j852j710Q30J084
6970b327K496K585L075K622m411l711k978k613J570K535P608l409l000k53K204
6955A993L458l580K85o57k589o488p029Q809J993N71K423j034K50l695K808L2
$$ plain form
6939 -2450 -7078 -7237 -2565 1197 8944 17258 15726 17745 12416 6564 2708 4622 5633 7004 8642
6924 8642 4705 3378 -589 -168 -2883 -10 4516 7163 7327 -595 -10982 -17081 -15587 -8437 -1024
6909 -1024 2728 3571 4198 6054 955 65 -254 147 -4092 -6802 1857 8377 12592 7415 7357 8121 6332
6892 6332 1905 -2729 -3814 -3177 1182 4749 3208 2455 2867 -2264 -1674 744 3625 3849 -4043 -8987
6876 -8987 -8554 -5618 -1702 -428 1653 5662 9277 17875 11524 4634 5757 8015 9967 8762 10871
6861 10871 18147 17840 13318 10780 9170 7591 5299 -1914 -4623 -8434 -8042 -4907 3190 4802 2441
6846 2441 1657 1803 905 -1743 -6881 -2214 4740 5063 12582 9499 4643 -913 550 10894 12111 6148
6830 6148 2897 -3135 -3380 888 7623 7450 1435 -993 -6973 -11180 -9071 -8067 -9519 -8779 -5627 1826
$$ packed form
6939b450m628j59M672L762P747Q314j532K019n329n852l856J914J011J371J638
6924H642l937j327l967M21k715K873M526K647J64p922j0387o099J494P150P413
6909a024L752Q43O27J856n099q90l19M01m239k710Q659O520M215n177n8P64j789
6892F332m427m634j085O37M359L567j541p53M12n131N90K418K881K24p892m944
6876h987M33K936L916J274K081M009L615Q598o351o890J123K258J952j205K109
6861A0871P276l07m522k538j610j579k292p213k709l811L92L135Q097J612k361
6846B441p84J46q98k648n138M667O954L23P519l083m856n556J463J0344J217n963
6830F148l251o032k45M268O735j73o015k428n980m207K109J004j452P40L152P453
$$ plain form
6814 1826 11394 9769 4872 1767 -3762 -12527 -10581 -2726 -3496 -9340 -2290 -634 -3010 -2242 -2387 -1791
6798 -1791 6378 8232 4539 5699 3146 4490 6671 3582 8544 7141 4639 -1172 -4297 -9367 -1445
6783 -1445 1622 -5547 -12810 -15200 -11224 -4084 -4792 -2322 498 -6382 -10933 -3473 -3712 -4492 258 18
6767 18 1252 12579 6098 -2685 -5115 -5493 3353 12612 13905 18288 14557 15667 13364 10315 11991
6752 11991 7765 4137 8246 5837 854 6786 9636 -533 -7910 -10324 -12554 -11486 -9354 -3954
6738 -3954 3418 -149 -531 3477 -3945 -7279 -3122 -2565 998 -172 -327 -609 2288 7541 8421 5849
6722 5849 5753 2258 -2803 2001 7330 4846 4646 9733 10846 11016 11408 16079 10783 5268 -2703 -498
6706 -498 6848 7565 -3336 -12072 -10482 -7217 -7251 -2046 -3944 -1256 293 5132 845 -3414 -4174 5010
$$ packed form
6814A826R568j625m897l105n529q765J946P855p70n844P050J656k376P68j45N96
6798a791Q169J854l693J160k553J344K181l089M962j403k502n811l125n070P922
6783a445L067p169p263k390L976P140p08K470K820o880m551P460k39p80M750k40
6767A8J234J1327o481q783k430l78Q846R259J293M383l731J110k303l049J676
6752A1991m226l628M109k409m983N932K850j0169p377k414k230J068K132N400
6738c954P372l567l82M008p422l334M157N57L563j170j55k82K897N253Q80k572
6722E849r6l495n061M804N329k484k00N087J113J70L92M671n296n515p971K205
6706d98P346P17j0901q736J590L265l4N205j898K688J549M839m287m259p60R184
$$ plain form
6690 5010 8198 1569 412 6798 2258 3460 6813 -2854 -8894 -11432 -3689 1185 -4697 -6928 -4660
6675 -4660 1053 8045 11366 11345 12734 9429 10305 11858 18035 24350 23333 20967 24880 18265 7255
6660 7255 9743 10239 4565 1157 -1661 -4867 1815 3388 6882 6996 5549 -125 495 -2379 173 781
6644 781 -1583 2223 4577 8179 4445 950 -4713 -1681 783 -140 2892 2252 1476 -3534 -8163 -9938
6628 -9938 -10238 -18783 -15310 -7512 -2318 2347 1783 3992 5120 12644 14610 12447 8058 1592 17
6613 17 -714 1175 2567 -623 1738 734 -8777 -7708 3528 5135 6641 9477 163 -1396 4455
6598 4455 7257 -557 -5007 -4712 -1493 815 1393 2054 36 -1082 712 -398 1798 -712 -8077 -4538
6582 -4538 628 -65 -3775 -4634 104 3507 924 2602 3767 3448 1936 5274 1059 1601 -4720 -2066
$$ packed form
6690E010L188o629j157O386m540J202L353r667o040k538P743M874n882k231K268
6675d660N713O992L321k1J389l305Q76J553O177O315j017k366L913o615j1010
6660G255K488M96n674l408k818l206O682J573L494J14j447n674O20k874K552O08
6644G81k364L806K354L602l734l495n663L032K464r23L032o40p76n010m629j775
6628i938l00q545L473P798N194M665n64K209J128P524J966k163m389o466j575
6613A7p31J889J392l190K361j004r511J069J1236J607J506K836r314j559N851
6598D455K802p814m450K95L219K308N78O61k018j118J794j110K196k510p365L539
6582d538N166o93l710q59M738L403k583J678J165l19j512L338m215N42o321K654
$$ plain form
6566 -2066 -2130 -6881 -8154 -14052 -9960 -6006 -5706 -5853 -5553 -10383 -14351 -9454 -7621 -18840 -17333 -4010
6550 -4010 3984 6026 6874 4319 1561 3748 -2282 -3103 142 -3003 -1356 5888 -418 -2087 787
6535 787 2979 5119 5834 9207 10297 7497 4871 7992 4323 217 -6238 -9703 -4176 -2743 802
6520 802 9063 9052 1081 817 -6380 -16147 -14592 -10053 -14858 -15357 -9537 -11594 -6644 -8998 -8092 -4862
6504 -4862 -2508 -8820 -11177 -8189 -4142 2230 4725 -445 845 8272 7328 3479 3239 -3607 -9410
6489 -9410 -6599 -5017 -8241 -9583 -10186 -1917 525 -2281 -3613 1558 4866 -258 3221 -541 -1852
6474 -1852 -29 -1347 -762 -7926 -13811 -13984 -14034 -10631 -5384 -5440 -7011 -14785 -11282 -12477 -21745 -25950
6458 -25950 -17132 -8025 -3987 -5711 -5275 -1694 -4675 -6621 -8969 -9359 -5726 -959 6061 6892 1255
$$ packed form
6566b066o4m751j273n898M092L954L00j47L00m830l968M897J833j1219J507J3323
6550d010P994K042Q48k555k758K187o030q21L245l145J647P244o306j669K874
6535G87K192K140P15L373J090k800k626L121l669m106o455l465N527J433L545
6520H02Q261j1p971k64p197r767J555M539m805m99N820k057M950k354R06L230
6504d862K354o312k357K988M047O372K495n170J290P427r44l849k40o846n803
6489i410K811J582l224j342o03Q269K442k806j332N171L308n124L479l762j311
6474a852J823j318N85p164n885j73n0L403N247n6j571p774L503j195r268m205
6458b5950Q818R107M038j724M36L581k981j946k348l90L633M767P020Q31n637
$$ plain form
6443 1255 -6416 -2169 -2709 -4063 -4982 -12047 -14031 -4583 253 1192 -368 -4371 -8522 -3385 4250 6192
6427 6192 5360 11351 7334 386 -3788 -6046 -6629 849 4039 -1217 -3928 -6401 -5221 -3297 2015
6412 2015 -69 2797 4323 5801 12812 7303 923 -3947 -8610 -5174 -5147 -3857 -5040 -1603 1597
6397 1597 1330 979 1525 4378 4036 1882 1148 2100 3792 10486 6529 -1577 -5136 -3227 -3320 -3376 -464
6380 -464 -2585 -543 1316 -546 859 -8992 -17187 -13071 -9581 -9242 -4106 1060 2094 1080 332 -5012
6364 -5012 -9643 -17194 -16471 -8711 -4590 -8050 -13002 -13947 -16038 -19044 -17463 -17004 -18166 -14220 -5652 -633
6348 -633 -875 3433 4572 -1444 172 -1542 -65 -5376 -4853 -6746 -11046 -10516 -4980 3909 6010 824
6332 824 -2950 -8104 -8752 -10330 -6279 -4955 -7944 -10180 -9770 -14242 -9959 -2399 -1925 -1376 4513 -3625
$$ packed form
6443A255p671M247n40j354r19p065j984R448M836R39j560m003m151N137P635J942
6427F192q32N991m017o948m174k258n83P478L190n256k711k473J180J924N312
6412B015k084K866J526J478P011n509o380m870m663L436K7J290j183L437L200
6397A597k67l51N46K853l42k154p34R52J692O694l957q106l559J909r3n6K912
6380d64k121K042J859j862J405r851q195M116L490L39N136N166J034j014p48n344
6364e012m631p551P23P760M121l460m952r45k091l006J581M59j162L946Q568N019
6348f33k42M308J139o016J616j714J477n311N23j893m300N30N536Q889K101n186
6332H24l774n154o48j578M051J324k989k236M10m472M283P560M74N49N889q138
$$ plain form
6316 -3625 -7102 768 3852 8829 8870 -869 -844 881 -3141 -7262 -449 -5848 -9374 -15193 -12651 -3376
6300 -3376 1192 -5723 -4829 -5413 -11228 -8872 20 2348 2022 3000 -1359 -1675 2017 3702 6479 4093
6284 4093 5278 -812 -1199 3708 6662 2250 1488 5004 1499 -1982 -3724 132 1053 -4719 -9718 -11815
6268 -11815 -14957 -11361 -3922 -7948 -5156 -11213 -17059 -11229 -5800 -3456 -5575 -1207 2586 8528 10089
6253 10089 7876 8072 -2130 -2446 -6704 -7981 -14093 -17197 -5958 -4946 -2583 -2482 -5348 450 2003
6238 2003 258 690 4113 4280 -1941 -1067 3327 3719 1328 -3554 -6715 -9570 -3668 -1768 -4637 891
6222 891 -1873 -3997 402 1728 3611 176 -2313 -6284 -6089 -10737 -4494 4955 4207 1996 2888 4115
6206 4115 2328 100 732 7537 10210 2517 -3855 -6781 -2827 882 -5832 -8287 -6892 -9757 -12167
$$ packed form
6316c625l477P870L084M977M1r739K5J725m022m121O813n399l526n819K542R275
6300c376M568o915Q94n84n815K356Q892K328l26R78m359l16L692J685K777k386
6284D093J185o090l87M907K954m412p62L516l505l481j742L856R21n772m999k097
6268a1815l142L596P439m026K792o057n846N830N429K344k119M368L793N942J561
6253A0089k213J96j0202l16m258j277o112l104J1239J012K363J01k866N798J553
6238B003j745M32L423J67o221Q74M394L92k391m882l161k855N902J900k869N528
6222H91k764k124M399J326J883l435k489l971J95m648O243R449p48k211Q92J227
6206D115j787k228O32O805K673p693o372k926L954L709o714k455J395k865k410
$$ plain form
6191 -12167 -2453 1070 2244 523 -2137 -4052 -10976 -12036 -1644 -1095 -147 -981 3177 -1357 -5168
6176 -5168 -5219 -5111 -1426 1347 4187 -543 -2242 -341 2586 6013 11537 8382 964 -2956 -5087 -8860
6160 -8860 -4877 2621 3550 -662 318 -2315 -5494 -12508 -13110 -2508 1710 2793 -956 -1551 -3577 -5745
6144 -5745 -5788 -7021 -8623 -5880 -705 -2678 -2463 -3745 -6247 -1111 -3387 -2400 2205 388 167 -3123
6128 -3123 -4090 -830 -6457 -9726 -8756 -5379 -4129 -5231 -1877 -4364 -13608 -13801 -9676 -7719 -12284 -14712
6112 -14712 -15798 -10700 1199 2396 -1603 -7253 760 -4042 -5094 -1133 -3406 -5335 -10528 -13342
6098 -13342 -15938 -11773 -2373 -309 3225 2926 681 -2978 -3641 -2017 210 1105 -804 2027 -3328
6083 -3328 -7159 -3183 -6063 -8511 -9947 -6867 3505 3537 6364 7074 5472 4099 5073 7912 14250 15352
$$ packed form
6191a2167R714L523J174j721k660j915o924j060J0392N49R48q34M158m534l811
6176e168n1J08L685K773K840m730j699J901K927L427N524l155p418l920k131l773
6160h860L983P498R29m212R80k633l179p014o02J0602M218J083l749n95k026k168
6144e745m3j233j602K743N175j973K15j282k502N136k276R87M605j817k21l290
6128c123r67L260n627l269R70L377J250j102L354k487r244j93M125J957m565k428
6112a4712j086N098J1899J197l999n650Q013m802j052L961k273j929n193k814
6098a3342k596M165R400K064L534k99k245l659o63J624K227Q95j909K831n355
6083c328l831L976k880k448j436L080J0372L2K827P10j602j373R74K839O338J102
$$ plain form
6067 15352 4728 -1230 -5066 -9616 -10270 -5440 -228 6551 4947 3026 7740 2535 -1262 -4731 -2441
6052 -2441 3464 1579 5778 7318 5545 -3594 -3447 -187 -3241 -2421 -8027 -9435 -12298 -3303 -417
6037 -417 866 -876 -868 557 -439 -6186 -3632 -5537 -4394 3999 5363 4783 -1486 -4785 -2844 -853
6021 -853 660 4616 9499 6112 1392 700 -324 1268 9798 8522 7065 1200 -5833 -3581 5621
6006 5621 2685 -5874 -5022 -10160 -8309 -6704 834 2092 868 -253 269 1627 1880 3715 3282 -4362
5990 -4362 -8248 -4988 -9384 -14600 -14411 -2539 630 -6906 -8019 1632 -1366 -4158 -10768 -9556 -2731
5975 -2731 -3768 -4835 -1922 -247 3539 9269 2236 -6896 -4462 -489 805 6443 10054 10205 2657
5960 2657 -2693 -7902 -6544 -430 376 1422 1981 3299 3212 -7091 -10979 -13342 -18093 -8866 -6498 -7772
$$ packed form
6067A5352j0624n958l836m550o54M830N212O779j604j921M714n205l797l469K290
6052b441N905j885M199J540j773r139J47L260l054Q20n606j408k863Q995K886
6037d17J283j742QJ425r96n747K554j905J143Q393J364n80o269l299J941J991
6021h53J513L956M883l387m720o92j024J592Q530j276j457n865p033K252R202
6006E621k936q559Q52n138J851J605P538J258j224j121N22J358K53J835m33p644
5990d362l886L260m396n216J89J1872L169p536j113R651k998k792o610J212O825
5975b731j037j067K913J675L786N730p033r132K434L973J294N638L611J51p548
5960B657n350n209J358O114Q06J046N59J318q7j0303l888k363m751R227K368j274
$$ plain form
5944 -7772 -3690 -5685 -9555 -15779 -12572 -11629 -11312 -13152 -13867 -8084 -6701 -6780 -7852 1349 2919 3180
5928 3180 5315 3443 5114 8134 3312 4862 2161 -969 -6 1088 -148 -5354 -7853 -2454 4643
5913 4643 1472 -6865 -10752 -5478 -810 2995 -1501 -9617 -11187 -8235 -6827 2203 1550 -4515 -5473
5898 -5473 -8813 -7154 1349 4324 -91 -6914 -8100 -5122 -8390 -9153 -12544 -15812 -14180 -10388 -9102
5883 -9102 -6616 -3479 -921 4840 8996 8238 1440 -4909 -10601 -9088 1283 7225 14519 11659 7611
5868 7611 8438 4961 6576 2402 108 8398 11023 8056 2336 -1769 -3200 -3973 -5698 -6536 2251 9981
5852 9981 6574 -963 -6494 -10346 -12392 -8902 -6970 -7035 -1995 -364 2135 -5344 -13255 -14979 -9258
5837 -9258 -2489 -5518 -4585 -2528 -812 -701 -2329 -7123 -5779 -4960 -456 1092 -372 -3836 -5316 -5255
$$ packed form
5944g772M082j995l870o224L207R43L17j840p15N783J383p9j072R201J570K61
5928C180K135j872J671L020m822J550k701l130R63J094j236n206k499N399P097
5913D643l171q337l887N274M668L805m496q116j570K952J408R030o53o065r58
5898e473l340J659Q503K975m415o823j186K978l268p63l391l268J632L792J286
5883i102K486L137K558N761M156p58o798o349n692J513J0371N942P294k860m048
5868G611Q27l477J615m174k294Q290K625k967n720m105j431p73j725q38Q787P730
5852I981l407p537n531l852k046L490J932o5N040J631K499p479p911j724N721
5837i258O769l029R33K057J716J11j628m794J344Q19M504J548j464l464j480O1
$$ plain form
5821 -5255 -3280 -1883 3705 5157 8152 7367 9056 8990 8842 6646 2458 3875 5461 7726 8123 4650
5805 4650 -1922 -6064 -13285 -13694 -12307 -8919 -7591 -5380 -4315 -5174 -5781 -6676 -6694 -3602 2022 -3864
5789 -3864 -10320 -13070 -4610 -1300 1000 5577 7194 11035 13210 5865 -1104 -3102 -2577 -2141 -3531
5774 -3531 -3222 -1989 1668 5167 11856 17702 8520 2599 2859 6437 8116 5755 3492 -1767 -4550
5759 -4550 -8964 -2478 383 2130 -2540 -3103 777 1283 6598 9275 5722 10789 17543 19367 11877
5744 11877 4649 -2464 -7030 -4090 -2849 -4107 -1176 111 -4058 3381 4183 608 -42 746 415 -5930
5728 -5930 -8056 -7510 -4677 -1100 -1041 -5625 -1013 3670 1518 3755 2433 -9302 -13862 -12612 -1097
5713 -1097 6660 9626 9374 5464 2962 3683 7737 7594 -3225 -14646 -8590 -6049 -5816 280 -775
$$ packed form
5821e255J975J397N588J452K995p85J689o6j48k196m188J417J586K265L97l473
5805D650o572m142p221m09J387L388J328K211J065q59o07q95j8L092N624n886
5789c864o456k750Q460L310K300M577J617L841K175p345o969j998N25M36j390
5774c531L09J233L657L499O689N846r182n921K60L578J679k361k263n259k783
5759d550m414O486K861J747m670n63L880N06N315K677l553N067O754J824p490
5744A1877p228p113m566K940J241j258K931J287m169P439Q02l575o50P88l31o345
5728e930k126N46K833L577N9m584M612M683k152K237j322j1735m560J250J1515
5713a097P757K966k52l910k502P21M054j43j0819j1421O056K541K33O096j055
$$ plain form
5698 -775 -5677 563 3568 -1455 -5427 -1045 1417 694 -2965 -529 -3069 1025 5237 1725 -3005
5683 -3005 18 -4176 -5943 -4811 -8224 -6777 -8105 -6725 -12548 -19765 -11380 2000 1939 -5327 -5433
5668 -5433 -5332 -8692 -10147 1393 1564 -4690 -6750 -5110 -4783 -1077 5457 10582 2834 3161 2703 -6293
5652 -6293 -13247 -15129 -14597 -15610 -10440 -3568 -4115 -1383 -3166 -9858 -13794 -4615 -727 2476 -955
5637 -955 -1436 -534 -3666 -8003 -7361 -7005 -7196 -1074 6961 11233 3678 -6240 -2907 -6189 -3552 -2925 -2188
5620 -2188 452 -444 -1335 1840 2569 3002 128 -7431 -2879 -1116 -4637 -2318 -675 -5022 16 -1792
5604 -1792 -5284 -5995 -8795 1735 6752 5227 3011 280 -7674 -14898 -15800 -15448 -12065 -8752 -3239
5589 -3239 -4530 -1711 5456 2610 -4676 -1126 -1754 -8652 -7875 -10107 -6703 -2494 -7108 -17399 -17569
$$ packed form
5698g75m902O240L005n023l972M382K462p23l659K436k540M094M212l512m730
5683c005L023m194j767J132l413J447j328J380n823p217Q385J3380o1p266j06
5668e433J01l360j455J1540J71o254k060J640L27L706O534N125p748L27m58q996
5652f293o954j882N32j013N170O872n47K732j783o692l936R179L888L203l431
5637i55m81R02l132m337O42L56j91O122Q035M272p555r918L333l282K637O27P37
5620b188K640q96q91L175P29M33k874p559M552J763l521K319J643m347N038j808
5604a792l492p11k800J0530N017j525k216k731p954p224r02L52L383L313N513
5589c239j291K819P167k846p286L550o28o898P77k232L404M209m614j0291j70
$$ plain form
5574 -17569 -7229 1023 4050 5957 7698 -1721 -7726 -12912 -7140 -2395 -304 -2110 1462 -625
5560 -625 -3843 -7416 -10350 -21736 -24561 -17435 -15644 -13634 -7279 -1649 -2709 6699 7774 4354 1232
5545 1232 -5347 4763 7701 1483 3176 813 -10558 -7672 -2142 -4819 -4483 -5108 -7755 -6165 -2795
5530 -2795 -1593 2565 -1451 -5506 -1639 -1432 -3161 -2351 -690 -5477 -13994 -16655 -10424 -7584 -11230
5515 -11230 -15501 -12193 -9172 -6977 -2185 1595 1469 -1543 1481 8017 8072 5756 5341 11190 4214 2595
5499 2595 4889 4720 4728 1070 1759 -956 -2913 -3410 -3741 -3302 -4203 2601 8683 6628 4257 -3040 -4075
5482 -4075 -6086 -7665 -6553 -263 10762 1471 -8477 -11427 -14055 -20397 -17991 -6129 -3276 -421
5468 -421 4951 3815 4873 5775 -1396 -6285 -5694 -2318 1279 2421 6205 8320 8205 3930 -3143 -3122
$$ packed form
5574a7569J0340Q252L027J907J741r419o005n186N772M745K091j806L572k087
5560f25l218l573k934j1386k825P126J791K010O355N630j060R408J075l420l122
5545A232o579J0110K938o218J693k363j1371K886N530k677L36o25k647J590L370
5530b795J202M158m016m055L867K07j729Q10J661m787q517k661O231K840l646
5515a1230m271L308L021K195M792L780j26l012L024O536N5k316m15N849o976j619
5499B595K294j69Ql658O89k715j957m97l31M39r01O804O082k055k371p297j035
5482d075k011j579J112O290J1025r291r948k950k628o342K406J1862K853K855
5468d21N372j136J058R02p171m889N91L376L597J142L784K115j15m275p073K1
$$ plain form
5452 -3122 -2548 -1627 -7464 -13587 -12186 -7955 -8970 -5943 -3255 -1594 6969 5558 1179 -6467 -2413
5437 -2413 -31 -1584 1512 -2187 -6074 -1819 -4719 -10204 -14579 -14125 -10044 -696 8172 6208 6882
5422 6882 5136 5717 965 1467 2398 -3443 -9963 -18651 -21546 -22479 -15680 -13166 -8992 -12484 -15772 -17756
5406 -17756 -8940 -8370 -12413 -12906 -11637 -4684 -5538 -5452 -1090 773 3462 4612 9681 11542 5006 -2094
5390 -2094 421 -3702 369 4176 3282 2457 1119 -5937 -4110 5522 5134 2776 747 -4130 -4600 -229
5374 -229 648 -4660 985 346 -5356 -1134 2443 4386 -1006 -6927 -5088 -394 1525 43 -2370 3696
5358 3696 -1992 -9035 -15159 -15854 -17447 -14807 -11045 -2654 -4267 -5608 -5266 -959 4264 7525 4524
5343 4524 2343 416 -4248 -210 4562 -4267 -10996 -7775 -6483 -8186 -10326 -10369 -7465 -480 546
$$ packed form
5452c122N74R21n837o123J401M231j015L027K688J661Q563j411m379p646M054
5437b413K382j553L096l699l887M255k900n485m375M54M081R348Q868j964O74
5422F882j746N81m752N02R31n841o520q688k895r33O799K514M174l492l288j984
5406a7756Q816N70m043m93J269O953q54Q6M362J863K689J150N069J861o536p100
5390b094K515m123M071L807q94q25j338p056J827R632l88k358k029m877m70M371
5374b29Q77n308N645o39n702M222L577J943n392n921J839M694J919j482k413O066
5358C696n688p043o124o95j593K640L762Q391j613j341L42M307N223L261l001
5343D524k181j927m664M038M772q829o729L221J292j703k140m3K904O985J026
$$ plain form
5328 546 -544 1750 -3092 -12429 -13491 -15998 -18828 -22607 -17575 -13792 -8331 -11313 -9326 -5905 -5481
5313 -5481 894 2223 6322 -1728 -7984 -7400 -6637 280 6826 2141 -5288 -3621 -2162 -11319 -8612
5298 -8612 -10860 -18545 -19123 -20111 -22449 -11870 -6770 4142 10269 9519 -3555 -8686 -556 5622 7802
5283 7802 1418 -2254 1704 689 -8217 -8068 -4652 -8002 -9125 -117 2644 518 -3127 -4686 -4584
5268 -4584 -2054 3488 221 -938 -3410 -2136 -3882 -7249 -3132 -5034 -8150 -6561 -2956 4789 7349
5253 7349 8536 8443 3212 -3627 -13764 -18269 -17381 -14633 -9523 818 8136 8876 6326 3391 -2068
5238 -2068 -10911 -8958 -9017 -3081 -891 -7228 -6868 -5354 -12194 -13465 -8109 265 3799 -4094 -13161 -17237
5222 -17237 -11216 -6562 -3425 5920 12673 11738 477 -6390 -3295 5624 3849 3022 2550 -4497 -5888
$$ packed form
5328E46j090K294m842r337j062k507k830l779N032L783N461k982J987L421M24
5313e481O375J329M099q050o256N84P63O917O546m685p429J667J459r157K707
5298h612k248p685n78r88k338J0579N100J0912O127p50j3074n131Q130O178K180
5283G802o384l672L958j015q906J49L416l350j123R008K761k126l645j559J02
5268d584K530N542l267j159k472J274j746l367M117j902l116J589L605P745K560
5253G349J187r3n231o839j0137m505Q88K748N110J0341P318P40k550k935n459
5238b068q843J953n9N936K190o337L60J514o840j271N356Q374L534p893r067m076
5222a7237O021M654L137R345O753r35j1261o867L095Q919j775q27m72p047j391
$$ plain form
5207 -5888 -7335 -11258 -14996 -10885 -7755 -4515 -6608 -11171 -13741 -12926 -8399 -6571 -5129 -3708 -3549
5192 -3549 2621 2259 2136 1019 2105 -1788 -42 -2654 -12316 -11774 -6810 1079 192 1640 14 -8005
5176 -8005 -15463 -11495 -6403 -2162 1728 -5333 -7467 -5281 568 4975 8093 4284 -914 -2411 1492
5161 1492 4223 3300 3634 -953 -9896 -4833 -5475 -11485 -13910 -5433 -753 -1770 -2348 8572 12760 6989
5145 6989 4963 6473 -1251 -3307 -7714 -10582 -8122 -6223 -1807 -9264 -8910 -9887 -7712 -3768 -1837
5130 -1837 679 2120 1557 6653 4409 1505 -5199 -3356 -7414 -5883 601 -2341 -10797 -18109 -13609
5115 -13609 -12542 -7657 -3495 3186 8085 12487 15409 8160 4591 -3646 -3994 1247 4932 2600 979
5100 979 -1324 -6360 -5600 -3777 1172 4502 1456 -4352 -7983 -8124 -7617 -9068 -5681 -9222 -11861 -8910
$$ packed form
5207e888j447l923l738M111L130L240k093m563k570Q15M527J828J442J421J59
5192c549O170l62j23j117J086l893J746k612r662N42M964P889q87J448j626q019
5176h005p458L968N092M241L890p061k134K186N849M407L118l809n198j497L903
5161A492K731r23L34m587q943N063o42o010k425Q477M680j017n78J0920M188n771
5145F989k026J510p724k056m407k868K460J899M416p457L54r77K175L944J931
5130a837K516J441n63N096k244k904o704J843m058J531O484k942q456p312M500
5115a3609J067M885M162O681M899M402K922p249l569q237l48N241L685k332j621
5100I79k303n036P60J823M949L330l046n808l631j41N07j451L387l541k639K951
$$ plain form
5084 -8910 -9681 -2888 4361 6929 6507 5120 -1784 -8329 -10473 -9820 -11207 -11788 -8758 -4300 -1715 -6298
5068 -6298 -4930 1817 6067 -246 -3182 -2367 761 2293 -55 -3213 -10588 -14561 -19834 -18162 -19031
5053 -19031 -17034 -13499 -10152 -8038 -4114 -4214 -4901 -279 2125 -2104 -2673 3717 10078 10339 6880 -777
5037 -777 -732 2216 -724 5090 8866 6315 2958 65 1141 5041 1698 -528 -1348 4013 1491 -3506
5021 -3506 -10020 -13950 -9283 -7082 -12857 -9311 -5118 -3206 -7035 -9993 -15643 -13949 -7178 -3452 1339
5006 1339 515 -2609 -6117 -3622 2360 3550 -3646 -4532 -8896 -9487 -5098 -1056 -2262 -6180 -6886 -3557
4990 -3557 -236 -1334 -5209 -3959 1664 3166 -913 -2879 -3375 -2862 -7492 -14181 -9089 -3039 2530
4975 2530 8354 -285 -890 -2274 -4272 1939 3915 5944 3833 3650 6979 5862 3750 3641 7256 7879
$$ packed form
5084h910p71O793P249K568m22j387o904o545k144O53j387n81L030M458K585m583
5068f298J368O747M250o313k936Q15L128J532k348l158p375l973n273J672q69
5053a9031J997L535L347K114L924j00o87M622K404m229n69O390O361K61l459p657
5037g77M5K948k940N814L776k551l357k893J076L900l343k226q20N361k522m997
5021c506o514l930M667K201n775L546M193J912l829k958n650J694O771L726M791
5006A339q24l124l508K495N982J190p196q86m364n91M389M042j206l918p06L329
4990c557L321j098l875J250N623J502m079j966m96N13m630o689N092O050N569
4975B530N824q639o05j384j998O211J976K029k111j83L329j117k112j09L615O23
$$ plain form
4959 7879 2098 3025 6708 3360 -827 -8122 -10986 -8177 -9652 -10377 -7809 -12610 -11258 -11050 -15043 -15494
4943 -15494 -15231 -13755 -13056 -7991 -6635 -3467 -10392 -13954 -10868 -10336 -7473 -6010 -1293 -6231 -8577
4928 -8577 -9292 -3965 7564 4251 -4967 -2654 2927 349 -4646 -9146 -5593 -3760 -1910 -4593 -8501
4913 -8501 -10466 -8398 -5548 -4347 -7165 -9714 -10913 -5702 -3607 -2899 -3965 -4689 -8941 -8007 -6348 -3946
4897 -3946 -9464 -16464 -20006 -12713 -7787 -8486 -8653 -16492 -21397 -17065 -14566 -5229 -1411 -2580 -4064
4882 -4064 1056 -675 3709 -3175 -9246 -8990 -11328 -20708 -23686 -18566 -16567 -8918 -7270 -5371 -2409
4867 -2409 6423 -806 -2420 -2544 -3063 -5835 -78 708 -4275 -3970 397 1937 57 9059 8888 -5730
4851 -5730 -17525 -17870 -12918 -10800 -10353 -1525 -13 -2794 2817 3569 -1998 -9853 -7191 -4402 -5579
$$ packed form
4959G879n781R27L683l348m187p295k864K809j475p25K568m801J352K08l993m51
4943a5494K63J476O99N065J356L168o925l562L086N32K863J463M717m938k346
4928h577p15N327J1529l313r218K313N581k578m995m500L553J833J850k683l908
4913h501j965K068K850J201k818k549j199N211K095P08j066p24m252R34J659K402
4897c946n518p000l542P293M926o99j67p839m905M332K499R337L818j169j484
4882d064N120j731M384o884o071K56k338r380k978N120J999P649J648J899K962
4867b409Q832p229j614j24n19k772N757P86m983L05M367J540j880R002j71j4618
4851e730j1795l45M952K118M47Q828J512k781N611P52n567p855K662K789j177
$$ plain form
4836 -5579 -7520 -2775 222 -6633 -9286 -3667 -4497 -18460 -19431 -14681 -8494 1634 -1437 -5004 -12953
4821 -12953 -17254 -14004 -4402 3057 6420 5582 -4023 -10480 -9436 -8100 -7935 -3360 2386 1569 -548
4806 -548 329 -1926 266 3094 -1381 -6528 -10009 -8595 -1438 1894 2189 3597 -1768 -7304 1649 5896
4790 5896 -6845 -12195 -8795 -139 -1009 -6014 -2589 268 -3162 -1492 2091 -2319 -3560 -2589 -7507
4775 -7507 -7319 -9889 -12468 -6121 2199 -6612 -14767 -6768 -461 -3172 -1637 -3435 -7833 -13808 -13064
4760 -13064 -13275 -16975 -13210 -9941 -6205 -7385 -10492 -3509 -11286 -5745 3597 -1479 -5198 -8771 -10477
4745 -10477 -2280 -4161 -7764 -5466 -5755 -6571 -834 2781 -841 -7324 -8986 -14933 -16984 -9004 -2129
4730 -2129 1491 6747 10626 7538 -1107 -2922 3752 4879 -5116 -14333 -10846 2717 8995 8659 7072
$$ packed form
4836e579j941M745K997o855k653N619q30j3963r71M750O187J0128l071l567p949
4821a2953m301L250R602P459L363q38r605o457J044J336J65M575N746q17k117
4806e48Q77k255K192K828m475n147l481J414P157L332K95J408n365n536Q953M247
4790E896j2741n350L400Q656q70n005L425K857l430J670L583m410j241R71m918
4775g507J88k570k579O347Q320q811q155P999O307k711J535j798m398n975P44
4760a3064k11l700L765L269L736j180l107O983p777N541R342n076l719l573j706
4745a0477Q197j881l603K298k89q16N737L615l622o483j662n947k051P980O875
4730b129L620N256L879l088q645j815O674J127r995r217L487J3563O278l36j587
$$ plain form
4715 7072 4147 -2782 -1062 -3074 -8146 -9319 -6443 -10883 -14985 -8289 -8466 -7164 -3854 -9371 -12289
4700 -12289 -8802 -14039 -11255 -4496 2051 8038 2632 -1694 -3298 -10538 -16836 -16508 -11681 -9069 -8548
4685 -8548 -6661 -2047 -6516 -2692 -256 2827 2425 154 4199 4711 2092 -7022 -9801 -1538 -1303 -2882
4669 -2882 -2971 -7350 -14265 -18411 -14354 -11861 -7300 -1848 3240 8429 17334 15962 10056 2413 2957 2179
4653 2179 -3046 -3915 -3377 -6462 -10607 -4292 -4555 -3471 -6681 -5242 -1577 -811 3782 5617 4371 954
4637 954 -6038 -2606 1146 -836 -578 -3654 -6228 -3873 5699 5030 -3803 -11304 -3479 -442 -4992 -1804
4621 -1804 -1101 4257 1768 -1410 -2746 287 332 1895 3411 -4903 -7218 -7271 -3747 -6083 -2815 -568
4605 -568 -4541 -9133 -11336 -2051 4066 5896 -654 -1794 -2046 680 5833 1218 882 -1153 246 6954
$$ packed form
4715G072k925o929J720k012n072j173K876m440m102O696j77J302L310n517k918
4700a2289L487n237K784O759O547N987n406m326j604p240o298L28M827K612N21
4685h548J887M614m469L824K436L083m02k271M045N12k619r114k779Q263K35j579
4669b882q9m379o915m146M057K493M561N452N088N189Q905j372n906p643N44p78
4653B179n225q69N38l085m145O315k63J084l210J439L665P66M593J835j246l417
4637I54o992L432L752j982K58l076k574K355R572o69q833p501P825L037m550L188
4621a804P03N358k489l178j336L033M5J563J516q314k315n3L524k336L268K247
4605e68l973m592k203R285O117J830o550j140k52K726N153m615l36k035J399O708
$$ plain form
4589 6954 11677 13352 7597 -19 2562 7296 3583 -4061 -13204 -16741 -19003 -18943 -16540 -10135 -8739
4574 -8739 -999 2207 -2874 -4900 -4308 -12085 -13080 -8040 -4561 -2002 -342 -1933 -4113 -4054 -11593 -13209
4558 -13209 -11798 -6009 -3959 -762 -1159 978 4498 1678 -6674 -5398 5736 7088 4636 1593 2993
4543 2993 4243 6126 3411 5865 647 -4183 -293 5255 -4207 -11179 -12473 -8677 -8490 -6409 955
4528 955 1421 2113 -1010 -3287 -4559 -4770 -5797 -4460 -9266 -7003 3788 5125 -3229 -2858 -787 971
4512 971 2774 -636 -4996 -8892 -6154 -2882 -1432 -7263 -15072 -12734 -4500 -6849 -300 6413 617
4497 617 -6129 -3298 3034 6846 573 -5325 -8229 -9625 -6126 451 235 -2584 -12466 -13831 -4178
4482 -4178 -3051 -4269 -3976 -4317 -5499 -5598 -4925 -4935 -2394 2457 516 579 2427 -1099 -3044 -2434 402
$$ packed form
4589F954M723J675n755p616K581M734l713p644r143l537k262O0K403O405J396
4574h739P740L206n081k026N92p777r95N040L479K559J660j591k180N9p539j616
4558a3209J411N789K050L197l97K137L520k820q352J276J1134J352k452l043J400
4543B993J250J883k715K454n218m830L890N548r462o972j294L796J87K081P364
4528I55M66O92l123k277j272k11j027J337m806K263J0791J337q354L71K071J758
4512I71J803l410m360l896K738L272J450n831p809K338Q234k349O549O713n796
4497F17o746K831O332L812o273n898k904j396L499O577k16k819r882j365R653
4482d178J127j218K93l41j182r9O73j0K541M851j941O3J848l526j945O10K836
$$ plain form
4465 402 -4477 498 4234 7582 1514 313 551 4797 -838 -4482 -6147 -6520 3381 4420 4752 -187
4449 -187 -962 337 1931 -2134 2180 1275 -1381 1804 2035 8453 9493 2889 -2847 -1657 -4482 -9733
4433 -9733 -9726 -7651 -9008 -9526 -5831 -11270 -10898 -2522 79 4775 8772 9660 2862 -3575 -10561 -13668
4417 -13668 -6326 -1659 1518 2777 -1960 -7929 -13592 -13634 -9818 -12043 -9868 -6592 -6962 -3689 -6786
4402 -6786 -6946 -8037 -9896 -7193 -5398 -1732 -7862 -3490 4394 1130 -2565 -2511 -2161 -7600 -488 940
4386 940 -3243 -4839 -569 3489 8626 7346 -2069 -9262 -3225 2728 6207 -401 -3777 1080 1497
4371 1497 -1746 -5934 -6554 681 -3575 92 4267 3576 2632 618 -3920 -1785 -5981 -9272 -10936 -16610
4355 -16610 -14423 -6904 -4671 -5548 -7257 -1402 2973 1332 3810 2460 1548 1525 4816 -1976 -3428 -4253
$$ packed form
4465D02m879M975L736L348o068j201K38M246n635l644j665l73R901J039L32m939
4449a87p75J299J594m065M314r05k656L185K31O418J040o604n736J190k825n251
4433i733PK075j357n18L695n439L72Q376K601M696L997Q88o798o437o986l107
4417a3668P342M667L177J259m737n969n663m2L816k225K175L276l70L273l097
4402f786j60j091j859K703J795L666o130M372P884l264l695N4L50n439P112J428
4386I40m183j596M270M058N137j280r415p193O037N953L479o608l376M857M17
4371A497l243m188o20P235m256L667M175o91r44k014m538K135m196l291j664n674
4355a6610K187P519K233q77j709N855M375j641K478j350r12k3L291o792j452q25
$$ plain form
4339 -4253 -8268 -8167 -1412 790 -6070 -7732 -6111 2164 5226 1004 8653 14438 10337 -1496 -8150
4324 -8150 -9948 -2425 -3872 -5744 -8794 -13333 -11887 -11468 -11265 -12224 -15490 -16160 -16017 -10740 -7138 -4962
4308 -4962 -4559 -12082 -11330 -8520 -2320 -6010 -8670 -12296 -11863 -7014 -13457 -13065 -9444 -12025 -7020 -3972
4292 -3972 3313 5744 1830 909 6395 4076 -7839 -12790 -5233 -2616 -9900 -15261 -12942 -9330 -6656
4277 -6656 -6668 -11551 -8614 -8457 -7163 -6677 -10866 -11173 -12968 -7735 -10578 -13479 -12573 -6928 -4623 -2395
4261 -2395 -4853 -8894 -8900 -3234 1852 -2722 -4816 -3136 -1992 -2888 -403 -2061 -5370 -3776 -3224 -3624
4245 -3624 -6634 -2412 -1854 -3387 718 2659 2177 5053 -815 -3659 10263 10301 2742 -2388 -2147 -3092
4229 -3092 -12369 -16666 -11477 -14841 -22326 -19675 -11506 -5522 -6028 -7449 314 6088 9734 7937 -665
$$ packed form
4339d253m015J01O755K202o860j662J621Q275L062m222P649N785m101j1833o654
4324h150j798P523j447j872l050m539J446M19K03r59l266o70J43N277L602K176
4308d962M03p523P52K810O200l690k660l626M33M849o443L92L621k581N005L048
4292c972P285K431l914r21N486k319j1915m951P557K617p284n361K319L612K674
4277f656j2m883K937J57J294M86m189l07j795N233k843k901R06N645K305K228
4261b395k458m041oN666N086m574k094J680J144q96K485j658l309J594N52m00
4245c624l010M222N58j533M105J941m82K876n868k844J3922L8p559n130K41r45
4229c092r277m297N189l364p485K651Q169N984n06j421P763N774L646j797q602
$$ plain form
4214 -665 -3168 -2493 -843 -7374 -6255 -9435 -11799 -2323 871 -2562 568 1506 -9845 -6938 -5342
4199 -5342 -10118 -10985 -5449 118 -2196 -11456 -9178 -4980 2430 69 -6254 -8465 -16257 -11332 -6829
4184 -6829 -6176 -8194 -9310 -7394 -7268 -1695 4461 4241 -6216 -6891 -2776 -3134 -4322 -2993 -3048 4860
4168 4860 7593 3543 -559 -642 -3913 -3611 -1641 -2559 -4536 929 2724 3016 -2003 -3589 1726 5278
4152 5278 6059 10737 12086 8492 10422 14721 13238 9406 10250 11945 7881 -2017 -2891 2364 6337 8160
4136 8160 4525 -1544 -4167 1277 4228 761 -2780 9695 12210 3925 -3453 1927 2164 257 859
4121 859 -3924 -6089 -9116 -11045 -4567 -100 2500 -4647 -6322 -118 -264 -11722 -15943 -18316 -16041
4106 -16041 -6907 1356 2180 -361 -8548 -4582 7874 10722 14139 3153 -106 1613 -3038 -8722
$$ packed form
4214f65k503O75J650o531J119l180k364R476L194l433L130R38j1351K907J596
4199e342m776q67N536N567k314r260K278M198P410k361o323k211p792M925M503
4184f829O53k018j116J916J26N573O156k20j0457o75M115l58j188J329n5P908
4168D860K733m050m102q3l271L02J970r18j977N465J795K92n019j586N315L552
4152E278P81M678J349l594J930M299j483l832Q44J695m064r898q74N255L973J823
4136H160l635o069k623N444K951l467l541J2475K515q285p378N380K37j907O02
4121H59m783k165l027j929O478M467K600p147j675O204j46j1458m221k373K275
4106a6041R134Q263Q24k541q187L966J2456K848L417j0986l259J719m651n684
$$ plain form
4092 -8722 -11184 -3820 1869 -3939 -7107 -5739 -5241 -3766 -1790 -1581 -3644 1179 -2409 -8543 -6197
4077 -6197 1382 4723 6484 1876 -6558 -7089 -7957 -6001 -4079 -2059 -6378 -9763 -14602 -20292 -17794
4062 -17794 -17872 -18202 -13134 -6357 632 7341 3861 4364 2348 1440 -4306 -2561 4093 9005 6925 3261
4046 3261 3769 7147 6374 5292 6330 7702 17801 13137 9023 5013 -766 -3346 -4696 -4119 1204
4031 1204 757 -4733 -5942 -8191 -12849 -12874 -7682 1294 -873 -3822 -1407 765 2370 -3825 -4000 5292
4015 5292 9340 715 -754 -6684 -9245 -2475 1263 3790 5362 3298 4415 -632 2247 -4299 -4605
4000 -4605 -7786 -9327 -6775 -3625 -7614 -14847 -20329 -19416 -16856 -9710 -5235 -4391 -6945 -6777 -8557 -2804
3984 -2804 -1552 2552 -2931 -3167 -2899 4786 6132 -2601 -6597 27 2048 -5492 -8012 -9703 -7344
$$ packed form
4092h722k462P364N689n808l168J368M98J475J976K09k063M823l588o134K346
4077f197P579L341J761m608q434n31q68J956J922K020m319l385m839n690K498
4062a7794p8l30N068O777O989O709l480N03k016r08n746J745O654M912k080l664
4046C261N08L378p73j082J038J372J0099m664m114m010n779k580j350N77N323
4031A204m47n490j209k249m658k5N192Q976k167k949K415K172J605o195j75R292
4015E292M048q625j469n930k561O770L738K527J572k064J117n047K879o546l06
4000d605l181j541K552L150l989p233n482R13K560P146M475Q44k554J68j780N753
3984b804J252M104n483k36K68P685J346q733l996O624K021p540k520j691K359
$$ [...]
##END NTUPLES=NMR SPECTRUM
##END=
