##TITLE=Analysis number 321100
Compound Code cc 55739
Book Reference 467/54
Project Code adrs
Chemist Name benw
##JCAMPDX= 6.0         $$ Bruker NMR JCAMP-DX V2.0
##DATA TYPE= NMR SPECTRUM
##DATA CLASS= NTUPLES
##ORIGIN= Bruker BioSpin GmbH
##OWNER= nmr
$$ XWIN-NMR		Version 3.5
$$ Mon Jul 24 21:21:30 2006 GMT Daylight Time (UT+1h)  MAYBRIDGE\nmr@NMR_250MHZ
##.OBSERVE FREQUENCY= 250.131544655141
##.OBSERVE NUCLEUS= ^1H
##.ACQUISITION MODE= SIMULTANEOUS (DQD)
##.ACQUISITION SCHEME= undefined
##.AVERAGES= 16
##.DIGITISER RES= 18
##SPECTROMETER/DATA SYSTEM= dpx250
##.PULSE SEQUENCE= zg30
##.SOLVENT NAME= CDCl3
##.SHIFT REFERENCE= (INTERNAL, CDCl3, 0, 16.522)
##AUDIT TRAIL= $$ (NUMBER, WHEN, WHO, WHERE, WHAT)
$$ ##TITLE= Audit trail, XWIN-NMR		Version 3.5
$$ ##JCAMPDX= 5.01
$$ ##ORIGIN= Bruker BioSpin GmbH
$$ ##OWNER= nmr
$$ C:\u/data/dgb/nmr/ADRS/3290/pdata/1/auditp.txt
$$ ##AUDIT TRAIL=  $$ (NUMBER, WHEN, WHO, WHERE, WHAT)
(   1,<2006-07-24 21:21:08.15 +100>,<MAYBRIDGE\nmr>,<NMR_250MHZ>,
      <created by zg, POWCHK disabled, PULCHK disabled
       configuration hash MD5:
       E2 DF 36 D8 04 B2 41 60 5A D7 A3 38 5A 4B D0 FE
       data hash MD5: 64K
       EC 20 61 3A B7 24 C7 CD 50 82 1D 79 24 85 0A 2D>)
(   2,<2006-07-24 21:21:21.10 +100>,<MAYBRIDGE\nmr>,<NMR_250MHZ>,
      <Start of raw data processing
       ef LB = 0.3 FT_mod = 6 PKNL = 1 SI = 32K 
       data hash MD5: 32K
       B9 6D 4C 78 FB 95 B5 68 2E 80 FC BC 3A 52 8F 96>)
(   3,<2006-07-24 21:21:22.73 +100>,<MAYBRIDGE\nmr>,<NMR_250MHZ>,
      <apk 
       data hash MD5: 32K
       D9 7F 27 C5 5C 74 A4 9A 87 92 5E 30 5B 45 6F ED>)
(   4,<2006-07-24 21:21:23.49 +100>,<MAYBRIDGE\nmr>,<NMR_250MHZ>,
      <abs ABSG = 5 
       data hash MD5: 32K
       C4 87 06 70 9E E7 E5 ED 8D A2 18 BB 7C 50 18 34>)
$$ ##END=
$$ 
$$ hash MD5
$$ AD DD 9C BF 8A E2 E0 74 BF 7D 08 23 F5 5F C4 4C
##$RELAX= 
##$RELAX= 
##$RELAX= 
##$RELAX= 
##$RELAX= 
##$RELAX= 
##$RELAX= 
$$ Bruker specific parameters
$$ --------------------------
##$DU= <C:\u>
##$EXPNO= 3290
##$NAME= <ADRS>
##$PROCNO= 1
##$TYPE= <nmr>
##$USER= <dgb>
##$AMP= (0..31)
100 100 100 100 100 100 100 100 100 100 100 100 100 100 100 100 100 100 
100 100 100 100 100 100 100 100 100 100 100 100 100 100 
##$AQSEQ= 0
##$AQ_mod= 3
##$AUNM= <au_zg>
##$AUTOPOS= <56 >
##$BF1= 250.13
##$BF2= 250.13
##$BF3= 250.13
##$BF4= 250.13
##$BF5= 500.13
##$BF6= 500.13
##$BF7= 500.13
##$BF8= 500.13
##$BYTORDA= 1
##$CFDGTYP= 0
##$CFRGTYP= 5
##$CHEMSTR= <none>
##$CNST= (0..31)
1 1 145 1 1 1 1 1 1 1 1 1 1 1 1 1 1 1 1 1 1 1 1 1 1 1 1 1 1 1 1 1 
##$CPDPRG= <>
##$CPDPRG1= <>
##$CPDPRG2= <>
##$CPDPRG3= <>
##$CPDPRG4= <mlev>
##$CPDPRG5= <mlev>
##$CPDPRG6= <mlev>
##$CPDPRG7= <mlev>
##$CPDPRG8= <mlev>
##$CPDPRGB= <>
##$CPDPRGT= <>
##$D= (0..31)
0 1 0 0 0 0 0 0 0 0.06 0 0 0 0 0 0 0.0002 0 0 0 0 0 0 0 0 0 0 0 0 0 0 
0 
##$DATE= 1153772467
##$DBL= (0..7)
120 120 120 120 120 120 120 120 
##$DBP= (0..7)
150 150 150 150 150 150 150 150 
##$DBP07= 0
##$DBPNAM0= <>
##$DBPNAM1= <>
$$ [...]
##$SUBNAM6= <"">
##$SUBNAM7= <"">
##$SUBNAM8= <"">
##$SUBNAM9= <"">
##$SW= 20.6930455092707
##$SWIBOX= (0..15)
0 0 3 0 0 0 0 0 0 0 0 0 0 0 0 0 
##$SW_h= 5175.983436853
##$TD= 65536
##$TD0= 1
##$TE= 295.16
##$TE2= 300
##$TE3= 300
##$TEG= 300
##$TL= (0..7)
0 120 120 120 120 120 120 120 
##$TP= (0..7)
150 150 150 150 150 150 150 150 
##$TP07= 0
##$TPNAME0= <>
##$TPNAME1= <>
##$TPNAME2= <>
##$TPNAME3= <>
##$TPNAME4= <>
##$TPNAME5= <>
##$TPNAME6= <>
##$TPNAME7= <>
##$TPOAL= (0..7)
0.5 0.5 0.5 0.5 0.5 0.5 0.5 0.5 
##$TPOFFS= (0..7)
0 0 0 0 0 0 0 0 
##$TUNHIN= 0
##$TUNHOUT= 0
##$TUNXOUT= 0
##$USERA1= <user>
##$USERA2= <user>
##$USERA3= <user>
##$USERA4= <user>
##$USERA5= <user>
##$V9= 5
##$VALIST= <valist>
##$VCLIST= <CCCCCCCCCCCCCCC>
##$VD= 0
##$VDLIST= <DDDDDDDDDDDDDDD>
##$VPLIST= <PPPPPPPPPPPPPPP>
##$VTLIST= <TTTTTTTTTTTTTTT>
##$WBST= 1024
##$WBSW= 4
##$XGAIN= (0..3)
0 0 0 0 
##$XL= 0
##$YL= 0
##$YMAX_a= 350322
##$YMIN_a= -444191
##$ZGOPTNS= <>
##$ZL1= 120
##$ZL2= 120
##$ZL3= 120
##$ZL4= 120
##$ABSF1= 16.522
##$ABSF2= -4.171173
##$ABSG= 5
##$ABSL= 3
##$ALPHA= 0
##$AQORDER= 0
##$ASSFAC= 0
##$ASSFACI= 0
##$ASSFACX= 0
##$ASSWID= 0
##$AUNMP= <proc_1d>
##$AZFE= 0.1
##$AZFW= 0.1
##$BCFW= 0
##$BC_mod= 0
##$BYTORDP= 0
##$COROFFS= 0
##$CY= 12.5
##$DATMOD= 1
##$DC= 0
##$DFILT= <>
##$DTYPP= 0
##$F1P= 14.0000005364418
##$F2P= -0.99999901652339
##$FCOR= 0.5
##$FTSIZE= 32768
##$FT_mod= 6
##$GAMMA= 0
##$GB= 0
##$INTBC= 1
##$INTSCL= 1
##$ISEN= 128
##$LB= 0.3
##$LEV0= 0
##$LPBIN= 0
##$MAXI= 10000
##$MC2= 0
##$MEAN= 0
##$ME_mod= 0
##$MI= 0
##$NCOEF= 0
##$NC_proc= -3
##$NLEV= 6
##$NOISF1= 0
##$NOISF2= 0
##$NSP= 0
##$NTH_PI= 0
##$NZP= 0
##$OFFSET= 16.522
##$PC= 1
##$PHC0= 167.802
##$PHC1= 1.17378
##$PH_mod= 1
##$PKNL= yes
##$PPARMOD= 0
##$PSCAL= 4
##$PSIGN= 0
##$REVERSE= no
##$SF= 250.13
##$SI= 32768
##$SIGF1= 0
##$SIGF2= 0
##$SINO= 400
##$SIOLD= 32768
##$SREGLST= <1H.CDCl3>
##$SSB= 0
##$STSI= 32768
##$STSR= 0
##$SW_p= 5175.98343685301
##$SYMM= 0
##$S_DEV= 0
##$TDeff= 65536
##$TDoff= 0
##$TI= <Analysis number 999999
Compound Code 99
Book Reference 9
Project Code 9>
##$TILT= no
##$TM1= 0
##$TM2= 0
##$TOPLEV= 0
##$USERP1= <user>
##$USERP2= <user>
##$USERP3= <user>
##$USERP4= <user>
##$USERP5= <user>
##$WDW= 1
##$XDIM= 32768
##$YMAX_p= 420497618
##$YMIN_p= -118907
$$ End of Bruker specific parameters
$$ ---------------------------------
##NTUPLES= NMR SPECTRUM
##VAR_NAME=  FREQUENCY,     SPECTRUM/REAL,   SPECTRUM/IMAG
##SYMBOL=    X,             R,               I
##VAR_TYPE=  INDEPENDENT,   DEPENDENT,       DEPENDENT
##VAR_FORM=  AFFN,          ASDF,            ASDF
##VAR_DIM=   32768,         32768,           32768
##UNITS=     HZ,            ARBITRARY UNITS, ARBITRARY UNITS
##FACTOR=    0.157963299565203, 1,           1
##FIRST=     4132.6476996994, 0,             0
##LAST=      -1043.33573715361, 0,           0
##MIN=       -1043.33573715361, -118907,     0
##MAX=       4132.6476996994, 420497618,     0
$$ Real data points
##PAGE= N=1
##DATA TABLE= (X++(R..R)), XYDATA
$$ [...]
$$ plain form
14516 10366 -27774 -35210 -4028 -8730 -64908 -77867 -52598 -23439 -22413 -37205 -36888 -29141 -34718
14503 -34718 -58433 -84115 -70959 -26893 27074 39796 23372 -5573 14705 60636 62391 57267
14491 57267 61162 48150 13521 6662 19872 27876 33562 26393 26806 17463 25717 6475 -11157
14478 -11157 15960 40743 29290 -13655 -35529 -49803 -19701 -4595 19679 27165 22876 -27326
14466 -27326 -57808 -43859 -22434 867 17407 33086 33701 46233 40849 14724 -27546 -51942
14454 -51942 -33878 -50266 -85581 -65749 -61925 -59922 -65452 -57760 -6659 30106 31876 28637 67117
14441 67117 71228 14058 7133 9864 -14023 -44000 -25393 -6091 -34978 -62129 -44374 -19332
14429 -19332 -14623 -11376 4846 -7239 -9595 -2039 -18962 -13831 -17422 -27916 -19539 3125 11278
$$ packed form
14516A0366l8140p436L1182m702n6178j2959K5269K9159J026j4792L17P747n577
14503c4718k3715k5682J3156M4066N3967J2722j6424k8945K0278M5931J755n124
14491E7267L895j3012l4629o859J3210Q004N686p169M13r343Q254j9242j7632
14478a1157K7117K4783j1453m2945k1874j4274L0102J5106K4274P486m289n0202
14466b7326l0482J3949K1425K3301J6540J5679O15J2532n384k6125m2270k4396
14454e1942J8064j6388l5315J9832L824K003n530P692N1101L6765J770l239L8480
14441F7117M111n7170o925K731k3887k9977J8607J9302k8887k7151J7755K5042
14429a9332M709L247J6222j2085k356P556j6923N131l591j0494Q377K2664Q153
$$ plain form
14416 11278 9333 18246 47194 28460 -11436 6793 3409 -9322 -5911 11184 28019 13183
14404 13183 10540 23713 40248 61101 11255 -29496 -46418 -23659 -8871 -23121 -32323 -35980
14392 -35980 -20840 6467 -7708 -43516 -38720 -12432 1800 5041 -14761 -13587 -2448 -12601
14380 -12601 -16162 -5256 14125 6647 -3142 -40509 -45592 -34900 8059 49084 73912 61621
14368 61621 16650 24933 48030 38059 52386 25768 -3263 -7267 -10909 5169 -3109 -31963 -45887
14355 -45887 -51068 -50161 -49581 -33777 -28232 -15438 -43689 -50329 -27785 -8622 -8768 -16497 -25413 -33626
14341 -33626 -21681 -35346 -63186 -73336 -78133 -44043 -34706 -51292 -49615 -37744 -36019 -33783 -10124
14328 -10124 7241 564 -15708 -14988 12585 27051 17153 -10975 -11123 -8582 -18837 -17398 -35401
$$ packed form
14416A1278j945Q913K8948j8734l9896J8229l384j2731L411J7095J6835j4836
14404A3183k643J3173J6535K0853m9846m0751j6922K2759J4788j4250r202l657
14392c5980J5140K7307j4175l5808M796K6288J4232L241j9802J174J1139j0153
14380a2601l561J0906J9381p478r789l7367n083J0692M2959M1025K4828j2291
14368F1621m4971Q283K3097r971J4327k6618k9031m004l642J6078q278k8854j3924
14355d5887n181R07N80J5804N545J2794k8251o640K2544J9163j46p729q916q213
14341c3626J1945j3665k7840j0150m797L4090R337j6586J677J1871J725K236K3659
14328a0124J7365o677j6272P20K7573J4466r898k8128j48K541j0255J439j8003
$$ plain form
14315 -35401 -54490 -23769 -23052 -470 5246 4035 899 3536 4661 -4758 3211 15499 16360 552
14301 552 -12075 -20633 -6599 -43350 -71538 -42750 -13592 49786 52745 10134 6463 30669 46241
14288 46241 21693 -13560 -12661 -15299 -14412 865 11451 41450 61552 41891 29710 -194 3878
14275 3878 -19249 -43840 -36714 -11257 -13282 -20243 -4837 -1636 -35094 -51902 -33663 568 -2007
14262 -2007 19496 4882 14315 29551 34239 -13611 -59470 -47342 -35737 -46785 -29089 -28717 -32213
14249 -32213 -5120 -45 -17015 5676 44993 47281 -7771 -30087 -25194 -40389 -57484 -56757 -51692
14236 -51692 -26996 -18565 -14994 -11015 -23269 -12488 -9687 -17458 1968 -12534 -25268 -16649 3799
14223 3799 -2364 9751 20563 30431 51313 51489 40273 7362 -19486 -12153 -25212 -24644 -3466
$$ packed form
14315c5401j9089L0721P17K2582N716j211l136K637J125r419P969J2288Q61j5808
14301E52j2627q558J4034l6751k8188K8788K9158O3378K959m2611l671K4206J5572
14288D6241k4548l5253Q99k638Q87J5277J0586K9999K0102j9661j2181k9904M072
14275C878k3127k4591P126K5457k025o961J5406L201l3458j6808J8239L4231k575
14262b007K1503j4614R433J5236M688m7850m5859J2128J1605j1048J7696L72l496
14249c2213K7093N075j6970K2691L9317K288n5052k2316M893j5195j7095P27N065
14236e1692K4696Q431L571L979j2254J0781K801p771J9426j4502j2734Q619K0448
14223C799o163J2115J0812R868K0882J76j1216l2911k6848P333j3059N68K1178
$$ plain form
14210 -3466 17082 7183 -15812 -13271 3430 1536 -17905 -20919 -29417 -32296 -55274 -71651 -39925
14197 -39925 -8183 4216 -1477 -18988 -32110 -7130 -5316 -20037 -27237 -23641 -14353 -6237 -6414
14184 -6414 5666 -8243 -17003 -5377 -11213 -12515 -16969 -514 13720 28998 22077 9705 -1640
14171 -1640 440 1584 13291 6793 20462 23413 -5196 5183 9914 11326 -1260 5009 3585
14158 3585 -19366 1831 41813 44813 54854 48872 61794 44160 21245 25114 4944 -33363
14146 -33363 -43302 -35230 -14958 -6610 -43738 -55939 -12813 7900 -5271 -13664 -36133 -15076
14134 -15076 -7732 -573 4953 4907 8676 -10654 -3712 -20383 -22696 18105 26228 29355 22372 5923
14120 5923 -4668 -24399 -26144 -14898 1670 7306 36145 48841 27485 37826 32643 24268 18031
$$ packed form
14210c466K0548r899k2995K541J6701j894j9441l014q498k879k2978j6377L1726
14197c9925L1742J2399n693j7511j3122K4980J814j4721p200L596R288Q116j77
14184f414J2080j3909q760J1626n836j302m454J6455J4234J5278o921j2372j1345
14171a640K080J144J1707o498J3669K951k8609J0379M731J412j2586O269j424
14158C585k2951K1197L9982L000J0041n982J2922j7634k2915L869k0170l8307
14146c3363r939Q072K0272Q348l7128j2201M3126K0713j3171q393k2469K1057
14134a5076P344P159N526m6L769j9330O942j6671k313M0801Q123L127o983j6449
14120E923j0591j9731j745J1246J6568N636K8839J2696k1356J0341n183q375o237
$$ plain form
14107 18031 24338 19685 12161 11979 26768 20429 19148 44347 24919 -3120 7240 2914 -9925
14094 -9925 -12238 -44916 -35628 -1656 -16597 -48225 -34160 587 -3938 -15677 -8693 1280 -12121
14081 -12121 -18520 -28785 -15362 -4795 -22375 7470 -6634 -8993 5479 48513 48731 40709 95
14068 95 25721 47148 40439 41196 45982 40329 39327 31949 24569 31621 25540 29864 9425 33583
14054 33583 75048 58585 31235 9376 5655 26250 47906 31273 16740 12525 -1819 -11315
14042 -11315 -24930 -31418 -28948 -6503 2125 -4515 -16457 -8337 -1061 -12982 -37801 -59000 -59384
14029 -59384 -54259 -38112 4311 20572 -2252 -24190 -29339 -31581 -38144 -26066 -4145 -28504
14017 -28504 -45683 -31139 9855 -6122 -33163 -55269 -55596 -282 12067 9605 16555 -491
$$ packed form
14107A8031O307m653p524j82J4789o339j281K5199j9428k8039J0360m326j2839
14094i925k313l2678R288L3972j4941l1628J4065L4747m525j1739O984R973j3401
14081a2121o399j0265J3423J0567j7580K9845j4104k359J4472M3034K18q022m0614
14068I5K5626K1427o709P57M786n653j002p378p380P052o081M324k0439K4158
14054C3583M1465j6463k7350k1859l721K0595K1656j6633j4533m215j4344r496
14042a1315j3615o488K470K2445Q628o640j1942Q120P276j1921k4819k1199l84
14029e9384N125J6147M2423J6261k2824k1938n149k242o563J2078K1921k4359
14017b8504j7179J4544M0994j5977k7041k2106l27N5314J2349k462O950j7046
$$ plain form
14005 -491 -7656 11024 798 -32613 -12451 -5406 4623 91 -23079 -37059 -26277 -23250 -6901
13992 -6901 -8535 -5872 -18600 -30727 -25141 -30553 -39723 -18161 7286 13355 -18604 -31446 -24135
13979 -24135 5360 5162 14501 15997 -10464 -52219 -76552 -72030 -19943 -19285 -20570 -429 -10756
13966 -10756 4194 -9369 -16238 -18518 -40265 -11596 15351 44492 39062 40045 42740 9693 4334
13953 4334 -2147 619 -13095 -8134 11281 3463 13988 19035 10103 15573 42063 30269 32166
13940 32166 17333 26677 33957 36794 18874 3332 -5339 -1016 21599 20634 20995 24245 -8113 -10508
13926 -10508 19731 -5410 -11369 1198 1743 -10389 -13714 -15791 7251 10988 2297 1998 -14269
13913 -14269 -24318 -25148 -14928 -9065 -45218 -49501 -22888 -11342 -7216 -3087 4879 3988 554 -12740
$$ packed form
14005d91p165J8680j0226l3411K0162P045J0029m532k3170j3980J0782L027J6349
13992f901j634K663j2728j2127N586n412r170K1562K5447O069l1959j2842P311
13979b4135K9495j98R339J496k6461m1755k4333M522N2087O58j285K0141j0327
13966a0756J4950j3563o869k280k1747K8669K6947K9141n430R83K695l3047n359
13953D334o481K766j3714M961J9415p818J0525N047q932N470K6490j1794J897
13940C2166j4833R344P280K837j7920j5542q671M323K2615r65L61L250l2358k395
13926a0508L0239k5141n959J2567N45j2132l325k077K3042L737q691k99j6267
13913a4269j0049q30J0220N863l6153m283K6613J1546M126M129P966q91l434j3294
$$ plain form
13899 -12740 13975 53074 41688 32109 43378 25571 29310 37810 11714 1939 -8411 -7875 -14520
13886 -14520 -208 -36674 -34565 -19289 -6056 -18803 -37697 -34200 -8052 -15858 -7949 7627
13874 7627 10246 -9934 -46630 -76535 -85560 -71131 -30608 -12301 -19880 -38848 -52317 -48609 -69256
13861 -69256 -81335 -66768 -65918 -66946 -41242 -46106 -54135 -27678 -21806 -3168 -21917 -23975 -30465
13848 -30465 -32559 -18173 5365 34806 35113 8445 11280 4519 35688 29871 17060 17837 20117
13835 20117 29957 11438 -43967 -42183 -34851 -18258 20615 6651 -36066 -47262 -49043 -39269 -29696
13822 -29696 773 -1863 3197 1448 1115 -8383 -5766 -31341 -50647 -43205 -20905 -7058 -1593
13809 -1593 2112 -1463 -16334 -14011 9670 4668 -27257 -51088 -38518 -35816 -22215 -22434 -12394
$$ packed form
13899a2740K6715L9099j1386r579J1269j7807L739Q500k6096r775j0350N36o645
13886a4520J4312l6466K109J5276J3233j2747j8894L497K6148p806P909J5576
13874G627K619k0180l6696k9905r025J4429M0523J8307p579j8968j3469L708k0647
13861f9256j2079J4567Q50j028K5704m864q029K6457N872J8638j8749k058o490
13848c0465k094J4386K3538K9441L07k6668K835o761L1169n817j2811P77K280
13835B0117R840j8519n5405J784P332J6593L8873j3964m2717j1196j781R774R573
13822b9696L0469k636N060j749l33r498K617k5575j9306P442K2300J3847N465
13809a593L705l575j4871K323K3681n002l1925k3831J2570K702J3601k19J0040
$$ plain form
13796 -12394 -14903 -18605 -11193 15599 8550 -43126 -18180 5754 -10096 -5846 -1934 -40186 -41806
13783 -41806 -40952 -57396 -74829 -32893 -25123 -30567 -6998 20893 26326 17820 13231 603 -37925
13770 -37925 -38795 -14847 8212 -10701 -9431 27 7659 -8129 -38838 -49656 -37884 -13341 -43159
13757 -43159 -52802 -38257 -54752 -63067 -47005 -68992 -48563 -59751 -24113 -13827 -17907 -6383
13745 -6383 5595 31843 11006 8150 -10402 -2406 -6941 -28578 -30027 -4991 10303 20847 -7042
13732 -7042 -18024 -30285 -8116 -627 7842 8973 -12092 -20644 -19580 1882 26031 13334 -11131
13719 -11131 -62508 -49258 -36126 -48098 -34352 -19723 26381 33287 11024 -8552 -4810 -30812
13707 -30812 -68619 -59008 -44020 -55163 -38763 -19011 18563 25092 7480 19187 8787 25248
$$ packed form
13796a2394k509l702P412K6792p049n1676K4946K3934j5850M250L912l8252j620
13783d1806Q54j6444j7433M1936P770n444K3569K7891N433q506m589j2628l8528
13770c7925q70K3948K3059j8913J270R458P632j5788l0709j0818J1772K4543k9818
13757d3159r643J4545j6495q315J6062k1987K0429j1188L5638J0286m080J1524
13745f383J1978K6248k0837k856j8552P996m535k1637j449K5036J5294J0544k7889
13732g042j0982j2261K2169P489Q469J131k1065q552J064K1462K4149j2697k4465
13719a1131n1377J3250J3132j1972J3746J4629M6104O906k2263j9576L742k6002
13707c0812l7807R611J4988j1143J6400J9752L7574O529j7612J1707j0400J6461
$$ plain form
13695 25248 15138 -6182 23958 39375 23132 6848 -14138 18651 39861 69289 98934 78675
13683 78675 80305 137913 187244 225137 243019 272195 298802 274367 226168 186997 166719 153624
13671 153624 102080 81468 84579 71128 72486 71401 43245 28998 26761 17735 -10284 -29804
13659 -29804 38 41082 38574 4924 -27034 -22453 -6486 -5576 10628 -11875 -7053 14328 30538
13646 30538 40690 27454 33987 21807 1525 -2838 -9118 -16373 -11582 2762 1146 -748 9416
13633 9416 19186 23737 16063 15149 11216 -23277 -6659 1965 28186 39653 36714 36840 23545 853
13619 853 -13033 13996 7148 -4765 24421 50452 42456 49409 46937 22416 -10250 -26959 -28096
13606 -28096 -46999 -45213 -58567 -46801 -33373 -52940 -41100 -32667 -26725 -16297 -16222 -15295 -23781
$$ packed form
13695B5248j0110k1320L0140J5417j6243j6284k0986L2789K1210K9428K9645k0259
13683G8675J630N7608M9331L7893J7882K9176K6607k4435m8199l9171k0278j3095
13671A53624n1544k0612L111j3451J358j085k8156j4247k237r026k8019j9520
13659b9804K9842M1044k508l3650l1958M581J5967R10J6204k2503M822K1381J6210
13646C0538J0152j3236O533j2180k0282m363o280p255M791J4344j616j894J0164
13633I416R770M551p674r14l933l4493J6618Q624K6221J1467k939J26j3295k2692
13619H53j3886K7029o848j1913K9186K6031p996O953k472k4521l2666j6709j137
13606b8096j8903J786j3354J1766J3428j9567J1840Q433N942J0428P5R27q486
$$ plain form
13593 -23781 -6243 8628 -7703 -42923 -25802 -14044 -13737 -28155 -29748 -476 15089 53518
13581 53518 57216 49676 44041 23969 14250 31877 18915 -26174 -32995 -12282 -8496 -9403 -15865
13568 -15865 -34483 4739 15104 -24493 -3872 52090 68737 45380 264 6685 -15459 3896
13556 3896 35336 39041 56796 53012 22772 35055 58889 65230 35896 37193 41924 28584 11054
13543 11054 773 5722 33141 59079 49145 29386 26171 18965 18938 17995 6782 15181 13949 -3220
13529 -3220 5960 23333 17136 11242 26104 9504 -19599 -11281 32210 27074 26223 30647 4900
13516 4900 -2165 -679 9384 20934 19616 -2724 -16335 -8038 -27151 -15783 -19099 -24972 -39107
13503 -39107 -43486 -28094 -17052 -10181 -4275 -1779 -6170 -1763 12905 1343 923 10490 -13072
$$ packed form
13593b3781J7538J4871j6331l5220J7121J1758L07j4418j593K9272J5565L8429
13581E3518L698p540n635k0072r719J7627j2962m5089o821K0713L786r07o462
13568a5865j8618L9222J0365l9597K0621N5962J6647k3357m5116O421k2144J9355
13556C896L1440L705J7755l784l0240J2283K3834O341k9334J297M731j3340j7530
13543A1054j0281M949K7419K5938r934j9759l215p206k7r43j1213Q399j232j7169
13529c220R180J7373o197n894J4862j6600k9103Q318M3491n136q51M424k5747
13516D900p065J486J0063J1550j318k2340j3611Q297j9113J1368l316n873j4135
13503c9107m379J5392J1042O871N906K496m391M407J4668j1562m20R567k3562
$$ plain form
13490 -13072 -24936 -34277 -4598 6662 15484 21897 11062 -18078 -47438 -47952 -25912 -25692 -41319
13477 -41319 -25958 -49321 -50449 -21474 8715 -2614 -975 1855 -8223 -34498 -48872 -43173
13465 -43173 -16490 -19605 -26111 -22632 22599 43634 44729 35017 32151 18713 -86 22797 35381
13452 35381 5143 -7831 6695 11835 13479 -2665 -11550 8614 35229 64407 54066 27224
13440 27224 0 -9822 -10392 -27684 -40114 -24749 -33574 -47196 -57750 -55991 -16295 -21013 -54768
13427 -54768 -69077 -53276 -20723 7115 37176 46663 30237 4668 -2244 -10735 -37459 -36198
13415 -36198 -15569 13832 52916 71242 63681 27768 -13396 -8414 10259 22998 30421 22150
13403 22150 779 -13444 -29946 -1786 -4061 -21216 -34727 -37951 -8512 18629 9032 7446
$$ packed form
13490a3072j1864r341K9679J1260Q822O413j0835k9140k9360n14K2040K20j5627
13477d1319J5361k3363j128K8975L0189j1329J639K830j0078k6275j4374N699
13465d3173K6683l115o506L479M5231K1035J095r712k866j3438j8799K2883J2584
13452C5381l0238j2974J4526N140J644j6144q885K0164K6615K9178j0341k6842
13440B7224k7224r822n70j7292j2430J5365q825j3622j0554J759L9696m718l3755
13427e4768j4309J5801L2553K7838L0061R487j6426k5569o912q491k6724J261
13415c6198K0629K9401L9084J8326p561l5913m1164M982J8673J2739P423q271
13403B2150k1371j4223j6502K8160k275j7155j3511l224K9439K7141r597j586
$$ plain form
13391 7446 4791 -9032 25114 979 -40804 -39716 -35515 -12872 -25211 -35101 -37377 -49836 -41423
13378 -41423 -31162 -31677 -21534 7309 16327 -31222 -29321 -28444 -18966 -31450 -26750 12912 34593
13365 34593 20617 4843 -5256 -30128 -44672 -34316 -18889 -13199 -23552 -38226 -32631 -51544
13353 -51544 -34243 -28953 -46001 -40377 -10316 -5657 -47497 -57668 -39536 -4940 2599 11018 -16351
13340 -16351 -23506 -18294 -26356 -40922 -35037 -11271 -10968 3237 -27483 -50106 -42679 -31097 -5977
13327 -5977 17549 19300 -7059 -18365 -25811 -5382 -7443 -23562 -5096 17121 20278 31895 26913
13314 26913 -1538 1327 -250 -8091 15130 -19365 -27815 -23753 18601 27861 20175 17257 26086
13301 26086 -25245 -39608 -31798 -21909 -6404 -8518 -4668 15037 21760 18452 12867 3555 -3694
$$ packed form
13391G446k655j3823L4146k4135m1783J088M201K2643j2339r890k276j2459Q413
13378d1423J0261n15J0143K8843R018m7549J901Q77R478j2484M700L9662K1681
13365C4593j3976j5774j0099k4872j4544J0356J5427N690j0353j4674N595j8913
13353e1544J7301N290j7048N624L0061M659m1840j0171J8132L4596P539Q419k7369
13340a6351p155N212q062j4566N885K3766L03J4205l0720k2623P427J1582K5120
13327e977K3526J751k6359j1306p446K0429k061j6119J8466K2217L157J1617m982
13314B6913k8451K865j577p841K3221l4495q450M062M2354R260p686k918Q829
13301B6086n1331j4363P810R889J5505k114L850J9705O723l308n585r312p249
$$ plain form
13288 -3694 -10281 -44417 -53122 -44298 -27272 -21437 -11997 -38737 -46106 -25959 -17591 -20383 -18260 -23639
13274 -23639 -25142 9605 51350 44975 26003 14315 23502 34709 23375 56654 37614 14970
13262 14970 11472 8664 1123 -5781 40021 37911 9121 6649 16258 25341 59252 69993 62121
13249 62121 23089 7161 18253 18908 3336 -4645 -15278 -15667 9060 11904 5643 27070 18735
13236 18735 21518 16412 14612 -14149 -13134 -21350 -25489 -29419 -54016 -70876 -50985 -25700 -2620
13223 -2620 -12987 -7999 2369 -924 34426 2260 -27630 -17125 355 -1991 9482 12978 9722
13210 9722 -18650 -45347 -55302 -28902 -22396 -2951 -3508 -20268 -18122 -2563 -2848 16277 32038
13197 32038 61490 49603 18761 53976 93563 131636 188208 193593 191594 202292 234016 245113
$$ packed form
13288c694o587l4136q705Q824J7026N835R440k6740p369K0147Q368k792K123n379
13274b3639j503L4747M1745o375j8972j1688R187J1207j1334L3279j9040k2644
13262A4970l498k808p541o904M5802k110k8790k472R609R083L3911J0741p872
13249F2121l9032j5928J1092O55j5572p981j0633l89K4727K844o261K1427q335
13236A8735K783n106j800k8761J015q216m139l930k4597j6860J9891K5285K3080
13223b620j0367M988J0368l293L5350l2166k9890J0505J7480k346J1473L496l256
13210I722k8372k6697r955K6400O506J9445n57j6760K146J5559k85J9125J5761
13197C2038K9452j1887l0842L5215L9587L8073N6572N385j999J0698L1724J1097
$$ plain form
13185 245113 144266 75788 49266 27404 26038 43747 72414 70520 64090 41349 -1517 -7152
13173 -7152 29738 31085 38668 79568 73237 41407 29006 39745 46210 66828 33657 22097 20982
13160 20982 7369 -15806 -3747 -11464 -22497 -11686 -28597 -55137 -45653 -19745 21756 37503
13148 37503 21929 12949 14099 22030 23061 27274 37034 42044 9930 -21761 -16211 -13791 -7366 3455
13134 3455 2350 -17693 1361 33647 24832 10593 -30132 -12189 6094 -9746 -45259 -65022
13122 -65022 -61924 -61585 -60676 -41248 -50799 -45231 -51340 -45617 -15505 3631 493 -33219 -28882 -41854
13108 -41854 -28760 -7250 -4295 1788 2266 -12204 16321 2155 -18589 -28483 -36119 -3041 6323
13095 6323 233 -9589 -11325 6149 13627 3392 18253 28391 35957 39413 56586 66804 58761
$$ packed form
13185B45113j00847o8478k6522k1862j366J7709K8667j894o430k2741m2866n635
13173g152L6890J347P583M0900o331l1830j2401J0739O465K0618l3171j1560j115
13160B0982j3613k3175J2059p717j1033J0811j6911k6540R484K5908M1501J5747
13148C7503j5574q980J150P931J031M213R760N010l2114l1691N550K420O425J0821
13134C455j105k0043J9054L2286q815j4239m0725J7943J8283j5840l5513j9763
13122f5022L098L39R09J9428r551N568o109N723L0112J9136l138l3712M337j2972
13108d1854J3094K1510K955O083M78j4470K8525j4166k0744r894p636L3078R364
13095F323o090r822j736J7474P478j0235J4861J0138P566L456J7173J0218q043
$$ plain form
13082 58761 63656 74102 94362 103536 130825 177140 164627 143799 169204 180244 175115 194231
13070 194231 183200 164988 172889 145709 133665 142669 136045 138954 121630 86520 79001 64814
13058 64814 55587 56459 55740 28512 16967 31316 43698 51803 6241 -26346 -9061 -7607 -19832
13045 -19832 -38681 -61193 -45015 -661 1254 -44295 -56249 -24638 -17316 -27230 -33418 -8416
13033 -8416 18751 43403 33535 18364 13860 8451 33275 43970 46515 46118 38612 14238 2668
13020 2668 15020 10824 -9749 -2304 -6119 -11236 -28101 -40985 -12858 3021 -11682 -19774 -14839
13007 -14839 3439 6030 1855 9 -14948 -24921 17553 57372 65614 36409 12051 17249 -6521
12994 -6521 -24018 -25279 -13612 -34809 -18391 -19156 -15149 -749 -1329 -11895 6299 -17779 -7091
$$ packed form
13082E8761M895J0446K0260R174K7289M6315j2513k0828K5405J1040n129J9116
13070A94231j1031j8212P901k7180j2044R004o624K909j7324l5110p519j4187
13058F4814r227Q72p19k7228j1545J4349J2382Q105m5562l2587J7285J454j2225
13045a9832j8849k2512J6178M4354J915m5549j1954L1611P322r914o188K5002
13033h416K7167K4652r868j5171m504n409K4824J0695K545l97p506k4374j1570
13020B668J2352m196k0573P445l815n117j6865j2884K8127J5879j4703q092M935
13007a4839J8278K591m175j846j4957r973M2474L9819Q242k9205k4358N198k3770
12994f521j7497j261J1667k1197J6418p65M007J4400n80j0566J8194k4078J0688
$$ plain form
12981 -7091 2748 9123 14746 9717 778 -2564 23486 45840 53409 30033 526 -31086 -47107
12968 -47107 -53436 -28735 -6469 189 3911 -6900 -26377 -27574 -44901 -53153 -54730 -56616 -48359
12955 -48359 -47175 -76416 -74149 -64229 -66374 -68587 -36857 -16858 -3340 901 -31992 -42465 -30254
12942 -30254 -50960 -54868 -64514 -33359 -44052 -48249 -49117 -56966 -34427 -51127 -41753 -38619 -56201
12929 -56201 -62043 -71687 -94180 -76432 -76187 -61470 -46150 -7113 -1937 -15934 -4310 -11993 -4540
12916 -4540 20145 -5428 -87 24405 13493 16481 24660 2869 -11051 -41271 -44045 -13930 -6655
12903 -6655 5381 20768 2088 -19573 -19747 -22997 -19893 13624 27271 18991 -6033 -25904 -24068
12890 -24068 922 23020 24818 -4711 -14653 -3458 -28386 -78893 -88049 -41950 -1823 -19065
$$ packed form
12981g091R839O375N623n029q939l342K6050K2354P569k3376k9507l1612j6021
12968d7107o329K4701K2266O658L722j0811j9477j197j7327q252j577j886Q257
12955d8359J184k9241K267R920k145k213L1730J9999J3518M241l2893j0473J2211
12942c0254k0706l908r646L1155j0693m197q68p849K2539j6700R374L134j7582
12929e6201n842r644k2493J7748K45J4717J5320L9037N176j3997J1624p683P453
12916d540K4685k5573N341K4492j0912K988Q179k1791j3920l0220k774L0115P275
12903f655J2036J5387j8680k1661j74l250L104L3517J3647q280k5024j9871J836
12890b4068K4990K2098J798k9529r942J1195k4928n0507r156M6099M0127j7242
$$ plain form
12878 -19065 -41345 -21043 -14392 -16361 -14377 -28668 -40621 -29981 -40622 -52008 -48598 -43294 -43348
12865 -43348 -22912 -20471 9976 32996 27368 5344 -7025 -9599 3633 11010 -33115 -64008
12853 -64008 -68278 -32812 -7023 -11760 -23851 -26784 -17964 -15159 -25569 -63108 -73100 -67031 -55648
12840 -55648 -48074 -50128 -54459 -27385 -9354 -2144 -10344 -9395 14444 18197 -11329 -7198 2741 -9263
12826 -9263 -26042 11541 39296 1029 5367 -15741 -40532 -25571 2085 2125 11451 -16341 -8244
12813 -8244 6293 -38281 -35052 -21193 3709 22474 8464 9679 -32615 -63424 -28410 -6264
12801 -6264 -6985 -36570 -63951 -45477 -26638 -22474 -28294 -44461 -50000 -64258 -37705 -33704 -35180
12788 -35180 -11782 -19758 -28517 -9766 15375 26777 25541 38627 34060 -17393 -41806 -64956
$$ packed form
12878a9065k2280K0302O651j969J984j4291j1953J0640j0641j1386L410N304n4
12865d3348K0436K441L0447K3020n628k2024j2369k574J3232P377m4125l0893
12853f4008m270L5466K5789m737j2091k933Q820K805j0410l7539r992O069J1383
12840e5648P574k054m331K7074J8031P210q200R49K3839L753k9526M131R939j2004
12826i263j6779L7583K7755l8267M338k1108k4791J4961K7656M0R326k7792Q097
12813h244J4537m4574L229J3859K4902J8765j4010J215m2294l0809L5014K2146
12801f264p21k9585k7381J8474J8839M164n820j6167n539j4258K6553M001j476
12788c5180K3398p976q759J8751K5141J1402j236J3086m567n1453k4413k3150
$$ plain form
12776 -64956 -79425 -58552 -46390 -43606 4725 31506 17524 -12275 -20744 -24710 -8840 17250
12764 17250 -17346 -27527 28401 62762 47333 54682 100906 151256 183056 212560 257707 275947
12752 275947 299307 310084 300275 282572 260281 233042 193996 162127 143396 132572 125964 96109
12740 96109 70793 107295 94485 72513 72901 59845 46620 52075 29488 17642 3760 3677 16267
12727 16267 10189 -2298 -23037 -37803 -55160 -43823 -28513 -8240 4669 -11926 -12335 8190
12715 8190 28025 27683 37326 36052 50452 67605 46511 -6235 -40916 -48520 -48777 -33397 -21482
12702 -21482 4840 7101 -5277 5959 26316 45396 43914 -12631 -7961 3582 -25393 -60035
12690 -60035 -53797 -22999 4219 -3832 7944 29548 20568 -26563 -41103 -19220 -6357 1807
$$ packed form
12776f4956j4469K0873J2162K784M8331K6781j3982k9799q469l966J5870K6090
12764A7250l4596j0181N5928L4361j5429P349M6224N0350L1800K9504M5147J8240
12752B75947K3360J0777r809j7703k2291k7239l9046l1869j8731j0824o608k9855
12740I6109k5316L6502j2810k1972L88j3056j3225N455k2587j1846j3882q3J2590
12727A6267o078j2487k0739j4766j7357J1337J5310K0273J2909j6595m09K0525
12715H190J9835l42R643j274J4400J7153k1094n2746l4681p604k57J5380J1915
12702b1482K6322K261j2378J1236K0357J9080j482n6545M670J1543k8975l4642
12690f0035O238L0798K7218q051J1776K1604q980m7131j4540K1883J2863Q164
$$ plain form
12678 1807 -26846 -51033 -27020 -19202 -3625 -8299 -33091 -30477 -38152 -54318 -32877 8669 13746
12665 13746 -37988 -77814 -70090 -34529 -8467 30249 44542 49328 49181 32956 8150 27628
12653 27628 25944 24334 2079 -8703 -34136 -22702 -11370 3509 5611 699 6028 -1878 -1196
12640 -1196 21007 35695 1439 -8134 -1114 2103 13756 19713 10258 8131 36884 55358 36522
12627 36522 15672 1659 18021 26255 -7800 5147 3071 -559 -30109 -18547 -16046 -1151
12615 -1151 4798 -10297 -8859 34123 85141 94655 106893 147435 177412 155218 145504 143896 128408
12602 128408 127636 112925 88449 80056 81249 60232 20402 1590 36285 24427 -6941 2370
12590 2370 -16450 -693 -3751 -15465 -30360 12005 34016 -6358 -35404 -26320 -34470 -71405
$$ packed form
12678A807k8653k4187K4013P818J5577m674k4792K614p675j6166K1441M1546N077
12665A3746n1734l9826P724L5561K6062L8716J4293M786j47j6225k4806J9478
12653B7628j684j610k2255j0782k5433J1434J1332J4879K102m912N329p906O82
12640a196K2203J4688l4256r573P020L217J1653N957r455k127K8753J8474j8836
12627C6522k0850j4013J6362Q234l4055J2947k076l630k9550J1562K501J4895
12615a151N949j5095J438M2982N1018R514J2238M0542K9977k2194r714j608j5488
12602A28408p72j4711k4476q393J193k1017l9830j8812L4695j1858l1368R311
12590B370j8820J5757l058j1714j4895M2365K2011m0374k9046R084q150l6935
$$ plain form
12578 -71405 -71510 -38058 -28474 -7595 -6416 -13797 10331 -24763 -40258 -10221 20177 29957 23136
12565 23136 19541 2434 3872 2940 -22406 -46387 -61896 -49436 -7101 10995 27767 18335 -20652
12552 -20652 -11838 -7601 -62729 -69578 -74281 -72764 -66260 -65508 -65916 -51699 -34173 -19949 -8429 -4501
12538 -4501 1481 -441 -16613 -16351 5864 35067 49526 50976 19928 -7506 -15668 4334 46162
12525 46162 17351 -6776 -16500 -9063 -12240 6082 48632 80174 56191 4102 -23449 -1924
12513 -1924 1351 16050 185 -2864 -8335 -4610 -14047 -6161 -24888 -30550 -26648 -2068 18657
12500 18657 405 -6891 277 20808 -1514 36825 57830 70071 55479 42029 33197 -4554
12488 -4554 -13083 -11463 -18349 3383 28844 11520 -19779 1703 56393 88253 71503 42921
$$ packed form
12578g1405j05L3452R584K0879J179p381K4128l5094j5495L0037L0398R780o821
12565B3136l595j7107J438r32k5346k3981j5509J2460M2335J8096J6772r432l8987
12552b0652Q814M237n5128o849m703J517O504P52m08J4217J7526J4224J1520L928
12538d501N982j922j6172K62K2215K9203J4459J450l1048k7434q162K0002M1828
12525D6162k8811k4127r724P437l177J8322M2550L1542k3983n2089k7551K1525
12513a924L275J4699j5865l049n471L725r437P886j8727n662L902K4580K0725
12500A8657j8252p296P168K0531k2322L8339K1005J2241j4592j3450q832l7751
12488d554q529J620o886K1732K5461j7324l1299K1482N4690L1860j6750k8582
$$ plain form
12476 42921 56536 60962 38892 57620 66449 52867 36049 14131 25827 28632 4165 -21057
12464 -21057 26366 44367 61182 61099 33208 27962 25091 4137 3297 41574 89848 106284 124041
12451 124041 129634 114283 126152 105407 83647 115184 124815 147790 166917 153215 138149 118277
12439 118277 107381 99748 102429 100705 103358 105181 117674 120235 102008 99966 92460 65778 71994
12426 71994 101195 98606 63529 76358 73323 74725 70294 67797 66913 57204 66721 43126 51733 87702
12412 87702 89198 85456 69695 107177 131471 138716 143193 118508 105541 105863 117330 114151 117792
12399 117792 138164 135158 143883 138183 132349 114793 96910 119076 182112 197710 204739 212362 220867
12386 220867 230836 251189 274651 307224 331182 328438 352555 390358 385189 394633 429626 463736
$$ packed form
12476D2921J3615M426k2070J8728Q829j3582j6818k1918J1696K805k4467k5222
12464b1057M7423J8001J6815q3k7891n246k871k0954q40L8277M8274J6436J7757
12451A24041N593j5351J1869k0745k1760L1537R631K2975J9127j3702j5066j9872
12439A18277j0896p633K681j724K653J823J2493K561j8227k042p506k6682O216
12426G1994K9201k589l5077J2829l035J402m431k497q84r709R517k3595Q607L5969
12412H7702J496l742j5761L7482K4294P245M477k4685j2967L22J1467l179L641
12399A17792K0372l006Q725n700n834j7556j7883K2166O3036J5598P029P623Q505
12386B20867R969K0353K3462L2573K3958k744K4117L7803n169R444L4993L4110
$$ plain form
12374 463736 501894 543018 572813 632896 699477 744183 759149 824386 951088 1060605 1175305
12363 1175305 1357318 1546768 1744838 1987841 2286961 2657308 3100403 3561081 4034145
12354 4034145 4592872 5215820 5957337 6810998 7811717 9113983 10939689 13455122 16804176
12345 16804176 21063023 26224147 32181979 38628972 45160652 51263666 56340541 59919978
12337 59919978 61618510 61252003 58901057 54856963 49513604 43461470 37230149 31370981
12329 31370981 26233587 21970454 18602403 16119582 14306826 12959677 11873409 10990971
12321 10990971 10235865 9548100 8888263 8240292 7651218 7134879 6659491 6232640 5818996
12312 5818996 5483042 5218814 4948330 4690477 4512135 4352271 4180149 4003257 3862891
$$ packed form
12374D63736L8158M1124K9795O0083O6581M4706J4966O5237J26702J09517J14700
12363A175305J82013J89450J98070K43003K99120L70347M43095M60678M73064
12354D034145N58727O22948P41517Q53661J000719J302266J825706K515433L349054
12345A6804176M258847N161124N957832O446993O531680O103014N076875L579437
12337E9919978J698532l66507k350946m044094n343359o052134o231321n859168
12329C1370981n137394m263133l368051k482821j812756j347149j086268q82438
12321A0990971p55106o87765o59837o47971n89074n16339m75388m26851m13644
12312E818996l35954k64228k70484k57853j78342j59864j72122j76892j40366
$$ plain form
12303 3862891 3727889 3608086 3477034 3313040 3172487 3075431 2963916 2826884 2701322 2585699
12293 2585699 2526265 2453678 2379816 2310508 2251015 2170322 2099457 2040039 1986047 1935475 1884121
12282 1884121 1787793 1718545 1695418 1646510 1578610 1524165 1465927 1433437 1380142 1336474 1265557
12271 1265557 1212617 1185663 1156282 1103262 1086555 1070342 1063169 1038190 1013166 984096 955816
12260 955816 928674 894422 880272 854059 847748 815665 805069 820101 788060 738425 698693 709408
12248 709408 716280 662742 613172 610638 573879 572334 593973 591794 552425 559422 554588 535033 517977
12235 517977 500428 481865 500562 534355 530417 533640 538932 558004 612139 678497 783607 912796
12223 912796 1019143 1098257 1152051 1220720 1279985 1273054 1243720 1191582 1143393 1069079 969348
$$ packed form
12303C862891j35002j19803j31052j63994j40553r7056j11515j37032j25562j15623
12293B585699n9434p2587p3862o9308n9493q0693p0865n9418n3992n0572n1354
12282A884121r6328o9248k3127m8908o7900n4445n8238l2490n3295m3668p0917
12271A265557n2940k6954k9381n3020j6707j6213p173k4979k5024k9070k8280
12260I55816k7142l4252j4150k6213o311l2083j0596J5032l2041m9635l9732J0715
12248G09408O872n3538m9570k534l6759j545K1639k179l9369O997m834j9555j7056
12235E17977j7549j8563J8697L3793l938L223N292J9072N4135O6358J05110J29189
12223I12796J06347P9114N3794O8669N9265o931k9334n2138m8189p4314r9731
$$ plain form
12212 969348 869300 766716 678573 627416 570800 521468 463480 418947 410199 405801 387752
12201 387752 334540 301910 281569 266680 239998 253623 241242 248757 231021 222250 203212 186800
12189 186800 166071 187969 191200 195361 208078 200075 209264 186473 176974 200108 235566 227349 168180
12176 168180 144943 141066 134691 111410 97100 122126 119330 118091 138906 134038 122812 135700
12164 135700 137584 147627 144869 127816 140232 164894 149255 142458 156699 118421 75018 73221
12152 73221 92881 100329 113859 135226 123139 83524 31518 51154 113112 147460 135492 143280
12140 143280 112008 79252 73663 94077 109345 108736 108471 100952 79982 63309 69841 78665 75761
12127 75761 80153 66185 66795 54568 27192 61605 106950 115895 77506 43976 71005 77186 86717
$$ packed form
12212I69348j00048j02584q8143n1157n6616m9332n7988m4533q748m398j8049
12201C87752n3212l2630k0341j4889k6682J3625j2381P515j7736q771j9038j6412
12189A86800k0729K1898L231M161J2717q003R189k2791r499K3134L5458q217n9169
12176A68180k3237l877o375k3281j4310K5026k796j239K0815m868j1226J2888
12164A35700J884J0043k758j7053J2416K4662j5639o797J4241l8278m3403j797
12152G3221J9660P448J3530K1367j2087l9615n2006J9636O1958L4348j1968P788
12140A43280l1272l2756n589K0414J5268o09k65p519k0970j6673O532Q824k904
12127G5761M392j3968O10j2227k7376L4413M5345Q945l8389l3530K7029O181R531
$$ plain form
12114 86717 94897 72710 87856 86709 73974 91294 68768 55418 61324 45241 13600 9516
12102 9516 17880 33546 56649 81081 81246 73868 57928 56089 41057 26412 20393 31020 25033
12089 25033 28629 62169 70128 53580 57939 51390 56235 52915 42003 33924 66785 67245 85466
12076 85466 90817 63403 56457 37537 24101 49011 51538 44922 42558 30907 46337 77159 84997
12063 84997 59238 42057 31293 33058 55337 69911 58269 56177 38184 30263 5032 -21721
12051 -21721 -12047 7940 30861 17479 -7313 15582 40930 21318 26697 43044 57988 71041
12039 71041 46786 -12467 -11800 16632 52469 37508 53574 54977 43476 44870 33744 27426 46821
12026 46821 58410 69503 48080 12158 2108 -14826 4539 -1112 -10064 -26582 -19790 19758
$$ packed form
12114H6717Q180k2187J5146j147j2735J7320k2526j3350N906j6083l1641m084
12102I516Q364J5666K3103K4432J65p378j5940j839j5032j4645o019J0627n987
12089B5033L596L3540P959j6548M359o549M845l320j0912q079L2861M60J8221
12076H5466N351k7414o946j8920j3436K4910K527o616k364j1651J5430L0822P838
12063H4997k5759j7181j0764J765K2279J4574j1642k092j7993p921k5231k6753
12051b1721R674J9987K2921j3382k4792K2895K5348j9612N379J6347J4944J3053
12039G1041k4255n9253O67K8432L5837j4961J6066J403j1501J394j1126o318J9395
12026D6821J1589J1093k1423l5922j0050j6934J9365n651q952j6518O792L9548
$$ plain form
12014 19758 27358 17342 1368 -9577 -32073 -50783 -35490 -9172 10936 580 -892 -8623
12002 -8623 -15527 19382 39182 4924 -731 1735 12511 14101 20832 23513 45469 26864 34774
11989 34774 39104 54704 6936 -7282 -16290 -11424 6852 23780 12125 16465 12187 33239 29021
11976 29021 9475 31025 16665 6689 16235 47514 87438 138500 208972 312660 371917 415454
11964 415454 412895 436055 467654 455597 371882 260538 196429 160110 126556 102062 79730
11953 79730 92889 142350 133282 124372 105934 100081 89960 63340 68048 84134 83834 49067 36608
11940 36608 57470 60164 62880 59070 52056 74331 50848 39965 53409 64809 71727 86636 87145
11927 87145 80152 69841 78027 102379 100833 119630 148401 205908 256610 300380 319679 304751
$$ packed form
12014A9758P600j0016j5974j0945k2496j8710J5293K6318K0108j0356j472p731
12002h623o904L4909J9800l4258n655K466J0776J590O731K681K1956j8605P910
11989C4774M330J5600m7768j4218r008M866J8276J6928j1655M340m278K1052m218
11976B9021j9546K1550j4360r976R546L1279L9924N1062P0472J03688N9257M3537
11964D15454k559K3160L1599j2057q3715j11344o4109l6319l3554k4494k2332
11953G9730J3159M9461r068q910j8438n853j0121k6620M708J6086l00l4767j2459
11940C6608K0862K694K716l810p014K2275k3483j0883J3444J1400O918J4909N09
11927H7145o993j0311Q186K4352j546J8797K8771N7507N0702M3770J9299j4928
$$ plain form
11915 304751 298379 273984 239143 202227 158046 151923 158597 149440 128858 134399 121291 92408
11903 92408 86711 90068 120434 119665 105728 67382 42169 46372 30248 16618 40245 41180 30708
11890 30708 32983 23462 44516 71978 67406 49756 10718 -16507 -29621 10138 36958 42295
11878 42295 -6636 -23940 -19531 -39519 -55241 -53756 -6092 40563 46394 32011 29331 41189
11866 41189 40338 23207 34575 57431 92567 54314 21357 18678 22424 9972 12697 18197 2257
11853 2257 21333 55235 61148 21278 5159 6802 30063 56725 23109 15428 5353 27009
11841 27009 36368 35909 37627 32414 28797 23022 41574 46097 32816 257 -23768 -497 23083
11828 23083 19865 39299 25224 13894 -6965 7766 25986 42150 58277 59199 15012 -27710
$$ packed form
11915C04751o372k4395l4841l6916m4181o123O674r157k0582N541j3108k8883
11903I2408n697L357L0366p69j3937l8346k5213M203j6124j3630K3627R35j0472
11890C0708K275r521K1054K7462m572j7650l9038k7225j3114L9759K6820N337
11878D2295m8931j7304M409j9988j5722J485M7664M6655N831j4383k680J1858
11866D1189q51j7131J1368K2856L5136l8253l2957k679L746j2452K725N500j5940
11853B257J9076L3902N913l9870j6119J643K3261K6662l3616p681j0075K1656
11841B7009R359m59J718n213l617n775J8552M523j3281l2559k4025K3271K3580
11828B3083l218J9434j4075j1330k0859J4731J8220J6164J6127R22m4187m2722
$$ plain form
11816 -27710 -43353 -1209 -7865 -23164 4249 36122 30098 20553 11977 1616 -44176 -82872
11804 -82872 -88923 -41081 2851 3296 -29828 -44743 -19787 481 -7384 -20329 -49501 -21280
11792 -21280 8996 12547 10875 -318 28345 34402 19150 10576 11528 -4338 -32286 -3226 19227
11779 19227 38032 15493 3154 22958 46700 34306 15870 35758 19226 11197 4943 -5392
11767 -5392 -481 11106 24338 14674 -11586 -22377 -51196 -47106 -13402 2953 1047 -19573 -7762
11754 -7762 4473 26962 20198 -41925 -66405 -48886 -49380 -18253 26264 9776 -835 29167
11742 29167 15032 -7037 430 -11209 -34115 -10379 -425 -18040 -19110 -9307 -11426 6597 -4011
11729 -4011 -27416 -38615 -39617 -25041 -21468 -41439 -36986 -19455 -27001 -76020 -60294 -35054 -21481
$$ packed form
11816b7710j5643M2144o656j5299K7413L1873o024r545q576j0361m5792l8696
11804h2872o051M7842M3932M45l3124j4915K4956K0268p865j2945k9172K8221
11792b1280L0276L551j672j1193K8663O057j5252q574R52j5866k7948K9060K2453
11779A9227J8805k2539j2339J9804K3742j2394j8436J9888j6532q029o254j0335
11767e392M911J1587J3232r664k6260j0791k8819M090L3704J6355j906k0620J1811
11754g762J2235K2489o764o2123k4480J7519m94L1127M4517j6488j0611L0002
11742B9167j4135k2069P467j1639k2906K3736R954j7615j070R803k119J8023j0608
11729d011k3405j1199j002J4576L573j9971M453J7531p546m9019J5726K5240J3573
$$ plain form
11716 -21481 -40154 -50469 -28548 28097 34465 9267 -8445 -12433 -27217 -20188 6979 8880
11704 8880 -28712 -39428 -35978 -52337 -44264 -26250 -29822 -29312 -33031 -35027 -18374 -10174 -20630
11691 -20630 -26214 -8941 -32082 -31310 -12287 -3083 -49496 -67879 -52569 -17575 22334 16000 -7091
11678 -7091 -9786 -3598 -6743 25288 18201 4627 23044 17745 5188 5828 43121 39187 25776
11665 25776 -10805 -16071 -19788 -13490 -2416 -15916 -27876 -28808 -8983 -2524 7733 416 13389
11652 13389 20774 36527 28996 16290 -15781 -18712 -1666 7158 7196 -29064 -43320 -44885 -26663
11639 -26663 1453 -870 -12906 -17894 -19851 -13759 23360 43370 22074 2012 18954 46461
11627 46461 37806 -11037 -22788 -10334 -17936 11976 11123 19367 14705 -14025 823 16742 3950
$$ packed form
11716b1481j8673j0315K1921N6645O368k5198j7712l988j4784P029K7167J901
11704H880l7592j0716L450j6359Q073J8014l572N10l719j996J6653Q200j0456
11691b0630n584J7273k3141P72J9023R204m6413j8383J5310L4994L9909o334k3091
11678g091k695O188l145L2031p087j3574J8417n299j2557O40L7293l934j3411
11665B5776l6581n266l717O298J1074j3500j1960r32J9825O459J0257p317J2973
11652A3389P385J5753p531j2706l2071k931J7046Q824L8l6260j4256j565J8222
11639b6663K8116k323j2036m988j957O092L7119K0010k1296k0062J6942K7507
11627D6461q655m8843j1751J2454p602K9912q53Q244m662k8730J4848J5919j2792
$$ plain form
11614 3950 10095 13718 4205 -1633 -3746 2017 5193 -2224 7238 15483 22427 15091 32886 42327
11600 42327 64482 50149 4508 -22628 3314 34682 52378 79660 84947 63351 21041 14853
11588 14853 17330 21784 14165 -10174 -18856 -20837 -12006 8453 -290 -25860 -21934 -10399 -5648
11575 -5648 -17245 -20901 11362 9377 22837 26941 40242 10091 -3402 -15949 -14729 -4716 -28196
11562 -28196 -46073 -50301 -11959 11071 -3267 -2854 28420 336 -14028 8528 20087 43974
11550 43974 43422 48901 56520 74890 83896 69247 25012 -2340 -4170 -14276 -21151 -36201 -15825
11537 -15825 -2986 -22367 -56021 -48558 -34237 -23565 -29314 -12836 1000 19431 9388 -3083
11525 -3083 33086 61730 77187 61459 58636 59024 79696 56242 29083 -9114 -20129 -14451 15070
$$ packed form
11614C950O145L623r513n838k113N763L176p417R462Q245O944p336J7795R441
11600D2327K2155j4333m5641k7136K5942L1368J7696K7282N287k1596m2310o188
11588A4853K477M454p619k4339q682j981Q831K0459q743k5570L926J1535M751
11575e648j1597l656L2263j985J3460M104J3301l0151j3493j2547J220J0013k3480
11562b8196j7877m228L8342K3030j4338M13L1274k8084j4364K2556J1559K3887
11550D3974n52N479P619J8370R006j4649m4235k7352j830j0106o875j5050K0376
11537a5825J2839j9381l3654P463J4321J0672n749J6478J3836J8431j0043j2471
11525c083L6169K8644J5457j5728k823L88K0672k3454k7159l8197j1015N678K9521
$$ plain form
11512 15070 41185 53188 48324 59678 75570 100208 82943 57426 62046 61581 47907 6425
11500 6425 1367 -8919 -3185 12792 41099 60969 43528 23415 32739 57983 41372 59837
11488 59837 57607 27884 33875 23988 19521 25200 6161 -24533 -14685 10708 3008 -20243 -8554
11475 -8554 -29256 -22095 -24235 -61315 -34791 -8991 29815 47839 26294 33896 63088 58750 26107
11462 26107 39514 41239 66979 86128 79938 63181 33770 26147 60516 53804 53358 19708 10186
11449 10186 16894 33589 43425 31857 5242 28780 58842 50937 45791 32810 37770 37225 22156
11436 22156 -1946 -33024 -25756 -14639 -11251 10489 18368 25111 27988 22642 48385 69144 51607
11423 51607 38886 16714 4244 -1057 8749 4324 15677 21400 16859 7522 24315 55603 29746
$$ packed form
11512A5070K6115J2003m864J1354J5892K4638j7265k5517M620m65j3674m1482
11500F425n058j0286N734J5977K8307J9870j7441k0113R324K5244j6611J8465
11488E9837k230k9723N991r887m467N679j9039l0694R848K5393p700k3251J1689
11475h554k0702P161k140l7080K6524K5800L8806J8024k1545P602K9192m338l2643
11462B6107J3407J725K5740J9149o190j6757k9411p623L4369o712m46l3650r522
11449A0186O708J6695R836j1568k6615K3538L0062p905n146j2981M960n45j5069
11436B2156k4102l1078P268J1117L388K1740P879O743K877n346K5743K0759j7537
11423E1607j2721k2172j2470n301R806m425J1353N723m541r337J6793L1288k5857
$$ plain form
11410 29746 -35839 -71015 -38542 -13571 5119 -9825 -19318 -39201 -26900 4000 44821 49019
11398 49019 -1528 -11205 -27814 -33475 -25857 -17840 -38913 -38654 -20079 -5117 -16355 -18849 -3890
11385 -3890 -11900 14293 -1582 -36193 -34919 -1639 18232 16186 10820 7478 12836 1095 10887
11372 10887 13480 -20929 -18660 -5951 -25185 -7605 8078 933 -6667 -20307 -29457 -27411 -21153
11359 -21153 -12214 -8653 -40270 -37038 -38261 -26672 -25578 -9549 -17889 11760 71902 79703 49175
11346 49175 9159 -8433 -2576 22236 23680 13202 2763 1053 14220 -6204 -7157 -15298 -8233
11333 -8233 -24827 -43158 -18207 3159 -936 -13349 -26119 -39100 -35615 -31765 -18782 33207
11321 33207 59984 48861 39691 9147 -29299 -62259 -74500 -57268 -37736 -24669 8377 -19326
$$ packed form
11410B9746o5585l5176L2473K4971J8690j4944r493j9883J2301L0900M0821M198
11398D9019n0547r677j6609n661P618Q017k1073K59J8575J4962j1238k494J4959
11385c890q010K6193j5875l4611J274L3280J9871k046n366l342N358j1741R792
11372A0887K593l4409K269J2709j9234J7580J5683p145p600j3640r150K046O258
11359b1153Q939L561l1617L232j223J1589J094J6029q340K9649O0142P801l0528
11346D9175m0016j7592N857K4812J444j0478j0439j710J3167k0424r53q141P065
11333h233j6594j8331K4951K1366m095j2413j2770j2981L485L850J2983N1989
11321C3207K6777j1123r170l0544l8446l2960j2241J7232J9532J3067L3046k7703
$$ plain form
11309 -19326 -49995 -44699 -49552 -39018 -55735 -34920 -22612 -27224 -45638 -29515 -10380 -13599
11297 -13599 16458 33210 34859 30697 35104 39067 39123 24267 5312 -20095 -21635 -24003 -24936 -19608
11283 -19608 -23788 -4160 376 3724 11864 6343 14549 4426 -630 11427 -13833 -30058 2133
11270 2133 567 -6630 -5414 -18472 9566 42462 47621 32787 2245 -8858 4170 -1304 -18818
11257 -18818 -2400 29280 30027 24667 34423 26925 5626 17466 19034 6404 -5618 -23846 -4215
11244 -4215 -3897 36534 69680 33449 16211 37896 50992 31694 26097 16519 25806 6600 30539
11231 30539 57590 81323 75657 43786 17258 -8614 -6820 22867 50987 50976 61128 48272 31477
11218 31477 39411 44879 50844 42296 46468 35752 20319 5236 25420 40233 37330 27270 6283
$$ packed form
11309a9326l0669N296m853J0534j6717K0815J2308m612j8414J6123J9135l219
11297a3599L0057J6752J649m162M407L963N6j4856j8955k5407j540k368r33N328
11283a9608m180J9628M536L348Q140n521Q206j0123n056J2057k5260j6225L2191
11270B133j566p197J216j3058K8038L2896N159j4834l0542j1103J3028n474j7514
11257a8818J6418L1680P47n360R756p498k1299J1840J568j2630j2022j8228J9631
11244d215L18M0431L3146l6231j7238K1685J3096j9298n597r578R287j9206K3939
11231C0539K7051K3733n666l1871k6528k5872J794K9687K8120j1J0152j2856j6795
11218C1477P934N468N965q548M172j0716j5433j5083K0184J4813k903j0060k0987
$$ plain form
11205 6283 4085 -6946 24980 12337 -23096 -38872 -18729 1266 1837 -33258 4472 43010
11193 43010 38457 40018 33958 58199 27066 -1127 21475 46491 51785 69109 90333 97533 62735
11180 62735 67919 69559 46805 53667 64818 71206 46218 16010 5782 30673 56786 40557
11168 40557 57810 103652 92104 86256 48670 17785 46707 78329 92997 101328 128968 136005
11156 136005 146935 125495 132042 127299 118578 116157 132042 147595 174753 178400 181458 167015 148645
11143 148645 156273 156297 151888 145466 140256 151242 151756 178467 166593 145243 107642 88581 81044
11130 81044 88438 118310 148690 130619 100690 92364 99722 105058 95883 88607 84858 92750 98597
11117 98597 94900 72847 89053 111707 131415 127556 120170 127850 125256 101957 76598 87089 90594
$$ packed form
11205F283k198j1031L1926j2643l5433j5776K0143J9995N71l5095L7730L8538
11193D3010m553J561o060K4241l1133k8193K2602K5016N294J7324K1224P200l4798
11180F2735N184J640k2754O862J1151O388k4988l0208j0228K4891K6113j6229
11168D0557J7253M5842j1548n848l7586l0885K8922L1622J4668Q331K7640P037
11156A36005J0930k1440O547m743q721k421J5885J5553K7158L647L058j4443j8370
11143A48645P628K4m409o422n210J0986N14K6711j1874k1350l7601j9061p537
11130H1044P394K9872L0380j8071k9929q326P358N336r175p276l749P892N847
11117I8597l697k2053J6206K2654J9708l859p386P680k594k3299k5359J0491L505
$$ plain form
11104 90594 57458 51588 56308 77325 86797 87387 76430 57176 30567 32605 36704 76855 74769
11091 74769 77257 78246 26127 16170 10130 22553 63479 80089 85568 77266 36286 27838 23504
11078 23504 48558 42760 22696 7738 27613 14191 28377 71750 93483 80350 53103 33945
11066 33945 19239 29636 31790 19280 26804 29500 48738 71257 54284 -5290 -21797 7761
11054 7761 16271 24445 28131 43047 63737 31622 18731 21739 47481 36376 60753 59107 73499
11041 73499 93833 109715 92966 71566 78771 84615 69499 63330 60403 89893 95899 72384 45797
11028 45797 34738 38298 51601 81242 111461 126385 128093 163730 159843 111356 114394 132597
11016 132597 135614 124965 110075 111896 127230 136081 125754 117465 135500 162172 162782 174786 169501
$$ packed form
11104I0594l3136n870M720K1017R472N90j0957j9254k6609K038M099M0151k086
11091G4769K488R89n2119r957o040J2423M0926J6610N479q302m0980q448m334
11078B3504K5054n798k0064j4958J9875j3422J4186M3373K1733j3133k7247j9158
11066C3945j4706J0397K154j2510P524K696J9238K2519j6973n9574j6507K9558
11054G761Q510Q174L686J4916K0690l2115j2891L008K5742j1105K4377j646J4392
11041G3499K0334J5882j6749k1400P205N844j5116o169k927K9490O006k3515k6587
11028D5797j1059L560J3303K9641L0219J4924J708L5637l887m8487L038J8203
11016A32597L017j0649j4890J821J5334Q851j0327q289J8035K6672O10J2004n285
$$ plain form
11003 169501 187342 223042 247485 250105 216484 193058 217617 236267 231079 234934 199617 196756
10991 196756 210726 179643 166918 135707 103993 70667 98644 114176 105573 112442 98757 69398
10979 69398 67190 67291 62094 71279 95314 91244 56648 44941 63653 85072 83742 54876 35884
10966 35884 20883 37583 44460 49204 61432 73983 59093 59098 69745 69441 87825 90623 63368
10953 63368 73223 69982 61119 43403 28430 32544 18146 52620 51721 26012 -14116 -29683 -7863
10940 -7863 19201 37193 55163 54332 32798 17866 32683 64932 54285 24190 16288 26984
10928 26984 28627 -1591 1943 -18042 -21763 -14538 -5626 -11842 -1737 23802 17283 -4731 18231
10915 18231 31412 10770 -1966 -10633 -16816 -11698 -1882 -14222 -20456 -20688 -36280 -46822 -27139
$$ packed form
11003A69501J7841L5700K4443K620l3621k3426K4559J8650n188L855l5317k861
10991A96756J3970l1083j2725l1211l1714l3326K7977J5532q603O869j3685k9359
10979F9398k208J01n197R185K4035m070l4596j1707J8712K1419j330k8866j8992
10966C5884j5001J6700O877M744J2228J2551j4890NJ0647l04J8384K798k7255
10953F3368R855l241q863j7716j4973M114j4398L4474q99k5709m0128j5567K1820
10940g863K7064J7992J7970q31k1534j4932J4817L2249j0647l0095p902J0696
10928B6984J643l0218L534j9985l721P225Q912o216J0105K5539o519k2014K2962
10915A8231J3181k0642j2736q667o183N118R816j2340o234k32j5592j0542J9683
$$ plain form
10902 -27139 -13252 19203 40011 21326 24463 43990 35262 20851 24676 53708 53096 60435 43989
10889 43989 12441 -15836 -53893 -47736 1807 54922 47099 23181 -8644 -41905 -58150 -54833
10877 -54833 -36787 -21233 -14459 -22667 -15485 -19524 -5880 -3858 -39087 -15082 -4250 -25059 -34544
10864 -34544 -46691 -60769 -30854 -37119 -46643 -22845 -20315 29499 63540 16252 -26082 -18127
10852 -18127 -19696 -19258 8072 -866 11633 17366 2536 1306 25579 49148 59380 24894 -16061
10839 -16061 -25152 -34468 -22327 19015 23409 46911 48445 62500 59564 39004 -4300 -43050 -1151
10826 -1151 20089 12865 -18262 -5664 -4656 3070 47112 76909 76684 41047 16724 -6329 -11153
10813 -11153 19612 49447 51347 55785 45022 58413 75993 66772 81848 83408 27413 6469
$$ packed form
10902b7139J3887L2455K0808j8685L137J9527q728j4411L825K9032o12P339j6446
10889D3989l1548k8277l8057O157M9543N3115p823k3918l1825l3261j6245L317
10877e4833J8046J5554O774q208P182m039J3644K022l5229K4005J0832k0809r485
10864c4544j2147j4078K9915o265r524K3798K530M9814L4041m7288m2334P955
10852a8127j569M38K7330q938J2499N733j4830j230K4273K3569J0232l4486m0955
10839a6061r091r316J2141M1342M394K3502J534J4055k936k0560m3304l8750M1899
10826a151K1240p224l1127J2598J008P726M4042K9797k25l5637k4323k3053m824
10813a1153L0765K9835J900M438j0763J3391J7580r221J5076J560n5995k0944
$$ plain form
10801 6469 28993 48271 24496 9759 5904 1618 9739 -5830 -4678 35176 34278 9442 19669
10788 19669 15465 33410 292 -9893 11959 44859 60115 24921 -1660 9862 16158 -179
10776 -179 5588 16684 23382 10714 2139 -4008 18666 28995 -2694 -358 5389 9323 53762
10763 53762 69231 84703 112839 93394 70555 70435 69339 56249 25806 29052 38278 18577 45507
10750 45507 49997 60177 53773 40782 51263 49816 23897 -3565 24701 44401 44969 67687 93578
10737 93578 96764 100042 78762 81250 59111 48023 24485 48622 78707 77017 76998 94854 102564
10724 102564 107548 117395 102783 105474 127121 163790 172889 150871 159105 184140 170749 143169
10712 143169 152269 182539 210301 230744 215258 220744 212950 224840 255814 303608 326966 343642
$$ packed form
10801F469K2524J9278k3775j4737l855m286Q121j5569J152L9854q98k4836J0227
10788A9669m204J7945l3118j0185K1852L2900J5256l5194k6581J1522O296j6337
10776a79N767J1096O698j2668q575o147K2674J0329l1689K336N747L934M4439
10763E3762J5469J5472K8136j9445k2839j20j096j3090l0443L246R226j9701K6930
10750D5507M490J0180o404j2991J0481j447k5919k7462K8266J9700N68K2718K5891
10737I3578L186L278k1280K488k2139j1088k3538K4137L0085j690j9J7856P710
10724A02564M984R847j4612K691K1647L6669R099k2018Q234K5035j3391k7580
10712A43169R100L0270K7762K0443j5486N486p794J1890L0974M7794K3358J6676
$$ plain form
10700 343642 385259 395160 366285 360650 352973 368215 338949 316781 331351 335765 323609 319343
10688 319343 349310 375930 375729 415051 444378 445396 468384 481425 473437 468421 465544 487249 507921
10675 507921 491375 498399 504052 504805 507960 502539 521938 543593 575451 609087 645336 698397 745477
10662 745477 802510 838744 861128 891335 926912 974163 1041667 1054946 1056013 1113459 1208669 1358827
10650 1358827 1467071 1589916 1750376 1880708 1977485 2067387 2168485 2299437 2380335 2431560
10640 2431560 2499313 2596987 2674032 2728162 2756545 2754522 2733303 2752331 2805363 2861540 2915177
10629 2915177 3029469 3237702 3575806 4026896 4578258 5377005 6382165 7572369 8856331
10620 8856331 10099762 11206218 12124228 12870619 13487212 13856907 13964655 13961430 13960034 14020775
$$ packed form
10700C43642M1617R901k8875n635p677J5242k9266k2168J4570M414j2156m266
10688C19343K9967K6620k01L9322K9327J018K2988J3041p988n016k877K1705K0672
10675E07921j6546P024N653P53L155n421J9399K1655L1858L3636L6249N3061M7080
10662G45477N7033L6234K2384L0207L5577M7251O7504J3279J067N7446R5210J50158
10650A358827J08244J22845J60460J30332R6777Q9902J01098J30952Q0898N1225
10640B431560O7753R7674P7045N4130K8383k023k1219J9028N3032N6177N3637
10629B915177J14292K08233L38104M51090N51362P98747J005160J190204J283962
10620H856331J243431J106456R18010P46391O16593L69695J07748l225j396O0741
$$ plain form
10610 14020775 14183964 14433032 14707014 14979185 15215794 15360814 15411271 15404063 15378314 15510332
10600 15510332 15815855 16202207 16597988 17012764 17549987 18180006 18833395 19501396 20069656
10591 20069656 20604407 21074848 21429952 21755578 22145783 22621551 23172020 23889994 24730728
10582 24730728 25731154 27030322 28676055 30516790 32384189 34091665 35378611 36205682
10574 36205682 36715992 36869943 36487530 35351643 33680890 32042938 30749615 29807535 29120742
10565 29120742 28579001 28202299 27948332 27688574 27309786 26810764 26251682 25703507 25115806
10556 25115806 24393349 23550895 22687508 21902346 21307254 20846471 20473156 20127494 19895189
10547 19895189 19802346 19823338 19856480 19831090 19751045 19702371 19685831 19652892 19618310 19608981 19668081
$$ packed form
10610A4020775J63189K49068K73982K72171K36609J45020N0457p208k5749J32018
10600A5510332L05523L86352L95781M14776N37223O30019O53389O68001N68260
10591B0069656N34751M70441L55104L25626L90205M75768N50469P17974Q40734
10582B4730728J000426J299168J645733J840735J867399J707476J286946Q27071
10574C6205682N10310J53951l82413j135887j670753j637952j293323r42080o86793
10565B9120742n41741l76702k53967k59758l78788m99022n59082n48175n87701
10556B5115806p22457q42454q63387p85162n95092m60783l73315l45662k32305
10547A9895189r2843K0992L3142k5390q0045m8674j6540l2939l4582r329N9100
$$ plain form
10536 19668081 19793374 19921742 19868740 19606009 19151695 18556004 17791910 16683000 15181437
10527 15181437 13494311 11906993 10603200 9576025 8809264 8245883 7811611 7490753 7243049
10518 7243049 7058917 6925013 6788203 6648782 6553963 6457545 6382152 6274297 6136625 6014876
10508 6014876 5852887 5682555 5488939 5285197 5124082 4916792 4726942 4551761 4394656
10499 4394656 4213689 4029694 3864086 3724463 3590221 3417787 3290853 3175430 3074737
10490 3074737 2979187 2854406 2767818 2669394 2553937 2453457 2368580 2272420 2182031 2126764 2024377
10479 2024377 1952258 1896253 1842946 1778981 1756963 1726793 1665002 1645680 1614551 1582731 1583779
10468 1583779 1564577 1510890 1489326 1462411 1434449 1390274 1348522 1300456 1279121 1241201 1219170
$$ packed form
10536A9668081J25293J28368n3002k62731m54314n95691p64094j108910j501563
10527A5181437j687126j587318j303793j027175p66761n63381m34272l20858k47704
10518G243049j84132j33904j36810j39421r4819r6418p5393j07855j37672j21749
10508F014876j61989j70332j93616k03742j61115k07290j89850j75181j57105
10499D394656j80967j83995j65608j39623j34242j72434j26934j15423j00693
10490C074737r5550j24781q6588r8424j15457j00480q4877r6160r0389n5267j02387
10479B024377p2119n6005n3307o3965k2018l0170o1791j9322l1129l1820J048
10468A583779j9202n3687k1564k6915k7962m4175m1752m8066k1335l7920k2031
$$ plain form
10457 1219170 1210220 1194483 1188378 1190883 1175460 1173878 1139602 1110288 1110803 1120126 1123310 1097811 1052999
10444 1052999 1003765 940859 871550 849805 791293 770904 769459 758864 760515 772936 731084 711345
10432 711345 685643 661138 643701 630976 599269 578334 589602 597920 585674 540558 500504 462403
10420 462403 414864 389673 386824 384145 373819 376139 407464 447703 420577 374787 380245 375069
10408 375069 340967 316099 301999 286652 292428 280127 259119 263101 291966 270803 277043 325020
10396 325020 306715 288696 279174 295829 263268 238321 246724 260121 257824 234650 233777 260137
10384 260137 261775 233618 242461 228891 238161 215510 242649 247344 230715 221914 241581 248512 284790
10371 284790 263808 220241 211647 215595 212325 190259 208125 217298 226843 219741 221528 221852 209104
$$ packed form
10457A219170q950j5737o105K505j5423j582l4276k9314N15R323L184k5499m4812
10444A052999m9234o2906o9309k1745n8512k0389j445j0595J651J2421m1852j9739
10432G11345k5702k4505j7437j2725l1707k0935J1268Q318j2246m5116m0054l8101
10420D62403m7539k5191k849k679j0326K320L1325M0239k7126m5790N458n176
10408C75069l4102k4868j4100j5347N776j2301k1008L982K8865k1163O240M7977
10396C25020j8305j8019r522J6655l2561k4947Q403J3397k297k3174q73K6360
10384B60137J638k8157Q843j3570R270k2651K7139M695j6629q801J9667O931L6278
10371B84790k0982m3567q594L948l270k2066J7866R173R545p102J787L24j2748
$$ plain form
10358 209104 202684 229324 227932 207560 190644 237644 281934 304706 309305 334674 358871 407929
10346 407929 478328 568630 686441 772588 835537 893083 981267 1063213 1071218 1042151 972279
10335 972279 885130 817949 742230 656932 565640 501655 419860 372972 351118 312348 286695
10324 286695 274181 263863 276648 239100 223289 230978 281100 296066 281318 256015 240616 208711
10312 208711 161340 157428 146154 163264 168954 132456 131480 114518 106841 126742 122238 110574 114785
10299 114785 96153 79269 102164 116636 96897 96195 106063 117440 159384 170349 147806 120596
10287 120596 109068 115877 105461 94102 114947 112841 131562 165371 197452 191804 141907 99161
10275 99161 74979 92593 104152 106850 101631 103853 92594 100425 76374 67392 82859 79409 76530
$$ packed form
10358B09104o420K6640j392k0372j6916M7000M4290K2772M599K5369K4197M9058
10346D07929P0399R0302J17811Q6147O2949N7546Q8184Q1946Q005k9067o9872
10335I72279q7149o7181p5719q5298r1292o3985q1795m6888k1854l8770k5653
10324B86695j2514j0318J2785l7548j5811P689N0122J4966j4748k5303j5399l1905
10312B08711m7371l912j1274J7110N690l6498r76j6962p677J9901m504j1664M211
10299A14785j8632j6884K2895J4472j9739p02R868J1377M1944J0965k2543k7210
10287A20596j1528O809j0416j1359K0845k106J8721L3809L2081n648m9897m2746
10275I9161k4182J7614J1559K698n219K222j1259P831k4051q982J5467l450k879
$$ plain form
10262 76530 86906 104624 112889 108388 160245 182968 176720 129142 86548 91905 101759 98065 88071
10249 88071 112058 113197 93023 98370 130395 120651 102974 93286 83045 81456 53518 53655 53032
10236 53032 87729 112177 98548 89165 102229 122695 101449 62695 55632 50797 68346 93510
10224 93510 109452 131341 149732 160985 144332 134594 150225 134377 152382 160203 171702 156927
10212 156927 157982 166326 139391 134105 149876 151347 139544 124106 105886 89748 105802 155507
10200 155507 185733 155741 98444 96973 117496 132963 118732 118654 103025 93639 120702 132586
10188 132586 133615 120149 124480 131889 124670 157514 152443 161231 152846 142638 133113 118595 98175
10175 98175 86509 109679 129710 108158 134447 174202 186074 201301 196908 173247 189700 209012
$$ packed form
10262G6530J0376J7718Q265m501N1857K2723o248m7578m2594N357R854l694r994
10249H8071K3987J139k0174N347L2025r744j7677r688j0241j589k7938J37o23
10236E3032L4697K4448j3629r383J3064K0466k1246l8754p063m835J7549K5164
10224I3510J5942K1889J8391J1253j6653r738J5631j5848J8005P821J1499j4775
10212A56927J055Q344k6935n286J5771J471j1803j5438j8220j6138J6054M9705
10200A55507L0226k9992n7297j471K0523J5467j4231p8j5629r386K7063J1884
10188A32586J029j3466M331P409p219L2844n071Q788q385j0208r525j4518k0420
10175I8175j1666K3170K0031k1552K6289L9755J1872J5227m393k3661J6453J9312
$$ plain form
10163 209012 219950 208315 193259 152235 147679 180563 149622 136035 136188 146087 160375 159319
10151 159319 183927 177912 209255 252683 250374 246921 254542 273277 297090 290867 269832 307297
10139 307297 310799 292575 254179 275158 269611 234135 227276 228899 222245 202257 254600 241179
10127 241179 197547 179463 187508 187170 193899 212111 217146 213349 196724 159292 148912 158877 173344
10114 173344 190656 199598 210532 181281 194435 177344 151911 142385 153992 148789 167051 195344
10102 195344 218267 210858 182909 188698 223291 259153 263058 245939 229550 194278 126464 101707
10090 101707 91450 106199 146460 149219 114549 125165 117623 138060 157332 167595 184558 202584
10078 202584 186219 189115 211532 282307 289887 308254 317312 307632 328299 327849 343013 382260 449384
$$ packed form
10163B09012J0938j1635j5056m1024m556L2884l0941j3587J53R899J4288j056
10151A59319K4608o015L1343M3428k309l453P621J8735K3813o223k1035L7465
10139C07297L502j8224l8396K0979n547l5476o859J623o654j9988N2343j3421
10127B41179m3632j8084Q045l38O729J8212N035l797j6625l7432j0380R965J4467
10114A73344J7312Q942J0934k9251J3154j7091k5433r526J1607n203J8262K8293
10102A95344K2923p409k7949N789L4593L5862L905j7119j6389l5272o7814k4757
10090A01707j0257J4749M0261K759l4670J0616p542K0437J9272J0263J6963J8026
10078B02584j6365K896K2417P0775P580J8367R058r680K0667m50J5164L9247O7124
$$ plain form
10065 449384 501757 548835 625620 720520 873275 1084730 1433911 2036618 3029889 4621706
10055 4621706 6398485 7273468 7294257 7197464 7461413 8089665 7585005 5236735 3389433
10046 3389433 2451323 1972080 1640843 1390759 1224462 1064742 998836 981933 906411 873983
10036 873983 811642 745616 699091 664720 650311 612638 587032 566107 533777 529118 518881 498052
10024 498052 465942 408953 381392 354380 350259 336187 319861 335259 349777 345481 308616 293403
10012 293403 305573 278998 282183 283483 245463 253101 298042 297255 306829 302390 251991 203240 225613
9999 225613 226464 222422 224280 217952 239607 246497 241057 216120 194453 208540 209053 214629 217591 206358
9985 206358 176652 198633 218975 211806 190412 165338 150678 141539 140573 159281 156141 123344 113062
$$ packed form
10065D49384N2373M7078P6785R4900J52755K11455L49181O02707R93271J591817
10055D621706J776779Q74983K0789r6793K63949O28252n04660k348270j847302
10046C389433r38110m79243l31237k50084j66297j59720o5906j6903p5522l2428
10036H73983o2341o6026m6525l4371j4409l7673k5606k0925l2330m659j0237k0829
10024D98052l2110n6989k7561k7012m121j4072j6326J5398J4518m296l6865j5213
10012B93403J2170k6575L185J300l8020P638M4941p87R574m439n0399m8751K2373
9999B25613Q51m042J858o328K1655O890n440k4937k1667J4087N13N576K962j1233
9985B06358k9706K1981K0342p169k1394k5074j4660r139r66J8708l140l2797j0282
$$ plain form
9972 113062 131494 147341 159110 172535 148225 120177 113588 109595 112737 94222 109411 124303
9960 124303 129728 115103 109073 89614 88404 80161 85216 94302 108550 126325 140132 138647 112491
9947 112491 94436 104400 99619 86713 69432 82578 92016 103931 126585 93228 85539 113249
9935 113249 114785 99838 72314 44291 65399 90720 105285 113586 113597 108271 89036 96717 89159
9922 89159 83249 73709 74530 91756 95475 92661 61208 26551 48115 70120 57015 46899 50439
9909 50439 59718 70976 74233 57778 35020 41204 47394 41402 61098 91210 89473 83918 94530
9896 94530 117911 135701 122911 106407 97285 115802 125995 110408 134375 171396 187407 171569
9884 171569 156373 158960 187194 204948 185593 185229 190845 180317 179945 192172 169116 140457 110784
$$ packed form
9972A13062J8432J5847J1769J3425k4310k8048o589l993L142j8515J5189J4892
9960A24303N425j4625o030j9459j210q243N055R086J4248J7775J3807j485k6156
9947A12491j8055R964m781j2906j7281J3146R438J1915K2654l3357p689K7710
9935A13249J536j4947k7524k8023K1108K5321J4565Q301J1n326j9235P681p558
9922H9159n910r540Q21J7226L719k814l1453l4657K1564K2005j3105j0116L540
9909E0439R279J1258L257j6455k2758O184O190n992J9696L0112j737n555J0612
9896I4530K3381J7790j2790j6504r122J8517J0193j5587K3967L7021J6011j5838
9884A71569j5196K587K8234J7754j9355l64N616j0528l72J2227k3056k8659k9673
$$ plain form
9871 110784 118957 138757 130572 119890 101655 121394 145817 142941 149935 143093 142157 161352 180605
9858 180605 139978 103974 108990 95522 107971 113280 122072 144592 141995 148054 204110 241318 210741
9845 210741 192468 189482 217765 218919 187232 182677 196916 222136 232562 218111 192118 184989
9833 184989 173384 179092 212533 225247 193898 167735 171591 155899 133785 156077 174234 176032
9821 176032 208119 217111 210116 230391 227357 209824 218659 216791 240023 217955 171549 150788 139261
9808 139261 133870 108948 90518 125217 157030 161745 145193 141789 128016 126702 158882 176143
9796 176143 157375 154936 155693 172481 185915 215097 237835 247953 258201 258154 242935 227643 247026
9783 247026 282424 267151 242734 216218 211721 208602 203172 169334 138774 122550 84251 69727
$$ packed form
9871A10784Q173J9800q185j0682j8235J9739K4423k876O994o842r36J9195J9253
9858A80605m0627l6004N016j3468J2449N309Q792K2520k597O059N6056L7208l0577
9845B10741j8273k986K8283J154l1687m555J4239K5220J0426j4451k5993p129
9833A84989j1605N708L3441J2714l1349k6163L856j5692k2114K2292J8157J798
9821A76032L2087Q992o995K0275l034j7533Q835j868K3232k2068m6406k0761j1527
9808A39261n391k4922j8430L4699L1813M715j6552l404j3773j314L2180J7261
9796A76143j8768k439P57J6788J3434K9182K2738J0118J0248m7j5219j5292J9383
9783B47026L5398j5273k4417k6516m497l119n430l3838l0560j6224l8299j4524
$$ plain form
9771 69727 101208 129296 123373 109385 104750 103659 126857 165068 188098 170111 152278 149385 149997
9758 149997 146879 132865 114809 119650 133092 152762 144646 121181 129014 119381 121149 142740 144904
9745 144904 178153 201074 212645 205457 194066 186773 170493 164457 151386 111330 91365 103895
9733 103895 134337 155236 166026 165455 166339 130938 113976 108876 131306 175709 193536 184077 185487
9720 185487 157567 144511 161555 144834 144951 148777 173120 163528 166219 119599 107424 112406 143675
9707 143675 139125 140693 170870 164879 154515 171109 185604 188525 203378 201295 198277 183186 157271
9694 157271 168932 197110 227900 212440 192646 180955 186740 198333 216537 193912 184742 202255
9682 202255 217598 225529 246924 236436 242148 218669 216213 223737 230446 185235 168878 176255 174485
$$ packed form
9771F9727L1481K8088n923j3988m635j091K3198L8211K3030j7987j7833k893O12
9758A49997l118j4014j8056M841J3442J9670q116k3465P833r633J768K1591K164
9745A44904L3249K2921J1571p188j1391p293j6280o036j3071m0056j9965J2530
9733A03895L0442K0899J0790n71Q84l5401j6962n100K2430M4403J7827r459J410
9720A85487k7920j3056J7044j6721J17L826K4343r592K691m6620j2175M982L1269
9707A43675m550J568L0177n991j0364J6594J4495K921J4853k083l018j5091k5915
9694A57271J1661K8178L0790j5460j9794j1691N785J1593J8204k2625r170J7513
9682B02255J5343P931K1395j0488N712k3479k456P524O709m5211j6357P377j770
$$ plain form
9669 174485 174519 183505 201154 199517 194692 202326 191340 200484 211416 197192 187770 155275 174899
9656 174899 225168 223076 207784 170045 160248 157867 152698 152683 195903 243296 268642 247714 265826
9643 265826 246975 237708 226482 189539 175962 154203 184079 253847 253199 248695 237531 269190
9631 269190 304057 281302 241187 216291 222050 254441 284915 278335 245386 239734 241975 236113 257553
9618 257553 255899 240299 241404 237258 255932 284767 292655 298855 302633 303315 297791 264432 260992 261067
9604 261067 288030 307534 321884 300740 275372 281466 270574 260140 259910 245777 252369 276782
9592 276782 299605 284398 282556 254352 271122 276417 283799 273692 286161 322583 304073 302216
9580 302216 292280 294946 298173 340011 346531 342276 377076 411014 420322 414980 406764 413998 430910
$$ packed form
9669A74485L4Q986J7649j637m825P634j0986R144J0932j4224r422l2495J9624
9656A74899N0269k092j5292l7739r797k381n169j5M3220M7393K5346k0928J8112
9643B65826j8851r267j1226l6943j3577k1759K9876O9768o48m504j1164L1659
9631B69190L4867k2755m0115k4896N759L2391L0474o580l2949n652K241n862K1440
9618B57553j654j5600J105m146J8674K8835P888O200L778O82n524l3359l440P5
9604B61067K6963J9504J4350k1144k5368O094j0892j0434k30j4133O592K4413
9592B76782K2823j5207j842k8204J6770N295P382j0107J2469L6422j8510j857
9580C02216r936K666L227M1838O520m255L4800L3938R308n342q216P234J6912
$$ plain form
9567 430910 440844 441697 450542 455980 446709 457260 477125 494419 487797 492512 523821 567779 566297
9554 566297 587223 623245 633561 644575 683167 715022 762313 812831 818132 860343 920238 956707
9542 956707 1002059 1007961 1056574 1102241 1091070 1083067 1094415 1094745 1080447 1055491 1030843 999703
9530 999703 998289 1000152 992178 1021382 1050133 1062978 1072323 1070302 1103637 1149657 1217027 1321347
9518 1321347 1433774 1547877 1679408 1792646 1895194 2013678 2123393 2227193 2259862 2234251
9508 2234251 2182353 2144857 2079380 2014798 1948891 1887547 1891386 1860542 1832631 1819184 1827387 1872680
9496 1872680 1917787 1942092 2004142 2089144 2166206 2275734 2416774 2590925 2780137 2962733
9486 2962733 3147762 3309451 3447677 3566787 3643500 3655537 3661289 3647169 3646278 3657868 3752439
$$ packed form
9567D30910R934Q53Q845N438r271J0551J9865J7294o622M715L1309M3958j482
9554E66297K0926L6022J0316J1014L8592L1855M7291N0518N301M2211N9895L6469
9542I56707M5352N902M8613M5667j1171q003J1348L30j4298k4956k4648l1140
9530I99703j414J863p974K9204K8751J2845R345k021L3335M6020O7370J04320
9518A321347J12427J14103J31531J13238J02548J18484J09715J03800L2669k5611
9508B234251n1898l7496o5477o4582o5907o1344L839l0844k7911j3447Q203M5293
9496A872680M5107K4305O2050Q5002P7062J09528J41040J74151J89212J82596
9486B962733J85029J61689J38226J19110P6713J2037N752j4120q91J1590R4571
$$ plain form
9475 3752439 3906301 4122987 4449471 4867776 5469204 6279756 7275111 8459483 9848836
9466 9848836 11316144 12645651 13737742 14606791 15238264 15659069 15764647 15492157 15048116
9457 15048116 14668415 14461486 14483472 14651517 15024634 15528580 16202214 16995323 17840449 18738362
9447 18738362 19693916 20692611 21652626 22435909 23116216 23665618 23985158 23950805 23613508 23214885
9437 23214885 22822314 22476829 22273179 22210888 22308392 22537876 22931255 23558524 24467717 25657858
9427 25657858 27159533 29054562 31426450 34250360 37227049 39821995 41627548 42624435
9419 42624435 43015664 42733656 41437098 39024011 35956036 32976330 30496656 28572496
9411 28572496 27105287 25975357 25162084 24673831 24418188 24266452 24146186 24167131 24385010
$$ packed form
9475C752439J53862K16686L26484M18305O01428Q10552R95355J184372J389353
9466I848836J467308J329507J092091Q69049O31473M20805J05578k72490m44041
9457A5048116l79701k06929K1986J68045L73117N03946O73634P93109Q45126Q97913
9447A8738362R55554R98695R60015P83283O80307N49402L19540l4353l37297l98623
9437B3214885l92571l45485k03650o2291R7504K29484L93379O27269R09193J190141
9427B5657858J501675J895029K371888K823910K976689K594946J805553R96887
9419D2624435L91229k82008j296558k413087l067975k979706k479674j924160
9411B8572496j467209j129930q13273m88253k55643j51736j20266K0945K17879
$$ plain form
9402 24385010 24847359 25493403 26164675 26658943 26876811 26801151 26473399 25908764 25089523 24047800
9392 24047800 22933619 21809545 20790515 19902930 19155640 18582469 18204389 17983499 17877626
9383 17877626 17886238 18029327 18322216 18663743 18898223 18896413 18705498 18306525 17678460 16777885
9373 16777885 15603054 14234622 12939691 11852623 10970663 10256624 9724194 9294069 8934903
9364 8934903 8652967 8442772 8303259 8212883 8162569 8117525 8030474 7943537 7816079 7657095
9354 7657095 7501963 7320489 7132590 6916621 6704830 6527148 6373002 6233570 6090689 5990896
9344 5990896 5899461 5814100 5716707 5659861 5605124 5539137 5500068 5450642 5391719 5374038 5372877 5363943
9332 5363943 5383351 5373573 5362787 5309090 5216424 5120946 5010864 4881435 4737485 4609391 4476840
$$ packed form
9402B4385010M62349O46044O71272M94268K17868p5660l27752n64635q19241j041723
9392B4047800j114181j124074j019030q87585p47290n73171l78080k20890j05873
9383A7877626Q612J43089K92889L41527K34480j810j90915l98973o28065r00575
9373A6777885j174831j368432j294931j087068q81960p14039n32430m30125l59166
9364H934903k81936k10195j39513r0376n0314m5044q7051q6937j27458j58984
9354G657095j55132j81474j87899k15969k11791j77682j54146j39432j42881r9793
9344E990896r1435q5361r7393n6846n4737o5987l9069m9426n8923j7681j161q934
9332E363943J9408r778j0786n3697r2666r5478j10082j29429j43950j28094j32551
$$ plain form
9321 4476840 4360606 4249972 4124442 4018300 3954578 3907386 3832518 3747547 3655155 3591546 3561285
9310 3561285 3530447 3433690 3384991 3366701 3374091 3343589 3317026 3276645 3239510 3219964 3173240 3144062
9298 3144062 3103087 3044744 2974864 2893860 2862188 2809355 2730695 2683837 2647533 2585228 2539914
9287 2539914 2509814 2476072 2412412 2372468 2345241 2313543 2258649 2196979 2139176 2119508 2080261
9276 2080261 2054532 2011275 1948371 1923447 1902762 1877295 1836610 1790783 1735848 1719748 1711063 1675474
9264 1675474 1647761 1632842 1616894 1591373 1557303 1510028 1455236 1453793 1449980 1455742 1448632 1385959
9252 1385959 1381179 1388176 1375185 1348573 1329213 1321935 1273830 1248274 1257851 1245980 1230510 1222642
9240 1222642 1192324 1173619 1162258 1152571 1128980 1103410 1111696 1115525 1063244 1054620 1030508 1017709
$$ packed form
9321D476840j16234j10634j25530j06142o3722m7192p4868q4971r2392o3609l0261
9310C561285l0838r6757m8699j8290P390l0502k6563m0381l7135j9546m6724k9178
9298C144062m0975n8343o9880q1004l1672n2833p8660m6858l6304o2305m5314
9287B539914l0100l3742o3660l9944k7227l1698n4894o1670n7803j9668l9247
9276B080261k5729m3257o2904k4924k0685k5467m0685m5827n4935j6100q685l5589
9264A675474k7713j4919j5948k5521l4070m7275n4792j443l813N762p110o2673
9252A385959m780O997j2991k6612j9360p278m8105k5556R577j1871j5470p868
9240A222642l0318j8705j1361r687k3591k5570Q286L829n2281q624k4112j2799
$$ plain form
9228 1017709 1012084 976471 985035 964934 927064 897584 894283 935845 941287 933368 903084 902274 898240
9215 898240 869777 857010 843792 838078 837140 802898 791749 770699 747005 755020 778669 740928
9203 740928 738356 710066 701005 700197 714207 745062 753422 718644 693193 681681 659573 654401 675207
9190 675207 640467 632227 638231 656946 632774 634121 651926 659980 619293 622505 624093 643426 631838
9177 631838 612128 597589 584071 592661 576594 556406 556487 549100 561302 559696 550783 554561 559912
9164 559912 573446 556907 547885 568362 567992 539671 544800 570708 572183 566265 603840 622056 616614
9151 616614 601727 655967 698161 716185 743448 813811 878251 923252 999699 1106963 1226743
9140 1226743 1375986 1554587 1719275 1897818 2065257 2199417 2260317 2274739 2207955 2120619
$$ packed form
9228A017709n625l5613Q564k0101l7870k9480l301M1562N442p919l0284q10m034
9215H98240k8463j2767j3218n714r38l4242j1149k1050k3694Q015K3649l7741
9203G40928k572k8290r061q08J4010L0855Q360l4778k5451j1512k2108n172K0806
9190F75207l4740q240O004J8715k4172J347J7805Q054m0687L212J588J9333j1588
9177F31838j9710j4539j3518Q590j6067k0188Q1p387J2202j606q913L778N351
9164E59912J3534j6539r022K0477l70k8321N129K5908J475n918L7575J8216n442
9151F16614j4887N4240M2194J8024K7263P0363O4440M5001P6447J07264J19780
9140A226743J49243J78601J64688J78543J67439J34160O0900J4422o6784q7336
$$ plain form
9130 2120619 1989736 1848554 1707253 1564166 1374078 1226451 1106462 1023128 941770 875941
9120 875941 825167 767890 704145 660946 666132 687646 650190 610672 575829 579857 593952 597923
9108 597923 617933 611498 574057 543942 509635 485443 495844 505416 493432 478538 470961 477556
9096 477556 469404 457971 484961 494278 492577 480882 439176 418991 422593 434347 403749 384077
9084 384077 406683 436629 416392 358866 299740 295518 325245 310563 312848 322067 308983 289221
9072 289221 303710 322435 343492 367711 339454 349481 363718 356515 370411 379445 390448 401525
9060 401525 391739 388827 390264 376823 350491 372732 412943 438530 455379 463777 413412 428918
9048 428918 434585 403801 376867 364884 346737 363318 371226 374074 386951 372166 359196 337414
$$ packed form
9130B120619j30883j41182j41301j43087j90088j47627j19989q3334q1358o5829
9120H75941n0774n7277o3745m3199N186K1514l7456l9518l4843M028J4095L971
9108E97923K0010o435l7441l0115l4307k4192J0401R572j1984j4894p577O595
9096D77556q152j1433K6990R317j701j1695m1706k0185L602J1754l0598j9672
9084C84077K2606K9946k0237n7526n9126m222K9727j4682K285R219j3084j9762
9072B89221J4489J8725K1057K4219k8257J0027J4237p203J3896R034J1003J1077
9060D01525r786k912J437j3441k6332K2241M0211K5587J6849Q398n0365J5506
9048D28918N667l0784k6934j1983j8147J6581P908K848J2877j4785j2970k1782
$$ plain form
9036 337414 342844 342576 340895 353474 358270 336576 317716 334554 338023 321762 334680 338453 314783
9023 314783 282114 293283 307668 289577 299358 298470 317954 343338 339719 325553 335974 331391 325170
9010 325170 345779 345888 365595 402761 403932 371098 362830 351643 370296 382739 382548 372303 396569
8997 396569 417458 489915 523619 564808 617862 648908 717787 698672 678271 675652 676482 630062
8985 630062 559319 541879 532442 526584 515943 484696 465676 429197 414775 427304 416038 433122
8973 433122 463278 449981 451585 415487 370641 377546 384227 364718 332574 329461 317540 313369 314034
8960 314034 299887 292194 312276 295013 302903 297034 308974 306971 317212 305677 305729 339670 373887
8947 373887 337790 333721 351350 319684 347829 380015 383888 367042 366405 357005 352865 399233 411783
$$ packed form
9036C37414N430k68j681J2579M796k1694j8860J6838L469j6261J2918L773k3670
9023C14783l2669J1169J4385j8091R781q88J9484K5384l619j4166J0421m583o221
9010C25170K0609J09J9707L7166J171l2834q268j1187J8653J2443j91j0245K4266
8997C96569K0889P2457L3704M1189N3054L1046O8879j9115k0401k619Q30m6420
8985F30062p0743j7440r437n858j0641l1247j9020l6479j4422J2529j1266J7084
8973D33122L0156j3297J604l6098m4846O905O681j9509l2144l113j1921m171O65
8960C14034j4147p693K0082j7263P890n869J1940k003J0241j1535N2L3941L4217
8947C73887l6097m069J7629l1666K8145L2186L873j6846o37r400m140M6368J2550
$$ plain form
8934 411783 389073 378247 390830 396112 421893 432162 399637 365191 357232 344411 344903 338687 324434
8921 324434 320686 349722 354706 315964 325106 353744 341615 324383 326651 350931 369059 382314
8909 382314 394855 384603 370135 357706 366717 361494 328050 300320 290113 281554 288689 291685 248779
8896 248779 260117 267634 255139 227089 221696 246164 275002 300371 320542 341410 358158 373246
8884 373246 374644 377184 369385 345964 338505 376737 378830 367193 354872 342371 311622 290274 280955
8871 280955 272181 286060 307930 346465 370249 400877 430950 461673 515628 574282 609972 615319
8859 615319 624364 664168 695519 698243 706340 757632 795102 834962 860044 865036 886083 900320
8847 900320 922102 930233 926347 902533 880968 849004 848393 856455 876922 895923 914569 921410 924256
$$ packed form
8934D11783k2710j0826J2583N282K5781J0269l2525l4446p959j2821M92o216j4253
8921C24434l748K9036M984l8742R142K8638j2129j7232K268K4280J8128J3255
8909C82314J2541j0252j4468j2429R011n223l3444k7730j0207q559P135K996m2906
8896B48779J1338P517j2495k8050n393K4468K8838K5369K0171K0868J6748J5088
8884C73246J398K540p799k3421p459L8232K093j1637j2321j2501l0749k1348r319
8871B80955q774J3879K1870L8535K3784L0628L0073L0723N3955N8654L5690N347
8859F15319R045L9804L1351K724Q097N1292L7470L9860K5082M992K1047J4237
8847I00320K1782Q131l886k3814k1565l1964o11Q062K0467J9001J8646O841K846
$$ plain form
8834 924256 963276 956886 945946 941176 930770 917905 905935 933546 938258 924879 961597 966894
8822 966894 936581 914583 919646 884595 850600 880808 918525 946280 970758 1020409 1088096 1126480
8810 1126480 1158300 1165637 1198222 1253537 1279884 1297013 1314943 1330065 1353041 1349940 1333342 1360679
8798 1360679 1398925 1426755 1469096 1543640 1613868 1669375 1747252 1797302 1865985 1941051 1997480
8787 1997480 2079871 2169407 2285154 2354171 2459847 2604630 2766516 2920907 3086926 3251487
8777 3251487 3434143 3638523 3814025 4013697 4170510 4343206 4546019 4819034 5186699 5604266
8767 5604266 6080316 6630048 7274963 8022534 8907449 9834303 10791087 11841184 13069888
8758 13069888 14507359 16172524 18147508 20471911 23214042 26335543 29832218 33808726
$$ packed form
8834I24256L9020o390j0940m770j0406j2865j1970K7611M712j3379L6718N297
8822I66894l0313k1998N063l5051l3995L0208L7717K7755K4478M9651O7687L8384
8810A126480L1820P337L2585N5315K6347J7129J7930J5122K2976l101j6598K7337
8798A360679L8246K7830M2341P4544P0228N5507P7877N0050O8683P5066N6429
8787A997480Q2391Q9536J15747O9017J05676J44783J61886J54391J66019J64561
8777C251487J82656K04380J75502J99672J56813J72696K02813K73015L67665M17567
8767E604266M76050N49732O44915P47571Q84915R26854R56784J050097J228704
8758A3069888J437471J665165J974984K324403K742131L121501L496675L976508
$$ plain form
8750 33808726 38359821 43620891 49778528 57273766 66714262 78881154 94857549 116591152
8742 116591152 147284735 190844576 248906260 313907799 367594621 397800246 410231031
8735 410231031 416812446 420497618 406516240 356597438 284574171 220219881 173979141
8728 173979141 142622954 120931290 105271189 93560802 84537116 77257714 71069224
8721 71069224 65542452 60615552 56233747 52247444 48561675 45164678 42130991 39409394
8713 39409394 37042657 35028543 33277234 31715228 30271309 28998745 27847539 26742687
8705 26742687 25721645 24792266 23982339 23271807 22543508 21805242 21023360 20259661 19461891
8696 19461891 18628528 17808648 17038748 16334250 15704930 15131849 14636509 14178846 13709501
$$ packed form
8750C3808726M551095N261070O157637P495238R440496J2166892J5976395K1733603
8742A16591152L0693583M3559841N8061684O5001539N3686822L0205625J2430785
8735D10231031O581415L685172j3981378m9918802p2023267o4354290m6240740
8728A73979141l1356187k1691664j5660101j1710387r023686p279402o188490
8721G1069224n526772m926900m381805l986303l685769l396997l033687k721597
8713C9409394k366737k014114j751309j562006j443919j272564j151206j104852
8705B6742687j021042r29379q09927p10532p28299p38266p81882p63699p97770
8696A9461891q33363q19880p69900p04498o29320n73081m95340m57663m69345
$$ plain form
8687 13709501 13270372 12845898 12448346 12078894 11654959 11275218 10931240 10584347 10250642
8678 10250642 9944329 9651743 9358034 9078841 8777933 8528831 8280747 8019663 7794900
8669 7794900 7544732 7277322 7078222 6872198 6679720 6500284 6327939 6168155 6002814 5874925
8659 5874925 5756321 5619313 5478744 5304019 5165384 5090112 4979150 4837170 4673703 4546506
8649 4546506 4442343 4326535 4208482 4097959 3987273 3883841 3782410 3655298 3571833 3519935
8639 3519935 3460985 3365498 3282643 3217231 3183084 3151261 3107324 3045377 3012463 2968091 2910874
8628 2910874 2855323 2812885 2740726 2653270 2592239 2516808 2443888 2371044 2352783 2338217 2281737
8617 2281737 2290298 2317785 2374018 2426500 2527798 2629497 2767133 2932062 3145206 3403054
$$ packed form
8687A3709501m39129m24474l97552l69452m23935l79741l43978l46893l33705
8678A0250642l06313k92586k93709k79193l00908k49102k48084k61084k24763
8669G794900k50168k67410j99100k06024j92478j79436j72345j59784j65341j27889
8659E874925j18604j37008j40569j74725j38635p5272j10962j41980j63467j27197
8649D546506j04163j15808j18053j10523j10686j03432j01431j27112q3465n1898
8639C519935n8950r5487q2855o5412l4147l1823m3937o1947l2914m4372n7217
8628B910874n5551m2438p2159q7456o1031p5431p2920p2844j8261j4566n6480
8617B281737Q561K7487N6233N2482J01298J01699J37636J64929K13144K57848
$$ plain form
8607 3403054 3620845 3877704 4228368 4803116 5695389 7064036 9176048 12050072 14905846
8598 14905846 16590308 17134211 17310628 17673567 17901599 16441972 13001179 9725488 7532765
8589 7532765 6214704 5397582 4811767 4388776 4086452 3897878 3722287 3624036 3581921 3653682
8579 3653682 3771861 3783637 3689266 3551695 3465404 3437056 3305483 2951144 2622989 2409592
8569 2409592 2252874 2126398 2023679 1953048 1886150 1838191 1806798 1772026 1741123 1717683 1719321
8558 1719321 1713108 1700447 1747103 1813986 1856397 1882322 1840070 1811064 1796328 1738748 1643855 1515356
8546 1515356 1419830 1343146 1227757 1167161 1117322 1060035 1031760 1006385 1003127 984360 967359
8535 967359 946049 917435 893945 883015 885951 869183 841600 834864 834061 818406 822842 821849 833368
$$ packed form
8607C403054K17791K56859L50664N74748Q92273J368647K112012K874024K855774
8598A4905846J684462N43903J76417L62939K28032j459627l440793l275691k192723
8589G532765j318061q17122n85815m22991l02324j88574j75591r8251m2115P1761
8579C653682J18179J1776r4371j37571q6291k8348j31573l54339l28155k13397
8569B409592j56718j26476j02719p0631o6898m7959l1393l4772l0903k3440J638
8558A719321o213j2661M6656O6883M2411K5925m2252k9006j4736n7580r4893j28499
8546A515356r5526p6684j15389o0596m9839n7287k8275k5375l258j8767j7001
8535I67359k1310k8614k3490j0930K936j6768k7583o736q03j5655M436r93J1519
$$ plain form
8522 833368 814182 787115 798934 797610 783429 782991 806726 813495 823046 782043 745026 706157 669539
8509 669539 657905 625218 584971 539330 546287 559942 562456 577556 581221 629450 639061 630584 624687
8496 624687 603292 577069 550199 537146 543925 541316 521668 512914 517767 523379 495066 473494 473336
8483 473336 455237 418885 445969 466406 472032 461122 437868 422271 425071 452877 475556 444983
8471 444983 397383 368305 356875 356805 356085 388463 397542 389888 394164 396390 399827 392566 376395 367098
8457 367098 372156 351620 311747 299531 302184 305558 308558 336912 316525 309535 315699 313096 322601
8444 322601 324319 324379 337601 324816 312622 308606 279766 251951 225600 203484 202183 235494 216433
8431 216433 208180 194319 209935 258682 240835 238518 229824 212947 205153 197484 176699 176489 162977
$$ packed form
8522H33368j9186k7067J1819j324j4181m38K3735O769R551m1003l7017l8869l6618
8509F69539j1634l2687m0247m5641O957J3655K514J5100L665M8229R611q477n897
8496F24687k1395k6223k6870j3053O779k609j9648q754M853N612k8313k1572j58
8483D73336j8099l6352K7084K0437N626j0910k3254j5597K800K7806K2679l0573
8471D44983m7600k9078j1430p0p20L2378R079p654M276K226L437p261j6171r297
8457C67098N058k0536l9873j2216K653L374L000K8354k0387o990O164k603R505
8444C22601J718O0J3222j2785j2194m016k8840k7815k6351k2116j301L3311j9061
8431B16433q253j3861J5616M8747j7847k317q694j6877p794p669k0785k10j3512
$$ plain form
8418 162977 157495 118828 114839 134958 157975 180965 203097 216500 191010 192615 189089 193600 212855
8405 212855 205207 195421 200474 196761 202845 215334 215233 221456 206086 209482 196245 194896 208799 218110
8391 218110 215851 216172 219607 178150 168270 198139 208181 209123 193004 172533 156585 195648 196920
8378 196920 199367 195745 175350 164247 183037 195800 209081 231211 229484 199088 197400 182822
8366 182822 164128 170647 179042 185356 172954 167810 195295 239884 262557 268336 263898 269396 284346
8353 284346 309255 290451 305281 320383 362965 370103 386086 426727 464951 502116 573084 679450
8341 679450 833189 986636 1108699 1238368 1413465 1578820 1719987 1845862 1922966 1936962
8331 1936962 1932131 1887882 1780496 1639587 1513664 1354800 1182224 1025485 900368 838162
$$ packed form
8418A62977n482l8667l989K0119K3017K2990K2132J3403k5490J605l526M511J9255
8405B12855p648r786N053l713O084J2489j01O223j5370L396j3237j349J3903R311
8391B18110k259L21L435m1457r880K9869J0042R42j6119k0471j5948L9063J272
8378A96920K447l622k0395j1103J8790J2763J3281K2130j727l0396j688j4578
8366A82822j8694O519Q395O314j2402n144K7485M4589K2673N779m438N498J4950
8353B84346K4909j8804J4830J5102M2582P138J5983M0641L8224L7165P0968J06366
8341F79450J53739J53447J22063J29669J75097J65355J41167J25875P7104J3996
8331A936962m831m4249j07386j40909j25923j58864j72576j56739j25117o2206
$$ plain form
8321 838162 739834 640108 574239 536133 497326 464454 445541 411995 387888 375466 348539 305399
8309 305399 284943 272477 299632 312957 324748 306341 290958 302111 300528 254454 227795 218087
8297 218087 241168 243825 233186 250281 273186 298557 260950 238074 230771 238822 239209 248300 235663
8284 235663 202552 179105 143998 158522 179711 194812 205407 192622 166889 173254 211021 215750
8272 215750 188304 162932 151261 144688 169023 179275 178146 161641 157797 144452 142902 142670 126700
8259 126700 93321 85073 65433 55923 65114 82468 109892 106944 123959 156902 171086 173872 170449
8246 170449 160634 150352 140842 148051 149121 150928 141014 117439 97148 94717 117490 138718 150548
8233 150548 128332 94973 102067 116349 97570 111390 145977 132967 125579 140413 133619 117210
$$ packed form
8321H38162r8328r9726o5869l8106l8807l2872j8913l3546k4107j2422k6927m3140
8309C05399k0456j2466K7155J3325J1791j8407j5383J1153j583m6074k6659r708
8297B18087K3081K657j0639J7095K2905K5371l7607k2876p303Q051L87R091j2637
8284B35663l3111k3447l5107J4524K1189J5101J0595j2785k5733O365L7767M729
8272B15750k7446k5372j1671o573K4335J0252j129j6505l844j3345j550k32j5970
8259A26700l3379q248j9640r510R191J7354K7424k948J7015L2943J4184K786l423
8246A70449r815j0282r510P209J070J807r914k3575k0291k431K2773K1228J1830
8233A50548k2216l3359P094J4282j8779J3820L4587j3010p388J4834o794j6409
$$ plain form
8221 117210 148406 157523 140892 155421 150845 169277 176280 159444 123938 110470 116291 100548
8209 100548 93626 79321 79135 102156 102222 98636 87971 125140 179691 201722 187164 174863 189448
8196 189448 192839 207879 215714 221829 222411 193479 199434 199816 198068 185530 183738 178097 186305 150164
8182 150164 151072 145417 140647 130994 120976 136787 161409 152978 140052 126405 119837 118100 110506
8169 110506 113991 133546 135133 112581 101084 86405 68474 62989 69317 92343 81745 34755
8157 34755 66332 80896 70642 65845 32581 55618 86664 107836 121714 116768 120463 113310 109106
8144 109106 107687 107077 101906 74428 97185 114853 110937 89595 98887 107549 115027 102144 103050 91343
8130 91343 74053 70941 78674 103464 142616 120836 79752 102220 144192 163745 185615 185194 157544
$$ packed form
8221A17210L1196R117j6631J4529m576J8432P003j6836l5506j3468N821j5743
8209A00548o922j4305j86K3021O6l586j0665L7169N4551K2031j4558j2301J4585
8196A89448L391J5040P835O115N82k8932N955L82j748j2538j792n641Q208l6141
8182A50164R08n655m770r653j0018J5811K4622q431j2926j3647o568j737p594
8169A10506L485J9555J587k2552j1497j4679j7931n485O328K3026j0598m6990
8157C4755L1577J4564j0254m797l3264K3037L1046K1172J3878m946L695p153m204
8144A09106j419o10n171k7478K2757J7668l916k1342R292Q662P478j2883R06j1707
8130I1343j7290l112P733K4790L9152k1780m1084K2468M1972J9553K1870m21k7650
$$ plain form
8117 157544 141860 162628 148956 125257 96707 100301 85916 91435 94964 100529 86822 89881 94739
8104 94739 87712 72715 56716 60953 73746 91379 118879 76192 75062 89770 110894 144731
8092 144731 151781 166421 160352 141256 124143 137177 119648 90966 103957 139958 164379 190582
8080 190582 159767 166381 150634 125428 114960 104521 92892 112054 134628 132208 121908 97619
8068 97619 99723 124352 98092 88509 118233 130451 142034 134820 142940 147861 115176 111121 105708
8055 105708 106326 127601 170119 166785 134993 142154 142737 146571 146279 166126 182059 190546 226968 232856
8041 232856 228422 243988 229751 230545 251131 239173 196271 166372 174250 182244 186308 192281 178151
8028 178151 131539 107324 109879 128596 151221 162659 150553 157571 161502 152305 149845 155974 166688
$$ packed form
8117A57544j5684K0768j3672k3699k8550L594j4385N519L529N565j3707L059M858
8104I4739p027j4997j5999M237J2793J7633K7500m2687j130J4708K1124L3837
8092A44731P050J4640o069j9096j7113J3034j7529k8682J2991L6001K4421K6203
8080A90582l0815O614j5747k5206j0468j0439j1629J9162K2574k420j0300k4289
8068I7619K104K4629k6260r583K9724J2218J1583p214Q120M921l2685m055n413
8055A05708O18K1275M2518l334l1792P161N83L834k92J9847J5933Q487L6422N888
8041B32856m434J5566j4237P94K0586j1958m2902k9899P878P994M064N973j4130
8028A78151m6612k4215K555J8717K2625J1438j2106P018L931r197k460O129J0714
$$ plain form
8015 166688 149544 134863 165016 200407 205149 200639 192398 197791 222470 220912 211489 211569 206320 207820
8001 207820 215600 223743 220351 250041 267285 260767 256184 239204 241138 232174 219195 180685 174864
7988 174864 169280 211324 210099 194933 194273 191122 176405 178041 210183 216061 203718 206163 225258
7975 225258 213846 196934 180060 193863 199686 229591 275731 280875 280481 275211 293689 276243 265858
7962 265858 258695 240856 240097 232886 248120 277584 291624 270198 261382 264930 237832 214493 246556
7949 246556 252581 240192 209430 206851 187088 196330 213470 224240 230202 227010 231613 249321 236732
7936 236732 233128 231524 240779 241083 254858 244276 247350 260147 270203 278608 285722 276784 257879
7923 257879 240978 243059 280296 250959 241519 286559 293031 310511 307836 262726 252242 238016
$$ packed form
8015A66688j7144j4681L0153L5391M742m510q241N393K4679j558r423Q0n249J500
8001B07820P780Q143l392K9690J7244o518m583j6980J934q964j2979l8510n821
7988A74864n584M2044j225j5166o60l151j4717J636L2142N878j2343K445J9095
7975B25258j1412j6912j6874J3803N823K9905M6140N144l94n270J8478j7446j0385
7962B65858p163j7839p59p211J5234K9464J4040k1426q816L548k7098k3339L2063
7949B46556O025j2389l0762k579j9763R242J7140J0770N962l192M603J7708j2589
7936B36732l604j604R255L04J3775j0582L074J2797J0056Q405P114q938j8905
7923B57879j6901K081L7237k9337r440M5040O472J7480k675m5110j0484j4226
$$ plain form
7911 238016 188411 171949 200664 220721 204741 209516 206631 199822 211085 190410 173510 193313
7899 193313 215380 233230 213015 229279 240228 190018 160098 195247 191582 186435 192487 206593
7887 206593 183857 172631 178668 187754 189970 187557 147371 125638 108790 125929 186439 204767
7875 204767 191915 156732 150937 154445 141528 131165 104655 108232 118708 143456 145399 149781 123922
7862 123922 82930 95032 113927 122820 118373 104302 105787 107813 121506 139275 139702 152030 164196
7849 164196 135402 101066 90185 88344 117369 121596 74163 59965 78106 81373 107390 107062 123155
7836 123155 130114 92295 99529 98120 89187 63544 28460 33279 50332 63923 85191 67509 65942
7823 65942 88283 88212 107892 104972 82632 34209 8063 22465 57206 59384 45434 62690 47532
$$ packed form
7911B38016m9605j6462K8715K0057j5980M775k885o809J1263k0675j6900J9803
7899A93313K2067J7850k0215J6264J0949n0210k9920L5149l665n147O052J4106
7887B06593k2736j1226O037R086K216k413m0186k1733j6848J7139O0510J8328
7875B04767j2852l5183n795L508j2917j0363k6510L577J0476K4748J943M382k5859
7862A23922m0992J2102J8895Q893m447j4071J485K026J3693J7769M27J2328J2166
7849A64196k8794l4336j0881j841K9025M227m7433j4198J8141L267K6017l28J6093
7836A23155O959l7819P234j409q933k5643l5084M819J7053J3591K1268j7682j567
7823F5942K2341p1J9680k920k2340m8423k6146J4402L4741K178j3950J7256j5158
$$ plain form
7810 47532 66570 88266 95238 81830 79007 53297 58900 58411 79719 57052 61789 80478 77520
7797 77520 69313 92153 68659 52756 35004 15763 44307 69494 50270 52271 37373 44920
7785 44920 36933 22820 16755 3316 6984 19105 57602 74072 71631 56851 52112 69731 82619
7772 82619 65614 52435 52694 55730 46124 49797 53880 25127 29343 51411 63660 69927 66523 52390
7758 52390 35401 48266 39233 48787 29328 23058 25765 42860 36279 44142 44325 25283 27713 55182
7744 55182 39077 3132 18683 9828 -19787 10460 18496 41056 24524 4561 24878 23583
7732 23583 41699 57163 13083 -3565 9385 13580 16667 9603 -1028 -30875 -48446 -25424
7720 -25424 783 24609 19590 14981 19689 30217 40147 40699 18344 14322 2007 -5690 13358
$$ packed form
7810D7532J9038K1696O972j3408k823k5710N603m89K1308k2667M737J8689k958
7797G7520q207K2840k3494j5903j7752j9241K8544K5187j9224K001j4898P547
7785D4920p987j4113o065j3439L668J2121L8497J6470k441j4780m739J7619J2888
7772H2619j7005j3179K59L036r606L673M083k8753M216K2068J2249O267l404j4133
7758E2390j6989J2865r033R554j9459o270K707J7095o581P863J83j9042K430K7469
7744E5182j6105l5945J5551q855k9615L0247Q036K2560j6532j9963K0317j295
7732B3583J8116J5464m4080j6648J2950M195L087p064j0631k9847j7571K3022
7720b5424K6207K3826n019m609M708J0528R930N52k2355m022j2315p697J9048
$$ plain form
7707 13358 14992 -16177 -31013 -26306 -23991 -27377 -22704 4275 14263 12051 4459 -3616 3656 -7896
7693 -7896 3985 13480 -22601 -46071 -40948 -20516 -7634 -21301 -13097 668 -2017 16310 30777
7680 30777 23398 1350 13094 -806 -7436 -33154 -42942 -30410 -16779 -17709 -28898 -10585 3516
7667 3516 9127 8923 24000 36683 45575 32265 29089 33869 30858 15582 23875 32343 11846 -1110
7653 -1110 19431 24673 17137 19997 36888 35536 16027 6376 -6781 35529 41055 24291 28320
7640 28320 22531 8336 30250 75517 51487 34928 35698 24998 1923 -10581 15836 35407
7628 35407 26764 28003 30172 40161 31911 3169 6595 33924 36191 33452 32391 23409 20957 46619
7614 46619 24006 7443 27952 55511 21026 15427 6583 -31450 -10711 33135 54032 43060
$$ packed form
7707A3358J634l1169j4836M707K315l386M673K6979R988k212p592q075P272j1552
7693g896J1881R495l6081k3470N123K0432J2882j3667Q204J3765k685J8327J4467
7680C0777p379k2048J1744j3900o630k5718r788J2532J3631r30j1189J8313J4101
7667C516N611k04J5077J2683Q892j3310l176M780l011j5276Q293Q468k0497j2956
7653a110K0541N242p536K860J6891j352j9509r651j3157M2310N526j6764M029
7640B8320n789j4195K1914M5267k4030j6559P70j0700k3075j2504K6417J9571
7628C5407q643J239K169R989q250k8742L426K7329K267k739j061q982k452K5662
7614D6619k2613j6563K0509K7559l4485n599q844l8033K0739M3846K0897j0972
$$ plain form
7602 43060 33469 60018 43057 31776 -12639 -18860 -6748 6892 -18285 -38178 -31392 -15936
7590 -15936 -18298 8885 38670 32484 29181 2322 -8024 1854 -6388 -5897 -36237 -55295 -30714
7577 -30714 -753 -7399 -34219 -43067 -53083 -55717 -5767 8481 26342 51995 12737 -5321
7565 -5321 16194 37630 41352 9291 44224 47510 34054 24787 47078 42704 28192 20284 35003
7552 35003 32051 37981 56408 62361 41652 21068 10088 -26934 -5937 23542 39512 31812 32353
7539 32353 46456 30988 37045 63060 84481 53920 23667 11485 23630 21748 30328 28752 29013
7526 29013 27473 30260 16415 -7829 -12210 -3128 22588 27951 11466 -18890 -27521 -18225 -1675
7513 -1675 14429 21292 28462 39259 5044 -25207 11921 29174 26672 26746 30925 33401 28217 23278
$$ packed form
7602D3060r591K6549j6961j1281m4415o221J2112J3640k5177j9893O786J5456
7590a5936k362K7183K9785o186l303k6859j0346R878q242M91l0340j9058K4581
7577c0714K9961o646k6820q848j0016k634M9950J4248J7861K5653l9258j8058
7565e321K1515K1436L722l2061L4933L286j3456r267K2291m374j4512p908J4719
7552C5003k952N930J8427N953k0709k0584j0980l7022K0997K9479J5970p700N41
7539C2353J4103j5468O057K6015K1421l0561l0253j2182J2145j882Q580j576K61
7526B9013j540K787j3845k4244m381R082K5716N363j6485l0356q631R296J6550
7513a675J6104O863P170J0797l4215l0251L7128J7253k502P4M179K476n184m939
$$ plain form
7499 23278 -620 24825 29426 58848 59632 34854 14405 7397 -4264 -18038 -14650 -15411 -41458
7486 -41458 -54629 -46750 -22965 -5662 -11341 11730 -199 -5857 -22842 -21073 -23652 -7308 133
7473 133 -12613 -11252 7972 31305 24060 -8921 -38651 -24148 -16016 -35174 -20930 -29593 -13450
7460 -13450 -9898 -19261 -15819 6770 3521 -32445 -24507 -28053 4726 3562 -10327 -49862 -54804
7447 -54804 -30312 -20150 4335 28020 31907 28037 4271 -4092 -13190 -38839 -22913 -21101 10315
7434 10315 15565 20979 43893 19021 13193 31172 21169 -1495 4171 6151 41924 62206 56105
7421 56105 19680 -9947 -22402 3152 20353 -17313 -32452 21022 33871 22951 2315 16495
7409 16495 6214 6387 26997 43086 24341 9554 15504 5500 24458 44880 56644 48082 24508
$$ packed form
7499B3278k3898K5445M601K9422P84k4778k0449p008j1661j3774L388p61k6047
7486d1458j3171P879K3785J7303n679K3071j1929n658j6985J769k579J6344P441
7473A33j2746J361J9224K3333p245l2981k9730J4503Q132j9158J4244q663J6143
7460a3450L552r363L442K2589l249l5966P938l546L2779j164j3889l9535m942
7447e4804K4492J0162K4485K3685L887l870k3766q363r098k5649J5926J812L1416
7434A0315N250N414K2914k4872n828J7979j0003k2664N666J980L5773K0282o101
7421E6105l6425k9627j2455K5554J7201l7666j5139N3474J2849j0920k0636J4180
7409A6495j0281J73K0610J6089j8745j4787N950j0004J8958K0422J1764q562k3574
$$ plain form
7396 24508 38377 32681 21127 -14865 -16997 -1244 14722 29095 33528 43444 51165 67505 55340
7383 55340 54341 60777 40156 26166 12238 13764 38573 7434 1129 -7841 29430 47384 7912
7370 7912 -28052 -21474 6340 40404 30121 29741 30162 22929 32863 10998 12878 26329 37338 20742
7356 20742 15246 -10799 -28351 -20571 -36640 -61402 -57515 -40817 -43621 -30860 -30878 -9607 18455
7343 18455 12763 9122 3616 -12084 -1407 10186 13767 45163 39993 21331 10451 12183 37807
7330 37807 53641 38767 14984 -4579 -7848 18728 18009 21491 11705 42555 54797 48555 41471
7317 41471 25603 -14938 -36285 -34622 -14408 -6439 34428 58559 51845 25788 -14671 1660
7305 1660 3425 8639 43011 44887 31466 17494 26036 64360 37882 36128 30804 21048 -1435
$$ packed form
7396B4508J3869n696j1554l5992k132J5753J5966J4373M433R916P721J6340j2165
7383E5340r99O436k0621j3990j3928J526K4809l1139o305q970L7271J7954l9472
7370G912l5964O578K7814L4064j0283l80M21p233R934k1865J880J3451J1009j6596
7356B0742n496k6045j7552P780j6069k4762L887J6698k804J2761j8K1271K8062
7343A8455n692l641n506j5700J0677J1593L581L1396n170j8662j0880J732K5624
7330C7807J5834j4874k3783j9563l269K6576p19L482r786L0850J2242o242p084
7317D1471j5868m0541k1347J663K0214P969M0867K4131o714k6057m0459J6331
7305A660J765N214L4372J876j3421j3972Q542L8324k6478j754n324r756k2483
$$ plain form
7292 -1435 -61005 -56198 -17790 -8013 7704 4969 3175 12239 14933 22237 379 -17416 -12173 5907
7278 5907 12580 8673 9031 -4279 -23881 -16624 -21610 -25623 -47591 -56361 -38294 -55434 -60272 -12819
7264 -12819 49354 42324 3061 -8627 10065 680 -31092 -47716 7736 29699 7007 6663 990
7251 990 -7791 -9807 -11839 -14271 -32164 -49798 -50063 -21976 -13880 -4961 -8274 10147 9847 -21204
7237 -21204 -16546 7336 35120 73511 52594 21198 2090 7302 -2555 1863 -6144 11556 33999
7224 33999 41296 43609 15257 -3998 -2495 11761 -6778 515 7580 10389 8710 14862 8764 21078
7210 21078 11155 -34601 -39833 -12354 20004 12257 -54547 -72419 -28535 -15040 -7388 -4687 3680
7197 3680 9117 28773 33347 17339 -8387 -10258 -26573 -28600 -715 27085 32289 4643 -16371
$$ packed form
7292a435n9570M807L8408R777J5717k735j794R064K694P304k1858j7795N243J8080
7278E907O673l907L58j3310j9602P257m986m013k1968q770J8067j7140m838M7453
7264a2819O2173p030l9263j1688J8692r385l1772j6624N5452K1963k2692l44n673
7251I90q781k016k032k432j7893j7634k65K8087Q096Q919l313J8421l00l1051
7237b1204M658K3882K7784L8391k0917l1396j9108N212r857M418q007J7700K2443
7224C3999P297K313k8352j9255J503J4256j8539P293P065K809j679O152o098J2314
7210B1078r923m5756n232K7479L2358p747o6804j7872M3884J3495P652K701Q367
7197C680N437J9656M574j6008k5726j871j6315k027K7885K7800N204k7646k1014
$$ plain form
7184 -16371 9672 1994 -24867 -42157 -6781 -33002 -42718 -28158 -38442 4795 27632 27130 21265
7171 21265 2098 23842 71776 24316 -28142 -23794 4014 1199 -3660 -7770 17666 28526 5103
7158 5103 -14692 -16933 -25544 -25185 -7635 -745 -14025 -10007 23383 32928 950 -50689 -61857
7145 -61857 -32614 15836 69827 57140 28740 16904 10351 -2205 9381 18939 31035 19749
7133 19749 1742 -27015 -8031 13768 16970 16109 32622 43942 57937 32303 -10463 -5105 32609
7120 32609 49222 34609 6699 -10325 -12893 -5873 -31821 -59890 -79161 -53008 -61846 -49940
7108 -49940 -18671 -7699 20303 12289 -4802 -14660 -3539 2728 -7133 25227 47975 39588 49433
7095 49433 18932 33034 61997 27138 -9119 -14536 -4412 12961 6830 -15204 -14542 -10228 -8362
$$ packed form
7184a6371K6043p678k6861j7290L5376k6221r716J4560j0284M3237K2837n02n865
7171B1265j9167K1744M7934m7460n2458M348K7808k815m859m110K5436J0860k3423
7158E103j9795k241q611L59J7550O890j3280M018L3390R545l1978n1639j1168
7145f1857K9243M8450N3991j2687k8400j1836o553j2556J1586R558J2096j1286
7133A9749j8007k8757J8984K1799L202q61J6513J1320J3995k5634m2766N358L7714
7120C2609J6613j4613k7910j7024k568P020k5948k8069j9271K6153q838J1906
7108d9940L1269J0972K8002q014j7091r858J1121O267r861L2360K2748q387R845
7095D9433l0501J4102K8963l4859l6257n417J0124J7373o131k2034O62M314J866
$$ plain form
7082 -8362 -6571 -14658 -29613 -37583 -30495 -2808 7185 9464 9933 10784 25339 3314 -15388 -37696
7068 -37696 -72115 -60548 -56305 -63600 -81911 -106598 -96606 -95549 -83972 -49159 -34250 -17236 -1446
7055 -1446 10674 -17216 -9288 24921 42280 32935 34696 18346 18366 21389 -389 19809 16163 7284
7041 7284 -1148 -643 29706 38242 39966 61949 46013 46320 48000 50131 59279 3723 -41807 -35564
7027 -35564 -35340 -27684 -15976 -1362 1272 -10051 -13085 11630 17846 38776 33398 10182 -11309
7014 -11309 -17583 -9204 -27931 -36226 -50117 -27280 -15154 -6199 22290 34999 19863 11075 14300
7001 14300 4037 -23577 -7884 11759 8688 14631 18731 3680 -17352 -30661 -27055 -2306 -14144
6988 -14144 -13613 -256 5165 26442 28417 36364 37362 12667 12731 -9294 7661 34148 14668 8215
$$ packed form
7082h362J791q087j4955p970P088K7687R993K279M69Q51J4555k2025j8702k2308
7068c7696l4419J1567M243p295j8311k4687R992J057J1577L4813J4909J7014J5790
7055a446J2120k7890P928L4209J7359r345J761j6350K0L023k1778K0198l646q879
7041G284q432N05L0349Q536J724K1983j5936L07J680K131R148n5556m5530O243
7027c5564K24P656J1708J4614K634j1323l034K4715O216K0930n378k3216k1491
7014a1309o274Q379j8727q295j3891K2837J2126Q955K8489J2709j5136q788L225
7001A4300j0263k7614J5693J9643l071N943M100j5051k1032j3309L606K4749j1838
6988a4144N31J3357N421K1277J975P947R98k4695O4k2025J6955K6487j9480o453
$$ plain form
6974 8215 3928 6562 10070 12594 4692 60094 76759 39640 18828 -9633 -31214 -28736 -17968
6961 -17968 11804 11283 -10124 -14792 -41599 -61995 -42790 -4297 13295 15297 -28040 -44884 -47224
6948 -47224 -10080 -5855 2640 19031 23363 17393 3670 5323 12208 40845 34802 20959 2197
6935 2197 38197 64695 41079 -10110 -29292 -43074 -38925 -26284 -25073 -23798 -16172 -1082 9637
6922 9637 4235 21929 23570 21540 38563 49271 59497 66358 44428 6553 -33199 -41263 -42492
6909 -42492 -34818 -25323 2599 -4953 -12356 -12062 -7405 3456 13714 -425 1237 16279 1790
6896 1790 -14457 -15693 -3547 95 2122 -6503 4519 12818 34787 33332 42536 52684 26367
6883 26367 -8550 -30953 -34803 -21184 -6533 251 -18104 -10922 -26450 -30145 -18467 -2532 9112
$$ packed form
6974H215m287K634L508K524p902N5402J6665l7119k0812k8461k1581K478J0768
6961a7968K9772n21k1407m668k6807k0396J9205L8493J7592K002m3337j6844k340
6948d7224L7144M225Q495J6391M332n970j3723J653O885K8637o043j3843j8762
6935B197L6000K6498k3616n1189j9182j3782M149J2641J211J275P626J5090J0719
6922I637n402J7694J641k030J7023J0708J0226O861k1930l7875l9752q064j229
6909d2492P674R495K7922p552p403K94M657J0861J0258j4139J662J5042j4489
6896A790j6247j236J2146L642K027q625J1022Q299K1969j455R204J0148k6317
6883B6367l4917k2403l850J3619J4651O784j8355P182j5528l695J1678J5935J1644
$$ plain form
6870 9112 14180 11972 -235 11240 -1283 -20938 2752 -4926 5240 24787 -1238 -19893 -38773
6857 -38773 -54640 -67547 -36347 -16099 35662 45870 -2499 -36533 -27809 -20052 -12006 -16415 -25068
6844 -25068 -25732 3397 16863 25653 25443 18437 -16579 -24885 -5485 9827 5276 23797 20880 12866
6830 12866 15647 3397 -26273 15060 39536 19784 6285 18544 11948 4684 -909 -2169 -13214
6817 -13214 -24526 7864 8691 -23377 -55260 -64980 -40912 -14259 -19326 7939 -7143 -4622 -10794
6804 -10794 -33097 -48747 -53318 -39268 -11275 -18190 -48201 -57278 -40581 -19155 -12518 -12129 4779
6791 4779 15680 -5493 -24143 -28283 -40342 -26392 -1821 -11406 -6530 -24080 -4589 -3558 -12199
6778 -12199 -3228 -11217 1907 15721 7506 9367 38107 40090 -1652 17100 5081 17892 44002
$$ packed form
6870I112N068k208j2207J1475j2523j9655K3690p678J0166J9547k6025j8655j8880
6857c8773j5867j2907L1200K0248N1761J0208m8369l4034Q724P757Q046m409q653
6844b5068o64K9129J3466Q790k10p006l5016q306J9400J5312m551J8521k917q014
6830A2866K781j2250k9670M1333K4476j9752j3499J2259o596p264n593j260j1045
6817a3214j1312L2390Q27l2068l1883r720K4068K6653n067K7265j5082K521o172
6804a0794k2303j5650m571J4050K7993o915l0011r077J6697K1426O637L89J6908
6791D779J0901k1173j8650m140j2059J3950K4571r585M876j7550J9491J031q641
6778a2199Q971p989J3124J3814q215J861K8740J983m1742J8752j2019J2811K6110
$$ plain form
6765 44002 33615 36347 17967 14253 19916 22304 27069 -3001 22022 52575 70093 51337 27487
6752 27487 5901 -9778 -25139 -701 12527 -474 -27567 -24036 -15366 -27584 -17088 -9072
6740 -9072 5543 7967 35948 40135 25920 -21255 -11492 7203 7106 11364 1230 10911 17771 27790
6726 27790 39864 46707 13838 -28729 -8800 -4312 1076 15980 -5508 -20384 -20101 -14380 -3649
6713 -3649 10384 1585 1397 16518 31613 28217 19936 39130 36477 23279 18508 18528 32014 16730
6699 16730 -7203 -13864 -10169 -3168 -6695 -31384 -44291 -28163 -21465 -8647 -30962 -55178 -45234
6686 -45234 -3427 5123 -8452 -6451 -20295 -20066 -8074 14769 2405 991 3852 1862 1721 28482
6672 28482 65856 64942 14728 -10936 -14537 -5831 -9369 8390 -3363 -11293 7333 13930 26837
$$ packed form
6765D4002j0387K732j8380l714N663K388M765l0070K5023L0553J7518j8756k3850
6752B7487k1586j5679j5361K4438J3228j3001k7093L531Q670j2218J0496Q016
6740i072J4615K424K7981M187j4215m7175R763J8695r7M258j0134R681O860J0019
6726B7790J2074O843l2869m2567J9929M488N388J4904k1488j4876K83N721J0731
6713c649J4033q799j88J5121J5095l396q281J9194k653j3198m771K0J3486j5284
6699A6730k3933o661L695P001l527k4689j2907J6128O698J2818k2315k4216R944
6686d5234M1807Q550j3575K001j3844K29J1992K2843j2364j414K861j990j41K6761
6672B8482L7374r14n0214k5664l601Q706l538J7759j1753p930J8626O597J2907
$$ plain form
6659 26837 27749 -19972 -57979 -61637 -19656 4653 10722 -1245 2129 8279 10416 19733 30947
6646 30947 41825 44771 56792 59322 60567 32369 19795 11502 -7234 -14741 -24947 -15560 3834
6633 3834 9376 -12924 -33260 -26570 -6420 -15417 -16071 -580 34511 18754 12447 34159 52882
6620 52882 42897 19798 30519 46630 32190 9696 -6783 4430 26182 20564 30083 26231 61183
6607 61183 55901 34816 -3338 5658 26661 8646 10782 20096 34623 24471 15981 -13172 -24857
6594 -24857 -12514 1434 11421 18762 8906 -17913 -11898 24027 24776 15593 459 -28005 -43555
6581 -43555 -23408 -5984 -19102 -14009 -44450 -64997 -44489 -9006 -5966 9027 6475 1475 -9591
6568 -9591 -25738 -25735 -6538 11677 -7070 -60911 -67593 -73377 -63286 -39085 -21969 18122 64772
$$ packed form
6659B6837R12m7721l8007l658M1981K4309O069j1967L374O150K137R317J1214
6646C0947J0878K946J2021K530J245k8198j2574q293j8736p507j0206R387J9394
6633C834N542k2300k0336O690K0150q997o54J5491L5091j5757o307K1712J8723
6620E2882r985k3099J0721J6111j4440k2494j6479J1213K1752n618R519l852L4952
6607F1183n282k1085l8154Q996K1003j8015K136R314J4527j0152q490k9153j1685
6594b4857J2343J3948R987P341r856k6819O015L5925P49r183j5134k8464j5550
6581d3555K0147J7424j3118N093l0441k0547K0508L5483L040J4993k552n000j1066
6568i591j6147LJ9197J8215j8747n3841o682n784J0091K4201J7116M0091M6650
$$ plain form
6555 64772 83831 64106 43595 12201 -12001 -19868 -1496 31812 31458 31470 29504 21105 14643 3269
6541 3269 2412 29882 36318 -13646 4879 1222 -40491 -45398 -67038 -63545 -69165 -62425 -51935 -18487
6527 -18487 -32752 -39099 -37036 -39934 -34320 -16017 -4446 8574 -14805 -31676 -30365 -24264 -24808
6514 -24808 -38714 -17851 1667 17999 20733 -5503 -11727 36856 58365 20471 3541 -9079
6502 -9079 -17716 3056 -3157 -26944 -1414 11773 -27761 -37079 -35814 -1374 -32913 -18931 14847
6489 14847 -24934 -45271 -30975 2777 20114 -7637 -16842 -4563 20457 30556 -1454 -19282
6477 -19282 -17976 -11026 9066 32288 29452 18953 34540 67223 54567 35585 2215 -10963
6465 -10963 -12702 -32179 -35224 -7664 -6416 -14358 -9831 3175 4441 -5266 -15268 -15120 5928 9603
$$ packed form
6555F4772J9059j9725k0511l1394k4202p867J8372L3308l54J2j966q399o462j1374
6541C269q57K7470O436m9964J8525l657m1713m907k1640L493n620O740J0490L3448
6527a8487j4265o347K063k898N614J8303J1571J3020k3379j6871J311O101n44
6514b4808j3906K0863J9518J6332K734k6236o224M8583K1509l7894j6930j2620
6502i079q637K0772o213k3787K5530J3187l9534r318J265L4440l1539J3982L3778
6489A4847l9781k0337J4296L3752J7337k7751r205J2279K5020J0099l2010j7828
6477a9282J306O950K0092K3222k836j0499J5587L2683j2656j8982l3370j3178
6465a0963j739j9477l045K7560J248p942M527J3006J266r707j0002J48K1048L675
$$ plain form
6451 9603 35150 45019 46981 34682 17790 -12268 -6491 9042 33116 45245 32361 -8539 -23993
6438 -23993 -17555 -14633 -5381 18831 8345 11951 15643 22372 38321 34740 18199 31661 37897
6425 37897 8676 6383 4942 -8765 -6820 25942 51757 47628 58691 73308 59152 44601 33259
6412 33259 20635 13612 22259 15877 5890 22797 24068 21593 2987 -14406 -41432 -55677 -62886
6399 -62886 -14936 -2772 3312 10791 8607 22928 10739 8294 28009 11841 -7797 -8443 -6056
6386 -6056 3686 8513 -8299 -4903 -34169 -53244 -24932 -35747 5470 32831 42316 27153 10875
6373 10875 5941 717 1052 -23072 -22879 -21746 -6031 -25249 -47749 -41264 -30037 -13589 15417
6360 15417 46597 27942 46641 21694 -16751 1775 -12866 -7268 20366 36049 44966 57179
$$ packed form
6451I603K5547R869J962j2299j6892l0058N777J5533K4074J2129j2884m0900j5454
6438b3993O438K922R252K4212j0486L606L692O729J5949l581j6541J3462O236
6425C7897k9221k293j441j3707J945L2762K5815m129J1063J4617j4156j4551j1342
6412C3259j2624p023Q647o382r987J6907J271k475j8606j7393k7026j4245p209
6399f2886M7950J2164O084P479k184J4321j2189k445J9715j6168j9638o46K387
6386f056R742M827j6812L396k9266j9075K8312j0815M1217K7361R485j5163j6278
6373A0875m934n224L35k4124J93J133J5715j9218k2500O485J1227J6448K9006
6360A5417L1180j8655J8699k4947l8445J8526j4641N598K7634J5683Q917J2213
$$ plain form
6348 57179 66956 43558 42409 32361 9467 -23666 -35054 -39547 -22544 7661 22512 24569 3164
6335 3164 -1934 6017 -9391 -10906 -8523 -5210 12717 17903 14651 -22356 -36356 -4493 13129
6322 13129 -11999 -10005 13143 -15235 -8396 -21221 -17387 -3411 -12490 -12900 -38150 -42394 -30238
6309 -30238 -26127 -37662 -35789 -1168 6796 12703 -8232 -3763 22327 41383 48823 37657 14686
6296 14686 -5645 6530 10642 29620 29457 41075 14779 -3098 -10723 -44975 -11748 17239 31712
6283 31712 49360 39595 29223 33385 44288 47950 40959 12642 2485 -14254 932 20269 31927
6270 31927 22485 2148 3542 8271 -12441 -18159 -13742 -7796 5274 -7933 7990 38170 47256
6257 47256 38907 13662 12669 13172 -1501 -14368 -15409 -12492 -19451 -35975 -25185 -4864 1132 -3357
$$ packed form
6348E7179R777k3398j149j0048k2894l3133j1388m493J7003L0205J4851K057k1405
6335C164n098P951j5408j515K383L313J7927N186l252l7007j4000L1863J7622
6322A3129k5128J994K3148k8378O839j2825L834J3976r079m10k5250m244J2156
6309c0238M111j1535J873L4621P964N907k0935M469K6090J9056P440j1166k2971
6296A4686k0331J2175M112J8978j63J1618k6296j7877p625l4252L3227K8987J4473
6283C1712J7648r765j0372M162J0903L662o991k8317j0157j6739J5186J9337J1658
6270C1927r442k0337J394M729k0712n718M417N946J3070j3207J5923L0180R086
6257D7256q349k5245r93N03j4673j2867j041K917o959j6524J0790K0321N996m489
$$ plain form
6243 -3357 -7645 -17284 -39442 -26151 -19155 -32505 -21112 -25332 -7903 12992 16476 22732 14877
6230 14877 25284 9066 -28062 -37424 -30203 -29799 -18643 -13301 -8690 -6806 -35108 -64293 -56161
6217 -56161 -35232 -20419 -16825 -27973 -165 25344 2308 -41385 -42238 -33033 -21960 -15625 -13663
6204 -13663 -13268 -37224 -37949 -49921 -55126 -40561 -28951 4477 25446 37061 5858 -12550 11161
6191 11161 2493 -9182 -6426 -4235 10630 13329 -14474 -23677 -5996 16276 29546 13842 11827
6178 11827 17817 20988 -5248 -2062 -12394 -7524 -15223 -19483 -16130 -4674 -4068 -372 26066 7622
6164 7622 8620 12439 16203 16630 -56 -17044 -18783 -8912 -12145 -33221 10830 1219 -33837 -13824
6150 -13824 4267 188 -9930 -13696 -20698 -19153 -14070 -20818 -23486 13938 20089 5966 22172
$$ packed form
6243c357m288r639k2158J3291O996j3350J1393m220J7429K0895L484O256p855
6230A4877J0407j6218l7128r362P221M04J1156N342M611J884k8302k9185Q132
6217e6161K0929J4813L594j1148K7808K5509k3036m3693q53R205J1073O335J962
6204a3663L95k3956p25j1972n205J4565J1610L3428K0969J1615l1203j8408K3711
6191A1161q668j1675K756K191J4865K699k7803r203J7681K2272J3270j5704k015
6178A1827N990L171k6236L186j0332M870p699m260L353J1456O06L696K6438j8444
6164G622R98L819L764M27j6686j6988j739R871l233k1076M4051r611l5056K0013
6150a3824J8091m079j0118l766p002J545N083o748k668L7424O151j4123J6206
$$ plain form
6137 22172 5570 -17574 -42195 -53677 -25829 -1703 13743 242 14346 33136 22816 -10300
6125 -10300 -18412 -14739 -17759 -18840 -26955 19419 27956 23882 19821 18604 10763 13117 9235 25657
6111 25657 52297 34018 2876 -7043 -11308 -5905 -40185 -28014 5330 2787 -6056 -3513 2742
6098 2742 45550 31537 -3637 -13248 -11528 -23710 -55528 -14564 37082 2634 -1889 8605 -38388
6085 -38388 -53872 -38010 -19423 -22659 -23996 -11137 22271 51717 58335 33493 8092 -11979
6073 -11979 -11730 13705 40422 46976 48918 35289 6302 -12705 -1561 -11447 -26248 -33311 -15886
6060 -15886 1502 19023 35915 27660 25201 46499 50917 17864 10884 -10746 -8053 11816 6081
6047 6081 -5953 14673 42213 35302 43880 -10745 -31494 -22906 -35519 -37312 -26080 -11607 4592
$$ packed form
6137B2172j6602k3144k4621j1482K7848K4126J5446j3501J4104J8790j0320l3116
6125a0300q112L673l020j081q115M6374Q537m074m061j217p841K354l882J6422
6111B5657K6640j8279l1142r919m265N403l4280J2171L3344k543q843K543O255
6098B742M2808j4013l5174r611J720j2182l1818M0964N1646l4448m523J0494m6993
6085c8388j5484J5862J8587l236j337J2859L3408K9446O618k4842k5401k0071
6073a1979K49K5435K6717O554J942j3629k8987j9007J1144r886j4801p063J7425
6060a5886J7388J7521J6892q255k459K1298M418l3053o980k1630K693J9869n735
6047F081j2034K0626K7540o911Q578n4625k0749Q588j2613j793J1232J4473J6199
$$ plain form
6034 4592 -2305 -4157 3490 28894 46705 36620 -4092 -6737 -14093 -39414 -38999 -25925 -1302
6021 -1302 5247 -12702 -31869 -3201 25761 19558 20265 8106 -5744 10984 30411 9828 -18129
6008 -18129 -5776 12573 46852 44786 23565 -6179 -36955 -11466 -13815 -28912 -13887 -20464
5996 -20464 -6505 12553 21691 32373 31937 13936 14568 -16607 -49941 -52737 -18902 19315 17875
5983 17875 28786 33036 13211 14024 25818 11805 -9444 -6305 -6235 -15530 -23822 -13151 12407 -8534
5969 -8534 -19027 11387 30536 19860 12381 -5217 -1405 9147 -8198 -17385 -10207 -9805 -1302
5956 -1302 26726 30395 19535 10320 21651 5480 9975 -16874 -9874 -1826 -1625 17292 -9079
5943 -9079 -618 24989 -1440 -39152 -38169 -34548 -21958 -51004 -87363 -60196 -39681 -39831 -16661
$$ packed form
6034D592o897j852P647K5404J7811j0085m0712k645p356k5321M15J3074K4623
6021a302O549j7949j9167K8668K8962o203P07j2159j3850J6728J9427k0583k7957
6008a8129J2353J8349L4279k066k1221k9744l0776K5489k349j5097J5025o577
5996b0464J3959J9058R138J0682m36j8001O32l1175l3334k796L3835L8217j440
5983A7875J0911M250j9825Q13J1794j4013k1249L139P0r295q292J0671K5558k0941
5969h534j0493L0414J9149j0676p479j7598L812J0552j7345r187P178M02Q503
5956a302K8028L669j0860r215J1331j6171M495k6849P000Q048K01J8917k6371
5943i079Q461K5607k6429l7712R83L621J2590k9046l6359K7167K0515j50K3170
$$ plain form
5930 -16661 30505 28626 3233 -7560 2793 3027 -2916 -5807 -2349 1436 2675 -1641 29619 48289
5916 48289 17821 -18269 -35959 -11397 10228 20803 16892 -2870 -23827 -41487 -36823 -26937
5904 -26937 -14130 -49034 -44980 -41836 -10458 -20802 -19322 -4769 -1816 3051 26326 24015 325
5891 325 -618 -8583 -23130 -10719 1080 -26168 -10800 1674 -13456 7588 21715 -826 -10346
5878 -10346 -29486 -38815 -20685 -28631 -23528 7677 26153 9285 -18453 -13464 -3017 10752 -10248
5865 -10248 -28996 5904 34012 48610 62164 37233 14379 -993 -12286 -8010 11859 -11301
5853 -11301 -21142 -30330 398 46145 25715 -4041 -24006 -51222 -56337 -18193 -12616 -15359 -6814
5840 -6814 416 9670 10152 -34386 -32376 -7266 -401 -6307 1907 15873 3281 1403 -934 -7779
$$ packed form
5930a6661M7166j879k5393j0793J0353K34n943k891L458L785J239m316L1260J8670
5916D8289l0468l6090j7690K4562K1625J0575l911j9762k0957j7660M664R886
5904b6937J2807l4904M054L144L1378j0344J480J4553K953M867K3275k311k3690
5891C25r43p965j4547J2411J1799k7248J5368J2474j5130K1044J4127k2541r520
5878a0346j9140r329J8130p946N103L1205J8476j6868k7738M989J0447J3769k1000
5865a0248j8748L4900K8108J4598J3554k4931k2854j5372j1293M276J9869k3160
5853a1301r841r188L0728M5747k0430k9756j9965k7216n115L8144N577k743Q545
5840f814P230R254M82m4538K010K5110O865n906Q214J3966j2592j878k337o845
$$ plain form
5826 -7779 -10384 -25000 -33723 -33641 -59345 -39870 17917 1885 3792 -11103 -27565 -19202 -23221 -9245
5812 -9245 -4112 19937 -21379 -63479 -50398 -12421 -5939 -6267 -16141 -29601 -30641 -27678 -16396
5799 -16396 -17925 2747 11675 -1357 -6803 -22855 -42334 -26324 -31730 -19029 -8531 11711 9488
5786 9488 -4903 16623 30659 22986 15415 -17012 1852 18067 -17697 -31544 -25684 -35295 -44818
5773 -44818 -34512 -2628 -2483 11612 12470 11939 7623 -26042 -8303 25650 -4150 6020 24099
5760 24099 20583 1285 14997 -10526 -27264 -13064 8127 -8187 -19912 -19018 -31684 -39450 -35117
5747 -35117 -6405 12336 10151 -22324 -63710 -60264 -28390 -16177 -14408 -22201 -37242 -32164 -16485
5734 -16485 -14320 -17147 455 1695 -20566 -43947 -34603 -8571 19945 -12069 -14988 -4696 416
$$ packed form
5826g779k605j4616q723Q2k5704J9475N7787j6032J907j4895j6462Q363m019J3976
5812i245N133K4049m1316m2100J3081L7977O482l28r874j3460j040K963J1282
5799a6396j529K0672Q928j3032n446j6052j9479J6010n406J2701J0498K0242k223
5786I488j4391K1526J4036p673p571l2427J8864J6215l5764j3847N860r611r523
5773d4818J0306L1884J45J4095Q58n31m316l3665J7739L3953k9800J0170J8079
5760B4099l516j9298J3712k5523j6738J4200K1191j6314j1725Q94j2666p766M333
5747c5117K8712J8741k185l2475m1386L446L1874J2213J769p793j5041N078J5679
5734a6485K165k827J7602J240k2261k3381R344K6032K8516l2014k919J0292N112
$$ plain form
5721 416 16858 37253 31832 13577 -7901 -19809 -35608 -33721 -34526 -20766 -16631 -11489 -15762 1607
5707 1607 1373 -1782 13786 25420 26692 12305 -46904 -84857 -84221 -57243 -17627 28033 17104
5694 17104 24733 -1019 -14271 -17878 -38234 -28192 21678 42031 35526 33023 26961 15599 27423
5681 27423 59729 25996 8026 18894 28009 20251 24163 48182 56174 38970 21565 7762 2379
5668 2379 11052 -15232 -5645 -2428 -1645 -3310 -21368 -11495 13039 50517 51001 25758 2665 -9636
5654 -9636 -5124 -11690 -32265 -30720 -17617 -717 27970 6973 -13262 -27762 -63705 -35588 -375
5641 -375 -34460 -14742 5103 -20378 -18720 -23928 23537 38253 17630 9817 10104 12319 29230
5628 29230 17763 20980 -15009 -5720 23274 26023 20371 44527 22106 6254 28264 15533 6619
$$ packed form
5721D16J6442K0395n421j8255k1478j1908j5799J887q05J3760M135N142m273J7369
5707A607k34l155J5568J1634J272j4387n9209l7953O36K6978L9616M5660j0929
5694A7104P629k5752j3252l607k0356J0042M9870K0353o505k503o062j1362J1824
5681B7423L2306l3733j7970J0868R115p758L912K4019P992j7204j7405j3803n383
5668B379Q673k6284R587L217P83j665j8058R873K4534L7478M84k5243k3093j2301
5654i636M512o566k0575J545J3103J6900K8687k0997k0235j4500l5943K8117L5213
5641c75l4085J9718J9845k5481J658n208M7465J4716k0623p813K87K215J6911
5628B9230j1467L217l5989R289K8994K749n652K4156k2421j5852K2010j2731q914
$$ plain form
5615 6619 -1017 -15758 -41431 -31630 3968 5479 -2687 -1849 2143 30664 25069 46677 28256 20374
5601 20374 23737 44180 49097 34503 38581 49697 69057 22276 8905 -8536 -38712 -30255 4580
5588 4580 4187 1325 -29426 -30270 -41943 -43745 -43278 -26220 -32011 -33159 -20829 -43252 -63042 -25683
5574 -25683 25083 50595 41973 44461 46418 12335 -14171 -10571 -2694 -14692 22178 57299 54695
5561 54695 2320 -32512 -41734 -46530 -36368 -23264 -11208 -5366 -25888 -40910 -17961 -16329 -3015
5548 -3015 23056 16048 1667 10142 3593 2200 12113 -16083 -36336 -37364 -2765 26282 4766
5535 4766 -18706 -7589 -4530 -4696 -4307 20675 46268 52416 51377 45513 -18269 -32485 -8854 -10414
5521 -10414 -9654 -7 4694 -16055 -25890 -27130 3706 39969 37019 24368 8095 14274 18239 -18582
$$ packed form
5615F619p636j4741k5673R801L5598J511q166Q38L992K8521n595K1608j8421p882
5601B0374L363K0443M917j4594M078J1116J9360m6781j3371j7441l0176Q457L4835
5588D580l93k862l0751q44j1673j802M67J7058n791j148J2330k2423j9790L7359
5574b5683N0766K5512q622K488J957l4083k6506L600P877j1998L6870L5121k604
5561E4695n2375l4832r222m796J0162J3104J2056N842k0522j5022K2949J632J3314
5548c015K6071p008j4381Q475o549j393R913k8196k0253j028L4599K9047k1516
5535D766k3472J1117L059j66L89K4982K5593O148j039n864o3782j4216K3631j560
5521a0414P60R647M701k0749r835j240L0836L6263k950j2651j6273O179L965l6821
$$ plain form
5507 -18582 -42121 -37296 -16890 3582 7068 18055 8295 18982 32589 19168 19638 23036 19775
5494 19775 5283 -9512 -4950 -35773 -49670 -26352 -448 27919 28597 30287 28930 33438 21696
5481 21696 7732 -8976 -629 -18236 -32703 -53892 -52639 -38152 -33306 -36636 -44792 -24558 -8839
5468 -8839 15310 31448 9977 -1737 25175 33583 29025 42135 28847 39704 17885 -46133
5456 -46133 -47190 -16415 7629 -4499 -907 -29915 -42833 -29626 -17161 2075 29947 44848
5444 44848 18512 5090 -6338 -4741 -13731 -10333 25418 9453 -18231 -8272 -1965 13921 2268
5431 2268 -2068 -619 911 -5406 -3518 -4993 -7036 -14068 -9535 -4801 -16566 -30037 -20538 -12864
5417 -12864 -19461 -19988 -49153 -74738 -70362 -21354 -13043 -5608 11068 1833 -15721 -38227 -39442
$$ packed form
5507a8582k3539M825K0406K0472L486J0987r760J0687J3607j3421M70L398l261
5494A9775j4492j4795M562l0823j3897K3318K5904K8367O78J690j357M508j1742
5481B1696j3964j6708Q347j7607j4467k1189J253J4487M846l330q156K0234J5719
5468h839K4149J6138k1471j1714K6912Q408m558J3110j3288J0857k1819o4018
5456d6133j057L0775K4044j2128L592k9008j2918J3207J2465J9236K7872J4901
5444D4848k6336j3422j1428J597q990L398L5751j5965k7684R959O307J5886j1653
5431B268m336J449J530o317J888j475k043p032M533M734j1765j3471R499P674
5417a2864o597n27k9165k5585M376M9008Q311P435J6676r235j7554k2506j215
$$ plain form
5404 -39442 -47442 -23486 -20364 6627 -16347 -39066 -23823 15778 34862 19530 6387 -17008
5392 -17008 -66826 -46506 -26274 -31103 -18209 -10180 6656 11661 13019 -3719 -26899 -31733 -8357
5379 -8357 -26175 -21065 -27629 -24923 -30693 -70742 -58952 -25208 -27047 -32491 -23534 3494 -6830
5366 -6830 -9195 -23456 -9531 -5399 -7957 -748 31621 57323 41889 15494 4862 5119 -10019
5353 -10019 -18739 -15299 -4807 -4046 -4911 7132 -5024 -13314 -33952 -25635 -20533 -8818 15808 8606
5339 8606 -19377 -29417 877 15155 5515 -20898 -15381 -19619 -54413 -62849 -46137 -23518 -41672
5326 -41672 -32805 -50034 -38520 -26884 -31633 -982 988 -7063 -1442 23241 38640 40546 20790
5313 20790 6106 -17665 -32031 -20676 6921 19137 17734 -6149 -4996 -18764 -23362 -28594 -22995
$$ packed form
5404c9442q000K3956L122K6991k2974k2719J5243L9601J9084j5332j3143k3395
5392a7008m9818K0320K0232m829J2894Q029J6836N005J358j6738k3180m834K3376
5379h357j7818N110o564K706n770m0049J1790L3744j839n444Q957K7028j0324
5366f830k365j4261J3925M132k558P209L2369K5702j5434k6395j0632K57j5138
5353a0019q720L440J0492P61q65J2043j2156q290k0638Q317N102J1715K4626p202
5339H606k7983j0040L0294J4278r640k6413N517m238l4794q436J6712K2619j8154
5326d1672Q867j7229J1514J1636m749L0651J970q051N621K4683J5399J906j9756
5313B0790j4684k3771j4366J1355K7597J2216j403k3883J153j3768m598n232N599
$$ plain form
5300 -22995 -14689 2351 7721 -125 12324 20210 -16260 -25139 -36826 -8452 23010 -6128 -14238
5287 -14238 -23609 -56006 -28888 -2208 47182 62579 27359 32835 7166 -12125 20022 44034
5275 44034 34620 42424 41367 40022 17391 8258 -12004 2701 6335 7785 -12788 -37008 -56574
5262 -56574 -66493 -46561 -26994 5051 1730 -27240 -30938 -15714 -11056 -47645 -51767 -46070 -58619
5249 -58619 -55849 -32361 13214 15716 16945 8728 -5318 -14767 -8077 -24186 -309 15136 8437
5236 8437 -16094 -37561 -41071 -1208 23970 31649 27639 6841 5372 -20879 -49828 -36276 -24529
5223 -24529 1415 21142 14506 -8860 -15346 2565 -669 15591 41999 36957 18770 15147 9317
5210 9317 -11032 -36746 -37397 -27306 -14314 1454 -7205 1440 -23504 -78722 -60168 -16210 -20782
$$ packed form
5300b2995Q306J7040N370p846J2449P886l6470q879j1687K8374L1462k9138q110
5287a4238r371l2397K7118K6680M9390J5397l5220N476k5669j9291L2147K4012
5275D4034r414P804j057j345k2631r133k0262J4705L634J450k0573k4220j9566
5262e6574r919J9932J9567L2045l321k8970l698J5224M658l6589m122N697j2549
5249e8619K770K3488M5575K502J229q217j4046r449O690j6109K3877J5445o699
5236H437k4531k1467l510L9863K5178P679m010k0798j469k6251k8949J3552J1747
5223b4529K5944J9727o636k3366o486J7911l234J6260K6408n042j8187l623n830
5210I317k0349k5714o51J0091J2992J5768q659Q645k4944n5218J8554M3958m572
$$ plain form
5197 -20782 -33971 -13903 -17126 -49883 -52433 -52841 -56477 -29435 -13524 11855 27976 2685 -22995
5184 -22995 -20493 1039 2240 -6348 -42839 -25872 31296 28716 21442 -8652 -34067 -24650 -37123
5171 -37123 -50881 -42690 -42375 -10191 4768 877 -2561 9056 25015 18145 270 -2914 28875
5158 28875 60386 61223 46453 -14079 -47150 -42393 -53520 -45122 -33497 -14702 -22255 -15286 -12281
5145 -12281 -19361 -6387 6760 6915 14702 7016 8380 28868 36105 26165 42956 21416 45881
5132 45881 43026 23203 4782 -7157 8588 328 4639 13514 28878 20053 23447 50567 28609
5119 28609 6001 59455 103592 81011 47362 -99 -11267 -4482 332 10943 11636 -5250 -25282
5106 -25282 -42501 -3290 13475 20451 1528 -6606 3077 -3591 13361 23424 11598 -28755 -76930
$$ packed form
5197b0782j3189K0068l223l2757k550m08l636K7042J5911K5379J6121k5291k5680
5184b2995K502K1532J201q588l6491J6967N7168k580p274l0094k5415R417j2473
5171c7123j3758Q191L15L2184J4959l891l438J1617J5959o870j7875l184L1789
5158B8875L1511Q37j4770o0532l3071M757j1127Q398J1625J8795p553O969L005
5145a2281p080J2974J3147J55P787p686J364K0488P237r940J6791k1540K4465
5132D5881k855j9823j8421j1939J5745q260M311Q875J5364q825L394K7120k1958
5119B8609k2608N3454M4137k2581l3649m7461j1168O785M814J0611O93j6886k0032
5106b5282j7219L9211J6765O976j8923q134R683o668J6952J0063j1826m0353m8175
$$ plain form
5093 -76930 -72804 -29786 -20831 -15125 -18481 -30501 -17362 6504 -19437 -44115 -52832 -43995 -39483
5080 -39483 -26023 -38782 -44542 -45483 -29116 -20164 -14310 -24563 -17655 14009 16817 10928 1073 -2037
5066 -2037 28575 42754 11061 564 16399 -23457 -14205 -12719 -13731 14858 13240 3394 -5603
5053 -5603 -32943 -10294 17226 32700 26643 14092 -17612 -59267 -57043 -31296 -30237 -23256 -39344
5040 -39344 -42055 -13915 -4418 17901 2594 -34121 -37810 -14096 -16503 -15220 -3399 -4557 -21206
5027 -21206 -14236 -5634 -14410 -7326 4990 -18505 -17580 -9160 -9651 -22439 -10684 -17691 -8068 11535
5013 11535 12213 2919 4102 25755 60782 29815 -15210 -53161 -65532 -82319 -46329 -9581 -12111
5000 -12111 -10599 -26817 -33416 -11783 -13803 -767 10169 18996 45700 49210 30668 -18433 -38125
$$ packed form
5093g6930M126M3018Q955N706l356j2020J3139K3866k5941k4678q717Q837M512
5080c9483J3460j2759n760r41J6367Q952N854j0253O908L1664K808n889r855l110
5066b037L0612J4179l1693j0497J5835l9856R252J486j012K8589j618r846q997
5053e603k7340K2649K7520J5474o057j2551l1704m1655K224K5747J059O981j6088
5040c9344k711K8140R497K2319j5307l6715l689K3714k407J283J1821j158j6649
5027b1206O970Q602q776P084J2316k3495R25Q420m91j2788J1755p007R623J9603
5013A1535O78r294J183K1653L5027l0967m5025l7951j2371j6787L5990L6748k530
5000a2111J512j6218o599K1633k020J3036J0936Q827K6704L510j8542m9101j9692
$$ plain form
4987 -38125 -55072 -2428 29006 34798 29196 -12327 -40038 -26193 -8941 -8246 -4463 -4091 15849
4974 15849 31386 30748 3127 -11661 -24718 -39065 -37896 -42008 -39908 -22388 -34814 -19162 -6627
4961 -6627 -28299 -23609 -17667 -29956 -24501 15027 23315 6892 -4493 25275 31841 16169 11763
4948 11763 12395 -7986 -30672 -29622 -43232 10502 24036 941 -24669 5320 -3478 -31007 -39900
4935 -39900 -33410 -9926 14299 27051 41148 67126 66185 27515 7636 12722 29683 28798 29117
4922 29117 -4320 2279 8950 31590 44752 16452 16353 -9815 -28188 -31509 -39089 -7928 6542
4909 6542 23076 31906 8589 -20156 -26691 -21896 2294 25080 134 -9849 1233 22220 26824
4896 26824 38396 32257 35703 29220 8860 -13608 15280 20438 -18710 -25565 -46596 -39148 2358
$$ packed form
4987c8125j6947N2644L1434N792n602m1523k7711J3845J7252O95L783L72J9940
4974A5849J5537o38k7621j4788j3057j4347J169m112K100J7520j2426J5652J2535
4961f627k1672M690N942j2289N455L9528Q288j6423j1385K9768O566j5672m406
4948A1763O32k0381k2686J050j3610N3734J3534k3095k5610K9989q798k7529q893
4935c9900O490K3484K4225J2752J4097K5978r41l8670j9879N086J6961q85L19
4922B9117l3437O599O671K2640J3162k8300r9k6168j8373l321p580L1161J4470
4909F542J6534Q830k3317k8745o535M795K4190K2786k4946r983J1082K0987M604
4896B6824J1572o139L446o483k0360k2468K8888N158l9148o855k1031P448M1506
$$ plain form
4883 2358 33449 26024 -5879 7411 4192 -29045 -13333 48330 51735 46713 19196 4849 8952
4870 8952 -24301 -15453 14128 13777 -4147 12623 43306 18312 -30382 -67650 -42256 -46185 -33417
4857 -33417 8523 36004 31005 13547 23954 9366 8746 -1074 -27388 -30670 -6466 21052 18981
4844 18981 -2394 -3344 -12550 -30163 6394 21156 -3834 -19750 -14311 -10155 -36363 -33335 -12209
4831 -12209 -27895 -24885 -436 -3553 -32916 -64148 -36769 -4321 8924 16697 11641 5366 6974
4818 6974 10027 -4576 10257 15194 5864 -11902 -26870 -31951 -29645 7642 31203 50045 49109
4805 49109 20980 24962 49647 31687 20163 14760 3460 -52765 -46632 -38298 -44907 -4999 16446
4792 16446 28550 40 -17464 -17028 -22063 -13494 -5313 -18173 -3540 867 -29439 -31383 -4303
$$ packed form
4883B358L1091p425l1903J3290l219l3237J5712O1663L405n022k7517j4347M103
4870H952l3253Q848K9581l51j7924J6770L0683k4994m8694l7268K5394l929J2768
4857c3417M1940K7481m999j7458J0407j4588o20r820k6314l282K4204K7518k071
4844A8981k1375r50r206j7613L6557J4762k4990j5916N439M156k6208L028K1126
4831a2209j5686L010K4449l117k9363l1232K7379L2448J3245P773n056o275J608
4818F974L053j4603J4833M937r330j7766j4968n081K306L7287K3561J8842r36
4805D9109k8129L982K4685j7960j1524n403j1300n6225O133Q334o609L9908K1445
4792A6446J2104k8510j7504M36n035Q569Q181j2860J4633M407l0306j944K7080
$$ plain form
4779 -4303 -8237 -1326 14694 25712 33005 28423 57016 32426 3857 -14307 -32221 -19739 -41590
4766 -41590 -38203 -34419 -18145 8371 17498 -12129 -17045 -2014 -8103 4191 8407 904 -5158
4753 -5158 8286 14170 10965 -15563 9754 29655 69854 73609 43020 11948 -34644 -35207 -20343
4740 -20343 -21595 -4581 6437 -12463 -10347 -18871 -26094 -6853 -1338 -12137 -27212 -61972 -54014
4727 -54014 -34596 -24535 -13279 -31846 -39187 -33667 -14353 8551 -4631 -12342 -23410 -27881 -14604
4714 -14604 5877 8128 -3776 -23700 -22559 -26363 -6797 -6719 -38618 -50421 -23660 15594 24825
4701 24825 16218 -7587 -5132 7387 -5906 -8175 -10322 -19309 -33536 -5459 19926 29288 14196
4688 14196 -3435 3901 21863 47803 73153 47031 36527 38560 14039 -16779 -3494 -2937 -14024
$$ packed form
4779d303l934O911J6020J1018P293m582K8593k4590k8569j8164j7914J2482k1851
4766d1590L387L784J6274K6516R127k9627m916J5031o089J2294M216p503o062
4753e158J3444N884l205k6528K5317J9901M0199L755l0589l1072m6592n63J4864
4740b0343j252J7014J1018j8900K116q524p223J9241N515j0799j5075l4760P958
4727e4014J9418J0061J1256j8567p341N520J9314K2904j3182p711j1068m471J3277
4714a4604K0481K251j1904j9924J141l804J9566P8l1899j1803K6761L9254R231
4701B4825q607k3805K455J2519j3293k269k147q987j4227K8077K5385R362j5092
4688A4196j7631P336J7962K5940K5350k6122j0504K033k4521l0818J3285N57j1087
$$ plain form
4675 -14024 -16937 -48936 -14376 -11968 -18593 -19151 -19045 -33987 -41471 -34480 -27005 -19610 -7923 -12992
4661 -12992 -28797 -89 35529 47934 27753 5579 -18426 -22664 -35280 -16418 -8815 -9964
4649 -9964 -214 -11925 -48276 -41950 -43969 -38438 -13321 -3079 -3057 25739 42401 19982 -27328
4636 -27328 -18012 -4014 -8111 5299 7497 -2354 -20320 -8579 13009 38195 18287 -19015 -21850
4623 -21850 -3481 4629 -24948 -14289 8671 -5118 -8633 -19615 -25498 -28623 -38691 -10734 -11068
4610 -11068 -441 13861 29862 39051 49489 53115 39201 -5776 -22372 -40691 -16566 13297
4598 13297 25100 -2784 2971 6235 -3529 -14243 -46259 -53502 -40905 -44565 -29607 -9227 4404
4585 4404 1333 -911 1447 9724 -7349 -10397 -20846 -29113 -49213 -43920 -9056 670 8907 24890
$$ packed form
4675a4024k913l1999L4560K408o625n58J06j4942p484O991P475P395J1687n069
4661a2992j5805K8708L5618J2405k0181k2174k4005m238j2616J8862P603j149
4649i964R750j1711l6351O326k019N531K5117J0242K2K8796J6662k2419m7310
4636b7328R316J3998m097J3410K198r851j7966J1741K1588K5186j9908l7302k835
4623b1850J8369Q110k9577J0659K2960j3789l515j0982n883l125j0068K7957l34
4610a1068J0627J4302J6001R189J0438L626j3914m4977j6596j8319K4125K9863
4598A3297J1803k7884N755L264r764j0714l2016p243J2597l660J4958K0380J3631
4585D404l071k244K358Q277j7073l048j0449q267k0100N293L4864R726Q237J5983
$$ plain form
4571 24890 680 -19735 -8754 -17657 -27341 -54954 -60310 -42100 -24220 9412 39063 39671 13013
4558 13013 12650 50006 78779 68574 45201 32609 33855 46739 52242 48928 16984 21885 5140
4545 5140 -15082 -14911 -12808 -4602 3243 16863 17473 -34941 -41186 -12206 868 -15183 -33149 -43760
4531 -43760 -26316 -22638 -12111 864 3847 19937 52369 51564 25619 16243 11196 -701 12785
4518 12785 1856 -15380 30448 63305 49521 48761 37203 30176 19982 57616 50822 13406 19685
4505 19685 11658 21246 17330 2569 -8590 11868 24853 15571 -3425 21019 27008 36079 53034
4492 53034 52165 38023 27986 31239 33132 8620 -22067 -10646 -17418 -9408 -35797 -6843 28259
4479 28259 2388 -15621 -28453 -26152 -16796 -12154 1899 20880 20930 -9364 -2176 13478 -177
$$ packed form
4571B4890k4210k0415J0981q903r684k7613n356J8210J7880L3632K9651O08k6658
4558A3013l63L7356K8773j0205k3373j2592J246J2884N503l314l1944M901j6745
4545E140k0222J71K103Q206P845J3620O10n2414o245K8980J3074j6051j7966j0611
4531d3760J7444L678J0527J2975K983J6090L2432q05k5945r376n047j1897J3486
4518A2785j0929j7236M5828L2857j3784p60j1558p027j0194L7634o794l7416O279
4505A9685q027R588l916j4761j1159K0458J2985r282j8996K4444N989R071J6955
4492E3034q69j4142j0037L253J893k4512l0687J1421o772Q010k6389K8954L5102
4479B8259k5871j8009j2832K301R356M642J4053J8981N0l0294P188J5654j3655
$$ plain form
4466 -177 2668 13837 17950 11792 10398 7054 -36641 -34037 -17743 -13297 -23435 -35317 -12897 -15343
4452 -15343 5580 6658 12804 657 8249 23164 58376 35922 -69 -14496 23285 26468 7488
4439 7488 8093 24106 14378 -49133 -60539 -24046 14788 38797 42633 37691 26867 -8194 -17976
4426 -17976 -14490 -4147 -6697 5750 -1785 -3470 14786 -4090 9029 41149 32839 25199 20441
4413 20441 27206 20306 18603 -987 -26176 -25255 21738 54228 41180 17140 6295 31443 8788
4400 8788 -4283 -16450 -14108 -25867 -1016 -7894 -20138 -25774 -12636 5961 -6352 -19367 -46648
4387 -46648 -43151 -44169 -31101 5550 16001 30700 25706 53178 30338 11171 29347 27433 40946
4374 40946 31969 17577 5020 8113 -2330 13545 16253 9619 -4770 -27755 -37915 -25557 -22237
$$ packed form
4466a77K845J1169M113o158j394l344m3695K604J6294M446j0138j1882K2420k446
4452a5343K0923J078O146j2147P592J4915L5212k2454l5991j4427L7781L183j8980
4439G488O05J6013r728o3511j1406L6493L8834K4009L836m942j0824l5061r782
4426a7976L486J0343k550J2447p535j685J8256j8876J3119L2120q310p640m758
4413B0441O765o900j703j9590k5189R21M6993L2490j3048k4040j0845K5148k2655
4400H788j3071j2167K342j1759K4851o878j2244n636J3138J8597j2313j3015k7281
4387d6648L497j018J3068L6651J0451J4699m994K7472k2840j9167J8176j914J3513
4374D0946q977j4392j2557L093j0443J5875K708o634j4389k2985j0160J2358L320
$$ plain form
4361 -22237 -34627 -31664 -18311 -4066 24912 44816 31501 2357 -13572 -6734 -2098 11609
4349 11609 45161 31730 28830 -30108 -44485 -37132 -45458 -21968 -23496 -63663 -60606 -17319 14710
4336 14710 24788 11310 -14276 -57530 -67531 -63212 -32291 -17486 -4703 -2539 15008 14521 -10140
4323 -10140 7887 2391 1482 9850 19278 19372 7146 -14187 -5655 7309 -19813 -29501 -15933 -17886
4309 -17886 -34902 -44457 -14918 -399 -7594 -6195 -98 -348 11462 -19028 -37364 -48065 -42651
4296 -42651 -34297 -7331 -463 -6846 16110 27761 40628 59022 54252 49092 32436 17409 13108
4283 13108 -6063 -15026 10955 27703 28680 26180 23390 36893 51691 28372 47667 68040 60857
4270 60857 34356 31981 13523 12694 8354 1254 7167 56 -14840 -41285 -50917 -40247 -23369
$$ packed form
4361b2237j2390K963J3353J4245K8978J9904j3315k9144j5929O838M636J3707
4349A1609L3552j3431k900n8938j4377P353q326K3490j528m0167L057M3287L2029
4336A4710J0078j3478k5586m3254j0001M319L0921J4805J2783K164J7547m87k4661
4323a0140J8027n496r09Q368R428R4j2226k1333Q532J2964k7122r688J3568j953
4309a7886j7016r555K9539J4519p195J399O097k50J1810l0490j8336j0701N414
4296d2651Q354K6966O868o383K2956J1651J2867J8394m770n160j6656j5027m301
4283A3108j9171q963K5981J6748R77k500k790J3503J4798k3319J9295K0373p183
4270F0857k6501k375j8458q29m340p100N913p111j4896k6445r632J0670J6878
$$ plain form
4257 -23369 -30913 -40663 -35925 -55029 -48802 -43501 -40199 -39694 -28690 -13740 2074 6981 2964 14421
4243 14421 33304 33694 13193 -3583 18623 59283 26057 -4847 1312 13080 33135 18350
4231 18350 17327 27233 10334 10281 -2426 -37871 -32504 -21189 37523 62909 50139 13193 -12545
4218 -12545 -10452 797 10153 39652 27894 23284 11663 5757 -3289 -4196 -19710 -10988 -15943 -21163
4204 -21163 -3549 5275 -7507 -12233 -16077 -4524 -17365 -40104 -40417 -20777 -35229 -24234 -31269
4191 -31269 -42278 -10684 16785 42363 41414 17298 21512 23925 33835 5027 -9466 -1487 9513
4178 9513 41540 38295 41654 46605 60239 35420 26877 50827 79974 52983 43490 22604 -17905
4165 -17905 -31892 -20093 -13249 -12941 27256 35985 24632 32557 22408 8764 -12137 -11942 851
$$ packed form
4257b3369p544r750M738j9104O227N301L302N05J1004J4950J5814M907m017J1457
4243A4421J8883L90k0501j6776K2206M0660l3226l0904O159J1768K0055j4785
4231A8350j023R906j6899n3j2707l5445N367J1315N8712K5386j2770l6946k5738
4218a2545K093J1249R356K9499j1758m610j1621n906r046r07j5514Q722m955n220
4204b1163J7614Q824j2782m726l844J1553j2841k2739l13J9640j4452J0995p035
4191c1269j1009L1594K7469K5578r49k4116M214K413R910k8808j4493P979J1000
4178I513L2027l245L359M951J3634k4819q543K3950K9147k6991r493k0886m0509
4165a7905j3987J1799O844L08M0197Q729j1353P925j0149j3644k0901J95J2793
$$ plain form
4152 851 -14004 -45344 -19636 -17071 -40639 -23404 -2680 13134 -17873 -29613 -34992 -24486 -15654
4139 -15654 -21502 -10341 8055 7883 32242 64359 61208 23160 -24574 -41361 2174 17931 27149
4126 27149 23813 -12964 -17972 -5351 -11597 -8304 -10377 -35887 -50315 -49090 -45711 -37012 -14291
4113 -14291 19587 6998 -31092 -68597 -54051 -9153 -1523 -4032 -13943 -18196 -24081 -5292 2430
4100 2430 -15057 -32430 -29036 -11105 -9745 14610 8917 12560 -2244 -22613 -7527 20826 21648
4087 21648 -5294 -14039 -9114 12331 37825 31783 -3637 -33765 -32366 -5941 -20062 -9960 19132
4074 19132 38885 27877 11196 12886 -7589 -16216 7332 1136 1556 4743 -9003 -33084 -29145
4061 -29145 -36041 -55729 -44792 -37064 -49122 -32637 -35572 -38607 -34324 -18873 11322 30804 11498
$$ packed form
4152H51j4855l1340K5708K565k3568J7235K0724J5814l1007j1740n379J0506Q832
4139a5654n848J1161J8396j72K4359L2117l151l8048m7734j6787M3535J5757R218
4126B7149l336l6777n008J2621o246L293k073k5510j4428J225L379Q699K2721
4113a4291L3878j2589l8090l7505J4546M4898P630k509r911m253n885J8789P722
4100B430j7487j7373L394J7931J360K4355n693L643j4804k0369J5086K8353Q22
4087B1648k6942q745M925K1445K5494o042l5420l0128J399K6425j4121J0102K9092
4074A9132J9753j1008j6681J690k0475q627K3548o196M20L187j3746k4081L939
4061b9145o896j9688J0937P728j2058J6485k935l035M283J5451L0195J9482j9306
$$ plain form
4048 11498 19185 16150 40113 33626 23328 19396 11998 19989 26059 43474 47428 49301 17250 -3059
4034 -3059 7364 21006 43026 88496 83711 32367 22569 51835 65754 22193 -2892 25390
4022 25390 35826 15781 1945 -2124 11877 -1775 -8426 -25385 -46125 -18976 861 -1461
4010 -1461 -17221 106 27622 13221 -3080 25222 13971 -29418 -43230 -20027 -20344 -30466
3998 -30466 -48891 -58997 -47878 -45078 -44875 -39129 -45987 -20541 -8635 -27187 -15429 5811 5675
3985 5675 1462 13160 5665 -27682 -42907 -13664 5657 -10026 -10142 -30052 -20354 -7394 -2734
3972 -2734 -18443 -42563 -32377 -27904 -19927 -10942 12746 11160 28367 18765 5517 -18685 -15875
3959 -15875 3338 -11134 -41689 -23848 1275 15619 25809 24329 -721 -13912 -22601 -1569
$$ packed form
4048A1498P687l035K3963o487j0298l932p398P991O070J7415L954J873l2051k0309
4034c059J0423J3642K2020M5470m785n1344r798K9266J3919m3561k5085K8282
4022B5390J0436k0045j3836m069J4001j3652o651j6959k0740K7149J9837k322
4010a461j5760J7327K7516j4401j6301K8302j1251m3389j3812K3203l17j0122
3998c0466j8425j0106J1119K800K03N746o858K5446J1906j8552J1758K1240j36
3985E675m213J1698p495l3347j5225K9243J9321j5683j16j9910R698J2960M660
3972b734j5709k4120J0186M473P977Q985K3688j586J7207r602j3248k4202K810
3959a5875J9213j4472l0555J7841K5123J4344J0190j480k5050j3191q689K1032
$$ plain form
3947 -1569 12090 3846 2406 1140 4294 -10734 -18449 -5080 32179 -969 -22485 -11230 -5357
3934 -5357 -15388 -2762 -4861 -316 16505 20658 32493 27668 18379 28513 46738 45038 34533
3921 34533 22107 4864 2397 8358 -11130 -29408 -23986 -44870 -63934 -38961 -11538 24571
3909 24571 48861 29011 9700 -3024 6323 47830 57621 33004 932 503 10650 6349 -15690
3896 -15690 6425 58 22036 16259 5543 23967 347 -13701 -27572 -26427 -12009 7637
3884 7637 20338 17107 940 14304 24423 29103 2458 1714 -11614 -13887 7825 26103 17522
3871 17522 15807 -4477 15625 56984 36774 23718 39716 21744 -38591 -61188 -28708 -15514
3859 -15514 -19945 -23513 -25147 -18810 -10483 -2269 -293 30481 42417 24633 9310 -33705 -36753
$$ packed form
3947a569J3659q244j440j266L154j5028p715J3369L7259l3148k1516J1255N873
3934e357j0031J2626k099M545J6821M153J1835m825r289J0134J8225j700j0505
3921C4533j2426j7243k467N961j9488j8278N422k0884j9064K4973K7423L6109
3909B4571K4290j9850j9311j2724R347M1507R791k4617l2072m29J0147m301k2039
3896a5690K2115o367K1978n777j0716J8424k3620j4048j3871J145J4418J9646
3884G637J2701l231j6167J3364J0119M680k6645p44j3328k273K1712J8278q581
3871A7522j715k0284K0102M1359k0210j3056J5998j7972o0335k2597L2480J3194
3859a5514m431l568j634O337Q327Q214J976L0774J1936j7784j5323m3015l048
$$ plain form
3846 -36753 -31696 -19217 2392 22990 19512 -841 7050 10401 2631 -6850 -7105 5609 17791
3833 17791 26786 15632 4444 -230 -17653 -37390 -47043 -19289 14438 3787 -25666 -7937
3821 -7937 -4691 -7250 -1990 -8956 -5900 21280 33932 4246 10344 18618 21234 26377 24805 6041
3807 6041 -11340 -24549 -42601 -32108 -7500 -20523 -32259 -7022 -1100 881 -7948 8707 1258
3794 1258 -17774 -36672 2555 9730 8638 28818 26417 20652 12839 19495 533 18604 38743
3781 38743 31943 29155 12203 -1519 -13672 -36102 -29818 -22867 -34564 -42135 -82691 -71780 -33725
3768 -33725 -24701 -14186 1292 18132 29386 -4658 -30844 -2660 21686 33556 2892 -22580
3756 -22580 4017 24717 3559 -803 -17289 -12040 -29766 -30727 -36291 -13185 26839 33919 36885
$$ packed form
3846c6753N057J2479K1609K0598l478k0353P891L351p770r481k55J2714J2182
3833A7791Q995j1154j1188m674j7423j9737r653K7754L3727j0651k9453J7729
3821g937L246k559N260o966L056K7180J2652k9686O098Q274K616N143j572j8764
3807F041j7381j3209j8052J0493K4608j3023j1736K5237N922J981q829J6655p449
3794A258j9032j8898L9227P175j092K0180k401n765p813O656j8962J8071K0139
3781C8743o800k788j6952j3722j2153k2430O284O951j1697p571m0556J0911L8055
3768c3725R024J0515J5478J6840J1254l4044k6186K8184K4346J1870l0664k5472
3756b2580K6597K0700k1158m362j6486N249j7726r61n564K3106M0024P080K966
$$ plain form
3743 36885 50194 56846 43151 -7043 -16273 -11589 -11699 -25584 -13054 27914 37482 33668 28861
3730 28861 45177 29634 9361 13592 -6071 -24180 -54656 -70570 -36452 -19375 -23003 -16822
3718 -16822 8528 1613 -12342 -65556 -61317 -16747 25357 20389 10181 19219 25970 38926 44353
3705 44353 50611 63597 59210 17772 515 -7976 25966 40917 28705 6735 -15772 -24477 -24968
3692 -24968 -22075 -25572 -18145 -11060 22378 39360 -8813 -32773 -18436 -20980 -39557 -33435 -13562
3679 -13562 -14351 8578 2377 -14875 -4549 -24181 -59678 -33775 1186 11647 -7319 -7107 -3464
3666 -3464 -16863 -26773 -25458 -36298 -37287 -32437 -41420 -16967 -7012 7019 2809 -18905 -11675 -24238
3652 -24238 -36801 -10198 10449 32328 27239 -13843 -11904 -5443 6834 5210 10561 -2553 -3744
$$ packed form
3743C6885J3309O652j3695n0194r230M684j10j3885J2530M0968R568l814m807
3730B8861J6316j5543k0273M231j9663j8109l0476j5914L4118J7077l628O181
3718a6822K5350o915j3955n3214M239M4570M2104m968j0208R038O751J2956N427
3705D4353O258J2986m387m1438j7257q491L3942J4951j2212k1970k2507q705m91
3692b4968K893l497P427P085L3438J6982m8173k3960J4337k544j8577O122J9873
3679a3562p89K2929o201j7252J0326j9632l5497K5903L4961J0461j8966K12L643
3666c464j3399r910J315j0840r89M850q983K4453R955J4031m210k1714P230j2563
3652b4238j2563K6603K0647K1879n089m1082J939O461J2277j624N351j3114j191
$$ plain form
3639 -3744 -14200 9881 16638 15913 28006 30165 -3807 -10139 -3007 -5037 -23941 -40510 -23267
3626 -23267 3726 14339 29159 28677 11193 5775 -12475 -23964 -6403 -19116 -27857 -10661 8301
3613 8301 8631 6560 38357 42750 40711 15489 -13700 12322 21837 22113 22249 51639 40738 -13992
3599 -13992 -36190 -43997 -39443 -37924 -31560 -56421 -44015 -1666 7798 6676 7188 12664 -7304 -43336
3585 -43336 -32858 -15608 -11606 -10811 1959 32433 22099 10506 19505 36803 35109 9731 -5507
3572 -5507 -23878 5830 32168 16670 -2983 -21174 -44706 -38570 -18262 -12747 -15825 -22489 -16991
3559 -16991 -32692 -37939 -30213 -22290 -41938 -61958 -41772 -14970 4755 38040 38548 22788 22296
3546 22296 4437 2667 6788 -4632 6606 -41777 -52426 -29762 5918 49289 45635 54616 51819
$$ packed form
3639c744j0456K4081O757p25J2093K159l3972o332P132k030j8904j6569J7243
3626b3267K6993J0613J4820m82j7484n418j8250j1489J7561j2713q741J7196J8962
3613H301L30k071L1797M393k039k5222k9189K6022R515K76J36K9390j0901n4730
3599a3992k2198p807M554J519O364k4861J2406M2349R464j122N12N476j9968l6032
3585d3336J0478J7250M002P95J2770L0474j0334j1593Q999J7298j694k5378j5238
3572e507j8371K9708K6338j5498j9653j8191k3532O136K0308N515l078o664N498
3559a6991j5701n247P726P923j9648k0020K0186K6802J9725L3285N08j5760m92
3546B2296j7859j770M121j1420J1238m8383j0649K2664L5680M3371l654Q981k797
$$ plain form
3533 51819 17812 10495 6820 -4602 -19299 -23819 -6687 18110 -2219 -17059 -33497 -55902
3521 -55902 -38398 -1099 12150 25449 14997 40354 30514 560 43012 27812 -14727 7502
3509 7502 10372 -27954 -25394 -8655 -540 2338 7911 24175 10091 3103 -9376 9631 12804
3496 12804 19078 14837 -2216 -9122 6077 -2141 -23339 -29468 -27950 -17243 -12777 -15257 -28514
3483 -28514 -58151 -53084 -17920 10242 40441 13334 763 -11833 -11323 -21871 -20623 -22553 6510
3470 6510 8269 3378 -3239 -5332 -44061 -60906 -38880 7252 32023 30436 7295 -31162 -46939
3457 -46939 -39659 -12228 497 23366 38282 17808 -11449 -7488 -890 -14499 -18342 -21999 -6402
3444 -6402 24949 36448 18988 -6110 -2204 14146 1450 -12118 -32042 -17477 -3291 8381
$$ packed form
3533E1819l4007p317l675j1422j4697m520J7132K4797k0329j4840j6438k2405
3521e5902J7504L7299J3249J3299j0452K5357r840k9954M2452j5200m2539K2229
3509G502K870l8326K560J6739Q115K878N573J6264j4084o988j2479J9007L173
3496A2804O274m241j7053o906J5199q218k1198o129J518J0707M466k480j3257
3483b8514k9637N067L5164K8162L0199k7107j2571j2596N10j0548J248j930K9063
3470F510J759m891o617k093l8729j6845K2026M6132K4771j587k3141l8457j5777
3457d6939P280K7431J2725K2869J4916k0474k9257L961O598j3609l843l657J5597
3444f402L1351J1499j7460k5098L906J6350j2696j3568j9924J4565J4186J1672
$$ plain form
3432 8381 14993 2828 -5987 -31000 -37758 -23348 -13222 4000 -7038 -1382 -15843 -13073 10329
3419 10329 34845 25174 -7934 -29451 -23070 5601 -756 133 24915 15206 12021 4092 345 -3541
3405 -3541 -7166 -1957 6222 24275 34361 18549 -24831 -26896 -23946 -10598 28035 47684 38647
3392 38647 55075 31564 -4746 -21022 -10522 45547 62128 23817 -8501 -10192 -14093 -11074
3380 -11074 -4902 -12186 -21259 -17405 -9076 -907 -25859 -26730 -251 -18483 -20575 -30731 -33003 -25989
3366 -25989 -17813 -2425 10052 35082 29645 -4776 -13413 -2152 15587 29022 43970 9732
3354 9732 -19152 -11590 832 22132 46462 37914 29792 29008 22091 -44309 -61566 -47861 -35870
3341 -35870 1259 46711 35218 39354 49115 20454 -8424 -21515 -22573 3699 24521 47023
$$ packed form
3432H381O612j2165q815k5013o758J4410J0126J7222j1038N656j4461K770K3402
3419A0329K4516r671l3108k1517O381K8671o357Q89K4782r709l185p929l747l886
3405c541l625N209Q179J8053J0086j5812m3380k065K950J3348L8633J9649r037
3392C8647J6428k3511l6310j6276J0500N6069J6581l8311l2318j691l901L019
3380a1074O172p284r073L854Q329Q169k4952q71K6479j8232k092j0156k272P014
3366b5989Q176J5388J2477K5030n437l4421q637J1261J7739J3435J4948l4238
3354I732k8884P562J2422K1300K4330q548q122p84o917o6400j7257J3705J1991
3341c5870L7129M5452j1493M136R761k8661k8878j3091j058K6272K0822K2502
$$ plain form
3329 47023 59006 46988 46378 4286 5985 26460 23129 30989 32275 4163 -37307 -43272 -21265
3316 -21265 -17632 13952 29954 18655 -2983 17653 -5129 -21509 -26768 4155 -9929 -7901
3304 -7901 22453 49639 102193 80654 41363 36694 30924 45519 6883 10238 6519 -938 8648
3291 8648 24172 8789 15396 5171 11198 -11621 -18766 15457 24972 -9329 -30814 -46014 -58830
3278 -58830 -45560 -7182 5705 -9896 2940 -9240 -23313 -15920 -33823 -29077 3480 1273
3266 1273 -21092 -26884 -18362 -11075 -21705 -15921 -3700 9668 19309 24396 7561 8480 -22475 -54936
3252 -54936 -64752 -40398 -17043 -34836 -45396 6148 39285 9958 -22508 -8340 -7045 -10983
3240 -10983 -39382 -31003 -16490 -9000 -8485 7557 3897 -35305 -60891 -74248 -79984 -45313 -49941
$$ packed form
3329D7023J1983j2018o10m2092J699K0475l331P860J286k8112m1470n965K2007
3316b1265L633L1584J6002j1299k1638K0636k2782j6380n259L0923j4084K028
3304g901L0354K7186N2554k1539l9291m669n770J4595l8636L355l719p457R586
3291H648J5524j5383O607j0225O027k2819p145L4223R515l4301k1485j5200j2816
3278e8830J3270L8378J2887j5601J2836j2180j4073P393j7903M746L2557k207
3266A273k2365n792Q522P287j0630N784J2221J3368R641N087j6835R19l0955l2461
3252e4936r816K4354K3355j7793j0560N1544L3137k9327l2466J4168J295l938
3240a0983k8399Q379J4513P490N15J6042l660l9202k5586j3357n736L4671m628
$$ plain form
3227 -49941 -20924 11128 19473 6071 346 5472 32937 22173 25499 7588 -25933 -22505 -13720
3214 -13720 9111 11731 -18539 -34781 -42283 -64133 -46979 -19763 -10197 -15621 -17600 -7144 -16070
3201 -16070 4211 -18595 -37030 -25286 -21976 2121 -2475 -22960 -32545 -11305 -1347 -5632 -19278
3188 -19278 -14810 -2661 700 345 -462 10505 5243 -6622 -7267 -3891 -4517 -9131 16508 4997
3174 4997 -5930 17547 22181 13362 -9922 -10255 9907 -5283 -34939 -41368 -56247 -66666 -44516
3161 -44516 -37053 -40301 -62754 -55039 -52692 -44898 8753 25610 5600 2277 789 -14518 -1482
3148 -1482 -20926 -46659 -34398 -7963 15263 19934 5375 -18536 -33606 -32682 -39247 -39334 -836
3135 -836 -25932 2842 40509 35745 39020 59 -40741 -28754 -191 23192 1228 -5237 -17058
$$ packed form
3227d9941K9017L2052Q345j3402n725N126K7465j0764L326j7911l3521L428Q785
3214a3720K2831K620l0270j6242p502k1850J7154K7216R566n424j979J0456q926
3201a6070K0281k2806j8435J1744L310K4097m596k0485r585K1240R958m285j3646
3188a9278M468J2149L361l55q07J0967n262j1865o45L376o26m614K5639j1511
3174D997j0927K3477M634q819k3284l33K0162j5190k9656o429j4879j0419K2150
3161d4516P463l248k2453P715K347P794N3651J6857k0010l323j488j5307J3036
3148a482j9444k5733J2261K6435K3226M671j4559k3911j5070R24o565q7L8498
3135h36k5096K8774L7667m764L275l8961m0800J1987K8563K3383k1964o465j1821
$$ plain form
3122 -17058 -39298 -37566 -36575 -41894 -47154 -34658 -16806 -21466 -24624 -6570 24424 10588 -4842
3109 -4842 9536 11577 12718 6574 -13048 -1754 580 -3563 4465 4461 69 24152 10192 25823
3095 25823 27006 19063 6106 -2501 7185 17537 25338 23987 -22750 -26783 -14922 -10522 4942
3082 4942 -4344 -16030 -2340 -12204 -22862 -45366 -45995 -50231 -41884 -9629 11891 25360 16458
3069 16458 10447 12282 30506 12409 2772 -15144 -30509 -25866 -24762 -22920 3031 24006 2958
3056 2958 -17662 -14755 -25914 -18248 -28580 -50904 -41690 -17039 -35408 -43848 -15863 -5358 5583
3043 5583 35500 51552 57933 69814 64383 33228 1716 16565 -25475 -33623 38 12919 26054
3030 26054 3990 -42526 -40182 -41286 -13552 11657 20280 23353 10163 -27386 -42859 -15126 -3751
$$ packed form
3122a7058k2240J732R91n319n260J2496J7852m660l158J8054L0994j3836j5430
3109d842J4378K041J141o144j9622J1294K334m143Q028mm392K4083j3960J5631
3095B5823J183p943j2957q607R686J0352P801j351m6737m033J1861M400J5464
3082D942r286j1686J3690r864j0658k2504o29m236Q347L2255K1520J3469q902
3069A6458o011J835J8224j8097r637j7916j5365M643J104J842K5951K0975k1048
3056B958k0620K907j1159P666j0332k2324R214K4651j8369q440K7985J0505J0941
3043E583K9917J6052O381J1881n431l1155l1512J4849m2040q148L3661J2881J3135
3030B6054k2064m6516K344j104K7734K5209Q623L073j3190l7549j5473K7733J1375
$$ plain form
3017 -3751 7569 5204 152 -7267 -11068 -21023 -48473 -60290 -66764 -32376 -30489 18269 14414 -19526
3003 -19526 -9396 16451 25794 -23373 -42207 -25649 -912 15144 18928 -11264 5162 31366
2991 31366 29930 44520 48818 29466 -25693 -44886 -32462 -42152 -27467 -23316 -16145 -39478 -32727
2978 -32727 -7803 9756 29807 34903 25435 17536 12257 1659 -2610 19300 -17955 -22570 26739
2965 26739 36495 33769 27856 2998 604 -7035 1661 6451 -15110 -3563 -10304 -17049 10061 33143
2951 33143 54545 67712 48573 36013 65308 70862 71257 59823 54347 33967 17465 9325 18725
2938 18725 -22513 -35388 -8093 -6830 -29933 -17933 27653 43956 3558 -40544 -35607 1950
2926 1950 910 -28819 -44825 -22089 -29883 -49143 -86868 -67244 -24905 14730 38501 51861
$$ packed form
3017c751J1320k365n052p419l801r955k7450j1817o474L4388J887M8758l855l3940
3003a9526J0130K5847R343m9167j8834J6558K4737J6056L784l0192J6426K6204
2991C1366j436J4590M298j9352n5159j9193J2424r690J4685M151P171k3333O751
2978c2727K4924J7559K0051N096r468p899n279j0598m269K1910l7255m615M9309
2965B6739R756k726n913k4858k394p639Q696M790k1561J1547o741o745K7110K3082
2951C3143K1402J3167j9139j2560K9295N554L95j1434n476k0380j6502q140R400
2938A8725m1238j2875K7295J263k3103J2000M5586J6303m0398m4102M937L7557
2926A950j040k9729j6006K2736p794j9260l7725J9624M2339L9635K3771J3360
$$ plain form
2914 51861 55053 43881 22090 31334 45400 16250 1286 -2245 -220 -11419 -35406 -36159 6015
2901 6015 31688 33989 20592 23875 14951 -9127 -3747 -10355 -3290 -7956 -31778 -2801 7452
2888 7452 -11843 -13344 5645 13521 -8893 -15275 -5396 -8084 -27661 -21705 -18456 9817 27013
2875 27013 50917 65818 48103 14672 -4879 -36518 -38683 -18760 -5863 -9884 -9645 -9493 -14356
2862 -14356 -1667 3273 5948 -10837 -49514 -43358 6670 13013 17815 46667 25115 10149 3428
2849 3428 4116 -1340 23155 49045 43039 39934 26414 -21669 -22478 7451 2197 -31625 -34402 -22088
2835 -22088 -4128 22663 27672 -26858 -61221 -55195 -45015 -2578 333 -14383 -30127 -21801 -6066
2822 -6066 40271 42973 41766 59487 35465 11138 -1665 -13991 -20758 -23531 -31004 -29106 -32450
$$ packed form
2914E1861L192j1172k1791R244J4066k9150j4964l531K025j1199k3987p53M2174
2901F015K5673K301j3397L283q924k4078N380o608P065m666k3822K8977J0253
2888G452j9295j501J8989P876k2414o382R879k688j9577N956L249K8273J7196
2875B7013K3904J4901j7715l3431j9551l1639k165J9923J2897m021K39J52m863
2862a4356J2689M940K675j6785l8677O156N0028O343M802K8852k1552j4966o721
2849C428O88n456K4495K5890o006l105j3520m8083q09K9929n254l3822k777J2314
2835b2088J7960K6791N009n4530l4363O026J0180M2437K911j4716j5744Q326J5735
2822f066M6337K702j207J7721k4022k4327j2803j2326o767k773p473J898l344
$$ plain form
2809 -32450 -39779 -38362 -29742 -41325 -26407 7536 16359 13770 9806 14786 -5769 7725 26186
2796 26186 24413 11491 40311 63215 40399 8310 4779 9203 -22453 -16878 -28881 -53213 -45036
2783 -45036 -8131 -19973 4298 40152 22723 -6596 4594 1614 -23429 -24900 -22610 21034
2771 21034 18069 -25564 -25380 -7965 -6706 -1080 -14643 8464 41742 43086 35619 16288 6279
2758 6279 26718 43367 28189 822 -3443 11419 14741 6593 22878 12779 10336 22778 24839
2745 24839 35757 23259 40925 56062 54442 51301 52072 38911 24463 19028 873 23746 53764
2732 53764 40556 -12616 -42398 -33620 -11170 -21287 -6894 -9136 -8041 -22204 -3101 8983
2720 8983 14357 2115 -15793 -15378 -8129 -1214 -17035 -1609 15356 8828 -7648 -25764 -15672
$$ packed form
2809c2450p329J417Q620j1583J4918L3943Q823k589l964M980k0555J3494J8461
2796B6186j773j2922K8820K2904k2816l2089l531M424l1656N575j2003k4332Q177
2783d5036L6905j1842K4271L5854j7429k9319J1190k980k5043j471K290M3644
2771B1034k965m3633J84J7415J259N626j3563K3107L3278J344p467j9331j0009
2758F279K0439J6649j5178k7367m265J4862L322q148J6285j0099k443J2442K061
2745B4839J0918j2498J7666J5137j620l141P71j3161j4448n435j8155K2873L0018
2732E3764j3208n3172k9782Q778K2450j0117J4393k242J095j4163J9103J2084
2720H983N374j2242j7908M15P249O915j5821J5426J6965o528j6476j8116J0092
$$ plain form
2707 -15672 5505 -3821 16305 32732 27332 24136 46597 25935 18998 10789 -40457 -37340 -27133
2694 -27133 -36176 -51764 -66803 -55147 -49431 -26333 -26210 -37159 -44155 -38198 -28622 -17891 -15156
2681 -15156 -15413 11604 23818 45392 44139 29456 34427 -2167 -13685 -26313 -8243 31281 21938
2668 21938 -18924 1327 11430 20353 8925 21595 17470 -3243 -7475 -16828 -15124 387 39825
2655 39825 58340 39912 22805 13504 15568 -495 -255 14167 7689 -15481 -39110 -41075 -20748
$$ packed form
2707a5672K1177r326K0126J6427n400l196K2461k0662o937q209n1246L117J0207
2694b7133r043j5588j5039J1656N716K3098J23j0949o996N957R576J0731K735
2681a5156k57K7017J2214K1574j253j4683M971l6594j1518j2628J8070L9524r343
2668B1938m0862K0251J0103Q923j1428J2670m125k0713m232r353J704J5511L9438
2655C9825J8515j8428j7107r301K064j6063K40J4422o478k3170k3629j965K0327
$$ [...]
##END NTUPLES=NMR SPECTRUM
##END=
