##TITLE=Analysis number 319767
Compound Code cc 55751
Book Reference 467/38
Project Code adrs
Chemist Name benw
##JCAMPDX= 6.0         $$ Bruker NMR JCAMP-DX V2.0
##DATA TYPE= NMR SPECTRUM
##DATA CLASS= NTUPLES
##ORIGIN= Bruker BioSpin GmbH
##OWNER= nmr
$$ XWIN-NMR		Version 3.5
$$ Fri May 26 10:46:24 2006 GMT Daylight Time (UT+1h)  MAYBRIDGE\nmr@NMR_250MHZ
##.OBSERVE FREQUENCY= 250.131544655141
##.OBSERVE NUCLEUS= ^1H
##.ACQUISITION MODE= SIMULTANEOUS (DQD)
##.ACQUISITION SCHEME= undefined
##.AVERAGES= 16
##.DIGITISER RES= 18
##SPECTROMETER/DATA SYSTEM= dpx250
##.PULSE SEQUENCE= zg30
##.SOLVENT NAME= DMSO
##.SHIFT REFERENCE= (INTERNAL, DMSO, 0, 16.579)
##AUDIT TRAIL= $$ (NUMBER, WHEN, WHO, WHERE, WHAT)
$$ ##TITLE= Audit trail, XWIN-NMR		Version 3.5
$$ ##JCAMPDX= 5.01
$$ ##ORIGIN= Bruker BioSpin GmbH
$$ ##OWNER= nmr
$$ C:\u/data/dgb/nmr/ADRS/5240/pdata/1/auditp.txt
$$ ##AUDIT TRAIL=  $$ (NUMBER, WHEN, WHO, WHERE, WHAT)
(   1,<2006-05-26 10:45:23.08 +100>,<MAYBRIDGE\nmr>,<NMR_250MHZ>,
      <created by zg, POWCHK disabled, PULCHK disabled
       configuration hash MD5:
       84 BC 41 DB A1 6E 1D 46 DA 25 12 A5 C1 ED C5 3A
       data hash MD5: 64K
       1D A8 14 92 19 FE 81 65 DB E3 15 40 CC F2 FA C3>)
(   2,<2006-05-26 10:45:58.28 +100>,<MAYBRIDGE\nmr>,<NMR_250MHZ>,
      <Start of raw data processing
       ef LB = 0.3 FT_mod = 6 PKNL = 1 SI = 32K 
       data hash MD5: 32K
       AF EB D1 6C D6 F5 53 93 4E 4E 47 9D 4C E0 B9 AE>)
(   3,<2006-05-26 10:46:02.59 +100>,<MAYBRIDGE\nmr>,<NMR_250MHZ>,
      <apk 
       data hash MD5: 32K
       34 9D 34 F6 19 DC 25 AA 05 B2 BF AB 2D C7 28 33>)
(   4,<2006-05-26 10:46:04.58 +100>,<MAYBRIDGE\nmr>,<NMR_250MHZ>,
      <abs ABSG = 5 
       data hash MD5: 32K
       9D 6C 57 B1 B5 AF 42 11 C7 F1 A4 52 9C BF E3 03>)
$$ ##END=
$$ 
$$ hash MD5
$$ 77 23 45 3A 5B B5 1D 04 69 38 0A 98 43 3C 17 35
##$RELAX= 
##$RELAX= 
##$RELAX= 
##$RELAX= 
##$RELAX= 
##$RELAX= 
##$RELAX= 
$$ Bruker specific parameters
$$ --------------------------
##$DU= <C:\u>
##$EXPNO= 5240
##$NAME= <ADRS>
##$PROCNO= 1
##$TYPE= <nmr>
##$USER= <dgb>
##$AMP= (0..31)
100 100 100 100 100 100 100 100 100 100 100 100 100 100 100 100 100 100 
100 100 100 100 100 100 100 100 100 100 100 100 100 100 
##$AQSEQ= 0
##$AQ_mod= 3
##$AUNM= <au_zg>
##$AUTOPOS= <12 >
##$BF1= 250.13
##$BF2= 250.13
##$BF3= 250.13
##$BF4= 250.13
##$BF5= 500.13
##$BF6= 500.13
##$BF7= 500.13
##$BF8= 500.13
##$BYTORDA= 1
##$CFDGTYP= 0
##$CFRGTYP= 5
##$CHEMSTR= <none>
##$CNST= (0..31)
1 1 145 1 1 1 1 1 1 1 1 1 1 1 1 1 1 1 1 1 1 1 1 1 1 1 1 1 1 1 1 1 
##$CPDPRG= <>
##$CPDPRG1= <>
##$CPDPRG2= <>
##$CPDPRG3= <>
##$CPDPRG4= <mlev>
##$CPDPRG5= <mlev>
##$CPDPRG6= <mlev>
##$CPDPRG7= <mlev>
##$CPDPRG8= <mlev>
##$CPDPRGB= <>
##$CPDPRGT= <>
##$D= (0..31)
0 1 0 0 0 0 0 0 0 0.06 0 0 0 0 0 0 0.0002 0 0 0 0 0 0 0 0 0 0 0 0 0 0 
0 
##$DATE= 1148636721
##$DBL= (0..7)
120 120 120 120 120 120 120 120 
##$DBP= (0..7)
150 150 150 150 150 150 150 150 
##$DBP07= 0
##$DBPNAM0= <>
##$DBPNAM1= <>
$$ [...]
##$SUBNAM7= <"">
##$SUBNAM8= <"">
##$SUBNAM9= <"">
##$SW= 20.6930455092707
##$SWIBOX= (0..15)
0 0 3 0 0 0 0 0 0 0 0 0 0 0 0 0 
##$SW_h= 5175.983436853
##$TD= 65536
##$TD0= 1
##$TE= 294.16
##$TE2= 300
##$TE3= 300
##$TEG= 300
##$TL= (0..7)
0 120 120 120 120 120 120 120 
##$TP= (0..7)
150 150 150 150 150 150 150 150 
##$TP07= 0
##$TPNAME0= <>
##$TPNAME1= <>
##$TPNAME2= <>
##$TPNAME3= <>
##$TPNAME4= <>
##$TPNAME5= <>
##$TPNAME6= <>
##$TPNAME7= <>
##$TPOAL= (0..7)
0.5 0.5 0.5 0.5 0.5 0.5 0.5 0.5 
##$TPOFFS= (0..7)
0 0 0 0 0 0 0 0 
##$TUNHIN= 0
##$TUNHOUT= 0
##$TUNXOUT= 0
##$USERA1= <user>
##$USERA2= <user>
##$USERA3= <user>
##$USERA4= <user>
##$USERA5= <user>
##$V9= 5
##$VALIST= <valist>
##$VCLIST= <CCCCCCCCCCCCCCC>
##$VD= 0
##$VDLIST= <DDDDDDDDDDDDDDD>
##$VPLIST= <PPPPPPPPPPPPPPP>
##$VTLIST= <TTTTTTTTTTTTTTT>
##$WBST= 1024
##$WBSW= 4
##$XGAIN= (0..3)
0 0 0 0 
##$XL= 0
##$YL= 0
##$YMAX_a= 314336
##$YMIN_a= -514157
##$ZGOPTNS= <>
##$ZL1= 120
##$ZL2= 120
##$ZL3= 120
##$ZL4= 120
##$ABSF1= 16.57898
##$ABSF2= -4.114195
##$ABSG= 5
##$ABSL= 3
##$ALPHA= 0
##$AQORDER= 0
##$ASSFAC= 0
##$ASSFACI= 0
##$ASSFACX= 0
##$ASSWID= 0
##$AUNMP= <proc_1d>
##$AZFE= 0.1
##$AZFW= 0.1
##$BCFW= 0
##$BC_mod= 0
##$BYTORDP= 0
##$COROFFS= 0
##$CY= 12.5
##$DATMOD= 1
##$DC= 0
##$DFILT= <>
##$DTYPP= 0
##$F1P= 14.0000005364418
##$F2P= -0.99999901652339
##$FCOR= 0.5
##$FTSIZE= 32768
##$FT_mod= 6
##$GAMMA= 0
##$GB= 0
##$INTBC= 1
##$INTSCL= 1
##$ISEN= 128
##$LB= 0.3
##$LEV0= 0
##$LPBIN= 0
##$MAXI= 10000
##$MC2= 0
##$MEAN= 0
##$ME_mod= 0
##$MI= 0
##$NCOEF= 0
##$NC_proc= -6
##$NLEV= 6
##$NOISF1= 0
##$NOISF2= 0
##$NSP= 0
##$NTH_PI= 0
##$NZP= 0
##$OFFSET= 16.57898
##$PC= 1
##$PHC0= 157.1601
##$PHC1= 12.13861
##$PH_mod= 1
##$PKNL= yes
##$PPARMOD= 0
##$PSCAL= 4
##$PSIGN= 0
##$REVERSE= no
##$SF= 250.129985746756
##$SI= 32768
##$SIGF1= 0
##$SIGF2= 0
##$SINO= 400
##$SIOLD= 32768
##$SREGLST= <1H.DMSO>
##$SSB= 0
##$STSI= 32768
##$STSR= 0
##$SW_p= 5175.98343685301
##$SYMM= 0
##$S_DEV= 0
##$TDeff= 65536
##$TDoff= 0
##$TI= <Analysis number 999999
Compound Code 99
Book Reference 9
Project Code 9>
##$TILT= no
##$TM1= 0
##$TM2= 0
##$TOPLEV= 0
##$USERP1= <user>
##$USERP2= <user>
##$USERP3= <user>
##$USERP4= <user>
##$USERP5= <user>
##$WDW= 1
##$XDIM= 32768
##$YMAX_p= 526124823
##$YMIN_p= -1016709
$$ End of Bruker specific parameters
$$ ---------------------------------
##NTUPLES= NMR SPECTRUM
##VAR_NAME=  FREQUENCY,     SPECTRUM/REAL,   SPECTRUM/IMAG
##SYMBOL=    X,             R,               I
##VAR_TYPE=  INDEPENDENT,   DEPENDENT,       DEPENDENT
##VAR_FORM=  AFFN,          ASDF,            ASDF
##VAR_DIM=   32768,         32768,           32768
##UNITS=     HZ,            ARBITRARY UNITS, ARBITRARY UNITS
##FACTOR=    0.157963299565203, 1,           1
##FIRST=     4146.89990407662, 0,            0
##LAST=      -1029.08353277639, 0,           0
##MIN=       -1029.08353277639, -1016709,    0
##MAX=       4146.89990407662, 526124823,    0
$$ Real data points
##PAGE= N=1
##DATA TABLE= (X++(R..R)), XYDATA
$$ [...]
22029 -385860 -379055 -325295 -524596 -565439 -417576 -259637 -387123 -417088 -488336 -430067 -432934
22018 -432934 -444654 -351631 -155742 28256 -131342 -316781 -381769 -365311 -393317 -346958 -342286
22007 -342286 -374137 -551372 -703807 -492919 -410551 -649027 -747577 -548227 -413729 -602055
21997 -602055 -735676 -649053 -477168 -279819 -276233 -430114 -409654 -331485 -35884 142965
21987 142965 -45102 -220389 -229087 -189469 -152513 -175730 -56281 -11615 -253496 -233834 -237911
21976 -237911 -285660 -294839 -393519 -405725 -442968 -219502 43357 -4359 -258450 -581421 -634810
21965 -634810 -345943 -113989 -155838 -267178 -363706 -425408 -519957 -425844 -381225 -344190 -211796
21954 -211796 -83050 -60834 -52517 52504 4590 -74757 36610 20451 -73366 -107007 -102495
21943 -102495 -113343 -178172 -84940 197644 104836 -190592 -285703 -251245 -240498 -255065 -266207
21932 -266207 -166708 -131312 -96313 -106432 -124367 -181372 -233152 -63927 32876 9373 -146557
21921 -146557 -206209 -261365 -260430 -267246 -274770 -223523 -124766 84793 133679 -87517 -196616 -325593
21909 -325593 -283229 -287119 -206511 -263644 -226093 -148683 -139273 -276827 -483678 -552130 -461137
21898 -461137 -369377 -356366 -218978 -55389 32351 -101039 -435066 -534634 -284229 -388746
21888 -388746 -616795 -349416 -167390 -268216 -299478 -359944 -505489 -582562 -689878 -617390
21878 -617390 -408191 -351946 -224815 -112611 -49658 -240659 -382790 -391253 -362662 -241759
21868 -241759 -116798 -110663 -87362 33279 185923 58920 -143854 -9094 73960 -9105
21858 -9105 -90162 -175319 -278848 -270192 -280777 -203188 -301095 -337759 -387433 -435285 -482722 -431453
21846 -431453 -202450 -54716 20566 5512 -104223 -204132 -21651 -104581 -108685 -258465 -516731
21835 -516731 -577229 -501770 -246795 -184780 -122078 -29114 24102 -237302 -519869 -663191 -556809
21824 -556809 -603814 -578718 -353013 -202014 -197742 -192975 -389664 -434701 -344062 -494166 -434819
21813 -434819 -289649 -163565 -355073 -451244 -494110 -361216 -327296 -436077 -316173 -274621
21803 -274621 -326237 -324375 -245856 -406839 -583412 -558214 -558496 -550224 -351953 -468692 -464482 -410154
21791 -410154 -193706 -395584 -197155 6153 17405 60180 89228 11942 -246625 -278405
21781 -278405 -231653 -346599 -411779 -211129 -121182 -122321 -146425 -42299 53912 169941 83468
21770 83468 108737 124959 -55632 -305855 -293336 -239906 -306621 -249435 -412002 -528179 -534564
21759 -534564 -169570 115155 -55523 -211168 -189866 -230662 -438440 -465902 -445059 -352678
21749 -352678 -316156 -392914 -560032 -559966 -458941 -550600 -744469 -625966 -316446 -214678 -257040
21738 -257040 -209079 -86793 -168352 -29774 -96523 -414293 -354588 -227700 -37298 -70201
21728 -70201 -98567 -50140 8976 -20655 -150108 -188824 -24635 -42542 -95901 -132078 111820
21717 111820 231212 77170 -88325 -139851 -270481 -265754 -212983 -211287 -221024 -6795 143039
21706 143039 175033 30719 -33016 -118810 -172915 -77718 -145794 -128970 9960 98637 191502
21695 191502 152945 116012 28875 -31373 -50287 -22657 -73764 -147394 -276874 -271642 -430475
21684 -430475 -288005 -191180 -146189 -213171 -250723 -19121 195613 406081 341612 276969 91865
21673 91865 102113 -83423 -260559 -121727 -93739 -22727 -129680 -179137 -247141 -175074 -125299
21662 -125299 -216991 -150877 -47415 49562 227468 241179 118243 103808 83863 -6028 -52283
21651 -52283 -91371 24116 -21349 -37400 -244306 -305757 -91322 82387 62162 147578 134025
21640 134025 157435 21126 139225 269154 144608 178723 349111 455972 227184 23416
21630 23416 60885 52959 35860 -77223 -122917 -94284 -14252 -72338 -15124 -126326 -135758 91962
21618 91962 143059 65844 113638 19417 23612 121201 306982 237635 -40971 88671 215695
21607 215695 165183 130236 52025 -27750 -133135 -217340 -234278 -3238 -94818 -132135 -240670
21596 -240670 -249014 -272420 -323212 -143952 60563 -49047 -72187 -83539 -246381 -307681 -283684
21585 -283684 -197347 -165769 -185853 -148152 -20732 55204 223056 155028 -12532 55768 70490
21574 70490 -20467 -252873 -129974 -47770 40852 153505 350532 328395 216818 60878
21564 60878 11037 47631 -67648 -38951 110706 241563 346632 224497 91096 125639
21554 125639 98390 307087 215844 43723 -11521 32531 106570 -18365 -40284 -65053 -130839
21543 -130839 -311020 -105603 64625 -135324 -101145 7378 -40623 79713 236907 189262
21533 189262 32242 -9439 -53699 11269 144563 154540 -12966 -6219 193720 290598 203414
21522 203414 213705 136750 108940 128291 282731 336117 309093 329270 418264 147805 151416
21511 151416 128688 151163 207579 102255 113746 42671 16248 -103266 -70989 18289 229493
21500 229493 209128 211436 301044 350121 224982 -8282 9269 104786 68300 127191 126981 292169
21488 292169 185952 -13907 5387 23279 160523 76200 201250 323622 142897 -28996
21478 -28996 -88763 40411 219259 171018 155983 107993 47934 248920 168950 106934 171946
21467 171946 323373 509022 656461 476323 476073 572925 481441 363713 241110 316404 418819
21456 418819 477837 575581 480721 266683 345473 456403 462117 401989 376959 213790 224803
21445 224803 152849 114690 -33611 18775 60462 130250 145854 521353 548208 471323 527648
21434 527648 574114 606579 454092 677922 752637 630432 435784 511136 639994 539817
21424 539817 448251 508331 621075 600195 712132 566434 473908 384120 283951 332505 317480
21413 317480 107619 -9177 -26178 191882 532679 581412 307127 61907 -2752 21513
21403 21513 15456 121745 96245 33037 -17198 208031 430051 219119 56060 207288 289183
21392 289183 218535 136944 365838 387257 318428 259373 215192 122607 104562 280430 350293
21381 350293 493953 449183 390317 344470 339968 234397 75437 107789 163887 200756 220418
21370 220418 303679 282422 209930 236327 263555 215684 99951 122658 174846 95564 230718
21359 230718 294605 262490 282238 277561 180893 225222 415922 413851 382292 195984 83972
21348 83972 -3379 10672 222142 281288 307106 348285 384908 302438 296924 374714 315350 119811
21336 119811 30431 202057 299830 301914 398922 293466 330639 304533 370384 295135 331731
21325 331731 297388 260237 411427 395959 374473 598630 423934 337152 540100 457640 298849
21314 298849 285447 344531 321901 304378 262616 392790 320596 321377 300742 393135 561758
21303 561758 413846 221242 444230 433274 329176 288452 248238 189136 184640 128646 269396
21292 269396 280337 198722 270568 358060 244280 443818 278481 122882 104271 158988 366834
21281 366834 483205 608507 452330 156723 214061 310556 200027 135469 167518 50076
21271 50076 12980 307517 612294 576754 518105 199299 135398 363431 544113 486000 363266
21260 363266 260254 123406 114504 177061 111197 25808 -51553 76249 47265 49616 349930
21249 349930 516270 291947 210550 365553 590488 488101 111895 -103102 -27671 -90092
21239 -90092 17215 26890 88949 227062 480648 507256 554189 335595 166852 171195 174597
21228 174597 294244 268498 211866 205468 250864 242285 121751 50293 166001 427663 493630
21217 493630 408829 596344 468877 332425 281804 126822 -29053 60491 312192 416449
21207 416449 432032 308768 177887 174379 168047 236892 382830 364988 323072 199474 162733
21196 162733 280484 330520 127126 52374 30220 63411 283833 525424 544761 586034 625572
21185 625572 487613 387142 445848 396627 269828 109306 -226734 -328185 -8428 57852
21175 57852 150449 215078 222224 159553 193024 348292 386839 492925 454865 463796 372996 287241
21163 287241 196750 183601 70901 -17609 163221 195592 222848 325222 262913 366529 455076
21152 455076 430005 519956 481378 415643 121097 99402 130087 144422 160164 151648 347048
21141 347048 267646 180975 225178 -15618 -100684 -73053 -248740 -419994 -152486 -149202 -376709
21130 -376709 -459882 -399682 -379720 -370463 -147108 69749 184861 150545 334828 447530 546013
21119 546013 247940 240349 331315 276013 220754 145670 171692 194899 131728 58934 -153963
21108 -153963 -177531 -202689 -181273 -184057 -218022 -252093 -151698 -34189 -136036 -94804 -75338
21097 -75338 -47297 45934 131164 265365 347142 256753 216761 210211 263478 209738 -25019
21086 -25019 -157191 -62676 -108106 -205277 -212096 -153761 -115147 -182032 -126092 49361 156718
21075 156718 276190 164101 82926 -135007 -101956 63886 33739 -42316 -81960 -114117 -132087
21064 -132087 -46256 -124723 -102207 -74784 -225080 -211374 -267597 -263613 -398254 -259698 -39446
21053 -39446 32736 86452 -144606 30384 227989 307298 123483 -177371 -390662 -264559
21043 -264559 -323643 -457921 -442443 -216075 41032 19088 -136191 -160161 -326372 -514712
21033 -514712 -397773 -305498 -389219 -339965 -245850 -127098 51459 14147 -42245 -1653 56762
21022 56762 -173535 -299796 -271206 -378609 -311150 -276139 -223353 -188090 4867 137398 37646
21011 37646 64579 161842 75963 36543 31295 -174592 -313625 -220673 -198128 -238332 -56113
21000 -56113 89331 333133 294065 70138 85870 124216 125247 89945 -50179 -134428 111337
20989 111337 329121 247957 32226 -7334 -118107 -226123 -340920 -339654 -418635 -264943
20979 -264943 -111363 -57608 -55378 -79286 100829 131276 185983 136759 -9766 176313 103061
20968 103061 -11956 -65246 -243086 -265974 -30382 38787 27064 95245 190383 42682 -71318
20957 -71318 -130940 -184013 -197444 -223371 -110276 53059 -24930 15615 67078 144707 171024
20946 171024 97300 -110346 -189542 -295958 -308811 -293903 -259194 -287587 -19640 -26142 81264
20935 81264 6729 -152946 -201740 101293 -64049 -296955 -337119 -249094 -265579 -260813 -130972
20924 -130972 -234314 -340945 -325056 -195532 -212262 -203009 -74801 -24687 -79869 -165716 -169006
20913 -169006 -214048 -290977 -335641 -353685 -370577 -367984 -403823 -377674 -104912 152629 56931
20902 56931 -115926 -130850 -54736 -16476 40236 -11207 5927 -59542 -161904 -177068 -142993
20891 -142993 -192594 -78666 173530 67265 -164552 -337914 -371265 -364410 -127524 -108898
20881 -108898 -230767 -212747 -167420 -371622 -626335 -639243 -518078 -529667 -513763 -324866
20871 -324866 -186589 -224995 -198571 -194805 -121845 -134217 -245077 -235060 -275893 -183049 -260776
20860 -260776 -387567 -330859 -322610 -274248 -347431 -308266 -269857 -275732 -154509 70063 25652
20849 25652 -109648 -149166 -282944 -153554 -6991 -13149 -195770 -347107 -475279 -380777
20839 -380777 -132917 -167634 -368848 -433461 -260799 -165370 -42858 -91255 -264543 -432435
20829 -432435 -514195 -389752 -305607 -221229 -143581 -195476 -213131 -133812 -208583 -305931 -211267
20818 -211267 24160 50116 76540 -14697 -200349 -365608 -285210 -166984 -217561 -171487 -61849
20807 -61849 -27212 -125973 -101928 -208961 -275121 -178898 -113153 27677 213512 164485 61536
20796 61536 111026 42358 -110426 -149727 -46677 -60793 -72680 -179209 -453293 -577577 -373888
20785 -373888 -134804 -74044 -141229 -161099 -154194 -13365 66975 -95497 -2291 -120775 -329167
20774 -329167 -124455 -89206 -52530 4470 -124255 -236755 -289967 -200849 -85162 91445
20764 91445 203297 42101 -25965 59383 181572 47443 -28210 -30029 -81418 -32685 -65937
20753 -65937 -192697 -385526 -403037 -226072 -104188 -39369 -55462 86608 82506 -40513 -176958
20742 -176958 -194549 -195360 -226576 -364952 -275657 -124724 -22605 157758 70912 -134641 -195189
20731 -195189 -345612 -496431 -308134 -262335 -200316 -246663 -108242 -4600 -8224 -231425
20721 -231425 -512338 -618687 -355689 -357026 -361880 -543153 -489979 -304159 -292190 -243176 -104317
20710 -104317 -14043 121628 111006 44575 -57773 -37088 -30736 -82972 -203646 -61351 -227192
20699 -227192 -164156 -59209 -245641 -356327 -419450 -392712 -249714 -256841 -299477 -257808 -162762
20688 -162762 -90115 -98881 -101596 -163473 -167084 -199328 -179440 -132411 -294923 -182620 -100334 -136215
20676 -136215 -217080 -368116 -577457 -567756 -402352 -264542 -390627 -465545 -356253 -255695
20666 -255695 -248295 -112974 -375807 -481308 -411243 -516813 -415447 -158863 -190743 -316270
20656 -316270 -314192 -295041 -276774 -135510 -67264 -96543 -153703 -254932 -397748 -276426 -337954
20645 -337954 -492428 -480641 -315103 -199334 -47033 -32365 -91301 -235217 -394658 -255017
20635 -255017 48735 45421 -222749 -121886 -106546 -181333 -76796 103010 103251 36985 77778
20624 77778 70311 -25179 -132158 -80742 -145577 -148221 -93809 -26720 -38198 -8675 -123596 -388636
20612 -388636 -282944 -188568 -361054 -475604 -407775 -295797 -120249 -93987 -297206 -339062
20602 -339062 -312998 -402863 -386538 -292460 -345354 -233315 -160646 -155689 -102354 -321265 -402854
20591 -402854 -409817 -385193 -405144 -323218 -128014 167618 147514 168190 121625 75822 43248
20580 43248 -65611 -238835 -359812 -475080 -444177 -464182 -672674 -726010 -654543 -582841 -633238
20569 -633238 -512022 -611406 -571778 -513969 -448474 -544207 -514541 -595833 -604920 -380459 -258720
20558 -258720 -424689 -493384 -374477 -341304 -459059 -427477 -269302 -170342 -220265 -382570
20548 -382570 -498151 -546896 -508954 -464013 -355981 -237209 -39029 -102922 -42761 -13458 -14936
20537 -14936 -136264 -57548 28631 37630 -133092 -364640 -304205 -393072 -380996 -313209 -289482
20526 -289482 -254771 -171554 -346691 -483285 -416232 -237217 -124930 -248498 -269040 -174215
20516 -174215 -208689 -285829 -191135 -48300 -71 -301034 -311571 -34381 -16955 -157141 -83437
20505 -83437 -40001 -373158 -348620 -234732 -196726 -136989 -234604 -271591 -311153 -431687 -377263
20494 -377263 -355168 -325569 -215480 -168097 -157099 -319430 -326100 -298475 -359450 -456900 -412036
20483 -412036 -348006 -150130 -58787 -152171 -325990 -290974 -158517 -112252 -226899 -159104 -194537
20472 -194537 -234652 -237645 -260886 -461978 -543323 -349358 -185113 -160491 -143702 -159445 -31865
20461 -31865 16204 -19365 47099 -28003 -86468 -10026 -116849 -364238 -474946 -433052 -230616
20450 -230616 -113870 -59247 -70229 -89815 28171 117612 -14553 27136 28725 -8164 3923
20439 3923 34116 -12697 -87423 -125888 -154783 -65237 -221265 -419297 -507285 -353454 -318926
20428 -318926 -424756 -298791 -315609 -300649 -316178 -485533 -588256 -505966 -370316 -340712
20418 -340712 -537103 -571278 -504411 -366652 -331709 -523345 -641541 -575010 -481527 -389316 -376067
20407 -376067 -339093 -448669 -561183 -313445 -168411 -278727 -325905 -182755 -112712 -136818
20397 -136818 -178493 -226441 -494272 -650949 -593520 -352003 -180433 -289267 -159265 60812
20387 60812 9275 -44262 17922 26994 1095 39275 -61921 -71068 142098 201874 -99322
20376 -99322 -317081 -204108 -112163 -302097 -456441 -269279 -128110 -144198 -192697 -235609
20366 -235609 -318165 -241578 -73102 -21508 57639 -126304 -299321 -405846 -365115 -216002
20356 -216002 -122350 -259596 -328045 -377890 -191756 -123759 -303672 -404039 -532386 -631788
20346 -631788 -413380 -246978 26410 -90067 -134483 -56350 -67877 -201701 -281943 -477043
20336 -477043 -496704 -262801 -230103 -247799 -182033 -250057 -238399 -392238 -722084 -630946 -369860
20325 -369860 -345922 -382444 -436151 -457775 -215805 76499 187114 137322 68170 -55975 -142312
20314 -142312 -27580 -125587 -40230 28808 -168548 -318077 -185715 -150666 -296729 -397820
20304 -397820 -466577 -411866 -522361 -375153 -213852 -344598 -422178 -396086 -399028 -517206 -656031
20293 -656031 -778901 -667471 -583318 -550977 -520643 -410142 -535405 -455728 -231555 -226210 -233154
20282 -233154 -316632 -209332 -194086 -188858 -262305 -91877 80475 -98091 -134503 -164931 -309165
20271 -309165 -399784 -331549 -176210 -42075 44254 8292 -169333 -196175 -329905 -340911 -218452
20260 -218452 -298898 -32742 112397 -28790 51278 87217 -65673 -282435 -450237 -408124
20250 -408124 -250075 -146785 -136548 -9806 147974 193003 238993 31894 -26845 37999
20240 37999 -33322 -184509 -259690 -326261 -257942 -216226 -139596 -191803 -298614 -388562 -188334
20229 -188334 61413 41443 -188072 -263296 -94522 7273 -15266 -79287 -22173 81910
20219 81910 -37684 -196078 -216039 -98983 -131034 -178668 -219476 -253597 -256484 -183149 -131344
20208 -131344 33779 446 12360 -87659 -215968 -158378 -61159 -178092 -204623 -120368 8263
20197 8263 -52459 -11 -136160 -165184 -101865 -45269 -33285 -64138 -209289 -222412 -107631
20186 -107631 -203727 -196740 -301724 -445614 -332437 -249720 -295196 -151542 21780 74492 106674
20175 106674 38561 -184118 -364355 -364486 -221333 -257288 -331201 -15840 -145522 -193268 -291512
20164 -291512 -177209 -116688 -47298 119802 84549 66656 -184339 -238019 -6001 183983
20154 183983 115105 205469 28074 -10378 104842 85530 -90162 -100470 -203482 -342304
20144 -342304 -318822 -215362 -217230 -221800 -59574 72879 36826 -70875 -121460 -256024 13920
20133 13920 287793 186398 -78363 -156632 -83705 -146683 -204330 -89597 -53691 -132933 -77408
20122 -77408 -130714 -224677 -124218 -41518 81608 134802 36023 51879 -39348 -46388 83175
20111 83175 -80672 -239970 -146036 -125074 -93591 -195243 -443604 -416092 -334488 -384629 -459926
20100 -459926 -416691 -171149 93868 -46166 60986 37646 -39016 34067 96767 27592 126933
20089 126933 312804 268381 137751 98263 89701 -33294 96259 205556 114121 19689 156395
20078 156395 167605 86126 -16668 -15033 52300 -77554 -58078 57285 159615 288458 394714
20067 394714 198444 158818 304521 225062 162992 293825 394653 512928 519238 764031
20057 764031 900907 823266 666700 589226 783270 832615 800570 833300 960000 1020046 1324711
20046 1324711 1397348 1470292 1801618 1911689 1870805 1837717 1699149 1668804 1462543 1366844
20036 1366844 1326675 1349524 1462256 1566155 1659025 1886968 1951449 1837308 1694117 1663264
20026 1663264 1601066 1414330 1213978 1251044 1220837 1096987 916895 874769 1010379 1104340
20016 1104340 996794 826414 907719 909969 713693 573360 585737 530658 478565 366271
20006 366271 358177 527367 614209 431526 450365 195788 45752 24292 232838 588546
19996 588546 704686 547677 482956 372853 343722 282035 137704 182505 252382 148741
19986 148741 5053 -45284 -109476 -64257 63125 181122 312137 393315 144898 -85918
19976 -85918 -53264 14782 38874 -43078 271912 348329 154281 2213 5827 82713 84160
19965 84160 170361 164899 152035 160557 6538 -48139 94239 217918 227514 299486 290240 259372
19953 259372 268628 138607 137265 189530 384663 509612 459473 299841 149004 312957 271479
19942 271479 174164 245487 349275 460804 497708 414467 395133 316591 327437 358198 284237
19931 284237 304179 89712 -57173 -37674 10656 160141 323157 95014 -210497 -156804
19921 -156804 -69076 16622 4880 75092 249573 245699 299250 4888 -34824 217806 291060
19910 291060 185441 122287 150666 172035 179764 70928 -78212 -266426 -287013 -102348 88250
19899 88250 101583 -1248 -18968 106688 16569 -93323 -146233 108853 260283 15862
19889 15862 94333 353166 460345 508596 418854 370502 407537 300857 122041 172573 72730
19878 72730 98673 198853 187937 142350 271131 250295 196964 281062 220551 44751 39030
19867 39030 245585 456289 431559 258291 241986 158226 134514 128816 14328 165867 190366
19856 190366 359545 351949 327959 257689 339647 202219 123837 91667 102550 93860 137554
19845 137554 4976 7461 77647 255791 363731 345876 283260 130662 -43237 -75233 -62176
19834 -62176 -104069 -115163 -9231 45042 171800 152982 168135 289520 125622 79164 250100
19823 250100 225190 334598 252075 118701 39020 25412 197023 129979 174622 72005 -1411
19812 -1411 18000 15913 139296 58942 37216 17581 154743 199386 193489 152058 251981 174527
19800 174527 116817 56133 147589 147668 111315 190822 383981 400987 430158 564978 739319
19789 739319 726581 734256 900898 1043228 1096176 1251537 1292091 1274694 1320108 1230596 1137126
19778 1137126 1038340 1129674 1259315 1086503 878996 740533 607366 641340 743575 659171
19768 659171 642594 660995 581727 560392 623597 595938 652973 628544 531149 676833 705269
19757 705269 704872 760103 708152 689811 638161 821433 868668 941016 932318 854370 954863 1005328
19745 1005328 866433 763072 663754 654493 750241 983073 903435 791163 844998 1002176
19735 1002176 1160929 1183327 1108901 1002382 982100 1024164 949746 892114 826571 754652 729710
19724 729710 815650 957585 956253 964104 912429 709941 703273 621211 451445 553547 628932
19713 628932 548629 656902 928694 722057 508872 514966 768474 853809 721679 568308
19703 568308 619481 749837 1060369 1149775 1000013 834813 686534 763818 794153 810642
19693 810642 792646 773081 682233 674933 898359 975623 921777 896876 968007 1133135 1217593
19682 1217593 927318 855306 881098 870757 849987 794555 842631 918820 1212491 1349894 1379731
19671 1379731 1069340 1285003 1401674 1436124 1388745 1487907 1537412 1563070 1437414 1579744
19661 1579744 1901730 1960172 1924963 1950926 1992757 2047680 2187329 2353885 2424560 2270352
19651 2270352 2019871 2039794 2038009 1822282 1544780 1654905 1688163 1672783 1702436 1678554 1543185
19640 1543185 1404846 1293195 1257586 1399418 1449941 1460654 1601639 1632875 1799493 1805347
19630 1805347 1808800 1926768 1908538 2061511 2241128 2155989 2026374 1951993 2103283 2221000
19620 2221000 2308699 2213187 2167930 2224020 2254987 2293217 2281154 2241825 2152177 2250963 2328395
19609 2328395 2345994 2117313 1987514 2145910 2464128 2415495 2470336 2424055 2085549 1988215
19599 1988215 2050941 2205196 2228790 2313048 2249059 2326776 2428977 2502848 2866183 3041381
19589 3041381 3215166 3226248 3322143 3406977 3243034 3264992 3218452 3125557 3020168 3234505
19579 3234505 3451477 3441987 3497675 3678060 4000186 4184741 4348578 4724615 5080877 5084614
19569 5084614 5170895 5293840 5607739 5828244 5992565 5954819 5761864 6007492 6064430 6118947
19559 6118947 6328238 6893913 7373445 7672580 7962028 8172197 8365042 8629585 8930258
19550 8930258 9598103 10462374 11118961 11929817 13035850 14312104 15738945 17373853 19347836
19541 19347836 21722516 24597251 28195254 32558713 38447579 45996605 54641760 64988143
19533 64988143 76465131 88612368 101430415 114095401 125651175 135550123 144080192
19526 144080192 152383069 160393434 168310469 177398379 188564966 201576434 215781518
19519 215781518 229600051 240639470 246479334 246173565 241059273 232366421 221098470 208808941
19511 208808941 197532123 189147981 183702643 180241026 177210771 172749546 164814856 153876268
19503 153876268 141176157 127162309 112759920 98788563 86315374 76293428 68202772
19496 68202772 61761426 56604422 52139054 48415992 45411687 42962155 40760409 38441351
19488 38441351 36514962 34732398 33095450 31442267 30101069 28870793 27581215 26411912
19480 26411912 25423057 24339921 23475414 22857974 22188378 21469005 20841788 20203271 19533963
19471 19533963 18944348 18492375 17929173 17476674 16995709 16548363 16113105 15572069 15140709
19462 15140709 14680003 14316027 13901772 13642612 13354999 12967148 12656308 12414800 12103167
19453 12103167 12046846 11728452 11156803 10868468 10760062 10704442 10512676 10100324 9811877 9615981
19443 9615981 9345057 9163569 8745238 8564736 8426980 8071258 8032166 7978728 7771118 7481939
19433 7481939 7265362 7193657 7082114 6830030 6829914 6658845 6610490 6618777 6600943 6443445 6111004
19422 6111004 5971370 5599092 5424358 5314976 5156969 5025242 4833945 4604414 4515683 4508112
19412 4508112 4700103 4621778 4519538 4490968 4295785 4371361 4301511 4268301 4155264 4258071
19402 4258071 4323806 4169416 4071654 4131353 3937554 3883802 3978270 3917548 4015713 4022345 3870515
19391 3870515 3679795 3694815 3599970 3656399 3711941 3603151 3518249 3560863 3483594 3392926 3384983
19380 3384983 3495823 3486520 3520310 3325685 3402484 3536788 3364368 3262045 3157380 3157873 3051743
19369 3051743 2967326 3094433 3081566 2908135 2839817 2673045 2695184 2610012 2391465 2237499
19359 2237499 2277414 2159754 2240806 2176115 2102529 2082966 2207427 2207289 2127963 2180718 2334736
19348 2334736 2619758 2823744 2689635 2705887 2704700 2725240 2655283 2603760 2539202 2622308 2591420
19337 2591420 2548507 2551006 2547740 2513142 2320368 2405347 2575300 2843754 2915104 2945779 3133566
19326 3133566 3148553 3133572 3185818 3230662 3226248 3284174 3277313 3505618 3703809 3759499 3809140
19315 3809140 3775267 4079598 4207106 4204009 4167802 4305678 4188255 4069509 4053522 4055751 4467363
19304 4467363 4697687 4831552 4925907 4961943 5074574 5365589 5679309 5907632 6093456 6519694
19294 6519694 6964433 7261565 7617201 8186715 8594531 9299852 10151902 10785796 11771390
19285 11771390 13109821 14717835 16591109 19280377 22947215 28029836 34326483 41674752
19277 41674752 49809933 57934447 66218599 74917246 83464994 90723348 95906281 100226461
19269 100226461 105269707 111514215 118954402 126683262 132452386 133815281 130355147 124378764
19261 124378764 118171290 112068469 106484428 102301552 99180100 96695112 94449950 90732135
19253 90732135 83329711 72668617 61949021 53109941 46760699 42286867 38726490 36144808
19245 36144808 34421368 33007568 32063077 31267424 30772175 30480955 30250633 30333200 30711027
19236 30711027 31373049 32271835 33906627 36374731 40046124 45311433 52277694 60849286
19228 60849286 70008452 79178411 88591981 98386507 108051459 116001922 120887171 124501760
19220 124501760 129248306 135901788 144206941 152527788 158491916 160353250 157765336 152720034
19212 152720034 146224199 138088591 130165314 124254400 119828696 116486161 113426463 108783529
19204 108783529 100143525 87836734 75054338 64421111 56452600 50701933 46492588
19197 46492588 43399374 40987056 38989260 37375077 36086070 34943788 33915372 33084553
19189 33084553 32471493 32130762 31862464 31771744 31952859 32506964 33317109 34727607 36442297
19180 36442297 38991433 42715671 47283699 52655659 58443945 64551107 70718161 77185647
19172 77185647 84181150 91369850 97800597 102828449 105909163 108102522 110716250 114160217
19164 114160217 118281429 122276905 124670959 124609571 122687081 120184348 117418251 113425902
19156 113425902 108171522 102830301 98021692 94183986 90843746 87409709 82949655 76688261
19148 76688261 69176015 61808897 55669882 50831556 46910527 43916813 41811050 40130348
19140 40130348 39227331 38713749 38464795 38347272 38581962 39366770 40634676 42326735 44997265
19131 44997265 48692428 53432016 59412272 66674158 74407011 81841806 89328725 97232129
19123 97232129 105584543 113673629 120217815 124270788 126234634 128056228 130688360 134752476
19115 134752476 139477874 143201059 144727982 144419377 142786681 140286282 136129230 129911804
19107 129911804 122336797 114546510 107884263 102564684 97940927 92936688 86633387 78527917
19099 78527917 69629355 61138317 54155444 48826982 44371704 40674077 37891828 35665131
19091 35665131 33704114 32015956 30597414 29306437 27898963 26557435 25531331 24567968
19083 24567968 23702523 22673113 21837025 21010859 20178985 19502241 18947689 18178121 17526937
19074 17526937 17066307 16353765 15766170 15221875 14927040 14738850 14239322 13896265 13529833
19065 13529833 13229470 12691269 12287330 11994664 11848725 11828403 11654120 11455911 11260432
19056 11260432 11037464 10675229 10307244 10060097 9792366 9546681 9362535 9223449 9074954
19047 9074954 8855104 8954792 9005684 8903076 8804900 8769932 8712905 8626552 8548040 8313556 8034761
19036 8034761 7894176 7790791 7741769 7529172 7149059 7048278 6832941 6701117 6564791 6309104
19026 6309104 5848090 5507663 5573797 5503400 5538323 5521208 5465009 5439543 5208739 5178168 5308763
19015 5308763 5189786 5180568 5253394 5272504 5248633 5122776 5153814 5153883 5243073 5311197 5532881
19004 5532881 5490815 5349014 5328661 5312749 5201671 5016594 5069761 5085829 5019398 4907113
18994 4907113 4655182 4453826 4394760 4202017 4140593 4151031 4241462 4070766 3954257 3856246
18984 3856246 3791679 3905115 3812918 3679232 3308746 3094753 3296941 3382614 3387449 3271353
18974 3271353 2901608 2766144 2996881 3035723 2928043 2969121 3006316 3181156 3066483 3029866
18964 3029866 3149892 3141311 2957892 2783430 2816848 2984433 3116893 3145885 3295980 3189577
18954 3189577 2950196 2905733 2937244 2783399 2622022 2692722 2812065 2755058 2849119 2738750
18944 2738750 2434185 2262970 2158195 2076867 1963963 2056621 2072072 2037716 2218665 2157081
18934 2157081 1976529 2047395 2181147 2091938 2209004 2369199 2358773 2278312 2134634 1942594
18924 1942594 2135296 2248116 2153750 2241124 2254858 2334036 2458483 2432084 2459503 2476123 2577583
18913 2577583 2760181 2713809 2670831 2539957 2445654 2332133 2085021 1987223 2109631 2325596
18903 2325596 2382189 2510723 2412269 2299143 2104026 2060537 1879650 1712363 1628335 1539270
18893 1539270 1735586 1924045 1934382 1823249 1735231 1890862 1960573 2006719 2003608 1931927 1938684
18882 1938684 2027899 1869088 1695856 1522356 1369192 1359893 1286122 1205264 1313566 1245266
18872 1245266 1209931 1060318 1127172 1181743 1106832 1160564 1307385 1114052 1027422 921853
18862 921853 1057022 1228809 1292252 1326152 1240695 1180693 1188687 1169328 1165711 1163013 1199360 1377332
18850 1377332 1394801 1307785 1241020 1392589 1452853 1375794 1303262 1248342 1215656 1243482 1192761
18839 1192761 1152190 1179585 1241685 1194517 1271085 1406771 1450344 1248653 1193103 1046598 1162839
18828 1162839 1396886 1355893 1452035 1589629 1500285 1359766 1444100 1839067 2098811 2199201
18818 2199201 2330234 2157995 1930699 1963493 2216712 2256232 2135612 2119133 2084935 1966735
18808 1966735 1915118 1887454 1754844 1661374 1670879 1537282 1518937 1596974 1586246 1561513 1432951
18797 1432951 1437586 1418404 1173329 1053805 1006974 1043166 1214833 1278282 1208916 1173439 1112724
18786 1112724 992606 952295 968638 1021915 988858 921936 879554 862498 969023 1042014 948135
18775 948135 1051153 1043914 1015072 1022382 1309772 1524546 1452697 1522332 1614942 1736995 1868936
18764 1868936 2138037 2090292 2123393 2141979 2278866 2358726 2316287 2312967 1955145 1792512 1759890
18753 1759890 1785918 1804600 1772142 1791541 1920085 1849901 1867064 1532973 1342628 1347598 1253019
18742 1253019 1308691 1482252 1531081 1531258 1526247 1347528 1328657 1331533 1467837 1646399 1600520
18731 1600520 1274709 1240209 1409558 1443041 1572306 1463019 1330779 1334242 1619526 1551738
18721 1551738 1445214 1390022 1553719 1828701 1977176 2221937 2493724 2743471 2819418 2811783
18711 2811783 2920518 3038944 2894475 2919174 2966744 2938435 3045431 2909641 2925457 3012758
18701 3012758 3044548 3313786 3421911 3348728 3283075 3555697 3646878 3755323 3580756 3293462
18691 3293462 3145771 3169274 3159257 3099063 3166540 3109848 3359954 3445520 3304967 3104149
18681 3104149 3074281 3115718 3221405 3305309 3302147 3203527 3200986 3592663 3834900 3967139 4351614
18670 4351614 4868439 5308698 5407278 5553646 5933186 6425559 6670776 7025577 7379363 7461329
18660 7461329 7774081 8160300 8472785 8999915 9672616 10660433 11894157 13499771 15672611
18651 15672611 18719275 22327861 27051083 33742395 42943322 54279519 67534453 82084891
18643 82084891 97140416 111619555 124074593 132130398 133198026 127721454 117783176 104136475
18635 104136475 87813654 71829602 58816434 49207246 42362361 37282035 33795531
18628 33795531 31157655 29023896 27306864 25967778 24815494 24105793 23715789 23481948
18620 23481948 23344254 23234098 23383802 23479596 23354698 23084789 22897696 22712922 22310567
18611 22310567 21974469 22071249 22311204 22823320 23568947 24911035 26803173 29214104 32456580
18602 32456580 36899211 42872274 51417525 63058336 78593363 98365536 121191506
18595 121191506 145532779 170326523 194604375 215168944 226747587 226108439 214844341
18588 214844341 196319798 171724147 143400670 116390107 94924303 79272993 67991936
18581 67991936 59744847 53659552 48888357 45046902 41980344 39433834 37335725 35394488
18573 35394488 34041284 32651741 31592897 30625481 29610217 28776681 28212022 27440449 26603028
18564 26603028 25806273 24936209 24265738 23578677 22926599 22529843 22495709 22645193 23024536
18555 23024536 24016558 25456911 27096436 29519051 33048443 38151092 45009100 53670504
18547 53670504 63686635 74451584 85273968 95446275 103516681 107284597 105431253
18540 105431253 99240781 90242215 78496687 65078674 53173643 44051881 37697675
18533 37697675 33357950 30157508 27605685 25537530 23953891 22596783 21459359 20328135
18525 20328135 19144724 18342218 17644621 17128566 16771055 16166034 15661282 15321787 14889920
18516 14889920 14436078 14186236 13684353 12883312 12080294 11790560 11572035 11256423 10883748
18507 10883748 10517454 10314937 9966053 9478918 9385049 9358830 8968423 8594232 8328893 8120634
18497 8120634 7896503 7763359 7603843 7413181 7091343 7019480 6977642 6956487 6836305 6566861
18487 6566861 6313159 6308683 6254883 6078288 5668992 5460866 5350944 5279146 5217233 5161750
18477 5161750 5159499 5262016 5274361 5108942 4858067 4934370 5002226 4980328 4953885 5174898 5068359
18466 5068359 4694129 4401730 4192906 4133985 4094724 3929716 3776128 3933554 3986658 3915349
18456 3915349 3831693 3824825 3672274 3507182 3285559 3100286 3065098 3047381 2809310 2778696
18446 2778696 2774062 2613524 2682239 2750906 2573161 2483713 2647565 2628331 2549456 2427801 2276609
18435 2276609 2184400 2025703 1849698 1956702 2174984 2212884 2372368 2486655 2638794 2585178
18425 2585178 2260795 1895518 1806318 1940732 1975503 2063159 1959453 1662771 1732185 1821295
18415 1821295 1778052 1773606 1742196 1651869 1684837 1667666 1578385 1422367 1538705 1912263 1948804
18404 1948804 1865376 1892853 1557340 1411533 1487600 1358400 1379654 1504806 1588248 1444718
18394 1444718 1413520 1437650 1482795 1350229 1230408 1354981 1287902 962544 794192 777070
18384 777070 822112 929661 930791 1096118 1008893 1027232 1009193 1044358 980415 922307 847733
18373 847733 999875 1075524 1048340 976020 962737 977889 877847 810978 780249 705336 592428
18362 592428 544141 457550 577947 801751 600962 539506 537573 534064 553510 455640 454707 498392
18350 498392 448672 370112 415785 530827 585339 682952 647253 782661 921970 962901 761139
18339 761139 673845 640326 684648 718029 572371 403933 314128 111197 -2818 111163
18329 111163 220212 255430 269010 413241 304620 353688 209820 4205 135806 496561
18319 496561 596093 580425 326615 43206 139532 351576 494164 402896 187451 215713
18309 215713 233606 509009 440114 208950 133402 225419 303784 194995 237109 112309 126105
18298 126105 182235 521755 642893 554179 364746 406841 338525 219458 224653 423358 251932
18287 251932 332240 222937 150905 165122 86244 299130 459008 410702 402056 473062 459418
18276 459418 479185 351346 221663 193996 30486 -116221 7478 -68916 -27982 3254
18266 3254 -90467 -121100 8299 61766 -13086 7494 293365 269892 165501 156332 310240
18255 310240 247220 -50828 -138304 -172016 -64364 -33886 35243 22623 -43926 -306408 -234492
18244 -234492 -139367 -235277 -267753 -31759 -14303 13753 -32251 -111302 -142497 -49307 -6324
18233 -6324 13478 -29104 -41818 -136132 -142929 -181223 -331727 -405299 -334594 -127298 -305713
18222 -305713 -306013 -177643 -54101 -278610 -509559 -516426 -279122 -72863 -211232 -107939
18212 -107939 -111248 -222199 -114665 -215195 -380812 -256425 -189802 -292540 -373393 -398305
18202 -398305 -260701 -13419 -102809 -203232 -271607 -254528 -211158 -26970 -45149 -10428 -128072
18191 -128072 -269462 -546367 -604822 -486495 -518207 -272057 -79592 38185 -9062 -68004
18181 -68004 -156712 -107287 -47189 -140666 -179781 -411059 -361661 -197856 -225085 -350923 -445957
18170 -445957 -414508 -488951 -510817 -288446 -46130 -125976 -265077 -283311 -292982 -188607 -163441
18159 -163441 -148278 -118230 -161672 -138973 9920 123221 230231 16104 -98862 -245876
18149 -245876 -375432 -353136 -451861 -594994 -385005 -363585 -339963 -298439 -358338 -406123 -504472
18138 -504472 -551242 -438318 -384748 -302603 -191322 -150585 -145000 -23778 45372 15879 76682
18127 76682 247709 225652 326481 368360 292800 362586 393823 277448 118954 187687 215829
18116 215829 316802 377196 382896 241897 52169 7773 48091 142730 18753 -225221 -177318
18105 -177318 -6899 -76491 -31895 -210450 -379595 -261993 -276802 -194161 -138266 -217144 -214686
18094 -214686 -117297 -80494 -91712 5857 38697 -127204 -166999 29782 -63022 -223690 -167822
18083 -167822 92450 251936 252452 119722 94071 284621 262885 335720 419032 446341 436920
18072 436920 474468 432675 365460 354745 255415 215087 113140 7804 69942 3642 -218243
18061 -218243 -234869 -206905 -75059 -14376 18525 141760 63339 -8726 -63238 -212069 -301154
18050 -301154 -172686 -84307 -136853 -228797 -391101 -430462 -379513 -412340 -281772 -202472 -147693
18039 -147693 -297488 -88733 -1695 -3213 47427 56213 -26688 -141298 -260100 -317975 -33171
18028 -33171 1259 71543 178967 237065 233364 209794 11515 -104129 103021 255759 207391
18017 207391 299243 180332 93892 -101538 -231431 -240764 -301136 -247484 -340248 -452427 -344236
18006 -344236 -152763 -224810 -413290 -431475 -190648 7328 53960 -9179 -95676 -137023 -342836
17995 -342836 -406957 -331014 -274047 -180233 -352271 -280412 -345837 -326993 -326841 -284573 -194729 -457421
17983 -457421 -707194 -514504 -501041 -494382 -423563 -299433 -331546 -401624 -542568 -434892 -290946
17972 -290946 -232459 -321336 -251068 -53338 -156324 -307799 -426457 -337428 -232812 -243760
17962 -243760 -209123 -296884 -382014 -433920 -300477 -291824 -439678 -450734 -350775 -279459 -324228
17951 -324228 -308093 -303230 -363342 -524864 -496156 -479145 -497449 -627094 -590547 -513758 -480597
17940 -480597 -180941 -103237 -374922 -479517 -483910 -410019 -539010 -655388 -632619 -480547
17930 -480547 -304546 -336852 -480124 -485738 -414318 -294895 -254661 -351111 -438168 -556297 -518406
17919 -518406 -418452 -304821 -72981 -43624 -44092 -167229 -293425 -293615 -289923 -307669 -170626
17908 -170626 -119789 -153905 -270347 -486087 -530610 -477491 -524829 -449099 -360447 -203904 -142867
17897 -142867 -358487 -484090 -586311 -641353 -627221 -471392 -523686 -632265 -590024 -580806 -688085
17886 -688085 -729818 -671555 -648416 -709368 -831877 -726221 -707922 -651019 -630724 -550561 -568827
17875 -568827 -564484 -460656 -371213 -374821 -447970 -543244 -442691 -492072 -512695 -482937 -401528
17864 -401528 -548380 -475415 -392708 -284409 -244300 -416346 -422470 -408676 -310068 -249811 -257659
17853 -257659 -231306 -291663 -91141 -176069 -440282 -346087 -357410 -408808 -300781 -404817 -365058
17842 -365058 -403251 -480710 -598477 -612248 -421288 -376381 -368343 -303852 -371501 -454745 -332430
17831 -332430 -227592 -175145 -376030 -467493 -454500 -494899 -482838 -513909 -631412 -619125 -734116
17820 -734116 -934947 -682589 -681647 -628935 -527801 -494044 -425047 -322267 -219285 -150355 -46383
17809 -46383 -53936 -187429 -246910 -274670 -406417 -444232 -461622 -424154 -450754 -559664 -739038
17798 -739038 -440643 -417624 -469014 -478979 -488574 -515120 -483625 -552595 -470824 -446355 -439033 -543229
17786 -543229 -636297 -501987 -364724 -474427 -433005 -403120 -200012 -156722 -406049 -690520
17776 -690520 -810576 -615649 -428178 -306794 -315726 -487597 -711534 -770471 -510860 -454552
17766 -454552 -600076 -632652 -689775 -811985 -682196 -590470 -541621 -513361 -608053 -614259 -747217
17755 -747217 -730651 -762717 -763505 -712950 -599068 -526854 -615683 -605529 -569447 -435245 -428182 -540307
17743 -540307 -470621 -309784 -404693 -481389 -474797 -477253 -397512 -546670 -821361 -692166 -657669
17732 -657669 -846442 -681388 -525290 -616620 -594611 -747775 -833924 -594455 -267453 -370342
17722 -370342 -641300 -606494 -451976 -282448 -316767 -358585 -261445 -366196 -491689 -425906
17712 -425906 -681253 -782866 -807780 -792770 -473345 -296116 -158476 -57056 -156800 -320521
17702 -320521 -315522 -255994 -261266 -219611 -297491 -282715 -332145 -312408 -316049 -526907 -674295 -755805
17690 -755805 -611178 -677892 -675449 -699703 -755525 -609675 -523115 -459052 -491105 -487201 -428972
17679 -428972 -473339 -500487 -347519 -243633 -143640 5698 -90710 -384546 -311434 -207081
17669 -207081 -350587 -482218 -363859 -149547 -236945 -317345 -413273 -523373 -540671 -347369
17659 -347369 -208654 -285199 -327743 -349839 -419881 -480183 -368513 -382722 -474310 -575228 -596625
17648 -596625 -486656 -420467 -447008 -391303 -429834 -638727 -711220 -838779 -871129 -795884 -503531
17637 -503531 -319777 -318023 -367376 -488397 -391101 -358913 -443588 -701347 -619591 -185268 -212029
17626 -212029 -433108 -532258 -661178 -647841 -582467 -585301 -298384 -341220 -280550 -215401 -415073
17615 -415073 -408805 -434248 -503554 -518115 -608277 -644217 -439811 -365765 -504058 -253542 -474249
17604 -474249 -545577 -381484 -508810 -721165 -673263 -562675 -582515 -529262 -591690 -750861
17594 -750861 -626472 -448195 -254127 -341142 -459129 -400377 -494421 -504561 -564421 -521856 -472102
17583 -472102 -415872 -303381 -157890 -245711 -340430 -456785 -364594 -385624 -361535 -426299 -434443
17572 -434443 -432998 -477753 -617219 -479326 -499119 -541321 -464013 -424932 -431238 -305626 -257469
17561 -257469 -277131 -349710 -330141 -568676 -648886 -560092 -482600 -490697 -546424 -406672 -345891
17550 -345891 -478069 -389944 -255231 -289939 -498557 -624797 -655527 -668131 -704604 -633484 -615606
17539 -615606 -669623 -602868 -439096 -356497 -348845 -580374 -697203 -593127 -569052 -390157 -385434
17528 -385434 -484454 -627511 -632743 -748346 -840260 -709802 -600531 -388710 -163135 -171649 -445015
17517 -445015 -608811 -558214 -450277 -274647 -245017 -336584 -465709 -579745 -617435 -595327
17507 -595327 -556905 -623934 -418588 -361050 -572862 -609522 -629110 -822529 -637798 -491497
17497 -491497 -562767 -624611 -678461 -746914 -637800 -667985 -701872 -587357 -529234 -407696 -445066
17486 -445066 -662277 -578766 -350912 -304759 -247675 -205439 -314434 -536086 -633050 -575874 -551040
17475 -551040 -400257 -524556 -438500 -205014 -58930 -339310 -521219 -613807 -616536 -396514
17465 -396514 -487319 -565184 -585679 -512423 -447319 -308644 -304009 -356052 -449499 -547477 -603767
17454 -603767 -521003 -323724 -272293 -337838 -537706 -554261 -541012 -484738 -542245 -649955 -575189
17443 -575189 -489753 -597156 -574684 -398887 -280297 -299145 -314199 -254483 -49776 -121093 -472882
17432 -472882 -600000 -581767 -652716 -632227 -595682 -421673 -368615 -480537 -580568 -593136 -570100
17421 -570100 -396529 -267934 -298917 -177993 -249998 -509911 -752465 -706265 -506809 -416354
17411 -416354 -561728 -460248 -552535 -646804 -672045 -767648 -789005 -560717 -482794 -566579 -614122
17400 -614122 -628861 -550548 -507875 -454389 -461098 -592837 -530611 -641300 -640456 -288291 -203486
17389 -203486 -159026 -331578 -679281 -727903 -606144 -599006 -592106 -483759 -553957 -799961 -918651
17378 -918651 -883069 -689265 -768758 -642980 -489610 -397568 -248224 -302376 -338257 -430065 -383884
17367 -383884 -211559 -196436 -182921 -278985 -259379 -304707 -459390 -440645 -448581 -524044 -442888
17356 -442888 -312758 -346285 -460138 -362642 -268641 -311977 -311577 -416631 -636517 -751032 -574680
17345 -574680 -459286 -569785 -665421 -518076 -383478 -414813 -305190 -219075 -275082 -34013
17335 -34013 -18686 -174039 -370183 -453226 -554292 -513138 -428006 -284018 -385645 -465407 -654677
17324 -654677 -648438 -407194 -475191 -428341 -427042 -541240 -444145 -297412 -355256 -534947 -608336
17313 -608336 -508499 -578562 -684021 -715482 -894467 -774996 -768488 -621612 -368644 -212637
17303 -212637 -151700 -170604 -120871 -94449 -63449 -348919 -446135 -328682 -390525 -515799 -538406
17292 -538406 -555556 -551204 -672280 -339738 -84747 -62689 -299129 -498687 -463433 -419871 -450232
17281 -450232 -535837 -667245 -390261 -219024 -374539 -655886 -729606 -717403 -437343 -356531
17271 -356531 -553931 -668304 -639277 -507197 -460905 -323589 -582575 -706645 -565928 -418237
17261 -418237 -363011 -343191 -412874 -589066 -601635 -544061 -539590 -612034 -500072 -449701 -425296
17250 -425296 -390480 -444912 -402576 -450601 -493506 -367525 -325725 -457360 -568173 -658138 -632714
17239 -632714 -653946 -584761 -555825 -390289 -480740 -600305 -661776 -644117 -613120 -469017 -289704
17228 -289704 -169422 -215997 -286334 -292960 -362465 -277328 -33265 -80310 -480259 -552383 -618653
17217 -618653 -669236 -579725 -478600 -368690 -343704 -343907 -474806 -558223 -425866 -541193 -677927
17206 -677927 -556082 -478115 -349916 -405106 -375382 -462381 -656959 -399037 -307363 -371398 -471384
17195 -471384 -465100 -291112 -354537 -540868 -485502 -332337 -261569 -308433 -335668 -425093 -564663
17184 -564663 -588829 -590483 -624013 -583086 -490995 -591837 -530093 -428116 -517426 -554397 -513813
17173 -513813 -425529 -676793 -763265 -701758 -659845 -699982 -624721 -319042 -260583 -410794 -567676
17162 -567676 -671312 -693778 -695179 -691688 -632866 -557037 -308416 -167609 -413161 -671964 -656828
17151 -656828 -636287 -692417 -460636 -64814 -215157 -190023 -344702 -430673 -468379 -401652 -353383
17140 -353383 -331591 -323432 -381060 -394502 -232246 -263600 -274415 -303501 -178197 -220558 -230694
17129 -230694 -381381 -447539 -505729 -521172 -670575 -745156 -658595 -512563 -520310 -485987 -522535
17118 -522535 -686501 -690955 -358208 -362852 -419397 -281509 -207217 -278922 -227310 -329979 -701791
17107 -701791 -723293 -749285 -721161 -674228 -404763 -352507 -523103 -643646 -687771 -724804 -608191
17096 -608191 -489907 -430673 -370965 -455124 -558374 -557543 -721222 -584751 -459823 -534845 -637048
17085 -637048 -558100 -309672 -256109 -282148 -271730 -399049 -500243 -566140 -460502 -268151
17075 -268151 -182392 -282164 -327962 -169445 -247329 -357305 -207183 -177818 -387904 -299760 -337144
17064 -337144 -248471 -252827 -480750 -713507 -768320 -667100 -581641 -502692 -521678 -370872 -392365
17053 -392365 -491107 -435913 -280963 -421548 -657269 -555417 -495659 -483649 -561838 -581389 -500656
17042 -500656 -273830 -382117 -497689 -499249 -295698 -287813 -444314 -622755 -552609 -332396
17032 -332396 -196228 -288338 -430959 -448550 -349694 -381919 -310515 -255022 -351523 -374331 -295849
17021 -295849 -176794 -166438 -322259 -448839 -527772 -561707 -578959 -552540 -418795 -425386 -366165
17010 -366165 -441015 -413180 -517715 -714700 -582965 -545801 -431624 -324147 -465727 -583924
17000 -583924 -615491 -570366 -408238 -319532 -261711 -355375 -487197 -579206 -524265 -449498 -360823
16989 -360823 -148115 -221313 -341642 -508821 -510465 -524962 -585111 -411361 -247135 -121358
16979 -121358 -120910 -287273 -295567 -505566 -572160 -523642 -533667 -403698 -430478 -644738 -805797
16968 -805797 -653750 -597687 -415317 -406634 -657863 -748633 -776571 -635973 -555446 -580128 -556908
16957 -556908 -500939 -554818 -639485 -702108 -561951 -412120 -380463 -401899 -388271 -500540 -577965
16946 -577965 -665983 -645723 -423063 -447467 -361639 -158886 -296640 -277129 -154015 -300548
16936 -300548 -389659 -640645 -569038 -288474 -352554 -375586 -330610 -234086 -147525 -276938 -481363
16925 -481363 -472988 -624091 -725013 -706095 -470813 -491761 -478870 -411959 -350592 -389934 -265473
16914 -265473 -280554 -318250 -222056 -380793 -376806 -458269 -227440 -234759 -238358 -34326 -38810 -193700
16902 -193700 -250641 -350260 -190476 -126038 19702 -132285 -356972 -504511 -399632 -382693
16892 -382693 -335769 -278691 -217883 -235554 -343554 -308077 -261415 -364455 -413624 -500286 -387405
16881 -387405 -102844 81337 -111816 -305822 -473193 -499626 -556866 -577504 -545472 -327032
16871 -327032 -171236 -162527 -47844 -187340 -456089 -647331 -582253 -466953 -235147 -4038
16861 -4038 -74117 -374978 -437571 -629966 -782337 -699703 -610779 -565163 -544300 -357101 -235730
16850 -235730 -48977 -149545 -251764 -311175 -433827 -412322 -599323 -629155 -538991 -604743
16840 -604743 -529746 -384259 -469364 -572738 -495230 -505345 -520095 -473604 -221152 -182281 -329902
16829 -329902 -347052 -443057 -517141 -423721 -304639 -361757 -536850 -693943 -488131 -305597
16819 -305597 -124418 -69437 -94838 -256021 -313840 -180113 -135381 -360522 -389509 -437220 -401627
16808 -401627 -388506 -516197 -575631 -364999 -355092 -598096 -647800 -753560 -997578 -1014356 -880736
16797 -880736 -934098 -847324 -692130 -686134 -805561 -913810 -807361 -773885 -719150 -473061 -464902
16786 -464902 -540506 -557691 -604938 -521968 -361216 -174943 -334306 -540138 -805608 -768416
16776 -768416 -808670 -780931 -409862 -268066 -300360 -416289 -524474 -473479 -533609 -590648 -707056
16765 -707056 -760912 -736468 -562798 -410142 -284864 -361654 -460232 -452539 -434626 -428611 -416267
16754 -416267 -435617 -216072 -251719 -519134 -360781 -125560 -171414 -172040 -246917 -457731 -475268
16743 -475268 -369642 -502913 -635997 -701264 -738633 -514027 -583439 -482434 -395238 -564279
16733 -564279 -509815 -694606 -735958 -633028 -665506 -661843 -573645 -608132 -368728 -326864 -380176
16722 -380176 -406897 -337816 -319800 -427508 -449086 -373409 -160035 -187231 -402295 -576239 -762842
16711 -762842 -1016709 -1000737 -832760 -893323 -970883 -738144 -542569 -498679 -647104 -574605
16701 -574605 -464265 -522709 -449642 -464017 -401866 -452795 -469554 -581184 -447074 -213058 -268643
16690 -268643 -367823 -485248 -539840 -456819 -235138 -191754 -405306 -431252 -386245 -491922 -610180
16679 -610180 -584626 -358056 -231441 -301795 -318564 -142315 -168858 -322998 -498720 -593732
16669 -593732 -441819 -381303 -576085 -537198 -98418 65806 25233 -122174 -396479 -450138
16659 -450138 -577916 -531734 -439320 -113243 -158655 -269492 -359599 -256629 46 -74268
16649 -74268 -205037 -244141 -228647 -148787 -120769 -203939 -261270 -379384 -540933 -510871 -319512
16638 -319512 -306264 -424388 -541151 -688446 -611774 -555700 -583467 -558636 -317891 -329972 -655155
16627 -655155 -654727 -386846 -355393 -426139 -421680 -460566 -401997 -389445 -265690 -346242 -570824
16616 -570824 -656819 -482904 -287826 -327628 -340576 -243835 -95733 -154522 -271049 -342950 -146738
16605 -146738 -81063 -175428 -101272 -264676 -319867 -324378 -328250 -482299 -589702 -567478 -531721
16594 -531721 -559905 -478324 -518951 -521857 -502861 -371335 -307798 -306021 -394455 -478197 -352521
16583 -352521 -194480 -266310 -310818 -433923 -464087 -464871 -449546 -500592 -446816 -414844 -416034 -396054
16571 -396054 -325214 -328412 -219545 -306052 -225721 -433799 -555310 -560885 -305599 -427159 -453374
16560 -453374 -366246 -420955 -424375 -352912 -375973 -452774 -229449 -163476 -426870 -556460 -523768
16549 -523768 -437080 -377136 -254478 1572 -126614 -325919 -492846 -536611 -572286 -668882
16539 -668882 -583027 -504795 -618167 -471994 -254576 -96071 -291665 -394247 -315151 -465276
16529 -465276 -608719 -532218 -415889 -477559 -598286 -556600 -350863 -250006 -146160 -222009
16519 -222009 -304330 -365781 -414764 -354740 -326924 -448635 -566597 -437977 -267828 -364099 -440753
16508 -440753 -487432 -639309 -564070 -413046 -362001 -286420 -235418 -291839 -348391 -413884 -458287
16497 -458287 -527721 -369800 -68519 -51065 -63115 -151020 -188633 -280223 -316428 -311413 -248687
16486 -248687 -217823 -160165 -301029 -472021 -448756 -472561 -229883 -207597 -465023 -651933
16476 -651933 -821150 -709550 -589052 -578553 -411984 -277644 -243493 -577274 -677959 -665825
16466 -665825 -731799 -879359 -828769 -525193 -293881 -194815 -286384 -303392 -242406 -242782 -336708
16455 -336708 -258320 -556727 -726131 -616820 -455642 -439369 -491667 -453916 -540238 -480731 -591708
16444 -591708 -588804 -518235 -256374 -250151 -332093 -376259 -336854 -392771 -302390 -428358 -516779
16433 -516779 -605304 -668077 -615165 -442299 -411178 -613959 -749813 -588084 -583220 -667983 -777201
16422 -777201 -628601 -630430 -712175 -726196 -809784 -898449 -717917 -558618 -491339 -527124 -620210
16411 -620210 -599524 -539661 -422296 -537773 -526692 -623658 -633731 -570360 -486331 -457312 -432133
16400 -432133 -726218 -645402 -263035 -51754 -116813 -340591 -424459 -502149 -517636 -516400 -293564
16389 -293564 -160132 -446421 -541422 -540523 -588720 -413202 -219596 -243489 -447895 -460395 -400355
16378 -400355 -305090 -302370 -459990 -301006 -166750 -40119 195127 91275 -100107 -173673
16368 -173673 -259793 -294642 -371337 -460348 -470064 -571020 -668361 -763340 -714588 -814240 -603009
16357 -603009 -473762 -452266 -402698 -269488 -389949 -350878 -325214 -349738 -382623 -480032 -427058
16346 -427058 -339777 -401023 -452159 -496170 -539332 -494814 -645036 -519428 -397740 -440360 -424608
16335 -424608 -574437 -759260 -838374 -624345 -561727 -533264 -612489 -706929 -705765 -733802 -990911
16324 -990911 -997827 -772184 -558889 -272248 -210659 -214233 -364281 -559154 -407150 -175153
16314 -175153 14564 -226061 -384455 -443450 -464120 -451800 -401103 -406346 -473271 -417085 -344595
16303 -344595 -534334 -713997 -819698 -706154 -557246 -420555 -497267 -462463 -294662 -53075
16293 -53075 -34148 -348336 -559634 -532283 -390449 -341607 -427995 -566643 -575850 -412630 -314085
16282 -314085 -176042 -370262 -452497 -542220 -425273 -216984 -184973 -177224 -289519 -432386
16272 -432386 -454215 -624042 -700200 -554265 -478804 -275242 -149848 -153296 -145245 -143369 -262591
16261 -262591 -198460 -209947 -20362 199137 -139097 -194034 -190409 -237138 -332568 -234398 -313300
16250 -313300 -574045 -722122 -686072 -419854 -360350 -401611 -253520 -255025 -239702 -101082 -44603
16239 -44603 -268754 -398704 -398780 -290516 -372057 -356012 -430369 -392090 -365472 -334333 -316649 -295491
16227 -295491 -307277 -324805 -328294 -368397 -355076 -190085 -207170 -231064 -188806 -316292 -485402
16216 -485402 -323847 -356087 -464315 -499522 -427805 -400598 -419660 -473292 -388004 -356220 -440945
16205 -440945 -377223 -390138 -391032 -471238 -497686 -449352 -588712 -559701 -435368 -463308 -661521
16194 -661521 -590788 -335517 -236049 -393668 -401308 -382566 -327345 -326173 -314432 -286461 -133398
16183 -133398 -114313 -339692 -464302 -425187 -308877 -155888 -155428 -332959 -464319 -549164 -475442
16172 -475442 -402281 -303816 -316281 -258949 -352476 -727006 -662291 -459139 -447052 -426907 -550063
16161 -550063 -468785 -232433 -244892 -387015 -450795 -547991 -634918 -489288 -479583 -623009 -573150
16150 -573150 -284444 -142525 -108280 -213762 -523241 -630905 -672651 -595842 -517345 -555850
16140 -555850 -593682 -700818 -880806 -753705 -693773 -726716 -564202 -254403 -226496 -329568
16130 -329568 -334534 -479473 -396784 -235745 -358777 -338327 -370758 -586504 -724224 -436629
16120 -436629 -433832 -385138 -217607 -184284 -74427 -167284 -254067 -140004 -245003 -433825 -522196
16109 -522196 -620070 -765016 -493323 -365213 -298465 -155565 -75539 -279887 -514313 -680173
16099 -680173 -682413 -592105 -572524 -676618 -516455 -583054 -587209 -559469 -545501 -508699 -614125
16088 -614125 -276331 -164351 -293787 -239810 -325602 -564610 -738486 -745594 -544766 -423114
16078 -423114 -502560 -533141 -489950 -530755 -483102 -488193 -426839 -462788 -389065 -381945 -474623 -319028
16066 -319028 -230156 -362605 -390930 -283876 -298994 -239820 -270201 -270657 -228331 -148159 -162252
16055 -162252 -220068 -240419 -299563 -412857 -406917 -523237 -486056 -220809 115094 317490 -75305
16044 -75305 -314358 -500648 -368241 -207621 -263452 -308134 -324569 -374580 -610265 -643046 -489169
16033 -489169 -368691 -284630 -255078 -374890 -326791 -308568 -413381 -569309 -516982 -511128 -564242
16022 -564242 -257304 -225094 -340736 -473434 -571404 -580723 -422890 -484696 -439956 -287723 -275198
16011 -275198 -404183 -516067 -433148 -389731 -285633 -313058 -138974 -59723 -172004 -286875
16001 -286875 -345490 -216619 -133898 -138189 -277397 -173294 -81580 -277280 -592086 -432107
15991 -432107 -319304 -550328 -622637 -719590 -607338 -625118 -528934 -447335 -570597 -602530 -689300
15980 -689300 -715836 -493281 -326692 -234575 -255041 -366430 -427064 -488248 -632818 -700710 -790892
15969 -790892 -886962 -791618 -550305 -421813 -506688 -497095 -497504 -573000 -505457 -566557 -682152
15958 -682152 -716348 -686046 -651478 -642510 -532979 -479615 -544398 -674636 -546140 -630779 -575248
15947 -575248 -566152 -626176 -634584 -571955 -520539 -329420 -76027 -218055 -288440 -517933 -403470
15936 -403470 -168755 -95658 -120690 64208 103293 -35466 -134218 -254227 -437282 -403331
15926 -403331 -227213 -295762 -441151 -556078 -479981 -474398 -504318 -332523 -277058 -434065 -418757
15915 -418757 -520730 -508318 -439341 -508048 -369152 -385586 -418868 -301432 -315034 -430152 -566620
15904 -566620 -511125 -581063 -521409 -586052 -818645 -742874 -737441 -750230 -577203 -530855 -593017
15893 -593017 -675045 -568779 -189489 -149494 -262757 -329872 -211687 -232602 -168947 -89993 -242020
15882 -242020 -361039 -367524 -237536 -293396 -339242 -51829 13327 -275921 -385784 -124003
15872 -124003 -64812 -150054 -426472 -412874 -302482 -375279 -415366 -273626 -136016 -168635 -412060
15861 -412060 -605254 -601801 -501360 -644285 -617838 -519267 -431574 -380477 -172814 -203895 -422602
15850 -422602 -733751 -605516 -353609 -247075 -149149 -70567 -109648 -238533 -126354 -127146 -83031
15839 -83031 -83020 -138320 -282974 -465224 -332431 -191897 -177959 -135228 -165326 -292638 -340014
15828 -340014 -446368 -316223 -191150 -401781 -533776 -731810 -674914 -409162 -210128 -359975
15818 -359975 -510469 -455466 -372231 -429292 -179949 -160741 -318262 -340037 -257839 -235595 -318168
15807 -318168 -429036 -435891 -303407 -408029 -303311 -284596 -450958 -522735 -499153 -346232
15797 -346232 -345781 -414211 -282980 -321641 -548380 -479681 -287387 -71577 39463 122578 -54373
15786 -54373 -260756 -249894 -236243 -306341 -320623 -105832 88539 80074 -180890 -300672 -273228
15775 -273228 -371257 -450020 -289539 -352623 -421191 -407322 -402986 -153176 958 50470 22376
15764 22376 -56175 191427 66297 -277737 -581014 -806509 -784792 -648453 -692212 -748371
15754 -748371 -594353 -282603 -274676 -141874 -376716 -410418 -364177 -170307 -303242 -422290
15744 -422290 -425226 -361483 -358988 -559964 -599619 -391079 -356601 -272913 -202246 -196657 -329835
15733 -329835 -198199 -232253 -199836 -85671 -1913 -150496 -108962 -117259 -226372 -230981 -249655
15722 -249655 -449186 -492595 -464653 -407979 -252438 -204209 -117800 -314 -14540 -109946 -239900
15711 -239900 -347734 -448247 -485076 -655234 -671600 -673466 -856410 -895666 -656508 -222453
15701 -222453 -145725 -203094 -316850 -252549 -20687 101665 -2110 -44806 -150567 -354879
15691 -354879 -362528 -215880 -198495 -276608 -332728 -399108 -537963 -541579 -318593 -459420 -458661
15680 -458661 -445567 -505556 -262749 -215440 -247225 -210927 -209453 -191731 -396794 -463663 -386502
15669 -386502 -291209 -218210 -301703 -400719 -495375 -327439 -167466 -134314 -395221 -581561 -415074
15658 -415074 -364017 -256291 -121451 -171311 -161026 -176788 -181310 -130013 -251973 -293178 -451502
15647 -451502 -375182 -210692 -217082 -276428 -416786 -371108 -396293 -486238 -457911 -568348 -631374
15636 -631374 -522485 -413018 -573238 -565389 -444323 -452771 -649489 -598448 -549655 -420897 -391266
15625 -391266 -269723 -47659 -2950 -217159 -263180 -155164 -149581 -442586 -506395 -227853
15615 -227853 -221489 -91967 43177 86389 -64374 -156717 -223401 -461677 -389143 -603054 -831754
15604 -831754 -726588 -578659 -443810 -397144 -230462 -244006 -327922 -396509 -340370 -397984 -389158
15593 -389158 -494744 -446974 -226657 -225408 -303923 -383206 -435434 -540971 -421592 -300410 -187023
15582 -187023 -167799 -368173 -523749 -489166 -581679 -710700 -750768 -667106 -506688 -360973
15572 -360973 -389903 -307304 -290428 -347252 -439086 -377054 -329237 -427537 -440407 -357096 -170236
15561 -170236 155349 213298 -113984 -502801 -564067 -408185 -429074 -573404 -820145 -766627
15551 -766627 -643882 -498317 -109428 25320 -252910 -474834 -612165 -547841 -523396 -267168
15541 -267168 -204656 -342874 -571318 -591446 -368236 -317339 -357144 -483777 -683224 -769661
15531 -769661 -808006 -621622 -364580 -299546 -124699 -156384 -169089 -179198 -80224 -144868 -317771
15520 -317771 -306499 -329816 -294845 -380930 -505368 -315099 19691 14565 -147302 -337489 -269884
15509 -269884 -239554 -308217 -287357 -321566 -290353 -328708 -282105 -220907 -79334 31001 -162169
15498 -162169 -163412 -191322 -430824 -507395 -419988 -321137 -453932 -434426 -367291 -566829 -524131
15487 -524131 -502867 -504245 -232574 -147624 -147682 -168417 -146704 148724 97114 16917 -108564 -181413
15475 -181413 -152692 -181177 -360768 -423272 -283864 -223850 -287147 -397820 -416420 -540507 -439027
15464 -439027 -315528 44890 -120944 -37020 24168 -30562 11862 55101 53847 -100223 -233918
15453 -233918 -205374 -167061 -131723 41202 -45710 -269027 -182775 -193911 -185851 -75630 -207244
15442 -207244 -147603 43042 -30292 -271789 -288910 -291678 -278159 -295369 -350477 -469275 -588470
15431 -588470 -550058 -560713 -361703 -139058 -164629 -252577 -344356 -199757 -212995 -170262 -171521
15420 -171521 -245842 -301674 -364347 -365032 -306433 -208867 -82313 -12020 63436 -67961 -338859
15409 -338859 -287298 -302326 -530454 -624031 -505875 -456643 -377622 -537237 -605978 -624342 -462998
15398 -462998 -355647 -203489 -267199 -392027 -376482 -266080 -207318 -303865 -193905 71144
15388 71144 137511 -23684 -131952 -262413 -332699 -352773 -354435 -453082 -329515 -261215 -212558
15377 -212558 -170586 -138884 -348062 -323645 -462527 -423443 -215116 -154788 -272839 -358525 -377239
15366 -377239 -360174 -516128 -465434 -273466 -93875 89613 123515 -121476 -145683 -240567
15356 -240567 -171986 -164169 25559 69941 -64870 -20534 -91059 -58333 -193098 -390306 -393367
15345 -393367 -248872 -149897 -196710 -134576 45197 1921 -109253 -71429 -74640 -170637 -262267
15334 -262267 -266946 -131862 161571 176866 92771 32266 -38644 32196 -12635 -54911 -55083 -99280
15322 -99280 -121366 -10775 63776 -35749 -123621 -126404 -273208 -513326 -497001 -321344 -313444
15311 -313444 -421211 -221110 -120510 -453303 -691179 -587509 -350257 1065 10101 -263967
15301 -263967 -250925 -271936 -172719 -121985 -38073 24904 16040 -69942 -260581 -385448 -278199
15290 -278199 -408361 -473868 -535322 -488472 -267053 -164813 -52139 -45787 -233184 -224403 -159997
15279 -159997 -87989 -72553 -295662 -703726 -736310 -389849 -350099 -395813 -432112 -290200 -133194
15268 -133194 -251340 -431326 -321756 -8440 -79919 -320775 -400469 -205760 -264712 -448849
15258 -448849 -481144 -473558 -365932 -311905 -260548 -321900 -329709 -440631 -514135 -401934 -346027
15247 -346027 -228193 -206635 -54949 82469 59874 134708 76716 11073 30946 118468 51347
15236 51347 10804 -65782 129519 46324 -163936 -74911 -57826 -12959 -42290 -132022 -60921
15225 -60921 7748 141090 286461 531483 900440 1188063 1553779 1869363 2284524 2760026
15215 2760026 3141107 3574253 3794403 3752556 3884721 3839486 3482469 3270926 2874607 2442173
15205 2442173 1910340 1466916 1047879 779513 882386 912120 699269 369706 403586 556739
15195 556739 385842 226950 342375 435253 481516 421665 325258 270179 108119 81970 48386
15184 48386 276 216307 257836 276131 469641 182017 -21799 65711 168069 209890 261255
15173 261255 229596 152690 41539 -33148 -50688 21355 -100913 -171928 -49067 -44556 -184519
15162 -184519 -194141 -133916 -107238 -67318 -154859 -113072 -153398 -40496 -135401 -219278 -132484
15151 -132484 -1445 -30495 -205733 -246699 -195980 34220 92375 -19679 -149985 -390289
15141 -390289 -451471 -372326 -235192 -236849 -241750 -213046 -214140 -83535 -91995 -101071 -96872 -50529
15129 -50529 972 -25986 -62397 -61686 -83712 -64093 24734 -54899 -111295 -77850 -76817 -22853
15117 -22853 -256285 -307806 -33107 56093 -63917 -123516 -311349 -251335 -62294 147380
15107 147380 -31797 -174033 -145089 -112441 -124362 -220614 -135279 -168880 -118357 -194685 -262381
15096 -262381 -330374 -257382 -184917 -114096 -114425 -167532 -151875 -269601 -303115 -192366 -172497
15085 -172497 -152669 -186137 -92326 -157229 -163083 -354100 -485680 -291028 -399961 -390822 -367333
15074 -367333 -373271 -405116 -426932 -435463 -366534 -397747 -450427 -394852 -195982 -157853 -214388 -249997
15062 -249997 -18323 86808 -7359 -104922 -90726 -18601 -20522 85419 116393 -125055 -144850
15051 -144850 -111463 -238035 -359249 -323745 -215714 -189391 -275712 -299665 -96141 -20196 100084
15040 100084 -159142 -417622 -257704 -82354 -262929 -221285 -268411 -322291 -489171 -619388
15030 -619388 -507813 -324482 -193022 -72862 35296 66475 -58085 -62647 -39475 -88993
15020 -88993 -139812 -266310 -151351 -50380 -127778 -204079 -291368 -265436 -153255 -34614 -45756
15009 -45756 -95255 -235526 -285457 -248370 -220876 3191 188978 113808 -60155 -140950 -2550
14998 -2550 63670 199385 95578 75144 84733 140116 232479 285993 275347 104331 -28437
14987 -28437 -29615 -79284 -71739 -90593 -106426 -125464 -33806 -260172 -327747 -210042 -111666 21336
14975 21336 -141216 -240857 -293163 -222026 -256291 -214307 -119821 -229891 -236783 -167258 -121102
14964 -121102 -84723 -243849 -441210 -547718 -344076 -58722 -187552 -320753 -242923 -328864
14954 -328864 -466476 -309163 -277590 -221034 -242948 -216469 68692 112458 -8978 -126615
14944 -126615 -232433 -280542 -357099 -210287 -120272 -140322 -238096 -205935 -431937 -646428 -503027
14933 -503027 -344875 -236765 -284402 -312795 -309543 -362278 -454564 -501119 -290049 -111481 -131193
14922 -131193 -163783 -1217 198294 371468 415535 102981 34344 59357 -9787 31 82458
14911 82458 -65159 -191082 -283010 -341479 -273900 -304477 -47423 -88381 -323946 -430515 -317128
14900 -317128 -444701 -364761 -315356 -471841 -441541 -276754 -202362 -64899 135357 123022
14890 123022 108067 136750 110939 104568 191696 315914 203120 283322 147715 -294460 -507726
14879 -507726 -639244 -503603 -206511 -51961 -322300 -118244 -77477 -141906 -97713 -133112
14869 -133112 7106 -90718 -102923 -122938 -145777 -127643 99302 309127 162694 77671 48903
14858 48903 78434 124723 42191 -160445 -326472 -164554 -241139 -240438 -389216 -175415 40402
14847 40402 -113650 -109224 -10880 -52933 -93718 -72509 -169350 -89805 207905 232797 154224
14836 154224 220562 193192 119379 89602 -23185 -67175 -112507 -175761 -168643 -132621 -31809
14825 -31809 74889 13311 -116162 -138919 -146720 -219168 -167397 20412 265520 266359 73558
14814 73558 -26143 -79820 -23830 -17630 -232592 -424964 -577703 -473721 -362736 -214930 63405
14803 63405 -23302 -131061 -99441 -133124 -22905 73926 8978 -207289 -230174 -399862 -287847
14792 -287847 -175021 -7730 -99880 -125180 -51486 -69819 -107698 -230623 -447903 -245625
14782 -245625 -20346 -29396 -26493 34247 -10559 -10239 -144233 -134650 -183915 -246999 -52493 -7587
14770 -7587 -134544 -112516 -10849 -515 25056 73263 139778 121498 8761 -105276 -176381
14759 -176381 -226476 -147173 78784 85898 -76294 -93151 -118524 -24158 19837 -741 24660
14748 24660 17533 167356 170336 224880 139333 7099 -58868 -233804 -82152 83409 -342
14737 -342 -88365 -125376 51027 5819 -154235 37430 34830 7506 16360 71805 158251 166499
14725 166499 177239 -30379 -260094 -248676 -152698 31770 92971 7135 -226411 -327873
14715 -327873 -115983 -113493 -82783 111271 10662 -45531 148838 230892 92165 26394 -141926
14704 -141926 -250370 -18355 -19356 -169579 -179400 -123702 -119567 -211992 -183826 -948 -29932
14693 -29932 -172236 -87196 -39494 166107 165435 9311 107209 -8573 -75097 -127466 -252719
14682 -252719 -176256 -184269 -285697 -343204 -239903 -316848 -140760 -125714 -24927 46324 -136394
14671 -136394 -286178 -123135 -130565 102858 244527 432769 471581 312271 -34290 125396
14661 125396 101261 73550 35407 -100956 -183604 17387 177249 151652 85991 6606 -92454
14650 -92454 -42300 195 11615 54664 -40822 -234182 -454801 -452465 -338990 -282388 -169015
14639 -169015 -3694 20605 111167 135669 52264 255607 339372 243806 177607 26482 87434
14628 87434 208141 340357 164967 -197240 -185924 -1904 -34446 -64566 -21096 53706 108271
14617 108271 208286 202184 245108 232627 128024 116703 31523 -165700 -176000 -28182 36401
14606 36401 111773 60287 9654 60906 -65682 -188507 -123186 85944 323672 406188 101764
14595 101764 8400 -136225 -123057 -84595 178607 222442 227179 244277 348725 345052 404804
14584 404804 464005 221020 191354 259908 274817 336350 308214 72335 -133869 72740 290482
14573 290482 14488 25223 154941 202995 199877 15429 56636 -52838 -54243 -41562 29013
14562 29013 -21952 77685 96559 -172905 -408686 -356851 38231 94857 44909 -48546 -204455
14551 -204455 -69932 87590 364497 452426 435780 420136 397289 179008 42100 34521 41788
14540 41788 87765 108918 173308 165376 109147 165164 302114 294923 229728 189838 39996 12234
14528 12234 -163613 -30321 -128734 -254821 -302926 -254130 -195473 -71069 73396 11775 -19006
14517 -19006 208839 348806 236595 -33568 -205989 -174490 -174310 -22203 -2911 -39563 140005
14506 140005 184807 70321 -82626 119286 -11481 -134663 10372 225639 144384 139590
14496 139590 219027 351672 140004 53209 -31775 -116599 -171526 24123 103238 59527 68710
14485 68710 -88258 -37212 136777 -141294 -168737 -100775 -26117 -57411 -127120 32360 79469
14474 79469 137872 189498 -66621 -174276 -113752 -215006 -20909 173171 124586 247301
14464 247301 30195 -38422 75570 109384 18088 95809 86368 119914 275495 194367 161941
14453 161941 336544 427631 306142 191126 221338 318456 441284 301656 91777 136589
14443 136589 114821 59707 -27912 47980 19244 33879 52256 -105030 -198476 48213 172767
14432 172767 104943 -22645 184162 364085 214740 135297 -58948 -291460 -305937 -332647
14422 -332647 -324574 -427842 -308746 -209515 -86022 64210 141745 76940 -32246 97680
14412 97680 213904 372923 386845 252839 280802 83300 25849 129532 150244 274585
14402 274585 219390 194104 172757 43378 136820 160850 1244 -146840 23774 181062
14392 181062 41900 -78812 -27304 4027 124574 191668 164134 196871 136746 131326 23909
14381 23909 22091 63869 125536 140265 183611 83242 41326 -82324 61633 115300 70625
14370 70625 9121 180139 282227 299451 188221 187876 206537 190064 80779 115892 -56232
14359 -56232 17107 260790 566321 353856 118205 18282 -106686 -87328 -19781 -150820
14349 -150820 -280160 -175794 -101105 -265187 -162158 -37216 317408 494060 251141 62447
14339 62447 62642 100998 128156 164722 55994 292406 314986 203627 335659 375540 268233
14328 268233 267744 184101 111353 264110 480156 428381 305732 369738 365445 86738 259443
14317 259443 472751 554564 261151 210147 290525 375533 507635 621218 592815 478260
14307 478260 384738 241548 211049 336864 405195 386134 434368 450237 473605 341110 415833
14296 415833 470550 367665 283720 274180 298923 182978 246147 199748 236534 293393 227293
14285 227293 282065 476066 461238 372088 405368 479136 431874 391452 255102 328105 536411
14274 536411 524844 339060 253984 356541 542788 813252 878122 760070 785009 875913
14264 875913 779353 733369 611614 464133 475098 506598 560326 434604 380565 502621 411942
14253 411942 471429 647788 673589 599646 648202 800907 763412 485558 155945 104187 196833
14242 196833 386588 529430 536278 568388 598649 493435 345515 509189 557621 356471
14232 356471 410976 508579 840606 890112 552815 334159 415654 447741 395868 414029 460497
14221 460497 315725 280810 360174 352944 536086 426503 326072 331815 410078 521002 491007
14210 491007 601838 772375 623288 480308 560786 567352 697641 625599 696870 629579 756946
14199 756946 678402 468864 500465 492774 451129 564771 607934 725223 800008 892686 1005675
14188 1005675 894105 692570 547996 639250 669289 533650 475786 537581 479759 456548
14178 456548 827833 938676 778239 604618 445657 201683 136347 480866 870438 910616
14168 910616 812544 812971 689299 606566 507630 658373 743494 720192 607583 505905 285449
14157 285449 411665 428654 426584 544854 453846 534733 754477 924260 939390 869073 781618
14146 781618 731630 742137 705983 471838 299158 379276 540059 870866 811604 723164 886869
14135 886869 931074 902699 1054168 1128462 949099 781791 611245 560841 501345 356031
14125 356031 361046 597546 639467 774808 943490 976594 817083 782285 718819 552015 576362
14114 576362 680856 702453 747465 647246 636066 744341 718217 640447 818934 821859 781641
14103 781641 865608 863159 752377 736042 691703 606109 606903 536747 497494 609959 682246 709864
14091 709864 716650 767311 822687 692720 585178 682841 637690 737341 732307 796163 747623
14080 747623 533136 554751 541730 525797 607811 709678 866639 905026 871587 895818 830387
14069 830387 813320 842418 982434 1037658 741005 577232 625466 706704 849549 861945 757093
14058 757093 710859 855829 922274 1017234 846356 712390 889409 979933 937359 793500
14048 793500 490975 448128 618663 655345 662526 729924 794434 763641 767204 778516 602520
14037 602520 560072 575696 618236 574041 642104 861529 1007273 959368 793767 647328 518051
14026 518051 396068 80170 284760 509249 642990 757487 779061 704967 674244 696887
14016 696887 824927 851336 957264 1000965 915922 785102 773625 971082 1214042 1185785
14006 1185785 1002578 1122010 1035366 901584 902071 764626 932955 1113080 1087327 1179493
13996 1179493 1300719 1256875 1219647 1240879 1360198 1477849 1520402 1622551 1479683 1659549
13986 1659549 1935832 1961974 1978007 2133265 2354872 2497792 2541672 2657586 2768048 2807520
13976 2807520 2736204 2741760 2595280 2631023 2566537 2521871 2522068 2517963 2297675 2180062 2091785
13965 2091785 2070267 1950132 1873188 1546124 1344203 1236656 1267391 1375214 1473821 1300927
13955 1300927 1345705 1268028 1322355 1406137 1455105 1523479 1546062 1383163 1231985 1243609 966982
13944 966982 818561 886657 811770 847616 1024018 1104617 1043239 977911 827696 883240 1004524
13933 1004524 1164470 1344201 1167969 768099 795421 829768 832321 779793 904569 1096616
13923 1096616 1100658 834374 804382 873489 830508 832123 1004747 1050230 1074334 1089289 1167898
13912 1167898 1005030 993279 1088215 1223684 1222105 1087911 1147474 1220744 1046632 902564
13902 902564 1014016 1002590 947816 955929 1087819 1090801 967155 936694 1022077 1159064 1277156
13891 1277156 1378701 1442231 1552961 1626067 1479975 1288192 1085337 945533 849796 803505
13881 803505 944024 1090967 1184332 1102153 761488 720517 1015802 1135543 1163368 1120667
13871 1120667 1072331 1013636 1025042 1030231 1070112 1052385 1125878 1204425 1096041 1113070 1149306
13860 1149306 1103138 991283 1160006 1354422 1307090 1208905 1243029 1254210 1110093 1056397
13850 1056397 1045447 1075062 1128233 1348393 1431247 1450806 1304947 1162787 1204788 1071976
13840 1071976 1033869 863627 678498 587025 627065 829397 998120 1042522 1151125 1203334
13830 1203334 1133044 1139330 1222954 1381188 1457203 1247590 951883 829698 909738 1295966
13820 1295966 1538724 1587806 1382169 1335653 1302495 1268311 1214257 1217943 1435021 1713776 1741034
13809 1741034 1595116 1422058 1351622 1228054 970690 786583 1040883 1298092 1050812 779997
13799 779997 848770 890771 1185883 1234034 1159383 1090366 1108476 1229043 1235289 1323593 1516104
13788 1516104 1547415 1597921 1612259 1563360 1531790 1507669 1597774 1688452 1675815 1536011 1429721
13777 1429721 1632315 1631926 1461393 1358899 1441901 1684610 1647405 1464474 1310372 1081231
13767 1081231 1191983 1314606 1194162 1151353 1428247 1486321 1433575 1381871 1465420 1522599
13757 1522599 1297171 1206677 1247217 1154057 1183003 1206178 1314639 1417919 1365719 1428593 1534002
13746 1534002 1447720 1353605 1383173 1451384 1524957 1506958 1579088 1665786 1690452 1531061 1490211
13735 1490211 1470935 1536885 1580194 1665249 1480614 1466025 1654663 1744461 1624541 1487936
13725 1487936 1673793 1651842 1515394 1230577 1221432 1279884 1312160 1314227 1228832 1397499 1672085
13714 1672085 1667657 1519951 1516788 1556974 1531484 1509101 1541014 1654294 1497866 1598831 1830488
13703 1830488 2023176 2132891 2044464 1856384 1644562 1587209 1717973 1780930 1645294 1603943
13693 1603943 1751931 1923792 1969372 2065949 2190703 2220233 2243718 2177047 1875043 1714270
13683 1714270 1655923 1671995 1746302 1684783 1659248 1695885 1716337 1697030 2045230 2220680 2192865
13672 2192865 2001584 2133749 2106040 2150640 2101026 1940214 1988674 2244375 2354128 2462472
13662 2462472 2512538 2441378 2395762 2443231 2605533 2648907 2646293 2487755 2428282 2591077 2680596
13651 2680596 2729653 2878257 3014146 3263345 3354934 3189155 3120578 2972838 3017800 3063465
13641 3063465 3251528 3305713 3391903 3371435 3381932 3459303 3351871 3488876 3664811 3738326
13631 3738326 3759807 3600685 3621076 3899461 4174339 4334391 4391396 4232136 4109516 4198962
13621 4198962 4428596 4491106 4449555 4439865 4499171 4680269 4821655 5176784 5183417 4922802 4892588
13610 4892588 4875082 5158074 5228855 5393114 5534571 5703327 5879916 5999754 5930360 5827131
13600 5827131 5838210 6061740 6232702 6410527 6653617 6727060 6723530 6979512 7081872 7162089
13590 7162089 7351334 7608813 7732522 7904255 8174934 8246527 8421235 8726393 9046546 9259544
13580 9259544 9606419 10110122 10541524 10841349 11135001 11580311 12144907 12490573 12834493
13571 12834493 13378796 13953742 14620944 15388683 16191157 16843335 17659067 18329627 19409273
13562 19409273 20529810 21690091 22851387 24051081 25432153 26971770 28929092 31042221
13554 31042221 33299780 35872730 38702071 41887543 45206180 48940357 53136960 57864748
13546 57864748 63078766 68954134 75627620 83268639 92214284 102374679 114109637 127702486
13538 127702486 143752038 162460698 184209832 209503243 238514514 271079279 306813973
13531 306813973 345036321 384081974 422328466 457612884 487411360 509953775 523258700
13524 523258700 526124823 518088666 500480388 474666877 443066835 408084591 372554094
13517 372554094 338192115 306210177 277374432 252142992 230236191 211206800 194459780
13510 194459780 179958096 167152809 155749586 145672006 136752275 128429743 120854088
13503 120854088 113974422 107547868 101906593 96848513 92052850 87963902 84190508 80483641
13495 80483641 76893898 73935364 71239614 68844703 66356406 64008918 61833790 59879451
13487 59879451 57972237 55975145 54092335 52626793 51151823 49611503 48104658 46817934
13479 46817934 45444841 44214949 42964349 42006593 40786039 39530229 38422290 37468074
13471 37468074 36559515 35603554 34532331 33658892 32668273 31722286 30888334 30173018 29217172
13462 29217172 28398602 27598331 26695960 26096321 25484875 24937794 24318851 23645202 23021335
13453 23021335 22352545 21807617 21230689 20669375 20146445 19372935 18948113 18701810 18542635
13444 18542635 18160570 17638163 17146096 16909093 16699228 16226572 15824792 15500649 15106403
13435 15106403 14765190 14213326 13951453 13981468 13714104 13316994 12932947 12718870 12456819
13426 12456819 12120633 11752531 11524886 11368197 11086134 10849721 10728731 10557602 10284537
13417 10284537 10192169 10079237 9828701 9574696 9390710 9314616 9121089 8831036 8322034 8311994
13407 8311994 8185805 8123338 8161929 8161654 8110780 7906034 7568931 7466147 7472459 7520079 7618259
13396 7618259 7717955 7500445 7433705 7283999 7243934 6924151 6804960 6609854 6632001 6696416
13386 6696416 6633115 6559973 6482991 6160712 5955385 5987078 5923914 5800422 5826360 5785985 5536007
13375 5536007 5558349 5464279 5275000 5071978 4968765 4885120 4764354 4488299 4257725 4326290
13365 4326290 4475504 4492077 4231194 4150745 4155808 4185408 4175465 4046625 4118838 4090660 3818138
13354 3818138 3753896 3665566 3579950 3648500 3665821 3615169 3493045 3473319 3567095 3353170 2978001
13343 2978001 2949761 2994715 3150558 3235097 3123088 3237415 3293962 3283382 3210034 2969712
13333 2969712 2617867 2777598 2857921 2790201 2872196 2988267 3034123 3009314 2969491 3090459
13323 3090459 2966867 2777315 2723206 2801177 2875878 2900205 2814866 2733449 2667291 2766884 2882945
13312 2882945 2803072 2567601 2407896 2414289 2465336 2459971 2555837 2551578 2525235 2656510 2504303
13301 2504303 2352926 2342172 2366576 2534615 2602087 2737714 2797475 2720316 2586058 2555485
13291 2555485 2660916 2662340 2652836 2657729 2598385 2385226 2456898 2622407 2510972 2330361 2359788
13280 2359788 2556754 2541513 2504885 2366011 2280649 2446552 2423067 2241869 2265018 2327847
13270 2327847 2475126 2495064 2444181 2395889 2292494 2251393 2261172 2380817 2243277 2232204 2262969
13259 2262969 2190816 2147185 2001202 1899365 1794675 1948494 2118925 2299290 2298541 2257287
13249 2257287 2332976 2419859 2308204 1913393 1751531 1942151 2073198 2022349 1901373 1905135
13239 1905135 1921331 2119107 2144106 2066984 1959290 1838230 1921934 2142061 1893828 1751983
13229 1751983 1887564 2101833 2077429 2052326 1796984 1737320 1723909 1629996 1573439 1840794
13219 1840794 2042214 1950836 1802218 1587349 1614398 1680020 1670469 1729516 1855749 1792045 1710965
13208 1710965 1926559 1790007 1496018 1356389 1569965 1633136 1574315 1502292 1506016 1623674
13198 1623674 1616581 1549687 1462680 1451867 1461335 1279328 1252542 1426381 1370875 1371501 1499244
13187 1499244 1455347 1394961 1377026 1457487 1507633 1391808 1413926 1549717 1628656 1755737 1824740
13176 1824740 1770615 1865460 1974425 1892899 1696587 1546225 1472659 1471772 1525320 1672465 1520391
13165 1520391 1505125 1478577 1650963 1804760 1889355 1820257 1659428 1543414 1574757 1668055
13155 1668055 1564755 1503541 1463753 1594968 1568769 1675771 1584335 1595265 1713565 1811467
13145 1811467 1862909 1976361 1955397 1962654 1714814 1494421 1535393 1570829 1569205 1605003 1603018
13134 1603018 1616680 1606097 1574891 1663426 1716597 1671799 1734963 1997333 1801528 1837650 2061837
13123 2061837 2115992 2140030 2003792 2047890 2154411 1959956 1843242 1625443 1515437 1520709
13113 1520709 1595615 1690238 1796339 2071763 2177645 2245780 2166755 2281655 2246261 2348831
13103 2348831 2591355 2748139 2921839 3180503 3490943 3526714 3615633 3492825 3287896 3286331
13093 3286331 3144613 2959030 2932470 2795166 2683290 2650201 2418420 2376128 2497372 2448631
13083 2448631 2579015 2911043 3115348 3250315 3267601 3254551 3421109 3564714 3541251 3746071
13073 3746071 3863240 3901174 4006430 3985319 4056961 4135462 4064339 4235983 4285445 4066038
13063 4066038 4076606 4204790 4217785 4198419 4149967 4130502 4032491 3998985 3919307 3787475 3474434
13052 3474434 3207271 3191457 2910172 2522026 2496771 2564221 2546864 2542771 2480568 2345134 2233022
13041 2233022 2264938 2419275 2378870 2385245 2507715 2620675 2677132 2791286 2658778 2395386
13031 2395386 2330430 2294719 2154478 2012492 1977396 2203630 2283963 2127176 1993047 2009281
13021 2009281 1869757 1727221 1731432 1800868 1912148 1850762 1701420 1668638 1664522 1695978 1899425
13010 1899425 1702360 1600938 1565923 1794575 2034177 2056797 1989373 2039991 2077453 1868995
13000 1868995 1992465 2026953 1973843 2024599 2008975 1832863 1907334 2283616 2338824 2344787 2196347
12989 2196347 2271725 2389546 2340603 2318390 2224627 2122757 2002294 1869542 1977755 1986868
12979 1986868 1868022 1803265 1814379 1776833 1707598 1608846 1601540 1562483 1532965 1546107 1344990
12968 1344990 1428938 1441052 1576926 1571018 1537984 1706515 1650599 1594436 1633403 1857479 1765391
12957 1765391 1782841 1764037 1716666 1672607 1740826 1809051 2068786 2027536 1813803 1690822 1573003
12946 1573003 1745416 1755410 1912334 1976685 1802666 1594740 1589700 1515651 1425470 1647727 1522274
12935 1522274 1521801 1533916 1560452 1488949 1431817 1535159 1613871 1539718 1599508 1720480 1731674
12924 1731674 1868321 1867241 1666529 1719986 1808577 1842756 1821325 1703417 1603616 1630905 1521001
12913 1521001 1458065 1461757 1488963 1634180 1842757 1961773 1840156 1931507 1926660 1896208 1932585
12902 1932585 1846428 1629557 1605864 1698857 1750207 1749785 1700908 1734884 1800929 2010232 2061373
12891 2061373 1666478 1550229 1568821 1515348 1624828 1925351 1870972 1882547 1810140 1663804
12881 1663804 1615733 1659509 1749909 1863711 1760405 1683402 1762320 1906219 1926596 1810028
12871 1810028 1535872 1513607 1524160 1569216 1728935 1657784 1446227 1460523 1628148 1827716
12861 1827716 1918679 1919125 2004347 1928737 1829405 1877320 1847799 1879743 1890013 1936339 2070593
12850 2070593 1983035 1867000 1750453 1785792 2002623 1960989 1940464 1976226 1847104 1740139
12840 1740139 1777204 1713338 1791745 1997221 2051942 2078940 2148399 1911700 1608649 1729555
12830 1729555 1884022 1792781 1757280 1594143 1474921 1672076 1770102 1763655 1728150 1652326 1531479
12819 1531479 1539287 1631344 1641828 1576947 1531965 1558126 1692984 1888392 1983976 1796040 1887487
12808 1887487 1955996 1927889 1860184 1702596 1601593 1699071 1888955 1931279 1739414 1806801
12798 1806801 1858831 1722645 1561663 1543687 1639928 1694659 1701931 1727597 1683202 1508273 1754648
12787 1754648 1917437 1960964 1907546 1972742 1863095 1689178 1648918 1574782 1560509 1715960
12777 1715960 1900348 1763295 1610587 1666224 1710509 1699930 1802443 1874693 1834027 1753873
12767 1753873 1724655 1835480 1850217 1842140 1775570 1737433 1692179 1699520 1678161 1836218 1963685
12756 1963685 2037359 2150965 2171992 2048619 2070780 1965723 1956716 1900047 1876508 1811033 1848018
12745 1848018 1905340 2076506 2050325 2050259 2086897 1887330 1798530 1805118 1966210 2071430 2021945
12734 2021945 1871790 1778657 1742037 1808533 1831539 1745859 1756548 1639767 1676908 1606256 1581688
12723 1581688 1690923 1757066 1843569 1833499 1703591 1697317 1673155 1576115 1597788 1762870 1808768
12712 1808768 1721970 1770915 1580640 1541064 1518496 1677967 1973873 1982724 2045917 2143154 2064435
12701 2064435 2058934 1971070 1837569 1806482 1733049 1862430 1814087 1560784 1731108 1870126
12691 1870126 1756734 1775519 1719377 1750232 1775012 1798290 1693502 1651388 1647332 1771631 1751245
12680 1751245 1858218 1901159 1995186 2015417 2042463 1983380 1840427 1708655 1701420 1643488 1680396
12669 1680396 1763694 1874783 1881887 1703038 1683353 1684752 1762641 1786323 1937489 1719321 1603882
12658 1603882 1747598 1802249 1924613 2056710 2096148 2025058 2172510 2204134 2178908 2089093
12648 2089093 2051659 2130250 2265808 2077582 1892734 1864455 1774661 1706079 1849787 1918393
12638 1918393 2126040 1831120 1777809 1873536 2026862 2128861 2033717 2034464 2092528 2075508 1990593
12627 1990593 2022190 2047979 1948545 1757840 1866334 2179741 1991016 2076560 2161711 2209421
12617 2209421 2220986 2146526 2108152 2010892 2002927 2108120 2296610 2218991 2033213 2008982 2083524
12606 2083524 2164866 2161529 2096932 1918786 1839149 1757176 1701193 1625492 1699796 1804664 1935642
12595 1935642 1895939 2001857 2213119 2125446 2118613 2070850 2006346 2052914 1967117 1838369 1755068
12584 1755068 1717610 1864310 1865819 1918766 1929365 1767655 1649749 1532026 1670076 1774005
12574 1774005 1865176 1995846 2083840 2066042 2078646 2288756 2295734 2118401 1951175 2022715 2251310
12563 2251310 2268984 2207642 2146622 2110217 2223902 2166207 1974447 1798267 1686681 1851038
12553 1851038 1939563 2020729 2093704 2145278 2064480 2107388 2363505 2371798 2057411 1935093 2031858
12542 2031858 2099642 2198937 2195293 2081838 1989719 1981295 2094298 2284630 2220333 2344656 2253607
12531 2253607 2118240 2017801 1956329 1934708 2027677 2199659 2095206 2079261 1986909 2083462
12521 2083462 1954102 1985945 2049112 2054024 1912902 1729712 1690785 1965400 2197713 2261729
12511 2261729 2257836 2211836 2204382 2323279 2348077 2157676 2059472 2048162 2057640 2073609 2240394
12500 2240394 2294818 2109627 1957876 1958995 2093455 2313356 2257694 2170096 2096135 2102865 2253570
12489 2253570 2409295 2492228 2532149 2472193 2386513 2326507 2252650 2508918 2664834 2655269 2713331
12478 2713331 2549449 2276706 2282724 2344215 2280470 2442830 2364249 2237033 2280192 2290048 2281173
12467 2281173 2324574 2378612 2371372 2374683 2441456 2463612 2367444 2096150 2085105 2024621 1989176
12456 1989176 2011103 2119128 2069057 2084619 2165608 2188041 2153048 2165649 2372741 2500043 2263016
12445 2263016 2128964 2254532 2227281 2341610 2279020 2317785 2305981 2408710 2608143 2580049
12435 2580049 2425082 2292939 2143106 2172859 2113250 2021134 2305746 2301748 2195527 2163783
12425 2163783 2342004 2401687 2505501 2617767 2537274 2582121 2400004 2210868 2086495 2142213
12415 2142213 2049289 2013537 2150147 2148465 2242526 2233935 2161400 1991050 2017783 2125222 2056478
12404 2056478 2248861 2469597 2316621 2336192 2121288 2060177 2090111 2182552 2324161 2243130
12394 2243130 2250416 2176461 2328720 2358362 2179748 2093598 2286290 2416303 2297185 2148395
12384 2148395 2110233 2111683 1917556 1834410 1932348 1893651 2205885 2287688 2234301 2306580 2440952
12373 2440952 2593779 2658392 2509848 2581894 2655642 2555296 2415729 2362782 2563578 2883787
12363 2883787 2837133 2599891 2352482 2334607 2490902 2571631 2565585 2454854 2385190 2507083
12353 2507083 2508277 2546114 2424160 2483523 2523698 2377922 2459016 2627481 2485472 2460091 2372690
12342 2372690 2199818 2336371 2340035 2252373 2189853 2296451 2481842 2450255 2397718 2470130 2694121
12331 2694121 2669988 2545957 2479688 2365415 2398313 2385470 2287487 2102676 2158558 2376843
12321 2376843 2472944 2459317 2518435 2295822 2336792 2473951 2528365 2556834 2469355 2343870 2419853
12310 2419853 2597463 2622759 2499131 2343374 2409743 2570879 2418556 2177742 2281082 2315802
12300 2315802 2377588 2441361 2577219 2553293 2677852 2761795 2523903 2375889 2162713 2451438
12290 2451438 2665434 2704773 2665746 2534211 2556179 2486804 2462662 2554788 2513496 2578664 2611937
12279 2611937 2708485 2791565 2665408 2808440 2674324 2541549 2546257 2587611 2692052 2687688 2713087
12268 2713087 2669523 2663752 2594415 2506284 2438832 2541401 2682991 2417061 2379180 2521690 2696858
12257 2696858 2816532 2768269 2618890 2628342 2778856 2829127 2646342 2437719 2521782 2566262
12247 2566262 2500861 2492930 2458280 2451304 2645729 2577118 2635287 2679452 2871338 2838973 2824861
12236 2824861 2955652 2832278 2695213 2666447 2474301 2461820 2693953 2691439 2429970 2425023
12226 2425023 2606967 2712992 2719266 2763875 2686930 2734154 2762794 2691002 2798070 2947598 2903129
12215 2903129 2748324 2819964 3161606 2818962 2707061 2669691 2694543 2609139 2483217 2576361
12205 2576361 2854040 3078876 3056107 2855213 2803032 2980503 3149541 2860163 2709983 2721321
12195 2721321 3054016 3170170 3005510 2765842 2699257 2616187 2585119 2546007 2531859 2667797
12185 2667797 2714179 2931340 3036508 2941394 3024393 3060037 2989733 2865221 2832175 2871626 2800546
12174 2800546 2847011 3084690 3151891 3055411 3087851 3121599 3020805 3067347 3240525 3380622
12164 3380622 3495123 3540209 3507994 3582201 3447738 3279244 3269646 3285622 3259368 3201103 3050010
12153 3050010 3003381 2975366 3096051 3214996 3462803 3508326 3490608 3564408 3432533 3433742 3638763
12142 3638763 3487650 3475790 3520035 3707484 3599655 3519341 3509627 3491477 3369768 3361464 3430360
12131 3430360 3471889 3505017 3525417 3435580 3386015 3260271 3169541 3303032 3496175 3564925 3486873
12120 3486873 3471953 3595030 3698801 3715219 3749604 4000133 3947643 3877587 3890323 4003269
12110 4003269 3900461 3766804 3760044 3865770 3978728 4013139 4064310 3975598 4021510 4133018
12100 4133018 4068231 4019636 4035654 4067375 3938491 3909940 4009585 3937439 3890209 3880783 3943033
12089 3943033 3959312 4065955 4178637 4305490 4272807 4164749 4224107 4182623 4292852 4452465
12079 4452465 4497597 4409716 4551420 4860672 4964390 5120474 4978533 4907800 4850056 5036698
12069 5036698 5023606 5049553 5204902 5570457 5706551 5559695 5664092 5789534 5808439 5873052
12059 5873052 5904521 5896856 5793353 5810742 6078976 6077948 6191609 6096444 5927259 5923260 5899990
12048 5899990 5814681 5591386 5513527 5576225 5405507 5341676 5350052 5387638 5192874 5036362 4994424
12037 4994424 5107407 5439410 5613368 5695999 5681268 5770046 5954472 6023187 6122179 6438280
12027 6438280 6600848 6785327 7035976 7101812 6920768 6880640 6779956 6654822 6634872 6600527
12017 6600527 6708613 6859638 6861572 6788084 6653311 6486013 6311936 6181150 6079973 6071170
12007 6071170 6048630 5985567 6047185 6184800 5999947 5989443 5765581 5692241 5788384 5894181
11997 5894181 5947196 5873148 5728645 5542267 5414771 5679635 5779298 5752767 5663741 5441634
11987 5441634 5537844 5681360 5831621 5944677 6092628 6043401 6087355 5954710 5756516 5667232
11977 5667232 5462625 5451494 5401052 5230553 5330641 5497014 5311395 4996481 4947670 5168435
11967 5168435 5117402 4937434 5109615 5354210 5366328 5285693 5410236 5436572 5348114 5191788
11957 5191788 5246408 5282505 5264987 5341126 5402571 5322941 5173804 5067069 4906698 4973622 4850368
11946 4850368 4722931 4794128 4802807 4670745 4493710 4521179 4394094 4314854 4576160 4759638
11936 4759638 4662590 4486295 4493756 4666194 4538484 4451474 4389442 4608164 4621935 4430306
11926 4430306 4372121 4195442 4318438 4550971 4665318 4674676 4684581 4610705 4669645 4680427 4702343
11915 4702343 4677515 4679433 4734831 4684034 4568536 4741761 4741391 4675813 4641592 4532091 4297270
11904 4297270 4293333 4149336 3978136 4096179 4263923 4282371 4297019 4364212 4327392 4187159
11894 4187159 4185293 4207664 4379175 4213084 4125357 4132084 4041840 4230884 4532392 4595321 4487050
11883 4487050 4359887 4235818 4231111 4267500 4145697 4204294 4183815 3998843 4225178 4337278
11873 4337278 4260573 4159451 4215949 4283495 4201392 4197436 4111828 4172482 4209190 4202953 4279776
11862 4279776 4254317 4318576 4515861 4613597 4429107 4391805 4422687 4392315 4379627 4580747 4534881
11851 4534881 4505105 4671460 4521429 4526366 4573576 4398581 4323613 4576524 4781237 4689188
11841 4689188 4337224 4208498 4185901 4308439 4265706 4251037 4445587 4707150 4730962 4594697
11831 4594697 4726190 4830055 4758294 4624204 4682352 4750752 4800681 4977228 5157444 5082734
11821 5082734 5091992 5094004 5039826 5116693 5186721 5123996 5149835 5167153 5042501 4916239 4933105
11810 4933105 5106306 5223634 5322830 5466192 5359619 5301972 4983733 5174605 5356555 5193429
11800 5193429 5044853 5082368 5393043 5435564 5312667 5462861 5577038 5748000 5871847 5875901
11790 5875901 5690758 5569211 5432063 5566891 5722511 5892471 5896668 5777222 5877381 5931497
11780 5931497 6054785 6108616 6177762 6142940 6189833 6143037 6099545 6020889 5949985 5829792 6054846
11769 6054846 6017411 5949211 5983166 6098212 6111051 5951261 6074741 6404651 6378935 6455189
11759 6455189 6435078 6489164 6544258 6801593 7027486 6928899 7006309 6851445 6733272 6843986
11749 6843986 6931194 7022776 7177907 7325951 7420321 7320640 7198964 7083058 7104531 7039726
11739 7039726 7038858 7120749 7020125 7086198 7175106 7226643 7406568 7772746 7722861 7770120 7813361
11728 7813361 7886954 8143451 8170518 8291117 8215879 8349341 8567254 8669454 8648465 8546741
11718 8546741 8349787 8268673 8439392 8832133 8792757 8866742 8934643 8934877 8950527 9028470 9232836
11707 9232836 9198965 9308872 9537072 9717398 9776827 9698778 9772313 10060272 10292412 10520681
11697 10520681 10881210 11229242 11292494 11336861 11640382 11857309 11996019 12130559 12389544 12702601
11687 12702601 12903506 13023723 13174122 13441767 13762401 14050641 14326740 14434822 14535707
11678 14535707 14804913 14985510 15219443 15346248 15605150 15641788 15702682 15929294 16052366 16234744
11668 16234744 16425113 16753292 17157620 17525956 17847101 18279063 18535800 18877004 19340025
11659 19340025 20118832 20656060 21211903 21717623 21940158 22399596 23030832 23701054 24472695
11650 24472695 25037362 25855408 26914965 28110850 29211360 30188082 31268979 32472616
11642 32472616 33906685 35201965 36538397 37834064 39404398 41074399 42962829 44809897
11634 44809897 46752566 48878781 51065867 53446124 55928624 58704797 61707375 65104020
11626 65104020 68817620 72850259 77386248 82524951 88608137 95181238 102076510 108595680
11618 108595680 115275722 122325689 128946785 134589448 138565403 141510477 144706168 148148518
11610 148148518 151667496 155086602 157998395 160696037 163113704 165143708 167058926 168662621
11602 168662621 170183263 171679369 173046828 174342796 175697652 177240711 179137988 181043173
11594 181043173 183306947 186004775 188949197 192205487 195769768 199795726 204095064 209022847
11586 209022847 214277837 219919499 226001319 232965024 240926473 249563779 258942421 268353658
11578 268353658 277832075 287835678 298039342 308011346 316604548 323251853 329255836 335675361
11570 335675361 342256690 348587731 354127168 358715476 362168210 364162310 364432079 363472352
11562 363472352 361227827 358051427 353660583 348364332 342477693 336066943 329382630 322421963
11554 322421963 315472667 308438596 301327523 294493146 287686203 281242758 275013904 268987776
11546 268987776 263425163 258346050 253311070 248857784 244857385 240915630 237274430 234386842
11538 234386842 231972942 229634679 227498430 225744571 224371661 223249726 222487692 221835138
11530 221835138 221024935 220154291 219463619 218697324 217582677 216066284 214282150 212053706
11522 212053706 209188254 205986095 202323378 197913450 193105908 187763795 182184035 176297696
11514 176297696 170057273 163896345 158008449 152410706 147177345 142001439 137016521 132334909
11506 132334909 127809411 123692552 119907025 116192261 112654477 109391664 106228527 103087439
11498 103087439 100044557 97408619 94812872 92442805 90131351 87801428 85372479 83181306
11490 83181306 81097987 79224769 77438933 75407005 73596729 71955665 70499229 69164965
11482 69164965 67932618 66813506 65865184 64872334 64120235 63503987 62817720 62475366 62172345
11473 62172345 61782786 61145435 60044168 58773810 57508569 56151864 54852442 53555779
11465 53555779 52313716 50938369 49228536 47954021 47032505 45980670 44906433 44048871
11457 44048871 43277982 42431674 41665018 40859065 39896606 39226604 38482522 37643406 36934544
11448 36934544 36361653 35678202 35212457 34532213 33983407 33600277 33102806 32362909 31750397
11439 31750397 31301617 30797026 30474045 30160599 29806104 29314853 28957664 28765380 28538981
11430 28538981 28339448 27976864 27685313 27369743 26990846 26399746 25872894 25272326 24688007
11421 24688007 23800735 23097635 22628295 22202358 21340791 20697695 20287956 19757472 19152164
11412 19152164 18620258 18276221 17785076 17474406 17318286 17011357 16639577 16249067 16173016
11403 16173016 16033017 15740512 15395947 15038137 14489201 14316766 14156320 13924431 13750233
11394 13750233 13513959 13044273 12904646 12698554 12201384 11801295 11742676 11700501 11525795 11452866
11384 11452866 11141980 10870676 10905203 10782149 10536498 10432106 10271646 10119390 10142724 10006250
11374 10006250 10029746 10016162 9921495 9835207 9761126 9401802 9080994 8904798 8874816 8852134
11364 8852134 8741422 8475633 8260200 8205004 8171467 8037140 7881154 7778676 7825756 7843137
11354 7843137 7651566 7531182 7523950 7429784 7469958 7492326 7274270 7150863 7268566 7192068
11344 7192068 6933069 6889205 6848362 6720714 6477398 6213167 6089344 6080958 6194078 6401723
11334 6401723 6305313 6148984 6177324 6252191 6300498 6186861 5969813 5983456 5918629 6035693
11324 6035693 6018737 6060800 5833284 5649644 5658162 5541497 5545136 5455144 5475810 5450976 5443554
11313 5443554 5395415 5297521 5315655 5278391 5404990 5514681 5418097 5202041 5143858 5108372 5119236
11302 5119236 5116543 5068728 5148337 5036152 4959302 5118277 5063374 4973404 4886039 4904360 4862243
11291 4862243 4811602 4881001 4934237 5024233 4837562 4804135 4545562 4473251 4522057 4584773 4712512
11280 4712512 4687548 4470163 4395872 4403588 4219881 4047081 4035255 4097188 4046833 4078959 4105027
11269 4105027 4004944 4059577 4114131 3914870 3871568 4048922 4202264 4079667 4078516 4065418
11259 4065418 4002967 3960894 3879220 3817575 3949410 3873112 3719515 3585417 3450506 3379069
11249 3379069 3356313 3492449 3598830 3465023 3387532 3621551 3754084 3691439 3630364 3564278
11239 3564278 3471976 3456478 3450613 3554921 3876405 3842142 3601285 3359525 3399087 3617768
11229 3617768 3415618 3272313 3411540 3505980 3627290 3685948 3706478 3476699 3280694 3332697
11219 3332697 3568143 3558339 3633138 3443757 3401735 3285332 3245145 3232293 3363655 3347481 3364928
11208 3364928 3368304 3355809 3229679 3261021 3149682 3158341 3400422 3599446 3706043 3615137 3564252
11197 3564252 3421948 3251445 3231398 3346284 3360513 3367078 3354339 3286071 3340270 3231496 3185206
11186 3185206 3137338 2951041 2946725 2868838 3067656 3279838 3276516 3165999 3232058 3501199 3446313
11175 3446313 3300032 3275596 3332000 3129979 2913795 2868367 2869028 2819781 2960861 3165459 3224406
11164 3224406 3271296 3324822 3354639 3439231 3336950 3113805 3105305 3374372 3483694 3499579 3598311
11153 3598311 3498895 3358426 3262581 3316164 3385936 3408343 3435239 3472590 3527650 3537579 3647764
11142 3647764 3361739 3300445 3493657 3469057 3680189 3771176 3759846 3790617 3802190 3736054 3620475
11131 3620475 3631166 3466275 3365172 3284692 3358479 3456323 3586906 3510227 3362488 3364918 3499525
11120 3499525 3521601 3538263 3681810 3769526 3963380 3892613 3986707 4038477 3952762 3900327 3920652
11109 3920652 3930707 4091350 4107449 4052365 4137205 4235108 4150221 4223453 4290919 4381203 4286120
11098 4286120 4068361 4243701 4242309 4143869 3985593 4018055 4070076 4202748 4234438 4306053 4253644
11087 4253644 4084170 3873905 3898746 3957401 4009286 3898040 3773128 3742263 3766637 3781887
11077 3781887 3794513 3599038 3633601 3749189 3820584 3712601 3481681 3257073 3414150 3589186
11067 3589186 3719558 3696000 3651568 3854478 3879900 3626235 3675119 3725904 3602850 3704265
11057 3704265 3688238 3680657 3575180 3464360 3337269 3335981 3468697 3327286 3117762 3036836
11047 3036836 3078704 3198668 3158421 2909557 2853539 2907203 3133160 3260448 3359905 3161123
11037 3161123 2984886 3026286 3207054 3464484 3437980 3334856 3285510 3173484 3083952 3107953
11027 3107953 3181965 3481924 3513656 3436800 3473083 3390218 3293372 3461023 3648587 3671359 3784155
11016 3784155 3798712 3823427 3903759 3782518 3661396 3651852 3466136 3445603 3478638 3471777 3442422
11005 3442422 3442976 3384750 3466587 3474379 3108165 3183017 3265429 3351178 3223751 3021653 2821159
10994 2821159 2801146 2838485 2937725 2874367 2867667 2842169 2728187 2514001 2598643 2727565 2651285
10983 2651285 2416462 2297703 2189986 2276666 2348932 2164165 1967767 1933081 2068938 2303220
10973 2303220 2474230 2428266 2399943 2450341 2467853 2368474 2149519 2223832 2159081 2124992 2142653
10962 2142653 2097049 2134637 2155554 2157683 2341962 2256894 2030777 2046154 1910280 2004159 1903543
10951 1903543 1930212 2102943 1979139 1795238 1822700 1966854 2037709 1943611 1779638 1820160
10941 1820160 1994126 1905593 1944821 2004314 2199507 2346671 2200150 2076112 1960004 1938336
10931 1938336 1964877 2049873 2171379 2001810 1929546 1875231 1889874 1746632 1753273 1661157 1677594
10920 1677594 1669688 1615534 1664590 1673461 1575204 1840820 1952032 1950641 1922025 1965288 1927787
10909 1927787 1875747 1833612 1777785 1535153 1303824 1359852 1570590 1679492 1824982 1759062
10899 1759062 1644523 1576676 1446964 1486372 1633747 1592086 1498422 1431300 1437050 1461638 1547528
10888 1547528 1477357 1403094 1422590 1510281 1550707 1663331 1658832 1690349 1609665 1411866 1274566
10877 1274566 1405189 1650583 1616208 1738289 1839885 1592216 1516068 1667208 1612610 1621342
10867 1621342 1585687 1401013 1485248 1534669 1496190 1499357 1620360 1893441 2050791 2100637 1916571
10856 1916571 1779589 1878937 2070876 2133008 1925653 1762715 1755231 1685211 1586388 1556795 1527945
10845 1527945 1580645 1656076 1608045 1663579 1651258 1779223 1764292 1607884 1435317 1502368 1666623
10834 1666623 1680849 1615435 1747438 1952063 1734990 1403096 1467619 1635304 1752285 1508080
10824 1508080 1205811 1260718 1496693 1389256 1328594 1283932 1254665 1458320 1602765 1591641
10814 1591641 1443502 1356087 1346983 1513538 1577426 1385883 1257361 1244222 1318724 1592992
10804 1592992 1581185 1447229 1386140 1288532 1329909 1223120 1198071 1315537 1312111 996167 1025646
10793 1025646 1253056 1295417 1232008 1264930 1440018 1403452 1392729 1378789 1250924 1394291
10783 1394291 1568408 1387374 1101080 1239262 1324229 1282289 1119419 1250881 1486540 1472253
10773 1472253 1328785 1316762 1431766 1509452 1669053 1675640 1408824 1427334 1558791 1510299
10763 1510299 1423896 1535119 1591886 1478956 1382126 1563017 1500746 1492899 1486041 1307337 1329681
10752 1329681 1430375 1484584 1299564 1240218 1317959 1471540 1503010 1573588 1643399 1641647 1590280
10741 1590280 1597665 1389280 1316018 1428289 1655215 1581278 1373643 1358023 1384028 1435819 1354931
10730 1354931 1312266 1427670 1301007 1099995 1082147 1160636 1025355 966700 1053169 1340527
10720 1340527 1562419 1559108 1562806 1617503 1638330 1679260 1804373 1864829 1805378 1374531 1339145
10709 1339145 1450050 1527866 1438054 1665124 1693858 1656986 1533597 1477698 1446327 1309065
10699 1309065 1226942 1123296 1245179 1481536 1588479 1562354 1559962 1605950 1628918 1582364 1626984
10688 1626984 1707413 1641434 1487598 1593767 1625871 1634507 1760845 1893305 1917867 1843934 1815029
10677 1815029 1714059 1690043 1785910 1846791 1859930 1778825 1804859 1511557 1443181 1572244 1595422
10666 1595422 1599674 1930053 2170986 1986953 1944245 1955786 2102029 2015994 2072005 2436030
10656 2436030 2566460 2466000 2516264 2732442 3346774 4269742 5237277 6522458 8002280
10647 8002280 8766444 9470754 10724007 12280811 12605856 9983699 7429147 6124323 5347098
10638 5347098 4977057 4492075 4078262 4080517 4052717 4190954 4231155 4236333 4270922 4628128 5388657
10627 5388657 5842713 6117398 6593940 7005991 7413012 7922866 8557070 9126536 9848046
10618 9848046 10976129 12552572 14844592 17749010 21444354 26377213 32467264 39949485
10610 39949485 48048692 55828242 63613194 71257579 78191901 83541825 86272879 87100440
10602 87100440 88356586 92621559 101088754 112849402 125968005 139103492 152014661
10595 152014661 164650826 175766538 181485754 179326321 172241865 166538246 166737757 173611884
10587 173611884 185871786 200695995 215049962 228488187 240887316 249623814 249318723
10580 249318723 236610843 216220749 197428820 185392444 180871004 181883286 185560455
10573 185560455 189672775 193431525 196601024 196814128 190351897 175760844 156999869 140309411
10565 140309411 128388217 121053078 117082973 114962197 113469095 112092625 110177701 106615111
10557 106615111 100455560 91227306 80609517 70615017 62515206 56165124 51169998 47287552
10549 47287552 43973298 41389786 39229231 37298649 35663151 34407885 33125416 31818942
10541 31818942 30733785 29640452 28625988 27592782 26728404 26034245 25122970 24321982 23442943
10532 23442943 22829483 22380248 21758364 21099801 20357718 19654795 19129580 18586739 18262031
10523 18262031 18052886 17708460 17141542 16694487 16195457 15608591 15134223 15071479 14905893
10514 14905893 14523671 13979641 13526780 13044914 12779773 12622174 12418924 12160387 12024728
10505 12024728 11979958 11862263 11430194 10960025 10703311 10550665 10279353 10115595 9980526
10496 9980526 9745412 9504645 9214953 8978506 9005831 8906564 8724017 8467529 8329308 8275390
10486 8275390 8366663 8379650 8504192 8573156 8634092 8525254 8478142 8241089 7941403 7658687
10476 7658687 7293879 7028232 6821961 6671575 6666389 6413600 6312129 6280899 6188592 6020630
10466 6020630 5724121 5546599 5400491 5483492 5589407 5454430 5324810 5188213 5125837 5022709
10456 5022709 4963231 4960296 5098010 5233358 5135440 5153366 5104209 5271182 5487324 5479263 5361691
10445 5361691 5359801 5416610 5474865 5378743 5029046 4665952 4607886 4498441 4403652 4152965 4165607
10434 4165607 4009300 3742978 3552779 3572760 3480315 3443203 3529620 3763820 3819300 3741083
10424 3741083 3420733 3017314 2844566 2853897 2737387 2774270 2808889 2866626 2885387 2859228 2782261
10413 2782261 2810721 2583717 2413271 2324232 2134523 2456089 2651356 2570745 2511585 2427130
10403 2427130 2405737 2333001 2299694 2267728 2355089 2253495 2274753 2336938 2306732 2162041 2178255
10392 2178255 2225592 2273170 2244546 2178069 2243199 2381909 2487072 2479451 2323757 2160199 2225958
10381 2225958 2173655 2150570 2032558 1983116 2031251 1969563 1950611 1982801 1900291 1889614 1864395
10370 1864395 1901961 2033279 2129530 2156771 2246095 2391010 2455811 2391427 2334187 2305812 2470848
10359 2470848 2621675 2563592 2783089 3099326 3161607 3005441 2782084 2559626 2449031 2430044
10349 2430044 2456080 2421184 2335731 2259689 2143885 2092430 2025451 2015159 2087275 1978555 2104080
10338 2104080 2163902 1931459 1998458 2256165 2205722 2156800 2082813 2152162 2059304 2239564 2083683
10327 2083683 1792278 1930578 2171082 2023156 1857526 1727365 1880256 1861686 1617327 1624798
10317 1624798 1737107 1853557 1948887 1803772 1764107 1962046 1872257 1800418 1727810 1813989
10307 1813989 1942950 1896358 1672494 1728805 1905719 1944537 1782010 1732011 1845502 1899319
10297 1899319 1780831 1749873 1749016 1774375 1881823 1844338 1726287 1784372 1670339 1708256 1762826
10286 1762826 1817282 1706753 1547040 1585839 1649662 1782760 1807827 1622759 1710853 1676883
10276 1676883 1503594 1500447 1719478 1721189 1531311 1474500 1492599 1564653 1540326 1605899 1678884
10265 1678884 1687086 1797492 1841167 1778255 1836436 1873656 1799305 1876695 1977894 2017527 2031213
10254 2031213 1913028 1799314 1659061 1719718 1722236 1699157 1742123 1753651 1775724 1672714 1662527
10243 1662527 1564734 1478919 1417878 1313927 1248064 1188245 1131794 1375187 1447505 1314432 1299641
10232 1299641 1530599 1397674 1413071 1500121 1435490 1553657 1713746 1709480 1562112 1667857
10222 1667857 1629139 1531087 1525758 1524373 1530172 1322462 1331700 1417626 1399344 1360763 1458211 1292738
10210 1292738 1222018 1304458 1305589 1268197 1257017 1309747 1461680 1557846 1394744 1408624 1469508
10199 1469508 1482703 1501251 1442282 1470310 1299997 1155565 1200108 1370914 1539985 1456559
10189 1456559 1432559 1476481 1477773 1339177 1446759 1602487 1809170 1534095 1294176 1333981
10179 1333981 1455659 1428613 1661630 1951298 1922888 1753456 1608627 1848819 1814941 1957066
10169 1957066 1910620 1883929 1922827 1724299 1646845 1553112 1662438 1961684 2049864 2098737 2114396
10158 2114396 2066641 2119901 2348720 2313841 2109634 2267568 2236777 2221658 2249858 2413403
10148 2413403 2545219 2488751 2456967 2723133 2901685 2927962 2847066 2737360 2644695 2663667
10138 2663667 2819180 2927402 3134577 3171854 3250651 3259051 2995333 2817323 2851302 2967967
10128 2967967 2934955 2754285 2614632 2614657 2557460 2700884 2746883 2749344 2608157 2563266 2388359
10117 2388359 2270800 2065865 1809341 1920931 2124874 2123349 1854082 1850224 2018948 1968478
10107 1968478 1970319 2013108 2153070 2064270 2174077 2327638 2192310 2063841 2196659 2252135
10097 2252135 2267781 2190488 2083573 1983519 1941654 1848520 1962611 2263566 2677381 2825338
10087 2825338 2891399 2744586 2702000 2481329 2549830 2663181 2672305 2754854 2762971 2879535 2892517
10076 2892517 2756042 2608622 2499993 2663697 2667735 2648405 2777209 2515823 2224904 2091149
10066 2091149 2072420 2063467 2088930 2210952 2105519 2159877 2092259 1880905 1695741 1622492 1599659
10055 1599659 1695643 1798368 1841434 1925369 1837555 1850408 1937174 1975707 1876808 1940121 2038913
10044 2038913 2200489 2316364 2425409 2401018 2371161 2548556 2475272 2324084 2312851 2278628
10034 2278628 2095872 1914132 1838165 2119309 2282753 2241867 2095983 2080002 2184173 2178016
10024 2178016 2151161 2023487 1927989 2053044 1893162 1745893 1751635 1558744 1536418 1639198
10014 1639198 1772023 1809650 2014228 1924315 1636749 1440714 1301792 1299265 1351913 1422588
10004 1422588 1437006 1649608 1802776 1862501 1815276 1742003 1935257 2080382 2171523 2055015
9994 2055015 2197777 2182848 2154856 2179297 2048588 1831064 1709905 1725514 1752363 1643460
9984 1643460 1722083 1713249 1718601 1746060 1610311 1248458 1191221 1142463 1261239 1354222 1406524
9973 1406524 1386027 1520477 1699918 1580187 1543508 1354177 1308589 1356760 1559313 1624832
9963 1624832 1644795 1608244 1730598 1857088 1892353 1758731 1513717 1365672 1562461 1755688
9953 1755688 1783997 1868773 2035063 1823033 1778835 1386671 1140066 1340454 1570789 1702071
9943 1702071 1728174 1724697 1762342 1719036 1626602 1614618 1553258 1583224 1510531 1514121 1591006 1641702
9931 1641702 1642619 1696311 1859420 1829912 1949557 1990597 1930714 2037408 2005504 1902903 1961132
9920 1961132 1899325 1899925 2220645 2694938 2898298 2924602 2515920 2078591 2073802 1861251 1795251
9909 1795251 1647726 1562053 1790047 2050440 1945929 1741831 1713579 1824320 1706740 1693141
9899 1693141 1697013 1537655 1433040 1527717 1650344 1642530 1667166 1608661 1759338 1791698 1902069
9888 1902069 2055347 1981334 1909229 1691600 1564409 1848052 1911968 1685653 1530122 1837022
9878 1837022 1956778 1788824 1740310 1874404 2112673 2099721 1922147 1713347 1759649 1796476
9868 1796476 1964295 2069698 1966129 1910106 1888993 1989082 2056688 2116335 2023763 1911264
9858 1911264 1918369 1886466 1777358 1606266 1679128 1842356 1782075 1802450 1776989 1843078 1739123
9847 1739123 1662381 1862828 1977659 2094616 2237338 2269641 2140006 1929551 1960703 1985020
9837 1985020 2237735 2466788 2566666 2348495 2299008 2326321 2392129 2448037 2515519 2533929 2469084
9826 2469084 2627057 2557286 2567675 2526964 2660373 2769207 2787115 2819551 2917860 2984457 2947160
9815 2947160 3088227 3145304 2893085 2785589 2867967 2919773 2777523 2744722 2998516 3221913
9805 3221913 3119093 3191283 3353717 3618277 3663348 3562069 3527740 3714074 3977177 4110074
9795 4110074 4286205 4436761 4595796 4753035 4950103 5390306 5653227 5934817 6228902 6652145
9785 6652145 7008028 7261268 7442669 7582463 7867392 8104273 8231808 8638788 8992453 9191594
9775 9191594 9415764 9815075 10147693 10260724 10551311 10674474 11017165 11200962 11333847 11464669
9765 11464669 11556470 11523477 11553467 11775175 12137836 12439861 12904316 13441658 14100220 14743336
9755 14743336 15549375 16304304 16991326 17660572 18482442 19114247 19511774 20236032 20959880
9746 20959880 21486457 21651604 21720127 21784364 21751197 21912652 22037046 22172419 22178673 22462905
9736 22462905 22928685 23256642 23519157 24003933 24587267 25520421 26473084 27419886 28481861
9727 28481861 29844603 31437465 33182875 35314504 37779192 40727676 43993788 47611697
9719 47611697 51659313 55687392 60032464 64752338 69866456 75417875 81459451 87918783
9711 87918783 94914795 102467308 110616178 119421595 127916504 136356178 144184207 150978977
9703 150978977 156756999 161178775 163831377 165110868 165679221 165717279 165533147 165332655 165643741
9694 165643741 166681157 168597581 171506805 175298586 180156576 186038809 192577821 199423186
9686 199423186 206537460 213343071 219957036 226129761 231680874 236432551 240703598 244284350
9678 244284350 247502753 250279981 252612853 254887463 257729397 261108903 265386789 270955634
9670 270955634 278014542 287220409 298805274 312879081 329527060 348255644 368250942
9663 368250942 388866967 408770304 426200509 439917184 448935595 451955541 448654742
9656 448654742 439042684 424727460 407274342 388444139 370367474 354227859 339952652
9649 339952652 327643142 317695050 309965379 303940477 299468946 296250003 293921867 291950684
9641 291950684 290049670 288456538 286693063 284055109 280991700 277184251 272728173 267578565
9633 267578565 261722820 255332142 248529259 241759321 235183739 228743955 222754307 217812086
9625 217812086 213828173 210823856 208810445 207861495 207614706 207707346 207975145 207778736 207109155
9616 207109155 205886824 203498381 200147636 195557077 189799886 183122640 175434282 167502916
9608 167502916 159594557 151863460 144593166 137656670 131306166 125283900 119801706 114437511
9600 114437511 109302922 104314236 99667531 95295675 91414161 87706812 84094805 80800697
9592 80800697 77924213 75305086 72856724 70541598 68627294 66748625 64945822 63361289
9584 63361289 61715646 60334555 59126865 58022981 56997656 56138002 55310239 54406130 53435595
9575 53435595 52515134 51782342 51081908 50147718 49194236 48283300 47275376 46207125 45026907
9566 45026907 43832455 42714319 41655482 40437442 39341852 38270298 37204646 36353040
9558 36353040 35596765 34985037 34291092 33752903 33218662 33129250 33184710 33249471 33691578 34214589
9548 34214589 34664273 35006107 35101313 35112783 35063732 34621214 33791713 32465996 31106756 29764802
9538 29764802 28571577 27736154 27086837 26479419 26148468 25759038 25482484 25506962 25708395
9529 25708395 25925751 25920932 25908150 25794100 25658061 25702029 25658119 25476182 25177572 24722787
9519 24722787 24549092 24377459 23756293 23131358 22581553 22119704 21437517 20909702 20585385
9510 20585385 20491061 20315003 20292688 20767508 21881310 23708427 25747773 27975973 29899458
9501 29899458 31337260 32714216 33747598 33538252 31417090 28174938 25082548 22615753
9493 22615753 20968340 19723962 18539107 17816998 17571552 17351942 17503640 17620048 17606824
9484 17606824 17662615 17954919 18257375 18331532 18490361 18573753 18419433 18217767 17921795 17479381
9474 17479381 16953282 16848343 16306179 15313533 14612644 13977594 13257555 12680724 12295256
9465 12295256 12227840 11993162 11944142 12173571 12525277 12824857 13349327 13925035 14593258 15023359
9455 15023359 15280667 15203259 14965236 14452340 13628686 12546155 11595986 11008374 10590994
9446 10590994 10058760 9644150 9006769 8456176 8335682 8270193 8120438 7895255 7609383 7587455
9436 7587455 7529713 7352323 7084185 7052038 7142004 7124153 7135798 7388684 7516891 7482146 7297008
9425 7297008 7204723 7206514 7116589 6844825 6653676 6704987 6705184 6689877 6553047 6274665 5949659
9414 5949659 5972314 6036536 6035247 6197752 6119489 5764858 5592020 5473877 5357927 5458347
9404 5458347 5370803 5187245 5014369 4914966 4940718 4838873 4802965 4597027 4704922 4924653
9394 4924653 4991376 5165373 4922108 4862584 4760667 4752789 4824011 4925187 4880024 4883759 4800959
9383 4800959 4648721 4669268 4555471 4377069 4309849 4350783 4562041 4699877 4561634 4319354
9373 4319354 4131844 4004642 3849640 3874996 3678442 3487289 3485236 3567546 3636606 3921064
9363 3921064 4042646 3887953 3938516 3802190 3710137 3840931 3864501 3694175 3660665 3612601
9353 3612601 3572921 3472809 3341238 3358052 3279660 3324856 3453429 3484733 3357611 3213520
9343 3213520 3181289 3052689 3121011 3199801 3355433 3379033 3420616 3341205 3382118 3231665 3359717
9332 3359717 3462813 3242523 3041963 2924976 2785056 2781462 2991951 2880821 2691942 2632670
9322 2632670 2645138 2458759 2490985 2821946 2947495 2980639 2924699 2964326 2820579 2810931 2957252
9311 2957252 2907868 2884182 2728789 2641004 2604559 2481281 2482254 2432487 2531101 2528273 2512049 2546950
9299 2546950 2452978 2400359 2370013 2503155 2631601 2597123 2442291 2513903 2502682 2443944 2557286
9288 2557286 2535271 2777412 2958516 2809695 2960488 3095191 3132407 3182910 3181876 3096886 3109549
9277 3109549 3110858 3004622 3167684 3439055 3679761 3580252 3570701 3504031 3427045 3382272 3361862
9266 3361862 3216010 2999781 2841948 2865866 2846800 2729983 2651708 2606686 2513279 2786899
9256 2786899 2746797 2825565 2702174 2456439 2318907 2300373 2232465 2225544 2203460 2222447 2321385
9245 2321385 2418792 2395965 2568671 2628457 2497536 2332833 2447869 2591871 2699792 2787768
9235 2787768 2733117 2968772 3477179 3863923 4264169 4492772 4670932 4765732 4708834 4739024
9225 4739024 4603255 4494336 4361223 4074894 3789412 3583233 3360672 3201613 3064319 3034343
9215 3034343 3125684 3102614 2883717 2735779 2503003 2296180 2252409 2433094 2596226 2589199
9205 2589199 2512097 2466966 2528138 2566056 2434519 2270645 2167667 2251172 2404578 2427804 2471120
9194 2471120 2551282 2679432 3052117 3267731 3728966 4263693 4555391 4886915 5205360 5202089
9184 5202089 5173506 5200988 5027530 4564075 4060019 4002609 3693460 3266551 2811516 2642332
9174 2642332 2855376 2848833 2897579 2623676 2425912 2308164 2266416 2272316 2366790 2195414 2119811
9163 2119811 2182362 1902269 1633580 1739508 1843408 1942184 2321358 2464056 2342272 2363228
9153 2363228 2459995 2538952 2626304 2848300 3036292 3311128 3710349 4216698 4551802 4841920
9143 4841920 4982737 4900774 4759465 4533324 4117097 3368453 2929315 2647696 2419714 2308712
9133 2308712 2337681 2383268 2243668 2036882 2162751 2372623 2476332 2204932 2005120 1843181
9123 1843181 1958982 1806714 1625668 1584424 1726926 2020086 2097122 2095333 1873808 1869189 1765533
9112 1765533 1733893 1755143 2085318 2361970 2622154 2732559 3055929 3409233 3740698 4216672
9102 4216672 4473589 4484146 4441729 4232615 3737764 3093861 2674553 2458613 2317522 2169644
9092 2169644 2091920 1923537 1827568 1947932 1707625 1424324 1359505 1414876 1375066 1576442
9082 1576442 1719231 1740858 1580964 1415504 1394127 1429840 1477054 1670960 1622182 1449349
9072 1449349 1464689 1616864 1534244 1472988 1556056 1720727 1770573 1815568 1944912 2127109 2496103
9061 2496103 2691504 2724613 2819370 2825465 2835665 2536079 2139004 1866305 1655148 1293920
9051 1293920 1138958 1145239 1129296 1039313 1183931 1259708 1135086 985289 821362 859599 882277
9040 882277 885670 1062702 1087236 1161994 1174527 1107062 1058992 964722 948613 1028639 1140229
9029 1140229 1258740 1189970 1129874 1080675 1144801 1081244 874727 1137239 1263940 1198734 1161787
9018 1161787 1180890 1393319 1695402 1674489 1196266 1061512 1119485 1079104 862728 714995
9008 714995 692974 694378 995232 1149014 1043175 1020545 876324 792234 985195 953965 887197
8997 887197 756287 622775 713213 915794 975179 904136 921783 896245 930075 969556 830760
8986 830760 601167 695235 599739 414250 493387 728290 879451 799567 752982 806575 719546
8975 719546 665017 676434 690108 669035 631543 721846 561122 485650 605850 756894 625445
8964 625445 510219 533917 474890 571389 568271 740420 738740 641497 495739 448392 554642
8953 554642 578512 644714 608889 834601 848855 712448 583557 627279 468146 331262 402444
8942 402444 454114 491994 528468 739336 891694 672761 530496 315280 189444 374903
8932 374903 480518 377747 474028 538729 614761 724595 604739 620881 695989 683859 765554
8921 765554 613499 495751 434466 595694 558069 414492 610948 755429 720969 646433
8911 646433 477991 481245 597658 634485 751626 778656 749900 691679 692107 548975 496736
8900 496736 616613 590144 621166 640401 583779 618711 545012 406591 368146 443438 563011
8889 563011 573866 697139 728103 569068 539572 521423 547415 711598 871394 744355 600181
8878 600181 313601 260471 453378 497841 401252 486637 487593 476958 262087 302238 282625
8867 282625 263370 354940 362208 328595 359931 537542 584095 636182 623317 544417 498693 393261
8855 393261 392500 405060 257094 313721 473313 652097 675014 632798 467987 284726 348286
8844 348286 352670 297640 313772 537277 735989 885728 900777 704255 810050 735618 556016
8833 556016 537635 394185 508255 608010 583880 428932 449727 532233 519657 684123 658924
8822 658924 486042 382772 405521 329477 277722 365774 345734 293807 302534 380055 552944
8811 552944 665515 507227 516561 522265 339429 290906 521713 779619 947566 798636 688074
8800 688074 556404 409777 251544 436746 396764 240864 422827 421614 271968 226831
8790 226831 -77841 -209354 -64741 193969 416748 536706 457678 331282 347496 283907
8780 283907 -14012 62795 207796 345424 355552 109214 89560 285439 375987 324787 197533
8769 197533 76825 7727 79747 264619 365248 555552 469820 462241 384075 214900 291124
8758 291124 156794 29421 290224 499778 408710 268093 -1056 -55272 52050 -6105
8748 -6105 193347 366036 500522 470109 600936 610408 418247 429510 506775 437227 358979
8737 358979 383696 616786 538292 337201 394609 276217 37752 27000 202083 401488
8727 401488 503126 280636 175131 220085 295849 417885 545826 584714 496654 470311 552325
8716 552325 487825 591110 680035 575327 426536 292860 263338 147731 161300 103818 -137523
8705 -137523 -185773 -25992 143342 119952 51058 267018 239261 76470 44222 135060 247718
8694 247718 119342 -215173 -256628 -202322 -157615 -2022 122574 216812 219735 285678 54781
8683 54781 -786 201348 425269 398654 427822 382369 435396 261579 120671 3115 -24126
8672 -24126 197679 357172 458222 604478 768489 653802 481378 322801 377911 424302
8662 424302 330847 194477 227588 152540 133870 232465 243110 63815 191263 291409 196575
8651 196575 166792 250420 434149 394178 220554 143947 147672 305385 355669 600914 548706
8640 548706 422102 265038 466477 623860 484494 399831 422958 540474 500732 463579
8630 463579 455226 360243 417564 497376 480221 508382 530797 667763 813540 775585 501152
8619 501152 386955 283318 191615 359830 443469 458482 499183 506596 244688 213620 522181
8608 522181 772113 669230 507601 466124 316179 276618 566000 874071 1005645 929536
8598 929536 928099 1024012 1029429 938359 787595 752098 922453 951076 1096684 1180244 1484803
8587 1484803 1716560 1908835 2293070 2438499 2543673 2567251 2679667 2823035 2438872 2048015
8577 2048015 1889942 1714388 1455432 1386395 1278110 1109181 1129572 1096979 1181329 1269589
8567 1269589 1255920 1344022 1627486 1819590 1627692 1675570 1867819 1930129 1796614 1758568
8557 1758568 1667380 1520845 1480203 1397337 1055881 837019 985368 1072133 1160805 947948
8547 947948 734590 790234 936347 1054926 1189434 1433050 1837715 2161033 2368579 2499221
8537 2499221 2491358 2321980 2082902 1789310 1387398 1136946 1187888 1158163 931389 717075
8527 717075 646093 511880 472802 380314 484479 731403 903952 802035 780298 876423 892247
8516 892247 1015376 1038603 767983 752052 694919 789092 655921 574906 485426 314440 440256
8505 440256 276621 125217 129481 73626 53301 32098 -46607 -6661 134006 295717 213637
8494 213637 30326 122905 277962 214455 143899 245458 430903 418612 266482 221079 276575
8483 276575 283762 278895 159978 243369 372695 288236 170824 243965 481489 442832 301009
8472 301009 191986 232899 429766 627556 514651 407515 503075 656153 636984 390477
8462 390477 265515 206152 323974 414738 371536 561598 513569 521322 638632 590639 513241
8451 513241 515051 583540 430612 222724 340289 643356 746594 567150 439166 579868
8441 579868 468267 343931 447485 463838 412224 150161 291872 369434 254651 94548
8431 94548 214457 365965 540877 467782 455754 522773 649633 589259 545442 647841 706859
8420 706859 677976 562837 557626 695614 700985 590905 474479 340566 284185 337793 535010
8409 535010 611512 470672 464260 537760 676213 756901 932318 1069985 934790 543207 231396
8398 231396 154352 290711 413668 353683 394262 415235 207896 114516 87949 158323 79511
8387 79511 243741 233930 322946 133727 -118028 -119407 761 37054 4753 140638 39902
8376 39902 69932 183044 159475 -48239 -301957 -284481 -234623 -99941 98507 63043 152635
8365 152635 116651 -28873 105745 56033 -117770 -79123 147751 127842 138183 31528 -128767
8354 -128767 44589 188153 442474 483521 166075 129347 271174 325009 167887 90507
8344 90507 254658 334420 260395 245589 186377 202792 -15536 -174718 -303252 -368807 -417362
8333 -417362 -384769 -231319 15562 585 -8799 -84432 -58615 92092 77975 90370 311832
8322 311832 358283 347044 257559 360751 339089 227820 34829 -68727 -77171 32137 -131910
8311 -131910 -198153 -57551 28848 21688 -51954 -113007 -63930 174232 310702 201707 80022
8300 80022 117658 45667 106199 40510 -198308 -214410 -81043 -81200 -13096 11964 121905 157338
8288 157338 212956 218159 48815 90092 199795 97824 31828 -173586 -160197 -56389 94614
8277 94614 -26294 14183 46992 -100357 -91272 26342 102038 55186 -53050 -64964 -126003
8266 -126003 -102996 -280363 -108575 -4184 6576 -177724 -227515 -159809 -21474 -24555 29090
8255 29090 -25432 -153374 -61333 -55183 -29228 232968 312420 400461 184615 -16001 37152
8244 37152 163618 227416 261880 308909 339063 260393 300098 239647 124377 57902 165881
8233 165881 257071 178569 -47018 -175732 -153342 -247712 -31662 248159 208352 270084 211573
8222 211573 258433 339543 343994 214521 100651 196704 140190 16445 16852 31983 1716 141525
8210 141525 95108 226954 246784 346782 570352 932797 1137971 1436766 1654863 1981804
8200 1981804 2610650 3114376 3315463 3631691 3779565 3748516 3396040 2808451 2333388 2086691
8190 2086691 1764520 1348541 1144395 1208494 1128927 1061757 1065209 996973 1011684 964007 790407
8179 790407 743490 747088 772424 889345 655805 580182 802377 829021 673507 658047 631607
8168 631607 766769 765095 571243 496129 714131 1032033 1282961 1605980 2016263 2310459
8158 2310459 2747066 3148241 3491588 3664717 3774277 3812173 3538310 2987726 2579194 2158843
8148 2158843 1841656 1795117 1491578 1323506 1240662 1058041 825938 1038287 1001185 747769
8138 747769 795794 835565 893701 887244 779883 570637 580512 589810 587494 620020 528645 352204
8126 352204 349792 242093 208425 177875 239281 269038 333785 396582 471027 642742 577441
8115 577441 510126 693384 541117 307588 302120 330585 480086 560156 619614 510127 538712
8104 538712 562307 337724 200294 309621 304859 151149 1150 5220 149513 290184 254642
8093 254642 443217 530160 486437 516298 431382 317431 199791 118039 23648 -116473 -99823
8082 -99823 -13276 -51751 91245 224340 143336 41194 -54019 -34743 -50549 -168665 17045
8071 17045 111309 133263 167835 237473 276615 65099 -57459 117628 22042 -40656 -54559
8060 -54559 -61695 -66839 -287987 -484409 -334184 -121751 12645 49417 39666 164632 228221
8049 228221 445166 494187 405676 557806 668237 665241 486941 386489 237781 294171 703586
8038 703586 835650 786194 743413 698544 528262 594547 608409 716682 802271 915396 886161
8027 886161 716355 608656 566014 713609 713316 784484 1102593 1222982 1006957 919604 803003
8016 803003 616885 628756 595507 532374 762126 887751 826937 1022280 949122 822276 783979
8005 783979 767094 623732 526744 569473 565593 590979 602573 429781 532321 629117 869814
7994 869814 938001 916432 724394 749498 815061 742558 731334 817914 793154 768607 890637
7983 890637 820293 867782 1036570 933963 947725 995506 1082868 1389081 1522117 1362692 1143346
7972 1143346 1071290 985247 979697 825534 751023 1051045 1177157 1070215 990075 940422 1011763
7961 1011763 950227 926329 837952 926501 1125035 965715 754170 978938 1312187 1341397
7951 1341397 1429708 1434940 1611577 1726822 1661551 1866653 2370896 2753110 2889002 3084564
7941 3084564 3743604 4589192 5661771 7343270 10281751 15084103 21828194 29855615 36889233
7932 36889233 42007679 46932306 53294397 57849822 54239385 42111441 29454507 20767285
7924 20767285 15683596 12742702 11024290 9896076 9118366 8475288 7998497 7554635 7196096
7915 7196096 7218680 6941082 6537356 6108536 5607546 5358731 5109300 4970301 5049997 5093381
7905 5093381 5165211 5379365 5436225 5371817 5209866 5408429 5904780 6297615 7020217 8608654
7895 8608654 11140292 15152742 21107041 28473425 35224693 40071590 44551609 50123915
7887 50123915 54902379 53496374 43926018 31866251 22696246 17287735 13893853 11847821
7879 11847821 10848822 10129179 9404708 8765165 8272263 7903762 7503451 6876094 6503617
7870 6503617 6181675 5686294 5322670 5028893 5010457 4867568 4683032 4461180 4298672 4077629
7860 4077629 4062224 3872509 3808441 3741464 3415532 3322909 3241697 3039963 2762645 2781685 2605912
7849 2605912 2519624 2614069 2702789 2711936 2703337 2617026 2398844 2402060 2465630 2223259 2103359
7838 2103359 2321801 2261540 2105712 2095799 2133248 2143308 2258109 1941598 1811508 1844310 1705238
7827 1705238 1513114 1575773 1670275 1765959 1729830 1493965 1499614 1574559 1432785 1304514 1334549
7816 1334549 1236077 1247793 1297299 1266606 1116281 925740 795076 646583 592879 706411
7806 706411 699727 630347 601901 449009 569962 490964 438236 498421 766147 1082389 1089619
7795 1089619 944652 962914 971050 731803 724467 752894 725753 944903 841146 689249 838758
7784 838758 1102257 932332 649277 749802 925889 842899 682158 766857 648951 346403
7774 346403 300645 219907 149566 285495 421664 452283 494858 382979 321882 198036 244809
7763 244809 530039 457180 481924 483924 368100 369457 496314 612674 649205 537680 354799
7752 354799 111608 193763 401643 424139 271813 284052 247331 227010 465191 502315 801651
7741 801651 853658 743834 252263 160580 288333 328703 232244 288687 75048 33645 50332
7730 50332 100812 117686 194761 307408 536585 490665 336314 286839 385569 417384 412003
7719 412003 515167 536646 435795 221839 148666 19335 -30559 -67961 -293714 -261677 -352345
7708 -352345 -282512 -222182 -306755 -162316 -76522 -163510 227216 421520 396675 117632 -134930
7697 -134930 -210505 -362664 -273994 -188071 -30413 -44666 -145552 -58030 -221270 -287525 -207389
7686 -207389 9922 126281 115540 -10373 -145860 -181587 -276322 -341820 -392558 -208725 -117323
7675 -117323 -64034 -159938 -182171 -351910 -460872 -343451 -148610 4936 36139 98374 222592
7664 222592 135626 84483 29263 1906 -23959 134265 197253 199861 19260 16182 20884 -67919
7652 -67919 -41015 78442 -34260 -81278 -81415 -20144 -218256 -363629 -169872 -118373 -113977
7641 -113977 -55602 -183029 -194084 -246112 -148047 -120702 -158528 -144069 51416 -27996 -88102
7630 -88102 -86989 56575 -217368 -274210 -272263 -98744 -183033 -401892 -340448 -52538 -49407
7619 -49407 -124903 108713 281980 350599 207316 285121 267670 160077 66943 -176588 -254374
7608 -254374 -293690 -150879 128749 265241 80936 -10180 -27351 14875 86335 67397 -7902
7597 -7902 81521 200468 126236 42822 78796 69522 -1164 83581 208267 130383 138511 86663
7585 86663 1299 -81700 -167110 -213835 -351168 -284384 -473414 -390362 -224847 -162436 -105003
7574 -105003 -175433 -256277 -329967 -564336 -486982 -332072 -145692 -140264 -127265 -105860 -7994
7563 -7994 117721 48268 20197 100736 -17601 -76032 -78084 -281111 -119669 -180742 -287037
7552 -287037 -75624 -63659 -159593 -194827 -303923 -332104 -154301 9802 47589 99891 -32231
7541 -32231 -132299 13829 28213 33403 -57054 -34630 55556 114177 255593 304699 177741
7530 177741 3595 -152741 -279721 -432666 -175695 -35416 -128180 -156299 -162362 -49384
7520 -49384 -11464 -52960 -197681 -140100 87401 42652 -71112 134421 232304 164904 136558
7509 136558 87 42962 -7671 -155709 57819 37818 -134957 -263951 -293206 -345184 -358420
7498 -358420 -359303 -315398 -296248 -303251 -157603 -64040 -69366 -77278 -27200 202900 311863 365920
7486 365920 252073 150160 35139 -80571 2819 -137158 76784 157039 -58390 83309
7476 83309 269970 325030 223453 120477 122362 113020 -204168 -206637 -67817 -62269 -128308 -41901
7464 -41901 -150370 -199974 -26219 77315 -46529 -261869 -366814 -349055 -411528 -461788 -368731
7453 -368731 -348968 -215745 -200948 -299969 -293755 -324102 -461494 -447598 -500861 -283118 -153912
7442 -153912 -376087 -537737 -642964 -527307 -346066 -307742 -268734 57059 50349 -259145
7432 -259145 -311912 -159001 -121730 -157620 -326770 -371672 -495962 -594479 -620336 -669137 -435524
7421 -435524 -180165 -107374 -52906 -57389 -52251 -105394 -166535 -82818 -152524 -373660 -450012 -402647
7409 -402647 -365443 -346264 -436193 -373247 -191504 -180339 -234552 -251748 -365989 -264477 -289457
7398 -289457 -458861 -472192 -277665 -268072 -136103 -178323 -241449 -266534 -260665 -497732 -360280
7387 -360280 -236208 -243645 -164756 -91510 -340766 -410921 -338075 -344979 -449813 -323868 -297087
7376 -297087 -227892 -132518 -23838 -44182 -301465 -501565 -450187 -507131 -408344 -275321 -94440
7365 -94440 154371 134013 25257 56973 118404 66088 82514 164590 301301 227161 -35613
7354 -35613 -202634 -319861 -331963 -267794 -254641 -293224 -230648 -91652 -132420 -320904 -426039
7343 -426039 -430703 -418646 -501666 -361738 -68171 -118449 -133078 -146962 -124972 -65459 134134
7332 134134 130691 -18763 -237715 -196808 -289938 -415892 -702383 -722017 -544645 -491909 -299494
7321 -299494 -173005 -293298 -383901 -527458 -554439 -414934 -309667 -395358 -484217 -443130 -345797
7310 -345797 -358955 -182561 -66175 -85252 -222648 -437632 -473310 -326508 -76352 1623
7300 1623 -39497 -207789 -368101 -504355 -441535 -100709 85655 143514 -154030 -378353 -478810
7289 -478810 -566967 -554153 -622445 -593143 -694896 -460389 -293806 -254831 -119450 -132533 -127885
7278 -127885 -199475 -140161 -155025 -225818 -277304 -480128 -362114 -246266 -428440 -456279 -246375
7267 -246375 -101204 -100625 -205564 -119643 -327868 -453115 -417141 -358638 -306172 -455762 -514726
7256 -514726 -390962 -365257 -455569 -333288 -346776 -367670 -413304 -360764 -429443 -499130 -412806
7245 -412806 -101827 -189501 -284123 -321263 -264825 -200132 -179689 -230860 -239743 -100733 -149309
7234 -149309 -349844 -436467 -293459 -267333 -202379 -139683 -106791 -256837 -328650 -292198 -96568
7223 -96568 40568 -173358 -129638 -326207 -508002 -332858 -61247 98585 84108 -149484
7213 -149484 -376578 -397951 -361667 -251585 -256731 -388071 -504730 -469171 -216985 -174745 -372432
7202 -372432 -504164 -401670 -260726 -261373 -294883 -216800 -82483 -134056 -214569 -368039 -265866
7191 -265866 -133845 -293140 -434927 -663512 -596460 -550458 -479543 -432961 -337277 -483365 -403599
7180 -403599 -301148 -440986 -548368 -383282 -450957 -596531 -648239 -803308 -767066 -725825
7170 -725825 -832425 -899321 -844685 -543763 -399846 -474715 -564788 -508905 -462734 -475005 -623159
7159 -623159 -612299 -647813 -521281 -478199 -476264 -400333 -409198 -419921 -280127 -111733 26394
7148 26394 186143 191851 248847 -18482 -107801 -165135 -334080 -257663 -87011 40846 -9092
7137 -9092 16734 -74578 -308177 -401998 -298604 -237682 -32485 163689 118985 127086 -77253
7126 -77253 -167177 -124469 -129182 -338287 -352522 -176730 -191340 -320392 -400226 -435930 -653381
7115 -653381 -591103 -334917 -172974 -25205 -145311 -438542 -405641 -159601 -32221 44925
7105 44925 -121997 -364124 -480616 -521295 -594349 -579646 -418221 -364250 -449435 -443725 -316032
7094 -316032 -181833 -151758 -104248 -196224 -397549 -321104 -138235 -306531 -506270 -518136 -330954
7083 -330954 -422084 -261521 -264999 -258733 -268718 -244418 -249238 -319642 -213232 -371625 -194263 -100979
7071 -100979 -168808 -121341 -176438 -320421 -404814 -322129 -442034 -296961 -95941 -216415 -141858
7060 -141858 -150761 -262001 -336889 -298718 -401959 -582190 -445250 -364449 -412513 -432830 -423672
7049 -423672 -498027 -350759 -126107 -89483 -244406 -251410 -278373 -173263 -47739 -141012 -281414
7038 -281414 -566885 -637460 -545234 -350210 -360784 -449381 -494910 -485016 -244265 -109305 -51076
7027 -51076 -97818 -247778 -348366 -420002 -373252 -116910 -278541 -360292 -368335 -446106 -510615
7016 -510615 -724514 -658928 -551161 -453515 -262354 -113692 26231 -57072 -92376 -238114
7006 -238114 -326124 -260886 -202435 -234364 -198031 -243436 -421281 -269475 -223657 -108721 52253
6995 52253 241165 17032 -133390 -233113 -276748 -569553 -596327 -437784 -558762 -574079 -572052
6984 -572052 -506078 -498660 -406010 -325671 -203453 -363254 -535646 -599016 -474399 -378625 -404801
6973 -404801 -431574 -387121 -231491 -270368 -240946 -296255 -330531 -253501 -120043 50689 263126
6962 263126 59620 -178646 -199403 -162778 -316142 -333734 -222307 -171301 -130966 -229485 -277726
6951 -277726 -170771 -219280 -130156 -106472 -193552 -290294 -163885 -24573 -139227 -296455 -431247
6940 -431247 -679775 -587956 -538437 -513168 -193544 -121809 -217865 -181541 -284259 -326252 -256442
6929 -256442 -193672 -203166 -235766 -209582 -440222 -410553 -80440 4207 37849 98894 -124635
6918 -124635 -313354 -221743 -126749 -202671 -301150 -457219 -621447 -762223 -613007 -449859
6908 -449859 -397644 -251236 -74284 16909 -249247 -242076 -125678 -101471 -151779 -465187 -502662
6897 -502662 -464376 -307000 -203721 -237961 -88868 -98714 -246096 -329156 -318921 -278804 -383487
6886 -383487 -287003 -409593 -419917 -161791 -179670 -88502 -126930 -84042 -135975 -348171 -339959
6875 -339959 -140907 -183697 -335688 -456520 -358886 -353406 -368177 -341849 -278215 -413330 -305802
6864 -305802 -346411 -435887 -514663 -477769 -288323 -239422 -260123 -195590 -230198 -254376 -175374
6853 -175374 -173358 -115377 -136480 -220982 -244298 -181972 -25659 -42538 -312243 -428526 -510755
6842 -510755 -412464 -321186 -277966 -335005 -363160 -444721 -493431 -380702 -216853 -103244 -145339
6831 -145339 -88251 -74316 -158360 -302852 -215633 -80721 12983 50736 -34602 -171332 -347239
6820 -347239 -454311 -462509 -575120 -577936 -418429 -483436 -627936 -636335 -460490 -239279 -165425
6809 -165425 10796 -85648 -109412 -275150 -250678 -43689 49578 -171019 -330677 -431283
6799 -431283 -337000 -212347 -297575 -345921 -250335 -124028 -233540 -241025 -281702 -362789 -503291
6788 -503291 -441717 -447816 -18893 172525 -29654 -316100 -531158 -461039 -340742 -149985
6778 -149985 -104781 -212704 -254691 -224840 -20459 -52032 -29878 35975 -30248 -186486 -295006
6767 -295006 -250382 -330980 -400880 -322759 -395514 -368617 -269681 -162109 -217423 -357765 -341206
6756 -341206 -94240 14903 -124248 -147412 -104859 -61217 124216 102432 135211 192810 346075
6745 346075 192853 101574 44924 -69785 -187674 54238 119271 204341 33978 35118 89787
6734 89787 -1925 -27728 -150929 -211899 -335781 -101202 115781 -65361 -380918 -400765 -388314
6723 -388314 -417145 -416375 -531856 -364048 -329629 -393279 -333713 -550055 -556068 -350208 -339474
6712 -339474 -421189 -384152 -335440 -224979 -68680 33835 -26999 -268738 -401792 -346680 -255656
6701 -255656 -243900 -70363 32423 59853 -11118 -85410 -113855 -123813 -57646 -121453 -245349
6690 -245349 -257259 -358285 -389428 -403107 -441948 -352015 -233471 -264122 -321040 -326182 -253138
6679 -253138 -393001 -486871 -515830 -411997 -363725 -328213 -339646 -190005 -135600 -243449 -236330
6668 -236330 -151098 -274393 -408744 -437647 -357820 -348809 -202531 -206346 -323162 -443421 -491464
6657 -491464 -660503 -712695 -449656 -243706 -272172 -351280 -281405 -317629 -498848 -674551 -622600
6646 -622600 -498780 -550110 -625386 -647697 -742732 -665430 -469801 -262403 -418134 -667737 -777435
6635 -777435 -765575 -609691 -485657 -373047 -307247 -242550 -288034 -391478 -416093 -496386 -674623
6624 -674623 -635154 -477593 -389944 -463143 -372003 -280534 -235181 -330328 -398935 -368364 -323523
6613 -323523 -249927 -185060 42241 308043 333585 -8060 -279862 -272274 -328841 -395062 -297501
6602 -297501 -116064 7310 -101847 -66470 -32813 32881 -89389 -159746 -148849 -70015 100308
6591 100308 34917 -233068 -280875 -112635 -65238 -182286 -308383 -219700 -76909 -43131 -61873
6580 -61873 -90419 -103180 39300 -66409 -113065 -148411 -29571 -70373 -134614 -112742 112086
6569 112086 171941 80332 104836 66016 -89084 -32484 -135654 -146124 46057 192623 280659
6558 280659 362435 381250 542139 555833 491868 399757 355779 263365 120851 316380 522535
6547 522535 592861 636154 592858 611700 605035 637840 589558 900425 1031182 806147 744999
6536 744999 892471 1010037 1074728 1088615 1197282 1301620 1483032 1774037 1954675 2127017
6526 2127017 2241498 2531981 2918970 3159397 3413267 3961486 4323530 4656781 5000724 5167828
6516 5167828 5488095 5566086 5514775 5367206 5228882 4988720 4714305 4282953 3946543 3700202
6506 3700202 3406311 3026306 2911479 2729560 2579132 2432167 2454651 2045693 1842723 1764420
6496 1764420 1727126 1773363 1512096 1316107 1132601 1023526 1002064 1092136 851731 1097343
6486 1097343 1306698 1167620 1017912 986284 987498 978274 930265 902764 859004 836195 760463
6475 760463 656767 527603 373342 180262 198134 214692 79978 184394 227272 336911
6465 336911 404878 292814 218505 178663 173144 209123 214398 201130 203857 213325 186307 163519
6453 163519 176585 300562 345742 388545 513089 661417 529575 315290 203420 91597
6443 91597 15202 -7688 52656 68026 10469 92970 202757 271349 72154 45914 105026
6432 105026 41365 -195546 -192094 -4562 -38154 -21461 81497 41830 109436 251285 346617
6421 346617 421464 250841 170087 136036 -94714 -226975 -133796 64222 129476 -18719 89913
6410 89913 21917 -76235 -243474 -213626 -171836 -284287 -260129 -323298 -164969 -1627 37931
6399 37931 134388 279839 2764 -61877 -85038 -66719 -64153 -54872 -131485 -254454 -201077 60699
6387 60699 122851 -237322 -189740 -127835 -51392 -21045 54901 -57916 -210599 -167653 -121863
6376 -121863 -40105 90621 -137002 -243153 -104090 -37136 -58238 -102528 -29119 61335 -146110
6365 -146110 -177196 -87579 -41377 -167836 -260758 -281953 -211896 -278918 -345824 -509709 -590611
6354 -590611 -295712 -14815 54884 -228350 -423735 -378327 -417418 -309833 -332302 -210047
6344 -210047 -351967 -649347 -794806 -712536 -448696 -408081 -413831 -319498 -512655 -556343 -542935
6333 -542935 -407826 -154471 57898 -35025 -46785 64866 -27398 -98424 -246616 -190742 -105038
6322 -105038 -58660 -90716 -48197 -17190 -157053 -252339 -463210 -379480 -265665 -328342 -299761
6311 -299761 -445937 -398412 -218286 -162358 -143713 -72450 -74564 -282846 -468564 -580143 -613331
6300 -613331 -583749 -441648 -248397 -202606 -71778 2650 35672 -208810 -348559 -294525 -232562
6289 -232562 -255287 57754 53567 9529 -45593 -152496 -162625 -183056 -118544 -305388 -379965
6278 -379965 -470609 -276214 -150954 -106024 -39110 -152146 -106745 -230396 -179765 -272765 -159887
6267 -159887 7664 3029 -193180 -371265 -572459 -558857 -327409 -408992 -482492 -402902 -156012
6256 -156012 -75277 -251922 -355871 -333622 -218318 -74538 -37771 -82549 -4393 4680 64508
6245 64508 -19032 -185385 -236383 -401334 -403431 -354948 -259740 -234412 -341828 -237937 -98550
6234 -98550 -357959 -504914 -497468 -464540 -297474 -315521 -263887 -323033 -407461 -362592 -306602
6223 -306602 -106768 4724 81403 -2296 -142892 -132164 -83608 -86161 -253414 -345790 -211735
6212 -211735 -65467 -308554 -427285 -261166 -279618 -206765 -407000 -144683 -122260 -291430
6202 -291430 -221591 -124829 -258516 -496807 -420966 -280318 -408380 -423627 -255189 -316078 -426799
6191 -426799 -478912 -483226 -480655 -212066 -111497 -230244 -315545 -387756 -341095 -320054 -234632
6180 -234632 -199108 -162864 -145785 -289468 -491910 -579963 -492712 -422804 -582636 -473629 -219846
6169 -219846 -146402 -182616 -443368 -382394 -77538 -26710 -155127 -167852 -136515 -398525 -509545
6158 -509545 -450271 -341112 -397632 -391773 -422842 -438732 -308624 -93364 -122351 -122676 -97186 8801
6146 8801 9551 -151996 -255647 -275561 -404355 -261504 -162188 -281856 -276655 -31534 10740
6135 10740 -177525 -373357 -388161 -386914 -378545 -543673 -561063 -504790 -543013 -495583 -409784 -217268
6123 -217268 -184127 -292119 -332964 -240364 -259833 -300048 -402124 -250288 -94328 -101486 -93908
6112 -93908 -91793 -193666 -151656 -175570 -99039 -221058 -312574 -422021 -347409 -12187 162628
6101 162628 13357 -69108 -146268 -167734 -188766 -43416 -180412 -166849 -186040 -247111 -154721
6090 -154721 40573 61612 -251126 -275769 -189725 -389428 -444542 -552397 -663892 -504219
6080 -504219 -221724 -325601 -475661 -522573 -617533 -508704 -185970 -38084 -166828 -49074
6070 -49074 -71805 -105902 -24260 153155 94230 -53235 -190781 -79569 -70498 -116900 -51444
6059 -51444 -51766 -255306 -386532 -320315 -191860 -339132 -382971 -263482 -138922 -169966 -116343
6048 -116343 -230802 -344199 -509173 -420021 -319217 -257172 -153374 -224981 -268951 -155014
6038 -155014 -209839 -202974 -259645 -364031 -390506 -427839 -396053 -286985 -333474 -259361 -131666
6027 -131666 -260937 -483688 -430558 -122664 85104 -38803 -53028 -136905 -423239 -622231
6017 -622231 -625008 -566996 -305832 -507267 -617803 -508617 -376720 -235952 -451761 -457066 -519554
6006 -519554 -603584 -591328 -507653 -352797 -307999 -193706 32475 -139489 -451921 -519664 -390292
5995 -390292 -465295 -543698 -437399 -381007 -399150 -259848 -222356 -218855 -264374 -144353 -76266
5984 -76266 -85632 -204995 -342967 -275438 -225927 -253479 -288128 -420008 -540395 -592288 -729965
5973 -729965 -677774 -465422 -465451 -582231 -468004 -407110 -508664 -529324 -427124 -325060 -280619
5962 -280619 -298173 -389480 -400339 -231580 -119698 -462992 -615485 -597961 -552223 -319945 -215132
5951 -215132 -203625 -101748 -218903 -132257 -80230 -132888 -264193 -361902 -512550 -423364 -424545
5940 -424545 -314254 -263793 -309594 -392698 -165013 1341 -9105 -131381 -161236 -74420 -124598
5929 -124598 -155270 -208900 -278009 -400403 -370643 -383366 -456034 -436623 -498046 -650309 -513709
5918 -513709 -516259 -530861 -604584 -652451 -421396 -440152 -532435 -457527 -449283 -472566 -433591 -309487
5906 -309487 -215530 -166715 -223231 -243112 -336631 -277833 -204009 -106761 -46251 -196430 -169738
5895 -169738 -67250 -133776 -256063 -476804 -407080 -338159 -366669 -467280 -451474 -485424 -417284
5884 -417284 -214390 11689 51117 26339 -69394 -16441 -71987 -146989 -189423 -287100 -101908
5873 -101908 -43142 -104419 -217547 -313615 -257980 -258906 -279189 -361949 -321670 -343834 -540826 -551245
5861 -551245 -593738 -523610 -369793 -260555 -280664 -285908 -411948 -427078 -283072 -38630 -50198
5850 -50198 -46410 52017 -58006 -323724 -453235 -401993 -380568 -287063 11183 38678 -173643
5839 -173643 -312057 -378776 -308124 -255951 -313797 -520833 -605756 -601701 -496046 -397063 -392645
5828 -392645 -291318 -236644 -408961 -476225 -245139 -176186 -114772 -38816 28922 153585 22360
5817 22360 -219156 2938 52338 16433 -105677 -233775 -443704 -569315 -526323 -409150
5807 -409150 -265905 -279885 -473312 -669010 -641130 -739404 -589438 -505341 -308602 -219116 -169338
5796 -169338 -166070 -246010 -142723 -33590 56900 329346 294851 -107940 -349592 -320568 -248293
5785 -248293 -328185 -453748 -320773 -236591 -242259 -227238 -440832 -605574 -577879 -543079 -454585
5774 -454585 -391022 -232668 -292816 -186272 -209015 -273410 -392985 -454940 -287427 -232638 -368018
5763 -368018 -585312 -636157 -535957 -375321 -250580 -211707 -264558 -92851 -120588 -100238 -20341
5752 -20341 -187555 -336353 -364560 -313524 -295840 -217512 -175217 -208983 -273929 -340033 -310722
5741 -310722 -253852 -368333 -431988 -497022 -719967 -740156 -544402 -212703 -120729 -194861 -387507
5730 -387507 -256283 -106547 -140786 -371734 -473109 -347178 -194669 -195079 -195757 -299828 -333974
5719 -333974 -257575 -179689 -214235 -336034 -521554 -443910 -353949 -259069 -291190 -372764 -475949
5708 -475949 -428237 -287478 -41759 -129428 -262703 -284519 -305900 -189618 -193823 -251045 -303553
5697 -303553 -330894 -228781 -226625 -21933 -114539 -333925 -421139 -476997 -482991 -388913 -460757
5686 -460757 -409363 -313679 -335144 -332748 -323012 -430806 -561974 -477723 -642851 -619260 -480656
5675 -480656 -320591 -459612 -328080 -241720 -370192 -325703 -348229 -353087 -230595 -193397 -461743
5664 -461743 -663156 -577581 -302361 -127321 -221667 -250516 -153209 -98442 -125903 -446557 -478271
5653 -478271 -188536 128574 -90653 -246417 -351087 -286923 -138450 -150828 -195901 -269626
5643 -269626 -92522 -18009 -122684 -123123 -130971 -129310 9033 -20121 -128554 -34628 -28973 -172864
5631 -172864 -232813 -190600 -267551 -246381 -472667 -584470 -485802 -332749 -369084 -307492 -246072
5620 -246072 -166246 -133402 -142939 -245377 -379973 -492147 -397329 -225643 -170488 -129337 -277441
5609 -277441 -434638 -267119 -111919 -57213 -112883 -337451 -471113 -583378 -390601 -483493
5599 -483493 -465417 -356880 -235850 -118794 1500 220312 74657 106746 192724 55948
5589 55948 113429 185349 93615 -92004 -273850 -323087 -222401 -122411 -96300 -273094 -277055
5578 -277055 -167239 -307400 -444783 -326266 -107159 -204947 -284112 -205517 -3562 108004
5568 108004 -88072 -373004 -458268 -422458 -368384 -426026 -541775 -515578 -476946 -382580 -239218
5557 -239218 -223869 -406091 -391322 -251411 -39552 -78964 -256249 -422201 -393263 -397398 -589781
5546 -589781 -566630 -510822 -609799 -739030 -623197 -403299 -610611 -642252 -592223 -467003 -407645
5535 -407645 -399040 -610233 -561086 -368525 -229435 -318472 -429997 -492393 -542984 -428210 -154131
5524 -154131 -148170 -156766 -454 -235799 -285255 -393513 -440787 -445127 -287495 -229791 -203857
5513 -203857 -219045 -26666 152144 204960 147766 -17793 -99494 -120159 -196135 -250342 -303799
5502 -303799 -221764 -257558 -236515 -347682 -301463 -179011 -142125 -356512 -374185 -262223 -43795
5491 -43795 -26169 -67443 -118490 -274042 -544419 -470300 -277064 -272947 -382650 -301876 -207256
5480 -207256 -338121 -446451 -306548 -262862 -246201 -88732 -83053 -59338 -163857 -414364 -344942
5469 -344942 -40294 -118589 -66545 -200404 -225233 -180846 -302781 -315380 -243365 -151261 -282170
5458 -282170 -126229 -71767 -279671 -392940 -230656 -127749 -52267 -90467 -249962 -125473
5448 -125473 -53685 -474547 -582355 -602116 -558719 -395794 -477711 -451023 -513991 -519135 -339281
5437 -339281 -87749 -221185 -133557 -58540 4586 143884 90290 57935 -28163 80379 -118583
5426 -118583 -289972 -177562 -218487 -269803 -304790 -221360 -123112 -247088 -235571 -218382 -199765
5415 -199765 -350014 -197786 64364 175461 160234 51566 -72039 -50346 -7918 58270
5405 58270 38227 -183223 -360184 -313372 -216608 -108265 -261664 -156376 -83558 -161702 -202247
5394 -202247 -135123 -231433 -345506 -447969 -370669 -283173 -137401 -81071 -80259 -131167 -122196 -115995
5382 -115995 -389357 -478334 -534962 -389472 -203626 -127619 -45738 -25568 -174375 -285064 -416133
5371 -416133 -436874 -349560 -407512 -393950 -381041 -341202 -420043 -370685 -382137 -426133 -215589
5360 -215589 -249692 -405583 -310433 -217216 -306110 -436448 -604235 -670916 -741399 -881111 -636963
5349 -636963 -321241 -183590 -171633 -76523 22273 45149 -167834 -181099 -195560 -348823 -453822
5338 -453822 -270179 -189440 -234040 -403509 -383662 -125498 137413 121379 -81007 -70993 -108530
5327 -108530 -51693 -199160 -312019 -286470 -270877 -273889 -285178 -123202 -79597 -180548 -309221
5316 -309221 -216167 -119745 -70534 -111654 -36240 63795 71393 19008 -172993 -178535 -182695 -220133
5304 -220133 -129773 -40068 -80596 -75153 -246184 -415088 -312834 -129392 -39119 -75325 -318754
5293 -318754 -397927 -368997 -272867 -126900 -164804 -313356 -471589 -334633 -162983 -222339 -208884
5282 -208884 -125753 -30767 1359 -163312 -428162 -383309 -248925 -307693 -336900 -187562 -214975
5271 -214975 -122299 -162765 -130638 27766 -65918 -109209 -85048 -142066 -215141 -233175 -338608
5260 -338608 -316215 -228193 -73578 -70556 -148958 -119826 -112647 -197373 -405035 -409888 -238460 -201744
5248 -201744 -451474 -418744 -454742 -369186 -197830 -221298 -308840 -228533 -170359 -120522 -363877
5237 -363877 -433638 -258946 -265904 -161342 -29897 -3126 -19984 -181598 -261936 -428627 -466600
5226 -466600 -561377 -549631 -408261 -297776 -431123 -583029 -514231 -509367 -511852 -455388 -379478
5215 -379478 -308490 -300175 -341105 -260373 -67501 -108159 -172963 -213144 -236306 -311895 -347842 -202334
5203 -202334 -148480 -356929 -443253 -639129 -735644 -587421 -545937 -505541 -489180 -389622 -330106
5192 -330106 -295107 -453804 -245866 -40316 -49899 -203523 -412209 -489176 -483103 -379348 -335414
5181 -335414 -211635 -312802 -306769 -123108 -24848 78618 89915 -169211 -218097 -371070 -450801
5170 -450801 -597685 -587553 -395991 -346216 -235507 -426638 -411441 -243133 -352376 -293394
5160 -293394 -339941 -531588 -538736 -581423 -517569 -387191 -232793 -39785 45950 99550 -2184
5149 -2184 -234529 -330364 -345508 -172172 -277983 -363610 -210264 -291302 -485575 -608587 -683101
5138 -683101 -444662 -272755 -87890 -101489 -302105 -346699 -260440 -121672 -63751 -210086
5128 -210086 -404751 -481870 -392353 -414310 -491280 -599687 -494842 -482554 -533031 -457945 -351484
5117 -351484 -235439 -361203 -557919 -580472 -370840 -375807 -256300 -217540 -207239 -150731 -260646
$$ [...]
##END NTUPLES=NMR SPECTRUM
##END=
