##TITLE=Analysis number 321206
Compound Code cc 58101
Book Reference 458/170/1
Project Code adrs
Chemist Name stevem
##JCAMPDX= 6.0         $$ Bruker NMR JCAMP-DX V2.0
##DATA TYPE= NMR SPECTRUM
##DATA CLASS= NTUPLES
##ORIGIN= Bruker BioSpin GmbH
##OWNER= nmr
$$ XWIN-NMR		Version 3.5
$$ Fri Jul 28 12:06:13 2006 GMT Daylight Time (UT+1h)  MAYBRIDGE\nmr@NMR_250MHZ
##.OBSERVE FREQUENCY= 250.131544655141
##.OBSERVE NUCLEUS= ^1H
##.ACQUISITION MODE= SIMULTANEOUS (DQD)
##.ACQUISITION SCHEME= undefined
##.AVERAGES= 16
##.DIGITISER RES= 18
##SPECTROMETER/DATA SYSTEM= dpx250
##.PULSE SEQUENCE= zg30
##.SOLVENT NAME= DMSO
##.SHIFT REFERENCE= (INTERNAL, DMSO, 0, 16.522)
##AUDIT TRAIL= $$ (NUMBER, WHEN, WHO, WHERE, WHAT)
$$ ##TITLE= Audit trail, XWIN-NMR		Version 3.5
$$ ##JCAMPDX= 5.01
$$ ##ORIGIN= Bruker BioSpin GmbH
$$ ##OWNER= nmr
$$ C:\u/data/dgb/nmr/ADRS/3780/pdata/1/auditp.txt
$$ ##AUDIT TRAIL=  $$ (NUMBER, WHEN, WHO, WHERE, WHAT)
(   1,<2006-07-28 12:05:47.60 +100>,<MAYBRIDGE\nmr>,<NMR_250MHZ>,
      <created by zg, POWCHK disabled, PULCHK disabled
       configuration hash MD5:
       E2 DF 36 D8 04 B2 41 60 5A D7 A3 38 5A 4B D0 FE
       data hash MD5: 64K
       0F A1 A7 D8 22 71 E9 DA 7D 0D B4 03 B7 75 AF 68>)
(   2,<2006-07-28 12:06:01.75 +100>,<MAYBRIDGE\nmr>,<NMR_250MHZ>,
      <Start of raw data processing
       ef LB = 0.3 FT_mod = 6 PKNL = 1 SI = 32K 
       data hash MD5: 32K
       09 C7 9C 50 5A 1F 4B FC 5D CC 4B 3D CF 90 CD 61>)
(   3,<2006-07-28 12:06:03.38 +100>,<MAYBRIDGE\nmr>,<NMR_250MHZ>,
      <apk 
       data hash MD5: 32K
       FE F3 D6 B3 B3 93 1B A7 83 43 ED CE 67 70 7B 6E>)
(   4,<2006-07-28 12:06:04.22 +100>,<MAYBRIDGE\nmr>,<NMR_250MHZ>,
      <abs ABSG = 5 
       data hash MD5: 32K
       50 31 14 6A 46 9B 28 58 D4 65 58 8C 84 15 E9 2B>)
$$ ##END=
$$ 
$$ hash MD5
$$ 82 21 BF 2A F3 B9 A5 97 5B 28 CE DA 6D 8F 0D 37
##$RELAX= 
##$RELAX= 
##$RELAX= 
##$RELAX= 
##$RELAX= 
##$RELAX= 
##$RELAX= 
$$ Bruker specific parameters
$$ --------------------------
##$DU= <C:\u>
##$EXPNO= 3780
##$NAME= <ADRS>
##$PROCNO= 1
##$TYPE= <nmr>
##$USER= <dgb>
##$AMP= (0..31)
100 100 100 100 100 100 100 100 100 100 100 100 100 100 100 100 100 100 
100 100 100 100 100 100 100 100 100 100 100 100 100 100 
##$AQSEQ= 0
##$AQ_mod= 3
##$AUNM= <au_zg>
##$AUTOPOS= <5 >
##$BF1= 250.13
##$BF2= 250.13
##$BF3= 250.13
##$BF4= 250.13
##$BF5= 500.13
##$BF6= 500.13
##$BF7= 500.13
##$BF8= 500.13
##$BYTORDA= 1
##$CFDGTYP= 0
##$CFRGTYP= 5
##$CHEMSTR= <none>
##$CNST= (0..31)
1 1 145 1 1 1 1 1 1 1 1 1 1 1 1 1 1 1 1 1 1 1 1 1 1 1 1 1 1 1 1 1 
##$CPDPRG= <>
##$CPDPRG1= <>
##$CPDPRG2= <>
##$CPDPRG3= <>
##$CPDPRG4= <mlev>
##$CPDPRG5= <mlev>
##$CPDPRG6= <mlev>
##$CPDPRG7= <mlev>
##$CPDPRG8= <mlev>
##$CPDPRGB= <>
##$CPDPRGT= <>
##$D= (0..31)
0 1 0 0 0 0 0 0 0 0.06 0 0 0 0 0 0 0.0002 0 0 0 0 0 0 0 0 0 0 0 0 0 0 
0 
##$DATE= 1154084746
##$DBL= (0..7)
120 120 120 120 120 120 120 120 
##$DBP= (0..7)
150 150 150 150 150 150 150 150 
##$DBP07= 0
##$DBPNAM0= <>
##$DBPNAM1= <>
$$ [...]
##$SUBNAM7= <"">
##$SUBNAM8= <"">
##$SUBNAM9= <"">
##$SW= 20.6930455092707
##$SWIBOX= (0..15)
0 0 3 0 0 0 0 0 0 0 0 0 0 0 0 0 
##$SW_h= 5175.983436853
##$TD= 65536
##$TD0= 1
##$TE= 295.16
##$TE2= 300
##$TE3= 300
##$TEG= 300
##$TL= (0..7)
0 120 120 120 120 120 120 120 
##$TP= (0..7)
150 150 150 150 150 150 150 150 
##$TP07= 0
##$TPNAME0= <>
##$TPNAME1= <>
##$TPNAME2= <>
##$TPNAME3= <>
##$TPNAME4= <>
##$TPNAME5= <>
##$TPNAME6= <>
##$TPNAME7= <>
##$TPOAL= (0..7)
0.5 0.5 0.5 0.5 0.5 0.5 0.5 0.5 
##$TPOFFS= (0..7)
0 0 0 0 0 0 0 0 
##$TUNHIN= 0
##$TUNHOUT= 0
##$TUNXOUT= 0
##$USERA1= <user>
##$USERA2= <user>
##$USERA3= <user>
##$USERA4= <user>
##$USERA5= <user>
##$V9= 5
##$VALIST= <valist>
##$VCLIST= <CCCCCCCCCCCCCCC>
##$VD= 0
##$VDLIST= <DDDDDDDDDDDDDDD>
##$VPLIST= <PPPPPPPPPPPPPPP>
##$VTLIST= <TTTTTTTTTTTTTTT>
##$WBST= 1024
##$WBSW= 4
##$XGAIN= (0..3)
0 0 0 0 
##$XL= 0
##$YL= 0
##$YMAX_a= 361820
##$YMIN_a= -387509
##$ZGOPTNS= <>
##$ZL1= 120
##$ZL2= 120
##$ZL3= 120
##$ZL4= 120
##$ABSF1= 16.522
##$ABSF2= -4.171173
##$ABSG= 5
##$ABSL= 3
##$ALPHA= 0
##$AQORDER= 0
##$ASSFAC= 0
##$ASSFACI= 0
##$ASSFACX= 0
##$ASSWID= 0
##$AUNMP= <proc_1d>
##$AZFE= 0.1
##$AZFW= 0.1
##$BCFW= 0
##$BC_mod= 0
##$BYTORDP= 0
##$COROFFS= 0
##$CY= 12.5
##$DATMOD= 1
##$DC= 0
##$DFILT= <>
##$DTYPP= 0
##$F1P= 14.0000005364418
##$F2P= -0.99999901652339
##$FCOR= 0.5
##$FTSIZE= 32768
##$FT_mod= 6
##$GAMMA= 0
##$GB= 0
##$INTBC= 1
##$INTSCL= 1
##$ISEN= 128
##$LB= 0.3
##$LEV0= 0
##$LPBIN= 0
##$MAXI= 10000
##$MC2= 0
##$MEAN= 0
##$ME_mod= 0
##$MI= 0
##$NCOEF= 0
##$NC_proc= -6
##$NLEV= 6
##$NOISF1= 0
##$NOISF2= 0
##$NSP= 0
##$NTH_PI= 0
##$NZP= 0
##$OFFSET= 16.522
##$PC= 1
##$PHC0= 146.4406
##$PHC1= 29.54602
##$PH_mod= 1
##$PKNL= yes
##$PPARMOD= 0
##$PSCAL= 4
##$PSIGN= 0
##$REVERSE= no
##$SF= 250.13
##$SI= 32768
##$SIGF1= 0
##$SIGF2= 0
##$SINO= 400
##$SIOLD= 32768
##$SREGLST= <1H.DMSO>
##$SSB= 0
##$STSI= 32768
##$STSR= 0
##$SW_p= 5175.98343685301
##$SYMM= 0
##$S_DEV= 0
##$TDeff= 65536
##$TDoff= 0
##$TI= <Analysis number 999999
Compound Code 99
Book Reference 9
Project Code 9>
##$TILT= no
##$TM1= 0
##$TM2= 0
##$TOPLEV= 0
##$USERP1= <user>
##$USERP2= <user>
##$USERP3= <user>
##$USERP4= <user>
##$USERP5= <user>
##$WDW= 1
##$XDIM= 32768
##$YMAX_p= 454587467
##$YMIN_p= -2124674
$$ End of Bruker specific parameters
$$ ---------------------------------
##NTUPLES= NMR SPECTRUM
##VAR_NAME=  FREQUENCY,     SPECTRUM/REAL,   SPECTRUM/IMAG
##SYMBOL=    X,             R,               I
##VAR_TYPE=  INDEPENDENT,   DEPENDENT,       DEPENDENT
##VAR_FORM=  AFFN,          ASDF,            ASDF
##VAR_DIM=   32768,         32768,           32768
##UNITS=     HZ,            ARBITRARY UNITS, ARBITRARY UNITS
##FACTOR=    0.157963299565203, 1,           1
##FIRST=     4132.6476996994, 0,             0
##LAST=      -1043.33573715361, 0,           0
##MIN=       -1043.33573715361, -2124674,    0
##MAX=       4132.6476996994, 454587467,     0
$$ Real data points
##PAGE= N=1
##DATA TABLE= (X++(R..R)), XYDATA
$$ [...]
15289a00284M9534J96611O8965k51990O0993m58459J49597L84527l90320j79128
15279d69954j67576N23135p5020P2172K80322J38670j33243l72575k3135K2074
15269b05130N2475P82361N8818m19679J67115N7109n61539l18370L66233r7665
15259a18272N7735j26524j33477j6108k50535n69782j59165Q18615L21578m46348
15249f22283K58588K10672K0283j80348J06561J04868O07186k0138l21397p19565
15239e55573k2305q8371N8686O56898M31090m2757j92094J90936q6446l21900
15229B8164J70628L15147n33709m23370k60033k95502m85823L2118Q27199P4503
15219e50678M0857q3603k67716j54676K07942J40446L31353p9970l31383O12970
$$ plain form
15289 -100284 -50750 145861 214826 -37164 23829 -434630 -285033 99494 -290826 -469954
15279 -469954 -637530 -114395 -189415 -117243 163079 301749 168506 -204069 -227204 -205130
15269 -205130 -152655 629706 688524 268845 435960 493069 -68470 -386840 -20607 -118272
15259 -118272 -60537 -187061 -320538 -336646 -587181 -1156963 -1316128 -497513 -175935 -622283
15249 -622283 -363695 -153023 -132740 -313088 -206527 -101659 505527 485389 163992 -555573
15239 -555573 -577878 -666249 -607563 49335 480425 437668 245574 436510 350064 28164
15229 28164 198792 513939 -19770 -443140 -703173 -998675 -1484498 -1452380 -625181 -550678
15219 -550678 -509821 -593424 -861140 -1015816 -807874 -667428 -336075 -416045 -747428 -134458
15209a34458j26260O945J73786J88049L39431O56192k35809l78057n23323q05590
15199h39094j64259K26667L16468M80982O4143K2440m6786r7574j38765m5833
15189b21611L97795l33181n04926M61489O02903l75051r4738M74999J78072j85187
15179D00564L76931l78129K48308k25707l9582j23589n58924j27044j43298o30585
15169a201055j61323N21050N78613N94799j67354J34888M41389O1466m65800p3347
15159B63326Q9093l64835l84221m33328l71781M16394N50922j02382m07814M85716
15149b58910P65415q8664l91249R4525n71550k49390N25442K89724N0655K25805
15139C91803L54643k31671o98531j67853K9101l62624k24345n04617L73656P49754
$$ plain form
15209 -134458 -260718 -253773 -79987 108062 447493 1103685 867876 489819 -33504 -839094
15199 -839094 -1003353 -776686 -460218 20764 84907 107347 60561 -37013 -175778 -221611
15189 -221611 176184 -156997 -661923 -200434 402469 27418 -67320 407679 585751 400564
15179 400564 777495 399366 647674 421967 382385 258796 -300128 -427172 -570470 -1201055
15169 -1201055 -1362378 -841328 -262715 332084 164730 299618 741007 802473 336673 263326
15159 263326 352419 -12416 -396637 -829965 -1201746 -785352 -234430 -336812 -744626 -258910
15149 -258910 506505 417841 26592 121117 -450433 -699823 -174381 115343 165998 391803
15139 391803 746446 514775 -183756 -351609 -322508 -685132 -909477 -1414094 -1040438 -290684
15129b90684L3169l8643l68312o86357L83111N85049K74974J2175O7836J00202
15119G2520L0466K80364j42990k50340J40143k26263j21758L364q8727r4399k09669
15108f07289j95759M48025M68416M13330j00437l28674j87671k79521m2149J59609
15098b52120p6813j43516k48345L86945N68314m09331k92816j31415K86059J21479
15088a91559j01877k09391J23474Q13064K39565r1511n63177n98909j76156K83426
15078d73051j32749K90444K83521L9404k98820n7017M5433r82K50750K7750n87495
15067f12812j37752r9665q3301P00170K22049j23828n5634j26837l68015k10557
15057h96182L3854j73581K11649M76862J01331J61840K19657K0884j27947p9719
$$ plain form
15129 -290684 -257515 -296158 -664470 -1350827 -967716 -382667 -107693 -95518 -27682 72520
15119 72520 102986 383350 240360 -9980 130163 -96100 -217858 -214494 -303221 -397620 -607289
15108 -607289 -803048 -355023 113393 526723 426286 97612 -90059 -369580 -411729 -252120
15098 -252120 -328933 -472449 -720794 -333849 234465 -174866 -467682 -599097 -313038 -191559
15088 -191559 -293436 -502827 -379353 433711 673276 581765 18588 -580321 -756477 -473051
15078 -473051 -605800 -315356 -31835 7569 -291251 -348268 -302835 -303817 -53067 -25317 -612812
15067 -612812 -750564 -850229 -933530 -233360 -11311 -135139 -190773 -317610 -685625 -896182
15057 -896182 -862328 -1035909 -824260 -347398 -246067 -84227 135430 156314 28367 -51352
15047e1352j20857N16297L23868n3367j01262q9057k16822j12466m47975j65697
15037e18690P65937N10789l86592k28869M24767m1102J25859n19583o67819k54328
15027g89631l50555K68915R17761J64854k92466k29694J82634K22810n35985m40945
15017h82302L16687j94274j18964K57508M25337M56229K89651k44266O4773k65539
15007A04840L64032m04161K68732M0187n16408l61663K32592k51633L1587r4567
14997e86462j72536N20031P71545K36207m32653l26710j99156k11597m47289K0710
14987h27910p3953J89869J016025J28669j69220m42608k14932K47324L3430k13474
14977c26780j50215J1778L63446L45370j94409l96071j87823L69561j28957k35455
$$ plain form
15047 -51352 -172209 344088 667956 614589 513327 424270 207448 94982 -352993 -518690
15037 -518690 247247 758036 371444 142575 567342 526240 652099 132516 -535303 -789631
15027 -789631 -1140186 -871271 46490 211344 -81122 -310816 -128182 94628 -441357 -882302
15017 -882302 -565615 -759889 -878853 -621345 -196008 260221 549872 305606 370379 104840
15007 104840 468872 64711 333443 373630 -142778 -504441 -271849 -523482 -491895 -586462
14997 -586462 -758998 -238967 532578 768785 336132 9422 -189734 -401331 -848620 -827910
14987 -827910 -901863 -711994 304031 432700 263480 -179128 -394060 -146736 -113306 -326780
14977 -326780 -476995 -465217 -101771 243599 49190 -346881 -534704 -165143 -294100 -529555
14967e29555L55602k36187R4865K26866k41448K28896K87560k2179j32132L21171
14957C53459j27814M8984p5422j91756j92655j95535J26398L67651j91164j41624
14947b19478P72901L16416k88999l68317n55246j51520O00668k68086k97347J02570
14937c56438L07346j18495R5749n19537K5993Q25641R342N6113N57745J93444
14927A076903k64297j43570j4636m56671n43167l16748K65176J63053N57986k88723
14917C5306m89953J96546M87601p8630O9578L90612n67403q20899J4664O30102
14907a32476K01488k86148l52064j50328J55703N36757J44326M94344O0291j76754
14897D95139l51432j5696N5595L77483L78936j34962n6216j2835o41511l12107
$$ plain form
14967 -529555 -173953 -410140 -315275 -88409 -329857 -100961 186599 164420 32288 353459
14957 353459 225645 274629 199207 7451 -185204 -380739 -254341 113310 -77854 -219478
14947 -219478 553423 869839 580840 212523 -342723 -494243 106425 -161661 -459008 -356438
14937 -356438 -49092 -167587 -71838 -591375 -565382 260259 269601 325714 883459 1076903
14927 1076903 812606 669036 654400 197729 -345438 -662186 -397010 -233957 324029 35306
14917 35306 -454647 -258101 229500 150870 220448 611060 43657 -777242 -762578 -132476
14907 -132476 69012 -217136 -569200 -719528 -563825 -27068 117258 611602 671893 495139
14897 495139 143707 128011 183606 561089 940025 805063 748847 736012 94501 -217606
14887b17606K90723P131N26907O5653J14444j29922j78930p6863k77105j78131
14877e3699m3681k42722l42153J27210J82272l3416m47438k06839J13365M90798
14867d56303L31182N25498l41862j89982L36972o8678j80941j25025M7101O0131
14857f1907j85078L84345P2678J25744M1562l70218L29770M31825m16427j92835
14847A59459n39609j78480O35959n5465n3271L15520m8479J15763l95195L35704
14837B91906L12337j08133J29876k66545n89238j73031m72930o84752K95873M98099
14827g66538K04850L24751j01019L01942K19536k20838l96191L591L88766L96652
14817C55502n78667j18186J04263p8745L83156k6342k40143o26677k96025O75202
$$ plain form
14887 -217606 73117 80248 607155 672808 787252 657330 478400 401537 124432 -53699
14877 -53699 -97380 -340102 -682255 -555045 -372773 -406189 -853627 -1060466 -947101 -456303
14867 -456303 -125121 400377 58515 -131467 205505 136827 -44114 -169139 -122038 -61907
14857 -61907 -246985 137360 210038 335782 377344 7126 336896 768721 352294 159459
14847 159459 -380150 -558630 77329 21864 -31407 284113 235634 351397 -43798 291906
14837 291906 604243 496110 625986 359441 -229797 -402828 -875758 -1560510 -1264637 -766538
14827 -766538 -561688 -236937 -337956 -36014 183522 -37316 -433507 -429916 -41150 355502
14817 355502 -223165 -341351 -237088 -315833 67323 40981 -199162 -825839 -1121864 -446662
14807d46662M77971k11986K5647L44268j20468l56335l4329O26865K39654l66143
14797A78482J9972L98663o8812n60898k43225J38651J98517q0494l31078j98417
14787e48639J54650j79787l70581N04207O19347M27791L11608m32943o26993n371
14777a46711M7131j2161k89476j18085O44596K77756M6098k03507n81785l81629
14767g17773k24177J64911J61935P8048M96498J48657J8216j9908K70977m17224
14757c9840m33193k34729n8246K98088k17735n2734N37025K69420K76947m0168
14747C04835j53728n85350k92828m00400M4073K57218N4092K52118j54877N8916
14737f15931O0168L2787j06012j64685J65948k97306J63871N87807O21818J90052
$$ plain form
14807 -446662 31309 -180677 -155030 189238 68770 -287565 -321894 304971 544625 178482
14797 178482 198454 597117 528305 -32593 -275818 -137167 61350 -19144 -350222 -548639
14787 -548639 -393989 -573776 -944357 -440150 179197 606988 918596 485653 -141340 -146711
14777 -146711 -99580 -111741 -401217 -519302 125294 403050 449148 245641 -336144 -717773
14767 -717773 -941950 -777039 -615104 -537056 -40558 108099 126315 106407 377384 -39840
14757 -39840 -473033 -707762 -766008 -467920 -685655 -738389 -201364 68056 345003 304835
14747 304835 151107 -434243 -727071 -1127471 -1083398 -826180 -772088 -519970 -674847 -615931
14737 -615931 -555763 -522976 -628988 -793673 -627725 -925031 -761160 -173353 448465 638517
14727F38517p38585k39499J56029L88869J05216m12937o39538n6562r444O72178
14717a35756K65311N9381j52015q8183m90047p0825Q4419j87951N00396j05001
14707c20271k03719N02337P3557l87017j97725L47105J51470q6281p4244L15656
14697A20868L08882l32461p9733K6612m7035j54907L64744O03773J45574j57392
14687G98925k35258q04619k06090O6051k29865p6289l58645k69086R8962j27581
14677a343495j0021O70338L876j40194j87340K38581n6504J59628O09033M83571
14667D27473O5667K20949p53732l59367M67698J23430O6494n064L37506K73078
14657H64132k63736o5358P9846m27363J1299K55541N7901K15705K76995k76494
$$ plain form
14727 638517 -100068 -339567 -183538 205331 310547 -102390 -741928 -798490 -807934 -135756
14717 -135756 129555 188936 36921 -51262 -541309 -612134 -527715 -715666 -215270 -320271
14707 -320271 -523990 -21653 51904 -335113 -532838 -185733 -34263 -120544 -194788 120868
14697 120868 429750 97289 17556 44168 -2867 -157774 206970 810743 956317 798925
14687 798925 563667 -240952 -447042 -380991 -610856 -687145 -1045790 -1314876 -1215914 -1343495
14677 -1343495 -1353516 -683178 -679302 -819496 -1006836 -768255 -824759 -665131 -56098 427473
14667 427473 493140 714089 -39643 -399010 68688 192118 258612 253548 591054 864132
14657 864132 600396 535038 614884 187521 198820 454361 512262 727967 1004962 728468
14647G28468o0421N37879j10351l83402M61268j81900m47830l35981p07684l21458
14637h21412J4791j63808L69753J47298J6738L28130L11924L12684n89344o11821
14627f85067j79480O27700L54376j93819M25738K56408N1665m47183m45312k56858
14617d91832O89J60674Q9036j06343L20060J65167k40973l05342M35579k99042
14607b72327m2996j47514k16379r8814j52709L99471R52420p9814R3354K07067
14597F41759k04270n79290l17074N71071K09245j45759M06945K12451J6146n52260
14587B58964m00554K91583l16756J78358M13854j84205n32967j10793O48881J87642
14577D34007k00157L3303m70645j14886L02957N5086N5318J98698l9343k75285
$$ plain form
14647 728468 668047 1205926 1095575 712173 1173441 991541 543711 207730 -499954 -821412
14637 -821412 -806621 -970429 -600676 -453378 -436640 -108510 203414 516098 -73246 -685067
14627 -685067 -864547 -236847 117529 -76290 349448 605856 657521 210338 -234974 -491832
14617 -491832 -491143 -330469 -241433 -347776 -27716 137451 -103522 -408864 26715 -272327
14607 -272327 -315323 -462837 -679216 -778030 -930739 -531268 421152 341338 434692 641759
14597 641759 437489 -141801 -458875 112196 321441 175682 582627 795078 811224 258964
14587 258964 -141590 149993 -166763 11595 425449 241244 -291723 -402516 246365 434007
14577 434007 233850 267153 -203492 -318378 -15421 39665 94983 293681 254338 -20947
14567b0947M92114P10471K15089l9655k69885o98888J53902L35402l17368k7947
14557E32288J24542J45441k23003j42251L00691l66773o52981Q2490K39207k88241
14547b48590Q8617l4448m05268o56126N74876M32306L57931L18608l05995l99129
14537b77218n80905j75085O90398O18778N09229n18589m84247K61999L27232L15626
14527F87218k6143n12617m82277O52809K18633o90673m14993K17725L48971M48851
14517D47504k23984R5411L91715N48308m00630l68519j51268J84856J00255k07637
14507D16011l66284J37363L9039n1981l42462j02719l79836n27295P6685L07581
14497g93898L92775J28902J45689J50346L36678L93767o804m29732J83493o04522
$$ plain form
14567 -20947 471167 1181638 1396727 1357072 1087187 388299 542201 877603 560235 532288
14557 532288 656830 802271 579268 437017 737708 370935 -282046 -199556 39651 -248590
14547 -248590 -159973 -194421 -599689 -1255815 -680939 -248633 109298 427906 121911 -277218
14537 -277218 -858123 -1033208 -342810 275968 785197 266608 -217639 44360 371592 687218
14527 687218 661075 148458 -333819 318990 537623 -153050 -568043 -350318 -1347 447504
14517 447504 223520 318931 710646 1258954 858324 489805 338537 523393 623648 416011
14507 416011 49727 187090 226129 174148 -168314 -271033 -650869 -1178164 -1101479 -793898
14497 -793898 -401123 -272221 -126532 23814 360492 754259 747455 317723 501216 -103306
14487a03306o17420j19515J68459M01716r7443N0423L1644J15460M65289K04030
14477D99337k97050m51137J94949j87649j76106m3297R1588l81052L4394M21866
14467b94157K0436J00247L7387l55710M96618J08745k94776K22865o64526J4364
14457f08507P41359M42595n8856n95446k79150l60438j56056K34751N11199j72601
14447c01150k76862k06140N2068o8306L60738Q67856Q7687m5114L01846k14841
14437E57782L19425L80963j06456m27250l77865Q4845Q7366j79414L8095j57847
14427B19644n18293J43659J48680J47971J97063M63029k4718l98661k96450j08508
14417b6584k54509O69165J39026k36079k27457q6176k31203k05259K64596J20858
$$ plain form
14487 -103306 -720726 -840241 -671782 -270066 -367509 -317086 -285442 -169982 295307 499337
14477 499337 202287 -248850 -53901 -241550 -417656 -460953 -369365 -750417 -716023 -294157
14467 -294157 -273721 -173474 -136087 -491797 4821 113566 -181210 41655 -622871 -608507
14457 -608507 132852 575447 516591 -78855 -358005 -718443 -874499 -639748 -128549 -301150
14447 -301150 -578012 -784152 -732084 -800390 -439652 428204 515891 470777 772623 557782
14437 557782 877207 1258170 1151714 724464 346599 431444 518810 339396 377491 219644
14427 219644 -298649 -154990 -6310 141661 338724 801753 777035 378374 81924 -26584
14417 -26584 -281093 388072 527098 291019 63562 -22614 -253817 -459076 -194480 -73622
14407g3622k19889J89196L17022l69459K8579K4952j85239k95075K31137M5983
14397c06415Q9052N73137M05736k57773o35735Q101k11793K02187N6390K96178
14387B19065K77607k7134j09178k81492L53388J83079m16851m89179J52948N6814
14377h0933J49098L3659j0805Q374O6788M75231L58037m85342j117974K12850
14367c91017M59784L71741K55426m41209k40838M22994J89265p6676j57143k87784
14357A04543o7523K46395J4217J89101N72233J65485j66516q75997l66424O15439
14347D30953K01255k40868P42108j56021q26464l30447j16620J60137M81808j3907
14337C31934j35399Q14652n5575n46309j57221k44090k53798j81543j17973J54037
$$ plain form
14407 -73622 -293511 -104315 212707 -156752 -128173 -103221 -288460 -583535 -352398 -306415
14397 -306415 -217363 355774 761510 503737 -131998 -123897 -335690 -133503 -77113 219065
14387 219065 496672 469538 360360 78868 432256 615335 198484 -290695 -137747 -80933
14377 -80933 68165 101824 91019 99393 166181 641412 999449 514107 -603867 -391017
14367 -391017 68767 440508 695934 254725 13887 436881 626146 549470 392327 104543
14357 104543 37020 283415 297632 486733 1058966 1224451 1057935 181938 -184486 430953
14347 430953 632208 391340 1133448 977427 150963 -179484 -296104 -135967 345841 331934
14337 331934 196535 1011187 955612 409303 252082 7992 -245806 -427349 -545322 -391285
14327c91285J67972Q02374J13822n62932r09265R2678R6465k52577J9787K03671
14317f19290N40856P49480j85532l46543m20911r9765m19362k25568Q47620N09775
14307C30760N47458j87183J33527o25234l37347L36328k9765L57629Q56640k57824
14297A124989r56560k69927N9499L00167N8655k24175n50071L65363J64853M8212
14287A21005k50553J80305j42829j45939J71186M58724J8245K07465k73014J38502
14277D83097K02030M22709q6148R3650k35029n46525r11713J31496R201q9321
14267e26553P6777j57158J80157N8429L04866M1790L50908L97269n18087o36575
14257d28177m44918N37873L52114N41000k8919p7663j13932L916L84049k35424
$$ plain form
14327 -391285 -223313 579061 692883 129951 -779314 -686636 -590171 -842748 -822961 -619290
14317 -619290 -78434 671046 485514 138971 -281940 -381705 -801067 -1026635 -179015 330760
14307 330760 878218 691035 824562 199328 -138019 198309 168544 526173 1382813 1124989
14297 1124989 168429 -101498 -41999 258168 316823 92648 -457423 -92060 72793 121005
14287 121005 -129548 50757 -92072 -238011 -66825 391899 410144 617609 344595 483097
14277 483097 685127 1107836 1021688 1115338 880309 333784 -577929 -446433 -437232 -526553
14267 -526553 -449776 -606934 -426777 -368348 -63482 -21692 329216 726485 208398 -428177
14257 -428177 -873095 -335222 16892 557892 528973 451310 337378 341294 725343 489919
14247D89919P326o25907l50560M06906K40131k38266K95937m90263n5629L27182
14237F776o5040M9232L33641O41771P3000l00377J47292r1865k27441m36678J07239
14226B37550j28061N83714L98661o79009l88586k59269k02402L78614j3944j70207
14216b42939K45163K75493l60785R361Q55139N3991r3123N4320m98952j171495
14206h73827K9054N35350L49130K89352M35417K08897j31283j56952o22021m33773
14196c70656l77481N70316Q09826M13766r4657k32408k86421k74782k73623P8656
14186c7464O99969l32309j68834L06272J39742k02285K9153N66826K72363L8062
14176A311495j10641l86594p41071k07841k44462O2539O86928k02637M5968L49610
$$ plain form
14247 489919 497245 -128662 -479222 -72316 167815 -70451 225486 -264777 -320406 6776
14237 6776 -58264 -9032 324609 966380 1039380 739003 886295 794430 566989 130311 237550
14226 237550 109489 693203 1091864 412855 24269 -235000 -437402 -58788 -72732 -242939
14216 -242939 2224 277717 -83068 -73707 781432 835423 742300 796620 297668 -873827
14206 -873827 -844773 -309423 39707 329059 764476 973373 842090 685138 63117 -370656
14196 -370656 -748137 -177821 632005 1045771 951114 718706 432285 157503 -116120 -37464
14186 -37464 662505 330196 161362 467634 607376 405091 434244 1001070 1273433 1311495
14176 1311495 1200854 814260 73189 -134652 -379114 -316575 370353 167716 213684 563294
14166E63294J0436j41360j57958j70248l34295J44378J88821M1221K31614k33755
14156A42148j05623k548k72130j30768M10655j53728k93097j39039J94772L73767
14146B4409K14602M22561K78185R8363j62289j63883j97313J39909o07336l02438
14136b55230K28869J58655l05782j13601L25975R54111l0322m86546k97069j00004
14126G9056N43987J92690l2899k26929n91162k6467O59698K44999k05590k9812
14116F07571M64125J34195j35578n47058M8268k68083p22784j2150l87505o8506
14106h87505J12834M91839Q08604J47388n98336k21295K84823k57775k54670K46625
14096a27468N83326K08217k34605K51491J83764n86237j59669k78462m97966o2085
$$ plain form
14166 563294 573730 432370 274412 104164 -230131 -85753 103068 144289 375903 142148
14156 142148 36525 33977 -238153 -368921 41734 -111994 -405091 -544130 -349358 24409
14146 24409 239011 661572 939757 1038120 875831 711948 514635 654544 47208 -255230
14136 -255230 -26361 132294 -173488 -287089 38886 992997 962675 476129 179060 79056
14126 79056 623043 815733 782834 555905 -35257 -61724 597974 842973 637383 607571
14116 607571 1071696 1205891 1070313 523255 571523 303440 -419344 -431494 -818999 -887505
14106 -887505 -774671 -282832 525772 673160 74824 -146471 138352 -119423 -374093 -127468
14096 -127468 455858 664075 429470 680961 864725 278488 118819 -159643 -657609 -719694
14086g19694M97389M96663M83767j60554m37705M8778n73581R5906N63926N51124
14076H46019L22759m26875j44377K4732o00432l11332m25983j23789K09778L94033
14066b35467k16120J52307Q2765n52410N75210P12045m9468j03369M68721O26193
14056A460407n0592j52245j96660k75809N74057J74102n09018K79454L78317K03958
14046A885971M21476n64371j129388n25879J04711M81526j13995J85145K78979
14037A024175K42551l15101J82962J61171l60817r1015J32446M9536k53632n9754
14027G12522L10759m9779J27904k38231m90940N01741P4415n46895L74148N07265
14017A282909L36919k35210P4386J19129m52640O3062j95444n29153n4922M00082
$$ plain form
14086 -719694 -222305 274358 758125 597571 159866 208644 -364937 -269031 294895 846019
14076 846019 1168778 741903 597526 622258 21826 -289506 -715489 -839278 -629500 -235467
14066 -235467 -451587 -299280 -216515 -768925 -193715 518330 468862 365493 834214 1460407
14056 1460407 1409815 1257570 1060910 785101 1359158 1533260 1024242 1303696 1682013 1885971
14046 1885971 2307447 1743076 613688 87809 192520 674046 560051 745196 1024175
14037 1024175 1266726 951625 1134587 1295758 934941 843926 976372 1025908 772276 712522
14027 712522 1023281 973502 1101406 863175 372235 873976 948391 401496 775644 1282909
14017 1282909 1619828 1384618 1459004 1578133 1125493 1188555 993111 463958 409036 809118
14007H09118O9606n0116l66703n3219K79323M18216q9447J69780L57554N24124
13997B068236k42012l30829k62608K40058O57777j10998o51341n19922M89391
13988A337752L70202N235J4256M19050J8092k5658o1174j98908J25J82792l56880
13977A704884J65743L78571M14317K31654k14044n33408k24389L11432o8280k95114
13967A871366L89000K63152j2365l20207p4897P32661k86194l86757L2768k06804
13957B001723J87714L3906n90151R3855k41818k728J63237L70680k14050l66207
13947A436161l93185o76958N77729J59092j72964O51994J81855j31641j5586k21550
13937A394947l8992M04663M10130j10813l08216K61351J94033L7566q8151K60290
$$ plain form
14007 809118 878724 828608 461905 408686 688009 1106225 1016778 1186558 1544112 2068236
13997 2068236 1826224 1495395 1232787 1472845 2130622 2019624 1368283 848361 1337752
13988 1337752 1707954 1713189 1727445 2146495 2164587 2138929 2077755 1878847 1878972 2061764 1704884
13977 1704884 1870627 2249198 2663515 2895169 2681125 2147717 1923328 2234760 2166480 1871366
13967 1871366 2260366 2523518 2511153 2190946 2116049 2848710 2562516 2175759 2208527 2001723
13957 2001723 2189437 2223343 1633192 1727047 1485229 1482501 1645738 2016418 1802368 1436161
13947 1436161 1042976 366018 943747 1102839 929875 1581869 1763724 1632083 1616497 1394947
13937 1394947 1355955 1760618 2170748 2059935 1751719 2013070 2207103 2244669 2156518 2416808
13927B416808j03743l53399l72221K9721M42299P4109j61411o2482l57117M45881
13917A998445J86967N66503o0289m99763j60507j06440L26351L9151j41369M09005
13907B558054j69787l31155K11881p18655m61652N46810L71062k98172k72944
13898A435442n9392K78000k85922o25313n16315M14650N60738M70752o3738O8800
13888A677702K36107O9923l82546n01533P1839J0422L1189n82444k42541P25762
13878A113880L94260N9366P804k8118k6343j67710N9507j4234p6873J79427J83171
13867A684137l80656J50787J09590K4178j35831J30311J52544k13385j93489M11802
13857A739988j18495m6505L9558j5896J51998j21350N971P2192K51163K90672
$$ plain form
13927 2416808 2313065 1959666 1587445 1617166 2059465 2133574 1972163 1909681 1552564 1998445
13917 1998445 2185412 2751915 2691626 2191863 2031356 1924916 2251267 2290418 2149049 2558054
13907 2558054 2388267 2057112 2268993 1550338 1088686 1635496 2006558 1708386 1435442
13898 1435442 1376050 1654050 1368128 742815 226500 641150 1201888 1672640 1608902 1677702
13888 1677702 1913809 1983732 1601186 1099653 1171492 1181914 1213103 630659 388118 1113880
13878 1113880 1508140 1567506 1575310 1547192 1520849 1353139 1412646 1398412 1321539 1500966 1684137
13867 1684137 1303481 1454268 1563858 1588036 1452205 1582516 1735060 1521675 1328186 1739988
13857 1739988 1621493 1574988 1614546 1598650 1750648 1629298 1635269 1707461 1958624 2249296
13847B249296L50481j75921l71484J90619k25763j068422m33881R40975j27463
13838A328437n99693K06814K59554K49576K02927n27142l89780q3434M4955P61894
13828A454108Q2778m47061l4194J89727j07484Q8197K34645j78101J59729K73745
13818A716089k04977k80751L3444j26707n2434K87176m9363l20002Q981P0803
13808A082259k68982M66905L17516m34582n02156L20729P4689O3883M94555k4598
13798A590218o49465M9302L04768J94415K83276L39494K06646J09624l7809j20315
13788B270154L09871J72094L18886L01411m84319J06150o03384n20073R7356K72810
13778B240956K0463L93827P60682K394m27746J12407L12462K74090l06001p49024
$$ plain form
13847 2249296 2599777 2423856 2052372 2242991 2017228 948806 514925 1455900 1328437
13838 1328437 728744 935558 1195112 1444688 1647615 1120473 730693 647259 692214 1454108
13828 1454108 1536886 1089825 1055631 1245358 1137874 1226071 1460716 1282615 1442344 1716089
13818 1716089 1511112 1230361 1263805 1137098 1084664 1371840 1322477 1002475 1011456 1082259
13808 1082259 813277 1280182 1597698 1163116 660960 981689 1056378 1120261 1614816 1590218
13798 1590218 940753 990055 1294823 1489238 1772514 2112008 2318654 2428278 2390469 2270154
13788 2270154 2580025 2752119 3071005 3372416 2888097 2994247 2390863 1870790 1968146 2240956
13778 2240956 2261419 2655246 3415928 3418322 2990576 3102983 3415445 3689535 3383534 2634510
13768B634510J43838k06350j42451P69453L56991n96976k41155L74374L76705
13759C468939l42796J62014K28070l2650l28546k65590k67833j38157L28952m7023
13749B765380j855O6070P2887o36708j97201K28811K33374n11290m41748l34734
13739A242986J9573P69148N59893k45887M51654M38156r8143k9040j27845m00466
13729B580029j02041n80096o07900M45105Q39404M8417j76327J41896L65636j02592
13719B851531m24333p89783k01836J20957j17258l02604L05302M92280o0900k73820
13709A599536o0944k44771O50602M14227o0060j4243J86443j29564q0109J30114
13699B391231R863M64317O71316K39030N4252n1703N0494J68046J33568k24557
$$ plain form
13768 2634510 2778348 2571998 2429547 3199000 3555991 2959015 2717860 3092234 3468939
13759 3468939 3126143 3288157 3516227 3483577 3155031 2889441 2621608 2483451 2812403 2765380
13749 2765380 2763525 2829595 2902482 2265774 2068573 2297384 2530758 2019468 1577720 1242986
13739 1242986 1262559 2031707 2591600 2345713 2797367 3235523 3137380 3108340 2980495 2580029
13729 2580029 2477988 1897892 1289992 1735097 2574501 2622918 2446591 2588487 2954123 2851531
13719 2851531 2427198 1637415 1435579 1556536 1439278 1136674 1441976 1934256 1873356 1599536
13709 1599536 1538592 1293821 1944423 2358650 2298590 2284347 2470790 2341226 2261117 2391231
13699 2391231 2401094 2865411 3536727 3775757 3830009 3778306 3828800 3996846 4130414 3905857
13689C905857n8535p9021k37723p86893r7198m3716l25501N93004P36144M81890
13679D088308n3916l46800K98923L64151Q20667K10097j25954k92537j63963k55443
13669D543533m61329L46111N25931M05970L37170M84550K93313j86804K49619
13660F538064M37963J40768K10536K72092P48808L9351l13008J64471j88589J65689
13650H216145M34385P76899L82402j04468l09374N69089L21499Q10703M58703
13641A1555983M45034M1403J78353K20172R5166k02313n50974Q68910K83137K81240
13631A3216111j56120l25279J57049R4847K19055L81264j66449o40595l13791
13622A2466092m30598O7365j13242q3949J26315o79935n89558O40047k9444l09488
$$ plain form
13689 3905857 3847322 3768301 3530578 2743685 2646487 2602771 2277270 2870274 3606418 4088308
13679 4088308 4034392 3687592 3986515 4350666 5171333 5381430 5255476 4962939 4798976 4543533
13669 4543533 4082204 4428315 4954246 5360216 5697386 6181936 6475249 6288445 6538064
13660 6538064 6976027 7116795 7327331 7599423 8348231 8387582 8074574 8239045 8050456 8216145
13650 8216145 8650530 9427429 9809831 9705363 9395989 9965078 10286577 11097280 11555983
13641 11555983 12001017 12042420 12220773 12440945 12536111 12333798 11782824 12651734 12934871 13216111
13631 13216111 13059991 12734712 12891761 12986608 13205663 13586927 13420478 12779883 12466092
13622 12466092 12035494 12102859 11989617 11905668 12031983 11352048 10762490 11402537 11373093 11063605
13612A1063605p08995k73158M58513K32189j88932l76889L3067J33761l11594
13603A0061567l00942l51092p00476J05483L86164L0958k21625l2546K08813j93282
13593H993022k34457n04372M95096M58330L38950J32247l24813N39647L62779
13584A0256429k16735K86240P39592n5618m12446M3184J53046j45242r007N69245
13574A1208688R00060K54953O19749M07319M05087R53851O06028J292272R94418
13565A7642425O94188P95945P99616J291733J516176J038968J028068J680368
13557B6487487K018913J220271J202562J605978K501421J977789J865425J780648
13549D0660494K060103K028041K356903K317449K140285K586416L066575L197942
$$ plain form
13612 11063605 10354610 10081452 10539965 10772154 10583222 10206333 10239400 10373161 10061567
13603 10061567 9760625 9409533 8709057 8814540 9200704 9231662 9010037 8977491 9186304 8993022
13593 8993022 8758565 8254193 8749289 9207619 9546569 9678816 9354003 9893650 10256429
13584 10256429 10039694 10325934 11065526 11009908 10597462 10640646 10793692 10648450 10639443 11208688
13574 11208688 12108748 12363701 12983450 13390769 13795856 14749707 15355735 16648007 17642425
13565 17642425 18336613 19132558 19932174 21223907 22740083 23779051 24807119 26487487
13557 26487487 28506400 29726671 30929233 32535211 35036632 37014421 38879846 40660494
13549 40660494 42720597 44748638 47105541 49422990 51563275 54149691 57216266 60414208
13541F0414208K565409K869503K944324K671286L343526L768760K832524K426846
13533H3836386L147914K395066K444990K485990L148362L094423L723150L002290
13525A07278571L000056L361983L172087K988214M207366N226268O050012O994074
13517A42278631P917597Q264713Q917166J0433286J1000408J1550209J2990320
13510B13352330J4393746J4389444J4794283J5391070J5594630J6608088J7058998
13503C21582589J6733243J5800619J4415645J2264690J0939867R788596R125787
13496D10651036P638317O857628N261173L628753K439106J844179J310913Q71071
13488D40502176m8118l1793j212217k185960l939035o434048p689832r897355
$$ plain form
13541 60414208 62979617 65849120 68793444 71464730 74808256 78577016 81409540 83836386
13533 83836386 86984300 89379366 91824356 94310346 97458708 100553131 104276281 107278571
13525 107278571 110278627 113640610 116812697 119800911 124008277 129234545 135284557 142278631
13517 142278631 150196228 158460941 167378107 177811393 188811801 200362010 213352330
13510 213352330 227746076 242135520 256929803 272320873 287915503 304523591 321582589
13503 321582589 338315832 354116451 368532096 380796786 391736653 401525249 410651036
13496 410651036 418289353 425146981 430408154 434036907 436476013 438320192 439631105 440502176
13488 440502176 440454058 440422265 439210048 437024088 433085053 426651005 418961173 409063818
13480D09063818j0754775j1456881j2385972j3196358j3518253j3593714j4064681
13473C20093184j4904126j3677125j2441781j0900331j0335218r957156r609037
13466B38268410r067346q014482o730630o717774o349288n468354m587929l949747
13458A87382860l837405k726818k522992k291433k007502k360146l116764l352661
13450A65167139l411642l182850l378499k758690k870274l577500l414615k621290
13442A39951779k874215k811977l091868l355350l122767k525880l020287k911334
13434A16238101k290227j792961j786795k565589k346961j622375j925197k436605
13426I9471391k375610k322103j521183j702507j899430j906743r65644q83916
$$ plain form
13480 409063818 398309043 386852162 374466190 361269832 347751579 334157865 320093184
13473 320093184 305189058 291511933 279070152 268169821 257834603 247877447 238268410
13466 238268410 229201064 221186582 214455952 207738178 201388890 195920536 191332607 187382860
13458 187382860 183545455 180818637 178295645 176004212 173996710 171636564 168519800 165167139
13450 165167139 161755497 158572647 155194148 152435458 149565184 145987684 142573069 139951779
13442 139951779 137077564 134265587 131173719 127818369 124695602 122169722 119149435 116238101
13434 116238101 113947874 112154913 110368118 107802529 105455568 103833193 101907996 99471391
13426 99471391 97095781 94773678 93252495 91549988 89650558 87743815 86778171 85894255
13418H5894255j751083p73888o00225j359248j001693j044506j256362p73588
13410G7333662p86071j267577q90269r08831o39050n62460q80097j215002p69833
13401F9414472r14889j23348M60412p76956m03713o2003K00460J09467l30696
13392F7573206p47044m17892l70956m11944n19263j35313l66280o81613n7553
13383F3865348j39689k95762n34466j85511n20510o00617j15411q71150q82697
13374E9719535n33368P4869p69198m49487o74858n10302o01129j568995r60623
13365E3726444l39059o29579j042580k19346o45747q24741o67342j133836o35032
13356D7589182n13603j44646q93962p81658n62444n69327m60090r852m83137q53805
$$ plain form
13418 85894255 84143172 83369284 82769059 81409811 80408118 79363612 78107250 77333662
13410 77333662 76547591 75280014 74389745 73480914 72841864 72279404 71399307 70184305 69414472
13401 69414472 68499583 68376235 68836647 68059691 67655978 67593975 67794435 67903902 67573206
13392 67573206 66826162 66408270 66037314 65625370 65106107 64970794 64604514 63922901 63865348
13383 63865348 63725659 63429897 62895431 62709920 62189410 61588793 61473382 60602232 59719535
13374 59719535 59186167 59261036 58491838 58042351 57367493 56857191 56256062 54687067 53726444
13365 53726444 53387385 52757806 51715226 51495880 50850133 50025392 49358050 48224214 47589182
13356 47589182 47075579 46930933 46036971 45255313 44692869 44123542 43663452 43653600 43170463 42316658
13346D2316658n57568o15496p93382m22603J10319L99103l24910J47018k54008
13337D0005131k11011r0541K03376l67911n50265l70199k04530N8277j39639l82876
13327C7949812K25699J09624K59642l63395o53855j115574p46885m27483m40341
13318C4797244k34725l08116p71511n11631K15008k37856k29451m19566m17604
13309C1881792o58274j83854j44339r06284o15053k51834m5919K27525L01672
13300B9605432n49757l58768r74599R7491P231p37192r03011l98505k78866j50720
13290B5358736l64135m93380j183394r46732m80001m32002k85456o15248n53925
13281B0004463k0245o42648r39237n65525l3795k21817k47481m90734l24642p71407
$$ plain form
13346 42316658 41759090 41143594 40350212 39927609 40037928 40437031 40112121 40259139 40005131
13337 40005131 39794120 39703579 39906955 39539044 38988779 38618580 38414050 38472327 38332688 37949812
13327 37949812 38175511 38285135 38544777 38181382 37527527 36411953 35665068 35237585 34797244
13318 34797244 34562519 34254403 33482892 32971261 33186269 32948413 32718962 32299396 31881792
13309 31881792 31223518 31039664 30895325 29989041 29373988 29122154 29076235 29303760 29605432
13300 29605432 29055675 28696907 27722308 27819799 27827030 27089838 26186827 25788322 25509456 25358736
13290 25358736 24994601 24501221 23317827 22371095 21891094 21459092 21173636 20558388 20004463
13281 20004463 19984218 19341570 18402333 17836808 17803013 17581196 17333715 16842981 16518339 15746932
13271A5746932J48895m44696j206660j00052J74098R62j83112j296540p49074
13262A2090753m01230l7903j95006j160585o87216O7540L46483k41381m78642
13253I302813m89454k71182l14020q1504J63315n51485p5139l90709Q3161J98922
13243G574718k49021l79063Q7757M2952m64882m75694K03917O55620J1398j00805
13233F906897n51501n5057j47012l34022p4677n8083K56318K67628M536o44456
13223E570571q00543M2181N89234k31304k5245J46772M53610M40831M19033K21496
13213F826636o90963n67989p3889k74974J37473M25721j68313J93828K82884o47413
13203E443001m36275L43859K68513K8413J27209k47805O9648J59415j62353n26708
$$ plain form
13271 15746932 15895827 15451131 14244471 14144419 14318517 14319479 14136367 12839827 12090753
13262 12090753 11689523 11651620 11456614 10296029 9608813 9676353 10022836 9781455 9302813
13253 9302813 8813359 8542177 8228157 8146653 8309968 7758483 7683344 7292635 7375796 7574718
13243 7574718 7325697 6946634 7034391 7077343 6612461 6136767 6340684 6996304 7007702 6906897
13233 6906897 6355396 6300339 6153327 5819305 5744628 5686545 5942863 6210491 6215027 5570571
13223 5570571 4770028 4812209 5401443 5170139 5144894 5291666 5745276 6186107 6605140 6826636
13213 6826636 6135673 5567684 5493795 5218821 5356294 5782015 5613702 5807530 6090414 5443001
13203 5443001 5006726 5350585 5619098 5647511 5774720 5526915 5596563 5755978 5593625 5066917
13193E066917l65082J54777L44916k33206k02984O19795K9707J42334N11133N38429
13183F606736j92463l25226k07309m20309m60083K60069K51834L62698j94511
13174E681436m77359j20043k41024M64609M15402L09353j60037K12218n55092
13165E529463j44118k28673j37271J14276o5448J83116P94531m5019n28323l53526
13155E119008J29980M61379K30483l52657o31247q1616K05611K69906K9545O76913
13145F057305K1146l18695o55348L97561L50437p6771r18458l61059L51071k38277
13135D608912J00884Q91031N94132q94367l45675j67648n63899L20648k13974
13126D330044n58244Q3373k58960j32123j95691M79428L3135j04799n19289j47324
$$ plain form
13193 5066917 4701835 4856612 5201528 4968322 4765338 5385133 5414840 5557174 6068307 6606736
13183 6606736 6414273 6089047 5881738 5461429 5001346 5261415 5513249 5875947 5681436
13174 5681436 5204077 5084034 4843010 5307619 5723021 6032374 5872337 6084555 5529463
13165 5529463 5385345 5156672 5019401 5133677 5068229 5251345 6045876 6000857 5472534 5119008
13155 5119008 5248988 5710367 5940850 5588193 4956946 4875330 5080941 5350847 5380392 6057305
13145 6057305 6078451 5759756 5104408 5501969 5852406 5775635 4857177 4496118 4847189 4608912
13135 4608912 4709796 5600827 6194959 5300592 4954917 4787269 4223370 4544018 4330044
13126 4330044 3771800 3855173 3596213 3464090 3268399 3747827 3780962 3676163 3156874 3009550
13116C009550N095r3384K40023Q9824n3175k48824J34541l81100j61613p3380
13106B467557n9995J9126J99191O10214l25971o72384J49251K21743j23197n59627
13096A925908p874l03144P59422K26559l17613p28701Q2468M11785R7175k59869
13086A886116M9639L46276K4186j28666K3335M50496j35526o40063l07491L22785
13076A891087L01783L19511j36797P55387K97123m14403r2420K14893Q68o36798
13066B500234n25633k85454M59888P40919M63181o12449m09562m52022K4626L74048
13056B277776M47300k15280K61017N87707M97992p2529k08121n31478l42794n24419
13046B177171r13015J19363P14582j64812j59462L086L03840L97475J02010k50376
$$ plain form
13116 3009550 3014645 2921261 3161284 3251108 3197933 2949109 3083650 2702550 2540937 2467557
13106 2467557 2407562 2426688 2625879 3236093 2910122 2237738 2386989 2608732 2485535 1925908
13096 1925908 1918034 1614890 2374312 2600871 2283258 1554557 1637025 2048810 2145985 1886116
13086 1886116 1935755 2282031 2306217 2177551 2200886 2651382 2515856 1875793 1568302 1891087
13076 1891087 2192870 2512381 2375584 3130971 3428094 3013691 2921271 3136164 3137032 2500234
13066 2500234 1974601 1689147 2149035 2889954 3353135 2740686 2331124 1879102 1903728 2277776
13056 2277776 2725076 2509796 2770813 3358520 3856512 3783983 3575862 3044384 2701590 2177171
13046 2177171 1264156 1383519 2098101 1933289 1773827 1776913 2080753 2478228 2580238 2329862
13036B329862K26598K84885J41479j54226j35143p6201L9728p0781M19975L6592
13026C042768j81715n9760j13977Q146O1100j55745L32368N31626j67499k48275
13016C049037J43214O3658P2892L83668Q18672m3173n84394k55643J38240m80303
13006C305868q49709J87200J69682j33225N39423J9374K28992K7457k17396j54287
12996C123379j68455p6665r7077R8558K48204L66907k10429J74401j21374j91373
12986C146076k4823m69607K69545M16294L7609m23632K55227k5191n54931l13117
12976B313450O66780K24000K54774m32340l94834K67320P7284n95331p0609J23770
12966B434264k75795J0593J88489m82774n0970L80712J82380O1792Q7292Q7197
$$ plain form
13036 2329862 2556460 2841345 2982824 2828598 2693455 2617254 2656982 2586201 3006176 3042768
13026 3042768 2861053 2801293 2687316 2695462 2756562 2600817 2933185 3464811 3297312 3049037
13016 3049037 3192251 3255909 3328801 3712469 4531141 4487968 3903574 3647931 3786171 3305868
13006 3305868 2456159 2643359 2813041 2679816 3219239 3238613 3467605 3495062 3277666 3123379
12996 3123379 2954924 2878259 2781182 2879740 3127944 3494851 3284422 3458823 3337449 3146076
12986 3146076 3121253 2651646 2921191 3337485 3375094 2951462 3206689 3181498 2626567 2313450
12976 2313450 2980230 3204230 3459004 3026664 2631830 2899150 2976434 2381103 2310494 2434264
12966 2434264 2158469 2169062 2357551 1874777 1823807 2204519 2386899 2448691 2535983 2623180
12956B623180r0808N2738N1996J28916l02288k41718o08237j50219K5314l15523
12946A173351J90187J83619L03398k57670L7270l17674m29569K29937K28365J85058
12936A526272M11351j49342m06711k54468J02050K0253k5550n08222J11020N24006
12926A350659k41958K60712q5408L70610K38952k37955k39858n6782j04629N735
12916A260078j33247k78913j21870L05490j56986L6096N137k48273J8373L4443
12906G20328m08509j26634R852N91280N49213L27528j55331q9432o44423J84243
12896I58115N11846k0387L99241J07062k13474j61264j40152m09627o31883L29279
12886G28756l09268j22673l469j92212l15381m7905Q53424K80073l87293J14996
$$ plain form
12956 2623180 2532372 2585110 2637106 2766022 2463734 2222016 1613779 1463560 1488874 1173351
12946 1173351 1363538 1547157 1850555 1592885 1630155 1312481 882912 1112849 1341214 1526272
12936 1526272 1937623 1788281 1381570 1127102 1229152 1249405 1223855 715633 826653 1350659
12926 1350659 1108701 1369413 1284005 1654615 1893567 1655612 1415754 1358972 1254343 1260078
12916 1260078 1126831 847918 726048 1031538 874552 910648 915785 667512 685885 720328
12906 720328 311819 185185 195037 786317 1335530 1663058 1507727 1418295 773872 958115
12896 958115 1469961 1449574 1848815 1955877 1742403 1581139 1440987 1031360 399477 728756
12886 728756 419488 296815 293346 101134 -214247 -262152 591272 871345 484052 599048
12876E99048N16935j33595j46363j13881k94636P3957k11680J34368J33383k68659
12866B88877L5220J9553J64327O20754O87483K73588m81276r3883L06137J30810
12856A951590l47318m26326J13841k69182l60326N23651N54320M44330o76236
12847A508344l8963p0612k4076j75313k02991k6196l01328J26755L23661O79811
12837A799092M64169L5120l33083q39358j64593L5240j31113k14379J25633L59404
12827A136132k29385K48339J91325J11450k43932J73788K05478O5309l07855n94986
12817G55663J89228R3495k9907l19631M40773O49649J51329l94784q30467n90845
12807A14503J35752N06382J42767L24927M62722J50460j74242l27777p1045J99799
$$ plain form
12876 599048 1115983 982388 836025 722144 427508 501465 289785 424153 557536 288877
12866 288877 324097 343650 507977 1128731 1816214 2089802 1608526 1514643 1820780 1951590
12856 1951590 1604272 1177946 1291787 1022605 662279 1185930 1740250 2184580 1508344
12847 1508344 1469381 1398769 1374693 1199380 996389 970193 668865 795620 1119281 1799092
12837 1799092 2263261 2298381 1965298 1125940 961347 996587 865474 651095 776728 1136132
12827 1136132 906747 1155086 1346411 1457861 1213929 1387717 1593195 1658504 1350649 755663
12817 755663 944891 1038386 1008479 688848 1129621 1779270 1930599 1535815 705348 114503
12807 114503 250255 756637 899404 1224331 1687053 1837513 1663271 1335494 1264449 1464248
12797A464248k15219j57437m85605n29786J30217O49269N74203J7142p6000k21961
12787A149071m44198o34764M3695J85207k70591k06802K57952K83196o8674j6942
12777B77150M08409n056L75713K74648j61922l25998J83515n23744k59678p4904
12767A68133K56235P7291L49709o72252J25702M00934m17736q8465J73185L84710
12757G57446O4153m17263N9717L91836j97034l92797q4308j36014k32189N28149
12747C41696K82573L84783K28199m84896n89909k25877j34308K20052K26404J81107
12737D29824L96299j3661k69241K44742k62887l46275n7069K70831K80622l36915
12727C36270n01644j39242J30877M6041K87877o0128Q3190M11143M93683O9512
$$ plain form
12797 1464248 1249029 1091592 605987 76201 206418 855687 1429890 1447032 1371032 1149071
12787 1149071 704873 70109 113804 299011 28420 -178382 79570 362766 294092 277150
12777 277150 685559 680503 1056216 1330864 1168942 842944 1026459 502715 243037 168133
12767 168133 424368 501659 851368 179116 304818 705752 288016 199551 372736 757446
12757 757446 821599 404336 464053 855889 658855 266058 181750 45736 -186453 341696
12747 341696 624269 1009052 1237251 752355 162446 -63431 -197739 22313 248717 429824
12737 429824 826123 812462 543221 787963 525076 178801 121732 392563 673185 336270
12727 336270 -165374 -304616 -173739 -127698 160179 100051 183241 594384 1088067 1157579
12717A157579p73740K55660J90267n10526j27688Q756R2476N95296M38643N1367
12707A378090K096j93873j67502j11132m74595n6063l81293o8825O10159J79325
12697G16387J17783k9280l4434k53657J00401J70431m4714Q1386m2256M2540k25051
12686E99536l23378j13050k475M1173N62961J75382P2954K55202L33686j52757
12676A449234k32407J46665m2566p79728k22921k34924m8472J07749K10557P4813
12666D28000M46937M02725k66196j71633l27057n94641K09394N51483O51084N9239
12656A389335j18983l96560n58094k36697l4721J19742M31771J75706J84388k80259
12646F75628m73811M38975N62377m83540r14433L42652N41022N4431N49313j37835
$$ plain form
12717 1157579 383839 639499 829766 319240 191552 200308 292784 888080 1326723 1378090
12707 1378090 1380186 1186313 1018811 907679 433084 377021 -4272 -73097 537062 716387
12697 716387 834170 804890 770456 516799 617200 787631 742917 824303 782047 824587 599536
12686 599536 276158 163108 160633 201806 764767 940149 1013103 1268305 1601991 1449234
12676 1449234 1216827 1363492 1320926 541198 318277 83353 34881 142630 353187 428000
12666 428000 874937 1277662 1011466 839833 512776 -81865 127529 679012 1330096 1389335
12656 1389335 1270352 873792 315698 79001 44280 164022 595793 771499 955887 675628
12646 675628 201817 640792 1203169 719629 -194804 147848 688870 743301 1292614 1154779
12636A154779j29327J80994K02684k91041r86172l16260j3352o03516K06259J053906
12626D58954L90016m68697m12283N42153L20822j20412m38092k30819O6606j09120
12616h72O89984j8836L49121K09720j15847j025408k67191N54279k86948j195
12606H6807K4201K04034N53737o7276j53037J06789j34091j03392p8519l60517
12596G8736l17136L2116M98290M61589j75381P2195k14915l87141L07897K00056
12586E56306k93582L76173q7781q21283l84532N49678Q56569J14426m22342L40818
12576G84450M79599m79795p94593k93032O26497J84410k89885j00531N4119K66835
12566D38074k2788q5047K30263l04161R209L6603j27707p0j99102j65551P31055
$$ plain form
12636 1154779 1025452 1206446 1409130 1118089 131917 -184343 -197695 -801211 -594952 458954
12626 458954 848970 380273 -32010 510143 830965 710553 272461 41642 108248 -872
12616 -872 689112 670276 1019397 1229117 1113270 87862 -179329 374950 88002 86807
12606 86807 111008 315042 868779 801503 648466 755255 621164 517772 439253 78736
12596 78736 -238400 -206284 292006 753595 578214 650409 435494 48353 356250 556306
12586 556306 262724 638897 551116 -270167 -654699 -105021 751548 865974 443632 784450
12576 784450 1264049 784254 -10339 -303371 323126 507536 217651 117120 171239 438074
12566 438074 415286 330239 560502 256341 265550 302153 174446 174376 -24726 -190277 540778
12555E40778K43262p902J60205l02918k46980m62455J5158L02374k29087J01127
12545A13562L94279Q2069m13175j46870J69549N48054K90223l45696Q3226O71120
12535A446341p2510p40549k03546q5267j58152K34357j4735P3132l02521m3208
12525A33342r3337K25244J12851j10564p8798j0709M18714N36443j92408j79342
12515G61436j81516K3116o2349j48283J39941k56731K5719J5767J45565J36003
12505E98668K9358n81859j26386K21559L17573J53297M83022j36061K77321m18191
12495H18301k85488l01525m2531M14071L60679J41374p01827n31951N5001M82556
12485D08660M37883N07393k92135k00308J68075J10044m56014m13012k34501L04154
$$ plain form
12555 540778 784040 776138 936343 633425 386445 -76010 -60852 241522 12435 113562
12545 113562 507841 589910 176735 29865 199414 747468 1037691 691995 775221 1446341
12535 1446341 1373831 633282 429736 344469 186317 420674 405939 479071 176550 133342
12525 133342 40005 265249 378100 267536 188738 178029 596743 1133186 940778 761436
12515 761436 579920 603036 540687 392404 532345 275614 301333 317100 462665 598668
12505 598668 628026 46167 -80219 141340 458913 612210 1095232 959171 1236492 818301
12495 818301 532813 231288 188757 602828 963507 1104881 403054 -128897 -73896 408660
12485 408660 846543 1353936 1061801 861493 1029568 1139612 683598 270586 36085 340239
12475C40239M17725J57933n81922l50106K28152M60473N37146K98379j89139m93268
12465H25612m38170L7216L12659j39503J6166j36792k15296q924J6942K17361
12455D87271K03508R3352j52786R4283Q7784J48262J53554j91257j878n14770
12445D07323l25259L28736J96416L72883L50685J12162k43054l70130K9641K32627
12435A092030l79896n41976J96386M07737J15057n29582q7432n8230L92944l1997
12425E75041J64337M58893P2008j22715o85618m7462Q00848k01099n38833j28821
12415C46579M11232N14080j90732N01658m0483j028753l87873o5553M26338J28263
12405F14756M20378M56808j25880J89360n16383k48277M90384K45548j18032Q5824
$$ plain form
12475 340239 757964 915897 333975 -16131 212021 672494 1209640 1508019 1318880 825612
12465 825612 387442 424658 737317 597814 613980 477188 261892 252968 269910 487271
12455 487271 690779 784131 631345 725628 813412 961674 1115228 923971 922093 407323
12445 407323 82064 410800 607216 980099 1330784 1442946 1199892 829762 859403 1092030
12435 1092030 712134 170158 366544 774281 889338 359756 272324 214094 607038 575041
12425 575041 739378 1198271 1270279 1147564 461946 414484 1215332 1014233 475400 346579
12415 346579 757811 1271891 1081159 1582817 1542334 513581 125708 60155 486493 614756
12405 614756 1035134 1491942 1366062 1555422 1039039 790762 1281146 1526694 1408662 1494486
12395A494486j42835o85932k99893k72300j74135P66839M88036J92171m51980
12386I14457J96481K35348l33808k55309r7941l2673k77010L688J22369l16167
12376A59435l43828M651r1749Q8400N17734O70664M6229r0846j15071k09500o3029
12365E73090k09346O80860K6008m10473Q6209K69573K85000J32737p69520k88421
12355C75717N96839k96869o8107J76776o6732N53562M2055o84812M69316P50886
12345A848631J27562l21175N2089J40939m84684m30075J69984J49295K35640K74655
12335A762861p39447J23226J60623l64942J25811N50595L03824L94522k82028
12326B035045m29843j62947K51889j98420p0859J45180K0098j53819k49289K10716
$$ plain form
12395 1494486 1351651 665719 365826 93526 -80609 686230 1174266 1366437 914457
12386 914457 1110938 1346286 1012478 757169 659228 626555 349545 353233 475602 159435
12376 159435 -184393 -179742 -271491 -183091 334643 1005307 1051536 960690 845619 636119 573090
12365 573090 363744 1044604 1070612 660139 746348 1015921 1300921 1433658 664138 375717
12355 375717 972556 675687 607580 784356 717624 1271186 1313241 628429 1097745 1848631
12345 1848631 1976193 1655018 1707107 1848046 1363362 933287 1103271 1252566 1488206 1762861
12335 1762861 1023414 1146640 1307263 942321 1068132 1618727 1922551 2317073 2035045
12326 2035045 1605202 1442255 1694144 1495724 1424865 1570045 1590143 1436324 1187035 1397751
12316A397751L80445K60203p24405p4927L4216j53691L91053O78282N17857J89147
12306B895931k01656r08350m26768L51472M72859l30295m18810L24745n22166
12297A236962J9958R901k16280n1272q1332M23159R4898k84549k68583K38674
12287A121536M19300M79178j80863m63192L953O3073M06247j07314J80986k78900
12277A644004k52227J83363l63648m50285L05201j50139j88420K19353M21062
12268A368264K1573m2441N1446Q982K65730N64813l2291n8121j04780l15740k25078
12257A502357k48550j31592j84331k55044K12148M74912j88437k06087j16796
12248H58580k19856K97527L0298M46319L83944L82649J85554o00804o4040N98080
$$ plain form
12316 1397751 1778196 2038399 1313994 1239067 1273283 1119592 1510645 2188927 2706784 2895931
12306 2895931 2694275 1785925 1359157 1710629 2183488 1853193 1434383 1759128 1236962
12297 1236962 1256920 1266821 1050541 999269 917937 1341096 1435994 1151445 882862 1121536
12287 1121536 1540836 2020014 1839151 1375959 1379912 1442985 1849232 1741918 1922904 1644004
12277 1644004 1391777 1575140 1211492 761207 1066408 916269 727849 947202 1368264
12268 1368264 1389837 1347396 1398842 1407824 1673554 2238367 2206076 2147955 2043175 1727435 1502357
12257 1502357 1253807 1122215 937884 682840 894988 1369900 1181463 975376 858580
12248 858580 638724 936251 966549 1412868 1796812 2179461 2365015 1764211 1700171 2298251
12238B298251l41649j95560Q4077l10086K98285o3251p90416p423N38929P20253
12228B231410P93585L37157k65810k70104l70713k90367l91972M21988k60175
12219A934999Q4560L16095Q894J25583r4554j03974n92145K16989L51337j94051
12209B053733L59538O24804M26231o79562o24050l07550J88056l56674N88231
12200B272757N17963Q1720n6439j29492j97244L20379j1592J6482K49550L3316
12190C097400M38756M93054j4497n40934j66873r6599j35713j46401N93641K31284
12180C753118q8223m26027j01374j24252L13236M84802J1137n10284j07038m75924
12170B729171p13268P22231N30806j06074j15774N4914K08845O21829k05047n86658
$$ plain form
12238 2298251 1956602 1761042 1845119 1535033 1833318 1770067 979651 972228 1511157 2231410
12228 2231410 3024995 3362152 3096342 2826238 2455525 2165158 1773186 2195174 1934999
12219 1934999 2019559 2335654 2344548 2470131 2375577 2271603 1679458 1896447 2247784 2053733
12209 2053733 2413271 3038075 3464306 2784744 2160694 1853144 2041200 1684526 2272757
12200 2272757 2790720 2872440 2816001 2686509 2489265 2809644 2798052 2814534 3064084 3097400
12190 3097400 3536156 4029210 4014713 3473779 3306906 3210307 3074594 2928193 3521834 3753118
12180 3753118 3664895 3238868 3137494 3013242 3326478 3811280 3822417 3312133 3205095 2729171
12170 2729171 2015903 2738134 3268940 3162866 3047092 3102006 3310851 3932680 3727633 3140975
12160C140975J37308l22446o9920L43703o5035L35231J9749k03874n33693K25597
12150C007595M93616p4639L4292l32406m81863M05393J65505K58281k79054j38595
12140C058125J61855k47454P049O5388K80105L24592j20193J13589l71133l4240
12130C237683N03539K88364M65595r3467K17958j77382m27313Q37081M50934n61393
12120D741599l01091n98186M1429M58581P63093M01500o1285o24248J08807L35533
12110E265732K34092L71353J3391l35758j58442J14506J0110M31027l49559K92684
12100E889136K59595M18296m87722j38673J17947L78505l30899K51845N33257
12091F891287R2562J80680J48951o3064L78807M81114M16158M39484J70010N40206
$$ plain form
12160 3140975 3278283 2955837 2885917 3229620 3164585 3499816 3519565 3315691 2781998 3007595
12150 3007595 3501211 3426572 3460864 3128458 2646595 3051988 3217493 3475774 3196720 3058125
12140 3058125 3219980 2972526 2979575 3044963 3325068 3649660 3529467 3643056 3271923 3237683
12130 3237683 3741222 4029586 4495181 4401714 4619672 4442290 4014977 4852058 5302992 4741599
12120 4741599 4440508 3842322 3883751 4342332 5105425 5506925 5445640 4821392 4930199 5265732
12110 5265732 5499824 5871177 5884568 5548810 5390368 5504874 5514984 5946011 5596452 5889136
12100 5889136 6148731 6567027 6079305 5940632 6058579 6437084 6106185 6358030 6891287
12091 6891287 6983849 7164529 7313480 7250416 7629223 8110337 8526495 8965979 9135989 9676195
12081I676195O3374M41145M95651j71295J00497L22108J48654L25005l95259K09471
12071A1215546O29795O25496L9116M6969J32039k76366l69954N42285L83130j66984
12061A2801072q51619q5333K56573N59835M73615l77229m11754k96960J04007
12052A2172207Q26665K30147j0300J3304O13173p1141n38003m88767q8679N42801
12042A3201407P28255J66153m77018l7253k14595j95326m81008M48710J90021
12033A3329346k31823J33927K29988J47810K10647k33809J74175L8038M58448
12024A4256747N91241j07683j32347P0213Q1673p2138J81206K14904J53373M81161
12014A5718350O80767j17891k93493q1944O16238L33165L55501k28732k13308
$$ plain form
12081 9676195 9739569 10180714 10676365 10505070 10605567 10927675 11076329 11401334 11006075 11215546
12071 11215546 11845341 12470837 12509953 12556922 12688961 12412595 12042641 12584926 12968056 12801072
12061 12801072 11949453 11864120 12120693 12680528 13154143 12776914 12365160 12068200 12172207
12052 12172207 12998872 13229019 13218719 13232023 13845196 13774055 13236052 12747285 12658606 13201407
12042 13201407 13929662 14095815 13618797 13581544 13366949 13171623 12690615 13139325 13329346
12033 13329346 13097523 13231450 13461438 13609248 13819895 13586086 13760261 13798299 14256747
12024 14256747 14847988 14740305 14607958 14678171 14759844 14687706 14868912 15083816 15237189 15718350
12014 15718350 16399117 16281226 15987733 15905789 16522027 16855192 17210693 16981961 16768653
12005A6768653M45608Q25260J059832L30434j81779J47488N26182N27540N71250
11996B1020468P14919M88199P49514R14014J81787L51790L48188O07881R39178
11987B6315938R71935J039255P85881L60593P72656Q02739J133147J581573J076561
11978C4840278Q87666J404993J146841J122308J723049J676385R82113J570741
11970D5354374J548639J127320J818913J875059K349530K393155K674217K479005
11962F1620212K548801K973356L008211K800120L342656L570444L185313L123056
11954H6172169L192259M029508M027542M401846M916514N201619N135509N539388
11946A22616354N305654O513112P217586O266104O600478O429829O774701P251510
$$ plain form
12005 16768653 17214261 18039521 19099353 19429787 19248008 19395496 19921678 20449218 21020468
11996 21020468 21735387 22223586 22973100 23887114 24068901 24420691 24768879 25376760 26315938
11987 26315938 27287873 28327128 29113009 29473602 30246258 31048997 32182144 33763717 34840278
11978 34840278 35727944 37132937 38279778 39402086 41125135 42801520 43783633 45354374
11970 45354374 46903013 48030333 49849246 51724305 54073835 56466990 59141207 61620212
11962 61620212 64169013 67142369 70150580 72950700 76293356 79863800 83049113 86172169
11954 86172169 89364428 93393936 97421478 101823324 106739838 111941457 117076966 122616354
11946 122616354 127922008 134435120 141652706 147918810 154519288 160949117 167723818 174975328
11938A74975328P492785P572100P500512P323298O976938P395863P928969Q080614
11930B35246407P249612O586601O648239O188367N398599M645024L485722K953000
11922B78401571K300267J561161O14453p42245j543125j722061k721904l135330
11914B73012787l653134m243274n200363n279353n038328m960691n886670o336347
11906B32414627o690431o307200n846227n950781n673640n775228n496201n521355
11898A85153564n787898n195141n390148m700067m453289l775606m556922m439742
11890A46854751l992994m499907m010259l871290l580232l497956l407771l183806
11882A16810536l159127k336039k476263k662584l019029k159938j978738k149196
$$ plain form
11938 174975328 182468113 190040213 197540725 204864023 211840961 219236824 227165793 235246407
11930 235246407 242496019 249082620 255730859 261919226 267317825 271962849 275448571 278401571
11922 278401571 280701838 282262999 282877452 282135207 280592082 278870021 276148117 273012787
11914 273012787 269359653 265116379 259916016 254636663 249598335 244637644 238750974 232414627
11906 232414627 225724196 219416996 213570769 207619988 201946348 196171120 190674919 185153564
11898 185153564 179365666 174170525 168780377 164080310 159627021 155851415 151294493 146854751
11890 146854751 142861757 138361850 134351591 130480301 126900069 123402113 119994342 116810536
11882 116810536 113651409 111315370 108839107 106176523 103157494 100997556 99018818 96869622
11874I6869622k226861j592740j583146k026798j892526j496046j346669j762195
11866H2942641j594808j732406n91510r71019j662821j731456j456019j473273
11858G1729329j064850q20360j077172m42944o13970p57032n92989j055156j455618
11849F3849238m09818j28339n90756m88547m73007r31017o73916n19268j90447
11840E9444123o6261m61671n10258j68401k41114l63654l5819m64876p49039n26011
11830E5857019o78643m03683K13134j53781k66206L60280j56676j53088K55599
11821E4873955L07834r00444j288014q51868j39749l88976j69863m87404k27244
11812E0728227K1784k90224j13401l07337j17100p56602J7997m43331r37344l76587
$$ plain form
11874 96869622 94642761 93050021 91466875 89440077 87547551 86051505 84704836 82942641
11866 82942641 81347833 79615427 79023917 78052898 76390077 74658621 73202602 71729329
11858 71729329 70664479 69844119 68766947 68324003 67710033 66953001 66360012 65304856 63849238
11849 63849238 63439420 63311081 62720325 62231778 61758771 60827754 60153838 59634570 59444123
11840 59444123 59377862 58916191 58405933 58237532 57996418 57632764 57596945 57132069 56383030 55857019
11830 55857019 55178376 54774693 54987827 54834046 54567840 54928120 54771444 54618356 54873955
11821 54873955 55181789 54281345 52993331 52141463 52001714 51612738 51442875 50955471 50728227
11812 50728227 50750011 50459787 50346386 50039049 49921949 49165347 49183344 48740013 47802669 47426082
11802D7426082m50103k90718n38757o48246l91970n50813q79813q25717p72631
11793D2077314n39544k22002j73523n25791n23734j265171r75576n5695m25822
11784C7370456K30314m02102p95542p15640o93990n93584k29882q82640j123703
11775C2163687m31720J79743l7415k31840o49959j23216m20685P140r2194l55571
11765C0007970j092597r64417j00793n7856L06387M63505j090158m57182J96541
11756B7211400j99040n66958p32871k28599J00284N6475r01568m89130P6359l84818
11746B3941534k90410m4669j117420l66849k519k52435q3336M11972j4499l38063
11736B1843306o54838k70609m35547l16574r428J56909l49021l16350k20244K74323
$$ plain form
11802 47426082 46975979 46685261 46146504 45498258 45106288 44555475 43675662 42849945 42077314
11793 42077314 41537770 41315768 41142245 40616454 40092720 38827549 37851973 37796278 37370456
11784 37370456 37600770 37198668 36403126 35687486 34993496 34399912 34170030 33287390 32163687
11775 32163687 31731967 31911710 31874295 31642455 30992496 30869280 30448595 30455735 30363541 30007970
11765 30007970 28915373 27950956 27850163 27792307 28098694 28562199 27472041 27014859 27211400
11756 27211400 27012360 26445402 25712531 25483932 25584216 25640691 24739123 24249993 24326352 23941534
11746 23941534 23651124 23606455 22489035 22122186 22119667 21867232 21783896 22195868 22181369 21843306
11736 21843306 21188468 20917859 20482312 20165738 20156310 20313219 19964198 19647848 19427604 19701927
11726A9701927l18886j033185j17083n5836o14865k54489j51956j29319l82824
11717A6643484l41864l3182q90971l20430M5285j55759l33108k69425o42030j210190
11707A2491810j57985L12326j10555m10760L9457l72957n83612n80601P0937J31847
11697A0829907k06485L6998m55308k22689j86965p5248K56765J65428k21178l13052
11687I608173o73032o16255J90140j80678o75351N47883N09849l33294m63376
11678G914059m27494k82650N2842l11417K48926l82233j19381K2983J30655j6158
11668F830132N7323K97093q9194k63881L287j74451j94658J28008k79000j14775
11658F199884L5679K29541J73289k19409k19139J425L15264K29179p99352k54586
$$ plain form
11726 19701927 19383041 18349856 18232773 18176937 17562072 17307583 17155627 17026308 16643484
11717 16643484 16301620 16268438 15377467 15057037 15102322 14946563 14613455 14344030 13702000 12491810
11707 12491810 12333825 12646151 12535596 12124836 12164293 11791336 11207724 10627123 10698060 10829907
11697 10829907 10623422 10660420 10205112 9982423 9795458 9720210 9976975 10142403 9921225 9608173
11687 9608173 8935141 8318886 8509026 8328348 7652997 8200880 8710729 8377435 7914059
11678 7914059 7486565 7203915 7256757 6945340 7194266 6812033 6692652 6715635 6846290 6830132
11668 6830132 6887455 7184548 7095354 6831473 6834760 6660309 6465651 6593659 6314659 6199884
11658 6199884 6235563 6465104 6638393 6418984 6199845 6201270 6516534 6745713 5946361 5691775
11648E691775K67142L92511k19064l29168n71842M02634K30821K4932j48219M5132
11638E786654O99777m57961J3744O27624j10757l57851r02168o20408l25116m58499
11628C895039m4604M41850J083162O42717l39091n07032N51726k13766m50146
11619E059855J38493J10391L75871l48657l48223R684N161l04783N2163M91552
11609E241507k61645N482P5265n49065K98298K6499n37401L4818M29919k58383
11599D505294L62843M5389N47035k0356J44756J15742J66201N48844j18411o3554
11589F233783M51044m78438o74770l93009J58158K32538l94395m1255J4078k22863
11579D884871K7407J98296j80881p75808k15952K54848K68984n15313L25788r8743
$$ plain form
11648 5691775 5958917 6351428 6132364 5803196 5231354 5633988 5864809 5889741 5741522 5786654
11638 5786654 6486431 6028470 6042214 6669838 6559081 6201230 5299062 4678654 4353538 3895039
11628 3895039 3850435 4292285 5375447 6018164 5679073 5172041 5723767 5510001 5059855
11619 5059855 5198348 5308739 5684610 5335953 4987730 4997414 5002575 4697792 4749955 5241507
11609 5241507 4979862 4985344 5060609 4511544 4809842 4836341 4298940 4333758 4763677 4505294
11599 4505294 4868137 4913526 5460561 5440205 5584961 5700703 5866904 6415748 6297337 6233783
11589 6233783 6684827 6206389 5531619 5138610 5296768 5529306 5134911 5093656 5107734 4884871
11579 4884871 4912278 5110574 4929693 4153885 3937933 4192781 4461765 3946452 4272240 4173497
11569D173497r4824N1385K92941J83388L30114M01971k29573N0737r53155o3901
11559D142580N03671n29024m71451k26609k83281L02089O35483N74409j62709
11550D485158n03812j53894j55975K12173j09655L24314M03245k29138l20100
11541C952316k02205l43147L23444L60734l40291K10953M67216j97068l14761
11532C917191k04367K4761K93240R9141L69906J9758k07566j00428l29030n38229
11522C344377k51658j55902o27760o4849q5439m29736k97282J1610K72824L00330
11512B016515J64559K66361m23707l11120J30752P05151k9752n00779m33665K20390
11502A804705p6879j71018j06158L02425J1738j13859k22939J98321N29953L00674
$$ plain form
11569 4173497 4078673 4130058 4422999 4606387 4936501 5338472 5108899 5159636 4206481 4142580
11559 4142580 4646251 4117227 3645776 3419167 3135886 3437975 4073458 4647867 4485158
11550 4485158 3981346 3827452 3671477 3883650 3773995 4098309 4501554 4272416 3952316
11541 3952316 3750111 3406964 3730408 4091142 3750851 3961804 4429020 4231952 3917191
11532 3917191 3712824 3737585 4030825 4129966 4499872 4519630 4312064 4211636 3882606 3344377
11522 3344377 3092719 2936817 2309057 2244208 2158769 1729033 1431751 1443361 1716185 2016515
11512 2016515 2181074 2447435 2023728 1712608 1843360 2548511 2518759 2017980 1584315 1804705
11502 1804705 1727826 1556808 1450650 1753075 1764813 1650954 1428015 1626336 2156289 2456963
11492B456963k32851k56662o04440k7256J00939Q71726O1968q37758r0556J07314
11482A549387J19596L72519m16332o06199J31854P41103J31160K09163r8850n53918
11472A579483j90837K07676j89439j65683M00524R27966K75070L47270l22951
11463B869079o67649m6942j54478p91781j92075M93274M52180K68411K10376l56944
11453B083451N7875l46825k06809N68833P27434J46303k70523n48129j14590K52282
11443B349302k39077l02199M05458L43928n14727n97053k46744M72732P13609
11434B385229J6489o58701p4922L47524K34072K06380J80550k04573m92518k97876
11424A641654P60896K71561k53083K92856J12379l03826q7823J36169L45480k63881
$$ plain form
11492 2456963 2224112 1967450 1363010 1335754 1436693 2308419 2370387 1532629 1442073 1549387
11482 1549387 1668983 2041502 1625170 1018971 1150825 1891928 2023088 2232251 2133401 1579483
11472 1579483 1388646 1596322 1406883 1241200 1641724 2569690 2844760 3192030 2869079
11463 2869079 2201430 2154488 2000010 1208229 1016154 1509428 1961608 2230019 2440395 2083451
11453 2083451 2141326 1794501 1587692 2156525 2883959 3030262 2759739 2211610 2097020 2349302
11443 2349302 2110225 1808026 2213484 2557412 2042685 1445632 1198888 1671620 2385229
11434 2385229 2401718 1743017 1668095 2015619 2249691 2456071 2636621 2432048 1939530 1641654
11424 1641654 2402550 2674111 2421028 2713884 2826263 2522437 2434614 2570783 2916263 2652382
11414B652382l88196L21963K8309m70187m69962J91936j36097o66005L77389L18889
11404A760421L26102l0923j61830L1294K49177m45350l84487K15533j37561Q3800
11394A506176P6469O4917k2073l43719N2745M5565l69872L8761K69543k7137P7235
11383A368610M70306l354j59839j44460J41953M94951j16498k750J19077J07285
11373B275281K70521L79397m02097j060678k49215K51471k21549j31592J63259
11364A274798O72662m8296l90166k63374P23004l31536j058591j67159J27360
11355E38702J43658J73207M93363O93078J04133K57685q9222n75508l84138q86940
11345D68018J00189O25968m6113l88398K12619K81839O0832N0263K21300L34802
$$ plain form
11414 2652382 2264186 2586149 2614458 2144271 1674309 1866245 1730148 1064143 1441532 1760421
11404 1760421 2086523 2055600 1893770 1925064 2174241 1728891 1344404 1559937 1422376 1506176
11394 1506176 1582645 1647562 1625489 1281770 1334515 1380080 1010208 1048969 1318512 1291375 1368610
11383 1368610 1838916 1835562 1675723 1531263 1673216 2168167 2051669 2048919 2167996 2275281
11373 2275281 2545802 2925199 2523102 1462424 1213209 1464680 1243131 1111539 1274798
11364 1274798 1947460 1899164 1508998 1245624 1968628 1637092 578501 411342 538702
11355 538702 682360 855567 1348930 2042008 2146141 2403826 2314604 1739096 1354958 468018
11345 468018 568207 1194175 1148062 759664 972283 1254122 1314954 1365217 1586517 1921319
11335A921319j6910m14244L6949k80035j95954M6544j77462Q1400P1326m99617
11325E73316j43804n568j28826N16137j36853J11898K05982J57382L41482l85056
11315A106090j13363j86591q2968J76136n70898l51524N16401J38857n17818l82038
11305b67716N82705N67136R0324j3019L13043k92187m71137j7717J38408N33199
11295A163039L39215m33215l87812m05476M54614N5211k00160r3179k28257j18064
11285A45916J28863M68579L53854R3077k38821k768J32125L71366p6619P1121
11275A446693l3404K10765j0510n24097l87263q6309N22035L45553M40655L77627
11265B301745q64747n54012k04801j80436Q6439m24041K33647L42411m0984m16414
$$ plain form
11335 1921319 1904409 1490165 1527114 1247079 1051125 1097669 920207 1001607 1072933 573316
11325 573316 429512 423944 295118 811255 674402 786300 992282 1149664 1491146 1106090
11315 1106090 992727 806136 723168 899304 328406 -23118 493283 632140 114322 -267716
11305 -267716 314989 882125 972449 959430 1272473 980286 509149 491432 629840 1163039
11295 1163039 1502254 1069039 681227 275751 730365 785576 585416 492237 263980 145916
11285 145916 274779 743358 1097212 1190289 951468 948700 1080825 1452191 1375572 1446693
11275 1446693 1413289 1624054 1613544 1089447 702184 615875 1137910 1483463 1924118 2301745
11265 2301745 1436998 882986 678185 497749 584188 160147 393794 736205 695221 278807
11255B78807k77467j79372K88585k5298K4884K40240N15147J85231J71260n61652
11245F60365k47668N73383O80137k54367K07115M3793l24278j13168k18198o41210
11235C65904M95167j99422K42646L57861j23422p6505l17757j74879o66843L61648
11225B64398J16863L53056L979P9669O5524k8679p10958l83991k04036Q08036
11215C63861M21180m792m12177P3280K88356J89166K53230J50655o846l86397
11205I29516J21274n24573k22276j47229l93071J28861P21079J5489l76560N9520
11195C12030k91123p257L2290M217O21124L11105M27417L6830l63367k47960k28791
11184F06515j53419N11824k14003m5931L78306l59358l25643k54790O99591j43306
$$ plain form
11255 278807 1340 -178032 110553 85255 110139 350379 865526 1050757 1222017 660365
11245 660365 412697 986080 1666217 1411850 1618965 1662758 1338480 1225312 1007114 365904
11235 365904 861071 661649 904295 1262156 1138734 1062229 744472 569593 -97250 264398
11225 264398 381261 734317 738296 817965 883489 854810 143852 -240139 -444175 363861
11215 363861 785041 780249 368072 441352 729708 918874 1172104 1322759 1315913 929516
11205 929516 1050790 526217 303941 156712 -236359 -107498 613581 629070 252510 312030
11195 312030 20907 13650 45940 50157 671281 982386 1409803 1446633 1083266 835306 606515
11184 606515 453096 964920 750917 704986 1083292 723934 398291 143501 843092 699786
11174F99786j75767k15913k47780K34014j02049k94354J20885p3421L37436M18812
11164G01649l41441j51211j61586k68302p1987J28213j53584m6827N22627O83291
11154H40842K83832q6382n07835M40623K69028q7197j91729k56322j11066J57231
11144G51025m0120j52462j06121L29761N37482k62617m22561k8563r9633K4731
11134E30922j2425L7588K89610J2825j29369m70251l4700l01382j75466M09779
11124A57131M11538m84774p9146O760K36029k00854l41059N78953r1228N58084
11114G51434L74001k52563O29234O41766j97521l20891k92748J57734k31616l55867
11104I02963j84232j24895k25751R3277L66127J52541J82898l18827J412M97393
$$ plain form
11174 699786 524019 308106 60326 294340 192291 -102063 18822 -54599 282837 701649
11164 701649 360208 208997 47411 -220891 -292878 -164665 -318249 -365076 157551 840842
11154 840842 1124674 1038292 530457 971080 1240108 1152911 961182 704860 593794 751025
11144 751025 710905 558443 452322 782083 1319565 1056948 634387 605824 506191 530922
11134 530922 518497 556085 845695 858520 729151 258900 224200 -77182 -252648 157131
11124 157131 568669 83895 4749 11509 247538 46684 -294375 284578 193350 751434
11114 751434 1125435 872872 1502106 2143872 1946351 1625460 1332712 1490446 1258830 902963
11104 902963 718731 593836 368085 461362 827489 980030 1162928 844101 845513 1342906
11094A342906j47393m72005m78926j97672L00521n3710m07581l24710K23441M39269
11084B24140L09758K34282J66638r9710J56520J99207j45052o75342j36367M16271
11074F50345M8767K95737J35849J74944j01671n73584m95771j29277N3061O53734
11064G12134k24144l07152p7719P11881L38613k87513n67069M6885N35320k46350
11054F34886m19948K96542M90822k03594l71724L70002M47240M13712L42715n57103
11044A443550L84434o4420L7766L48614k3059k96968l89976K95981J06166J28080
11034A970168J34656j48039o79639J62154N44727M09098k43431l68008N03127
11025B284813P28571M41833L40097l58088p14641l17439j11839J73327K22331
$$ plain form
11094 1342906 1195513 723508 244582 46910 347431 293721 -113860 -438570 -215129 224140
11084 224140 533898 768180 934818 835108 991628 1190835 1045783 370441 234074 650345
11074 650345 699112 994849 1130698 1305642 1203971 630387 134616 5339 58400 712134
11064 712134 487990 180838 103119 815000 1153613 866100 299031 345916 881236 634886
11054 634886 214938 511480 1002302 798708 426984 796986 1244226 1657938 2000653 1443550
11044 1443550 1827984 1763564 1801330 2149944 2126885 1829917 1439941 1735922 1842088 1970168
11034 1970168 2104824 1956785 1277146 1439300 1984027 2393125 2149694 1781686 2284813
11025 2284813 3013384 3455217 3795314 3437226 2722585 2405146 2293307 2466634 2688965
11016B688965K4564K96916K6769M15791l66723n17763n51503K57565K94652l6312
11006B532921J96471L07281k29937o64203l58391K27048j47985j19929O27045
10997B370321P70950l06016k80724p0690l37996m56031Q5171O43228m3755k58094
10987B116364q39352l19165J12918n34821j05839L95830N26314r6606o41007q2281
10977E32355n83869o6071N35153K65191p5248j3015J37655P20036n61600n71080
10967C19507J71738j50185R7179Q6830L26177r0617n36606J08827Q72143P58948
10957A963941l54083o41278k27440j48911P04624n2129k01683m32239l46573j0794
10947B53435m68535j45558L73337j58851K54213N56944K78271k05911l63235j83577
$$ plain form
11016 2688965 2713529 3010445 3037214 3453005 3086282 2568519 2017016 2274581 2569233 2532921
11006 2532921 2729392 3036673 2806736 2142533 1784142 2011190 1863205 1743276 2370321
10997 2370321 3141271 2835255 2554531 2483841 2145845 1689814 1774985 2418213 2374458 2116364
10987 2116364 1277012 957847 1070765 535944 430105 825935 1352249 1255643 614636 532355
10977 532355 -51514 -117585 417568 682759 607511 594496 732151 1452187 890587 319507
10967 319507 491245 341060 438239 525069 851246 760629 224023 332850 1204993 1963941
10957 1963941 1609858 968580 741140 592229 1296853 1244724 1043041 610802 264229 253435
10947 253435 -215100 -360658 12679 -146172 108041 664985 943256 737345 374110 190533
10937A90533P9787M95470m9366m33489k59158K2473M77619o150L06058q8036l20734
10926D15007o0224l32259n0293K39992l15452Q2092M99868J08151k28867M6124
10916D04139M08199J39796r2221j70486r22487n01666L74973O97979M85872r98587
10906a74489m17987P73402O52805p3884k06199k00936N18926K33742O8887m82722
10896F91545K49236P8504N17061M321n80123R932l3711N18489j418j78647r48
10885A274241J52780M9379l11679M0783l22503m04493O13441K09903K18013O9336
10875A589201K3924m89732J17632O88577J84993p9639L12431J15252l66203m50372
10865A646064J04206L4638l80141l38081M29907Q6691N988J77743j94821j93292
$$ plain form
10937 190533 270320 765790 716424 282935 23777 46250 523869 517719 823777 735741 415007
10926 415007 354783 22524 -27769 212223 -103229 -21137 478731 586882 358015 404139
10916 404139 812338 952134 859913 689427 -233060 -734726 -359753 338226 824098 -174489
10906 -174489 -592476 180926 833731 759847 553648 352712 871638 1105380 1174267 691545
10896 691545 940781 1019285 1536346 1540667 960544 970476 936765 1455254 1453836 1275189 1274241
10885 1274241 1427021 1476400 1164721 1205504 883001 478508 1091949 1301852 1519865 1589201
10875 1589201 1613125 1123393 1241025 1929602 2114595 2034956 2347387 2462639 2096436 1646064
10865 1646064 1750270 1784908 1404767 1066686 1496593 1583284 1589272 1767015 1572194 1378902
10855A378902o93335j30583M78042P95652J32957m27867m48259k29723J49048
10846A004834L28994j59765p03019J91792M84317J72601J06852k3254k24638r4509
10836A084205J63938m66319l1683K01862o09338l8098M16713j58483j97502k51316
10826A13979p38874R1258M89657k413k3748m7008O4729m54552N1020L04598l5434
10815a86788J77504O31600J26682m78509J70391r5482J27213p8796m13883l45573
10805c65641L30950l9637k16032l56507k42026R2454k15921L6439M49872q0634
10795f06683l31237M00811N71383J73655n36447k1733l93480L50153L41390J75367
10785A23179K98824M4272J88176L21721L57699k88163m8898M05108J46201k44455
$$ plain form
10855 1378902 685567 554984 1033026 1828678 1961635 1533768 1085509 855786 1004834
10846 1004834 1333828 1174063 471044 662836 1147153 1319754 1426606 1403352 1178714 1084205
10836 1084205 1248143 781824 750141 952003 342665 304567 721280 562797 365295 113979
10826 113979 -624895 -533637 -43980 -46393 -70141 -117149 -52420 -506972 -455952 -151354 -186788
10815 -186788 -9284 622316 748998 270489 440880 345398 472611 393815 -20068 -365641
10805 -365641 -34691 -74328 -290360 -646867 -888893 -796439 -1012360 -975921 -526049 -606683
10795 -606683 -937920 -537109 34274 207929 -328518 -350251 -743731 -393578 -52188 123179
10785 123179 422003 466275 654451 976172 1333871 1045708 996810 1401918 1548119 1303664
10775A303664k078l8915n8356J108872j00689k30476M21113k66149J38575L5341
10765B310902l7929N66497Q2485J60654O46157N76951M88246L33429k07964J30750
10755E050178J13724m78471N21895L93695M89533Q19464Q5886M39356m9460O33361
10745H019161K88210j32751M18363J71629K3323O42049R3799j69018k8795L23658
10735I649628k17443J06466J23425L05172P5269n66387j27317K27102n0651j92345
10725I332919l81995o11643q4941J78011O9647l11660n93499l26963j31261q90271
10715F248344n59027J12003l42745J48540k46649l30345l7255k74508j02665m13631
10705D202062l48353l26089l21658p3799K19966K05863n9623r02570l82593k26444
$$ plain form
10775 1303664 1301586 1262671 1204315 2313187 2212498 1982022 2403135 2136986 2275561 2310902
10765 2310902 2272973 2839470 2921955 3082609 3728766 4305717 4793963 5127392 4919428 5050178
10755 5050178 5163902 4685431 5207326 5601021 6090554 6910018 6995904 7435260 7385800 8019161
10745 8019161 8307371 8174620 8592983 8764612 8787935 9429984 9523783 9354765 9325970 9649628
10735 9649628 9432185 9538651 9662076 9967248 10042517 9476130 9348813 9575915 9525264 9332919
10725 9332919 8950924 8339281 8254340 8432351 8501998 8190338 7596839 7269876 7138615 6248344
10715 6248344 5689317 5801320 5458575 5607115 5360466 5030121 4992866 4718358 4615693 4202062
10705 4202062 3853709 3527620 3205962 3132163 3352129 3557992 3498369 2595799 2213206 1986762
10695A986762m8806o57625K265l5250L66234Q4684j78492o92346n95580J5314
10685B47160K58124J2414M21916j59025j92580R326k43154M35159L95134q4937
10675A099537Q7799K10472j83502p30071j29297K00796k04140k70822k01098L26964
10665B06638K01685M66593L16867m0487M91632P95645Q554K41764P49070M95705
10655C933666L41799l5234M64249O35680N13674M03480K16503P65483Q21990O19528
10645H680818J024393J612321J887868J706763J904122J774267K078662K358626
10637B3027840L072580K734962K684799L314070M241619M712342M640322N694038
10629E4122572P052991P325364P682686R277378J0573089J0851800J1423817J1287378
$$ plain form
10695 1986762 1937956 1280331 1282596 1247346 1613580 1698264 1519772 827426 231846 247160
10685 247160 505284 517698 939614 780589 588009 597335 354181 789340 1184474 1099537
10675 1099537 1187336 1397808 1214306 484235 354938 555734 351594 80772 -120326 206638
10665 206638 408323 874916 1191783 1151296 1642928 2438573 2447127 2688891 3437961 3933666
10655 3933666 4275465 4240231 4704480 5340160 5853834 6257314 6473817 7239300 8061290 8680818
10645 8680818 9705211 11317532 13205400 14912163 16816285 18590552 20669214 23027840
10637 23027840 26100420 28835382 31520181 34834251 39075870 43788212 48428534 54122572
10629 54122572 61175563 68500927 76183613 85460991 96034080 106885880 118309697 129597075
10621A29597075J1943093J2539664J3079592J2874443J2584364J2179689J2551517
10614B17349437J2960686J3768863J3816314J3868001J3868672J4824345J5899243
10607C16355561J6071965J4962113J2336590J0112747Q891432Q967813Q442759
10600C96140980P678484P598299Q748128J0282965J0086961Q098300N094066Q59284
10592D54587467k896975n910458p844779p992925p657450p098107o929344n115565
10584D03141864l894632m962677p016031r399656j1221051j3221429j4440840
10577C38985548j4547623j4438205j3193741j1898958r703774q689198r408395
10570B57105654j0688540j1691653j1997113j2071084j1492235j1256608j0535395
$$ plain form
10621 129597075 141540168 154079832 167159424 180033867 192618231 204797920 217349437
10614 217349437 230310123 244078986 257895300 271763301 285631973 300456318 316355561
10607 316355561 332427526 347389639 359726229 369838976 378730408 387698221 396140980
10600 396140980 403819464 411417763 420165891 430448856 440535817 448634117 453728183 454587467
10592 454587467 451690492 445780034 437935255 429942330 422284880 415186773 408257429 403141864
10584 403141864 399247232 394284555 387268524 377868868 366647817 353426388 338985548
10577 338985548 324437925 309999720 296805979 284907021 275203247 266514049 257105654
10570 257105654 246417114 234725461 222728348 210657264 199165029 187908421 177373026
10563A77373026j0048194r607083q765034p418153o417789n959476n226286m709721
10555A19221290m701352m874930m285496l382571l206381l289598l056544k800462
10547H9623956l088723k723597j942120k166292k550740j788503j143406j217204
10539G3003371j266424j306597j746306j109491j209012j107635q60169r24753
10531F3472984o47924r97332o77938j62376p77981p28152o89932p34316p21262
10522E7335771j83480L93181M84325q5145r03775m48651K47949L03478Q3964J24808
10512E7352425l35847l58811j5108M96694j47643J55563n4547o16509K36301L51441
10502E7063959k30777o45552J68145O04794k11861j19985L94937j86623o62461
$$ plain form
10563 177373026 167324832 157717749 148952715 141534562 135116773 129157297 123931011 119221290
10555 119221290 114519938 109645008 105359512 101976941 98770560 95480962 92424418 89623956
10547 89623956 86535233 83811636 81869516 79703224 77152484 75363981 74220575 73003371
10539 73003371 71736947 70430350 68684044 67574553 66365541 65257906 64397737 63472984
10531 63472984 62825060 61827728 61149790 60987414 60209433 59481281 58791349 58057033 57335771
10522 57335771 57152291 57545472 58029797 57944652 57040877 56592226 56840175 57143653 57227617 57352425
10512 57352425 57016578 56657767 56642659 57139353 56991710 57147273 57092726 56476217 56712518 57063959
10502 57063959 56833182 56187630 56355775 56960569 56748708 56628723 57023660 56837037 56174576
10493E6174576J80430O4845k69570n66628m01836j01190N47822J16015m27888
10484E5316576o59915l47633l34032M1067l44529j040798j38800m43770p27504
10475E1320662q28919p43962l20020l55852o92105j30680o03476o25878m57147
10466D6562623o07805j170104o31098l19865m58972j42485j357164r96890J02116
10457D0980356q24357j435631r81805j482023p80220j76912J82627m67219k54992
10448C4759824n14315r08368p65273j83827l98566q36533j105895l11592m59377
10439B9276078k75886j9299j94805o06573j33379q45682o52494o17524n7323r0433
10429B5782680l61293l46645l14140P09038n76188o51900k10711k76764P310k5417
$$ plain form
10493 56174576 56355006 56419851 56150281 55583653 55181817 55080627 55628449 55744464 55316576
10484 55316576 54656661 54309028 53974996 54016063 53671534 52630736 52491936 52048166 51320662
10475 51320662 50491743 49747781 49427761 49071909 48379804 48249124 47645648 47019770 46562623
10466 46562623 45954818 44784714 44153616 43833751 43374779 43232294 41875130 40878240 40980356
10457 40980356 40155999 38720368 37738563 36256540 35476320 35299408 35482035 35014816 34759824
10448 34759824 34245509 33337141 32571868 32388041 31989475 31152942 30047047 29735455 29276078
10439 29276078 29000192 28980893 28786088 28179515 28046136 27200454 26547960 25930436 25873113 25782680
10429 25782680 25421387 25074742 24760602 25469640 24893452 24241552 24030841 23754077 23761387 23735970
10419B3735970o44326n63330N44461k94133r40762l75179j24970n58472j92331
10410B0586928k91856j03855M097j78669m90476j10410j75143k20834q076L66620
10400A9378326k12839r03527l90693m22037m52405l77246j26539l4494n26523
10391A5932023p28059l37920l54541R6708j80325n77395m3636L1954o92245r90176
10381A2156388k64936m46816l75015n939j51025j02813m83513j72349m02299m30840
10371I320843o03314p20231P0294l73781l63539L9207M8462J78448J54356k85115
10361G465630r18430n12000J23741O33375k63211o51797p18309K45737L93086
10352E797822j32607l56465p03399P8747l046o46370j83206N00825L91684k50943
$$ plain form
10419 23735970 23091644 22528314 23072775 22778642 21837880 21462701 21337731 20779259 20586928
10410 20586928 20295072 20191217 20195314 20016645 19526169 19415759 19240616 19019782 19011706 19378326
10400 19378326 19165487 18261960 17871267 17449230 16996825 16619579 16493040 16458546 15932023
10391 15932023 15203964 14866044 14511503 14608211 14427886 13850491 13806855 13838809 13146564 12156388
10381 12156388 11891452 11444636 11069621 11063682 10912657 10809844 10326331 10153982 9751683 9320843
10371 9320843 8717529 7997298 8067592 7693811 7330272 7369479 7417941 7596389 7750745 7465630
10361 7465630 6547200 6035200 6158941 6792316 6529105 5877308 5158999 5404736 5797822
10352 5797822 5665215 5308750 4605351 4684098 4681052 4034682 3851476 4352301 4743985 4493042
10342D493042l42131l04457Q2998J57885k7397k94377k56863j01574p1055K36950
10332C573021J98253j85291K04763P3967N2667L7463O07259M86971k71368q67836
10322C909869l03666K0378R6985N17734M47959J31702P7264k90542k0498K60815
10312D848000k86879M716O20084o09078n08633K7426l86797J17352J46599j5736
10302C957054O57542L26189J76444m64009L07012l3742p65120j57883L19816j00591
10292D222712L13824m8392j68449k62835k68510L88721N30450K72027K54900L5812
10282E270260j35947o1238M95764P17004n41922o17340j39208P7771m7914l7408
10272D979822J00756p00656O9237O01762K05452M56623k49752p9110n0198k31719
$$ plain form
10342 4493042 4150911 3846454 3929452 4087337 4059940 3765563 3508700 3407126 3336071 3573021
10332 3573021 3771274 3585983 3790746 3864713 3917380 3954843 4562102 5049073 4777705 3909869
10322 3909869 3606203 3626581 3723566 4241300 4689259 4820961 4898225 4607683 4587185 4848000
10312 4848000 4561121 4565837 5185921 4576843 4068210 4095636 3708839 3826191 3972790 3957054
10302 3957054 4614596 4940785 5117229 4653220 4960232 4926490 4161370 4003487 4323303 4222712
10292 4222712 4536536 4488144 4319695 4056860 3788350 4177071 4707521 4979548 5234448 5270260
10282 5270260 5134313 5073075 5568839 6285843 5743921 5126581 4987373 5065144 5017230 4979822
10272 4979822 5080578 4379922 4449159 5050921 5256373 5712996 5463244 5384134 5333936 5102217
10262E102217P5560k16702o4460j04857J71008R8412m45611J80749L145L23445
10252E122906J40177n5268O09521K35316J08633n76784l90636K19448l08291k7138
10242E077884J01431m96055p6590l1380j82535J01677J5744M17349K19122l59878
10232D786769j05011o27718l59414k58163L0984K05435k45972M81258K73795r6198
10222D085765n66287l30521L569j86803n3481L75993K21049m97197k45754k85956
10212B520377L93696M34015m94600p0738J24338J7876k13038j79975j43836j22346
10202B265769M08346L60564L7543J0932m65827l70088L0049p0230K64134l76891
10192B094301k97282M38355J42812K51289L09445k00669K23570n56168n20834
$$ plain form
10262 5102217 5177777 4961075 4896615 4791758 4962766 5061178 4615567 4796316 4799461 5122906
10252 5122906 5263083 5207815 5817336 6052652 6161285 5584501 5193865 5413313 5105022 5077884
10242 5077884 5179315 4683260 4606670 4575290 4392755 4494432 4510176 4927525 5146647 4786769
10232 4786769 4681758 4054040 3694626 3436463 3467447 3672882 3426910 3908168 4181963 4085765
10222 4085765 3519478 3188957 3192526 3005723 2952242 3328235 3549284 3052087 2806333 2520377
10212 2520377 2914073 3348088 2853488 2782750 2907088 2924964 2711926 2531951 2388115 2265769
10202 2265769 2674115 3034679 3072222 3083154 2617327 2247239 2277288 2207058 2471192 2094301
10192 2094301 1797019 2235374 2378186 2629475 2938920 2738251 2961821 2405653 1884819
10183A884819M23006O18750J86647m99221j24513j36449R2512N16367N75396l42157
10173C195157k55831J74547N03904N74273j7907o53409j67949q5515N04922R5833
10163C868025O62625K66367n18356k02419j25296j92240J00604K93200p181j06750
10153D038579q27552j47726K75150O73808M0650J1533k38972Q9364J40893l90236
10143C665491k58407N8245L81445L57972m3351L5195r6354r8389l53670k82805
10133C365372P89641l07337m24173Q5512J41167m26684n16715L1082m3048p9678
10123B615139J48931P7777l17406J35847p855J69748J55608l8737J22810J17668
10113C179530k34033n7851K33308k32536p73914k29013J34507n2459J39192M58164
$$ plain form
10183 1884819 2307825 2926575 3113222 2614001 2489488 2353039 2445551 2961918 3537314 3195157
10173 3195157 2939326 3113873 3617777 4192050 4174143 3520734 3352785 3267270 3772192 3868025
10163 3868025 4530650 4797017 4278661 4076242 3950946 3758706 3859310 4152510 4145329 4038579
10153 4038579 3211027 3063301 3338451 4012259 4052909 4064442 3825470 3914834 4055727 3665491
10143 3665491 3407084 3465329 3846774 4204746 4161395 4196590 4100236 4001847 3648177 3365372
10133 3365372 4155013 3847676 3423503 3509015 3650182 3223498 2706783 2737865 2694817 2615139
10123 2615139 2764070 2841847 2524441 2660288 2652433 2822181 2977789 2939052 3061862 3179530
10113 3179530 2945497 2887646 3120954 2888418 2114504 1885491 2019998 1967539 2106731 2564895
10103B564895m05848j99100K55586R1902J47400L4642m76534k69361L38380K57175
10093B339137O6723l26814K95536K12163L13155j09065o0387M19842Q13440k43052
10083C720678q14638n82419k25690l29768m91624k82968L54796M04932M77650
10074B230949q7808m54121l97254j48379R3372N02931j87313L1114L67810k4580
10064A926721l12240j81499O92019L67329J04301q77950q38268L23181J33216
10055A336810p3466n8451K52580J78971O3243K22314j53414o73736R7573L79444
10045A571868L97537L27229J0791J82267k9776l15405J23615j06985r55931n7366
10035A147844J20065K88386J07846L48400L62712J0293l11558p41690o13061j50715
$$ plain form
10103 2564895 2159047 1959947 2215533 2307435 2454835 2489477 2012943 1743582 2081962 2339137
10093 2339137 2405860 2079046 2374582 2586745 2899900 2790835 2730448 3150290 3963730 3720678
10083 3720678 2906040 2323621 2097931 1768163 1276539 993571 1348367 1753299 2230949
10074 2230949 2143141 1689020 1291766 1143387 1236759 1739690 1552377 1583491 1951301 1926721
10064 1926721 1614481 1432982 2125001 2492330 2596631 1718681 880413 1203594 1336810
10055 1336810 1263344 1204893 1457473 1636444 1699687 1922001 1768587 1094851 1192424 1571868
10045 1571868 1969405 2296634 2307425 2489692 2459916 2144511 2268126 2161141 1205210 1147844
10035 1147844 1267909 1556295 1664141 2012541 2375253 2385546 2073988 1332298 719237 568522
10025E68522K61402r644k24385J99503L42908J38846J66855L74665r7822K48729
10015A969579M02772k38818L0449K60189m40361l76028N3774k9768l07003j22017
10005A202768J38880L38183L37436m04161k04893m3314j72358j73676k49331k37387
9995E32147J06878j9196N01531K74127k02344M453m81303j65604Q5050K37124
9985H72863J45834J86477n5406l43949l67665J83139K6428J17594M22218M90603
9975A678136J9962N058N99804J04561Q5436l64303k93290l53663L52605L69605
9965B203911M6385m21955l10791l13933J53757K48501m444l54159m0084j01244
9955A105944J990N5852K66825j21373m90365J38545K40375K68908M34272N0242
$$ plain form
10025 568522 829924 820280 595895 795398 1138306 1277152 1444007 1818672 1720850 1969579
10015 1969579 2372351 2133533 2163982 2424171 1983810 1607782 1661556 1631788 1324785 1202768
10005 1202768 1341648 1679831 2017267 1613106 1408213 1364899 1192541 1018865 769534 532147
9995 532147 639025 619829 1121360 1395487 1193143 1197596 716293 550689 635739 872863
9985 872863 1018697 1205174 1149768 805819 438154 621293 647721 765315 1187533 1678136
9975 1678136 1698098 1703156 2302960 2407521 2492957 2128654 1835364 1481701 1834306 2203911
9965 2203911 2250296 1828341 1517550 1203617 1357374 1605875 1601431 1247272 1207188 1105944
9955 1105944 1107934 1163786 1430611 1309238 818873 957418 1197793 1466701 1900973 1951215
9945A951215j63780l53132J68096j79442j54115n54493k46914Q4720Q33790K80403
9935A666348q3901m85518j35649K00768J30398P9505P30476m43365k83392k56831
9925A118839k41152j85836j21452O37434K32146m6785J48774k88128k14843j35918
9915I03079J54522n6650M55698O8829q2942j00818k1353L45806J44484J53214
9905A963869m95596k48346L88599l55463o55487j37257J40410M88495O3902P9878
9895A233004k38879k7158j20076L96453K6363j64704m08788K04761J49320m4165
9885A006131J74382j89405J37650N44177J41715n59324m94211o45954K04874N91427
9875I11462M48986q7629j12114n021n8018r0649j54502N31092j27755n88936J18562
$$ plain form
9945 1951215 1787435 1434303 1602399 1422957 1268842 714349 467435 552155 1385945 1666348
9935 1666348 1582447 1096929 961280 1162048 1292446 1371951 2102427 1659062 1375670 1118839
9925 1118839 877687 691851 570399 1207833 1439979 1393194 1541968 1253840 1038997 903079
9915 903079 1057601 1000951 1456649 1525478 1442536 1341718 1320365 1666171 1810655 1963869
9905 1963869 1468273 1219927 1608526 1253063 597576 460319 600729 1089224 1153126 1233004
9895 1233004 994125 966967 846891 1243344 1269707 1105003 696215 900976 1050296 1006131
9885 1006131 1180513 991108 1128758 1672935 1814650 1255326 761115 115161 320035 911462
9875 911462 1360448 1272819 1160705 1155684 1097666 1007017 852515 1383607 1255852 666916 785478
9864G85478M9129r1643j1921P531M3473k42728j07042k75079R5963N1207K47652
9853E52020J87783L26914l27569l22734K72695j61712m21337l75225J93808j94148
9843b69505j32659L78651N49044K77853l55621j40911L05481K00156m34591n47146
9833a69248O77604J65130J23037L91350k15531l45633J48770k9026m47388j7651
9823B81414O12068L62954k68099l53120j96128j25579n247J47579M30824K16411
9813A103077J35809L9502n84391k46479L71632J74192r9197L14179J00579N4111
9803A363014k88353m80127r9077o0462K50967J88267L01820q343l97113J14212
9793H84805k80152P30J01667K96402L54671o08796k18996K71722k4246J86975
$$ plain form
9864 785478 834607 742964 731043 738574 782047 539319 432277 157198 253161 304368 552020
9853 552020 739803 1066717 739148 416414 689109 527397 106060 -269165 -75357 -269505
9843 -269505 -402164 -23513 525531 803384 447763 306852 612333 812489 377898 -169248
9833 -169248 508356 673486 796523 1187873 972342 626709 775479 746453 299065 281414
9823 281414 893482 1256436 988337 635217 439089 313510 308263 455842 886666 1103077
9813 1103077 1238886 1278388 693997 447518 819150 993342 894145 1208324 1308903 1363014
9803 1363014 1074661 594534 495457 434995 685962 874229 1176049 1167706 770593 884805
9793 884805 604653 605383 707050 1003452 1358123 749327 530331 802053 777807 964782
9783I64782M86584m9589j13675J64022J75864o18085o12242K21638k02782j56255
9773B60262M97561L0611k80041n584m11682l2539J83728K8429K44325l95975J47761
9762B66856L18836O03668r3592l56171q11763M84621O58808K27538p3112K68658
9752A494347M69768p94117p47489l37571N73708j55493k66626K57194N21935j14989
9742I00667m85106n54000k7986L62432J97001P36887J58870j10732n59418o39691
9732b1076L23937J92357m66225O65528J064413L07402q26357m77126k71106N6430
9722E48177k14988L03264p2836o9728J50955j56651J9760K76399O39047N8218
9712A481617J13046q20049j37435k02323j68083K66492m12160k6617K0469k7083
$$ plain form
9783 964782 1451366 1401777 1288102 1452124 1627988 1009903 397661 619299 416517 260262
9773 260262 757823 788434 508393 502809 91127 58588 242316 270745 515070 119095 266856
9762 266856 585692 1189360 1095768 739597 -72166 412455 1071263 1298801 1225689 1494347
9752 1494347 1964115 1169998 422509 84938 658646 503153 236527 493721 1015656 900667
9742 900667 415561 -138439 -166425 196007 393008 1129895 1288765 1178033 618615 -21076
9732 -21076 302861 495218 28993 694521 1758934 2066336 1239979 762853 491747 548177
9722 548177 333189 636453 563617 493889 644844 488193 507953 784352 1423399 1481617
9712 1481617 1594663 774614 637179 434856 266773 533265 121105 94488 114957 87874
9702H7874j16715J55259K99947j3284O0157p0737L8991j68856N4115J58537j81051
9691C04237l57140k13176j57258J34847K77778J32168M5967N5013l891p2995K84953
9680D30503n9960K84427L083o45531j27658L98726K07765l3426k06190k0305J46974
9669C78408k97122J87475l19378K98146M45076k48474l13534l33977L2936m11518
9659e81962j18336J51142M36011Q9621j47533k7887L00666M38902j12856J75496
9649F03264k92455l35652L70821P18072M18060m58718J7199Q5442k09136j90487
9639G26410m59570j81683q7438o87592O8133N56911K89894K05172M06602L2485
9629H69324k60346r6433n70033r8331Q26635J87187j59777J25523k65644k51240
$$ plain form
9702 87874 -28841 126418 426365 413081 473238 402501 441492 272636 326751 485288 304237
9691 304237 -52903 -266079 -423337 -288490 -10712 121456 167423 222436 218545 145550 430503
9680 430503 370543 654970 658053 12522 -115136 283590 491355 457929 251739 231434 378408
9669 378408 81286 268761 -50617 247529 692605 444131 130597 -203380 -170444 -581962
9659 -581962 -700298 -549156 -113145 -23524 -171057 -198944 101722 540624 427768 603264
9649 603264 310809 -24843 345978 1064050 1482110 1023392 1040591 1126033 916897 726410
9639 726410 266840 85157 -2281 -689873 -621740 -64829 225065 430237 836839 869324
9629 869324 608978 512545 -57488 -155819 670816 858003 698226 823749 558105 306865
9619C06865J86378r4694j28209J53477q2508k75266j70649K05070M30060M03222
9609I33746k2975n18574l93892M42733L11379J66434k75944J4601J94913o1112
9599G91309l52415n49144k81988K61656P27J47212M72631K70881L72713k12463
9589I21119m94726n31128j21584j80388K14767L1074k5375L4297q75439J18597
9579i08786N65933K89679J76310r2796k461J18945J12691o60k81731J09478L25401
9568D12003m34442m28981J25713r5635O43181J95518R2666J4573M60261r2084
9558H92773l20442q31216k43879M86564K04202N9276p9321j38413p7669M11972
9548C63847Q58197j67638l74981j90596l16597j00759O50520P33390n93568m79795
$$ plain form
9619 306865 493243 398549 270340 423817 341309 66043 -104606 100464 530524 933746
9609 933746 910771 392197 -1695 441038 752417 918851 642907 657508 852421 791309
9599 791309 438894 -110250 -392238 -130582 -129855 17357 489988 760869 1133582 921119
9589 921119 426393 -104735 -226319 -406707 -191940 -160866 -186241 -151944 -1027383 -908786
9579 -908786 -342853 -53174 123136 30340 27879 146824 259515 258855 -22876 86602 412003
9568 412003 -22439 -451420 -325707 -421342 221839 417357 510023 524596 984857 892773
9558 892773 572331 -258885 -502764 -16200 188002 247278 167957 29544 -48125 363847
9548 363847 1222044 1054406 679425 488829 172232 71473 721993 1455383 861815 382020
9538C82020l68957Q682N11875M03388o4604N9014l83961m06719J44249K91450
9528E76437N645M468k34288O0408K97253M58017j51558p20773n52399j45754n54665
9517i57209J90969M70254R7561K77116J27843M08509p38520J43285O20673N9011
9507F99492n13239J15242M16835M26861p6240m10329L31437N5105m63327o8402
9497E13435K14543J30782k04425j42667K66785K8385m12222l64114K55511N33275
9487H19288o7857m14183j88349L88154M12596L40605J996l5712l40588P8235K63836
9476A258021k10992j97177j27552P0137n8540j08273r8380j66190M34447K31800
9466A027301K87345r1172k25576o97883l08937L41013L76350j89531j67869M42641
$$ plain form
9538 382020 13063 21745 533620 937008 872404 931418 547457 140738 284987 576437
9528 576437 582082 586550 352262 412670 709923 1167940 1016382 295609 -256790 -402544 -957209
9517 -957209 -766240 -295986 -198425 78691 206534 615043 -123477 19808 640481 699492
9507 699492 186253 301495 718330 1145191 1068951 658622 990059 1045164 581837 513435
9497 513435 727978 858760 654335 511668 778453 806838 394616 30502 286013 819288
9487 819288 751431 337248 148899 537053 949649 1290254 1292250 1256538 915950 994185 1258021
9476 1258021 1047029 849852 722300 792437 733897 625624 527244 361054 795501 1027301
9466 1027301 1314646 1223474 997898 300015 -8922 332091 708441 518910 351041 793682
9456G93682p3011J96704k32165j91099m62675o35304j26999k82893M13320M92800
9446a07640J94050L6848J46503j61390m78413n36462p8194O46258O36467l19165
9436b1138j022477J44348J10553m235l12420K75578J16413M88728K26655m47837
9426d45832K96727J93984j6009J10377j73321L92267L24119k4739p31795k36069
9416c10291K74885m73043J74550N31620P71111L17214j32268j65851n98099l60061
9406B9767J5603q5317L67973o59839m79264p9167N75077L67518r0708Q0183J20257
9395A62083k17921J4914L11110M24860p8197N7389M02934L3190m71476J32023
9385G70909r9749J1825r3490k54660k51674k36888K31516j09793m33326M8458
$$ plain form
9456 793682 720671 917375 685210 494111 31436 -603868 -730867 -1013760 -600440 -107640
9446 -107640 86410 123258 269761 108371 -370042 -906504 -984698 -338440 298027 -21138
9436 -21138 -1043615 -899267 -788714 -792949 -1105369 -829791 -713378 -224650 2005 -445832
9426 -445832 -149105 44879 28870 139247 -34074 358193 682312 657573 -74222 -310291
9416 -310291 -35406 -508449 -333899 197721 968832 1286046 1153778 987927 389828 29767
9406 29767 45370 -39947 328026 -331813 -811077 -890244 -315167 52351 -38357 41826 162083
9395 162083 -55838 -40924 270186 695046 616849 674238 1077172 1110362 638886 770909
9385 770909 671160 682985 589495 334835 83161 -153727 77789 -32004 -465330 -416872
9375d16872j85246M32185P21168M29437m31217o25093m91206n38755L93744K31497
9365d80358q6178j29577M87794K42102J43575l28786l49532L85121K28096K94844
9355D07101l06351O6525k75284l02711o47498L90402Q04359J48195Q6315j67001
9345B04052j94969K18328j01486J56984N10778M01206j0341n94522l15973N82471
9335H56528l22290j80814Q3942j78135l3443K21396j12200l43509N484k01905
9325b04946m59759N27700N16084L32241J96666n554n49011n6793L92572L91574
9315A080774m49298l3651l62489l92317L66166M90447j01823m36205l19198k92658
9305d50252k64974L97364J29170j74756N21688N09308j4916p0281l5292k0162
$$ plain form
9375 -416872 -602118 -169933 551235 980672 549455 -75638 -566844 -1105599 -711855 -480358
9365 -480358 -566536 -696113 -208319 33783 177358 -151428 -500960 -115839 112257 407101
9355 407101 100750 167275 -108009 -410720 -1058218 -667816 136543 284738 371053 204052
9345 204052 9083 227411 125925 282909 793687 1194893 1184552 590030 274057 856528
9335 856528 534238 353424 437366 259231 225788 447184 334984 -8525 -3041 -204946
9325 -204946 -664705 -137005 379079 711320 907986 902432 353421 296628 689200 1080774
9315 1080774 631476 597825 235336 -156981 209185 699632 597809 161604 -157594 -450252
9305 -450252 -715226 -317862 -188692 -363448 158240 667548 652632 582351 547059 526897
9295E26897o39865o5547K35093o8524l81845L02804N55903k39411K6785J26457
9285C78747j34247K14855p9734j52399n2555M1118J02086k03848M00646O0048
9275E74717p0669j06969k93544j77626l45310j04368J45967k00210j43014l15228
9265a036254N91540M67988M20582Q09034P791p32493l96671o8090n022L856O05962
9254F68223J33318o95776L94535M28303l79009o21235k08908K2483O4444J82594
9244a1028k99677J45735k71751K19071P93328m28936k88260P594k33456L09456
9234e7924M36306J21024j05753m68439k25268j13153l00203l6243k59028l79126
9224a387807K64237P74000J41465K15237m04808l14742L5493R7956L60194o70414
$$ plain form
9295 526897 -112968 -178515 56578 -11946 -393791 -90987 464916 225505 252290 378747
9285 378747 244500 459355 379621 227222 174667 215785 317871 114023 514669 574717
9275 574717 504048 397079 103535 -74091 -419401 -523769 -377802 -578012 -721026 -1036254
9265 -1036254 -444714 23274 443856 1252890 1260681 528188 131517 63427 58405 62261 668223
9254 668223 801541 105765 500300 928603 549594 -71641 -280549 -258066 -193622 -11028
9244 -11028 -310705 -164970 -436721 -217650 575678 146742 -141518 -133924 -367380 -57924
9234 -57924 378382 499406 393653 -74786 -300054 -413207 -713410 -749653 -1008681 -1387807
9224 -1387807 -1123570 -349570 -208105 7132 -397676 -712418 -676925 -578969 -218775 -889189
9214h89189j56705M82246N31408L18297j736n1371k41587J68733l30525k92332
9204d62761K79770O8765N45021J73362q04111k24666P02348P75837j72843L21037
9194A201759K19079q70865m78503M73044M7123j99313j19554m3049J12575n37839
9184a95543J67791J41601m9065j78260K61356J18045L2067j30207K03744N4486
9174D26015J60364k14061N82688j25212o26427n00256j52431j98241R0267R04114
9164C46820P50303M7738p73591k13305j34349k54275J12481P44789J03858j04948
9154F25521l76318k56986k28043Q6761K32599k206k90245k71222M98134M59995
9144D77990j95396m9893M82280k26774l4559K79107k6513J55635k2854j24782
$$ plain form
9214 -889189 -1045894 -563648 -32240 286057 284321 232950 -8637 160096 -170429 -462761
9204 -462761 -182991 -114226 430795 604157 -199954 -424620 277728 1053565 880722 1201759
9194 1201759 1420838 549973 71470 544514 591637 392324 272770 229721 342296 -195543
9184 -195543 -27752 113849 64784 -113476 147880 265925 297992 167785 371529 426015
9174 426015 586379 372318 955006 829794 203367 -296889 -449320 -647561 -557294 346820
9164 346820 1097123 1144861 371270 157965 23616 -230659 -118178 626611 730469 625521
9154 625521 249203 -7783 -235826 -149065 83534 81328 -208917 -480139 17995 477990
9144 477990 282594 232701 714981 488207 453648 732755 706242 861877 839023 714241
9134G14241n14128J0007j48938L16719N55342j92188r31461p84262M64524O72381
9124A62237K90566l9763L70319k75296k82485k01944K97104L7799k37112j07955
9114A3470n0546k17081N37830L72645M05218K70100n21706K46271n7232o42392
9104C56577m61341l38119l08814M04430N83896J46489J86240k03918k73294q23121
9094g30975l52861M39578L52846K24480L38128o69775m97176M44124k18246p00870
9084a370747k44299P28937J96923L31482j87215l67383K6102J30002L03K16522
9074e39373K50460L52407P5338j97754l05527J9927m0393k39700m08612N06607
9064e26620O8671j18563j80503M77268n38230R0769o7496L33026L72188m86946
$$ plain form
9134 714241 200113 210120 61182 377901 933243 741055 -190406 -974668 -510144 162237
9124 162237 452803 413040 783359 508063 225578 23634 320738 358537 121425 13470
9114 13470 -37076 -254157 283673 656318 1061536 1331636 809930 1056201 998969 356577
9104 356577 -104764 -442883 -751697 -347267 236629 383118 569358 365440 92146 -730975
9094 -730975 -1083836 -644258 -291412 -66932 271196 -398579 -895755 -451631 -669877 -1370747
9084 -1370747 -1615046 -886109 -689186 -357704 -544919 -912302 -886200 -756198 -755895 -539373
9074 -539373 -288913 63494 138832 -58922 -364449 -344522 -384915 -624615 -1033227 -526620
9064 -526620 -457949 -576512 -757015 -279747 -817977 -727208 -794704 -461678 -89490 -576436
9054e76436k74074M01420j8299m0409R92412j35525n91330L97111L57744J09739
9044F22353j59871j52583K03746K98348L20112j96298l25049J61589l93222j10595
9034B68530J4965J30433q8025J83877K49057m19172n03378K34710K39742l60256
9024d9517j45207K14230O7756j82004k24454N46444K17120K18874q4663l25861
9014B52718M06632j32171O75212K48639l75752j49999k71006m76208j23476M07222
9004D61811J88446N19730j83220l09069k8348j56994M7797l24319J05987k97956
8994B3865r737q6037K30029K68593L0853k59278K56752M10664o17590o19407l71872
8983g43165L39343L16071m61300j83873L30658J31119j37192n99571K9689N65480
$$ plain form
9054 -576436 -850510 -449090 -467389 -507798 484614 349089 -242241 154870 512614 622353
9044 622353 462482 309899 513645 811993 1132105 935807 610758 772347 379125 268530
9034 268530 283495 413928 325903 509780 758837 339665 -163713 70997 310739 -49517
9024 -49517 -194724 19506 87262 -94742 -319196 227248 444368 663242 578579 252718
9014 252718 659350 527179 1202391 1451030 1075278 925279 654273 178065 54589 461811
9004 461811 650257 1169987 986767 677698 649350 492356 540153 215834 321821 23865
8994 23865 14128 -71909 158120 426713 457566 198288 455040 865704 248114 -371293 -743165
8983 -743165 -403822 -87751 -549051 -732924 -402266 -271147 -408339 -1007910 -978221 -412741
8973d12741K88174j70241N08284K6426K01659L83356O5102m03615l68257N6445
8963A74592J16352j0972k31419J03023M89959l11042j8669j32481k22016J31387
8953H8714j23863l56172q07547r2688K37674L70447O1649m1344M92480M18122
8943B47472J45007J91892k0075j84042o01727l23282k28226N62021Q1185p101
8933a36876L18380J99145m64006J7495M71056K0905j83854Q055J45101R0427M02328
8922H88156K2604n79361l83967J27201J93524l32189o02967K98146L03643J88280
8912A23070l33607q28754J79913Q2308K80178Q48923J75616l97867k71020K00777
8902E9537l5901N06696K87910J13291j22947n57287j57593m2143p1060K51487
$$ plain form
8973 -412741 -124567 -294808 213476 239902 441561 824917 890019 486404 118147 174592
8963 174592 290944 279972 48553 151576 641535 330493 311824 179343 -42673 88714
8953 88714 -35149 -391321 -1198868 -1291556 -1053882 -683435 -621786 -663130 -170650 247472
8943 247472 392479 584371 564296 380254 -221473 -544755 -772981 -210960 -129775 -136876
8933 -136876 181504 380649 -83357 -65862 405194 426099 242245 250300 395401 485828 888156
8922 888156 910760 331399 -52568 74633 268157 -64032 -666999 -368853 -65210 123070
8912 123070 -210537 -1039291 -859378 -777070 -496892 352031 527647 129780 -141240 59537
8902 59537 23636 530332 818242 931533 808586 251299 93706 51563 -19497 231990
8892B31990j19346j48206Q8891K65996M2032M69685m39515j09769N30830q9158
8882G23430l65057k11183k57675j20136L1489Q6127j03849j58445j83806M34044
8872a25061O69158k50781r3218O217m42001k7909K45994P4574n80185k16759Q99355
8861A59384J06683l77745m07188J56724J21780l79636J49826P6548n9081L48120
8851a04585K21137J23306J12559k77603M48218K76790l57012o10541n1378k31378
8841d50487q51203j82749J16171j17034N10746J49379j73587K02701K70489k12179
8831g37753n20584L82318P45591J48500j54726K84292o84951k50272L96217j52562
8821e43930j10752M88152P2064J63085j27916K1068N10839J92721o16540o06750
$$ plain form
8892 231990 112644 -35562 53329 319325 361357 831042 391527 281758 812588 723430
8882 723430 358373 147190 -110485 -230621 -199132 -113005 -216854 -375299 -559105 -125061
8872 -125061 544097 293316 200098 206315 -235686 -263595 -17601 56973 -523212 -739971 159384
8861 159384 266067 -111678 -518866 -362142 -240362 -619998 -470172 -393624 -452705 -104585
8851 -104585 116552 239858 352417 74814 523032 799822 442810 -167731 -219109 -450487
8841 -450487 -1301690 -1484439 -1368268 -1485302 -974556 -825177 -998764 -796063 -525574 -737753
8831 -737753 -1258337 -876019 -130428 18072 -136654 147638 -537313 -787585 -391368 -543930
8821 -543930 -654682 -166530 -94466 68619 -59297 -38229 472610 665331 48791 -557959
8811e57959j40969J03800K27407L88608J69416q5864J94993k34569j79393N3395
8801f1135j86135j05127q3062m41058K96970M40616n9348m6468L77827M66631
8791E99711j4537j0036k64996J14215l41435r0537M04270L03655l3736n40443
8781A26131j81870J14143j85793q98169L07545R32819J46131K4543L48941J68853
8771I03274o87041m21319J43778K6256o1240K26253L96693K67116n25201j13547
8761A55022O24558M38835o5453M21304Q9756k10812O49799J7419q6719P49470
8751B783179Q29392K60446J76814r5300j26506k7179J07315N47864N94222R31083
8741E981330J082483J99081j0364j33j63301n050j23723j02634l27030j95130
$$ plain form
8811 -557959 -698928 -595128 -367721 20887 190303 104439 299432 64863 -114530 -61135
8801 -61135 -247270 -352397 -435459 -876517 -579547 -138931 -198279 -244747 133080 599711
8791 599711 585174 575138 310142 424357 82922 -7615 396655 700310 666574 126131
8781 126131 -55739 58404 -127389 -1025558 -718013 214806 360937 385480 734421 903274
8771 903274 216233 -205086 -61308 -35052 -96292 129961 526654 793770 268569 155022
8761 155022 779580 1218415 1152962 1574266 1664022 1453210 2103009 2120428 2033709 2783179
8751 2783179 3612571 3873017 4049831 3954531 3828025 3800846 3908161 4456025 5050247 5981330
8741 5981330 7063813 7262894 7252530 7252397 7089096 7084046 6960323 6857689 6530659 6335529
8731F335529m84873o53062j63171n39525o41287j29173l45393k39537j4548n2879
8721C072081n73560k38685q542P7658N98839M2058Q9448l23481p13017r83553
8711A039246K7648K89280P20886J17048n84327l76760m13461l54164j77639L36966
8701F24723M42436l13379j76134m46477J5049Q45553o2188j24390J26724K19828
8691A151745M39551k07007k11297q4943k57669p87212r5653P21112O02642N18387
8681A789656J24902M29294j92020n54270o27032m79785m6976K44864k61594j34730
8671B92309K50687L13230J48777K36694M45413J43275k2733m52865k09648K56133
8661A401272m3704q58305J70301p7679l13941K81894j35168p5242k06769j36547
$$ plain form
8731 6335529 5850656 5197594 5034423 4494898 3853611 3724438 3379045 3139508 3124960 3072081
8721 3072081 2498521 2259836 2251294 2328952 2927791 2969849 3059297 2735816 2022799 1039246
8711 1039246 1066894 1356174 2077060 2194108 1609781 1233021 819560 465396 287757 624723
8701 624723 1067159 753780 577646 131169 146218 991771 929583 805193 931917 1151745
8691 1151745 1591296 1384289 1172992 1088049 830380 43168 -52485 668627 1271269 1789656
8681 1789656 1914558 2343852 2151832 1597562 970530 490745 443769 688633 427039 292309
8671 292309 542996 856226 1005003 1241697 1687110 1830385 1807652 1354787 1145139 1401272
8661 1401272 1357568 499263 669564 591885 277944 559838 424670 349428 142659 6112
8651F112j14973K93987P11714j26760o6268k49410n07759J83061O7884K44292
8641D41880L40919N38805J3160k26614j19836q07373k40779K33053R734M21094
8631F04043k36529l31171L65049k28507p9931k592P68464M65759O0920J48404
8621A533909J10479L9528q50297m67670R6572k31652K67312K16382m5512j2946
8611F56105o20460k79079m87511n6833Q00884J75727K78908P7829l45876k13259
8601a3565K33454j1364L89964J84580q7674K27847J65794O8611q3236p73013m61998
8590a60600J38613J48239O74958P74364O8111q19782j019880p2315K9342J12381
8580a26569J86914K98031J66501l76744J94483m23075K04864k55094J7615O69221
$$ plain form
8651 6112 -108861 185126 896840 770080 703812 454402 -53357 129704 197588 441880
8641 441880 782799 1321604 1334764 1108150 988314 180941 -59838 173215 182949 604043
8631 604043 367514 36343 401392 172885 92954 90362 858826 1324585 1385505 1533909
8621 1533909 1644388 1683916 833619 365949 462521 230869 498181 714563 669051 656105
8611 656105 35645 -243434 -730945 -787778 13106 188833 467741 545570 199694 -13565
8601 -13565 219889 208525 598489 783069 695395 923242 1089036 1157647 1074411 301398 -160600
8590 -160600 -21987 126252 801210 1575574 1643685 823903 -195977 -268292 -238950 -126569
8580 -126569 60345 358376 524877 148133 342616 -80459 124405 -130689 -113074 556147
8570E56147K87315O6132l15572q952M4127p27864j71526J69918k08607m37491
8560g46373K30359N28965K43250K4257o7680m14896j78233L43926J049517K90961
8550A304053L98189q09235l64689j33134m07955K28644J48172p40670j75868N38251
8540a4242j47130K57431K30413J34280o51769n48874P452N86203j12171P4635
8530a83772J62867L17847L0674L47632K98810n43146o00806k14389j17417J27141
8520c74559K91306J28506N76612M1521k14482n35223j36430j20121Q0745n01611
8510g63736r839J65461M9162k04229J79076r2533m67184K55588M26423M41451
8500b0360O6019k73681K88481l28L24425l88767r7884K64657J70249L70225j77045
$$ plain form
8570 556147 843462 909594 594022 585070 629197 -98667 -270193 -100275 -308882 -746373
8560 -746373 -516014 12951 256201 280458 212778 -202118 -380351 -36425 1013092 1304053
8550 1304053 1702242 893007 528318 395184 -12771 215873 364045 -376625 -552493 -14242
8540 -14242 -161372 96059 326472 460752 -191017 -739891 -732439 -146236 -258407 -183772
8530 -183772 -20905 296942 327616 675248 974058 430912 -169894 -384283 -501700 -374559
8520 -374559 -83253 45253 621865 663386 448904 -86319 -222749 -342870 -262125 -763736
8510 -763736 -773575 -608114 -558952 -763181 -584105 -676638 -1143822 -888234 -461811 -20360
8500 -20360 45659 -228022 60459 60131 384556 -4211 -102095 162562 332811 703036 525991
8489E25991m42061q616J8326J50846K1202r6497j63969L23850M25138M55567j16932
8478A092845l18873k72938m93169r284J69497J1480J45054N39587l0036k17704
8468F16459J55575k37323k47158k31653J50339K02132m77584m98585Q3330K72819
8458b11649N22077J54779K46783N0395j20512k46314j97182J73444O08372l69483
8448F10710k69361j37073N4791P75579J25052J39663l54895n91388m00485j48737
8438a96144K96817K97411N5398n62164j69755O63159m290l25023p38058p0640
8428g53289Q13012L50069k32376n35350p21601J64427R01659L23492k72585j46313
8418a08855j44460Q02166J38219k48642J92023N74365l48142j6978j70829j57843
$$ plain form
8489 525991 83930 75314 93640 244486 265688 169191 5222 329072 754210 1209777 1092845
8478 1092845 773972 501034 7865 -1419 168078 179558 324612 864199 834163 616459
8468 616459 772034 534711 287553 55900 206239 408371 -69213 -567798 -484468 -211649
8458 -211649 310428 465207 711990 762385 641873 395559 198377 371821 980193 610710
8448 610710 341349 204276 259067 1034646 1159698 1299361 944466 353078 -47407 -196144
8438 -196144 100673 398084 453482 -108682 -278437 384722 380432 55409 -682649 -753289
8428 -753289 59723 409792 177416 -357934 -1079535 -915108 -13449 310043 37458 -108855
8418 -108855 -253315 548851 687070 438428 630451 1204816 856674 839696 668867 511024
8408E11024k3835j38805K43461j09526n16613k60869L29544j02926Q5729k27085
8398b09901J47684p099Q0189L08998m3739l0K26156K65790l2790m3853k81410
8387D09995l0759J05063m04258j078155j76029L60243J22576O53370N21696m78408
8377E334m30013O95454J48509l67328n00918M5190K09457N06167M20047m8065
8367F83834P742m50752j70968j38988K13395M43627K48111n4694N5687n17967
8357C19027o65362N1307J16225M47418k07667l62087M21076M32444n61137n00153
8347e08909L212o8998O48562R29894m54881m40111K44429J19377k1496j63604
8337B87475J106j05610o50347N41995j63566M4619m10637j05459O87364O5201
$$ plain form
8408 511024 487189 348384 591845 482319 -34294 -295163 34381 -68545 17184 -209901
8398 -209901 -62217 -69316 10873 319871 276132 276102 502258 768048 735258 691405 409995
8387 409995 379236 484299 80041 -998114 -1174143 -813900 -691324 -37954 483742 5334
8377 5334 -424679 270775 419284 51956 -448962 -403772 -194315 311852 731899 683834
8367 683834 691576 240824 69856 -69132 144263 587890 836001 781307 836994 319027
8357 319027 -346335 -295028 -178803 268615 60948 -301139 119937 552381 -8756 -508909
8347 -508909 -505697 -574695 73867 1003761 548880 108769 353198 472575 451079 287475
8337 287475 288581 182971 -467376 74619 -88947 -44328 -454965 -560424 126940 192141
8327A92141L75417P9360O5457l16421J1571K48175n97596o15337L38405J013737
8317G94909J7131n76918n05840m64515j62595N56290P85271K56070J14117l44425
8307D69495o51298K5761J46574J32810p7381N3240k58173l3967J67894j98743
8297b23788l30923K57649J71182M7858k47336j97494R939K4736K20848m16526
8287f83855K96132O4415K70445q825j88729k5713j5124j02605M26974r086j93914
8276a69885J17466M58416J2462n52605p17286q3668M38265K26898M63424K57902
8266D51389j64536Q4258O60760m3682p74003k35501j04399L34768J84266K63010
8256F56330j32718l05026m43622p5165p8905j47788J15642j93241k7328N66806
$$ plain form
8327 192141 567558 646918 712375 395954 407525 655700 58104 -557233 -218828 794909
8317 794909 812040 235122 -270718 -735233 -897828 -341538 443733 699803 813920 469495
8307 469495 -181803 -156042 -9468 123342 45961 99201 -158972 -192939 -25045 -223788
8297 -223788 -554711 -297062 -125880 -78022 -325358 -522852 -512913 -488177 -267329 -683855
8287 -683855 -387723 -323308 -52863 -61688 -250417 -276130 -291254 -393859 33115 24029 -169885
8276 -169885 -52419 405997 418459 -134146 -851432 -935100 -496835 -269937 193487 451389
8266 451389 286853 371111 1031871 988189 214186 -21315 -125714 209054 393320 656330
8256 656330 523612 218586 -225036 -300201 -379106 -526894 -411252 -604493 -631821 -65015
8246f5015J38595j70480J44718k06484J12270N37639k25096k22568L75871O32000
8236A051450n1841j24506k49912M8529n81642R5937k29360J4961M7683l68654
8226c47355L38378R8407j8712j47264k75907K70684K94624k3654J31746l08744
8216A2203q8153l81623J84600m15913R126k109O8927J92415N98144M49474K48388
8205H75479j98986j40379j33879P7619l40277R3585j51465l71900m32341J77078
8195e45466J4893k74010K61381L4607j76497k00025j60170j98808M8481J48408
8185a047206k29249K00025P01375l1304K32127l18101l78998j21266L54987M627
8175f32983M75229O58479k30120m55975m09052j16872k08913K99876L25941O34443
$$ plain form
8246 -65015 73580 -96900 47818 -158666 -46396 491243 266147 43579 419450 1051450
8236 1051450 999609 875103 625191 673720 92078 188015 -41345 -26384 21299 -347355
8226 -347355 -8977 89430 70718 -76546 -352453 -81769 212855 189201 320947 12203
8216 12203 -75950 -457573 -272973 -688886 -679760 -681869 -612942 -420527 177617 627091 875479
8205 875479 676493 536114 402235 479854 139577 233162 81697 -290203 -722544 -545466
8195 -545466 -530573 -804583 -543202 -508595 -685092 -885117 -1045287 -1244095 -1195614 -1047206
8185 -1047206 -1276455 -1076430 -375055 -406359 -174232 -492333 -871331 -992597 -637610 -632983
8175 -632983 -157754 500725 270605 -185370 -594422 -711294 -920207 -620331 -294390 340053
8165C40053J50925n56059m46956j29759O78584O02574m19382j90310j74300N10585
8155C65955j49993l35555j78243j02219k89697j4755p1475R97823J81851l22897
8145H0795n88345o06022M55682J21663k52338P3571M3204l6381M49831M98901
8135B40561R2102J35058m91748m44629j46175K41683L65332N40610K1126Q64p97224
8124b42440q48336M49094L15972L27538q5590l9502P52937K39420l75987l39355
8114A53751k65606J14923m0785K93529k98122j75756L65147M6017j90279j23885
8104a21066j58199J68271K37046l91999M7264j95745k7998j91019M88479N45757
8094D00791j57292n2424q0550Q6375n511n44727k09852j16062j82464m10459N29367
$$ plain form
8165 340053 490978 -65081 -512037 -641796 36788 639362 219980 29670 -144630 365955
8155 365955 215962 -119593 -297836 -400055 -689752 -704507 -775982 221841 403692 80795
8145 80795 -507550 -1113572 -657890 -536227 -788565 -714994 -671790 -708171 -258340 240561
8135 240561 332663 467721 -24027 -468656 -614831 -373148 -7816 532794 553920 554784 -242440
8124 -242440 -1090776 -641682 -325710 1828 -83762 -123264 629673 869093 493106 153751
8114 153751 -111855 3068 -37717 255812 -42310 -218066 147081 193098 2819 -121066
8104 -121066 -279265 -110994 126052 -265947 -218683 -414428 -442426 -633445 -144966 400791
8094 400791 243499 191075 110525 196900 191389 -353338 -563190 -679252 -861716 -1272175 -742808
8083g42808O45446J81320J43629k27295m04982n450m34134J09613M43069N057
8073b86535r4951o2379m68047K166Q05647O89221n93602M8340K94781n50344p9946
8062b95649m2548k15831n40794R4832J62701K93341P49766K74783n57470l46610
8052d23479M63327N92735j31839k39591N18624K68004n87849n86303J48950L3769
8042E6348m09355k42647M37307J91358k88632j49852J33395K21457q1979q2912
8032b15512K35807k68909l0447J8953M56198L24578J96806J31851J52726K43477
8022A245528n33372l71966R0816J2169k03768N42754J36242O9608o4904J318o9459
8011H54966K63068k80215q93040j44988P6049p1359k1165L88527j22978o00709
$$ plain form
8083 -742808 -97362 83958 227587 292 -404690 -410140 -844274 -734661 -291592 -286535
8073 -286535 -381486 -443865 -911912 -909746 -104099 585122 -8480 39860 334641 -215703 -295649
8062 -295649 -338197 -554028 -1094822 -999990 -837289 -543948 205818 480601 -76869 -423479
8052 -423479 39848 632583 500744 261153 779777 1047781 459932 -126371 22579 56348
8042 56348 -353007 -595654 -158347 33011 -255621 -405473 -272078 -50621 -132600 -215512
8032 -215512 20295 -248614 -279061 -260108 196090 520668 717474 849325 1002051 1245528
8022 1245528 712156 340190 431006 443175 239407 782161 918403 988011 923107 924425 854966
8011 854966 1118034 837819 -55221 -200209 -124160 -195519 -216684 171843 48865 -551844
8001e51844m2422L18414j08143O6430O8843J58533L22120n9060j28748K75825
7991C19948r8843k83001m66976l03375j92662O35512J9565O5841k6324O536r8462
7980d22241K74905j87907O2340R9243j88225j45860J17049j13876q2377m8830
7970f35779R7940k3196l6982P2071k01657m47574L8440J02729M52494k80506M2325
7959h19695N32418J86811K05971k53853o4143l18278J61332J27295n6730L47589
7949D8717n84548j12668L0285q9098L7199J75484L07743M12558k2284k68422k68447
7938c33481J56214k49721k61730M24533L21066J49352r3055j49782O3850j78627
7928a51381M5960L78614L91368J037J3034J34393J80147m71314o78493l67439
$$ plain form
8001 -551844 -594266 -275852 -383995 -317565 -248722 -90189 231931 172871 44123 319948
7991 319948 221105 -61896 -528872 -832247 -1024909 -389397 -369832 -303991 -330315 -323779 -422241
7980 -422241 -147336 -335243 -272903 -173660 -361885 -507745 -390696 -504572 -586949 -635779
7970 -635779 -537839 -561035 -598017 -525946 -727603 -1175177 -1136737 -1034008 -581514 -862020 -819695
7959 -819695 -287277 -100466 105505 -148348 -212491 -530769 -369437 -242142 -298872 48717
7949 48717 -535831 -648499 -618214 -707312 -670113 -494629 -186886 225672 203388 -65034 -333481
7938 -333481 -177267 -426988 -688718 -264185 56881 206233 113178 -36604 27246 -151381
7928 -151381 -105421 273193 664561 665598 678632 813025 993172 521858 -156635 -524074
7918e24074l89402J16372N30661M32194O86539K46327k28387l94043n23373J1719
7908c5467J43977Q7731j57304m16942l02033J8525L90868M8073k56511O0648M59586
7897D1151m750j12085M06638J37200p47219m86310N30675J28671J078033J49845
7887A121849l39680k13680q32633J64108K86095l75073k8823K08887l4572j21751
7877a65273n87708l52669M62130L75541k90611L03408M23622J01294R5209n28062
7867a63119l1630K96627l11562L9884L15304j25419k02170L87723o5347m35709
7857b95418L45163j65648n92166k60200K77832M75014J63620j97377J56429j67145
7847b59896L1065L91640j65412L69233j24531j005843l90654L64526j65529O1494
$$ plain form
7918 -524074 -913476 -797104 -266443 165751 852290 1098617 870230 476187 -47186 -35467
7908 -35467 108510 196241 38937 -378005 -680038 -661513 -270645 -222572 -479083 -418435 41151
7897 41151 36401 -75684 330954 468154 -279065 -765375 -234700 -106029 972004 1121849
7887 1121849 782169 568489 -264144 -100036 186059 -189014 -217837 -8950 -43522 -165273
7877 -165273 -752981 -1105650 -643520 -267979 -558590 -255182 168440 269734 364943 -163119
7867 -163119 -194749 101878 -209684 -169800 145504 20085 -182085 205638 140291 -295418
7857 -295418 49745 -115903 -708069 -968269 -690437 -215423 -51803 -249180 -92751 -259896
7847 -259896 -228831 162809 -2603 366630 242099 -763744 -1154398 -789872 -955401 -893907
7837h93907Q54743N1157o6393J86118j89929o1935J67780N17341o61987k43118
7827c40130o4244J88481j3972L52923l22677l82380J24297N47437L28042J96658
7817F14435j75966n12346j96011o3260j2914r9082L923J97410J20583P94779O1457
7806G33008r12223m07276J89442N7812K40032K74279l03180J45870L52997J85032
7796E55793P8325n31590j08787k9503l48915K25207O7167m37061k30962M06897
7786c53429L77873O2543M7274L43381L11790j96534k49585o49564J36724M58825
7776B89298L52560j18833o25322m4654J01013k98451j22312Q2992o3584R54241
7766E06948l8400k6908j25511L71666J45190p1949j014574o37788K57422J68798
$$ plain form
7837 -893907 -39164 11993 -54400 131718 -58211 -120146 47634 564975 -97012 -340130
7827 -340130 -404374 -215893 -229865 123058 -199619 -581999 -457702 89735 417777 614435
7817 614435 438469 -73877 -269888 -333148 -346062 -445144 -441221 -243811 -123228 671551 733008
7806 733008 -179215 -586491 -397049 -339237 -99205 175074 -128106 17764 370761 555793
7796 555793 634118 102528 -6259 -35762 -384677 -159470 -92303 -529364 -760326 -353429
7786 -353429 24444 86987 134261 477642 789432 592898 343313 -306251 -169527 289298
7776 289298 641858 523025 -102297 -146951 -45938 -344389 -466701 -383709 -447293 506948
7766 506948 468548 441640 316129 687795 832985 761036 -253538 -891326 -633904 -465106
7756d65106j59247l64207J21037K57378p6926J74104r3787O0669J1435K33164
7746c01486L51981J56928r6421m31271k21165Q6914l94392J8550M90739J73996
7736a65627M39037n6784p04895n90137K82927K77909L36979J21275L70077P0634
7726C81395L44399j39482l67077o28703j80185j67257P6446O17982L19868m2974
7716B14412j71754R4343M56953O47382n37607o15517m48656k89456N97513k8297
7706h0684p85644N46391O28238r2935J35072k13509n89596j68199N79980j60824
7696b01710N89739N17965m26133m55013k80459k71705L37844K27995k40758l05025
7686e07260q9814M05342M23661J43445R4659m51414j19712J03497M9141J7o0679
$$ plain form
7756 -465106 -624353 -988560 -867523 -610145 -687071 -512967 -606754 -546085 -534650 -301486
7746 -301486 50495 207423 111002 -320269 -541434 -454520 -848912 -830362 -339623 -165627
7736 -165627 273410 216626 -488269 -1078406 -795479 -517570 -180591 -59316 310761 381395
7726 381395 725794 586312 219235 -409468 -589653 -756910 -680464 -62482 257386 214412
7716 214412 42658 137001 593954 1241336 703729 88212 -360444 -649900 -52387 -80684
7706 -80684 -866328 -319937 308301 215366 350438 136929 -452667 -620866 -40886 -201710
7696 -201710 388029 905994 479861 24848 -255611 -527316 -189472 38523 -202235 -507260
7686 -507260 -597074 -191732 231929 375374 470033 18619 -101093 2404 51545 51562 -9117
7675i117L30972j24457k48149j48866J52951Q6433q1094k1212j7945J07887o2775
7664c5372n23919n90796J17964O10496O28275P3266j5338j00232k20275n94512
7654f50443J99372J0486J19951J66042J25765J64258j19005j50360k22869L96018
7644C9215L20021L09913k13144o21280k34269K9627M45675m6722l33026l40367
7634f44357N2727K82076l30576l49710R9194L92211O84185J40758n89536l15859
7624e78887k6199Q24086M64676l4916L1879j7021R9226Q9060n56700l13126J23188
7613A05266j17429k96001n39597J51537M65745N2910j23480r8352o1750J90259
7603b70892N9822K20435R0224M9907j87150l29880N1421L59615J93327r9348J48478
$$ plain form
7675 -9117 321855 197398 -50751 -199617 -46666 39767 -41327 -62539 -80484 27403 -35372
7664 -35372 -559291 -1150087 -1032123 -421627 206648 279914 264576 164344 -55931 -650443
7654 -650443 -451071 -440585 -320634 -154592 -28827 135431 16426 -133934 -356803 39215
7644 39215 359236 669149 456005 -165275 -399544 -369917 75758 29036 -303990 -644357
7634 -644357 -591630 -309554 -640130 -989840 -890646 -498435 185750 326508 -263028 -578887
7624 -578887 -605086 219000 683676 648760 680639 663618 762844 851904 295204 -17922 105266
7613 105266 -12163 -308164 -847761 -696224 -230479 -177569 -301049 -399401 -461151 -270892
7603 -270892 -211070 9365 99589 149496 -37654 -367534 -316113 43502 236829 137481 285959
7592B85959l55349k4608k9399J2484K44715J15048j63643l73419K94504K47786
7582B54078n33482q81294K73350L03877K88808k26461R5858L94427k5813K77210
7572B20558K21651p6602k40840o66020j53687M35040j54160K54911N01664k39059
7562A03456k41434M22288Q1656l44553n23681m68826J58884L99J23561N11359
7552a76891L75108l2917K2147o5871l65667l96056n9338K41796L67590K56003
7542A65904K12957k40682m21384K69271j27678k17594O34269K46145n17131m08233
7532d04156N81578J17857p03325j47630P4988O20701M99274J6118k83640L18791
7522F90556j08373J56599p52862r45571q9507n9202J24180J93268j42090J48024
$$ plain form
7592 285959 -69390 -93998 -123397 -110913 133802 248850 85207 -288212 6292 254078
7582 254078 -279404 -1160698 -887348 -583471 -294663 -521124 -425266 -30839 -56652 220558
7572 220558 442209 365607 124767 -541253 -694940 -259900 -414060 -159149 342515 103456
7562 103456 -137978 284310 365966 21413 -502268 -971094 -812210 -811811 -688250 -176891
7552 -176891 198217 165300 187447 121576 -244091 -640147 -699485 -457689 -90099 165904
7542 165904 378861 138179 -283205 -13934 -141612 -359206 275063 521208 4077 -404156
7532 -404156 177422 295279 -408046 -555676 -480688 140013 639287 655405 371765 690556
7522 690556 582183 738782 -14080 -959651 -1049158 -1108360 -984180 -790912 -933002 -784978
7512g84978K20944N26986O6843l32833r6004K87185K11231o13739l7840J74734
7502c77471k23083J14634Q3376j48556M89199J99528l0567L84584l80165n05102
7492c93623L1168R1271l60635k92587L2153L6813j09967J14814M01858J20037
7482c28698J06104O02846k15810n12630Q2753L88113N52202l5634P5614L2041
7472G46901l6554P8603j79250l99987M10890o6872m5103p48761l74781M21729
7462a93185L89413K2470L72536n41031m42701m27245J62394J33549J22630k22017
7452f23187K16188L46712N2949M69946k9354l25224n86126j79867m83802K89900
7442h51865j26603J04520P39570j53760J8971j00129J20214K00978J26800j1772
$$ plain form
7512 -784978 -564034 -37048 29795 -303038 -399042 -111857 99374 -514365 -552205 -377471
7502 -377471 -600554 -485920 -402544 -551100 -61901 137627 107060 491644 111479 -393623
7492 -393623 -362455 -271184 -631819 -924406 -892253 -855440 -965407 -850593 -448735 -328698
7482 -328698 -222594 380252 164442 -348188 -265435 122678 674880 639246 714860 746901
7472 746901 710347 788950 609700 209713 620603 553731 508628 -240133 -614914 -193185
7462 -193185 196228 218698 591234 50203 -392498 -819743 -657349 -523800 -401170 -623187
7452 -623187 -406999 -60287 -7338 462608 433254 108030 -478096 -657963 -1141765 -851865
7442 -851865 -978468 -873948 -134378 -288138 -269167 -369296 -249082 -48104 78696 66924
7432F6924K68619j34861J86958m14657n9784k10260J04015K38443k14003K60457
7422I1851K08733Q03125j42811q54437P2720m71665n79971J53128J10757o16084
7412a224654Q2385q398K29432L75947J218465L55063l92989r79112k62620L51222
7402b55259j04878j77413M4571K12838l44626m04260K77726k9169K62201J84013
7392c34256J32648m0221o58412J49827L38238K75302q1443K19813M10879j08581
7382C03794k20359k87101m77915R9733O6646J72360l49003o6305M37068l6736
7372c57818J35164K35836P2950j78788L90394P2646k79455l75296m17322m35767
7362a137456N4061L68641M4868k76059L62532K85564K73583N3116k98101q8211
$$ plain form
7432 66924 335543 200682 387640 -27017 -86801 -297061 -193046 45397 -168606 91851
7422 91851 300584 1103709 960898 106461 179181 -292484 -872455 -719327 -608570 -1224654
7412 -1224654 -1142269 -1150667 -921235 -545288 673177 1028240 635251 -343861 -606481 -255259
7402 -255259 -360137 -537550 -492979 -280141 -624767 -1029027 -751301 -780470 -518269 -334256
7392 -334256 -201608 -241829 -900241 -750414 -412176 -136874 -218317 1496 412375 303794
7382 303794 83435 -203666 -681581 -581848 -515202 -342842 -691845 -758150 -321082 -357818
7372 -357818 -222654 13182 86132 -92656 297738 370384 90929 -284367 -701689 -1137456
7362 -1137456 -1083395 -714754 -669886 -945945 -583413 -297849 -24266 28850 -269251 -357462
7352c57462m9376r0770j36142j19360k8000J71989L68790j85864n10326n03486
7342a440007K05103K69779J40162k97483J6131j2585L57573K01037j07555j97854
7332h65699L89170O18007L64740J02504k20746l44300j65600K62038j34586J34
7322E662j153k15946J92005j38231k35900K80141l20248l67191L85740j61795
7312e76916k11880K7262J99185L62641M63291J56246N55335m35785Q2217L29226
7302I50822J72481n7891o6906l30984o12954p43096k49079j51948M31321L9746
7292f18488p6382N19068J18782j67421J19003M07739N6347n43063J61780J33528
7282A10893j00469k55914k52731o1806L70733L55395k85083r2633J49737j66845
$$ plain form
7352 -357462 -406838 -497608 -633750 -753110 -781110 -609121 -240331 -426195 -936521 -1440007
7342 -1440007 -1234904 -965125 -824963 -1122446 -1106315 -1118900 -761327 -560290 -667845 -865699
7332 -865699 -476529 141478 506218 608722 387976 43676 -121924 140114 5528 5662
7322 5662 4509 -211437 -19432 -157663 -393563 -113422 -433670 -800861 -415121 -576916
7312 -576916 -788796 -761534 -562349 -199708 263583 419829 975164 539379 621596 950822
7302 950822 1123303 1065412 998506 667522 54568 -688528 -937607 -1089555 -658234 -618488
7292 -618488 -694870 -175802 -57020 -224441 -105438 302301 358648 -184415 -22635 110893
7282 110893 10424 -245490 -498221 -560027 -189294 166101 -118982 -211615 -61878 -228723
7272b28723R8408K39033K4551j85601J74246j41623j96633R933J37843k04590
7262b73156j86654j344O84580j26160K78088N449k77116J62872K57020J13242
7252F36821J03298l39594m58001j06069P4828p3564m3731J58154k31045P0026
7242b08877o6408J04746N08631j36474n41371l78807L62252J37165L9863k99302
7232d78582l76408Q7484M9231j68687J11907N64498N20915m1124l95301m84098
7222f10165K09652P16683M0464J23092J66476k14510l2638J96970N12781m75245
7212F33560k43637j79310j5406K1472l0765k2176K22605l61935m97933k71641
7202g45166K23631L39448J28171j36037k17362J60130j77763M4945j46012K75720
$$ plain form
7272 -228723 -130315 108718 133269 -52332 121914 -19709 -216342 -206409 -68566 -273156
7262 -273156 -459810 -461154 223426 97266 375354 380803 103687 266559 523579 636821
7252 636821 740119 400525 -57476 -163545 -88717 -162281 -206012 -47858 -278903 -208877
7242 -208877 -275285 -170539 338092 201618 -339753 -718560 -356308 -219143 -179280 -478582
7232 -478582 -854990 -767506 -718275 -886962 -775055 -210557 310358 269234 -126067 -610165
7222 -610165 -400513 316170 356634 479726 646202 431692 399054 596024 1108805 633560
7212 633560 389923 210613 195207 216679 185914 163738 386343 24408 -473525 -745166
7202 -745166 -521535 -182087 -53916 -189953 -407315 -247185 -424948 -380003 -526015 -250295
7192b50295o0104p5426m11595K39543M32405N83152J63507o19599J6312N15678
7182E33578M8961k14390m04999J89869l50543K64963O15840n0326O4103n6090
7172F40966m19265N5257O0286m72073j62079k40658L52336R8074r2219l91921
7162e71296j46581P67032K96471p37662l90262K52429N91062r9027k1370j66480
7152b25684o8026M37717M97114K2423K31569K246m32533m34970k83006j16094
7142c69244j16472P1224O49491j31313M09492l61945l80767l09524j32553J70904
7132e00707J61042N16648l37804m73958j32821N10171K19075L09067O8973N5100
7122C94786p4802n70670l19105M74974M20198k62789k7924Q0779l4011L18339
$$ plain form
7192 -250295 -310399 -385825 -797420 -557877 -125472 457680 621187 1588 17900 533578
7182 533578 582539 368149 -36850 153019 -197524 67439 683279 632953 697056 640966
7172 640966 221701 276958 337244 -134829 -296908 -537566 -185230 -87156 -179375 -571296
7162 -571296 -717877 49155 345626 -392036 -782298 -529869 61193 -37834 -59204 -225684
7152 -225684 -293710 144007 641121 663544 895113 897359 464826 29856 -253150 -369244
7142 -369244 -485716 -414492 234999 103686 513178 151233 -229534 -539058 -671611 -500707
7132 -500707 -339665 176983 -160821 -634779 -767600 -257429 -38354 270713 339686 394786
7122 394786 319984 -250686 -569791 -94817 325381 62592 34668 115447 81436 399775
7112C99775q6369n61742k94556L87556K41067j83914k8021M09755l45097M05733
7102C44187K14413l94646j85812O07336L27878m52814p00263O09904K10203j38167
7092D42219o15589m36412p9060Q6357R76003J25802n60280j10723l42025N61020
7082D7312Q0567m46715R8224L7124l097j26400R1742J89744l1753q4918K18386
7071G0216J46702j56756l36104K99829O4533k03176k36391L19716J82171o1802
7061H8938N35297m1025n66721k64169J24581o20861m66209k25812J104644L50580
7051A9243L58410l2784m00613j18598j56276q5337k05470j57883l09861M6980
7041a042189k39588M25800L02154K05794K03334l89454p5650P04675L10133N8721
$$ plain form
7112 399775 313406 -248336 -542892 -155336 85731 -98183 -126204 283551 -61546 344187
7102 344187 558600 163954 -21858 585478 913356 460542 -239721 370183 580386 442219
7092 442219 -173370 -609782 -688842 -602485 373518 499320 -60960 -171683 -513708 47312
7082 47312 127879 -318836 -220612 -183488 -186585 -312985 -221243 -31499 -63252 -148170 70216
7071 70216 216918 60162 -275942 23887 88420 -114756 -351147 -31431 150740 88938
7061 88938 624235 583210 16489 -247680 -123099 -743960 -1210169 -1435981 -331337 19243
7051 19243 377653 344869 -55744 -174342 -330618 -415955 -621425 -779308 -1089169 -1042189
7041 -1042189 -1281777 -855977 -553823 -348029 -144695 -534149 -609799 94876 405009 463730
7031D63730q5924J04592j54735m8968J5255J44789K62069J15009J29069l20181
7021F24705m34566J48557J41244j153943k25623K38009R44360K02820l57028k88734
7011a60199j37826J37839J82837P5476J64360L45490n69924l47788k33210L18220
7001b24725J34076J47468J34947K08646K7843r3018l23489k94254l63479r2416
6991g38401R9991K24525M4943J39108J58978L5398k52395j63390K90727j26195
6981b86711L30190O44921M01991j80983o43774m95518L55467K18821j15031m91429
6971b62056J30734K40812l27350l24310k49310J42229O38147J05535n74903J66808
6961c13664K80259m64619l92296N11247N81583j53568m35264l9184k76742M14482
$$ plain form
7031 463730 377806 482398 327663 278695 293950 438739 700808 815817 944886 624705
7021 624705 190139 338696 479940 -674003 -899626 -661617 282743 485563 128535 -160199
7011 -160199 -298025 -160186 22651 98127 262487 607977 38053 -309735 -542945 -224725
7001 -224725 -90649 56819 191766 400412 428255 335237 11748 -282506 -645985 -738401
6991 -738401 -638410 -413885 -368942 -229834 -70856 -35458 -287853 -451243 -160516 -286711
6981 -286711 43479 688400 1090391 909408 265634 -229884 125583 344404 229373 -262056
6971 -262056 -131322 109490 -217860 -542170 -791480 -649251 -11104 94431 -480472 -313664
6961 -313664 -33405 -498024 -890320 -379073 202510 48942 -386322 -425506 -702248 -287766
6951b87766P35448o8054l90839j57077J98708L84637Q745j77228k75401J43770
6941A14943j40430l94107K21787k15676j91668l3267R1263j62992K31613J56950
6931c21584j38360N98551O07231p1939m30319m49831k8799J63824R9144M516k15234
6920a82800m16504L70160r3896K68059K73257j89944J90882N6795j9210n32433
6910b75634k96117j20067j02063M57294O57351k65210j65563J16126o24982n18539
6900a137404J92742J25120r1655L25699K04785j97149L02754R1685M51958M13286
6890F81821k5797k75234q08373n62086O20116K03401l15926j52715K49030J30121
6880b55642l53657K1607J30937L26830K70389J03133R1328n36334m83955k18562
$$ plain form
6951 -287766 447682 379628 -11211 -168288 30420 415057 423802 246574 -28827 114943
6941 114943 -25487 -419594 -197807 -413483 -605151 -638418 -547155 -710147 -478534 -321584
6931 -321584 -459944 138607 745838 673899 243580 -206251 -235050 -71226 27918 32434 -182800
6920 -182800 -599304 -229144 -323040 -54981 218276 28332 219214 276009 256799 -275634
6910 -275634 -571751 -691818 -793881 -336587 320764 55554 -110009 6117 -618865 -1137404
6900 -1137404 -944662 -819542 -911197 -585498 -380713 -577862 -275108 -183423 268535 681821
6890 681821 656024 380790 -427583 -989669 -369553 -166152 -482078 -634793 -385763 -255642
6880 -255642 -609299 -587692 -456755 -129925 140464 243597 334925 -201409 -685364 -903926
6870i03926K84922L25106l13248k24713L04357j24782j80423M89245j22987o4220
6860e30669L73256o9219M40360O6141o51710n9134j74775J01453j86866J99454
6850d91709L77419L56415L32781k90783j00468J0795Q4204l19909n54861l03575
6840h99691L41532J87825M64344j13485l8490Q3755o70921p59311k30359P89098
6830h45703M76922k63356j7865k58544j99318P34531R0311O23422K74429J38287
6820G53116O77391n53487j049533k7167p9472k1425K76988J09573K7195l55474
6810b42295K69303m0753L10475K50563j25868k57181k02993K30856Q1727J69996
6800D43830L72724l42723m8896o51383l01880M849k11883o5147J97260P16451
$$ plain form
6870 -903926 -619004 -293898 -607146 -831859 -527502 -652284 -832707 -343462 -466449 -530669
6860 -530669 -157413 -226632 213728 279869 -371841 -430975 -605750 -504297 -691163 -491709
6850 -491709 -114290 242125 574906 284123 183655 194450 278654 -41255 -596116 -899691
6840 -899691 -558159 -370334 94010 -19475 -57965 25790 -645131 -1404442 -1634801 -845703
6830 -845703 -368781 -632137 -650002 -908546 -1107864 -373333 -283022 340400 614829 753116
6820 753116 1430507 877020 -172513 -199680 -279152 -300577 -23589 85984 113179 -242295
6810 -242295 27008 -13745 296730 547293 421425 164244 -38749 192107 273834 443830
6800 443830 816554 473831 424935 -226448 -528328 -523479 -735362 -800509 -603249 113202
6790A13202Q19848J2813m59280m79947j91952N99985M66735J88616q05467k59972
6780D581M69997J98430j43576j81689l92541L9379k07475n5686L89277k12122
6770i1425J3725l2861l75503L44211L11189j31246J51789k43669l73427J34826
6760b92391j56352R0641R5982J0630j25648K3445n75L00643M54860j68963k61519
6749b9247j24149o24872M9258Q32524K26708j81194q25791M8305J84796N04713
6739F1051L90179q565o6105K06486L06784j62574p22107m56768J66898M35410
6729A50689k68191M93797Q0343l46596l43643o1467J47356N19903l49814l15304
6719b92927j63722j64033N42785J3008n35512J76505J47357m9310m67181J7801
$$ plain form
6790 113202 933050 945863 486583 6636 -185316 414669 881404 1070020 264553 4581
6780 4581 474578 673008 529432 347743 -44798 -5419 -212894 -268580 120697 -91425
6770 -91425 -77700 -110561 -486064 -141853 169336 38090 189879 -53790 -427217 -292391
6760 -292391 -448743 -358102 -262120 -251490 -377138 -353693 -354268 -53625 401235 232272 -29247
6749 -29247 -153396 -778268 -729010 103514 330222 149028 -676763 -628458 -443662 61051
6739 61051 451230 442665 376560 583046 889830 727256 5149 -451619 -284721 150689
6729 150689 -117502 376295 456638 110042 -233601 -295068 -147712 372191 22377 -292927
6719 -292927 -456649 -620682 -77897 -64889 -600401 -423896 -276539 -325849 -793030 -775229
6709g75229j86778K10088o3028L7879j54094M4411M01259o167L21648Q19003k25236
6698D23756l19751k97859j29383J65998l2397m64110l63756L23818J44675J46840
6688d02169j99808r922L29014L3756M30733M03725L15952l2319j30373k45448
6678D93141m24325l75125o33810L50849P42101J02649M74063Q63841k83454l79486
6668I30444j47749n52893K98855o52817j62890M95975J72827j02286K38397M28525
6658I46388m64600j148401j16565M18011K53637N9256J89846k19396p0563n3673
6648b06060n41493J29252k4740j1207L18200J05139K31525J39416j70629k44551
6638b75148K68226j62055n05577M99176p1510n31416l07282m15752O01989O62394
$$ plain form
6709 -775229 -962007 -751919 -814947 -777068 -931162 -886751 -485492 -491659 -170011 648992 423756
6698 423756 104005 -193854 -323237 -157239 -189636 -653746 -1017502 -693684 -549009 -402169
6688 -402169 -601977 -611899 -282885 -249129 181604 585329 901281 868962 738589 493141
6678 493141 68816 -306309 -940119 -589270 152831 255480 729543 1593384 1309930 930444
6668 930444 782695 229802 528657 -124160 -287050 208925 381752 279466 517863 946388
6658 946388 481788 -666613 -783178 -365167 -111530 -52274 137572 -81824 -152387 -206060
6648 -206060 -747553 -618301 -643041 -654248 -336048 -230909 616 140032 -30597 -275148
6638 -275148 -6922 -168977 -674554 -175378 -246888 -778304 -1085586 -1501338 -899349 -236955
6628b36955r5225k06819j47353M94102L00281j07713j39112K64660q0763j27842
6618h2739n43736k03464J32907K71638q678K21527k22104O05351J72441q72712
6608e29569j76634Q2768m17438l87289J69292k000j09281K61542M48482J97799
6598d62328m46716o40342J72495N79599P89203P4225r934k67803j71126l7202
6588d19929j39125L97508L84130J72105k16280l7906j5154J07700m76451m55488
6578f98890j44726j42386J65109M1860k26175N4176n3784K05642L66810o1662
6568d94026J02207J07164n01240m24764L93035L09435k65522m68637J98186j02733
6558a146895k69542J60776n8598J50756p0458N54702L86943l3396K91952K47516
$$ plain form
6628 -236955 -332180 -538999 -686352 -192250 108031 318 -138794 125866 45103 -82739
6618 -82739 -626475 -829939 -697032 -425394 -434072 -212545 -434649 170702 343143 -529569
6608 -529569 -706203 -623435 -1040873 -1428162 -1258870 -1260870 -1370151 -1108609 -660127 -462328
6598 -462328 -909044 -1549386 -1376891 -797292 -8089 66136 56202 -211601 -382727 -419929
6588 -419929 -559054 -161546 222584 394689 178409 140503 125349 233049 -243402 -698890
6578 -698890 -843616 -986002 -820893 -779033 -1005208 -951032 -1004816 -799174 -432364 -494026
6568 -494026 -391819 -284655 -785895 -1210659 -817624 -508189 -773711 -1242348 -1044162 -1146895
6558 -1146895 -1416437 -1255661 -1314259 -1163503 -1233961 -679259 -292316 -325712 -33760 213756
6548B13756P06051j04884n91227j42787J97220l48482m31874R8227J22987M96554
6538B15541J10797l51731n1009M013j3654k74086o8589n62327l3810O4484k42702
6527a203073L01901j22110J39087M17842L47673r6J1864l76863O10543K59059
6517C85827m24731J93176k82551n9844j66726j51608o5844p4951N49270J61753
6507F3771J72990L58532j45736n60790k0333l0960j99880k89810m05882J95042
6497h63056N67415M05240j42001l85237j75789O2164J13778k6722L11155L21492
6487A88439m34060k82832K66399N46063N21747K93554l68179n30856n95667n66268
6477i61660l39982j10792O4183K23028J2765L90735L92387L27272L1388K8053
$$ plain form
6548 213756 919807 814923 223696 80909 278129 -70353 -502227 -404000 -281013 215541
6538 215541 326338 -25393 -76402 -72389 -86043 -360129 -428718 -991045 -1024855 -960371 -1203073
6527 -1203073 -901172 -1023282 -884195 -466353 -118680 -118776 -106912 -483775 126768 385827
6517 385827 -38904 154272 -128279 -188123 -354849 -506457 -572301 -647252 -97982 63771
6507 63771 236761 595293 449557 -111233 -131566 -162526 -362406 -652216 -1058098 -863056
6497 -863056 -295641 109599 -32402 -417639 -593428 -531264 -417486 -444208 -133053 188439
6487 188439 -245621 -528453 -262054 284009 805756 1099310 731131 200275 -395392 -961660
6477 -961660 -1301642 -1412434 -1348251 -1125223 -1112458 -721723 -329336 -2064 29324 57377
6467E7377n13354k35009M69924k8587n21244J73469J97275j89781O7168M43760
6457g9002J24945j28463j38425M35437p8377m4631j65600p5689j79369P2039K41345
6446a5790K40193M77624l75639j19787j34917J29369k60859J18872M42407K09911
6436G11384n1240l13480l68748K93653l4142l64795n42469O2884k84364J9814
6426h71503J89870N40545K98951j40291m59597n65378J48322J74544m39009l1253
6416a154799K27996N6815K38722J68595j45488J64308L08859P00378o4860p70699
6406b70173j7846N14810j51965l64781K1802k47070p2200L23865p7484L21225
6396a9817J42756q5502J6264l77880K52684L24184L68947j65075k99348n12013
$$ plain form
6467 57377 -455977 -690986 -221062 -249649 -770893 -597424 -400149 -589930 -522762 -79002
6457 -79002 45943 -82520 -220945 214492 136115 91484 -74116 -149805 -329174 -257135 -15790
6446 -15790 224403 702027 326388 206601 71684 201053 -59806 59066 501473 711384
6436 711384 660144 346664 -22084 271569 237427 -127368 -669837 -606953 -891317 -871503
6426 -871503 -681633 -141088 157863 17572 -442025 -1007403 -859081 -684537 -1123546 -1154799
6416 -1154799 -926803 -869988 -631266 -462671 -608159 -443851 -134992 565386 500526 -270173
6406 -270173 -288019 226791 74826 -289955 -268153 -515223 -587423 -263558 -341042 -19817
6396 -19817 122939 37437 53701 -324179 -71495 252689 621636 456561 157213 -354800
6386c54800k41511J70257J47072n9337l84865Q1406J88057k6147R5814k94598
6376f78652K75847K69420K68811M74963l7876k68434l51039R4250j4653l63081
6366c30444M63519J2727p93833n15984L46171N90521K37843q6481k04417l85614
6356f65992K23856J7236l77263k55905K47221O07031N61222j88030k84442L88800
6346B73734J95206o8541n97566n48023O8521L10390L13877K22292l23882m02606
6336e56598n14899N15172K48890K87684L07104j63443l87893k79414r755M37127
6326a16025N68576N62738j51019k79518l05492l06284J84682J95919J70308K38502
6316G62387m68428o47825p53030J06313K03380q2081o6802P6344L08133M18860
$$ plain form
6386 -354800 -596311 -426054 -278982 -338319 -723184 -641778 -453721 -479868 -384054 -678652
6376 -678652 -402805 -133385 135426 610389 572513 304079 -46960 47290 32637 -330444
6366 -330444 133075 145802 -648031 -1164015 -817844 -227323 10520 -75961 -280378 -665992
6356 -665992 -442136 -424900 -802163 -1058068 -810847 -203816 357406 169376 -115066 273734
6346 273734 468940 400399 -197167 -745190 -676669 -366279 -52402 169890 -153992 -556598
6336 -556598 -1071497 -556325 -307435 -19751 287353 123910 -263983 -543397 -553152 -116025
6326 -116025 452551 1015289 864270 584752 279260 -27024 157658 353577 523885 762387
6316 762387 293959 -353866 -1106896 -1000583 -797203 -879284 -946086 -869742 -561609 -142749
6306a42749l685l86958J08046j4233K86245K57471p8969l9925j84587Q1109M46267
6295C28032j0622J77851N15176M90385O9794n43177l70458j47056q99177q49915
6285a239167j25420M00457L49498O89296O30238K28259j81828l68971j91306o1610
6275A29446m54155k07979K78499l18475J24491K79065K86061J36462O2672L9643
6265C55730k55270j3866L28666K37373N7031k4728j68479l80211l42010j54381
6255c60145k10429k92639J00011P35539K62790m016M6254l90086K34154M92283
6245F13716L19992K59281l7977n34030L3206n8303k24972j62183j09760m8516
6235E0454K87757Q2505P6036k7193k31968K2604K75188q4906o35099k64949l35117
$$ plain form
6306 -142749 -146434 -533392 -425346 -439579 -153334 104137 25168 -14757 -199344 -118235 328032
6295 328032 317410 495261 1010437 1500822 1570616 1027439 656981 509925 -389252 -1239167
6285 -1239167 -1364587 -964130 -614632 74664 704902 933161 751333 382362 191056 129446
6275 129446 -324709 -532688 -254189 -572664 -448173 -169108 116953 253415 316087 355730
6265 355730 100460 86594 415260 652633 709664 684936 516457 136246 -205764 -360145
6255 -360145 -570574 -863213 -763202 -27663 235127 231111 277365 -112721 121433 613716
6245 613716 933708 1192989 1155012 620982 654188 595885 370913 208730 98970 50454
6235 50454 338211 420716 496752 469559 237591 260195 535383 450477 -184622 -449571 -784688
6224g84688K89517K01415k24545L18756k61708M4957M21945l13655l95196l00019
6214a003221j99215M50037J21846j79952K7148m3423M71427j69274K81820K88267
6204D5460R5418n69850m40983N83743J23949L49217j97390O6792j64525N28O0848
6193d6793j3561o58058Q3865Q49576J9482k03797j27559K99931P3466M88234J5767
6182G80553J82685n62571n27460l65668q5437Q911J90085M03113K99417n89915
6172b66287k54374j66952J26065m73R82012O50517j63607N5420j42360j7503M14725
6161A217183n16130m18276J45332L87420l66247o7153k8480k15202L38874L24944
6151H02265l97482m26165q9109j99818l1066K89229J8674q4952K24368j44282
$$ plain form
6224 -784688 -495171 -293756 -518301 -199545 -461253 -416296 5649 -308006 -703202 -1003221
6214 -1003221 -1202436 -752399 -630553 -810505 -783357 -826780 -355353 -524627 -242807 45460
6204 45460 140878 -428972 -869955 -286212 -162263 186954 -10436 56356 -108169 -107641 -46793
6193 -46793 -60354 -718412 -634547 215029 234511 30714 -96845 203086 276552 764786 780553
6182 780553 963238 400667 -126793 -492461 -577898 -568987 -378902 24211 323628 -266287
6172 -266287 -520661 -687613 -561548 -562021 419991 1070508 906901 962321 819961 802458 1217183
6161 1217183 701053 282777 428109 815529 449282 382129 353649 138447 477321 802265
6151 802265 404783 -21382 -110491 -310309 -341375 -52146 -33472 -118424 105944 -38338
6141c8338m89558L19547M2275J78098q1060K10990M03281J74193m10334l63779
6131e4685M9412J25072M89910j94758m48453n52324K84206l32043l78450L67773
6121f44340J35290K46450J64219j07320k57734L29704k77201j69800K9200L03104
6111b48428M01130l61214o0271M4052J43638k3513j99134m3985M83027l4028l14548
6100b13274k16086j39908J12265L17234j48947m74000K72186N88464j66936o3988
6090a32990M68316M35824J5401j00851R5842l09742J27692K03359k81780j82763
6080C38308j43751o4032l9381L7236r7156N0650j08002k76367l97403L47357r6793
6069d49334M18067R5329J2876J48303l25574J66726j7085j18923O84372j89963
$$ plain form
6141 -38338 -527896 -208349 -166074 12024 -69036 141954 545235 719428 309094 -54685
6131 -54685 -5273 119799 609709 414951 -33502 -585826 -301620 -633663 -1012113 -644340
6121 -644340 -509050 -262600 -98381 -205701 -463435 -133731 -410932 -580732 -551532 -248428
6111 -248428 152702 -208512 -268783 -224731 -81093 -104606 -303740 -347725 135302 101274 -213274
6100 -213274 -429360 -569268 -457003 -139769 -288716 -762716 -490530 97934 -69002 -132990
6090 -132990 335326 771150 786551 685700 781542 471800 599492 802851 521071 338308
6080 338308 194557 130525 91144 128380 31224 81874 -26128 -302495 -699898 -352541 -449334
6069 -449334 -31267 64062 76938 225241 -100333 66393 49308 -69615 614757 424794
6059D24794j80391j39861k61709N17412L40803J57013p35381m32157P2083J048671
6049H11277k15064l77781j68390j47896o29079j40250J83231M11016k45184K25424
6039b92696J75390J13315l15920L20999M99151J05344j15890k44029o40720j12894
6029e07950K78324M86659M4147j68374N1479j84582n98142J06288n23539j71669
6019a187359J81793M05020M89769K12782k33666j21552m29930K01281K80340Q6254
6009a15268Q6515m24379r0720L44909Q3573K89476J06558n76865r9965m15709
5999h11875j70013J94429L67695K29579j1245N7935j38129l06454o8895Q1699
5989e75274J56312O02898m25773m10307j28249o9665L75271L09392j68732K7222
$$ plain form
6059 424794 244403 104542 -157167 360245 701048 858061 122680 -309477 -237394 811277
6049 811277 596213 218432 50042 -97854 -726933 -867183 -683952 -272936 -518120 -292696
6039 -292696 -117306 -3991 -319911 1088 500239 605583 489693 245664 -395056 -507950
6029 -507950 -229626 257033 301180 132806 184285 -297 -598439 -492151 -1015690 -1187359
6019 -1187359 -1005566 -600546 -110777 102005 -131661 -253213 -683143 -481862 -201522 -115268
6009 -115268 -28753 -453132 -543852 -198943 -115370 174106 280664 -296201 -396166 -811875
5999 -811875 -981888 -787459 -419764 -190185 -201430 -143495 -281624 -588078 -656973 -575274
5989 -575274 -418962 183936 -241837 -652144 -780393 -850058 -474787 -165395 -334127 -306905
5979c06905K04021n08803k14116O3887r0831M64960M0287k51647n33m4325N81029
5968f2976L65809o04451l63559N53080O55292m8351j5145j67783n983K36314l02409
5957B39838p13458j84218k519O09801M42352l07285j81516K45309K29339j37313
5947B40330n47289K92113j18259k46737M09009K07966J07038l08983j69352m28481
5937e62645L95226p8023M47095L42371M1793l09607L21867K26291n57484m25088
5927a58204l74562L41348M84922O3419l49418M3524j60483K29094L90612K7624
5917E37876q721p11630m87553J57032J40376N72332J99434k33514J03300L91714
5907F60646q8047p6794k58752j9457M40923M15961j34429p80701k61400K2823
$$ plain form
5979 -306905 -102884 -611687 -825803 -761916 -852747 -387787 -347500 -599147 -599680 -644005 -62976
5968 -62976 302833 -301618 -665177 -112097 543195 494844 479699 311916 305933 542247 239838
5957 239838 -473620 -657838 -660357 -50556 391796 84511 -97005 148304 377643 240330
5947 240330 -306959 -14846 -133105 -379842 29167 237133 344171 35188 -134164 -562645
5937 -562645 -167419 -245442 201653 544024 585817 276210 598077 824368 266884 -158204
5927 -158204 -532766 -191418 293504 356923 7505 51029 -109454 119640 510252 537876
5917 537876 529155 -182475 -670028 -512996 -372620 199712 399146 165632 268932 660646
5907 660646 572599 495805 237053 217596 658519 1074480 940051 159350 -102050 -79227
5897g9227l47518Q433M38015R50559n19747o69423l37525J0832M001n27255L58014
5886g10841K56229K87873l15107Q3217l08919p85600j78751M73363Q07096O99061
5876C07621K49879l45160O9791l57753m03414M4418k16492M05128J59680K03202
5866A16900l95540r4212K10874N64741o0159k78196k11924K781n78741J3902M5764
5855f63810k6279J74605n9555K81650J64796k97491j32556K69662N45823L74524
5845F31369m31544K9448J45585l37109j69900j90290J73792Q4447k06994m98902
5835g70098j05458l8436k8348M6344O74923J84346M70577k68522p11482k2835
5825e68989O01245M22341j67314N0340K3436K93666J68392r41924l71358K25007
$$ plain form
5897 -79227 -426745 -418312 19703 970262 450515 -218908 -556433 -545601 -541600 -1068855 -710841
5886 -710841 -454612 -166739 -481846 -398629 -707548 -1493148 -1671899 -1198536 -391440 307621
5876 307621 557500 212340 282131 -75622 -479036 -434618 -651110 -245982 -86302 116900
5866 116900 -278640 -372852 -161978 402763 342604 64408 -147516 -144735 -723476 -709574 -663810
5855 -663810 -690089 -515484 -575039 -293389 -128593 -426084 -558640 -288978 256845 631369
5845 631369 199825 229273 374858 37749 -132151 -322441 -148649 -64202 -271196 -770098
5835 -770098 -875556 -913992 -942340 -895996 -221073 -36727 433850 165328 -546154 -568989
5825 -568989 32256 454597 287283 337623 361059 654725 823117 -118807 -490165 -265158
5815b65158K16711J48753q25085m51608o763L45925K09942j07583L92891M0266
5805c01709k11710l45208k04916N53432O27572K59035Q05K3135j54108k4590o46225
5794d24487o47077o4740P48569J46313k24270L01124P87454r2509l64531q20854
5784f55008k86401N27611k23807l20017N69796P03748K3589m23656k6682K27338
5774A16511K40036l28203k40272L48625L12125j84130O8195m58476l70831K26735
5764b69685k82805j81486K17721M52184L81772n8652Q4868J66268K70865N7501
5754H38551q14840r32588J56403J25231P2974J62797J99509R8591l46230M5632
5744c93970M3828R34751J15016r3594Q4087l49485J77598K15393n4877p71907
$$ plain form
5815 -265158 -48447 100306 -724779 -1176387 -1183150 -837225 -627283 -734866 -341975 -301709
5805 -301709 -513419 -858627 -1063543 -510111 117461 376496 377301 400436 246328 221738 -424487
5794 -424487 -1071564 -1136304 -387735 -241422 -465692 -164568 622886 530377 165846 -655008
5784 -655008 -941409 -413798 -637605 -957622 -387826 315922 339511 -84145 -110827 116511
5774 116511 356547 28344 -211928 136697 448822 264692 332887 -125589 -496420 -269685
5764 -269685 -552490 -733976 -516255 -64071 317701 259049 343917 510185 781050 838551
5754 838551 23711 -908877 -752474 -627243 -554269 -391472 -191963 -93372 -439602 -393970
5744 -393970 -350142 584609 699625 606031 690118 340633 518231 733624 678747 -93160
5734i3160j60061N38453o1170p48347n82889K48738N64525R5583K54786j48304
$$ plain form
5734 -93160 -253221 285232 224062 -524285 -1107174 -858436 -293911 -198328 56458 -91846
$$ [...]
##END NTUPLES=NMR SPECTRUM
##END=
