##TITLE=Analysis number 321175
Compound Code cc 58104
Book Reference 458/174
Project Code adrs
Chemist Name stevem
##JCAMPDX= 6.0         $$ Bruker NMR JCAMP-DX V2.0
##DATA TYPE= NMR SPECTRUM
##DATA CLASS= NTUPLES
##ORIGIN= Bruker BioSpin GmbH
##OWNER= nmr
$$ XWIN-NMR		Version 3.5
$$ Wed Jul 26 18:30:07 2006 GMT Daylight Time (UT+1h)  MAYBRIDGE\nmr@NMR_250MHZ
##.OBSERVE FREQUENCY= 250.131544655141
##.OBSERVE NUCLEUS= ^1H
##.ACQUISITION MODE= SIMULTANEOUS (DQD)
##.ACQUISITION SCHEME= undefined
##.AVERAGES= 16
##.DIGITISER RES= 18
##SPECTROMETER/DATA SYSTEM= dpx250
##.PULSE SEQUENCE= zg30
##.SOLVENT NAME= CDCl3
##.SHIFT REFERENCE= (INTERNAL, CDCl3, 0, 16.4541)
##AUDIT TRAIL= $$ (NUMBER, WHEN, WHO, WHERE, WHAT)
$$ ##TITLE= Audit trail, XWIN-NMR		Version 3.5
$$ ##JCAMPDX= 5.01
$$ ##ORIGIN= Bruker BioSpin GmbH
$$ ##OWNER= nmr
$$ C:\u/data/dgb/nmr/ADRS/3700/pdata/1/auditp.txt
$$ ##AUDIT TRAIL=  $$ (NUMBER, WHEN, WHO, WHERE, WHAT)
(   1,<2006-07-26 18:29:46.41 +100>,<MAYBRIDGE\nmr>,<NMR_250MHZ>,
      <created by zg, POWCHK disabled, PULCHK disabled
       configuration hash MD5:
       E2 DF 36 D8 04 B2 41 60 5A D7 A3 38 5A 4B D0 FE
       data hash MD5: 64K
       14 6C E2 82 91 6C D4 83 80 F1 2E 37 7E 40 36 86>)
(   2,<2006-07-26 18:29:58.95 +100>,<MAYBRIDGE\nmr>,<NMR_250MHZ>,
      <Start of raw data processing
       ef LB = 0.3 FT_mod = 6 PKNL = 1 SI = 32K 
       data hash MD5: 32K
       FC 13 33 F3 A2 3C AA 73 04 A8 91 0B 74 E7 C3 17>)
(   3,<2006-07-26 18:30:00.52 +100>,<MAYBRIDGE\nmr>,<NMR_250MHZ>,
      <apk 
       data hash MD5: 32K
       77 F6 DE B2 EB C3 08 58 3D BF BB 6F 04 B1 19 49>)
(   4,<2006-07-26 18:30:01.24 +100>,<MAYBRIDGE\nmr>,<NMR_250MHZ>,
      <abs ABSG = 5 
       data hash MD5: 32K
       89 68 BE 87 2D BE CF CE C6 24 5E D3 29 71 D6 76>)
$$ ##END=
$$ 
$$ hash MD5
$$ F4 D7 EC DE 34 67 61 C2 6F DF E7 62 D8 55 5A 5F
##$RELAX= 
##$RELAX= 
##$RELAX= 
##$RELAX= 
##$RELAX= 
##$RELAX= 
##$RELAX= 
$$ Bruker specific parameters
$$ --------------------------
##$DU= <C:\u>
##$EXPNO= 3700
##$NAME= <ADRS>
##$PROCNO= 1
##$TYPE= <nmr>
##$USER= <dgb>
##$AMP= (0..31)
100 100 100 100 100 100 100 100 100 100 100 100 100 100 100 100 100 100 
100 100 100 100 100 100 100 100 100 100 100 100 100 100 
##$AQSEQ= 0
##$AQ_mod= 3
##$AUNM= <au_zg>
##$AUTOPOS= <58 >
##$BF1= 250.13
##$BF2= 250.13
##$BF3= 250.13
##$BF4= 250.13
##$BF5= 500.13
##$BF6= 500.13
##$BF7= 500.13
##$BF8= 500.13
##$BYTORDA= 1
##$CFDGTYP= 0
##$CFRGTYP= 5
##$CHEMSTR= <none>
##$CNST= (0..31)
1 1 145 1 1 1 1 1 1 1 1 1 1 1 1 1 1 1 1 1 1 1 1 1 1 1 1 1 1 1 1 1 
##$CPDPRG= <>
##$CPDPRG1= <>
##$CPDPRG2= <>
##$CPDPRG3= <>
##$CPDPRG4= <mlev>
##$CPDPRG5= <mlev>
##$CPDPRG6= <mlev>
##$CPDPRG7= <mlev>
##$CPDPRG8= <mlev>
##$CPDPRGB= <>
##$CPDPRGT= <>
##$D= (0..31)
0 1 0 0 0 0 0 0 0 0.06 0 0 0 0 0 0 0.0002 0 0 0 0 0 0 0 0 0 0 0 0 0 0 
0 
##$DATE= 1153934985
##$DBL= (0..7)
120 120 120 120 120 120 120 120 
##$DBP= (0..7)
150 150 150 150 150 150 150 150 
##$DBP07= 0
##$DBPNAM0= <>
##$DBPNAM1= <>
$$ [...]
##$SUBNAM7= <"">
##$SUBNAM8= <"">
##$SUBNAM9= <"">
##$SW= 20.6930455092707
##$SWIBOX= (0..15)
0 0 3 0 0 0 0 0 0 0 0 0 0 0 0 0 
##$SW_h= 5175.983436853
##$TD= 65536
##$TD0= 1
##$TE= 296.16
##$TE2= 300
##$TE3= 300
##$TEG= 300
##$TL= (0..7)
0 120 120 120 120 120 120 120 
##$TP= (0..7)
150 150 150 150 150 150 150 150 
##$TP07= 0
##$TPNAME0= <>
##$TPNAME1= <>
##$TPNAME2= <>
##$TPNAME3= <>
##$TPNAME4= <>
##$TPNAME5= <>
##$TPNAME6= <>
##$TPNAME7= <>
##$TPOAL= (0..7)
0.5 0.5 0.5 0.5 0.5 0.5 0.5 0.5 
##$TPOFFS= (0..7)
0 0 0 0 0 0 0 0 
##$TUNHIN= 0
##$TUNHOUT= 0
##$TUNXOUT= 0
##$USERA1= <user>
##$USERA2= <user>
##$USERA3= <user>
##$USERA4= <user>
##$USERA5= <user>
##$V9= 5
##$VALIST= <valist>
##$VCLIST= <CCCCCCCCCCCCCCC>
##$VD= 0
##$VDLIST= <DDDDDDDDDDDDDDD>
##$VPLIST= <PPPPPPPPPPPPPPP>
##$VTLIST= <TTTTTTTTTTTTTTT>
##$WBST= 1024
##$WBSW= 4
##$XGAIN= (0..3)
0 0 0 0 
##$XL= 0
##$YL= 0
##$YMAX_a= 415080
##$YMIN_a= -432812
##$ZGOPTNS= <>
##$ZL1= 120
##$ZL2= 120
##$ZL3= 120
##$ZL4= 120
##$ABSF1= 16.45411
##$ABSF2= -4.239063
##$ABSG= 5
##$ABSL= 3
##$ALPHA= 0
##$AQORDER= 0
##$ASSFAC= 0
##$ASSFACI= 0
##$ASSFACX= 0
##$ASSWID= 0
##$AUNMP= <proc_1d>
##$AZFE= 0.1
##$AZFW= 0.1
##$BCFW= 0
##$BC_mod= 0
##$BYTORDP= 0
##$COROFFS= 0
##$CY= 12.5
##$DATMOD= 1
##$DC= 0
##$DFILT= <>
##$DTYPP= 0
##$F1P= 14.0000005364418
##$F2P= -0.99999901652339
##$FCOR= 0.5
##$FTSIZE= 32768
##$FT_mod= 6
##$GAMMA= 0
##$GB= 0
##$INTBC= 1
##$INTSCL= 1
##$ISEN= 128
##$LB= 0.3
##$LEV0= 0
##$LPBIN= 0
##$MAXI= 10000
##$MC2= 0
##$MEAN= 0
##$ME_mod= 0
##$MI= 0
##$NCOEF= 0
##$NC_proc= -3
##$NLEV= 6
##$NOISF1= 0
##$NOISF2= 0
##$NSP= 0
##$NTH_PI= 0
##$NZP= 0
##$OFFSET= 16.45411
##$PC= 1
##$PHC0= 167.9133
##$PHC1= 5.47165
##$PH_mod= 1
##$PKNL= yes
##$PPARMOD= 0
##$PSCAL= 4
##$PSIGN= 0
##$REVERSE= no
##$SF= 250.13001697996
##$SI= 32768
##$SIGF1= 0
##$SIGF2= 0
##$SINO= 400
##$SIOLD= 32768
##$SREGLST= <1H.CDCl3>
##$SSB= 0
##$STSI= 32768
##$STSR= 0
##$SW_p= 5175.98343685301
##$SYMM= 0
##$S_DEV= 0
##$TDeff= 65536
##$TDoff= 0
##$TI= <Analysis number 999999
Compound Code 99
Book Reference 9
Project Code 9>
##$TILT= no
##$TM1= 0
##$TM2= 0
##$TOPLEV= 0
##$USERP1= <user>
##$USERP2= <user>
##$USERP3= <user>
##$USERP4= <user>
##$USERP5= <user>
##$WDW= 1
##$XDIM= 32768
##$YMAX_p= 294364051
##$YMIN_p= -245584
$$ End of Bruker specific parameters
$$ ---------------------------------
##NTUPLES= NMR SPECTRUM
##VAR_NAME=  FREQUENCY,     SPECTRUM/REAL,   SPECTRUM/IMAG
##SYMBOL=    X,             R,               I
##VAR_TYPE=  INDEPENDENT,   DEPENDENT,       DEPENDENT
##VAR_FORM=  AFFN,          ASDF,            ASDF
##VAR_DIM=   32768,         32768,           32768
##UNITS=     HZ,            ARBITRARY UNITS, ARBITRARY UNITS
##FACTOR=    0.157963299565203, 1,           1
##FIRST=     4115.66661155869, 0,            0
##LAST=      -1060.31682529432, 0,           0
##MIN=       -1060.31682529432, -245584,     0
##MAX=       4115.66661155869, 294364051,    0
$$ Real data points
##PAGE= N=1
##DATA TABLE= (X++(R..R)), XYDATA
$$ [...]
19253e8298O1782J4390o4409j366l0569k9283P553K1933J79L7115k716q616Q266
19240d4039K3135p477k2874R738N5025k2733P308L5731K267k8734j1765K9766
19228B5348N76n6507j4773m747n5801K1801K6527J0584j0421J5563P4087J5103
19216D7340k477k8734N737j5640J9384k5823l17K4898l8845Q863J7861j8765L3954
19203B7436L4788m863l2274p8945K2920O66P919L0091P737k3848L9683M5202O11
19190G7123m2710K1371M6315j9847q2277R970J3656m9167K4850K5807J0007o616
19178B8482l288q283j748l308l8502O0925n61L6263J142m8832n570K451k2776
19165c605K4274K2031k6105k8132J0081l8596n06k1614j6667R4200M8681K0095
$$ y = [-58298, 3484, 17874, -46535, -47901, -78470, -107753, -100200, -78267, -78088, -40973, -43689, -52305, -44039, -20904, -28381, -51255, -41517, 13508, -9225, -1917, 33814, 36081, 7347, -4418, 25348, 25924, -30583, -45356, -50103, -105904, -84103, -57576, -46992, -57413, -41850, 32237, 47340, 44863, 16129, 21866, 6226, 25610, -213, -530, 24368, -14477, -5614, 12247, -6518, 27436, 62224, 57361, 25087, -53858, -30938, -30272, -22353, 7738, 15475, -8373, 31310, 76512, 77123, 34413, 55784, 102099, 82252, -25, 9945, 23601, -25566, -716, 25091, 35098, 28482, 25194, 16911, 15163, 11855, -26647, 34278, 33717, 69980, 71122, 22290, 16720, 19171, -3605, 20669, 42700, 16595, -11537, -1456, -40052, -40558, -62172, -78839, 15361, 64042, 84137]
19153H4137n8793p9980l605M1753J7797l6788j1075n8228L6184K0654P0766q485
19141A4337j2728K4257K1085M1303L3785k1678p1516k432K7643L809K2552M646
19129H5063O83n1404K122m1365k0647m4488K7763n6752l5731O0354J09592M9588
19117H4778p553m8625l1905k4531J1636L004k8254J6861j5115j4020M2957n0614
19105f1381j8205P2390M197j0494n0771K7430J3018j6088j4276K239n624q714
19093f6279K1901L5931N0996j3187j9303m758m3064o5569J8202J4970K5327K2326
19081b2507J1980m82k3615m4530M4243M1659l7565n2654J583J5743K7781J4125
19069b4239J4443q265O494o553k9782j4745j6261K6818l427Q563N7343N5490K838
$$ y = [84137, 25344, -54636, -58241, -16488, 1309, -35479, -46554, -104782, -68598, -47944, 22822, 14337, 1609, 25866, 46951, 88254, 122039, 100361, 28845, 26413, 54056, 57865, 80417, 85063, 85746, 34342, 36464, -4901, -25548, -70036, -42273, -99025, -134756, -74402, 35190, 84778, 77225, 28600, -3305, -27836, -16200, -13196, -41450, -24589, -39704, -53724, -10767, -61381, -79586, -7196, -2999, -13493, -64264, -36834, -23816, -39904, -54180, -51941, -57565, -66279, -44378, -8447, 42549, 29362, 10059, 5301, -37763, -103332, -85130, -70160, -44833, -22507, -10527, -11009, -34624, -79154, -34911, 6748, -30817, -83471, -81888, -66145, -38364, -24239, -9796, -18061, -11567, -18120, -47902, -62647, -78908, -52090, -55517, -46954, 10389, 65879, 68717]
19056F8717l8149p5981r146l564m1089j9705N4720P3463M2867j0235K2511P5276
19044A39685k0159k4714m7092p8539j3948M8895j0674m421N1465L5505n2547m5208
19032b1752n4047K9124J5257o012J2435K9989L5264J7623j9650l3629j4415l801
19020a3614m696K5016L5582k6605p038k3924j9343q902Q317K3402J008J3050J8544
19007B0797l3044l1356L1195k7809k4460q982o7420K5141M4557m1138n4136N9833
18995a06822J05339P9970m389k8810k0328l2590l836j4315o665j4600j4216J5987
18983d5275K0568M6204k0832j5443R729L5220N1356j1109l8526p4714j6127Q808
18971e0141L7200L8490R597K4445n3161m1407K6926O29l1058J7459m5572p9072
$$ y = [68717, 30568, -45413, -54559, -58123, -99212, -118917, -64197, 9266, 52133, 41898, 64409, 139685, 119526, 94812, 47720, -30819, -44767, 4128, -6546, -10967, 40498, 76003, 23456, -21752, -75799, -46675, -31418, -37430, -24995, 4994, 40258, 57881, 38231, 4602, -9813, -13614, -18310, 6706, 42288, 15683, 8645, -15279, -34622, -43524, -35207, -11805, -10797, 2253, 20797, -12247, -43603, -12408, -40217, -64677, -73659, -141079, -115938, -71381, -112519, -166655, -106822, -1483, 78487, 74098, 45288, 24960, -7630, -11466, -25781, -32446, -47046, -61262, -45275, -24707, 21497, 665, -14778, -5049, 30171, 81527, 70418, 31892, -42822, -58949, -50141, -12941, 25549, 35146, 59591, 6430, -34977, -8051, -7422, -38480, -21021, -66593, -145665]
18959a45665K409O1388N3003J3688m4321j6448K3973j766P2420M6641j0707k0217
18947C4398q701l5410l1071n2483K5262J2875m5787K8302O341P500J1247j9810
18935f7337K1191N05k1852M3966N0356l3148o5855P257R426Q4389Q9549J5406
18923A33853m0830n2956n7190n6950m3012o117M2476K3380l4081k9605p7309P8169
18911a20172J24627O1642J7747Q7940l3887n0999J608l131j7735n9540p1656m4125
18899a07681O7215J12076n957l0164m1589J8768J0312j7972L123M8924j5392O804
18887D8467j2232o7695k5651M3141n4881M1652K562K4732O1603n6355j3103j674
18875i434P330o340l4432N410N8950J8127k0593o3408N192m297P0585M9318K7585
$$ y = [-145665, -143256, -81868, -28865, -15177, -59498, -75946, -51973, -53739, 18681, 65322, 54615, 34398, 25697, -9713, -40784, -93267, -68005, -55130, -100917, -72615, -66274, -58774, -47527, -67337, -46146, -45641, -67493, -23527, 26829, -6319, -72174, -64917, -55491, 28898, 118447, 133853, 93023, 40067, -17123, -74073, -117085, -123202, -80726, -57346, -91427, -121032, -198341, -120172, 4455, 66097, 83844, 171784, 137897, 86898, 88506, 85375, 67640, 8100, -63556, -107681, -40466, 71610, 65653, 35489, -6100, 12668, 22980, 5008, 8131, 57055, 41663, 48467, 36235, -31460, -57111, -13970, -68851, -27199, -24637, 95, 61698, 5343, -7760, -9434, -2104, -8444, -42876, -37466, 21484, 39611, 19018, -44390, -39198, -43495, 27090, 76408, 103993]
18862A03993n3632P893j472k0341j0445j2564j0300l9683J0889O1260n2906p3374
18850i0682n707K6031O9444j404j9637l3310M2660N3256R032j765l3992j9613
18838e687j5992L7983k4273K871k0813p872J5508J5993K7895N3261k8209m7149
18826C516l4731j450L6295M2532k7028L2568L0807m515J1986l4634k5982k0709
18814H655k2061o7419K3368L9093J7595K712J441J5057K1394l5381o5204j2727
18802g3477L6194K8783K2796j1635K0365K933K482m0247J8407J8897m654k6938
18790f094M5284O5630l833k4368m5015j7272k3067K1502J9415P9891L4163n3696
18778I2540K6258k2152K0419R828j1744O132L521O2890J1331Q3299N5975L0353
$$ y = [103993, 50361, 58254, 56782, 36441, 25996, 13432, 3132, -36551, -25662, 35598, -17308, -90682, -96389, -70358, -914, -2318, -21955, -55265, -12605, 40651, 49683, 47918, 13926, -5687, -21679, 16304, -7969, -5098, -25911, -33783, -18275, -2282, 25613, 78874, 50665, 3516, -31215, -32665, 3630, 46162, 19134, 51702, 82509, 77994, 89980, 55346, 29364, 8655, -13406, -80825, -57457, -18364, -769, 1943, 3384, 18441, 39835, 4454, -60750, -73477, -37283, -8500, 14296, 2661, 23026, 25959, 28441, -11806, 6601, 25498, 20844, -6094, 39190, 104820, 100987, 76619, 31604, 14332, -8735, 12767, 32182, 112073, 146236, 92540, 118798, 96646, 117065, 126893, 115149, 121281, 124802, 187692, 199023, 282322, 338297, 368650]
18766C68650o0597p1177j00971n1971l5111R513l0588l4584J807N475l295M5790
18754D2941N316q0100m1074M9522N086O608N0352j9805k9274L9285l1193p0803
18742g3139K724L7200k2560n461K716K4973P0546M2567n7086k3883K3874K2007
18730D4478P6524K0415O556n4888o6870k4512m2208j6935K1113j3852m2721Q682
18718h4218O2278L7716M5067n0462j02141R871M8171R867J0345K5037n0260q197
18706d6926L3558R156J6933m4623p6907O2301J9762j0487q606j332N6187m9332
18694d0316k3038n587l5158L3387N1066R9709R124p4804n4699K9297O0073J7316
18682F6370n546j1004M6813L275j9808m2000j6191J6443m4097n9428l835K6451
$$ y = [368650, 308053, 236876, 135905, 83934, 48823, 58336, 27748, -6836, -5029, 446, -2849, 42941, 48257, -31843, -72917, -23395, -18309, -11701, 38651, 18846, -10428, 28857, -2336, -73139, -70415, -33215, -55775, -61236, -58520, -33547, 36999, 79566, 22480, -1403, 22471, 44478, 121002, 141417, 147973, 93085, 26215, 1703, -40505, -57440, -36327, -50179, -92900, -84218, -21940, 15776, 60843, 10381, -91760, -81889, -33718, -23851, -13506, 11531, -38729, -46926, -13368, -4212, 12721, -31902, -108809, -46508, -26746, -37233, -45839, -47171, 9016, -40316, -63354, -68941, -104099, -70712, -19646, 80063, 89187, 14383, -40316, -11019, 49054, 66370, 60824, 49820, 96633, 99908, 80100, 38100, 21909, 38352, -5745, -65173, -69008, -42557]
18670d2557j95M5340j0343M0758K4997j7748m8162N8779P037k5089R550l343L379
18657D2403m7173o2960K7951J4441L0892K1950m125M142J1833l9600j8983j9206
18645c8435r575M2348P8828o089l2277p6789K289m1829M7953L5163K668l2241
18633b7986L2288k3499l9960J8886K1902R4191k0682n6871m2190r847K8191j0103
18621c5680o3109j1442L3378L1275k2535O3940P1668m695l3522K2113L6394l6435
18609E1350m0820k4852m495m042R828K8046p866k4854J4873m0642n8946j3540
18597a15960J00900O054p172O0584M080K1866J7060o2492o9733o594K3839j0377
18585c7945j9950k5136K9375J8763P2571M01q8543m7081o851K2734K0138N4234
$$ y = [-42557, -42752, 2588, -7755, 33003, 58000, 40252, -7910, 50869, 57906, 32817, 42367, 39024, 42403, -4770, -67730, -39779, -25338, 5554, 27504, 23379, 27521, 39354, -246, -19229, -38435, -48010, -5662, 73166, 67077, 34800, -41989, -39700, -81529, -33576, 1587, 4255, -27986, 4302, -19197, -59157, -40271, -18369, 75822, 55140, -1731, -43921, -53768, -25577, -35680, -98789, -110231, -76853, -45578, -68113, -4173, 67495, 62800, 29278, 51391, 87785, 51350, 10530, -14322, -18817, -22859, -13031, 15015, 7149, -17705, -2832, -43474, -102420, -115960, -15060, -9006, -16178, 44406, 48486, 70352, 87412, 24920, -44813, -51407, -27568, -37945, -57895, -83031, -53656, -34893, 37678, 38079, -50464, -97545, -104396, -81662, -61524, -7290]
18573g290j5707l7997r469R0085o524l6557l6822N0904M9142p0913J7948j2225
18561b5425n5443l012M8148N832k1198J6557K9376j0475K3529L2648k9900j7330
18549f693l0088l6703J9135O7141L8616j3639k2139n6722K0183Q521o853M244
18537a4997j4126K4443m3149k2951Q718J588L1573J5853L1493J0609m7609J7447
18525a108K6873k5309m0119L6457P58J9460O7899k0831j8452n1531k3116q344
18513c7363k6411J866r80N7949J6016J8334J8577L819J4391J3165n1591j4326
18501A3446O66k3575J3963O4177J9955m6627m685j6011L342l856n384k7980m6424
18488e8993L7438K024J9584J0009l283k7886m9945m7324L1802k8855k6598r047
$$ y = [-7290, -22997, -60994, -70463, 19622, 13098, -23459, -60281, -9377, 39765, -31148, -13200, -25425, -80868, -83880, -35732, -29900, -51098, -34541, -5165, -15640, 7889, 40537, 10637, -6693, -36781, -73484, -54349, 12792, 51408, 37769, 15630, -41092, -20909, -12388, -19241, -14997, -29123, -4680, -47829, -70780, -62062, -60474, -28901, -13048, 18445, 29054, -18555, -1108, 25765, 456, -39663, -3206, -2448, 17012, 84911, 64080, 45628, -5903, -29019, -37363, -63774, -61908, -62888, -4939, 11077, 29411, 47988, 51807, 66198, 79363, 27772, 13446, 14112, -9463, 4500, 68677, 88632, 42005, 37320, 21309, 24651, 20795, 15411, -12569, -58993, -21555, -19531, 53, 10062, 6779, -21107, -71052, -118376, -86574, -115429, -142027, -151074]
18476a51074M128J8414m810M9763J7136N585J0967J1631M5441j8948o5301L8063
18464c9005K4219J1011j9610j4412M0859L3249L6736k1649K9292j2475l7678k4828
18452E709L2089P6796l7780n7659M9088J5208J1013l2485k2146n0741k2184K3979
18440i113O4538N2991J9906k4171r2152l4593M8851o225J3958K6864j3731n629
18428D1494j1807k3863m0501K625J5694M9002p395n0005j4609M6331R668l9298
18416b2664j132l7594p50J4032L6009k6545L7320j7010Q489J3071L061R7031l175
18403A00143k8908r3852L4559M1321K8864J7742J755J1122j6447j3365j1662p6187
18391d915K1578K449R07K4378m654N1120K9605p2300o7281j8859M270N7307K4595
$$ y = [-151074, -146946, -128532, -133342, -83579, -66443, -60858, -49891, -38260, 7181, -11767, -77068, -39005, -14786, -3775, -23385, -37797, 3062, 36311, 73047, 51398, 80690, 68215, 30537, 5709, 37798, 114594, 76814, 19155, 68243, 83451, 94464, 61979, 39833, -10908, -33092, -9113, 55425, 108416, 128322, 104151, 11999, -22594, 26257, 20032, 33990, 60854, 47123, 41494, 29687, 5824, -34677, -32052, -16358, 32644, 25249, -24756, -39365, 6966, 16634, -22664, -23796, -61390, -62140, -48108, -12099, -38644, -1324, -18334, -9845, 3226, 6287, 103318, 100143, 71235, -22617, 11942, 53263, 82127, 99869, 101624, 112746, 96299, 82934, 71272, -4915, 16663, 19112, 20019, 44397, 39743, 90863, 120468, 48168, -19113, -37972, -33702, 23605, 48200]
18378D8200M3988O274j01561l1267O3525k537k7660p4210n2117L7237J8465L6274
18366c5389r048r189M3086J8925m2318m4500j7798J5663Q0313O4439P066J1054
18354H2304M5925l1321l0111k9817n8770L0633K1535M2801J8711o7222k8915Q748
18342D501M4214J0199K7035p474l5817m7226m2568m6180K5256P3799L4937l2362
18330H314k412L1002k8501o938p92O8624J9236m0001j0328K5397L2552k5373l5861
18317C4919n6007j6583K2104K6832O0480P633L4527m6770n7512j764J5209j2481
18305A0587J2747l0847N7249o678j9129L2566K3048l969N2595J2695l2829L165
18293A11200l8459k9122J8678j108k5210m8809k324k6098m2806k9258L0235O5077
$$ y = [48200, 92188, 98462, -3099, -34366, 29159, 26622, -1038, -75248, -127365, -90128, -71663, -35389, -44437, -53626, -10540, 8385, -33933, -78433, -96231, -80568, -255, 64184, 71250, 82304, 128229, 96908, 66797, 36980, -21790, 8843, 30378, 73179, 91890, 24668, -4247, 4501, 48715, 58914, 85949, 78475, 42658, -4568, -47136, -93316, -68060, 5739, 40676, 8314, 5902, 36904, 8403, 1465, 673, 69297, 88533, 48532, 38204, 63601, 96153, 70780, 34919, -21088, -37671, -15567, 11265, 71745, 79378, 113905, 67135, 9623, 7859, 23068, 10587, 23334, -7513, 49736, 43058, 23929, 56495, 79543, 75574, 128169, 140864, 108035, 111200, 72741, 43619, 62297, 61189, 35979, -12830, -15154, -41252, -84058, -113316, -83081, -18004]
18281a8004P1780L5679o1947o1635K1767L167r8468M3094J9672M2901K4736J5149
18269C7891O6853k419j7301J5132l4035K7512L7013m4706o3087n5101N4053P4801
18257I6606m3804n6237n5195K0090L2225o604K7264k4635J9947M4567J0036p1418
18245g158J4139J8017n7420J4303P7566K816K0026K9087Q849n4640L559N0742
18233A19886q792j1625M3201J9411n9169k955P43N2518J6306j11018K4344L3986
18221A16836N464p3789l5667N18j8868l3174L1865M3130J2775j8206M4633P3986
18209A49503k9127j8116J8690r266k9982J6156J9475K6545N0771j3373k2769k3163
18197A35344m6773m2750R099J6358n4098K3808J6662L0147k4281M6083L4408n0249
$$ y = [-18004, 53776, 89455, 27508, -34127, -12360, -9193, -107661, -64567, -44895, -1994, 22742, 37891, 104744, 102325, 85024, 100156, 66121, 93633, 130646, 85940, 22853, -32248, 21805, 96606, 52802, -3435, -58630, -38540, -6315, -12919, 14345, -10290, 9657, 54224, 64260, -7158, 6981, 24998, -32422, -18119, 59447, 62263, 82289, 111376, 120225, 65585, 69144, 119886, 111094, 99469, 142670, 162081, 102912, 99957, 100700, 153218, 169524, 58506, 82850, 116836, 122300, 48511, 12844, 13362, -5506, -38680, -6815, 36315, 49090, 30884, 75517, 149503, 120376, 102260, 120950, 111684, 81702, 97858, 117333, 143878, 194649, 181276, 158507, 135344, 88571, 45821, 54920, 71278, 17180, 40988, 57650, 87797, 63516, 109599, 144007, 93758]
18185I3758m4749M3326n0130n6065K6566L3144k089M504l0207k450J2961j9650
18173H919l746k8606O4622M2910j940P880l6779L0837K5930J3926J0824J5400
18161A50177J3850M2455K3619k594l5940q439L4130L8576O0949n594P014p117
18149C11086N4378j5544j8743o627L0906N8120N1543k2992L7693L5472K6821L8631
18137E80744P4944M9031M1597J5759K88M1854P4787M7167Q8926J86220J43497
18126A344814J65069J99126K62200L73255N04902N57674O32434Q88992J288247
18117F216713J836404K774370M407562O755787Q956402P629626M990614O177301
18109D9744779Q081038K070850j3857048j5764593r362344n315863l278899k126895
$$ y = [93758, 49009, 92335, 42205, -13860, 12706, 45850, 43761, 48265, 18058, 15608, 28569, 8919, 5173, -23433, 41189, 84099, 82159, 90039, 53260, 84097, 110027, 123953, 134777, 150177, 164027, 206482, 230101, 227507, 191567, 183128, 217258, 255834, 316783, 311189, 318203, 311086, 365464, 349920, 331177, 324550, 355456, 413576, 465119, 442127, 479820, 515292, 542113, 580744, 655688, 704719, 746316, 762075, 762363, 804217, 879004, 926171, 1015097, 1201317, 1344814, 1509883, 1709009, 1971209, 2344464, 2849366, 3407040, 4039474, 4928466, 6216713, 8053117, 10827487, 15235049, 21990836, 30947238, 38576864, 43567478, 49744779, 57825817, 59896667, 46039619, 30275026, 20912682, 15596819, 12317920, 10191025]
18101A0191025j451731r97033p15457n79290n08437m46556l84021k46423k47194
18092D614883k29997j87218k03741j80772j24268j41997j55768j42008k9865j03664
18082C115585j37885j27888j06326r0981q5426j20400p8153r5744q0131p8124
18072B114527n5420K3553J4058j16143j53235j14252p6859r983q489l6073m0827
18061A540857o3713n7185l6173o7526m2167l8307K2415l9373p8660m9348M40q068
18049A083192p0899j15112O551P208l568k4878k5670J0290k2064J2337l1076j00920
18037G25391m9530N3783J4265n1520l9010k1412J1532j6088m7908K4993m0659
18026E63837J479K7185m3407n8512k8907M3857l746J2091M3448n7320q382o2694
$$ y = [10191025, 8739294, 7742261, 7026804, 6447514, 5939077, 5492521, 5108500, 4862077, 4614883, 4384886, 4197668, 3993927, 3813155, 3688887, 3546890, 3391122, 3249114, 3219249, 3115585, 2977700, 2849812, 2743486, 2652505, 2567079, 2446679, 2368526, 2272782, 2192651, 2114527, 2059107, 2082660, 2096718, 1980575, 1827340, 1713088, 1636229, 1626246, 1617757, 1581684, 1540857, 1477144, 1419959, 1383786, 1316260, 1274093, 1235786, 1258201, 1218828, 1140168, 1090820, 1091260, 1083192, 1012293, 897181, 903732, 910940, 907372, 882494, 856824, 867114, 845050, 857387, 826311, 725391, 675861, 729644, 743909, 692389, 653379, 631967, 643499, 627411, 579503, 604496, 563837, 565316, 592501, 549094, 490582, 461675, 505532, 501786, 513877, 557325, 500005, 491623, 428929]
18014D28929n7706m771k6002r152k0865n3486k8455J8085o055J6640L3471p557
18002B83076O0832L8154o4245l7370L9059J1107n4972n1698n431j7304O13j5332
17990A86489K1311Q273M6133k3141k6048n1720m4027p182k9282N9223k751k9512
17978A07766Q913q370J5799j4225j3668j3655o4654M911O3600m2160l3705J0354
17966B0906L1883p086j0760L8185j5068k2974J5636K8228L8264l3580J7045N1427
17954A52106k3219j12008k0172j9408L0740m549o9462j2738J5716L4744M1137
17943A2887L341J048j4419m4405N6787L5931J4246r516M731L6440m2829l4448
17931A9794J4594N2810L6918l5524o7085q593j0831N6970K2269m1842O586J7224
$$ y = [428929, 371223, 366452, 340450, 331298, 310433, 256947, 228492, 246577, 240522, 257162, 290633, 283076, 343908, 382062, 317817, 280447, 319506, 330613, 275641, 223943, 218512, 201208, 201821, 186489, 207800, 216073, 262206, 239065, 213017, 161297, 117270, 110088, 80806, 140029, 137278, 107766, 116679, 108309, 124108, 109883, 96215, 82560, 17906, 22817, 86417, 44257, 10552, 20906, 52789, 45703, 34943, 73128, 58060, 35086, 50722, 78950, 117214, 83634, 100679, 152106, 128887, 16879, -3293, -22701, 8039, 3490, -65972, -78710, -62994, -28250, 12887, 16228, 17276, 2857, -41548, 15239, 51170, 65416, 55900, 60631, 97071, 54242, 19794, 34388, 87198, 124116, 88592, 21507, 12914, 2083, 59053, 81322, 39480, 46066, 63290]
17919F3290l0287K7153L3242m472m6381o1516q939M3141L4263m872q3145n1936
17907i0459K297M9766N7315K0726o704l8990j7311K9036L317K6942M9446J148
17895H6529p7660K5710L9869m2139j9646j016L0521m2065K5011K5741k610l4952
17883A3293K6067P4128J5871p0397L3425k0311l1796L8270P0351q180q665j5214
17871A16842M558J4010j02680k9816j0591N076P7553J2232k1251k3195N2464p168
17859H8034n6634k773n90j231J3400L2365L651q1986n7782m0918k279J0603Q5341
17846a0799m221m4188l2898K3254M8631P7519M5220r097n2820k3205r213m0395
17834c2212J3685J3535l0132Q795L6630N859k7890j5215J3591J6985L1789J2570
$$ y = [63290, 33003, 60156, 93398, 88926, 42545, -18971, -27910, 15231, 49494, 44622, -38523, -90459, -88162, -38396, 18919, 39645, 32941, -6049, -23360, 5676, 8993, 35935, 85381, 86529, 8869, 34579, 74448, 32309, 12663, 11647, 42168, 103, 25114, 50855, 48245, 13293, 39360, 113488, 129359, 58962, 92387, 72076, 40280, 78550, 148901, 140721, 132056, 116842, 121400, 135410, 32730, 2914, -7677, -2601, 74952, 87184, 65933, 42738, 95202, 88034, 31400, 28627, 28037, 26806, 40206, 72571, 76222, -5764, -63546, -104464, -106743, -96140, -10799, -15020, -59208, -92106, -68852, -20221, 57298, 102518, 93421, 40601, 17396, 8183, -32212, -18527, -4992, -35124, -26329, 10301, 16160, -11730, -26945, -13354, 3631, 35420, 47990]
17822D7990M6704O3783O116n6675j1210K4709j9787o8642m0145O436J6988M150
17810B0417M6852j1713j7513O049k4783j6068q023j0585M5096k242l4530j9199
17798b6242j7755R3422K7950m9779k5221M4014m505J4857K0803m8007j6907J4074
17786B6704k1698p4574k3554K0892M141o3707L3144P0995Q1279j9904J3134j4830
17774C2022o3325l2504N5606j036m8691j7962L562L2928N4441J9552J1238J7446
17762F3277R225l2404p7129m6130O2302O4372l749P31j609j9480J7658K7484j9670
17749D4878k4710l7237n1781Q0071L1915j824k4854o648q975k4225j0225N6307
17737B2692J8800l4881l8018J820L2859l544J6623o1215p078m449j6212k5482
$$ y = [47990, 94694, 158477, 164593, 107918, 96708, 121417, 101630, 32988, -7157, -721, 16267, 20417, 67269, 55556, 38043, 44092, 19309, 3241, -4782, -15367, 29729, 27487, -7043, -26242, -43997, 49425, 77375, 27596, 2375, 46389, 41884, 56741, 77544, 29537, 12630, 26704, 5006, -69568, -93122, -72230, -68089, -131796, -98652, -27657, 53622, 33718, 46852, 32022, -31303, -63807, -8201, -9237, -57928, -75890, -72328, -39400, 15041, 34593, 45831, 63277, 72502, 40098, -37031, -83161, -20859, 43513, 39764, 40495, 38886, 19406, 37064, 64548, 44878, 20168, -17069, -68850, 11221, 43136, 41312, 16458, 9810, 835, -23390, -33615, 22692, 41492, 6611, -31407, -29587, 3272, -272, 16351, -44864, -51942, -56391, -72603, -98085]
17725i8085N7837J9454j8261N2008j8993n1825m044J07092k5014k5009j5620n4620
17713g5080p909K858M0781P0325R6209K7379l3495j8451k3707l1333l3080l2439
17701a7942j10842N0910K9753j1074J3512l9212m9646o020K4225L4293L3107l6312
17689h5248k922k6471O473L9788L2812J8353o024j7034k8794j6962P412j5987
17677i4604o5011j5793P6018K7293p0680n609K6757K8989J6367M779M8749M025
17665a8720P464J4897M1090P693L8946N1297L3967j00608j18205l8656l2183j3253
17653a26271J8317L6374M4817P1970r98Q02o5568n9542l1629J853M7169P8928
17641A6222J448p7987l0391J4835R6903o645n8084K2179M1348K745N36k9205M0500
$$ y = [-98085, -40248, -20794, -39055, 12953, -6040, -57865, -61909, 45183, 20169, -4840, -20460, -75080, -82989, -80131, -39350, 30975, 127184, 154563, 121068, 102617, 78910, 47577, 14497, -17942, -128784, -77874, -48121, -59195, -45683, -84895, -134541, -140561, -116336, -82043, -48936, -85248, -88170, -114641, -108168, -68380, -35568, -17215, -23239, -40273, -69067, -86029, -78617, -94604, -159615, -175408, -99390, -72097, -142777, -148386, -121629, -92640, -76273, -71494, -22745, -18720, -11256, 3641, 44731, 52424, 91370, 142667, 176634, 76026, -42179, -80835, -113018, -126271, -107954, -71580, -26763, 45207, 44209, 45011, -20557, -80099, -111728, -109875, -62706, 16222, 17670, -60317, -90708, -75873, 21030, 14385, -43699, -21520, 19828, 22573, 23109, -6096, 34404]
17628C4404j0600j3429O064j6796J0102J22265J5627o0979k7767J1094l8301n876
17616B5808k3152Q929k5514l129J6434k9321m5170j0143l6403J6945J3674O7429
17604b3613L1271k5008L1570l7397n5605l2222M1576P7995n7867m3609M6869r499
17592e5539l698j945K8548j401q3053k4285M7269P110j3564J8174K0675J9395
17580d2314O4474K2127r58m3988k8017M5169N6357k6466j4627k1049J4532K2243
17568D7483M871p3472m7970l1775k7323L9664l271O45J9767R729J7376O3127M461
17555B3312Q906M3241K6394k3339k092o9205m7497K7281O3272o6507m8393j7043
17543h1670L3418R870j6163K6262j8688o0099J9396O8074l9958k3169L6139K5374
$$ y = [34404, 23804, 10375, 16439, -357, 9745, 132010, 147637, 86658, 58891, 69985, 31684, 25808, 2656, 11585, -13929, -17058, -624, -29945, -75115, -85258, -121661, -104716, -91042, -23613, 7658, -17350, 14220, -23177, -78782, -111004, -69428, 8567, -49300, -92909, -46040, -55539, -59237, -61182, -32634, -34035, -117088, -141373, -94104, -86994, -100558, -82384, -61709, -42314, 22160, 44287, 43329, -659, -28676, 16493, 72850, 46384, 31757, 10708, 25240, 47483, 52354, -21118, -69088, -100863, -128186, -88522, -91793, -91148, -71381, -61652, -44276, 18851, 23312, 32218, 75459, 101853, 78514, 76422, 7217, -40280, -12999, 50273, -16234, -64627, -81670, -48252, -38382, -54545, -28283, -46971, -107070, -87674, -19600, -59558, -82727, -46588, -21214]
17531b1214O7048K7154J6747j2641o4841P04j5428n1414m3446L5561M2689k871
17519b1952n5134m8617J7876L1401k96N3884j4212k7998K835N5977K7m9213m2535
17506i7957J1899N237n903P0390M4020m889J3666M7150J0289r7223J1475o6592
17494e8438p2343J4896N2763o18l7237j6658K7845J02009l8679l3408O0305O943
17482G380k0344k4629K7540j7827K30J6556M6116K0748J9184j5664N360j1398
17470E3252k3619K6026J5427O783q0783l6506K235n709Q2556N4528o5564O566
17458C5192K1268K0069l8147n7804J2517m1412Q390N0833K9227K1736J7207N5868
17446A34944J5130M9674P855O1842P2842K361l0445q9258q4421k1469J9877n2837
$$ y = [-21214, 45834, 72988, 89735, 77094, 12253, 12957, -2471, -53885, -97331, -61770, -19081, -21952, -77086, -125703, -107827, -76426, -76722, -22838, -37050, -65048, -62213, -6236, -6209, -55422, -97957, -86058, -80821, -86724, -16334, 27686, 22797, 36463, 83613, 93902, -3321, 8154, -58438, -130781, -115885, -63122, -63740, -100977, -117635, -89790, 12219, -26460, -59868, 437, 7380, -12964, -37593, -10053, -27880, -27650, -11094, 35022, 55770, 74954, 59290, 64650, 53252, 29633, 55659, 71086, 77869, -2914, -39420, -37185, -42894, 39662, 94190, 28626, 35192, 56460, 76529, 38382, -19422, -6905, -48317, -39927, 10906, 40133, 61869, 79076, 134944, 150074, 199748, 207603, 269445, 342287, 344648, 314203, 224945, 140524, 119055, 138932, 86095]
17434H6095n3582l7267m6234L6316J8997m0906P3593N2817J4790q5022J8856J2649
17422E1102p8671p3317M9296L0965K840J0289Q417k355K0368L5170J3561J307
17410F8972p3642r2431L2671R312o445l5810l7668N9665J10590j4786n8893M6374
17398G909k0600J3328J8185q0322k925M8711j04876k5931M8648O7271M1334J8524
17386B9256K079K649l2808q203j3329Q317J0214j6355J2690N4157J6523P7088
17374A42278J22122M4009r0518m8814q474j5504j9929J1493J6024l9694p6885
17363C6108j3719N1694j5816j0095j2098l7929P4244J4304k877R533n680J124
17351H8793o6710r5243k4201K2936J5482L7743O3026k8181k5266j8206k6043O5922
$$ y = [86095, 32513, -4754, -50988, -14672, 4325, -36581, 37012, 89829, 104619, 19597, 38453, 51102, -27569, -100886, -51590, -20625, -17785, -7496, 921, -1434, 18934, 54104, 67665, 68972, -4670, -97101, -64430, -55118, -61563, -97373, -135041, -75376, 35214, 20428, -38465, 7909, -12691, 637, 18822, -61500, -64425, -15714, -120590, -146521, -97873, -30602, 10732, 29256, 31335, 33984, 1176, -7027, -20356, -12039, -1825, -18180, -5490, 48667, 65190, 142278, 264400, 308409, 217891, 169077, 160603, 145099, 125170, 136663, 152687, 112993, 36108, 22389, 74083, 58267, 48172, 36074, -1855, 72389, 86693, 83816, 93349, 87669, 88793, 22083, -73160, -97361, -74425, -58943, -21200, 41826, 13645, -11621, -29827, -55870, 10052]
17339A0052M8160o673l2663k6017L0429m6229j8003k5675o8252j4424N7732J46214
17327E4651J5335m7329m0953m129k057P4980J9358l7411O45J0869K757J070j8228
17314B9558K0178J6859l0509k9328k0634K4177K8724J5941J5227k4372j9409l9530
17302a3118k6580M1397J0137k8620L263L8208K8769k0729m5593J7040K8862R217
17290D2253n2175m2335J3516k7340l4114M0693K9093M6201J6342m9209j9913J4757
17278b2231J95L3625j3599K3051R933J1487j2732j4522K3065k5557n5456M5166
17266B425J224k4851J4423l9405K7681N2116K9681j0369q8353l5385q873j636
17254h1322J004N9127N584n5219Q822N3145O351M1048j1934l3035J7422K3804
$$ y = [10052, 58212, 51539, 18876, -7141, 23288, -22941, -40944, -66619, -134871, -149295, -91563, 54651, 69986, 22657, -18296, -22425, -24482, 50498, 69856, 32445, 33090, 43959, 46716, 47786, 29558, 49736, 66595, 36086, 6758, -13876, 10301, 39025, 54966, 70193, 45821, 26412, -13118, -39698, 1699, 11836, -16784, -13521, 24687, 53456, 32727, -12866, 4174, 33036, 42253, -9922, -52257, -38741, -66081, -100195, -59502, -30409, 15792, 32134, -17075, -36988, -22231, -22036, 11589, -2010, 21041, 30974, 42461, 29729, 15207, 38272, 12715, -42741, 2425, 3649, -21202, -6779, -46184, -18503, 33613, 63294, 52925, -35428, -70813, -79686, -81322, -80318, -21191, -15607, -70826, -62004, -8859, -2508, 38540, 26606, -6429, 10993, 34797]
17242C4797J9965o2260j08649k3741L0469K1914J8127M4180N177m8951l2736N8729
17230d2979L8038m8643k4586m156q681L3305L9121L4005j3713n473M795N8972
17218F0005O3626l538n5118L89J9433J2592J6001p3542p8630j5642R506O1078
17206A6160K0145K2178K8577n443j2382m7083n2711j1291l6522J50j263K3635
17194e5850K3474K0343l8410j7878K8365R0776L705l4279M8638j3527n6781p5820
17182g7244K2777O6372j1824J5202M8785L9219R689p3327j7125K9852J0591j817
17170F1150k5310j1359m8697M7185J634l6995j1332j1564k9719L7470n0937p993
17158h6467N3380K209j1684j4157M040j7208K0672J5558N864q031O5136P6527
$$ y = [34797, 54762, -7498, -116147, -139888, -109419, -87505, -69378, -25198, -20021, -68972, -101708, -42979, -4941, -53584, -78170, -82326, -91007, -57702, -18581, 15424, 1711, -3762, 1033, 60005, 123631, 120093, 64975, 65364, 84797, 97389, 113390, 39848, -38782, -54424, -44918, 16160, 36305, 58483, 87060, 81617, 69235, 22152, -30559, -41850, -78372, -78222, -79485, -55850, -32376, -12033, -50443, -68321, -39956, 50820, 54525, 20246, 68884, 55357, -1424, -77244, -54467, 11905, 81, 15283, 64068, 103287, 112976, 39649, 22524, 52376, 62967, 61150, 35840, 24481, -24216, 22969, 24603, -12392, -23724, -35288, -65007, -27537, -78474, -86467, -33087, -30878, -42562, -56719, -52679, -69887, -49215, -33657, -27793, -35824, 29312, 105839]
17146A05839p578l627k6447k1557j27440n751L0676P2708K3150l6226J1451j632
17134A3566l3740n4142k3026k1331m5398K8083R1527N2265o554k1505k9986L846
17122d6395Q420J3200J0870q653j7941J1825L7615k060J5107L2049N2435l3261
17110G3211q7306p7304j9891L4629l9522J6337Q9356N6568l1697k5906K4705j3874
17098f94o101l321J0692o0298N877K7247K0514j6161J4829L8802p803j0429M113
17085A7267M3627K4189J3565J6433P102m3618l8187m6693n589j0300j1567n2401
17073h6172J799j3199Q9302J1519n0188K5068M1729j2466L6928J3371l2223k826
17061B2642l7200n9983J2520P4136N3439j1843q854j4270o4160k9851J1859j1620
$$ y = [105839, 98261, 94634, 68187, 46630, -80810, -86561, -55885, 16823, 39973, 3747, 15198, 13566, -20174, -74316, -97342, -118673, -164071, -135988, -44461, 7804, 1250, -20255, -50241, -46395, -37975, -24775, -13905, -22558, -40499, -28674, 8941, 6881, 21988, 54037, 106472, 73211, -14095, -91399, -111290, -76661, -116183, -99846, -10490, 46078, 14381, -11525, 13180, -694, -6795, -10116, 576, -59722, -53845, -26598, -6084, -22245, -7416, 31386, 23583, 13154, 17267, 60894, 85083, 98648, 115081, 122183, 78565, 40378, -6315, -11904, -22204, -33771, -86172, -84373, -97572, -8270, 3249, -46939, -21871, 19858, 7392, 44320, 57691, 25468, 22642, -14558, -74541, -62021, 12115, 65554, 53711, 44857, 30587, -33573, -63424, -51565, -63185]
17049f3185M5686l6068l5578N6389M0666l27M9252J1940k3110k4768J9804J1254
17037E1955j9482J7339J3610k7763q2215L831L1771k2977l4636k219L5545K8626
17025f615M18J8221M4252K2942O335l8129p995M928M788O982R580K6898k8060
17012F4545L256j5591j5992m8092m1437o127M386k1359K8885N8170n339p988j2481
16999a5164l810n8482j7634o3965j2393O9181J5221K9824K0553q031J8652L5207
16987I159k6573n479N2659M2406O6353r275j1436j2976j10882m9226N8289J5604
16975A8623k910J0934r472L6115J7003N8432j5160n7611j9114N3023l0814q3646
16963b4597k8756m7909J5172M7356j3099k8303J1394N4731O051K5620o2682o1324
$$ y = [-63185, -17499, -53567, -89145, -32756, 7910, 7583, 56835, 68775, 45665, 20897, 40701, 51955, 32473, 49812, 63422, 35659, -46556, -42725, -10954, -33931, -68567, -70786, -35241, -6615, -6197, 12024, 56276, 79218, 85553, 47424, 39429, 44357, 49145, 56127, 65707, 92605, 64545, 67801, 52210, 36218, -11874, -53311, -59438, -55052, -76411, -47526, 10644, 5305, -2683, -15164, -18974, -77456, -95090, -159055, -171448, -102267, -87046, -57222, -36669, -44700, -26048, 9159, -17414, -22893, 29766, 72172, 138525, 129250, 117814, 104838, -6044, -55270, 3019, 18623, 15713, 26647, 17175, 53290, 70293, 128725, 113565, 55954, 36840, 89863, 59049, -24597, -53353, -101262, -86090, -38734, -51833, -80136, -68742, -14011, -7960, 17660, -45022, -106346]
16951a06346J506K8183O4378M4769j864M046J0457o8081p3081O021N5773J2186
16939b2053O40K9098L7692K9295J0672l2042M4592N723J1774o7268q3136j2906
16927d7919n4939m869O6623K8933L2226M5083m2161o4379k663N793J4282K7184
16915C194k8364m4281M042K5492J9061J6840J739j1495K276M468P899l0753k647
16902c2529K653O8288O1757o3147o4851k5372L7105O1547j0514m6192J4922k3718
16890b0051m6616n0189p589Q1041L6063k375O216K1794J1955N2524N258p1008
16878A7023m5920k5022K8746M9448o262j7795j7013k73k4000K5404q873l1229
16866e5766J9062O5320L8304j3380m629j7637k9576p5366K6746K4221k0407L5473
$$ y = [-106346, -104840, -76657, -12279, 32490, 30626, 34672, 45129, -22952, -96033, -90012, -34239, -22053, -21413, 7685, 45377, 74672, 85344, 53302, 97894, 103617, 115391, 48123, -35013, -47919, -102858, -107727, -41104, -12171, 20055, 65138, 22977, -41402, -44065, -38272, -23990, 3194, -25170, -69451, -65409, -39917, -20856, -4016, -2277, -13772, -11496, -7028, 871, -29882, -32529, -29876, 38412, 100169, 37022, -27829, -53201, -16096, 45451, 34937, -11255, 3667, -20051, -66667, -116856, -124445, -43404, -7341, -9716, -3500, 18294, 30249, 82773, 88031, 17023, -28897, -53919, -25173, 24275, 18013, 218, -16795, -17068, -41068, -15664, -24537, -55766, -36704, 28616, 66920, 53540, 48911, 31274, 1698, -73668, -46922, -22701, -43108, -7635]
16854g635M0415k5137k2711K2808J0521N259j9272L1410j456J1148j0151j0446
16842B4753r654r025j3182M9418j534l9258j2994J4449N000l0198n0412J1842
16830f0795j5303J802J1041j2145N7597L4718k2502k6734k1110o561M8012l59
16818a2339m6595m3350P3198M4384j4484K6984k0145k7435j8082J021J7460K2074
16806B691M4858J6115k1580P708k726M4933N833J9274m8060K4179N1565o2254
16794H2536o7578j6334L3180K0462J1887k9807j5337n4195o1682K6979n128j4335
16782h9352Q6817j236q7417k8494O5941L5654N3916L4011j6552q2742n7881K6266
16770f1069M1277P628l6763J0657L7324l9180M8208j1207r6535m9702M8896J8803
$$ y = [-7635, 32780, 7643, -15068, 7740, 18261, 23520, 4248, 35658, 34202, 45350, 35199, 24753, 15099, 6074, -7108, 42310, 40776, 1518, -11476, 2973, 7973, -22225, -72637, -60795, -76098, -74296, -63255, -75400, -17803, 16915, -5587, -32321, -53431, -59992, -11980, -12339, -58934, -102284, -29086, 15298, 814, 27798, 7653, -19782, -37864, -36843, -19383, 2691, 47549, 63664, 42084, 49792, 47066, 91999, 97832, 117106, 69046, 93225, 144790, 82536, 14958, -1376, 31804, 52266, 64153, 34346, 19009, -35186, -96868, -69889, -75017, -89352, -2535, -3771, -91188, -119682, -53741, -18087, 35829, 69840, 53288, -29454, -87335, -61069, -19792, -12164, -48927, -38270, -946, -40126, 8082, -3125, -99660, -149362, -100466, -81663]
16758h1663J271R909Q459k3023Q004Q2947k7577p1740n6568J6812O0525J1153
16746f1491r277N126O1022L7307q379J4169P417l5299p2409L4211P1140k0658
16734B2879j1672k2371n0603m972K0526L0013l0256k8670J1701l7724M8975N9725
16722G551J8157j3843l6478J2780K4687R339M463j4216j1718j2086q646L3359
16710A3349k8867J8900o046k4512M9575L6629j7449o0555N630k6130l7871O2126
16698a5221L3197j1390j832n1081M4095K3270j3781l3458L6388J6250o364L239
16686B3312n480j8141n1457n5727J3353K4620K6646N3600M1176m5896m088J7754
16674A9672l842K0043K5665J0864M1259J6381k4617n9293M724J3051m1931n7945
$$ y = [-81663, -80392, -70483, -62024, -85047, -77043, 5904, -21673, -93413, -149981, -133169, -72644, -61491, -70768, -65642, -4620, 32687, 24308, 38477, 45894, 10595, -61814, -27603, 43537, 22879, 11207, -11164, -61767, -66739, -46213, -16200, -46456, -75126, -63425, -101149, -52174, 7551, 25708, 11865, -24613, -11833, 12854, 22193, 26656, 12440, 722, -11364, -20010, 13349, -15518, 3382, -2664, -27176, 22399, 59028, 41579, -18976, -13346, -39476, -77347, -15221, 17976, 6586, 4754, -46327, -2232, 21038, 7257, -26201, 10187, 26437, 20073, 23312, 17832, -309, -51766, -107493, -94140, -69520, -42874, 10726, 51902, 6006, 1918, 19672, 15830, 35873, 61538, 72402, 113661, 130042, 105425, 46132, 50856, 63907, 21976, -35969]
16662c5969K1088j8539k7551K1392R445J287N8068L7670p3296o1467R099K7605
16650c1168J5538J1813p0967p08N3456O8617J6742j2951L5128k0782m4268j8173
16638B277n3389M1697M8735k5310j5175p3185N726J7426m5528n0780K0356L8180
16626h8970J0594K2866r201K0306o655J5298K2198K0631k9283J1902M2499J9096
16614E1281K004k7452o2221m1848j517J5787j1491J2166j417j9115N8375O8976
16602D3528J1452l4028j5202K583m7415m3567J5789L7426N140R122L5954J0169
16590C0951j8881K1675o566L933j8487j9071M533K0864K5119k1118j5280k8634
16578b0962j1883j1546l2971K5365j7568M2957M5193j0776O4804l3336l4285J0648
$$ y = [-35969, -14881, -33420, -60971, -39579, -30134, -28847, 29221, 66891, -6405, -67872, -58773, -31168, -15630, -3817, -74784, -75492, -22036, 46581, 63323, 50372, 85500, 64718, 20450, 2277, -51112, -9415, 39320, 14010, -1165, -74350, -68624, -51198, -96726, -147506, -127150, -88970, -78376, -55510, -64711, -44405, -51060, -35762, -13564, 7067, -22216, -10314, 32185, 51281, 53285, 25833, -36388, -78236, -79753, -63966, -75457, -63291, -64708, -83823, -25448, 43528, 54980, 20952, 5750, 8333, -39082, -82649, -66860, -29434, -24294, -15172, 20782, 30951, 12070, 33745, 27179, 31112, 12625, -6446, -1913, 18951, 44070, 22952, 7672, -20962, -32845, -44391, -77362, -51997, -69565, -26608, 18585, 7809, 72613, 39277, 4992, 15640]
16566A5640n1237M0813K0434j0688K1668P0606j9607l6758L4205J5482J3383L3211
16554A47152n1443k2287J700N0012J1556n2682j00395o6433j5604J4796L0254
16543e3374N1425M3083q197j0535O7931j549r865m0130j0218j312j3898n32J2322
16530B5151j9765M5030N4290k3207l6040n5253O035k8395l1938J8304j4573K3777
16518c6584Q3450K8359m5743l9767J3789N3156O3220j5326m0125K8647j9597m2771
16506C0708M1682N3258j3609l5450j4920K0538j4784k7298J1659l2474k6167l5671
16494d2528K3985L8320j571j2528J271K6015M840q337k5633J1823Q575l1959J5614
16481G887j0956K163j7615J2956P0050N484L6864m3268J7432K5867m1441k8021
$$ y = [15640, -35597, 5216, 25650, 14962, 36630, 107236, 87629, 50871, 85076, 100558, 113941, 147152, 95709, 73422, 75122, 125134, 136690, 84008, -16387, -82820, -98424, -83628, -53374, -1949, 41134, 32937, 22402, 90333, 88784, 78919, 38789, 28571, 27259, 13361, 12829, 25151, 5386, 50416, 104706, 81499, 45459, -9794, -3759, -32154, -64092, -45788, -60361, -36584, 46866, 75225, 29482, -10285, 3504, 56660, 119880, 104554, 64429, 93076, 73479, 30708, 72390, 125648, 112039, 76589, 61669, 82207, 67423, 40125, 51784, 19310, -6857, -42528, -18543, 19777, 18206, 5678, 6949, 32964, 37804, 29467, 3834, 15657, 24232, -7727, 7887, -3069, -906, -18521, -5565, 64485, 69969, 106833, 63565, 80997, 106864, 65423, 37402]
16469C7402L5746k8353k6725J3402K3795p648k6955m0442r905J312R410j1720
16457c0681k0462j4847q1807J0183O8722P4059j6858j5878K2278j0023j5527q556
16445c9397k5335K0972J0632p139q656j2097M633J9771P2145P0864j9097L5112
16433A22408p8409J5044Q6371j1830p0742p1464l2842K1962o418K705k5691j1286
16421f0192J2017M7278J0382Q417j0754k624l4847j05905N943K7796M0433n827
16409f7883l703k4316L4917K1261L9571m6058J0670n1709m2807L4661P5135L4337
16397A4076k9714j1057m6545P990N6933j1103l8006K9267K9036J3974j6528j4318
16385a5995r4671n8204L2757Q7546L3870j1882n0527J04792J5605p1729l2345
$$ y = [37402, 73148, 44795, 18070, 31472, 55267, 47619, 20664, -19778, -29683, -28371, -18961, -30681, -51143, -65990, -147797, -137614, -68892, 5167, -11691, -27569, -5291, -15314, -30841, -39397, -64732, -43760, -33128, -40267, -48923, -61020, -56387, -36616, 35529, 106393, 87296, 122408, 43999, 59043, 145414, 133584, 62842, -8622, -41464, -19502, -25920, -23215, -48906, -60192, -48175, -897, 9485, 17902, 7148, 4524, -30323, -136228, -130285, -102489, -62056, -67883, -71586, -95902, -60985, -39724, -153, -46211, -35541, -87250, -130057, -95396, -20261, 14076, -15638, -26695, -73240, -65250, -8317, -19420, -57426, -28159, 877, 14851, -1677, -15995, -110666, -168870, -136113, -48567, -14697, -26579, -77106, 27686, 43291, -28438, -60783]
16374f0783k6706l0834J6630n523P202O4053O239k6336k612N9014N9397n0816
16362H925l6365J6242R827K6956l8541j4146j8219o818L2695M0645k0636L9319
16350C9884L4772r2955n2901M9661K4444M0012j8136k4434K9035O86m4988m2194
16338e7114L5098P689K0849N1592p4671o2389L3152J5407j0395N466k7512k5657
16326h8485K3434n223J3402K5573l1236k0785K5598J41J969o864k0562P2027m0972
16313e1983o4093K3273N0227Q356Q2673K2149n0779r5770o1955N8917P1517j8915
16301b6383K5026k1859l7746m1191k4436M4443M5699K3807o0726k0220M3763j85
16289e0008p587n37L1683L0440M1034m7205o0229l1754k138k2812M865J4005K2291
$$ y = [-60783, -87489, -118323, -101693, -107216, -100014, -35961, -29722, -56058, -58670, 344, 59741, 8925, -27440, -11198, -1371, 25585, -12956, -27102, -45321, -52139, -19444, 21201, 565, 39884, 74656, -18299, -71200, -21539, 2905, 42917, 24781, 347, 29382, 30068, -14920, -57114, -22016, -14327, 6522, 58114, -16557, -78946, -45794, -30387, -40782, -35316, -62828, -88485, -65051, -70274, -56872, -31299, -62535, -83320, -57722, -57581, -55612, -62476, -83038, -11011, -51983, -116076, -92803, -42576, -34220, 48453, 70602, 19823, -75947, -137902, -78985, -7468, -26383, -1357, -23216, -60962, -102153, -126589, -82146, -36447, -12640, -73366, -93586, -49823, -50008, -57595, -58132, -26449, 3991, 45025, -2180, -62409, -94163, -96301, -119113, -114248, -100243, -77952]
16276g7952L5127J638Q5160p459p2778j4977k787L2624L7637m6205l2916m5388
16264a08276k1132J9905O0202N7680O278k913N3626J9779j5749m6952l321L3519
16252E2646K5058j6697m6060j2892k8460m259O1123j1735j06982j0007M4439p053
16240f0879j8517J5896p689j5745l1159L7572P3294q790n7745K4838K8450K7118
16228F644j0568P999L3790j6515k4272j4394m6495n1672r514L6636K0206r105
16216g7260j22r53J4528k2741l7935J185K4375M7312Q3563k343k6168q544L7570
16203C2467L1683o937l5099l7210n8658R9102J2589P900p5974k2910L3232O1926
16191D2111O7262j3117l5757l7548k3929J3246K415j9991j919j1759J1098K9831
$$ y = [-77952, -42825, -41187, 43973, 36514, -36264, -51241, -54028, -21404, 16233, -29972, -62888, -108276, -129408, -109503, -49301, 8379, 14657, 11744, 65370, 85149, 69400, 22448, 19127, 52646, 77704, 61007, 14947, 2055, -26405, -30664, 30459, 18724, -88258, -98265, -53826, -60879, -79396, -63500, -71189, -86934, -118093, -80521, -7227, -16017, -73762, -48924, -20474, 6644, -3924, 4075, 37865, 21350, -2922, -17316, -63811, -115483, -124997, -88361, -68155, -77260, -77382, -78335, -63807, -86548, -124483, -123298, -98923, -51611, 31952, 29609, 3441, -5103, 32467, 64150, 57213, 22114, -15096, -73754, 25348, 37937, 45837, -30137, -53047, -19815, 42111, 109373, 96256, 60499, 22951, -978, 12268, 14683, -5308, -7227, -18986, -7888, 21943]
16179B1943K0608l6711K2763r694m8704j7922n0117N308J07588J684j334K4588
16167D0000k1622j4065o947P414Q252l5154J9505P510p5742j9567Q622M2320k671
16154d2145p073k2688l7996P590N5411Q400r105Q9068N0523L1383o5535n3257
16142D576n082o0188m0346M8774M1603J3919K3592k0792l0194L6612q064J5268
16130A9678m4389q6339k0183L7863J11706L3737j7093K3057l0958K1K9260M2860
16118I9220j7422k2805o1335k4023L4304Q0106o4891n4951j5421P3749j4591k6729
16106a4789L1292L7538l2576j7599O287Q0677k9479j09853l9031m123R854O5021
16094a6781P4420j8489j14237J9474L6307K6758J981l5335m8224N972M5762l5947
$$ y = [21943, 42551, 5840, 28603, 18909, -29795, -47717, -97834, -92526, 15062, 16746, 15412, 40000, 18378, 4313, -2634, 4780, 13032, -22122, -2617, 4893, -70849, -90416, -81794, -39474, -42145, -49218, -71906, -109902, -102312, -46901, -38501, -47606, 41462, 91985, 123368, 57833, 4576, -506, -60694, -101040, -52266, -10663, 3256, 26848, 6056, -24138, 12474, 4410, 19678, -24711, -111050, -131233, -93370, 18336, 52073, 34980, 58037, 27079, 27100, 56360, 99220, 81798, 58993, -2342, -26365, 7939, 88045, 23154, -31797, -47218, 26531, 11940, -14789, 16503, 54041, 21465, 3866, 10153, 90830, 61351, -48502, -87533, -91656, -81802, -16781, 57639, 39150, -75087, -55613, -19306, 7452, 9433, -25902, -74126, -68154, -22392, -58339]
16082e8339L2345L1254k5519m8404K3750N366K2466l333M060K4326k4537L2898
16070A6333Q868K5313P697k3072L0113l936k6608m2085L3062L9919L4543k7026
16058G3121m3108k0246j1939j7959K329L6737O6771l8038q669K8210j0759O2380
16046A18830K9782k5881j0766l0483l969K6051J7796l8875o6499k0074L124R727
16034H763M6765L1694K944k0013l4732j1699j053p2667l3645N9814k2007l8003
16022h3839L330R0460M5640k6402N9434N5982p2898q3244L0239n230J3320J6597
16010D3389m6465k2129K3803k0699J5561k7773m5705P2911O6215j0280l6907o4426
15998e2505l999J8148P088l1927N1471M7607K802r145N157J1223j4271l7414j9581
$$ y = [-58339, -25994, 5260, -20259, -68663, -44913, -39547, -17081, -20414, -16354, 7972, -16565, 16333, 25201, 50514, 58211, 35139, 65252, 61316, 34708, -7377, 25685, 65604, 100147, 73121, 30013, 9767, -2172, -20131, -17802, 18935, 85706, 47668, 38999, 67209, 56450, 118830, 148612, 122731, 111965, 81482, 77513, 103564, 121360, 82485, 15986, -4088, -964, 8763, 55528, 87222, 90166, 70153, 35421, 23722, 22669, -49998, -83643, -23829, -45836, -83839, -80509, 9951, 55591, 29189, 88623, 144605, 71707, -11537, 18702, 13472, 26792, 43389, -3076, -25205, -1402, -22101, -6540, -34313, -80018, -7107, 59108, 48828, 11921, -52505, -56504, -38356, -31268, -63195, -11724, 35883, 38685, 29540, 34697, 45920, 31649, -5765, -25346]
15985b5346l4254O5534L9818k8193p7264K5410j6051n9355j7217L9259N7400l562
15973c3821j7432L1097P23O4214j9009j4528j0559n5248J1004L3135K1130r029
15961A677J3328O1489J7251J2087o5516m1543M3127k3399r681n100L6352J67l2802
15948G437p6896k2639L5349K6058lK1096j3200K0193L0636k7351m0305P2400k1388
15935A1387p6535l2997J1338K8053Q3196J17881l0209k9135j7720q1039k8976
15924d4756J7222K6718J2208R4597P978J3112n4720q0427P423P710K0012K2164
15912D9241K1021L0238J1587l0761l3849J8243o6189n8782L8088K6341K086J0977
15900A8241M822r851J433J3709j4933L924J4327j0905j5969k9620l1932K2469
$$ y = [-25346, -59600, 5934, 45752, 17559, -59705, -34295, -50346, -109701, -126918, -87659, -30259, -33821, -51253, -20156, -19433, 44781, 25772, 11244, 685, -54563, -43559, -10424, 10706, 1677, 15005, 76494, 93745, 105832, 40316, -1227, 41900, 18501, 8820, 3720, 40072, 40239, 7437, -69459, -92098, -56749, -30691, -30694, -9598, -22798, -2605, 28031, 680, -39625, 32775, 11387, -65148, -98145, -86807, -58754, 24442, 142323, 112114, 82979, 65259, -15780, -44756, -27534, -816, 11392, 105989, 113967, 127079, 72359, -8068, -645, 7065, 27077, 49241, 70262, 100500, 112087, 81326, 47477, 65720, -469, -59251, -21163, 5178, 7264, 18241, 23063, 13212, 14645, 28354, 13421, 17345, 31672, 20767, 4798, -24822, -56754, -34285]
15888c4285M2660k164k1102R496k2170K1463J8263j0895k7959M2257m850l1205
15876b0491L3306P43j9577P2444m3334m2697j7745O7759j723l8903M1459p324
15864B3917n2109O8681K0515j0628m2849k583o585R643O6192L8665j9085L57n1212
15851D2919k7080L0064j55o6581l3534J0983m77K055N2000n3345j7293L7292O7442
15838D4290L7052j2793m7107l0062J1073K7652J5932o3823n49P8313K7841o1450
15826B6369k1951m3635j1627m078q357P4317O0903j6550O633m9347j438m809O7384
15813G3814J7321l6665l2027k9971L0745L0025L5428k2585m1313k5699J1027L6152
15801D6252K8513L0164l7554n5605j4075P9291N6557L2958l937k391o2876j364
$$ y = [-34285, 8375, 6211, -14891, -5395, -27565, -6102, 12161, 1266, -26693, 15564, 10714, -20491, 12815, 13558, -6019, 66425, 23091, -19606, -37351, 30408, 28685, -10218, 31241, 23917, -28192, 40489, 61004, 50376, 7527, 4944, -1641, 8002, 74194, 112859, 93774, 94131, 42919, 15839, 45903, 45748, -20833, -54367, -43384, -43861, -41806, 10194, -43151, -60444, -23152, 44290, 81342, 68549, 21442, -8620, 2453, 30105, 46037, -17786, -18335, 59978, 87819, 26369, 4418, -39217, -50844, -54922, -63279, 11038, 71941, 55391, 62024, 12677, 11239, 6430, 73814, 91135, 54470, 22443, -7528, 23217, 53242, 88670, 66085, 24772, -927, 10100, 46252, 74765, 104929, 67375, 11770, -2305, 76986, 133543, 166501, 162564, 160173, 97297, 95933]
15789I5933N1259l7790m6713p5393k1258l2131L8017K8201Q4554L059o6206j5892
15777E640j2859j1006J154L459M0342j86K5907K5226l5195n5837l5174l7846L0221
15764e6154L519j679M5166K0386j6509n5044K0653K8514N3342K3807r184l608
15752E3209j4632n1957M0019Q4244j7266l0384K2987k3739j9703q423K1048o0948
15740e545m368k111O12J8223J6726k2576l0297N9698K1662l6824R585k3874m7603
15727d6692o5349L365M1761O0403P1644M2630l4897p0052J6735j071n3548n993
15715d1064O2310K5024J0435P4625J1016n7398r53p3091K5142P985P168j4926
15703C6273j9710L765k0857j1564j3178n6313l6431n98O0556N2618Q5922K3874
$$ y = [95933, 147192, 109402, 62689, -12704, -33962, -66093, -28076, 125, 84679, 87738, 21532, 5640, -7219, -18225, -17071, -13612, 26730, 26544, 52451, 77677, 42482, -13355, -48529, -86375, -56154, -52635, -54314, -9148, 11238, -5271, -60315, -39662, -11148, 42194, 66001, 56817, 53209, 38577, -13380, 26639, 110883, 93617, 63233, 86220, 62481, 42778, 34355, 55403, -5545, -9913, -12024, -11412, 6811, 23537, 961, -29336, 30362, 52024, 15200, 24785, 911, -46692, -112041, -108676, -66915, -6512, 65132, 107762, 72865, 2813, 19548, 18477, -35071, -41064, 21246, 46270, 56705, 131330, 142346, 84948, 83995, 10904, 36046, 44031, 51199, 36273, 16563, 20328, -529, -12093, -25271, -81584, -118015, -118613, -58057, -5439, 80483, 104357]
15691A04357k7468j3550L5054M2045O1015k6426j1625k4792l8987q5088r700N6971
15679F1806J4841L4848k142n9419j7789M8999j107J71l3992K3743L5708j7638
15667H8029m3735m6040J2810j5963l0389Q5504o694J3136J6360N012l8136N990
15655D5884l3434q2135K7605M9090L2847K5512K7581J0818p486J2953k8937M037
15643H4335k0489q932L5466p919p646m9749M4694L753m7034k1663J5204Q559M4009
15630G2588j2951q1064o2436Q0895l3455m2194l45O7078N9036K4420l7499j3436
15618B0637k1494N87N6375j6213k9029J0110M4240l0482l4079j7459m2362N3582
15606e587K4912m9770m950O5677M8879p458o7634q5539n5060J140M7129J148k0040
$$ y = [104357, 76889, 63339, 98393, 140438, 201453, 175027, 163402, 138610, 99623, 14535, 4835, 61806, 76647, 111495, 109353, 49934, 32145, 81144, 80037, 80208, 46216, 69959, 105667, 88029, 44294, -1746, 11064, -4899, -35288, 50216, 43522, 56658, 73018, 78030, 39894, 45884, 12450, -69685, -42080, 7010, 39857, 65369, 92950, 103768, 96282, 109235, 80298, 84335, 63846, 54914, 90380, 82461, 74815, 25066, 69760, 73513, 26479, 4816, 20020, 28579, 72588, 59637, -21427, -83863, -2968, -36423, -78617, -78962, -11884, 47152, 71572, 34073, 20637, -857, -270, 56105, 39892, 10863, 20973, 65213, 34731, 652, -16807, -59169, -5587, 19325, -30445, -35395, 30282, 79161, 71703, 4069, -81470, -136530, -135390, -88261, -87113, -107153]
15593a07153J9566Q9382J9090l720j4513p3200m1062n594q807J5119M6167N6248
15581h477K7562n6J2879k408p410J6317M0773o7967l6043K1906K937p2703N700
15568f6990N4118j395l7393k3539M3016M7637m0805M7626J1368m9803l0849l9990
15556h6999Q8156Q0209o637j5735l1576M6471j3252k0332J2667N1502J3223l0263
15544H7434k7278m599j9235K6555k450n1844n5396J0907N3805Q6917l750q9822
15532A1244K2276J8886M0138M4849M7029q4038n7711k1556J2651J1549N137K3366
15520G3820j0701k3598k3170k0746J540L2865n9702p825M3615L6966K22l082j6888
15507B3316l5141j1518P7842M3620l7045n7128j0910J9818M7768k6686l5078K5880
$$ y = [-107153, -87587, 1795, 20885, 17165, 2652, -70548, -111610, -117204, -126011, -110892, -64725, -8477, 19085, 19029, 31908, 29500, 22090, 38407, 79180, 11213, -24830, -2924, 13, -72690, -66990, -12872, -14267, -51660, -75199, -32183, 15454, -25351, 22275, 33643, -16160, -47009, -86999, 1157, 81366, 74729, 58994, 27418, 73889, 60637, 40305, 52972, 104474, 117697, 87434, 60156, 55557, 36322, 62877, 60427, 8583, -46813, -35906, 17899, 104816, 101066, 11244, 33520, 52406, 92544, 137393, 184422, 100384, 42673, 21117, 33768, 45317, 50454, 73820, 63119, 39521, 16351, -4395, -2855, 30010, -29692, -37517, 6098, 43064, 43286, 40204, 23316, -11825, -23343, 54499, 98119, 61074, 3946, -6964, 12854, 60622, 33936, -1142, 24738]
15495B4738O2136k5052k5932k3878J214J086M8778J2072J7513n6024K4832N8108
15483A19591l9267p0638m724J8652j5026k6161N095N242L653J6649m1575j4956
15471d3465M8893N1008M829J5123j2513J96J41K3485J5368j4311k0344j7620m5741
15458E049M337K0624K2402k5706j25497j3189O2425L3271O6086j6860o0098M7019
15446A9863p633L1781j0279m7477M7523N5986p2136m8527k4234j0592K3329M9316
15434F920k1201K9753K2386o6841o5955N633K2880Q410n6518K9489L8545k5501
15422g2000n2557j0269L7347O0678M9816Q809m0278k2023K6573J7879j6795n529
15410a8349R119j8964J0198K3053L5064K5874k0100j390L1175O402P946o0756
$$ y = [24738, 86874, 61822, 35890, 12012, 13226, 14312, 63090, 75162, 92675, 36651, 61483, 119591, 80324, 9686, 4962, 23614, 8588, -17573, -12478, -7236, -3583, 13066, -28509, -43465, 5428, 56436, 61265, 76388, 63875, 64071, 64212, 87697, 103065, 88754, 68410, 50790, 5049, 9386, 30010, 52412, 26706, -98791, -111980, -49555, -16284, 49802, 32942, -27156, 19863, 12230, 44011, 33732, -13745, 33778, 89764, 17628, -30899, -55133, -65725, -42396, 6920, -14281, 15472, 37858, -28983, -94938, -89305, -66425, -58015, -114533, -85044, -46499, -72000, -124557, -134826, -97479, -36801, 13015, 21824, -18454, -40477, -13904, 3975, -12820, -18349, -9230, -28194, -17996, 5057, 40121, 65995, 45895, 44505, 75680, 82082, 90028, 29272]
15398B9272o2054r499J4708L0173O3705q887m1330n713m1855q128O3368m6276
15386b2516q9695P055O3097L1299J5170J2528J1053j146k7610L3295M0565N475
15374G8570o7995l6422J5512j9557M1355q140J5694k7818m8000P4262O075J2460
15362C5996L2501M034K0205N0570j190m7269j3368N988j5381J6366m1316n2755
15350e619K845n5461m32M0118J5159l5284J3841N6459J8015o995q7L3555k0375
15337E5739k8640L562k7577L2291J6465J2073q8641m323L9550n3811J0434J8435
15325a4443Q676K1253k791j9188M8625k6885q196O879K7198L75O757K3501K544
15312G4305k6740j0587J184M9773k3449K2227J1089K9833o243n1446l0075K3411
$$ y = [29272, -32782, -42281, -27573, 2600, 66305, 57418, 16088, 10375, -31480, -39608, 23760, -22516, -112211, -105156, -42059, -10760, 4410, 16938, 27991, 26845, -765, 32530, 73095, 78570, 10575, -25847, -10335, -29892, 11463, 3323, 19017, -8801, -56801, 17461, 23536, 35996, 68497, 72531, 92736, 143306, 142116, 94847, 81479, 87467, 72086, 88452, 47136, -5619, -2774, -58235, -58667, -18549, -3390, -38674, -24833, 31626, 49641, 42646, 42559, 76114, 55739, 27099, 30661, 3084, 35375, 51840, 63913, -24728, -29051, 10499, -43312, -32878, -14443, -5767, 15486, 12695, -6493, 42132, 15247, 7051, 13930, 41128, 41503, 48260, 71761, 74305, 47565, 36978, 38162, 87935, 64486, 86713, 97802, 127635, 121392, 69946, 39871, 63282]
15300F3282M5838l4839L8887P4916K0k7439p8255q1236l3499N2482L0932o6556
15288a5467n105J17142k616m1833q596k0977r4190n5056K0331M5241L9308P722
15276a4096j0116j2470l819M1355Q8051K1165o1011j9541j2708J3800K589k8188
15264E011l4262L5195n110J6175N8539J2186J9734K2528l3788R39l0018j4978
15252E2151m08j03430j21966J7329J09276Q0213O8818l1176o0264q239O914J7748
15240B6966k652J6079L9865o5470j5571k3163r229l9059L0447N8597k884p715
15228F211N5627L3737J7017o0773n7950R784J9268R3415J9592p1896p2072q0133
15216h8173K9662L3415O7327M148J4044N948m0673r915K5729j6974j1826M702
$$ y = [63282, 109120, 74281, 113168, 188084, 188104, 160665, 82410, 1174, -32325, 20157, 51089, -15467, -20572, 96570, 93954, 52121, 43525, 22548, -71642, -126698, -106367, -61126, -21818, -14096, -24212, -36682, -40501, 854, 88905, 110070, 49059, 29518, 16810, 30610, 33199, 5011, -29251, 5944, 834, 17009, 75548, 87734, 107468, 129996, 96208, 97147, 67129, 52151, 51743, -51687, -173653, -156324, -47048, 33165, 101983, 70807, 10543, 2304, 9218, 26966, 24314, 40393, 80258, 14788, -783, -23946, -33175, -72234, -41787, 16810, 13926, 6211, 61838, 95575, 112592, 51819, -6131, 3653, 22921, 116336, 135928, 64032, -8040, -88173, -58511, -25096, 42231, 46379, 60423, 66371, 25698, 15783, 41512, 24538, 12712, 17414]
15204A7414L5198m8534k5801j4122j4881J3160j0409L9067M8799m3366J4600R50
15192A2075J113M315L7658l4003j4834K2052M1693n5635k0379j8385J1987j5162
15180b7505M3880J3909L296N902m6512K9811J2051Q4k571k9938l7929R989m0865
15167f6398K4913k9229k0551K4102q65M8534j7844k9633j6883L805N854K9143
15155d5052Q020P34J0485K1844L9268K7774o3185L5955N6644j8002m0091j3541
15143B0853K7964n5169j6385O194k255P8575j3075p1216j4799o3102l4285L1965
15131a04735J5317J9499k2877m806J6242P4200J726Q166k9969L5181m5164m0591
15119g7811O1792N2555l5332J3108p914K174q56L8470L4126L4563L8154k6115
$$ y = [17414, 52612, 4078, -21723, -35845, -50726, -37566, -47975, -8908, 39891, -3475, 11125, 12075, 13188, 17503, 55161, 21158, 6324, 28376, 70069, 14434, -5945, -24330, -12343, -27505, 16375, 30284, 33580, 39482, -7030, 22781, 34832, 34916, 32345, 2407, -35522, -25533, -66398, -41485, -70714, -91265, -67163, -68028, -19494, -37338, -66971, -83854, -80049, -74195, -45052, -37032, -36298, -25813, -3969, 35299, 63073, -112, 35843, 92487, 74485, 34394, 20853, 48817, -6352, -22737, -16543, -18798, 59777, 46702, -24514, -39313, -102415, -136700, -104735, -89418, -69919, -92796, -97602, -81360, -7160, -5434, 2732, -27237, 7944, -37220, -77811, -16019, 36536, 1204, 14312, 6398, 8572, 7716, 46186, 80312, 114875, 153029, 126914]
15107A26914q3656L467K662J0685o3285m074J08631K2337m0957n2029j5000l6305
15095b0610j1510N6450k265J5775L5761n5308p1125P9078K0999J1813O368k5890
15083C9536j262l2353j8153k1782p8763k5892o140L5509P4333O2479L7106k4965
15071C9653m087L5213j8676J7396j9047L646K3571j3678n4357J2839J4803l4398
15059B878j6287M1515K6126l0892k1743k8708j1847p543q168N8379O6225N5870
15047A25805R59q9864O21j8152K8477o72J5035J40o376q699M959l5555j316m9339
15033c3977k2055L3474L7692r787L912K4191j9050k2515l200k4694j3515j406
15021e0930Q979j1670R649L1137j9553O1981M591k9774K554P31j1272M994K0563
$$ y = [126914, 43258, 46725, 49387, 60072, -3213, -7287, 101344, 123681, 82724, 30695, 15695, -20610, -32120, 24330, 22065, 37840, 73601, 18293, -52832, 26246, 47245, 59058, 65426, 39536, 38274, 5921, -12232, -34014, -112777, -138669, -144809, -109300, -34967, 27512, 64618, 39653, 35566, 70779, 52103, 69499, 50452, 54098, 77669, 63991, 9634, 22473, 37276, 2878, -13409, 28106, 54232, 23340, 1597, -27111, -38958, -46501, -54669, 3710, 69935, 125805, 126764, 36900, 37521, 19369, 47846, 47174, 62209, 62349, 55973, 47274, 52233, 16678, 15362, -33977, -56032, -22558, 15134, 5347, 9259, 33450, 14400, -8115, -11315, -36009, -49524, -50930, -41951, -53621, -43972, -12835, -32388, 29593, 34184, 4410, 6964, 7695, -3577, 1417, 21980]
15008B1980L8842j0684l8309k8755N7931L6082q596J0322n9055o51r010K0513
14996C0610m167N4362k2082n0898N488M370j73K0593q767K9343m1117K7117k6688
14983A7991K468O1030M0365R742m5880o2459n452p433J860k5435j0153K6498q321
14970e179j2917L5242J3548j2825l2693L8627l9994J9053K7236m0731l3225M4162
14958C04j9749k4810j9705M9137O9650M816j3454M2850L9934o888n6393l2291
14946C3401k5191J3211N1257k3590m4519K6456O9494k6291q640m4903J3037M9739
14934H3461m34p993L5728m080j4743q324Q05l3855J4836P8207O14p7134m0515
14921B6573j4378L0255k389q382l3809m4965J1714L4033O006L7313l335N7862
$$ y = [21980, 60822, 50138, 11829, -16926, 41005, 77087, 68491, 78813, 19758, 19107, 10097, 30610, 26443, 80805, 58723, 7825, 13313, 17683, 17510, 38103, 29336, 58679, 17562, 44679, 17991, 20459, 81489, 121854, 131596, 85716, 23257, 17805, 10372, 12232, -13203, -23356, 3142, -5179, -18096, 17146, 30694, 17869, -14824, 23803, -16191, 2862, 30098, -10633, -43858, 304, -19445, -44255, -63960, -14823, 54827, 59643, 46189, 89039, 128973, 122085, 65692, 33401, 8210, 21421, 72678, 49088, 4569, 31025, 100519, 74228, 65588, 20685, 33722, 83461, 83027, 75034, 110762, 106682, 91939, 83615, 84420, 50565, 65401, 143608, 144222, 67088, 26573, 12195, 42450, 40061, 31679, -2130, -47095, -35381, -1348, 4658, 41971, 38636, 96498]
14909I6498j2022m5354k1128J4204J1715p779L4427K9083l2931j275k9958n4940
14897a9460j7520J2854K4178k5395m3497L8251r109m114P7133j8158j107J197
14885A5253o9131J7247N3772j295N578O0539K0633K4550j9703k5400M571k7859
14873E8755m6866L1686k1544r166M1709K8738n3284k6239n503k022M298j2880
14861a2318l9951J577K0071m3549l6420R3739O5923K5984k5831k7393J1034r631
14849B3235j2029r617p744j1758L2499Q673k044l0071o8103n2446L4769M1348
14837e3288M3352j578k774O3571k4005j0688R518k9298q369n8460n8386j0247
14825a40652j2484O6368Q6243j4032K6718K187n3039M1901N9802o3841j27406
$$ y = [96498, 84476, 39122, 17994, 32198, 43913, 36134, 70561, 99644, 66713, 65438, 35480, -19460, -36980, -24126, 52, -25343, -68840, -30589, -39698, -43812, 33321, 15163, 14056, 15253, -53878, -36631, 17141, 15846, 21424, 81963, 102596, 127146, 107443, 82043, 86614, 58755, 11889, 43575, 22031, 12865, 54574, 83312, 30028, 3789, -1714, -3736, 562, -12318, -52269, -50692, -30621, -74170, -110590, -16851, 49072, 75056, 49225, 21832, 32866, 23235, 11206, 1589, -6155, -17913, 14586, 23259, 21215, -8856, -76959, -129405, -94636, -53288, -9936, -11514, -14288, 49283, 25278, 14590, 24108, -5190, -13559, -72019, -130405, -140652, -153136, -86768, -525, -14557, 12161, 14348, -38691, 3210, 63012, -829, -128235]
14814a28235L6971N8812n7277k140K8725l7554j8645L6079N8610K367J5986M5199
14802C8898j7202k0714J0817O9236L9089m1503k435l8524n0012p2233j7763M5986
14790e6360J0528O66K9488K1721j9569L0673J5682k8725L5200k3471j5057J4619
14778A5395L5173K4060r5085q8977K2405L4961M6915O1281J0022L0634j516m4930
14766E0338j3059M1699j915k3624k4408M3113j0081o8087k8335k7198M7896M2053
14754B8392n04L8238L3752k6022J275l1275k0248j6283K741J7701L1981n0458
14742I290j3990k3191p1599j7089L2333O5679M4716n683o737K2759j9366p9371
14730f2249K4490P5720L5371Q39K3312j1569l8634J4693J2144m5325p4548k4369
$$ y = [-128235, -91264, -32452, -89729, -91869, -63144, -100698, -119343, -83264, -24654, -22287, -6301, 38898, 21696, 982, 11799, 81035, 120124, 78621, 76186, 37662, -12350, -84583, -102346, -56360, -45832, -45166, -15678, 6043, -13526, 17147, 32829, 4104, 39304, 15833, 776, 15395, 50568, 74628, -20457, -109434, -87029, -52068, -5153, 56128, 66150, 96784, 95268, 50338, 37279, 78978, 77063, 53439, 29031, 72144, 62063, -6024, -34359, -61557, -13661, 28392, 27888, 66126, 99878, 73856, 75131, 43856, 23608, 7325, 10066, 27767, 59748, 9290, -4700, -27891, -99490, -116579, -84246, -18567, 26149, 20466, 13729, 36488, 17122, -62249, -37759, 37961, 73332, 74171, 97483, 85914, 47280, 61973, 74117, 28792, -45756, -70125]
14718g0125L1154P409R400N4919j7349k0922K1054k2242m4567Q193J6381K5296
14706a399M536K67l899l837J3126k265m5889j6754J5221j0656L1081K2570m739
14693b637k0839m1099m2532N622r246O1328j0711N316L2323J02181K9398k9878
14681G9226k2106k6438o384l842q777L3311J6701K7694L3651m363o4147o7428
14669a2902m4474Q8249J02109l982n164k578l8666m1694m5666K3792K0985R167
14657D9176l0848J6575L3379L2831K1759J0417p1822Q581P2379m3174p5477l5120
14645a1344L4815K309l3204l3906K5772J306J1336k1605R8201J0952k8658o7528
14633a1554R08K8383n448J9944L9793l6496k0264l2095k3158Q825L0968J3758
$$ y = [-70125, -38971, -31562, -22162, 32757, 15408, -5514, 15540, -6702, -51269, -43076, -26695, -1399, 3137, 3404, -495, -4332, 8794, 6529, -39360, -56114, -40893, -51549, -20468, 2102, -2637, -23476, -64575, -107107, -101485, -110731, -49403, -60114, -54798, -22475, 79706, 109104, 79226, 57120, 30682, 24298, 20456, 11679, 44990, 61691, 89385, 123036, 118673, 54526, -12902, -57376, 30873, 132982, 129000, 123836, 121258, 82592, 40898, -4768, 19024, 40009, 49176, 18328, 34903, 68282, 101113, 122872, 133289, 61467, 70048, 142427, 99253, 23776, -11344, 23471, 25780, -7424, -41330, -15558, -14252, -2916, -24521, 73680, 84632, 55974, -11554, -10646, 17737, 12289, 32233, 72026, 35530, 15266, -16829, -39987, -31162, -194, 13564]
14621A3564K0434Q7502J8002r9809j11604j3911P9543L5253l1155N1207Q1049
14610A30075l4239j07223k3123k1206l6187k2029K6120O3268M5119l6635J7680
14599A620K5649j697m3230J591O2484p6552j9588P8398K1107J6702l3132m9755
14587a6403O735P1099M913l8809k9114L6532O220k5827M277K6885m2863L4845
14575C8490O8477K9644o2398o1501k7911l4696k7101M088J530J1971J1000K9510
14563a8897K1014K0891n723n9678p221L9850K4474p419j6885P2136O3885k5425
14551A01002M009K9605K2098L0285O10p7581k2671K5543m0895q6111K4600P9312
14539H9806l3178J3506j2754l9153j8678j5003m2129n7732m195K9941L8947P2848
$$ y = [13564, 33998, 121500, 139502, 39693, -71911, -85822, -6279, 28974, -2181, 49026, 130075, 95836, -11387, -34510, -55716, -91903, -113932, -87812, -24544, 20575, -16060, 1620, 27269, 25572, -17658, -16067, 46417, -30135, -49723, 28675, 49782, 66484, 33352, -16403, -9668, 61431, 66344, 27535, -1579, 34953, 41173, 15346, 19623, 46508, 3645, 38490, 106967, 136611, 74213, 12712, -15199, -49895, -76996, -72908, -71378, -59407, -48407, -18897, 2117, 23008, 17285, -42393, -49614, -9764, 14710, 7291, -9594, 62542, 126427, 101002, 105011, 134616, 156714, 186999, 187609, 110028, 87357, 112900, 72005, -14106, 10494, 89806, 56628, 70134, 57380, 18227, -451, -15454, -57583, -115315, -119510, -89569, -50622, 22226]
14527B2226K312N884k8793O629k0536j4773k9444j9721J5760P1399L1277k9140
14515A3080l9552L1173K1669K2693k178O544m856r2600k1595J4070J5943O634
14503b8975k6075L0375J5262J5659L6971j2296J53M2474o3256L7183j1994K3140
14491E8621K404j104j6155k1320m8962J5415k361k0093N983j986N087P63L2532
14478H824J5400K8040O843L2010K2002l48k9561o122k3736l7829k9640j6265K8214
14465b168L3736N5631n0397M631M585K4483R817m50K6235j4796m9646K574N0578
14452I4813P219j2811m7932k9006O5929J3584O520o2096j3884j1717K9459N1331
14440I1409J9261k2544n4203l3024J394L7771j6997p7554j3479N3439J14140k031
$$ y = [22226, 24538, 30422, 1629, 8258, -12278, -27051, -56495, -76216, -60456, 10943, 42220, 13080, -26472, 4701, 26370, 49063, 46885, 53429, 48573, -44027, -65622, -51552, -35609, -28975, -55050, -24675, -9413, 6246, 43217, 30921, 31074, 73548, 10292, 47475, 35481, 58621, 61025, 59921, 43766, 22446, -26516, -11101, -13462, -33555, -27572, -29558, -24471, -23708, 8824, 24224, 52264, 59107, 91117, 113119, 112771, 83210, 77088, 53352, 15523, -14117, -30382, -2168, 31568, 87199, 36802, 41433, 46018, 70501, 80318, 79868, 106103, 91307, 41661, 44235, 94813, 102032, 89221, 41289, 12283, 78212, 91796, 98316, 36220, 22336, 10619, 40078, 91409, 110670, 88126, 33923, 899, 2293, 40064, 23067, -54487, -67966, -14527, 99613, 97582]
14428I7582l2391M5892l6343q5102j9873J0107P562M196J05531l3986k9721j5751
14416A7703K037L8300M1096J2634k2427k4425k3090K5759O9998k2764q8777j0486
14404A5558q019M7767J2619l4426K183q846p394Q157k1444M7238j9912m031m261
14391B5189K0314k2595j016M926J380K4352P8l1898K088P0407l1054j4890R282
14378E6563L6954L3360m4470l7488j8860j8096m6235J5179P6185L4203k8972p0440
14366a2117K1119L8204L0332k4984K1975l0334o729j337j5523K0239n4547k7227
14354d0929K0198p85M8667K7142O766j6307j7525M0139M636l9603J4730l3700
14342A3429m1334Q2512K2210m7441L676j3104j4219j0724M0288K2699K4960L1004
$$ y = [97582, 65191, 111083, 74740, -10362, -30235, -20128, -12566, -8370, 97161, 63175, 33454, 17703, 19740, 58040, 99136, 111770, 89343, 64918, 41828, 67587, 137585, 114821, 26044, 15558, 7539, 55306, 67925, 33499, 35682, 26836, 19442, 27599, 6155, 53393, 33481, 29450, 25189, 45503, 22908, 21892, 26818, 28198, 52550, 52628, 20730, 22818, 93225, 62171, 47281, 56563, 93517, 126877, 82407, 44919, 26059, 7963, -38272, -23093, 53092, 87295, 58323, -12117, 9002, 47206, 77538, 52554, 74529, 44195, 37466, 36129, 20606, 40845, -13702, -40929, -20731, -21516, 27151, 54293, 61059, 44752, 27227, 67366, 72002, 32399, 47129, 13429, -27905, 54607, 76817, 29376, 33052, 19948, 5729, -4995, 35293, 57992, 82952, 113956]
14330A13956J379Q255m6227k7869k0723k508n925J9105N9132K0847n2434m396
14318F2592J6825j9110m962k7917l444J232L91K4908m721n860Q416Q6384j644
14305A33090l4017p0096o8117l745J9504M7761L0458L7476j5803k113J4281L2211
14293A20890K9395j585n8720j1909p830n408k7725K7804J7123m2221j05767J012
14281f4941N1048L2975N8358l330j3116K7971j5372k2011m7523o0906Q040o451
14269e5258L3999k2939j1504L3151P1424l3883r636j371J0804O8278N977k6281
14257F2761k9698n4934K1024K7855p498K7651N8669n2808k0619J5465J8386R341
14245G5595K1749l9801n3885p6247M5043K6411L4445K7605J0655M0071p5064n4395
$$ y = [113956, 115335, 123590, 77363, 49494, 28771, 26263, 20338, 39443, 98575, 119422, 66988, 62592, 79417, 60307, 55345, 27428, 23984, 25216, 25607, 50515, 45794, 39934, 48350, 134734, 133090, 99073, 28977, -39140, -42885, -23381, 24380, 54838, 92314, 76511, 74398, 88679, 120890, 150285, 148700, 89980, 78071, 70241, 64833, 37108, 64912, 82035, 39814, -65953, -64941, -13893, 19082, 77440, 74110, 60994, 88965, 73593, 51582, 4059, -56847, -48807, -55258, -21259, -44198, -55702, -22551, 48873, 14990, 5354, 3983, 14787, 83065, 89042, 62761, 33063, -21871, -847, 27008, 19510, 47161, 105830, 53022, 32403, 47868, 66254, 75595, 97344, 57543, 3658, -72589, -27546, -1135, 33310, 60915, 71570, 111641, 36577, -17818]
14233a7818J5246k019K4456M1811j4075o464J1801k8754J268K0869P1191K4070
14221A41582m6753k3910L6647K2898k7019j1895j752J5390j2404k0156j9439R513
14209F2702j1129K5334j434p112m0078K1280L3594k4296n6456k080K7171M3042
14197G0538j4025k8573P0938J1753r374J095n2737n9209r804P6517J5814n7594
14185A5339k4427K8117J12513k3080j0564J559j00024K8090K9412j0166L8518
14174H5287l66J2555K1996k5552n5677p46K5148j0244K3589P952R779K0831M746
14161A19298n155j4106k2843o1574l1823J5160O032J4236j0878o8648N3164K2512
14149A5375K3990L987j07256J0835K5976K0537L7314J4296k8017l2145R442M588
$$ y = [-17818, -2572, -4591, 19865, 61676, 47601, 41137, 52938, 24184, 25452, 46321, 117512, 141582, 94829, 70919, 107566, 130464, 103445, 91550, 89798, 105188, 92784, 72628, 53189, 62702, 51573, 76907, 75473, 68361, 28283, 49563, 83157, 58861, 2405, 325, 27496, 70538, 56513, 27940, 98878, 110631, 101257, 102352, 49615, -9594, -19398, 57119, 72933, 15339, -9088, 19029, 131542, 108462, 97898, 99457, -567, 27523, 56935, 46769, 85287, 84921, 97476, 119472, 93920, 38243, 37497, 62645, 52401, 75990, 83942, 93721, 114552, 119298, 114143, 100037, 77194, 15620, -16203, -1043, 4989, 19225, 8347, -60301, -7137, 15375, 39365, 43352, -63904, -53069, -27093, -6556, 30758, 45054, 17037, -15108, -5666, -1078]
14137a078N213M0509L0116O098l6324k63L4595P802n2304k5788J4951m654m029
14124A4844L9449N3852k5505r370L0960J8793m376j0368J3031k8113L389R005
14112A05591o989o2185j7152L2174r886p9313Q290J00383M0129j9238o835O5124
14100A50093N3733m6196k0831m9012j4797O2719l4266J0637K3268o5226M4330
14089A14452K5963L900r0210q431N6112L9953K076J113R275J0848o8590m0376
14077E6085M0737J6341o8894j9055O7407N2866m1465n7169o598k0827N098L4740
14065E9266N9673m3396o9994m7925r485J29939O6666k659o047M8459M007m2987
14053A45517m4390m3310n1519M2716N8798r005l3188J0927P0944L4022K5541L8583
$$ y = [-1078, 4135, 44644, 74760, 80858, 44534, 44271, 78866, 86668, 34364, 8576, 23527, 18873, 14844, 54293, 108145, 82640, 73270, 104230, 123023, 118647, 108279, 121310, 93197, 96586, 105591, 98602, 36417, 19265, 51439, 41553, -37760, -29470, 70913, 111042, 91804, 84969, 150093, 203826, 157630, 136799, 87787, 72990, 135709, 101443, 112080, 135348, 70122, 114452, 140415, 144315, 54105, 45674, 101786, 141739, 143815, 144928, 154203, 165051, 96461, 56085, 96822, 113163, 44269, 25214, 92621, 145487, 104022, 46853, 40255, 19428, 24526, 59266, 118939, 75543, 5549, -42376, -51861, 78078, 144744, 142085, 136038, 184497, 188504, 145517, 101127, 57817, 6298, 49014, 107812, 98807, 65619, 76546, 147490, 181512, 207053, 245636]
14041B45636Q0987J05979M1738j2064L5294O5998l9774j53220r8710L882J4693
14030B90439j5448r1167R409K0114L1229J5063M3336K5110K650N3189j6953m2090
14018C24881M5737L8926N8734P5984O704M4886N1529M5713r611k5133K2266P3159
14006G53775J4772p3341J9273J19810N054n6672o1772r0144k924j4450R094m4078
13994E78397J7040K0077o43k2510M8715M5876J6282Q4889N5640j7355j060M8801
13982H74149j5010n4750J0679k5064j0155j0836r517m2648n5306r4754r5295k3216
13970D48277l9971k4221j2894O8989K2899L6485N439j5573k9117m0757n8562O1606
13958D22600L9160n7654j0573M1532M3605P9013O3537K7441J8998L5982p4681
$$ y = [245636, 326623, 432602, 474340, 462276, 497570, 563568, 523794, 370574, 271864, 275746, 290439, 274991, 183824, 193233, 213347, 244576, 259639, 302975, 328085, 330735, 383924, 366971, 324881, 370618, 409544, 468278, 544262, 550966, 595852, 647381, 693094, 683483, 658350, 680616, 753775, 768547, 695206, 714479, 834289, 839343, 782671, 720899, 630755, 627831, 613381, 622475, 578397, 595437, 615514, 614871, 592361, 641076, 686952, 703234, 788123, 843763, 826408, 825348, 874149, 859139, 804389, 815068, 790004, 779849, 769013, 759496, 716848, 661542, 566788, 471493, 448277, 408306, 384085, 371191, 440180, 463079, 499564, 505003, 489430, 460313, 419556, 360994, 422600, 461760, 404106, 393533, 435065, 478670, 557683, 621220, 648661, 667659, 703641, 628960]
13947F28960j16792n7425m4454k1854l4157j4710M8819m3382l0730K3337j6916
13936C20696r7164m2028M609k491K8823K8139J1049k3212l4400J331j3903J174
13924A82623K4245P4430l9440p4385J3162N5813J0394j068l7139j7623N852k462
13912A94402k6373q2242L3557P0600N8117L1641J7238j0915m9481Q242l7830j2969
13900A93987m2285L9272J1783n1615k3770R408K7053L7585L3039o1892j4193n6501
13888A01871L2587q564j2208k9911M335M8111M2933L3451j3479k6266J309j1942
13876A62227k7053L1330j023J0406l4412k0818J2511L8145L2596k0506j3530j666
13864A68207n4998j9432L0943j095N306k1263P556j4273L6875M2136k4904m5874
$$ y = [628960, 512168, 454743, 410289, 388435, 354278, 339568, 388387, 345005, 314275, 337612, 320696, 223532, 181504, 186113, 183622, 212445, 240584, 251633, 228421, 194021, 195352, 181449, 182623, 206868, 281298, 241858, 167473, 180635, 236448, 246842, 245774, 208635, 191012, 196864, 194402, 168029, 85787, 119344, 189944, 248061, 279702, 296940, 286025, 236544, 244786, 206956, 193987, 151702, 190974, 202757, 151142, 127372, 136780, 163833, 201418, 234457, 172565, 158372, 101871, 134458, 125894, 113686, 83775, 88110, 136221, 179154, 212605, 199126, 172860, 174169, 162227, 135174, 166504, 165481, 175887, 141475, 120657, 133168, 171313, 203909, 183403, 169873, 168207, 113209, 93777, 124720, 123625, 128931, 107668, 115224, 100951, 137826, 179962, 155058, 109184]
13852A09184j4334M9090K2268j4118J02J481R686o891j2693K1377j2053m404o0909
13839H7786J664J7163k8422J9933n6248m4223L0739m60J1985R1982P2647j0681
13827A93865K4385m7645l5151j9364j1037l6746n1120K1269Q7824P4157l6288
13816A64149L380o662k3935M8795K4691l6706o7756q670K9657m7190P9933L8408
13804A98094k9777K9328J8951O026O133P1407L0795o5290l8040J8929j4255k2269
13792B10032l737M1827R089n856J6704Q3716N6557k9874o8031j6654K9685O2430
13780C85888K7907N1428O7118m2201l1137o9974j5714J9648J0087N984n5544l0591
13768C22899N5443O8234Q770k7617L7401L3840o3109o5641k7650o193m4291k7554
$$ y = [109184, 94850, 143940, 166208, 152090, 152192, 153673, 163359, 156468, 143775, 165152, 153099, 148695, 87786, 89450, 106613, 78191, 98124, 41876, -2347, 28392, 27932, 39917, 131899, 204546, 193865, 218250, 170605, 135454, 116090, 105053, 68307, 17187, 38456, 126280, 200437, 164149, 167529, 160867, 136932, 185727, 210418, 173712, 105956, 97286, 126943, 79753, 159686, 198094, 168317, 197645, 216596, 222622, 228755, 300162, 330957, 265667, 227627, 246556, 232301, 210032, 206295, 248122, 257211, 251355, 268059, 351775, 408332, 378458, 310427, 293773, 323458, 385888, 413795, 465223, 532341, 490140, 459003, 389029, 373315, 392963, 403050, 409034, 353490, 322899, 378342, 446576, 455346, 427729, 465130, 498970, 435861, 370220, 342570, 336377, 292086, 264532]
13756B64532n850K2236L2339j9692l3684P949R101J048J8728r685R255P1046j7075
13743C50248m36n4410L2006R4558L1526r2090j12333k8697p527Q15M6688n252
13731B55096K525K2189K4321j6799m3042L2850K9702k6364M5160L1849K658L7174
13719C97319l3909o5502M1725N1991j5000q397L4382P749j0043N112J8884q211
13707D16100k7514J3539j0688K1237J1316m3228n6064j2563N3234J3614j2250
13696C66733P941k4728N34q716l1636M4380M5751l2035j8011j3187l1544m0023
13684B65459q509K9067O8796P5641M8619r2355j1978P620j1712j1755p262N6925
13672D08556O273k2492p078J6334K6572N3927O3894L8539q458L9749L7812j4762
$$ y = [264532, 258682, 280918, 313257, 293565, 259881, 267830, 276931, 277979, 296707, 287022, 296277, 367323, 350248, 349812, 295402, 327408, 421966, 453492, 361402, 249069, 220372, 212845, 213660, 260348, 255096, 257621, 279810, 304131, 287332, 244290, 277140, 306842, 280478, 325638, 357487, 360145, 397319, 363410, 297908, 339633, 391624, 376624, 368227, 402609, 410358, 400315, 405427, 424311, 416100, 388586, 402125, 391437, 412674, 423990, 380762, 324698, 312135, 365369, 378983, 366733, 374674, 349946, 350480, 341764, 310128, 354508, 400259, 368224, 350213, 337026, 305482, 265459, 256950, 286017, 354813, 430454, 479073, 386718, 374740, 382360, 370648, 358893, 351631, 408556, 414829, 392337, 385259, 401593, 428165, 482092, 545986, 584525, 576067, 615816, 653628, 638866]
13660F38866j3711l8315l4680Q117M5867O8053O8978K0045O8329Q1921K9157L8560
13648I81187r459J6672k920J9634M8552K282M730m0484n039J9024l4587q856K8682
13635A019418m4783n0003M3869O8004N2156n468J5237J4702o849l8027N982Q9013
13623A163251K3358O5257L252n5798K0502J14746j9726l6074M4930Q359k008M212
13611A334261O2571Q088q878M8327j4446p5257J6073J14648P5361P3866N6196
13600A690810M6758L8342M0079R3711O5909R2031P2356J54204J32268J19611K16236
13589B762315K91247L24102K82867L42615M69205O29445P83609Q89253Q27093
13580G601751Q09393Q71394P20572J51249n89794n49796r0151L64644O73370P32726
$$ y = [638866, 625155, 586840, 552160, 560277, 606144, 674197, 743175, 763220, 831549, 913470, 942627, 981187, 971728, 988400, 985480, 1005114, 1053666, 1055948, 1060678, 1020194, 1015155, 1034179, 999592, 990736, 1019418, 974635, 924632, 968501, 1036505, 1088661, 1083193, 1098430, 1113132, 1106283, 1068256, 1074238, 1163251, 1186609, 1251866, 1255118, 1199320, 1219822, 1334568, 1314842, 1278768, 1323698, 1332057, 1330049, 1334261, 1396832, 1404920, 1396042, 1444369, 1429923, 1354666, 1370739, 1485387, 1560748, 1634614, 1690810, 1737568, 1775910, 1815989, 1909700, 1975609, 2067640, 2139996, 2294200, 2426468, 2546079, 2762315, 3053562, 3377664, 3660531, 4003146, 4472351, 5101796, 5885405, 6774658, 7601751, 8411144, 9282538, 10003110, 10154359, 9564565, 9014769, 8924618, 9289262, 9962632, 10695358]
13570A0695358P70224J051581J195485R99869Q67718J047360J181579J277670
13562A9086844J471794J565133Q08585n23410n68146O12561J543429J484396J305604
13553B6786790J714552J492213q54390l421171l189291j683497n88018J64276
13545B0421464P74462J395878K131264K883960L848007N113360O426844P418932
13537E0414171P808098Q792734J0678721J2036551J1739834J1616541J3374932
13530A26461582J7966039K4966658K8217201K1790598J4490899J5970036J9043907
13523B68906920J5966789Q980122N10220o147096m742853r88361k526387j0497154
13515B69462200j9174844k5721161k3463712j5355702j4083629j9924632j9679831
$$ y = [10695358, 11465582, 12517163, 13712648, 14712517, 15580235, 16627595, 17809174, 19086844, 20558638, 22123771, 22932356, 22408946, 21840800, 22453361, 23996790, 25481186, 26786790, 28501342, 29993555, 29139165, 25717994, 22528703, 20845206, 20257188, 20421464, 21195926, 22591804, 24723068, 27607028, 31455035, 36568395, 42995239, 50414171, 58222269, 67015003, 77693724, 89730275, 101470109, 113086650, 126461582, 144427621, 169394279, 197611480, 219402078, 233892977, 249863013, 268906920, 284873709, 293853831, 294364051, 288216955, 283474102, 282485741, 279959354, 269462200, 250287356, 224566195, 201102483, 185746781, 171663152, 151738520, 132058689]
13508A32058689j4076114q934152n920538n972298q830259j0175757q530347o343043
13500F3276181m662696l619533k917351k222236j616590j038484l66408L74774
13492D7207657J048399J057532O42235Q76640J068013m60248l331205l862272
13484D4246751k253398j013413n15721k52422n012j99223j359210k607332k516377
13475C3524643j870001j383540r75693o88713r19156j318099j387996j008763
13467B3972682n08828k23829k27285j67632q2560k23939p80485j489924j597215
13458A8670985j269923q80286p56377o74864o34778n83705m77363l99434m11993
13449A2582262l94711m21760m31319l53289l50453l04683k88503l18444k55488
$$ y = [132058689, 117982575, 109048423, 103127885, 97155587, 88325328, 78149571, 69619224, 63276181, 58613485, 54993952, 52076601, 49854365, 48237775, 47199291, 46832883, 47207657, 48256056, 49313588, 49955823, 50832463, 51900476, 51440228, 48109023, 44246751, 41993353, 40979940, 40464219, 40211797, 40206785, 40007562, 38648352, 36041020, 33524643, 31654642, 30271102, 29295409, 28606696, 27687540, 26369441, 24981445, 23972682, 23463854, 23240025, 23012740, 22845108, 22762548, 22538609, 21758124, 20268200, 18670985, 17401062, 16520776, 15764399, 15089535, 14454757, 13871052, 13393689, 12994255, 12582262, 12187551, 11765791, 11334472, 10981183, 10630730, 10326047, 10037544, 9719100, 9463612]
13440I463612j79204k15531k23661k94278l43972k10587j60935k13450k29475
13431G392519k40361k30314k06142k24171j63658k08119k01086j22706j82751
13422E613211j53021o7068n4001j55611j24826r5797j36152j28323j09633j41969
13412D446810j51101k6576r4506r3820r0751j2054m4170j23640j17237r8396r583
13401C584976n7062j26947p6918n1999n1624r7625j48722j55225j52668p5835
13391B590351j00763m0087j27586q3932o4369p6544j37440r0912l0956r7587r7553
13380A642622n7801l3392l5390n8186m6462m0655o1603k6807o400j9042P1787
13369A328671k410l7249n5230q118M1656k7372o4937j19214r6744m7137j402m26
$$ y = [9463612, 9284408, 9068877, 8845216, 8550938, 8206966, 7996379, 7835444, 7621994, 7392519, 7152158, 6921844, 6715702, 6491531, 6327873, 6119754, 5918668, 5795962, 5613211, 5460190, 5393122, 5339121, 5183510, 5058684, 4962887, 4826735, 4698412, 4588779, 4446810, 4295709, 4269133, 4174627, 4080807, 3990056, 3978002, 3933832, 3810192, 3692955, 3594559, 3584976, 3527914, 3400967, 3324049, 3272050, 3220426, 3122801, 2974079, 2818854, 2666186, 2590351, 2489588, 2449501, 2321915, 2237983, 2173614, 2097070, 1959630, 1868718, 1837762, 1740175, 1642622, 1584821, 1551429, 1516039, 1457853, 1411391, 1370736, 1309133, 1282326, 1275926, 1256884, 1328671, 1326261, 1289012, 1233782, 1225664, 1267320, 1239948, 1175011, 1055797, 959053, 911916, 910514, 910088]
13357I10088k8690m1178l2757J6935M2114l7683k6886M072N3129K8374k6962o8808
13345G91748p0778o3993j1805N499l1709l6038n4338J5596M1208K7827l5622n5352
13333E22243K1749R791k7077o349k9564l6804j6642k6006o3304j2963L7802L8570
13321D11446L0916M7384j7272l3172l0125N5958K1039M204k9489R452M8623p411
13309E11553j09875j8500J5232J667p082m0440J8353N598m4888m9289J2552K3047
13297C17928j0261K7777l2893L9728P0956K359p2929R186N2089m0245o2260m0529
13285B60906K8937K7529j3504n218j0748J52J9866k5535m5864o1457J0175Q9498
13273B74737M6974K273L6936m1651K9341J08960l7371n6259j5301o4717q7584
$$ y = [910088, 881398, 840220, 807463, 824398, 866512, 828829, 801943, 806015, 859144, 887518, 860556, 791748, 720970, 656977, 645172, 650671, 618962, 582924, 528586, 544182, 585390, 613217, 577595, 522243, 543992, 553783, 526706, 520357, 490793, 453989, 437347, 411341, 348037, 335074, 372876, 411446, 442362, 489746, 472474, 439302, 409177, 465135, 486174, 490378, 460889, 470341, 518964, 511553, 401678, 383178, 398410, 400077, 392995, 352555, 370908, 376506, 331618, 282329, 294881, 317928, 307667, 335444, 302551, 342279, 413235, 415594, 342665, 351851, 403940, 363695, 301435, 260906, 289843, 317372, 303868, 298650, 287902, 288054, 307920, 282385, 236521, 175064, 185239, 274737, 321711, 323984, 360920, 319269, 348610, 457570, 420199, 363940, 348639, 283922, 196338]
13262A96338K7805n347O8481O8120p2047q9492L1137J4330J6247K6101K0852n0058
13250B52467q2394m95N0570l8714l851P0766J8950o43m7563n5692l973J1758n356
13237A65830m5971J3832k8409J206N1492J7640l1564m672K3104K879p085J4692
13225A72974j832J2346j9174J4559O233k8217m7200p976k4394k2571K7117J0732
13213I2597k5925l9406Q653k336K9664o396K8613Q601J9793M6663k8088k9379
13201A03054k2396k9170L616l5993n8486L5797L0559N7985K5262n685k5393K278
13189H1428Q154k0600j0084M5908k1914j5071j290N380j5045J5821P174m295k2586
13176E2980j124j3282j1634k0351J2490K3680K5943j2260K832m5041Q869k4847
$$ y = [196338, 224143, 218796, 287277, 355397, 283350, 193858, 224995, 239325, 255572, 281673, 302525, 252467, 170073, 169578, 220148, 181434, 177583, 248349, 267299, 266656, 219093, 163401, 159428, 171186, 165830, 119859, 133691, 105282, 106488, 157980, 175620, 144056, 139384, 162488, 165367, 158282, 172974, 171142, 183488, 164314, 178873, 185106, 156889, 109689, 101713, 77319, 54748, 81865, 92597, 66672, 27266, 35919, 33583, 63247, 56851, 85464, 94065, 113858, 160521, 132433, 103054, 80658, 51488, 55104, 19111, -39375, -3578, 26981, 84966, 110228, 104543, 79150, 81428, 89582, 68982, 58898, 104806, 82892, 67821, 66531, 71911, 56866, 72687, 79861, 75566, 52980, 51856, 38574, 26940, 6589, 19079, 42759, 68702, 56442, 59274, 14233, 23102, -1745]
13164a745k1651K8332j6742n4659L7932j3029j3640M3735M447j5567Q468J0755
13152c364k0274k1905r237P464Q5640j3984n1516j9511K9144J4893j9769N291
13140a7128j913l515K3845J5112J4216j7975N3776k6314q3903L24L4285L512n664
13127a1342K0820P8603L961k9776m5948l7772Q0810P2907j1766k3328L0368k1678
13115A05859l6679j2408L8185L1837J2700J9127n7911k4553L5152n065m7187r260
13103D9797N1061l1570n0521O312J2858K0063K2801m5881M1030P7015l1553K9771
13091A51183K9755Q930K5323K9743p028R760P5885M0967L5113J05328J1381n4090
13079D62250r2293l9462k3797p925k3060K0348L7320m1274M778Q9059j2547P121
$$ y = [-1745, -23396, 4936, -11806, -66465, -28533, -41562, -55202, -11467, -7020, -22587, -14119, -3364, -23638, -45543, -54780, -47316, 38324, 24340, -27176, -46687, -17543, -2650, -22419, -17128, -19041, -22556, 1289, 16401, 30617, 12642, 66418, 40104, -43799, -43475, -9190, -5678, -11342, 9478, 88081, 92042, 62266, 16318, -21454, 59356, 132263, 120497, 97169, 127537, 105859, 69180, 56772, 94957, 126794, 139494, 158621, 100710, 76157, 111309, 106244, 59057, 49797, 100858, 69288, 18767, 25079, 37937, 58000, 80801, 34920, 75950, 152965, 121412, 151183, 180938, 189868, 215191, 244934, 237906, 247666, 323551, 364518, 399631, 504959, 516340, 462250, 369957, 330495, 306698, 298773, 275713, 296061, 333381, 292107, 296885, 385944, 373397, 380518]
13067C80518L5888m0403m2455J7287q137k4969Q153M2954O6414K1001P2592J74136
13055G02979J03367M2549M3080O172o7739q9069o1755p7722q1665J6614K0311
13044E57122q465n7437m3684k2013k8180J0693O7237M5362N8380M8166k8367K4424
13032F23238M2332j2815j6681J19117M2756l7291p3563n3510J0602k7252p8958
13021E37975l6966n3683q4436q1508N5790J05848L8014k0444P712M0288m2719
13010D65871m8053m3792l7897K2608J798n3366N1070L2720K407O9658J1407k4842
12998D49589L5050K117n1970n5477p7644o0305o8285m0045m8317m0912L6893p533
12986G3161n9750K1938M7613N944L2191j3584r7558P552L4596J623p220R002J6154
$$ y = [380518, 416406, 376003, 333548, 350835, 342698, 317729, 325882, 368836, 435250, 456251, 528843, 702979, 806346, 848895, 891975, 898147, 830408, 741339, 679584, 601862, 520197, 536811, 557122, 548657, 491220, 447536, 425523, 397343, 408036, 475273, 520635, 579015, 627181, 598814, 623238, 665570, 652755, 636074, 755191, 797947, 760656, 687093, 633583, 644185, 616933, 537975, 501009, 447326, 362890, 281382, 337172, 443020, 481034, 460590, 468302, 508590, 465871, 417818, 374026, 336129, 358737, 360535, 307169, 358239, 390959, 393366, 463024, 474431, 449589, 484639, 486756, 434786, 379309, 301665, 241360, 173075, 133030, 84713, 43801, 80694, 73161, 13411, 35349, 82962, 88906, 121097, 107513, 9955, 17507, 52103, 53726, 46506, 55508, 71662]
12973G1662k9574j4027N145M3183J0245k1938k5946K9821M8418m0797l4608J43
12961D1727K3367K2497L6371r057O750k2415n1238k3267j101k8937J3028R217
12949A6942o5613l599j578l8993m050K341J2378L581m4332N2488L0830P7011M1885
12936G9291o3246j8594p073K0468N522p57M8614k0885m7446j5794O092k2972J1951
12923b4829L1341L4780J8534N1140q860o5491n649K6074j0840J1469n1873j4485
12911h689R5266j2546m1392k4495m7637K1556Q7507M7517k3801n6557k9841k2542
12899a5654k541L294J2709o997m5702O593m0776k1820Q535k0061P7533P1996J2558
12886C9667l8043j5973L6011R858K132j7938j2438J1559L233l4121L839o5293
$$ y = [71662, 42088, 28061, 33206, 76389, 86634, 64696, 38750, 68571, 116989, 76192, 41584, 41727, 65094, 87591, 123962, 114905, 121655, 99240, 48002, 24735, 23634, -5303, 7725, 16942, -48671, -52270, -53848, -92841, -96891, -94550, -82172, -78591, -122923, -70435, -39605, 37406, 79291, 16045, -2549, -9622, 10846, 16368, 15611, 64225, 43340, -4106, -19900, -13808, -36780, -24829, 6512, 41292, 59826, 110966, 102106, 36615, 30966, 57040, 46200, 57669, 5796, -8689, 86577, 74031, 32639, 8144, -39493, -17937, 69570, 117087, 93286, 36729, 6888, -15654, -18195, -14901, -2192, -9189, -54891, -48298, -89074, -110894, -102359, -122420, -44887, 27109, 39667, 1624, -14349, 21662, 31520, 33652, 15714, 3276, 14835, 18068, -16053, -12214, -77507]
12874g7507n418M2999l668P828m834O7892q451l6827J7637j1893n3955j7616J1239
12861g2574J522N7024M6030m4081n7403p3590M9551L9842J5979K8094K4817K9697
12849D4908K2634R458p584p0656k4881K0015O1534j090P289K1773j8766L506L1625
12836I9765m5256L7825j0937q6323l083M4558o6020l3774N6959l5911K7108l477
12824a8566l6161r514N4623Q7661l1063L3855K3530k3048n6864m6885J9971m249
12812f710J8652K0258P6769l4235m5363k9812L4970o787K614J2397l3167L5715
12800D5301J6718K5780L5538L8850l614n3677k3224k4465M0601l6485l4034m0834
12788a3545k0174j90l0526j0817N4819P6216P5216j7588q7751k2386J8481j695
$$ y = [-77507, -82925, -39926, -43594, -35766, -40600, 27292, 18841, -17986, -349, -12242, -66197, -83813, -72574, -71052, -14028, 32002, -12079, -69482, -143072, -93521, -53679, -37700, -9606, 15211, 44908, 67542, 77000, 69416, -1240, -26121, -6106, 55428, 54338, 61627, 83400, 64634, 68140, 99765, 54509, 92334, 81397, -4926, -8009, 36549, -29471, -63245, -6286, -42197, -15089, -18566, -54727, -64241, -9618, 78043, 46980, 80835, 104365, 81317, 24453, -22432, -2461, -6710, 11942, 32200, 108969, 74734, 29371, -441, 34529, 27742, 30356, 42753, 9586, 45301, 62019, 87799, 123337, 162187, 158573, 104896, 81672, 57207, 97808, 61323, 27289, -13545, -33719, -33909, -64435, -75252, -20433, 55783, 130999, 113411, 25660, 3274, 21755, 20060]
12776B0060J112M2612n5054o0878O5172K8578R973K185j1492k5183k1129n2529
12764e6573L6959N7069j9033L2687N3315k5051m6840l5840M0960o431k9792k2067
12752b0637j8685N6743K1571n4486O310k8017l1157j798K5149K6225O9560k9602
12740B1176l3695M210l7932J4631N9404q409l6874k7688j4624K5760k4182J9986
12728c8237J7341j7575j4405M9231N2111J4229O557L3503M7347l2892q1967p5826
12716d0583m7030m1512J7576L7849N6916M2559R229j1748n5537n6625L202M6459
12704c9245L1063J2907l490L993N161Q2250n1319k5882m0395N5210R457n018n1517
12691a6825k0809k2177J46L8627L3081k7966J9866l2941L654o721J7184R603j3610
$$ y = [20060, 21172, 63784, 8730, -52148, 13024, 41602, 51575, 53760, 42268, 17085, -4044, -56573, -19614, 37455, 18422, 51109, 104424, 79373, 32533, -3307, 37653, 31222, 1430, -20637, -39322, 17421, 38992, -15494, -9184, -37201, -68358, -70156, -45007, -18782, 50778, 21176, -12519, -8309, -46241, -31610, 27794, 19385, -17489, -45177, -59801, -34041, -58223, -38237, -20896, -38471, -52876, -3645, 48466, 62695, 69252, 102755, 150102, 117210, 35243, -40583, -87613, -129125, -111549, -73700, -16784, 25775, 35004, 23256, -32281, -88906, -85704, -39245, -8182, 4725, 1235, 5228, 10389, 92639, 41320, 15438, -24957, 30253, 39710, 34692, -16825, -37634, -59811, -59665, -21038, 12043, -15923, 3943, -28998, -25344, -32065, -14881, -5278, -18888]
12678a8888l6141l5411K3877J34049L8978l5154r732J1773n3442o0598N1672K259
12666A3242j1658L0213M4429J31k6647n886k4502m5951o451O7908P657k5704J2886
12653B9667l8035j3382L859o5626n0481J3767K6231O6857L6051K2635L2842l2813
12641C1572k4816n7189l5368J1891M9235J880J9652K6858M045K8754J4526N0952
12629A21992l3040m7780k974R913p3664m4075m2676r459K5553M2034q9m898n6325
12616a15488K319Q1182O1493J5622p241J0080l9066O4614L7233o0719j09533N2379
12604g125k7987j1481j7823P668m67l3319n6629L6563M5694N0970K6194M549K9355
12591D6162l7366l9030J0937N1317L2729J2013p089m5151n2715N5695N1946n8150
$$ y = [-18888, -55029, -90440, -66563, 67486, 106464, 71310, 61578, 73351, 19909, -40689, 10983, 13242, 1584, 31797, 76226, 76357, 49710, 43824, 19322, -26629, -33080, 34828, 42485, 16781, 29667, -8368, -21750, -17891, -83517, -133998, -120231, -94000, -27143, 8908, 31543, 64385, 31572, 6756, -50433, -85801, -73910, -24675, -22795, -3143, 23715, 27760, 56514, 71040, 121992, 88952, 41172, 38198, 48111, -25553, -69628, -112304, -121763, -96210, -54176, -54265, -59163, -115488, -113169, -31987, 29506, 45128, 37887, 47967, 8901, 73515, 110748, 50029, -59504, -7125, -35112, -46593, -64416, -56748, -57215, -90534, -147163, -110600, -64906, -13936, 12258, 16807, 46162, 8796, -30234, -19297, 32020, 64749, 76762, 69673, 24522, -28193, 27502, 79448, 21298]
12579B1298j5755Q0779J8040n5874n1142m2750r966k7375k3981J7149J9157O3118
12567g302J8737j00972k3284K20O4618M3169j1896P957P162N492K916L0567K3828
12554F1212l6399o5066j8995P7035K933m4962q272l5677n126m6626K927L2270
12542h4746N9909k2217K9502L6481j4816m5852j9194Q480j3702J600M3428K945
12530a8182P46k5265k6257j1543r743m329m5688J5107P5246P646k2991O661L6742
12517b1850p341k1869M3088M4001j5812n2971J3076m680l6305L9298Q751j554
12505a4168l9823L3255l1781L0597K3351J7835q912m5899k2857j9790L3392J3541
12493c1259j5611r3663L7070K0840L4751m987N4370o07j4095J75K6349J8767q469
$$ y = [21298, 5543, 86322, 104362, 48488, -2654, -45404, -55370, -82745, -106726, -89577, -70420, -7302, 11435, -89537, -112821, -112601, -47983, -4814, -16710, -8753, -1591, 3901, 6817, 37384, 61212, 24813, -40253, -59248, 17787, 20720, -24242, -32514, -68191, -73317, -119943, -117016, -84746, -24837, -47054, -17552, 18929, 4113, -41739, -60933, -52453, -66155, -64555, -21127, -18182, -17436, -42701, -68958, -80501, -90244, -94573, -140261, -125154, -49908, -42262, -65253, -58592, -21850, -29191, -51060, -7972, 36029, 20217, -32754, -19678, -24358, -60663, -21365, -12614, -14168, -53991, -20736, -52517, -21920, 1431, 19266, 10354, -35545, -58402, -78192, -44800, -31259, -46870, -140533, -103463, -82623, -47872, -52859, 1511, 904, -13191, -13016, 13333, 32100, 23631]
12480B3631l5942j3669O0315R967q4923o3498j8244N8836N9854M6629L9208j2166
12468F9998l9744k3154N669l8491k0978n4250n7439L5317L3421J8051l8418J4383
12456i5635J3184L4398J0756j1269J2500N092j7368k1589L4844K96l7645O6603
12444e833M0420L5965l002p2414J9526j9672o5100N491O4367K4373j3093l2998
12432b1970p4062m0956O084J3657M0404J7107K1226J2168j1311l0966L2216K419
12420c3984l3981L4892L6701l6341k8359m041M1363N972n4996L5680J15505O0731
12408A39142j5855J2093r2964k8038r017o5210j0490L1802M1196K7039l616l0889
12396d807l3145K7305K2247L0097L6772L6082k1300m5570l3070m0717R707O1974
$$ y = [23631, -12311, -25980, 34335, 44302, -40621, -104119, -122363, -63527, -3673, 42956, 82164, 69998, 30254, 7100, 12769, -25722, -46700, -100950, -158389, -123072, -89651, -71600, -110018, -95635, -82451, -48053, -37297, -48566, -36066, -30974, -48342, -69931, -35087, -34791, -72436, -5833, 34587, 70552, 67550, -4864, 14662, -5010, -70110, -64619, -252, 24121, 11028, -21970, -96032, -136988, -130904, -117247, -76843, -59736, -38510, -26342, -37653, -68619, -36403, -33984, -67965, -33073, 3628, -32713, -61072, -65113, -23750, -17778, -72774, -37094, 78411, 139142, 123287, 135380, 42416, 14378, 5361, -59849, -70339, -38537, 2659, 29698, 26082, -4807, -37952, -10647, 11600, 41697, 78469, 114551, 93251, 47681, 14611, -26106, -16399, 45575]
12384D5575J3371J8698j3546m3790o0536o2412J084q813L9914N2914R7576p3501
12372F534j4491m5953m1682M8414J2142l9416j7318j4233L0400J338j0929n076
12360i0270M5886M8231Q4071R34j2640o919l6212m1120J0158K4296J0362R679
12348D6456m7845k9204j6937o9230O02K1997r591P8810P0510k9492L066J2609
12336C1751n201n657r264m1656J3197M1684K2200L621j9403m5260L7784J0706
12324C4502l4766J7354k325k7104j8018L1033j7394n6724M4493j2691p475Q9N3673
12311D647L6365J6605k1456Q010J2786k8372j4372L7397j1127j5846P960L3090
12299F5687P1727j6226o6930K7708m3782k6131n6062l8057J6083J0850O513P0324
$$ y = [45575, 58946, 77644, 64098, 20308, -40228, -102640, -101556, -110369, -70455, -17541, 80035, 6534, -7957, -53910, -95592, -47178, -35036, -74452, -91770, -106003, -75603, -74265, -85194, -90270, -44384, 3847, 87918, 88852, 76212, 69293, 33081, -8039, 2119, 26415, 36777, 46456, -1389, -30593, -47530, -116760, -116158, -94161, -103752, -24942, 45568, 16076, 19142, 31751, 26550, 20893, 11629, -30027, -16830, 24854, 47054, 50675, 31272, -13988, 23796, 34502, -264, 17090, 14765, -12339, -30357, 676, -16718, -73442, -28949, -41640, -49115, -49026, 4647, 41012, 57617, 36161, 44171, 56957, 28585, 14213, 51610, 40483, 24637, 32597, 65687, 137414, 121188, 54258, 81966, 38184, 12053, -44009, -82066, -65983, -55133, -48620, 21704]
12287B1704J0219m2024j1440k5858j4623K6679l925q0699l6792r994Q2853N5513
12275b8387K9620R104Q505k468l7829M164M1592j0784m8916n763k4440l5758K6734
12262g4626k0356L5664M8450j5248K3107M2500R458R875l2035j7394M839o4881
12250e0647K5612J2921M8167J0361k0112q3543j3081j3315N659R170K9142R994
12238b9672L9999J2300q722o934J6007L0457j3585k9136p240J6930K1589p0934
12226b8941n089P0733R69n3283j5888k5331P058K8863L2114K3541L1900J2364
12214G9010n39n5738o7540k2391M9637J1442l1765j0900k7401l3135M8091L0364
12202c0865O1073K4050l4583j0385j2275J1384l2247l2220J472J0025l8500j7510
$$ y = [21704, 31923, -10101, -21541, -47399, -62022, -35343, -39268, -119967, -156759, -166753, -83900, -28387, 1233, 10337, 18842, 16374, -21455, -17291, 24301, 13517, -35399, -41162, -65602, -101360, -74626, -94982, -59318, -10868, -26116, -3009, 39491, 48949, 58824, 26789, 9395, 14234, -50647, -25035, -12114, 36053, 46414, 26302, -57241, -70322, -83637, -77978, -68808, -39666, -29672, 10327, 22627, 13905, 6971, 22978, 53435, 39850, 10714, 3474, 20404, 41993, -28941, -34030, 36703, 37672, -15611, -31499, -56830, -49772, -20909, 11205, 34746, 66646, 79010, 78471, 22733, -44807, -67198, -17561, -6119, -37884, -48784, -76185, -109320, -61229, -30865, 30208, 54258, 19675, 9290, -2985, 8399, -23848, -56068, -54596, -44571, -83071, -100581]
12190a00581J9243L7634J5901N7132M7180K1512j8444j7473j3854j1240j1624
12179B5386p7360p6704K931O8849J0600K2934m8895m8181L2100j1242J1766O3659
12167b4157j1995j4311M2862p273n7511l437p305k7671j3364P9868K1073j9254
12155d2475m1498Q442O1149m094O063m234O181M181K4773M7985K4424l5031P906
12142F3772l8902p373P0784P312n6035j4588m9693P538N6709o4276m2518J1697
12130e5573Q9865j9597m2092K8144L1317M8237l8910l3199J2078J8752K143Q52
12118D2017m3641M447k1325J2732J9366l8060k032m1479m2135o492K7761N6156
12106c2685l1133Q577R5646Q748p622l5319j506K1168j0290R057l989k7759l5569
$$ y = [-100581, -81338, -43704, -27803, 29329, 76509, 98021, 79577, 62104, 48250, 37010, 25386, -51974, -128678, -125747, -56898, -46298, -23364, -72259, -120440, -88340, -99582, -87816, -24157, -36152, -50463, -7601, -14874, -72385, -75822, -83127, -110798, -124162, -44294, -23221, -42475, -83973, -75531, -14382, -18476, -12413, -16647, -10466, -6285, 18488, 66473, 90897, 55866, 63772, 24870, 17497, 88281, 95593, 39558, 24970, -24723, -17185, 39524, -24752, -67270, -55573, 34292, 14695, -27397, 747, 32064, 80301, 41391, 8192, 20270, 39022, 41165, 42017, -1624, 2823, -18502, -5770, 13596, -24464, -26496, -67975, -110110, -116602, -88841, -32685, -63818, -55241, 40405, 49153, 41531, 6212, 4706, 25874, 15584, 24641, 20652, -7107, -42676]
12093d2676O703J6256M466M5787P908j7385n3800M1066J1987o1810l5900K1341
12081e6057P1347N4391n3903K9880K7007m3386k7416Q018N7539L4421j4725k6615
12069F0501J910L677J910k6767r064l6234J1143O0828o307k588n1474k3434k827
12056a8726l4958n5184J216M2683P3113j904n8677k6167R484K7061P970N1926
12044A7837L2755j1134j440k0166l9295J1156J1271l2578l3493m1617O4427Q8159
12032D5882q5894k6493K2886K4156P3538R912m7500M2532l7723p7601k6539q600
12020i1444k400k7809M6734M5194J5373L837r2602n1194N5213M7732k5330K2947
12008e3749N027K4991J9684K0501o021m0301L5479J484o5557K831O074O4291J0073
$$ y = [-42676, -35973, -19717, -15251, 30536, 38444, 21059, -32741, 8325, 20312, -41498, -77398, -56057, 15290, 69681, 15778, 45658, 72665, 29279, 1863, 9881, 67420, 101841, 87116, 60501, 62411, 66088, 67998, 41231, 32167, -4067, 7076, 67904, 61597, 59009, 7535, -15899, -18726, -53684, -108868, -107652, -64969, 8144, 6240, -52437, -78604, -69120, -42059, -34089, 17837, 50592, 39458, 38018, 17852, -21443, -10287, 984, -31594, -65087, -106704, -42277, 45882, -40012, -66505, -43619, -19463, 54075, 63987, 16487, 59019, 21296, -56305, -82844, -91444, -93844, -121653, -74919, -29725, -14352, -10515, -103117, -154311, -99098, -51366, -76696, -53749, -48722, -23731, -4047, 16454, 10433, -29868, 5611, 7095, -58462, -55631, -49557, 14734, 24807]
11995B4807J9480n1317k3547P356L8885l2382l1084k7303m1590k2882R49M4247
11983i4381J8533r562K9320N6746M3193N416j3264K1172n7188J507n0939o7927
11971a17374j9428O1121K1974Q1461m9013l3088O528O3143j55k6413k8688Q36
11959c9096J5029N6345L4722j2510L9933j839k4463L0425j2152m0030o1887L0539
11947A5016R5033Q559j4945j9706k1344k3055J6928K231k8447m2558n3117K1745
11935d3660M1949n3016j554R5992k907j5419j2011k0401K142r574k1185j1172
11923e0816M8895K1626q1780K6051J1365o3455l0663M2591Q858Q7287L108o381
11911A6686m0328n0554L3240L2148k0996l2568M214L1041j6872l6141k9289N4634
$$ y = [24807, 44287, -7030, -30577, -23221, 15664, -16718, -47802, -75105, -116695, -139577, -138628, -94381, -75848, -85410, -56090, 656, 43849, 49265, 36001, 57173, -15, 1492, -49447, -117374, -136802, -75681, -53707, 27754, -21259, -54347, -47819, 15324, 15169, -11244, -39932, -39096, -24067, 32278, 67000, 54490, 94423, 92584, 68121, 98546, 86394, 46364, -15523, 15016, 110049, 118608, 103663, 83957, 62613, 39558, 56486, 58717, 30270, -12288, -65405, -43660, -1711, -54727, -56281, 39711, 36804, 21385, 9374, -11027, -8885, -18459, -39644, -50816, -1921, 19705, -62075, -36024, -24659, -88114, -118777, -76186, -67328, 19959, 23067, 16686, -23642, -74196, -40956, -8808, -29804, -62372, -58158, -27117, -43989, -80130, -109419, -54785]
11899e4785N9652N3686J4301k7315j3035k9486l483k8631p046l2264M0904k1695
11887d9197J7635l5041m1572j0802m971k0251L0623J1784L8208K228M0642m964
11875b5678j7846k0738P7063l356o6934N352O0951j8792j02886L0165Q3701J3326
11863A4328k1644K1959j3382r0388p910M4938N3989L8136n9311n4120m9446l6823
11851a59674J2864r766O9982N3598K4467J3586n1922J4105N3514j892K7070J3753
11839E9685j3772o562l8119l3252l3069J560L0583L962k3571j6944L4069L6894
11827A464O1962L0504O1112M162m9904o3453k6576K7620J6379p856p847N7013
11815A04580J7169n2700o3892l5604n2891K783k0125P628L5463J2903K1644K0081
$$ y = [-54785, 4867, 58553, 72854, 45539, 32504, 3018, -465, -29096, -36142, -68406, -27502, -49197, -31562, -66603, -108175, -118977, -123948, -144199, -113576, -101792, -63584, -61356, -20714, -25678, -43524, -64262, 12801, 9445, -57489, -52137, 8814, -9978, -112864, -82699, 1002, 14328, -7316, 14643, 1261, -89127, -97037, -52099, 1890, 40026, -19285, -73405, -122851, -159674, -146810, -156576, -86594, -32996, -8529, 5057, -46865, -32760, 20754, 18862, 45932, 59685, 45913, 39351, 1232, -32020, -65089, -63529, -32946, -28984, -52555, -69499, -35430, 1464, 63426, 93930, 155042, 159204, 109300, 45847, 19271, 46891, 63270, 55414, 47567, 104580, 121749, 69049, 5157, -30447, -83338, -80555, -100680, -93052, -57589, -44686, -23042, -2961]
11803b961O1084J8620n7510n4679k1123L3911J9355j2117M747j2629J6511M6901
11791D0110O972m354P216j09635j2281J1430m9218k2591l5941Q9769R6072M3252
11779F0801n4922k7554K6695l2672k5682J9224L0384m082K7921l0709k0266q433
11767c9295K9815R927M0200N6739L0012p8045l5853k423m7399o815O4971j8957
11755B877k4692M4850J7320J5290j6071q7405J587K8699J1126j5005J667k960
11743b2717L8985l11j5420K2242j5109p2782j4167R0876J2637j4462r119J0066
11731A0719R762J7794j9630l6549l6582l5216j554K5982L8286j1576k5509K8118
11719c5955K3941k0143K0345R2942L1076k934o1445k2280j4469L1501k0587l7405
$$ y = [-2961, 58123, 76743, 19233, -35446, -56569, -22658, -3303, -15420, -10673, -23302, -6791, 40110, 47082, 42728, 49944, -59691, -71972, -60542, -109760, -132351, -168292, -78523, 17549, 60801, 5879, -21675, 5020, -27652, -53334, -34110, -3726, -7808, 20113, -10596, -30862, -39295, -9480, 447, 40647, 97386, 127398, 49353, 13500, 11077, -36322, -43137, 21834, 2877, -21815, 23035, 40355, 55645, 39574, -47831, -46244, -17545, -6419, -21424, -19757, -22717, 16268, 15957, 537, 22779, 7670, -65112, -79279, 11597, 24234, 9772, 653, 10719, 20481, 38275, 18645, -17904, -54486, -89702, -91256, -65274, -26988, -38564, -64073, -35955, -12014, -32157, -11812, 81130, 112206, 109272, 47827, 25547, 11078, 42579, 21992, -15413]
11707a5413l1875J6925M9862L3788k5603n472l8280q742k8725L6465N8734n9404
11695a7740j1658L4855N4259M6453m9815K377j143j3474k4839l8069l4457L2326
11683b0925N735L7096O7959j9259L516m6658k2397K3478L9724m4449l8882Q391
11671f671n1265k5975R359M6661M3851j6325l0239m1223K9092K5552j1384q24
11659b9391J3896P3672J7097k9729j0683k991k906j4816k5964q1908O578J8814
11647f8331J1954O489O8198N0726j7686J8259L1469o0526m3924k3259m486M5179
11635A4062L0034p2341m1089K1361K1992k5584j4488q4l4855q137P93L3880M5518
11622b8938L9145R737l8131m4940M6357n967k7916L3957q891J4131R991J5933
$$ y = [-15413, -47288, -30363, 19499, 53287, 27684, 22212, -16068, -24810, -53535, -17070, 41664, -17740, -29398, 5457, 59716, 106169, 56354, 58731, 57588, 44114, 19275, -18794, -53251, -20925, -15190, 21906, 89865, 70606, 74122, 27464, 5067, 28545, 68269, 23820, -15062, -6671, -57936, -83911, -74552, -27891, 15960, -365, -30604, -71827, -42735, -17183, -28567, -29391, -15495, 58177, 75274, 45545, 34862, 31871, 28965, 14149, -11815, -93723, -87145, -68331, -56377, -49888, 18310, 69036, 51350, 69609, 101078, 40552, -3372, -26631, -31117, 14062, 44096, -28245, -69334, -47973, -25981, -51565, -66053, -66137, -100992, -109129, -108336, -74456, -28938, 10207, 19944, -18187, -63127, -16770, -22737, -50653, -16696, -25587, -11456, -1465, 14468]
11610A4468R802j7716k7605Q389N5254l1039l6098J5904J8440p445r126P0165
11598F3393j3358p0173n4875k6238J426L0997J2971L0533K3615o3193j6744L3881
11586d7765j5447n5388L5008O3017J0797j7357k069Q5696J8659m2748l0468r704
11574g769j519j0317j0579j7646m4711N8565k5334O0406K621j4976L8625o0268
11562c2902q9218J2043L0699o376L3858o959l5243Q293j7431L4937N9032N416
11550c851K8006M0626n1140j5357m9403k0919j7225O7878k331j9944L8417R7952
11538I2709J358n5226k6796k2552M3687l5499p9701m0780Q0848N5206N7348p6283
11526e681l9554R842J5618p721k9113P2988N6604n6431p5453P0622N3038l8978
$$ y = [14468, 24270, 6554, -21051, -12662, 42592, 11553, -24545, -8641, 9799, 2354, -6772, 63393, 50035, -20138, -75013, -101251, -99825, -68828, -55857, -25324, -1709, -64902, -81646, -47765, -63212, -118600, -83592, -20575, -9778, -27135, -29204, 56492, 75151, 32403, 1935, -7769, -9288, -19605, -30184, -47830, -92541, -33976, -59310, 1096, 3717, -11259, 27366, -32902, -122120, -110077, -79378, -85754, -51896, -58855, -94098, -85805, -103236, -68299, -9267, -3851, 24155, 64781, 13641, -1716, -51119, -72038, -89263, -21385, -23716, -43660, -5243, 92709, 94067, 38841, 12045, -10507, 33180, -2319, -82020, -122800, -41952, 13254, 70602, -5681, -45235, -35393, -19775, -27496, -56609, 16379, 72983, 16552, -58901, 11721, 64759, 25781]
11514B5781o8273l9107K4440M960P1152N6714J1109o6398k2122k3879l8592J2892
11502e1323M4278K350l9256J0720j7381K5093J5007n8254n4565L9065j6709L7994
11490f2981K8559l7945O7961N8244L3415k2493o3619o275l8116N1196K8120K1345
11478E7411N2030q9977j20988k0376r758K0399L4796J35416K3732o2294k8959
11467h568J995J6551n484n957K4574J9880m2207K5882K9949j2088p6687L8019
11455E859K9715P088j204o403O6253J3875L0053J5947J3255k2345R612l094o5974
11442I2637j15348J6589L0538j3265k7239k2340Q572K1019l0405J4758j7686l2005
11430g4175k0068k3841j368K0659k3898L6476K1969J9237L0076l1731j5510N6488
$$ y = [25781, -42492, -81599, -57159, -52199, 18953, 75667, 86776, 20378, -1744, -25623, -64215, -51323, -7045, -4695, -43951, -33231, -50612, -25519, -10512, -68766, -123331, -84266, -100975, -62981, -34422, -72367, -4406, 53838, 87253, 64760, 1141, -5134, -43250, 7946, 36066, 57411, 109441, 19464, -101524, -121900, -131658, -111259, -76463, 58953, 82685, 20391, -8568, -6573, 9978, 4494, -1463, 23111, 42991, 784, 26666, 56615, 44527, -32160, 5859, 35574, 42662, 41458, 35055, 101308, 115183, 145236, 161183, 174438, 152093, 161705, 158611, 92637, -22711, -6122, 24416, 11151, -16088, -38428, -29856, -8837, -39242, -24484, -42170, -74175, -94243, -118084, -119452, -98793, -122691, -86215, -64246, -45009, -14933, -46664, -62174, -5686]
11418e686M6840O352Q050l1120k0963p3855L4630r416m3501K257J4161P5243O342
11405I334o0511P377J9674O1900J0623o7802j1037M922k1139j024l923R010N4726
11392A2130m4568l432J6434N5249L4278m3167n5580M4374K9622L3980p539n8019
11380A3762K5456K6781m0316m7439q666m0728k5254J2793O1139J7579J8120J4650
11368B7877j7261m6152R689J141M2859k161k8008k5373K1668p723k567M2295l2389
11355a6105m1612M1077L0182o9287J7676N1318L9514l7808m9372l715m0197p1617
11343a49946j8671K6664L0329M4788L3847j2000L2808j1296m8373l9259O0232
11332e0877M1067o547j6039l0318O092M3938L8110M799J7890l5450j7653K6170
$$ y = [-5686, 41154, 47506, 55556, 24436, 3473, -70382, -35752, -45168, -88669, -86412, -72251, 2992, 9334, -51177, -43800, -24126, 37774, 48397, -19405, -30442, -25520, -46659, -47683, -51606, -42596, 12130, -32438, -35870, -19436, 35813, 70091, 26924, -28656, 15718, 45340, 79320, 71781, 13762, 39218, 65999, 25683, -21756, -30422, -71150, -96404, -83611, -22472, -4893, 13227, 27877, 10616, -35536, -25847, -24706, 18153, 15992, -12016, -37389, -15721, -23444, -26011, 16284, -16105, -57717, -16640, 13542, -55745, -38069, 13249, 52763, 14955, -34417, -38132, -78329, -149946, -168617, -141953, -111624, -66836, -32989, -44989, -12181, -23477, -71850, -111109, -50877, -9810, -16357, -32396, -62714, -56622, -12684, 25426, 30225, 48115, 12665, -4988, 21182]
11320B1182p522P667L1870l3147m7855l7534k5506j9344n225M840M5662n1892
11308a16804R8621J7177p6143J7964j2303j5235M6897m8141m7791m21Q0413L5833
11296a9933J5409M0136K550j0689r942K688o8433J0407M981l0651N0106K3701
11284A0330l8866o2984l2048l053L9197k9200L0273L6293K5261l1581M2333O09
11272a3436n4496k227M5648P301L9294K4486q3j8854j1560P3817n2527n0745J5244
11259A862K1261l6767J5500k0136k7196m9579J9567N7451R946l3037N3152K840
11247A4864q2498j5194R75L8822K626K7773l045j9022p5019N6991R0585Q73k7134
11234A1597J0693P606k6558r046J6065j7950m2253N1614L9725r634k2549o8479
$$ y = [21182, 13660, 21327, 53197, 20050, -27805, -65339, -90845, -110189, -115414, -110574, -64912, -116804, -18183, -1006, -77149, -59185, -71488, -86723, -39826, -87967, -135758, -136179, -55766, -19933, -4524, 35612, 38162, 27473, 17531, 20219, -48214, -37807, -32826, -63477, -13371, 10330, -28536, -91520, -123568, -126621, -87424, -116624, -86351, -50058, -24797, -56378, -14045, -13436, -67932, -70159, -24511, -17210, 22084, 46570, 46487, 27633, 16073, 89890, 37363, -13382, 1862, 23123, -13644, 1856, -18280, -45476, -95055, -75488, -18037, -8091, -41128, 12024, 14864, -67634, -82828, -81853, -43031, -40405, -12632, -15677, -34699, -109718, -52727, 37858, 38731, 11597, 22290, 29896, 3338, -5708, 10357, -7593, -49846, 1768, 41493, 31859, 9310, -59169]
11222e9169k9370m3514L7016K9244J3789L5010J5545n1558R011L2271L9152N4151
11210H1578K088q2196J8308J3355L6860r074M290K425m6162q6662k3104J079P6234
11197a0981P853j4597o6311j8760Q9813M5449L7488j9175p0309l2807K5092M174
11185b3071o4891m882L277k418J5742J8608M7384L7196j5697q56K5276Q093n734
11172C8027j1894m699r863k963J1983M0962N6695m9056n1147m1373r389M5049
11160A2332J0203J2462k1584o095l8925l6536j1227J1058K7531J7021L0121J5006
11148B1367M655o272M1572j8143l8302j0932j3968k8607K2201j7800J7638J4991
11136a1600O772j920N263k2940l7191j6200j0411j3701J9940J3667K1044M6148
$$ y = [-59169, -88539, -132053, -95037, -65793, -52004, -16994, -1449, -53007, -43996, -11725, 27427, 81578, 83666, 1470, 19778, 33133, 69993, 60919, 65209, 67634, 21472, -65190, -88294, -87215, -10981, -3128, -17725, -84036, -102796, -12983, 32466, 69954, 50779, -19530, -52337, -27245, -23071, -87962, -92844, -89567, -91985, -76243, -57635, -10251, 26945, 11248, 10392, 35668, 43761, 38027, 26133, 21434, 11571, 8608, 20591, 61553, 118248, 69192, 18045, -23328, -32717, 12332, 22535, 34997, 13413, 7318, -31607, -68143, -79370, -68312, -40781, -23760, 6361, 21367, 26022, 19750, 61322, 43179, 4877, -6055, -20023, -48630, -26429, -44229, -26591, -11600, -4828, -6748, -1485, -24425, -61616, -77816, -88227, -101928, -81988, -68321, -47277, -1129]
11124a129j5886L3603L1349j1136o2423K6874O4390n9916k6328k126M269O0712
11112D2253J970l9886J3086j5434k1437K4696k909k3668k1915k2589l1495L5893
11100f1435K7849J516q812k3875M7729L3781J5170l5343k0923J0538j8943m1531
11088g4279j5607L0154k7431j5241R614L0017K8978r739k2548k0493n57K3918
11076f3214k9541m639R079l79J0800L5171j8037k2408j2216L3021K7631M5528
11064A0796k650r7824k8365M0438k59K818L8205j8178n89l8445J1663J4983J3859
11051e3548O277L6905J0084q404j8248j9777N366j0297Q3264Q89n9177L1298M9569
11038E4201l89n1225k2886K6461O250K5186M359Q307p2211k6202M5956K5195J8753
$$ y = [-1129, -17015, 16588, 47937, 36801, -25622, 1252, 65642, 5726, -20602, -22728, -18459, 42253, 44223, 4337, 17423, 1989, -19448, 5248, 2339, -21329, -43244, -65833, -97328, -61435, -33586, -32070, -40882, -64757, -17028, 16753, 31923, -3420, -24343, -13805, -32748, -74279, -89886, -59732, -87163, -102404, -92790, -62773, -33795, -43534, -66082, -86575, -87132, -63214, -92755, -97394, -88315, -88694, -77894, -42723, -60760, -83168, -95384, -62363, -34732, 10796, 8146, -89678, -118043, -77605, -77864, -75046, -36841, -55019, -55608, -94053, -82390, -67407, -53548, -47271, -10366, -282, -8686, -26934, -46711, -41345, -51642, 31622, 32511, -26666, 4632, 54201, 53812, 2587, -20299, 6162, 12412, 37598, 41957, 50264, -21947, -48149, -2193, 23002, 41755]
11025D1755K0197J6752K7401r423M4366M2410n9233p8714k0704n762o2148l6504
11013g9607k547P3360M9104K2577K7195o1543m6232M181J11812R0390n7006j1095
11001A20589o9633J5544j6915l8182n027J4768n381m0866m8967L575n601K3970
10989e2126M9431k0430p6024L7680L6055M2112R239K0990N1313N679m4170q1714
10977b1965k0180m4703m5421J7465Q2853K1396L6548J2667R725m9261l8771k6857
10965f6504j8118P5468P2280P389j4319q3961j2738J1567R256l7515l1825n1917
10953a40937N8580L0286m1129k1536O7648K6129L2873k8929l8750J477r542J8386
10941d5444J9677L2610L016q3973l6541L1694O0248k926m994m5121j9820K9291
$$ y = [41755, 61952, 78704, 106105, 96682, 141048, 183458, 124225, 45511, 24807, 19045, -43103, -79607, -82154, -8794, 40310, 62887, 90082, 28539, -17693, -13512, 98300, 188690, 131684, 120589, 50956, 66500, 49585, 11403, 6376, 21144, 15763, -25103, -74070, -70495, -76096, -52126, -2695, -23125, -99149, -61469, -25414, 16698, 25937, 46927, 98240, 103919, 59749, -21965, -42145, -86848, -132269, -114804, -31951, -10555, 25993, 38660, 48385, -876, -39647, -66504, -84622, -9154, 63126, 70515, 56196, -27765, -40503, -28936, -19680, -57195, -89020, -140937, -82357, -52071, -93200, -114736, -47088, -20959, 11914, -17015, -55765, -54288, -63830, -45444, -25767, 6843, 9859, -74114, -110655, -78961, -18713, -21639, -26633, -71754, -91574, -62283]
10929f2283K0645k7416l1417r936K3059l2888j5210R8892L9715K6882K8050J6004
10917G4097j2374l6550K07n981L3252R393O933m3539j7109k5155m0965M7107m5558
10904e6242M6298j6998j4857O0886J8589L1581J3712k2935j7889l4289O1j42j6638
10891h863K2091j333J5819J5470l9714m0847M5546k3954L142j7841m8805L8146
10879d1143J1240k762m7824N7140O1936k8005q717r881J4475j1348M2032m461
10867C2682k0855Q859J6035l8658j788p027j3120Q868J5029j17J8834M1793K5853
10854H6388j8408p0434l6233K6337N0073m783J1922k246K7652k2137n0984M0486
10842C7633L0480r5483q9586M2347P5356j3291k6003J5130k8904k9481J3820P278
$$ y = [-62283, -41638, -69054, -100471, -110407, -87348, -120236, -135446, -36554, 3161, 30043, 58093, 74097, 61723, 25173, 25380, 19399, 52651, 62044, 68977, 25438, 8329, -16826, -57791, -10684, -56242, -9944, -26942, -41799, 19087, 37676, 69257, 82969, 60034, 42145, 7856, 7917, 7775, -8863, 13228, 11895, 27714, 43184, 3470, -37377, 8169, -15785, -12643, -30484, -79289, -41143, -29903, -32665, -80489, -23349, 38587, 10582, 1865, -8016, 6459, -4889, 37143, 32682, 11827, 20686, 36721, -1937, -3725, -10752, -23872, -15004, 25, -92, 18742, 60535, 86388, 67980, -2454, -38687, -12350, 37723, 32940, 44862, 42616, 70268, 48131, -2853, 37633, 68113, -27370, -116956, -74609, 747, -12544, -38547, -23417, -52321, -81802, -67982, -60704]
10830f0704m309P2748J8156j2920K9425K8338j1464m82n2642j2521K6513P0173
10818I0311n5618N8338l0227k2120J8291K0394p938n0042n0180m168J7175N590
10806a0194j5056K8290M2978K5419m8221k8661r643o036K258K2787k8715L69K5690
10793A265P314L6957j0381M5035j487K857O3962j1719j02837m8718k2747r155
10781d9654L1819k5866q2029J6562M2538q396K8369N7675K2267L3615l3624j1130
10769B2146l2422K9384K7671k0412m2115j4227K0450J4766J0911N4096K2196n4675
10757C7769o6K2556J7494m6183n9021m217N2642l0860j6193J7402J6161l441l3348
10744b9305K7603L7583p337L0893k9028p9091n691J265K3556l4975k9003K8946
$$ y = [-60704, -65013, 7735, 25891, 12971, 42396, 70734, 59270, 58788, 6146, -6375, 20138, 90311, 34693, 93031, 62804, 40684, 58975, 79369, 71431, 21389, -28791, -32959, -15784, -10194, -25250, 3040, 46018, 71437, 23216, -5445, -15088, -21124, -18866, 3921, -24794, -24425, 1265, 8579, 45536, 35155, 80190, 78703, 81560, 145522, 133803, 30966, -17752, -40499, -49654, -17835, -43701, -125730, -109168, -66630, -75026, -46657, 11018, 33285, 66900, 33276, 22146, -10276, 19108, 46779, 26367, -15748, -29975, -9525, 5241, 16152, 70248, 92444, 37769, 37703, 60259, 77753, 31570, -27451, -31668, 20974, -9886, -26079, -8677, 7484, 4043, -29305, -1702, 35881, 28544, 59437, 30409, -48682, -54373, -53108, -29552, -64527, -93530, -64584]
10732f4584L7117O188O971j7246M717J9067l7173j4437n3446q015O8662K3874
10720b8305M4783K6017m3619m2121M8764k8434j9840M7570O7349m1815m1230J0412
10708d69k1169k3202M3807n030m6323O0246Q3878L0980n1737o4981n3530L7493
10696a0037M0140N0836k4645n4949l7160L0532L4951L2202j0275P136J789N137
10684F5657k3764Q8n7283j7110M3550P163n598K1145k8209k8837p3296J141K0212
10671g5141O7302Q7277J3805o2793j2917k2934l3138l17N5430J1908j6498L0018
10659D2002K9269m1107o3139m6300o5738n3608J0543M9572M0840N8276K8536o319
10647a7173k0610o2814l738P3279N926o178K0796n941m7476M908K0732K0257o1612
$$ y = [-64584, -27467, -21279, -14308, -31554, -26837, -7770, -44943, -59380, -112826, -120841, -52179, -28305, 16478, 42495, -1124, -43245, 5519, -22915, -42755, 4815, 72164, 30349, -10881, -469, -21638, -44840, -1033, -6063, -52386, 7860, 91738, 122718, 70981, 6000, -47530, -10037, 30103, 80939, 56294, 1345, -35815, -5283, 29668, 61870, 51595, 58731, 60520, 65657, 41893, 41981, -15302, -32412, 11138, 18301, 12703, 33848, 5639, -23198, -96494, -95353, -75141, -7839, 79438, 93243, 30450, 17533, -5401, -38539, -38856, 16574, 28482, 11984, 42002, 71271, 30164, -32975, -79275, -145013, -198621, -188078, -138506, -97666, -39390, -10854, -17173, -37783, -100597, -104335, -31056, -25130, -31308, -10512, -16453, -63929, -59021, -38289, -18032, -79644]
10634g9644r104M7731M7208J0887J394P4123k7563J4241q712n5506l563k5909
10622a4417M1010j9872n5388m421K9227j6628Q0685n0727n6828l657o521N759
10610g1778K9835K4628J6093L709j8447L6618J8546p0770p1391L2637N2444J8201
10598C25k2200n111k0350q4018l216N2653J7465L0823K6728o67k175l172J0735
10585b180m0120p2821l730J9423j1975R382K6364j649n2338O1549N01N763m9903
10572a11734R219Q7038J07912k6286q830l8720m3631k587k0117o5858J061L9114
10560g3419Q681m1253l5294M2745O3099j3996o8858K1833L5248L198j7498n4851
10548a30365j4321M37l4471L1777p438j972l3697N028O5936J4179N430K807N4764
$$ y = [-79644, -88748, -41017, 6191, 17078, 18472, 92595, 65032, 79273, 70561, 15055, 11492, -14417, 26593, 6721, -48667, -53088, -23861, -40489, 40196, -10531, -67359, -71016, -77537, -71778, -41943, -17315, -1222, 2487, -15960, 20658, 39204, -31566, -102957, -70320, -17876, 325, -21875, -26986, -47336, -131354, -134570, -81917, -64452, -33629, -6901, -7568, -9743, -12915, -2180, -42300, -115121, -118851, -99428, -111403, -102021, -75657, -77306, -129644, -68095, -67594, -61831, -111734, -102515, -15477, 92435, 66149, 57319, 18599, -25032, -27619, -47736, -113594, -112533, -73419, -64738, -105991, -141285, -98540, -35441, -49437, -118295, -96462, -61214, -58016, -75514, -130365, -144686, -144249, -178720, -146943, -154381, -156353, -190050, -185022, -119086, -104907, -99477, -96670, -41906]
10535d1906k7105l005n996J6079L824P168j8735l4480Q975K317J598M717K4979
10522f1570J03403l3609j2550P202L367R873l3096l5656J689p907Q199O4065q407
10509E003L1352m682j6081m7022j9036K1986k9329N6350k66l6669l9797l3749
10497a11940j2771Q2984K1578l1836l518N3055L7023P2980J678j01222Q986o861
10485A0136l7056q625j9609J506J9836K5820J6838L3200m544K431J5595p177L8094
10472H6445M117K3577r495k8239j5332J9622l0450m8156j197j4720j1280o4721
10460h9829K3021K0200M5221N810m9849l5466m3739o591r625R423J1645L4586
10448h5193O413J1374L737n122o0885K6135P2663l776r3667n4215l0682K6487
$$ y = [-41906, -69011, -72016, -78012, -61933, -58109, -50941, -69676, -104156, -95181, -92864, -91266, -86549, -61570, 41833, 8224, -4326, 2876, 6243, 16116, -16980, -52636, -50947, -58854, -50655, 13410, 5003, 36355, 31673, 15592, -31430, -50466, -28480, -57809, -1459, -1725, -38394, -78191, -111940, -124711, -41727, -20149, -51985, -55503, -2448, 34575, 107555, 109233, 8011, 16997, 10136, -26920, -35545, -55154, -53648, -33812, -7992, 8846, 42046, 37502, 39933, 55528, 48351, 86445, 90562, 114139, 104644, 76405, 61073, 80695, 50245, 2089, 892, -13828, -25108, -89829, -66808, -46608, -1387, 4423, -45426, -80892, -124631, -131222, -140847, -131424, -119779, -85193, -78780, -67406, -63669, -68791, -129676, -103541, -30878, -34654, -128321, -182536, -213218, -186731]
10436a86731J7782M8874L5013P3409M796k0409K408n750m2991l985K1295N2016
10424d273k8082k3870L8450M6989J846J1906l3949l0538k0936q503m0218J8364
10412g2814N5060P175J9409j4490L8918N1902k1091j8656o3602n6607j1898k699
10400h9393j3777n0420n5998K0002N1051J7852L7053N3002M176k2449Q5096j1431
10388B4764j174N7824k421o9704k7081J6764K8728l892J6233J8148j07200p3024
10376a22035P6394P6915N9113o285p5633k7209J8822N990M734k943m0972j2049
10364d5158J5069J1364J9022J9336M1773l9130m5814l117j0605K2579Q1883j1158
10352E6044l7810K9731k1644n8892k8138l5381j1354R371J074k4651J4295j7315
$$ y = [-186731, -168949, -120075, -85062, -11653, -6857, -27266, -24858, -30608, -73599, -77584, -56289, -4273, -32355, -56225, -17775, 29214, 31060, 42966, 9017, -21521, -42457, -50960, -91178, -72814, -17754, -10579, 8830, -5660, 33258, 85160, 64069, 45413, -18189, -74796, -86694, -89393, -103170, -153590, -209588, -189586, -138535, -120683, -83630, -30628, -26452, -48901, 36195, 24764, 23590, 81414, 78993, 9289, -17792, -1028, 27700, 23808, 40041, 58189, -49011, -122035, -45641, 31274, 90387, 84102, 8469, -18740, 82, 6072, 10806, 7863, -33109, -45158, -30089, -18725, 297, 19633, 61406, 22276, -23538, -26655, -37260, -14681, 67202, 56044, 18234, 47965, 26321, -32571, -60709, -96090, -107444, -98073, -96999, -121650, -107355, -124670]
10340a24670O336L3534O5012k9611k8192j3669J6856P5145K390k4665k4255K5050
10328b0739O1679J0869m0887j771k9573L6832N8643j04804k4585N8804j6498k662
10316a4692J2413K3938k9031o0808J2601L7407M9569n9587n7753j028J3029J904
10304g2038P6641L0556k3012q5o163j3683j5862o157m1118K848J5374j1281m0373
10291a04353R430N6198N1212P316o557j2743j4397J1095m349K7303k9653L923
10279e575L1240L2280r565J9182K0883K6150j5223k8097M0781j2l8490k5258o486
10266D1810j6404k2499j1258K4992k4504j4234J7662Q184n5641k2893l6941O6151
10254d5575O8508O557k0463p885O0707K7826p9045K979K1085l1245j2482l3760
$$ y = [-124670, -118334, -84800, -19788, -49399, -77591, -91260, -74404, 741, 3131, -21534, -45789, -20739, 40940, 51809, 10922, 9151, -20422, 16410, 75053, -29751, -54336, 4468, -12030, -14692, -2279, 21659, -7372, -68180, -55579, -18172, 31397, -28190, -85943, -86971, -73942, -72038, 4603, 35159, 12147, 12062, 5899, -7784, -23646, -29803, -70921, -68073, -52699, -63980, -104353, -94923, -38725, 12487, 19803, 13246, 503, -13894, -2799, -7148, 20155, -9498, -5575, 25665, 57945, 48380, 67562, 88445, 114595, 99372, 71275, 112056, 112044, 73554, 48296, 41810, 25406, 2907, -8351, 16641, -7863, -22097, -4435, 3749, -51892, -74785, -111726, -45575, 22933, 29490, 9027, 1142, 61849, 89675, 10630, 13609, 34694, 3449, -9033, -42793]
10242d2793j5357n0127k0712Q9145Q8602p721Q093j1318m662l333J7827k4192
10230B3452m0069m8185O2140m4099p1100J0592J6727O0415J3571M8582J0881n0510
10218g603Q642J5156J3927N8451m5483j01475k0946k872r801P038J4967K1815
10206d8184n878l4667K4237P0408N629n6111l1792L7112L2383J3476l2137n0706
10194g6230N530L4769J9276J4699L3369M2348K3029k3363m872j01399n2242l12
10182h5398K4298K0463j4003M863k4760k3367M2537L3552J0872K752M843N2614
10170D9266M167n858P0761q262o8274k0858l216K9390j2281k7861j7419K9420
10158A8975n7562p1250j6318l0340L4381R5465o826k8359M7463N5799n7345o2164
$$ y = [-42793, -58150, -108277, -128989, -39844, 48758, 41037, 49130, 37812, 33150, 29817, 47644, 23452, -16617, -64802, -2662, -46761, -117861, -107269, -90542, -30127, -16556, 32026, 42907, -7603, 1039, 16195, 30122, 88573, 43090, -58385, -79331, -82203, -92004, -84966, -69999, -48184, -54062, -88729, -64492, 5916, 11545, -44566, -76358, -39246, -6863, 6613, -25524, -76230, -70700, -35931, -16655, -1956, 31413, 73761, 96790, 73427, 68555, -32844, -85086, -85398, -61100, -40637, -54640, -49777, -74537, -97904, -55367, -21815, -10943, -8191, -3348, 49266, 53433, 47575, 118336, 110074, 41800, 20942, 17726, 47116, 34835, 6974, -10445, 18975, -38587, -109837, -126155, -156495, -122114, -26649, -33475, -61834, -14371, 41428, -15917, -78081]
10146g8081Q037K3408O8288M4253k8304R742J3923l630n064m7171p1011n913j18
10133g1641L3066J8123j2120O485K45o9832l8589M4400M9150k809J2674N2345
10121B1497K53r508K3311j6721m9695m435O896p4829k1271L915R5623J9625K196
10108c143L7918k1280q3043K3659J6337p6325L1685J14J0422N114l853Q4932M7848
10095G0385n4041r4616L7782P5556l3844l3040l7952M647L8373N7969K3903j7561
10083C7561M720L0339N3711K6420j5679l8126K1437m2292m9256n0534k3210m54
10071d5363j6995J5611M3115M5853J3018j9791P854j1914k944p328m069m180P724
10058B0591O0402J00098k8615o7376J3158M0129J8504P1135R9548Q8968Q1102
$$ y = [-78081, -70044, -46636, 21652, 65905, 37601, 47343, 61266, 57636, 52572, 5401, -65610, -71523, -71641, -38575, -20452, -32572, -26087, -25842, -95674, -134263, -89863, -40713, -43522, -30848, 21497, 21750, 12242, 35553, 18832, -30863, -35298, -28402, -103231, -124502, -120587, -24964, -5339, -3143, 34775, 13495, -69548, -45889, -29552, -105877, -74192, -74078, -63656, -58542, -62395, 22537, 70385, 16344, -78272, -40490, 35066, 1222, -31818, -69770, -65123, -26750, 31219, 55122, 37561, 42281, 72620, 126331, 152751, 137072, 98946, 120383, 78091, 28835, -21699, -44909, -45363, -62358, -46747, -3632, 42221, 55239, 35448, 43302, 31388, 28444, 21116, 17047, 12867, 20591, 80993, 181091, 152476, 85100, 98258, 138387, 156891, 228026, 327574, 416542, 497644]
10047D97644J18976J08174J13743o8708k22636j79478j34238o8840k2461O9014
10037B11190j6419r5671J1616J8051J3349n7975L820J8563o4119J428J71l213
10025D0791j2026M8431P467m136q534k0487k1957o760L8598l18k0814k2075l0981
10012a2801j4376m422q205M0975P096Q153k3360L8292O3185k5423k2111p030l1657
9999H316k4680K5236j1866J5984j057K1630j2635l1729L7033n0790P2597O9308
9987A17347l3469q7059N051L5552M6745l878k2713m5892j6676j0031J9898N2761
9975E7636M9087n0835p9253L6181L0769K1802N7411N5635n8235p5834r057r1365
9963e6058o4904J5181O4148K7465L7371n0206R941m601j1453L8366M1565n2805
$$ y = [497644, 616620, 724794, 838537, 769829, 547193, 367715, 233477, 164637, 142176, 211190, 194771, 99100, 110716, 128767, 142116, 84141, 87961, 106524, 42405, 43833, 44004, 40791, 28765, 77196, 84663, 80527, 71993, 51506, 29549, 22789, 61387, 61069, 40255, 18180, -12801, -27177, -31599, -39804, 1171, 8267, 16420, -6940, 31352, 94537, 69114, 47003, 39973, 8316, -16364, 8872, -2994, 12990, 11933, 33563, 20928, -10801, 26232, -24558, 48039, 117347, 83878, -3181, 1870, 37422, 84167, 80289, 57576, 11684, -4992, -15023, 4875, 57636, 106723, 55888, -23365, 12816, 43585, 65387, 122798, 178433, 120198, 44364, 35307, -56058, -120962, -105781, -41633, -14168, 23203, -27003, -17062, -21663, -33116, 5250, 46815, -5990]
9951e990M323L2815M0087j0392r796j6887J3973n4971L6929Q6566j2609p8886
9939B5162o3023m5065M7115J6325J241J8027J3231J6998O7057M7825k6187o2614
9927E6092o8777N0880J8926r457P221n210L7403K1061N097k2436j6924n1834l6158
9914a4116K5673J7983J1486l1163K0232L9289o419l6553j1967J9734k4172L6943
9902D6950J1130o297k2362m6257o220K1790N6529M7642j0172L6987K7752n4212
9890A03260O316j0961o6549J65L894n0866m674n2557L5000K8743N3460O0112L722
9877A09065l4900m7862o3020J2996l3402L6608K5855Q0902n0787n2299m202k4995
9865d6041l2231N5326M1906L7170M1308O1072n4627o2986l8573J4670k8152j4791
$$ y = [-5990, -1667, 31148, 71235, 60843, 51047, 34160, 48133, -6838, 30091, 116657, 104048, 25162, -37861, -82926, -35811, -19486, -18245, -218, 13013, 30011, 97068, 144893, 118706, 56092, -12685, 38195, 57121, 47664, 54885, 49675, 87078, 108139, 113236, 90800, 73876, 22042, -14116, 11557, 29540, 41026, 9863, 30095, 69384, 62965, 26412, 14445, 34179, 10007, 46950, 58080, 51783, 29421, -16836, -23056, -1266, 55263, 102905, 92733, 129720, 157472, 103260, 109576, 98615, 32066, 32231, 36125, -14741, -19415, -71972, -36972, -8229, 45231, 105343, 109065, 74165, 26303, -36717, -23721, -57123, -20515, 5340, 86242, 35455, -16844, -21046, -46041, -78272, -22946, 18960, 56130, 97438, 158510, 103883, 40897, 2324, 16994, -11158, -25949]
9853b5949L5936L6319J149p790l303O1976m8770m5971K0051l9853k5578N2180
9841A0397K4881m4255k2116K9802m531K154L8929K7997j3722k6045N1649N9853
9829A34993n9858m8672L3779J8319l2718k0826m5757m1141L4324M7164N7684j8184
9817E9107k6963p8255L4054P3225r1493r1034K3069J8795P2711L4658k447k5774
9805c47m010j834m6376K3590J2809m3999K3700K6146l9562m2934J0551N5829L7211
9792A0774J5321j7013n4265j7001J9408M2460n6594m9234K2211L1729J1376m4545
9780h5373l1695k0786k0918K5783k717M7854J55j0364N9029L7143L3140O352K1845
9767E9448o5092r098m7517m9047P915M0023K8359K1335l117j9709K7324J10678
$$ y = [-25949, 9987, 46306, 47455, 39665, 36362, 98338, 49568, 3597, 23648, -16205, -41783, 10397, 35278, -8977, -31093, -1291, -5822, -3668, 35261, 63258, 49536, 23491, 75140, 134993, 75135, 26463, 60242, 78561, 45843, 25017, -20740, -61881, -27557, 19607, 77291, 59107, 32144, -46111, -12057, 61168, -30325, -121359, -98290, -79495, -6784, 27874, 25427, -347, -4357, -6191, -52567, -28977, -16168, -60167, -36467, -10321, -49883, -92817, -82266, -26437, 10774, 26095, 9082, -45183, -62184, -42776, -316, -56910, -106144, -83933, -52204, -40828, -85373, -117068, -137854, -158772, -132989, -135706, -87852, -87697, -98061, -39032, -1889, 31251, 37603, 59448, -5644, -14742, -62259, -111306, -103391, -63368, -35009, -13674, -16791, -36500, -9176, 101502]
9755A01502L8576n1539m2858m471k6606l6858m1662N920K6150j1087J3281J4902
9743a4750L3768M033J6000j1975l5740q229N4494K6771k0764p9333j589J4628
9731b2686K6672r601q9807p05O7454J22272M327m7157l6863k254k2538K7544J4134
9718C0792m1352N9928Q4362m8450j30919L044N3472K8154L3413l5477n4057K6953
9706I863l4609m0052J9855L0853j7779J0888p261J7009k5565j6852O2423P1729
9694H0502J6688n6529p0805n8633Q042N9581j2543n162O650K0069r212n658J5444
9681a1566L9304m088j4943L370K9626K3847L2293M2868l5519p4050p2102N88k0053
9668f0425l4053M5215L7982j7195K4340p012j6177L8045j3369j8055J7946j2410
$$ y = [101502, 140078, 88539, 45681, 41210, 14604, -22254, -63916, -57996, -31846, -42933, -29652, -14750, 19018, 23051, 39051, 27076, -8664, -16893, 37601, 64372, 43608, -35725, -37314, -22686, 3986, -5615, -95422, -96127, -28673, 93599, 97926, 50769, 13906, 11652, -10886, 16658, 30792, -10560, 49368, 133730, 85280, -45639, -42595, 10877, 39031, 72444, 36967, -17090, 9863, -24746, -64798, -44943, -14090, -31869, -20981, -28242, -11233, -36798, -53650, 8773, 80502, 97190, 40661, -30144, -88777, -80735, -21154, -33697, -38859, -32209, -12140, -21352, -27010, -11566, 27738, 23650, 8707, 12077, 41703, 65550, 97843, 140711, 105192, 31142, -40960, -40372, -60425, -94478, -49263, -11281, -28476, -4136, -11148, -27325, 10720, -2649, -20704, -2758, -15168]
9656a5168k2573p3166O1803J6440O965O9119K6950j491n7342Q602O5922k4840
9644F1221k9282m5868n2540k3206J3383Q7663L1609J8878J8253m4236M442M1493
9632H1810n8646P122K473k0296K5884Q2389k0950o5695n242n4935q4652o0830
9620a71568K6112O2980L3107j3980K5924J6916M1300N3871j8519o0384m8077K2266
9608c0052L4970m24P718M413q9513o8456j1129R4095L7851L2169o4096n3991J6188
9595i0257n988k6196J1533J7662R367k9779O5350P8858O8661K440l7143K8336
9583I2844J5590k051r879l9882k9081l5232J6877M546n6907k9557n372J4295N3981
9570i828o998j4430M1250J9982k0449l46K3708r640o8359K8330P6597n7289J5872
$$ y = [-15168, -37741, -110907, -49104, -32664, -25699, 43420, 70370, 68879, 11537, 20139, 86061, 61221, 31939, -13929, -66469, -89675, -76292, 11371, 42980, 61858, 80111, 35875, 40317, 81810, 23164, 30286, 32759, 12463, 38347, 120736, 99786, 34091, 28849, -26086, -110738, -171568, -145456, -82476, -49369, -63349, -37425, -20509, 20791, 74662, 56143, -4241, -52318, -30052, 4918, 4494, 12212, 16625, -72888, -141344, -152473, -58378, -20527, 11642, -52454, -106445, -90257, -96245, -122441, -110908, -93246, -83879, -113658, -48308, 30550, 99211, 101651, 64508, 92844, 108434, 106383, 96504, 56622, 27541, -7691, 9186, 13732, -43175, -72732, -78104, -63809, -9828, -16826, -31256, 9994, 29976, 9527, 9181, 32889, 23249, -45110, -16780, 59817, 2528, 18400]
9557A8400J8108l0961j191K0484j1667K2313l2666l3827P903L9305L7072n395
9545D7878k1526L0642R143k6925K1158O5093J9240o9661m8623j9983n2739n327
9533e1630j8870O729N4071m752L5907k1667K6387P2023r664n5295j2410k2926
9521b097L4936J2199k6363m4620K4659J5786K3478j2806M9088l9288o0042m6383
9509g1453L1561M9954M901j4852l7588J0827O47J6052L0597J9866P963L8590j8998
9496F8067J5635j4276J0442M876k326l8730l8423m6941M1106N2511l1402k5405
9484d866o303l0913L3004P828J7935M1872L7332j427j042J2140p0849K6954j1769
9471D9896l4951M6372K1746m2173j7464k317K5963N286K1452J1789K3884m1210
$$ y = [18400, 36508, 5547, 4356, 24840, 13173, 35486, 2820, -31007, -23104, 16201, 53273, 47878, 26352, 56994, 66137, 39212, 60370, 125463, 144703, 75042, 26419, 6436, -46303, -51630, -70500, -63771, -9700, -14452, 21455, -212, 26175, 98198, 88534, 33239, 20829, -2097, 32839, 45038, 18675, -25945, -1286, 14500, 37978, 25172, 74260, 34972, -25070, -71453, -39892, 10062, 14963, 111, -37477, -26650, -26003, -9951, 20646, 40512, 48475, 87065, 68067, 83702, 69426, 79868, 84744, 82418, 43688, 5265, -41676, -570, 51941, 20539, -4866, -11169, -42082, -9078, -1250, 16685, 58557, 95889, 94462, 93420, 105560, 34711, 61665, 49896, 14945, 61317, 83063, 40890, 23426, 21109, 47072, 52358, 73810, 85599, 109483, 68273]
9459F8273n6874l4313L2k2534q74L9070J8553K2742k5821j7828Q139J7938j3662
9446B841q294M8765m65o1788j04988l0194J4680M7243N2572N1273O8931L9262
9434A19838j2615p0534l6691j4114K7682M0268j5838j4828L1841P857m0030k2448
9422C88k2562k9552Q195L3110L703n4995L7953K24o1736k6339K3375O6804l2363
9409e3795m657P338M6880M5965K0911k6563J3378P1498M6301M0063q5516j0732
9397A11071M2697j6804n5068k1777J083l8955P257N0103L1532K3051j2972n3491
9385F7727n5682L8623J973p4229q252K8919O2472J0686J212o6102n8090O4242
9373A3499L9320o9494L0923P2637O4538J3873n1014q587k0686l8011p5416J5787
$$ y = [68273, 11399, -22914, -22882, -45416, -46290, -7220, 11333, 34075, 8254, -9574, -1435, 16503, 2841, -5453, 43312, 42847, -18941, -123929, -154123, -139443, -92200, -39628, 11645, 80576, 119838, 107223, 36689, -2, -14116, 13566, 53834, 37996, 23168, 55009, 62866, 22836, 388, -22174, -51726, -43531, -10421, -6718, -61713, -23760, -23536, -85272, -111611, -88236, -21432, -53795, -58452, -51114, -4234, 41731, 62642, 36079, 49457, 120955, 167256, 207319, 121803, 111071, 153768, 136964, 81896, 60119, 61202, 22247, 29504, 79607, 111139, 134190, 121218, 67727, 12045, 50668, 52641, -21588, -29840, -921, 61551, 72237, 73449, 7347, -50743, 13499, 52819, -16675, 14248, 86885, 151423, 165296, 114282, 105695, 85009, 46998, -28418, -12631]
9361a2631L6867j011p255m899J3234J7690J9970o085k4921J423R119M7168n0963
9348C7706K9507l4966n4128k9154N5293L6520L5151J6962k0006k087J3251K8694
9336A12743M9816j6103n9707L2585M3889l5235n4315o733K1226M3332M7236K6478
9324B05212n9499j20302K7655K5667m160j7890n0385o9473m4950p924O5463P1379
9312B0793O5325J9735l2287K5737K9225m370L6225J2635l9542L341j0105m6777
9300G9935N8474J9341m5320l1039n706j3304l1869n8168m2400P2260O9465k9750
9288D1919q977J2977m808P3795J7150n7076K978L0503N3966m3266m005j1511Q528
9275A12173K2736l4350j9860l4636j2633O2196N7567q871K268J2418N2728J4375
$$ y = [-12631, 24236, 23225, 15970, 11071, 24305, 41995, 61965, 55880, 30959, 32382, 41501, 88669, 37706, 67213, 32247, -21881, -51035, 4258, 40778, 75929, 92891, 72885, 70798, 84049, 112743, 162559, 146456, 86749, 119334, 163223, 127988, 73673, 66940, 88166, 131498, 178734, 205212, 145713, 25411, 53066, 78733, 74573, 56683, 6298, -63175, -108125, -116049, -50586, 20793, 86118, 105853, 73566, 99303, 128528, 124158, 160383, 173018, 133476, 136817, 126712, 79935, 138409, 157750, 112430, 81391, 75685, 62381, 30512, -27656, -70056, 2204, 71669, 41919, 32942, 45919, 41111, 114906, 132056, 74980, 77958, 108461, 162427, 119161, 115156, 103645, 112173, 134909, 100559, 80699, 46063, 33430, 95626, 153193, 144322, 146590, 159008, 211736, 226111]
9263B26111n7559J3144k3439j9956l0318L6039M3759K8922l7676J8344O3118m4809
9251B15680l5361n14j0674K9666N6655m110o425M524K9193O8727j1272l2116m3986
9238B59987k6557M0852l1872n8428o9162J0583k5708J4423M6896j4850j9516K9295
9226A55943J4234M870j4854J6377N1348K1108N2138L9361L2794J9449l0037k58
9214C62473j4215o5412L098j0597l5942n914P6541O9950L3937M933L086m4171
9202C77767m2903O404L8240L5111M5253l642J523L1702j1510l7337k8169J7435
9190D29874N7482p056l2100N5908N9088K8425j5261J9010O1093K3385L1995L7412
9178G49255N2016j2230J0113P5209N2009K0713N6486N0092L7842Q2702J06479
$$ y = [226111, 168552, 181696, 158257, 138301, 107983, 144022, 187781, 216703, 179027, 197371, 260489, 215680, 180319, 179805, 169131, 198797, 255452, 251342, 244917, 249441, 278634, 347361, 336089, 303973, 259987, 233430, 274282, 242410, 183982, 114820, 125403, 99695, 114118, 161014, 146164, 126648, 155943, 170177, 175047, 160193, 176570, 227918, 249026, 301164, 340525, 373319, 392768, 362731, 362473, 348258, 282846, 285944, 275347, 239405, 233491, 310032, 379982, 413919, 418852, 421938, 377767, 334864, 341268, 379508, 414619, 459872, 456230, 457753, 489455, 477945, 440608, 412439, 429874, 487356, 480300, 448200, 504108, 563196, 591621, 576360, 595370, 656463, 679848, 711843, 749255, 801271, 789041, 799154, 874363, 926372, 947085, 1003571, 1053663, 1091505, 1174207, 1280686]
9167A280686J06181J21910R5696J28206R7311J23938J53504J70575J11142K14137
9157B603286K76303L44261M91591N47711O15612P09959R53910J225444J635764
9148I403841K253489L056440M430574O528495R495695J2652500J3393171J0503424
9140G1717629R161113J0360799O927678q614524k1870481j9214822j2529381p961008
9132B7977003n238861l551379k505303j885779j449915j188499q87038p81273
9124A0488956o33418n13949m79039m92173m36813l37570l28024l11498l39293
9115F617179k68355j85312j47381j86587j62805k51267k22741k05728j60483j35297
9105D691223j88117j67212q1206j16959j45948j87368j67886p6900q5715j39323
$$ y = [1280686, 1386867, 1508777, 1604473, 1732679, 1829990, 1953928, 2107432, 2278007, 2389149, 2603286, 2879589, 3223850, 3715441, 4263152, 4878764, 5588723, 6542633, 7768077, 9403841, 11657330, 14713770, 19144344, 25672839, 35168534, 47821034, 61214205, 71717629, 80878742, 91239541, 98167219, 89552695, 67682214, 48467392, 35938011, 27977003, 22738142, 19186763, 16681460, 14795681, 13345766, 12157267, 11270229, 10488956, 9855538, 9341589, 8862550, 8370377, 7933564, 7595994, 7267970, 6956472, 6617179, 6348824, 6163512, 6016131, 5829544, 5666739, 5415472, 5192731, 4987003, 4826520, 4691223, 4503106, 4335894, 4254688, 4137729, 3991781, 3804413, 3636527, 3559627, 3473912, 3334589]
9095C334589j29870j04753j10656l9853p1622n9669n8243j07563j37398j06273
9085B408689n9731n521p222p5285p4021l6853m7824m5745q5082j07595q9593j15569
9073A658648j6969P5214k0285q3961l0234L4318J0199n7547n1853n4550p2895
9062A390085q8789r0432l8683l3554l9738l1035m0799m2660K4898M455k9968O145
9050I89925J7053p551p2794l6583J6031l3406m59j6012r6958o7440l4320M5766
9038G03252p43k2912J1185k9510J3108k984o8136J821q765J6995L9738q372p6391
9025E68286n2862L3453L9687j5112m7120j8297M6508o552m2560K1435m7463o9755
9013D09648J9510l849j8351K5806n5338l0480P5298J1228l4999k1452k8226j3280
$$ y = [3334589, 3204719, 3099966, 2989310, 2949457, 2877835, 2818166, 2759923, 2652360, 2514962, 2408689, 2348958, 2343437, 2336215, 2260930, 2186909, 2150056, 2102232, 2056487, 1971405, 1863810, 1774217, 1658648, 1641679, 1716893, 1696608, 1612647, 1582413, 1616731, 1626930, 1569383, 1517530, 1462980, 1390085, 1301296, 1210864, 1172181, 1138627, 1098889, 1067854, 1027055, 984395, 1009293, 1013748, 983780, 989925, 1006978, 999427, 926633, 890050, 906081, 872675, 872216, 856204, 759246, 691806, 657486, 703252, 702509, 679597, 690782, 661272, 674380, 671396, 603260, 605081, 596316, 613311, 653049, 644677, 568286, 515424, 548877, 588564, 573452, 526332, 508035, 554543, 547991, 505431, 526866, 479403, 409648, 429158, 425309, 406958, 432764, 377426, 346946, 422244, 433472, 398473, 377021, 348795, 335515]
9001C35515L1509J9102m8027k8732l7809l0462R054n8169N641L6119m5285k0039
8989A68417J9803l4141O6522N6533k0570o3524J0604j7308n1404m2787j6326J5802
8977I1621J0368l469l945P949O0581K4164k7269p024K6452O5378Q082l4855l7511
8964A80522l6683L0552l1277n6345J381N3685M4086L0618K7612O877k5761j110
8952B24157L0082L8158N4888R995M6883J11723j403K8790P9305J3677j13247j15407
8940D07601p7909k2039k0559r3636k0778L972M2207k8667o2156p7465L6633L6147
8928A23351k3639M0674J4747L7587k1091K0045q5455o4940J1915p314P066q748
8916D4198N6164P9665K7674k9598p2751p1141M726R6420m501L1797K5793P217
$$ y = [335515, 367024, 386126, 338099, 309367, 271558, 241096, 250150, 191981, 197622, 233741, 188456, 168417, 188220, 154079, 220601, 277134, 256564, 193040, 203644, 186336, 134932, 92145, 75819, 91621, 101989, 98520, 94575, 102524, 163105, 187269, 160000, 152976, 179428, 244806, 252888, 218033, 180522, 143839, 174391, 143114, 86769, 88150, 141835, 185921, 216539, 244151, 251028, 225267, 224157, 254239, 292397, 347285, 357280, 404163, 515886, 514483, 543273, 622578, 636255, 523008, 407601, 329692, 307653, 287094, 193458, 172680, 176652, 218859, 190192, 128036, 50571, 87204, 123351, 99712, 140386, 155133, 192720, 171629, 191674, 106219, 41279, 53194, 45880, 52946, 44198, 100362, 180027, 207701, 178103, 105352, 34211, 38937, 135357, 130856, 162653, 188446, 195663]
8904A95663p4324q3143j0753L7864O9770R16K9133m5343K7374N4321m4706j7577
8892A39195J0965p254L2916m853N705l9328m2726l8031j4529j0267N2940J3672
8880I8405k9036j5051k1287N7432k104m8769J8359K0085k3455K8827P729K9560
8868A20695j4041L9613j0362J4374q696K3706k3254o977L1802P4143Q727m2010
8856B07720n6919m1696M7337j2616K7200n914J3091l9672k5104m1565L0399P603
8844A09864p491N4229N2401j0181o3597K1819N534l2599j6513o428K4006k9101
8832A01943k411k0268r847K9229J7170J0726K7131K6386l7988j942j218l6858
8820A02053j583o143k2641L4917M5668l8620r593K3191K7465j2508o9268K5419
$$ y = [195663, 121339, 38196, 27443, 65307, 135077, 135993, 165126, 119783, 147157, 201478, 156772, 139195, 150160, 142906, 175822, 170969, 176674, 137346, 94620, 56589, 42060, 31793, 84733, 98405, 69369, 54318, 33031, 90463, 88359, 39590, 57949, 78034, 54579, 83406, 91135, 120695, 106654, 146267, 135905, 150279, 141583, 165289, 142035, 135058, 166860, 241003, 249730, 207720, 150801, 109105, 156442, 143826, 171026, 165112, 178203, 138531, 113427, 71862, 102261, 109864, 102373, 156602, 209003, 198822, 135225, 157044, 162578, 129979, 113466, 107038, 131044, 101943, 99532, 79264, 69417, 98646, 115816, 126542, 153673, 180059, 142071, 140129, 138911, 102053, 100470, 94327, 71686, 106603, 152271, 113651, 104058, 127249, 154714, 142206, 72938, 98357]
8808I8357K5630Q0N1667j8978J330O766l0529j2216j417l6667j9719P404K2650
8795I4358P5771K5766n9999j03991m9223K4040J8762k2935j944N0161J6038k6436
8783D0368j3433k4154j292l4247j4560K4795j1600J2870j3869m796M3168K1923
8771B5173l1517K965M1523P644L1873J4076N020n715L4893l9951o107n405J897
8758G6369J8823j0245P316J4793m232J7140j0632O4677m385k3224j5812j046q875
8745A20667J1878J9961M2199k5510l8912J6172K7689l3060k3001O3007n394K9533
8733B05229l9612J9124k6637m1912J1507L0136n1501M750K2687n6K6469k1366
8721A38818n8724q272N3430O8838K3976o689l2995n2576O9837J01119k2972q2109
$$ y = [98357, 123987, 124067, 175734, 156756, 158086, 164852, 134323, 122107, 120690, 84023, 64304, 71708, 94358, 170129, 195895, 135896, 31905, -17318, 6722, 25484, 2549, 605, 50766, 66804, 40368, 26935, 2781, 1489, -32758, -47318, -22523, -34123, -21253, -35122, -39918, 3250, 25173, -6344, -3379, 38144, 45788, 77661, 91737, 96757, 91042, 125935, 85984, 79877, 74472, 76369, 95192, 84947, 92263, 107056, 102824, 119964, 109332, 174009, 169624, 146400, 130588, 129542, 120667, 132545, 152506, 194705, 169195, 130283, 146455, 174144, 141084, 118083, 181090, 175696, 205229, 165617, 184741, 158104, 116192, 127699, 157835, 106334, 111084, 133771, 133715, 160184, 138818, 80094, 71822, 125252, 194090, 218066, 211377, 178382, 125806, 195643, 296762, 273790, 191681]
8709A91681n6925k1932O4144O7432m0845m2034j3364M4430N0215j9091j6840o4628
8697A42243J2795L7414k3937J5399O8563l7713k1028k4487L3855O324o7417K3121
8685A65132k2100j0331K6188R1621L7260j2786o3221j5666l1365Q110l9268j8894
8673A14680K5342K5976o1721n2006L9706K7379L1029P778N1693r436J1130k8258
8661A83292j0251J977j6598r568m2052R762L421M8906J5738n0M0557J1047j7922
8648B18259l6644K0834N902q755N2027k8326m0454L1896Q4690L1322L7836r665
8636C58922j0481N6621m604o7050k7441M8352m1034l3665m3971n4444J0156L4674
8624B26035j3950J0268J6597n808J2433M0208K6682K3039n7600m9552k98j3319
$$ y = [191681, 134756, 112824, 176968, 244400, 203555, 161521, 148157, 192587, 242802, 223711, 206871, 142243, 155038, 192452, 168515, 183914, 252477, 214764, 193736, 169249, 203104, 209428, 142011, 165132, 143032, 132701, 158889, 250510, 287770, 274984, 211763, 196097, 164732, 172842, 133574, 114680, 140022, 165998, 104277, 52271, 91977, 119356, 150385, 158163, 209856, 200420, 211550, 183292, 173041, 175018, 158420, 148852, 106800, 116562, 119983, 168889, 184627, 184577, 225134, 236181, 218259, 181615, 202449, 208351, 199596, 251623, 223297, 182843, 214739, 299429, 330751, 368587, 358922, 348441, 405062, 400458, 333408, 305967, 354319, 313285, 279620, 235649, 181205, 191361, 226035, 212085, 222353, 238950, 233142, 245575, 285783, 312465, 335504, 277904, 228352, 228054, 214735]
8612B14735P0086L4687J9375n6869M1533L2348p449R7063J29918j5306M177P4219
8600F38517L7605M3895N8368P0687J419j2433J00646M8787Q5482N1903L3987Q5681
8588A244544L031n871j5344k6048j77326j20561o1541o5634o9811p6566k8738
8577F00135l7658n3583o2399m1359J807L1725M0884L0003L642k8779m3387o5401
8565C75630q5301J3249l4128k2463Q1467K7764K3264J706l5381j4702O457r442
8553C28120o0592J1897k1455K1936O1236R866k1063j884R334J9198j1400l8771
8541C06422O5037L6831k6758Q358m5651l5369m5528j2086l6428m0533J7176K8409
8529B19880k9111M3993M0095j8822K0768p331m1377p311N36m3194l9937j1408
$$ y = [214735, 284821, 319508, 338883, 282014, 323547, 355895, 348446, 445509, 575427, 560121, 564298, 638517, 676122, 720017, 778385, 849072, 850491, 838058, 938704, 987491, 1072973, 1124876, 1158863, 1244544, 1247575, 1241704, 1226360, 1200312, 1022986, 902425, 840884, 775250, 705439, 628873, 600135, 562477, 508894, 446495, 405136, 406943, 438668, 479552, 509555, 513197, 484418, 441031, 375630, 290329, 303578, 269450, 246987, 328454, 356218, 379482, 381188, 345807, 331105, 337562, 328120, 267528, 279425, 257970, 279906, 341142, 351008, 329945, 328061, 337395, 356593, 345193, 306422, 371459, 408290, 381532, 389890, 344239, 308870, 263342, 251256, 214828, 174295, 191471, 219880, 190769, 234762, 274857, 256035, 276803, 269472, 228095, 220784, 221320, 178126, 138189, 126781]
8517A26781j1080K3249N2770J2695l5949L376K9482l686J6842k7937K734o8553
8505A20724J7368L5402m6342o4902J6584o168K4659L1048q317N837J6712J6715
8493A59320o429K0483M2133j3539l5211k8226j9611n9670P031N640P111m5543
8481C3489r169M5705M0116L1219P626n591R238q428k3276o9813K4628J6799Q363
8468A00906Q496j413j80j189p4202k0814N6645J878J222k758k9798j8779J0644
8455C0658R976K4948n453J6995k8689J8629P8435J1967l7799L6785n4036p0501
8443C1915j1130J4560m8423L7435N1916k8403Q03k3025K999o774k2726k4185K6030
8430I92p91J0752p593N7844J8979k0605K2851l3144J1189N266o39J2400j4622
$$ y = [126781, 115701, 138950, 191720, 204415, 168466, 171842, 201324, 197638, 214480, 186543, 189277, 120724, 138092, 173494, 127152, 62250, 78834, 72666, 97325, 128373, 120056, 125893, 142605, 159320, 152891, 173374, 215507, 201968, 166757, 138531, 118920, 59250, 66281, 71921, 79032, 33489, 24320, 70025, 110141, 141360, 148986, 143395, 152633, 144205, 120929, 51116, 75744, 92543, 100906, 109402, 107989, 107809, 106620, 32418, 11604, 68249, 70127, 71349, 68591, 38793, 20014, 30658, 40634, 65582, 60129, 77124, 48435, 67064, 145499, 157466, 119667, 156452, 102416, 31915, 20785, 35345, -13078, 24357, 76273, 47870, 48673, 25648, 28647, 21873, -853, -25038, 992, 201, 10953, 3360, 61204, 80183, 59578, 82429, 49285, 60474, 65740, 65101, 77501, 62879]
8417F2879M069k973J2743L3938K544M6525K6617m7059j414j4482j2204j572k5329
8404H4282j972J4758l4864n3967j7025O5528L8943p865p33K8299k1950L803j9795
8391G7442k4600P11L9012L2415k8646m3373J0860L3743J6403K4421L432j1935
8379A29885J1683J1793l1579k0574P870l8655j0896K1002j321L5078P842j7899
8367A04229L851r515o6601L6100R946l9966O884K6782l877k9180n6494M2398P663
8354C2220N8469j4197j5486j9087J0966j65k165l6850l831L1016K7770J9016M791
8341I2467k8545k41k953P9713M7588j684j6096l9719m8547O2271K820o1278j5945
8328F9851j2976K4053l4510o5515K1588K5399J5529l7165K0258L2185J545N8278
$$ y = [62879, 66948, 63975, 76718, 110656, 113200, 159725, 186342, 139283, 137869, 123387, 111183, 109611, 84282, 82310, 97068, 62204, 8237, -8788, 56740, 95683, 87818, 87085, 115384, 93434, 97237, 77442, 52842, 53553, 92565, 124980, 96334, 52961, 63821, 97564, 113967, 138388, 141820, 129885, 141568, 153361, 121782, 101208, 109078, 70423, 59527, 80529, 79208, 114286, 122128, 104229, 108080, 98565, 31964, 68064, 78010, 38044, 44928, 71710, 67833, 38653, -17841, 24557, 32220, 90689, 76492, 61006, 41919, 52885, 52720, 50555, 13705, 9874, 40890, 68660, 87676, 92467, 63922, 63681, 60728, 140441, 188029, 186345, 170249, 130530, 81983, 144254, 147074, 85796, 69851, 56875, 80928, 46418, -19097, 2491, 27890, 43419, 6254, 26512, 58697, 60242, 118520]
8316A18520P670J1183l3938j8090n3164n100J0817J1004j9777j8534J4769r170
8304A6190k4977q045K8689o356Q737o391J2914j0277j2825R245o077k9775L892
8291b5056P6559K0486J6246O725m9134l0899n4890M8384o187K2439Q5658J0685
8279A21016m1128l2463K1666j5771j5222J1883J3370p5667o2763j0831O1782P2681
8267D8553j3851l3641j5949K9902K0708J4445k6774N21j8989j2439j5403J443
8255b1474O5530M7067o246o3132l4253K1516J09610P1342P44l8288p0316O846
8243H8946J9790M986m0930K620L8995j6888j3794M7967K9574j5110J0491k8144
8231A28503p0123L7033K0942o396k2394J7854J7644l7872n1713m2165L098j9765
$$ y = [118520, 126190, 137373, 103435, 85345, 32181, 27081, 37898, 48902, 29125, 10591, 25360, 16190, -8787, -16832, 11857, 5501, 14238, 7847, 20761, 10484, -2341, 6904, 827, -28948, -25056, 51503, 71989, 88235, 94960, 45826, 14927, -39963, 8421, 2234, 24673, 110331, 121016, 79888, 47425, 69091, 53320, 38098, 49981, 63351, -12316, -75079, -85910, -24128, 48553, 34702, 1061, -14888, 15014, 35722, 50167, 23393, 23914, 4925, -7514, -22917, -21474, 44056, 91123, 84877, 21745, -12508, 9008, 118618, 189960, 190704, 152416, 82100, 88946, 108736, 113722, 72792, 75412, 114407, 97519, 83725, 131692, 161266, 146156, 156647, 128503, 58380, 95413, 116355, 109959, 87565, 105419, 123063, 85191, 33478, -8687, -5589, -25354]
8219b5354M82K3098K746L7771l62r98K6904J8105L1472m3607J0738J3979j0003
8206H4971M4153K9285p9618r7486K510Q0102L9255j8970l4234m1465M3097R131
8194F0731j1403k3171J3950K6618j1002Q848k0255n1957P8055N3234j8235m4542
8182F0871m451R944M0550l9592J750j614R754K8067m4784m4784m55k1873J8692
8169A2075j3872l0814L4358l3655N115n527M6811M9712l6770k9439l464O784m5937
8156d4623K4748P5546k1388L249M5578K173l7518k327M7591L9597p0083k2298
8144D0245m3615l9217K8503K2885K5286J4554n393k4596N101m6971l296L6834
8132A0320M8215N4836P63m5213n5226p2421l5469M0391O517j1897M2347l47n3245
$$ y = [-25354, -24872, -1774, 972, 38743, 38381, 37383, 64287, 82392, 113864, 70257, 80995, 94974, 84971, 129124, 158409, 78791, -18695, -16185, 63917, 103172, 84202, 49968, 8503, 51600, 60731, 49328, 26157, 40107, 66725, 55723, 64571, 44316, -7641, 70414, 123648, 105413, 60871, 56420, 66364, 106914, 67322, 69072, 67458, 77212, 105279, 60495, 15711, 15256, -6617, 12075, -1797, -32611, 1747, -31908, -26793, -32320, 14491, 64203, 27433, -2006, -5470, 1314, -44623, -19875, 55671, 34283, 37532, 83110, 85283, 47765, 45438, 93029, 132626, 62543, 40245, -3370, -42587, -14084, 8801, 34087, 48641, 43248, 18652, 23753, -23218, -26514, 10320, 58535, 113371, 114134, 68921, 13695, -58726, -94195, -53804, -47287, -59184, -16837, -17184, -70429]
8119g0429K9116N1078j6450l03l3566J1906M5109L2612j5329k9629k0942M0819
8107B3992P5806k3502j8478K7728k1443J1507Q526Q332J0936m9941m0703O0284
8095G3044O448J4080j7055K1691J8593M822n0456l7198k9459k1019J2107R956
8083E554K6677L4176K9665O9173R936l6093l3606k501J3893j7400k1519J1894
8071H9849P0752j8353r6315J0324K0445K283O1116P3526j32r0884o4966m715J8016
8058G0946J0507R0721M8658J631n2664m867j9019j2441J661j5355L7346j4243
8046A42881q438P528K4356m80K3432m0647j7406J169l8572O3634O9626J7387M036
8033B48506K0040k7478j8536l22m6428o243m3787K7179N3949M8601L0121L47P4777
$$ y = [-70429, -41313, 9765, -6685, -6988, -40554, -28648, 16461, 49073, 33744, 4115, -16827, 23992, 99798, 76296, 57818, 85546, 64103, 75610, 84136, 92468, 103404, 53463, 12760, 73044, 79492, 93572, 76517, 98208, 116801, 121623, 71167, 33969, 4510, -16509, -4402, 5554, 32231, 66407, 96072, 165245, 175181, 139088, 105482, 102981, 116874, 99474, 77955, 89849, 160601, 142248, 45933, 56257, 76702, 78985, 140101, 213627, 213495, 122611, 57645, 52930, 70946, 81453, 172174, 220832, 222463, 169799, 164932, 145913, 133472, 135133, 119778, 157124, 142881, 134443, 141971, 166327, 165847, 189279, 148632, 131226, 132395, 93823, 157457, 227083, 244470, 248506, 268546, 241068, 222532, 222210, 175782, 169539, 125752, 152931, 206880, 255481, 285602, 285949, 360726]
8020C60726m6626k9558K124k4146j3163k055n800N4517R2658J2405m8018J3174
8008C66238k76p3932j9640l513J7492J7278k8670m0123j0837J1111N4662J9675
7996C09465m6423P704J976J0415M4326J0005k0930Q804K4435k9491l2787q941
7984B78558P7M9187j2779m7362k273K2286J9335n0172K9878j517J8847K1085M838
7971C29988O214M8614j3192j6466L1132N1379K3647n9487k2612k4865k1690O2833
7959C95495L9883j8347j4099O358K5509J2455j8239m6109K1683L3667K2823k9041
7947D32038j0088J258K7959K898n4610J1240m5634J000L9049J1340m6785o3210
7935C06455N39k0686L4004Q4643j4878l6021R759L3025L9019O4362K7239l4446
$$ y = [360726, 314100, 284542, 286666, 262520, 249357, 247302, 241502, 296019, 388677, 401082, 353064, 366238, 365962, 292030, 272390, 268877, 286369, 303647, 274977, 234854, 224017, 235128, 289790, 309465, 263042, 270746, 272722, 283137, 327463, 337468, 316538, 325342, 349777, 320286, 287499, 278558, 278635, 327822, 315043, 267681, 265408, 287694, 307029, 256857, 286735, 285218, 304065, 325150, 329988, 336202, 384816, 371624, 355158, 386290, 437669, 461316, 401829, 379217, 354352, 332662, 395495, 435378, 417031, 402932, 409290, 434799, 447254, 429015, 382906, 404589, 438256, 461079, 432038, 421950, 423208, 451167, 454065, 399455, 410695, 365061, 366061, 405110, 416450, 369665, 306455, 306994, 286308, 320312, 404955, 390077, 354056, 363815, 396840, 435859, 500221, 527460, 493014]
7923D93014p1817m1010K2986L5959m921k9988k4979J3080J5898L0122N2293J4760
7911E05397J991q6541n2194L4572J9842l3838J5054m6502l2415K5231r575k9818
7899C11204l0479P9643M827k2541J728l102O8058L2629m7580m0860k0793k8303
7887C04431k2425L034j254j8871l587J6143j6621j2238L0664O63J05737L9979
7875D25655j08871m8444R157K7158r87K2431q450m6015n2950j9672j0446K2671
7863B11237j0104l6053M0509K9282q941o3882j9471K2979l9750k3334M8587L2917
7851A83976p96N632J8479R827p587q2503N863M7689N0483j0890m09j2936k8779
7838A78049J1078m2397j1864j5496R642o1744K4223K7986m1855J7067J5003m283
$$ y = [493014, 421197, 380187, 403173, 439132, 434211, 404223, 379244, 392324, 408222, 438344, 490637, 505397, 507388, 420847, 368653, 403225, 423067, 389229, 404283, 357781, 325366, 350597, 341022, 311204, 280725, 360368, 365195, 342654, 344382, 341280, 409338, 441967, 394387, 353527, 332734, 304431, 282006, 285040, 283786, 264915, 261328, 277471, 260850, 248612, 279276, 279939, 385676, 425655, 316784, 268340, 277497, 304655, 303668, 326099, 317649, 271634, 218684, 199012, 188566, 211237, 201133, 165080, 205589, 234871, 225930, 162048, 142577, 165556, 125806, 102472, 151059, 183976, 183180, 188812, 207291, 217118, 209531, 127028, 132891, 180580, 231063, 220173, 219764, 206828, 178049, 189127, 146730, 134866, 119370, 129012, 67268, 91491, 119477, 77622, 94689, 109692, 105409]
7826A05409J6281m4992n3812P0283M1810k4834m5638M81M2146j2481o5869l2816
7814d032M2794L4316r094N4201M1160j3566r048m5801L8266J4130m7066j1619
7802H4641l4043m0504K8650L4085R1141P2798k0859m1992o0727o9254j2673N1202
7790H2465L3282k7038k8480j0109M0496M7164l9175p7167l4968k2200j9678q184
7778f3592k8216N6186J7144K5712L9115j7835n482M6341k802Q254j4377k2542
7766C7906j0427j0305L101K0686p8712r751Q5748P3579k0462J1877J0326n139
7754A08427l7647o4547k2636j7322J9400j9874p2995K3859J4875N4457K7764k8410
7742a4649k1679m668O1499L8161Q187o9718k155J01802K0708k978M0332M64k3007
$$ y = [105409, 121690, 76698, 22886, 93169, 134979, 110145, 64507, 64988, 107134, 94653, 28784, -4032, 38762, 73078, 63984, 118185, 159345, 145779, 136731, 90930, 129196, 143326, 96260, 84641, 50598, 10094, 38744, 72829, 163970, 236768, 215909, 173917, 113190, 43936, 31263, 82465, 115747, 88709, 60229, 50120, 90616, 137780, 98605, 21438, -13530, -35730, -55408, -63592, -91808, -35622, -18478, 7234, 46349, 28514, 23032, 69373, 66571, 74825, 60448, 37906, 27479, 17174, 20275, 40961, -37751, -47502, 38246, 111825, 91363, 103240, 113566, 108427, 70780, 6233, -16403, -33725, -14325, -34199, -107194, -83335, -68460, -14003, 13761, -14649, -36328, -40996, 20503, 58664, 66851, -2867, -5022, 96780, 117488, 114510, 154842, 155306, 132299]
$$ [...]
##END NTUPLES=NMR SPECTRUM
##END=
