##TITLE=Analysis number 321174
Compound Code cc 58116
Book Reference 458/172
Project Code adrs
Chemist Name stevem
##JCAMPDX= 6.0         $$ Bruker NMR JCAMP-DX V2.0
##DATA TYPE= NMR SPECTRUM
##DATA CLASS= NTUPLES
##ORIGIN= Bruker BioSpin GmbH
##OWNER= nmr
$$ XWIN-NMR		Version 3.5
$$ Wed Jul 26 18:22:35 2006 GMT Daylight Time (UT+1h)  MAYBRIDGE\nmr@NMR_250MHZ
##.OBSERVE FREQUENCY= 250.131544655141
##.OBSERVE NUCLEUS= ^1H
##.ACQUISITION MODE= SIMULTANEOUS (DQD)
##.ACQUISITION SCHEME= undefined
##.AVERAGES= 16
##.DIGITISER RES= 18
##SPECTROMETER/DATA SYSTEM= dpx250
##.PULSE SEQUENCE= zg30
##.SOLVENT NAME= CDCl3
##.SHIFT REFERENCE= (INTERNAL, CDCl3, 0, 16.451)
##AUDIT TRAIL= $$ (NUMBER, WHEN, WHO, WHERE, WHAT)
$$ ##TITLE= Audit trail, XWIN-NMR		Version 3.5
$$ ##JCAMPDX= 5.01
$$ ##ORIGIN= Bruker BioSpin GmbH
$$ ##OWNER= nmr
$$ C:\u/data/dgb/nmr/ADRS/3690/pdata/1/auditp.txt
$$ ##AUDIT TRAIL=  $$ (NUMBER, WHEN, WHO, WHERE, WHAT)
(   1,<2006-07-26 18:22:11.93 +100>,<MAYBRIDGE\nmr>,<NMR_250MHZ>,
      <created by zg, POWCHK disabled, PULCHK disabled
       configuration hash MD5:
       E2 DF 36 D8 04 B2 41 60 5A D7 A3 38 5A 4B D0 FE
       data hash MD5: 64K
       D0 65 07 DF 46 0F C1 D9 7D 0E B1 00 89 90 52 92>)
(   2,<2006-07-26 18:22:24.95 +100>,<MAYBRIDGE\nmr>,<NMR_250MHZ>,
      <Start of raw data processing
       ef LB = 0.3 FT_mod = 6 PKNL = 1 SI = 32K 
       data hash MD5: 32K
       6B 9F 3F 3F BF 14 96 62 A9 25 52 6D 91 85 94 FC>)
(   3,<2006-07-26 18:22:26.49 +100>,<MAYBRIDGE\nmr>,<NMR_250MHZ>,
      <apk 
       data hash MD5: 32K
       FB 86 50 D4 AE DE 4C CC 23 A5 36 86 48 04 3E F4>)
(   4,<2006-07-26 18:22:27.48 +100>,<MAYBRIDGE\nmr>,<NMR_250MHZ>,
      <abs ABSG = 5 
       data hash MD5: 32K
       D2 FE 17 D5 2A 2C 78 41 A5 43 77 23 BB B2 22 AD>)
$$ ##END=
$$ 
$$ hash MD5
$$ 12 7F C5 57 5E BC 56 3E 16 93 90 C3 5B A2 D6 AF
##$RELAX= 
##$RELAX= 
##$RELAX= 
##$RELAX= 
##$RELAX= 
##$RELAX= 
##$RELAX= 
$$ Bruker specific parameters
$$ --------------------------
##$DU= <C:\u>
##$EXPNO= 3690
##$NAME= <ADRS>
##$PROCNO= 1
##$TYPE= <nmr>
##$USER= <dgb>
##$AMP= (0..31)
100 100 100 100 100 100 100 100 100 100 100 100 100 100 100 100 100 100 
100 100 100 100 100 100 100 100 100 100 100 100 100 100 
##$AQSEQ= 0
##$AQ_mod= 3
##$AUNM= <au_zg>
##$AUTOPOS= <57 >
##$BF1= 250.13
##$BF2= 250.13
##$BF3= 250.13
##$BF4= 250.13
##$BF5= 500.13
##$BF6= 500.13
##$BF7= 500.13
##$BF8= 500.13
##$BYTORDA= 1
##$CFDGTYP= 0
##$CFRGTYP= 5
##$CHEMSTR= <none>
##$CNST= (0..31)
1 1 145 1 1 1 1 1 1 1 1 1 1 1 1 1 1 1 1 1 1 1 1 1 1 1 1 1 1 1 1 1 
##$CPDPRG= <>
##$CPDPRG1= <>
##$CPDPRG2= <>
##$CPDPRG3= <>
##$CPDPRG4= <mlev>
##$CPDPRG5= <mlev>
##$CPDPRG6= <mlev>
##$CPDPRG7= <mlev>
##$CPDPRG8= <mlev>
##$CPDPRGB= <>
##$CPDPRGT= <>
##$D= (0..31)
0 1 0 0 0 0 0 0 0 0.06 0 0 0 0 0 0 0.0002 0 0 0 0 0 0 0 0 0 0 0 0 0 0 
0 
##$DATE= 1153934530
##$DBL= (0..7)
120 120 120 120 120 120 120 120 
##$DBP= (0..7)
150 150 150 150 150 150 150 150 
##$DBP07= 0
##$DBPNAM0= <>
##$DBPNAM1= <>
$$ [...]
##$SUBNAM7= <"">
##$SUBNAM8= <"">
##$SUBNAM9= <"">
##$SW= 20.6930455092707
##$SWIBOX= (0..15)
0 0 3 0 0 0 0 0 0 0 0 0 0 0 0 0 
##$SW_h= 5175.983436853
##$TD= 65536
##$TD0= 1
##$TE= 296.16
##$TE2= 300
##$TE3= 300
##$TEG= 300
##$TL= (0..7)
0 120 120 120 120 120 120 120 
##$TP= (0..7)
150 150 150 150 150 150 150 150 
##$TP07= 0
##$TPNAME0= <>
##$TPNAME1= <>
##$TPNAME2= <>
##$TPNAME3= <>
##$TPNAME4= <>
##$TPNAME5= <>
##$TPNAME6= <>
##$TPNAME7= <>
##$TPOAL= (0..7)
0.5 0.5 0.5 0.5 0.5 0.5 0.5 0.5 
##$TPOFFS= (0..7)
0 0 0 0 0 0 0 0 
##$TUNHIN= 0
##$TUNHOUT= 0
##$TUNXOUT= 0
##$USERA1= <user>
##$USERA2= <user>
##$USERA3= <user>
##$USERA4= <user>
##$USERA5= <user>
##$V9= 5
##$VALIST= <valist>
##$VCLIST= <CCCCCCCCCCCCCCC>
##$VD= 0
##$VDLIST= <DDDDDDDDDDDDDDD>
##$VPLIST= <PPPPPPPPPPPPPPP>
##$VTLIST= <TTTTTTTTTTTTTTT>
##$WBST= 1024
##$WBSW= 4
##$XGAIN= (0..3)
0 0 0 0 
##$XL= 0
##$YL= 0
##$YMAX_a= 390728
##$YMIN_a= -457996
##$ZGOPTNS= <>
##$ZL1= 120
##$ZL2= 120
##$ZL3= 120
##$ZL4= 120
##$ABSF1= 16.451
##$ABSF2= -4.242172
##$ABSG= 5
##$ABSL= 3
##$ALPHA= 0
##$AQORDER= 0
##$ASSFAC= 0
##$ASSFACI= 0
##$ASSFACX= 0
##$ASSWID= 0
##$AUNMP= <proc_1d>
##$AZFE= 0.1
##$AZFW= 0.1
##$BCFW= 0
##$BC_mod= 0
##$BYTORDP= 0
##$COROFFS= 0
##$CY= 12.5
##$DATMOD= 1
##$DC= 0
##$DFILT= <>
##$DTYPP= 0
##$F1P= 14.0000005364418
##$F2P= -0.99999901652339
##$FCOR= 0.5
##$FTSIZE= 32768
##$FT_mod= 6
##$GAMMA= 0
##$GB= 0
##$INTBC= 1
##$INTSCL= 1
##$ISEN= 128
##$LB= 0.3
##$LEV0= 0
##$LPBIN= 0
##$MAXI= 10000
##$MC2= 0
##$MEAN= 0
##$ME_mod= 0
##$MI= 0
##$NCOEF= 0
##$NC_proc= -4
##$NLEV= 6
##$NOISF1= 0
##$NOISF2= 0
##$NSP= 0
##$NTH_PI= 0
##$NZP= 0
##$OFFSET= 16.451
##$PC= 1
##$PHC0= 172.8418
##$PHC1= -1.491695
##$PH_mod= 1
##$PKNL= yes
##$PPARMOD= 0
##$PSCAL= 4
##$PSIGN= 0
##$REVERSE= no
##$SF= 250.130017758955
##$SI= 32768
##$SIGF1= 0
##$SIGF2= 0
##$SINO= 400
##$SIOLD= 32768
##$SREGLST= <1H.CDCl3>
##$SSB= 0
##$STSI= 32768
##$STSR= 0
##$SW_p= 5175.98343685301
##$SYMM= 0
##$S_DEV= 0
##$TDeff= 65536
##$TDoff= 0
##$TI= <Analysis number 999999
Compound Code 99
Book Reference 9
Project Code 9>
##$TILT= no
##$TM1= 0
##$TM2= 0
##$TOPLEV= 0
##$USERP1= <user>
##$USERP2= <user>
##$USERP3= <user>
##$USERP4= <user>
##$USERP5= <user>
##$WDW= 1
##$XDIM= 32768
##$YMAX_p= 313629460
##$YMIN_p= -645953
$$ End of Bruker specific parameters
$$ ---------------------------------
##NTUPLES= NMR SPECTRUM
##VAR_NAME=  FREQUENCY,     SPECTRUM/REAL,   SPECTRUM/IMAG
##SYMBOL=    X,             R,               I
##VAR_TYPE=  INDEPENDENT,   DEPENDENT,       DEPENDENT
##VAR_FORM=  AFFN,          ASDF,            ASDF
##VAR_DIM=   32768,         32768,           32768
##UNITS=     HZ,            ARBITRARY UNITS, ARBITRARY UNITS
##FACTOR=    0.157963299565203, 1,           1
##FIRST=     4114.88897558611, 0,            0
##LAST=      -1061.0944612669, 0,            0
##MIN=       -1061.0944612669, -645953,      0
##MAX=       4114.88897558611, 313629460,    0
$$ Real data points
##PAGE= N=1
##DATA TABLE= (X++(R..R)), XYDATA
$$ [...]
18742h1647j02408R7632J94351o0687j65747M7135J30648k9006k11694N6299K27822
18731A02698q6767n7487J41095p3140K15996J65185j74533J4347p0195j17213
18721E9986n5995l3716j58253Q5030K213Q7301Q33O5932J8326J39343J6545N0226
18709B77771j27776j23213K643l7434m8899l2919j39055j38346J75466L35873
18699A44111j08338j07516j05012l0724J36474J3983Q0287J57190j58543j67189
18689a45277p1265p5633J88070K8782j56678l1883L12986P3403q7250J4724J01877
18678A51856l5723j98846j25708q870N9115o5217o4841o9298J99742J21386J45809
18667A09405J969j89132r7103j1224M6032J03773J3169M812L7569j0999Q2175
$$ y = [-81647, -184055, -86423, 107928, 47241, -118506, -71371, 59277, 30271, -181423, -125124, 102698, 15931, -41556, 99539, 26399, 242395, 407580, 233047, 247394, 177199, 59986, 3991, -29725, -187978, -102948, -100735, -13434, -12601, 53331, 71657, 211000, 227545, 277771, 149995, 26782, 29425, -8009, -56908, -89827, -228882, -367228, -191762, 144111, 35773, -71743, -176755, -207479, -71005, -57022, 23265, 180455, 21912, -145277, -216542, -292175, -104105, -75323, -232001, -263884, 49102, 122505, 35255, 49979, 151856, 116133, -82713, -208421, -217291, -158176, -223393, -288234, -357532, -157790, -36404, 109405, 111374, -77758, -174861, -186085, -140053, -36280, -23111, -18299, 19270, 8271, 90446]
18656I0446r7241k59164l5763J89907K45540M1397K29865Q9077L4971k05141j94322
18645A29572j46876o7968K00375K8684j20535k12070J90848j1589k8226J8795
18635a8990j47719j64363Q8450o8776j31931J11263K72329J50549k05522j11029
18625b25739R7610J08426j1475M8249o1655k9430r2100J7443J65409j02747p0718
18614a56727n4698O2045J55810J05078j33649l03066J46188J64911l3562l0945
18604g8615M9201k9375j03180M4415O0403K4048P3146j64003K4541R0890J20344
18593A11815J3584n7742j24555j97641K1496P0077K72762L73813N5541k49037
18583B90113k69048Q901k7615p3917p1578L2487J73869k8617p0687n2303j1108
$$ y = [90446, -6795, -265959, -301722, -111815, 133725, 175122, 404987, 494064, 529035, 323894, 129572, -17304, -85272, 115103, 143787, 23252, -188818, 2030, -9559, -37785, -18990, -166709, -331072, -242622, -311398, -443329, -332066, -59737, 90812, -114710, -225739, -128129, -19703, -31178, 17071, -44584, -74014, -166114, -148671, 16738, -86009, -156727, -211425, -149380, 6430, 111508, -22141, -325207, -179019, -14108, -47670, -78615, -29414, -58789, -161969, -117554, -57151, -33103, 40043, -123960, -99419, -8529, 111815, 125399, 67657, -56898, -254539, -233043, -162966, 109796, 483609, 539150, 290113, 21065, 29966, 2351, -71566, -143144, -110657, 63212, 34595, -36092, -88395, -99503]
18572i9503q8892L7058L9330k5387M7010J43149P1280l3134j683p2536r4546j08118
18560a85972j919P3887J21950j7489q9474O314j4203N7704K3996p0867n1230q5185
18548b32488L6465k2910K2763L8989m7317m0864J54301J1890J94351J62457K0875
18537B98512j20553j92137R551J32965j08910R3255j886j0844o0041j65425q3059
18526b08572M5284J53355K2860k0671N8855J80402l0590j07019j75654m7650J10928
18515a8472j24017o6398P354J99920j1801k0759r452K61572r1490j85426K3466
18504c5503l5493j814J59834P1249k3199o4899P2442j5981M6522q8430p0451R6350
18492A10627P1281r8197n7805M3128k5014J00495L544k08488q9843m3182p63J5894
$$ y = [-99503, -188395, -151337, -112007, -137394, -90384, 52765, 124045, 90911, 89228, 16692, -77854, -185972, -187891, -114004, 7946, -9543, -99017, -92703, -106906, -49202, -25206, -96073, -147303, -232488, -196023, -218933, -196170, -157181, -204498, -245362, -91061, -79171, 115180, 277637, 298512, 177959, -14178, -4627, 128338, 19428, 112683, 110797, 99953, 39912, -125513, -208572, -163288, -9933, 12927, -7744, 51111, 231513, 200923, 93904, -81750, -129400, -18472, -142489, -208887, -201533, -1613, -13414, -34173, -43625, 217947, 126457, -58969, -35503, -70996, -72810, 87024, 158273, 135074, 70175, 142617, 126636, 173158, 84728, 14277, 110627, 181908, 83711, 25906, 69034, 44020, 144515, 148059, -60429, -150272, -193454, -194217, -178323]
18480a78323J67622N8914j87016P5811K04360l3454j88967j89241N3074L3987
18470a83233J08522Q6385R1322O577j66918j43175L810J32684j03941k13685M7573
18459c34079K95591L71646L5260q3250o5560R913m303k3855k06459q4504l1418
18448a21018o0677k8499J16136N5214j17762Q6708O8719l6306K8530K23349n1850
18437A62544j04504K681j71394j20742J60970N0719j79824o5999Q3003R1222J55950
18426F4626M307l6280J5147j411j04135L6172j08890j32727j02217L3963J82342
18415a49103J86392J2847q4172R6440p6588O2941P8209P479j62007L3997k5194
18404a8759j02618O2012j08583p4535l9287J7292O293j06431J26656J66092N7919
$$ y = [-178323, -10701, 48213, -138803, -62992, 141368, 107914, -81053, -270294, -217220, -183233, -74711, 11674, 102996, 109573, -57345, -200520, -196710, -64026, -167967, -381652, -334079, -38488, 333158, 368418, 285168, 219608, 229521, 225218, 201363, -5096, -89600, -121018, -181695, -210194, -94058, -38844, -156606, -69898, -1179, -37485, -8955, 214394, 162544, 58040, 60721, -110673, -231415, -70445, -19726, -199550, -265549, -182546, -91324, 64626, 68933, 32653, 47800, 46389, -57746, -21574, -130464, -263191, -365408, -331445, -149103, 37289, 50136, -34036, 62404, -14184, 48757, 126966, 134445, -27562, 6435, -18759, -121377, -59365, -167948, -242483, -281770, -264478, -258185, -364616, -237960, -71868, -13949]
18393a3949q3092q8894j76567J68634J71595p9138m60P7786J19312J10617J04927
18382C10771K4646j88459j11001N1717R7803n179q5k8886m966P1705j7950K7224
18370B27340M4442J55959o0011k00445j11534N011R9716L8644r2475J18707m0595
18359A84759j09519j45355k18962J49333O6906r9492l3114P418q1068O5911J64395
18348d8788J14564J68512J70580j65223j33997j9826j28481k28101J790J79924
18338h9046N2914m468L6463J42957N4346q6561k5781j4081j04792P1765J10791
18327A44507P8150j27971J1398K2513j70045l5787J5785k4490o6595j6115O8106
18316a00544j3607l0392J84140J11081j78956l7278j15350n3951O3963Q7124K01921
$$ y = [-13949, -97041, -185935, -362502, -193868, -22273, -101411, -101871, -24085, 95227, 205844, 310771, 335417, 146958, 35957, 87674, 185477, 180298, 180213, 151327, 146361, 218066, 200116, 227340, 271782, 427741, 367730, 167285, 55751, 60762, 160478, 199122, 106647, 225354, 184759, 75240, -70115, -289077, -139744, -72838, -172330, -205444, -198026, -279094, -213183, -48788, 65776, 234288, 404868, 239645, 105648, 85822, -42659, -270760, -268970, -89046, -36132, -40600, -4137, 138820, 193166, 106605, 80824, 66743, -38049, 33716, 144507, 222657, 94686, 106084, 128597, -41448, -77235, -61450, -85940, -152535, -168650, -100544, -114151, -144543, 39597, 150678, -28278, -65556, -180906, -234857, -170894, -83770, 118151]
18305A18151l6978j77148n506n8305N3483J07224J03636K2396n1335L3650j01845
18294G423L7943J51133o8880k76174R0149Q4774k57559k7662J40888J476J76900
18283F0411P3573N255Q0670l7068o5112r6335r3218Q5562J79857l6927j73365
18272a6697j46302n9354K21341j09471j26919k8784R0597J04415N0470J8475Q1924
18261G9695r5295j69030q8996K01832J38938J01940O4096m1029Q2244J38520q1912
18250C31003q6263K3198p8382o9707J63297J2297l03811O8611n2187j81191P3152
18239i9983L52139M4373n2067n8940P8351k7570j50529n1027k668k2087q2296
18228g2304P471o512J69167j20784m279R6249j4019Q8757P1699M76k43547j38741
$$ y = [118151, 81173, -95975, -101481, -159786, -106303, 921, 104557, 126953, 75618, 109268, 7423, 45366, 196499, 127619, -148555, -58406, 26368, -231191, -258853, -117965, -116489, 60411, 133984, 139239, 219909, 182841, 117729, 21394, -71824, 13738, 193595, 156668, -16697, -162999, -222353, -1012, -110483, -237402, -266186, -175589, -71174, -20704, -2229, 79695, -15600, -184630, -273626, -71794, 67144, 169084, 233180, 192151, 274395, 412915, 331003, 244740, 267938, 189556, 119849, 283146, 295443, -8368, 60243, 8056, -173135, -99983, 252156, 296529, 244462, 185522, 263873, 236303, 85774, 34747, 32079, 9992, -72304, -64833, -71345, 97822, -22962, -27241, 69008, 54989, 143746, 215445, 215921, -27626, -166367]
18216a66367N8270o7705M9666k6488Q4290O3408J03257M3417p9148j42972l0590
18205a10962O5490J55302J17935J7295o2619K4992Q4338p9502j48158m4613Q8296
18194A07794j01558k8004K33135l6268j08055q8433k5984p3765p9387q932J5225
18183a94232J2244L3490J65457Q1578j32773N5994N9113Q1235M7033J19752p1386
18172B57505j38020p170J14697N09O3305n9387j71625O5948J6921k463j27384
18161A2836j605J10388N1526R1286L50460L01164J14470j38345j44455k9775k62843
18150D55107K9073Q0462K9774J03380J12109K36399L30136J36371J86697J20965
18140A820473q5926l9624J75137K66677L35845K42298J83206K23718L22709L82781
$$ y = [-166367, -108097, -175802, -126136, -152624, -68334, -4926, 98331, 141748, 62600, -80372, -110962, -45472, 109830, 227765, 245060, 182441, 207433, 291771, 212269, 64111, 19498, 107794, 6236, -21768, 211367, 175099, 67044, -21389, -47373, -121138, -200525, -209457, -194232, -181988, -148498, 16959, 98537, -34236, 21758, 80871, 162106, 209139, 328891, 257505, 119485, 112315, 227012, 227521, 290826, 231439, 59814, 125762, 142683, 140220, 12836, 11231, 121619, 173145, 264431, 614891, 916055, 1030525, 892180, 747725, 717950, 455107, 484180, 564642, 594416, 697796, 809905, 1046304, 1376440, 1512811, 1699508, 1820473, 1734547, 1694923, 1870060, 2136737, 2472582, 2714880, 2898086, 3121804, 3444513, 3827294]
18130C827294M24175M57789L63155L36428M84771P52157J068781J287843J409053
18121A0411446J907571K486070L182330M206018N502520P607183J1876180K0897082
18113F8076400L3476561L2238969N675680r436935m760109M851498P406069j5900754
18105A21627379l7504982k7415889j5254554q771979n415279l555723k587910
18098B1121063k062835j510091j215296j214227j116443q27788m56134k63608
18090A2454641m91822p15435o72903m80428m03092m29003m80460n38466l83586
18081G859446k67902l25204n61682l58455k50045k21034j12908k49026j80971
18072E332219j34138j79244k59581k91609k45163k36259j14512M5573M8751n0924
$$ y = [3827294, 4251469, 4709258, 5072413, 5408841, 5893612, 6645769, 7714550, 9002393, 10411446, 12319017, 14805087, 17987417, 22193435, 27695955, 35303138, 47179318, 68076400, 101552961, 133791930, 139467610, 130030675, 125270566, 130122064, 137528133, 121627379, 84122397, 56706508, 41451954, 32679975, 27264696, 23708973, 21121063, 19058228, 17548137, 16332841, 15118614, 14002171, 13174383, 12718249, 12454641, 11962819, 11247384, 10574481, 10094053, 9690961, 9261958, 8781498, 8243032, 7859446, 7591544, 7266340, 6704658, 6346203, 6096158, 5875124, 5762216, 5513190, 5332219, 5198081, 5018837, 4759256, 4467647, 4222484, 3986225, 3871713, 3917286, 3966037, 3915113]
18062C915113j23191j56231k47727j75119k46295r7730J20678M3288k27348j10006
18052B695432j45860r0579j26300r2956n8476n8173J51537r592j1942J6317j21850
18041B147558j33161m2957j43585q2833M3188k4481j76987o4994P2645n4429j5887
18030A524077m6351p8234N11k8637r0152q9496J34152j0275k31965n7708J01130
18019A127052J48109M854k60890j225P9904j41391o7897K7237l4925m8278o5638
18008G66912J149R9458k5124j86228n3516j23887j76344l599J7408O4251R1676
17997D72156N8524J6321L5458O4532J55759j14267p397L1310R1832q3315j08221
17986F12692j39492k2271r0010J2788o0461j3008M1500j10386k18979J3317K51087
$$ y = [3915113, 3791922, 3635691, 3387964, 3212845, 2966550, 2868820, 2989498, 3032786, 2805438, 2695432, 2549572, 2458993, 2332693, 2239737, 2181261, 2123088, 2274625, 2265033, 2253091, 2269408, 2147558, 2014397, 1971440, 1827855, 1745022, 1788210, 1763729, 1586742, 1521748, 1594393, 1539964, 1524077, 1477726, 1399492, 1400003, 1371366, 1281214, 1191718, 1325870, 1315595, 1083630, 1025922, 1127052, 1275161, 1280015, 1019125, 1017900, 1097804, 956413, 888516, 915753, 880828, 832550, 766912, 768061, 867519, 842395, 656167, 602651, 478764, 302420, 298821, 316229, 380480, 472156, 530680, 547001, 582459, 646991, 802750, 688483, 681086, 712396, 804228, 720913, 612692, 473200, 450929, 360919, 373707, 313246, 300238, 341738, 231352, 12373, 25690, 276777]
17975B76777J18060r6296q9450m7461J9936k2121p340J49739r9579k06254O9507
17964F5518J18969J29722j23999j27511k2117R7134N5093K8968J15645j78235
17954A59187j01959j28712p697J06473p6779m5537K5110R3201J21610j03149n8785
17943a7037J00392O1821k2560j05780P6507Q5667L1592j8275m2254O6729o4473
17932A52329M3118J7960R454k36018L6774K39611Q739l129o9360j8701o1207L2814
17920A52384k4550r2688J62025J87040J3166N8846k1500j85125j19361l5117q9201
17909E919L1847J4215k9124j39651q7838J71118J67502K22237L9255l31530k00303
17898a36353N3584J62278K0653r8596j8775p8069P0187p0246J37951K49993O2666
$$ y = [276777, 394837, 298541, 209091, 161630, 181566, 159445, 152105, 301844, 202265, -3989, 65518, 184487, 314209, 190210, 62699, 40582, 137716, 192809, 221777, 337422, 159187, 57228, -71484, -79181, 27292, -49487, -95024, -69914, 23287, 144897, 41748, -17037, 83355, 145176, 122616, 16836, 93343, 179010, 210602, 192327, 150073, 216802, 152329, 195447, 213407, 222861, -13157, 23617, 263228, 271967, 268838, 199478, 180777, 119570, 152384, 127834, 35146, 197171, 384211, 397377, 456223, 434723, 249598, 130237, 95120, 5919, 37766, 51981, 22857, -116794, -204632, -33514, 133988, 356225, 395480, 63950, -136353, -82769, 79509, 100162, 1566, -17209, -95278, -25091, -95337, 42614, 292607, 355273]
17887C55273q0395j29965j51828K6690J39004M6763Q7346L6343j90951q3530K03436
17876B58186J57130k0046j01322O8864M0614M1397q0574j65065j30204K0494K16651
17865C06125o5276J0452J2411L1443j51252j63587J2486R5371j9912m4510M1712
17854F5463J52154r7577n6380P797j67044l1308k417o484O3277M4831N9655n193
17842B6774m3560p0731P1871l8314p8M2135k9997J8017K0682N6629Q8745N5805
17830A97978o3412l8253j24851k2867J02191j99352j82759L0407K91616N5604
17820D6302m976Q1442k4919j05977r7653p8045k8866R3258J03630J93795l4165
17809A43826j04904o3248M9697o2199O8554J19295q1133l5670R821M9935n6005
$$ y = [355273, 274878, 144913, -6915, 19775, 158779, 205542, 292888, 329231, 138280, 54750, 258186, 415316, 395270, 293948, 362812, 403426, 444823, 364249, 199184, 68980, 89474, 306125, 240849, 251301, 263712, 295155, 143903, -19684, -7198, 88173, 68261, 23751, 65463, 217617, 120040, 63660, 71457, -95587, -126895, -129312, -135796, -72519, -27688, 31967, 26774, -16786, -87517, -15646, -53960, -54038, -11903, -41900, -23883, -3201, 53428, 142173, 197978, 134566, 96313, -28538, -51405, 50786, -148566, -331325, -300918, -9302, 46302, 41326, 122768, 97849, -8128, -105781, -183826, -212692, -119434, -15804, 177991, 143826, 38922, -24326, 25371, -36828, 31726, 151021, 69888, 34218, 44039, 93974, 37969]
17798C7969J95760o4484l79293O1549O5663R7142L8772j92428j77645L1763J30367
17787a54865J37918P5233j79482L2964K27202P3826k18264p7313L6598p189l413
17776e6785J04396Q2702J4088n807j51491j22061l4715L586j15586J02269R942
17765a69462K5310r2977J47727K70751k2020j01279j0739J98919p39j08069k3672
17754A13750N8242J26074K4854m1145j2602P2636p7281n7827m4582q228j05020
17743D8871J095O057k4975j12235J5223P4963j34003l77P2322J08992J11478J94641
17731C62052j32132j76767k9004K6566n4277l6946J67971j27072j26921J20749
17721e781J60877J17293o4080q2001J2173N7704J6975j66275j40209R4691K45762
$$ y = [37969, 233729, 169245, -210048, -148499, -82836, 14306, 53078, -139350, -316995, -285232, -154865, -16947, 58286, -121196, -88232, 138970, 212796, -5468, -82781, -46183, -53372, -56785, 47611, 130313, 144401, 138594, -12897, -134958, -169673, -166087, -281673, -179404, -169462, -144152, -237129, -89402, 181349, 159329, 58050, 47311, 246230, 245491, 137422, 113750, 171992, 298066, 322920, 281775, 269173, 341809, 264528, 206701, 162119, 153891, 48871, 49966, 56023, 31048, -81187, -65964, 8999, -125004, -125381, -53059, 55933, 167411, 362052, 229920, 53153, 24149, 50715, -3562, -40508, 127463, 391, -126530, -5781, 155096, 272389, 208309, 126308, 138481, 196185, 213160, 46885, -93324, 1367, 247129]
17710B47129k393P2433p3787k69744n4327J6629l0189J82127J5871n2086l5730
17699A5933N0846p267j43740j01933P8446Q0849n2669o8955K7798J45320K3232
17688D7860k34550J34213R3407o2163j71549k7902K18287j535J2321o6190K2685
17677c5116J44479j5799q0367K2590m1941k5991q318n3657O9416j25289l8731
17666a88724Q0566q2088j10229j5457j9730k7520O132M2977R6501Q3921n2176
17655a85827J14980L26297m1961j77330q9478J53262n4874k6958r4585J6927J13419
17644E3872J21818L5994L9033P4594r4065j02495o0060j14679m7594j45099K3386
17633b15295J18690K58011Q4811j37106j25348l4119R9555j50871o6728J31155
$$ y = [247129, 244736, 317169, 243382, -26362, -80689, -64060, -94249, 87878, 103749, 51663, 15933, 66779, 59512, -84228, -186161, -107715, -26866, -79535, -148490, -120692, 24628, 47860, -186690, -52477, 40930, -21233, -192782, -220684, -2397, -3932, 8389, -57801, -35116, 109363, 93564, 13197, 35787, -6154, -32145, -40463, -94120, -24704, -149993, -188724, -108158, -190246, -300475, -315932, -335662, -363182, -357050, -314073, -217572, -133651, -185827, -70847, 255450, 213489, 36159, -53319, 99943, 45069, 18111, -76474, -59547, 53872, 175690, 211684, 250717, 325311, 231246, 128751, 68691, -45988, -93582, -238681, -215295, -96605, 161406, 246217, 109111, -16237, -50356, 49199, -101672, -168400, -37245]
17623c7245L7947j2237j7128K15555Q9144j1057r2751Q8451j15530q3442m0185
17612B1522J16641o9717m3980P9575K8974n2944k63543j85325r0592m239J12897
17601c50731J34292l4083M3228P2393K7251J7419M0661N1385j3777m6012J77709
17590A19735K9743r9932J4331j86503l3021M925o7687j0509J80972K1525j7101
17579d3522J30749K48321j10756j8769o3560O7382M3617r2239k18664L6679J11858
17568I1096O7025m5557k15783j81078k9004L0424K41302N0238o5401m1638P1897
17557b6479J38601K5497l867l6599m6058l5431r2758m736O4734K4978K1403o2957
17545c3672o4996l203K32781R6543L6845j98109j04298J2175J14885J9806j4520
$$ y = [-37245, 702, -11535, -28663, 186892, 276036, 264979, 172228, 260679, 145149, 61707, 21522, 138163, 68446, 24466, 104041, 133015, 80071, -183472, -368797, -459389, -463628, -350731, -216439, -250522, -207294, -134901, -107650, -90231, -49570, 1815, -11962, -57974, 119735, 149478, 49546, 63877, -122626, -155647, -150722, -218409, -228918, -47946, -26421, -43522, 87227, 335548, 224792, 206023, 142463, 209845, 253462, 161223, -57441, -20762, 91096, 158121, 112564, -103219, -284297, -313301, -282877, -41575, 8663, -56738, -98376, -26479, 112122, 137619, 133752, 97153, 51095, 15664, -77094, -81830, -17096, 7882, 29285, -33672, -98668, -101871, 130910, 227453, 264298, 66189, -38109, -25934, 88951, 108757, 94237]
17534I4237J40088k3946O2741N3683j75599k15938K4754R7921j281o0769J5351
17523A1242K9845n5749j9647J0103R1883O5290j57714j92654K4138K0337R6644
17512g6282R2914j7685m4696j17050j83749J49336N7971P7752J51993o0779l1417
17501a692l1710j16723j7899P3643P6268J6888M0172K54834j20147k02200j77588
17490b06154q7554J28J37929J1452p164O8527L7337N9051m2321N2819J39474J5432
17478A78956J293q3130k0976j08727j36700p2909k2511k4541j4315J30288J35602
17467c7670J18913N3834Q4120j26594j15370J86361m4403j68018j05545R5886
17457e8486L7117J21900J3478j14003N9988K7552l655K912Q511O7436J50288K68572
$$ y = [94237, 234325, 210379, 273120, 326803, 151204, -64734, -39980, 57941, 56660, -4109, 11242, 41087, -14662, -34309, -24206, 67677, 132967, -24747, -217401, -193263, -172926, -76282, 16632, -1053, -45749, -162799, -346548, -197212, -139241, -61489, 90504, 29725, -1692, -33402, -150125, -168024, -94381, -18113, -1225, 38947, 293781, 173634, -28566, -206154, -293708, -293580, -155651, -144199, -151363, -82836, -45499, 13552, -28769, 24050, 163524, 178956, 180249, 97119, 76143, -32584, -169284, -242193, -264704, -289245, -303560, -173272, -37670, 81243, 135077, 219197, 92603, -22767, 163594, 119191, -48827, -154372, -58486, -21369, 100531, 114009, 6, 59994, 87546, 83891, 86803, 95314, 162750, 313038, 581610]
17445E81610l2844J32953r8790n6186O2485P5280k49303l33563j25029j07875
17435a51262O7549K3045R0388j329N1354N0826j63159j20875M2802K50512J73465
17424C13316j30893j96656m2376R9533p9319L8078Q7798j12792o3855k1885n0918
17413a59969P0937J47242P933k2566K0855l3126O7883j45296j3176r9220J33868
17402b4635L3628j46771L0871M8821J00803q5485m2004J10217j7202j58492L4507
17391a15742O888q1923j3976J36397o3202n8054J39690O2850O4300J16730J8807
17380B12765O9457j88622j61368L5658o2937Q8397o2620j00656l5325Q1753J59428
17369C5930L7620r3842N4675P4407j2978M0577k42305k17163O1742R2064j8590
$$ y = [581610, 548766, 681719, 582929, 526743, 589228, 664508, 415205, 81642, -43387, -151262, -83713, -60668, 29720, 28391, 79745, 130571, -32588, -153463, -110661, 139851, 313316, 182423, -14233, -56609, 42924, -36395, 1683, 89481, -23311, -87166, -109051, -159969, -89032, 58210, 66143, 43577, 64432, 31306, 99189, -46107, -59283, -158503, -24635, 8993, -137778, -106907, -58086, 42717, -42768, -84772, 25445, 8243, -150249, -115742, -108854, -190777, -204753, -68356, -131558, -189612, -49922, 12928, 77228, 193958, 212765, 282222, 93600, -67768, -32110, -95047, -6650, -69270, -169926, -205251, -123498, 35930, 73550, -20292, 34383, 108790, 95812, 136389, -105916, -323079, -261337, -169273, -187863]
17358a87863J46971L2853N2577p6803m0791j39218j45967O0847K07402m3308n5090
17347a88390J07254O3537m8991j05866j2656r0627j52773J01190l6142J851K98280
17336f3333P1327p1569n7614M0847L7375j00877L0120J10531K3228N4806J77681
17325B52522J31904j36742j73351m0732P9241N751j77161L4205N1448p9253l2487
17314h4655l995M4959Q1026k9350l4852N1365L9016L6760k3559j947O9488K9733
17302A73989N7288M0604j05217j31407j02164k21480k2238J48024q8978j17712
17292c69291J03053N1081R4935N8528K25538K103j57233n010n8972n733N1498
17281i503K44928K3089j01722k11218j97644k3152J06717J04590J57211k42931
$$ y = [-187863, -40892, -8039, 44538, -32265, -73056, -212274, -358241, -297394, -89992, -133300, -188390, -81136, -17599, -66590, -172456, -185112, -275739, -428512, -327322, -363464, -361613, -63333, 7994, -63575, -121189, -80342, -42967, -143844, -113724, -3193, 20035, 74841, 252522, 384426, 247684, 74333, 33601, 112842, 118593, -58568, -24363, 27085, -52168, -84655, -88650, -43691, 37335, 7985, -26867, 24498, 63514, 100274, 76715, 74768, 144256, 173989, 231277, 271881, 166664, 35257, -66907, -288387, -310625, -162601, -251579, -369291, -266238, -215157, -120222, -61694, 163844, 165947, 8714, 3704, -55268, -61001, -9503, 235425, 258514, 156792, -54426, -252070, -275222, -168505, -63915, 93296, -149635]
17271a49635k38489J11793K76287J82415j22366J2416J20467j10308p8943j12516
17261a08879m348J3789M8545K48627k2062m9045J24400j00178k25448n7641n5687
17250a87927Q8520J6670N6311J50941J71684k69545j48676K8421M0633k7512r1438
17239a71918J22244J73964j67247O0727J57933P8549p6879o0539k3729p75J25371
17228B17701m8288j38383j0591q1362L8382j4843Q475J51344R314q0569l1993
17217A9187N2917M2709R9974m7414o7171L5724k00537j1633R4011M5344Q0505
17206A43616K008j23107k51536N7026m9293k5333o1420J7835K05368L25417q0972
17195A59609j68811O8359j09017j17670R4291J65403o6683O896p1250k26887J07941
$$ y = [-149635, -388124, -276331, -44, 182371, 60005, 72421, 192888, 82580, 3637, -108879, -113227, -99438, -50893, 197734, 175672, 126627, 251027, 150849, -74599, -132240, -187927, -99407, -82737, -26426, 124515, 296199, 26654, -122022, -93601, -52968, -80480, -171918, -49674, 124290, -42957, 17770, 175703, 254252, 177373, 116834, 93105, 92330, 217701, 169413, 31030, 20439, -60923, -22541, -37384, -28909, 122435, 131749, 51180, 19187, 72104, 114813, 214787, 167373, 100202, 135926, -64611, -76244, 17767, 63111, 143616, 145624, 22517, -229019, -171993, -221286, -246619, -308039, -290204, -84836, 240581, 159609, -9202, 59157, -49860, -167530, -73239, 92164, 25481, 32377, -38873, -265760, -157819]
17184a57819j3180R1608k8453o8538J26792K8488j06227j47423M0267K60204K08631
17173B34350p2103q8017j02451l705J12876o1696J1383q7073J07013J17918j5027
17162A53468O880K9662M6492O5136Q6936p1494j79759k03572l5659J24050J09890
17151A32030p5922l8990j27142l2071J23219L5090P6526N0232j45168l96557j14020
17140e12773L20736L9376j32635j7208J85434q6188j13974l2527P1089L7575J98235
17129d2860J49246p9649p0722M2563p3647j08123l5414R8017J61132Q6363o1715
17118F5191j29669j3736J47891l034r3935J04660K2033j83303j79414Q3819Q8464
17107i1033Q9924J95902L9257j42410q6076P1692O0897j25094k84287J2705J71693
$$ y = [-157819, -170999, -79391, -107844, -176382, -49590, -21102, -127329, -274752, -234485, 25719, 234350, 162247, 74230, -28221, -31926, 80950, 19254, 30637, -56436, 50577, 168495, 153468, 160348, 190010, 236502, 301638, 388574, 317080, 137321, -66251, -101910, 22140, 132030, 56108, 17118, -110024, -142095, -18876, 16214, 92740, 142972, -2196, -398753, -512773, -192037, -152661, -285296, -302504, -117070, -203258, -317232, -349759, -278670, -241095, -42860, 106386, 26737, -43985, -1422, -75069, -183192, -218606, -120589, 40543, 126906, 65191, -64478, -78214, 69677, 66643, -27292, 77368, 99401, -83902, -263316, -179497, -91033, -1109, 194793, 234050, 91640, 5564, 77256, 138153, 13059, -271228, -258523, -86830]
17096h6830J29313M6979L7801J68826r7809k31260K3945N1271J52519K2461r4806
17085A22410o63J08774k40512k64507J53345O7912K2327J06552j00724q3745l7261
17074a46092J25978J88464N6258j46284J78499J00096o3217j80749n5762M4265
17064A01456j48497j9866J10875Q1356K5685O318Q1678Q2998J29249L845l3114
17053D21983j57485J92035J27172J51151O20444P41081O16362J25431k55401n3023
17043B529750K30879K16302n39736q62058o81892k63436n9690J7475N0333J63838
17033H01765P5539o9390j64208r4437r9322j48494j85513p9189M4594j28533Q0842
17022C3654J77318L0228J11609j21252j36314n5718N3778J43058J9427J20709
$$ y = [-86830, 42483, 89462, 127263, 296089, 198280, -32980, -9035, 42236, 194755, 217216, 122410, 121747, 230521, -9991, -274498, -121153, -53241, -30914, 75638, -25086, -108831, -146092, -20114, 168350, 224608, 78324, 256823, 356919, 293702, 112953, 57191, 101456, -47041, -66907, 43968, 125324, 151009, 157327, 239005, 322003, 451252, 455097, 421983, 264498, 456533, 583705, 734856, 1355300, 2096381, 2712743, 2838174, 2582773, 2529750, 2760629, 2976931, 2437195, 1575137, 893245, 629809, 570119, 587594, 637927, 801765, 877304, 807914, 643706, 549269, 449947, 301453, 115940, 36751, 81345, -47188, 33654, 210972, 241200, 352809, 231557, 95243, 39525, 93303, 236361, 255788, 376497]
17012C76497J3714p0518P9088j02024N8522K3179j32365O0169J3119k7550j09511
17001A82320r7984p0663N981M9311P0852k2645l0067p3303O8457O3636l3044J83823
16989B96674J17643K0151q4159k9686j66771j68261L03608K83748p5003l02924
16979A95020j37959j11591J03224J4205O1540m8939l06387M1704J78686K06861
16969A96364O3121j32678j8130j68732r8462J53796j3273J64073J93781J9732
16959C59592J04690K7832j74954j12850N389Q1241q0586k1778L695O788m5272
16948A53787n8794n4815j87161n6993K6995R8383J3215P4847K0425L4697J2071
16937G6657r4104k24462m9309J66229J0513k49784Q708K00323N8342m6190O3341
$$ y = [376497, 390211, 319693, 398781, 296757, 355279, 378458, 246093, 306262, 319381, 291831, 182320, 84336, 13673, 19654, 68965, 139817, 117172, 87105, 13802, 82259, 145895, 112851, 296674, 414317, 434468, 350309, 320623, 153852, -14409, 289199, 572947, 497944, 195020, 57061, -54530, 48694, 62899, 124439, 75500, -230887, -189183, -10497, 196364, 259485, 126807, 108677, -60055, -158517, -4721, -17994, 146079, 339860, 359592, 464282, 492114, 317160, 204310, 209699, 290940, 210354, 188576, 192271, 199059, 153787, 94993, 40178, -146983, -203976, -176981, -78598, -65383, 9464, 29889, 64586, 76657, -17447, -241909, -291218, -124989, -114476, -364260, -355552, -155229, -96887, -143077, -79736]
16926g9736m528q5839o1224j13916o8630Q7755K35467K53590J04631j9267j20246
16915A28057L9218k7468j04847j27259o632Q4137k4278n192l9739q6834r941J44234
16903c6544K43708o6522j08456N9788N5956j36895k2130n6580l2459q282J04212
16892d204m8127k14938j52117J56469M7434k5064J21484j61689P7795K87842N7315
16881A42200M5233l9857J33460k663k58953r5348O8729J54808J14327J02412j73707
16870A90641o9763n4122j97602J04138J58130j5347j77142J99603K8112k4492
16860A42156j29588m4303J8832r943M4344p6900L071N6861Q733J06126R7939L3603
16848B50931L7470k8868m3871k098Q8561j1988j09444o0103M2324P061M111R1511
$$ y = [-79736, -84264, -170103, -231327, -345243, -413873, -326118, -90651, 162939, 267570, 248303, 128057, 167275, 139807, 34960, -92299, -98931, -14794, -39072, -44264, -84003, -170837, -180778, -36544, 207164, 140642, 32186, 91974, 147930, 11035, -11095, -67675, -100134, -108416, -4204, -52331, -267269, -419386, -262917, -215483, -240547, -119063, -280752, -202957, 84885, 142200, 187433, 147576, 281036, 278373, 19420, -75928, -7199, 147609, 261936, 364348, 190641, 120878, 66756, -130846, -26708, 131422, 116075, -61067, 138536, 166648, 142156, 12568, -31735, -12903, -22846, 21498, -55402, -52331, 4530, 13263, 119389, 217328, 250931, 288401, 259533, 215662, 213564, 302125, 290137, 180693, 120590, 162914, 169975, 174086, 265597]
16836B65597k2093j46009j81967o2829M3522J60088K3949j15204k30494J43436
16826a22004J46348j02000k20584Q6579n9776Q5302M8340K4044J9236L15998J52640
16815C74123j30658j18204J2203M7519J81328j68848k80481j51250k0582m638
16805b59488Q0957o4367N4235J73690K71811J8357k31441j85383k08239J765J73973
16794a74130P2329r2786j4136Q0114j43053o6136K5832M0464O2016J23461l6055
16783a22080j63537L6902K19808Q9220o0127r5152K5136k008P4546l1001q1024
16772a09317l7479J06877j90256Q453N4828k5933j1710k4067q7878J27553J37764
16761e1165M940P7939K20785j39217k30587j17796m3356R2443K03679l8535M3782
$$ y = [265597, 243504, 97495, -84472, -147301, -103779, 56309, 80258, -34946, -265440, -122004, 24344, -77656, -298240, -211661, -271437, -186135, -137795, -113751, -94515, 221483, 374123, 243465, 125261, 137464, 184983, 366311, 197463, -83018, -234268, -254850, -259488, -178531, -242898, -188663, -14973, 256838, 275195, 43754, -141629, -349868, -348103, -174130, -101801, -194587, -208723, -128609, -271662, -337798, -311966, -271502, -209486, -86025, -122080, -285617, -248715, -28907, 60313, 186, -94966, -69830, -71838, 2708, -28293, -109317, -146796, -39919, -230175, -221722, -166894, -192827, -204537, -228604, -316482, -188929, -51165, -46225, 31714, 252499, 113282, -117305, -235101, -278457, -186014, 17665, -20870, 22912]
16750B2912P2560j23174J10255P5536k03637J63731J88765j68701k348Q7142J6716
16739B39757k2790l49169l14291P9788O8975K7511n5265K6784l9648M5242L54491
16728F1385J10201j62156R9618k5248p7412j7841P0543n2356j82618k2301J23857
16717g4328P0273N1524j58115q5270J01904J62917K11152O7154k07485j60716
16707b0990k8858J12435J12583n6676l14562l3285J61515q832j64230N6737P7114
16696a07049o0180j71810M8343J48881j19J19279P7297p2836J89R956M7205J299
16684D0455R0366J37515J38084p6208j78145j54404m3572N8510N5831p5669N5342
16673D8105j49592j98398j25981R6871L79064K72179j54357J6158j89920L5774
$$ y = [22912, 95472, -27702, 82553, 158089, -45548, 118183, 306948, 138247, 135899, 223041, 239757, 216967, -132202, -446493, -366705, -297730, -270219, -325484, -298700, -338348, -293106, 61385, 171586, 9430, 109048, 83800, 6388, -11453, 59090, 6734, -175884, -198185, -74328, -4055, 47469, -110646, -195916, -94012, 68905, 280057, 347211, 139726, -20990, -49848, 62587, 175170, 118494, -196068, -229353, -67838, -76670, -240900, -184163, -107049, -167229, -339039, -290696, -141815, -141934, -22655, 54642, -18194, -18005, -8049, 39156, 40455, 130821, 268336, 406420, 330212, 152067, -2337, -45909, 12601, 68432, -7237, 48105, -101487, -299885, -425866, -328995, 50069, 322248, 167891, 184049, -5871, 29903]
16663B9903N5445j29432m4197M4693N5026J15866j12677j16348j6842j75332j79775
16652d73670Q0377R8678J2782M0769j0071M6867j6804q3064J37776J09111K010
16641e5239M1965L346q8998p940M206R19m4689M7907J39731J66393j8926p8665
16629A10010j78375j48886O1910P6332M3503O8453K75127Q449k39018J9903m2253
16618E5155J1075R4173l1067R7488Q7073l6336j98815k71102q4920J21882Q9543
16607f5851J41762j70760p0621j27768J20815J34895J39254j7025M6565J88941
16597C20207p5654j85131j84265J25787J96795N5194j8330j16712j92126L4743
16587c9492K19686J18835j84946l7934p9160j7266K458J00185k7143J3533q676
$$ y = [29903, 85348, -44084, -88281, -43588, 11438, 127304, 14627, -101721, -118563, -293895, -473670, -393293, -294615, -281833, -241064, -251135, -204268, -221072, -304136, -166360, -57249, -55239, -13274, -9928, -98926, -106866, -102660, -101741, -146430, -98523, 41208, 207601, 188675, 110010, -68365, -217251, -155341, -79009, -35506, 32947, 308074, 316523, 77505, 97408, 55155, 66230, 160403, 129336, 226824, 313897, 277561, 78746, -192356, -277276, -155394, -65851, 75911, -94849, -165470, -293238, -172423, -37528, 101726, 84701, 131266, 320207, 244553, 59422, -124843, 944, 197739, 252933, 234603, 117891, -74235, -39492, 180194, 299029, 114083, 76149, -3011, -20277, -17819, 82366, 55223, 68756, 60080]
16576F0080p3622p7976l3995J19225l9148J0226k6983K2018K38454K8517J14738
16565C41534k5407j60826j66859k4393J27051L5089j12130M5395K5729M3369l08957
16554a80405j15390P5832J53619N0406N1851k3753R8629J2061Q7078j2140l7088
16543A60700O1799R4722o9117j08434p3241J3693k8126P8251j14141r3074q4455
16532a61423M4042p1020J5235N8410k2046r2843j82597o4123J41868M0147O93
16521b93657l3179J12211N1652N2391J17837L2170j29164m1485j4159j27613l8864
16510c11860j8925J17187K54772K45411O8832j67986o7967j14187j22656K4093
16500i3286R501O0786J26987l3242k0942J19347n6575q0220P6479k7098O8187
$$ y = [60080, -13542, -91518, -125513, -6288, -45436, -35210, -62193, -40175, 198279, 226796, 341534, 316127, 155301, -11558, -35951, 91100, 126189, 14059, 59454, 85183, 128552, -180405, -295795, -219963, -66344, -15938, 35913, 12160, 110789, 122850, 209928, 197788, 160700, 222499, 317221, 248104, 139670, 66429, 80122, 51996, 130247, 16106, -76968, -161423, -117381, -188401, -173166, -114756, -136802, -229645, -412242, -476365, -334497, -294350, -293657, -326836, -214625, -162973, -110582, 7255, 39425, -89739, -131224, -145383, -272996, -311860, -330785, -213598, 41174, 286585, 355417, 187431, 119464, 5277, -117379, -93286, -83785, -22999, 103988, 70746, 49804, 169151, 112576, 32356, 108835, 81737, 149924]
16489A49924P8233l6968j26933K1879r7373k78245O900J32398q7331j29071J38182
16478b28405J37089N6375Q3613k9623M2292R2180j81821j50979N609p9707K00705
16467e2672O2573L3596J19879K27665P6464p7841j33433j82589P3693j55416m3028
16456e1109J03498l6290K1657l8846o2296O8087K3804K4798J2782L0381n5538
16445D0928O1286K5372q5769n8256r3939R3464K09017j61881r8161K614J34042
16434F8717M6215k9543j5079j59366P715j38535M1317M0242J24831J91460J06549
16423B84523q4667l4427P354j63096m7177J03527L1475p7670n640K44898N8211
16412C17311j07836j48474r5246m4942j2180o0260L0548o6339j25392J42428J10097
$$ y = [149924, 228157, 191189, 64256, 86135, -11238, -289483, -282583, -150185, -237516, -366587, -228405, -91316, -34941, 48672, 19049, 61341, 153521, -28300, -179279, -173670, -253377, -52672, 9901, 43497, 163376, 391041, 467505, 389664, 256231, 73642, 147335, -8081, -51109, 52389, 16099, 37756, -1090, -63386, 4701, 28505, 53303, 66085, 96466, 40928, 102214, 127586, 41817, -16439, -110378, -16914, 192103, 30222, -67939, -65325, 68717, 114932, 85389, 70310, -89056, -81341, -219876, -178559, -138317, -13486, 177974, 284523, 199856, 165429, 172783, 9687, -37490, 66037, 97512, 19842, 14202, 259100, 317311, 209475, 61001, -34245, -79187, -91367, -151627, -121079, -187418, -312810, -170382, -60285]
16401f0285j36565j06970o0055R5179K51348q3778N6699M7305k3562j13984K8372
16390a06296J26888J66724R7565k58794j67235m1439R1461J31503J18987j3944
16380A45420n1740m3419O1475J98807K306j17243L6230L5106L2033m7099m4513
16369B07363L1122J45547k19633j44427j4940K92M1493M211P8218l6092O8035
16358A61189O9053j01691j30739j17681K010n0094J02669l0692R6386N1071J36380
16347A87861m9639K2144k2963q9023r5527L3090N4950j2811j52666o2134N35M0461
16335a45722J6465L603J74209n0299m349J13855n5871r3101k8482j35528m3344
16324b48564J1458J20661K5183M3696O6592k9277Q140L3543J3731j05755r3271
$$ y = [-60285, -196850, -303820, -363875, -268696, -17348, -101126, -44427, 2878, -20684, -134668, -106296, 20592, 187316, 284881, 26087, -141148, -182587, -91126, 40377, 159364, 145420, 93680, 50261, 111736, 310543, 312849, 195606, 231836, 266942, 298975, 251876, 207363, 238485, 384032, 164399, 19972, 5032, 5324, 46817, 51028, 129246, 93154, 161189, 230242, 128551, -2188, -119869, -117859, -167953, -65284, -95976, 410, 51481, 187861, 138222, 160366, 137403, 48380, -47147, -14057, 40893, 28082, -124584, -186718, -186183, -145722, -129257, -125654, 48555, -1744, -6093, 107762, 51891, -41210, -69692, -205220, -248564, -237106, -116445, -91262, -47566, 19026, -10251, -2111, 31432, 45163, -60592, -153863]
16313a53863j1926o5174p4415O6017R0894J80290J04935k32356j10027j29188
16303c34813j2098J25915J53093K9102J53186R8496o5847K9017o5446j05463O832
16292A1974N8133j8164p3711j27580J20306k4504p8030K01428r4052q7076J3967
16281i7309Q8133j7205j21082j4052l4929K15122l9493j20517R0062J15151l8344
16270B5537N2387q0227p3521L2352J37023O4068K1124j16447j64728K19859m2053
16259G5374j80305n8724j06737P1644K8991k6057J21149n7427r9283j3903J00027
16248a45251k2503N0054M7284N9704P5175N7575k01017m2524m6442J14330k0955
16237g4570K16512J27856j35204o0152j357J0467m740r0411o8511P7118M7036
$$ y = [-153863, -165789, -230963, -305378, -239361, -148467, 31823, 136758, -95598, -205625, -334813, -346911, -220996, -67903, -38801, 114385, 212881, 147034, 176051, 110605, 5142, 11974, 70107, 51943, -21768, -149348, -29042, -53546, -131576, 69852, -24200, -111276, -97309, -9176, -26381, -147463, -161515, -196444, 18678, -20815, -141332, -51270, 63881, 25537, 77924, -2303, -75824, -43472, 93551, 157619, 178743, 62296, -102432, 117427, 75374, -104931, -163655, -270392, -198748, -169757, -195814, -74665, -132092, -231375, -245278, -145251, -167754, -117700, -70416, -10712, 64463, 122038, -78979, -121503, -167945, -53615, -74570, 141942, 269798, 134594, 74442, 73085, 83552, 78812, -11599, -80110, -2992, 44044]
16226D4044Q3978J94427R0802q1593j3167m1271j59921J84886k8676j92058p2767
16215H684J77564j1344k13539J34799m4372j85358p6040P4884J15188O8999J07946
16204A57411j4388K4240p4278j95188r2816p568J30729O2593K0313j62596L9033
16193a12515J80362j6142j55046q1924j7932J0601l0717J02989L492j18902n6646
16182b92380P9128O0521P1350R5127M3585M5244L3575m1682K0783j22357r1319
16171i8425Q9709p2940m710K4609L1667n8193k6935L5268Q6124K16664N9523j46613
16159A35748j08696J25514n5559n064j66333j02102O0614L54218J41254j73492
16149B06102j66305m8689k6596J15858L5607k92637j78369n9135l343M7931j2415
$$ y = [44044, 128022, 322449, 413251, 331658, 318491, 277220, 117299, 302185, 273509, 81451, 8684, 186248, 174904, -38635, 96164, 51792, -133566, -209606, -134722, -19534, 49465, 157411, 143023, 167263, 92985, -102203, -195019, -202587, -71858, -9265, 11048, -151548, -112515, 67847, 51705, -103341, -185265, -203197, -192596, -223313, -120324, -116832, -235734, -292380, -213252, -152731, -81381, 13746, 57331, 102575, 136150, 94468, 115251, -7106, -98425, -8716, -81656, -86366, -61757, -30090, -88283, -115218, -79950, 6174, 222838, 282361, 135748, 27052, 152566, 97007, 91943, -74390, -176492, -115878, 238340, 379594, 206102, 39797, -8892, -35488, 80370, 115977, -176660, -355029, -414164, -417507, -369576, -381991]
16138c81991n788K77451J18656J93902j01449j38324j60606o5906J27930N1234
16128h4891M9800n3322L8502L03991q2030n0452O7768j27759J27608O1052j44737
16117A05530j67172p0438J21972r2270j17276J31067J71945q63M6582N3780K4626
16106B07483p1770J7579R3116J18010q1028j66491K6360q9580Q4261m3606P6243
16095A70577M6258j95763q8436n5992o9937j55106J70722K02495J33325O3065
16085B21208k6767o3531M9860n7045l9121m002j00563p2550J1351l5136m6910
16074a63206n4105N2140n9567K03165Q7143n6503L5929Q0986j26327n9208L0889
16063b8664O5642J73499j49978m5200o022L8799m4227L2300j2195O043j6482m1098
$$ y = [-381991, -387779, -110328, 8328, 202230, 100781, -37543, -198149, -264055, -136125, -84891, -35091, -88413, -49911, 254080, 172050, 121598, 189366, 61607, 189215, 250267, 105530, -61642, -132080, -10108, -102378, -219654, -88587, 83358, 82495, 129077, 182857, 207483, 135713, 153292, 246408, 364418, 283390, 116899, 143259, 53679, 137940, 94334, 170577, 216835, 21072, -67364, -123356, -193293, -348399, -177677, 24818, 158143, 221208, 194441, 130910, 180770, 123725, 84604, 80602, -19961, -92511, -81160, -116296, -163206, -217311, -165171, -224738, -21573, 65570, 9067, 44996, 125982, -345, -59553, -28664, 36978, 210477, 60499, 15299, 9277, 48076, 3849, 36149, 23954, 29997, 13515, -27583]
16051b7583R9793m154J2564J19072k1149j14929r0938n3106J54824k2446o7680
16040a5732p2292n1912R3947J48686O0457L4709k28648P3475Q1813o5089j8351
16029D1063o8698M0114L2439R4519j99441J478J49823j12676p9218p340R2265
16018a5672R4692j24834m4245J01081K7475K4829L4785j84116k13157m6910J82520
16007a63552J28290R9979P1045J07806P9687l8574k8234P8081n7669j4686j45911
15996A16262m3453R985q4086j43736J05184k4136j15518j44434P4311J49641q4798
15985a84778L0927Q9195J05794L269J4547J35182J48274Q1408j40135k82957p6453
15974g5727j04552m0360J89932K46316Q9018j57353j61410j47280P4026J02823
$$ y = [-27583, 72210, 68056, 80620, 199692, 178543, 63614, -27324, -80430, 74394, 51948, -15732, -88024, -139936, -45989, 102697, 163154, 197863, -30785, 42690, 124503, 59414, 41063, -27635, 12479, 44918, 139437, -60004, -58526, 91297, -21379, -100597, -107937, -15672, 79020, -45814, -90059, 11022, 38497, 63326, 98111, -86005, -299162, -346072, -163552, -35262, 64717, 135762, 243568, 323255, 284681, 256447, 334528, 276859, 262173, 116262, 72809, 82794, -1292, -145028, -39844, -63980, -179498, -323932, -249621, -99980, -184778, -153851, -64656, 41138, 44407, 58954, 194136, 342410, 423818, 283683, 726, -75727, -180279, -220639, -30707, 215609, 304627, 147274, -14136, -161416, -87390, 15433]
15964A5433O5840m6808p3459k57966L8215J58320n9651j64904Q2160J17625J18303
15953f892q446j11002q4162P6926J589J23339P9851o0100J06610j7032j19810
15942a9129p2256j15339N3085J27290J68155q680q1293R0356J17170J2885k3636
15931B48608l3055m3089j00234j62261K11271M8850l4738j8211j22264o9958J76498
15920A01417j1228k36845l27981P2365K02302Q5648n6197m6994R092j29814R3302
15909b44933K8294P8042K7426J46442O1901J3804O6620o3732r1381J53930N6811
15898B33224J18680p8063m7966p8590n4803k206l0106J41582J1944J38104m7546
15887C04254k28202l0772N1660K1216n3604j3444j3330j05189N7473O9310j37515
$$ y = [15433, 81273, 34465, -38994, -296960, -258745, -100425, -160076, -324980, -242820, -125195, -6892, -15338, -126340, -210502, -133576, -131987, -8648, 71203, 11103, 117713, 100681, -19129, -91385, -206724, -153639, -26349, 141806, 133126, 51833, 142189, 259359, 272244, 248608, 215553, 172464, 72230, -90031, 121240, 170090, 135352, 117141, -5123, -75081, 101417, 90189, -146656, -474637, -402272, -199970, -114322, -170519, -217513, -208421, -338235, -244933, -216639, -138597, -111171, 35271, 97172, 110976, 177596, 113864, 22483, 176413, 233224, 351904, 273841, 225875, 147285, 92482, 90276, 60170, 201752, 213696, 351800, 304254, 76052, 45280, 96940, 118156, 64552, 51108, 37778, -67411, -9938, 59372, -78143]
15876g8143M341P1588J01182J01164j52717j17326M8874r4411j84843Q5825K67031
15865E2565J99293M9119L6104j8834o9282J9362Q167l9169o4142n4419j3085R0318
15853A95997P0806m1234j51606o1433O6240n5039n946m5923n2123l8938J80028
15842F0829O2370j83038m4452J83887Q1573p855q3168N4439l4200j72018N6180
15831b5453J14769j76247k16558o7376J62525J25917r2091n7225n8976P1868P6429
15820a42418p3954R214J0981R1817J2895J2844O2606J85310J97805p8119r7318
15809A91663O6248R707O5205j18071j85872p8122m583o0040R4524O7140P5494
15798A23293j018j78273J25511n5196j50123k3180m4230J12184K02551l7166l7889
$$ y = [-78143, -73802, -2214, 98968, 200132, 47415, -69911, -21037, -115448, -300291, -214466, 52565, 251858, 300977, 337081, 318247, 248965, 268327, 276494, 237325, 173183, 118764, 105679, 195997, 266803, 225569, 73963, 12530, 78770, 23731, 17785, -28138, -80261, -119199, 60829, 123199, -59839, -104291, 79596, 161169, 153314, 70146, 124585, 90385, -81633, -25453, 89316, -86931, -303489, -370865, -208340, -82423, -174514, -231739, -290715, -218847, -142418, -216372, -207158, -196177, -104360, -91465, -78621, -16015, 169295, 367100, 288981, 191663, 257911, 267618, 332823, 214752, 28880, -49242, -53825, -113865, -19341, 47799, 123293, 122275, -55998, 69513, 14317, -135806, -158986, -203216, -91032, 111519, 74353, 36464]
15787C6464J09949J62753k81731j37029J15376L1240q7449n1575P8289k5771M4278
15776e206K7162m4276j85426L1781K30990R9236q8092j46326n2111J43693M6511
15765E7936l766J84893J41372k71584k54456P9200O9057K15457j03848j65018
15755e0757p2772J41770J50975k6412j71976O5290j28836j83058M4460L8037Q6241
15744a07038R4460r0492j1794J91171n7660O6446N996M632r082r1093n2276j18051
15732a74781n8026l7610J6654K18551J11330k49877j7408J45448m1222J9913R4687
15721B7659J10585m8592o936r0085J17668P9098j07183K1996j76614r7756m7957
15710b18117Q5773J78228K05584j7275L7331L3047R815k7951q8999k64075k0899
$$ y = [36464, 146413, 309166, 27435, -109594, 5782, 37022, -50427, -102002, -23713, -49484, -5206, 21956, -22320, -207746, -175965, 55025, 154261, 66169, -80157, -132268, 11425, 57936, 54170, 239063, 380435, 108851, -145605, -66405, 2652, 218109, 114261, -50757, -123529, 18241, 169216, 142804, -29172, 36118, -92718, -275776, -231316, -193279, -107038, -12578, -103070, -114864, 76307, 18647, 85093, 91089, 95721, 86639, -4454, -56730, -174781, -232807, -270417, -253763, -35212, 76118, -173759, -191167, -45719, -86941, -67028, 27659, 138244, 89652, 82716, -7369, 110299, 189397, 82214, 104210, -72404, -170160, -218117, -132344, 45884, 251468, 234193, 271524, 304571, 314386, 286435, 197436, -66639, -87538]
15699h7538J34261j43208R8347O861O497O2957Q6263O4034k12159k24440n9227
15688b67352J7513J39611n5581J72335K67814n4505n0964J03612N5907n7136j65984
15677A05270p6748K39P3317o3493J63671k3084j10533n3609o0894j73741M0552
15666a79053J5110p1132J29181K1380k51530M5881K00388l372o2155K60633J02351
15655B07682n9669n6779J32545L0114j24412n6907J0454j21441M0980J12204k9485
15644H5286n4812n7126m7194m3359j19219J5428J97411K9250L5966l0405n6521
15633d5295p389q6856J10541K9191J07088q4426l5596Q1624l2712q7577J89999
15622A38592J23637l50776j51246j81152l3045L15517K62107o3900j49217P4132
$$ y = [-87538, 46723, -96485, 1862, 8723, 15220, 78177, 164440, 228474, 16315, -208125, -267352, -249839, -110228, -165809, 6526, 274340, 219835, 168871, 272483, 328390, 271254, 105270, 28522, 28761, 102078, 38585, 202256, 179172, 68639, 15030, -45864, -219605, -179053, -163943, -235075, -105894, -84514, -336044, -290163, -89775, -93147, -155302, 105331, 207682, 148013, 91234, 223779, 253893, 129481, 72574, 83028, -38413, 2567, 114771, 85286, 30474, -26652, -73846, -117205, -236424, -220996, -23585, 5665, 41631, 11226, -45295, -52684, -139540, -28999, 192, 107280, 22854, -12742, 68882, 36170, -51407, 138592, 262229, -88547, -239793, -420945, -453990, -138473, 123634, 59734, -89483, -15351]
15612a5351Q1371r8138j99893K9357P4923J80719K59850R1386p2728j17114o8381
15601A46001p9801O4227N2710q5584j15356k41691j5177J22561k1374O1644J65551
15590E3711n0392j07857n0742q655K75919Q728j42744O7526M5359r8741J42488
15579A34600J58707j17051l18209j8514K56358o431J51718n3051K0266j395Q3165
15568B90163p9876j02409M4462q0107J13955L1375J6509q2107j67782p3365K91618
15557B02436J59330j86197q1102j67152j59828J04174l1541j30724j02413j34515
15547e27532J33640L23977K30055j00693r4689K9988j272L5762P0904K2252o0781
15536F1611q4749M8504J83456M5115k54286q6128K00078K36442J53229j60423
$$ y = [-15351, 66020, -32118, -232011, -202654, -127731, 52988, 312838, 404224, 331496, 214382, 146001, 66200, 130427, 183137, 97553, -17803, -259494, -274671, -152110, -173484, -111840, 53711, 3319, -104538, -155280, -163935, 111984, 120712, -22032, 45494, 90853, -7888, 134600, 293307, 176256, -141953, -160467, 95891, 89460, 241178, 188127, 208393, 206998, 290163, 210287, 107878, 152340, 72233, 186188, 217563, 234072, 151965, -15817, -89182, 202436, 361766, 175569, 94467, -72685, -232513, -128339, -159880, -290604, -393017, -527532, -393892, -69915, 160140, 59447, -35242, -5254, -6526, 29236, 100140, 122392, 61611, -23138, 25366, 208822, 253937, -349, -86477, 113601, 350043, 503272, 342849]
15526C42849j15660j36463n9972j16432j04693L5837J52282j5604m4341k3491
15516h5688K56938P1406M1745l8493n127N437J16j30980j435l8250j9413o5319
15504i063p1724k09515k0308n9506O4276J78447Q8976L4879Q8636l1999j2730
15493D0369j15051j71237j0623Q410R3529P0984J69098m0633K5938N5500n9348
15482F6936q9889L3836r594j03852l1536n8502N8850K42930J32635n1031m1903
15471A48880q4290o4351j86057J19053q23Q6830R4446L3513j84355r3276J09495
15460b0935o5081j3931J84944k8856p4458j82896M6820J90752J02009j17413j67568
15449a46613J45306K30956L2108j01783J831q2592j5451n9761O5279J03381J12748
$$ y = [342849, 227189, 90726, 30754, -85678, -190371, -154534, -2252, -17856, -62197, -85688, 171250, 242656, 284401, 245908, 240781, 246218, 246334, 115354, 113919, 75669, 56256, -9063, -80787, -290302, -310610, -370116, -305840, -127393, -38417, -3538, 85098, 53099, 40369, -74682, -245919, -256542, -248132, -154603, -83619, 85479, 44846, 70784, 126284, 66936, -22953, 10883, 1289, -102563, -134099, -192601, -133751, 109179, 241814, 190783, 148880, 64590, 239, -185818, -66765, -67588, 19242, 113688, 147201, -37154, -130430, -20935, -86016, -99947, 84997, 56141, -18317, -201213, -154393, 36359, 138368, 20955, -146613, -1307, 229649, 261757, 159974, 161805, 79213, 63762, 4001, 69280, 172661, 285409]
15438B85409j52928j38089q1438J17614J14038R6099l1081j62833k3558L4815
15428E8048q8043n3104N1290J31897j1838j41031m3350J28757n8656m3090J89929
15417A20809L7851j05831n0313k35042n9990J48038P2951M8720J07011j1394q7053
15406a4243q7345n2281j3424O4357N9977l9421j01008Q3541O9077J46161Q4368
15395A99759p9142j16572o8266k6415O941j04141J02248J25603L5886k87719K0786
15384a91032K42672J9348q625q9460N6337j42879j48266R170R1671j4985J84344
15373H295J70574o5321N5818n7028j59921m1707J14411O5167K9047k6794L3035
15362A25576m3246Q5359K7607j50257j37110o8129J29203N7981j56232k37485
$$ y = [285409, 132481, -5608, -87046, 30568, 144606, 240705, 209624, 46791, 23233, 58048, -29995, -83099, -31809, 100088, 88250, -52781, -96131, 32626, -26030, -69120, 120809, 158660, 52829, 2516, -232526, -292516, -144478, -71527, -22807, 84204, 72810, -14243, -101588, -153869, -167293, -102936, -42959, -82380, -183388, -99847, -30770, 115391, 199759, 120617, 4045, -64221, -90636, -83695, -187836, -85588, 40015, 75901, -211818, -191032, 51640, 70988, 62363, -27097, 29240, -113639, -261905, -252735, -161064, -176049, 8295, 178869, 113548, 169366, 112338, -47583, -89290, 25121, 90288, 119335, 92541, 125576, 82330, 167689, 195296, 45039, -92071, -160200, -30997, 26984, -129248, -366733]
15352c66733l7341R8940L8913J00968J10415J8913k8734r6605J13746P1196k3351
15341C27Q6202p702K8814J00544O1577q0694n6034j12249q4451J28107L8251P0423
15329A73115p8328k34506J5859L66874K58912j59701m07412p8404R9806M9076
15319E291j06515N3180R984j5955R159p0107J6279M6893R4758N5520J1974j98926
15307h8465M7059l1530k4055J14172J8721q2587k5933J77466L4117k8863p0282
15296C9820j83920j7137j6998K36902K93026J68084k47561k35978l8217K12801
15286B10822L1754M9284k7427j86230j20951N1002N9906K8540j5959l2553m0484
15275G704R4752j35770p8536L6686J3049l9255J14531P0114m7579n2792k0040
$$ y = [-366733, -404074, -305134, -266221, -165253, -54838, -35925, -64659, -161264, -47518, 23678, 327, 86529, 78827, 107641, 208185, 269762, 189068, 133034, 20785, -63666, 64441, 102692, 173115, 94787, -139719, -123860, 243014, 501926, 342225, -65187, -143591, -43785, 5291, -101224, -48044, -38060, -54015, -44856, -114963, -98684, -51791, 42967, 98487, 110461, -88465, -41406, -72936, -96991, 17181, 35902, -46685, -72618, 104848, 138965, 110102, 39820, -144100, -161237, -178235, 58667, 351693, 519777, 272216, 36238, -1979, 210822, 242576, 291860, 264433, 78203, -42748, 8254, 68160, 96700, 80741, 48188, 7704, 102456, -33314, -111850, -75164, -62115, -101370, 13161, 83275, 35696, -17096, -37136]
15264c7136R7544J10542j58720N1971M3293r5762K9456M1299n13O1568J55341
15253B98883k6438j18811o8965L6872o8018l0810m8635q9005P1156Q6879m1311
15242A797O2850P0475o9423r9540n6742j61887K12766J1329j96611j6026J54259
15231h6753J32660j39481m2525J36497o9731j18497J20320J51148l3643j39137
15221h9142P0710P7555j29764j43278k6025P1451Q5305Q615K00465J41058m206
15210B62744j14245K337Q1111j11050j86211j50018m9841Q0874J48621J97256
15200A61578n9388k8019N5872R8876J38692j53699j66375j60902J26472N047M3108
15189F1262o2867j60198J00133J07016j924j29571M1498J20488r442l4616N161
$$ y = [-37136, 60408, 170950, 12230, 64201, 107494, 11732, 41188, 82487, 81974, 143542, 298883, 272445, 153634, 84669, 121541, 53523, 22713, -25922, -114927, -43771, 43108, 1797, 64647, 135122, 65699, -33841, -90583, -252470, -39704, -28375, -224986, -241012, -86753, 45907, -93574, -136099, 398, -69333, -187830, -67510, 83638, 49995, -89142, -18432, 59123, -70641, -213919, -239944, -168493, -83188, -74573, 125892, 266950, 262744, 148499, 150836, 231947, 120897, -65314, -215332, -265173, -184299, -35678, 161578, 102190, 74171, 130043, 228919, 367611, 213912, 47537, -113365, 13107, 18154, 61262, -1605, -161803, -61670, 45346, 43422, -86149, -44651, 75837, 66395, 31779, 36940]
15178C6940j40810n8830J99784J47653j34542n1248j3671k0558O8833K9742j59060
15167i5767j31043J64422K62446l7157N0498N9350l6862Q332k0701K580o2134
15156A63964k7119M0023J37160j43625N5794k2528k98865R7612Q6712N5396K9518
15145A74042M785N1611p0631q3304k4758q5856Q028o9386q4610K12798q1036m3454
15133i1771J51290k2394P721l9569Q2008J04977j06430m1349k88309m2315P9635
15122b06506K6802K65804M2286j61041j400k7719N3220J46837Q7245o9573q0490
15111G5465o2378J26630J38518j21907O5178j08338j75004j0212j37275O4071
15101a45252m9511J8484P9888J32709K668O5970j04295L7713p7583l126R073J0364
$$ y = [36940, -103870, -162700, 37084, 184737, 50195, -1053, -14724, -35282, 33551, 63293, -95767, -226810, -62388, 200058, 162901, 213399, 272749, 235887, 244219, 223518, 226098, 163964, 136845, 176868, 314028, 170403, 226197, 203669, -95196, 2416, 89128, 144524, 174042, 178827, 230438, 159807, 76503, 51745, -34111, -26083, -95469, -180079, 32719, -48317, -91771, 59519, 37125, 44846, 5277, 87285, 192262, 85832, 44483, -243826, -286141, -206506, -179704, 86100, 128386, -32655, -34055, -61774, -8554, 138283, 225528, 155955, 75465, 13087, 139717, 278235, 156328, 221506, 113168, -61836, -72048, -209323, -145252, -194763, -176279, -96391, 36318, 38986, 104956, 661, 38374, -39209, -42335, -33262, -22898]
15089b2898J25012Q557k25766j87521J69306L13897K38506j09472k84868k2486
15079B267l45j68764j18207r8097J17486J25271L2720Q8192n5165j20681L5506
15068a59817Q4398J00026J21945J3830O8218k41926k07982p9334J39450M0848
15058a20344p3117k8799J3927K4488N7984J07472O2274O1583j14047J39087J4155
15047A44663k5554m0612K2106l538J15042L9061M883j36657j45873j48907J41117
15036c4269J53383O3798j04496o6075Q1800P9890p0353j22620k4329P5130P8236
15025A10095l9971j89622R0482J21012J08050m1015J36496N0596o2357r105R468
15014B84129o9813j55596k715J02471j11915j43810O9652m2575k7921J12893L0345
$$ y = [-22898, 102114, 110671, -115095, -302616, -133310, 180587, 419093, 309621, 24753, 2267, 1922, -166842, -285049, -383146, -265660, -140389, -107669, -19477, -74642, -195323, -159817, -75419, 24607, 146552, 160382, 228600, -13326, -221308, -300642, -161192, -120344, -193461, -222260, -208333, -183845, -125861, -18389, 43885, 105468, -8579, 130508, 144663, 119109, 78497, 100603, 97065, 212107, 251168, 256051, 119394, -26479, -175386, -34269, 119114, 182912, 78416, 12341, 94141, 174031, 103678, -18942, -43271, 31859, 110095, 70124, -119498, -29016, 91996, 200046, 159031, 295527, 346123, 283766, 274661, 284129, 214316, 58720, 56005, 158476, 46561, -97249, -27597, -70172, -98093, 14800, 45145]
15003D5145m5018j21060K76959J75496l2363j54003k67731m2928R4770Q0130p3975
14992f4578j76108r543k8750l9075j6995n575Q7780J84413J4760p4152j03206
14981b31029R1249m155J65652J36146m7731j48387R540J74116L4815j15670K1353
14970H5899k5308j21317N1413Q8862n2358l6398j19281k746J83872J10242Q1143
14959B44023j05302o6719L6089M1509k12005j29610J81634j2058j65930l0339
14949b18708J07971R2504N2116l839J8840J38300r7331k05848M0884K47643p504
14938A65028j6283j62121j11601J45131k8736n9672o8884p7825k1086K9470P6236
14927a30343J77161M9118N1059M7377n5027j09756j35408p9099j98520o3857K50138
$$ y = [45145, 127, -120933, 156026, 331522, 299159, 145156, -122575, -165503, -70733, 9397, -64578, -240686, -250229, -278979, -318054, -335049, -340624, -252844, -68431, -53671, -127823, -231029, -139780, -143935, 21717, 157863, 110132, -38255, -28715, 145401, 180216, 64546, 85899, 60591, -60726, -9313, 79549, 27191, -9207, -128488, -131234, 52638, 162880, 244023, 138721, 72002, 108091, 149600, -62405, -192015, -10381, -22439, -188369, -218708, -110737, -18233, 33883, 30044, 48884, 187184, 89853, -115995, -75111, 172532, 165028, 148745, -13376, -124977, 20154, -8582, -68254, -137138, -214963, -236049, -206579, -130343, 46818, 95936, 146995, 194372, 139345, 29589, -105819, -184918, -383438, -447295, -197157]
14916a97157J55690j19357l7318J30811L8431J62533P6503j25199L4373J29083
14906B48393O1269j81487k27819r5937Q8945J07447q4280L1465l6645M6133P4076
14895C1560Q7965r281j3781j00209j21686m2316o6005l7698J37828L24999R3816
14884B85192r2261j45978j52510O8515q2972M3655R9157o8540J0836M6747J87319
14873A99160J10214N0671j70857r2780n1237j28103o3977r8725J43207J64977
14863F2550p0618j44111q4085R0892J13310n3074M4968q072Q0350J0650J44411
14852A87171o4086l9499j48805j46317O6739J64421n7440j85782J21793K66655
14842A64850j05524O0762J7468r4896j08993O2712L6117J4830r2336k15203j66712
$$ y = [-197157, -41467, -160824, -198142, -67331, -28900, 133633, 210136, 84937, 119310, 248393, 309662, 128175, -99644, -195581, -106636, 811, -83469, -52004, -88649, -42516, 31560, 119525, 110244, 96463, -3746, -125432, -167748, -233753, -271451, -133623, 191376, 285192, 192931, 46953, -105557, -37042, -120014, -76359, 22798, -45742, -34906, 11841, 199160, 309374, 360045, 189188, 96408, 45171, -82932, -146909, -245634, -102427, 62550, -8068, -152179, -236264, -145372, -32062, -85136, -40168, -48240, 32110, 42760, 187171, 123085, 83586, -65219, -211536, -144797, 19624, -37816, -223598, -101805, 164850, 59326, 120088, 137556, 42660, -66333, -3621, 32496, 47326, -45010, -260213, -426925]
14831d26925j23309K90607J64047J27222J50122n3805j62934l5971L3540O884
14821c0522l0323M1173N525R671n1435m2071O1980J85148J94696q8702k434j97794
14809E4912J3634l5287k3141j43917M1807k4786K09426R6377j50051j49883J01376
14798i533J23370K5530j04076M7031K16748q480j35865j62526N4055P7432o1157
14787F2529k485J07612L516M3982j43166j8217J4462R341m4903L4301K61198l9681
14775B88489q144j17902J63223Q2746j33645k06372k1106o5142l4518J1880k57592
14764b98083l9250L5033O9553J16302J56632J5611O7076n399p4258r2326M4084
14753e025N6159J7060M4891n9758O2815J59978O4628k6172J1806P0460K0539j28906
$$ y = [-426925, -550234, -259627, -95580, 31642, 181764, 127959, -34975, -70946, -37406, -30522, -60845, -19672, -14147, -4476, -55911, -97982, -36002, 149146, 343842, 255140, 252706, 54912, 68546, 33259, 10118, -133799, -91992, -116778, 92648, 189025, 38974, -110909, -9533, 113837, 139367, 35291, 82322, 299070, 290590, 154725, -7801, 46254, 123686, 62529, 60044, 167656, 171172, 215154, 71988, 53771, 68233, 77574, 32671, 66972, 328170, 288489, 280345, 162443, 325666, 408412, 274767, 68395, 47289, -17853, -52371, -40491, -298083, -337333, -302300, -232747, -116445, 40187, 55798, 122874, 117475, 43217, -49109, -5025, 51134, 68194, 113085, 53327, 116142, 276120, 340748, 314576, 326382, 396842, 417381, 288475]
14741B88475m0544j03562M3883O3480P8263k54999p4093L8720r9764P6188J31086
14730A47133j0816P9596k8124j88060k17301M8260m1064L1638J68625K3841m0092
14719b6364l8278m6070P9407O0486j31104m8861k2014l9131J30302J78741J52195
14708B49309L3221j8837p6613n4646q2458q5822N3479P4325k8745q5783k6316
14697d8886J66540K44585j34502q8219R169J75403p5797k2620j73507j70974P1752
14686d7056j95593n6710J01917M4847m0474O4025K19133J09713o0355q5761l3871
14675A9815j14148n6801p895N5075j862m8623o9858R1589o9598r8536N1437R3927
14663a55478J83770o9541J1278Q3200L2635K043P544k281J5920j36262m4187k08130
$$ y = [288475, 247931, 144369, 188252, 251732, 329995, 74996, 903, 39623, -60141, 16047, 147133, 136317, 215913, 187789, -271, -217572, -169312, -210376, -178738, -10113, 13728, -26364, -64642, -110712, -31305, 29181, -101923, -150784, -172798, -211929, -81627, 97114, 249309, 282530, 263693, 187080, 132434, 49976, -35846, 17633, 91958, 63213, -22570, -48886, 117654, 362239, 227737, 139518, 148687, 324090, 248293, 225673, 52166, -118808, -47056, -242649, -299359, -197442, -152595, -193069, -129044, 90089, 199802, 139447, 53686, 19815, -94333, -151134, -159029, -103954, -105816, -154439, -224297, -132708, -202306, -300842, -249405, -155478, 28292, -41249, -29971, 53229, 85864, 87907, 95451, 93170, 109090, -27172, -71359, -279489]
14651b79489O2039O4263J17193J19093L1569q0656j78574o0854J47857Q3959l4436
14640h036l8411O3865j16303K7237P8300Q7981J4158J307M7229k31227m4770m0226
14628a58896J7252J36932O8022k3567k1907J60714M4068k11870J4485n5150j86570
14617b16487K2633Q6059J38776K2776k14475j31733J38147K4939J35560L3635
14607C9830o4963l4637M0122m6802o0072Q5402K63439L9957j3208j63543r4801
14596i276l8591K6854p2172o246L4934J19128j39043J02021p2201l2541J81418
14585I4285L0239j12313j41331J59987J56952j9808R8411J6391j46718q2478J2959
14574F6576N0122k44126N4175J03535J17530O0608P738k9729j39608l3395K14018
$$ y = [-279489, -217450, -153187, -35994, 83099, 114668, 34012, -144562, -205416, -57559, 26400, -8036, -46447, 17418, -98885, -71648, 6652, 94633, 108791, 110098, 157327, -73900, -118670, -158896, -141644, -4712, 63310, 39743, 17836, 178550, 222618, 10748, 25233, -29917, -216487, -193854, -107795, 30981, 53757, -160718, -292451, -154304, -129365, 6195, 39830, -25133, -59770, -19648, -66450, -126522, -41120, 222319, 262276, 249068, 85525, -9276, -47867, -21013, -93185, -99431, -64497, 54631, -84412, 17609, -54592, -87133, 94285, 124524, 12211, -129120, 30867, 187819, 168011, 266422, 282813, 136095, 53617, 66576, 116698, -127428, -73253, 30282, 147812, 208420, 216158, 186429, 46821, 13426, 227444]
14563B27444L8543j53561q5801L845K4494Q259j45815j73562R7183J36259J23599
14552A00887L2549O4010p2731j39662q2808O8801j08206o2636J6537k46834Q3471
14541c46622L18189J24727m0951k4461l6034L9760j3120O0809J26585J12110O0133
14530C81125r0893J7572k33318j27622M6338k2329j03198j17279L8781J08956
14520a01867N72J781K12117J54103M701N0721j72267j69731J37012r4811k7501
14509e170J05949K8203M870q6900n449j8450r6417K54N1389R6524k2251J36348
14497A88900r6956j14813R1863J9144J2567o1407n8784M4507j23610R8360L1533
14486C1304O0761m6129j21745k05706q9889K20569K07939q7740J7051m2806k88350
$$ y = [227444, 265987, 112426, 26625, 30470, 54964, 63223, -82592, -256154, -158971, -22712, 100887, 133436, 197446, 124715, -14947, -97755, -28954, -137160, -199796, -183259, -430093, -346622, -28433, 96294, 55343, 30882, -5152, 34608, 21488, 82297, 208882, 320992, 381125, 290232, 307804, 74486, -53136, -6798, -29127, -132325, -249604, -210823, -101867, -101295, -99514, 112603, 266706, 271407, 322128, 149861, -19870, 117142, 22331, -5170, 100779, 128982, 133852, 46952, 41503, 23053, -73364, -73110, -21721, 74803, 52552, 188900, 91944, -22869, 68994, 88138, 100705, 39298, -19486, 25021, -98589, -229, 31304, 92065, 45936, -75809, -281515, -371404, -150835, 57104, -30636, -13585, -56391, -344741]
14475c44741J00564J89252K29294j29422m345m9179K05976N7766R6397k34532
14465A17030k25659j78899L1195Q9658K57645K9468o5339M8828j20600j07609
14455a24282k4537Q5318Q9816J91516j83920j37053O6496K1846Q6828K3379j07088
14444a1681L3528Q2383J5310k2506k6932P1636N9176k29703k01760J35569J50645
14433E5665j2789o7124j50725m5118K14295K47856J44164m4849j7653q1329j11870
14422A30523k11774k7129M0871j0291j1356k0274m04J11371O107n3213P6150K74403
14410C04984k02241j81529K353M0262N6665L3910k76613m2529o152J58375J71132
14399E8617j48928J730K4760m4471o4713L0371O086J44988J47662N1013j2792
$$ y = [-344741, -244177, -54925, 174369, 44947, 40602, -8577, 197399, 255165, 351562, 117030, -108629, -287528, -256333, -166675, 90970, 120438, 55099, 103927, -16673, -124282, -148819, -63501, 26315, 217831, 33911, -103142, -36646, -14800, 72028, 95407, -11681, 21847, 104230, 119540, 97034, 70102, 141738, 200914, -28789, -230549, -94980, 55665, 42876, -24248, -174973, -220091, -5796, 242060, 386224, 341375, 323722, 242393, 130523, -81251, -108380, -67509, -77800, -89156, -109430, -109834, 1537, 7644, -45569, 30581, 304984, 102743, -78786, -76433, -36171, 20494, 54404, -222209, -264738, -270890, -112515, 58617, -90311, -88581, -63821, -108292, -173005, -142634, -136548, 8440, 156102, 207115, 194323]
14388A94323P0459j20231j22695j09448j0357J3094q1886M3673J06054J23321
14378A06307P4978j80605q4988J91577j39231j78867R6967O2431L0493q6191o4351
14367a71480Q4134K49473M4051M3329J92177k2134k25716j39995K15698Q557L1121
14356C09215k201j4972l566L1877M6092r8469j40149J3288N0046O69r5601j3194
14344H3035k01104r5341J3900J23963J94528J83926J45098j14369k19874j78679
14334f4917l2888K23735j4138q0504k32997J7071J72275R0134M1962k9762p2362
14323A7609l3334O5056J1921j24209j0085K1080k43100J00350L31389k4078J05729
14312B18328R9810j63543n8423Q0529R5806j68361j33904M1884J49890J25041
$$ y = [194323, 264782, 144551, 21856, -87592, -97949, -84855, -166741, -123068, -17014, 106307, 181285, 680, -84308, 107269, -31962, -210829, -113862, -51431, -20938, -107129, -171480, -87346, 162127, 206178, 249507, 441684, 419550, 193834, 53839, 269537, 278094, 309215, 307014, 292042, 288476, 320353, 366445, 267976, 127827, 141115, 191161, 191830, 96229, 83035, -118069, -213410, -199510, -75547, 118981, 302907, 448005, 333636, 113762, -64917, -97805, 125930, 111792, 31288, -201709, -184638, -12363, 77771, 119733, 89971, 17609, -15725, 49331, 61252, -62957, -73042, -51962, -295062, -194712, 136677, 112599, 218328, 318138, 154595, 96172, 176701, 272507, 104146, -29758, 12126, 162016, 287057]
14302B87057j61009j84295r4187j44846J82298P0417k182j21176Q3529O9598K1240
14291F444j9649j5573O688J02169j16271j08398R2243J77509Q0675j5468J5493
14280B05862j0521j87396j80799K8228R9179K00192M5644O9967J49811m3474r0197
14269B86496n8852j53325l3137r1536j10968k9007m1031K56719R7713k6952k2917
14258G3203j16365o0033K6318J11996J17881J34178j3976k01536p4095J32382
14248A29953q1393j35391P4087K1866k0199N5032k0183K393N4632j83761n3226
14237a56190j3608N8410J96399P238j20249K4707k2426r5069J68447J66239n4123
14226A59775N6617n0467k32775Q265m2323K8628Q2891J43737j58906L1425K02626
$$ y = [287057, 126048, -58247, -152434, -297280, -114982, -44565, -46747, -167923, -84394, -14796, 6444, -13205, -28778, -22090, 80079, -36192, -144590, -52347, 125162, 205837, 190369, 205862, 195341, 7945, -172854, -144626, -45447, 154745, 200389, 270356, 420167, 376693, 286496, 227644, 74319, 41182, -50354, -161322, -190329, -231360, 25359, 123072, 96120, 73203, -43162, -103195, -76877, 35119, 153000, 287178, 273202, 71666, -2429, 129953, 48560, -86831, -12744, 9122, -11077, 43955, 23772, 26165, 80797, -102964, -156190, -169798, -111388, 85011, 92249, -28000, -3293, -25719, -120788, 47659, 213898, 159775, 216392, 165925, -66850, -58585, -100908, -72280, 10611, 154348, -4558, 26867, 229493]
14215B29493o7590O20J24921j46841j2779o8553M791Q9528N526N1439j25947o338
14203G8270L9299j32677j15613m943R2366l4699j10310j85399Q4106K55946J49957
14192A16303Q7217j3834R8654j34026j09128J93740L9326r0404R0162J00421k9876
14181C48555j24811r038J0929j47734l4228l750k5777O1497J17866P3898L6385
14170C03792p0642n0998M5104j1767m179k3434q3554J36391R9473j32338p2411
14159A35437j67307j73617k0511J51654m642J43621J8535Q2593k5120o0786p6311
14148C546j0084j80187k0275M6701J65871l5670M8278j19457j0723N3247M4523
14137a4230P1713l8897n8403J06679k2512j8331p7966j44964Q0688j8487n7582
$$ y = [229493, 161903, 162523, 287444, 140603, 127824, 59271, 64062, 153590, 159116, 210555, 84608, 78270, 117569, -15108, -130721, -135664, -43298, -77997, -188307, -373706, -289600, -33654, 116303, 203520, 189686, 288340, 154314, 45186, 238926, 278252, 187848, 278010, 378431, 348555, 223744, 214706, 225635, 77901, 43673, 39923, 14146, 75643, 193509, 267407, 303792, 233150, 182152, 227256, 215489, 211310, 187876, 104322, 240713, 340186, 207848, 135437, -31870, -205487, -225998, -74344, -78986, 64635, 83170, 165763, 140643, 79857, 3546, -6538, -186725, -207000, -160299, 5572, -30098, 18180, -101277, -112000, -58753, -14230, 57483, 18586, -39817, 66862, 44350, 26019, -51947, -196911, -116223, -134710, -192292]
14126a92292K82658L2795j4447J7835k6663J52245J31405m9302j32565l8216l8806
14115A24647m6914p1419O2827O5623k21863j35730M9854J99161J95625n7729j34609
14104B9473k00057O5830J25803L7017p6637j06759n7739k427J66795n6462n9290
14093a34453l603J1347R5166J99237R2909k7425j567j63617j64655J89365O5717
14082A58421M3650l8241j89613J6351J03509p2170n1986n3490J29410L24389j7877
14071C52353j79099j2899k33453l1800J14323n080K7310O3142k7753N8836J3301
14060A39181m3651q326J35510J96982j28632l7016j15911j18155J67705m2647
14050A45040J2981j9498j06718j01542M6952q355K5483K00707R4137n7498j79374
$$ y = [-192292, 90366, 123161, 108714, 126549, 99886, 252131, 383536, 334234, 201669, 163453, 124647, 77733, 6314, 69141, 134764, -87099, -222829, -172975, 26186, 221811, 164082, 29473, -170584, -104754, 21049, 58066, -18571, -125330, -183069, -185496, -18701, -75163, -134453, -138056, -126709, -31543, 167694, 260603, 233178, 231611, 67994, -96661, 92704, 158421, 202071, 163830, -25783, -9432, 94077, 21907, -30079, -83569, 45841, 370230, 352353, 173254, 160355, -73098, -104898, 9425, 4345, 31655, 94797, 67044, 125880, 139181, 95530, 87204, 222714, 419696, 291064, 254048, 138137, 19982, 187687, 145040, 158021, 138523, 31805, -69737, -22785, -31140, -5657, 195050, 289187, 231689, 52315]
14039E2315J9169J5560r9748K7870k8573p4981J61166J25460Q0304j02024l805
14028A72713J03303j47928J41619Q7724O8766O9541J49393J80383K6951j01390
14018G51075j82175j8240R1557o8646n4525o8540k34535n2473K10350R0252Q3789
14007E47889J17633j21357J37961J04526n1351l3700J38679o6569j02598J01430
13997G72543N7529K6288Q4669k0801k95812r2773J78856J0009j24776K0428N8851
13986F75011n5793q1136N1885J89298J23682r5230j52808J62258L9614n3716o0437
13975G42628j18425K6045K9149k2131K3050J15517K49561K23339J8579j48487
13965A138825l0122J51985p3062j48310o1224r8096Q0190J06048O9718J48559
$$ y = [52315, 71484, 87044, -12704, 15166, -13407, -88388, 72778, 198238, 278542, 176518, 172713, 276016, 128088, 269707, 357431, 426197, 495738, 645131, 825514, 852465, 751075, 568900, 550660, 642217, 573571, 519046, 450506, 215971, 163498, 373848, 464100, 547889, 665522, 544165, 682126, 786652, 735301, 701601, 840280, 773711, 671113, 772543, 830072, 856360, 941029, 920228, 624416, 531643, 710499, 720508, 595732, 616160, 675011, 619218, 538082, 589967, 779265, 902947, 807717, 654909, 817167, 856781, 803065, 742628, 624203, 650248, 679397, 657266, 680316, 795833, 1045394, 1268733, 1287312, 1138825, 1108703, 1260688, 1187626, 1039316, 978092, 879996, 960186, 1066234, 1135952, 1284511]
13955A284511m4884j47325j63928j44476J11384m8593l5903J6997J49588j3325
13945I64046k06620k01383p89K97657M8331J973J16626l9135j87509r820Q0300
13934H63677Q88N1862R9053r6835J42486N9448J00160j21479j46469j69919J88545
13923I71417N0032K0203l0368P1475k24831m2861R8792p9640k38335j44838J04676
13912E55722K46048L9861r4536q2184o0761n1369J17473J89491J36219j4151J31699
13901A113512J34950J11556j14419j37071j95997P4899j4561l7024j50760k28832
13891E56253m4513J11706N2471j20113k69221j38843J6276O9668J11767J2075
13881C57526j31827l8823J35968K17797l5475j44801j21024m1917K2509n0304
$$ y = [1284511, 1239627, 1092302, 928374, 783898, 895282, 846689, 810786, 827783, 977371, 964046, 757426, 556043, 555254, 852911, 901242, 903215, 1019841, 980706, 793197, 783377, 863677, 864565, 916427, 1015480, 918645, 1061131, 1120579, 1220739, 1099260, 952791, 782872, 971417, 1021449, 1041652, 1011284, 1082759, 857928, 815067, 913859, 834219, 595884, 451046, 555722, 801770, 841631, 747095, 664911, 604150, 552781, 670254, 859745, 995964, 981813, 1113512, 1248462, 1360018, 1245599, 1108528, 912531, 987430, 972869, 935845, 785085, 556253, 511740, 623446, 675917, 555804, 286583, 147740, 164016, 233684, 345451, 357526, 225699, 186876, 322844, 540641, 505166, 360365, 239341, 197424, 219933, 169629]
13871A69629K43798m5928n2202J57394p574j55837k592R3057O5888N361p2333
13860C98661O0200O6450k868l0760o0289o0442k101J23333j17131J6717j18414
13849B73356p148m3893j448P7468k6445j56873k09741j67418N2818J05361N6868
13838d7095m6872m0366J77388P059L8409j06488j11166J19308P0790P79Q3285
13827A45031J15327M7116m5753o0857J23353p8273l6058J19897M7724J33758L5377
13816E46642k11005J0457K0241j20715p7983K5863j03886o616r6461M6765j714
13805C1588J15065l0735j19778K5085J53290P1312R925N9303q5390l9875l0865
13794A58925J47089J24803n3096Q3198R0266k09974k10399Q7001J54493r8544
$$ y = [169629, 413427, 367499, 315297, 472691, 465117, 309280, 306688, 399745, 465633, 470994, 398661, 458861, 525311, 522443, 491683, 431394, 370952, 368851, 492184, 375053, 391770, 273356, 266208, 222315, 220867, 298335, 271890, 115017, -94724, -262142, -209324, -103963, -47095, -93967, -134333, 43055, 50114, 88523, -17965, -129131, -9823, 60967, 61746, 145031, 260358, 307474, 261721, 200864, 324217, 245944, 209886, 329783, 377507, 511265, 546642, 335637, 346094, 366335, 245620, 167637, 193500, 89614, 82998, -13463, 33302, 31588, 146653, 115918, -3860, 21225, 174515, 245827, 255752, 315055, 229665, 189790, 158925, 306014, 430817, 377721, 460919, 551185, 341211, 130812, 217813, 372306, 273762]
13784B73762l5761K9806J1859n6425j80137j70422J82075J21576N7346q0101M1862
13773A95440J80332L9693o0276j04882j31352j2551K37531J03094J97338J8839
13763F63206j11000J38223o381j11875O381k9432J06040l6608j50918l6405o1640
13752C69591L0568Q1344Q7694j30840n2707k9416M6214R695n0017J35511N8831
13741E56468j50722j46675O9244J00270J20617p8059Q788R807L9907m1776m2808
13730D45061K2819L8768k7544J98279n3107l5825r0718j10684P6190J91911K3720
13719F78870M2824j8100r1124k19159j8299m2570J14033k1732K5390L6180q8016
13708C98297l3888k2536m2839m8044Q6684K15314m0655J4239L4868O3024J22880
$$ y = [273762, 238001, 267807, 279666, 223241, 43104, -127318, 54757, 176333, 233679, 153578, 195440, 375772, 415465, 355189, 250307, 118955, 106404, 343935, 447029, 644367, 663206, 552206, 690429, 684048, 572173, 578554, 549122, 655162, 618554, 467636, 431231, 369591, 400159, 481503, 569197, 438357, 385650, 356234, 402448, 412143, 362126, 497637, 556468, 405746, 259071, 328315, 428585, 549202, 471143, 479931, 489738, 529645, 487869, 445061, 467880, 506648, 479104, 677383, 624276, 588451, 497733, 387049, 463239, 655150, 678870, 721694, 703594, 612470, 393311, 375012, 332442, 446475, 424743, 450133, 486313, 398297, 364409, 341873, 299034, 250990, 337674, 552988, 512333, 526572, 561440, 624464, 747344]
13697G47344k6460k24607R7066J30650R0725m5048J1530j9638p2764l5852j5698
13686F37248l5949J02541j49381j4345l1675O916J903q2368j8778P2699R5848
13675E84659P3683Q9789P2429j8909k0479R2509K6532Q3757M9184M008M4807k9244
13663A052725j45810l3203J93002O0269m0684L8149j36549J0954k7062l1654Q6971
13652A027108J15664J8631O9817q1394m3766K0807k1077r8044M5884J82388J29210
13641A365228j33233j32989j60295K4173L15994Q1979Q6510l9449Q8024J11857
13631A607799O1201m6373R8094J17092J6797L7468J26436Q0539J76556M8208j32649
13620B191168k94540j50243K3149J273O9072m4247q6374o1757m5784Q6933O8328
$$ y = [747344, 720884, 496277, 593343, 723993, 814718, 769670, 781200, 761562, 688798, 652946, 637248, 601299, 703840, 554459, 540114, 508439, 515355, 517258, 434890, 416112, 488811, 584659, 658342, 748131, 820560, 801651, 781172, 873681, 900213, 983970, 1033154, 1037162, 1081969, 1052725, 906915, 873712, 1066714, 1126983, 1086299, 1124448, 987899, 998853, 971791, 940137, 1027108, 1142772, 1161403, 1231220, 1149826, 1106060, 1126867, 1105790, 1007746, 1053630, 1236018, 1365228, 1231995, 1099006, 938711, 962884, 1278878, 1360857, 1447367, 1407918, 1495942, 1607799, 1669000, 1622627, 1720721, 1837813, 1854610, 1892078, 2018514, 2099053, 2275609, 2323817, 2191168, 1896628, 1746385, 1769534, 1770807, 1839879, 1795632, 1709258, 1647501, 1601717, 1688650, 1756978]
13609A756978K870J91745J27967P2582J06613J24765J49042K09767K6068L7283
13599B805680R9919k48117P879q0535j34474O6403K33687J6358O4681O8995J51197
13588C051673K8928J38239J23273J54466K68218K92332J54980J33171L4799J48223
13578D528302K32713J25117K15196J56178N1140J86240J28769K42230K32316M03946
13568F502147M46131M68384O13862R45177Q90026J122557J185060J742396K347639
13559A6263379L273506M466661N432981M627079K161417Q71213J304298K092481
13551D0493015J489068m13274j027335J044248L947979O193745N474579K859624
13543F0061649J275951K524589M537852N018657L347493J619904J366912L245838
$$ y = [1756978, 1759848, 1951593, 2079560, 2152142, 2258755, 2383520, 2532562, 2742329, 2768397, 2805680, 2905599, 2657482, 2665361, 2584826, 2450352, 2516755, 2750442, 2766800, 2831481, 2900476, 3051673, 3080601, 3218840, 3342113, 3496579, 3764797, 4057129, 4212109, 4345280, 4380079, 4528302, 4761015, 4886132, 5101328, 5257506, 5308646, 5494886, 5623655, 5865885, 6098201, 6502147, 6948278, 7416662, 8030524, 8975701, 9865727, 10988284, 12173344, 13915740, 16263379, 19536885, 24003546, 29436527, 34063606, 36225023, 37096236, 38400534, 40493015, 41982083, 41568809, 40541474, 41585722, 45533701, 51727446, 57202025, 60061649, 61337600, 63862189, 68400041, 73418698, 76766191, 78386095, 79753007, 82998845]
13535H2998845P332706R180790M147366l371941n954382l699301j321768l869864
13527H5442451q512023p261253k700149J688922N788219R412903J0022019N804706
13519I9685795J573815J119200K827780L628357O77478k352881O58504Q561897
13511A16379945J7795571K1332134J3197471M131823N192297J2554690J8982780
13504B09566711J7635117J0145956N989447N463273J1631686K0845967K0434467
13497C01712624K781349j8572307k4548324j8419943j5394621k2862174l0409916
13490A74286688k6826709j8279910j1154001o351640l141247k30026K412452N610568
13482A16326175R066575J3748735K0982065K8806776L0945717K3247004J5268144
$$ y = [82998845, 90331551, 99512341, 103659707, 100287766, 94333384, 90634083, 89312315, 85442451, 76930428, 69669175, 66969026, 68657948, 74446167, 83859070, 93881089, 99685795, 101259610, 102378810, 105206590, 108834947, 109512425, 107159544, 107818048, 116379945, 134175516, 155507650, 168705121, 172836944, 178029241, 190583931, 209566711, 227201828, 237347784, 243337231, 248800504, 260432190, 281278157, 301712624, 304493973, 285921666, 261373342, 242953399, 227558778, 204696604, 174286688, 147459979, 129180069, 118026068, 111674428, 108533181, 108303155, 110715607, 116326175, 125392750, 139141485, 160123550, 188930326, 219876043, 243123047, 258391191]
13475B58391191J6777508K2023362J6437399m104251k2321557k1962928j1196950
13468B54043774l783945m824636j0207057j6761429j8053358j1966630m781865
13461A83664854l414089j2700498k1141552j6052797o343908J017472K879614
13454A27909096l31033l644059l578908j753335j900031o090929j0192352r109325
13446I1309124n055273n51663L873162Q107772Q569788L806166Q49172K852044
13438A13760292N141342L035507m408800j0063624p548527l041401j325269j850883
13430I3698637l051370m798151m702396l082943j995972k920824n561712o066522
13422F1518747l633843n16775J262837L75252j829850k665589j948916j383104
$$ y = [258391191, 275168699, 297192061, 313629460, 309525209, 287203652, 265240724, 254043774, 250259829, 245435193, 235228136, 218466707, 200413349, 188446719, 183664854, 180250765, 167550267, 146408715, 130355918, 124012010, 125029482, 127909096, 127578063, 123934004, 120355096, 118601761, 116701730, 110610801, 100418449, 91309124, 86253851, 85702188, 89575350, 97683122, 106252910, 110059076, 110908248, 113760292, 118901634, 121937141, 117528341, 107464717, 99916190, 96874789, 95549520, 93698637, 90647267, 85849116, 81146720, 78063777, 76067805, 73146981, 67585269, 61518747, 57884904, 57368129, 58630966, 59006218, 57176368, 54510779, 52561863, 51178759]
13414E1178759k444398n141756n839811m520389l207711k560166j930752j348115
13406B4185661j357884j144898j035429r51518p69094o27241n08040n29262o58259
13397A6604036o11401m74696m74436l51893m19690n17564n01468n71482n63325
13388A2118081m85449o08309o12934m13134k61148l71150m01968l62554l20905
13379H280530j76262l13080k49280j39384j67750j64317l93733o8961k09550j55501
13369F242712J16383j04749r4238j03900j28552j54250l7566j34487j98647j83933
13359E218773l3700p3774q4806k61839l13889r7112L336j84167P9644o7020j10907
13348D074539j09363j57841j21773m4705l8326N3669N0827Q808j858j3290r9898
$$ y = [51178759, 48734361, 43592605, 37752794, 33232405, 30024694, 27464528, 25533776, 24185661, 22827777, 21682879, 20647450, 19695932, 18926838, 18299597, 17791557, 17262295, 16604036, 15992635, 15517939, 15043503, 14691610, 14271920, 13754356, 13252888, 12681406, 12118081, 11632632, 11024323, 10411389, 9998255, 9737107, 9365957, 8963989, 8601435, 8280530, 8104268, 7791188, 7541908, 7402524, 7234774, 7070457, 6676724, 6607763, 6398213, 6242712, 6359095, 6254346, 6160108, 6056208, 5927656, 5773406, 5735840, 5601353, 5402706, 5218773, 5185073, 5111299, 5026493, 4764654, 4450765, 4353653, 4356989, 4172822, 4252466, 4185446, 4074539, 3965176, 3807335, 3685562, 3640857, 3602531, 3656200, 3707027, 3715835, 3713977, 3700687, 3600789]
13337C600789l1824j34419l09026l83517j18766o4679M0539k0169k5906O9889
13327B622911J4472K73749J97432q5297j13560r1535j4869q5793j4213j80248
13317B523049q4553j32991j3123R5679j45930l10450r6144J07554M5559N3373
13307B042023m2122n9393N6424J2067Q4987J14713J13125O0762K43j04818l8155
13296B239856j19862k04610k2834j4940k09283k39729m2330j95067N538j7682
13286A179057k10823L443Q6864Q1146l0345k20797j63754J71509R0720o849O8364
13275A048535J71712L6889K645j43728P334j50653j21024J18138K24950k4955
13265A169843j44585k448r9034l8169R1999k09266j41974P7375J52758L5817k14178
$$ y = [3600789, 3568965, 3434546, 3125520, 2742003, 2623237, 2558558, 2599097, 2578928, 2553022, 2622911, 2637383, 2911132, 3108564, 3023267, 2909707, 2818172, 2803303, 2717510, 2703297, 2523049, 2438496, 2305505, 2292382, 2388061, 2242131, 1931681, 1835537, 1943091, 1988650, 2042023, 1999901, 1940508, 1996932, 2008999, 2093986, 2208699, 2321824, 2382586, 2382829, 2278011, 2239856, 2119994, 1915384, 1892550, 1877610, 1668327, 1428598, 1386268, 1191201, 1196739, 1179057, 968234, 971677, 1058541, 1139687, 1109342, 888545, 724791, 896300, 987020, 980171, 1048535, 1220247, 1257136, 1259781, 1116053, 1123387, 972734, 851710, 969848, 1194798, 1169843, 1025258, 1022810, 923776, 885607, 977606, 768340, 626366, 703741, 856499, 892316, 678138]
13254F78138q0586Q4369n4030m6343q9607k0721l4075J3393J31823L6966q5069
13243E34258o6610l6901N5693M1427p791O7774j9067O5236J20831r9700j1433
13232F43717J12411P7533j2783r4792j06878j17520k6941m1202j00412R0273J70267
13221E93673L475k28474j54626r416J0614L5722m5771j41785k3868L4152J66669
13210B40365J97505J1381r9498j2790j44488n0894l2125n0751J21845J22920J3544
13199C17014j93157J3449Q4832j04166j38930K08935O0047K7717j8731J3056q1660
13188A88406j60806L7796N0376J02265N5110P011L1362p4475p5072j09713p9458
13177b7198q6320O482L8585m8507J27300J12949J1359o1728n3313L5039K43251
$$ y = [678138, 597552, 681921, 627891, 581548, 491941, 471220, 437145, 450538, 582361, 619327, 534258, 467648, 430747, 486440, 527867, 520076, 587850, 568783, 634019, 754850, 655150, 643717, 756128, 833661, 820878, 726086, 619208, 501688, 474747, 433545, 333133, 423406, 593673, 597148, 368674, 214048, 204632, 215246, 250968, 205197, 63412, 39544, 73696, 240365, 437870, 449251, 349753, 336963, 192475, 141581, 109456, 58705, 180550, 303470, 317014, 123857, 137306, 222138, 117972, -20958, 187977, 248024, 275741, 257010, 270066, 188406, 27600, 65396, 115772, 218037, 273147, 280158, 311520, 237045, 161973, 52260, -27198, -113518, -107036, -68451, -116958, 10342, 123291, 134650, 72922, 19609, 54648, 297899]
13166B97899k826k36181k35403R2429J44426Q2388j6741k8096Q8963K23702M4034
13155D54594k13780k27916k27532L0987J70202J72798Q7739k3815n6836k28546
13145f2105K0519m2160M1928J70796j50644q2092j72857Q0543K66793J60889q614
13134B22996k37727M4745K07974k2506j48962l8553M2153K771p5080j03583J03254
13123b518J57570J84950j51080k71124q1168J88253k6577N9606J15734j38391
13113C5255k4739Q3520J1799m9898o845J79336J95426j6503r5871j24417j33776
13102E3287N0609K8846J402j09435j09987R2729K02362Q4010q0135m4530r3488
13091G5670m3741k1305J41148J67225K2586P8273K3152k31150j40764q517M403
$$ y = [297899, 295073, 58892, -176511, -84082, 60344, 142732, 125991, 97895, 186858, 410560, 454594, 240814, 12898, -214634, -183647, -13445, 159353, 247092, 223277, 166441, -62105, -41586, -83746, -41818, 128978, -21666, -103758, -276615, -196072, 70721, 231610, 222996, -14731, 30014, 237988, 215482, 66520, 27967, 70120, 72891, -2189, -105772, -2518, 155052, 340002, 188922, -82202, -163370, 24883, -1694, 57912, 173646, 35255, 10516, 94036, 105835, 55937, 49092, 228428, 423854, 407351, 311480, 187063, 53287, 103896, 132742, 134144, 24709, -85278, 7451, 209813, 293823, 213688, 169158, 75670, 31929, 10624, 151772, 318997, 341583, 419856, 443008, 211858, 71094, 62577, 66980]
13080F6980r635l7293P6332n77m8566M965n3651j7892J5402J66911K26454j4814
13068C74616K9494k0675j3532J7101J56753J46079K46165j06651r9967P0570Q5164
13057H85117q5020j22985r8272J12113K52002l8677j31784J6389Q660J29666k7145
13046I00064P3132j32260k27934J22673Q3633n7428o4186O3953J11722K01048
13036A074417j1882J6153R624l660J09954j44064j71247O3645q8169m9296k48705
13025E56770j34861J12920J42790l7452j7722R3257K138M2804r9754N6264J9180
13014G36334J84751P5347r9080m8925j9137N4653J11514K24858P6245q3302o3782
13003A149476O6937J35394J03601K7349l5860m8976L1660j69400l21195j34585
$$ y = [66980, 57345, 20052, 96384, 95807, 47241, 52206, -1445, -19337, -3935, 162976, 389430, 374616, 404110, 383435, 369903, 387004, 543757, 689836, 936001, 829350, 729383, 799953, 885117, 800097, 677112, 578840, 690953, 942955, 904278, 772494, 788883, 797543, 927209, 900064, 973196, 840936, 613002, 735675, 819308, 761880, 697694, 761647, 873369, 1074417, 1062535, 1078688, 1088312, 1084652, 1194606, 1050542, 879295, 942940, 854771, 805475, 556770, 421909, 534829, 677619, 640167, 622445, 715702, 717840, 760644, 660890, 717154, 736334, 921085, 996432, 897352, 848427, 829290, 883943, 995457, 1220315, 1296560, 1213258, 1149476, 1216413, 1351807, 1455408, 1482757, 1446897, 1397921, 1429581, 1260181, 938986, 804401]
12993H04401j24544k2577M6971p1279k0168r1146K5140L26228J53190q0297J42253
12982A088172l0481k15131j47088j12790R034Q9401M5088J57414M6378J07138
12972A037135J04000l1336j00388l329j88852j43683j18163p2256J93001J04277
12962G80406j36863j35277j22496M5214J96620k6919q6598j10192j99382Q6648
12952B91161R0558J74832R2966J76923n5160j9360K127p4131k5505j2665r4606
12941E47140j52745m2619p4612o5913N904M3609k9326O2314K5479J2022p7118
12930B54135p6014J7404J06820J43332j32051j7538p3024J83842J11701N3061
12920E71668n1018k51308l767P8469k26795j7271J19672m2014j27729L7910j8585
$$ y = [804401, 679857, 657280, 704251, 632972, 612804, 521658, 546798, 873026, 1026216, 945919, 1088172, 1057691, 842560, 695472, 582682, 591716, 681117, 726205, 883619, 929997, 1037135, 1141135, 1109799, 1009411, 1006082, 817230, 673547, 555384, 483128, 676129, 780406, 643543, 508266, 385770, 430984, 627604, 600685, 514087, 403895, 204513, 291161, 381719, 556551, 649517, 826440, 771280, 751920, 754047, 679916, 654411, 641746, 547140, 394395, 351776, 277164, 211251, 217155, 260764, 231438, 293752, 319231, 331253, 254135, 178121, 195525, 302345, 445677, 313626, 296088, 223064, 406906, 518607, 571668, 520650, 269342, 265575, 344044, 117249, 99978, 219650, 177636, 49907, 87817, 69232]
12909F9232k6546P906n3580R3082R5235r6512j07391P3439L8798k29765J0930
12898a25172L5749M1312K25k9233j59456j16362L2219K07224K60479J71150Q532
12887C26667k49738n6829p733K5715j88166N4661J6106J79336R3457r4973O3666
12876A62169p3295p8872j67611J10037j12611L5598R680l6348N9213j37369m6933
12865b76342K2110K32876N9274o9148q755J28574K1662j0086p064j11711n4338
12854g2948K05569O6422j1540p0218k157P0674R350p841l8198q2593R950L506
12842G9976m2269j23128j33945J61487J22538M0944K01061j43261k54472q409
12832i9478J38913M6644M2876r8448P9448M4745L7205q4666p737r4788j04928
$$ y = [69232, 42686, 50592, -2988, 90094, 185329, 88817, -18574, 54865, 93663, -136102, -125172, -89423, -48111, -47886, -77119, -236575, -352937, -320718, -113494, 146985, 318135, 326667, 76929, 20100, 12367, 38082, -150084, -95423, -79317, 100019, 193476, 98503, 162169, 88874, 10002, -157609, -47572, -160183, -124585, -114905, -151253, -92040, -229409, -276342, -254232, -21356, 37918, -31230, -39985, 88589, 110251, 100165, 93101, -18610, -72948, 132621, 199043, 187503, 117285, 115128, 185802, 195152, 187311, 149113, 66520, 76470, 79976, 37707, -85421, -219366, -57879, 64659, 105603, 306664, 163403, -91069, -99478, 39435, 86079, 128955, 30507, 109955, 154700, 191905, 107239, 99502, 4714, -100214]
12821a00214J93536R8619k13797j72053J61889K05012j52366n9594q1879j34008
12811b54855j4722R2437N5121R0012q5622j14021O1573J02364P5332m5931M0709
12800B397N58l4907J56817J32228j58334j86089j73012n5024J19488K86865J31818
12789B22805j11400q3883j14034o6988Q778K9087k4525r2859R930j39768J2902
12778c49955N0885m3828l8823p459K27153K77627j39985p1165Q0464K02503J72947
12767C60364j70302o8607k5535K8552p737o2814r4634k0022j15065j12621J4483
12756b73938k47832L6203J78977J24559J97025J87728m6208j95857j84336P0686
12746a52993L25534R8479r1977j50859R9368j5455j05661q8196L1531k5843l205
$$ y = [-100214, 93322, 191941, -21856, -193909, -32020, 172992, 20626, -38968, -120847, -254855, -269577, -177140, -122019, -32007, -117629, -231650, -170077, -67713, 7619, -38312, 2397, 2955, -31952, 124865, 257093, 98759, -87330, -260342, -315366, -195878, 90987, 222805, 111405, 27522, -86512, -153500, -144722, -115635, -140160, -233019, -223089, -362857, -349955, -299070, -342898, -381721, -389180, -162027, 115600, -24385, -95550, -15086, 187417, 360364, 190062, 121455, 95920, 124472, 116735, 53921, -40713, -60735, -175800, -288421, -273938, -521770, -485567, -306590, -182031, 14994, 202722, 156514, -39343, -223679, -152993, 172541, 271020, 179043, 28184, 127552, 112097, 6436, -81760, -50229, -76072, -79277]
12735g9277J14787O3372n67j23772J1223L35287N4991l685m3040j39378P7666
12724B67607r1697j54493O8776m0073j01380j29486j34193K3304K27743J24350
12714F0458m6057Q0323m0917p5006M664Q0646j01701K5268M9541K688p1114m4165
12702g5372K6519l2158L7712m6627J04231J15991P775l9032Q8074o5934P9937
12691B01116j02595k03565k815O9512j23950q1706M5437l8702p984l4903J37888
12680a42267J02219N8112J7598r6623r500J38162N7529m5509j13793j0713J61752
12669A16967J9697q1955N9884q7426j54721r5796Q3160M2898J2411M5375j02461
12658a41967j34807K84707K69851j24124K3349J37931J7931r9328R6434j08955
$$ y = [-79277, 35510, 98882, 98315, -25457, -14234, 321053, 376044, 372359, 329319, 189941, 267607, 175910, 21417, 90193, 50120, -51260, -180746, -314939, -291635, -63892, 60458, 14401, 94724, 53807, -21199, -16535, 64111, -37590, -12322, 37219, 39907, -31207, -75372, -48853, -81011, -43299, -89926, 14305, 130296, 138071, 99039, 187113, 121179, 201116, 98521, -105044, -107859, -38347, -162297, -244003, -198566, -237268, -245252, -280155, -142267, -40048, 18064, 35662, -60961, -70461, 67701, 125230, 79721, -34072, -44785, 116967, 136664, 54709, 114593, 27167, -127554, -223350, -140190, -97292, -84881, -39506, -141967, -276774, 7933, 277784, 153660, 177009, 314940, 332871, 233543, 329977, 221022]
12648B21022j35031L0412q3888k52592M7126J25225K14765J18089k37370k29311
12638a81553J32839J63542R3671q7882k0926q3856k9064q8493k50148J06067K60276
12627A4473K09027n6084j05645m4924J03968l698n3293m1409J09434j2161j27630
12616g942J85912L5776j08404R9779L7338l9249j03003p7735l3795m1655L6892
12605a6086K4192Q8481P2641l9518R9299K2336j43265m0598o8015j00265J9410
12594h1388N3690l028q891J24840q4588k00764J7575P1322l2116j90256p941K81057
12582f0488J42814l6301k08330q7523p3428R8591J38669J32672O2540j32078m8097
12571g0959J88611J78189j40701j99171K3319K98274J31102j70423p5524m340
$$ y = [221022, 85991, 116403, 32515, -220077, -172951, -47726, 167039, 285128, 47758, -181553, -48714, 114828, 208499, 120617, 99691, 15835, -13229, -101722, -351870, -245803, 14473, 223500, 167416, 61771, 16847, 120815, 117117, 63824, 22415, 131849, 119688, -7942, 177970, 213746, 105342, 205121, 242459, 203210, 100207, 22472, -11323, -52978, -16086, 8106, 96587, 169228, 129710, 229009, 251345, 108080, 67482, -533, -100798, -81388, -27698, -30726, -39617, 85223, 635, -200129, -182554, -111232, -143348, -333604, -341545, -60488, 82326, 46025, -162305, -249828, -323256, -224665, -85996, 46676, 109216, -22862, -70959, 117652, 295841, 155140, -44031, -20712, 277562, 408664, 238241, 162717, 158377]
12561A58377j35299j68529j14366J82250O8538L1831j65538L315K03220K28528
12551B92327n0325p7359J23402m4992r2059r6377J20864J52242n8704m3001P2782
12540B98800j35615N2336j06225q8611o8089L1319P0015m6251j86500K7361J0807
12529a40653j58125l5483P8963J20915Q2484o7740l676L0991J9497J1887J09335
12518D8395k35368L9255J91863o7729n5010l791M1282M1893j40072j25642p7167
12507c42091J10460l0805j71467N6752N0612M4554j6968J28705J70008J5077Q4955
12496I9792R4865R0810J221O5038r1950p7599l1772r2827j49314j64616J24483
12485a31869r0715Q0890K27211j24041j51835j05058J35155K97868K5394j6633
$$ y = [158377, 23078, -145451, -259817, -77567, -9029, 22802, -142736, -139421, 63799, 292327, 242002, 164643, 288045, 243053, 150994, 54617, 175481, 327723, 269019, 226018, 298800, 163185, 215521, 109296, 20685, -47404, -16085, 53930, 7679, -178821, -151460, -140653, -298778, -334261, -255298, -134383, -51899, -119639, -123315, -92324, -72827, -60940, 48395, -186973, -147718, 44145, -23584, -78594, -82385, -41103, 790, -139282, -264924, -342091, -231631, -262436, -433903, -377151, -326539, -281985, -298953, -170248, -240, 14837, 99792, 194657, 285467, 286688, 351726, 259776, 182177, 150405, 57578, -91736, -256352, -131869, -222584, -141694, 85517, -38524, -190359, -295417, -160262, 137606, 163000, 146367]
12475A46367j21789j7449k1711q968R443Q1795J69225J60082n0640k36193q3010
12464B7152N1482O0232P5541L8063P0168j99972k28428j97833O4356M3159N5820
12453a40260L5434j5504k0626J46855Q855M6092n6701q7891J39241l1158k07428
12442a83091j94793N3454J00210K54972q7834j38730J2571J98532Q5273L3378
12432A33942J54828r1109j72289j53619p1639r6133j23980J78491o9034K0982
12422b89560J01917K37664K16512j37855k45672j75424O000J02815J47185J03860
12412F7442M7812k15283o8640K30025M2654j37556O6392K412m0955j00151l48735
12401d54583Q5997K28629j52862K4039Q3670M5044K4437j18213n1709J81292K0926
$$ y = [146367, 24578, 7129, -14582, -23550, -14107, 67688, 236913, 396995, 346355, 110162, 27152, 78634, 138866, 214407, 252470, 322638, 122666, -105762, -303595, -239239, -196080, -140260, -104826, -120330, -140956, 5899, 14754, 60846, 4145, -83746, 55495, 24337, -183091, -377884, -324430, -224220, 30752, -57082, -195812, -183241, 15291, 100564, 133942, 288770, 197661, 25372, -128247, -199886, -296019, -419999, -241508, -310542, -289560, -187643, 50021, 266533, 128678, -116994, -292418, -286418, -183603, -36418, 67442, 115254, -100029, -168669, 61356, 104010, -33546, 32846, 35258, -5697, -105848, -454583, -368586, -139957, -292819, -268780, -185110, -140066, -115629, -233842, -285551, -104259, -83333]
12390h3333p223K12678P5370j88050J0524j00036J05298n3318j02175j1588O9949
12379g1904K86731J01968j25152j55946m2378N7692j03485j03850m1628O5451
12369a32501k7263O6947j34692j88120K8826N5181J07530J15329P681l4396j14659
12358b50137J2886Q1058P6885l5875K09797r4317Q8965Q6468R8554K397j75172
12347A01509k46271j34802j6931K4176M8579m2442K28586k8223j55817M3479J11384
12336f6773k9775q4122k1289N9246Q4880J10288J22298J21063j29802l14434j25194
12325b73614J21443L49374L7393o9867k5922M9456r2268p1538J77845l9517j56882
12314E903m3765j24829J7421R8082Q6625J01172o3775j17581L2650Q1393l1756
$$ y = [-83333, -90556, 122122, 197492, 9442, 19966, -80070, 25228, -28090, -130265, -141853, -71904, 214827, 316795, 191643, 35697, -6681, 51011, -52474, -156324, -197952, -132501, -159764, -92817, -227509, -415629, -386803, -331622, -224092, -108763, -101082, -135478, -250137, -237251, -156193, -79308, -115183, 94614, 297, 89262, 175730, 274284, 276681, 101509, -144762, -279564, -296495, -272319, -223740, -266182, -37596, -65819, -221636, -178157, -66773, -96548, -180670, -201959, -142713, -57833, 52455, 174753, 295816, 166014, -148420, -273614, -152171, 197203, 234596, 164729, 138807, 188263, 95995, 24457, 202302, 162785, 5903, -37862, -162691, -145270, -47188, 39437, 140609, 76834, -40747, -8097, 73296, 41540]
12303D1540k67220M698j31517l3411K72425J59001Q2959M0703o8278q4861J0089
12292B6128J17933J8316j04417j03915J2740O8428m1081j56435M3824l5539j5
12281a54033K3843K9596N2988p607l5703K53987O1088p3557M587N9583j15663
12270I9109k71797j37322p043P6353J11331J39234o2881j65571j63172R3330J39477
12259a48952N6349M1631O4249j42830L4170L35290J37301m1353n8190n5036j56273
12248F6356r9858l0436J63103R1972j43969j04942L8074J22796P54j02750J41155
12237A42255J1294j6269J49335j10485r1191p6689r296r3403k95554J4113L00678
12226g5212J64801p9210j77010p0319N5100l4994K53730K21336j1679m1834L4853
$$ y = [41540, -225680, -220982, -352499, -385910, -113485, 45516, 128475, 169178, 100900, 16039, 26128, 144061, 162377, 57960, -45955, -33215, 35213, -5868, -162303, -118479, -154018, -154033, -130190, -100594, -47606, -55213, -90916, 163071, 224159, 150602, 155189, 214772, 99109, -172688, -310010, -317053, -240700, -129369, 9865, -53016, -218587, -381759, -288429, -148952, -92603, -50972, 13277, -129553, -95383, 239907, 377208, 335855, 277665, 222629, 66356, -33502, -63938, 99165, 191137, 47168, -57774, -19700, 103096, 103850, 1100, 142255, 153549, 137280, 286615, 176130, 84939, 8250, -1046, -94449, -390003, -375890, -75212, 89589, 10379, -166631, -236950, -181850, -216844, 36886, 258222, 246543, 204709, 239562]
12215B39562N5124l1402j91675k77199l0109J9461r2878M2850J31237J03998J59759
12204A28728J21051j00641j71316j79402j81227j4693K6509k9855N4553R9491
12194b46802N7261R55J07746N466N5244M8860J03115p2218m0359O1624p2227j8063
12182i398l9751j45044j08794K9239l3239K774Q5862p7944j47109J79497J71849
12171i2058j44522J15625L22948o8073j71360L3080k6979l3016n6041k08323K2102
12160c06617J04816J57071J28631j80966j13326J16508M0143O097l1147J54361
12150G5571l0904j00853k46328J9144J46105m3533Q9228J06308j6339r1418J5288
12139g7731m8998p5129j6618l2481o05K0201J39552r061N6459Q194n8108Q1409
$$ y = [239562, 294686, 263284, 71609, -205590, -235699, -216238, -309116, -266266, -135029, -31031, 128728, 249779, 149138, -22178, -201580, -382807, -397500, -370991, -400846, -346293, -246802, -189541, -188586, -80840, -75374, -20130, 28730, 131845, 59627, 19268, 80892, 8665, -9398, -49149, -194193, -302987, -273748, -306987, -304213, -218351, -296295, -443404, -263907, -92058, -236580, -120955, 201993, 133920, -37440, -4360, -31339, -64355, -120396, -328719, -306617, -201801, -44730, 83901, -97065, -210391, -93883, -53740, -47643, -78790, 75571, 44667, -56186, -302514, -283370, -137265, -180798, -91570, 14738, -1601, -93019, -77731, -126729, -201858, -218476, -250957, -251562, -231361, -91809, -100870, -44411, -36217, -94325, -12916]
12127a2916N0836l2777J64996j1839j10904J13593N3927q4279K7309J65759N807
12116C29512N0194k30474p9177K8006O526k6731j92773N8116J78228p9519j8362
12105B3546p7475n1595J02043K9325j73468J32427J66253R117k8390q6896q507
12094C6380R3362n0674j91401j00459J09543J23467P8690O5693j53862k069J59568
12083A68238Q9483j52543q3350o4227q654q5131Q8247r754m9580J31603M9437
12072G3769J19541J74084l8360j29065j75053j57817q443K29835j3240o8032k9564
12061b2345Q5885J28804Q9546j65462q6150m8865j61825j00096L1537K26984O6753
12050D4766j09150N7205n4707Q3019p2398j31289R6942N0819j2170O4456l5335
$$ y = [-12916, 37920, 5143, 170139, 158300, 47396, 160989, 214916, 130637, 157946, 323705, 329512, 379706, 149232, 70055, 98061, 104587, 77856, -114917, -56801, 121427, 41908, 23546, -53929, -105524, -3481, 25844, -147624, -15197, 151056, 160173, 131783, 44887, 36380, 129742, 79068, -112333, -212792, -103249, 20218, 98908, 164601, 10739, 8670, 168238, 257721, 105178, 21828, -42399, -51053, -136184, -47937, -57691, -107271, 24332, 73769, 193310, 367394, 329034, 199969, 24916, -132901, -141344, 88491, 75251, 7219, -22345, 63540, 192344, 281890, 116428, 30278, -18587, -180412, -280508, -248971, -21987, 44766, -64384, -7179, -61886, 21133, -51265, -182554, -85612, -34793, -46963, 17493, -17842]
12039a7842r8920L1427R7370J21372j15717j38370j5624o0647J69679J73285n2589
12028I3424j05208K7678n5510j02599r2349N1380R6306J68089N7584o3155J48461
12017B24101N3011j35194L7848k7273L3402m1675J12930j3247j33491J0042p2183
12006D8271k1615r0606M5879m9404k5238J16343J35508J1143L1255M4833k17705
11995B8664j40986n9413N945J32093o64j48531J18052L7653q5730n6280J62526
11984f671M9047j1430K0965j0839o1966J30746J49781l3297k93401l8409K3699
11973h1775J15710J65043J28501J9014j76516k75589M0058J79372j25350M581
11963f951K11616R1481j17878r6955j51883j12442N6679Q2730o8871j27226N4782
$$ y = [-17842, -116762, -85335, 12035, 133407, 17690, -120680, -136304, -196951, -27272, 146013, 93424, -11784, 15894, -39616, -142215, -234564, -183184, -86878, 81211, 138795, 75640, 224101, 277112, 141918, 179766, 152493, 185895, 144220, 257150, 243903, 110412, 120454, 48271, 26656, -63950, -18071, -67475, -92713, 23630, 159138, 170281, 201536, 246369, 28664, -112322, -171735, -165790, -33697, -34361, -182892, -64840, -27187, -112917, -169197, -6671, 42376, 30946, 51911, 41072, -20894, 109852, 259633, 226336, -67065, -105474, -81775, 33935, 198978, 327479, 346493, 169977, -105612, -65554, 113818, -11532, -6951, 204665, 296146, 178268, 81313, -70570, -183012, -126333, -43603, -112474, -239700, -184918]
11952a84918J85772j4926r4384L6179N9483J00855p8726J8747n827J17995j2910
11941A27340J77821M848p4780m073N0667j59512j55682j46131j05616L4379J26155
11930a24584L7348R7556J80126J0274j5869k67236k00394L8495J16617J78518
11920E0851p3217j15305p1292R7430J26206k92960p7423P0063P627J4411J03112
11909a60497P665R5145m0453J60o5942j9557Q5519R7304Q5068n6997J0635j1992
11897B6058P775j08474O5826J4543o9562M9709K83430N4736K1372J1848j72051
11886A85210j28193L0079K65310J14075q7608j81857p7648J45828J45416q228
11876D02384j72325p6316j3875p153q7776p8422Q5722n5818j36303N2436R2264
$$ y = [-184918, 854, -14072, -108456, -72277, -12794, 88061, 9335, 28082, 22255, 140250, 127340, 305161, 310009, 235229, 231156, 281823, 122311, -33371, -179502, -285118, -250739, -124584, -87236, 10320, 190446, 200720, 184851, -82385, -282779, -244284, -127667, 50851, -22366, -137671, -208963, -111533, 14673, -278287, -355710, -285647, -278020, -263609, -160497, -152832, -57687, -98140, -97980, -163922, -183479, -97960, -656, 84412, 27415, 38050, 26058, 33833, -74641, -8815, 5728, -63834, -14125, 269305, 324041, 345413, 357261, 185210, 57017, 87096, 352406, 466481, 378873, 197016, 119368, 265196, 410612, 402384, 230059, 153743, 139868, 132715, 44939, -33483, 52239, -3579, -139882, -87446, 4818]
11865D818j18367J00658J4138P5029M9051L411q2985N165m2100R7826K6777j95072
11853f1651q2101K0650J37110N5563o9880p5647j05133j04834L6630J00353N7293
11842i1647Q6883j59623q049P9340O6747K3190j21111j38392J4670J90594K48853
11831A91455N0972k85436L5224J75018k0766j45368j07217j48626J41049K61290
11821A47595P1476j57025L4988M8296j10509j41190N5441J53962m5303K3829j58222
11810g6662L4013L7464m910N0952L2652J53452j8853q0982k1764j799p750m8139
11798D7674k2097J31491M0484j24690q5600K5451K07677K0187k14967j83926j04403
11787b62719J5760j3315K13520N4588k62271q0209L514M4531O9522K7932M5305
$$ y = [4818, -113549, -12891, 1247, 76276, 125327, 128738, 45753, 50918, 8818, 106644, 133421, -61651, -143752, -123102, 14008, 69571, -309, -75956, -181089, -285923, -249293, -148940, -91647, -4764, -164387, -172436, -93096, -26349, -3159, -124270, -262662, -247992, -57398, 191455, 242427, -43009, -7785, 167233, 146467, 1099, -106118, -254744, -113695, 147595, 219071, 62046, 97034, 145330, 34821, -106369, -50928, 103034, 57731, 81560, -76662, -42649, -5185, -10095, 40857, 73509, 226961, 208108, 127126, 105362, 103563, 95813, 47674, 25577, 157068, 197552, 72862, -12738, 12713, 220390, 240577, 25610, -158316, -262719, -246959, -260274, -46754, 7834, -254437, -334646, -331132, -286601, -217079, -189147, -143842]
11776a43842J13302l2881j17332n1887j97Q5005J16986m3747j17687m9765K58126
11765A6081J6366j8973n5774l5716L9411J55019n5475l7337q4961m2189J0160
11754i3388R7014k4345k4230l8814r7768o9724q6757N7852J47029J80243N3100
11743A00212p326J53095K4801k34M9942j40865q1612N3193K33874O2821j36831
11732C11070L6800O7222J35164n8471j22881j69176j96647o8048p0917R4652J5305
11721b5927j13747J19920J07420J4900j63958j46662o0568j28983L8697J03105
11711b55803N1825J65016Q6754k2402M9992j25945k47977p4810K11971J10841
11701e0538o6963J17859J21402m4896k06650q0287j10900J11597J81776j6510
$$ y = [-143842, -30540, -63421, -180753, -232640, -232837, -147832, -30846, -74593, -192280, -242045, 16081, 32447, 13474, -42300, -78016, -38605, 116414, 60939, 23602, -61359, -103548, -93388, 3626, -20719, -44949, -83763, -181531, -251255, -338012, -280160, -133131, 47112, 100212, 92886, 245981, 270782, 270548, 320490, 179625, 98013, 151206, 385080, 447901, 311070, 347870, 415092, 550256, 491785, 368904, 199728, 3081, -64967, -135884, -41232, -25927, -139674, -19754, 87666, 102566, -61392, -208054, -268622, -397605, -358908, -255803, -203978, -38962, 47792, 25390, 75382, -50563, -298540, -373350, -161379, -50538, -117501, 358, 121760, 76864, -129786, -210073, -320973, -209376, -27600, -44110]
11691d4110l0696l6489J30097J57171K7525N7118j7038j47420k17649J9239J09796
11680G544J06301r4473J21104J64447k05996p9904j1338l5851J8520k7028P3990
11669C7316O3474j48L5964O8298m7691n8699j42675l9141J9495k43737r6131R8860
11657c04815K36351K14691L7434O6980j68058j47745j6552N8671p5132m6644j18599
11646b63418M4772j01726r3826l3480L9541k0917J81272L25443J72636o792r1608
11635A51897j98776j62311n9051k2140k4429J18593J37032j5445K8995o3092N6435
11624e2292l6204J4926l3578J12526J49590N1691l06471J03451p8561q4788P3957
11613h5753m9877P1666N4153k1266O4979Q5477p4835j8654J33093j12122o1882
$$ y = [-44110, -74806, -111295, 18802, 175973, 203498, 260616, 243578, 96158, -121491, -102252, 7544, 113845, 19372, 140476, 304923, 98927, 19023, 7685, -28166, -9646, -36674, 37316, 100790, 100642, 136606, 204904, 157213, 98514, -44161, -83302, -63807, -307544, -403675, -304815, -68464, 146227, 183661, 250641, 82583, -65162, -81714, -23043, -98175, -144819, -263418, -218646, -320372, -414198, -447678, -408137, -429054, -247782, 77661, 250297, 243505, 151897, -46879, -209190, -268241, -290381, -314810, -196217, -59185, -74630, -45635, -108727, -52292, -88496, -73570, -107148, 5378, 154968, 206659, -99812, 3639, -74922, -159710, -85753, -135630, -63964, -9811, -31077, 33902, 119379, 44544, 25890, 158983, 46861, -15021]
11602a5021m4780j52218n2746J94743N7549K78974J88922J80252p6839l46463
11592B12373j09557M390j01011j35526J69642J38815N0044K3158r7418K0434L7082
11581B12426K1807j46331J2597j56397J09586K08057p1595j38169k1251j20197
11571h9467k1002J71582J13214M0563j09158p7952J09155j09620r3324j55560
11561b21569j75392J5614J06145J38897J37053j6892o4599m8524Q4450K08656
11551A63839k04793l2284J39690J42800J04927R8224k26455j04802j39520Q9149
11541C0775R2184Q0205p3712j45390k25622J11649J82058j22189j02731Q9631
11531h3142L0104J99619P4627j79659n1765k6571m222L7031J72280j86456j84185
$$ y = [-15021, -59801, -212019, -264765, -70022, -12473, 266501, 455423, 635675, 558836, 212373, 102816, 107206, 6195, -129331, 40311, 179126, 229170, 252328, 154910, 175344, 212426, 234233, 87902, 100499, -55898, 53688, 261745, 190150, 51981, 30730, -89467, -110469, 61113, 174327, 214890, 105732, 27780, 136935, 27315, -66009, -221569, -396961, -381347, -275202, -136305, 748, -16144, -80743, -129267, -44817, 163839, -40954, -73238, 66452, 209252, 314179, 412403, 185948, 81146, -58374, 30775, 122959, 203164, 129452, -15938, -241560, -129911, 52147, -70042, -172773, -83142, -53038, 146581, 221208, 41549, -10216, -36787, -41009, -3978, 168302, -18154, -202339]
11520b02339r1102N7264l1129N3869K2750r0931k02402q103J853L11280K35153
11509E6163n8111o0252j50108M1245p4250r5557J63937J03129j24089j8631J73489
11498d3035Q6830P8520j3489k06499m7093K5103L247J14121j1170Q4963j22395
11487e0897n6266p7336m4556K503o634m8562J81359O0374o1317m0962o1553j8114
11475b21961J0500M4252J82705J56637o5900r5218P806j0044k26940j4586J1026
11464b21723J5654J04404L9820o5690N8379o949M7731K39090J6319j80833j54973
11453a08771N3601N1149N4105J56286N7401P0800k5474n6266k44023k23536M8703
11442a66025J78574J97016P8909J12290k69078p6219o3918p1460n6312n5375q2026
$$ y = [-202339, -293441, -236177, -267306, -213437, -190687, -281618, -484020, -492123, -490270, -178990, 56163, -1948, -62200, -212308, -171063, -245313, -340870, -176933, -73804, -197893, -216524, -43035, 43795, 122315, 108826, -97673, -144766, -119663, -116416, -2295, -13465, 71498, -50897, -107163, -184499, -229055, -226552, -233186, -281748, -100389, -40015, -101332, -142294, -203847, -221961, -211461, -167209, 15496, 172133, 106233, 11015, 18821, 8777, -218163, -232749, -221723, -206069, -101665, -61845, -127535, -69156, -76105, -28374, 210716, 227035, 46202, -108771, -55170, -4021, 50084, 206370, 263771, 334571, 309097, 252831, 8808, -214728, -166025, 12549, 209565, 288474, 400764, 131686, 55467, -8451, -79911, -136223, -191598, -273624]
11431b73624K294K2903Q3586J0197L3018j7946Q161J45789J76629L5066j64182
11420F1891k7162M4830k2340q0143J46060L8395m5666j09829o9656j1491P4609
11409e02L8071l3357J01196q275O9356j7137k78482p9162J47403K76278J58636
11398C74025k11851j36093j7513k13129j77313j7606j7887R3419J01527j1782
11388b34203L7968j0829O3354M2040R8027P9020k9505j83127N5186R4103J0413
11377B2447j58758M9530J53494l8651p8761R7924J62084k5007m7473j49770l311
11366a6252q8485M7124M4417J48367J16243j42962N8036q2440k1449j15224q3181
11355a35806O366J896l0544J98078J64489j83300k33616R445O5045n2685N6192
$$ y = [-273624, -271330, -248427, -164841, -154644, -121626, -139572, -131411, 14378, 191007, 226073, 61891, 34729, 79559, 57219, -22924, 123136, 161531, 115865, 6036, -63620, -75111, -502, 37569, 4212, 105408, 97133, 166489, 149352, -129130, -208292, -60889, 215389, 374025, 162174, 26081, 8568, -204561, -381874, -399480, -417367, -323948, -222421, -234203, -196235, -207064, -143710, -101670, -3643, 75377, 45872, -137255, -82069, 12034, 22447, -136311, -86781, 66713, 28062, -50699, 47225, 209309, 184302, 136829, -12941, -16252, -104737, -57613, -13196, 135171, 251414, 108452, 166488, 84048, 62599, -52625, -135806, -129440, -127544, -158088, 39990, 204479, 21179, -212437, -202992, -137947, -190632, -134440]
11344a34440r7019j63637p013K24071J41997Q2685K406J9324J46408k85l8834
11333A75663j76160m6630J66510J20603l8507n7419n9808j35042j3110N5401p0148
11322g8647q8757R1253q1699k14889k4970P6892K52781O6679p7069K612M4185
11311c1629j62028J6501N2440k7133J23308J32178o6752J2380J2017k6628l8245
11300c591j10330j57729R6789n7797O264L2999J3189R7945K7427K1283R8856j46208
11288h0903j15499J16073k8136J68850J34641j01957k7877m87k5711O4769J35526
11277B39289m1064k23887j05979n566L899R0058J19824J5469R1377j15529m1053
11266B6838j51304j08818J06672P809O8125Q6885r4442l1304R6619J74282J85465
$$ y = [-134440, -231459, -395096, -402109, -178038, -36041, 46644, 49050, 68374, 214782, 214497, 175663, -497, -47127, 119383, 239986, 201479, 144060, 84252, -50790, -63900, -8499, -78647, -167404, -76151, -157850, -372739, -397709, -320817, -68036, -1357, -78426, -75814, -31629, -193657, -177156, -124716, -151849, -28541, 103637, 36885, 49265, 61282, 34654, -3591, -113921, -271650, -174861, -232658, -226394, -193395, -180206, -82261, -54834, -33551, 65305, -80903, -196402, -80329, -108465, 60385, 195026, 93069, 65192, 64705, 38994, 103763, 239289, 198225, -25662, -131641, -137207, -133308, -43250, 76574, 92043, 183420, 67891, 26838, -124466, -233284, -126612, -118803, -50678, 36207, -58235, -89539, 7080, 181362, 366827]
11255C66827J3953k71304J0228J4442r7661P394q7988j8957r8795k9581q9407
11244b80849L2144Q0116n3041j07663O6467J61837K1815k58877O0533Q736L4106
11233b34676J3875J18143R7046n6770Q0148R7298K32258j52624j82143n7808J22751
11222G7498k0390L6610K575K2123J76399j75350j37313N4633q9921j28688m6817
11211b28641K3315n3556R7030J23549l3651K0300M386J51622j47245j82902K7430
11200a98363J00716n1051J06280P6496k3037O4293L8127l9537k9889j5462n6860
11189b8287k51753p6559j11296K0808J22898j8339P8563K18052q3520L6220J11390
11178A8177J69115k02928j00556P7646o4493M5257J48248J48073k7705j23599
$$ y = [366827, 380780, 109476, 119704, 134146, 36485, 43879, -44109, -63066, -161861, -191442, -280849, -248705, -168589, -221630, -329293, -262826, -100989, -79174, -338051, -277518, -268782, -234676, -220801, -102658, -5612, -62382, 17766, 115064, 347322, 194698, 12555, -45253, 77498, 57108, 93718, 96293, 118416, 294815, 119465, -17848, 36785, -53136, -181824, -228641, -205326, -258882, -161852, -38303, -71954, -51654, -47268, 104354, -42891, -225793, -198363, -97647, -148698, -42418, 34078, 11041, 75334, 113461, 73924, 44035, 28573, -28287, -280040, -356599, -467895, -447087, -324189, -342528, -263965, -45913, -129433, -93213, 18177, 187292, -15636, -116192, -38546, -103039, -57782, 90466, 238539, 210834, 87235]
11168H7235k3194q6114M5587J67152k1940O146k29344l8784L39648K186j24859
11157A23719j84415K1364J38229j03800j01432m8580J58540J92565j02429j11690
11147a7929J9772J9817J83739Q6297J75260P9486j59725l3355J22683k77087l34793
11136a35835m2182J12185K65361J89551j44208q7265r0505p9205J87333R6096
11126B71326l3299N614j69785j21255l2358N2019N7130j2577R7280K9354l7784
11115A05665L7619J20126J02895k5845j99988J6917L9198j00554j64527j89571
11105b58065n4180J43181P3010j09497p8431Q5992K40679J13346r8833j16819
11095e9617p4608J77844K30487l0035j57923k25798q3478r6232M2759J50957N1646
$$ y = [87235, 64041, -22073, 23514, 190666, 168726, 174872, -54472, -93256, 246392, 248578, 123719, -60696, -39332, 98897, -4903, -106335, -154915, 3625, 196190, 93761, -17929, 1843, 21660, 205399, 291696, 466956, 546442, 386717, 353362, 476045, 198958, -135835, -178017, -65832, 199529, 389080, 244872, 157607, 67102, -12103, 175230, 271326, 238027, 243641, 73856, -47399, -79757, -27738, 29392, 16815, 114095, 143449, 105665, 143284, 263410, 366305, 340460, 140472, 157389, 196587, 96033, -68494, -258065, -312245, -169064, -96054, -205551, -283982, -197990, 42689, 156035, 57202, -59617, -134225, 43619, 274106, 244071, 86148, -139650, -223128, -319360, -276601, -125644, -73998]
11084g3998p8300k5536J31342N8714m4970L2002j00448p0800J46254K45101o668
11073B12693k03347l5525J20008J68701J10677j26060n2380j33006K567P0309
11063A34637q5415m0457l8456p4309r9534k9951M20870J48343p3687m3520l4744
11052A83777q6433K8610O5399j25680r8392J25906M7081j8568J0967J20255P9904
11041C32826j54496l0440q624p2690K7707m8803m8599r2354j04848L7243P8045
11030h5033O6792l1588K8163j65579o2812k7795J70825J68928O6287p4061R2731
11019A46858O5209k101p5990j1380j50242m2810j04599J34099R9724k1189m4989
11008g410L8016K45845N6574j32985p3519n4866o0385o5446o1352m431O6039J03871
$$ y = [-73998, -152298, -177834, -46492, 12222, -32748, -746, -101194, -171994, -25740, 219361, 212693, 9346, -26179, 93829, 262530, 373207, 247147, 194767, 61761, 64328, 134637, 49222, 8765, -29691, -104000, -203534, -233485, 187385, 335728, 262041, 218521, 183777, 97344, 125954, 191353, 65673, -32719, 93187, 140268, 121700, 132667, 252922, 332826, 178330, 147890, 139266, 66576, 94283, 45480, -3119, -95473, -200321, -163078, -85033, -18241, -49829, -21666, -187245, -250057, -277852, -107027, 61901, 128188, 54127, 146858, 212067, 209966, 133976, 122596, -27646, -70456, -175055, -40956, 58768, 37579, -7410, 30606, 276451, 333025, 200040, 126521, 71655, 11270, -54176, -115528, -119959, -53920, 49951]
10996D9951P2379q8993j25713n3243J21018N5581j43859p9310P456j04127J31601
10985a57259J08316K4857q3095R1830l9616k3199N424q9009j49672M2864p5484
10974c44043J12386J35251J27733p2533n0060M5601J2505J6924j03741k2411j1440
10963a53828N4059j20989l2304p1655M9993O7919R6100P6100l0616k4504j43107
10952b32832k24083P2307K43922J05572m4277j08101K3669k7112q2032N0807o8634
10941b90794k959L1044J32036J23546J6972n0166M1766j23614p9521J59212m3581
10930h6059K3225m3198l7180j5671R7894K08357l7106j53851j18617q3872M0953
10919b05125K03540J12816j37151j37383J20296l5302j9510Q6766n6696M0652
$$ y = [49951, 122330, 33337, -92376, -145619, -24601, 30980, -112879, -192189, -184733, -288860, -157259, -48943, -24086, -107181, -15351, -54967, -78166, -72742, -161751, -311423, -268559, -344043, -231657, -96406, 31327, -41206, -91266, -45665, -33160, -16236, -119977, -142388, -153828, -99769, -220758, -253062, -324717, -274724, -206805, -110705, -34605, -65221, -89725, -232832, -456915, -384608, -140686, -35114, -79391, -187492, -163823, -190935, -272967, -222160, -290794, -293753, -262709, -130673, -7127, 9845, -40321, 1445, -122169, -201690, -42478, -86059, -62834, -106032, -143212, -158883, -60989, 147368, 110262, -43589, -162206, -246078, -205125, -1585, 111231, -25920, -163303, -43007, -78309, -97819, -11053, -67749, -27097]
10909b7097J87660j32045j75011l3949J1284M5910R4494L3750k1303Q8580J0923
10898H3196l1546j37209o5686k15460P3013K70332R2002J39492l4180o432o7264
10887A00258M2149J5543j51936j81399J56070O992k4858j77184r378K82702j08260
10876d9301k33005K8929J35227k0083K732J01396l056l6253j1976N2607M420J54271
10864A25908J51025q8179k04650R2644J2408j27210p9636N058P3477o0682k0718
10853a20555J70968J19268K147m27111q9404K91529K02642J35270J012o5662j30875
10842H9229r0837Q1336j4204J8703p6175J02558J07600n859l63028K9146P1971
10831d9560o5553L7649m8126M8013N4990N1386j05873L078m1307l9677j00449
$$ y = [-27097, 160563, 28518, -146493, -180442, -169158, -123248, -28754, 4996, -16307, 72273, 83196, 51650, -85559, -151245, -366705, -293692, -23360, 68642, 208134, 173954, 167522, 100258, 142407, 157950, 6014, -175385, -19315, -12323, -37181, -214365, -223743, 58959, -49301, -282306, -253377, -118150, -138233, -135501, -34105, -37161, -73414, -85390, -32783, -28363, 125908, 276933, 188754, -15896, 76748, 89156, -38054, -117690, -112632, -39155, -99837, -120555, 50413, 169681, 171828, -255283, -344687, -53158, 149484, 284754, 285766, 220104, 89229, -1608, 79728, 65524, 84227, 8052, 110610, 218210, 212351, -150677, -121531, -49560, -115113, -77464, -125590, -77577, -22587, 28799, -77074, -73996, -115303, -154980, -255429]
10820b55429j2333Q0270K11674K1552m6899j79878j49112Q9552m4644N529J85070
10809i4648R7944R3035L8700J20703o794j32228r635r4780J32491Q0572m6102
10798A79258r4798j63032J02455J28590p0537M4084j6121O8376K70529M7167k38077
10787B57894k56800l7325K0528o9541k3725m5002J18002J30973N4851k2137j55994
10776b8276P1632j4707j16862J29747O0997l4268m8178K4818J05174r2113J103
10765E9067O798j79449j8400J64380j12093J01084n955O6593n5131n581j9672
10754A641q5958m9450K26813K23225q7568n6550q7670M9159j54345j43113J13511
10743e0305N6520L3585L2474M9046K5087r687j15488r4201j4779l1945J93467
$$ y = [-255429, -267762, -187492, 24182, 45734, -1165, -181043, -330155, -240603, -285247, -279718, -94648, 3296, 96331, 135031, 255734, 248940, 116712, 107077, 12297, 144788, 225360, 179258, 84460, -78572, 23883, 152473, 81936, 126020, 109899, 178275, 448804, 495971, 257894, 1094, -36231, -15703, -85244, -108969, -153971, -35969, 95004, 149855, 127718, -28276, 43356, 28649, -88213, 41534, 102531, 68263, 20085, 44903, 150077, 57964, 59067, 65865, -113584, -131984, 32396, -79697, 21387, 15432, 82025, 26894, 21313, 1641, -84317, -133767, 93046, 316271, 228703, 172153, 84483, 133642, -20703, -163816, -50305, 6215, 39800, 72274, 121320, 146407, 136720, 21232, -72969, -87748, -119693, 73774]
10732G3774Q321q1229J98039j35335j26253L5374j79493J47256k3283l3681M3875
10721g2635J20766K2689l7609J0569q3149j33809n4170K4865J63406J07619j36462
10710f7920m8775M7899K5899M9392L5168J02093j19871j88352j21979R4884K23496
10699C1934Q1076O5099j03676o6777o2999j9278M5883N5574J39695P7306K8819
10688B72656m3509J2821n2851O8767j45082p2041J00610L8412n2089Q3027L3517
10677B44238j34898j73828j3192J21315J5050j89984p4532O4881j2905j95005
10667c48860L003Q0097J50445J2778R2035J38360K0347R7239J08208j79340l0184
10656A44128J4540r3369j71486J01576Q4221q290j7660p6381J7564k2602q2475
$$ y = [73774, 82095, 866, 198905, 63570, -62683, -27309, -206802, -59546, -82829, -116510, -72635, 48131, 70820, 33211, 43780, -39369, -173178, -227348, -202483, -39077, 68542, -67920, -116695, -68796, -42897, 6495, 41663, 143756, 23885, -164467, -286446, -191562, 31934, 113010, 178109, 74433, 7656, -55343, -74621, -28738, 26836, 166531, 243837, 272656, 229147, 241968, 189117, 257884, 112802, 40761, 141371, 179783, 127694, 210721, 244238, 109340, -64488, -77680, 43635, 58685, -131299, -205831, -140950, -153855, -348860, -345857, -265760, -115315, -102537, -10502, 127858, 148205, 245444, 353652, 174312, 144128, 158668, 65299, -106187, -4611, 79610, 71320, 53660, -22721, -5157, -27759, -110234]
10645a10234J16616J00153j68775r0941J05398J58836K02947l7748j41003j0054
10635A25195K0683n166j67919p7358P946J16331n0986Q5599M2746j66831j9360
10624h9120J4751Q611J16902K19091m6455j72212k9008j38511j11373R7758J42111
10613A2545Q6812L6326O3072p206k10241l2537j2755L4724J31086K36782j30803
10602B07805k61960j9744n6970K3174R5472q6282j367r6164k10079J40220J7268
10591b48627P6301K81142n8977j06210m1070N767k4900o6405q63J08422J46836
10580G1416j20534j89355J08127J55197L2745M1943M5202J51968n5323j29658
10570A11728L0739N9381p2123o8085n5339J58660L5448m9696J9736j7063k9868
$$ y = [-110234, 6382, 106535, -62240, -153181, -47783, 111053, 314000, 276252, 135249, 125195, 145878, 140712, -27207, -104565, -96619, 19712, -31274, 54325, 97071, -69760, -89120, -74369, -65758, 51144, 270235, 223780, 51568, 22560, -115951, -227324, -129566, 12545, 99357, 135683, 198755, 191549, -18692, -51229, -63984, -29260, 101826, 338608, 207805, -54155, -73899, -130869, -107695, -12223, -98505, -99872, -196036, -406115, -265895, -248627, -172326, 108816, 49839, -56371, -97441, -91674, -116574, -182979, -183842, -75420, 71416, -49118, -238473, -130346, 24851, 57596, 99539, 144741, 296709, 241386, 111728, 142467, 201848, 129725, 61640, 6301, 164961, 200409, 150713, 170449, 153386, 123518]
10559A23518j52742j12798k7316M2824L25372K0908o0642k07328K6013k6067j502
10548d9760J04566n4948L1561o334N384L668j44738j6644J36941n7177l1013k0375
10536i8869M8555L3290j52255j28904Q9049J43207N179m9150j22737j06146o969
10525c45750J06033J47505K6675J33840n6860m2116J18668j1621l8097k7224M0099
10514E1152q2918j40649j61572O1457J29304J28694L2959J86499J99798j45625
10504B59099j17752M9626J54134Q1958k17403m3078k3718o5717r841K0628P1222
10493A59158k54135m1887K81255J67307k05202j52153n0235j37869n6893O1722
10483b28932j04858k3285J58091J4938j00121K30991J34210l5550L625r325q8252
$$ y = [123518, -29224, -142022, -169338, -126514, 198858, 219766, 159124, -48204, -22191, -48258, -49760, 54806, -142, 31419, 25085, 30469, 34137, -110601, -127245, 9696, -47481, -78494, -98869, -50314, -17024, -169279, -298183, -209134, -65927, -60748, -109898, -232635, -338781, -345750, -239717, -92212, -65537, 68303, 11443, -30673, 87995, 76374, 38277, 11053, 51152, -31766, -172415, -333987, -272530, -143226, -14532, 18427, 204926, 404724, 259099, 141347, 190973, 345107, 427065, 209662, 166584, 142866, 77149, 67308, 87936, 159158, -94977, -136864, 144391, 311698, 106496, -45657, -95892, -233761, -290654, -228932, -333790, -357075, -198984, -184046, -284167, -53176, 81034, 45484, 49109, 39784, -48468]
10472d8468m2766R621N6653J10145P4902j66560K2546j1156L6928n4290j43054
10461a55499J28685J73878L697j07250j5589r7567o5809Q260j63881k5488J46830
10450a69733J5120N4170L0965L819j25741l9031J3417j1753R0614j557R8568K25533
10438A84391M2841J9798o8934k01981k03540q0645J50267J82154J45034K27154
10428C96539j9401j52138j89411k38922J02599J25409q7091m6594N6712K19048
10418A66750j68067j80373l3503k5031P253Q4299K4710J7597Q1379J40769K8062
10407A43845l1423m12l9231m1894m1428J25244O5984j62847J24572R4622l3078
10396B03954j28011j49152k6457J32709K7784O8756j17344j52112J69433J65141
$$ y = [-48468, -91234, -81613, -24960, 85185, 160087, -6473, 16073, 4917, 41845, -12445, -155499, -26814, 147064, 150761, 43511, 27922, -69645, -135454, -127194, -291075, -316563, -169733, -154613, -100443, -69478, -65659, -191400, -230431, -217014, -228767, -138153, -139710, -41142, 184391, 227232, 247030, 178096, -23885, -227425, -308070, -157803, 24351, 169385, 396539, 377138, 225000, 35589, -203333, -100734, 24675, -62416, -109010, -52298, 166750, -1317, -181690, -215193, -240224, -232971, -148672, -123962, -106365, -24986, 115783, 143845, 112422, 112010, 72779, 30885, -10543, 114701, 180685, 17838, 142410, 237032, 203954, 75943, -73209, -99666, 33043, 60827, 129583, 12239, -139873, 29560, 194701]
10386A94701r9148j77327j58712o08J11004J67433P1906n197j13202R5078O4218
10375A50146j82023j81415m4730o981J8410N1944q7384k6148M102M4340M2044
10364b17695Q0090Q9203M0505N3367L1260p9321P312o0511o9793P1393j3800K1948
10352d6042K6360J18723K3038j43481l1477j3462j5461K03054l9692k4307j12507
10341e5254j34972l196L4870J05092K06851m1063o4862J17775J11707l5823o0586
10330A80539j35668J37459j29203j66341j15072l2356J25329L06814J54799j06732
10320B19568j93571l7415J87388p6472N056J8883j45388J31231j6949k18497j7444
10309a43610J89313J06698o0354J6722P6916k09362j14556J43981j33306L7429
$$ y = [194701, 95553, -81774, -240486, -241094, -130090, 37343, 109249, 104052, -9150, 85928, 150146, -31877, -213292, -258022, -265003, -246593, -194649, -282033, -308181, -304079, -259739, -217695, -137605, -48402, -7897, 45470, 76730, -2591, 4721, -55790, -125583, -54190, -67990, -46042, -19682, 99041, 122079, -21402, -52879, -66341, -81802, 121252, 81560, 57253, -55254, -190226, -193422, -158552, -53460, 153391, 112328, 47466, 165241, 276948, 241125, 180539, 44871, 182330, 53127, -113214, -228286, -260642, -135313, 171501, 326300, 219568, 25997, -11418, 175970, 99498, 104554, 123437, -21951, 109280, 92331, -126166, -143610, 45703, 152401, 92047, 108769, 185685, -23677, -138233, 5748, -127558, -90129]
10299i0129J11631K12036k1192n6969L8063N5810Q4657P6387j06289N2100Q0345
10288D36450p3261j36181k0668j0549q1123j40272j61992L2165P424j41810r3794
10277c83611J82820J36305j68941N7023J34049m8442j41845l1348J12182L4293
10267a17515J47452J50692j24961J1916J98919m2302l0342l9294m7143N1458q6251
10256G2629j04375O406N5567r7934N1471J51350k06575j45667K11060M6325j15363
10245g5106o6322p373J15241J450j23584J12939O1062Q94n0847N7639K4848J24323
10233A75164Q9784m6233j42338k3016k5874j91262j88566k5824J28542Q9087N0160
10222a10376J75329l9415J01923J91204J76903K17763J37429k43858j18743N8042
$$ y = [-90129, 21502, 233538, 212346, 155377, 193440, 249250, 333907, 410294, 304005, 356105, 436450, 363189, 227008, 206340, 195791, 114668, -25604, -187596, -155431, -148007, -289817, -383611, -200791, -64486, -233427, -176404, -42355, -90797, -232642, -263990, -151808, -117515, 29937, 180629, 55668, 67584, 266503, 224201, 193859, 154565, 107422, 158880, 72629, -31746, -25340, 30227, -67707, -16236, 135114, -71461, -217128, -6068, 40257, -75106, -141428, -148801, -33560, -32110, -155694, -42755, 18307, 19201, -31646, 25993, 50841, 175164, 264948, 218715, 76377, 53361, 27487, -163775, -352341, -378165, -249623, -160536, -110376, 64953, 25538, 127461, 318665, 495568, 713331, 850760, 606902, 488159, 546201]
10212E46201K8941o3201l2214j87086l43288r0567J07587N0825j36544k21057
10202c40403p5499J05186J23578J21753J54258m8550l8964J04781K0233N9084
10192A85457J17370J8637j12665k04736o5824P4109l1453m8004l2582K10310Q0225
10181A90844j2573J69912N9327q9954P3732K2072j36361k45332k0534o9976j24816
10170a83659m9113O8165L07302j8247k45529p5566K33706J80624j44946J0555
10160H3292Q2622N5738O3791j56888j79260p6865Q7603Q5693n2037r6024M7431
10149e4904k8882N8687M4271J7173l4252N5409O8809l9648q9895P1643K2377R7866
10137A88654q8955r0210m5364O6516J43606r1924j27387N5326O6259k58923j26082
$$ y = [546201, 575142, 511941, 479727, 292641, -50647, -141214, -33627, 17198, -119346, -340403, -415902, -310716, -187138, -65385, 88873, 40323, 1359, 106140, 126373, 185457, 302827, 321464, 208799, 4063, -61761, 12348, -19105, -67109, -99691, 110619, 190844, 178271, 348183, 407510, 317556, 391288, 413360, 276999, 31667, 11133, -58843, -183659, -232772, -164607, 142695, 124448, -121081, -196647, 37059, 217683, 72737, 83292, 165914, 221652, 285443, 128555, -50705, -127570, -39967, 45726, -6311, -102335, -54904, -83786, -25099, 19172, 36345, 2093, 57502, 126311, 86663, -3232, 68411, 90788, 188654, 99699, 9489, -35875, 30641, 174247, 82323, -45064, 10262, 76521, -182402, -308484]
10126c08484M0517P2664R2910J08335m1663O5457j2829j02368K1357J55128O0751
10115A51775k14358r0619J00544J11969K30249O4096o8369o4441k1831n7843L2041
10104A73213j4659m7453n5871J11124n0343O4686q3877j02149L464J96216N2302
10093B46653j00880j09720L7365o9483R292N2988j558j24653J73116J76954j93402
10082I6672m7158J25232K56321J33020k79494j65092M7796k9013p5613P9390N5986
10071A98047O7258J73124M729P4654K26237l4090r3506q1269J70778K38577M28309
10060A372848J73132O0515L87293N02559O48674Q90844J927004K475342J253875
10051I692086n25889n27717J77369P59130j86569k586267k306216j323254o29546
$$ y = [-308484, -267967, -195303, -102393, 5942, -35721, 29736, 16907, -85461, -64104, 91024, 151775, -62583, -153202, -52658, 59311, 289560, 353656, 285287, 220846, 199015, 141172, 173213, 158554, 111101, 55230, 166354, 116011, 180697, 96820, -5329, -1865, 194351, 246653, 145773, 36053, 73418, 3935, 13227, 66215, 64657, -59996, 113120, 290074, 96672, 49514, 174746, 431067, 564087, 284593, 119501, 167297, 138284, 62671, 142061, 198047, 265305, 438429, 443158, 517812, 744049, 709959, 616453, 535184, 705962, 944539, 1372848, 1545980, 1606495, 1993788, 2496347, 3145021, 4035865, 5962869, 8438211, 9692086, 9166197, 8638480, 8815849, 9574979, 9388410, 6802143, 4495927, 3172673, 2543127]
10042B543127m07042k82617k29249k27546r6242J3769p4062r2964r2051l7518
10032A017605N677j43784k8933J8145k95973j20273K11348J5938k2232j56184
10022E01334j83202k1142M4293P3045m2046j36602j3702j92896l4356K38531J12876
10011C46133P5680J26755J15030r3056O516j488q0608j71913j15732p9117Q1513
10000B09713Q0194j20142n4257R137M2263j71437j95228K23108J34434j2250K9898
9989A75433n254o8077K1918Q5678o6399j44680o6890m5772P7707K8134K6704J45580
9977A64082R8083l7921j44558j66906k34073L1803o7511J27176J60524P6719J22821
9966A30239J35764K0915p7659r7437J12580Q4402m6122n1696j38741k548m3904
$$ y = [2543127, 2136085, 1853468, 1624219, 1396673, 1300431, 1314200, 1240138, 1147174, 1055123, 1017605, 1023282, 879498, 850565, 868710, 572737, 452464, 663812, 679750, 657518, 501334, 318132, 296990, 341283, 414328, 372282, 235680, 221978, 29082, -5274, 233257, 346133, 421813, 548568, 663598, 570542, 577058, 575570, 494962, 323049, 207317, 128200, 209713, 289907, 169765, 115508, 124645, 166908, -4529, -199757, 23351, 157785, 145535, 175433, 170179, 102102, 124020, 209698, 143299, -1381, -68271, -114043, -36336, -8202, 18502, 164082, 262165, 224244, 79686, -87220, -321293, -289490, -357001, -229825, -69301, 7418, 130239, 266003, 286918, 209259, 111822, 224402, 308804, 262682, 210986, 72245, 69697, 25793]
9955B5793j0614L1390J51598J68367j28144l9165P4319r2482k23062k24002J427
9944b64575J56020q449J4638P3103k8569R873p6537j30975J39232K35248J23780
9933B42789l7951o0699L0999j02748N8622P8829j90719j23009j5682J2265K7624
9922g9680o3768M9665l3176J32320K8644r4518J08795K1841O3668o1251p7623
9911e083j9555j2554j15755j5547J47531J19663j00412j62615J12586K22882M773
9900A75914m0704O9767q0672q7251n173p1007O8160J0246l3962M4346p4940n6298
9888h1574M5142k1401l9059J20969J35712J84488J37034j67180k41485m8601q6280
9877f2235N046Q323J33071N0446J02555k8764r6043J14201O8601j47778j43954
$$ y = [25793, 15179, 46569, 198167, 366534, 238390, 199225, 273544, 181062, -42000, -266002, -264575, -108555, -117004, -102366, -29263, -57832, -47959, -124496, -255471, -116239, 119009, 242789, 204838, 144139, 175138, 72390, 131012, 209841, 19122, -103887, -119569, -107304, -79680, -143448, -93783, -126959, 5361, 34005, -60513, 48282, 70123, 133791, 72540, -5083, -24638, -37192, -152947, -168494, -20963, 98700, -1712, -164327, -51741, 171141, 175914, 135210, 204977, 124305, 37054, 31881, -39126, 29034, 39280, 5318, 49664, -25276, -81574, -36432, -57833, -96892, 24077, 159789, 344277, 481311, 314131, 72646, 24045, -62235, -57189, -48866, 84205, 134651, 237206, 208442, 112399, 226600, 295201, 147423, 3469]
9866C469O5823K9356J15986l2895o1665J9862O03l3051P0744Q649N6556L1564
9854B75001l1141j45157j33352K4964P7346k4434n1464j19429N9261K24389j8043
9843A37941L4348M0745k7728j50487J2725p946P2481P1660L9160k3560L136l3251
9831A69224j16202k2246j63860k5786l4822L9314M255R3734J31913J46699J6913
9820B39136r7282q817Q9272k7209k0670j25457q6818K0851N5929l546j0357o5759
9808d0727Q1636N1430o3476J06863k2669j21354q2339n6619J46452O7692j42630
9797g5741m1457J2144r22k9593P3053Q5244J2129n0771R3775Q2305j9002m1146
9785A00018J4042p1808R4515J56179l5779p2817L214k6945M0543j15360O5836
$$ y = [3469, 69292, 98648, 214634, 181739, 120074, 139936, 140539, 107488, 178232, 186881, 243437, 275001, 243860, 98703, -34649, -9685, 67661, 43227, -8237, -127666, -68405, 155984, 137941, 172289, 213034, 185306, 34819, 47544, 39598, 112079, 183739, 222899, 199339, 202475, 169224, 53022, 30776, -133084, -158870, -193692, -154378, -150123, -56389, 75524, 222223, 239136, 141854, 133037, 222309, 195100, 174430, 48973, -37845, -16994, 38935, 35389, 25032, -40727, 40909, 92339, 28863, 135726, 113057, -8297, -90636, -147255, -803, 66889, -75741, -117198, -105054, -105976, -135569, -62516, 22728, 34857, -15914, 77861, 160166, 141164, 100018, 114060, 42252, 136767, 292946, 257167, 184350, 187564, 160619, 201162, 85802, 151638]
9774A51638O8573n1205n000J8102L7511l4906M4381j24167n2057j3493Q893m5631
9762B639J04911R8390l8893p0979O2553k1275J06169l4974o2628j29954q6794
9751g0835o1560o0215l330J2297K00476K06471J06152O7844l3461k99811k56981
9740a92953J75150J53367j43874r8816O9676j27486r7160m5123J55942O6718k8010
9729a12569O4267J41260K9651j14850M6963M8062m0567N8760l5815r5710r426
9718a9974J11667O9035J09477m0322j76338k27491j33482M9866J90328J86021
9708A18787p647R895J62943l4060j36547m4316L2526R4616M1069j20149L7986
9697A55103J01871J90383Q1436k98371k11318n4638Q6409j44724j53295N4325
$$ y = [151638, 220211, 169006, 164006, 182108, 219619, 184713, 229094, 104927, 52870, 39377, 48270, 2639, 107550, 205940, 167047, 96068, 158621, 137346, 243515, 208541, 145913, 15959, -70835, -132395, -192610, -195940, -183643, 16833, 223304, 329456, 397300, 363839, 64028, -192953, -17803, 135564, -8310, -107126, -37450, -164936, -262096, -307219, -151277, -84559, -112569, -48302, 92958, 122609, 7759, 54722, 102784, 62217, 120977, 85162, -10548, -19974, 91693, 160728, 270205, 229883, 53545, -173946, -307428, -257562, -67234, 118787, 111140, 121035, 283978, 249918, 113371, 69055, 101581, 196197, 237266, 117117, 155103, 256974, 447357, 528793, 230422, 19104, -35534, 50875, -93849, -247144, -192819]
9687a92819j24177M8853J77845J29388N2502o851k78949n3643K14761Q4228K4931
9676G6069r3570j55783J61192J25747p1286j04403j49970k0669R9519J74962m6661
9665d853q9813J28516o6895m7583j19353l2794J45975m9207p8254p5144L3564
9654b55841K01269L39043K9568r2072K7015q5406k43352j35561p1257P7318J10893
9643i8383L5255N3084n3320m0546N4286K53472K07772k1489r7531R191j01437
9632B00354p8506J0512j40961P0064m333o2994L6872K5495m214n9265l6751K28587
9620A84860L3876N7L2250p5273j07253j58373J75722J38363j52114m6805O3830
9609H9140P5276j42380J6607J01929Q2337Q7014K4486j52635M2788j051J46047
$$ y = [-192819, -316996, -268143, -90298, 39090, 91592, 84741, -194208, -247851, -33090, 51138, 76069, -17501, -173284, -12092, 113655, 42369, -62034, -212004, -232673, -133154, 41808, -4853, -94666, 33850, -33045, -80628, -199981, -232775, -86800, -136007, -214261, -289405, -255841, -54572, 284471, 314039, 221967, 248982, 163576, -79776, -215337, -286594, -209276, -98383, -63128, -10044, -63364, -103910, -49624, 203848, 411620, 390131, 292600, 301791, 200354, 121848, 132360, -8601, 61463, 57130, -5864, 31008, 56503, 52289, -6976, -43727, 184860, 218736, 218793, 251043, 175770, 68517, -89856, 85866, 224229, 72115, 25310, 89140, 164416, 22036, 38643, 140572, 222909, 309923, 334409, 181774, 224562, 223511, 369558]
9598C69558l8998j8207O2951k4783r2872j2867p420j57537L5454M481j81742j0926
9586g2908R1093J30775K3560j08276n98L181q9701p865J22293J19793j4344r8670
9574I8333p5483r1855K00288l47j30088J04642j68677L402K74540j89781j82588
9563a57614j9017J75377L7356Q2738N5373J22386N827j2121M7467l0023j22104
9552A85645j1458P7775Q8093q8974j74418j31987j80361o2482r677J02892J85960
9541a8992N4412p3287P9598l6652j56455Q1393P3439k1099n6389N9234k1708J12643
9529G6137J16257J0019j48489j53476j23374J0488N9636Q2869J5769p5964N8653
9518g1475J14063l4716K4390j0910J30085J08049l6563o8139k0669K4443o3118
$$ y = [369558, 330560, 312353, 375304, 350521, 257649, 244782, 237362, 79825, 115279, 119760, -61982, -72908, 18185, 148960, 172520, 64244, 63646, 66827, -22874, -30739, 91554, 211347, 197003, 98333, 22850, -69005, 131283, 130936, 848, 105490, -63187, -59785, 214755, 24974, -157614, -176631, -1254, 36102, 118840, 174213, 296599, 302426, 290305, 337772, 307749, 185645, 174187, 251962, 340055, 251081, 76663, -55324, -235685, -298167, -307844, -204952, -18992, 35420, -37867, 41731, 5079, -151376, -69983, 3456, -17643, -74032, -14798, -36506, 76137, 192394, 202413, 53924, -99552, -222926, -212438, -152802, -69933, -54164, -130128, -71475, 42588, 7872, 32262, 21352, 151437, 259486, 222923, 154784, 134115, 158558, 95440]
9507I5440m0527J00619J27640J06976j16957J5405j55613l7947j6766L1850q9458
9496B0662M3959J75560N9645j19509j26343J22685j16097j28194P2720J19699
9486A24787q3681P3751P5695O8062j76094r7595J02667P9964j9279J54753L4790
9475C37820m9543p0402J00482j52380j3605R6992J2452o6229p0974j36906o312
9464a8605J86121m7651j09751L8644P8251O4959k6791j24941p2490K4737J83770
9453A76253j16758j14037j0610L5164l8088J52085J80539J65373j01680k758j32389
9442A93094j22546M5336o6975k2505N6265j3681m6634J505Q9532q9403O2864n5095
9430C1757J92342J44536m4594j56439N8607N61n2688O7482O8390J01443M6487
$$ y = [95440, 54913, 155532, 283172, 390148, 273191, 288596, 132983, 95036, 78270, 110120, 20662, 64621, 240181, 299826, 180317, 53974, 176659, 60562, -67632, 5088, 124787, 41106, 114857, 190552, 258614, 82520, -15075, 87592, 167556, 148277, 303030, 337820, 288277, 217875, 318357, 165977, 152372, 249364, 261816, 195587, 124613, -12293, -18605, 167516, 119865, 10114, 48758, 127009, 191968, 165177, 40236, -32254, -7517, 176253, 59495, -54542, -65152, -29988, -68076, 84009, 264548, 429921, 328241, 325483, 193094, 70548, 115884, 48909, 26404, 82669, 68988, 22354, 23859, 113391, 23988, 86852, 31757, 224099, 368635, 324041, 167602, 226209, 226770, 174082, 241564, 309954, 411397, 457884]
9419D57884k09469r6724o1877l7877M0834O2415L7236l6585q2872l1490k7107
9408A4368m8637R3188k8047j52723n9333R6692j53634R0748J90794J15411J07925
9397B66752k379j6019k3183q0098N6129P9102J12955K7175l9755j08765J12131
9386C84045n8703N7564M7641n0200q1806j31647m5268n5451p5598r894M7276o4138
9374c6179j181K36110J34794Q1774k4637n4701j47823O5262R500j29487J65592
9363B99024q3632o4138l0607j55266j09715P7738J15818J50772M8567P1434j46769
9352A73226j52249J21509J68018J6527J21364R0610j45705P5400o0190j77538
9342B30972j03902n6418j49302Q2098J15767K6182Q0936J06484J49105J57340
$$ y = [457884, 248415, 151691, 89814, 51937, 92771, 155186, 192422, 155837, 72965, 41475, 14368, -34269, 58919, 30872, -121851, -181184, -84492, -238126, -147378, 43416, 158827, 266752, 264373, 248354, 225171, 145073, 201202, 280304, 393259, 420434, 380679, 271914, 384045, 325342, 382906, 430547, 380347, 298541, 166894, 121626, 66175, -9423, -19317, 27959, -36179, -37360, 198750, 333544, 415318, 390681, 335980, 188157, 253419, 262919, 133432, 299024, 215392, 151254, 120647, -34619, -144334, -66596, 49222, 199994, 248561, 319995, 173226, 20977, 142486, 310504, 327031, 448395, 539005, 393300, 468700, 408510, 230972, 127070, 70652, -78650, 3448, 119215, 145397, 226333, 332817, 481922, 639262]
9332F39262j38136o8676k12128j50674j4743J27551J56718P0700K3011j69626
9322B63259k1472N555Q8823R571m7881J48176J4084k16359j23066l0402L1682
9311A21970J33938P6389q3801J48870Q1131j27317j83504j11555o6688R4588R5295
9300A79316L0622J0867j1856j53283M9500J23776p1635j63605k7496p4179Q9881
9289a8092P775o8743n1074m1106j89427K3547L29701K38289J8635K9637n9769
9278B19373j5868O5098Q9602j43058M3269j68200r3448O5960j6784J6487J54484
9267B16915J15721o2556k35643l2113L91772m8300k47549O6371J8394j56791m5709
9256a9488J59743J71357J52131J31556n3635P18N9634n5698j08760J6262n8645
$$ y = [639262, 501126, 432450, 220322, 69648, 54905, 182456, 339174, 409874, 432885, 263259, 241787, 247342, 336165, 345736, 297855, 446031, 460115, 243756, 120690, 90288, 121970, 255908, 332297, 248496, 397366, 478497, 351180, 167676, 56121, -10567, 84021, 179316, 209938, 220805, 208949, 55666, 105166, 228942, 157307, -6298, -33794, -107973, -18092, -10317, -79060, -130134, -171240, -360667, -337120, -7419, 230870, 249505, 279142, 219373, 203505, 268603, 358205, 215147, 258416, 90216, -3232, 62728, 45944, 62431, 216915, 332636, 270080, 34437, 2324, 394096, 345796, 98247, 164618, 183012, 26221, -19488, 140255, 311612, 463743, 595299, 541664, 542382, 602016, 546318, 437558, 453820, 395175]
9245C95175J73783Q5949q4029L4894L5725J6451j3765k14170j00868q5957J55258
9234C98446j07859j43489J648L0923O1732J01975m0355l0173J04850Q3970J33721
9223E95389J58536P877J24377K0344L169j30360j15596j3525m45P8398q8950p3146
9211E66068K0562j11672K4778o376J07826o3410j45559p1945Q5140P8578J15765
9200E99755P8115J556m1832M6250p1473j40548j11376J51491N4150O3361l9361
9189E90088L9449L6453J6091l761Q9014J13074J57066j09343j09994q2476N2509
9178G88170J52819m1243M2912K67059k33840n5205J63466K167p2744p8513p2134
9167H62914K2417l7691j24409j9975J97371J06266k1760O3085Q1020q512l075
$$ y = [395175, 568958, 654907, 570878, 605772, 641497, 657948, 644183, 430013, 329145, 243188, 398446, 290587, 147098, 148746, 179669, 241401, 343376, 303021, 272848, 377698, 461668, 595389, 753925, 761802, 886179, 906523, 909692, 779332, 663736, 650211, 649766, 728164, 639214, 566068, 586630, 474958, 499736, 493360, 601186, 537776, 392217, 320272, 405412, 483990, 599755, 677870, 679426, 637594, 683844, 612371, 471823, 360447, 511938, 566088, 629449, 590088, 629537, 665990, 682081, 678320, 767334, 880408, 1037474, 928131, 818137, 735661, 788170, 940989, 899746, 942658, 1209717, 975877, 920672, 1084138, 1086305, 1013561, 935048, 862914, 885331, 847640, 723231, 703256, 900627, 1006893, 985133, 1048218, 1129238, 1120726, 1117651]
9156A117651P7125J16269L3121k26275j30990R7791K85436R1055M9941K23164
9146A734288L7258M6587J84816Q4199J22760J62098R6558J39555R699l7701q2585
9135B497532K6140K06603L01392J28537K51159O9973K32742K83798K87755K98597
9125D584228K07312K27478K61853M11389L75286L56018L95495M59753O45361P61041
9115H685214P60216N19534N27408Q79473J330814J309019J479782J765249K046090
9106A9302799K727627L462475M093113N429975P133608R439060J2717800J8689833
9098H2996290L0618691M9605066O0518352L0106974q753845j2675747M71374J0482374
9090B43369529q426523n4551386n7696239l5666870k0540790j2328779q142568
$$ y = [1117651, 1194776, 1311045, 1344166, 1117891, 986901, 1084692, 1370128, 1461183, 1511124, 1734288, 1771546, 1818133, 2002949, 2087148, 2209908, 2372006, 2468564, 2608119, 2617818, 2580117, 2497532, 2523672, 2730275, 3031667, 3160204, 3411363, 3481336, 3714078, 3997876, 4285631, 4584228, 4791540, 5019018, 5280871, 5692260, 6067546, 6423564, 6819059, 7278812, 7924173, 8685214, 9445430, 9964964, 10492372, 11371845, 12702659, 14011678, 15491460, 17256709, 19302799, 22030426, 25492901, 29586014, 35015989, 42149597, 51588657, 64306457, 82996290, 113614981, 163220047, 223738399, 253845373, 245091528, 232415781, 232887155, 243369529, 234943006, 180391620, 122695381, 87028511, 66487721, 54158942, 46016374]
9083D6016374n737245m375212l274023k686863k222898j845255j592094j165114
9075B3117670j100182r66682j287444j106768r35266q14881q17683p13171p18586
9066A4657007o53433o37547n79960m60685m28435m30511n49943o08831n00826
9057I806836l18820k41893j98009m18923m95993j55741j40063k30863j62004m61638
9047F982889m21979k46295k35476k85967k23458j78190l1408l64657k39735n3811
9037D701913L8957K1815j13159j11883j60580j26383j34542o0924j26796j37405
9027C791013j24732Q243k2922r1114k62689p4809l6537j30401j65666j96690j30512
9016B563184p1121m3127m8324j93975j67900k3105L0254k38659j53334o4961J81855
$$ y = [46016374, 40279129, 35903917, 32629894, 29943031, 27720133, 25874878, 24282784, 23117670, 22017488, 21050806, 19763362, 18656594, 17721328, 16906447, 16088764, 15375593, 14657007, 14003574, 13366027, 12786067, 12325382, 11896947, 11466436, 10916493, 10307662, 9806836, 9488016, 9246123, 9048114, 8629191, 8133198, 7977457, 7837394, 7606531, 7444527, 6982889, 6560910, 6314615, 6079139, 5793172, 5569714, 5391524, 5360116, 4995459, 4755724, 4701913, 4740870, 4762685, 4649526, 4537643, 4377063, 4250680, 4116138, 4055214, 3928418, 3791013, 3666281, 3674524, 3651602, 3560488, 3297799, 3222990, 3186453, 3056052, 2890386, 2693696, 2563184, 2492063, 2448936, 2400612, 2206637, 2038737, 2015632, 2045886, 1807227, 1653893, 1588932, 1770787]
9005A770787K10012r2717k53452L2296r6502p7898k6303R8707P2153j16467j31587
8994A389029m7019J22263p6529j00205l782k31009m2253J24404j70826j82289
8984G81784O6889m623r1162l3489j73829r3023m3532n7832r3331l2165J568j39568
8972H7687k10443p8449K2754K11154K36035K40871j61530j76049n0324M5307j12259
8961E4754j00859J27394O9682l9418j8293m32O5072O2922M767j5784o3981n4512
8949I1312j0786K213M1978q7615M268N4045O552K7765j51742k16876J09364K17967
8937H8445j1676o5652M1018p8213j06830M0950L03526K7129R9328O0710o4615
8926C34120r7338J13962O9630o1353j16127M8203j0684l6882J38734r1863j12059
$$ y = [1770787, 1980799, 1888082, 1634630, 1666926, 1570424, 1492526, 1466223, 1564930, 1637083, 1520616, 1389029, 1342010, 1464273, 1387744, 1287539, 1283757, 1052748, 1010495, 1134899, 964073, 781784, 848673, 844050, 752888, 719399, 545570, 452547, 409015, 351183, 257852, 225687, 227255, 87687, -122756, -201205, -178451, 32703, 268738, 509609, 348079, 172030, 121706, 167013, 54754, -46105, 81289, 150971, 111553, 93260, 92828, 157900, 220822, 225589, 209805, 145824, 91312, 80526, 82739, 124717, 37102, 41370, 95415, 101967, 129732, -22010, -238886, -129522, 88445, 76769, 11117, 52135, -26078, -132908, -91958, 211568, 238697, 338025, 398735, 334120, 236782, 350744, 420374, 359021, 242894, 291097, 280413, 243531, 382265, 290402, 178343]
8915A78343j9850j86370j3181J79805J2024P3853N9068m3628n2436j2527o9915
8904A05186O8580N4206J08870j7038r0296o8842J486L4484K9576n5041J7286J09072
8892B97529L6083j24735J63252P1032L0687j32477r0199O6917l3869l0395j8820
8881B35005o776r9873m7969J13552k162P450J95756K43095o4732l07115j77255
8870H8976R7383J62268l1040k09726k1650p2993J9936J03328P5877o9633K41803
8859C84529L396m8314j87497J18083j07819j10611r1385j05515k3053N8365J27690
8848A7869r3589R2880J07396O2224j08433j5041J60472L7205Q4800j80511j73994
8837h722k1646l0390k3918J9431J25185k19906q684J4123K01064j1899j5427Q8271
$$ y = [178343, 158493, -27877, -41058, 138747, 150771, 224624, 283692, 240064, 187628, 175101, 105186, 173766, 227972, 336842, 319804, 229508, 160666, 162152, 196636, 226212, 171171, 188457, 297529, 333612, 208877, 372129, 443161, 473848, 341371, 251172, 318089, 284220, 253825, 235005, 228229, 128356, 80387, 193939, 191777, 199227, 394983, 638078, 573346, 266231, 88976, 186359, 348627, 317587, 107861, 86211, 13218, 33154, 136482, 212359, 142726, 384529, 387925, 339611, 152114, 270197, 162378, 51767, -39618, -145133, -168186, -109821, 17869, -75720, 17160, 124556, 186780, 78347, 63306, 223778, 260983, 345783, 165272, -8722, -30368, -60758, -84676, -65245, 59940, -159966, -168650, -154527, 46537, 34638, 19211, 107482]
8825A07482J61511R3665j83274j48675o6678j0165M5392K9815P674O638J00202
8814A43587j54797k9519N9816j2807N8838n4254n1000O4256J31751r6839l8210
8803B0822o3348K1679k7479l5392J25795J5507L6587K570Q5391j65844O963k1681
8791A570O1028J09837O9356J35599J7366M6165m9454m1909n8135m9995k28943
8780A2485l7652J65636R3354K2699j53164j15839P9794P6253m5297k0781p7727
8769b39q6088J5951K05402R0267j30364j25973q3492P4169j20482P0562Q0562
8758i725O6837N1723K6717O3315j3200m3732N8862j11750j18424P8398M3282k05456
8746a13153J38238O4905r5116j15658q9001K3951Q3107L6070j36224l6563K51907
$$ y = [107482, 268993, 362658, 179384, 30709, -35969, -46134, -742, 29073, 36747, 43385, 143587, -11210, -40729, 19087, 6280, 65118, 10864, -40136, 24120, 155871, 59032, 20822, -42526, -20847, -48326, -83718, 42077, 57584, 94171, 96741, 182132, 16288, 23251, 1570, 62598, 172435, 241791, 377390, 394756, 440921, 391467, 349558, 291423, 241428, 12485, -25167, 140469, 233823, 256522, 103358, -12481, 67313, 143566, 98269, 77488, -239, -86327, -70376, 135026, 225293, 94929, -31044, -114536, -40367, -160849, -90287, -9725, 57112, 108835, 135552, 198867, 185667, 141935, 200797, 89047, -29377, 49021, 92303, -113153, 25085, 89990, -5126, -120784, -209785, -185834, -102727, -66657, -202881, -239444, 12463]
8735A2463J47679P0718j28098p1670K11660j2244J76847N0267j21986j24322p3452
8724A37862j39681Q381J49909j13695j33001J15007J7809Q3564J78826K44907
8714E49888j8406k01098k32794j26134L4472J75890m4512j8651J13554J16053
8704C48262j13772j19790o0330Q4152o9529O9206p710j14018Q5697P9346j95510
8693a3996J0397L0313l0614l1197N6345J4726P8424J77776N691m0573N5809K8157
8681C41258p1892r3310k44116N2236J84974N2160j8027Q0999J3849k09541j02193
8670a3603J10414Q7346l6020R9294K7237j94130P2006J56458L7337j1444j12459
8659B22436j05600J8590q0308R2159R005P3685M1387k5345J55110N8872j30861
$$ y = [12463, 160142, 230860, 102762, 31092, 242752, 230508, 407355, 457622, 335636, 211314, 137862, -1819, 6562, 156471, 42776, -90225, 24782, 42591, 126155, 304981, 549888, 531482, 330384, 97590, -28544, 5928, 181818, 137306, 118655, 232209, 348262, 234490, 114700, 54370, 138522, 68993, 138199, 130489, 16471, 102168, 181514, -13996, -3599, 26714, -3900, -35097, 21248, 35974, 114398, 292174, 297865, 257292, 313101, 341258, 269366, 176056, -68060, -15824, 169150, 221310, 203283, 284282, 298131, 88590, -13603, 96811, 184157, 148137, 247431, 274668, 80538, 152544, 309002, 346339, 334895, 222436, 116836, 135426, 55118, 147277, 156282, 229967, 271354, 246009, 401119, 459991, 329130]
8648C29130j70692L8593K42279J82682J11862K5118Q6758j0985j24989J33667
8638H43423J09706j09373k0239k0585j40847j79181P5185K24378O4424q3509q0380
8627F83002j07974j85017o863r5901R7160N8052N7449J34559m6501k8604O27K19876
8615G79865O5779j6791k5364k3758N2101J35519Q6515k29584J16K88880K6482
8604A139760o3891O0221K4011N5109J56350K50358Q3210J31187L5137K60795J86077
8593B318324k02037j05247n7102j30595q3788j75282p2791L495r4913j17946n3613
8582A228505j59319j24437l38253j3119N0764K6258m1029o6215O7124j22019j93099
8571C15161l8493Q2672R6513J54027J78316k20362k20976N9128q1157m9820J18911
$$ y = [329130, 158438, 197031, 439310, 621992, 733854, 758972, 845730, 834745, 709756, 843423, 953129, 843756, 823517, 802932, 662085, 482904, 558089, 782467, 846891, 763382, 683002, 575028, 390011, 383148, 287247, 384407, 442459, 499908, 634467, 587966, 559362, 559989, 779865, 845644, 828853, 803489, 779731, 831832, 967351, 1053866, 824282, 824398, 1113278, 1139760, 1075869, 1136090, 1160101, 1215210, 1371560, 1621918, 1705128, 1836315, 1871452, 2132247, 2318324, 2116287, 2011040, 1953938, 1823343, 1739555, 1564273, 1491482, 1494977, 1400064, 1282118, 1228505, 1069186, 944749, 606496, 593377, 644141, 670399, 629370, 563155, 630279, 508260, 315161, 276668, 359340, 455853, 609880, 788196, 567834, 346858, 405986, 324829, 275009, 393920]
8560C93920L0466L9623K5368j0713N1269J4405j6686M9071j12939O5552J42091
8549F71427J39922r3845k44762k73638j91944J5202J34287k0081J18181K20299
8539D75048R0292j3936L9479m6003j42728P5997l2746j07103l4482J29531r9862
8528C33487K2898K6514M6312O4063l3515k5579j40919k20811j44248J18178K35608
8517B81988O0481k8736O4593J53541J07410j64650j76461j3741r9363l41960M7692
8506a09206M1073l5618K48098K45830p5759j91316N655J01791l6986k20768j19846
8495a47052J79067R8531r7009J16581Q6153j30603O800j68629j7297K16570J70172
8484C13284N3972j51713P4468q4363M608N8140q7789k5272J9398j22287j53909
$$ y = [393920, 424386, 464009, 489377, 478664, 529933, 544338, 527652, 576723, 463784, 529336, 671427, 811349, 717504, 472742, 199104, 7160, 22362, 156649, 136568, 254749, 475048, 565340, 551404, 590883, 544880, 402152, 478149, 445403, 338300, 303818, 433349, 333487, 356385, 382899, 429211, 493274, 459759, 434180, 293261, 72450, -71798, 46380, 281988, 342469, 313733, 378326, 531867, 639277, 474627, 298166, 284425, 185062, -156898, -109206, -68133, -103751, 144347, 390177, 314418, 123102, 128757, 230548, 193562, -27206, -147052, 32015, 130546, 33537, 150118, 236271, 105668, 112468, -56161, -73458, 143112, 313284, 367256, 215543, 290011, 205648, 210256, 268396, 180607, 155335, 174733, 52446, -101463]
8473a01463J0106L6094O0884P2501Q7120L8168k23724l6239J62299J12524J11314
8462C29584r3105J9047l5073M4920L5742j21201n4552M9256L9133q6504k6392
8451A00855K890Q7933J02913O8689o5186j59633k5882o0423J11919J16186K4133
8440C04394L0809L0276l2120k3156J2485P3576Q4347Q2118r4978j98892q4402
8429A84457r5151j95191q0615L0894J11259M7639m4954J02900L4041K43687J73634
8418E12600r5597j50988M0962Q6174j04896j00001O1359j1676j4285p703j08316
8407A07633m4578O5227Q8657O4876j17023r1309k01650M9623J79622j58323Q005
8396d9240J30345j52O5419n276O7269q043j36374L0606P6906Q9301J20784j27275
$$ y = [-101463, -91357, -55263, 5621, 78122, 165242, 203410, -20314, -56553, 105746, 218270, 329584, 236479, 255526, 220453, 265373, 301115, 179914, 125362, 174618, 213751, 127247, 100855, 103745, 191678, 294591, 363280, 298094, 138461, 112579, 52156, 164075, 280261, 304394, 335203, 365479, 333359, 310203, 322688, 396264, 480611, 562729, 467751, 268859, 184457, 89306, -105885, -186500, -155606, -44347, 3292, -41662, 61238, 95279, 338966, 512600, 417003, 266015, 306977, 393151, 288255, 188254, 249613, 237937, 223652, 215949, 107633, 63055, 128282, 216939, 281815, 164792, 73483, -128167, -78544, 101078, -57245, -49240, 81105, 80953, 146372, 141096, 208365, 200322, 63948, 94554, 171460, 260761, 381545, 254270]
8384B54270O4819O9358j7429j2943j2028j84213k4101l0072q267J41026j0625
8373B29795j06801J236j9533L0384J9103m7935Q3017K3510n9476q8024M1461N7462
8361A64199o5608j42481j63823N2813J1756m1822N7663o627L2052J9796J91540
8350A09458O1486q8156J30N2843J02758K1658O2793r5526m9627j54232l1192k3947
8338c1554M346K09448M2437k5035q8835j07072l1613j5827r885m2818o8247m5462
8326b10117Q3417L3199J21146R6052M806R9559j05898k02374m4562J48402Q5792
8315A09422K8266O4761Q7372l7570m3769j75682k10575M9933N5641q7883p1674
8304b31758J56903o659p6314l8492j7845q180l8287R8172K40701j6437o1825J8367
$$ y = [254270, 319089, 388447, 371018, 358075, 346047, 161834, 137733, 107661, 99394, 240420, 229795, 122994, 124230, 104697, 135081, 154184, 106249, 189266, 212776, 153300, 65276, 106737, 164199, 98591, -43890, -207713, -154900, -143144, -184966, -127303, -133930, -101878, -82082, 109458, 170944, 82788, 82918, 135761, 238519, 260177, 322970, 227444, 177817, 23585, -7607, -31554, -27208, 182240, 224677, 199642, 110807, 3735, -27878, -43705, -53590, -96408, -164655, -210117, -126700, -93501, 27645, 123697, 128503, 228062, 122164, -80210, -124772, 23630, 109422, 137688, 202449, 289821, 252251, 208482, 32800, -177775, -127842, -72201, -160084, -231758, -74855, -81514, -157828, -196320, -214165, -222345, -260632, -162460, 78241, 61804, -21, 18346]
8292A8346P3234o795p8857j00512J45590J00409P7483j01175L2611o629K5949
8281A79654k637p3994l946k14174r8828r7687M4111K45251J58124J0420J4810
8270A61104Q6048o647M9134J8232r2247N2533J8548l4593q1519j09794K2987K3156
$$ y = [18346, 91580, 84785, 5928, -94584, 51006, 151415, 228898, 127723, 160334, 153705, 179654, 177017, 103023, 99077, -115097, -213925, -311612, -267501, -22250, 135874, 146294, 161104, 247152, 240505, 289639, 307871, 215624, 268157, 286705, 252112, 170593, 60799, 83786, 106942]
$$ [...]
##END NTUPLES=NMR SPECTRUM
##END=
