##TITLE=Analysis number 321171
Compound Code cc 58513
Book Reference 196/178
Project Code adrs
Chemist Name jimp
##JCAMPDX= 6.0         $$ Bruker NMR JCAMP-DX V2.0
##DATA TYPE= NMR SPECTRUM
##DATA CLASS= NTUPLES
##ORIGIN= Bruker BioSpin GmbH
##OWNER= nmr
$$ XWIN-NMR		Version 3.5
$$ Wed Jul 26 18:14:48 2006 GMT Daylight Time (UT+1h)  MAYBRIDGE\nmr@NMR_250MHZ
##.OBSERVE FREQUENCY= 250.131544655141
##.OBSERVE NUCLEUS= ^1H
##.ACQUISITION MODE= SIMULTANEOUS (DQD)
##.ACQUISITION SCHEME= undefined
##.AVERAGES= 16
##.DIGITISER RES= 18
##SPECTROMETER/DATA SYSTEM= dpx250
##.PULSE SEQUENCE= zg30
##.SOLVENT NAME= CDCl3
##.SHIFT REFERENCE= (INTERNAL, CDCl3, 0, 16.522)
##AUDIT TRAIL= $$ (NUMBER, WHEN, WHO, WHERE, WHAT)
$$ ##TITLE= Audit trail, XWIN-NMR		Version 3.5
$$ ##JCAMPDX= 5.01
$$ ##ORIGIN= Bruker BioSpin GmbH
$$ ##OWNER= nmr
$$ C:\u/data/dgb/nmr/ADRS/3680/pdata/1/auditp.txt
$$ ##AUDIT TRAIL=  $$ (NUMBER, WHEN, WHO, WHERE, WHAT)
(   1,<2006-07-26 18:14:20.91 +100>,<MAYBRIDGE\nmr>,<NMR_250MHZ>,
      <created by zg, POWCHK disabled, PULCHK disabled
       configuration hash MD5:
       E2 DF 36 D8 04 B2 41 60 5A D7 A3 38 5A 4B D0 FE
       data hash MD5: 64K
       9D 6F 8F 1D F7 B5 15 4A 4C 91 D7 67 8B 49 F6 DE>)
(   2,<2006-07-26 18:14:39.30 +100>,<MAYBRIDGE\nmr>,<NMR_250MHZ>,
      <Start of raw data processing
       ef LB = 0.3 FT_mod = 6 PKNL = 1 SI = 32K 
       data hash MD5: 32K
       55 69 C1 E7 2F BA 87 07 13 74 5C B8 9F A8 C4 8B>)
(   3,<2006-07-26 18:14:41.48 +100>,<MAYBRIDGE\nmr>,<NMR_250MHZ>,
      <apk 
       data hash MD5: 32K
       79 39 E7 AD DB 41 FD 5E 55 BA 16 AB 57 BF 1D 7C>)
(   4,<2006-07-26 18:14:42.26 +100>,<MAYBRIDGE\nmr>,<NMR_250MHZ>,
      <abs ABSG = 5 
       data hash MD5: 32K
       BA D8 F5 22 CF CC F7 B5 D5 42 34 1F AE 1B 0A A1>)
$$ ##END=
$$ 
$$ hash MD5
$$ 9E AE 11 61 8D 8E 74 76 5F AB 15 8E 5E 74 1B 49
##$RELAX= 
##$RELAX= 
##$RELAX= 
##$RELAX= 
##$RELAX= 
##$RELAX= 
##$RELAX= 
$$ Bruker specific parameters
$$ --------------------------
##$DU= <C:\u>
##$EXPNO= 3680
##$NAME= <ADRS>
##$PROCNO= 1
##$TYPE= <nmr>
##$USER= <dgb>
##$AMP= (0..31)
100 100 100 100 100 100 100 100 100 100 100 100 100 100 100 100 100 100 
100 100 100 100 100 100 100 100 100 100 100 100 100 100 
##$AQSEQ= 0
##$AQ_mod= 3
##$AUNM= <au_zg>
##$AUTOPOS= <56 >
##$BF1= 250.13
##$BF2= 250.13
##$BF3= 250.13
##$BF4= 250.13
##$BF5= 500.13
##$BF6= 500.13
##$BF7= 500.13
##$BF8= 500.13
##$BYTORDA= 1
##$CFDGTYP= 0
##$CFRGTYP= 5
##$CHEMSTR= <none>
##$CNST= (0..31)
1 1 145 1 1 1 1 1 1 1 1 1 1 1 1 1 1 1 1 1 1 1 1 1 1 1 1 1 1 1 1 1 
##$CPDPRG= <>
##$CPDPRG1= <>
##$CPDPRG2= <>
##$CPDPRG3= <>
##$CPDPRG4= <mlev>
##$CPDPRG5= <mlev>
##$CPDPRG6= <mlev>
##$CPDPRG7= <mlev>
##$CPDPRG8= <mlev>
##$CPDPRGB= <>
##$CPDPRGT= <>
##$D= (0..31)
0 1 0 0 0 0 0 0 0 0.06 0 0 0 0 0 0 0.0002 0 0 0 0 0 0 0 0 0 0 0 0 0 0 
0 
##$DATE= 1153934058
##$DBL= (0..7)
120 120 120 120 120 120 120 120 
##$DBP= (0..7)
150 150 150 150 150 150 150 150 
##$DBP07= 0
##$DBPNAM0= <>
##$DBPNAM1= <>
$$ [...]
##$SUBNAM7= <"">
##$SUBNAM8= <"">
##$SUBNAM9= <"">
##$SW= 20.6930455092707
##$SWIBOX= (0..15)
0 0 3 0 0 0 0 0 0 0 0 0 0 0 0 0 
##$SW_h= 5175.983436853
##$TD= 65536
##$TD0= 1
##$TE= 296.16
##$TE2= 300
##$TE3= 300
##$TEG= 300
##$TL= (0..7)
0 120 120 120 120 120 120 120 
##$TP= (0..7)
150 150 150 150 150 150 150 150 
##$TP07= 0
##$TPNAME0= <>
##$TPNAME1= <>
##$TPNAME2= <>
##$TPNAME3= <>
##$TPNAME4= <>
##$TPNAME5= <>
##$TPNAME6= <>
##$TPNAME7= <>
##$TPOAL= (0..7)
0.5 0.5 0.5 0.5 0.5 0.5 0.5 0.5 
##$TPOFFS= (0..7)
0 0 0 0 0 0 0 0 
##$TUNHIN= 0
##$TUNHOUT= 0
##$TUNXOUT= 0
##$USERA1= <user>
##$USERA2= <user>
##$USERA3= <user>
##$USERA4= <user>
##$USERA5= <user>
##$V9= 5
##$VALIST= <valist>
##$VCLIST= <CCCCCCCCCCCCCCC>
##$VD= 0
##$VDLIST= <DDDDDDDDDDDDDDD>
##$VPLIST= <PPPPPPPPPPPPPPP>
##$VTLIST= <TTTTTTTTTTTTTTT>
##$WBST= 1024
##$WBSW= 4
##$XGAIN= (0..3)
0 0 0 0 
##$XL= 0
##$YL= 0
##$YMAX_a= 431780
##$YMIN_a= -620838
##$ZGOPTNS= <>
##$ZL1= 120
##$ZL2= 120
##$ZL3= 120
##$ZL4= 120
##$ABSF1= 16.522
##$ABSF2= -4.171173
##$ABSG= 5
##$ABSL= 3
##$ALPHA= 0
##$AQORDER= 0
##$ASSFAC= 0
##$ASSFACI= 0
##$ASSFACX= 0
##$ASSWID= 0
##$AUNMP= <proc_1d>
##$AZFE= 0.1
##$AZFW= 0.1
##$BCFW= 0
##$BC_mod= 0
##$BYTORDP= 0
##$COROFFS= 0
##$CY= 12.5
##$DATMOD= 1
##$DC= 0
##$DFILT= <>
##$DTYPP= 0
##$F1P= 14.0000005364418
##$F2P= -0.99999901652339
##$FCOR= 0.5
##$FTSIZE= 32768
##$FT_mod= 6
##$GAMMA= 0
##$GB= 0
##$INTBC= 1
##$INTSCL= 1
##$ISEN= 128
##$LB= 0.3
##$LEV0= 0
##$LPBIN= 0
##$MAXI= 10000
##$MC2= 0
##$MEAN= 0
##$ME_mod= 0
##$MI= 0
##$NCOEF= 0
##$NC_proc= -4
##$NLEV= 6
##$NOISF1= 0
##$NOISF2= 0
##$NSP= 0
##$NTH_PI= 0
##$NZP= 0
##$OFFSET= 16.522
##$PC= 1
##$PHC0= 162.7461
##$PHC1= 4.012381
##$PH_mod= 1
##$PKNL= yes
##$PPARMOD= 0
##$PSCAL= 4
##$PSIGN= 0
##$REVERSE= no
##$SF= 250.13
##$SI= 32768
##$SIGF1= 0
##$SIGF2= 0
##$SINO= 400
##$SIOLD= 32768
##$SREGLST= <1H.CDCl3>
##$SSB= 0
##$STSI= 32768
##$STSR= 0
##$SW_p= 5175.98343685301
##$SYMM= 0
##$S_DEV= 0
##$TDeff= 65536
##$TDoff= 0
##$TI= <Analysis number 999999
Compound Code 99
Book Reference 9
Project Code 9>
##$TILT= no
##$TM1= 0
##$TM2= 0
##$TOPLEV= 0
##$USERP1= <user>
##$USERP2= <user>
##$USERP3= <user>
##$USERP4= <user>
##$USERP5= <user>
##$WDW= 1
##$XDIM= 32768
##$YMAX_p= 309524835
##$YMIN_p= -113554
$$ End of Bruker specific parameters
$$ ---------------------------------
##NTUPLES= NMR SPECTRUM
##VAR_NAME=  FREQUENCY,     SPECTRUM/REAL,   SPECTRUM/IMAG
##SYMBOL=    X,             R,               I
##VAR_TYPE=  INDEPENDENT,   DEPENDENT,       DEPENDENT
##VAR_FORM=  AFFN,          ASDF,            ASDF
##VAR_DIM=   32768,         32768,           32768
##UNITS=     HZ,            ARBITRARY UNITS, ARBITRARY UNITS
##FACTOR=    0.157963299565203, 1,           1
##FIRST=     4132.6476996994, 0,             0
##LAST=      -1043.33573715361, 0,           0
##MIN=       -1043.33573715361, -113554,     0
##MAX=       4132.6476996994, 309524835,     0
$$ Real data points
##PAGE= N=1
##DATA TABLE= (X++(R..R)), XYDATA
$$ [...]
18407B7763894J368807J583918J677215J591308J354254J133881R07853R47586
18399C8328716J244622J610975K101966K615889K891367K924832K731861K293441
18391E6743669J661391R30289O02806N34826N17426O13821R83571J249386J253628
18382F5090813Q54922N917r40348j500320j806148j979426j828367r14877L81062
18373E7363228J586360K313748K781691K949868K702875J902414O98764k75798
18365G2023150o39039n77502l88439k0871Q00708J588947J782268J560868J113574
18356G7243664K78663j022815k492844l336476l228549k770483k495204k357331
18348E9818625k295861k205426k004898j935250k244399k704922k416182j180163
$$ plain form
18407 27763894 29132701 30716619 32393834 33985142 35339396 36473277 37381130 38328716
18399 38328716 39573338 41184313 43286279 45902168 48793535 51718367 54450228 56743669
18391 56743669 58405060 59335349 59938155 60472981 60990407 61604228 62587799 63837185 65090813
18382 65090813 65945735 65951652 65011304 63510984 61704836 59725410 57897043 56982166 57363228
18373 57363228 58949588 61263336 64045027 66994895 69697770 71600184 72298948 72023150
18365 72023150 71384111 70806609 70418170 70397299 71198007 72786954 74569222 76130090 77243664
18356 77243664 77522327 76499512 74006668 70670192 67441643 64671160 62175956 59818625
18348 59818625 57522764 55317338 53312440 51377190 49132791 46427869 44011687 42831524
18340D2831524J70900Q48707O97853K32322m03303j282258k619276l997163m711760
18331C1767546m469705l585763k615986j840941j292969r23294p36013n58659
18323A5744216m59477m25847l83126k92065k37680j32330n1486M1221J52126L02909
18313A4258461M39595O58943J006953J543270K379311L573239M974491O238221
18305C5072484O856847O489472N358490L895809K267864N32115j266551k777573
18297E6428957l212092k426091j059625M1721M87215L53622l84418j649413l121315
18288D5458561m487271n093919m902156m167476l257670k342668j606369j098302
18280A8502730p20067m08671j06333J33521M68468O38752N20570M03773M97064
$$ plain form
18340 42831524 43002424 43851131 44548984 44781306 44378003 43095745 40476469 36479306 31767546
18331 31767546 27297841 23712078 21096092 19255151 17962182 17038888 16302875 15744216
18323 15744216 15284739 14858892 14475766 14183701 13946021 13813691 13762205 13803426 13955552 14258461
18313 14258461 14698056 15356999 16363952 17907222 20286533 23859772 28834263 35072484
18305 35072484 41929331 48418803 53777293 57673102 59940966 60473081 59206530 56428957
18297 56428957 53216865 50790774 49731149 49772870 50260085 50613707 50229289 48579876 45458561
18288 45458561 40971290 35877371 30975215 26807739 23550069 21207401 19601032 18502730
18280 18502730 17782663 17373992 17267659 17401180 17869648 18508400 19028970 19432743 19929807
18271A9929807P27334R20565Q63123Q75043J887892L715133N635458O719213O942025
18262D8215593O424587N128222M903983M748592K373979l87431m056783n801432
18254F1549310l956671k542044l211440l815170k388958q09684j17475J53528
18246D4861396L35643K81216k77250k090979l882896l977593l538649k924282
18238B8786606k137534j145486k68370K34261K87742L57334N80304Q95859J199550
18229B8790266J343608J824838L004642M349188N611796O557180P105734P526494
18221F6113746Q546658J0432729J1367777Q601619L792800J272936J957831L949145
18213A16035241K579210l288253m928371r55789L666446O925872O339552J790536
$$ plain form
18271 19929807 20657141 21577706 22440829 23315872 25203764 28918897 34554355 41273568 48215593
18262 48215593 54640180 59768402 64672385 69420977 71794956 71407525 67350742 61549310
18254 61549310 57592639 55050595 51839155 48023985 45635027 44825343 44707868 44861396
18246 44861396 45197039 45478255 45201005 43110026 39227130 35249537 31710888 28786606
18238 28786606 26649072 25503586 25235216 25469477 25757219 26114553 26694857 27590716 28790266
18229 28790266 30133874 31958712 34963354 39312542 44924338 51481518 58587252 66113746
18221 66113746 74660404 85093133 96460910 105062529 108855329 110128265 112086096 116035241
18213 116035241 118614451 115326198 110397827 109442038 113108484 120034356 126373908 128164444
18205A28164444j813374m385509n888110o701891j0375355j4878820j3106717
18198G1014668j0406455q521579o046398l811939k107308j276978j158301j006871
18190C6678839o91650l40663l95250j092612j333660n68142L31510J264366K268886
18181C6121624L466580M947728O321648P275555P249351N854488L616842J581390
18173G6435206j45733j733465l314885m427986k847917O29351L251052M709779
18165G2555402O254158Q222536R959092R083384N188204R42488k791694m261602
18157A05151968n651838q828396j1329152j4521402j3565549q972797n566907
18150C6715927l666956k459245j543509o95273o5714p3474m11093n48346n04468
$$ plain form
18205 128164444 126351070 121965561 116077451 109375560 99000205 84121385 71014668
18198 71014668 60608213 52086634 46040236 42228297 40120989 38844011 37685710 36678839
18190 36678839 35987189 35646526 35251276 34158664 32825004 32256862 32588372 33852738 36121624
18181 36121624 39588204 44535932 50857580 58133135 65382486 71236974 74853816 76435206
18173 76435206 76289473 74556008 71241123 66813137 63965220 64594571 67845623 72555402
18165 72555402 78809560 87032096 96991188 106074572 111262776 112205264 109413570 105151968
18157 105151968 99500130 90671734 79342582 64821180 51255631 42282834 36715927
18150 36715927 33048971 30589726 29046217 28350944 28285230 28211756 27800663 27252317 26747849
18141B6747849m25259q41002j643172j600156q36450j29632M98801R82246J248841
18132B4002066J165714Q55163M71438O258m73506r87693j430961j471974j134669
18123B1001836m80378K07288O68222Q21457Q07700O78580N20790N82922J050816
18114B5859233K352951L835521K671010j1377o45998j91360O85745n46602o745920
18105B7263203p292425l984588k212380j376794r59803p40317o04526n04478m36803
18096I151089l63306l24203k78470k70244k68709k76711k74145k68900k43667
18087F582734k45259k31236j94534j64948j37872j77085j67748j23672j04776
18078E035604j10290q5976n4560o5995o9611k0226J8982J8811K8333k8077n2581
$$ plain form
18141 26747849 26322590 25481588 23838416 22238260 21401810 21272178 21770979 22753225 24002066
18132 24002066 25167780 26022943 26494381 26500639 26027133 25039440 23608479 22136505 21001836
18123 21001836 20521458 20728746 21396968 22218425 23026125 23704705 24225495 24808417 25859233
18114 25859233 28212184 32047705 34718715 34707338 34061340 33869980 34555725 34009123 27263203
18105 27263203 19970778 15986190 13773810 12397016 11437213 10696896 10092370 9587892 9151089
18096 9151089 8787783 8463580 8185110 7914866 7646157 7369446 7095301 6826401 6582734
18087 6582734 6337475 6106239 5911705 5746757 5608885 5431800 5264052 5140380 5035604
18078 5035604 4925314 4839338 4784778 4718783 4649172 4628946 4647928 4666739 4695072 4666995 4614414
18067D614414q9273j33102j40167j95446j94026j29189j16450j09997j34114j15875
18057C256775j08808r0591q8702j08584p9076o6314p2943p4540r1662p9567m9129
18046B346859j0553J7895K5944M6716L6765L3116J5584M7523M3928n108n7892
18035B540777k3155l7907q6824p8546p6346p8386m6153q3169n9437m2607l0256
18024A897991m0726l1314J193j1405j1476O929J3331K9402J0905k0793K07L0289
18012A874533K0605j5930P07N073P338N232P3091M4807N2514M6277L6686R6917
18000B247850J07726J67794K14326K08613J65232J62870J43655J34643J04157
17991C656866J2746O892R9930J43675K01290K15173J94230J57708O4779m5711
$$ plain form
18067 4614414 4525141 4392039 4251872 4056426 3862400 3733211 3616761 3506764 3372650 3256775
18057 3256775 3147967 3057376 2968674 2860090 2781014 2714700 2641757 2567217 2475555 2395988 2346859
18046 2346859 2336306 2354201 2380145 2426861 2463626 2496742 2512326 2559849 2603777 2598669 2540777
18035 2540777 2517622 2479715 2392891 2314345 2237999 2159613 2113460 2030291 1970854 1928247 1897991
18024 1897991 1857265 1825951 1827144 1815739 1804263 1811192 1824523 1853925 1864830 1844037 1844244 1874533
18012 1874533 1895138 1879208 1879915 1884988 1892326 1897558 1970649 2015456 2067970 2114247 2150933 2247850
18000 2247850 2355576 2523370 2737696 2946309 3111541 3274411 3418066 3552709 3656866
17991 3656866 3669612 3676504 3776434 3920109 4121399 4336572 4530802 4688510 4753289 4707578
17981D707578j73833l27474m16138m30393m20972l55945k43626j63411j16847
17972B058939r1745o3623l5682l5092k2280N2810O6221N0674K6466P276l2774
17961A981190l6745m4967j00326j41111q3301o2823n5743r187l641O473J6160
17950A465979n891o497m0810n2302l4053k8112J6267J5893J3643K7530Q2215R9234
17938A553096P1867K9914N3217M4996O9437P1223M054k6637l8286m389l013l4109
17926A791370n6502p9852q3989j05376o8715n2302m4472p2932l5004k5868k9396
17915A136962m87K6387J9812K1193p526j5404k0983m146J0578r960j8108m646
17903A133672j6386j7917k467k7842l2947k271K0688J5643j3659k1146M400q71
$$ plain form
17981 4707578 4533745 4206271 3790133 3359740 2938768 2582823 2339197 2175786 2058939
17972 2058939 1967194 1903571 1867889 1832797 1810517 1863327 1929548 1980222 2006688 2013964 1981190
17961 1981190 1944445 1899478 1799152 1658041 1574740 1511917 1456174 1446987 1443346 1449819 1465979
17950 1465979 1460088 1453591 1412781 1360479 1326426 1298314 1314581 1330474 1344117 1371647 1453862 1553096
17938 1553096 1624963 1654877 1708094 1753090 1822527 1893750 1897804 1871167 1832881 1828492 1825479 1791370
17926 1791370 1734868 1655016 1571027 1465651 1396936 1344634 1300162 1227230 1192226 1166358 1136962
17915 1136962 1136475 1162862 1182674 1203867 1196341 1180937 1159954 1155808 1166386 1156426 1138318 1133672
17903 1133672 1117286 1099369 1096902 1069060 1036113 1033842 1054530 1070173 1056514 1035368 1039768 1038897
17891A038897k3222j2864l634k500P4897R2902J11623J07362j688l5720l2916
17880A313137l3473l1011q7915j46896j00790o4814k6296J2504K1600k218L453
17869H57281L1779Q947M677j9490o528J0123k0272k9920J3612L1011k431K4482
17857I03271q89M357J3164n712J254j6377l0392j3828k8391q0191m5907j5525
17845F84834k0560J3246k1602m7402l5754P447o517j6694L925J4934L179P17N423
17832E85176J2112j759L4396J2112K3296K8933J1386M83k2202R42K2151L4367
17820G41393M241l025J1639k313k7509J2090K0579J5722l872j2952K1116L6462
17808H13571K3987J1663K5803L4251M3647K1696J2151K5397J7820L4647P2206
$$ plain form
17891 1038897 1015675 1002811 999177 996677 1071574 1164476 1276099 1383461 1381773 1346053 1313137
17880 1313137 1279664 1248653 1160738 1013842 913052 848238 821942 834446 856046 853828 857281
17869 857281 889060 898007 902684 883194 876666 886789 866517 836597 850209 881220 878789 903271
17857 903271 902382 906739 919903 914191 915445 899068 868676 854848 826457 746266 700359 684834
17845 684834 664274 677520 655918 608516 572762 580209 573692 556998 560923 575857 579036 579753 585176
17832 585176 597288 595529 629925 642037 665333 694266 705652 706135 683933 684875 707026 741393
17820 741393 745634 742609 754248 751935 724426 736516 757095 772817 768945 755993 777109 813571
17808 813571 837558 849221 875024 909275 952922 974618 986769 1012166 1029986 1064633 1136839
17797A136839Q1378O0667P2218J02174L5605M2008P3987R4981N4317N8121R0753
17786A903048Q9542Q5529J14799J20292J28396J32409J58106J85592K19965K35608
17776C373286K45345L21005L41189M14654N02386O76417R12599J276585J703484
17767I766950J939121J918980J944199J937909J779743J369991Q68987P99006
17759B2324886J413748K221443K932950L674837M427786N356098O653652Q075503
17751E7080903R624831J1685272J4060441J4875636J2404784P990966N386616
17744A33109449N303985M196715m15111p028339j1022373r340775n394888l315257
17736A06093406m315061p763141r415486p218430n582000n862639m980777l381708
$$ plain form
17797 1136839 1218217 1278884 1351102 1453276 1488881 1530889 1604876 1699857 1754174 1812295 1903048
17786 1903048 1992590 2078119 2192918 2313210 2441606 2574015 2732121 2917713 3137678 3373286
17776 3373286 3618631 3939636 4280825 4695479 5197865 5874282 6786881 8063466 9766950
17767 9766950 11706071 13625051 15569250 17507159 19286902 20656893 21525880 22324886
17759 22324886 23738634 25960077 28893027 32567864 36995650 42351748 49005400 57080903
17751 57080903 66705734 78391006 92451447 107327083 119731867 127722833 133109449
17744 133109449 138413434 142610149 142195038 135166699 124144326 114803551 109408663 106093406
17736 106093406 101778345 94015204 84599718 77381288 71799288 65936649 60955872 57574164
17728E7574164k855177l795713n164573n422130m267694l062658k517878j967824
17720B8520517j302770p79973m72401k19735L9960L80773Q35924J448724J998326
17711C0449345K143152K027088K196763K886537L918179M486105L888599L033858
17703E5029626L229364M762370P409666J0534248J2580433J2293189J0480367
17696A16319263R219993R126693J0042469R429729M007054k128977n677991p668018
17688A42670215p086575n455795p091478j1655540j5355734j5183706j1113092
17681F9728295p184753n251028m757052m481859l806511l449484l673869l229489
17673C3894250k345690j791178j391366j143607j087108j301444j462645j330005
$$ plain form
17728 57574164 54718987 50923274 45758701 40336571 36068877 33006219 30488341 28520517
17720 28520517 27217747 26437774 25965373 25745638 25785598 26166371 27002295 28451019 30449345
17711 30449345 32592497 34619585 36816348 39702885 43621064 48107169 51995768 55029626
17703 55029626 58258990 63021360 70431026 80965274 93545707 105838896 116319263
17696 116319263 125539256 134665949 144708418 154138147 158145201 156016224 150338233 142670215
17688 142670215 135583640 130127845 123036367 111380827 96025093 80841387 69728295
17681 69728295 62543542 57292514 52535462 48053603 44247092 40797608 37123739 33894250
17673 33894250 31548560 29757382 28366016 27222409 26135301 24833857 23371212 22041207
17665B2041207j109606q95415p43391o56610o09595n55755m48773l32034j75511
17656A6514517o760K86192Q04738J527658K121466J838080J072072Q36284J201826
17647B6196073J907539K221678J102863k1657n59319m92857J1507M60761l31644
17638C0494944k759863l458182k574545j713626j138605q23634j211276k203765
17630A4611448k174308j443337r36357o31478n07787m26958l88244l29913k90593
17621G482473k86247k65527k71112k26512j67459k15373k09028j53891j61572
17612E525752j50031j58862j57038j18295j01315j43575j45765j71713j65063
17603D214095j61649j50482j30420q1044j11488j20357q1954r2820p1921m7881
$$ plain form
17665 22041207 20931601 20036186 19292795 18636185 18026590 17470835 17022062 16690028 16514517
17656 16514517 16507757 16793949 17598687 19126345 21247811 23085891 24157963 24994247 26196073
17647 26196073 28103612 30325290 31428153 31406496 30847177 30354320 30365827 30826588 30494944
17638 30494944 27735081 24276899 21702354 19988728 18850123 18026489 16815213 14611448
17630 14611448 12437140 10993803 10057446 9425968 8918181 8491223 8102979 7773066 7482473
17621 7482473 7196226 6930699 6659587 6433075 6265616 6050243 5841215 5687324 5525752
17612 5525752 5375721 5216859 5059821 4941526 4840211 4696636 4550871 4379158 4214095
17603 4214095 4052446 3901964 3771544 3690500 3579012 3458655 3376701 3283881 3211960 3164079
17593C164079n5356k6349j8947o9007r3207q5301q7950j12746j63000j58173j31888
17582B162155j01917j00927r7604j00137n4275m3209m2710n4312n6623m5193q3762
17571A381486m4944k6669j3980K788l0773n5832m8265m348k233n3092m0151m724
17559A059263o369l5561k8873j4009k3456k983l2380j2268M133j3719k4823j7278
17547H51677k6604j0450m990j8973j6660l246q296l5536l3794l4457m4898m4732
17535E69041k5809K041k9478m1212k8995k6134k1659j5118j46L324J3908p23j4541
17522C84499j8387N820K2438k874P335j5318j6365P597L3191J583N236K5639r754
17509D30640o907n748J5756J3600J8591j1543k9787j9767J0630J3614k8290J7981
$$ plain form
17593 3164079 3108723 3082374 3063427 2994420 2901213 2815912 2727962 2615216 2452216 2294043 2162155
17582 2162155 2060238 1959311 1861707 1761570 1707295 1664086 1621376 1567064 1510441 1465248 1381486
17571 1381486 1336542 1309873 1295893 1298681 1267908 1212076 1163811 1159463 1157230 1104138 1063987 1059263
17559 1059263 1052894 1017333 988460 974451 950995 948012 915632 903364 907497 893778 868955 851677
17547 851677 825073 814623 809633 790660 774000 770754 762458 726922 693128 658671 613773 569041
17535 569041 543232 545273 515795 474583 445588 419454 397795 382677 382531 385855 399763 399040 384499
17522 384499 366112 371932 394370 391496 398831 383513 367148 374745 407936 409519 414755 440394 430640
17509 430640 423733 417985 433741 447341 465932 454389 424602 404835 415465 429079 400789 418770
17497D18770J905m802l743j2168l7449n5963j4973P080J4904r004p030J119k53
17484B98393j7434J1083J2410j8449j0763K7186J6414K2878J8311M2307N4667
17473D57003J8490M2952k8420M702M0717j1440P065j4059k7594k9692m2288k1847
17461C95589r521l861j1489k9611k6305l7391m801p165o963J1417l587k4899N943
17448B47356K7186K879J8930M808m786M5330J612J6325J4362k7412k4242j7590
17436C04758k815K6671K3131L716m885L6638O085L8237M8565L4796N3128K5764
17424E93789L1428k427J3925J40j7139l7053r4705o9093l2836l1750p344l4535
17412C12400l0614N103j9628l6919k2081k8826q488o670O498O239K669l983p667
$$ plain form
17497 418770 420675 415873 412130 399962 362513 306550 291577 298657 313561 304557 297527 298646 298393
17484 298393 280959 292042 304452 286003 275240 302426 318840 341718 360029 402336 457003
17473 457003 475493 518445 490025 494727 535444 524004 531069 517010 489416 459724 417436 395589
17461 395589 386068 382207 370718 341107 314802 277411 272610 265445 258482 269899 266312 241413 247356
17448 247356 274542 277421 296351 301159 296373 341703 343315 359640 374002 346590 322348 304758
17436 304758 301943 328614 351745 355461 350576 387214 393299 431536 480101 514897 568025 593789
17424 593789 625217 622790 636715 636855 619716 582663 487958 418865 386029 354279 346935 312400
17412 312400 281786 286889 267261 230342 208261 179435 170947 164277 170775 177014 179683 175700 168033
17399A68033l1687k6228j5495J1361K6986R115K5378N198J1816j4647r68J9966
17387A88828M387K0055K0460k0898K529L3087j968r615M3217L0143j2154Q343
17375C06414O1741K5875m2886l0010j4276n482J1l4521l8840K322j6546m0817
17363A72985m0541j0455j0684M385j9434j447K8863J9633j8167l8555J8502J7198
17351A22283j5729k3647j358L77K0160L054m0038K5152K8888K3633r031j9899
17339A13845m2279O752K1957K8743K5734p086K2113L3396J3824J2725Q970K7628
17327B66322K8049M229K802L5998M5235O6265J05289R4668Q8979O5885K4131O1582
17315H89434L4276K528J2054l567O463L4262L3799K2339q5887j36939j02640p9761
$$ plain form
17399 168033 136346 110118 94623 105984 132970 142085 167463 172661 184477 169830 168862 188828
17387 188828 193215 213270 233730 212832 215361 248448 246480 236865 280082 310225 298071 306414
17375 306414 368155 394030 351144 321134 306858 301376 301387 266866 228026 230348 213802 172985
17363 172985 132444 121989 111305 115690 96256 94809 123672 143305 125138 86583 105085 122283
17351 122283 106554 82907 81549 81926 102086 105140 65102 90254 119142 142775 133744 113845
17339 113845 71566 78318 100275 129018 154752 147666 169779 203175 216999 229724 238694 266322
17327 266322 294371 298600 301402 337400 382635 448900 554189 648857 737836 803721 827852 889434
17315 889434 923710 926238 938292 934725 941188 975450 1009249 1031588 945701 808762 706122 626361
17303F26361l3456m9343o8002o1708k5604m0836N235J0389J2147L784n6022m4780
17291B78165j6128l8481l5075k2179k62K8622p853Q1q752o668L9415L3465L202
17278B47552K3186L5753L7273M9643N8337N8844Q879L415J5114K7673Q0981J08931
17266G55581O7425O0938M1641J7203K4452P0490O4148Q821m8575o9667m6692J1328
17254I57093N91o7462r4388l5358m4812n7292m5156k0259k2222R678k758j0540
17242E67115j8682k1749K6300J6375K343K241r577N288k860J5508l1772l6576
17230E13954J7605p754k2798P014j2202k8135n8602j1534j9088j8344N649j8953
17218C46812k4955J9481j3284l8999j673j0461k6107l2003l1832j750R342Q405
$$ plain form
17303 626361 592905 543562 475560 413852 388248 347412 352647 363036 375183 378967 322945 278165
17291 278165 262037 223556 188481 166302 166040 194662 186809 186890 178138 171470 210885 244350 247552
17278 247552 270738 306491 343764 393407 451744 510588 519467 522882 537996 565669 646650 755581
17266 755581 823006 883944 925585 942788 967240 1037730 1101878 1110699 1062124 992457 945765 957093
17254 957093 957684 890222 795834 760476 715664 658372 613216 592957 570735 580413 577655 567115
17242 567115 548433 526684 552984 569359 571702 573943 564366 569654 566794 582302 550530 513954
17230 513954 531559 523805 501007 508021 495819 467684 409082 397548 378460 360116 365765 346812
17218 346812 321857 341338 328054 289055 287382 276921 250814 218811 186979 185229 194571 202976
17206B02976K3550L7584N0732L8831L0200K5426L5974K7220j8080l640J3753M0614
17194E05140J1151n1665k5932k6965r542o487k881K1101L9134J4858K2375K3806
17182E14093M0354L1738K7644L9055r013m2408J4421J3499j1337n6305n3131n6650
17170D51960n8875n2788k5931k6648j6454m9051j5451l7561j4546L554J5263m987
17158A68485M37o659j5446n40k0571N252L4444Q766N14k5938k7265R394P378k8291
17144A09960J447j5765N413J5665K2171Q637p538k9034O041M3064M3964J2209
17132B16234j3724J1767j3178j7986M306R145o079k4069j6140j5140j9170k4585
17120I1381k4571k494J3448P538j9583j8888K4738J1810n589k1921J289j2868
$$ plain form
17206 202976 226526 264110 314842 353673 383873 409299 445273 472493 454413 450773 464526 505140
17194 505140 516291 464626 438694 411729 402187 395700 392819 413920 453054 467912 490287 514093
17182 514093 554447 586185 613829 652884 643871 601463 615884 629383 618046 561741 508610 451960
17170 451960 393085 340297 314366 287718 271264 222213 206762 169201 154655 158209 173472 168485
17158 168485 168922 162263 146817 146277 125706 130958 165402 174168 174682 148744 121479 130873 138251 109960
17144 109960 111407 95642 101055 116720 138891 147528 139990 110956 116997 160061 204025 216234
17132 216234 202510 214277 201099 183113 187419 196564 190485 166416 150276 135136 115966 91381
17120 91381 66810 64316 77764 85302 65719 46831 71569 83379 77790 55869 57158 44290
17108D4290l589j15k259l5527j8493J1768J6693k3350J0070n478r674K3766K0068
17095B8170l171J261J6220J1880q2l873l3157j8617Q916J7135J9423j6363k1991
17082E751Q182N718J1707q516j7589p877k565k5213j1478j891J7999j3010j1309
17069e0091J4628K7903K4401R03J1300L112k4461K677n152K3180l463k3884o118
17056e065M1403r722k2297k820J2487J2807N645o209j0364J9833R522l6496k2437
17043a3713J4049O31j6640N319M42l186k48r291p332R823J315J033M161j15Q658
17028e094o13O62Q603J8505J2535p492j4189o662K3817m102j2464j6856k3391
17015b6741J6722R821k0851o824j1337k4010K6950J0552m588r124J7314N814k754
$$ plain form
17108 44290 40701 40586 38327 2800 -15693 -3925 12768 -10582 -512 -5990 -15664 8102 28170
17095 28170 24999 26260 42480 54360 54278 50405 17248 -1369 7547 24682 44105 27742 5751
17082 5751 13933 19651 31358 22842 5253 -2624 -5189 -30402 -41880 -43771 -25772 -38782 -50091
17069 -50091 -35463 -7560 16841 17744 29044 32156 7695 10372 5220 28400 24937 1053 -5065
17056 -5065 36338 26616 4319 1499 13986 26793 32438 26229 15865 35698 45220 8724 -13713
17043 -13713 336 967 -15673 -10354 -9912 -13098 -13346 -22637 -29969 -20146 -18831 -17798 -13637 -13752 -5094
17028 -5094 -5707 -5045 3558 22063 34598 27106 12917 6255 30072 25970 13506 -3350 -26741
17015 -26741 -10019 -198 -21049 -27873 -39210 -63220 -36270 -25718 -30306 -39430 -22116 -16302 -19056
17002a9056n414Q17k7458q296J9935J6908L157K8Q711p134k7650k404J2892J2050
16988b2914O844K9473J3905j375R405p985r57l0850j6965R32r096J0806L2239
16975A3462Q294j5957j6138J4115J6367J1440m564r009j2088j4972r682o079K6686
16962A875J3601k2264m353j504j5444L203L2783K2514L0952p931l8740k4387o123
16949a5818P372j2280j9042p66R436j0804j1543K323L2119J749q921O845n622
16936b4952n387L902L9225J9757n1570j9854J7276J2419j8208m107j6710J0979
16924c7230P721l820l357J7236M991j4377K209Q931j3898k4777k191K6985M061
16911b7516n187Q077j3056L0684J1757k446k835r177M904j3966o252k988J3941
$$ plain form
17002 -19056 -24470 -23653 -51111 -59407 -39472 -22564 -19407 -19379 -10668 -17802 -45452 -47856 -34964 -22914
16988 -22914 -16070 13403 27308 25933 35338 27353 26396 -4454 -21419 -20487 -29583 -18777 13462
16975 13462 21756 5799 -10339 3776 20143 31583 27019 18010 5922 -9050 -18732 -24811 1875
16962 1875 15476 -6788 -11141 -12645 -28089 -24886 7897 30411 61363 53432 14692 -9695 -15818
16949 -15818 -8446 -20726 -39768 -40534 -31098 -41902 -53445 -51122 -19003 -17254 -26175 -19330 -24952
16936 -24952 -30339 -26437 12788 32545 -19025 -38879 -21603 -9184 -27392 -31499 -48209 -37230
16924 -37230 -29509 -33329 -36686 -19450 -14459 -28836 -26627 -17696 -31594 -56371 -58562 -31577 -27516
16911 -27516 -32703 -24626 -37682 -6998 4759 2313 -522 -9699 -4795 -18761 -25013 -28001 -14060
16898a4060K1251l3201j0717m956j6180J8040J1002L020P370J436n242K2729J3282
16885A3774K31j9246j522p196j4928K8450P315l096N435l804q542j7862j970Q316
16871a4645j5519o095l253J3673J9970j120l7495K5392k312k7214L8758K3920
16859A4060J5820Q92n396j2878J3800K0544Q311k3665m8035j4016K1538o286k4423
16846c9734K8223O4442j3197k4112K0234l131J4910O90m133o070l3067l4750n613
16833c5308r549J1142J3379K080k3570j0400K1209L642K2211L9029j6344l2961
16821a5440j3128L165k418L7609M407K896k6359P896j9467j0739m994O727J0913
16808a8932j1598K803L724j180r804j5232k4194N540L8121M0980K1178l4625J168
$$ plain form
16898 -14060 7191 -26010 -36727 -41683 -57863 -39823 -28821 -25801 -18431 -16995 -22237 492 13774
16885 13774 14005 -5241 -6763 -13959 -28887 -437 6878 3782 9217 5413 -3129 -20991 -22961 -14645
16871 -14645 -30164 -36259 -39512 -25839 -5869 -6989 -44484 -19092 -21404 -48618 -9860 14060
16859 14060 29880 30772 25376 12498 26298 46842 55153 31488 -16547 -30563 -9025 -15311 -39734
16846 -39734 -11511 52931 39734 15622 35856 32725 47635 48325 44192 38122 5055 -29695 -35308
16833 -35308 -44857 -33715 -20336 -18256 -41826 -52226 -31017 -27375 -5164 33865 17521 -15440
16821 -15440 -28568 -25403 -27821 9788 14195 17091 -9268 -1372 -20839 -31578 -36572 -29845 -18932
16808 -18932 -30530 -27727 -24003 -25183 -34987 -50219 -74413 -68873 -30752 10228 31406 -3219 -2051
16795b051j3169P385L326J059K3922P844J0259j7960m3654O437K7238j4991L1240
16782B6885j0368j0135K8926j5079O355O711L337k9005j2596L882j1929l218r392
16769b5626R860k6062k1402j03L0260K445R07K3945J1851q966J7628j4899o779
16756f941j5678K66J369J4131K0508l6043j950j2268k4050j3971J9971J5881l714
16743d2489j2654K5709K1183P989l8421r057K2614l481j5312J5393K51K0172J4671
16730F568o505r377O170j8025j6806L024K0554j1234n2579k3437M777L8404K9325
16717b9141K9712k14j4375r328j8215k029J8341K3272j4319j6644J9382R078N935
16704A455j358j8744o695J2517P468l172j4446n240p188J5125N508j4715R041
$$ plain form
16795 -2051 -15220 -7835 -4509 -3450 20472 28316 38575 20615 -23039 -16602 10636 -4355 26885
16782 26885 16517 6382 35308 20229 26584 33295 36632 7627 -4969 -1087 -13016 -16234 -25626
16769 -25626 -15766 -41828 -63230 -63333 -33073 -30628 -29721 -5776 6075 -2891 14737 -162 -6941
16756 -6941 -22619 -22353 -20984 -6853 13655 -22388 -24338 -36606 -60656 -74627 -54656 -38775 -42489
16743 -42489 -55143 -29434 -8251 -262 -38683 -47740 -25126 -28607 -43919 -28526 -28275 -8103 6568
16730 6568 63 -9314 -3144 -21169 -37975 -34951 -14397 -25631 -78210 -101647 -96870 -58466 -29141
16717 -29141 571 357 -14018 -23346 -41561 -43590 -25249 -1977 -16296 -32940 -13558 -4480 1455
16704 1455 97 -18647 -25342 -12825 -5357 -8529 -22975 -28215 -35403 -20278 -14770 -29485 -20444
16691b0444P041m501k7189k6137L3641K3788j3938j5453l908K809J6153p782M214
16678c1706J2493P569m048o81K8488J5300k5837n343j5572L042K0998o619P93
16665a123q680k0355O137P317J016l3601j2200J9390O548O525j0294J7386j4303
16652c6237l3278J5519J7268J6162K0048L900k5326j5931Q722R504K5707K7569
16640C3627j8355k8643J1677j1218M786m320n673k1263k485L0512l3704M014L2808
16627h237J9646j8574k6613J314R228P446O741J4183k997l0209j9388j0534l378
16614f1372K9966J9342j6981j7634J218K4445O616j8100J4042J6273K7478J2306
16602C7599J7920L1983N784k9644q078j0226K270j4995j9391k0033j982L483j3280
$$ plain form
16691 -20444 -13403 -17904 -45093 -71230 -37589 -13801 -27739 -43192 -47100 -44291 -28138 -35920 -31706
16678 -31706 -19213 -11644 -15692 -16373 12115 27415 1578 -3765 -19337 -16295 4703 -1916 -1123
16665 -1123 -9803 -30158 -24021 -16704 -15688 -49289 -61489 -42099 -35551 -29026 -39320 -21934 -36237
16652 -36237 -69515 -53996 -36728 -20566 -518 3382 -21944 -37875 -29153 -19649 6058 33627
16640 33627 15272 -13371 -1694 -12912 -8126 -12446 -18119 -39382 -41867 -11355 -45059 -41045 -8237
16627 -8237 11409 -7165 -33778 -32464 -23236 -15790 -9049 5134 2137 -28072 -47460 -57994 -61372
16614 -61372 -31406 -12064 -29045 -46679 -45461 -21016 -14400 -32500 -18458 -2185 25293 37599
16602 37599 55519 87502 93286 63642 55564 45338 47608 32613 13222 -6811 -8793 -5310 -18590
16589a8590p2j0060L924j3608J4873N2820J0734k6109k3505L6078o721k0214j2442
16576a2892k4692J8197K7509J677k8291M895K7346K3586r248K514j0534n8536
16564c8469J959Q03Q344O401O140M5773j4675l2775k6936j6893K4603J1082M596
16551b0047J2179j2474J1002k7931j7538K8687j246M963J2481J3981m024l0258
16539c0225N105J1190K427R97J5363j1230n073J6118J3895N232l5727K6686J2196
16526B6954j1091l8311j4821L1647J6211J5936N681k3315j0600N4727j9165k0560
16514A3293L2405k0139n811J5990k750k2903J410m377M202R829k6554j3363R619
16501i149L1549q122O037J9162N281l172o997K194l6928j9259M504J0747m839
$$ plain form
16589 -18590 -18662 -28722 -24798 -38406 -23533 29287 40021 13912 -9593 26485 19764 -450 -12892
16576 -12892 -37584 -19387 8122 9799 -18492 -13597 13749 37335 28087 30601 20067 -38469
16564 -38469 -36510 -35707 -27363 -20962 -14822 30951 16276 -16499 -43435 -60328 -35725 -24643 -20047
16551 -20047 -7868 -20342 -9340 -37271 -54809 -26122 -27368 -22405 -9924 4057 33 -30225
16539 -30225 -25120 -13930 -11503 -10506 4857 -6373 -11446 4672 18567 23799 -11928 14758 26954
16526 26954 15863 -22448 -37269 -5622 10589 26525 32206 8891 -1709 53018 33853 13293
16514 13293 45698 25559 19748 35738 32988 10085 11495 7118 11320 21149 -5405 -18768 -9149
16501 -9149 22400 14278 20315 39477 44758 41586 34589 36783 -145 -19404 -14900 -4153 -8992
16488h992O164k3947j64J9761K1683l436l0677k6671j2462K0004L6923J5990j075
16475A3101k621O87J3947J802J3265j3280r490O155l3887j4765N721R319m85Q741
16461a790j7058J3174K5498J678p056n7491j607L0758J3477l52P271K50K933j5092
16447e407o355j0889k5305K009K3045J9963J0340r977R702K4553j1852j8802j1076
16434a0051j5367j60j8643P711K2237J1645k3680k9980J5500J6931J1519J408
16422a0930l453q237p146M268M543J741k8631J2092M063K142K288L137o376R133
16408b1366j4155M348j6877o290K0183K6496M813J2399M309l6803k1110o594J254
16395d9393L518N582K7885M0998J0968j4636l7877j7595j4229J1024Q036k922
$$ plain form
16488 -8992 -2828 -26775 -26939 -7178 14505 11069 -19608 -46279 -58741 -38737 -1814 14176 13101
16475 13101 10480 11167 25114 26916 40181 26901 17411 23566 -10321 -25086 -19365 -10046 -10531 -1790
16461 -1790 -18848 -5674 19824 21502 14446 -43045 -44652 -13894 -417 -769 6502 6752 9685 -5407
16447 -5407 -11762 -22651 -47956 -45947 -22902 -2939 7401 -2576 7126 31679 19827 1025 -10051
16434 -10051 -25418 -25578 -44221 -36510 -14273 -2628 -26308 -56288 -40788 -23857 -12338 -10930
16422 -10930 -14383 -22620 -29766 -25498 -20955 -19214 -47845 -35753 -31690 -29548 -27260 -24123 -30499 -21366
16408 -21366 -35521 -31173 -48050 -54340 -34157 -7661 -2848 9551 13860 -22943 -44053 -50647 -49393
16395 -49393 -45875 -40293 -12408 28590 39558 24922 -12955 -30550 -44779 -33755 -25719 -28641
16383b8641k1616l17M3194J5906O401p724J3173K519k9592j3306K458O274k6082
16370c7353j2526m445L994J8402J3215k2230q588J1593k1012J0489j54j127M730
16357d5012N424k206R216K8448K157K2746R314j2369k4391j7091q930k847r254
16344d4795R361l39j9446J7734J8717K5047M932r552m608K4977J357j9833Q660
16331A2212k3071l0830j2997j2161O227k7189J4330K8266Q464o927Q902L4209
16319e65o989n891l198M000j1389K3163M632R16L8627m083q393j0463k3807m468
16305g908n906j6781K703j7124K684K0869J4211l515r045j1409j759J0132Q116
16292a4732K7176L33N988k0644j6695J6350k084j7014K725k6602Q972J684j5887
$$ plain form
16383 -28641 -50257 -50574 -7380 8526 14927 7203 20376 22895 -6697 -20003 -17545 -11271 -37353
16370 -37353 -49879 -54324 -50330 -31928 -18713 -40943 -49531 -37938 -58950 -48461 -48615 -49742 -45012
16357 -45012 -39588 -41794 -32578 -4130 -1973 20773 30087 17718 -6673 -23764 -32694 -35541 -44795
16344 -44795 -35434 -35773 -55219 -37485 -18768 6279 11211 1659 -2949 22028 23385 3552 12212
16331 12212 -10859 -41689 -54686 -66847 -60620 -87809 -73479 -45213 -36749 -43676 -34774 -565
16319 -565 -7554 -13445 -16643 -12643 -24032 -869 3763 4679 43306 39223 30830 20367 -3440 -7908
16305 -7908 -13814 -30595 -27892 -45016 -42332 -21463 -7252 -10767 -19812 -31221 -32980 -22848 -14732
16292 -14732 12444 12777 18765 -1879 -18574 -2224 -4308 -21322 -18597 -45199 -36227 -34543 -50430
16279e0430j690J798k490J537J9104M1030J6867j2267k4758j4119j578K7809K8525
16266B9338j859L934J571K667r612j0769N123j277j0947k375J666J1454j3364
16253E550k3288j2084j0385j3435j0721K3201R345P168l1102k5640K8779J9845
16241c2767J8225P496k512L060J029j133n834L742r015n067J4083k2290k6276
16228e7259J0533K1936j2527R247L7090K4484J1174k168O838J2902j3239p732
16216D1279m523k6226J345j0396q379j0315l4783J0080J7526K225K0414N915k0813
16203a6651n708J8495K2987N08j6385P139M7712J5656l2196m6880j4870J9329
16191h64N267j6559Q779m194K468q148J7420M0224o427j3273L199R367r877L032
$$ plain form
16279 -50430 -52120 -50322 -52812 -51275 -32171 8859 25726 13459 -11299 -25418 -26996 813 29338
16266 29338 27479 31413 32984 35651 26039 15270 20393 19116 8169 5794 7460 18914 5550
16253 5550 -17738 -29822 -40207 -53642 -64363 -41162 -31817 -24649 -55751 -81391 -52612 -32767
16241 -32767 -14542 -7046 -9558 -6498 -5469 -6602 -12436 -8694 -17709 -22776 -8693 -30983 -57259
16228 -57259 -46726 -24790 -37317 -28070 9020 33504 44678 42510 49348 62250 49011 41279
16216 41279 36756 10530 11875 1479 -6900 -17215 -51998 -41918 -24392 -22167 -1753 4162 -16651
16203 -16651 -22359 -3864 19123 19631 3246 10385 58097 73753 41557 -5323 -20193 -864
16191 -864 4403 -12156 -3377 -7571 -5103 -13251 4169 44393 37966 24693 27892 37259 27382 30414
16177C0414j2946l4607j3112N228J6200K5982L0481j9837k1861R651Q784K2281
16165D6658k3496k7328P525Q1Q896L363j891N708k6387K5510J5686k7429N820
16152A2716L381p438k4798k0870J881k9733L3377K9577P575Q411j3261l0414j9898
16139d9494j9521J5462Q280O874Q025p713K0937N552k0462M511N4025L4344j3926
16126D6894m7659r20q981J9745k3567m1204j5240K130K4747p031K5560L1999P13
16113G186k6580N095k7690J1121L2605K2064l1910J0422J3723k7961l0916K6714
16101a6127r931m478J9528M752k425J9686J2079R79k2365k3816k255M123K3614
16088C364P645K1667p439p533j3953r844j0716K570O43p069K0441n483q570J1619
$$ plain form
16177 30414 17468 -17139 -30251 -25023 -8823 17159 47640 27803 5942 15593 24377 46658
16165 46658 23162 -4166 3359 3440 12336 15699 13808 19516 -6871 18639 34325 6896 12716
16152 12716 16097 8659 -16139 -37009 -35128 -64861 -31484 -1907 5668 14079 818 -29596 -49494
16139 -49494 -69015 -53553 -45273 -38399 -30374 -38087 -17150 -11598 -32060 -27549 26476 60820 46894
16126 46894 -765 -1685 -10666 9079 -14488 -55692 -70932 -68802 -44055 -51086 -25526 6473 7186
16113 7186 -19394 -14299 -41989 -30868 1737 23801 -8109 2313 16036 -11925 -42841 -16127
16101 -16127 -26058 -30536 -11008 -6256 -8681 11005 23084 24063 1698 -22118 -24373 -20250 3364
16088 3364 11009 32676 25237 17704 3751 -6093 -16809 -14239 -13596 -20665 -224 -5707 -14277 -2658
16074b658R085m177m329l89J9545R274n925K223Q816m439K3846j7003M142k1568
16060A6443k3475r979J0307K862k649j4128k658L269R376j2888l996K6099Q279
16047F862l3801k0214j0998M3822J6764N568j5591j0926J0378O054N719L2737
16035C6374j9610N530J8675O395J7234j7045l1777j7574J1984R987n578j3291
16023A304J0120j3595k6717l2551M565K4609m573J5382L9180m551j4987J7864
16011A6050j940j239o037p801k4006L835j6944R507m099j5201j227M384q483N507
15997d7694N183M1048K9588n482j8236k0858O999L1673j7325j688j6468K093N732
15984e435J1502j8388R033J181Q199O692k5655k6073O087k478j1574K4021J5251
$$ plain form
16074 -2658 6427 2250 -2079 -2468 17077 26351 20426 22649 31465 27026 50872 33869 38011 16443
16060 16443 -7032 -17011 -6704 -3842 -6491 -20619 -23277 -20008 -10632 -23520 -27516 -1417 6862
16047 6862 -26939 -47153 -58151 -14329 2435 8003 -7588 -18514 -8136 -2082 3637 36374
16035 36374 16764 22294 40969 47364 64598 47553 15776 -1798 10186 20173 14595 1304
16023 1304 11424 -2171 -28888 -61439 -56874 -32265 -36838 -21456 17724 13173 -1814 16050
16011 16050 14110 12871 6834 -967 -24973 -21138 -38082 -28575 -32674 -47875 -49102 -44718 -53201 -47694
15997 -47694 -42511 -1463 28125 22643 4407 -16451 -9452 22221 4896 3208 -13260 -11167 -5435
15984 -5435 6067 -12321 -3288 -2107 6092 12784 -12871 -38944 -32857 -35335 -46909 -22888 -7637
15971g637K7761K0777J1614r426j1706N031j3238Q958r844j1274l1539l254J7528
15958f249K3048k2255l5575J158K4973L1105n767r12j8717k4716K2946K589m536
15945a2908J5104P900P98k1743k3394q765P772k517M338K3944J1300J0671n627
15932F873l8548m3591q137J4632J637K9359J1043k5304L039M0268K8040l0076
15920a0765l960Q260m487Q343j0538P307j5633J3981j2410j1005K024r681J4191
15907b4373J2868k3389J2529O584O654J6954j2572j6095J7826j5892k5686K9082
15895a5510J1765j4390k966K406j892k0137O473k263k047J5797J8287M129K181
15882A833L201M3482J3839k7281j9879k1366J7365J3991r812p537M625j9211k9145
$$ plain form
15971 -7637 20124 40901 52515 43089 31383 36414 23176 32134 22290 11016 -20523 -23777 -6249
15958 -6249 16799 -5456 -41031 -39873 -14900 16205 10438 9526 -9191 -33907 -10961 -8372 -12908
15945 -12908 2196 10096 10894 -10849 -34243 -43008 -35236 -37753 -33415 -9471 1829 12500 6873
15932 6873 -31675 -75266 -83403 -68771 -67134 -37775 -26732 -52036 -48997 -8729 19311 -10765
15920 -10765 -14725 -6465 -10952 -2609 -13147 -5840 -21473 -7492 -19902 -30907 -28883 -38564 -24373
15907 -24373 -11505 -34894 -22365 -15781 -9127 7827 -4745 -20840 -3014 -18906 -44592 -15510
15895 -15510 -3745 -18135 -21101 -18695 -20587 -40724 -34251 -36514 -38561 -22764 -4477 -348 1833
15882 1833 5034 48516 62355 35074 15195 -6171 11194 25185 15373 7836 12461 -6750 -35895
15869c5895o688M1652L2696p305l0469j7530o933N598J9872O663j2571K292M254
15856d364r26J9252M051k3098K9833J3291k719j4649j8327j5298r963j1469K0110
15843a4276J9388J555r849k5026L2928J1244J5766l2739m3638j0576j4551j5257
15831h5031M3517k45J3381J5912J7798P252j0260Q272j1052J5883K9637p485n514
15818C2065m792m253j5804q762P058k461j6086n09O291M664n642N438K5874p982
15804A5099k3966j1236J9063j2413J384J7579L475j2230j0836m639J7956J7555
15792A6791j4988K4607j6256m2010k2199K2988K9883o124l431j7522J7700J2035
15780A474m0211j0719N461M9130j5740k8360R19K8543K368j0208J757l6370M731
$$ plain form
15869 -35895 -42583 -931 31765 24460 -6009 -23539 -30472 -24874 -5002 1661 -10910 -8618 -4364
15856 -4364 -5290 13962 18013 -5085 24748 38039 35320 20671 2344 -12954 -22917 -34386 -14276
15843 -14276 5112 6667 -3182 -28208 4720 15964 31730 -1009 -44647 -55223 -69774 -85031
15831 -85031 -41514 -41759 -28378 -12466 5332 12584 2324 10596 -456 15427 45064 37579 32065
15818 32065 27273 23020 7216 -1546 5512 3051 -13035 -13544 -7253 -2589 -8231 -2793 23081 15099
15804 15099 -8867 -20103 -1040 -13453 -12069 5510 8985 -3245 -14081 -18720 -764 16791
15792 16791 1803 26410 10154 -31856 -54055 -31067 -1184 -7308 -10739 -28261 -10561 1474
15780 1474 -38737 -49456 -43995 5135 -10605 -38965 -38046 -9503 -7135 -17343 -15586 -51956 -47225
15767d7225K7235P048m456K2241J1113j3845q126m1157R784M3983L2750q740k6488
15754D117R458J589k7726j2427N101K9772K4069j2274k2052m7673k7454N815K6703
15741d2982L4380J6961M681l811o899L5715J3425n097q005r450l2146k6262m404
15728c3894J8327J3758p390K839l1300n17j971K5j3381k723J1205j370j6640k856
15714f5888K0737K5993p058K7836R753k1825o955K322J2043l1592k4200J1774
15702d7060j2946J1490M5873K3883n501k0748J3952L066n587M38k4577J0402K0180
15689A2865P146j1115j1319J0060j6422k9794p716J664R328O67J8535k5158J957
15676c9302n596J8541K3376j5306P877j0619k739P737M4304q410k3295r106O904
$$ plain form
15767 -47225 -19990 -12942 -17398 4843 15956 2111 -6015 -47172 -37388 6595 39345 30605 4117
15754 4117 13575 15164 -12562 -24989 -19888 9884 33953 21679 -373 -48046 -75500 -69685 -42982
15741 -42982 -8602 8359 13040 9229 2330 38045 51470 46373 38368 28918 -3228 -29490 -33894
15728 -33894 -15567 -1809 -9199 -6360 -37660 -38177 -40148 -40123 -53504 -56227 -45022 -46392 -63032 -65888
15714 -65888 -45151 -19158 -26216 1620 11373 -10452 -17407 -15085 -3042 -34634 -58834 -47060
15702 -47060 -60006 -48516 -2643 21240 15739 -5009 8943 12009 6422 6860 -17717 -7315 12865
15689 12865 20011 8896 -2423 7637 -8785 -38579 -46295 -44631 -35303 -34636 -16101 -41259 -39302
15676 -39302 -44898 -26357 -2981 -18287 -10410 -21029 -23768 -16031 28273 19863 -3432 -12538 -5634
15663e634N455K536M082O312J4085q181j2271k2191J3615P962j7626k4321J6566
15650a9611J0945J3477n441L007j0475j30O612M5120L0619r484j9329j7338q743
15637A9229k7635J195j4122J4227P466J8771j9539k7932J2509R681J8148k60q791
15624B947j185L143N978j2887k5626k434J3282O966P350K7551K682k1306Q875
15611A5336n987j6240J5865L685J3167J8661k360L553j9706l7964o15O858p501
15598a3248J7606J1416J1995J8764l5363l6740o401K4385K53j2071O23L3518J4730
15585B9467r887j2000l074j195j603Q621m450M945J4021R621k3268p58R882P124
15571B7446J574q225J019p167m207o99L4100J0764r974l5731J2880q318J7550
$$ plain form
15663 -5634 -179 2357 6439 12751 26836 18655 6384 -15807 -2192 5770 -11856 -36177 -19611
15650 -19611 -8666 4811 -630 2377 -8098 -8228 -1616 43504 74123 64639 45310 27972 19229
15637 19229 -8406 -7211 -21333 -7106 360 19131 -408 -28340 -15831 -6150 11998 11738 2947
15624 2947 1762 4905 10883 -2004 -27630 -30064 -16782 -9816 -2466 25085 27767 6461 15336
15611 15336 9349 -6891 8974 12659 25826 44487 42127 45680 25974 -11990 -12605 -5747 -13248
15598 -13248 4358 15774 27769 46533 11170 -25570 -31971 -7586 -7333 -19404 -18781 14737 29467
15585 29467 19580 7580 4506 3311 1708 10329 5879 10824 24845 34466 11198 10440 20322 27446
15571 27446 29020 20795 21814 14647 10440 9741 43841 54605 44631 8900 21780 13462 31012
15558C1012l746N490P554n461k6817M805j90k8866q566K2897L1507J9435J078
15545E0132o625n4065l295M452K6845J153p180l7208j5464L0172O8217J2179j4054
15532E5259p858m420k7597r463M098K3993M642j6234L783J089P63j1812m009j6845
15518d611m2452j4855J8200Q874J8411M2004k4613p810o947L780q680j9788K6777
15505a1710L0616M017J8525K5258n4064m3776O09j639M001K9410K0125k9112q737
15492a6477J1283O549J781j0951O028l694j3216j3601L3189R297L036j694n763
15479E767J2135j1878k2963r195l945J0380Q611K6104K2452Q989l055j2076K2338
15466E3664k3984k6774J383j167M732N0m64M311k1590K1536J3733n108q985j9011
$$ plain form
15558 31012 27266 32756 40310 34849 8032 12837 12647 -16219 -24785 -1888 29619 49054 50132
15545 50132 43507 -10558 -13853 -9401 17444 18597 11417 -25791 -41255 -11083 57134 69313 55259
15532 55259 47401 42981 15384 5921 10019 34012 38654 22420 26203 27292 28055 16243 12234 -4611
15518 -4611 -47063 -61918 -43718 -34844 -16433 25571 958 -6852 -13799 -10019 -18699 -38487 -11710
15505 -11710 18906 22923 41448 66706 12642 -31134 -30525 -32164 -28163 1247 21372 -7740 -16477
15492 -16477 -5194 1355 3136 -7815 -1787 -5481 -18697 -32298 891 10188 13224 11530 5767
15479 5767 17902 6024 -16939 -26134 -30079 -19699 -11088 15016 37468 46457 43402 31326 53664
15466 53664 29680 2906 4289 3122 7854 7904 7440 11751 -9839 11697 25430 20322 11337 -7674
15452g674o276k646k2392L1299J6126N528k8172K373J4933M3271J0935k5495j2741
15439A9069J2426l45m02M362m631K897p983k0241j3262J0182J6784k095k8441
15426a1680m247J1485q930M714J1186K5446j0392j4393p394L3267Q016j3340r287
15413A4451L9700K1677k3517r903j9530Q485J4049k3064Q893o623O544J480L832
15400C6474J4451j8725J5893j1006l0098J3457K8031N68M935j3094J7903o045
15388E2744k669R541l1498k2750j0294J4014j0298j8540l8176k8346J0757j1827
15376h7342M132K1661J9633M2250J7555j4097k4912o750O66k9113j7810L356L8731
15363c2040K5452l129L268K9499J5614j3661j2352K401q516p052K538L091K483
$$ plain form
15452 -7674 -13950 -16596 -38988 -7689 8437 13965 -14207 -11834 3099 46370 57305 31810 19069
15439 19069 31495 31150 30748 35110 30479 33376 25393 5152 -8110 2072 18856 16761 -11680
15426 -11680 -15927 -4442 -13372 -8658 2528 27974 17582 3189 -4205 29062 37078 23738 14451
15413 14451 54151 75828 52311 42408 22878 31363 45412 22348 31241 24618 31162 32642 36474
15400 36474 50925 32200 48093 37087 6989 20446 48477 49045 53980 40886 58789 52744
15388 52744 50075 59616 28118 5368 -4926 9088 -1210 -19750 -57926 -86272 -75515 -87342
15376 -87342 -83210 -61549 -41916 334 17889 3792 -21120 -27870 -27204 -56317 -74127 -70771 -32040
15363 -32040 -6588 -9717 -6449 23050 38664 25003 12651 15052 6536 -516 2022 5113 7596
15350G596J4734J1264j0939j2210P010J7662l494j5629k5257q750J4922J3867
15338A0776M446O48q816J4744K3495j5343k9790J3295K5125l777O633l231j9245
15325A8960j284k2777j6057J7837K999Q835n231l597l439J2211L9427K5553P961
15312H1398R428r972k2332k62R648k001j2840J6765M924l5037M837j3047j7249
15299A4260k5777o152j1877k03J635M325L497J5947K8030k3851J0408L0980r69
15286D0253j8541J3L2584K3738j691k3196J025k6088k7287J5276J0049R399K3050
15273E8584k401m531j2622K222l1425k6579o186J7448j122o803j0656n911K2633
15260g349N1343J25j9765j2146j4580n207L091k129J9181O005o959k2011j5322
$$ plain form
15350 7596 22330 33594 22655 10445 17455 35117 31623 15994 -9263 -18013 -3091 10776
15338 10776 15222 15870 7054 21798 45293 29950 160 13455 38580 34803 41436 38205 18960
15325 18960 17676 -5101 -21158 -3321 -322 8513 3282 -315 -3754 8457 47884 73437 81398
15312 81398 90826 80854 58522 58260 67908 65907 53067 69832 74756 39719 44556 31509 14260
15299 14260 -11517 -17669 -29546 -29749 -28114 -23789 -20292 -4345 23685 -166 10242 41222 40253
15286 40253 21712 21725 54309 78047 76356 53160 54185 28097 810 16086 26135 35534 58584
15273 58584 56183 51652 39030 41252 9827 -16752 -22938 -5490 -6612 -13415 -24071 -29982 -7349
15260 -7349 43994 44119 24354 12208 -2372 -7579 -4488 -6617 12564 18569 11610 -10401 -25723
15247b5723j294j5540J6197L1040Q366K9641M370J7162j4381j0667j673k106J0322
15234D5714M371k0503k1061K0994M3320K4217K7972k9575l1012J149k42j3910
15222E1434j7022j7549j8634O614K4690J7849K881J1565k0755l176K8403J4349
15210H0649j2312L21j432J1527j0434J7305K3543O868K9472J9299J6516m509K6447
15197B03260M9068L1869K0512M7075O6392J10865Q8318J09928J45671J82907J75876
15186A231741J53638J29548P1809J1201p1448j05646j40399j70944j95078j76567
15176G37855j42515j18476p3048m1770o9704k0974n814P855k8763k9975k8519
15165A86152Q014J2283j5495r849p544K2738o992o912j793k2129k6282m881K970
$$ plain form
15247 -25723 -27017 -42557 -26360 4680 13046 42687 47057 64219 49838 39171 37498 35392 45714
15234 45714 50085 29582 8521 29515 72835 97052 125024 95449 64437 65586 65344 51434
15222 51434 34412 16863 -1771 4843 29533 47382 50263 61828 41073 37897 66300 80649
15210 80649 68337 68658 67226 78753 68319 85624 109167 116035 145507 164806 181322 176813 203260
15197 203260 252328 284197 304709 351784 418176 529041 617359 727287 872958 1055865 1231741
15186 1231741 1385379 1514927 1586736 1597937 1526489 1420843 1280444 1109500 914422 737855
15176 737855 595340 476864 403816 362046 292342 271368 265554 273409 244646 214671 186152
15165 186152 194166 206449 190954 181105 173561 196299 189307 182395 180602 158473 132191 127310 130280
15152A30280k0637L989j1673k193K8479K9603P400J950J1290m432k2753r092j1540
15139A30671l0194l6269J2514J7087k1121j2421o292K205k241k1434m3027J4500
15127C978Q695j9346L3688K3169R309q956m4931j2028K547K2872K3650M7716L469
15114I3832K651j9614k0294j1538p731j2243j8762K5381L272J4210J0509K0263
15102G9936j1871M872K2879J5904j5875j3352N168j4062k5286j8696q012M240
15090B5845K1994K7721K5211K1205k1251l7411k2405Q873R102j8505P970R249
15078E7598m289J5434R109k788k1211j9042j0256M764K2754K1007K0827o48l1479
15065F1780j7776R470L1846j2437j9939j790q278J0789j5585k0426j4409j038
$$ plain form
15152 130280 109643 113632 101959 99766 128245 157848 165248 167198 178488 174056 151303 142211 130671
15139 130671 100477 64208 76722 93809 72688 60267 53975 56180 53939 32505 -10522 3978
15127 3978 12673 -6673 27015 50184 59493 50537 5606 -6422 -3875 18997 42647 90363 93832
15114 93832 96483 76869 56575 45037 37306 25063 6301 31682 34954 49164 59673 79936
15102 79936 68065 72937 95816 111720 95845 82493 87661 73599 48313 29617 21605 25845
15090 25845 47839 75560 100771 121976 100725 63314 40909 49782 58884 40379 48349 57598
15078 57598 53309 68743 77852 75064 53853 34811 24555 29319 52073 73080 93907 93259 61780
15065 61780 44004 53474 85320 72883 52944 51154 42876 53665 38080 17654 3245 2207
15053B207q644j2142J2680K2959J1825J0239J1006P433J164K585r607O132r272
15040D8565n636J9501K4273p10j9701k087L336J7159J540J1431Q902J5628j4476
15027A07725k1535K6585Q382j6165j0744j6477j2390J5972j1794j3314K3120k2082
15015E7283l665J6950j796J5232k2675k212K0848p865k6407j840L2787P423J7057
15002A01120K0636o764J2124L4312J7003m293k895l517p815k522J7448J5388J7822
14989B08047J3872O114J4708k389M096K9948K311j6699K300j0062j6647j7464
14977B18135o662j7381M349o852J5787L037J6931m329j2264q465j0278K812K116
14964A96936Q792R002J997j9811m384j2257J4003K129R8j4481m868k4517j5222
$$ plain form
15053 2207 -6437 -18579 -5899 17060 28885 39124 50130 57563 58727 61312 51705 57837 48565
15040 48565 42929 62430 86703 85993 66292 64205 67541 84700 86240 97671 106573 122201 107725
15027 107725 86190 112775 121157 104992 94248 77771 65381 81353 69559 56245 79365 57283
15015 57283 53618 70568 68772 84004 61329 59117 79965 72100 45693 43853 76640 84063 101120
15002 101120 121756 114992 127116 161428 178431 174138 171243 167726 159911 157389 174837 190225 208047
14989 208047 221919 228033 242741 240352 244448 274396 276707 260008 262308 252246 235599 218135
14977 218135 211473 194092 198441 191589 207376 210413 227344 223015 210751 202286 192008 194820 196936
14964 196936 205728 214730 216727 196916 192532 180275 194278 196407 196505 182024 177156 152639 137417
14951A37417K4915J5J4333N833M250k3391k1567R727J5846l94r448P576Q426k2815
14937A50723J704J2203l584n623j5213J28K8805l5116l1405j1133k3533k1993
14925D5963j714q082m0074j3065K1397o335q522k9860O252L0804L7097R275L0165
14912G3301M8344j0929L0291K9105M8942J9298k4218J904K3796K4624K6024K1625
14900C12107K6252N1196j585P594M4520J4815m818j805j1697k8296l8043n3303
14888C16937o3527p6179o7652m2087m7305l7280k0958J6174L8963K0032j0j1756
14876B5352L0525J1898J0815L0868L1469o6K4564J6225J6906J0518K5027K9894
14864B63995L9372Q3030N0278j403q606p000m269L012P352n5085n7328l3600j874
$$ plain form
14951 137417 162332 162347 176680 182513 186763 163372 141805 151532 167378 166984 157536 165112 173538 150723
14937 150723 152427 164630 161046 155423 140210 140338 169143 134027 102622 91489 67956 45963
14925 45963 44249 36167 -3907 -16972 4425 -1910 -10432 -40292 -34040 -3236 33861 43136 73301
14912 73301 121645 110716 141007 170112 219054 238352 214134 216038 239834 264458 290482 312107
14900 312107 338359 389555 387970 395564 440084 454899 450081 448276 436579 408283 370240 316937
14888 316937 253410 177231 109579 67492 20187 -17093 -38051 -21877 17086 37118 37108 25352
14876 25352 55877 67775 78590 109458 140927 140861 165425 181650 198556 209074 234101 263995
14864 263995 303367 386397 436675 435272 426666 419666 415397 418409 425761 370676 313348 279748 277874
14851B77874k367K950j2739K2717j9065j6307J3610J7810K1651M1281J7574M730
14839C69719j5323j1420N361M715k2245K5171M3380K737L1800M862j661N802l630
14826D39268J219j5317K3148L2645K4352K5385J4209k602R953O585k00j4241R905
14813E54309M1261K0500K329J9901J7603P128o676P343L1943Q990J303L887Q943
14800G18764K3515j0323j8146M6247N7554O6126O4842Q1363O5436M6197N1995
14789A193570M6063P2889L8811L4446Q9054N3698O9707O2097O6001P6087Q6800
14778A889223R4110P1229P7855J02679J16786J23740J31091J22940R4991J45313
14768B969957J85857J76078K12411J92721J92440K13718K65800L02365L54409
$$ plain form
14851 277874 275507 278457 265718 288435 269370 253063 266673 284483 306134 347415 364989 369719
14839 369719 354396 342976 348337 353052 330807 355978 399358 402095 433895 438757 437096 442898 439268
14826 439268 440487 425170 448318 480963 505315 530700 544909 542307 552260 558845 558645 544404 554309
14813 554309 595570 616070 618399 638300 655903 663031 656355 663698 695641 704631 705934 709821 718764
14800 718764 742279 731956 713810 760057 817611 883737 948579 1029942 1095378 1141575 1193570
14789 1193570 1239633 1312522 1351333 1385779 1474833 1528531 1598238 1660335 1726336 1802423 1889223
14778 1889223 1983333 2054562 2132417 2235096 2351882 2475622 2606713 2729653 2824644 2969957
14768 2969957 3155814 3331892 3544303 3737024 3929464 4143182 4408982 4711347 5065756
14759E065756M31096N00551N99315P31794Q83722J012250J221135J461713J687203
14750A3594535J961838K288025K633612L069412L628259M475004N636737P504219
14742D4791641J0502469J4985120K0776729K7023790L2442260L5913947L6885455
14735B23321411L4741020K8584794J8118164M759446q906954k0649633k9713425
14728B50254823l5804273l7980929l5535945k9447156k2051372j5390331j0454989
14721F3589828p226067n212524m074527l346099k896380k597238k370462k201440
14713C3665091k013826j802341j592530j417198j325585j215985j145238j086723
14705B2065665j044235j011382r66434q87070q14388p54069p21973o64828n89902
$$ plain form
14759 5065756 5496852 5997403 6596718 7328512 8212234 9224484 10445619 11907332 13594535
14750 13594535 15556373 17844398 20478010 23547422 27175681 31650685 37287422 44791641
14742 44791641 55294110 70279230 91055959 118079749 150522009 186435956 223321411
14735 223321411 258062431 286647225 304765389 309524835 300617881 279968248 250254823
14728 250254823 214450550 176469621 140933676 111486520 89435148 74044817 63589828
14721 63589828 56363761 51151237 47076710 43730611 40834231 38236993 35866531 33665091
14713 33665091 31651265 29848924 28256394 26839196 25513611 24297626 23152388 22065665
14705 22065665 21021430 20010048 19043614 18156544 17342156 16588087 15866114 15201286 14611384
14696A4611384n88159n84842n27432m71969m48216m24926l94980l65709l40616
14687A0464535l75099l90042l26063l24779l07431l02580l01538k87658k80022
14678G569323k48302k23591k38074k23445j92102j69843j51211j21493j22915
14669E878347j34148j18687j39642j15825j33208j32109j52627j31043j48241
14660D672817j41251j21992j16211j23766j07378j27491r7283j13527j22597j04447
14650C496874j03212r7462o2797o4116r0293q7499n9048l3959n2214p3534l0131
14639B742609n9240o9324o1860l8936l8968o3928p1258k8780k4714p6230j00034
14628B109337r2928r0146r6019r2546o1977r0092p8159o7886p2763o9847p0856
$$ plain form
14696 14611384 14023225 13438383 12910951 12438982 11990766 11565840 11170860 10805151 10464535
14687 10464535 10089436 9699394 9373331 9048552 8741121 8438541 8137003 7849345 7569323
14678 7569323 7321021 7097430 6859356 6635911 6443809 6273966 6122755 6001262 5878347
14669 5878347 5744199 5625512 5485870 5370045 5236837 5104728 4952101 4821058 4672817
14660 4672817 4531566 4409574 4293363 4169597 4062219 3934728 3837445 3723918 3601321 3496874
14650 3496874 3393662 3296200 3233403 3169287 3078994 2991495 2932447 2898488 2846274 2772740 2742609
14639 2742609 2683369 2614045 2552185 2513249 2474281 2410353 2339095 2310315 2285601 2209371 2109337
14628 2109337 2016409 1926263 1830244 1737698 1675721 1585629 1507470 1439584 1366821 1296974 1226118
14617A226118o1239n7300n3113m6998l1516k0706m3206l906o6556o2969m0292
14606G38317m8317k7729q499j5669j5325k0547l6655j4363m515o362j9177k198
14594E18961j7715o636J7495Q821K50L4742L0131J1912K9151L2369j26j0874l2891
14581F15590k8857k5504k9377r4427q7661n5601q4056q5176n9138j0182k4422
14570C1189n487J7920N1222N5444K3701J1923k3709l3926M429L9733O697J921
14558A81057Q01L3826K3095M591L5259L3246K8500L3167K6961L965j9607J8950
14546D03811L8636Q774K572m8359m7895k6567K83l460j496j0309n881j4392j1128
14533B84589j086k2094j9331j4398j4995j446j2606k0061j6706L963J067o579
$$ plain form
14617 1226118 1164879 1107579 1054466 1007468 975952 955246 912040 908134 841578 778609 738317
14606 738317 690000 662271 653772 638103 622778 602231 565576 551213 546698 540336 521159 518961
14594 518961 501246 494610 512105 520926 521176 555918 586049 597961 627112 659481 659355 648481 615590
14581 615590 586733 561229 531852 437425 349764 294163 210107 124931 65793 55611 31189
14570 31189 25702 43622 94844 150288 173989 185912 162203 128277 132706 172439 179136 181057
14558 181057 181858 215684 238779 243370 278629 311875 340375 373542 400503 404468 384861 403811
14546 403811 442447 451221 453793 405434 357539 330972 331255 327795 326299 315990 310109 295717 284589
14533 284589 283503 261409 242078 227680 212685 211239 198633 178572 161866 165829 166896 160317
14521A60317J260J7718J0699J5289j919J2720L4489J5346k3005j2200r308l1960
14509A89446k3409O647p732j4814J4852Q622j897r763J7013J6583j3533j0817
14497A71198J533j1134k3559O947M1037L208J5603J9142L889r568j6635l4978
14485A66683j4602n576n531M275j7541o461O849L1136j3216l2187l659o788m2904
14472F0478j6521K0389K274j5584p693j8883J3336J3591k1375l58r164j1065J1035
14459B0460L3874K9854k7211l2414j9973M0637M334j4073k5101P586N6490K2297
14447I6760j7909l3081R150K5866j8592j4172K6163r443l0700k0748j2577J1376
14435A2093J6055j56j1925R296R852j481J2211N0740k381j8994r773k1668P347
$$ plain form
14521 160317 161577 179295 189994 205283 203364 216084 250573 265919 242914 230714 221406 189446
14509 189446 166037 172684 164952 150138 164990 173612 171715 161952 178965 195548 182015 171198
14497 171198 172731 161597 138038 144985 186022 189230 204833 223975 227864 218296 201661 166683
14485 166683 152081 146505 140974 145249 127708 121247 128096 159232 146016 113829 110170 103382 60478
14472 60478 43957 64346 66620 51036 43343 24460 37796 51387 30012 29654 20490 9425 20460
14459 20460 54334 84188 56977 24563 4590 45227 49561 35488 10387 17973 74463 96760
14447 96760 78851 45770 54920 80786 62194 48022 74185 64742 34042 13294 717 12093
14435 12093 28148 27992 16067 25363 35215 33734 45945 96685 94304 75310 65537 43869 51216
14422E1216J3416K4340J3803n597k7734O797Q106k2336K3957m754k2229o152j2109
14409D0724j4863j9564p957Q717K1624L3217K68k2830l551L517K906j1122j4079
14396A7007j4528J6633O826J0281K2052m785k3721k990L3834J7549l0759q582
14384C8817r484J2366J2041m333j9773k991K9003k749J648j3555j8601J4604j3075
14371B3918M011j1745k3466l838J64J8637M491P390R062n152q469j0389k0080
14358a5466K484J1131k0286O077J4505K71j1758j9311J0893K7139N500J9388K7948
14345E8515Q434J4342j8401j8368k4039o753M667M7762Q138l4521j9534J4500
14333C4742L1030j3321L874L625J508m63q542K2516K6698J1066L711K1195P176
$$ plain form
14422 51216 64632 88972 102775 97178 69444 76241 84347 62011 85968 81214 58985 52833 40724
14409 40724 25861 6297 -1660 7057 28681 61898 62166 39336 35785 39302 42208 31086 17007
14396 17007 2479 19112 25938 36219 58271 53486 29765 26775 60609 78158 47399 38817
14384 38817 29333 41699 53740 49407 29634 26643 55646 52897 54545 40990 22389 36993 23918
14371 23918 27929 16184 -7282 -11120 -10956 7681 12172 19562 28624 23472 15003 4614 -15466
14358 -15466 -12982 -1851 -22137 -16060 -1555 -1284 -13042 -32353 -21460 5679 11179 30567 58515
14345 58515 66949 81291 62890 44522 20483 13730 18397 66159 74297 39776 20242 34742
14333 34742 65772 52451 56325 59950 61458 60995 52453 74969 101667 112733 116444 137639 144815
14320A44815J2024J876L336L927k0838j2556o509r522k6266J497J9289j6305Q583
14307A03351J7226R732L4389m653K432m76J4807j11m134k3133j3733o923K594
14294A31368J669L041K4767J5145j5368J723O717L2150J2966M5704M1309M5150
14282C46341R0950J32186J38535J76753J88174J94674J55247R8446N0143n213
14272A566236p3987j32072j49254j60707j94176j68277j49704j06287o1393n1654
14262C18725p156j0219j8279k0428l1322k7023j5797j7957o518k5529k4356J2587
14250A26728J0734J641j5712k6508q371M12l636n506L333K0495K1505q338k1203
14237I5574j1555J6258L187p344K014j5438J826J0900r463k1898J0139K9936J0740
$$ plain form
14320 144815 156839 158715 162051 165978 145140 132584 126075 116553 90287 91784 111073 94768 103351
14307 103351 120577 130309 164698 160045 162477 162001 176808 176697 172563 149430 135697 128774 131368
14294 131368 133037 136078 160845 175990 160622 162345 169062 201212 214178 259882 301191 346341
14282 346341 437291 569477 708012 884765 1072939 1267613 1422860 1521306 1571449 1566236
14272 1566236 1492249 1360177 1210923 1050216 856040 687763 538059 431772 370379 318725
14262 318725 311569 301350 283071 262643 231321 204298 188501 170544 164026 138497 114141 126728
14250 126728 137462 139103 123391 96883 88512 88924 85288 79782 83115 103610 125115 116777 95574
14237 95574 84019 100277 103464 96120 98134 82696 84522 95422 85959 64061 74200 104136 114876
14224A14876k3291k0165K031k2593j7850m469K858j2565k1096L58j0901J4606
14212A799L212j0264R582L350l432p494L2728L467j6096j4961l605m9866j9795
14199g1375M3200M0748L322J6577k70k4882j2009J531J2283j1778m768J2864N604
14186A1047R089P699Q473J4416K7909q884k3170k5734P376J9150k7506j4806L280
14173H339r538j7304J6251l927n324R714L436K8461Q090m3038k2370J3162R880
14160d168k1976j8142j5316Q363J9134n98J5479J2872L15N1j1270r923j997q11
14146b7987K7545K4380J2841j8385q171r600J7169J514l9J8683J5613m8129l4330
14133b8896N55K1763M721r575k4727j4441P295J4257K1549J2971J5372j9333k7442
$$ plain form
14224 114876 91585 71420 73451 50858 33008 28539 31397 18832 -2264 -1906 -12807 1799
14212 1799 5011 -5253 4329 7679 4247 -3247 29481 32948 16852 1891 -1714 -51580 -71375
14199 -71375 -28175 12573 15895 32472 32202 7320 -4689 -3158 9125 -2653 -7421 5443 11047
14186 11047 20136 27835 36308 50724 78633 69749 46579 20845 28221 47371 19865 5059 8339
14173 8339 -1199 -18503 -2252 -6179 -11503 -1789 1647 30108 38198 -4840 -27210 -14048 -4168
14160 -4168 -26144 -44286 -59602 -51239 -32105 -32703 -17224 -4352 -4037 -3986 -15256 -25179 -27176 -27987
14146 -27987 -442 23938 36779 18394 10223 623 17792 19306 19267 37950 53563 5434 -28896
14133 -28896 -28341 -6578 -1857 -11432 -36159 -50600 -43305 -29048 -7499 5472 20844 1511 -25931
14120b5931j5909J4461J1655j4518j9964J3977J6564J5856j6558m911j3163j4305
14108e2746J559J2411n68N00J6285M261k048K7098M490J2861n554j3051j1987
14095f489P54n013K0268j3428m575j58k251J6449q855k8719k5381J0116N2104
14082D822K1881R626k4888l0649L2920J0866k9401J2825J8060k2929k1021q74
14070a8762J8880q169n173J2756M7787N682N731P211j2005j0608n413j6138o004
14057A5775j0286k0471J9207J8339N570j994l387L895J1068o534J1111q201j6770
14044A7322k0860J7215J1547M1283L1319P766M0490M1385L4036L3991L3993j433
14032B88054n578J7638k6896n7973l5974k2396J2912M7610P6546Q3563J11179
$$ plain form
14120 -25931 -41840 -27379 -15724 -30242 -50206 -36229 -19665 -3809 -20367 -25278 -38441 -52746
14108 -52746 -51187 -38776 -39344 -38844 -22559 -18298 -20346 6752 11242 24103 18549 5498 -6489
14095 -6489 -5735 -10748 9520 -3908 -8483 -8641 -10892 5557 -3298 -32017 -57398 -47282 4822
14082 4822 26703 36329 11441 -19208 13712 24578 -4823 8002 26062 3133 -17888 -18762
14070 -18762 118 -8051 -13224 -468 47319 53001 58732 65943 53938 43330 37917 21779 15775
14057 15775 5489 -14982 4225 22564 28134 26140 22753 26648 37716 31182 42293 34092 17322
14044 17322 -3538 13677 25224 66507 97826 105592 146082 187467 221503 255494 289487 288054
14032 288054 282476 300114 273218 215245 179271 156875 169787 217397 293943 377506 488685
14021D88685J60290K08190K05821J40637J22148N8462p202p1574j38968j99101
14011I67388k03589j93092j48673j00703n3234l4820l3953j2203l032L547J3185
14000B00821J336k0803n22J2200n913k0546j4896k3140l0307j6959N632J1968
13988I8871J186Q55j2628L01k494q843J4172M441j9102l1490k2783l97j0038K4383
13974C6434K4007j2780j7473j5909L657L0886M750N621k679l111Q919k363j1595
13961D8364k8028j262K329l1015k632K6933Q968k0465j5167k112J8216J3668%
13948A7797o531J7523L872M251K574j2273j3564K2196J56j2186l795j532J5370
13935C3858l446k9928k139j2180J8771r499o250J4135k439P727m4691n8976K0950
$$ plain form
14021 488685 648975 857165 1062986 1203623 1325771 1384233 1377031 1305457 1166489 967388
14011 967388 763799 570707 422034 321331 268097 233277 199324 187121 184089 187636 200821
14000 200821 202157 181354 180832 193032 187119 166573 151677 128537 98230 81271 86903 98871
13988 98871 100057 100912 88284 88585 86091 77248 91420 95861 76759 45269 22486 22089 12051 36434
13974 36434 60441 47661 30188 14279 17936 48822 53572 59193 56514 53403 62322 59959 48364
13961 48364 20336 19074 21403 -9612 -12244 14689 23657 3192 -11975 -14087 4129 17797 17797
13948 17797 11266 28789 32661 36912 39486 27213 13649 35845 36001 23815 20020 18488 33858
13935 33858 30412 484 -1655 -13835 4936 -4563 -10813 3322 883 8610 -36081 -95057 -74107
13922g4107N2767K2674Q155N416n583J8833K4800j3212j4139j578j2274j0944
13910H08o395q664J3525Q465J1147n432L531k969j1948j6382k0236n840j3313
13897e3703J0071J41Q353l715k60J9581J5261l242j3861M446k323j657J282K1900
13883B274j100Q554l863k5991K820J6268p08j1026j1245J1410J9532J5152k1961
13870A16o957J8505J3829J0860k2891k5406Q870J8968K174l1578k7664J1871L7940
13857H637J4012j6395p003J3319K4k488j1185j9509n211q254J0586R065K7187
13844A2785q045j7387j7950R104O329p487O255K9926K92j5774J3672R670N479
13831B6869p417K1818J5043J23k5325j8155k0426p948L1076L132J355J4629l1211
$$ plain form
13922 -74107 -21340 1334 9489 14905 9322 28155 52955 39743 25604 24026 11752 808
13910 808 -5587 -14251 -726 7739 18886 13454 16985 14016 2068 -14314 -34550 -40390 -53703
13897 -53703 -43632 -43491 -35138 -38853 -39113 -19532 -4271 -7513 -21374 -16928 -19251 -20908 -19626 2274
13883 2274 1174 9728 5865 -20126 -17306 -1038 -1746 -12772 -24017 -12607 6925 22077 116
13870 116 -6841 11664 25493 36353 13462 -11944 -3074 15894 18068 -13510 -41174 -29303 8637
13857 8637 22649 6254 -749 12570 12594 10106 -1079 -20588 -25799 -34053 -23467 -14402 12785
13844 12785 4740 -12647 -30597 -21493 -15164 -22651 -16396 13530 13822 -1952 11720 21390 26869
13831 26869 19452 41270 56313 56436 31111 12956 -7470 -15418 15658 18790 20145 34774 3563
13818C563J8155K713k1205k2991j7467Q266j3989J5323L039N28J9388q529l584
13805a6790O159L65K0834R041j7886K172J7108j1058K3517m656k9644k227J1493
13792H428j8416n25L7516m359j0469j1015o316J4427L1705o258J279P533K7658
13779G1188J8420R255j3465k0739k1314J1888K07L784j141q559M129k4219k9919
13766d85J9429M0877m579j7105K673j6762j0010K0946j91j25J3395L326K067l4742
13752A8714r962N93k2116J1494J5239k671J0594k907j00L2602K77L4317O507l7475
13738E5106l3734j3924J1322n211J113j2061N814J6686J315P831M437J3768j3523
13725C8939k3310k9387J9946K0504j87J4543O043k9272q754J9659L269j5655M893
$$ plain form
13818 3563 21718 24431 3226 -19765 -37232 -28966 -42955 -27632 -24593 -24065 -4677 -13206 -16790
13805 -16790 -10631 -10266 10568 19609 1723 3895 21003 9945 33462 28806 -838 -3065 8428
13792 8428 -9988 -10513 27003 22644 12175 1160 -5156 9271 40976 34718 35997 43530 71188
13779 71188 89608 98863 85398 64659 43345 55233 55440 59224 58083 49524 53653 29434 -485
13766 -485 18944 59821 55242 38137 40810 24048 14038 34984 34793 34668 48063 51389 53456 18714
13752 18714 8752 9345 -12771 -1277 13962 11291 21885 18978 18878 51480 51757 86074 92581 55106
13738 55106 21372 7448 18770 13559 14672 2611 8425 25111 26426 34257 38694 52462 38939
13725 38939 15629 -13758 6188 26692 26505 41048 47091 17819 9065 28724 31993 16338 21231
13712B1231K791j434j163m837J62k967K0904K4521R670j2630q521J3077p154r048
13698D4602J6547Q337j5876O480m85l4964l496j8967l612J7448K8312O698p415
13685D3609j8272j3497j5129m324J4265J9244j5647K361J4076L809J7651L053
13673E1199J3568l20R070l9864m807k6028R998N980P57J8931n776p781j0000J3051
13659B7978L3386N200j3576j15L163N722O442n843O55m2664l1952j486j4997J3610
13645a4477J8692n581l678q42L9871p473k2777k144K924K4818l672R460K0507
13632E5628j506k5659k0148Q409K0258J0732R11l902j1020k2778l986M8492j1972
13619D3459j7700L536J2176j3433K202K7669j1456k6008P97J3993J021j6479l3764
$$ plain form
13712 21231 24022 22588 21425 16588 16750 13783 34687 59208 68878 56248 47727 60804 53650 44602
13698 44602 61149 69486 53610 60090 59605 24641 21145 2178 -1434 16014 44326 51024 43609
13685 43609 25337 11840 -3289 -7613 6652 25896 10249 12610 26686 30495 48146 51199
13673 51199 64767 64447 73517 33653 28846 2818 12816 18796 19553 38484 32708 24927 14927 27978
13659 27978 61364 66564 52988 52873 56036 61758 68200 62357 63012 20348 -11604 -13090 -28087 -14477
13645 -14477 4215 -1366 -5044 -5886 33985 26512 3735 1591 4515 29333 25661 35121 55628
13632 55628 54122 28463 8315 16724 36982 47714 48625 44723 33703 10925 6939 55431 43459
13619 43459 25759 29295 41471 28038 30240 57909 46453 20445 21242 35235 36256 19777 -13987
13606a3987l239K0207K8667k1728Q935L0169p044p284j8302j7089J6222n975j1867
13593b315K912K1021j6501l0971O603r660J3097J2583J6077o488j5862J1350P476
13580I322J0652J5162o745k0420l3778J5967J7980m514j3775j9709K494L6153
13568H789J8769J1150K784l63L873K4631j036k8962P458j1195p389J9169l3174
13555A4504p043m693K0238J0395J3851j0219l0050p749l585Q375J2114j9330r381
13542a2573J1979M870q271J6777J1792J3297J514k7339M0171n673r709j3197k4247
13529f09j6429k0893k0765J2334J6685R552J9310l243K6319K6887j9828n220J078
13516B5178P904M06J1105j5414l274K2197P519l9347r869N377K110J2797k0783
$$ plain form
13606 -13987 -17226 2981 31648 9920 18855 49024 41980 34696 16394 -695 15527 9552 -2315
13593 -2315 597 21618 5117 -25854 -19251 -28911 -15814 -3231 12846 6358 -9504 1846 9322
13580 9322 19974 35136 28391 7971 -25807 -9840 8140 3626 -10149 -29858 -27364 8789
13568 8789 27558 38708 41492 41129 45002 69633 68597 39635 47093 35898 28509 47678 14504
13555 14504 7461 2768 23006 33401 47252 37033 6983 -766 -4351 4024 16138 -3192 -12573
13542 -12573 -594 4276 -3995 12782 24574 37871 39385 12046 52217 46544 36835 23638 -609
13529 -609 -17038 -37931 -58696 -46362 -29677 -20125 -815 -4058 22261 49148 29320 24100 25178
13516 25178 33082 33488 44593 29179 25905 48102 55621 16274 6405 11782 13892 26689 5906
13503E906j2527K5475K7632j0543J666J1002j888r390k9104r978J5380J8515J3551
13490D5697k2121k5224J6396J9217l237J3243o952q618Q692j520J0246Q532j2584
13477D1767j9389j0993p907J3477J3219j0832l1290J9953J6160j1932k3703R172
13465b298j0907N138J0158K0296j5992j1529N816K3259K313j4692l4062r227L0690
13452a037j1647J061K6517J6587r896j2545k385m531O017K9334L197J6169L510
13439F0351l2396p464M2564K1392r142R080J2758J573k7908m7550n726K4k9513
13426a1957o626L7141K5553j7346m7718R318M1723l950j5897J2802N827l198M90
13413B6162m46j0758l0019J6612P141J943R964K3109k2053j7917L4360K6105k839
$$ plain form
13503 5906 -6621 18854 46486 35943 37609 48611 46723 37333 8229 -1749 13631 32146 45697
13490 45697 23576 -1648 14748 33965 30728 43971 37019 28401 37093 35573 45819 54351 41767
13477 41767 22378 11385 3478 16955 30174 19342 -11948 8005 24165 12233 -11470 -2298
13465 -2298 -13205 -8067 2091 22387 6395 -5134 682 23941 26254 11562 -22500 -31727 -1037
13452 -1037 -12684 -11623 14894 31481 21585 9040 6655 2124 8141 37475 40672 56841 60351
13439 60351 27955 20491 63055 84447 75305 84385 97143 98716 70808 23258 17532 17556 -11957
13426 -11957 -18583 18558 44111 26765 -20953 -11635 30088 26138 10241 23043 28870 25672 26162
13413 26162 25716 14958 -15061 1551 8692 10635 20599 43708 21655 3738 38098 64203 61364
13400F1364l5528J8463L9470Q943j4197k4853j6579J9577K9491j4849J5054M267
13388I0623j1792J4670N911l7172J1057K1294l1895q953M993m024j1134j2866
13376C0712j3611J7430J8887j3729r33r933J7041J6208Q640N337j0665l4582j566
13363B9236K0926K7327J1188n15J7463P120K1979k674J1913K1406r367k4319j59
13350A31524L6001K5157Q773J5900K1898l109J3119O6982Q7427R3566J22806K16841
13338H36885K54134K66497K53794J85868J35119N3287l3662r2794j59991k31419
13328A467718k69246k24636j69832q2324p7856p9200n6395m1160j8608j669J0768
13317D57560k8042j8381q176j8813r352l2439P96K5444K4257k707M718m2882Q70
$$ plain form
13400 61364 25836 44299 83769 92712 78515 53662 37083 56660 86151 71302 86356 90623
13388 90623 78831 93501 99412 62240 73297 94591 62696 53743 58736 54712 43578 30712
13376 30712 17101 34531 53418 39689 38756 28823 45864 62072 70712 76049 65384 30802 29236
13363 29236 50162 77489 88677 88162 105625 112745 134724 132050 143963 165369 156002 131683 131524
13350 131524 167525 192682 201455 217355 239253 236144 249263 316245 403672 497238 620044 836885
13338 836885 1091019 1357516 1611310 1797178 1932297 1985584 1951922 1859128 1699137 1467718
13328 1467718 1198472 973836 804004 721680 643824 564624 508229 467069 448461 446792 457560
13317 457560 429518 411137 402961 384148 374796 342357 343153 368597 392854 390147 394865 351983 352853
13304C52853J5987K4262K9304K0445N4271K6825M6987P4254J15170J27625J33901
13293A021884J61051J89461K00601J40752N5483N057o2956j01005j66161k06959
13283A237208j90713j92942j60972q2152n0702p4546o3770k3757M269P052k9669
13272C79306m0726m9236l2566L916j4606J4430k1693j1391q357n325l3879k4720
13260A55153k1256k3979J6976L4865k0022k1786J1573k3286j7832M1244L91J9883
13248A51924n806m824n979m670j4555q50k5134l382J9194j3529j2508j9694j398
13235E8789K0599N906j254o810n640K546k4796k0289L779J772J6492N5763j306
13222A05551k4955k1244j0350L3950p65r301j7325K9563N7159R951p606J2298
$$ plain form
13304 352853 368840 393102 422406 442851 497122 523947 570934 645188 760358 887983 1021884
13293 1021884 1182935 1372396 1572997 1713749 1769232 1774289 1711333 1610328 1444167 1237208
13283 1237208 1046495 853553 692581 610429 559727 485181 421411 397654 401923 408975 379306
13272 379306 338580 289344 256778 260694 246088 260518 238825 227434 219077 213752 179873 155153
13260 155153 133897 109918 126894 161759 141737 119951 131524 108238 90406 131650 132041 151924
13248 151924 146118 141294 135315 130645 116090 115240 90106 86724 105918 92389 79881 60187 58789
13235 58789 79388 85294 84040 77230 71590 74136 49340 29051 32830 34602 51094 106857 105551
13222 105551 80596 59352 49002 82952 82187 72886 55561 85124 142283 152234 144628 156926
13210A56926K5705l405l9384o516k230Q832j0887j9437J1001M556N19K4706k453
13197A47933j2756r319k6035k8016j965J2663J4206j4768j8945Q981K7506J0957
13185A10442k2238J0985J1902M209J695k0466l4072k5286k690J0242J1040m957
13173E0806n953j6001K332J7587L1415P888Q588j1131j3778P034l881J7836K283
13160I5025q074k530j7745q528n321N445J7548J1035j7313J7436K187k5056k5132
13147C8977K5911K7679k793j2354J846J2854j9697R566p098K6691J8083J840k0061
13134A01444q638J6479K2860j8858J9026J6604J8314l133K1753N1083R794O794
13122B53522P523O224K7122J8445K0166J8548O494J3725K5811J3466k3991j9278
$$ plain form
13210 156926 182631 179226 139842 133326 131096 139928 129041 109604 120605 125161 125680 150386 147933
13197 147933 135177 125858 99823 71807 69842 82505 96711 81943 62998 71979 99485 110442
13185 110442 88204 99189 111091 115300 116995 96529 62457 37171 34481 44723 55763 50806
13173 50806 44853 28852 31184 48771 80186 88074 96662 85531 71753 78787 74906 92742 95025
13160 95025 86951 84421 66676 58148 52827 58272 75820 86855 69542 86978 89165 64109 38977
13147 38977 64888 92567 89774 77420 79266 92120 72423 81989 74891 101582 119665 121505 101444
13134 101444 92806 109285 132145 113287 132313 148917 167231 164098 185851 236934 246728 253522
13122 253522 261045 267269 294391 312836 333002 351550 358044 371769 397580 411046 387055 367777
13110C67777M755j1307l1024k4712l0822l5122k08M592J8347k2526m1883k6171
13098A71696Q366J1400J2645J4242J6907K6971O785j9532j0099J673k9426k3084
13086A88544j5957m442O551j781j8617K117K092M387K901Q644Q68k3237j626K5873
13072A76317j331J462q05J5302K494k016K617J8413K754m4811k3180J6383j1540
13059A52059K027L1777k7881o6105l6680j4564M126j6503k6569L173J7340K398
13047B4598r043J6371M3365L2993K0077L0725J2703L6797O4103K0349J6319L223
13035C12580J8043K8641L3933K6458J0761J4837L0885n812n08J7651R029j9380
13023D77118m2854n3645p6592q5731n2904m8378l7118m6005j2107L46j6724j1741
$$ plain form
13110 367777 372532 361225 330201 305489 274667 239545 239337 243929 262276 239750 197867 171696
13098 171696 180062 191462 204107 218349 235256 262227 269012 249480 239381 241054 211628 188544
13086 188544 172587 168145 174696 172915 154298 156415 158507 162894 165795 174439 175307 152070 150444 176317
13072 176317 174986 176448 175643 190945 193439 191423 194040 212453 215207 170396 147216 163599 152059
13059 152059 154086 185863 157982 91877 55197 40633 44759 28256 1687 4860 22200 24598
13047 24598 15555 31926 75291 108284 128361 159086 171789 208586 272689 293038 309357 312580
13035 312580 330623 359264 393197 419655 430416 445253 476138 470326 469818 487469 496498 477118
13023 477118 434264 380619 304027 218296 165392 117014 79896 33891 21784 22130 5406 -6335
13011f335L4312M9505K3641J9876K7220J9990k8382J3840K0893p43K2588J8528
12999B14933L3265M6690q605K9113K7976M9574J6145L849K8874J8321q986k4214
12987D26935m9259k4358o213L918l235J8673K5569K6741J0951R613N495M1614
12975D86444K7313M2219M5569R6975J56322K09603K05544J79993J32942J05445
12965A688369M8972k1063r0599j43174j96746k20301j80869r4436o5303l0377
12955F94473j4295j7935Q345Q971L8956M8171l388j3611K3067J6189m696J597
12943G85844q562L1212N0260M053k3522J0450J3361R912J2057M4744J155k0544
12931I10420j9147O319M2088L5592M6887M2515P9700L9794M1508O6619O3640K9667
$$ plain form
13011 -6335 27977 77482 101123 120999 148219 168209 139827 153667 174560 173817 196405 214933
12999 214933 248198 294888 286283 315396 343372 392946 409091 412940 441814 460135 451149 426935
12987 426935 377676 353318 347105 351023 347788 366461 392030 418771 429722 439335 444830 486444
12975 486444 513757 555976 601545 698520 854842 1064445 1269989 1449982 1582924 1688369
12965 1688369 1737341 1716278 1625679 1482505 1285759 1065458 884589 790153 724850 694473
12955 694473 680178 662243 670588 679559 718515 766686 763298 749687 772754 788943 784247 785844
12943 785844 777282 808494 858754 862807 839285 849735 863096 873008 885065 929809 930964 910420
12931 910420 891273 897592 939680 975272 1022159 1064674 1144374 1184168 1225676 1292295 1355935 1385602
12919A385602P0255M4434K1761O3550Q4172R9831Q9974Q2159P8868R1519J09980
12908B222105J01425J02183J29490J27456J24177J44049J76292K02711J91003
12899C520891K30428K02941K17854K71023K41822K45471L08937L60945M49975
12890F050287N49014O24994P52545R38692J091639J293144J508373J757525K008723
12881A6574936K280200K616196L001427L566360M335393N563987P531518J0633353
12873E6103370J5309195K1283801K7724704L3317554L6852452L7394022L4447809
12866B62432907K7315120J6240540K956273j0557934k2736167l1923353l7364574
12859B06362812l8335037l4629430k8044842k0765983j4149679r447443o526708
$$ plain form
12919 1385602 1455857 1500291 1522052 1585602 1669774 1769605 1859579 1941738 2020606 2112125 2222105
12908 2222105 2323530 2425713 2555203 2682659 2806836 2950885 3127177 3329888 3520891
12899 3520891 3751319 3954260 4172114 4443137 4684959 4930430 5239367 5600312 6050287
12890 6050287 6599301 7224295 7976840 8915532 10007171 11300315 12808688 14566213 16574936
12881 16574936 18855136 21471332 24472759 28039119 32374512 37938499 45470017 56103370
12873 56103370 71412565 92696366 120421070 153738624 190591076 227985098 262432907
12866 262432907 289748027 305988567 308944840 298386906 275650739 243727386 206362812
12859 206362812 168027775 133398345 105353503 84587520 70437841 60990398 54463690
12852E4463690m779285l650283l010609k645974k376705k244672k152070k002072
12844C1602020j809200j650855j436950j313571j249956j131725j058695r97582
12836B0953486r57366r37230r03928p83006p63383p60239o97443o29876n72175
12827A3948840n29033m96321m33165m11062m24119m04203m04640l77250l85583
12818A0083464l60004l64650l27650k96292k97667k91298k87795k66178k43883
12809G348047k21029k36208k05926j58449j37461j57751j33512j45715j23489
12800E828507j06812j19104j48620j41277j36472j57235j56187j39708j37836
12791D585256j29871r9777r0781j09640j18216j21770j06278j00435r7053j09921
$$ plain form
12852 54463690 49684405 46034122 43023513 40377539 38000834 35756162 33604092 31602020
12844 31602020 29792820 28141965 26705015 25391444 24141488 23009763 21951068 20953486
12836 20953486 19996120 19058890 18154962 17371956 16608573 15848334 15150891 14521015 13948840
12827 13948840 13419807 12923486 12490321 12079259 11655140 11250937 10846297 10469047 10083464
12818 10083464 9723460 9358810 9031160 8734868 8437201 8145903 7858108 7591930 7348047
12809 7348047 7127018 6890810 6684884 6526435 6388974 6231223 6097711 5951996 5828507
12800 5828507 5721695 5602591 5453971 5312694 5176222 5018987 4862800 4723092 4585256
12791 4585256 4455385 4355608 4264827 4155187 4036971 3915201 3808923 3708488 3611435 3501514
12781C501514j06755j05103r5040p7210k9130j3085k4587n0455o5138r5694n8692
12770B780625m7735m7640k5954l6346q0223n6028m8372m8161o8946n6234n0096
12759B214890o1719m3348n7128o9682n7545k8735j2977j2297k1552N2869J28475
12748B031251K18167L04914M36463M75120N09257N22186M80517L94442J74680
12739E546997n7689k89224l91289m63989n36129n67535n58181m57857l33642k17976
12729A673486j58026j05215n4913k5783m1161q311J6832L293k06L5557L6376M0911
12717A412840L9902O4305J10413R9817N7391j0036q037o0757r7458j76867k04778
12706A226735k20928k03897j39005r4871n4564j7091N959q752K5435p957l4988
$$ plain form
12781 3501514 3394759 3289656 3194616 3117406 3088276 3075191 3050604 3000149 2935011 2839317 2780625
12770 2780625 2732890 2685250 2659296 2622950 2542727 2486699 2438327 2390166 2321220 2264986 2214890
12759 2214890 2153171 2109823 2052695 1983013 1925468 1896733 1883756 1871459 1849907 1902776 2031251
12748 2031251 2249418 2554332 2990795 3465915 3975172 4497358 4977875 5372317 5546997
12739 5546997 5489308 5200084 4808795 4344806 3808677 3241142 2682961 2225104 1891462 1673486
12729 1673486 1515460 1410245 1355332 1329549 1288388 1280077 1296909 1300202 1299996 1335553 1371929 1412840
12717 1412840 1452742 1517047 1627460 1727277 1784668 1774632 1766595 1705838 1608380 1431513 1226735
12706 1226735 1005807 801910 662905 568034 513470 496379 502338 493586 519021 511064 476076
12695D76076j1562M495l661J5320J593R656K4591q541j068R014K6754j3128K8409
12682E57948R684O703K6247r553k3823r911K0761k229l0967j7643J020l3797l4230
12669D60210j5744o97Q996K3491K337m4153n5235m3200l5908k1389j1389P721
12657B75040o199L225k0183M76J4098K406l0189j6728J0164n53O243Q950q854
12644B37896l2072n959j8126L461L1413K8455o812M536L4582M7998N0937L4136
12632D10445J7734J2368m240n285l9739n2176j1472l5588j7080l0547j022r99
12620B42399p213j4564J2403j3032j9941J154j9047n860n199L549k3376K0436
12608A71709j2588j6394k2445j7639K2427l926m4042m678K4656J5787J0505l037
$$ plain form
12695 476076 464514 469009 465348 480668 482261 491917 516508 507967 506899 515913 542667 529539 557948
12682 557948 567632 574335 600582 591029 567206 557295 578056 575827 544860 527217 528237 494440 460210
12669 460210 444466 443769 452765 476256 478593 434440 379205 336005 300097 278708 267319 275040
12657 275040 268841 272066 251883 252359 266457 268863 238674 221946 232110 231557 237800 246750 237896
12644 237896 205824 199865 181739 185200 216613 245068 238256 242792 277374 325372 376309 410445
12632 410445 428179 440547 436307 431022 391283 339107 327635 292047 274967 244420 243398 242399
12620 242399 235186 220622 233025 219993 200052 201206 182159 176299 171100 174649 151273 171709
12608 171709 159121 142727 120282 102643 125070 121144 77102 72424 97080 112867 123372 120335
12596A20335J0743J0839l613j2646j1381j9223p137K7892l2392l4886j098j0536
12584C6897m971J1364j8370k0138K3665j527Q16j4224k3363O155L352K1276j0727
12571A0205k4340J1951J4069q924q587j2470R489Q969J0879L1865K1977k9040
12559C6043J3590L5998J5096k482l7397k0030j0588J4547R210J8746k9537j8574
12547B4622P220k0792k0597J3035n459L0625P402J152j5527j7294j2166j7866
12535b5645j4096J8155J1624L2357R340l4019l549J3835K0253J5903J6895o359
12523E4694l914k2163J757M131J6745J1435J996j9197k9723K2098p451L197R620
12510D3225j75k4682j1798j6854r970K3518r196J0562L317r228Q007K5626R769
$$ plain form
12596 120335 131078 141917 138304 125658 114277 95054 87917 115809 83417 48531 47433 36897
12584 36897 31926 43290 24920 4782 28447 26920 27736 13512 -9851 -3696 -344 20932 10205
12571 10205 -14135 -2184 11885 2961 -5626 -18096 -8607 362 11241 43106 65083 36043
12559 36043 49633 85631 100727 98245 60848 40818 30230 44777 53987 72733 43196 24622
12547 24622 31842 11050 -9547 3488 -1971 28654 36056 37208 21681 4387 -7779 -25645
12535 -25645 -39741 -21586 -9962 22395 31735 -2284 -5833 8002 28255 44158 61053 54694
12523 54694 50780 28617 30374 34505 51250 62685 64681 45484 15761 37859 30408 33605 43225
12510 43225 43050 18368 6570 -10284 -20254 3264 -5932 4630 7947 -1281 6726 32352 42121
12497D2121l663J6664j8690j6979j9153j5254p028o754j0048J2878l046J9500
12485i452R712j4371j2435J1895Q931P773K3783N597j5007p853J484j0963L8992
12472C8086K5085p893M387k6638m1801p43k241J8831o038J6364j150k7631J4655
12459C273K7233L3852j366j4748k237p493P735K3636J0552j0471K4233J9199L1853
12446A45251J2001K5610M6849Q4809J00973J26555J65442J97269K17906K03550
12436A326215J81191R1634L3937m5931q0692j48908j72179j93763j63231j29606
12426F98667j24097o4413o3498k5596k0209j8018j1182J0549M2244K9714N7504
12415E11665J30996J07296J14182J23687J43172Q2340K8381k3861q2663q8814
$$ plain form
12497 42121 38458 55122 36432 19453 300 -14954 -21982 -28736 -38784 -25906 -28952 -9452
12485 -9452 260 -14111 -26546 -14651 -5720 2053 25836 31433 16426 8573 10057 -906 38086
12472 38086 63171 55278 59665 33027 -8774 -9517 -11758 7073 1035 17399 16249 -11382 3273
12459 3273 30506 64358 62992 48244 46007 38514 46249 69885 80437 69966 94199 113398 145251
12446 145251 157252 182862 229711 314520 415493 542048 707490 904759 1122665 1326215
12436 1326215 1507406 1599040 1632977 1587046 1506354 1357446 1185267 991504 828273 698667
12426 698667 574570 510157 446659 421063 400854 382836 371654 382203 424447 454161 511665
12415 511665 642661 749957 864139 987826 1130998 1213338 1241719 1217858 1135195 1046381
12405A046381j10061j46314j17237n9945n1484m1541j7016J2846n309l8922p944
12394D63454l1651l1084k0317j584j6021J784N5410J4261k49k607p806l9934k2658
12381C60998K2740N555l254J3102N0392O2856Q5027O9158L5057J5002J9697O467
12369G42797m4613n2913n5012n1736p2417m6669l6515l6278j6721K5568K0385
12358C75876Q881M505J4131l142n840J8443J9808q912n344o757j6984k1982l9563
12345C33120q711p617p238j2048p436l512K0706K8879L0465j28j3816J73k035
12332C50802M933k9876l4102k6027k9026n4453l6432k5719j9525j7565j9221M854
12320F8643K6348k546k6059L7451L608J562k6365j552L0887K1426l277N039M267
$$ plain form
12405 1046381 936320 790006 672769 612824 561340 519799 502783 515629 510320 471398 463454
12394 463454 431803 400719 380402 378818 362797 364581 419991 434252 434003 431396 423590 383656 360998
12381 360998 383738 389293 386039 399141 449533 512389 597416 666574 701631 716633 736330 742797
12369 742797 698184 645271 590259 538523 466106 419437 382922 346644 329923 355491 375876
12358 375876 384757 389262 403393 400251 394411 412854 432662 423750 418406 411649 394665 372683 333120
12345 333120 324409 316792 309554 297506 290070 286558 307264 336143 366608 366480 352664 352837 350802
12332 350802 355735 325859 291757 265730 236704 182251 145819 120100 100575 83010 63789 68643
12320 68643 94991 92445 66386 103837 107445 109007 82642 81090 111977 133403 130126 135165 139432
12307A39432O634q684j5687k0875j9406m402K288J0965l7146l0784R589J9409
12295E1333P88k592k6700P61R207l1880m5838N071L9602M7902l250l1158j5984
12282b738J458j7092L601O118K0476m919P467m364q968k0670j3602J3866J8823
12269e44R052j8183j1545o674K3554K1024j336J1287K1397j3044j2473j2905l4285
12256b4675J3061k855j7474J2272K5729j2201n016r750N282j9868j1483j5479
12244f2457j0736J4632k1300r052J6228J3654K3362J3730o208J7311q836l6732
12232e6404l005L8143R952O550M116J6504J2137J881K67Q005R447l1146j6275
12219A72j0121m390J0010J010k137k1388l498K1099K3252j1884k2185m875O065
$$ plain form
12307 139432 146066 137382 121695 100820 81414 77012 79300 90265 53119 22335 31924 51333
12295 51333 52121 49529 22829 23590 32797 917 -44921 -39850 -248 47654 44404 13246 -2738
12282 -2738 -1280 -18372 -14771 -8653 11823 6904 14371 10007 1039 -19631 -33233 -19367 -544
12269 -544 8508 -9675 -21220 -27894 -4340 16684 15348 26635 48032 34988 22515 9610 -24675
12256 -24675 -11614 -14469 -31943 -19671 6058 -6143 -11159 -20909 -15627 -35495 -46978 -62457
12244 -62457 -73193 -58561 -79861 -88913 -72685 -59031 -35669 -21939 -28147 -10836 -19672 -56404
12232 -56404 -59409 -21266 -11314 -4764 -648 15856 27993 29874 30141 38146 47593 16447 172
12219 172 -9949 -14339 -4329 -3319 -5456 -26844 -30342 -9243 14009 2125 -20060 -24935 -18870
12206a8870J9968J2984l92o517m4201k2563J6884J5123O523J9324k99j749j2908
12193a6693k0737O897J7984J0345L1162J1327k720k6669j9614n309j1947l9088
12181f5062j25K2937Q326M287K5437K0035J8143p586l3900l0226j0561J2043J7253
12168a8999J9592j4217j7619j1790M7027L1019p62L002l6798j9726O289R001M581
12155F00O349o340k1866L050p433J448J5793L5570Q47r515l914j9994j4756p360
12141b7521K152J0144j7372o393J2566J3524r79r108l892p403k7268J0153L0426
12128b0971k932k552L908R76L501J866k7222P888K1751K4761j1438P320J2787
12115A9643J4883J6358k5807l4323k4825k9615J4312J9596L4012j937n237k9996
$$ plain form
12206 -18870 1098 14082 13690 7173 -37028 -59591 -42707 -27584 -21061 -1737 -2036 -3785 -16693
12193 -16693 -37430 -30533 -12549 -2204 28958 40285 37565 10896 -8718 -14027 -25974 -65062
12181 -65062 -65187 -42250 -33924 -29637 -4200 15835 33978 26392 -7508 -37734 -48295 -36252 -18999
12168 -18999 593 -13624 -31243 -43033 3994 35013 34251 37253 455 -19271 -12982 -3981 600
12155 600 6949 609 -21257 -18207 -25640 -24192 -8399 27171 28018 18503 14589 -5405 -20161 -27521
12141 -27521 -25369 -15225 -32597 -38990 -26424 -12900 -13879 -22987 -26879 -34282 -61550 -51397 -20971
12128 -20971 -23903 -26455 -22547 -21571 -18070 -16204 -43426 -35538 -13787 10974 -464 6856 19643
12115 19643 34526 50884 25077 -9246 -34071 -63686 -49374 -29778 4234 2297 -2940 -32936
12103c2936j23K2121j6236k141P68q936L128q167K962J6945j4725n043P098l255
12089c8540n234R706J9250J3824l515J9933l679l4091j5281J9034K1799K19j0450
12076g025p257K4976k7548q962j7724l315l226L589L96P465q623n809M380J1596
12062c7087K2453J4931k932j93k2361j2483k098N27J31r713L472K2919M681l2555
12048e0308j0132K8623j1761k319j8691M303O602K375k8405K5996K1111J4039
12036a8567j1191K6572m539j6982J6066J5833J4083L060O841M746J4175q321m3937
12023b161o724J3058m653k1214j5339j1960r484Q930J1439K5196O386L2573J5786
12010D1833j2181j6972P83j602j2272P782J675j5479l6132n717K1866L270l9954
$$ plain form
12103 -32936 -33059 -10938 -27174 -29315 -28547 -37483 -34355 -42522 -39560 -22615 -37340 -42383 -35285 -38540
12089 -38540 -43774 -34068 -14818 -994 -4509 15424 11745 -22346 -37627 -18593 3206 3425 -7025
12076 -7025 -14282 10694 -16854 -25816 -43540 -46855 -50081 -46492 -46096 -38631 -47254 -53063 -48683 -37087
12062 -37087 -14634 297 -2635 -2828 -25189 -37672 -39770 -39243 -39112 -48825 -45353 -22434 -17753 -50308
12048 -50308 -60440 -31817 -43578 -45897 -64588 -60285 -53683 -51308 -79713 -53717 -32606 -18567
12036 -18567 -29758 -3186 -7725 -24707 -8641 7192 21275 24335 31176 35922 50097 41776 -2161
12023 -2161 -8885 4173 -480 -21694 -37033 -48993 -58477 -49547 -38108 -12912 -6526 26047 41833
12010 41833 29652 12680 13463 11861 -411 7371 9046 -6433 -42565 -48282 -26416 -23146 -63100
11997f3100q897L1096Q317R727P81q473l0351J5255K822K6411J4238R310o027
11984A109j1441K450K2300J0476k9474k5375p83j3300N226L265M1845Q185l5620
11971b1137j6641k811M735l6144k8137j2517K8333K7785J0226K3624j1851J2778
11959b1757K3590m936l0178J0114K4557J7585O148j7049k4087j2609j3738k737
11947d5097j0218J6701J4201j8114J5109L1138n839q112J866J8616P643m758O63
11934A3799j1483j1992l5359j4785j8058j4417K0904K825l0905J9506J9299K8074
11922c2592L1417J2968k396K4298q836k6419q344r883j9165k0849k4467J5059
11910f9209K5390J6440K820j5066L8421K0723j0623j3450j8410r057P98K8135
$$ plain form
11997 -63100 -71997 -40901 -32584 -22857 -22076 -30549 -60900 -45645 -42823 -16412 -2174 7136 1109
11984 1109 -10332 -7882 14418 24894 -4580 -29955 -30738 -44038 -38812 -35547 6298 14483 -21137
11971 -21137 -37778 -40589 -35854 -71998 -100135 -112652 -84319 -56534 -46308 -22684 -34535 -21757
11959 -21757 1833 -3103 -33281 -23167 1390 18975 25123 8074 -16013 -28622 -42360 -45097
11947 -45097 -55315 -38614 -24413 -42527 -27418 3720 -2119 -10231 -8365 10251 17894 13136 13799
11934 13799 2316 -9676 -45035 -59820 -77878 -92295 -71391 -68566 -99471 -79965 -60666 -32592
11922 -32592 -1175 11793 9397 33695 24859 -1560 -9904 -19787 -38952 -59801 -84268 -69209
11910 -69209 -43819 -27379 -24559 -39625 -1204 19519 8896 -4554 -22964 -32021 -31223 -3088
11898c088R640j1930o666k8591j7020N856K1032L0518m919n4092k201R023J444
11885e0994K4031J1355o533R259O462L97j7774j0162J2890n949j5082j8315r926
11872g0341j813J1337K7961l317p493M856j3958J0323j7197J8565L0979M306J7564
11859A1772k8056l9838K2683J5608j987r649M429k819k3699k8061L0877J0776
11847c7964N990J3089j6806J5659o967K246k9658r695l177n059R543k1350J1977
11834g2172L5229j5601J1751O578J9746N241O834K645r739k9116K435K8116J1241
11821C188k4753r053k5230p237P098J8829o294R962J7446M019k0892q144P24K7920
11807a2417j7468j1900r724k0081K2710J635Q808k29p424J1373J0776L7591J7533
$$ plain form
11898 -3088 6552 -5378 -12044 -40635 -57655 -51799 -30767 -249 -5168 -59260 -61461 -52438 -50994
11885 -50994 -26963 -15608 -22141 -12882 -6420 -6023 -23797 -33959 -21069 -27018 -42100 -60415 -70341
11872 -70341 -72154 -60817 -32856 -36173 -43666 -38810 -52768 -42445 -59642 -41077 -10098 -5792 11772
11859 11772 -16284 -56122 -33439 -17831 -19818 -29467 -25038 -27857 -51556 -79617 -48740 -37964
11847 -37964 -31974 -18885 -35691 -20032 -26999 -24753 -54411 -64106 -67283 -72342 -62799 -84149 -72172
11834 -72172 -36943 -52544 -40793 -34215 -14469 -9228 -2394 251 -9488 -38604 -36169 -8053 3188
11821 3188 -21565 -30618 -55848 -63085 -55987 -37158 -43452 -33490 -16044 -12025 -32917 -41061 -40337 -12417
11807 -12417 -29885 -41785 -51509 -71590 -48880 -47245 -38437 -38666 -46090 -34717 -23941 13650 31183
11794C1183r193k2830n730J930N134J6598l541k0698l5185j836j3210m721J1213
11781e0886j3427O025J7603k0640m708r286J8978L4089M962j058K2548j7218j224
11768a4242K2404J0880k5676j6649M865j549k9490k957L366j391K3779J2935o27
11755a4352k48j8821R227P528J0290P901l2532J1739J7525R034j4380q24l033
11742a0946j911Q046j7613n359j10K0152K8635J1003L039m897k1269l0270j9645
11729d1145K125Q695N420J0352J0636j392J2181k0601j6684J62K5864K0390q584
11716G419j5717l06K0597j5144o656K2546k111k5471l4391L6383K3805J0177L686
11703B4817R181J9634m008j738J8038l2719l8532r02m583j4705l8284l2070J3999
$$ plain form
11794 31183 21990 -840 -6570 -4640 494 17092 13551 -7147 -42332 -44168 -57378 -62099 -50886
11781 -50886 -64313 -58288 -40685 -61325 -66033 -75319 -56341 -22252 -17290 -18348 4200 -13018 -14242
11768 -14242 8162 19042 -6634 -23283 -18418 -19967 -49457 -52414 -49048 -50439 -26660 -13725 -14352
11755 -14352 -14600 -33421 -24194 -16666 -6376 1525 -31007 -19268 -1743 7291 -7089 -7913 -10946
11742 -10946 -12857 -4811 -22424 -27783 -27893 -7741 20894 31897 34936 30039 8770 -21500 -41145
11729 -41145 -39020 -30325 -24905 -14553 -3917 -5309 6872 -13729 -30413 -30251 -4387 16003 7419
11716 7419 -8298 -8604 11993 -3151 -9807 12739 10628 -14843 -49234 -12851 10954 21131 24817
11703 24817 33998 53632 49624 47886 65924 33205 -5327 -6229 -10812 -25517 -63801 -95871 -81872
11690h1872N612J2336J8109N343j1239j0069J8197K1448J8995J1139j560l211
11678C228l516m269Q237L8980p209j3116o89j340k7177q277K6205k1846r713J3534
11664f968j0639j0609P076k32P000n745j5061k995q773m519J344K824k3424J386
11650f9335J9714R761J3602Q553J0411L796k0040N799j219L113L114q550k5769
11637d7050j6925r637l343J7849J8059K5933K9873k0368k8910k0577j7901n571
11625g8568k455K0804P138j4789O251l622j533P827p734L4594L8692m496m9429
11612d7320M338J6679K1564K582R376K905k0235J2522L7293q324j8603K631q377
11599G031J7489r882O241j7865j7229K0285k0815J4799l864l5554j6145J8880
$$ plain form
11690 -81872 -76260 -63924 -45815 -40472 -51711 -61780 -43583 -22135 -3140 7999 6439 3228
11678 3228 -288 -4557 3680 42660 35451 22335 21646 20306 -6871 -15148 11057 -10789 -20502 -6968
11664 -6968 -17607 -28216 -21140 -21372 -14372 -20117 -35178 -38173 -46946 -51465 -50121 -47297 -70721 -69335
11650 -69335 -49621 -39860 -26258 -17705 -7294 -3498 -23538 -17739 -18958 -15845 -12731 -21281 -47050
11637 -47050 -63975 -73612 -76955 -59106 -41047 -15114 14759 -5609 -34519 -55096 -72997 -78568
11625 -78568 -81023 -60219 -53081 -67870 -61619 -65241 -66774 -58947 -66681 -32087 6605 2109 -47320
11612 -47320 -42982 -26303 -4739 -2157 7219 10124 -10111 2411 39704 31380 12777 15408 7031
11599 7031 24520 14638 20879 3014 -14215 6070 -14745 54 -3810 -39364 -55509 -36629
11587c6629L4611M739k2886l9030r673J1108j976R280K5912J5718R762j9624j1511
11574c0199J1351J1349j051J2972N466k1233o935j3487J6324J2726J1823J3287
11562B2393j8982j1074j4344K2431K8739R917R116l0015l4810j5628j1825q046
11550e2128j7787J3170J9979J6089J1008L562k9298N878K0832K2015r325l7311
11538c3316K0134K8627Q616j837j5153J774J7349K9366l3285k1492N448j775P477
11525A1933J1479K2136m14n194Q91J2670j1022j1626J2766J7689k6231j3599j3760
11512G718l4200j8041J5207P867J3630j9553J5407J0345k7225k3477K7999J0246
11500a4077j1637R82J3371j660J0733k087j8843k7613K2478O760r780J5470J3621
$$ plain form
11587 -36629 -2018 2721 -20165 -59195 -68868 -57760 -59736 -50456 -24544 -8826 936 -18688 -30199
11574 -30199 -18848 -7499 -8550 4422 9888 -11345 -18280 -31767 -15443 -2717 9106 22393
11562 22393 3411 -7663 -22007 424 29163 39080 48196 18181 -16629 -32257 -44082 -52128
11550 -52128 -69915 -56745 -36766 -20677 -9669 -6107 -35405 -29527 -8695 13320 3995 -33316
11538 -33316 -13182 15445 24061 22224 7071 8845 26194 55560 22275 783 6231 4456 11933
11525 11933 23412 45548 45134 39940 40831 53501 42479 30853 43619 61308 35077 21478 7718
11512 7718 -26482 -44523 -29316 -21449 -7819 -27372 -11965 -1620 -28845 -52322 -24323 -14077
11500 -14077 -25714 -24732 -11361 -13021 -2288 -4375 -23218 -50831 -28353 -21593 -31373 -15903 -2282
11487b282r078k1044K2520L6305J2440k2054j7136M67L7681P991m0662J335R804
11474A6287p687P87J8348o435j2747j9427K3973K7940j9399m5463R244Q89L6266
11461B2576J7883J4337l514k4984k0269J8845j5335k8807l928K8243q79J3638
11449A7806Q044q728k1770j4438k0864R207j037R505r9k420N3J5435K7724j454
11435A6964p650Q740J7411n76r37J0946k436j6176j2690l0j9446K565o846L873
11421f288K333m582K3559J2345k4814K0731k2671k770J2211j5711Q930J8898j0639
11408A1532O3j7486J8996J5753L2634J2737j9481k9556l3894j6243J5676J6562
11396G293J2057M347N664M138k7579j9277J5129l040q695K859J0768L0050K9376
$$ plain form
11487 -2282 -11360 -32404 -9884 26421 38861 16807 -329 138 37819 45810 5148 6483 16287
11474 16287 8600 9387 27735 21300 8553 -10874 13099 41039 21640 -23823 -14579 -13690 22576
11461 22576 40459 54796 51282 26298 6029 24874 9539 -19268 -23196 5047 4168 17806
11449 17806 25850 17122 -4648 -19086 -39950 -30743 -31780 -22275 -22374 -24794 -24741 -9306 18418 16964
11435 16964 9314 18054 35465 34889 33952 44898 42462 26286 13596 13566 -5880 -3315 -10161 -6288
11421 -6288 -3955 -8537 15022 27367 2553 23284 613 -2157 10054 -5657 3273 22171 11532
11408 11532 11595 -5891 13105 28858 61492 74229 54748 25192 -8702 -24945 -9269 7293
11396 7293 19350 23697 29361 33499 5920 -13357 1772 -1268 -9963 -7104 3664 33714 63090
11383F3090j3261J3509j0538j9703k3159J9062r073R212m863K076J6312j1706
11371C0958l6134l0505O538J5876L4865L303k7950l2155P686K7901K0075o448
11359A4010j2925n093j2550L1191L6812Q296l0486j7045J0260k4111Q81K745L9602
11346D1587l95p283L692O864k8498p447k021K7325L352p446l0120K8150K9990
11333E7750Q399j5875J3044K1735M053l223j3557M526q834j0380M005j1169k3851
11320B6623n12r470j4485r297J8599K1948Q882p702K3030J0006j637J4127M715
11307H4827m631j5310o091J9030l781k9483l5082J9610J3234j6266j078j3124
11295A1855J9857J5992K0465P866o79k5554j1539J23k817j0136k9328L243J9247
$$ plain form
11383 63090 49829 63338 52800 33097 9938 29000 19927 29139 24276 26352 42664 30958
11371 30958 -5176 -35681 -29143 -13267 21598 24901 -3049 -35204 -27518 383 20458 14010
11359 14010 1085 -4008 -16558 14633 51445 59741 29255 12210 22470 -1641 -760 1985 41587
11346 41587 41192 33909 37601 44465 15967 8520 6499 33824 37176 29730 -390 27760 57750
11333 57750 66149 50274 63318 85053 89106 85883 72326 76852 68018 57638 61643 50474 26623
11320 26623 26111 16641 2156 -7141 11458 33406 42288 34586 57616 67622 65985 80112 84827
11307 84827 80196 64886 58795 77825 74044 44561 9479 29089 42323 26057 24979 11855
11295 11855 31712 47704 68169 76035 75356 49802 38263 38386 35569 25433 -3895 -652 18595
11282A8595Q068K5924n401k8616J3641q302K9891J7526j7088k4299j0294m608
11270A5037k871j6690O561J8334n450J4004J981K9379L0185l289n889r493k1262
11257E0537K6188K9011M4297L869k1336j7705l0536j9318J7997J5752P856j2256
11245I4356j3869j2814j2700j4979j2464J5934j1186j3109K614k814J1809K3874
11233E4652J385o432k6628l2565j3220J1143J5771N771K5897O913k1184O55L0623
11220E2781k2049j2481l541K0524k4717J6401L6219M894J1635k8065P178j6110
11208D2669J4182L5105j0085l1863R8JJ3353M742R419m986k361j9772k0698j700
11194B8104k5240j9703J4606P034q268K0129r490q376j7777k325K3876o543J5307
$$ plain form
11282 18595 26663 52587 47186 18570 32211 23909 53800 71326 54238 29939 19645 15037
11270 15037 12166 -4524 2037 20371 14921 28925 30906 60285 90470 87181 81292 71799 50537
11257 50537 76725 105736 150033 153902 132566 114861 84325 65007 83004 98756 106612 94356
11245 94356 80487 67673 54973 39994 27530 43464 32278 19169 21783 18969 30778 54652
11233 54652 56037 49605 22977 -9588 -22808 -11665 4106 9877 35774 42687 21503 22158 52781
11220 52781 30732 18251 14710 35234 10517 26918 63137 68031 79666 51601 58779 42669
11208 42669 56851 91956 81871 50008 50106 50107 63460 68202 77621 72635 70274 50502 29804 28104
11194 28104 2864 -16839 -2233 4801 -3467 16662 7172 -1204 -18981 -21306 2570 -3973 11334
11181A1334l825k3099r415k4948L1390K5038M864j2959k1492J889K0845K5892
11169B5514j3090N648L3753J4026k1099j3036j1704k3141Q642L6097k8447P242
11157B0405j877k509r72p253N105j43K9504k3210m1454j1669L6176j5670O074
11144g493J2601J718K165j2109j3710J3345J0446L781R756O219j6399J6038K8775
11131E5133j0146l0844J1494L1082O536k1315j2935k4397m649r751k431R16j1075
11118b2382P896M880p261K8665o325j2726p552k797n364K1688j6345m780K3809
11105A406J790K0176r306P274l7824J050J6413q563j1364Q152J4112J1422r161
11092E577K545p34M608K1079K0022j7347k4892k87r110p023K3971j3158R064M902
$$ plain form
11181 11334 7509 -15590 -25005 -49953 -18563 6475 11339 -1620 -23112 -21223 -378 25514
11169 25514 12424 18072 51825 65851 44752 31716 20012 -3129 5513 41610 13163 20405
11157 20405 18528 16019 15047 7794 12899 12756 42260 19050 -22404 -34073 2103 -13567 -7493
11144 -7493 5108 6826 8991 -3118 -16828 -3483 6963 10744 20500 26719 10320 26358 55133
11131 55133 44987 14143 25637 56719 63255 41940 29005 4608 -41 -9792 -12223 -11307 -22382
11118 -22382 -14486 -9606 -16867 11798 5473 -7253 -14805 -17602 -22966 -1278 -17623 -22403 1406
11105 1406 3196 23372 14066 21340 -16484 -15434 979 -7584 -18948 -10796 3316 14738 5577
11092 5577 8122 7388 11996 33075 53097 35750 10858 10571 1461 -5562 18409 5251 14315 19217
11078A9217R241j3676J169P117K2375K0248Q47k82m956l4337j646J8346j8401
11065B5262q029j32j2175n512o187K5319J5489l8109o173L0602m070o22J4921
11052C0584J8245j9890k4296J2077J1740j9181l371n781O90j3387k3021K3437
11040a2154L163R286M2843K5929p236J262j4610k1851J0064J7410l1221k1242
11028A643Q487K2547l958m468J5436L2317K753j1370p773Q002j7465j0873J4367
11015D9645R246r009l4267j8729p203K797J7218P711R860j2790J0334R119J3246
11002D7178J5049j5275L288L425J588J734K6181K1665J432j4560k9760k1445Q206
10989D8706r415k5335k0960K3102K135k0727N432L7262m262n403J7800L4342Q237
$$ plain form
11078 19217 28458 14782 15951 23068 45443 65691 66538 66256 61300 26963 25317 43663 25262
11065 25262 17233 17101 4926 -586 -6773 18546 34035 -4074 -10247 20355 16285 15663 30584
11052 30584 48829 28939 4643 16720 28460 9279 5908 127 817 -12570 -35591 -12154
11040 -12154 -8991 295 43138 69067 61831 63093 48483 26632 36696 54106 22885 1643
11028 1643 10130 32677 28719 24251 39687 72004 74757 63387 55614 63616 46151 35278 49645
11015 49645 58891 49882 15615 -3114 -10317 -7520 9698 17409 27269 14479 24813 33932 47178
11002 47178 62227 46952 50240 53665 55253 56987 83168 104833 106265 91705 61945 40500 48706
10989 48706 39291 13956 -7004 16098 18233 -2494 2938 40200 35938 30535 48335 82677 90914
10976I0914o805l1504r930j2592k0863j2012j3039K3797J3106k2098j7038R638
10964h426K1642R403M523k8784j133J5276m1357k3793J3882K8271q856P013k396
10951a4735O176K0775J3490r981j7730m981O849J0733N471O464K4722J0980q569
10938D9664k019k6080j0736j6971k6864N290J1824k4873p576J1992J7694K2693
10926D038J2032J0498L574l6289P497K3816M967q518j7963M138N616n500r754
10913a848M347N447J6706K4009L59k3736l1329M554J0895K647J3797j29k4200
10900A519m970O966J0035Q722j0169l3149j0057O816L808K9759l6010r461L0042
10887f149J4088l3738l2098P58L3281L8449l562n134M583P428r444M29r693M708
$$ plain form
10976 90914 84109 52605 42675 30083 9220 -2792 -15831 7966 21072 -1026 -18064 -8426
10964 -8426 13216 22619 27142 -1642 -2775 12501 -28856 -52649 -38767 -10496 -19352 -12339 -14735
10951 -14735 -8559 12216 25706 15725 -2005 -6986 -137 10596 16067 22531 47253 58233 49664
10938 49664 47645 21565 10829 -6142 -33006 -27716 -15892 -40765 -48341 -36349 -18655 4038
10926 4038 16070 26568 30142 -6147 1350 25166 30133 21615 3652 7790 13406 7906 -1848
10913 -1848 2499 7946 24652 48661 49020 25284 -6045 -1491 9404 12051 25848 25719 1519
10900 1519 -3451 3515 13550 22272 12103 -21046 -31103 -24287 -20479 9280 -26730 -36191 -6149
10887 -6149 7939 -25799 -57897 -57139 -23858 14591 11029 5895 10478 17906 8462 8891 -802 3906
10873C906j0175j1130J4339J1044J9056j1903j2109J5073j5073j8832J2378j1610
10861a5036j0080J679L8591K6049l822J8489r893n653n894k0586j1652K2863P901
10848C2956k1320R04J6577J281J5342M1045j7470k8211j1127j4525K7412j1925
10836C0939j2322L618j4941J560j0039O465P781r31J7348K4020J351m260l729
10823D6860k7068m7814j5047K2013j8475j2326L4088M233j2205K6723K1190q77
10811B1295k5646l9576J7551k127L2317K0757m599j7749l1210k739r240J3814
10799b7152O922l007j7048J7014J1012L417q891R701j2455k9305J8903L1984N172
10786F267K520K1458K1001j462L751L122j8937j2285L944k5754j2924P924k0288
$$ plain form
10873 3906 -6269 -17399 -3060 7984 27040 15137 3028 18101 3028 -15804 -3426 -15036
10861 -15036 -25116 -23437 15154 41203 37381 55870 45977 40324 34430 13844 2192 25055 32956
10848 32956 11636 12540 29117 30398 45740 86785 69315 41104 29977 15452 42864 30939
10836 30939 18617 22235 7294 8854 -1185 5280 13061 12130 29478 53498 54849 50589 46860
10823 46860 19792 -28022 -43069 -21056 -39531 -51857 -17769 -13536 -25741 982 22172 21295
10811 21295 -4351 -43927 -26376 -28503 3814 24571 19972 2223 -28987 -31726 -40966 -27152
10799 -27152 -20230 -23237 -40285 -23271 -12259 -8842 -17733 -8032 -20487 -49792 -30889 1095 6267
10786 6267 8787 30245 51246 49784 53535 56657 37720 25435 29379 3625 -9299 -1375 -21663
10773b1663L2626K5953P452j8213j3101j6909k851k0558J758j029J7620j4113
10761b3028K1456M587j1916J8743K3600J8578j5550n177Q30J709M331j0295K0944
10748D8812l860R330j2066p771J6368M270P368j3515j141j458J2949J307J2610
10735G3203r275Q862J749j5200j5531r818M783j6066k6788n626k1159o285J6553
10722b0598J5317Q006j7437j26K1944L982j2756K5689J9052J3496Q696r762l4795
10709B0708q975j6115j4311L2311K684j854R014k669J0172L7879L270m2451l2499
10696b836J6897J1517l690q247J5627N1454Q60k1509N06j8914l3461r84m620n851
10682c251o352N681J8548K4825R395m1128k8566J1126J2414n765J2326J4687n686
$$ plain form
10773 -21663 10963 36916 44368 26155 13054 -3855 -6706 -27264 -25506 -26535 -8915 -23028
10761 -23028 -1572 3015 -8901 9842 33442 52020 36470 31293 32123 33832 38163 27868 48812
10748 48812 44952 54282 42216 34445 50813 55083 62451 48936 47795 46337 59286 60593 73203
10735 73203 63928 72790 74539 59339 43808 33990 38773 22707 -4081 -9707 -30866 -37151 -20598
10722 -20598 -5281 2725 -14712 -14838 7106 11088 -1668 24021 43073 56569 65265 55503 20708
10709 20708 11733 -4382 -18693 13618 16302 14448 23462 20793 30965 68844 72114 29663 -2836
10696 -2836 14061 25578 21888 13641 29268 80722 81582 60073 60579 41665 8204 7220 2600 -3251
10682 -3251 -9603 -3922 14626 39451 48846 7718 -20848 -9722 2692 -3073 9253 23940 18254
10669A8254O880M85N695L6132O115j0472n855k81l9713J6666M990r111R485J0930
10655E0200J1712R95q120N323Q342n153K1876N624J2209r3j8306j6678K161M4481
10641A14573J4220p564l7061m4537P708K6112j2144J1105J3220M928j3771J0617
10629H7406n826l1154K3037J6063N22k5026J6475M2860k53k8042j6444l1049R489
10616E8058O9318M6396K7769j5925n634n526K1198J8045J4399j1020j0996k1604
10604A84478m261K259P078J7430J2289K8164J4940q068J6082K6234J0184r654
10592B97155j6519J6707J8815j4588q774l901q736m806J5003K2848j5238n211
10580B92755L018K0485M1868R762K570L610m21q215L5794L4925J7374J0754L4867
$$ plain form
10669 18254 25134 25619 31314 67446 73561 63089 57234 56953 17240 33906 38896 29785 39270 50200
10655 50200 61912 62907 54787 60110 68452 63299 85175 90799 103008 102915 84609 67931 70092 114573
10641 114573 128793 121229 84168 39631 47339 73451 61307 72412 85632 90560 76789 87406
10629 87406 81580 50426 73463 89526 90048 65022 81497 124357 124104 96062 79618 48569 58058
10616 58058 127376 173772 201541 185616 179982 174456 195654 213699 228098 217078 206082 184478
10604 184478 180217 182476 189554 206984 219273 247437 262377 254309 270391 296625 306809 297155
10592 297155 280636 297343 316158 301570 292796 288895 280159 275353 290356 313204 297966 292755
10580 292755 295773 316258 358126 367888 370458 374068 373647 365432 401226 436151 453525 464279 499146
10567D99146J9833L283l5971o5882l7851k6201L440j3739j9181l3699J3891J8993
10555C26062m025j3611K942J0518M008j0319m8886k0404J2783J8749l214l5658
10543B38945p797J4200j02O458J7127K3570J0075K534K343j6919k7376J1511M745
10530B79314j2427k3814J7421M5615J8570m0141k3857l2141n8585l7487J257j6392
10518A17333N838K7113J3839k1120L260k6676p167J652J9929L853J0898J435J037
10505A51224k7895j414J7359o270l3410j1390J1639j9895L269K0722l805p971
10493I2163Q711J0458k8125k82k1862J278l556m044J5357J3974k002J1929K279
10480I6278M92j519o898l924J0983K3427k2586k9785m940J6683k7062k700R063
$$ plain form
10567 499146 518979 522262 486291 420409 382558 356357 359797 346058 326877 293178 307069 326062
10555 326062 322037 308426 311368 321886 325894 315575 266689 246285 259068 277817 274603 238945
10543 238945 231148 245348 245246 251704 268831 292401 302476 305010 307353 290434 263058 274569 279314
10530 279314 266887 243073 260494 306109 324679 284538 260681 228540 169955 132468 133725 117333
10518 117333 123171 150284 164123 143003 146263 119587 112420 114072 134001 137854 148752 150187 151224
10505 151224 123329 121915 139274 133004 99594 88204 99843 79948 83217 103939 100134 92163
10493 92163 100874 111332 83207 82925 61063 62341 58785 54741 70098 84072 82070 93999 96278
10480 96278 96770 95251 88353 84429 95412 118839 96253 66468 61528 78211 51149 48449 57512
10467E7512J8876J6099K4179p122m2714k7340J3526J3993Q97j4356Q375M507r924
10454E6508J9398N006J524M805J1431l209K0163o956q585J2078p204n410r363
10441I0186j8846j0573o728J7016Q897m9194M256L686k52j7252L6741O4302j0695
10428A11544k8160K618l001r60m0566K7226m942J1291m80k0893R07n53J8688J717
10414G4436J5063K4995l7567k5988P69k3198J2763N1264J0887K5440R012l0021
10402A07855l5576J3347J5570K333k867P4J6251K1559J7626l3582j9055j2595
10390I0940N346O316K0611K8182j0101k5959j281k2823k2524n021k120K2000K1369
10377A04935r193j8937j5931K0763P035K0387L675J9088L1780O862J6367K6339
$$ plain form
10467 57512 76388 92487 116666 109544 66830 39490 53016 67009 67906 53550 61925 66432 56508
10454 56508 75906 80912 82436 87241 98672 95463 115626 108670 100085 112163 104959 99549 90186
10441 90186 71340 60767 54039 71055 79952 30758 35014 38700 38448 21196 57937 122239 111544
10428 111544 83384 86002 83001 82041 41475 68701 63759 75050 74570 53677 54584 54031 72719 74436
10414 74436 89499 114494 76927 50939 51708 28510 41273 92537 103424 128864 137876 107855
10402 107855 72279 85626 101196 103529 100662 100736 116987 138546 156172 122590 103535 90940
10390 90940 96286 102602 123213 151395 141294 115335 114054 91231 68707 63686 61566 83566 104935
10377 104935 95742 76805 60874 81637 88672 109059 112734 131822 163602 170464 186831 213170
10365B13170L710k326N838j4942J4376M0031J6815N0663K8210J3671M8944O5817
10353D83977N4469O8295O6310P4449P5070J20356K06609K79622M06055N74796
10343B410008P21915Q66514R40696R04329Q12335O01078L00202l7482m03946o63145
10333F452504q36411r42587r45848q28707o65166m65040l11729j74805q2252p6906
10323A123053p7536p5377l3585j4872n5904l9844m5266k8953m2538n8229l3387
10312F17562j6746j3316q461l9150n676l9542j7954Q213M760j3777o881k0503
10300D48529O507k8465l2919J7050N888N464j1091k4307k1616l7669j5791J3622
10288C25202R869O160j3936o411l6526k5785J8944o876k9092q704J894O784j7393
$$ plain form
10365 213170 216880 214554 220392 205450 219826 259857 276672 327335 355545 369216 418160 483977
10353 483977 538446 606741 673051 747500 822570 942926 1149535 1429157 1835212 2410008
10343 2410008 3131923 3998437 4939133 5843462 6655797 7256875 7557077 7519595 7115649 6452504
10333 6452504 5616093 4673506 3727658 2898951 2233785 1768745 1457016 1282211 1199959 1123053
10323 1123053 1045517 970140 936555 921683 865779 825935 780669 751716 709178 650949 617562
10312 617562 600816 587500 579039 539889 534213 494671 476717 484930 489690 475913 469032 448529
10300 448529 455036 426571 393652 410702 416590 422054 410963 386656 365040 327371 311580 325202
10288 325202 335071 341231 327295 320884 284358 258573 277517 270641 241549 232845 234739 241523 224130
10275B24130j1183M4766J503O120K4012l376j3315j6684J858J192J320j6372k1257
10262B22714R625N034J8340M2468O1551J5033Q07l531K7021L3691K0996L1439
10250D85188J15052J24776K10904K74992K96528L07184L24965M54871M77716L56481
10240C428657J35896J5969K9975Q498k32031m58753m17088l16830k57398l07852
10230A629043l00041k15922j37402r2731r0860q8547n4240l1719n5225l2044l1812
10219D98500k6167j3408o026j0834J857k0883l1596l7977l3703k1133j3184K867
10207B88313M199k1448J628N452O585j0726J3600P171k5869j5548n059O461j5950
10194B38809l0723k0924j818R263L3171n714o808K191J4525Q164L715k4783k5310
$$ plain form
10275 224130 212947 257713 259216 265336 289348 285972 272657 255973 257831 259023 260343 243971 222714
10262 222714 232339 237373 255713 298181 359732 374765 375572 372041 399062 432753 453749 485188
10250 485188 600240 725016 935920 1210912 1507440 1814624 2139589 2594460 3072176 3428657
10240 3428657 3564553 3580522 3610497 3618995 3386964 2928211 2511123 2194293 1936895 1629043
10230 1629043 1329002 1113080 975678 882947 792087 703540 649300 617581 562356 530312 498500
10219 498500 472333 458925 452899 442065 443922 423039 391443 353466 319763 298630 285446 288313
10207 288313 292512 271064 272692 278144 284729 274003 287603 294774 268905 253357 248298 254759 238809
10194 238809 208086 187162 185344 194607 227778 222064 215256 217447 231972 240136 243851 219068 193758
10181A93758j9978o565K2654j2308l2121k9801k7551M7942N6342K03p984J003
10169A85594k2436p128j2434l8763l0553K3216K2619P287j0376K4678J7534q881
10157A50357M750o636k7580K557J9747J5602L039j6701m510J1351p353L533l349
10144A44807j6794O776m099K618j8880o916R846L779l4497p03K9527K1818L834
10131A41116J908j2434n943j6559m055j3509j624K5884J7124J9480k2695l6792
10119I1901p754J8480K3606J279j8784j804J9990n566j7392N415K729Q049j0890
10106A09259j3800J5228o789o006j6322j191J2279N650o27L0442K2145O602j2821
10093A44049k2900j0992j8906N220K4672j713P254j9565j9872j0577N4r219n42
$$ plain form
10181 193758 173780 167215 189869 177561 145440 115639 88088 136030 192372 192575 184591 185594
10169 185594 163158 156030 143596 104833 74280 97496 120115 127402 117026 141704 159238 150357
10157 150357 155107 148471 120891 123448 143195 158797 161836 145135 140625 151976 144623 148156 144807
10144 144807 128013 134789 130690 133308 114428 107512 117358 121137 86640 85937 115464 137282 141116
10131 141116 143024 130590 124647 108088 104033 90524 88900 114784 131908 151388 128693 91901
10119 91901 84147 102627 126233 127512 108728 106924 126914 121348 103956 109371 112100 120149 109259
10106 109259 95459 110687 103898 97892 81570 80379 92658 98308 97681 128123 150268 156870 144049
10093 144049 121149 110157 91251 96471 121143 119430 126684 107119 87247 76670 76724 67505 66963
10080F6963p73L1260K0826p984r784l190J5554J20k2883L121K0541L1711K760
10067A48242k935K2837L876j9946m85l184j9735j3429R175K2757J319Q498j4980
10054A42010R743P857r102j4911j1173j2729L131J7146L0352j0561l0549k5231
10042I5983k3363J6454K5126o730j3737J8778r153J9441j2804N052p113L237J173
10029A12344J023M309J1280K4180n055J8309J1016l6691j4293K295j4336j3567
10017A00814O304J6809J7164m9020j4386J599K6536M526k7674l803J9439J5584
10005A13892J2515m491M260K007n971Q728K5637n418J2387L4180k5141k5405N823
9992A53003L2119L1200j5076k9417k807j1012R0J9364J7357n224j31r124o505
$$ plain form
10080 66963 66190 97450 118276 110292 100508 97318 112872 112992 90109 93230 113771 145482 148242
10067 148242 145307 168144 172020 152074 151589 148405 128670 115241 124416 147173 148492 156990 142010
10054 142010 151753 159610 150508 135597 124424 111695 114826 131972 162324 151763 121214 95983
10042 95983 72620 89074 114200 107470 93733 112511 103358 122799 109995 115047 107934 111171 112344
10029 112344 113367 117676 128956 153136 148081 166390 177406 140715 126422 128717 114381 100814
10017 100814 107118 123927 141091 92071 77685 79284 105820 110346 82672 78869 98308 113892
10005 113892 126407 121916 126176 128183 122212 130940 156577 151159 163546 197726 172585 147180 153003
9992 153003 185122 216322 201246 171829 169022 158010 158100 177464 194821 189597 189466 180342 173837
9979A73837k4554l9638L06K7545J7712m672l320k815M762N728l24j2894n949J4532
9965A50256J8374L121L4832J1727m8346k0163K0743l571J7612J2618j5454r264
9953A72485O735k4711k1479j0857O290K5910j390j0015o638m766j8192R852L290
9940A26514K5843O445L0891P284j2537J880n837P557j3594j6129J5767R526m516
9927A79094j4002J9584j0066n145l0173N410P834r328P972Q321K905K8789l375
9914A87820r625K807M19J7688K2168J6811J4659K066j3945l2819j2582J3546l532
9901B05481k127k7697n215k653K2625k375l5483K3606L1329K1583l9877j2358
9889A76839J9713L2090O753K2125j4565l6325j9935j538J495P95j2289M935M498
$$ plain form
9979 173837 149283 109645 109951 137496 155208 150536 147216 144401 149163 154891 154567 141673 135724 150256
9965 150256 168630 171751 206583 218310 169964 149801 170544 166973 184585 197203 181749 172485
9953 172485 179220 154509 133030 122173 128463 154373 152983 142968 136330 131564 113372 123224 126514
9940 126514 152357 158802 189693 196977 184440 186320 180483 188040 174446 158317 174084 183610 179094
9927 179094 165092 184676 174610 169465 139292 144702 152536 143208 151180 159501 162406 191195 187820
9914 187820 178195 181002 181421 199109 221277 238088 252747 254813 240868 208049 195467 209013 205481
9901 205481 203354 175657 170442 167789 190414 188039 152556 176162 207491 229074 189197 176839
9889 176839 196552 228642 235395 257520 242955 206630 186695 185157 186652 187447 175158 180093 184591
9876A84591R636j4667o60R990O37N819O143m041m13j6590k1530K3567J1386q288
9862A85580o505J5157K5861R980J4727O37J412m4156j5076K9766K0699j581j5637
9849B20864j055L694k1672L560K2741k566m229k238L986J1605J916q587K3743
9836B51762J5324R804M421k3812q232M315j3314j0654L1025M982n899l577j8146
9823B37999j843k198k919K8974j7071R97j1411r554J3841K00l1220j2571R0K9011
9809B22325J7202O178L730J0321P100k8835n055m698m429J9935R744q448o787
9796B38283j1195l6897K7206n041K2963J5136J4994n698j6527o212k5694l140
9784B08178J9049L8286K2477l2822K7608r234p433K6653l4409k291N815j0095
$$ plain form
9876 184591 194227 179560 178900 188890 189527 195346 201489 197448 197035 180445 158915 182482 193868 185580
9862 185580 179075 194232 220093 230073 244800 245437 246849 202693 187617 217383 238082 236501 220864
9849 220864 219809 223503 201831 205391 228132 225566 221337 219099 223085 234690 236606 228019 251762
9836 251762 267086 276890 281311 257499 249267 253582 240268 229614 260639 265621 259722 256145 237999
9823 237999 236156 233958 231039 260013 242942 243939 232528 222974 236815 237015 205795 193224 193314 222325
9809 222325 239527 245705 249435 259756 266856 238021 232966 228268 223839 243774 253518 245070 238283
9796 238283 227088 190191 217397 212356 235319 250455 265449 259751 243224 237012 211318 208178
9784 208178 227227 265513 287990 255168 282776 273542 266109 292762 258353 256062 261877 251782
9772B51782o169n465o007J6310J0007l149k3145m667K7397K8070j4959r404J0070
9759B70671l462k0501j093J674J9663J1788P517j3867p020j1853j944j184k8770
9746B21619l519L6761L6723J920l188m5353o452J7855L152l764K0349K2349j2660
9733B85792k0138O448J1853l2846j8313J7722K1377K0271L778k3748j0552k685
9721B58959k3541m239L7005J7850l012m241J0786K4821r276j8630k1729j0285
9709B54468R369K7266j512r806j1838J0688j2821n247L7591J8774J7014J2821
9697C46767j1821l421k909l5211K180Q139K2181j5744j327j3607l426M0J1597
9684C03438K006n998k8995j6164p765O736M354R435K0233J4188J1007K745k5501
$$ plain form
9772 251782 245613 240148 234141 250451 260458 257309 234164 229497 256894 284964 270005 260601 270671
9759 270671 267209 246708 245615 247289 266952 278740 286257 272390 265370 253517 251573 250389 221619
9746 221619 218100 254861 291584 293504 290316 244963 238511 256366 259518 255754 276103 298452 285792
9733 285792 265654 272102 283955 251109 232796 250518 271895 292166 295944 272196 261644 258959
9721 258959 235418 231179 268184 286034 283022 278781 289567 314388 305112 286482 264753 254468
9709 254468 263837 291103 289591 279785 267947 278635 265814 260567 298158 316932 333946 346767
9697 346767 334946 331525 328616 293405 295585 303724 325905 310161 308834 295227 291801 291841 303438
9684 303438 305444 299446 270451 254287 246522 253258 257612 267047 287280 301468 312475 315220 289719
9671B89719k9200J4775K1363L940J514r363l254M789J8803L8337J4813n093j7882
9658C43261j8781R067J1460L1548K468k4451j0461K09O230R150J1072M318K414
9645C77504j476N443L819J066N504J2250j174l1554l21K702l573q079O225p785
9631C60551j6914M523N3730j059j1988L030J3346k98r396J2362p723o962J1740
9618D04942O744l0270K5026K1644Q603j5504J2823J8426Q508l717J8131Q228l3484
9605D50100j3058K505J3568K2734N766m026l779k4259l842j766q707L901K4339
9592D63476j2567k6069K7360K0844l233J6664k1266q442l652J3470K7225M206
9580D98016J9242j2985m1897j1177K4193K9767r07j3509k1724L2328L5403K0359
$$ plain form
9671 289719 260519 275294 296657 300597 302111 292748 289494 294283 313086 351423 366236 361143 343261
9658 343261 324480 333547 345007 376555 379023 354572 344111 344320 350550 359700 370772 375090 377504
9645 377504 376028 381471 385290 386356 391860 404110 402936 371382 371061 373763 370190 362111 368336 360551
9631 360551 343637 348160 401890 400831 388843 391873 405219 404921 395525 407887 400164 393202 404942
9618 404942 411686 381416 406442 428086 436689 421185 434008 452434 460942 457225 475356 483584 450100
9605 450100 437042 439547 453115 475849 481615 477589 473810 449551 445709 443943 435236 439137 463476
9592 463476 450909 424840 452200 473044 469811 486475 465209 456767 453115 466585 493810 498016
9580 498016 517258 504273 462376 451199 475392 505159 504252 490743 469019 501347 536750 557109
9568E57109o564m073j5727j5025j8982L401K9601O357k587L1675k8177l2238P656
9555E12426j109l230k373L5254n17J080J7771J9840K0831J0373j4204M033j9040
9542E81135J7423j129o664J980j0119J022L1634J8892O853j6870j845r475K09
9529F13046L3429J1600J7716j5248k7855n274r010l2172R214L1521N947j6545
9517F16369J2027K8291K9311M12k983l7049j5635p398J0356K5009J6189k8943
9505F45956k640K9984K8156J5940L274k1453K828J8907J1656L2797K11j0314j8587
9492G36715J6339K680J207J957J5701J5306K395k0965j4973K8214J7196k2858
9480G78914J8663m572j0829j490l8193J6528L2036L3373L1261K0026n367r658
$$ plain form
9568 557109 550545 546472 530745 515720 496738 500139 529740 536097 533510 565185 537008 504770 512426
9555 512426 511317 508087 505714 540968 540451 541531 559302 579142 599973 610346 596142 600175 581135
9542 581135 598558 597429 590765 592745 582626 583648 615282 634174 641027 624157 622312 612837 613046
9529 613046 646475 658075 675791 660543 632688 627414 618404 586232 595446 626967 632914 616369
9517 616369 628396 656687 685998 686410 683427 646378 630743 623345 633701 658710 674899 645956
9505 645956 643316 673300 701456 717396 720670 699217 702045 720952 732608 765405 765616 755302 736715
9492 736715 753054 755734 756941 758898 774599 789905 792300 771335 756362 784576 801772 778914
9480 778914 797577 793005 782176 780686 742493 759021 791057 824430 855691 875717 870350 860692
9468H60692J8864O960q739J679J8221Q421P099j3250j0853Q040K094J7163L7223
9455I53614K8642n955j6288j7169K3139n88K410P839J4991m578O928M1782o327
9442A028440j0260J9241J6690R75J5496J0150N401j2932J0288J1774m942r144
9430A081177J2269Q450L0165K7903K0492K5812N9284L3687J3685L8625N2716J1859
9418A416124n696K5301n881l4900J2079m889J4618J1989j4275O536K2293J5885
9406A459184k714j7132J7895K5121M4043K4043O172J4711K5425R796J4218m155
9394A616607K2888K5902K0636L479q236J6m773J4674L4046L6587M2348L7779L5247
9381A877200M0256N0859M5032M4083L0324L951K236o460j1062m0698m4077k6901
$$ plain form
9468 860692 879556 886516 877777 879456 897677 906098 913197 899947 889094 897134 899228 916391 953614
9455 953614 982256 976301 960013 942844 965983 965395 967805 975644 990635 986057 992985 1034767 1028440
9442 1028440 1018180 1037421 1054111 1055086 1070582 1080732 1086133 1073201 1083489 1095263 1090321 1081177
9430 1081177 1093446 1101896 1132061 1159964 1180456 1206268 1265552 1299239 1312924 1351549 1404265 1416124
9418 1416124 1410428 1435729 1429848 1394948 1407027 1402138 1416756 1428745 1414470 1421006 1443299 1459184
9406 1459184 1456470 1439338 1457233 1482354 1526397 1550440 1556612 1571323 1596748 1606544 1620762 1616607
9394 1616607 1639495 1665397 1686033 1689512 1681276 1681292 1676519 1691193 1725239 1761826 1804174 1841953 1877200
9381 1877200 1917456 1968315 2013347 2057430 2087754 2091705 2093941 2087481 2076419 2035721 1991644 1964743
9369A964743r00K3991P306k1773j4347K5090O600J9011n006q22K5714K2182L4996
9356B086785J7111J9518L1599j8185J5916J2319j379j218j576m87R797J1085l734
9343B177551r107J5513P922R965M4042J2743J4208L3771J9375R011q66M953L281
9330B342362j2361J303J4117J5911O833l335K4136L4381L4774J2599J2882j1622
9318B471980K0533L9564K4054J3494K9161L9442M0292J6062K4510M6865N8927
9307B824884K8092R464J3588L8525N0230M5590O4119K3376o272k330L476M3422
9295C136164K219j2512L7723L5149n75K1005N3245O0661K6718K7700M1166L6824
9283C465487J2628L8779Q1798O4184p494M0269N3819L6482N2788M8107P1022M7582
$$ plain form
9369 1964743 1963843 1987834 1995140 1973367 1959020 1984110 1990710 2009721 2004715 2003893 2029607 2051789 2086785
9356 2086785 2103896 2123414 2155013 2136828 2152744 2165063 2163684 2162466 2160890 2160403 2170200 2181285 2177551
9343 2177551 2168444 2183957 2191879 2201844 2245886 2258629 2272837 2306608 2325983 2334994 2334128 2339081 2342362
9330 2342362 2330001 2331304 2345421 2361332 2368165 2364830 2388966 2423347 2458121 2470720 2483602 2471980
9318 2471980 2492513 2532077 2556131 2569625 2598786 2638228 2678520 2694582 2719092 2765957 2824884
9307 2824884 2852976 2862440 2876028 2914553 2964783 3010373 3074492 3097868 3091596 3089266 3092742 3136164
9295 3136164 3138383 3125871 3163594 3198743 3198168 3219173 3272418 3333079 3359797 3387497 3428663 3465487
9283 3465487 3478115 3516894 3598692 3662876 3655382 3695651 3749470 3785952 3838740 3886847 3957869 4005451
9271D005451P5532Q0846O7362Q6215P9280P4481R8682P8618M1782L2763L8874
9260D759886o620L2759L7891M1226K7758O5064R7507Q9943Q9549J15965J05261
9249E456189J02194R7869P7302N3673P0560Q8908Q4964R6437P9263M9296P4548
9238F331203R0962J06003J03112R8983J24196J50229J59710J91354J92427J64913
9228G713092J31113J35928J04072O8355N1197K5411Q8035Q0095P6784J50799J11194
9217H736075J19894J48141J63274J74414J58643J82785J71081J71173J97655J71225
9207A0394360J77667J65192J59682J90708J89671K05980J47750J64167K39351
9198A2034528K55330K73273K59065K94606L13186K71755K79815L15956K86416
$$ plain form
9271 4005451 4080983 4161829 4229191 4315406 4394686 4469167 4567849 4646467 4688249 4721012 4759886
9260 4759886 4753266 4786025 4823916 4865142 4892900 4957964 5055471 5145414 5234963 5350928 5456189
9249 5456189 5558383 5656252 5733554 5787227 5857787 5946695 6031659 6128096 6207359 6256655 6331203
9238 6331203 6422165 6528168 6631280 6730263 6854459 7004688 7164398 7355752 7548179 7713092
9228 7713092 7844205 7980133 8084205 8152560 8203757 8229168 8317203 8397298 8474082 8624881 8736075
9217 8736075 8855969 9004110 9167384 9341798 9500441 9683226 9854307 10025480 10223135 10394360
9207 10394360 10572027 10737219 10896901 11087609 11277280 11483260 11631010 11795177 12034528
9198 12034528 12289858 12563131 12822196 13116802 13429988 13701743 13981558 14297514 14583930
9189A4583930L00426K65300K75854K96291K89853L15065L18255L37251L57587
9180A7339812L65262L69606L73601L96448M21921L99448M11161M45292M84400
9171B1006951M74960M57714M68219N26986M96023M89560N00284N01541N11415
9162B5433653N51090N72885N57182N80676N68484N86598N87252N92672O18383
9153C0648875O13181N97004N87498O08356O21270N88733N94952N79830N70299
9144C6009998N58077N71261N24683N05191M96143M88930M66499M57798M13462
9135D0492042L51705L28833K99501L16894K89565K37242J91464J55560J58556
9126D2821362J15276Q887m9644l3712p0835j18167j41394k04337k37688k32481
$$ plain form
9189 14583930 14884356 15149656 15425510 15721801 16011654 16326719 16644974 16982225 17339812
9180 17339812 17705074 18074680 18448281 18844729 19266650 19666098 20077259 20522551 21006951
9171 21006951 21481911 21939625 22407844 22934830 23430853 23920413 24420697 24922238 25433653
9162 25433653 25984743 26557628 27114810 27695486 28263970 28850568 29437820 30030492 30648875
9153 30648875 31262056 31859060 32446558 33054914 33676184 34264917 34859869 35439699 36009998
9144 36009998 36568075 37139336 37664019 38169210 38665353 39154283 39620782 40078580 40492042
9135 40492042 40843747 41172580 41472081 41788975 42078540 42315782 42507246 42662806 42821362
9126 42821362 42936638 42945525 42895881 42862169 42791334 42673167 42531773 42327436 42089748 41857267
9116D1857267k86699l27902l34309l36720l63913m16397m23013m50218m73729
9107C8444367m65795n03728m85427m81946m97603n57352n36330n14459n64894
9098C3836833n86019n20029n21177n38392n49969n45088n64026n15786m99260
9089B8997087n31052n43863n21949n06005m86873m71719m67193m71388m39833
9080B4557212m60791m64860m36881m17312m18433m12716m36434m16471m18503
9071B0674811m06358l59628l73098l45587l63439l58368l67984l76938l41011
9062A7382400l17617k85459l04118l00862k88442k92472k80307k52477k82035
9053A4778611k75138k43388k46269k50883k62969k25928k18592k20848k32664
$$ plain form
9116 41857267 41570568 41242666 40908357 40571637 40207724 39791327 39368314 38918096 38444367
9107 38444367 37978572 37474844 36989417 36507471 36009868 35452516 34916186 34401727 33836833
9098 33836833 33250814 32730785 32209608 31671216 31121247 30576159 30012133 29496347 28997087
9089 28997087 28466035 27922172 27400223 26894218 26407345 25935626 25468433 24997045 24557212
9080 24557212 24096421 23631561 23194680 22777368 22358935 21946219 21509785 21093314 20674811
9071 20674811 20268453 19908825 19535727 19190140 18826701 18468333 18100349 17723411 17382400
9062 17382400 17064783 16779324 16475206 16174344 15885902 15593430 15313123 15060646 14778611
9053 14778611 14503473 14260085 14013816 13762933 13499964 13274036 13055444 12834596 12601932
9044A2601932k19600k22599j99503j87631k00384k01235k12727k29652j56557
9035A0772044j78876j58079j65020j57396j81460j83519j65857j56755j77497
9026I247585j30354j50708j60699j64218j65565j50762j15236j03860j02865r5573
9016G907745j24585j20508j19113j18656j13368j56864j32139r5549j03495j44458
9006F679010r9489p0640j00173o9385r4851j23236p1773p2610j16194r7010p6521
8995E687128p0707n7821p8775q8099q9046l8488m8611p1900o5166p5304o1709
8984D941502q0098r2805n7477n6615p4321n9482k7141o2848o6902q0381o7008
8973D216424l7519l4055m0973m6672n8868p0461k9579n2605m3645l5993k6879
$$ plain form
9044 12601932 12382332 12159733 11960230 11772599 11572215 11370980 11158253 10928601 10772044
9035 10772044 10593168 10435089 10270069 10112673 9931213 9747694 9581837 9425082 9247585
9026 9247585 9117231 8966523 8805824 8641606 8476041 8325279 8210043 8106183 8003318 7907745
9016 7907745 7783160 7662652 7543539 7424883 7311515 7154651 7022512 6926963 6823468 6679010
9006 6679010 6579521 6508881 6408708 6339323 6244472 6121236 6049463 5976853 5860659 5763649 5687128
8995 5687128 5616421 5558600 5479825 5391726 5302680 5264192 5215581 5143681 5078515 5003211 4941502
8984 4941502 4861404 4768599 4711122 4654507 4580186 4520704 4493563 4430715 4363813 4283432 4216424
8973 4216424 4178905 4144850 4103877 4057205 3998337 3927876 3898297 3845692 3802047 3766054 3739175
8962C739175l1345m8079m4254o3978o3377l3943m4159l2153l546J098k6851o6170
8950C282418l0574k6287r498l5112m2631n0179j400J0806l1928l3379k5621r209
8938B997406j1052j3241k7714P012K5546L629J6060o806Q879M5403L2148L8461
8926C115731Q8642R7003J11468J02494J37767J32325J87718K30874K21421K94122
8916D719565L64065M79338O88447R62346J479686K356680L569379M450790L806461
8907B2876757K081856R26899N64464L29163j122253m339743n437939l946505k419390
8898I513309j503195r93402o61889m72257l75638k64419k14243k19819k06611
8889D601836j67211j68481j84177j60264j37887j19182j20304j22277j18419j05125
$$ plain form
8962 3739175 3707830 3659751 3615497 3551519 3488142 3454199 3410040 3377887 3374341 3375439 3348588 3282418
8950 3282418 3251844 3225557 3216059 3180947 3138316 3088137 3086737 3097543 3065615 3032236 3006615 2997406
8938 2997406 2986354 2973113 2945399 2952411 2977957 2981586 2997646 2990840 2999719 3045122 3077270 3115731
8926 3115731 3204373 3301376 3412844 3515338 3653105 3785430 3973148 4204022 4425443 4719565
8916 4719565 5083630 5562968 6251415 7213761 8693447 11050127 14619506 19070296 22876757
8907 22876757 24958613 25885512 26449976 26779139 25656886 21317143 15879204 11932699 9513309
8898 9513309 8010114 7016712 6354823 5882566 5506928 5242509 5028266 4808447 4601836
8889 4601836 4434625 4266144 4081967 3921703 3783816 3664634 3544330 3422053 3303634 3198509
8879C198509p2496j10041q8053q1721o8047p6942m5037o5939j11755n8306l3068
8868B387104o4761m3920k4912n4708l8153m8060m3981l1663k2485j1484k4813
8857A978164m6865m7652l2832l8856k0140q709k5848j1613l5525l3504l5657l6062
8845A604901j8486K0155l6046n4879o513j0751r658j8422j8935j2936l6242l4336
8833A367852k5287L312k2417n036j8266j9577P139k6244m626k2712Q591r429o5108
8820A168192k5415Q370j9598M007j2509j6042M070J1084J2419j7124k8811k8226
8808A060417J5701Q173j1829R851l6212m6187o410J5646k5168m0815k9880k6423
8796H86864k063j6359k5538K586N861k9460J4001J5252j4133M884J3828k5883
$$ plain form
8879 3198509 3126013 3015972 2927919 2846198 2778151 2701209 2656172 2590233 2478478 2420172 2387104
8868 2387104 2322343 2278423 2253511 2198803 2160650 2112590 2068609 2036946 2014461 2002977 1978164
8857 1978164 1931299 1883647 1850815 1811959 1791819 1783110 1757262 1745649 1710124 1676620 1640963 1604901
8845 1604901 1586415 1606570 1570524 1515645 1509132 1498381 1488723 1470301 1451366 1438430 1402188 1367852
8833 1367852 1342565 1345877 1323460 1318424 1300158 1280581 1287720 1261476 1256850 1234138 1242729 1233300 1168192
8820 1168192 1142777 1151147 1131549 1135556 1123047 1107005 1111075 1122159 1134578 1117454 1088643 1060417
8808 1060417 1076118 1084291 1072462 1082313 1046101 999914 993504 1009150 983982 943167 913287 886864
8796 886864 884801 868442 842904 845490 851351 821891 835892 851144 837011 841895 855723 829840
8784H29840l9822k864l436p930k3203j5991R436K2903p652k4381q971O89N34J4318
8770G43470k2310q466J5703J4586k113j5300j1072J7458j0037J1301L0427P296
8758G70943J0417r199j9852p301r113p638l0987l8276l5531K86J3005J780k6602
8745F11932j5727R169K5651j1184j9859m302M141j261J1280l87J9684L4040J2636
8732F75813j3710j3878j4157j3627m851n222k4515j2815K3089J9558J8223J3205
8720F47113k4897o460j7285j1483j4638j008N715m146k6531N747P966j1418m192
8707E44483k8502k1269J718J7923L591n086j5780p607J9277M311m352J7290n239
8694E20758k2252k7494o713M507k250K8811L8808R715J683J858N652j8853k7098
$$ plain form
8784 829840 790018 787154 783718 775788 752585 736594 746030 768933 761281 736900 727929 728618 729152 743470
8770 743470 721160 712694 728397 742983 740870 725570 714498 731956 721919 733220 763647 770943
8758 770943 781360 772161 752309 745008 735895 728257 697270 658994 623463 623749 636754 638534 611932
8745 611932 596205 605374 631025 619841 599982 595680 599821 598560 609840 609453 629137 663177 675813
8732 675813 662103 648225 634068 620441 615590 610368 585853 573038 596127 615685 633908 647113
8720 647113 622216 615756 598471 586988 572350 571342 577057 572911 546380 552127 560093 548675 544483
8707 544483 515981 494712 496430 514353 517944 512858 497078 489471 508748 513059 508707 525997 520758
8694 520758 498506 471012 464299 468806 466556 495367 534175 543890 545573 547431 553083 534230 507132
8681E07132j2136K1088J5630J6424n894j2922j292J283j7079J6031O860l7118
8669D98007k9968K9710K7055Q017K0724j1489k9586j3795j5395l547K6856M0581
8657E47170P139J4990l1042m6088k3026J5854K1684k3610J0454J1530j2754L4918
8645E27219K9775j1213L5221K1695J7852K9638K6878N958J8708M3853M9867K2301
8633H17752K717q749J7653J4923J319k7364l5800k8421n0790n0368j0043r851
8621F32978k9247k6101P620L0438j852l8539l7056R436m516m0778m3830m2678
8609D15875l958O763j4878J4061J2269j2455j2848L106q880k1665q157J20L9561
8596D08914K5175k9475j3815n49R446j1145m8011k8387J175J4992L8834J1844
$$ plain form
8681 507132 494996 516084 531714 548138 542244 529322 528030 529313 512234 528265 535125 498007
8669 498007 468039 497749 524804 532821 553545 542056 512470 498675 483280 479733 506589 547170
8657 547170 554309 569299 538257 492169 469143 484997 506681 483071 493525 505055 492301 527219
8645 527219 556994 545781 581002 602697 620549 650187 677065 683023 701731 745584 795451 817752
8633 817752 820469 811720 829373 844296 845615 818251 782451 754030 703240 652872 642829 632978
8621 632978 603731 577630 585250 615688 613836 575297 538241 547677 543161 502383 458553 415875
8609 415875 411917 418680 403802 417863 430132 417677 404829 407935 399055 377390 369233 369353 408914
8596 408914 434089 404614 390799 390250 399696 388551 340540 312153 313328 328320 367154 378998
8584C78998j4110J4982N797K6315q80o756p531j5194N011K2484L10k5868j4342
8571C69216j9246q490j5160j0946J893R211K6378L4950L692J8327n768J3179N530
8558D22766k0353j0209j3042k4550j0908j2481k8189l6157K277l0807m837J7613
8546B51123n108L434J9208K3876j7806Q51P306L9733J4425n3255j2229m347P999
8533B75210J6460N970p891P864k0911r188j3142L7213J6372j1860k4344j6841
8521B54912K028m169m109J6021J1324k5753l396J4494J5798K3007p743n210K2010
8508C09214q12K427J4445K4693M38k6644J327k96J269k0326m3947k9929O150K3466
8494B61475R790k2677j031Q681m512j8767j5967r075J584M224J7419r758l0645
$$ plain form
8584 378998 364888 379870 385667 411982 411102 404346 396815 381621 386632 409116 409426 383558 369216
8571 369216 349970 341480 326320 315374 317267 326478 352856 387806 391498 409825 404057 417236 422766
8558 422766 402413 392204 379162 354612 343704 331223 303034 266877 269154 238347 233510 251123
8546 251123 246015 249449 268657 292533 274727 275578 282884 322617 337042 283787 271558 267211 275210
8533 275210 291670 297640 289749 297613 276702 267514 254372 291585 307957 296097 271753 254912
8521 254912 256940 252771 248662 264683 276007 250254 246858 261352 277150 300157 292414 287204 309214
8508 309214 308402 310829 325274 349967 350405 323761 325088 324792 326061 305735 261788 231859 238009 261475
8494 261475 271265 248588 247557 256238 251726 232959 216992 207917 209501 213725 231144 221386 190741
8481A90741r898M747l164j7192j9972K7711O3575o843j5490m313k5908l512Q369
8468A88851k2969M123m803K0152J6005k4644K3201K0079l562L0665k2121p505
8456B17472j250K614O857p231k1088o538j6567K951J4599k1654K834J1841J6278
8443B01118M079K6921K2228l484j8954J2464j1045l1444j6518k236J6469K3587
8431B23185k025m6879k8771J9920Q694j865p218j2927J5282N843k879j5375j9583
8418A35402L5919P693j0322k5554K4839K9836L3037J4430k9624l2953k2300k7383
8406A33020j1924J1918J1783J7192q837j8844k3532N515K7838J4219J2303n896
8394A64755j0933k1719M862N323J1705l302k4941l1506L555Q42L9919L5343J3128
$$ plain form
8481 190741 180843 185590 182426 165234 145262 172973 236548 229705 214215 209902 183994 180482 188851
8468 188851 165882 170005 165202 185354 201359 176715 199916 219995 216433 247098 224977 217472
8456 217472 216222 218836 225693 218462 197374 190836 174269 177220 191819 170165 172999 184840 201118
8443 201118 205197 232118 254346 250862 231908 244372 233327 201883 185365 183129 199598 223185
8431 223185 221160 174281 145510 165430 174124 172259 165041 152114 167396 173239 170360 154985 135402
8418 135402 171321 179014 168692 143138 167977 197813 230850 245280 215656 182703 160403 133020
8406 133020 121096 133014 144797 161989 153152 134308 110776 116291 144129 158348 170651 164755
8394 164755 153822 132103 136965 142288 153993 150691 125750 94244 97799 98641 138560 173903 187031
8381A87031J02k397L818j0671j1225p090J6871Q348j5389j9135m7715k0219R785
8368I2114L1272J5971N847m486k300J849m320k164r16n772L490J4981o24Q401
8354A53343K119j5955K064J2119M7780K1781l2597k1811L778J0105q214p586j6038
8341A50888j3164k4898o44L9808L120K2777J9055l8046j6820l142R646k110p597
8328A38873j8162j7263l93R931k7810k1157P271M081N663J6026K87J198l283M471
8314I9733j5828j1133l026K6184R363M671j1222j1779j1933m60o320L7271j461
8301A04060R582L0661k2421m8215j3647K4119j7206o841o97K3472K9199P445o628
8288A12883m713p121J186j0379j3136O261K1400M781j7793j2435j1902R522L1932
$$ plain form
8381 187031 187133 184736 188554 177883 166658 159568 176439 184787 169398 150263 102548 82329 92114
8368 92114 123386 139357 145204 140718 138418 140267 135947 133783 132867 127095 130585 145566 144942 153343
8354 153343 155462 139507 141571 153690 201470 223251 190654 168843 172621 182726 174512 166926 150888
8341 150888 137724 112826 112182 151990 155110 177887 196942 158896 142076 138934 148580 146470 138873
8328 138873 120711 103448 103055 112986 85176 64019 71290 75371 81034 97060 97347 98545 95262 99733
8314 99733 83905 72772 69746 95930 105293 109964 98742 86963 75030 74570 68250 105521 104060
8301 104060 113642 144303 121882 73667 60020 84139 66933 60092 59395 82867 112066 119511 112883
8288 112883 108170 101049 102235 91856 78720 84981 106381 111162 93369 80934 69032 78554 110486
8275A10486L1756P180p417k483r664R196L6837J1223l7019k3091L1547O376n947
8262A58980l7820j6674K5155J3340k093k0645k710j151M81j3676m044j9996J9503
8249I8650J7795J315R777k294J225k563Q710j4692j8077r620K3937K3899O659
8236A44721L848l0257j7057R263M261o649j1190j4797K1132N510j9889K569J7038
8223A08503K7936Q599k2095O319P020j3627k760n915J9455O144j9831l069J8068
8210A34747J5764q003J9226j4802j4715k0662k5843L1680K6149L9183j624j4569
8198A66531k1568k6110L898n557j4027k4415j7417R660J3401J2469J9930l1556
8186H5239q912J1405O466J9772K1165J2305p222r510P282J1592J3469j9544O541
$$ plain form
8275 110486 142242 149422 142005 139522 129858 139054 175891 187114 150095 127004 158551 164927 158980
8262 158980 121160 104486 129641 142981 140888 120243 117533 116382 116863 103187 99143 79147 98650
8249 98650 116445 117760 127537 125243 126468 123905 132615 117923 99846 90226 114163 138062 144721
8236 144721 148569 118312 101255 110518 114779 108130 96940 82143 103275 108785 88896 91465 108503
8223 108503 136439 145038 122943 129262 136282 122655 119895 113980 133435 139579 119748 116679 134747
8210 134747 150511 142508 161734 146932 132217 111555 85712 117392 143541 182724 181100 166531
8198 166531 144963 118853 122751 117194 103167 78752 61335 70995 84396 96865 116795 85239
8186 85239 76327 87732 94198 113970 135135 147440 140218 130708 137990 149582 163051 143507 150048
8173A50048K7773J0800J5312N434j8507j6631j5690n84J9836J0592k9998l9940
8161A18445p884M6175j2916l4757P959j2621O418J4072j5482k2375k2638N882
8149G0278K1157j6114n446j9675j5429O251K6925m784j5000q496j465l436L2605
8136F7371J4560l9737l298K0019l048k3353N418O025O991j9512n604J1039K0446
8123E7317o292j433o115k12m291J0489J7535M721P613L5352m122m7949j9203K6201
8109F9611O130L236r807o07J1145m719j5792j4866J6050j8411n91R266K4295L930
8095G8870m2756j4473L0919Q816J0995M4114L7209J4594j9744j9065l0023O196
8083A05652r207J755J3542K2957J5590n008j817K0575L755r135k1529l2737j7948
$$ plain form
8173 150048 177821 188621 203933 209367 190860 174229 158539 157955 177791 188383 158385 118445
8161 118445 110561 156736 143820 109063 117022 104401 110819 124891 109409 87034 64396 70278
8149 70278 91435 75321 69875 50200 34771 41022 67947 63163 48163 39667 38202 34766 67371
8136 67371 81931 42194 38896 58915 55867 32514 37932 43957 50948 31436 25832 36871 57317
8123 57317 51025 49592 43477 43265 38974 49463 66998 71719 79332 114684 110562 62613 43410 69611
8109 69611 75741 78977 69170 68563 79708 74989 59197 44331 60381 41970 41379 50645 74940 78870
8095 78870 36114 21641 52560 61376 72371 116485 153694 168288 148544 129479 99456 105652
8083 105652 96445 98200 111742 134699 150289 145281 143464 164039 167794 158659 137130 104393 86445
8070H6445k8902O347K3114J4623j9507l0970N021J7944K5935o884J3770J593j2119
8057I6410J8176k8860j5735O712J7982K3080J7009j7392k3269R026L5874K2548
8045A61561o878J0265R137Q565j5208N929J6032O633J2507j79l5552j1307J5648
8032A77153o771p277K0409Q729M999j8062n0187j0824K5544o943r527N711j1621
8019A21333K0453m510Q175L5189N388l5418j2422q394K9151L1899O389l9209J6262
8006A74286L1306K070j2271m768R901j0691l9220Q968K4613o09J7560J1865o597
7993B06413k667N269K7117P250J885L977r089j7827O825m871k5860k3831P098
7980A81689o599N642j0307K2251J4887q079K607N715r015j4269l57k557j848P612
$$ plain form
8070 86445 57543 63890 87004 101627 82120 51150 56171 74115 100050 93166 106936 108529 96410
8057 96410 114586 85726 69991 76703 94685 117765 134774 117382 94113 103139 139013 161561
8045 161561 154683 164948 174085 182650 167442 173371 189403 196036 208543 208364 172812 161505 177153
8032 177153 170382 163105 183514 192243 197242 179180 128993 118169 143713 136770 127243 132954 121333
8019 121333 141786 137276 145451 180640 186028 150610 138188 129794 158945 190844 197233 158024 174286
8006 174286 205592 207662 195391 190623 200524 189833 150613 159581 184194 183585 201145 213010 206413
7993 206413 203746 209015 236132 243382 245267 249244 240155 222328 229153 224282 198422 174591 181689
7980 181689 175090 180732 170425 192676 207563 199484 202091 207806 198791 184522 184165 181608 179760 187372
7966A87372R414K98j9668k047J3616J2372k7985k561J915n917J388q556R24m610
7952A55955L204L6520K0328k4747o146m593l683J032K07j152N116j5715k1711
7939A44615L509P897O107J7315J9521N024N940k0279l7947P040j9262l5566l563
7926A00351J9576j6604L4733J3251J2135R476M46l146k3850k9772j9705R487K7289
7913A33667j159o523O866j2874k4122J5556J4730k8548k9713R248K0900k856k0371
7900G4801J8044J0434R269K2307j6086o2803J0365L4899j3004p047n601k4666
7888E0912k186K2681J8420O78j1283o042L719J3597N385J0591j7558k6923J2418
7875G4409j5953r749m490J2453q324N393L374p946j2761j8915J8776m82o75M35
$$ plain form
7966 187372 196786 197084 177416 175369 188985 201357 173372 170811 172726 166809 168197 159641 160565 155955
7952 155955 159159 195679 216007 191260 185114 180521 176838 177870 178077 176925 182041 166326 144615
7939 144615 148124 156021 162128 179443 198964 203988 209928 189649 151702 158742 139480 103914 100351
7926 100351 119927 103323 138056 151307 163442 172918 173364 170218 146368 116596 96891 106378 133667
7913 133667 132508 125985 132851 119977 95855 111411 126141 97593 67880 77128 98028 95172 74801
7900 74801 92845 103279 112548 134855 118769 55966 66331 101230 88226 81179 75578 50912
7888 50912 48726 71407 89827 90505 79222 73180 76899 90496 95881 106472 88914 61991 74409
7875 74409 58456 48707 44217 56670 48346 53739 57113 49167 36406 17491 36267 35785 35110 35545
7861C5545R013N255j4548L0859L1592o912k0583q209K909K659l3586Q114J532
7848D3640l813q245j0501j8975q921L3495J1685m67J6601p336j4741j1858J6126
7835C6690j6026k922J1379j0547j6512K9425K2417m3672j9638p536J2007J4354
7823I419L94Q35R917J685M215o718L116L2820m788j9720N57j0006J5279K0720
7809E7725k0711k5154J2669j5591j1929K0235J1413K7422K734j4558k099o976
7797C5180M855k3325L571J3153o617r285J6082K7105o764l4837O700J3588j4296
7784B5110j797m66o183j8362k432k2126R11L7446K2415n73K3389j4013k0084J1548
7770C4783L959L528J466m880K187n079k8242j8641K2048K0321k6790p841K34K5643
$$ plain form
7861 35545 44558 49813 35265 66124 97716 90804 70221 62012 64921 67580 33994 42108 43640
7848 43640 39827 31582 21081 2106 -6815 26680 38365 37898 54499 47163 32422 20564 36690
7835 36690 20664 17742 29121 18574 2062 31487 53904 10232 -9406 -16942 -4935 9419
7823 9419 9813 10648 20565 22250 26465 19747 22863 55683 50895 31175 31732 21726 37005 57725
7809 57725 37014 11860 24529 8938 -2991 17244 28657 56079 58813 44255 42156 35180
7797 35180 40035 16710 20281 33434 26817 17532 33614 60719 53955 19118 25818 39406 25110
7784 25110 23313 22847 16664 -1698 -4130 -26256 -25345 12101 34516 33943 57332 43319 23235 34783
7770 34783 38742 42270 43736 38856 41043 35964 7722 -10919 11129 31450 4660 -3181 -2947 22696
7756B2696P007k6855k0922J1027J1263R662J1739L379j4875j739j7350J6289K1552
7743C2873k7256J2118M0037o097n0145k0288k872J0874n204L120k306K0050N937
7730A0841j1110k0145M503m200J1160j0441J8532p312j7572j0779J4439k330J2837
7717a1577m297J933j1496K0043P662P887k6096j7110l838P563J4227o904J4604
7704g399N968j9277R141J3991J9536O269J9078q143p018p120k804j586O816J7752
7690D5204j1398J540j9578n887o400M301R290K219L130J7034k7419j3349J3541
7677A2228j377k4484Q475J9361J9500Q39Q236J4661J0028o18l6196m2842P904
7664d285J4101j5328k4180L2209M7839p595k9113m443N241L498k2341j9747l629
$$ plain form
7756 22696 29703 2848 -18074 -7047 4216 13878 25617 28996 14121 12382 -4968 11321 32873
7743 32873 5617 17735 57772 51675 1530 -18758 -21630 -10756 -15960 -12840 -15146 4904 10841
7730 10841 -269 -20414 -15911 -20111 -8951 -19392 -860 -8172 -25744 -36523 -22084 -24414 -11577
7717 -11577 -15874 -13941 -25437 -5394 2268 10155 -15941 -33051 -36889 -29326 -15099 -22003 -7399
7704 -7399 -1431 -20708 -11567 2424 21960 28229 47307 39164 32146 25026 22222 20636 27452 45204
7690 45204 33806 35346 15768 9881 3481 7782 17072 19291 22421 39455 12036 -1313 12228
7677 12228 10851 -13633 -5158 14203 33703 34542 42778 57439 67467 66849 30653 -12189 -4285
7664 -4285 9816 -5512 -29692 2517 50356 42761 13648 9205 14446 17944 -4397 -24144 -27773
7651b7773M570J7710J5431M230R627l936J8575r106l058N406j689j0228k7525
7638g766J7431K6307K5o208k3122R735j86k0013j950L337L0095l522l3764k0275
7624b9876j167m83R848r093K916P164J5389j2180J356k3K9183m372M261L5l851
7609I107l794L0588j5779m0959k1143k202O03O764K6352J9475R123p278n590P624
7595A2891k6389j3908J1632J1709k3937j1705k839J6234N6l626K0209J2774l11
7582B790k6558K891L3039m23P051l034p594M377k2650k8523O551L8309J8411r807
7568A4830k8380j3023J7404Q961j4810L866J220j8045J5365j2589q450L1581K4824
7555B2754k0804j3320j4635K2363J1110m1116J6345L2240j7194o644J7563J1580
$$ plain form
7651 -27773 -23203 -5493 9938 14168 23795 19859 38434 29328 26270 31676 29987 19759 -7766
7638 -7766 9665 35972 35997 29789 6667 16402 16216 -3797 -5747 -2410 27685 24163 -9601 -29876
7624 -29876 -31043 -31526 -21678 -30771 -27855 -20691 -5302 -17482 -16126 -16149 13034 8662 12923 12958 9107
7609 9107 5313 35901 20122 -20837 -41980 -44182 -43579 -36815 -10463 9012 18135 10857 5267 12891
7595 12891 -13498 -27406 -15774 -4065 -28002 -39707 -42546 -26312 -26256 -29882 -9673 3101 2790
7582 2790 -23768 -20877 12162 11739 18790 15756 8162 12539 -10111 -38634 -32083 6226 24637 14830
7568 14830 -13550 -26573 -9169 -208 -15018 -11152 -9932 -27977 -12612 -25201 -33651 -2070 22754
7555 22754 1950 -11370 -26005 -3642 7468 -33648 -17303 14937 -2257 -8901 8662 20242
7543B0242J641j685q549N700K3147M3778K3010j4933k3051k6473j7575l491L94
7530B2155k0295k4936O510J5253O51J4659J4291k1138j9136R170j634k9151Q379
7517b5222J932K7779J1932q680J9261L0718j5555q206j2366j4036n996M170M51
7504F182k3832j4004L85K1585J4542J4311K1862O691j2880j8699o928p889k735
7491a409O210j7462M224r027o775J9142J2761j379M210l2233p787K9734J0988
7478A1197j1620N335p653N528M327J170R88M699l613j2012O577j4042j8034K1088
7464f065J5055N990l2453k3367J6199Q060J2059K5959J0266j6481l6416M235R324
7451g635L2252J8155j3895j2688J6011P071k7886k4553R616j2565K3801Q991N462
$$ plain form
7543 20242 21883 20198 11649 17349 40496 84274 107284 92351 69300 42827 25252 21761 22155
7530 22155 1860 -23076 -16566 -1313 -662 13997 28288 7150 -11986 -2816 -4450 -33601 -25222
7517 -25222 -23290 4489 16421 7741 27002 57720 42165 33959 21593 7557 1561 5731 6182
7504 6182 -17650 -31654 -31269 -9684 4858 19169 41031 47722 34842 16143 9215 1326 -1409
7491 -1409 4801 -12661 -8437 -17464 -24239 -5097 7664 6285 10495 -21738 -29525 209 11197
7478 11197 -423 4912 -2741 2787 7114 8284 9272 13971 10358 -1654 4923 -9119 -27153 -6065
7464 -6065 8990 14980 -17473 -40840 -24641 -16581 -4522 21437 31703 15222 -21194 -16959 -7635
7451 -7635 24617 42772 28877 16189 32200 39271 11385 -13168 -3552 -16117 7684 16675 22137
7438B2137M542j4154k6748Q091J942L693m808M387k4396k5573J4231J8280l673
7425b2049j1299O980j1157J1287L4071j2658K131k131J5354K7931J6808j0244
7413D5024r203j631j2677J5822j4908l075Q896j4790O257j531k1232k2526M765
7400b0809K5801J9801k5340j4507O979r22j0583M510j0703J5878M029m956j6904
7387b7726K7038k878l4000M876Q822k4455L435L5482J6645N693L0164m037k8767
7374A0292j0301K2520j2122K318J1172p38k9594k0875Q970p511j1704K4326k4144
7361c7391p47l68J1688j097j0876J6187J7802J5769Q076l3912Q084J924j5133
7348a9994M265r784r909J9979p988J5107K5874m1887l816K864j6612J8523K1274
$$ plain form
7438 22137 26679 12525 -14223 -6132 -4190 -497 -5305 -918 -25314 -50887 -36656 -18376 -22049
7425 -22049 -33348 -26368 -37525 -26238 7833 -4825 -2694 -4825 10529 38460 55268 45024
7413 45024 35821 34190 21513 37335 22427 19352 28248 13458 19715 18184 -3048 -25574 -20809
7400 -20809 4992 24793 -547 -15054 -8075 -8997 -19580 -15070 -25773 -9895 -5866 -10822 -27726
7387 -27726 -688 -3566 -37566 -32690 -23868 -48323 -44888 -9406 7239 12932 43096 39059 10292
7374 10292 -9 22511 10389 12707 23879 23141 -6453 -27328 -18358 -25869 -37573 -13247 -37391
7361 -37391 -38138 -38506 -26818 -27915 -38791 -22604 -4802 10967 19043 -14869 -6785 -4861 -19994
7348 -19994 -15729 -25513 -35422 -15443 -23431 -8324 17550 -24337 -28153 -25289 -41901 -23378 -2104
7335b104m453L1216K1743j1409o632j0856k69r995j9639J8443K1267j5940K2114
7322C3486m97k9576m982K498L14j045R528m42j3732O069j8387j6726j2911k468
7308d8871J5623R208J517q896P192J7729j336j6665r843k4248K7709M3540J8347
7295C1006j3909j4153j141j7012K714n007r384k2997L929K3071N7017m48j6590
7282A7096k7893J0325P575k0367P428O910m067q487l551o516J7193L32P490k175
7268A293o727j8562J688J1957j0619n117k795j7116j4791L0883J5767j2016j2750
7255c8905P896Q290J0531O581K975J0062j4020m484J6156M5k0573o859q101L1347
7241I41J5931k1426m9826j4340K3167K9964J46o540J4618L1933K1361q156l3044
$$ plain form
7335 -2104 -6557 24659 46402 34993 28361 17505 17236 7241 -12398 6045 27312 11372 33486
7322 33486 32989 3413 -1569 929 1243 198 9726 9284 -4448 1621 -16766 -33492 -46403 -48871
7308 -48871 -33248 -24040 -22523 -31419 -24227 -6498 -7834 -24499 -34342 -58590 -30881 12659 31006
7295 31006 17097 2944 1803 -15209 -12495 -17502 -26886 -49883 -45954 -22883 34134 33686 17096
7282 17096 -10797 -472 7103 -13264 -5836 1074 -2993 -11480 -15031 -21547 -4354 -4022 3468 1293
7268 1293 -5434 -23996 -22308 -10351 -20970 -26087 -28882 -45998 -60789 -29906 -14139 -26155 -38905
7255 -38905 -31009 -22719 -12188 -5607 -2632 7430 -6590 -11074 5082 5127 -15446 -22305 -30406 941
7241 941 16872 -4554 -54380 -68720 -45553 -15589 -15443 -21983 -7365 24568 45929 37773 4729
7228D729p506J4708m02N733N324o239J417m533k677K0086k4468r006j8328J036
7214b0126J7852j1178J785j6175K708K3624L652M324o633k0169L1549J5208Q013
7201C4434J9348J9450q656l0384l0937r363l725L288j2034J7397J7767k0374r951
7188a3740P974k586j5291j2351J0310J7793K3815L6270k0334k8477N116n641k6519
7175b3661j9421k1039J9842L8112l882k5131j773M0979K0678P57q531J5716r098
7162B3548l5067j911m69J4979M865k8112j8731l634J8748M2232J5994J503k0752
7149A3193k1464J919K266k1807K6329P573j9171J4787P711k082N931k3036r343
7136a7194m732L3472j4178m5055k9966l5901K0907R635J0545J9992J050J2319
$$ plain form
7228 4729 -2777 11931 11529 17262 22586 16347 17764 13231 10554 30640 6172 -2834 -21162 -20126
7214 -20126 -2274 -13452 -11667 -27842 -25134 -1510 2142 6466 -167 -20336 11213 26421 34434
7201 34434 53782 73232 64576 34192 3255 -6108 -9833 -6545 -18579 -1182 16585 -3789 -13740
7188 -13740 -5766 -8352 -23643 -35994 -25684 -7891 15924 52194 31860 3383 8499 2858 -23661
7175 -23661 -43082 -64121 -44279 -6167 -10049 -35180 -36953 4026 24704 25461 16930 32646 23548
7162 23548 -11519 -13430 -13899 1080 5945 -22167 -40898 -44532 -25784 16448 32442 33945 13193
7149 13193 -8271 -6352 -4086 -25893 436 8009 -11162 3625 11336 9254 15185 -7851 -17194
7136 -17194 -21926 11546 -2632 -47687 -77653 -113554 -92647 -83012 -72467 -52475 -51425 -39106
7124c9106l71N637J0430J5369Q055O07J6228l1063j5482K3840j3158j7395J8768
7111a7641J1175J5588j7299p648K0411l443k6705k71K0833M680o959N907p236
7098h608P827R692K3601k9846j6645K3841J2119j1277m3982L270K6938m912Q055
7085G3J1964j8113o522J4406J866j1286N961R623j871k7627k2126j2849l203M798
7071e4906M2342L733l763O244J0526n02j836J3689k1043L153n500O448j9986l7420
7057e8821K842L4257J2457O127m846n09j7519n633L0912r115q632l524j354J1783
$$ plain form
7124 -39106 -39477 -33840 -23410 -8041 14 621 16849 -14214 -29696 -5856 -19014 -36409 -17641
7111 -17641 -6466 9122 -8177 -15825 4586 1143 -25562 -25833 -5000 -320 -7279 -1372 -8608
7098 -8608 -781 8911 32512 2666 -13979 9862 21981 10704 -33278 -30008 -3070 -7982 73
7085 73 12037 -6076 -12598 1808 3674 -7612 -1651 7972 6101 -21526 -43652 -56501 -59704 -54906
7071 -54906 -12564 -8831 -12594 -6350 4176 3674 1838 15527 -5516 -2363 -7863 -1415 -21401 -58821
7057 -58821 -55979 -21722 -9265 -3138 -7984 -8493 -26012 -31645 -733 -9848 -18480 -22004 -23358 -11575
$$ [...]
##END NTUPLES=NMR SPECTRUM
##END=
