##TITLE=Analysis number 321140
Compound Code mb 00242
Project Code adrs
Chemist Name ddcweighroom
##JCAMPDX= 6.0         $$ Bruker NMR JCAMP-DX V2.0
##DATA TYPE= NMR SPECTRUM
##DATA CLASS= NTUPLES
##ORIGIN= Bruker BioSpin GmbH
##OWNER= nmr
$$ XWIN-NMR		Version 3.5
$$ Wed Jul 26 18:54:12 2006 GMT Daylight Time (UT+1h)  MAYBRIDGE\nmr@NMR_250MHZ
##.OBSERVE FREQUENCY= 250.131544655141
##.OBSERVE NUCLEUS= ^1H
##.ACQUISITION MODE= SIMULTANEOUS (DQD)
##.ACQUISITION SCHEME= undefined
##.AVERAGES= 16
##.DIGITISER RES= 18
##SPECTROMETER/DATA SYSTEM= dpx250
##.PULSE SEQUENCE= zg30
##.SOLVENT NAME= CDCl3
##.SHIFT REFERENCE= (INTERNAL, CDCl3, 0, 16.522)
##AUDIT TRAIL= $$ (NUMBER, WHEN, WHO, WHERE, WHAT)
$$ ##TITLE= Audit trail, XWIN-NMR		Version 3.5
$$ ##JCAMPDX= 5.01
$$ ##ORIGIN= Bruker BioSpin GmbH
$$ ##OWNER= nmr
$$ C:\u/data/dgb/nmr/ADRS/3710/pdata/1/auditp.txt
$$ ##AUDIT TRAIL=  $$ (NUMBER, WHEN, WHO, WHERE, WHAT)
(   1,<2006-07-26 18:53:48.30 +100>,<MAYBRIDGE\nmr>,<NMR_250MHZ>,
      <created by zg, POWCHK disabled, PULCHK disabled
       configuration hash MD5:
       E2 DF 36 D8 04 B2 41 60 5A D7 A3 38 5A 4B D0 FE
       data hash MD5: 64K
       5E 8F A7 19 77 E9 7D 9F 1E 5F FB 99 06 50 62 67>)
(   2,<2006-07-26 18:54:02.82 +100>,<MAYBRIDGE\nmr>,<NMR_250MHZ>,
      <Start of raw data processing
       ef LB = 0.3 FT_mod = 6 PKNL = 1 SI = 32K 
       data hash MD5: 32K
       BC CB 52 A0 03 92 32 16 FB 44 FE EB A9 20 EF CB>)
(   3,<2006-07-26 18:54:04.35 +100>,<MAYBRIDGE\nmr>,<NMR_250MHZ>,
      <apk 
       data hash MD5: 32K
       5C 18 A1 8F BB 6B 94 5E D5 FC 01 E6 D0 F4 9C 0B>)
(   4,<2006-07-26 18:54:05.11 +100>,<MAYBRIDGE\nmr>,<NMR_250MHZ>,
      <abs ABSG = 5 
       data hash MD5: 32K
       7F C3 13 2B 5C 5E 1B 4C A1 B7 D2 E4 D0 0A EE F4>)
$$ ##END=
$$ 
$$ hash MD5
$$ DC 20 D0 EE 66 E3 D5 67 CD 6E 10 0D 2F 9E FE A1
##$RELAX= 
##$RELAX= 
##$RELAX= 
##$RELAX= 
##$RELAX= 
##$RELAX= 
##$RELAX= 
$$ Bruker specific parameters
$$ --------------------------
##$DU= <C:\u>
##$EXPNO= 3710
##$NAME= <ADRS>
##$PROCNO= 1
##$TYPE= <nmr>
##$USER= <dgb>
##$AMP= (0..31)
100 100 100 100 100 100 100 100 100 100 100 100 100 100 100 100 100 100 
100 100 100 100 100 100 100 100 100 100 100 100 100 100 
##$AQSEQ= 0
##$AQ_mod= 3
##$AUNM= <au_zg>
##$AUTOPOS= <1 >
##$BF1= 250.13
##$BF2= 250.13
##$BF3= 250.13
##$BF4= 250.13
##$BF5= 500.13
##$BF6= 500.13
##$BF7= 500.13
##$BF8= 500.13
##$BYTORDA= 1
##$CFDGTYP= 0
##$CFRGTYP= 5
##$CHEMSTR= <none>
##$CNST= (0..31)
1 1 145 1 1 1 1 1 1 1 1 1 1 1 1 1 1 1 1 1 1 1 1 1 1 1 1 1 1 1 1 1 
##$CPDPRG= <>
##$CPDPRG1= <>
##$CPDPRG2= <>
##$CPDPRG3= <>
##$CPDPRG4= <mlev>
##$CPDPRG5= <mlev>
##$CPDPRG6= <mlev>
##$CPDPRG7= <mlev>
##$CPDPRG8= <mlev>
##$CPDPRGB= <>
##$CPDPRGT= <>
##$D= (0..31)
0 1 0 0 0 0 0 0 0 0.06 0 0 0 0 0 0 0.0002 0 0 0 0 0 0 0 0 0 0 0 0 0 0 
0 
##$DATE= 1153936426
##$DBL= (0..7)
120 120 120 120 120 120 120 120 
##$DBP= (0..7)
150 150 150 150 150 150 150 150 
##$DBP07= 0
##$DBPNAM0= <>
##$DBPNAM1= <>
##$DBPNAM2= <>
$$ [...]
##$SUBNAM7= <"">
##$SUBNAM8= <"">
##$SUBNAM9= <"">
##$SW= 20.6930455092707
##$SWIBOX= (0..15)
0 0 3 0 0 0 0 0 0 0 0 0 0 0 0 0 
##$SW_h= 5175.983436853
##$TD= 65536
##$TD0= 1
##$TE= 295.16
##$TE2= 300
##$TE3= 300
##$TEG= 300
##$TL= (0..7)
0 120 120 120 120 120 120 120 
##$TP= (0..7)
150 150 150 150 150 150 150 150 
##$TP07= 0
##$TPNAME0= <>
##$TPNAME1= <>
##$TPNAME2= <>
##$TPNAME3= <>
##$TPNAME4= <>
##$TPNAME5= <>
##$TPNAME6= <>
##$TPNAME7= <>
##$TPOAL= (0..7)
0.5 0.5 0.5 0.5 0.5 0.5 0.5 0.5 
##$TPOFFS= (0..7)
0 0 0 0 0 0 0 0 
##$TUNHIN= 0
##$TUNHOUT= 0
##$TUNXOUT= 0
##$USERA1= <user>
##$USERA2= <user>
##$USERA3= <user>
##$USERA4= <user>
##$USERA5= <user>
##$V9= 5
##$VALIST= <valist>
##$VCLIST= <CCCCCCCCCCCCCCC>
##$VD= 0
##$VDLIST= <DDDDDDDDDDDDDDD>
##$VPLIST= <PPPPPPPPPPPPPPP>
##$VTLIST= <TTTTTTTTTTTTTTT>
##$WBST= 1024
##$WBSW= 4
##$XGAIN= (0..3)
0 0 0 0 
##$XL= 0
##$YL= 0
##$YMAX_a= 133744
##$YMIN_a= -188666
##$ZGOPTNS= <>
##$ZL1= 120
##$ZL2= 120
##$ZL3= 120
##$ZL4= 120
##$ABSF1= 16.522
##$ABSF2= -4.171173
##$ABSG= 5
##$ABSL= 3
##$ALPHA= 0
##$AQORDER= 0
##$ASSFAC= 0
##$ASSFACI= 0
##$ASSFACX= 0
##$ASSWID= 0
##$AUNMP= <proc_1d>
##$AZFE= 0.1
##$AZFW= 0.1
##$BCFW= 0
##$BC_mod= 0
##$BYTORDP= 0
##$COROFFS= 0
##$CY= 12.5
##$DATMOD= 1
##$DC= 0
##$DFILT= <>
##$DTYPP= 0
##$F1P= 14.0000005364418
##$F2P= -0.99999901652339
##$FCOR= 0.5
##$FTSIZE= 32768
##$FT_mod= 6
##$GAMMA= 0
##$GB= 0
##$INTBC= 1
##$INTSCL= 1
##$ISEN= 128
##$LB= 0.3
##$LEV0= 0
##$LPBIN= 0
##$MAXI= 10000
##$MC2= 0
##$MEAN= 0
##$ME_mod= 0
##$MI= 0
##$NCOEF= 0
##$NC_proc= -6
##$NLEV= 6
##$NOISF1= 0
##$NOISF2= 0
##$NSP= 0
##$NTH_PI= 0
##$NZP= 0
##$OFFSET= 16.522
##$PC= 1
##$PHC0= 155.6353
##$PHC1= 25.72628
##$PH_mod= 1
##$PKNL= yes
##$PPARMOD= 0
##$PSCAL= 4
##$PSIGN= 0
##$REVERSE= no
##$SF= 250.13
##$SI= 32768
##$SIGF1= 0
##$SIGF2= 0
##$SINO= 400
##$SIOLD= 32768
##$SREGLST= <1H.CDCl3>
##$SSB= 0
##$STSI= 32768
##$STSR= 0
##$SW_p= 5175.98343685301
##$SYMM= 0
##$S_DEV= 0
##$TDeff= 65536
##$TDoff= 0
##$TI= <Analysis number 999999
Compound Code 99
Book Reference 9
Project Code 9>
##$TILT= no
##$TM1= 0
##$TM2= 0
##$TOPLEV= 0
##$USERP1= <user>
##$USERP2= <user>
##$USERP3= <user>
##$USERP4= <user>
##$USERP5= <user>
##$WDW= 1
##$XDIM= 32768
##$YMAX_p= 424875547
##$YMIN_p= -3438166
$$ End of Bruker specific parameters
$$ ---------------------------------
##NTUPLES= NMR SPECTRUM
##VAR_NAME=  FREQUENCY,     SPECTRUM/REAL,   SPECTRUM/IMAG
##SYMBOL=    X,             R,               I
##VAR_TYPE=  INDEPENDENT,   DEPENDENT,       DEPENDENT
##VAR_FORM=  AFFN,          ASDF,            ASDF
##VAR_DIM=   32768,         32768,           32768
##UNITS=     HZ,            ARBITRARY UNITS, ARBITRARY UNITS
##FACTOR=    0.157963299565203, 1,           1
##FIRST=     4132.6476996994, 0,             0
##LAST=      -1043.33573715361, 0,           0
##MIN=       -1043.33573715361, -3438166,    0
##MAX=       4132.6476996994, 424875547,     0
$$ Real data points
##PAGE= N=1
##DATA TABLE= (X++(R..R)), XYDATA
$$ [...]
13804D68915O00559m32622l77200j88431J014345P05364M11376m51998m69454
13795A280854j279288j466395l20045L96070J090739q67840n42919K08827J18906
13786a381091J403787N36920r04658K85138M83245n37219l46204j42759M77140
13777a25701K93171o22825j38236R14868O26311n56795l50498L06386L86065o37055
13767I5691J45830K67669L28577o18212O97905P1880j138580m08433N89625n7866
13757b5914O31419L57898r76227j62489r08588j229753L39700Q61437K69869j96121
13747a038769j08726N35159L86016m3611N30554p2682k82028L15966N12825r6000
13737F38704p29277K81185J076124O63595P9847r49648j015348l12319J133174
$$ y = [468915, 1069474, 636852, 259652, 71221, 1085566, 1790930, 2202306, 1750308, 1280854, 1566, -1464829, -1784874, -1388804, -298065, -1165905, -1708824, -1499997, -1381091, 22696, 559616, -345042, -59904, 423341, -113878, -460082, -602841, -125701, 167470, -455355, -593591, 321277, 947588, 390793, 40295, 346681, 732746, 95691, 241521, 509190, 837767, 219555, 917460, 989340, -149240, -557673, 31952, -25914, 605505, 963403, -12824, -175313, -1083901, -2313654, -1973954, -1112517, -842648, -1038769, -1147495, -612336, -226320, -269931, 260623, 187941, -94087, 221879, 734704, 638704, -90573, 190612, 1266736, 1930331, 2010178, 1060530, 45182, -267137, 866037]
13728H66037K93633n21900k09950m09123j73227j009303l74708J012508J427760
13719I01727O3511o16306m23471l38146n91747L94651M49016J392274Q87158n53275
13709A565392j250127M46171M50150m03483j41136m94812j72974l44815m04965
13700g50599m68247l13567K89181o00397M87945J721343L02868m03705j142005
13691h77183K37945L92024J9159l64637m80049l17184O41823J4157R90841J223085
13681A479981M20253p28883j568752l67434N89976P15195K47018l80742O57912
13672A064524Q96742q63712q73827k97264J37746M06148q88501K15204n38365
13663g41305q9133J127496K28073k4881O60316k3897P04032l1009n95373q24737
$$ y = [866037, 1159670, 637770, 427820, 18697, -154530, -1163833, -1538541, -526033, 901727, 965238, 348932, -74539, -412685, -1004432, -609781, -160765, 1231509, 2118667, 1565392, 315265, 761436, 1211586, 808103, 666967, 172155, -819, -345634, -750599, -1218846, -1532413, -1243232, -1843629, -1355684, 365659, 668527, 264822, -877183, -639238, -247214, -228055, -592692, -1072741, -1389925, -748102, -733945, 256896, 1479981, 1900234, 1171351, -397401, -764835, -174859, 540336, 787354, 406612, 1064524, 1961266, 1097554, 223727, -73537, 64209, 470357, -418144, -202940, -741305, -830438, 297058, 525131, 500250, 1160566, 1136669, 1840701, 1809692, 1214319, 389582]
13653C89582M08652K36562k37448K4536o55823r60076p44029M2291L88900Q71226
13643b35627O25335J5193p19739q99785J93410J225594J601801q0613l22735J75599
13633A578433n81747j65206J053353M27993r6356L71517o83990j410649j032987
13624e39639M28877N80559K79980p14613q91606P27250k0378j07785R68773L80065
13614A091483o01046J7238N34174k76161q00915K66545P96257o54008M7772j4522
13604D06817j446989L09602P31832R23196p5866o67268j015730J019539L07897
13595D93030p5849j23399L88561l14072q13765K10782K11285l11867K00944j65139
13585b99489n15710j24649N26269O89764J204549j023208j859018L19233J122385
$$ y = [389582, 798234, 1034796, 797348, 821884, 166061, -794015, -1538044, -1495753, -1106853, -235627, 389708, 404901, -314838, -1214623, -1021213, 204381, 1806182, 1725569, 1402834, 1578433, 996686, 831480, 1884833, 2312826, 2216470, 2587987, 1903997, 493348, -539639, -110762, 469797, 749777, 35164, -856442, -129192, -149570, -257355, 711418, 1091483, 490437, 507675, 1041849, 765688, -35227, 231318, 1027575, 373567, 421339, 406817, -1040172, -730570, 1262, 924458, 848592, 181324, -834406, 185133, 493030, 417181, 293782, 682343, 368271, -445494, -234712, -23427, -335294, -134350, -299489, -815199, -939848, -413579, 276185, 1480734, 457526, -1401492, -1082259, 40126]
13576D0126L48974j246653J194143m25302j141855J14391j37001P69244J034358
13567E50425l96209m20960N8523r7472J12157O13031L29056m81981j17822P11603
13557H60351j60102j95940L42479M38157r71811r24957L73086J01109m19431K36593
13547c20466r3045Q38700K18476m51400K13016l37191j50916o12955j00871O31153
13537a65499k5661m83431l3797Q0298K69047k62786L71658J106464K26787k61663
13527H21417l16759k88856K94175p71999j23798J52758K90972j08844j135451
13518a186385M2165J39810P55794Q21125j65439r2331j089098k98553O99755J028934
13508F55777l63592n2991j44742q70897m88877M53122J291935l60868k43989k41138
$$ y = [40126, 389100, -857553, 336590, -88712, -1230567, -1116176, -1253177, -483933, 550425, 154216, -266744, -208221, -305693, -193536, 419495, 748551, 266570, 148748, 860351, 700249, 504309, 846788, 1284945, 313134, -611823, -238737, -137628, -557059, -320466, -413511, 425189, 643665, 192265, 405281, 68090, -82826, -695781, -796652, -165499, -191160, -674591, -708388, -628090, -359043, -621829, -250171, 856293, 1083080, 821417, 504658, 215802, 509977, -262022, -385820, -233062, 57910, -50934, -1186385, -1144220, -1004410, -248616, 572509, 407070, 314739, -774359, -1072912, -373157, 655777, 292185, 239194, 94452, -776445, -1265322, -812200, 479735, 118867, -125122, -366260]
13498c66260o94129J258333l2746o61168k31058M52283k71528N48439K2358O59270
13488F83794L35369n59252m65575k64376J82498L27497L74714p59975P7212m31747
13478d99841R2517M98795l10305l74423j70951l1341J072838O52622k78564J7110
13468F68457P73467m9385j059712L39959M08162n81692l73904L0210j7909l0937
13458A06716n03239p10973q9161L38804r4782n32789j6595N26556J06813P61045
13448a07605J93613J89908n1950p91203M99146K099486M54483J61625q25990p49684
13438A071829M76757m53372N77798J00008l30862q61692o32858k68949j05301
13429d26642M79810J260566k06136q11915j45590P48693L33326r98847Q3395O52759
$$ y = [-366260, -1060389, 197944, 165198, -495970, -727028, -274745, -546273, 2166, 24524, 683794, 1019163, 459911, -5664, -270040, -87542, 239955, 614669, -145306, -68094, -499841, -407324, 91471, -218834, -593257, -764208, -795549, 277289, 929911, 651347, 668457, 1441924, 1392539, 332827, 672786, 1080948, 499256, 125352, 155562, 137653, 106716, -396523, -1107496, -1196657, -857853, -952635, -1485424, -1502019, -975463, -868650, -107605, 86008, 275916, 223966, -567237, -68091, 2031395, 2485878, 2647503, 1821513, 1071829, 1548586, 1095214, 1673012, 1773020, 1442158, 580466, -52392, -321341, -426642, 53168, 1313734, 1107598, 295683, 150093, 898786, 1232112, 233265, 316660, 969419]
13419I69419p30867J65522J61975J77025o75562q21937J32346J062259M09765
13410H49945p75957j84311L36974P1126j48087K93508K26414o88793m95072P6293
13400d37960O16989j70101J67721k35599M72364k11163m93822j43698k0215k24168
13390f79652j89258N56745J59139P92436l5804M83511L54178m07036o14860n98742
13380a79343N78776n46515m23472k02709M94639K63910m07063l70165P9921J82401
13370e29620l72918L2287O80047L71429J54843q29404j080659P39660O94996O00008
13360D60669p41720n80267P54628K86711q44838m47380n94691M26420P19104M01748
13350a59616j10527m46322P7320L84434P90031P33610j58894L65145r59143l88044
$$ y = [969419, 238552, 404074, 566049, 743074, 67512, -754425, -622079, 440180, 849945, 73988, -110323, 226651, 297777, 149690, 443198, 669612, -19181, -514253, -437960, 179029, 8928, 176649, -58950, 413414, 202251, -291571, -435269, -455484, -679652, -868910, -312165, -153026, 639410, 603606, 1087117, 1441295, 1034259, 419399, -179343, 399433, -147082, -570554, -773263, -278624, -14714, -421777, -791942, -712021, -529620, -902538, -870251, -190204, 181225, 336068, -493336, -1573995, -834335, -139339, 460669, -281051, -861318, -106690, 180021, -664817, -1112197, -1706888, -1280468, -561364, -159616, -270143, -716465, -639145, -254711, 535320, 1268930, 1110036, 1475181, 516038, 127994]
13340A27994l37796q25088Q37921Q2331m23682L54332L63694K18739M61765m70764
13330C89446K19514l31741K45048k60174K81487J9157L02940M82335j29999j34788
13320A083225k83771k4804r87491J07196J50973q20504m4127k22044o87793N94935
13310a134205O93449k59058J79729O21840R21352J39799L78262N17280o93334
13301A365114j603354O00570k78608N89586L1271j20515m84719j107546p70320
13292a778521N65972J830524L14761q71990r7120M14844p6863j17791r10195r1954
13282h18333M75032N4578l28563K37561K86702L4075m74329j51204J50019N12453
13272b2009N8841l16040P53273o9151j13723k8919m89735l33152q07110k5912
$$ y = [127994, -209802, -1034890, -196969, -114638, -538320, -183988, 179706, 398445, 860210, 389446, 608960, 277219, 522267, 262093, 543580, 562737, 865677, 1348012, 1218013, 1083225, 799454, 774650, -212841, -105645, 45328, -775176, -819303, -1041347, -1729140, -1134205, -440756, -699814, -520085, 101755, 1023107, 1162906, 1541168, 2058448, 1365114, -238240, 362330, 83722, 673308, 704579, 584064, 99345, -1008201, -1778521, -1212549, 617975, 932736, 60746, -36374, 378470, 301607, 183816, -726379, -818333, -343301, -288723, -617286, -379725, -93023, -58948, -533277, -684481, -534462, -22009, 36832, -279208, 474065, 404914, 291191, 262272, -227463, -560615, -1367725, -1393637]
13262a393637L08511r3267m5022Q5998P50657N81221m78726m71876J315184Q55861
13252A414904N13208n88025l86645q82994j93813K97800k97264K35790k35916
13243a22955k50508l55231j46499M46208L92771n14495l17972J264924P35019
13234A131262q47731l07973J64596j75073o10806o334Q31879N99316j07652q9626
13224E81858r5888l96942m29539m64581k43415M62930K57432k5786n37547n14934
13214a406412J33970J206310J457669K91196m16511L448K72071o87549p68085
13205H6107j06329r23423n13532k02238P4540R59982O57156N61840j10087N69737
13195A053753o27105j660164m88069M32985m55152j58269L08724J28787l11739
$$ y = [-1393637, -1085126, -1178393, -1223415, -1137417, -386760, 194461, -284265, -756141, 559043, 1414904, 1928112, 1340087, 953442, 70448, -123365, 174435, -122829, 112961, -122955, -373463, -728694, -875193, -428985, -36214, -550709, -868681, 396243, 1131262, 283531, -24442, 140154, -34919, -645725, -652059, 179820, 779136, 671484, 581858, 485970, 89028, -340511, -805092, -1048507, -585577, -328145, -353931, -891478, -1406412, -1272442, -66132, 1391537, 1682733, 1266222, 1269670, 1541741, 854192, 86107, -20222, -943645, -1457177, -1659415, -1584875, -624893, 32263, 594103, 484016, 1053753, 426648, -1233516, -1721585, -1288600, -1743752, -1902021, -1593297, -1464510, -1776249]
13186a776249P291J07462J153685J232821N29815l25801p2611n30085k98628N92117
13176F19817R1306J168563L4220p32482q36492j51786P29794q37351p73740L17179
13166c70972p16827n57575J84904J42966L99514Q72730N81123m55485P8962M20248
13156E79588r49236P7440J094187k36107J84105Q6084m17533J29528l9545M5709
13146E54220M69216q68727k55339K83552q32452j93360J97544M119J293728N24557
13136A177058n43813p0255q45767n5922M42255O53494J51661p35901j487398j34620
13126a449208N03112M18589J197267O6790o26996J98030l98881P98252o96702
13117A0253n33701J789L39279L13487N81307n89922m93927r5319l15187q15406
$$ y = [-1776249, -1768958, -1661496, -507811, 725010, 1254825, 929024, 856413, 326328, 27700, 619817, 711123, 1879686, 1913906, 1181424, 344932, 193146, 922940, 85589, -688151, -370972, -1087799, -1645374, -1460470, -1317504, -917990, -45260, 535863, 80378, 159340, 579588, -369648, -292208, 801979, 565872, 749977, 836061, 418528, 548056, 508511, 554220, 1023436, 154709, -100630, 182922, -649530, -842890, -645346, -641227, 652501, 1177058, 633245, 562990, -282777, -338699, 103556, 757050, 908711, 172810, -1314588, -1449208, -946096, -527507, 669760, 736550, 109554, 307584, -91297, 706955, 10253, -523448, -521659, -182380, 131107, 712414, 122492, -371435, -466754, -781941, -1597347]
13107a597347J189802L45119j4183L98870r84563o79356P07405P62201R19563
13098A047511j20523J70013j57306R82435M53947n40460J30326p83691r61922
13089B20330r60207j28061J174624J068383l90711j093578j480297M39330Q90165
13080b60022K93680m90561p63272m11736j91711M94899J77669L49253J29924m25968
13070a097845J126793P42494o67856m9318L19263l1151j296341N31015j65074
13061e88020l33513J079382Q71942k19855J50425L76961k12490j89488k56160
13052F79184m42294o10939J1411o27328p31047J52025L89553j23278m10987J016266
13042f97434J319011J05578M8826Q89135r61298K30105J88868n52415j157004
$$ y = [-1597347, -407545, -62426, -76609, 322261, -662302, -1341658, -634253, 127948, 1047511, 926988, 1097001, 939695, 1922130, 2376077, 1835617, 1965943, 1182252, 220330, -739877, -867938, 306686, 1375069, 984358, -109220, -1589517, -1150187, -260022, 33658, -456903, -1220175, -1631911, -1823622, -1328723, -1151054, -801801, -671877, -1097845, 28948, 771442, 103586, 54268, 373531, 342380, -953961, -422946, -588020, -921533, 157849, 1029791, 809936, 960361, 1337322, 1124832, 935344, 679184, 236890, -374049, -362638, -989966, -1721013, -1568988, -1179435, -1302713, -1713700, -697434, 621577, 727155, 775981, 1665116, 703818, 933923, 1122791, 570376, -586628]
13033e86628q28158J28831M67822n75593K19953K87430N20859R17265j28238k32331
13023A91212P59201N1844k84718k84566J6529O36242n20434l31771j28102j650
13013A03787n16004r8265R2316j06669K29988j44142J55165Q19711K82849o33800
13003A84936p15300K84340K5560J40783m97035L80937O66611R20367j29046l40973
12993I21180j02182j071265R4982J707316N73573q85736k5033j151950j111844
12984a050959J90864k81252K7279M13930K41420N73774n51772j21711n35289o16101
12974a709817L13611M03962P27819O05980q07905j209648J30457K5431O20720
12965h99390P42805P22782n13321n68028j338909K00077J084857K83867k3864
$$ y = [-586628, -1414786, -1285955, -818133, -1393726, -1173773, -886343, -365484, 551781, 423543, 191212, 950413, 1002257, 717539, 432973, 449502, 1085744, 565310, 233539, 105437, 103787, -412217, -510482, -418166, -524835, -294847, -438989, -283824, 535887, 818736, 184936, -530364, -246024, -220464, -79681, -576716, -195779, 470832, 1391199, 1262153, 921180, 818998, -252267, -157285, 1550031, 2123604, 1237868, 1212835, 60885, -1050959, -860095, -1141347, -1114068, -700138, -458718, 115056, -436716, -558427, -1093716, -1709817, -1396206, -992244, -264425, 341555, -466350, -1675998, -1545541, -1520110, -899390, -156585, 566197, 52876, -515152, -1854061, -1653984, -569127, -285260, -309124]
12956c09124J65451M68261n14310O11476M88073k95055l08493p27976n09216R78039
12946D7126J049548o75600j106827l40959o39224M09309N0839R05542k22868n90801
12936a113915k68501R07624L82197k99642J010192l80567k89660m97795k92864
12927h42931n28743J040470L93411m78668J037859R90111j73382j024785L31872
12918G45214R43915k01313m82496N66695n02334j168708l57822m58476L38944
12909e76381O70418J87689k88093L20195k96421J01158o56579K17880j89305o1878
12899e71317N08707n28006k05104J119311J4515m31253K17482j29803n03928O93911
12889A84515m92441r18501Q42878N65427J68729o22060N19865p5763O66349K57107
$$ y = [-309124, -143673, 324588, -189722, 421754, 909827, 614772, 306279, -421697, -930913, 47126, 1096674, 421074, -685753, -1026712, -1665936, -1256627, -1205788, -300246, -523114, -1113915, -1382416, -474792, -92595, -392237, 617955, 237388, -52272, -550067, -842931, -1371674, -331204, 62207, -416461, 621398, 1611509, 1438127, 413342, 745214, 1689129, 1487816, 1005320, 1572015, 1069681, -99027, -456849, -915325, -576381, 94037, 281726, -6367, 313828, 17407, 118565, -538014, -320134, -509439, -571317, -62610, -590616, -795720, 323591, 338106, -93147, 124335, -5468, -509396, 184515, -307926, -1226427, -383549, 181878, 350607, -271453, 248412, 172649, 838998, 1096105]
12879A096105p12621p66169n58322n7739P41851p8298m00364Q4418K59065J094967
12869G02893Q17973k50670J68982L44828o49007r92181M42131l01143n19779L2492
12859b03481L61891n98045r87871K57498M33679K95817K98999K28557M69405L24348
12849H80797q05796R8332R0717j099129j24207N98599L14795J14103L28943J77295
12839E74449L22719l20933M55478N77732J31414n99407q17186r78792p2311L11883
12829d14954J275384M60013K02928L3441n18185r41909l63886P9274O53691n71168
12819a05371o94927k69497K20851J418736K67080j85185O7462o62632o56933M86969
12809a13447L1629n5232n36993L12219O1689p16148k50933P80784J04864P07984
$$ y = [1096105, 383484, -382685, -941007, -998746, -256895, -335193, -735557, -651139, -392074, 702893, 1520866, 1270196, 1439178, 1784006, 1134999, 142818, 584949, 283806, -235973, -203481, 158410, -439635, -1427506, -1170008, -736329, -440512, -141513, 87044, 556449, 880797, 75001, 173333, 264050, -835079, -959286, -360687, -45892, 68211, 397154, 574449, 897168, 576235, 1031713, 1609445, 1740859, 1141452, 324266, -654526, -726837, -414954, 860430, 1320443, 1523371, 1556812, 1038627, 96718, -267168, -187894, 465797, -105371, -800298, -1069795, -848944, 569792, 836872, 651687, 719149, 56517, -600416, -113447, -81818, -137050, -674043, -361824, -300135, -1016283, -1267216, -486432, -381568, 326416]
12799C26416M57421N05011o39668j150938R5980L3073j108062J58227O39573K18625
12789d64342l30458k79092j80922p74510J169453Q23763o65104L03782k66176
12780f63606L56011k39658n46916O50884J404461L99515j032927O3375l73524
12771A7615j67522K99622N83290J84190L63577k68041j444713M96659J97883n3912
12761B08648k88127J60518r70917j15213J061311O69185k51901J01193k73519
12752C01178k58122Q7288k8284l34389K86240N20122J261951L47609n20106r11335
12742G52152P25752l74070q63455p8044p81479r16201L55249M37564K70027o43360
12732a115865L61426J581818N45177m49819n65224j142756p91227K62194L20780
$$ y = [326416, 783837, 1288848, 649180, -501758, -405778, -372705, -1480767, -1322540, -682967, -464342, -794800, -1073892, -1254814, -2029324, -859871, -36108, -701212, -397430, -663606, -307595, -547253, -1094169, -443285, 961176, 1360691, 327764, 391139, 17615, -149907, 149715, 733005, 917195, 1280772, 1012731, -431982, 64677, 262560, 208648, -79479, 81039, -889878, -1005091, 56220, 725405, 473504, 574697, 301178, 43056, 130344, 102060, -232329, 53911, 574033, 1835984, 2183593, 1663487, 752152, 1477904, 1103834, 240379, 162335, -619144, -1535345, -1180096, -742532, -472505, -1115865, -754439, 827379, 1372556, 922737, 357513, -785243, -1576470, -1314276, -993496]
12723i93496L64208R26672L59858O9453j026976j258255p4157R15688N92818r50816
12713a075003O72985P09612j89826q39967k95927r3905j21834O85280R75091J43382
12703E69888l21732j46531R41739J12562k15972l28708o98108k61337k07521M28707
12693a27013J113265N94027l11796p96853l66242q5258J17909n71972n271R79458
12683E40254O4208j123619j167212r6690k29586L99068Q09224j58523N19815k9385
12673d72446k25904Q13014M14669L00984p69591m38943K09565M10375J024998
12664A266721K02456J15235M16686r68804j171978j032161O96753O49277r94525
12655h20340n29208Q59976N27963q3474r27332O9031l0458L4930k02807P14842
$$ y = [-993496, -629288, 297384, 657242, 726695, -300281, -1558536, -1632693, -717005, -124187, -1075003, -402018, 307594, 117768, -722199, -1018126, -1112031, -1233865, -548585, 426506, 569888, 248156, 101625, 1043364, 1155926, 939954, 611246, -86862, -348199, -555720, -127013, 986252, 1580279, 1268483, 471630, 105388, 20130, 138039, -433933, -439204, 540254, 604462, -519157, -1686369, -1783059, -2012645, -1613577, -804353, -962876, -443061, -472446, -698350, 114664, 529333, 830317, 60726, -378217, -168652, 241723, 1266721, 1469177, 1584412, 2001098, 1032294, -139684, -1171845, -475092, 174185, -820340, -1349548, -489572, 38391, -45083, -972415, -903384, -933842, -898912, -1101719, -386877]
12645c86877m22886j455O11940K9205J003092k09032l01441o12318r20303R5778
12635a114297Q30556N52212n98144K68515P05637K90696M43178n08918k73806
12626E95629O28583P4145p19589l90317j315817r95124J049068J030124N06954
12617D63656M52111P64663O76861j112815K90312l45581M2341R5596l08634p87768
12607B30742o2463M34926K49994j088712K88329J079143N63877p73188o70725
12598B51923N67197l81566o65274m64644j14464l6183P56831J139736M88133k17502
12588A324187l99918N715R35542j90657r80817n71912K54089J88811k67918O9426
12578C66548J8981q94762n86555R8051M44192N27125l24972j13878k70035N66322
$$ y = [-386877, -809763, -811218, -199278, -170073, 833019, 623987, 322546, -289772, -1210075, -1114297, -283741, 268471, -329673, -61158, 644479, 935175, 1378353, 869435, 595629, 1224212, 1298357, 578768, 188451, -1127366, -2122490, -1073422, -43298, 463656, 915767, 1680430, 2357291, 1244476, 1534788, 1189207, 1231548, 1327144, 1018510, 230742, 168279, 603205, 853199, -235513, 52816, 1131959, 1695836, 922648, 251923, 819120, 437554, -227720, -692364, -806828, -843011, -86180, 1053556, 1541689, 1324187, 924269, 929984, 1865526, 1674869, 694052, 122140, 376229, 565040, 297122, 366548, 385529, -509233, -1095788, -997737, -553545, -26420, -351392, -465270, -735305, -168983]
12568a68983o45276n19198k25120m10380n94511L44254m82664P40391M97809J001039
12558d62639P56649q93576q49943R76488N08322J80215k69877J83598M57211k39043
12548C47405l40326j185735l09487j18796J374154N28861R32914J087886n33502
12539A783374j291831j63456J7904m04914l6667k19012N670K1834l61209m31047
12529a079354K61044q29113N35747J030484J163843K62930j436158j193861R18928
12520c65510Q32033K03041L48534N01946n4459j163225N36012J36609k76718p19187
12510b0924l18109p74720L62539J361149Q26602o03908q51264m14363J63405o3860
12500c33453n48093m59729l48940O8492N41527P14943L38604M8656J10611K90917
$$ y = [-168983, -814259, -1333457, -1558577, -1968957, -2563468, -2219214, -2701878, -1961487, -1463678, -462639, 294010, -599566, -1449509, -473021, 35301, 215516, -54361, 129237, 586448, 347405, 7079, -1178656, -1488143, -1606939, -232785, 296076, 1228990, 2316876, 1783374, 491543, 328087, 345991, -58923, -95590, -314602, -308932, -287098, -648307, -1079354, -818310, -1647423, -1111676, -81192, 1082651, 1345581, -90577, -1284438, -365510, 466523, 669564, 1018098, 1520044, 1465585, 302360, 838372, 974981, 698263, -20924, -339033, -1113753, -751214, 609935, 1436537, 832629, -18635, -432998, -269593, -333453, -881546, -1341275, -1690215, -1621723, -1080196, -365253, -26649, 22007, 132618, 423535]
12490D23535K916M59233K94116q62464j497625o38198K02977J048361P29168N6837
12480B18856O63163O752p39372j58963m36454k54296K14366m44450j6766O81780
12470b65384j91001R09189O65078n43725o78250O76488N7671n66098J66551O47934
12460H78453q59411o04518j04014P04189j66836J12723k19770J28867K70419o3955
12450G6147J277655L91486m55746r43216p5046j87218m09755J24274j23920l53631
12440f78970J96788N03099r75630r9878J006981J6591N93628M25854q21857m22828
12430b56222l20945m14702M33611R0199Q25998K81757p72522o29368j27012Q16617
12420g2589J45464M12581M42884m26920K60375J242832m56387n57147j5593r41245
$$ y = [423535, 426451, 885684, 1179800, 317336, -1180289, -1818487, -1615510, -567149, 162019, 218856, 882019, 888771, 149399, -9564, -446018, -700314, -485948, -930398, -947164, -265384, -456385, 452804, 1117882, 574157, -104093, 572395, 630066, 63968, 230519, 878453, 19042, -585476, -689490, 14699, -152137, -39414, -259184, -130317, 140102, 76147, 1353802, 1745288, 1289542, 346326, 271280, 84062, -325693, -201419, -325339, -678970, -482182, 20917, -954713, -1054591, -47610, -31019, 562609, 988463, 166606, -256222, -577167, -991869, -558258, -468059, 357939, 639696, -132826, -762194, -889206, -72589, 72875, 485456, 928340, 501420, 761795, 2004627, 1548240, 991093, 975500, 34255]
12410C4255j152400L27240K25666l9954k95497l15631M23849J50046J50404M71155
12400b0867J41220K89100M33052m4131J20746J58344m34178j18071n74021M9166
12390C60J46074Q32510n23543n12964j18040J048438k61666k25293n56180L11815
12380A41511J55482q79994l6196N17055N21115k13530k05007p07903p9439k33928
12370a020834m6494L50967N54345o9785J52734L16557j69775n90817P14278K62907
12360D54083J330546k50002p56545R8955P95133J57202l4864p55953o296m00400
12350F31859o99608L43092L30842M85550Q42680N93721k83107p61515m27777k28165
12340H27572L0756m79994o15452m73221r8929P83784o0335K28632m22004j108838
$$ y = [34255, -1118145, -790905, -565239, -605193, -900690, -1216321, -792472, -642426, -492022, -20867, 120353, 409453, 842505, 798374, 919120, 1077464, 643286, 525215, -48806, 360, 146434, 978944, 455401, -57563, -175603, 872835, 611169, 385876, -170304, 141511, 296993, -583001, -619197, -102142, 418973, 205443, 436, -707467, -786906, -1020834, -1067328, -716361, -162016, -231801, -79067, 237490, 67715, -523102, 191176, 454083, 1784629, 1534627, 778082, 877037, 1672170, 1829372, 1794508, 1038555, 1032259, 631859, -67749, 275343, 606185, 1091735, 1934415, 2528136, 2245029, 1483514, 1055737, 827572, 858328, 378334, -237118, -710339, -809268, -25484, -85819, 142813, -279191, -1388029]
12330a388029J40602O42275O65980q64107p82033J035662N92782Q00491l73466
12321D70157j131248L74528J097228n29709j87355J09950J79731Q4159J68270
12312F35711m55930p49372R79188m54246m98923J057064N67384o44278O087l89302
12302E3383j119378L10366J597059k52759l4949n9057L69984k5120j446381N66763
12292d0089P75403k45634N09315m0224K60845M52705p14692p36075k36101J34694
12282A20147R4770m77623m53493m23461L76044m63764r2918O75846Q60957n31013
12272c14508K500m05600k6211O35610m11390m4671j69094n36999n67906O88530
12262a149739L65130J62174O3414M15241K66316P02219n89946p68798q17700L35895
$$ y = [-1388029, -1247427, -605152, 60828, -803279, -1585312, -549650, 43132, 843623, 470157, -661091, -286563, 810665, 280956, 93601, 203551, 383282, 467441, 635711, 179781, -569591, 409597, -44649, -543572, 513492, 1080876, 436598, 442685, 53383, -1065995, -755629, 841430, 588671, 553722, 494665, 864649, 839529, -606852, -40089, 735314, 489680, 998995, 958771, 1219616, 1672321, 957629, 221554, -14547, 120147, 214917, -262706, -716199, -1139660, -763616, -1227380, -1320298, -644452, 216505, -314508, -312008, -717608, -743819, -108209, -519599, -564270, -733364, -1270363, -1838269, -1149739, -784609, -622435, -559021, -143780, 122536, 824755, 234809, -533989, -1351689, -1015794]
12252a015794L41684L94418o32861J76045J487891m59945o42990k46707J583550
12243I85291K36370p95218p5688k25032O22681p2388J15387o16596p28156r99934
12233a553283J90242J156897K74827M43644K5951p06654p734m27809R47694Q73033
12223A216808m65498m11590o6757q2041l64929J100508O42613o54341l06774k94464
12213C13535j10635m46823P45380J56879J44531L91504j800709k033773P77175
12204a862936J220812P16311J10540n38897L63822N27285j471229k5833P97163
12195a62962K31280j70939L79895O57095q07536M8950Q58352k96185j315072J159216
12185E82094N65975J221048k65598n34750m57715j90290n9767l32874l4126M23626
$$ y = [-1015794, -674110, -279692, -912553, -736508, 751383, 291438, -351552, -598259, 985291, 1221661, 426443, 350755, 125723, 748404, 676016, 791403, 174807, -553349, -1553283, -1363041, -206144, 68683, 512327, 538278, -168376, -176110, -603919, 343775, 1216808, 751310, 339720, 272963, 190922, -174007, 926501, 1569114, 914773, 607999, 313535, 202900, -243923, 501457, 658336, 802867, 1194371, -606338, -2640111, -1862936, -642124, 74187, 184727, -354170, 9652, 536937, -934292, -960125, -162962, 68318, -102621, 277274, 934369, 126833, 175783, 1034135, 737950, -577122, 582094, 1148069, 2369117, 2103519, 1568769, 1111054, 920764, 860997, 528123, 493997, 917623]
12175I17623K45616r4247n77849k31485l40621r07989M32529O71035p9420K43170
12165B78362p2399M82107P06938o0336O5729L32236J77490j325257j151168Q9746
12155d76552L23668o004K44203m8761p20463o46091R76919L32093L0562L56956
12145C66530l31674l90427l8528O32609l22898N0739M99783J73630k3201q10211
12135a93648k002018q29938J455315J276086N27466P14898Q88166J127614j41026
12126B822915m69883j256915n71967M50846l30458J43005K30492l00267j72923
12117E44845K22471K68255L01802n77018j037388k84053K56426K54884Q44595
12108G94819m8221k87774L20524j40790l21388j53661j358824j37389Q78089m4506
$$ y = [917623, 1163239, 1068992, 491143, 259658, -80963, -988952, -556423, 114612, 35192, 278362, 205963, 688070, 1395008, 1334672, 1400401, 1732637, 1910127, 584870, -566298, -476552, -152884, -158888, 85315, 36554, -683909, -1330000, -353081, -20988, 9574, 366530, 34856, -355571, -394099, 238510, -84388, -33649, 466134, 639764, 616563, -193648, -2195666, -3025604, -1570289, -294203, 233263, 948161, 1836327, 2963941, 2822915, 2353032, 1096117, 524150, 974996, 644538, 787543, 1018035, 717768, 544845, 767316, 1035571, 1337373, 760355, -277033, -561086, -304660, -49776, 794819, 746598, 458824, 779348, 638558, 317170, 163509, -1195315, -1332704, -454615, -499121]
12098d99121P793K91595O47051j74247j76771M73447K9609l25782j244906k34082
12088a205414N49235j46073R9225O18914P77876L92525K11663J11486q22697q96896
12078c10156j12320O65130l02747M1340K13421p92222J61012j15234r2573O88400
12068D4051R4149k03465N12998M0150K67662L17589O9776k22593r62866l40602
12058c83151R74867k90319L22833L21893L63179q19164p24851M88734J013021
12049A267042q80294j326776J279J85613j87948j10452J008006P48460k73368
12040D31562m21272J07934O6357K48062n7981N94233j39423l30008n67711l78648
12030d46895q36812l26647R0114l79628M62642N09562j61347J919313J276489
$$ y = [-499121, -491328, -199733, 447318, 273071, 96300, 569747, 599356, 273574, -971332, -1205414, -656179, -802252, -703027, -84113, 693763, 1086288, 1297951, 1409437, 586740, -310156, -422476, 242654, -60093, -18753, 194668, -597554, -436542, -551776, -644349, 44051, 138200, -65265, 447733, 487883, 755545, 1073134, 1142910, 920317, -42549, -383151, 591716, 301397, 624230, 946123, 1309302, 490138, -234713, 254021, 1267042, 386748, -940028, -938749, -753136, -941084, -1051536, -43530, 704930, 431562, 10290, 118224, 184581, 432643, 374662, 968895, 829472, 499464, -68247, -446895, -1283707, -1610354, -1520240, -1899868, -1437226, -927664, -1089011, 830302, 2106791]
12021B106791L64797k89630j631810j16001r6466r00792K5434K85188n51879n92593
12011a396961l25890R138N02913N48881p1616O59954L19313Q42573L60750j379879
12001F9176l69095K03106j97068L38006p59443k87015R81031m41908J36391J079011
11991G52192J03344P99818J072520r32504j362914j402124q08075k08633J134180
11982h52196J077483O71507n821j017235j325044o90445P73959M83422O74347
11973b10023J4973j401624l3747J344530Q86244Q3123o48356j57316J045301j56974
11963G66131q5589K57515N00963J51071J10260Q5982j031835n92098j8407k76538
11953a32545J85458l70197j59614N29730J37500j81301P07132L58630M44781l74967
$$ y = [2106791, 2471588, 2181958, 550148, 434147, 337681, -563111, -537677, -252489, -804368, -1396961, -1722851, -1713713, -1210800, -661919, -733535, -73581, 245732, 1088305, 1449055, 69176, -299919, -96813, -293881, 44125, -715318, -1002333, -21302, -463210, -326819, 752192, 855536, 1655354, 2727874, 1795370, 432456, -969668, -1777743, -1986376, -852196, 225287, 896794, 890973, -126262, -1451306, -2141751, -1367792, -884370, -210023, -195050, -1596674, -1630421, -285891, 600353, 683476, 35120, -122196, 923105, 766131, 680542, 938057, 1439020, 1590091, 1700351, 1786333, 754498, 162400, 143993, -132545, 52913, -317284, -476898, 52832, 190332, 9031, 716163, 1074793, 1519574, 1144607]
11943A144607L748l32311q25106p64667J33404L78359n95135n85866N95270J213711
11933C66014n67109j05500l97844O06065L05888j146962l94991M87909J79749
11924f66781k05083K940N96020K12245N73819q5741l23076n45626L6384O64963
11914B60064n75798m15543k47229n34667l52754l67585O78480Q21718m51576P93080
11904c91810P02289K94690l01313n8907J90647l46591J89166L07272N68530l1362
11894A122611N21736P14820o8052o92202j610722j437066J059264K39261o17207
11885g67557o14584j19515N02536j36002N26717p8970L05414o73131k77037J579382
11875B47253J0850J1594Q29549m88334o14537n69655P23220Q57623O31916K78282
$$ y = [1144607, 1148355, 816044, -9062, -773729, -640325, -261966, -857101, -1442967, -847697, 366014, -201095, -306595, -704439, -98374, 207514, -939448, -1334439, -846530, -666781, -871864, -868924, -272904, -60659, 513160, 427419, 104343, -441283, -404899, 260064, -315734, -731277, -978506, -1513173, -1865927, -2233512, -1555032, -733314, -1184890, -391810, 310479, 605169, 303856, 244949, 435596, 89005, 278171, 585443, 1153973, 1122611, 1644347, 2359167, 2291115, 1598913, -11809, -1448875, -389611, -150350, -767557, -1382141, -1501656, -999120, -1135122, -608405, -687375, -381961, -1055092, -1332129, 247253, 258103, 269697, 1099246, 610912, -3625, -573280, 149940, 1007563, 1639479, 1917761]
11865A917761q18952r37273J10576R8131J55834Q77678O0811j30523o22325l35031
11855C76687j86202J61392J59421q50349n39977m37089P82641R71576J65666n13575
11845I0191l73800R64741j86222N37121K71111m07668o81566m51468J505866j13969
11835A154337k168244k11884M31907P78508n43133j4296q16142K95447N27813
11826e65687J60464J26739l80165Q0257j99018k99977J56896Q426M26826N71473
11816H6234L87477l36404p87860k5094m53097o34222J47266M49663J47777j352105
11806b370365n33491K06108J142267Q62343P35011P95738l7229j229818N80960
11797A51524K28740P5607j5453R22022M08155o26750j258766m23034O24850J67517
$$ y = [1917761, 1098809, 161536, 272112, 370243, 526077, 1403755, 1464566, 1334043, 711718, 376687, 190485, 351877, 511298, -339051, -879028, -1316117, -533476, 438100, 603766, 90191, -283609, 681132, 494910, 1032031, 1303142, 895474, 213908, -237560, 1268306, 1154337, -1013907, -1225791, -793884, -15376, -558509, -572805, -1388947, -1093500, -565687, -405223, -278484, -658649, -578392, -777410, -1077387, -920491, -912065, -485239, 86234, 473711, 137307, -650553, -675647, -1128744, -1762966, -1615700, -1166037, -1018260, -2370365, -2903856, -2697748, -1555481, -693138, 41873, 837611, 800382, -429436, 151524, 380264, 455871, 440418, 1362440, 1770595, 1143845, -114921, -537955, 86895, 254412]
11787B54412o49086N06875L96816q12903j034314O06529O14853M69752N73420
11778I26354j110916j98269L68425l41296j179606m59008K70879Q75196R8560
11769g49681M37416N61541Q3890K62589j3930J80050j048450j77312n62837m16203
11759a442927k65913J87291J78428r4458K72474q0533O21316P3079K18046p05154
11749a038351M36192K55766J94829p0213l59693j725198Q82487Q21747j53944
11740g56378N27301N1573P9419k42634J30633M16217J457217n3977p46885N4558
11730I17044j86966n74775J61143N6314P0025L16982o95954K35730P36098k70367
11720G65274j652151j252797O435M32907Q30887k01351Q05171O13287l74298m01257
$$ y = [254412, -394674, 112201, 509017, -303886, -1338200, -731671, -116818, 352934, 926354, -184562, -382831, -14406, -355702, -1535308, -1994316, -1723437, -848241, -749681, -312265, 249276, 333166, 595755, 581825, 761875, -286575, -463887, -1026724, -1442927, -1708840, -1521549, -1343121, -1437579, -1165105, -1245638, -624322, -551243, -333197, -1038351, -602159, -346393, -151564, -221777, -581470, -2306668, -1424181, -602434, -756378, -229077, -177504, -98085, -340719, -210086, 206131, 1663348, 1609371, 862486, 917044, 730078, 155303, 316446, 372760, 442785, 759767, 63813, 299543, 1035641, 765274, -886877, -2139674, -2133239, -1700332, -869445, -1070796, -265625, 347662, -26636, -427893]
11710d27893j185536L47973K04039K83963J269510j69343n26963L54104p16318
11701e66464M5239L57467J41227j265702J30463O79600L41809j52938M2346N0532
11691a96421Q1483k39584O14382J235379L90916o54424r80256r12558j193508
11682a854591n25878K80894M96123O80936K46976M03790M85343j69885q7554O4962
11672B1116j40197n93745O78735J6315m64093p04094K2881N91218m71832L1781
11662a011915J164632K12045l4050q93550l09694M69741J22222K66136J491152
11653A476719K53276r87306m58283L70311M53774M82116j177497P3159K64996
11644G51265k72888j275305K8472j59736P16250J007214J175484J14134r99976
$$ y = [-427893, -1613429, -1265456, -1061417, -777454, 492056, 322713, -204250, 149854, -566464, -521225, -163758, -22531, -1288233, -1157770, -478170, -136361, -289299, -246953, -196421, -114938, -354522, 259860, 1495239, 1886155, 1231731, 251475, -661083, -1854591, -2380469, -2099575, -1603452, -922516, -675540, -271750, 213593, 43708, -43846, 21116, -119081, -712826, -34091, -17776, -481869, -1185963, -1163082, -571864, -1043696, -1011915, 152717, 364762, 330712, -562838, -872532, -402791, -280569, -14433, 1476719, 1729995, 742689, 284406, 654717, 1108491, 1590607, 413110, 486269, 751265, 478377, -796928, -768456, -928192, -211942, 795272, 1970756, 2084890, 1084914]
11635A084914j305129n07941L04269J96039p49090R77259K86793o68866l33948
11626g15700o22124L23801O19509j865o25226O5351N22675p644R5914O89481J84084
11615E28256M24523n6632k4487l90499q83752l08574n72837j126098J72311P69584
11605a468205Q13504Q29470L26730m91483r07221M82650k12796k14577J147983
11596C06055P17910j059395q09225J068203l8170q66081K07615Q6069J74982L97668
11586A85631L9481R2386k43849M29721j43277q79727j086769o86315J607713J526243
11576H41238P12902l68078q26236K71538j72547j681267r04455N60261Q79826
11567f86818L29653M35429j27201K06659n43055l00446k2424j11560r4304l57256
$$ y = [1084914, -220215, -728156, -423887, -227848, -976938, 321, 287114, -381752, -715700, -1337824, -1014023, -394514, -396379, -1021605, -956254, -433579, -441223, -345309, 344172, 528256, 952779, 896147, 871660, 481161, -402591, -711165, -1284002, -2410100, -2237789, -1468205, -654701, 174769, 501499, 10016, -897205, -414555, -627351, -841928, 306055, 1023965, -35430, -844655, 223548, 185378, -680703, -473088, -387019, -212037, 185631, 225112, 317498, 73649, 503370, 360093, -519634, -1606403, -2292718, -685005, 841238, 1554140, 1186062, 359826, 631364, 458817, -1222450, -2126905, -1566644, -686818, -357165, 78264, -48937, 157722, -385333, -685779, -708203, -819763, -914067, -1271323]
11557a271323M4495M070q55571J001320R44210O57115L5250l5062j344035m17426
11547a236957J203603Q11877j76536k51017o40019K31233L34699j027631k00092
11538i50840M02686N6763l22612O60757l21830j60756K58277n33896o03782P8112
11528a437121K91942P68100O73175l5569M99024o54725r16673L38900N04533o95748
11518f64162o82166P33742Q25044p4622J88940l85526J18017n35934m84827j75496
11508a136990J90513J40104m93434K075333L3763m17187o1003q37624n46392P17671
11498c35246O17857J41203J031240J34477j2884r68780m70692k19030p60891K97946
11488e44800Q2458M82836j02047l92020l75472J19416k28752R840k4094M66109
$$ y = [-1271323, -1226828, -1222758, -2078329, -1077009, -132799, 524316, 559566, 524504, -819531, -1236957, -33354, 778523, 601987, 350970, -289049, -57816, 276883, -750748, -950840, -548154, -491391, -814003, -153246, -475076, -635832, -377555, -911451, -1515233, -1437121, -1145179, -377079, 296096, 260527, 759551, 104826, -811847, -472947, 31586, -664162, -1346328, -612586, 212458, 137836, 326776, -58750, 59267, -476667, -961494, -1136990, -946477, -806373, -1299807, 775526, 809289, 392102, 331099, -506525, -1052917, -335246, 282611, 423814, 1455054, 1589531, 1576647, 607867, 137175, -81855, -842746, -544800, -462342, 20494, -81553, -473573, -849045, -729629, -958381, -948541, -972635, -506526]
11478e06526m78830K76075Q92706N38106j93244L75580k18662m2254K87126m43947
11468D86130L19283m7572j0631m48324r23501l83385m55949n55039k63590K70099
11458b012479j49455J397512M20569n54553J32259L81732q55267K49381k36m73678
11448a464215K27381R72843K59901J2271l76618o85329K35683L90413M63284N76908
11438F12522q44452J39237N73944j32398L15333p71716p05569n66057j88458Q20500
11428g47114M42267M05181p71686L85460O55579L76763m02300P77273J71137J63605
11418A456165k64019n97614m04473L94862j06119k34950p3020N56872j90146j23922
11408D13636m18685o65981j098365P25575J031140l85847j69282J001447p12090
$$ y = [-506526, -985356, -709281, 183425, 721531, 528287, 903867, 685205, 642951, 930077, 486130, 805413, 757841, 747210, 298886, -624615, -1008000, -1463949, -2018988, -2282578, -2012479, -2161934, -764422, -343853, -898406, -766147, -384415, -1239682, -990301, -990537, -1464215, -1236834, -263991, -4090, 8181, -368437, -1053766, -818083, -427670, 35614, 612522, -231930, -92693, 481251, 348853, 664186, -107530, -813099, -1379156, -1567614, -747114, -304847, 100334, -671352, -285892, 369687, 746450, 344150, 1121423, 1292560, 1456165, 1192146, 594532, 190059, 584921, 478802, 243852, 170832, 727704, 537558, 413636, -5049, -671030, -1769395, -1043820, -12680, -398527, -567809, 433638, -278452]
11399b78452j069588j65362K4659P93847j21590K01603j36161K58729L33666o13777
11389g72426K14446Q37249J141263o22091o31634l30126L36330m42512P20170
11380D50669l83272o23375j73046m7726L94981K31249N44303q48636o61162Q53263
11370b62752l51469N20040q23114p28818N63891l09535J58467J33911p7050k67917
11360a444346J5029M57548o918L96092Q32055K83587l99588p92363l76506k02422
11350a237832K95455j067314K88705J459433J277563o92348p70945k32477l91375
11341a071135J46825m3690R43997N39977m19225o42311K28238J72418O00604M55772
11331I11470j164818K9109L94054m62787J86753J16551P99200J96641q05277J022905
$$ y = [-278452, -1348040, -1513402, -1488743, -694896, -816486, -614883, -751044, -492315, -158649, -772426, -557980, 279269, 1420532, 798441, 166807, -163319, 173011, -269501, 450669, 67397, -555978, -729024, -776750, -381769, -150520, 393783, -454853, -1116015, -262752, -614221, -94181, -917295, -1646113, -1082222, -1391757, -1233290, -1099379, -1176429, -1444346, -1429317, -971769, -978687, -582595, 249460, 533047, 133459, -658904, -1035410, -1237832, -942377, -2009691, -1720986, -261553, 1016010, 323662, -447283, -679760, -1071135, -924310, -968000, -24003, 515974, 96749, -545562, -317324, -144906, 455698, 911470, -253348, -224239, 169815, -292972, -106219, 10332, 809532, 1006173, 200896, 1223801]
11321A223801Q03286p20058J7212r73763j022908k49602R46904l42097l11332
11312f28557J16204m84209J5859M09491M71284M00621j063237K95424K18715p9556
11302c27961l29208p50461m95989L36439J161783k80747L9038L71309l46767l581
11292f26145R19350P46976n5474J52911l32581j175217K2910M40491Q15011j34633
11282G73599o53585q10345m27860K94180L56110r3591M4795m59828j295J44560
11272h33260O03031Q74300O04998j031354p10941j16122N50421L0832K03713p29724
11262e54106k74586o20815q00535p42854O85510J356232P35469J080154Q04625
11253A669094q14912m75711m7425J49553n20980L98508Q1020O7572k58334j80227
$$ y = [1223801, 2027087, 1307029, 1324241, 350478, -672430, -922032, 24872, -317225, -628557, -512353, -996562, -980703, -571212, -99928, 300693, -762544, -467120, -248405, -327961, -657169, -1407630, -1903619, -1567180, -405397, -686144, -647106, -275797, -622564, -626145, 293205, 1040181, 984707, 1137618, 805037, -370180, -347270, 93221, 908232, 773599, 120014, -690331, -1118191, -824011, -467901, -561492, -516697, -976525, -977820, -833260, -230229, 644071, 1249069, 217715, -493226, -609348, -58927, -28095, 175618, -554106, -828692, -1449507, -2250042, -2992896, -2307386, -951154, -215685, 864469, 1669094, 854182, 378471, 331046, 480599, -40381, 358127, 439147, 506719, 248385, 68158]
11243F8158J00387m55076P21862N29650J82216K82665O12219l61532l86676j288082
11233E791j01758R13339r8555N6798j008541n399K2874K77041P99962M00980Q9689
11222A352221o27330j690365p85418J050615N00987L58208n14879n38877O89425
11213b05413P49783K1084k56798k06454l44434O37016R68221J57551r7130l05420
11203A118006k73048J71657j56887l47971k07163M06988J51608n57995J29950
11194D35145M03141p03624N5150L15289j630024p73253J63980J215209P07620
11185A88633q49176P52710K68229L03792m51009K69172J05940j25018j64908j2088
11175B86277j22950n45731M38548O7800J78271j244764M67801M05702o20789l65542
$$ y = [68158, 168545, -286531, 435331, 964981, 1147197, 1429862, 2042081, 1680549, 1293873, 5791, -95967, 817372, 718817, 775615, -232926, -238325, -215451, 61590, 861552, 1262532, 1352221, 724891, -965474, -1750892, -700277, -199290, 158918, -355961, -894838, -205413, 544370, 565454, 308656, 102202, -242232, 394784, 1363005, 1520556, 1423426, 1118006, 844958, 1016615, 859728, 511757, 304594, 711582, 863190, 305195, 435145, 838286, 134662, 189812, 505101, -1124923, -1898176, -1734196, -518987, 188633, -660543, 92167, 360396, 664188, 213179, 482351, 588291, 463273, 298365, 286277, 163327, -382404, 56144, 123944, 302215, -942549, -474748, -69046, -689835, -1055377]
11165a055377K17383M7973P23560k03333j187556l91552m80443N42382r3017L51414
11155a528566R2763O06172L58428M6625L04546r09799J44495j08663o07363K99249
11145a302113M02950R07876Q73508N25854K01053k09256j39667p86569j489858
11136a016222m24455R34500L200n57247J35595M09641j03727M50839n04566k30301
11126i02743Q10975O67731k6534l82722n87827R6227M41601l50561j18167m31491
11116g83511J49540R18224o2532n93729M23248K42370r02086J26650K27707N48089
11106B93970L26192m06385k09673L59233n94708J10109Q2447J19976r77326L04706
11096e91459P96403L78935k05330j42678J05718p55503j138468M67191N70424
$$ y = [-1055377, -837994, -790021, -66461, -269794, -1457350, -1848902, -2329345, -1786963, -1879980, -1528566, -1435803, -829631, -471203, -424578, -120032, -1029831, -885336, -993999, -1601362, -1302113, -899163, 8713, 882221, 1408075, 1609128, 1399872, 1260205, 473636, -1016222, -1440677, -506177, -502977, -1060224, -924629, -514988, -618715, -167876, -672442, -902743, -91768, 575963, 549429, 166707, -421120, -324893, 116708, -233853, -352020, -783511, -633971, 284253, 221721, -372008, 51240, 293610, -608476, -481826, -254119, 293970, 620162, 213777, 4104, 363337, -231371, -121262, -38815, 81161, -896165, -591459, 204944, 583879, 378549, 235871, 341589, -413914, -1552382, -1085191, -514767]
11087e14767k56998l14498P71056K47308m52972N78180m25671m10910P42034J393468
11077A356230p85158m35936j13465j496235L02722L33008q51400M42751J501326
11068B53843P79776p68392j31420m6544j93101q7816q47302j084108L02502R07352
11058i15210K18751K85499M57978p12423O03368M7787l96434m41825M32753Q71680
11048D51924O6109Q37954l01139j032428m8700m67305o68509m42919m15546M53771
11038a566788J8573P46321J96244p98495o39844J743621J142952K4970l44420
11029E23134j45882n92020l92430J81854O04359k0528l49793j056775k77889j125230
11019b651200K28948J254517J054486r8213o06215o41090l35926P51017J531318
$$ y = [-514767, -771765, -1086263, -315207, -67899, -520871, 57309, -368362, -779272, -37238, 1356230, 571072, 135136, 21671, -1474564, -1171842, -838834, -1690234, -1247483, 253843, 1033619, 265227, 133807, 87263, -105838, -193654, -1040956, -2125064, -1822562, -915210, -696459, -410960, 47018, -665405, -62037, -14250, -410684, -852509, -419756, 451924, 518033, 1355987, 1054848, 22420, -26280, -493585, -1162094, -1605013, -2020559, -1566788, -1548215, -801894, -605650, -1404145, -2043989, -300368, 842584, 867554, 523134, 377252, -214768, -607198, -425344, 179015, 158487, -191306, -1248081, -1525970, -2651200, -2422252, -1167735, -113249, -211462, -817677, -1458767, -1794693, -1043676, 487642]
11010D87642P88223P554k72864k43756m89764o22637K4566j59651M17491M7741
11000a5455j935778j175142J127923J342773K65765k4818j30715J108333m47749
10991A15137j99482p51570K70678n29070M84473L09512O53415N02148j008048
10982a52807k83462K32707Q06412j150594k80461J156684j88249l69970M12010
10973A82270K24342j92016p30284j64617L95036K2868R36732K79529K70335o63830
10963E60365K84694K92819o37810n32506K57078r0991K03108j70897K04116Q74755
10953A244731o53312n96508J243730l74539k99610k06381K54242N24858N29324
10944A666535M6497n55279j542151O80623J48550p21395L40255J037040q58377
$$ y = [487642, 1275865, 1283419, 1010555, 766799, 277035, -345602, -321036, -480687, -63196, -15455, -1951233, -3126375, -1998452, -655679, -389914, -414732, -545447, 562886, 115137, -84345, -835915, -565237, -1094307, -609834, -300322, 353093, 855241, -152807, -436269, -203562, 602850, -547744, -828205, 328479, 140230, -229740, 182270, 406612, 214596, -515688, -680305, -285269, -262401, 674331, 953860, 1224195, 560365, 845059, 1137878, 500068, -32438, 224640, 133649, 336757, 165860, 369976, 1244731, 591419, -5089, 1238641, 864102, 564492, 358111, 612353, 1137211, 1666535, 1713032, 1157753, -384398, 296225, 444775, -276620, 63635, 1100675, 242298]
10935B42298j8291j143654l53415l0812J390694J10068J08294k79517p81174K95015
10925d60494q1964n08342L22683P92061j83563p07736m87201J83145N83585O25747
10915G7921q0446l5742p8938J8652l59207r15316p55066l03645M83588P47203
10905a200996P83890J049628k74365o1096O2399j40767l1274m77599l54134r17582
10895a561896o59489K28634Q72309k55096p26497J302211J933625k22294j592329
10886f80822j10921J431374J038382n36204j583748N86554Q40839l89496o30026
10877c4068N13829q83642j330032j39605J36747K079808P47491k04848p00865
10868A84815j52462P2449n03580r53772k96434O6849N06175J26436M13462j19499
$$ y = [242298, 224007, -919647, -1273062, -1303874, 86820, 196888, 305182, 25665, -755509, -460494, -542458, -1050800, -728117, 63944, -119619, -827355, -1314556, -1131411, -547826, 77921, -2525, -38267, -117205, -98553, -457760, -1373076, -2128142, -2431787, -1948199, -1200996, -417106, 632522, 358157, 297061, 359460, 218693, 187419, -290180, -644314, -1561896, -2221385, -1992751, -1120442, -1375538, -2102035, -799824, 1133801, 911507, -680822, -791743, 639631, 1678013, 1141809, -441939, 144615, 985454, 595958, -34068, 479761, -403881, -1733913, -1873518, -1736771, 343037, 1090528, 885680, 184815, 32353, 104802, -398778, -1352550, -1648984, -1582135, -1075960, -949524, -536062, -655561]
10858f55561m62319n44735J66208p20558k3564J115361R05300p6563l66893j3516
10848f76840r31995k55030J302993N93800j453651j90062M57787K08348J47053
10839g97597J127074Q9052p55459K89429N89887j08970r81149J58480J253228
10830H63975K2303l70060o24851J61879Q27427n8738l68237N24385j38700m61991
10820C77392o95433o59147P47645K4007p26134o25187K01060N72267J61440l91912
10810a014002R83071N81179J65481J48588o68600p01289M93576J110835m8549
10801A050290j313278J71721M66245l67685K3358n3936p50750P43042Q6921L98626
10791D54554L84005J73028l82430j98674K9481J51258o9274o29401j32668P91810
$$ y = [-655561, -1117880, -1662615, -1496407, -2216965, -2240529, -1125168, -219868, -296431, -663324, -676840, -1608835, -1863865, -560872, 32928, -1420723, -1610785, -1152998, -944650, -797597, 329477, 418529, -336930, -47501, 542386, 433416, -547733, -389253, 863975, 886278, 516218, -108633, 53246, 880673, 821935, 453698, 978083, 839383, 377392, -318041, -977188, -229543, -205536, -931670, -1556857, -1355797, -783530, -622090, -1014002, -30931, 550248, 715729, 864317, 195717, -505572, -11996, 1098839, 1050290, -262988, -91267, 374978, 7293, 30651, -23285, -774035, -30993, 55928, 454554, 838559, 1011587, 629157, 430483, 459964, 611222, 541948, -87453, -220121, 571689]
10781E71689j79184l51423R83561J88536q47179l29819K01869O93414O19943j72200
10771A379207j391517j061102l84009O89725L74932k71719m81579l9260Q90102
10762b95220J150166l44574P54609L55724Q8323r69200J56492M4091l09943j331257
10752g00789P1374n62823M43285Q72678P84018Q33177k69448l96221m82206R7735
10742F90780p53712l1836q1661l70904p2590J020979M76954j076237p03166M61383
10732d40010P38840l54431j75583n13310M78257Q36802l30002j021221j60382
10723i41040P52137k48763o73644J85729m09982N23529K20607q5833J01778K18965
10713c56517l9507k77526j21062L70723l06151k1582J239620Q82695J19013J24520
$$ y = [571689, 392505, 41082, 1024643, 1213179, 366000, 36181, 238050, 931464, 1551407, 1379207, -12310, -1073412, -1457421, -767696, -392764, -664483, -1146062, -1185322, -295220, 854946, 510372, 1264981, 1620705, 1709028, 739828, 896320, 940411, 630468, -700789, -629415, -1192238, -748953, 123725, 907743, 1740920, 1471472, 1075251, 593045, 690780, -62932, -94768, -176429, -547333, -619923, 401056, 878010, -198227, -901393, -440010, 298830, -55601, -231184, -744494, -266237, 570565, 240563, -780658, -941040, -188903, -437666, -1111310, -925581, -1335563, -812034, -591427, -677260, -575482, -356517, -396024, -673550, -794612, -423889, -730040, -751622, 487998, 1370693, 1489706, 1614226]
10703A614226p13636J02630J144329m8525k64417p27099j276812J74073N18862
10694E23631P39019l96923j117900N02676N07868P95606K55027j004866p54924
10685D9214j492593N47479J003638J167163l41643l65379k26016j248980J47366
10676g59751J448592M64069n86205K69707Q04445R1618J51151N9495l66446n98010
10666I78665N56531j091607j937068L74452R94637N47053j35191j88237K47605
10657C46840m37351q50580k22381l74014J899850N67964n84316M96988Q86692
10648A729692k12471n66684l36878q12428o61672k89248M19775N34932J93003
10639a979q3151q58539r33547q8745q4925O50308R26420K2333l28054L00232R93112
$$ y = [1614226, 900590, 1003220, 2147549, 2099024, 1834607, 1107508, -169304, 4769, 523631, 1262650, 865727, -252173, 250503, 758371, 1553977, 1809004, 804138, 49214, -1443379, -895900, 107738, 1274901, 933258, 567879, 341863, -907117, -759751, 688841, 1152910, 566705, 836412, 1640857, 1732475, 1883626, 1943121, 1576675, 978665, 1535196, 443589, -1493479, -1119027, -124390, 422663, 287472, 99235, 346840, -90511, -941091, -1163472, -1537486, 362364, 930328, 346012, 843000, 1729692, 1517221, 950537, 613659, -198769, -860441, -1149689, -729914, -194982, -1979, -85130, -943669, -1877216, -1965961, -2050886, -1400578, -474158, -451825, -779879, -479647, 513465]
10628E13465K03534q98351n69757O4480o46900J95391R7184L60927L31922r8527
10618d46632q04136N44662R5219k41523n30340R6857R92141R36449k84454L01306
10608F59549Q85397o11017j153063j242290p0580J371421M42016q2079O52281
10599H51635j8203r42891q37888n65553P68476O86498Q0253j519949j189642Q54728
10589a832536J187502P13906k70290J70159J041563k61804r1979J19109k96861
10580D78769p86239o12762r04897r9066L83143K89571J165930J061557L11123
10571A287129j97468q28069l66458o09586N135J41960M15014k01900k53179O33117
10561B5695M47952n10467J20254R47644m68540n10997o4659l28145Q19565P8036
$$ y = [513465, 716999, -181352, -751109, -686629, -1333529, -1138138, -1040954, -680027, -348105, -446632, -1250768, -706106, -610887, -852410, -1382750, -1285893, -293752, 642697, 358243, 659549, 1544946, 933929, -219134, -1461424, -1532004, -160583, 281433, 199354, 851635, 833432, -109459, -947347, -1512900, -744424, -57926, 22327, -1497622, -2687264, -1832536, -645034, 68872, -201418, -31259, 1010304, 748500, 656521, 775630, 478769, -307470, -920232, -1825129, -1924195, -1541052, -1251481, -85551, 976006, 1287129, 1089661, 261592, -104866, -714452, -709317, -567357, -152343, -354243, -607422, 25695, 473647, -36820, 83434, 1031078, 562538, 51541, -13118, -341263, 478302, 556338]
10551E56338r78570p47367n76187k11145J7163R1139J21954J66619P63846O77379
10541a18831m65380l03454j12007q8500K38451p12111l25311L81939N66725K65852
10531f72627q41404L17849J076845m85899p6563L66056m45828j162411l98336
10522b322318R68630M7205L22330N21357r25637j20354L18572M9156Q37229k18972
10512e22802j034094N19531R44217J342141l43968r55355j118032n4849J134946
10503h8265J44317Q47263l3974j218001l51132J145409N60591j71784N31348j87612
10493A178160N45684j64998L7785o45036j48614o36240j1756n2896k01785K6240
10483g3456R9774q98125J56642O59285j379337J45457L19784N03575L45434k09718
$$ y = [556338, -422232, -1169599, -1745786, -1956931, -1939768, -1848629, -1726675, -1560056, -796210, -118831, -584211, -887665, -999672, -1088172, -849721, -1561832, -1887143, -1505204, -938479, -672627, -1514031, -1196182, -119337, -605236, -681799, -315743, -761571, -1923982, -2322318, -1353688, -1306483, -984153, -462796, -1388433, -1508787, -1190215, -1141059, -303830, -522802, -1556896, -1037365, -93148, 1248993, 905025, -50330, -1168362, -1223211, -88265, 56052, 903315, 869341, -348660, -699792, 445617, 1006208, 834424, 1365772, 1178160, 1723844, 1558846, 1596631, 951595, 802981, 166741, 154985, 102089, -99696, -73456, 26318, -871807, -715165, -55880, -1435217, -1289760, -969976, -466401, -120967, -330685]
10473c30685Q91849j63155K4296J08532j30980P35385M31436j155355o65850O88768
10463D34241k20257j198604J176259Q24941r42663o96221k26273M64096p720j417958
10453a810159j001953K80885R03834N13179L21271m1876P7103M69130R69355Q21515
10443A502284J67231k97149M75309k39377j692589j164176J20662J037611M45292
10434C55098J15073M2369K38379m49308j72112M8206J68630m8047k0504R4209
10424C71993Q82108N156j001942m13060O23425R43719j6928n61085j30665N49100
10414A251821l38014r06764n98127K15643r7964N92433K27966o15313J81288K06053
10404A19022J22448J768979M18610j17203k87109j334485n69185J12262l98221
$$ y = [-330685, 561164, 398009, 422305, 530837, 399857, 1135242, 1566678, 411323, -254527, 434241, 213984, -984620, 191639, 1016580, 73917, -622304, -848577, -384481, -392201, -1810159, -2812112, -2531227, -1627393, -1114214, -792943, -834819, -757716, -288586, 680769, 1502284, 1669515, 1372366, 1847675, 1608298, -84291, -1248467, -1127805, -90194, 355098, 470171, 512540, 750919, 301611, 129499, 177705, 346335, 298288, 277784, 371993, 1254101, 1259257, 257315, -155745, 467680, 1411399, 1394471, 833386, 702721, 1251821, 913807, 7043, -591084, -375441, -473405, 119028, 346994, -268319, -87031, 119022, 241470, 2010449, 2429059, 2311856, 2024747, 690262, 121077, 233339, -164882]
10395a64882n71924m06881R70694k61196n54497k58317J167462k13748o75476
10386i68765k53940Q38840j40409M46102L59431P74130o26586q23204J384106
10377I89705k32568n06097K97167k09559M037m96511k30689n88965p46517J64818
10367a555179J068144L07698k38054J162811R30613K61985m21116p09356k50900
10358E56646N29742N80148m91984l68623k75524L47542M36542K76421L00026j516521
10348C74415Q7802q0549O23527r1157l41706m92035o57164l8668M59062L46026
10338A89553N19197j338879j801687L29950J548578M43690O15614l29615J7828
10329A94229m02792l26915J94703M14390K27164Q46169n28620m50072J45706l9305
$$ y = [-164882, -736806, -1143687, -172993, -434189, -988686, -1247003, -79541, -293289, -968765, -1222705, -383865, -524274, -78172, 281259, 1055389, 428803, -394401, 989705, 757137, 251040, 548207, 338648, 342685, -153826, -384515, -973480, -1719997, -1555179, -487035, -179337, -417391, 745420, 1676033, 1938018, 1516902, 807546, 556646, 1086388, 1666536, 1174552, 805929, 530405, 877947, 1314489, 1590910, 1890936, 374415, 462217, 381668, 1005195, 914038, 572332, 80297, -576867, -615535, -156473, 189553, 708750, -630129, -2431816, -2101866, -553288, -109598, 506016, 176401, 194229, -208563, -535478, -340775, 73615, 300779, 1146948, 618328, 168256, 313962, 274657]
10319B74657J43458k26836j84031J90164L15168K41839o97310O61369L7935q86858
10309a30445o17877J13197J039644K84002m43584n79875j257409p38888M46224
10300a885011J003101l21716k15982O11194P76033J00644K75044j23906j58493
10291F0908l34769N02861J8586l40850o70255M72059L05715K59875K18610j55585
10281C37155p72085n9322O88236K49410j587540m15341n80256n18549M04058j87827
10271b442061l02035J424230K99074Q8650R75583K41824m95868k6625L75216j71162
10261c3174j360745N090J102040N55243j037572l22247j40766Q8359O57683M59288
10251b6801P4464m17095j1144k25707j99565Q17103O59030N93931j59928q14000
$$ y = [274657, 418115, 191279, 7248, 197412, 512580, 754419, 57109, 718478, 756413, -130445, -748322, -635125, 404519, 688521, 244937, -334938, -1592347, -2331235, -1885011, -881910, -1203626, -1419608, -808414, -32381, 68263, 343307, 219401, 60908, -273861, 229000, 247586, -93264, -763519, -291460, 14255, 274130, 492740, 337155, -434930, -494252, 193984, 443394, -1144146, -1559487, -2139743, -2658292, -2254234, -2442061, -2744096, -1319866, -1020792, -932142, 43441, 285265, -210603, -237228, 137988, -33174, -1393919, -1388829, -286789, 268454, -769118, -1091365, -1232131, -1143772, -486089, -26801, 47663, -369432, -380576, -606283, -805848, 11255, 670285, 1264216, 1104288, 290288]
10241B90288n36271K7678M69477k05197J90525J39649j36680m00691m49672Q8610
10231e22284L60986L09724m46374M19100N11467r55659r88823m01402M64492J33488
10221a115285j63132k13569O35736M03978L72138K42874j68579j80037p27374
10212i13250J94459J061642O08656o22722k24180N85952R42309L02527q23974
10203A111419r95381m02450J80102l42626J577k50645L42993N00103j65149p42471
10193g62528O0720R36823r44569q6272M93964k50753k90811M33291J219597p931
10183H01531o02160L6726N83470K56528j131376P75853l44442r17778p19350J424348
10173A63350L25995L50670l15506M92705r5718J299418M06158r99532j093108
$$ y = [290288, -245983, -218305, 251172, 45975, 236500, 376149, 239469, -161222, -610894, -522284, -161298, 148426, -297948, 121152, 632619, -323040, -1311863, -1713265, -1248773, -1115285, -1278417, -1491986, -856250, -452272, -80134, 162740, -5839, -185876, -913250, -718791, 342851, 951507, 328785, 104605, 690557, 1632866, 1935393, 1111419, 116038, -286412, -106310, -448936, -447359, -698004, -355011, 145092, -20057, -762528, -701808, 235015, -709554, -795826, -301862, -552615, -843426, -410135, 809462, 801531, 199371, 236097, 819567, 1076095, -55281, 720572, 376130, -541648, -1260998, 163350, 489345, 840015, 524509, 1017214, 921496, 2220914, 2627072, 1627540, 534432]
10164E34432n13518p79172l65727L20216L26682J386036Q06471k81170p33221
10155G01029J9304J260592Q40636K7397j347583o44218k14345j449048k71793
10146a078029k87212K21563Q86908N6996p54488K95578k16976J79782J118854
10137D22976K70345m71258l12832O61789p59276k18922O30002k02260R99919J057070
10127B077553J107327N55224q48397j369636j108820n36548J12812K70328L22589
10118E82432K29136r90584l57642r20909p41699l88854K15074K49020Q10944J202926
10108a10156J452021m98991p57193q30647m00653m22354L65191J22008O18353
10099d62421J17004J3052J2125K01926m28049k62806R07415j8849p72074K16842
$$ y = [534432, 20914, -758258, -1123985, -803769, -477087, 908949, 1715420, 1434250, 701029, 720333, 1980925, 2821561, 2848958, 1501375, 857157, 642812, -806236, -1078029, -1365241, -1143678, -256770, -199774, -954262, -658684, -875660, -695878, 422976, 693321, 222063, -90769, 571020, -188256, -407178, 222824, 20564, 1020483, 2077553, 3184880, 3740104, 2891707, 1522071, 413251, -123297, -10485, 259843, 582432, 811568, -179016, -536658, -1457567, -2199266, -2588120, -2373046, -2124026, -1313082, -110156, 1341865, 842874, 85681, -744966, -1145619, -1567973, -1202782, -1080774, -462421, -345417, -332365, -320240, -118314, -546363, -809169, 98246, 79397, -692677, -475835]
10089d75835J05977L77390M88098n3798k06402m69323k20344o18728K82516O97041
10079i3408K97152p50947o89161M98477N90934L42851m66483N33488L09515P0474
10069F42892l02596j277343n68345N72724J59832j205674P20657Q60757J53247
10060b43849J03998L34734k28531n8794k2218m09382j48302j64311j358221r86406
10050c181282M86385J339949N43250m5128P29433M32324R81628j50902j133870
10041A787r00616l01935k21174N97377l39568Q74377J050232j70022n21710Q1646
10031A50394L54333K48958p9347n80416n01025L35149O71097p2963l36002n81014
10021c90836o95453Q82086k72991L9637K39199j65075r4954N29510M10100O52171
$$ y = [-475835, -369858, 7532, 495630, 441832, 235430, -233893, -454237, -1072965, -790449, -93408, 203744, -547203, -1236364, -737887, -146953, 195898, -270585, 262903, 572418, 642892, 340296, -937047, -1505392, -932668, -772836, -1978510, -1257853, -397096, -243849, -139851, 194883, -33648, -92442, -114660, -524042, -672344, -836655, -2194876, -3181282, -2694897, -1354948, -811698, -856826, -127393, 304931, 1286559, 1135657, 1787, -898829, -1200764, -1421938, -824561, -1164129, -289752, 760480, 590458, 68748, 150394, 504727, 753685, 674338, 93922, -407103, -71954, 599143, 526180, 190178, -390836, -1086289, -204203, -477194, -437557, -198358, -363433, -458387, 71123, 481223, 1133394]
10011A133394L77786l64112p85708k26679m33866j047036J006447P96388k98877
10002A57737p69463k6556O34882L97517j83881o57105n9117P0116J15235k09504
9992e30139k89818K01614q06875m4467J135757K47922n75785m05104m25613J079732
9982d12776M63872n55827n93606l73315J472532J19660l69007J20136J73828L78904
9972D24401M94889k14393K39287k63553J24446P13949n21181k67953p63636j863484
9962a897228k23005J23451K85546J098426L37514j00598k31275K20641l86046
9953g72574P59229M68205m04212k09450o31418N77317Q87695O69620p30304k42542
9943C71566M53944M1014r923L39607L06706k43405p87184K26513M69742r77049
$$ y = [1133394, 1511180, 1147068, 361360, 134681, -299185, -1346221, -339774, 456614, 157737, -611726, -638282, -3400, 394117, 210236, -446869, -505986, -435870, -320635, -530139, -819957, -618343, -1425218, -1469685, -333928, -86006, -661791, -1066895, -1492508, -412776, 51096, -504731, -1098337, -1471652, 880, 120540, -248467, -128331, 45497, 424401, 919290, 704897, 944184, 680631, 805077, 1519026, 997845, 729892, -33744, -1897228, -2120233, -1996782, -1711236, -612810, -275296, -375894, -607169, -386528, -772574, -13345, 454860, 50648, -158802, -790220, -212903, 674792, 1344412, 614108, 371566, 825510, 866524, 856601, 1196208, 1502914, 1259509, 472325, 698838, 1168580, 191531]
9933A91531m14230Q64908R39469p16040k71537j207716M90642J288930P14323
9924A880280j60884j096879j474621J81706L42663M06684k53184r17458O03568
9915d88125J261139J332292P4763l40111o27166p78718L60411j21574o8553n4244
9905E50114m27997m9756j37169M3608Q2460L59088p87095o15450M7912l65919
9895a300204N87888L31116l3144j154575J46321Q89691j148688l92565M86739
9886a587421L15979k37167R38405p2747R9266K74252J25314l05707r02847m52807
9876a805480O8392L20196N55488k36857r1781j960K57850N55540j49443M8925
9866d79130J49867j35843P40496M27861j235520j71312m98165k73702J31231M56960
$$ y = [191531, -222699, 642209, 1581678, 865638, 594101, -613615, -122973, 1165957, 1880280, 1719396, 622517, -852104, -670398, -327735, 78949, -174235, -1091693, -488125, 773014, 2105306, 2180069, 1839958, 1212792, 434074, 794485, 672911, 604358, 550114, 122117, 72361, -64808, -21200, 61260, 420348, -366747, -982197, -934285, -1300204, -712316, -381200, -414344, -1568919, -1422598, -532907, -1681595, -2074160, -1587421, -1271442, -1508609, -570204, -642951, -543685, -269433, -144119, -449826, -1352673, -1805480, -1737088, -1416892, -861404, -1098261, -1190042, -1192002, -934152, -378612, -528055, -479130, -329263, -465106, 275390, 703251, -532269, -703581, -1201746, -1475448, -1344217, -887257]
9856h87257J007171K08984J80372K8939K97538J274336l29716j018737m62887
9847B98743M87602j243406j180715J5465R44064M49219k10931M16894J46477Q12311
9837I35723K01957n44897p6569r01782k21367Q24082K59285j50487k01509o2683
9827F1753j23156K71462R37678j052991k61321m61244p08604o34752J4281O16717
9817a340177n42114M5286M46234K88752r001m73187j95433K09473J668470O93613
9807G91916q7323r2224j85420j314719m18489Q21981O00585l34050m09421K55148
9797c72016O21967K29725K49312n82J31556O47228m62492m46940J85874m97430
9787B86202j72316M08652n28260r60405N68313L41035m91278P1312O26945J7454
$$ y = [-887257, 119914, 328898, 509270, 538209, 835747, 2110083, 1780367, 761630, 298743, 786345, -457061, -1637776, -1622311, -678247, -229028, -439959, -23065, 123412, 935723, 1137680, 592783, 516214, -385568, -606935, 217147, 476432, 325945, 124436, 61753, -61403, 210059, 1147737, 94746, -166575, -627819, -1336423, -1971175, -1956894, -1340177, -1882291, -1837005, -1390771, -1102019, -1111020, -1584207, -1779640, -1570167, 98303, 791916, 704593, 612369, 426949, -887770, -1306259, -484278, 116307, -217743, -627164, -372016, 249951, 479676, 728988, 728406, 859962, 1507190, 1044698, 597758, 783632, 286202, 113886, 522538, -5722, -966127, -397814, -56779, -548057, -476745, 150200, 167654]
9777A67654k60943M43858L19468L6010p12546p00718j019965p31844L50501M74440
9767a634085l14455J9365J80204R53173N70050n42948r74495n21448m51250m7708
9757b763597J257174N33571l82593k54880r32887Q69486j70127J008493l19050
9748a154410P48539R11563K9287j038426R23162J88783O1175j61942r89884j85028
9738f67181M50391o30923O30930k4852p91097K12431j17312q23636J300695O02908
9728A42354k9325M69525r04219j212330Q21941K49070m65028J48921J509594m54164
9718B76339j149997o21555L12176J017500L47691p57831p47699n4728J33788q0506
9708a324822K05329O41871J156157l7328l86733k59743O76923j034290j148287
$$ y = [167654, -93289, 350569, 670037, 706047, -6499, -707217, -1727182, -2459026, -2108525, -1634085, -1948540, -1929175, -1748971, -795798, -225748, -768696, -1743191, -2264639, -2715889, -2763597, -1506423, -972852, -1355445, -1610325, -2543212, -1673726, -1843853, -835360, -1154410, -405871, 505692, 534979, -503447, 419715, 608498, 669673, 507731, -482153, -667181, -216790, -847713, -216783, -241635, -1032732, -820301, -937613, -1761249, -460554, 142354, 113029, 582554, -321665, -1533995, -712054, -462984, -928012, -779091, 730503, 276339, -873658, -1495213, -1183037, -165537, 182154, -575677, -1323376, -1378104, -1244316, -1324822, -1119493, -477622, 678535, 641207, 254474, -5269, 671654, -362636, -1510923]
9699a510923p8153p74129K29183M59835m37826J162095R50327j52503l9222j59319
9689c50635n19503M94190O76888p34809N38851M27035m06647j48689j83292j39214
9679c45825j70824o23495O21894L36J44901O3804M06142K25490K81394k10283
9669C93534k2529O19914m66587j15623Q23363K41468j149570M7670Q9725K06333
9659F67698O79636m94297o88668o89100K7582Q39864k8513L65899m62485J53063
9649C70679j92889r88649m8470o0355P65616J128284l2227p73544l70071N36311
9639C34685m16952k07020k62790N6952J041253O20381j26143Q56698j104579n97551
9629A94934O09000k17850L95041j84547n57092M8575R89958M93501l97206p75463
$$ y = [-1510923, -1589076, -2363205, -2134022, -1674187, -2112013, -949918, 409, -152094, -191316, -350635, -870138, -375948, 300940, -433869, 104982, 532017, 125370, -23319, -206611, -345825, -516649, -1140144, -518250, -517914, -373013, -309209, 96933, 322423, 603817, 393534, 371005, 990919, 524332, 408709, 1232072, 1473540, 323970, 371640, 461365, 667698, 1347334, 853037, 164369, -524731, -497149, 342715, 314202, 680101, 217616, 370679, 177790, -810859, -859329, -919684, -154068, 974216, 941989, 168445, -201626, 334685, -82267, -289287, -552077, -495125, 546128, 1166509, 1040366, 1897064, 792485, 194934, 803934, 586084, 981125, 796578, 239486, 288061, 1278019, 1771520, 1374314, 598851]
9619E98851q75722j46855K34657P1987q85899o47740M61485J115648L90246K89475
9609F06133o0393q84459o85695K36767n25177j54521K69336K64537m68023J363308
9599c8187Q14749j68710R77013o83922j235639K62911o51775J84518j69159n11902
9589a220103l33144K07718K65975P02616L57532o65734J39230p2991l62847j78682
9579a160430M35186Q26376r7492J070719K54132k67929j78679m25713M74062l6941
9569H93291j8284p1318m90614J05430L68599k14910N64922l80341p37418l2775
9559a3418j45606l3593k2095N90600J21493K20326K55881j056180J028035J86377
9549A131820p18990q22969k71909L68193m72551N61197q5624p03912R91141j78813
$$ y = [598851, -276871, -423726, -189069, -117082, -1002981, -1650721, -1189236, -73588, 316658, 606133, 545740, -338719, -1024414, -787647, -1312824, -1467345, -1198009, -933472, -1401495, -38187, 776562, 607852, 1584865, 900943, -334696, -71785, -723560, -539042, -708201, -1220103, -1553247, -1345529, -1079554, -376938, -19406, -685140, -545910, -618901, -981748, -1160430, -725244, 101132, 3640, 1074359, 1328491, 1060562, 881883, 456170, 930232, 893291, 875007, 803689, 313075, 418505, 787104, 572194, 1137116, 756775, 19357, -13418, -159024, -192617, -214712, 375888, 497381, 717707, 973588, -82592, 945443, 1131820, 412830, -410139, -682048, -313855, -786406, -225209, -310833, -1014745, -23604, -202417]
9539b02417o33405K74601J029550M05996j110596L35120K96729o11454p26078
9530i41954J373136j40514j226421M3200R1859L63024L87557j37135J462896R81310
9520B256958q41901K18125J135467j45790r29254j23741j32120l04743q57929
9511B75072k24166k39861k42783R70106K9901Q6044J61803r26926l00434R54161
9501E42917J085563j061069j087811p52464P25345O82888q26753K48449N51402
9492A08467R46423P80651K82755m78805o92069J6913L9244M0695n33169j446617
9482i35512m67255k00495n89417j84386J5803K69929K65484K96077j51653O09226
9472a072199M12141L06713K34661O74050p7986m56181p95818o29599n61106j05632
$$ y = [-202417, -835822, -561221, 468329, 874325, -236271, 98849, 395578, -215876, -941954, 431182, 290668, -935753, -892553, -800694, -437670, -50113, -187248, 1275648, 2256958, 1415057, 1633182, 2768649, 2622859, 1693605, 1569864, 1437744, 1133001, 275072, 50906, -188955, -431738, 538368, 568269, 654313, 816116, -110810, -411244, 542917, 1628480, 567411, -520400, -1272864, -547519, 135369, -691384, -442935, 108467, 1054890, 1835541, 2118296, 1639491, 947422, 964335, 1003579, 1044274, 511105, -935512, -1402767, -1603262, -2192679, -2377065, -2361262, -2091333, -1825849, -1529772, -1681425, -1072199, -660058, -353345, -118684, 555366, 477380, 21199, -774619, -1404218, -1965324, -2070956]
9462b070956L78122K43790K61234J72988J299837O3769J23089J229678k65265
9453A436286r024J67108j406074q9485O12392Q90531o76564l32017q90251K04345
9443i2753m3120K82546j09291j256314r7258J183840P05695Q95081l83188l27537
9433G57701M79595j41061L24785J002890K24893n48611p21969j097298o86309
9424d05384M19707N78311N31722P8093j97864K63782Q14747O3145L85463M88541
9414C020263n28077j724057O31389N35935l93204n25969o26185N9244L59765J431733
9404B240837P51742q50082o84116j70176Q90500J31774p08468k9098J09226k43863
9394A438276M63674L5169k11707r70885R5434P57966O43189N11555p51954p16880
$$ y = [-2070956, -1692834, -1449044, -1187810, -1014822, 285015, 348784, 471873, 1701551, 1436286, 1427262, 1594370, 188296, 98811, 711203, 1601734, 925170, 593153, -297098, -92753, -135873, 146673, 37382, -1218932, -1316190, -132350, 573345, 1468426, 1085238, 757701, 1237296, 1096235, 1421020, 2423910, 2648803, 2100192, 1378223, 280925, -405384, 14323, 592634, 1124356, 1202449, 1004585, 1268367, 2083114, 2146259, 2531722, 3020263, 2492186, 768129, 1399518, 1935453, 1542249, 1016280, 390095, 449339, 809104, 2240837, 2992579, 2142497, 1458381, 1288205, 2178705, 2310479, 1602011, 1572913, 1682139, 1438276, 1901950, 1937119, 1725412, 754527, 849961, 1607927, 2251116, 2762671, 2010717, 1293837]
9384A293837k70165k98183N36047j103079p15978M10400K44513n09989J53019
9375b59578N42601J037963N67357N32418O88315N01543K2104j429930r12597k85112
9365A005084M86548k21072p98117J091945R50550L80083m97982o68244M76383
9356B205178j67149j385581o39470Q80591O13891O19951j109048m45178M66128
9347A039313K48290l17253N35631J66597k93235N38228l91329n76364O65730L14283
9337A929891n29154p97242j84712K88787J89437P61884Q7896j433625J02575L73097
9327G88834n3234Q10631P59375O2991N2328l81533n05378o0679p7517k44257p17852
9316D33709R95167O64957o95988J34285O505m67777p1581J49634n55302Q51492
$$ y = [1293837, 1023672, 725489, 1261536, 158457, -557521, -147121, 97392, -412597, -259578, 283023, 1320986, 1888343, 2420761, 3109076, 3610619, 3632723, 2202793, 1290196, 1005084, 1491632, 1270560, 472443, 1564388, 2514938, 2895021, 2397039, 1728795, 2205178, 2038029, 652448, 12978, 893569, 1507460, 2127411, 1018363, 573185, 1039313, 1287603, 970350, 1505981, 1672578, 1379343, 1917571, 1526242, 949878, 1615608, 1929891, 1400737, 603495, 418783, 707570, 897007, 1658891, 1746787, 313162, 415737, 788834, 735600, 1546231, 2305606, 2368597, 2420925, 2039392, 1534014, 1473335, 1395818, 1151561, 433709, 1428876, 2093833, 1397845, 1532130, 1538635, 1070858, 999277, 1148911, 593609, 1445101]
9306A445101J024241K66860o29944k81710q44843n09529M28201J016870L7861
9297A953108j7967M42938O96427j91909J0031L53688j13930J84179J115911Q90909
9287E323385P40381k66055m67687J50000J034172N46662m17815J788272K57276
9278H688591j002422l06411j28431l1697J006766J591166N96742L18472R9463
9269A0832239J322631J98005o72797m84261p4169O82511N91040J78362p77824
9260A1795737l81672K67562K60927N74769M8938J72616q61864r08199q02213j096539
9250I070062J29351k21501j264306q82206O2587r0022j702007K14877K58705P90942
9240F366482L81921L5670K29583P53621l69733j434037K23202K82560k06005j198753
$$ y = [1445101, 2469342, 2736202, 2106258, 1824548, 979705, 470176, 898377, 1915247, 1953108, 1935141, 2378079, 3074506, 2882597, 2892628, 3246316, 3132386, 3316565, 4432476, 5323385, 6063766, 5797711, 5330024, 5480024, 6514196, 7060858, 6643043, 8431315, 8688591, 7686169, 7379758, 7251327, 7219630, 8226396, 9817562, 10414304, 10732776, 10832239, 12154870, 12352875, 11680078, 11195817, 11121648, 11804159, 12395199, 12573561, 11795737, 11414065, 11681627, 11942554, 12517323, 12566261, 12738877, 11877013, 10968814, 10166601, 9070062, 9199413, 8977912, 7713606, 6831400, 6893987, 6803965, 5101958, 5316835, 5575540, 6366482, 6748403, 6784073, 7013656, 7767277, 7397544, 5963507, 6186709, 6469269, 6263264, 5064511]
9230E064511k79183P41550L1031N53868O3207l35311L89218m45749M13655p67196
9220E429601n37216L9059n73347n51398j08097R39109J55508l88550m00420M52682
9210D456931O28872k8051o0024O79679m30956j281880k27282N03549P28167O21994
9200E590999j050652r7284O58437M49233n15697L61577N79955j211r4006M56014
9190F337365J08277K30451O6402k7904L81491j17426P65302j89554j52392O63653
9180H065665J127241M85864K54750R1649J024557J036475N92431R62770J357591
9171A4998993M68116L9217O40389M34776J603357J450039J046038J345770J496488
9162B3523183K511501K774990K268663J583719J212838J831788K916348K526839
$$ y = [5064511, 4785328, 5526878, 5557909, 6111777, 6174984, 5839673, 6228891, 5783142, 6196797, 5429601, 4892385, 4931444, 4358097, 3806699, 3698602, 4637711, 4793219, 4404669, 4004249, 4456931, 5085803, 5057752, 4997728, 5677407, 5246451, 3964571, 3737289, 4240838, 4969005, 5590999, 4540347, 4443063, 5101500, 5550733, 5035036, 5396613, 5976568, 5975357, 5881351, 6337365, 6445642, 6676093, 6742495, 6714591, 7096082, 6978656, 7743958, 7554404, 7402012, 8065665, 9192906, 9678770, 9933520, 10025169, 11049726, 12086201, 12678632, 13641402, 14998993, 15467109, 15506326, 16146715, 16581491, 18184848, 19634887, 20680925, 22026695, 23523183, 26034684, 28809674, 31078337, 32662056, 33874894, 35706682, 38623030, 41149869]
9154D1149869K201962M165926N259914L701597L662260M235212O013471P091061
9146G7481272P030758P472380Q454851P671272Q697185J0506295J1183387J2471674
9138A50969074J2991938J5077622J6198307J8456045J8785575K0551120K1151405
9131B74181086J9458483J8699989J5573454J3238905J1399445J0450450J0485323
9124C73487135J0679961J1361142J0806191R704266O645027K191825k428626p555905
9116D14891016j2853873j5673949j8704308j9724653k0654170k0407982k0535460
9109B86336621j8249249j4949651j2111931j0319458r682406r414999o824621
9102B04784306o325387o138709m928789l745020m813362m645738n070723n555734
$$ y = [41149869, 43351831, 47517757, 52777671, 56479268, 60141528, 64376740, 70390211, 77481272, 84512030, 91984410, 100439261, 108110533, 116807718, 127314013, 138497400, 150969074, 163961012, 179038634, 195236941, 213692986, 232478561, 253029681, 274181086, 293639569, 312339558, 327913012, 341151917, 352551362, 363001812, 373487135, 384167096, 395528238, 406334429, 416038695, 422683722, 424875547, 422446921, 414891016, 402037143, 386363194, 367658886, 347934233, 327280063, 306872081, 286336621, 268087372, 253137721, 241025790, 230706332, 221023926, 211608927, 204784306, 198458919, 192320210, 187391421, 183646401, 178833039, 174187301, 169116578, 163560844]
9094A63560844n563953n588730n203022n229813n411640m558375n216007l764225
9086A23025079l231371l730655l112338k830115l270546l502688k141982j984784
9078I9220600k666193k561575k624490j741041k081665l023082j220462n52898
9070H2749194j517999k674057j720412j133840j228394k364223j640102j204456
9062F9265711m33855k97688M57273j303391j802337M1950o48547j355537m58043
9053F3465536r0246o71000m39298Q98638M96541r95867j288645n78837n34224
9044F0262598r02194l21440O38816n3844j249657m74160J60142M45095L40698
9035E8846054N91553k58491m92991n19552L79463L0534m59224q29582R0675J019296
$$ y = [163560844, 157996891, 152408161, 147205139, 141975326, 136563686, 132005311, 126789304, 123025079, 119793708, 116063053, 112950715, 110120600, 106850054, 103347366, 101205384, 99220600, 96554407, 93992832, 91368342, 89627301, 87545636, 84522554, 83302092, 82749194, 81231195, 78557138, 76836726, 75702886, 74474492, 72110269, 70470167, 69265711, 68831856, 68534168, 68991441, 67688050, 65885713, 65927663, 65279116, 63923579, 63465536, 63375290, 62704290, 62264992, 63163630, 63660171, 62664304, 61375659, 60796822, 60262598, 59360404, 59038964, 59677780, 59623936, 58374279, 57900119, 58060261, 58505356, 58846054, 59437607, 59179116, 58686125, 58166573, 58546036, 58576570, 58117346, 57287764, 57378439, 58397735]
9025E8397735L44364j29109K17800q1130j208374l76024o50409q28810m70101
9016E5215942O47382M26989J59043m71845j15739j257285j781841r5988O48723
9007E3375381K53826m07273j733309o72750M9759j320088j543735j830395j490603
8998D4680813j553845j352449k28286j355540j056467k85918r85065j651727j443999
8989C4767517n84173p11693J1970k66055j144860k40029n45702r29879q22082
8980B9535014K45532N42291L25776o82028j054242j119972j063957k69151J95739
8971B6655002l32852m40337k60134r69178m76039K86197L83665q91116n28540
8962B3426668j271948l35397l9015O49171m99933m72188j25392j144330P2249
$$ y = [58397735, 58742099, 58612990, 58830790, 58749660, 57541286, 57165262, 56514853, 55686043, 55215942, 55863324, 56290313, 56449356, 55977511, 55861772, 54604487, 52822646, 52726658, 53375381, 53629207, 53221934, 51488625, 50815875, 50865634, 49545546, 48001811, 46171416, 44680813, 43126968, 41774519, 41546233, 40190693, 39134226, 38848308, 37863243, 36211516, 34767517, 34183344, 33471651, 33483621, 33217566, 32072706, 31832677, 31286975, 30357096, 29535014, 29780546, 30322837, 30648613, 29966585, 28912343, 27792371, 26728414, 26459263, 26655002, 26322150, 25881813, 25621679, 24652501, 24176462, 24462659, 24846324, 23955208, 23426668, 22154720, 21819323, 21780308, 22429479, 21929546, 21457358, 21331966, 20187636, 20259885]
8953B0259885K83104k24408p6943J35011q00306q93339k28268J23335J61810J95019
8943A8934900n41816m87995m06372Q72440P40355q2984o96630j338829n32053
8934A6461016P59552Q48440k09408j204949r68674N13935k64470r09612l34134
8925A4691696k4316l1153j495651o42489q527J0067J32828P75718r39335r82916
8915A1485922j500351l74937o25987k83291k01428K48366l26004P8899q26566
8906G674623J36883K73441k33548J44345K37392P27361j44259m93854j274517
8897G047867r06913k23053K19145J29559n55835P6767O16183K33710j77799m97002
8887E962629j165735o69299N11412N17125p79305o37396P7833l64545j90181R55904
$$ y = [20259885, 20542989, 20318581, 20241638, 20376649, 19576343, 18683004, 18454736, 18578071, 18739881, 18934900, 18393084, 17905089, 17498717, 18371157, 19111512, 19028528, 18331898, 16993069, 16461016, 17220568, 18069008, 17859600, 16654651, 15685977, 16199912, 15935442, 15025830, 14691696, 14667380, 14636227, 13140576, 12498087, 12489560, 12499627, 12632455, 13408173, 12468838, 11485922, 9985571, 9610634, 8984647, 8701356, 8499928, 8748294, 8422290, 8501189, 7674623, 7811506, 8084947, 7851399, 7995744, 8233136, 8960497, 8816238, 8322384, 7047867, 6140954, 5917901, 6137046, 6266605, 5710770, 5787537, 6403720, 6637430, 6459631, 5962629, 4796894, 4127595, 4639007, 5156132, 4376827, 3739431, 3817264, 3452719, 3262538, 4218442]
8877D218442N61301k0317p90171o08091j32837Q37982J108829P35971o28477o23993
8867D658639N9334m78689p36431K57967P23735K1609k54927p47636J39237J103131
8857D745969L38031j78668k01930K45154m49147J68032L38317j57221r72877j8201
8847C857459M65027M91851j67698j162934K37481L62991K25683o8056r06858M79896
8837C814842J87984L27205k22349m42115M76093N39029L68970M10657j5779k83270
8827E161267r4996n40702J26124O15140l98381n48119k90935j09194J04936J9778
8817D044918k90959O10877R77834n00441K96716K393J6643q12955J6085o9741
8807D291370M94004J91689K75005L78823m26011k54722p61367l94501l04320l12091
$$ y = [4218442, 4779743, 4759426, 3969255, 3361164, 3228327, 4066309, 5175138, 5911109, 5282632, 4658639, 4717973, 4239284, 3502853, 3760820, 4484555, 4506164, 4251237, 3503601, 3642838, 4745969, 5084000, 4905332, 4703402, 4948556, 4499409, 4667441, 5005758, 4848537, 3875660, 3857459, 4322486, 4814337, 4646639, 3483705, 3721186, 4084177, 4309860, 4241804, 3334946, 3814842, 4002826, 4330031, 4107682, 3665567, 4141660, 4680689, 5049659, 5460316, 5444537, 5161267, 5066271, 4525569, 4651693, 5266833, 4868452, 4320333, 4029398, 3920204, 4025140, 4044918, 3753959, 4364836, 5342670, 4842229, 5138945, 5141338, 5157981, 4345026, 4361111, 4291370, 4785374, 4977063, 5252068, 5630891, 5204880, 4950158, 4188791, 3794290, 3489970, 3177879]
8797C177879Q05565J088305n4815n78128l36066J33283J272414Q11862n62118
8788E758181m47366K68591K44119m02191r44441L0413K47350k65453K04388J123094
8778E816685O49897m65285q93017L87611P36676K20259L69833o89900m70795k09990
8768E451974J58440M41521j107689m28590O20465J90942J82594l54499l76406
8759D778752n33116p41997Q36501O84245M3405r02195K51822K50527o2545r86590
8749C618809m74945L74977N79710k84456n18672O69733J12484j019980o7133m32953
8739B557574p380k27533l5686M50924L36702N24731O29783L29209o22273k26768
8729C709283Q11036q12375o28644J53648o30573p66866J0169P76822J112201j85907
$$ y = [3177879, 3983444, 5071749, 5016934, 4438806, 4102740, 4236023, 5508437, 6320299, 5758181, 5310815, 5579406, 5823525, 5421334, 4476893, 4507306, 4754656, 4489203, 4693591, 5816685, 6466582, 6001297, 5108280, 5495891, 6232567, 6452826, 6822659, 6132759, 5661964, 5451974, 5610414, 6051935, 4944246, 4515656, 5136121, 5327063, 5509657, 5155158, 4778752, 4245636, 3503639, 4340140, 5024385, 5067790, 4165595, 4417417, 4667944, 4605399, 3618809, 3143864, 3518841, 4098551, 3814095, 3295423, 3965156, 4077640, 3057660, 2990527, 2557574, 2550194, 2322661, 2286975, 2737899, 3074601, 3599332, 4229115, 4558324, 3936051, 3709283, 4520319, 3707944, 3079300, 3232948, 2602375, 1835509, 1845678, 2622500, 3734701, 3548794]
8719C548794J91461k72885N44310L43192K08377r67550n71893R653j28158j260901
8709A644400k22741J48751j23002J137682j41449q74938p36533j46417J132983
8700A818736M94238o43448l27183O9914J01212J015140R08620L57258R70230O9392
8690D834109k89836o60605n83588j04117k52189O44831N53547P51076q12617m2067
8680D038544J522K96489m53179m43253J87183R32187k00031p72442l52700j82722
8670C051598j4609J126125k89515l61065L51784k66411P88105J9712M45685L36862
8660E188271k36427p18624Q53146O8579j207750n78513Q12268J439681N15446
8651F136077r99193l30292Q27498L57236J43122P03400J44071O0528j5725j557321
$$ y = [3548794, 3740255, 3467370, 4011680, 4354872, 4563249, 3595699, 3023806, 3033459, 2905301, 1644400, 1421659, 1570410, 1447408, 2585090, 2443641, 1568703, 832170, 685753, 1818736, 2312974, 1669526, 1342343, 1412257, 1513469, 2528609, 3437229, 3794487, 4764717, 4834109, 4544273, 3883668, 3300080, 3195963, 2943774, 3588605, 4142152, 4893228, 4080611, 4038544, 4040066, 4336555, 3883376, 3440123, 3627306, 4559493, 4359462, 3587020, 3234320, 3051598, 3036989, 4163114, 3873599, 3512534, 3864318, 3597907, 4386012, 4405724, 4851409, 5188271, 4951844, 4233220, 5086366, 5154945, 3947195, 3368682, 4180950, 5620631, 6136077, 5136884, 4806592, 5634090, 5991326, 6134448, 6837848, 6981919, 7042447, 7026722, 5469401]
8641E469401n25581k79072n27645N12858O77788m13967j17970k55248P01487K44762
8631E486813p4546Q88369N05266l05077O5400k63864P11998K98223N7551K61121
8621G631254m17663l35607l7568K55572K62627M77422m93576J41496J204248J78952
8611H867157P47083P67945l32121K33182P62533K25727n30332L84066L46654k32425
8601A1239469l70907p47627j94408N38960J586673O7635O00464o95813q52549
8592A1171897j03252o23514n37402n21636l85612m53223R9802o4694J10875m86872
8582H206369k2738j51398K70103L51453n06512K33126l30398o10364o81275k56243
8572F502123N14634M80056o2525q6636r11672p67901N86662Q50655j38586r28640
$$ y = [5469401, 4943820, 4664748, 4137103, 4649961, 5327749, 4913782, 4795812, 4540564, 5242051, 5486813, 5412267, 6300636, 6805902, 6500825, 6566225, 6302361, 7014359, 7312582, 7370133, 7631254, 7213591, 6877984, 6840416, 7095988, 7358615, 7836037, 7342461, 7483957, 8688205, 8867157, 9614240, 10382185, 10050064, 10283246, 11045779, 11271506, 10741174, 11125240, 11471894, 11239469, 10868562, 10120935, 9926527, 10465487, 12052160, 12119795, 12720259, 12024446, 11171897, 11068645, 10445131, 9907729, 9386093, 9000481, 8547258, 8647060, 8582366, 8693241, 8206369, 8183631, 8032233, 8302336, 8653789, 8147277, 8380403, 8050005, 7439641, 6758366, 6502123, 7016757, 7496813, 7434288, 7347652, 6435980, 5668079, 6254741, 7105396, 6966810, 6038170]
8562F038170r11983M38783K06327L53672K28089k15851R43814L29852k50065K91252
8552G452060j13736j531760j207834N81977L31596r47386n94476K89370O23929
8543D883740L82777j89820r93398j024134m01663J223339p1175J15167L57622
8534D282455K39829o94919j78135r7924m2792M11633N98619j52218l34274N35716
8524D567990o88307q63996L55670N42507m05513O0525P67393j76675n34438R5419
8514C720575j82932L3118N66265r18474j02796Q48651P43244m60608q90953N3738
8504C409828K19500Q91528K019714k92634j5640n5833K06585J15083q74472n85322
8494E038337j22504J567l59586q63991l23368K58590J386214M70613j134497K37337
$$ y = [6038170, 5126187, 5564970, 5771297, 6124969, 6353058, 6137207, 7081021, 7410873, 7160808, 7452060, 7338324, 5806564, 4598730, 5180707, 5512303, 4564917, 3970441, 4259811, 4883740, 5266517, 5076697, 4083299, 3059165, 2657502, 3880841, 3809666, 3924833, 4282455, 4522284, 3827365, 3649230, 3551306, 3508514, 3920147, 4518766, 4366548, 4032274, 4567990, 3879683, 3015687, 3371357, 3913864, 3508351, 3568876, 4336269, 4159594, 3625156, 3720575, 3537643, 3570761, 4137026, 3218552, 3115756, 3964407, 4707651, 4247043, 3356090, 3409828, 3629328, 4520856, 6540570, 6247936, 6232296, 6176463, 6383048, 6498131, 5623659, 5038337, 4915833, 4917400, 4557814, 3693823, 3370455, 3629045, 5015259, 5485872, 4351375, 4588712]
8484D588712J11375j084483r89q79403j39976j21100J388756J039379j792757
8475C109514j672447K68619N57478j7071k86825L15466O23269Q10303q2443l83757
8465C242106K11064K24331P10891p91265p65667p3578l02102N25172J044440p78738
8455C246654m78892j26611N02360o42421k89421k41539n03161M71343M27330o8005
8445B297637K87699Q94514P23790J15734j234155j2698M12708j15703J11738l69545
8435C111719J78927L19191p57129n21327L56284N64371r87059j103631k81247
8426H80099R32158L49434m1839L6449k07203q4393N00461J12747l0612m29841
8416B017460k37351n63929k41141k93777J030140P77477J44325p20383k58622
$$ y = [4588712, 4700087, 3615604, 3614615, 2735212, 2595236, 2474136, 3862892, 4902271, 3109514, 1437067, 1705686, 2263164, 2246093, 1959268, 2274734, 2898003, 3708306, 3625863, 3242106, 3453170, 3677501, 4388392, 3597127, 2831460, 2757882, 2455780, 2980952, 4025392, 3246654, 2767762, 2641151, 3143511, 2501090, 2211669, 1970130, 1466969, 1938312, 2365642, 2297637, 2585336, 3479850, 4203640, 4319374, 3085219, 3072521, 3485229, 3369526, 3481264, 3111719, 3290646, 3609837, 2852708, 2331381, 2687665, 3252036, 2264977, 1161346, 880099, 1812257, 2161691, 2119852, 2156301, 1949098, 1864705, 2365166, 2477913, 2447301, 2017460, 1780109, 1216180, 975039, 681262, 1711402, 2488879, 2633204, 1912821, 1654199]
8407A654199L89112R75751r13859j047877k49081J96183J212404j84075m60191
8398A572566N60412k90575l47610K17172Q6053O4974L57306M61150j89877N83846
8388C075417L77719p35749o20373k20528k46740l45371o90686O57007J031496
8379B282192m34162J1020m35208o61946l67338J254024O27907j057196k63289
8370I56004k03156o0137Q26645K00664J37334O98102Q6774O34958j381229r99154
8360H96805n1257N42345l90581M5774L097P91225j82582p63835j58561l4554K17033
8349I14909M34979K15722m51208j001379J367734N56712m49007l39071P68483
8340B017874M98050q30204k07900k66853L4591L93817m67284k1740o32040j1026
$$ y = [1654199, 2043311, 3019062, 2105203, 1057326, 808245, 1004428, 2216832, 2032757, 1572566, 2132978, 1842403, 1494793, 1711965, 1798018, 1862992, 2220298, 2681448, 2491571, 3075417, 3453136, 2717387, 2097014, 1876486, 1629746, 1284375, 593689, 1250696, 2282192, 1848030, 1859050, 1423842, 761896, 394558, 1648582, 2276489, 1219293, 956004, 752848, 692711, 1519356, 1720020, 1857354, 2555456, 2642230, 3277188, 1895959, 896805, 845548, 1387893, 997312, 1043086, 1046183, 1837408, 1654826, 890991, 732430, 697876, 914909, 1349888, 1565610, 1114402, 113023, 1480757, 2037469, 1588462, 1249391, 2017874, 2515924, 1685720, 1477820, 1210967, 1245558, 1639375, 1172091, 1150351, 518311, 507285]
8330E07285k63977J356077K84584n24224l08270J64868q01481L16762j1787N69359
8320A289196J177550K46320j30859k03183l48344R5579L40960Q96248O92158m28571
8310C627054l08755l24013P882k8725L70410j044995p74914j99330j47636n96043
8300E80935L40079K07296k6979o34219n31957q7675J099412R17315n63245m61749
8290H39213N22823J55008l34212j033715J448030K54732K48389o8816N46124M68444
8280C046020j759329K19022J33020K02107P43134m75602O44548K24455j03761
8271B873614m44274l41393J08884m204J05133k38383m36348p35790m37687j18538
8261C31014O12743K84355N69537L18373l60117M01131N13148L4792l24311N368
$$ y = [507285, 243308, 1599385, 1883969, 1359745, 1051475, 1216343, 414862, 731624, 719837, 1289196, 2466746, 2713066, 2582207, 2379024, 2030680, 2126259, 2467219, 3363467, 4055625, 3627054, 3318299, 2994286, 3002168, 2973443, 3343853, 2298858, 1523944, 1324614, 1176978, 580935, 921014, 1128310, 1101331, 467112, -64845, -152520, 946892, 1864207, 1300962, 839213, 1362036, 1517044, 1182832, 149117, 1597147, 1851879, 2100268, 2031452, 2577576, 3046020, 1286691, 1505713, 1638733, 1840840, 2583974, 2108372, 2752920, 2977375, 2873614, 2429340, 2087947, 2196831, 2192627, 2297760, 2059377, 1623029, 887239, 449552, 331014, 943757, 1228112, 1797649, 2116022, 1755905, 2157036, 2670184, 2704976, 2380665, 2386033]
8251B386033p62144m39783L20033J167510L83141l69208p65049q44451k50935
8242H25147N62614L92986n22836r9356P9720n7050L97046M51704p69082n1084
8232A209809Q77127r0359j072562o60840j56799p5965J32125L50055j10435L99164
8222H01320M3587Q11498j68057j049508l39092J25978L53418O64331L45100k15142
8212A373433K52158j42656L84184q04012P24492J712747j10720K4554j94179L08469
8202C528470j09972p62103r91413q88331O07939J8732L48652L1916K52503k80290
8192A756103q85035m62805K72185J02108J58420J75969L15031m57759j402860
8183d28643L59841M83273N13588j30703K56669N19216M1776k0776J27252K33662
$$ y = [2386033, 1623889, 1184106, 1504139, 2671649, 3054790, 2685582, 1920533, 1076082, 825147, 1387761, 1780747, 1257911, 1158555, 1238275, 1181225, 1578271, 2029975, 1260893, 1209809, 2086936, 1996577, 924015, 263175, 106376, 30411, 162536, 512591, 402156, 801320, 844907, 1656405, 1488348, 438840, 99748, 225726, 579144, 1243475, 1588575, 1373433, 1625591, 1482935, 1867119, 1063107, 1787599, 3500346, 3389626, 3414180, 3220001, 3528470, 3418498, 2656395, 1664982, 776651, 1384590, 1403322, 1751974, 1783890, 2036393, 1756103, 871068, 408263, 680448, 782556, 940976, 1116945, 1431976, 974217, -428643, -68802, 414471, 928059, 797356, 1054025, 1573241, 1615017, 1594241, 1721493, 1955155]
8173A955155J42892l02457k88955j87451K31389J55632k20006Q3332L27451j3330
8163A883652n43141o53248o82327o60622L25005k2127R79845J25251L60352O1056
8153A173696q98689n22409l29871o9911P62606n21916J03293K19928O74006j8487
8143E72246n78434n01393O69791J329133J133218M34815o10659j066628n32231
8134H49858Q37929Q15605j27579j026732r4382J183554J056473k22844k52413
8125C019469j282544m44448q0937M25262L24236j52972l36244O70753o53115J52098
8115A641558J48247M38518k7524o33885m20476j0267K07878O37802L35506j212235
8105A105122k12900R67916J41306J5545M345J81027k41344p65091q65771Q23649
$$ y = [1955155, 2098047, 1795590, 1506635, 1319184, 1550573, 1706205, 1486199, 1569531, 1896982, 1883652, 1340511, 687263, 4936, -655686, -330681, -352808, 627037, 752288, 1112640, 1173696, 275007, -247402, -577273, -647184, 115422, -406494, -303201, -83273, 590733, 572246, -6188, -507581, 162210, 1491343, 2624561, 3059376, 2448717, 1382089, 849858, 1687787, 2503392, 2375813, 1349081, 1254699, 2438253, 3494726, 3271882, 3019469, 1736925, 1292477, 1211540, 1636802, 1961038, 1808066, 1471822, 2142575, 1489460, 1641558, 1789805, 2228323, 2200799, 1566914, 1146438, 1136171, 1344049, 1981851, 2317357, 1105122, 892222, 1860138, 2001444, 2016989, 2021334, 2202361, 1961017, 1195926, 330155, 1153804]
8095A153804R97213M39436q93672j146141L92379J32618j68065L83807J14584
8086A405963j33396o09539m09745q87533J82118P04923m63042L37748J235566
8077A363063L33101p36652r31400K85072R42327N07521Q74553J050580k24234
8068C463931K52554J85512o29461o86665l08968j29963l42944N82662J53533K82997
8058B823188J050869n13794j196981r93651K75300R60682k09369M33786L91843
8049C021873j66848L23265J29090j413729O1352M88545l61938m96005k90177m36316
8039H59112J596564J109086l51855Q46066R4097k56013o58922J07102m18719L77022
8029C303540j019675l4216R36875J537664l82994r78515o29721J58565L31012
$$ y = [1153804, 2151017, 2590453, 1696781, 550640, 943019, 1075637, 907572, 1291379, 1405963, 1272567, 663028, 253283, -634250, -452132, 252791, -210251, 127497, 1363063, 1696164, 959512, 28112, 313184, 1255511, 1763032, 2637585, 3688165, 3463931, 3716485, 3901997, 3272536, 2585871, 2276903, 2146940, 1803996, 2386658, 2540191, 2823188, 3874057, 3360263, 2163282, 1169631, 1444931, 2405613, 2196244, 2630030, 3021873, 2855025, 3178290, 3307380, 1893651, 1955003, 2443548, 2081610, 1585605, 1295428, 859112, 2455676, 3564762, 3212907, 4058973, 4153070, 3897057, 3238135, 3345237, 2926518, 3303540, 2283865, 2249649, 3186524, 4724188, 4341194, 3362679, 2732958, 2891523, 3222535]
8020C222535j13811j85112O2132P17625M05109O96231q6852o91056o22126l51731
8010C052944o1225o76193J62342L08289N16420O88377O59002M19939j151934N18467
8000D436428M1377n25246q0422L42797Q3293q70688J64280K65445Q08448J126858
7990E792570L58333m27902j592014k00962j45703m02075r2697K25559K54251M79997
7980D249357M528N82767O77661J49710j42597j004630j27959N25440L00266M70838
7970E685381L92878k83177n30470n5317P4867j31005R3955N79777q0372j14417
7960E632100R37887O57862j239697O47992J343516j86308K44968L36043p22054
7951G652309q27528k48984l5972o00147j846N40359L78408L16696r29643q55177
$$ y = [3222535, 3108724, 2923612, 2985744, 3703369, 4108478, 4804709, 4717857, 4026801, 3404675, 3052944, 2991719, 2315526, 2477868, 2786157, 3302577, 3990954, 4649956, 5069895, 3917961, 4436428, 4477805, 3952559, 3872137, 4214934, 4298227, 3427539, 3591819, 3857264, 4665712, 5792570, 6150903, 5723001, 4130987, 3930025, 3784322, 3382247, 3289550, 3515109, 3769360, 4249357, 4253885, 4836652, 5514313, 5664023, 5521426, 4516796, 4388837, 4914277, 5214543, 5685381, 6078259, 5795082, 5264612, 5209295, 5284162, 5153157, 5247112, 5826889, 5746517, 5632100, 6569987, 7227849, 5988152, 6636144, 7979660, 7793352, 8038320, 8374363, 7652309, 6824781, 6575797, 6539825, 5939678, 5937832, 6478191, 6856599, 7173295, 6243652, 5388475]
7941E388475K19721M28462l37408L29302M77524L05173J10314O5834J41984O025
7931G135406k23583Q84419K74543p736k06430L10150q00749n20815P0063j02553
7921F812715l66534r019Q78263O57985L48771l04895k29325M3080p80387l23421
7911F727233M49447J25011j148142M83974j384J13118n3976Q34042P32746j173204
7901G088865q96769j46168Q6260L52616M13389K3109p13292p84367j01731m02185
7891D919727J81814O0946J56855j76769n11434J024026J502816k91567l98511
7882F467903L86105n6105j003134M21623K44390k77417j419962l71654Q09876
7873E201625K69503l14411p6024l63718O24452M55528r027k514p31945m90525
$$ y = [5388475, 5608196, 6036658, 5699250, 6028552, 6506076, 6811249, 6921563, 6987397, 7129381, 7135406, 6911823, 7796242, 8070785, 8063049, 7856619, 8166769, 7366020, 6845205, 6915268, 6812715, 6446181, 6437162, 7315425, 7973410, 8322181, 8017286, 7787961, 7831041, 7050654, 6727233, 7176680, 7301691, 6153549, 6637523, 6636139, 6749257, 6695281, 7529323, 8262069, 7088865, 6192096, 6045928, 6132188, 6484804, 6898193, 6921302, 6208010, 5423643, 5321912, 4919727, 5101541, 5162487, 5319342, 5142573, 4631139, 5655165, 7157981, 6866414, 6467903, 6854008, 6797903, 5794769, 6216392, 6460782, 6183365, 4763403, 4391749, 5201625, 5471128, 5156717, 5080693, 4716975, 5341427, 5796955, 5787928, 5785414, 5053469, 4562944]
7863D562944M47249q11526j520r1012q39538M57745l91874M08064R58861J282273
7853E981666j59271q23826j45582k59129q72938k48303j90543K69804J167596
7844D719474l58816j759234q66015l00443j06618J235105N77543q03159l38148
7835A999689l24341J24949N78236K45470m77170j155377K77271L16260L44146
7826A929133Q44552J49236P56995l87670k38683q46722J39351J093661Q3401q33922
7816B689332l84088n591k70766Q57181l45223r97460j093456M19168P24242R6045
7806A689384K39285O69017o4291L54385K84014n60496n57563r87109O5566O69910
7796A802102M72323M75490L6934m5160p71394L08358N66610j15131l05872j65236
$$ y = [4562944, 5010193, 4198667, 4197147, 4106135, 3266597, 3724342, 3332468, 3740532, 4699393, 5981666, 5822395, 4998569, 4852987, 4593858, 3720920, 3472617, 3282074, 3551878, 4719474, 4360658, 2601424, 1735409, 1434966, 1328348, 2563453, 3140996, 2337837, 1999689, 1675348, 1800297, 2378533, 2624003, 2146833, 991456, 1268727, 1584987, 1929133, 2773685, 2922921, 3679916, 3292246, 3053563, 2206841, 2346192, 3439853, 3523254, 2689332, 2305244, 2299653, 2028887, 2886068, 2540845, 1543385, 449929, 869097, 1593339, 1689384, 1928669, 2597686, 2533395, 2887780, 3171794, 2611298, 2053735, 1066626, 1132192, 1802102, 2274425, 2749915, 2786849, 2741689, 1970295, 2278653, 2845263, 2730132, 2424260, 2259024]
7786B259024J06288J63933O78831n46224O88462J06729l81675o74089k73824j36563
7776A990892L41458L56111k21176n06315o76448n28387N42977R8086o57304k82092
7766D57802L39055L38498O53456k47197L4482q19184L89018R82855l87723l66210
7756A374852j59032j64919J98798k90339L78370Q40946j38254K12336L03686p52599
7746A803845r04063m38202K57969q01099k59820N68370J079945r23668l22384
7737F0893j52620o3994K80326O08886Q29563K61823j93370j358582p74151O42538
7727A41312P42765J9530O47154J18355q15813q45266l09029j59311J01619J364572
7717A005888O74451J83960L7778N81336J28951o81374L41702m32808n72902j06829
$$ y = [2259024, 2365312, 2529245, 3208076, 2661852, 3350314, 3457043, 3075368, 2401279, 2127455, 1990892, 2332350, 2688461, 2467285, 1960970, 1284522, 756135, 1299112, 1397198, 739894, 457802, 796857, 1135355, 1788811, 1541614, 1576096, 756912, 1145930, 2128785, 1741062, 1374852, 1215820, 1050901, 1249699, 959360, 1337730, 2178676, 2040422, 2252758, 2556444, 1803845, 899782, 461580, 719549, -81550, -341370, 227000, 1306945, 383277, 60893, -91727, -155721, 124605, 733491, 1563054, 1824877, 1631507, 272925, -501226, 141312, 884077, 903607, 1550761, 1669116, 853303, 8037, -300992, -460303, -358684, 1005888, 1680339, 1864299, 1902077, 2483413, 2612364, 1930990, 2272692, 1839884, 1266982, 1160153]
7707A160153P52512L33035j123183m40998m17191j27229J073222Q82179k45643
7698A846857k60797j96407o43553j411658J1213l72585L13517R39329k7523m95850
7688b97457N00256l26218j06844J46625k98981J37680N56403P15110O30154p5951
7678A580777O72194M35922r3429p85756L6085j114199q09042N21329R80649Q15931
7668B240461m41576j33081n79550L47724j129240j413183r4800P83365M00929
7659a8951M91683P5662J05632k88020J48726J50469l90325l66231j64439Q37035
7649E81241K51251l00409M36246q08449J10255k61066m46908j29741Q72220M90339
7639G94979L00683J204541m01419p61080o88160k8619m74728M54071J097155k59129
$$ y = [1160153, 1912665, 2245700, 1122517, 681519, 264328, 137099, 1210321, 2092500, 1846857, 1586060, 1389653, 746100, -665558, -654345, -1026930, -713413, 225916, 198393, -297457, 202799, -123419, -230263, -83638, -382619, -244939, 311464, 1026574, 1656728, 1580777, 2252971, 2688893, 2595464, 1809708, 1845793, 731594, -77448, 443881, 1424530, 2240461, 1798885, 1665804, 1086254, 1433978, 304738, -1108445, -1203245, -419880, -18951, 472732, 548394, 654026, 366006, 514732, 665201, 274876, -91355, -255794, 581241, 832492, 532083, 968329, 159880, 270135, 9069, -437839, -567580, 304640, 794979, 1095662, 2300203, 1898784, 1137704, 449544, 420925, -53803, 400268, 1497423, 1238294]
7629A238294p76463l085n19507j003577r08353P25100J473752K64928j17747M85117
7619H58459L67772L6777M51291K00242j50400q82033j2869m70726k0603N64306
7609I42216K10784J91359L92771Q55745j569600j161942o78970M28131N07953
7600A18447L61496J19092P57059J27717q26740n37072m59473k45325j18467Q8654
7590f14612Q79853N53902J82209k09999K74287l9336q13420j82940K15381k91379
7580d6054R2807K99278P13550k99848j49049P4045J49454p70545k75510q8872
7570c00744M31701K66843j153857r43004J076135L75837N98491l30802k55614
7561b35014M56375J264058J087288k98901p92943j47785p27475J50877k07968
$$ y = [1238294, 461831, 458746, -60761, -1064338, -1972691, -1247591, 226161, 491089, 373342, 858459, 1226231, 1263008, 1714299, 1914541, 1764141, 882108, 869239, 398513, 377910, 942216, 1153000, 1344359, 1737130, 2592875, 1023275, -138667, -817637, -389506, 118447, 479943, 599035, 1356094, 1483811, 657071, 119999, -339474, -584799, -703266, -614612, 265241, 819143, 1001352, 791353, 1065640, 1026304, 212884, 29944, 245325, -46054, 46753, 346031, 1059581, 759733, 610684, 684729, 834183, 63638, -211872, -300744, 130957, 397800, -756057, -1699061, -622926, -247089, 351402, 20600, -235014, 221361, 1485419, 2572707, 2273806, 1480863, 1333078, 605603, 756480, 548512]
7552E48512M74708m35911r11074J009042N96007K81756Q21241n19282o60647L11872
7542A516224k26100p26948r47773n39269K66703J110398o7093O04413K01000L62489
7532A554044j012454m56947L58942n16659K58358M38619p05031k5454K2696l10234
7522c94120p4678j29666Q0540m61737p4400O31864l87982q59378j32906R25915
7512h76548J233034J236011j35989j107155k49436n64100j68916K40593O72162
7503B79656j38278j38256j20769N85987J173391K23483o01129j321843m63980
7494e21738j5747k87122o8095J515324O28558j15121K69575k61101p38371J75321
7484E81483k97015l80109j8271j46478m67087j3327P3804l90322l16315P00173
$$ y = [548512, 1023220, 587309, -323765, 685277, 1281284, 1563040, 2384281, 1864999, 1204352, 1516224, 1290124, 563176, -384597, -923866, -657163, 453235, 386142, 990555, 1191555, 1554044, 541590, 84643, 443585, -73074, 185284, 623903, -81128, -106582, -83886, -394120, -468798, -598464, -517924, -979661, -1054061, -422197, -810179, -1669557, -1802463, -876548, 356486, 1592497, 1456508, 349353, 99917, -464183, -633099, -392506, 279656, 141378, 3122, -117647, 468340, 1641731, 1865214, 1264085, -57758, -521738, -537485, -824607, -892702, 622622, 1251180, 1136059, 1405634, 1144533, 406162, 581483, 284468, -95641, -113912, -260390, -727477, -740804, -667000, -1057322, -1373637, -673464]
7474f73464P03476J246460K25487j181078L17607L07551K65529N53336N43197
7465B308101R8579l93597p82763p80321M3559j39358l38759j419273k8211N54328
7455h77715O48059P17602P2660K88775N1152N89369r59452P6082Q8622N7190K7009
7444G79353J36034k04254O22232o83628r93741m52858L45645O75294n0723j19634
7434E3720K39228P87192r44001j055527l15906M96653l61722P66468N38044N10645
7424G14794n12884L56688K37963q10554m35254M83153j9164l64809L8743K16908
7414i4416j99117j038119K77467P98290k22123M57817j0602m57877j63583o06245
7404a258508Q0351p61962P8800j99938o4580K33592L85843K0653J159967L79327
$$ y = [-673464, 30012, 1276472, 1501959, 320881, 638488, 946039, 1211568, 1764904, 2308101, 2406680, 2013083, 1230320, 449999, 493558, 354200, 15441, -1403832, -1432043, -877715, -229656, 487946, 560606, 849381, 900533, 1489902, 530450, 606532, 695154, 752344, 779353, 915387, 711133, 1333365, 649737, -344004, -796862, -451217, 224077, 173354, 53720, 292948, 1080140, 136139, -919388, -1235294, -738641, -1100363, -333895, 204149, 714794, 201910, 558598, 796561, -13993, -449247, 33906, 14742, -350067, -311324, -94416, -293533, -1331652, -1054185, -255895, -478018, -20201, -30803, -488680, -652263, -1258508, -1178157, -1940119, -1861319, -2061257, -2125837, -1892245, -1506402, -1485749, -325782, 53545]
7394E3545j21515K25052J19444K34115P0182q7410j15786m18222L9451p30344
7384g31488j91594L53968N02670O90589L40257l81933o16615m265l2500q75895
7374i46806m24712L45847R86831n12526j228028j82300j72664P17016J359104
7365e8238l0043N78691q6503R3278l1610Q24133m59200k10231J536801O66217
7355B823295j000562l44565q91666M01962J41788m72100o88854L25280m96744
7346b02166m58983n9649L55557J58774M3572k22049j28701m535L5720K72840J426391
7335A216771K93531j002154r2837J06182N72804J073328o79457m25283N59981
7326A622866k54152j177711k47252O75888K27053n56722k80688Q75270j81231
$$ y = [53545, -67970, 157082, 276526, 510641, 580823, 493413, 377627, -40595, -1144, -731488, -923082, -569114, -66444, 624145, 964402, 582469, -34146, -38411, -70911, -946806, -1371518, -1025671, -38840, -551366, -1779394, -1961694, -2134358, -1417342, -58238, -88281, 490410, 403907, 497185, 465575, 1289708, 830508, 620277, 2157078, 2823295, 1822733, 1478168, 586502, 988464, 1130252, 658152, -30702, 294578, -202166, -661149, -720798, -365241, -206467, -162895, -384944, -513645, -518180, -482460, -209620, 1216771, 1510302, 508148, 415311, 521493, 1094297, 2167625, 1488168, 1062885, 1622866, 1368714, 191003, -56249, 619639, 846692, 289970, 9282, 884552, 703321]
7317G03321L5619M95097J188686r23007j417905o43921K88817J20379J022482
7308H69568j78238l72936k72802P32895J31326L68085n23648m1528Q62035q757
7298A566000o81299k03841Q71861o8453k147037n32118R73447J069869L47178
7289A195607j108851J13464O62476n21123P08262k2176r94877o60883J71396m73794
7279i30499m12511J092100J87300m51464p48653o45770J8671R76355M24837O07307
7269A17673K19790j15355K816L12876l44714l4591j41189j17356l14040K50256
7259a63834J116218L10323L0269r77763p32635j66070M9322k97155P9701N0562
7249g01062J152216N78775O27906R7365n20298q37899p73425K56575J45321K52047
$$ y = [703321, 738940, 1234037, 2422723, 1499716, 81811, -562110, -273293, -152914, 869568, 691330, 318394, 45592, 778487, 909813, 1277898, 754250, 712722, 1574757, 1566000, 884701, 680860, 1552721, 1484268, -662769, -1194887, -221440, 848429, 1195607, 86756, 200220, 862696, 341573, 1049835, 1027659, 32782, -628101, -456705, -930499, -1343010, -250910, -63610, -515074, -1263727, -1909497, -1890826, -914471, -489634, 117673, 337463, 222108, 224924, 537800, 193086, 158495, 17306, -100050, -414090, -163834, 952384, 1262707, 1292976, 315213, -417422, -583492, -534170, -831325, -751624, -701062, 451154, 1029929, 1657835, 1755200, 1234902, 397003, -376422, -119847, 25474, 277521]
7239B77521k2338n70000m75188r82079j1861J199542J20001K5679L2855K74017
7229a31851n41461p91957Q8776R42785n24962J51805J44527P39706p90191j76552
7219h89375p4030K59286J10239R47943N31857j79117k17594r83678O5705O26918
7209A98154L34321j76946R65651Q3755m53349l7203M40130l58752j329532k29845
7199e63616R0146R80802K46624m81224J68451M13284r066n90433n81777L41915
7189A5106j98057J5461l97848j27511l71111L03416Q38780Q09029q17538j00093
7179c0366N47188K05880j218121n97256q7494l5805r3040o94093Q12220J782069
7169E91182L62280M1395N6285o7674o86319N67899P45939r50544p70105j16684
$$ y = [277521, 255183, -314817, -790005, -1772084, -1783945, -584403, -464402, -438723, -405868, -131851, -673312, -1465269, -1376493, -433708, -958670, -806865, -662338, 77368, -712823, -889375, -963405, -704119, -593880, 354063, 885920, 706803, 489209, -494469, -428764, 198154, 532475, 355529, 1321180, 1404935, 951586, 914383, 1354513, 995761, -333771, -563616, -473470, 507332, 753956, 272732, 441183, 854467, 845401, 254968, -326809, 15106, -182951, -167490, -565338, -692849, -1063960, -760544, 78236, 887265, 69727, -30366, 516822, 722702, -495419, -1092675, -1180169, -1215974, -1309014, -2003107, -1190887, 591182, 953462, 994857, 1051142, 983468, 297149, 865048, 1610987, 660443, -109662, -226346]
7159b26346q6276k75015j494983Q95817J632893O89183Q10511L37489K94368k95867
7149B281774r72276m0784M11480n04039K36208p57212l20849k25355K5283o66104
7139e31874M79835J8106O3380j06969l28613L15966K47952j41636j292918p16462
7129a993233j41200O52997J129352R98751q6088q3296k25047m71705j219833o650
7119a445952J19289N40527Q15860Q76146o75827L96189Q24469P45279r51256q59444
7109C85280n68480j265224j119485J199543M07774j71896M49017N26474l23519
7100d80516M97449k29852k88493J386480l45052r11509M17042J65069j04120N3623
7090A60121q13812q67178K2687L69884P25540K39819o36176k0204J38426P91474
$$ y = [-226346, -312622, -587637, -2082620, -1186803, 446090, 1135273, 1945784, 2283273, 2577641, 2281774, 1309498, 1268714, 1680194, 1176155, 1412363, 655151, 334302, 108947, 134230, -531874, -52039, -33933, 29447, -77522, -406135, -90169, 157783, 16147, -1276771, -1993233, -2134433, -1481436, -352084, 646667, 560579, 477283, 252236, -219469, -1439302, -1445952, -1326663, -786136, 29724, 905870, 230043, 626232, 1450701, 2195980, 1244724, 385280, -183200, -1448424, -2567909, -1368366, -960592, -1132488, -683471, -156997, -480516, 16933, -212919, -501412, 885068, 540016, -371493, 45549, 210618, 106498, 160121, -653691, -1520869, -1498182, -1128298, -402758, -162939, -799115, -819319, -680893, 110581]
7080A10581L26313m38917o65980J51714J281581J020747K48108l87073m55303
7071A191771O0112q46550j39459M08982J95321k28578L00707m90567r22905Q14260
7061C43094k48612j043580L36757P92558N05679j67867l12566p9487J61910L15718
7051F03604r79597l18673P04920K08744j47122k02002J13754j15079Q11119J99084
7041H78752m06907r06193m01438N61437J212606J179507k83794j01243p80370
7032I52357p15888P07001j49154p92598L18282J21918k39965q67397L60535J47873
7022a57036J7734q07004K89567L59929O98393J2697m42058N40714P24440r0220
7012A147156j33577r46993k68587J81552P15004J83364n72458K79209p98139l01831
$$ y = [110581, 436894, -2023, -668003, -516289, 765292, 1786039, 2034147, 1647074, 1191771, 1251883, 405333, 265874, 674856, 870177, 641599, 942306, 451739, -471166, 343094, 94482, -949098, -612341, 180217, 685896, 518029, 205463, 125976, 287886, 603604, -375993, -694666, 10254, 218998, 71876, -130126, -16372, -131451, 679668, 878752, 471845, -434348, -835786, -274349, 938257, 2117764, 1833970, 1732727, 952357, 236469, 943470, 794316, 1718, 320000, 441918, 201953, -665444, -304909, -157036, -139302, -946306, -656739, -296810, 401583, 414280, -27778, 512936, 1237376, 1147156, 1013579, 66586, -202001, -20449, 694555, 877919, 305461, 584670, -213469, -515300]
7002e15300L51422R3639k35348L59227J21158k68577l23656l25796J35443O69396
6992F1608R96858P07896L38316n49270j136718n22248m33105J85399N91096J57275
6982C97107L35052M52801L7853K86567j139230m22392o73686R44741R51047r20343
6972B49517r48921M53365Q67146O13035q7180k22939P27701L68335l93072p87832
6962H39155j668801j78726L88242m73555K3479m01540M67829N32083k25653m9465
6952g46952P6808p3274N93227L19314q37188J59490p9712M58942l22935O42635
6942A90355P51427n99649p39956p93660J9786P23521N43713J5264J13727j127700
6932i03172m5673N33126L64296j57199R8308O40838l88267o71314l6510P80359
$$ y = [-515300, -163878, -70239, -305587, 53640, 174798, -93779, -417435, -743231, -607788, 61608, 1058466, 1766362, 2104678, 1555408, 418690, -103558, -536663, -351264, 239832, 397107, 732159, 1184960, 1222813, 1509380, 370150, -52242, -725928, 218813, 1169860, 249517, -699404, -246039, 621107, 1234142, 1146962, 924023, 1651724, 2020059, 1626987, 839155, -829646, -1008372, -620130, -1093685, -1070206, -1471746, -1003917, -471834, -697487, -746952, -670144, -743418, -150191, 169123, -668065, -508575, -588287, -129345, -452280, 190355, 941782, 342133, -397823, -1191483, -1171697, -448176, 95537, 110801, 224528, -903172, -948845, -415719, -51423, -208622, -110314, 530524, 142257, -529057, -565567, 214792]
6922B14792P53358p84180M29234m14059p36532k56984L2271R04060K76758l56818
6912F1900j084857P96143P02335J22230l69793M3803o71648q92722L99277K13787
6902f79545n4740j59981p92319J84227K33388k85646M80418q0031r31695q08039
6892b893963Q65171J217898p0612p88j0824p000k68009M00268O37418L39414N68172
6881G77145q75866o53510m46601k83042J00603m0629n79016o18050j49545o28545
6871c397056J02958M06528J055647M84091O12946J35142m58325M91884O81814
6862A15629k72928M9740N59759j14347j94217j59144j385499M08538N09145p87480
6852a270804L87570J049899J468071l84928q98317j29781P0465k98028p6676K45662
$$ y = [214792, 968150, 183970, 613204, 199145, -537387, -794371, -762100, 141960, 418718, 61900, -1022957, -226814, 475521, 597751, 227958, 271761, -399887, -1292609, -893332, -679545, -734285, -894266, -1686585, -1502358, -1268970, -1554616, -1074198, -1154229, -2085924, -2893963, -2028792, -810894, -881506, -882294, -893118, -900118, -1168127, -767859, -130441, 208973, 777145, -98721, -752231, -1198832, -1481874, -1381271, -1421900, -2000916, -2618966, -2768511, -3397056, -3294098, -2887570, -1831923, -1347832, -734886, -599744, -1058069, -566185, 115629, -157299, -107559, 452200, 337853, 143636, -15508, -1401007, -992469, -483324, -1270804, -883234, 166665, 1634736, 1249808, 351491, 221710, 292175, -5853, -82529, 163133]
6842A63133l90427K49423J027495p13541q27099Q32424N92038K30907J02133j39138
6832A127348j24674j80014n62406l207J159841o60287j328544n55134N58815O85600
6822A17338L03680O29793J52966l2611j128313o59742p9246J87951Q18862J397802
6812A708480Q75611j92239r43829r91744p9072j4695o50288j42746k73057q63025
6802a566604k51304O69103Q89749L87816L90863k11166o9390k52130m84136r78094
6792a475293K76690M58051k73939k71526P54575J69098p63835M195J77903N76127
6782c67954K76978p81981m1271P00638R28924l39798k1337L58016j76746o23388
6772h7919j007321K71997N21729N87151k64682K01488o64514l43538N18533j20613
$$ y = [163133, -227294, 22129, 1049624, 336083, -491016, 341408, 933446, 1164353, 1266486, 1127348, 1002674, 822660, 260254, 257047, 1416888, 756601, -571943, -1127077, -568262, 117338, 421018, 1050811, 1203777, 1171166, 42853, -616889, -696135, -508184, 310678, 1708480, 2584091, 2391852, 1448023, 456279, 377207, 362512, -287776, -430522, -703579, -1566604, -1817908, -1148805, -259056, 128760, 519623, 308457, 239067, -13063, -497199, -1475293, -1198603, -740552, -1014491, -1286017, -531442, -362344, -1126179, -1121984, -944081, -367954, -90976, -872957, -914228, -213590, 715334, 375536, 354199, 712215, 535469, -87919, -1095240, -823243, -301514, 285637, 20955, 222443, -442071, -785609, -267076, -387689]
6762c87689k15166R16113m3210o42410J45334p31466K48378J80323j80024J467603
6752G57786Q84157l95946j27742l89831K19869L8490k9275q03514n14379l17789
6742f78174M71836M12436K12563k05002j154336p2648O13658N94095J029306L44158
6732A567892j71343n26662l38837j07898M27566j62223m99175m16878m46039m21082
6722a094679Q61402P11447K25957R90696p9868m91350l4943r66555n79682M11434
6712d6141L09159Q75141l54697j147820q06315P11269O94002m45032q80382N8355
6702a032461O02515P75935J04240O06851J211888l86976k402333r74285j94359
6693a688985k45967M89131N89898P02909q49349p63080m63454L19449J124131
$$ y = [-387689, -602855, 313258, 270048, -372362, -227028, -958494, -710116, -529793, -709817, 757786, 1641943, 1245997, 1118255, 728424, 948293, 986783, 957508, 153994, -360385, -678174, -206338, 206098, 418661, 213659, -940677, -1013325, -399667, 194428, 1223734, 1567892, 1396549, 869887, 531050, 423152, 850718, 688495, 189320, -227558, -673597, -1094679, -233277, 478170, 704127, 1694823, 1614955, 1123605, 1088662, 122107, -457575, -46141, 263018, 1138159, 783462, -364358, -1170673, -459404, 234598, -210434, -1090816, -1032461, -429946, 345989, 450229, 1057080, 2268968, 1881992, -520341, -1494626, -1688985, -1934952, -1445821, -855923, -153014, -1002363, -1765443, -2228897, -1909448, -785317]
6684g85317L70495j77012k3447j37495p13399O59926N12600j02639Q71366Q58821
6674A333899l60694k55581M00657K75843q8571j317629r97468K0935J24023k02389
6664a066975J440472l29313k8756k79922P12320Q97813l96495q44575n46150M58436
6654A6855R17472k38614r52209q41089r3241K22005n7126N91859m8937J63869
6644c19156Q94568R39269J8233K65737J8325m95698l04321l50118m85751n51486
6634c70398P11346O67115n15194M17779l59722n63975M02280J076601J19951q09718
6624G76065n46941M67213J28410J88470n14908r92058n2477N50679K05536J034623
6614A244612K41398o00351r33596K41720m63075l71260l11227N69226L82453l26129
$$ y = [-785317, -414822, -591834, -615281, -752776, -1466175, -806249, -293649, -396288, 475078, 1333899, 973205, 717624, 1118281, 1394124, 1305553, -12076, -1009544, -988609, -864586, -1066975, 373497, 44184, 15428, -264494, 447826, 1345639, 949144, 104569, -441581, 16855, 934327, 695713, -256496, -1097585, -1190826, -968821, -1025947, -434088, -483025, -319156, 575412, 1514681, 1532914, 1798651, 1816976, 1321278, 1016957, 666839, 181088, -370398, 340948, 1008063, 492869, 910648, 550926, -13049, 389231, 1465832, 1585783, 776065, 229124, 696337, 824747, 1013217, 498309, -493749, -546226, 4453, 209989, 1244612, 1486010, 885659, -47937, 193783, -269292, -640552, -951779, -382553, -100, -326229]
6604c26229r877p61251K33724N98888J49917r65574n53364J58820L21945Q76133
6594b76868J65091N83737M34763k68138m59920N09939R6675l15814J42504r98094
6584c86125R0952m05618o6475O30922M7125P43710N35535j4925o17316q77804
6574c20019n59736J79587N453k69998j66827q3769Q54023l05988K85472L81438
6564c64M57169k20124m87315L8249O19626O47493M39320p34737k70318n19359
6554c0360j175752n5648J322041O37542j02983j990139o38540j97870Q3315J181684
6544i66710J06988J22025l7716q11808l75957m82465k90088M28311M95002N10673
6534a301745j64693Q57598N38093j708053n78310J011774O54678M22761j56508
$$ y = [-326229, -336106, -1097357, -863633, -264745, -114828, -1080402, -1633766, -1474946, -1153001, -276868, -111777, 471960, 906723, 638585, 178665, 688604, 785279, 469465, 611969, -386125, -295173, -700791, -767266, -136344, -89219, 654491, 1190026, 1175101, 557785, -320019, -879755, -700168, -694715, -964713, -1131540, -1215309, -361286, -667274, -381802, -364, 456805, 236681, -250634, -212385, 407241, 1054734, 1494054, 759317, 488999, -30360, -1206112, -1261760, 60281, 697823, 594840, -1395299, -2033839, -2231709, -2148394, -966710, -859722, -737697, -775413, -1587221, -1963178, -2445643, -2735731, -2307420, -1812418, -1301745, -1466438, -608840, -70747, -1778800, -2357110, -1345336, -690658, -267897, -424405]
6525d24405j36810K51111Q8412K95587M76553k16764M53229k38048o23637M94248
6515D19476n5658n157J73718L60639m24215j069856r73743N1796k06710J93932
6505a535778J526355J208903J005960o04279j128975n03297J8780l41763m06951
6496g61045m3915P92245L78043o03864l92401Q46956L0129K07626l11910L53306
6486D95170J023340M69348j812571O4878P87437n77238j566703o73115M57275
6477a332179j66604O37444L74943O80548O59463R0832j282743o05487M03569p1253
6467f11467o23208j26108J13120m17960M03826K0312p38289M93104J530914K50664
6457B94908j23466q4096j70978j052882o51592l2714K664J303496N84876N54235
$$ y = [-424405, -561215, -310104, -221692, 73895, 550448, 333684, 786913, 548865, -74772, 419476, 363818, 358661, 532379, 893018, 468803, -601053, -1574796, -1523000, -1729710, -1535778, -9423, 1199480, 2205440, 1601161, 472186, -31111, -12331, -354094, -761045, -804960, -12715, 365328, -238536, -630937, 216019, 246148, 453774, 141864, 495170, 1518510, 1987858, 175287, 240165, 1027602, 450364, -1116339, -1789454, -1332179, -1498783, -861339, -486396, 194152, 853615, 944447, -338296, -943783, -540214, -611467, -1234675, -1360783, -1247663, -1665623, -1261797, -1241485, -1979774, -1486670, 44244, 294908, 171442, 87346, -83632, -1136514, -1788106, -1820820, -1818156, -514660, 70216, 624451]
6447F24451p25781J03889l28494j051505K00770J135825J33264L08944L40717
6438G42080j51782n27505m33959l46607j13764J58907J10930N97370m88128o8907
6428e21365N41545P04612O77544k05548r29646p94546k77293j68276l25817P37002
6418e61788K9866j60097P29964O50119q98672r4609L94353r27327l55011m77292
6408a670494M42637N80195M98409M8449K28774o79397P01804N99056j094136L56545
6398A1842O31270o80617n79805q7828k23575L88852P94388p86074m93361k87951
6388a312859P01030N46252M90330q01336J87732Q37393n21095m25252q1986Q9423
6378b90368n76694n22277P57539p57244L79809R89318O9648n89535K79247R95216
$$ y = [624451, -101330, 2559, -325935, -1377440, -1176670, -40845, 92419, 401363, 742080, 590298, 62793, -371166, -717773, -831537, -672630, -561700, 35670, -452458, -521365, 20180, 724792, 1402336, 1196788, 267142, -527404, -804697, -972973, -1298790, -561788, -531922, -692019, 37945, 688064, -210608, -305217, 89136, -838191, -1193202, -1670494, -1227857, -647662, -149253, -100804, 127970, -551427, 150377, 749433, -344703, 11842, 643112, -37505, -617310, -705138, -928713, -539861, 254527, -531547, -1024908, -1312859, -611829, -65577, 424753, -376583, -188851, 648542, 127447, -297805, -379791, -290368, -867062, -1389339, -631800, -1389044, -1009235, -19917, 49731, -539804, -260557, 734659]
6368G34659M73445q13225l8132N65905R3355r81449l72891L93402N34079j50525
6358D38623r12576o12952M85989j62759J87197m23801m71058L09955L05673O82301
6348a73408l03283M33897Q45508j45893k74033m49455J29100Q26795J23587r11606
6338A01209n00270J67463Q32053k59254K6251J5297p65425J4139N30497O80390
6328H42350k77840o1580O78631P4355m81559q68899o47257p54617j19222l47431
6318a963069Q41381K64348K95324O24913j060030l84952J003685J024629o65792
6309a9563j072135j515242J064343J528679P28868k56618m47305J08429Q07008
6300I26464O32090K8141r22461J80231m87773o90617r19705J95688n78051N57878
$$ y = [734659, 1208104, 394879, 356747, 922652, 1016007, 34558, -338333, 55069, 589148, 438623, -473953, -1086905, -600916, -763675, -576478, -1000279, -1471337, -1161382, -855709, -173408, -476691, -42794, 802714, 656821, 382788, -66667, 62433, 889228, 1012815, 101209, -399061, -231598, 600455, 341201, 367452, 382749, -382676, -368537, 161960, 842350, 564510, 502930, 1181561, 1255916, 774357, -94542, -741799, -1496416, -1615638, -1963069, -1121688, -857340, -562016, 62897, -997133, -1382085, -378400, 646229, -19563, -1091698, -2606940, -1542597, -13918, 714950, 458332, 11027, 119456, 926464, 1558554, 1586695, 664234, 844465, 356692, -333925, -1253630, -1057942, -1635993, -1078115]
6290a078115N65683n63686n39660R33898O50513k24654k58074Q65335K88786k67451
6280C72575k37275n52257R8007k767J086568K57241n38290n47308J9447l40629
6270c84688k74372M85951J71652O37469N55146m03037j087598n08490k83275M05796
6260f85446l42454l3207R80021R52760N65349m85386n82245n34811K3487P09692
6250E67760K18971q3620K15067k77278L36165l14775l23915J21532j075573l21958
6240i37624J54536N83268p96168j91060P88074L63475M25807N99711l58625r87335
6230c55941K7943J38307P6627o35639k65681O16462J010808L54493j92092R17007
6220A692294N34369j092833j725071l79887Q9996n14813m90963Q53324J114794
$$ y = [-1078115, -512432, -1076118, -1615778, -681880, -31367, -256021, -514095, 351240, 640026, 372575, 135300, -416957, -318950, -321717, 764851, 1022092, 483802, -63506, -44059, -384688, -659060, -173109, -1457, 636012, 1191158, 788121, -299477, -807967, -1091242, -685446, -1027900, -1061107, -81086, 871674, 1437023, 951637, 369392, -165419, -141932, 567760, 786731, 703111, 918178, 640900, 977065, 662290, 338375, 459907, -615666, -937624, -783088, -199820, -995988, -1187048, -398974, -35499, 390308, 990019, 631394, -355941, -327998, -189691, -113064, -748703, -1014384, -397922, 612886, 967379, 775287, 1692294, 2226663, 1133830, -591241, -971128, -881132, -1395945, -1886908, -1033584, 81210]
6211H1210M12845N22270o95001L05934N97622j29451J05657n35015q5657q2476
6201D97938L30347k7705m54337l40090k15178J2772N99331L23643n23857J09512
6191C12376M83295q10011M09051k65982K55689p94146l14216K9105O81632J29680
6181A16473r23549J08168N09797k32930k48431o8644N56857q76651j04016J405
6171a161521J081824n2636j99050O97046j33317J15947m2864J1167m56950k38599
6161c78953o82545m819K48042l46019L32841M88716J49586k69595j09311N41036
6151c1021K8681m93894j77588J90825L2053K24934N16997P5303l45590l1076P67216
6140G56840k75102j260142K90921M80110p44637N0543L22511n35126J9397J176115
$$ y = [81210, 494055, 1016325, 321324, 627258, 1224880, 1095429, 1201086, 666071, 580414, 497938, 828285, 800580, 346243, 6153, -209025, -196253, 403078, 726721, 202864, 312376, 795671, -14340, 394711, 128729, 384418, -409728, -723944, -694839, -13207, 116473, -807076, -698908, -189111, -422041, -670472, -739116, -182259, -1058910, -1162926, -1161521, -79697, -132333, -331383, 365663, 232346, 348293, 305429, 316596, -140354, -378953, -1061498, -1066317, -818275, -1164294, -831453, -342737, -193151, -462746, -572057, -31021, -2340, -496234, -673822, -482997, -450944, -226010, 290987, 366290, 20700, -10376, 756840, 481738, -778404, -487483, -7373, -752010, -701467, -378956, -914082, -894685, 281430]
6130B81430j35131k9925l26256K4487p16687l61993Q58503N18836m66703L83887
6120C0448p2423j49781j232011j15081L56057J94027K1279k70716J479769J052432
6110A294000O36688q61545o33823N4025n55993l75272m30801N65501j22012K89815
6100a39417L2257N6738m28877M3553o54815j63386l92492P32128m00520L33393
6090i81438j54889j37068R42143O64931j8925p44409k54040O22546p5911n77408
6080g14468k12721p3440K32075k88768K14275P59543O15123m99676N18008L70939
6070I20890r60152l98870q82232p06053P55080J731724o69228k49266q8629o75133
6060a221869K10132j36349J81858L12486R93506J65827k19328m58186l35935k02384
$$ y = [281430, 146299, 116374, -209882, -185395, -902082, -1264075, -405572, 113264, -353439, 30448, -41975, -191756, -1423767, -1538848, -1182791, -988764, -967485, -1238201, 241568, 1294000, 1930688, 1069143, 435320, 489345, -66648, -441920, -872721, -307220, -429232, -139417, -107160, -50422, -479299, -435746, -1090561, -1253947, -1646439, -914311, -1314831, -981438, -1136327, -1273395, -331252, 333679, 314754, -429655, -683695, -61149, -137060, -714468, -927189, -1000629, -768554, -1057322, -843047, -83504, 531619, 31943, 549951, 920890, -39262, -438132, -1320364, -2026417, -1271337, 460387, -208841, -458107, -546736, -1221869, -1011737, -1148086, -966228, -653742, 339764, 505591, 286263, -171923, -507858, -710242]
6050g10242L56137l0594o83398M58358K17581o34770N96061J909511m72J27796
6040A605968l49378n25517j012745N57737j5944J22855K41045K81296l89119J95011
6030G11209Q6553p63599l38577k84533p95596P11285P0390M35501J92934J68575
6020A94142k02116M86282O13173m91995n77880o48860M24286o66123p0559j92367
6010a132017K65817O65966J17074K75034R02581j06953l55071j74782O72219o69204
6000D60664l34126L65391q35036K60512L88011K71952o11038p2858N05622m67102
5990f8008l74244m6959L39616k30822m66277m73460m60748k52898l40780L76141
5980a998439J016694J171286j65429l3299o97149j11514l47349L72689J63534
$$ y = [-710242, -354105, -384699, -1068097, -609739, -392158, -1026928, -430867, 1478644, 1478172, 1605968, 1256590, 731073, -281672, 276065, 260121, 382976, 624021, 905317, 516198, 711209, 797762, 34163, -304414, -588947, -1384543, -673258, -602868, -167367, 25567, 194142, -7974, 478308, 1091481, 599486, 21606, -627254, -202968, -869091, -939650, -1132017, -866200, -200234, -83160, 191874, 1094455, 987502, 632431, 457649, 1129868, 460664, 126538, 491929, -343107, -82595, 305416, 577368, -33670, -106528, 399094, -68008, -442252, -489211, -149595, -380417, -846694, -1320154, -1780902, -2033800, -2374580, -1998439, -981745, 189541, 24112, -9187, -706336, -817850, -1165199, -792510, -628976]
5971f28976M8426l84631m79270k95938J92746O45079m21046q71530L97791N97224
5961a200125j37992N69913Q94275L84854Q12839P5723q01707M1037L69752o30974
5951C77595k38300M93108l46138L29742M64552K20594n18094q72839O71909J122390
5941A704519k64620o17859q9444K91248j17478n71283N47014o76624j45278O86992
5931G47187M63202l62146p75996r02385j75166L74524P02976L89525m48786o99347
5921f86412J37309J49559p07084J415837O26982j077144p78967q6149M82465O58798
5911A35194M6346j51935N14193p5014l03026J90335m10308L38702J051888n36135
5901H00240p90515J18966L19877m30317q37021k27893L27290k48377J76669Q30175
$$ y = [-628976, -580550, -965181, -1444451, -1740389, -1547643, -902564, -1323610, -2195140, -1797349, -1200125, -1338117, -768204, 126071, 510925, 1323764, 1399487, 597780, 638817, 1008569, 377595, 139295, 632403, 286265, 616007, 1080559, 1301153, 783059, -89780, 582129, 1704519, 1439899, 822040, 732596, 1023844, 906366, 335083, 882097, 205473, 60195, 747187, 1210389, 848243, 72247, -830138, -1005304, -630780, 72196, 461721, 12935, -686412, -549103, -399544, -1106628, 309209, 936191, -140953, -919920, -1006069, -523604, 135194, 181540, 29605, 543798, 468784, 165758, 356093, -54215, 284487, 1336375, 800240, 9725, 128691, 448568, 18251, -818770, -1046663, -719373, -967750, -791081, 39094]
5891C9094N34381J45971p14307l76542K09884k8582j261191m59891K19347L32730
5881a359106P10972k69421N92301Q44233L53097j58282o11667k69375p13497J87550
5871f93195p7916O88408Q27590l23502j93310L41338m12304m88331n63023K84267
5861f09978L03963p4747K4309q04511p1210J308762L17541j24319l9884j30931
5851I8995m53285L19118M06766j84641j98601j180757q1487O63839J10192L61350
5841a38511N75047j1478P84328j9289p06506o12347n47638k37396K0084N17138
5831c76568P64958l79973k32820n77361P39041L67008l68462r70860L1892J58931
5821h44214N61577n16880p70695l2036Q48229j5321K72668k82402l46870L86159
$$ y = [39094, 573475, 719446, 5139, -371403, -161519, -190101, -1451292, -1911183, -1691836, -1359106, -648134, -917555, -325254, 518979, 872076, 713794, 102127, -167248, -880745, -693195, -771111, -82703, 744887, 421385, 228075, 569413, 157109, -331222, -894245, -609978, -306015, -380762, -356453, -1160964, -1232174, 76588, 394129, 269810, 229926, 98995, -354290, -35172, 371594, 186953, -11648, -1192405, -1273892, -610053, -499861, -138511, 436536, 425058, 1209386, 1190097, 483591, -128756, -676394, -913790, -893706, -376568, 388390, 8417, -224403, -801764, -62723, 304285, -64177, -1035037, -1003145, -844214, -282637, -799517, -1570212, -1602248, -754019, -769340, -496672, -779074, -1125944, -739785]
5811g39785l53659l4543m17391o29259J488031J055418o45540n74570M56851q5500
5801d79947K39863J13679k56260J20668k21720Q35333P30552P94633q18294r00318
5791A58189j55448L37892N05125O18308l98215o26157j023140j81201K1812L35500
5781d07335N16806Q9029n16707n85559J20734M74165M66653j97009L24968P90922
5771A076667o20450r22339m82124R84057M51965o9812l84071j59237J097819N45708
5761A518183q80091k04914L54998l06074p8728K8409P35544P68195j36947j50965
5751A647610J63783K57702o04395n91653K10853l93776m54073N61877l83007l49381
5741F5540l18944J281736L65424o11j4155K61531J81013k87076p97046r05740
$$ y = [-739785, -1093444, -1127987, -1545378, -2174637, -686606, 368812, -276728, -851298, -394447, -479947, -240084, -126405, -382665, -261997, -483717, 351616, 1082168, 1876801, 1058507, 158189, 2741, 340633, 845758, 1464066, 1065851, 439694, -583446, -764647, -742835, -407335, 109471, 198500, -318207, -903766, -783032, -308867, 157786, -39223, 285745, 1076667, 456217, -466122, -948246, 35811, 487776, 417964, 33893, -125344, 972475, 1518183, 638092, 433178, 788176, 482102, 403374, 431783, 1167327, 1935522, 1798575, 1647610, 1811393, 2069095, 1464700, 873047, 1083900, 690124, 236051, 797928, 414921, 65540, -253404, 1028332, 1393756, 1393145, 1378990, 1640521, 1821534, 1534458, 737412, -168328]
5731a68328K56340R42505l66788o7883j172718n84487N32272M44858J165379k64847
5721G16303n5065O26470O22812l25693p04916J43549M45834o6998j034845p3415
5711B94036P94397M1792p42099j497934p34997N60465Q13304J228415M50485o05583
5701F02281o32255O58452q31550r67276l19140M95938J379336O73456r87151m45272
5691c73181O06122O04618k93572n71436K2419r33351J71768M28483l49405r44760
5681a632295K04922J95735n8986L51105R91806N81816j79926l86817j37581L12836
5671B42615L85741r5696o19196o19773l68710Q56723P20969p67505m97664O69128
5661i3368N8984j122183p49102J12292P39655O62303K77448O3407L54434l87089
$$ y = [-168328, 88012, 1030517, 663729, 595846, -576872, -1161359, -629087, -184229, 981150, 716303, 661238, 1287708, 1910520, 1584827, 879911, 1023460, 1469294, 1402296, 367451, 294036, 1088433, 1130225, 388126, -1109808, -1844805, -1284340, -471036, 757379, 1207864, 602281, -29974, 628478, -203072, -1170348, -1489488, -993550, 385786, 1059242, 72091, -373181, 232941, 837559, 543987, -27449, -5030, -938381, -766613, -338130, -687535, -1632295, -1427373, -1231638, -1290624, -939519, 52287, 634103, 454177, 67360, -70221, 242615, 628356, 532660, -86536, -706309, -1075019, -218296, 502673, -264832, -762496, -93368, -34384, -1156567, -1905669, -1793377, -1053722, -391419, -113971, -50564, 303870, -83219]
5651h3219l826o37497J000915o4328q62606M41481K44460K75195M34644j16526
5641F28693n61130L25742J156306m73309m85802P9508o53047m94100K43325N27307
5631B93493k3938N17847o57714j94063O62039K39537J97316j24809k90803r8955
5621E19950m49180q13863k88435R2321J50132M3759j65419m37465M07805P98862
5611a41533J08617m35983n20662j16125m26937o6412M23074P01835k9162M74879
5601b8409M07574n11468m31670m30080p7353L4063k21771K66848J526211O07176
5591A141121L58815P40387m89792j849538j198845O0981R41631l2197O5006J9282
5581b43149J070345M78946o40762r6319j430847n12203N9206M54264O95196l85536
$$ y = [-83219, -87045, -724542, 276373, 212045, -650561, -209080, 35380, 310575, 745219, 628693, 67563, 393305, 1549611, 1076302, 590500, 670008, 16961, -477139, -233814, 293493, 269555, 787402, 129688, -64375, 597664, 837201, 1034517, 909708, 618905, 519950, 70770, -743093, -1031528, -939207, -789075, -745316, -910735, -1348200, -940395, -141533, -32916, -468899, -989561, -1105686, -1532623, -1599035, -1175961, -474126, -503288, -28409, 379165, -132303, -563973, -994053, -1071406, -1037343, -1259114, -992266, 533945, 1141121, 1499936, 2240323, 1750531, -99007, -1297852, -1236871, -295240, -327437, -262431, -243149, 827196, 1306142, 665380, 569061, -861786, -1373989, -1314783, -860519, -165323, -550859]
5571e50859L0899J073107Q91422K72507l11589j620114j85130N58785k3310K77862
5561D13580O1650o68313k77658J55476m28798M90691L54076l40567l71258N42091
5551f9030J10271N35237k16634p32078k06985N93415L4731m63205J84803L47599
5541A18124l40570j55454L07564n82351l93713N6231J15550R18267m59904l59785
5531g76041j39760m69881L2759n3256N29522n08021J177018R0378k35199o64701
5521a017182O19668Q74825J33946j80635n89225q255J232445o91619j88884M04956
5511E90040N44807k38098l10294J41501J52413q545p17998m90241J42966j013341
5501a206790O29601M76310l2983r42151j3731Q0001J17238J60826O22456O17799
$$ y = [-550859, -519960, 553147, 1444569, 1717076, 1405487, -214627, -399757, 159028, 135718, 413580, 475230, -193083, -470741, -315265, -744063, -253372, 100704, -239863, -611121, -69030, 41241, 576478, 359844, -372234, -579219, 14196, 48927, -414278, -229475, 118124, -222446, -377900, -70336, -652687, -1046400, -990169, -874619, 43648, -416256, -776041, -915801, -1385682, -1352923, -1406179, -876657, -1384678, -207660, -117282, -352481, -1017182, -397514, 477311, 611257, 430622, -158603, -166858, 1065587, 373968, 185084, 590040, 1134847, 896749, 586455, 727956, 880369, 871824, 153826, -336415, -193449, -1206790, -577189, -100879, -133862, -1076013, -1089744, -1009743, -892505, -731679, -109223, 508576]
5491E08576k61391o05185o98138J81644P1488k50235J79720R50603R55783o70842
5481C62023K38816J33494J36185j95526p94445N45590O58161P79739L33870q67752
5471A330155o73308J29113o13092p88905R29863o65495r15954K53017J122311
5462A07705N84879L48109k66766M1304M70264l73846j096666K83889l1212m6538
5452B1122J98625J25389L76402l70561L5329M70381K87869m17161p61026m32890
5442d66521J25548P2566O02033k60628K3340l74919p30042J048698J12680j446957
5432a294202p59076L52918J565469O37375q97198r92238O38761L78581j333612
5423a703222J04472O60856O00214n8711o28743O49730J21234J76077o26916l89148
$$ y = [508576, 247185, -358000, -1056138, -874494, -803006, -1053241, -873521, 77082, 1032865, 362023, 600839, 734333, 870518, 674992, -119453, 426137, 1084298, 1864037, 2197907, 1330155, 656847, 785960, 172868, -616037, 313826, -351669, -1267623, -1014606, 107705, 692584, 1040693, 773927, 815231, 1285495, 911649, -185017, 98872, 67660, 21122, 219747, 345136, 721538, 350977, 386306, 856687, 1144556, 727395, -33631, -466521, -340973, -268407, 333626, 72998, 96338, -278581, -1008623, 40075, 152755, -1294202, -2053278, -1700360, -134891, 502484, -394714, -1386952, -748191, -369610, -1703222, -1598750, -937894, -337680, -396391, -1025134, -375404, -254170, -78093, -705009, -1094157]
5413a094157m73844N29456K08627J257560l35936n50297M06921K67092P39837
5404I55259j95871l69924L56155M72248m57733j096144o46773j162172P66833
5395a378122J062762N31407j03022M35250P56229j98146R3984m93551o49304N15380
5385E72867R31654O12575o36638j03669O16951j416428m84142J66528O08767L14261
5375A182726p2706q8792q21060j210146k42871L73940J298844J255604k7532j152599
5365D95408K06743P07190l32541K53766l4676j8624Q7506q553m92213P8393o17681
5354C24718l25088J80871j96755j075804j17098Q2091m2838K37446L31505K98257
5344c02695P12944J77499N56084j63608l45627K85344l03695k79152k08001M3752
$$ y = [-1094157, -1568001, -1038545, -829918, 427642, 91706, -458591, -51670, 215422, 955259, 759388, 389464, 745619, 1217867, 760134, -336010, -982783, -2144955, -1378122, -315360, 216047, 113025, 548275, 1304504, 1106358, 1200342, 706791, 57487, 572867, 1504521, 2117096, 1480458, 1376789, 1993740, 577312, 93170, 259698, 868465, 1182726, 1110020, 1021228, 200168, -1009978, -1252849, -878909, 419935, 1675539, 1648007, 495408, 702151, 1409341, 1076800, 1330566, 1295890, 1277266, 1364772, 1356219, 864006, 942399, 324718, -370, 180501, -16254, -1092058, -1209156, -1127065, -1169903, -932457, -600952, -302695, 410249, 587748, 1143832, 980224, 634597, 919941, 616246, 337094, 129093, 172845]
5334A72845O62803k0871n98032p97565N40114O14600K62263p5770O10981o1806
5324A309562L60922j111008j67992R64391l67255l35172L26668J103535k03064
5315A880587j644240r46299K25368j636k37056J71700O26029J66814o18589q72715
5305a250037P5435J96744N36093J75845K92285K33666Q19093K22273p71657k68580
5295B61160N39062N05045R6725o4205J35127K28767j602803n89068j2695L0767
5285d72118J257399q2491L26878N74402j72273j011283j107360j1298O21375J9993
5275e6776m03180O42231n39791l17530O35710K46128O7413N31960l10502k97138
5265A98525Q24314m49579k63431J93138q9343M32081p39272P1021j83100R2182
$$ y = [172845, 835648, 814777, 216745, -580820, -40706, 573894, 836157, 760387, 1371368, 1309562, 1670484, 559476, 391484, 1355875, 988620, 653448, 980116, 2083651, 1880587, 236347, -709952, -484584, -486220, -723276, -551576, 74453, 241267, -377322, -1250037, -1174602, -977858, -441765, -265920, 26365, 260031, 1079124, 1301397, 529740, 261160, 800222, 1305267, 1401992, 1337787, 1472914, 1701681, 98878, -490190, -502885, -472118, 785281, 702790, 1029668, 1604070, 1431797, 420514, -686846, -698144, -76769, -56776, -459956, 182275, -357516, -675046, -39336, 206792, 274205, 806165, 495663, 198525, 1022839, 573260, 309829, 502967, 413624, 845705, 106433, 177454, -5646, 86536]
5255H6536K14652j25899N89203L23037l45680k08594R3499L74198K41839r74617
5245B68174k61682j89167l65508M38436L17368l69657q22267q6622J63532L05029
5235f02364N86858J178678J174639l26099r49421j80299j084035l78557P06564
5226A25964q13114j90262l47979k02305O5861N92217J210386J255223k29143p66694
5216G00154K42455M89087R98734o57253q33239Q80787j02356k65876j275761l09846
5206a33114r28784n16427k06222n15864Q70764Q18367K71676N36387O0911k14449
5196D3245J60513P96774K32019m95547J85800j11210p62104j71419k71569m43785
5186h37283J1539o76532q3294J39078J50242m795J147821Q70034j13432J31100
$$ y = [86536, 301188, 175289, 764492, 1087529, 741849, 533255, 626754, 1000952, 1242791, 268174, 6492, -182675, -548183, -109747, 207621, -162036, -984303, -1070925, -907393, -602364, -15506, 1163172, 2337811, 2011712, 1062291, 881992, -202043, -580600, 125964, -687150, -877412, -1225391, -1427696, -1361835, -769618, 440768, 1695991, 1466848, 700154, 942609, 1431696, 2430430, 1773177, 939938, 1820725, 1718369, 1452493, 176732, -133114, -1061898, -1578325, -1784547, -2300411, -1429647, -611280, -339604, 196783, 257694, 43245, 203758, 1000532, 1232551, 737004, 922804, 811594, 49490, -121929, -393498, -837283, -825744, -1502276, -1585570, -1446492, -1296250, -1301045, -153224, 716810, 603378, 734478]
5176G34478r17388N91521O51016n84385o25052m29031L49872K16975k13181O83048
5166D57873J80982p25147j198469O26852O12872L05124p37165P49263O61091J04568
5156A037844J98516n93219k26805l21386L5472O42002J22166j52429J278792l10209
5146A710744n02577j67278M62969L51785m67678j514110j91681j92047m35906
5137i45779r6038j00333R43374n0543j04024q16712K17347j27004j0945l89625
5127a480282J22337j24272K53223l88966J26343K72534J44915O40116j35363m1203
5117f10618J93078q58011K19341K95455L00694j96060q92776K85530k83739m21094
5107a968200M37266P92116n58048k70861P32388O51645J87860o45801l70121L04102
$$ y = [734478, -182910, 408611, 1059627, 475242, -149810, -578841, -228969, -11994, -225175, 457873, 638855, -86292, -1284761, -657909, -45037, 260087, -477078, 272185, 933276, 1037844, 1236360, 643141, 416336, 94950, 130422, 772424, 894590, 742161, 2020953, 1710744, 1208167, 1040889, 1503858, 1855643, 1387965, -126145, -317826, -509873, -945779, -1041817, -1142150, -198776, -249319, -353343, -1170055, -952708, -1079712, -1090657, -1480282, -1357945, -1482217, -1228994, -1617960, -1491617, -1219083, -1074168, -434052, -569415, -610618, -417540, -1275551, -1056210, -760755, -460061, -656121, -1548897, -1263367, -1547106, -1968200, -1530934, -738818, -1296866, -1567727, -835339, -183694, 4166, -641635, -1011756, -707654]
5097g07654L73395j60006L63468j98726m94716l96879m51094J84903N99419N32757
5087c55133K68058l02449M4234L44579o71123Q72265l91219k43476J064845L05686
5077I36267l28946l27242l62173J1342q5735M49847j27710M32558l36411k74776
5067a2979J088750M20310o97791O39883j80394l62557r2179K86327q03738P2455
5057C58087L25641l11966k35395j47771l09294K88310n75463K37412M88191Q58800
5047I76552j01736n63136k62987Q35089n25818q9128L083N81351J47725j252695
5037b51700n71452N91745M15497j8459N54687N87797j72493n39894J69854K27780
5027I93362K35563l21317n11548k0123m57286j36020k08878L54373K03906m90569
$$ y = [-707654, -334259, -494265, -130797, -329523, -824239, -1221118, -1672212, -1487309, -887890, -355133, -87075, -389524, -345290, -711, -671834, 200431, -190788, -434264, 630581, 936267, 607321, 280079, -82094, -70752, -156487, 293360, 165650, 598208, 261797, -12979, 1075771, 1496081, 798290, 1438173, 1257779, 895222, 803043, 1089370, 285632, 358087, 683728, 371762, 136367, -11404, -320698, -32388, -607851, -370439, 117752, 976552, 874816, 311680, 48693, 883782, 357964, 268836, 271919, 853270, 1000995, -251700, -823152, -231407, 184090, 165631, 720318, 1308115, 1135622, 595728, 765582, 993362, 1228925, 907608, 396060, 375937, -81349, -217369, -426247, -71874, 132032, -358537]
5017c58537n67330L83934J064504j66989r60602j8773r2091P6040L5959k80576
5007h84461Q96916M95167p2305j208310N87355p1840R337O26343P07465j20150
4997I65517j31896n58823k18900K85367N94479k02205q05543N11585O87436J16354
4987A243371o99632j26630M22249P76096O68848j9011l50588o37365o91604P4818
4977F60552O96913Q40146j290023K2336l09134L31984m35169n71149J53419J14226
4967B14101n04960J89355k78669m14534q1602j15058n9305J187541M22771r47095
4957c87455o65944n03937R7473M34349k12284J146310M26387p85009j636381k33119
4947b319610J45752Q57836R80906R7999m64300P09733L06980N9056R33953m58767
$$ y = [-358537, -925867, -541933, 522571, 355582, -605020, -623793, -715884, -639844, -603885, -884461, 12455, 507622, 435317, -772993, -185638, -257478, -248141, 378202, 1085667, 965517, 833621, 274798, 55898, 341265, 935744, 733539, -72004, 439581, 1127017, 1243371, 543739, 417109, 839358, 1615454, 2284302, 2265291, 1914703, 1277338, 585734, 660552, 1357465, 2197611, 907588, 929924, 620790, 952774, 517605, -53544, 99875, 214101, -290859, -101504, -380173, -794707, -876309, -991367, -1050672, 136869, 559640, -387455, -1053399, -1557336, -1459863, -1025514, -1237798, -91488, 334899, -450110, -2086491, -2319610, -2173858, -1316022, -335116, -237117, -701417, 8316, 315296, 374352, 1308305, 849538]
4937H49538K1576n61490q29692P78509O08309J90542k32177k73782J49293N3499
4927G54125n45111N89923M71493K33383M6988J87008m37950r2739p13390m96258
4917b528j054552K04211J76219O30491K12787l3081M18523l92277M65475N61661
4907A186929Q346M63259m5526p32563l08932L6670l51943m18221p05699J03653
4897g64027m01785L66254J137831m40368j26505M54995m92700r760R37422p81813
4887a20456j118615j6305N08250K14890R1544Q27727O86829n12319l37420N59649
4877G83774j351884O86100N84773n61545L27680K80450j1608Q6744k65312q71952
4867c12780L62738l55708p46917M25263O46886M84703n51320p52157l83422N97673
$$ y = [849538, 871114, 309624, -520068, 258441, 866750, 1057292, 825115, 551333, 700626, 754125, 209014, 798937, 1270430, 1503813, 1550801, 1737809, 1299859, 1207120, 493730, -2528, -1057080, -852869, -676650, -46159, 166628, 133547, 552070, 159793, 625268, 1186929, 1195275, 1658534, 1613008, 880445, 571513, 608183, 256240, -161981, -867680, -764027, -1165812, -799558, 338273, -102095, -228600, 226395, -266305, -276065, 661357, -120456, -1239071, -1255376, -747126, -532236, -440692, 387035, 1073864, 561545, 224125, 783774, -568110, 117990, 702763, 141218, 468898, 749348, 737740, 824484, 559172, -312780, 49958, -305750, -1052667, -627404, 19482, 504185, -47135, -799292, -1182714, -585041]
4857e85041Q57307k28598L55207j22184k77126K21514Q53370M17110j9422l00687
4847A171450j43093M54591l97360p28866m7953q14428o4898K05592p7666l0065
4837d72696K73272k57921R32112m52669q56142L49478m13185o45243M47820M34172
4827f61002P65843K81678J345552p65013k79587o65947k57609j52783J65827M69659
4817B46618k53226n58888O93268O91934r03654p99155O10294J29151M38879m38815
4807a43594m41164M56689K24020l65477j36103J38660l33212L36951J95306l95470
4797d63394j18493o28192M006j59782k4578q8388J429035M46813J18471m63067
4787E2431n88375P90597N24484L13585o70673q62102m62323K99595O98522j25660
$$ y = [-585041, 272266, 43668, 398875, 276691, -435, 221079, 1074449, 1491559, 1472137, 1171450, 1028357, 1482948, 1085588, 356722, 308769, -505659, -570557, -364965, -442631, -472696, -199424, -457345, 474767, 22098, -834044, -484566, -897751, -1542994, -1095174, -661002, 104841, 386519, 1732071, 967058, 687471, 21524, -236085, -388868, -223041, 246618, -6608, -565496, 127772, 819706, -83948, -883103, -272809, -143658, 295221, -143594, -584758, -128069, 95951, -269526, -405629, -266969, -600181, -263230, -67924, -463394, -581887, -1210079, -1206073, -1365855, -1390433, -1478821, -49786, 397027, 515498, 52431, -535944, 254653, 779137, 1092722, 422049, -440053, -902376, -602781, 95741, -29919]
4777b9919k2258j31563k44707l26367O46701p04067k93308P694j33018L97082
4767h33730L07262K31334O5844j06077j70542J074041J73461j36646q00221j130103
4757a325377P2680R28410O34599j324051q60142j124264J055082J304708P44637
4748A06282O32087P4897J25078k5019l41269L1148n6264n65106r18787O54529
4738b82424N47551n05642J45934O27406K34812l22758J66206L07217m78901L53726
4728G93127M39552n84831q93402j81835p0077K35763K5576L60357j98047k73726
4718c47543k08782O01736P43244m798k01594L31042M47380k21800k58262N2588
4708I33211m9799r03526O2761Q9381M64951J25725l08559K7297l8544M66077k19477
$$ y = [-29919, -52177, -183740, -428447, -754814, -108113, -812180, -1105488, -1097794, -1230812, -833730, -526468, -295134, -229290, -335367, -505909, 568132, 741593, 604947, -195274, -1325377, -1252697, -324287, 310312, -1013739, -1873881, -2998145, -1943063, -638355, 106282, 738369, 813266, 938344, 913325, 572056, 603204, 546940, -18166, -936953, -282424, 265127, -240515, -94581, 532825, 767637, 444879, 611085, 918302, 439401, 793127, 1232679, 647848, -245554, -427389, -497466, -261703, -236127, 124230, -73817, -347543, -556325, 45411, 788655, 783857, 582263, 913305, 1360685, 1138885, 880623, 933211, 883412, -20114, 42647, 132028, 596979, 722704, 414145, 441442, 402898, 868975, 649498]
4697F49498m27642k16544p19485r19271N42169J6286K08278R872N23775J093098
4687G60034N59575k40104n96717O88400J255710m30018j244829l54712q04904
4678d07565q01776L26658O65739K86977P07126j11944l39692P3203K3075N83814
4668A005615N91001l82807j048431J9337R40004l67494j083100o48033L65295
4659f08613Q92355q4260J25727J66225O89133L48355M37422p66673l41684p28155
4649A29832k03011l37392m53065k45043k29333J63819k56312J36677j00336Q28425
4639e65739N62310K73376j35625j91878K08611j63701j42381m04399K08147K64913
4629h6366r6433l59491O85845K85905J62587J22072k47240l39961m84339K85925
$$ y = [649498, 221856, 5312, -714173, -1633444, -1091275, -1074989, -866711, -856839, -333064, 760034, 1319609, 1079505, 482788, 1171188, 2426898, 1996880, 752051, 397339, -407565, -1209341, -882683, -216944, 70033, 777159, 665215, 325523, 398726, 421801, 1005615, 1596616, 1213809, 165378, 184715, 1124719, 757225, -325875, -973908, -608613, 283742, 199482, 325209, 491434, 1180567, 1528922, 1966344, 1199671, 857987, 129832, -73179, -410571, -863636, -1108679, -1338012, -1174193, -1430505, -1293828, -1394164, -565739, -3429, 269947, 134322, -57556, 151055, -12646, -155027, -559426, -351279, -86366, -182799, -542290, 143555, 429460, 592047, 714119, 466879, 126918, -357421, -71496]
4619g1496n472M22275O0537j19130m61401j522663J040016M23021o06222J446093
4609F05558N94586j043081m83001j56650K6289r93777j90125O59193M52269N63892
4599C5153O63753l14686m86214N93476J24010p78095j24724m60813j6579l99037
4589a163756N66558J8551j284887n64510R55628L95427N51124P22579J46261k05596
4579A37379j22989K92206L76094k86192r35886J16577K14528O39665n04434k17809
4569b90861N09761k31289o2553M31068j69766o25641m15933L30663k81959p18959
4559a525469j60284J058995N96320n81398p85210K97537M31829N85607j10085
4550a92158M67403J46767o47285l87794J4978m80991L15968J25113o90047n15555
$$ y = [-71496, -76968, 345307, 405844, 286714, -174687, -1697350, -657334, -234313, -840535, 605558, 1200144, 157063, -325938, -482588, -456299, -1450076, -1640201, -981008, -528739, 35153, 698906, 384220, -101994, 491482, 615492, -162603, -287327, -748140, -764719, -1163756, -597198, -578647, -1863534, -2428044, -1472416, -1076989, -525865, 196714, 342975, 137379, 14390, 306596, 682690, 396498, -539388, -422811, -208283, 431382, -73052, -290861, 218900, -12389, -74942, 356126, 186360, -439281, -855214, -524551, -806510, -1525469, -1685753, -626758, -30438, -611836, -1397046, -1099509, -667680, -82073, -192158, 275245, 422012, -225273, -613067, -598089, -1079080, -763112, -637999, -1328046, -1843601]
4540a843601l96689J618852Q91285K76883L92211o71875r56889K84843n81367
4531i86347o84936k88903N84764O82642O56439P3101k44639j93164k05486j9084
4521f25613M12598N12387l24349K71122L50168j78729m24757J23560R80106O27427
4511A723920o40407n45958l03469q60717l09433O11350N67923L16486Q93026k1514
4501A431207l89711N62002Q93039j415440L13075k2221j476836o253m90304R32108
4491C30666j96109n49106K44138J48481j053760m39541j3357k39468J91866R91259
4481e84931J90605J18065k48549O8653J46690n20420m1045n1676k60039K80748
4471i01899n98256M45330M96304o06043O7906L65402L19775l04018m21804J21983
$$ y = [-1843601, -2240290, -621438, 269847, 546730, 938941, 267066, -689823, -404980, -986347, -1671283, -1960186, -1375422, -692780, -36341, 36760, -207879, -401043, -606529, -625613, -213015, 299372, -24977, 246145, 596313, 417584, -7173, 116387, 1096493, 1723920, 1083513, 537555, 234086, -626631, -936064, -324714, 243209, 559695, 1452721, 1431207, 1041496, 1603498, 2496537, 1081097, 1394172, 1371951, -104885, -111138, -601442, 330666, 134557, -414549, -170411, -21930, -1075690, -1515231, -1528588, -1768056, -1576190, -584931, -394326, -276261, -524810, -456157, -309467, -829887, -870932, -922608, -1182647, -901899, -1500155, -1054825, -558521, -1164564, -1096658, -731256, -411481, -715499, -1137303, -1015320]
4461a015320j92846J16769o1549O43999P65273j037974r03858O00814J334935
4452B50243j12466J424025K00499m46648l6726p45529p38796m63661P12326J48659
4442A91926k99186o96992J89221K11388K48183j85708j7386O49606P32964r64945
4432E9071k49191L89302n26799K36403m1614k78095Q96321N26174j8315q62937
4422A30320j30157j99466P69127K31513p22937q33544K94299L76163P8061L0573
4412B3952o07863j4652k54471p64332l78200L70642N04728K14886K06110J66959
4402e32241l93058L91856j75610N27432P00120J77044n98219l62147r7534N72761
4392B10404L27997m687r78593R05007R31468j124747K20152P36788k31962o8013
$$ y = [-1015320, -1208166, -1091397, -1152946, -508947, 256326, -781648, -1685506, -1084692, 250243, 137777, 1561802, 1762301, 1315653, 1278927, 533398, -205398, -669059, 43267, 191926, -107260, -804252, -615031, -403643, -155460, -341168, -358554, 291052, 1024016, 59071, -190120, 199182, -327617, -91214, -132828, -410923, 485398, 1011572, 993257, 130320, 163, -199303, 569824, 801337, 78400, -755144, -460845, -84682, -6621, 23952, -583911, -598563, -853034, -1617366, -1995566, -1624924, -1120196, -905310, -699200, -532241, -925299, -533443, -709053, -181621, 518499, 695543, 97324, -264823, -362357, 210404, 538401, 533714, -444879, 460128, 1391596, 266849, 487001, 1223789, 991827, 923814]
4382I23814j93477m72267r24481q89098j67483Q9360k13837L24307N15611K7995
4372i79556M13937N71430N48499l14871P40064O23762n61745n04948O1059r65677
4362c68046J5624K95232L72155K10883P27069j28579l92341j012825L96082M06067
4352E21321l23191m70845N80001l41857q40882n11049P13483J382081K89414k32044
$$ y = [923814, 730337, 258070, -666411, -1555509, -1722992, -1633632, -1847469, -1523162, -1007551, -979556, -565619, 5811, 554310, 239439, 979503, 1603265, 1041520, 536572, 597631, -368046, -352422, -57190, 314965, 525848, 1252917, 1124338, 731997, -280828, 115254, 521321, 198130, -272715, 307286, -34571, -875453, -1386502, -673019, 709062, 998476, 766432]
$$ [...]
##END NTUPLES=NMR SPECTRUM
##END=
