##TITLE=Analysis number 321226
Compound Code mo 07460
Project Code adrs
Chemist Name durham
##JCAMPDX= 6.0         $$ Bruker NMR JCAMP-DX V2.0
##DATA TYPE= NMR SPECTRUM
##DATA CLASS= NTUPLES
##ORIGIN= Bruker BioSpin GmbH
##OWNER= nmr
$$ XWIN-NMR		Version 3.5
$$ Mon Jul 31 14:36:27 2006 GMT Daylight Time (UT+1h)  MAYBRIDGE\nmr@NMR_250MHZ
##.OBSERVE FREQUENCY= 250.131544655141
##.OBSERVE NUCLEUS= ^1H
##.ACQUISITION MODE= SIMULTANEOUS (DQD)
##.ACQUISITION SCHEME= undefined
##.AVERAGES= 16
##.DIGITISER RES= 18
##SPECTROMETER/DATA SYSTEM= dpx250
##.PULSE SEQUENCE= zg30
##.SOLVENT NAME= CDCl3
##.SHIFT REFERENCE= (INTERNAL, CDCl3, 0, 16.522)
##AUDIT TRAIL= $$ (NUMBER, WHEN, WHO, WHERE, WHAT)
$$ ##TITLE= Audit trail, XWIN-NMR		Version 3.5
$$ ##JCAMPDX= 5.01
$$ ##ORIGIN= Bruker BioSpin GmbH
$$ ##OWNER= nmr
$$ C:\u/data/dgb/nmr/ADRS/3870/pdata/1/auditp.txt
$$ ##AUDIT TRAIL=  $$ (NUMBER, WHEN, WHO, WHERE, WHAT)
(   1,<2006-07-31 14:35:44.93 +100>,<MAYBRIDGE\nmr>,<NMR_250MHZ>,
      <created by zg, POWCHK disabled, PULCHK disabled
       configuration hash MD5:
       E2 DF 36 D8 04 B2 41 60 5A D7 A3 38 5A 4B D0 FE
       data hash MD5: 64K
       EF 98 04 54 F0 1B 72 01 DB 3E 04 58 E0 0D 92 33>)
(   2,<2006-07-31 14:36:07.73 +100>,<MAYBRIDGE\nmr>,<NMR_250MHZ>,
      <Start of raw data processing
       ef LB = 0.3 FT_mod = 6 PKNL = 1 SI = 32K 
       data hash MD5: 32K
       7B 2E 6E 57 51 75 D6 F2 03 82 64 E7 3D 61 B1 20>)
(   3,<2006-07-31 14:36:10.89 +100>,<MAYBRIDGE\nmr>,<NMR_250MHZ>,
      <apk 
       data hash MD5: 32K
       BB 08 6F A7 96 65 6A 92 68 A8 52 AB F2 74 49 55>)
(   4,<2006-07-31 14:36:12.93 +100>,<MAYBRIDGE\nmr>,<NMR_250MHZ>,
      <abs ABSG = 5 
       data hash MD5: 32K
       E4 C1 E0 20 1E 3B BB 1B FE C0 6B F0 F2 7B F8 81>)
$$ ##END=
$$ 
$$ hash MD5
$$ B2 97 88 0C BC D4 22 0A CA 87 23 D6 1C 8F FD 15
##$RELAX= 
##$RELAX= 
##$RELAX= 
##$RELAX= 
##$RELAX= 
##$RELAX= 
##$RELAX= 
$$ Bruker specific parameters
$$ --------------------------
##$DU= <C:\u>
##$EXPNO= 3870
##$NAME= <ADRS>
##$PROCNO= 1
##$TYPE= <nmr>
##$USER= <dgb>
##$AMP= (0..31)
100 100 100 100 100 100 100 100 100 100 100 100 100 100 100 100 100 100 
100 100 100 100 100 100 100 100 100 100 100 100 100 100 
##$AQSEQ= 0
##$AQ_mod= 3
##$AUNM= <au_zg>
##$AUTOPOS= <52 >
##$BF1= 250.13
##$BF2= 250.13
##$BF3= 250.13
##$BF4= 250.13
##$BF5= 500.13
##$BF6= 500.13
##$BF7= 500.13
##$BF8= 500.13
##$BYTORDA= 1
##$CFDGTYP= 0
##$CFRGTYP= 5
##$CHEMSTR= <none>
##$CNST= (0..31)
1 1 145 1 1 1 1 1 1 1 1 1 1 1 1 1 1 1 1 1 1 1 1 1 1 1 1 1 1 1 1 1 
##$CPDPRG= <>
##$CPDPRG1= <>
##$CPDPRG2= <>
##$CPDPRG3= <>
##$CPDPRG4= <mlev>
##$CPDPRG5= <mlev>
##$CPDPRG6= <mlev>
##$CPDPRG7= <mlev>
##$CPDPRG8= <mlev>
##$CPDPRGB= <>
##$CPDPRGT= <>
##$D= (0..31)
0 1 0 0 0 0 0 0 0 0.06 0 0 0 0 0 0 0.0002 0 0 0 0 0 0 0 0 0 0 0 0 0 0 
0 
##$DATE= 1154352942
##$DBL= (0..7)
120 120 120 120 120 120 120 120 
##$DBP= (0..7)
150 150 150 150 150 150 150 150 
##$DBP07= 0
##$DBPNAM0= <>
##$DBPNAM1= <>
##$DBPNAM2= <>
$$ [...]
##$SUBNAM7= <"">
##$SUBNAM8= <"">
##$SUBNAM9= <"">
##$SW= 20.6930455092707
##$SWIBOX= (0..15)
0 0 3 0 0 0 0 0 0 0 0 0 0 0 0 0 
##$SW_h= 5175.983436853
##$TD= 65536
##$TD0= 1
##$TE= 295.16
##$TE2= 300
##$TE3= 300
##$TEG= 300
##$TL= (0..7)
0 120 120 120 120 120 120 120 
##$TP= (0..7)
150 150 150 150 150 150 150 150 
##$TP07= 0
##$TPNAME0= <>
##$TPNAME1= <>
##$TPNAME2= <>
##$TPNAME3= <>
##$TPNAME4= <>
##$TPNAME5= <>
##$TPNAME6= <>
##$TPNAME7= <>
##$TPOAL= (0..7)
0.5 0.5 0.5 0.5 0.5 0.5 0.5 0.5 
##$TPOFFS= (0..7)
0 0 0 0 0 0 0 0 
##$TUNHIN= 0
##$TUNHOUT= 0
##$TUNXOUT= 0
##$USERA1= <user>
##$USERA2= <user>
##$USERA3= <user>
##$USERA4= <user>
##$USERA5= <user>
##$V9= 5
##$VALIST= <valist>
##$VCLIST= <CCCCCCCCCCCCCCC>
##$VD= 0
##$VDLIST= <DDDDDDDDDDDDDDD>
##$VPLIST= <PPPPPPPPPPPPPPP>
##$VTLIST= <TTTTTTTTTTTTTTT>
##$WBST= 1024
##$WBSW= 4
##$XGAIN= (0..3)
0 0 0 0 
##$XL= 0
##$YL= 0
##$YMAX_a= 394238
##$YMIN_a= -356702
##$ZGOPTNS= <>
##$ZL1= 120
##$ZL2= 120
##$ZL3= 120
##$ZL4= 120
##$ABSF1= 16.522
##$ABSF2= -4.171173
##$ABSG= 5
##$ABSL= 3
##$ALPHA= 0
##$AQORDER= 0
##$ASSFAC= 0
##$ASSFACI= 0
##$ASSFACX= 0
##$ASSWID= 0
##$AUNMP= <proc_1d>
##$AZFE= 0.1
##$AZFW= 0.1
##$BCFW= 0
##$BC_mod= 0
##$BYTORDP= 0
##$COROFFS= 0
##$CY= 12.5
##$DATMOD= 1
##$DC= 0
##$DFILT= <>
##$DTYPP= 0
##$F1P= 14.0000005364418
##$F2P= -0.99999901652339
##$FCOR= 0.5
##$FTSIZE= 32768
##$FT_mod= 6
##$GAMMA= 0
##$GB= 0
##$INTBC= 1
##$INTSCL= 1
##$ISEN= 128
##$LB= 0.3
##$LEV0= 0
##$LPBIN= 0
##$MAXI= 10000
##$MC2= 0
##$MEAN= 0
##$ME_mod= 0
##$MI= 0
##$NCOEF= 0
##$NC_proc= -3
##$NLEV= 6
##$NOISF1= 0
##$NOISF2= 0
##$NSP= 0
##$NTH_PI= 0
##$NZP= 0
##$OFFSET= 16.522
##$PC= 1
##$PHC0= 139.4709
##$PHC1= 10.71203
##$PH_mod= 1
##$PKNL= yes
##$PPARMOD= 0
##$PSCAL= 4
##$PSIGN= 0
##$REVERSE= no
##$SF= 250.13
##$SI= 32768
##$SIGF1= 0
##$SIGF2= 0
##$SINO= 400
##$SIOLD= 32768
##$SREGLST= <1H.CDCl3>
##$SSB= 0
##$STSI= 32768
##$STSR= 0
##$SW_p= 5175.98343685301
##$SYMM= 0
##$S_DEV= 0
##$TDeff= 65536
##$TDoff= 0
##$TI= <Analysis number 999999
Compound Code 99
Book Reference 9
Project Code 9>
##$TILT= no
##$TM1= 0
##$TM2= 0
##$TOPLEV= 0
##$USERP1= <user>
##$USERP2= <user>
##$USERP3= <user>
##$USERP4= <user>
##$USERP5= <user>
##$WDW= 1
##$XDIM= 32768
##$YMAX_p= 399408017
##$YMIN_p= -58103
$$ End of Bruker specific parameters
$$ ---------------------------------
##NTUPLES= NMR SPECTRUM
##VAR_NAME=  FREQUENCY,     SPECTRUM/REAL,   SPECTRUM/IMAG
##SYMBOL=    X,             R,               I
##VAR_TYPE=  INDEPENDENT,   DEPENDENT,       DEPENDENT
##VAR_FORM=  AFFN,          ASDF,            ASDF
##VAR_DIM=   32768,         32768,           32768
##UNITS=     HZ,            ARBITRARY UNITS, ARBITRARY UNITS
##FACTOR=    0.157963299565203, 1,           1
##FIRST=     4132.6476996994, 0,             0
##LAST=      -1043.33573715361, 0,           0
##MIN=       -1043.33573715361, -58103,      0
##MAX=       4132.6476996994, 399408017,     0
$$ Real data points
##PAGE= N=1
##DATA TABLE= (X++(R..R)), XYDATA
$$ [...]
18879 340128 341847 344801 341183 345946 345140 353783 341976 334300 337551 321376 327337 336291 346101 334680
18865 334680 317595 318909 329217 332268 308744 300660 310400 329122 336751 326469 321806 328417 329709
18852 329709 315809 318817 320343 303931 309121 328022 329798 329121 321352 318430 321541 325174 326928 318044
18838 318044 309298 300537 302026 298568 311815 315010 310669 309083 302872 282703 301705 308896 306050
18825 306050 306493 306801 309655 302531 301128 310131 298652 310351 309464 300482 300231 301972 292400 274435
18811 274435 278059 285601 293089 305633 292706 278986 273220 279383 281302 292252 300616 288021 281456
18798 281456 275529 265711 269132 279124 277477 275984 283770 296261 292672 287593 293346 310459 300009
18785 300009 281063 276837 300546 300869 281293 273933 271646 262187 262357 271985 262560 278104 293491
18772 293491 291514 274796 263861 269703 282874 296217 304916 331835 350094 368281 357532 327281
18760 327281 305115 285530 275966 274502 273158 274145 266919 252747 250652 251353 253814 254057 258302 249768
18746 249768 259447 272986 278670 271769 246781 239549 262059 280733 269415 264833 264720 256942 259739
18733 259739 255867 268970 270075 261521 256682 250038 256233 268007 264470 261971 260780 256516 252090 248986
18719 248986 251306 245288 244428 246723 254706 257817 263583 263828 248180 248298 260101 251017 232719 233128
18705 233128 237258 238142 241499 248052 237088 224767 228712 228213 224602 230717 225895 221145 223163 228469
18691 228469 239348 248180 242840 236205 236326 231382 226041 217066 213950 219003 224259 220981 219643 215478
18677 215478 213590 225756 232898 239944 238739 232820 220539 214701 207725 214303 218523 214956 220672 230889
18663 230889 217267 201170 214582 233191 227584 233680 232641 221759 210161 210485 209727 205879 219506
18650 219506 229489 234645 235246 219671 205873 209320 209968 202606 195991 195459 205112 213441 215484 212372
18636 212372 209048 202888 206089 209480 196002 198450 196457 186534 183050 188335 194346 195696 208139 218915
18622 218915 222589 211998 191929 183999 182181 174345 173745 173710 183000 178611 186567 195824 206745 200184
18608 200184 192919 200509 201338 195798 183585 182181 192015 192164 192423 184140 196787 196425 180088 165125
18594 165125 164514 184158 201534 198236 196780 194504 192626 188590 179573 174074 172090 166540 172664 193147
18580 193147 197780 206894 205021 192173 194131 196076 195452 191741 183974 180711 178090 179008 172838 165278
18566 165278 157456 152183 168361 160388 167911 166892 172619 185742 191896 184679 185520 183592 179446 182973
18552 182973 186848 201238 206151 191733 189149 184649 184440 179007 172400 178995 168542 146710 137478
18539 137478 149500 148706 159602 175933 175680 176340 179318 183995 184856 190082 185845 187748 180511 173077
18525 173077 162870 160707 154255 158601 162429 163716 152865 154605 167291 161558 160564 164310 168005 151939
18511 151939 144957 145615 153159 165143 171950 163294 162400 177383 163345 151340 149111 161211 172483
18498 172483 166966 165379 155305 160305 160412 163862 162033 146731 136976 128011 139689 147319 147557 145200
18484 145200 143381 144418 141973 154196 171259 180994 174649 169524 168091 176229 181212 162504 149528
18471 149528 146005 156292 177367 175648 155091 136693 131127 141598 169147 175498 173039 171371 168592
18458 168592 170275 170624 160521 149062 155546 170754 164243 151582 157363 154103 143859 142039 142393
18445 142393 138495 129336 132020 132038 139814 148615 144043 143598 150828 146652 150722 150031 149281 141438 125879
18430 125879 108955 117871 134655 144007 141933 135187 134417 121199 117367 122778 130423 127228 117642 118153
18416 118153 131993 141427 149702 153623 152315 156913 148000 143028 147446 156950 158867 146422 129868
18403 129868 122181 136544 143459 140904 139315 148563 151662 159392 157291 157686 160914 152353 141657 131042
18389 131042 116265 110452 109953 112999 129158 137815 148904 147205 154429 152925 149674 147644 132355
18376 132355 103132 100262 114848 125120 137552 141294 141437 147111 148567 141898 142656 138147 138929 141086
18362 141086 134403 126836 128927 141650 131798 125538 125982 126447 116707 110268 106898 108566 113622 120282
18348 120282 126113 133039 141995 125554 121463 118411 107644 117758 123063 107403 113525 119677 116283
18335 116283 102295 100021 113747 127446 130414 129892 129384 106380 97621 77838 84520 99253 113531
18322 113531 116595 109121 91100 100071 99520 91540 101519 115313 129886 122612 122831 110748 112955 107287
18308 107287 100411 98881 103542 97410 87196 94650 104335 109434 116015 107258 90371 88670 96390 98251
18294 98251 100558 95952 96828 94893 99651 97108 91871 76401 76694 91186 109618 119481 112144 110993
18280 110993 120577 123734 126976 130037 120480 116744 107118 98606 105603 92475 88361 101748 116237
18267 116237 111163 110074 112799 136858 151459 147195 145732 143064 141980 138549 150553 175807 221809
18254 221809 283402 322723 316718 254037 196194 174510 168430 164953 149075 137547 137400 143051 146427
18241 146427 152508 158369 143692 140623 140611 139099 131992 121587 108996 93667 99070 102984 101278 107849
18227 107849 99556 106073 116039 119782 116421 107116 108055 110103 134597 144331 141263 138328 133323 131237
18213 131237 143701 136844 128447 126230 122636 114234 105495 111790 137762 139350 141179 135996 143821 142878
18199 142878 134672 132074 120895 105820 110853 122566 122299 109300 102130 121577 130057 123944 110750
18186 110750 106055 117605 129826 120731 123858 136235 130178 132019 130546 127271 133234 123862 100559
18173 100559 97151 107358 116657 135916 136261 127940 120404 110348 123354 133326 137216 135895 128018
18160 128018 127927 139519 147145 145535 149943 145701 145619 160088 167545 168275 162483 166777 167310 167297 168294 174103
18144 174103 184148 179819 170986 166159 176148 174823 177046 184200 186459 200044 215723 234343 229015
18131 229015 228552 247178 257912 285812 301821 301340 308468 349507 375986 409451 437114 494393
18119 494393 569126 647646 729090 833209 962522 1126522 1371419 1713558 2197368 2944433
18109 2944433 4209079 6545183 10681941 15798207 19077893 18447554 13116496 8349495
18101 8349495 5737864 4316865 3445514 2889302 2519751 2262301 2057180 1865809 1692651
18092 1692651 1557857 1453966 1374238 1298849 1240971 1178387 1112108 1069975 1059363 1046110 1013272
18081 1013272 976097 950948 912012 864132 827879 807535 774634 748170 722051 690106 652941
18070 652941 627755 610238 595757 583549 562054 541966 533069 521861 510469 504784 495032 486133
18058 486133 450379 425857 429228 432033 421092 413421 393592 388777 382886 370924 364914 359647 365410
18045 365410 379849 362501 339021 340274 317874 284769 269313 264441 257159 247750 245030 235822 237313
18032 237313 239386 240841 243681 240547 235354 232524 215724 216462 214627 217946 212398 206919 190606 192971
18018 192971 190742 190420 174518 157231 155191 159024 153826 158019 159387 148289 132246 129428 133008
18005 133008 133359 124948 132792 135386 139741 125996 108624 88429 82884 85979 90342 89656 94188 109647
17991 109647 105714 96461 83257 80616 86421 87342 83945 95094 102080 100385 102654 100377 95328 104302
17977 104302 114013 112815 113100 117468 119301 118215 124966 127012 114842 113725 115989 114508 102036 89484
17963 89484 89440 90775 88720 85070 71827 61038 58551 60299 62938 58098 48770 43392 41073 34351
17949 34351 47688 55700 52307 60741 65069 56828 50072 51478 57025 48456 57772 75786 79469 92075
17935 92075 74419 59363 48066 53464 41861 43301 48176 41464 44190 53323 66616 77339 75277
17922 75277 69644 71681 59958 49098 61406 84028 61293 29901 32201 52956 62625 61925 77721
17909 77721 79985 67075 61865 61903 70302 64858 54213 50438 41281 45574 46600 40923 30514 30738
17895 30738 35274 44136 57563 58437 42211 42092 47811 53313 56265 53789 46562 50281 51023 53273 52374
17880 52374 43107 56237 52497 41519 30367 28852 33716 47471 55262 43602 37831 28488 29274
17867 29274 30203 32881 38430 44704 43978 41637 52444 59583 53659 33801 24653 39340 39323 41517 46357
17852 46357 48853 47331 44481 30162 23970 37037 38347 33768 39159 47924 36940 35964 34710 40296
17838 40296 44572 46326 40347 28690 21732 27624 44315 55116 45048 41571 46447 51675 47812
17825 47812 47388 40901 32183 35971 46104 44295 43134 38913 37453 50903 59216 58883 53710 45095
17811 45095 35767 53331 56760 56186 61122 56321 36291 43281 48187 35931 24498 41112 32271
17798 32271 27637 27045 32579 23931 34103 48105 50431 47667 53619 61462 62395 55308 63734 57217
17784 57217 45373 31090 40995 51533 48141 48908 45008 36676 30093 37389 40337 39745 42074 44213
17770 44213 22529 6082 2687 14113 32085 35701 43479 54066 42990 33124 31878 31676 27300
17757 27300 36737 33047 27015 19236 38778 58226 63440 47998 41629 34938 32657 27142 10332
17744 10332 8826 14278 26742 31474 47897 42501 37862 42542 45335 34847 41529 42200 36458 31684
17730 31684 39925 51914 49900 31113 29113 36031 32316 20202 16078 19868 9104 2068 15166
17717 15166 32213 26165 25758 39415 35510 20087 19155 32888 31320 41109 54607 40728 29614
17704 29614 31592 32700 36954 34679 29712 32238 44889 57652 43994 31452 26396 31770 31114 23288
17690 23288 23313 24887 30678 37439 27965 11218 14592 19596 23200 10510 17250 26658 19611 20165 13658
17675 13658 9009 20596 18011 19365 26972 28816 22224 18356 14758 18750 25302 37141 39143 31269
17661 31269 27058 17905 13338 13760 15567 22995 37186 28788 27172 25619 25894 20200 16151 10559 -2427
17646 -2427 -1031 11452 19955 36179 31416 31902 34202 36966 36238 22902 5719 3482 -2887 2255
17632 2255 9321 14659 -4093 -10954 -8158 -7779 -5486 12062 14061 21768 21947 16342 24627 29190 22077
17617 22077 14083 16353 8843 12523 18165 17354 20705 29692 38337 13574 2327 7817 15497 16341
17603 16341 13141 8529 21918 29201 24820 28670 14207 8700 19098 21102 19578 15188 22190 27144
17589 27144 20255 12143 18297 24202 29385 30104 27616 31470 16802 15374 33662 27501 26744 34743
17575 34743 44053 42693 35563 27187 20521 26400 20954 9549 -9300 4590 21750 20753 1557
17562 1557 -728 19213 28283 16478 18867 18057 10016 17014 25865 28364 20982 9829 2020 15480
17548 15480 16685 19204 23035 26165 35531 26841 21798 18793 4034 5444 5380 6766 4470 7238 17127
17533 17127 24604 15619 13827 18896 30221 38350 30216 10741 8211 24663 31476 26355 13496
17520 13496 19626 24629 13896 4048 11927 19091 19518 19331 23454 25686 11517 10619 2580 3966 -6224
17505 -6224 -1863 819 -2629 8877 9571 14663 10803 5510 4098 9955 14580 2824 -4185 -2334
17491 -2334 -6831 -12578 6766 7230 15137 22699 21038 14203 26153 26987 25888 31687 33631 32652 21349
17476 21349 7674 -1510 5816 10745 11856 -2014 3284 14324 11296 21637 32017 26542 14753
17463 14753 7413 16553 33094 34455 24030 30418 26569 13577 7953 13438 19780 22354 17935 4749
17449 4749 -817 -1190 8481 9743 11305 25645 38088 44991 54957 85241 114505 117984 94711 65586
17435 65586 55547 48267 47062 35527 25027 13516 12977 14564 7553 13507 14280 14000 12372 9555
17421 9555 13408 12252 20979 26902 31501 21968 14236 25295 19764 5572 -1156 5056 8524 17098
17407 17098 27976 18526 16095 18574 33597 32856 19379 14154 14965 23123 18973 8812 14556 22020
17393 22020 18129 31101 37186 32566 21386 15250 14216 11024 14312 15537 12999 3876 3561 -9158
17379 -9158 -9840 -5572 11598 10259 -2122 4591 17952 24228 24481 19754 20569 8131 -2005 -2314
17365 -2314 14593 9657 6179 7780 18547 35369 30398 40351 47571 28017 29629 35589 15809
17352 15809 838 -402 -240 17363 15214 -2388 -7948 -2929 12342 19557 9872 -4757 185
17339 185 18581 20411 16943 8004 -1523 13769 17176 991 8606 20342 17077 3167 11951 3858
17325 3858 1978 5775 3205 6483 13417 1563 3332 6462 17087 19470 15274 25998 15345 8027
17311 8027 365 -6226 318 6115 7733 13062 21843 24373 22784 17953 12060 21994 26579 28333 11594
17296 11594 -11790 -19652 -29047 -32016 -15773 -13924 -10134 4984 11435 1626 2500 772 2107 10489
17282 10489 22177 16381 11783 20192 19587 20189 9730 7038 21807 20525 27973 20640 -3025 -18777
17268 -18777 -6976 -4524 -3039 1866 4887 -7561 -16514 -17532 -5682 6528 7918 11382 20756
17255 20756 22726 29827 30033 19688 5436 4258 14081 7107 4581 1107 -2649 -9558 -8674 -1060
17241 -1060 -2208 6858 17965 9282 11285 10374 -15478 -14703 18324 24142 15262 16739 12346 13051 17968
17226 17968 23735 29496 23528 -1498 -2282 -13861 -8210 3146 -5957 -14579 -8314 3058 5512 10580
17212 10580 465 1027 9996 1329 -6566 -11869 -4987 -1324 -2970 3429 6311 5315 92 410 4633
17197 4633 4831 5371 2974 -8246 -7160 -3410 -6042 -2148 -6094 -2373 2971 11584 26694 32022 19907
17182 19907 9482 -1589 9521 10972 12438 -2119 -7334 -16546 -25349 -20550 -29410 -21119 -12129
17169 -12129 -26778 -23401 -16704 1215 7467 9943 11167 18599 19858 32814 20885 1953 4070
17156 4070 18337 28464 30148 24242 3580 -11750 -8504 -15004 -6113 -1399 1564 -6569 -9179 5683
17142 5683 9232 11418 14741 8726 -4104 -5182 -8231 -964 5238 10683 11333 14502 15882 23847 22846
17127 22846 25165 10110 -3572 -3231 1810 11818 14586 11516 2902 11588 16914 17590 1436 -21965
17113 -21965 -6372 8494 5266 -3407 2480 8653 -10776 -14088 5539 252 145 7926 -2439
17100 -2439 3510 -3859 -1913 1422 5837 9459 -5217 -13357 -3293 2600 -10349 -21336 -23546 -13509
17086 -13509 -16070 -13216 -20992 -33258 -33874 -26415 -17120 -10684 -5159 -7832 -12161 -18888 -15259 -11908
17072 -11908 -9629 -9432 -23224 -38768 -29887 -14687 -2986 1625 10295 12498 8633 4013 -14618
17059 -14618 -24320 -12147 -7575 -8657 -15897 -13030 -7236 -16178 -21533 -18239 -18765 -15499 -18645 -19688
17045 -19688 -13263 -8589 -9345 -7185 -12492 -19607 -18439 -8843 -11224 -8355 -8264 -19559 -34193 -34658 -6421
17030 -6421 2614 4247 -6442 4513 1348 -7950 -20298 -20846 -13477 -12149 -828 3144 2731 14794
17016 14794 12018 -1435 -12211 -11562 7742 8392 11208 19941 30931 13804 8104 1846 4227 -2375
17002 -2375 -3937 3377 17078 21567 20469 22365 23433 18713 1542 8382 10951 5097 6808 1468
16988 1468 -13469 -9634 -886 -4993 2502 2643 -4010 -1959 88 -878 -1725 4268 4427 -96 -5957
16973 -5957 -2590 9378 4047 -1741 362 -966 1161 14809 17999 2088 -5859 -2491 -3304 316
16959 316 -498 -3067 -13471 -15811 -19996 -18570 -16693 -10184 -3933 3092 -1970 317 4682 -2256 -4762
16944 -4762 -14874 -16395 -15986 -24499 -23444 -21783 -19772 -10112 -6221 -22964 -29963 -26706 -28460 -31988
16930 -31988 -28652 -33333 -22861 -5884 2358 -3016 9340 16993 10849 -12157 -36460 -32148 -22658
16917 -22658 -19296 -12455 -9879 1806 -16926 -22267 -22474 -24123 -23050 -11051 6294 -6442 -9209
16904 -9209 -15220 -11501 -2681 11656 15739 11812 -7168 -4686 4044 -7552 -10334 -6714 -2225 9956
16890 9956 13190 -21 -7500 -9339 -18139 10653 16146 739 -2813 -2709 10700 18400 1769 -13459
16876 -13459 -12145 -8484 3035 9147 12746 7470 1452 9102 2915 6541 17851 21525 4237 2258
16862 2258 -4093 -6125 -9283 -30071 -35291 -32084 -27951 -36957 -38230 -27713 -21190 -30800 -24472 -11743
16848 -11743 5861 15153 1954 -4905 -7895 -5728 5303 20965 26362 13605 19655 18718 141
16835 141 -18210 2777 -2726 -14219 -10833 -5995 -7510 -20575 -33638 -26386 -18814 -20991 -14768 -11026
16821 -11026 -16556 -11246 -10934 -21062 -17322 -8445 -10930 -14790 -8466 150 -11339 -14357 -9069 -3806
16807 -3806 -6380 7909 6304 -2862 -16492 -12437 -5890 10996 9536 8592 7319 -1566 -11866 -5392
16793 -5392 -7282 -11068 -11251 -10063 -9012 7247 -551 -22129 -15262 -6140 -13296 -6433 7099 2242
16779 2242 -11506 -29072 -11917 6077 2823 -11218 -7204 4042 1422 630 5205 7477 -4630
16766 -4630 -17276 -16105 -26118 -19363 -12073 -13027 -14529 -4221 3256 656 -4137 -6627 -3603 -588
16752 -588 -2294 -12194 -15073 -18685 -19056 -19029 -6737 -2557 -23277 -32921 -19044 868 3596 -13840
16738 -13840 -16723 -26499 -29131 -18319 -13339 -11173 340 2450 2192 -430 10610 6362 3757 -1870
16724 -1870 7469 3527 -4676 -6117 1025 7268 12881 8334 2331 -6408 -13573 -5470 5199 -262
16710 -262 -7361 -15464 -8527 -8021 -621 6807 15184 7583 -6963 -5282 2010 -1782 5816 -1555 -5532
16695 -5532 -12547 -23417 -18253 -3990 -5593 -8756 -4512 7313 21238 8509 -7265 461 -5651
16682 -5651 -20045 -14361 -14065 -6124 954 -1785 -6715 -27647 -37846 -23638 -4680 6077 9955
16669 9955 3971 -4053 -23803 -25445 -16938 -6724 4271 3576 3672 4310 8484 18416 29317 22707 19359
16654 19359 14452 6631 -39 -3361 -2178 -13469 -43423 -52122 -34719 -20588 -6990 -7678 -11102
16641 -11102 -5426 -7967 -4003 16431 16247 10527 2208 7215 6157 9153 7946 6505 -341 -2881
16627 -2881 -5548 -12607 -11575 -2703 -1474 -5747 -6974 -3634 -5079 -5835 -883 -4548 -12871 -13477 -12468
16612 -12468 -10904 -7450 -11354 -18872 -12837 -5632 6717 14839 22321 2192 -20424 -25111 -26302 -22989
16598 -22989 -7480 -5663 -11631 -11569 -5981 -8561 -11741 -10233 -18103 -18720 1021 1889 -14734 -16575 -14777
16583 -14777 -6658 -5706 -13910 -12648 -11764 -3037 867 498 -8229 -17284 -15213 -14055 -10856 2838 6818
16568 6818 1322 -2464 -6394 -20217 -16429 -10409 -8976 -3460 2124 -2860 -12287 -9857 -2482 230
16554 230 1755 -10607 -9970 -3270 -1824 -16643 -13419 -24968 -27891 -20062 -15295 -14505 6749 18594
16540 18594 18970 17195 21228 11689 678 6111 9447 7474 7407 13263 21481 28937 15108 10520 -76
16525 -76 -5353 -2790 -1163 -1149 -3125 -9349 7373 11595 7216 4689 -1254 -4904 3302 2044 -7048
16510 -7048 -19154 -10340 -2742 11163 11621 11762 1342 -2874 4714 11145 12851 10024 12234 18283
16496 18283 28034 22317 7272 -1236 -8005 -898 5456 3501 16211 17214 8457 -9981 -8147 6172
16482 6172 9238 2146 2339 -11326 -11628 -8672 2359 5487 4828 1170 1138 2515 12510 13513 1976
16467 1976 5517 20442 14867 5780 3345 4148 4851 -931 -10086 -12730 -18955 -18481 -4370 -3243 -9075
16452 -9075 -13597 -15070 -20802 -12995 4915 7310 264 1671 -7820 -3187 4243 49 -2291 -3220 4515
16437 4515 1912 -4438 -15760 -11411 -7176 -6163 -253 -3391 -8953 -8504 -4507 17457 27587 18452
16423 18452 17951 17713 20341 29471 27011 27233 16800 17229 11719 9318 5774 16161 21364 24005 25587
16408 25587 24952 19766 9952 3911 20890 19310 23859 31081 21295 19205 37071 40181 17178 -2482
16394 -2482 13122 27331 32699 38570 41554 42460 35471 28044 15996 6639 13922 13163 -9942 1951
16380 1951 16406 12450 16901 19678 28955 27426 6957 6915 11082 13246 9375 14873 12041 3033 3722
16365 3722 2106 2803 15212 23156 19005 24773 30927 23567 37710 38510 15645 6780 13735 18221
16351 18221 14801 15560 22317 34247 39918 32555 24904 19637 19030 17316 15400 24064 33824 45940
16337 45940 37211 31283 24290 27123 33846 39021 47787 66679 62838 39233 40326 28361 27625 40535
16323 40535 36967 31065 38777 44176 52343 42102 40965 45213 46504 31836 27197 40931 45978 39567
16309 39567 18416 23183 29741 9837 679 3264 8119 7616 15260 12599 2585 349 3979 12831
16295 12831 13315 19417 31398 48922 59145 61396 48493 25514 22686 26636 26866 42263 40195
16282 40195 36365 32431 38729 31909 17206 17123 22027 18856 17025 22197 22789 30827 52183 61687 53630
16267 53630 44766 39755 39406 35042 41916 45988 42614 33312 27084 34791 35118 29765 26478 29626 23575
16252 23575 34306 35996 40309 28070 20269 16320 4618 -243 8418 16264 24201 31183 25800 32060
16238 32060 30227 35647 38945 31678 24885 12163 11205 27353 41124 32812 21996 10925 12141
16225 12141 12066 10094 20869 16362 14358 16418 15921 24851 25948 6117 -4814 8834 17620 7200
16211 7200 8808 -4917 2760 9359 9584 15919 3444 -12013 1438 6682 -272 -780 5698 18157
16197 18157 12503 1630 16219 21861 19115 23985 13983 10144 13717 6496 -8034 3105 6987
16184 6987 6311 -843 -4098 7882 12209 6770 8310 10696 12205 7346 -137 8415 1003 5928 3306
16169 3306 5107 4863 3575 5116 7443 1771 -1096 -7235 -7585 -354 16953 26098 29530 13615 7693
16154 7693 12827 3078 1840 2786 14898 5078 5303 11540 3974 6003 7654 1895 -3542 1502 -8785
16139 -8785 -13164 -713 6996 6270 9459 3781 -7086 -16683 -24235 -28629 -23020 -17590 -16913 -15139 -15445
16124 -15445 -12431 -7341 -12368 -24984 -16230 -3681 -6255 -4463 -3946 -9180 -11877 -6963 -732 727
16110 727 15003 16368 14350 13559 10813 4670 9310 8186 -1813 -12109 -13646 -18576 -9037 2477
16096 2477 -10899 -18532 -19787 -693 -6762 -10089 -9950 -16924 -12502 -5076 60 2880 -84 -4522
16082 -4522 -12514 -12550 20271 30187 19772 15780 8205 7187 6561 8661 6158 15531 13636 8644 -9963
16067 -9963 -17129 -7901 4824 12471 1192 -14078 -9961 -3822 5777 8737 4804 11173 15866 7581
16053 7581 10876 5310 7037 393 -583 -7804 -7733 -1574 2498 11088 16200 21488 25144 4391 -5285
16038 -5285 -5363 -3449 4215 -4496 -26823 -25497 -9937 -170 491 3382 7387 13138 12061 6504 -851
16023 -851 -808 -3485 -14292 -12016 -3500 1230 7753 12721 12621 -7069 -9637 -1452 -153 -1492 12024
16008 12024 16897 18656 8285 1201 2901 8114 19824 24180 15954 -125 -3517 -5741 -17381
15995 -17381 -20520 -20676 -16881 -11870 -9477 -7526 5092 8281 -5879 -4981 7727 -2865 -12071 -3713
15981 -3713 260 3359 7572 8125 11356 17522 8122 -472 -10079 -8499 -14126 -4471 -6450 -6521 -13755
15966 -13755 -12746 -18273 -19722 -24165 -25409 -27395 -24821 -23243 -33673 -28335 -7304 -7846 -14499 -21847
15952 -21847 -18906 -13076 -4563 -4290 -9195 -12959 -8809 -4614 6558 11125 -2765 -19464 -20002 -22008
15938 -22008 -19504 -9786 -8835 -6685 5904 6955 -4596 -919 4924 -4564 -8185 -14898 -11642 -1127
15924 -1127 -3043 4009 15227 18632 13572 15025 -4315 -24826 -9246 2772 -6498 -7380 -8055 -18424
15910 -18424 -8990 -2251 11356 9702 2497 5803 12532 11857 3878 -10512 -9634 -23296 -29197 -34423
15896 -34423 -29996 -29989 -24840 -26958 -32581 -27260 -24114 -22936 -22603 -15053 -10384 -19745 -457 6495 4492
15881 4492 -8740 -14143 -5121 -10835 -9275 6973 8111 797 233 919 -2914 -7691 -16377 -7301 8103
15866 8103 18997 10505 18053 14163 704 -1209 -9585 -12111 -8890 -9002 -5736 -14453 -12444 9672
15852 9672 20854 8020 -2304 -11626 -16941 -11889 267 2380 2193 1166 3070 1022 -8658 -3832
15838 -3832 -7191 -3475 1829 3828 9819 -8325 -16206 -32632 -37065 -34865 -30124 -28723 -31499 -34296
15824 -34296 -35549 -27067 -17657 -324 -6048 -9323 -23277 -24937 -31237 -14317 -19635 -33115 -39163
15811 -39163 -26623 -5488 -16853 -22556 -10053 -14605 -11711 -22607 -25905 -21913 -7401 -1518 -6046
15798 -6046 2376 10958 3344 -1431 -2769 3253 7443 1552 -3247 -342 -2648 -3433 -10426 -6240 -2995
15783 -2995 -4247 1550 -2737 -3120 3166 -2070 -4258 -3232 9789 2099 -2760 1569 -2065 1676 10533
15768 10533 3432 -8716 -7739 -10255 -6514 -2882 -10450 -6683 451 -6079 -25691 -24749 -9507 -2453
15754 -2453 1245 558 -5516 -11560 -16487 -17854 -23064 -15999 -15580 -10703 -5559 -10098 -21164 -23656 -23860
15739 -23860 -21878 -25918 -25107 -26241 -23767 -20544 -10811 -22265 -17925 -12554 -12322 -12950 193 1150 -6720
15724 -6720 -15163 -10127 -3106 -11852 -15363 -353 2593 -10768 -12364 -12533 -13694 -12059 -4407 9395
15710 9395 3936 -4792 -5364 -6415 -9874 -18864 -16859 -13742 -10544 -15301 -8525 3916 858 -10719
15696 -10719 -6614 14602 23987 7134 -2707 -12888 -10553 -9945 -13031 -8517 3562 -1793 -5291 -9748
15682 -9748 -10557 -9436 -1293 6365 20336 17264 -271 1070 10111 6130 7341 2481 6840 7398 6838
15667 6838 5289 8881 12778 -7414 1803 17352 20951 19418 16297 9773 -1820 -1458 -13039 -9581
15653 -9581 -16949 -10321 -2999 1543 -4778 -13699 -3161 3396 3665 13892 10537 5078 2275 8899
15639 8899 10413 9968 8706 6865 4694 1338 -5209 -9290 -9292 -15473 -12020 6334 16684 17223 11390
15624 11390 -54 8223 12807 22352 28993 22451 16898 -78 -7014 -5739 -8860 -11603 -19618 -30086
15610 -30086 -20555 5589 8994 -5378 -7454 -5674 -7291 -7542 -2800 -9016 -13571 -16531 -9132 -1425
15596 -1425 -7131 -950 3712 9220 15163 12136 11193 11575 20439 15668 9740 10991 11645 7144 -9250
15581 -9250 -23027 -23780 -20029 -19276 -17815 -6851 2617 -3331 -2871 -1839 4976 9157 -382 -4360 -2799
15566 -2799 -10656 -10971 -64 -6345 2407 7777 10190 -227 -1104 -10302 -828 -1048 -9532 -9997 -8452
15551 -8452 1238 16444 23922 14358 5553 2898 5659 17916 9535 -1464 -10392 -4928 -7014 -6834
15537 -6834 -2024 5213 5881 13065 12752 -59 7021 22456 20292 11036 12004 20005 28829 25068 24665
15522 24665 32011 29922 13838 10444 21905 30682 17479 16367 10604 5277 11971 20177 22602 17896
15508 17896 9371 491 -466 1166 2470 4102 -70 -4753 -8141 -7224 -3060 -9613 8520 10884 1817
15493 1817 37 3179 -7158 7234 13871 15535 439 741 -2590 -4607 6975 6584 9198 8481
15479 8481 7338 8132 14487 14016 10851 8908 10311 7426 15591 16652 490 4735 10992 22180 23019
15464 23019 21744 17206 9462 13605 23612 31220 28329 27888 22308 12131 11073 17502 22851 9185
15450 9185 2656 8821 12791 9233 10265 14829 8950 3018 20123 15048 16015 29311 36014 45028
15436 45028 51293 44104 34635 40104 40933 33454 37737 48206 45743 32567 25920 27312 23507 25666
15422 25666 21529 38100 50047 47068 36722 30834 19723 24457 16746 13787 8779 6174 14467
15409 14467 13724 23953 24867 37096 38686 35262 34784 42080 43670 35994 37358 33794 42197 51352 42382
15394 42382 14856 -1791 -445 -467 400 9064 16143 22148 23477 27000 17899 27403 20238 -800
15380 -800 -1178 14658 37811 56017 60236 46094 37971 33547 16530 8382 20918 13624 11380 31304
15366 31304 41429 35117 20749 17904 19209 20252 26971 37868 41810 36848 24000 21545 44665
15353 44665 47317 56593 73299 55226 32060 29494 36056 22354 29828 43151 43048 33595 27585
15340 27585 22178 4075 -534 1438 21816 30504 29866 21410 25407 22719 36554 39404 35111 31396
15326 31396 34788 46390 42408 44150 50718 54009 62039 61001 40200 25079 27893 26223 35019 34675
15312 34675 33043 39835 36646 19567 15990 15632 20867 24984 18190 10074 19986 33863 43260 35984
15298 35984 27533 27817 43383 51957 39464 34808 42499 51622 60295 46692 29491 17207 13045
15285 13045 25232 31524 28833 30276 32312 41440 48973 45767 40582 41219 43766 42447 33594 35852
15271 35852 33871 34279 32260 31951 27073 25159 29638 43301 35772 16050 13636 10730 18480 28327
15257 28327 36868 37612 31903 20456 28728 38543 33917 24221 6682 -366 6616 12907 29957 28078
15243 28078 29235 35657 41959 29097 21890 10110 14013 27773 28848 19331 15837 23271 30324 41147
15229 41147 46303 32690 27878 36870 39443 34959 19215 14434 13422 8067 13204 16471 11638 8843
15215 8843 -1777 2125 12243 14428 16834 23933 28400 19345 9245 5144 24640 36497 24915
15202 24915 18165 7317 10976 11642 11488 25424 29409 34543 42008 44525 24245 17676 20776 8309
15188 8309 15524 26147 25946 16857 22378 37629 25389 28809 43442 46241 44445 48620 32514 33792
15174 33792 27836 18687 12917 10463 3693 -6491 6718 -1771 -7631 -5731 12336 33606 38171
15161 38171 26371 18316 29196 27173 25213 30740 25700 32340 28987 13011 13557 11237 11688 382
15147 382 -4990 -11073 -971 815 11528 31612 46786 37813 35360 41683 36150 37146 31651 20534
15133 20534 15097 23576 34462 19997 23328 23723 32706 31966 20602 15240 19652 24990 23397 15331
15119 15331 20234 25752 35463 25240 9970 26585 43567 44725 36710 34239 30527 39313 28368
15106 28368 6804 8128 27745 21497 24964 26178 22945 28767 25459 19675 23429 29433 25446 14952
15092 14952 21590 39018 31554 19870 24892 29667 20968 14941 26890 29591 29337 26019 10779 -5546
15078 -5546 4887 19724 26564 11237 7271 14697 11117 22294 23155 29573 29335 14300 1709 9283
15064 9283 27359 32756 22023 7323 17334 28018 27413 13646 529 -7934 2288 27401 31767
15051 31767 24516 11950 7541 525 6893 21764 23586 32262 26272 15717 15731 18233 30869 29543
15037 29543 16032 3270 -545 6101 16946 34232 39269 34812 19643 5815 2590 21443 39624
15024 39624 40836 34425 39747 49172 59674 64009 65350 64985 80804 79918 70646 59463 53848 47014
15010 47014 39176 30746 39522 50014 41834 44437 43451 44502 48883 38754 15548 4621 20722
14997 20722 34617 42480 39480 47342 73888 106104 121265 126226 109561 72234 33988 33926 36349
14984 36349 26344 30868 36934 45912 33385 31121 37423 35045 42654 44548 40893 28802 14213
14971 14213 10956 20991 20884 26953 36670 32306 17580 6096 14072 17916 24922 11988 8437 -2035
14957 -2035 1561 15365 24969 25702 21482 23998 13526 2714 17052 38600 33160 29569 25862 24234
14943 24234 30083 35770 22365 9594 16655 10475 19183 29933 34791 31436 21708 23907 13673
14930 13673 27023 24448 10434 -4865 -2113 20276 27670 28578 34908 35942 31793 23046 17633 17614
14916 17614 29387 44888 31913 12354 14474 7764 1850 13274 21418 17832 31051 46769 46460
14903 46460 44113 45535 40263 41900 39870 25908 26169 30882 33310 19833 10766 6013 16803 33551
14889 33551 42375 29135 25484 23056 26123 23096 35288 39131 28494 20464 17620 16496 23315 39444
14875 39444 48675 34960 23587 16924 24743 23477 24234 28988 28805 24285 13452 24413 22718 9228
14861 9228 10805 13454 16240 19786 32304 41180 25945 13353 26315 21030 18206 28356 23676
14848 23676 29956 28287 29988 32627 42447 49050 50039 48967 38643 52056 51779 41536 40755 31795
14834 31795 15801 25898 49884 62277 67068 64597 66156 55781 42834 48555 55432 57660 54169
14821 54169 41419 43050 36890 35956 41193 57271 56323 44835 50043 50089 45727 43677 41649 44525 41343
14806 41343 41005 42213 49867 52479 41952 33790 32830 33584 34528 36238 43196 44270 35435 38009 51370
14791 51370 61682 64698 62036 61866 48483 53037 49001 39189 33244 29626 29758 30736 23468 21005 30415
14776 30415 40831 42530 33657 30711 40322 40268 39125 33345 23117 11308 25024 25018 24783 19706 14696
14761 14696 15333 24734 30547 28005 39524 40197 33184 27868 19422 10825 17041 21431 26901 29867 26074
14746 26074 25568 29671 23328 20859 16417 18579 20751 35014 56362 54376 38413 39217 56293 56829
14732 56829 60405 49513 35650 36253 32538 28711 39306 36872 29789 20526 27894 37034 40754 35110
14718 35110 36419 48583 55367 67209 77846 68469 42744 50606 50434 35498 33435 31248 37157
14705 37157 49913 48515 57029 61072 52546 41165 29476 22162 22377 26591 32679 38603 37553 48652
14691 48652 42092 32639 38545 43519 39218 41891 48194 49422 48493 49182 47569 54751 49256 49700 58918
14676 58918 64682 61170 72556 77351 78698 88166 71823 55937 53324 55338 55538 59611 59931 59684
14662 59684 50583 51799 51718 46806 44438 44562 35496 24996 50911 55278 47190 51541 49306 51182 54881
14647 54881 51354 55998 55641 51972 50751 55214 52882 59200 42615 32678 31237 39980 47506 43354
14633 43354 35205 45969 57047 66121 65793 55167 47779 49941 58959 56263 58727 63407 59418 58718
14619 58718 60196 66718 73203 82493 75481 69683 63180 48937 48133 61918 78361 80357 73821 83756
14605 83756 86878 85774 69976 69533 61345 60798 54798 66091 69936 62111 46906 57220 63647 63379
14591 63379 63262 74271 70398 60644 67779 74179 64033 45960 49436 59623 70200 60278 50798
14578 50798 50596 67386 67627 66211 69774 62640 69217 79624 87648 86441 88422 85254 68826 64433
14564 64433 66976 74756 75658 85304 82594 70834 63720 68343 72540 82700 76636 75601 82319 90313
14550 90313 80119 70008 73508 86158 88918 79038 70610 72752 79050 80956 97753 102718 89944
14537 89944 89052 94588 101027 95127 89151 90887 96293 92637 76032 80381 88154 90595 96866 95439
14523 95439 88050 83445 95402 101434 98984 94784 92689 93889 91872 89501 87657 92846 86267 81249
14509 81249 83934 101817 103900 102024 92939 73318 67923 74316 79518 75559 82208 96950 102526 94918
14495 94918 92361 100995 105799 91120 86875 96286 111128 105758 94781 98237 111189 131812 134640
14482 134640 118517 113853 114016 111675 116217 110950 99198 91694 89166 89563 85021 78874 90710 94840
14468 94840 96777 84298 80480 81125 72932 76437 91222 81584 78663 84498 98023 101641 103809 113813
14454 113813 123352 124018 120287 123553 131826 106600 94977 106744 113156 115117 123901 124567 131699 128821
14440 128821 122632 103944 93030 92716 94236 95840 96442 106925 123000 118854 108237 107110 112239
14427 112239 113452 112080 118796 129208 136439 131354 122089 112544 124900 132109 128183 130788 133453 136186
14413 136186 120479 106548 85113 96986 116499 127204 114940 110316 105408 103302 98611 105647
14401 105647 126226 122308 118707 114918 111168 107498 108031 115876 115160 115260 122286 142512 158375 150226
14387 150226 145461 140905 136095 143400 148294 145098 146991 145460 144623 144802 151936 156921 155126 154554 157120
14372 157120 158958 158609 150486 126953 118353 122304 152315 180556 190861 182598 164403 150652 147182
14359 147182 139787 152528 167985 168246 175805 160607 149498 136132 145103 153174 149328 160004 158992
14346 158992 161953 161611 159992 171196 170362 165117 165871 164041 159901 155234 158466 155395 153609 151007 159322
14331 159322 172466 184964 184649 168665 148961 146317 148435 151094 162963 164823 163972 159277 162257
14318 162257 178257 175591 179647 188194 188755 188550 189610 190054 189387 178259 178719 171947 177178 190644 184044
14303 184044 186539 198453 193412 202702 207159 192777 196049 218184 218746 212292 208276 204225 204827 202563
14289 202563 195212 184531 191121 208650 207700 209150 217584 232429 235198 222975 206869 201380 197454
14276 197454 200735 204370 212959 220165 224360 232206 225952 219229 229421 227205 222523 211091 209587 215313
14262 215313 229118 218539 217146 215385 218971 214407 213956 211152 197505 203279 224501 225325 219841 215323
14248 215323 215617 222484 236741 236832 243398 248573 246386 245388 234148 230846 234248 234212 253348 254743 235169
14233 235169 233266 233961 241505 252050 258370 257783 267800 251559 238826 230556 236223 254624 261047
14220 261047 254968 262686 259841 258561 253176 247640 244864 258500 281008 299587 289454 271849 271861
14207 271861 268482 269014 278986 292194 304097 303772 287312 288465 291298 285570 279569 275416 286246 298573
14193 298573 292124 303344 311968 313813 308348 299751 290454 290057 304118 311520 305431 305831 313142 318988
14179 318988 337296 339252 330194 323061 303676 299693 313162 315931 328436 333934 337564 335868 330474
14166 330474 336398 329275 311867 318393 320359 330607 343596 339070 332424 336740 352914 358848 353194
14153 353194 353011 352864 343740 358804 380847 383081 378709 370752 358591 364897 372718 364522 370112 372531
14139 372531 369029 366497 368032 356391 355927 386279 406780 407586 395122 386965 377758 385184 408647
14126 408647 403675 415324 416121 413412 418469 437459 433026 429770 426156 421903 423841 426608 418602 427262
14112 427262 435912 438985 439522 435525 442800 462097 458025 440694 443235 449380 476870 499898 489135
14099 489135 475832 464357 459705 476614 487428 486373 476992 479445 496521 502848 507238 511749 512318
14086 512318 514802 514748 513805 513843 512169 513453 511939 516973 515351 513265 523650 531634 535470 545985 565354
14071 565354 573238 581974 584950 577759 564053 562212 576525 593781 592981 585168 583611 590137 600607
14058 600607 608311 605219 606381 603908 603041 604846 607984 626697 635660 634244 640016 642867 654015 667616
14044 667616 682491 694127 714289 717081 729910 732267 738286 755751 758756 782196 804275 806415
14032 806415 819182 833410 837359 835846 837926 837677 838226 848877 855507 871212 885477 879817 875436
14019 875436 876888 885049 886962 874921 870552 882369 876375 882053 877649 868526 880667 902241 902245 892186
14005 892186 888254 903461 905393 902495 906534 922737 921861 928675 930145 938498 938802 941379 962271 982881
13991 982881 994090 986386 978857 977550 985628 988860 990092 1008489 1022816 1033829 1036139 1038743 1049287
13978 1049287 1061252 1065605 1079902 1091927 1079577 1104080 1121049 1124529 1114902 1124089 1136245 1146198
13966 1146198 1165241 1180948 1189519 1194796 1200710 1211888 1230985 1247324 1252278 1265163 1264063 1263937 1280166
13953 1280166 1293556 1300107 1321000 1325433 1317930 1325693 1331927 1354168 1389702 1404261 1404473 1415592 1432488
13940 1432488 1451134 1471639 1495882 1514007 1523643 1518588 1527104 1547806 1564381 1572908 1578366 1607340
13928 1607340 1619980 1630160 1647357 1660402 1672571 1682459 1703116 1730367 1749396 1771145 1806817
13917 1806817 1823485 1828654 1849291 1879115 1906467 1924969 1945698 1967896 1998207 2027086 2031297 2037796
13905 2037796 2054726 2075110 2102694 2128722 2157256 2184376 2195625 2224745 2261255 2291187 2302999
13894 2302999 2330071 2359336 2381148 2410972 2438973 2465299 2496884 2522722 2545025 2574593 2627578
13883 2627578 2673287 2701623 2721290 2760217 2808386 2842965 2876626 2933671 2966668 3004712 3038845
13872 3038845 3076249 3109233 3156049 3193298 3233085 3260580 3303709 3355577 3405478 3461113 3506960
13861 3506960 3561044 3601971 3650041 3706321 3763535 3817827 3881561 3948666 4016548 4058523 4105484
13850 4105484 4161943 4215811 4286735 4351260 4418100 4467958 4526949 4599244 4686548 4780221 4854559
13839 4854559 4921655 4998344 5069169 5144958 5225581 5317018 5402924 5481471 5581080 5674144 5766138
13828 5766138 5861194 5965506 6071278 6169999 6271166 6367776 6463689 6573415 6685975 6796889
13818 6796889 6916927 7025267 7158242 7289423 7402213 7533367 7664209 7801098 7931440
13809 7931440 8065610 8216651 8357056 8501893 8660632 8812208 8969099 9127879 9278395
13800 9278395 9444489 9616333 9785486 9944657 10112117 10283813 10468712 10632197 10797055
13791 10797055 10974736 11156684 11356491 11552860 11752579 11952324 12154711 12345387 12542490
13782 12542490 12747723 12937177 13126294 13314601 13515540 13714617 13902052 14095107 14292000
13773 14292000 14469314 14656837 14843115 15014690 15188434 15347069 15506275 15666073 15837838
13764 15837838 16002787 16150102 16277272 16386161 16499927 16620221 16719263 16830395 16924484 17017814
13754 17017814 17098758 17143518 17201799 17255204 17282194 17309700 17336971 17345443 17337793 17322880 17297635
13743 17297635 17258653 17215140 17170976 17116428 17048328 16984199 16897894 16800339 16695922 16587222 16471922
13732 16471922 16359411 16232481 16100965 15964606 15824048 15677000 15524531 15378939 15222566
13723 15222566 15065162 14897384 14727505 14554149 14392769 14224869 14057683 13903964 13731464
13714 13731464 13549643 13369821 13200182 13022850 12848502 12675201 12504654 12323393 12139841
13705 12139841 11971004 11810375 11636194 11469329 11318628 11164389 11005954 10847720 10700065
13696 10700065 10542074 10401247 10244074 10075824 9909416 9773945 9645333 9495982 9346758
13687 9346758 9218457 9077637 8945627 8808377 8670090 8525741 8394411 8278080 8155461
13678 8155461 8045752 7913822 7797471 7681304 7562197 7450189 7344803 7237391 7133538
13669 7133538 7023614 6910810 6796519 6689725 6594927 6506359 6412502 6316952 6223795 6135255
13659 6135255 6040111 5954751 5868425 5793651 5716189 5627118 5527717 5441397 5368358 5304465 5240402
13648 5240402 5167663 5100768 5029586 4946057 4873875 4801036 4722258 4654124 4579672 4506667 4454064
13637 4454064 4416290 4348554 4282984 4222981 4155678 4086964 4038517 3977935 3918266 3872041 3830197
13626 3830197 3782736 3739587 3684006 3637778 3601304 3568606 3516880 3470067 3435902 3378397 3330627
13615 3330627 3292251 3253462 3195781 3144603 3101479 3060825 3025669 3009808 2966672 2918647 2882128
13604 2882128 2839878 2810794 2780483 2742400 2702998 2661851 2627967 2587171 2565292 2548820 2514116
13593 2514116 2480321 2460752 2430022 2394503 2367395 2321118 2278803 2257003 2243793 2224378 2212997
13582 2212997 2184867 2151460 2113955 2081108 2052988 2033482 2029026 2003858 1969095 1949937 1948468 1931995
13570 1931995 1911949 1896475 1869866 1844173 1824405 1798033 1773667 1752507 1730059 1708943 1692736
13559 1692736 1676699 1651386 1623881 1607643 1598592 1591314 1577113 1560446 1556420 1536580 1516225 1494632
13547 1494632 1473895 1453312 1443107 1424326 1410460 1410902 1390587 1380187 1373946 1345449 1334487 1328221
13535 1328221 1312282 1295447 1276374 1258954 1260454 1251190 1239150 1238973 1237202 1229078 1215586 1209749 1203229
13522 1203229 1184988 1161318 1157885 1160866 1150940 1142658 1121523 1095373 1095348 1090154 1076709 1067213 1036775
13509 1036775 1027556 1035693 1023571 1009730 993860 980232 965161 963061 973375 967022 950197 929885
13497 929885 933741 944123 956065 957542 939861 933500 933955 911960 896286 902431 906917 909786 912234
13484 912234 913371 906035 902990 902677 896883 894574 899494 907006 910620 903184 897353 886500 867048 854055
13470 854055 853083 850171 846345 819678 800674 798112 788349 779981 771409 762466 748427 730137 731876
13457 731876 729553 728540 713549 690026 669970 677887 678959 663794 665705 652354 653259 660209 645107
13444 645107 630995 626539 619452 597718 602832 598053 597855 597574 594613 580207 566541 559947 558341 539876
13430 539876 526293 542799 544278 530331 524177 518458 506682 514595 512281 506629 501586 488052 470632
13417 470632 475764 491205 488269 476366 477450 485565 468539 460954 456207 462532 464102 451382 444172
13404 444172 443916 456536 445488 437380 441170 430236 406702 408048 417553 414644 408771 406701 408732
13391 408732 393780 395686 404105 405503 403631 384362 375365 381535 375375 359267 359979 370300 372356
13378 372356 375742 371612 370432 375475 365119 345165 332077 340366 361680 367975 352838 342644 350384
13365 350384 344178 337670 328591 332322 327238 326382 327286 323105 330959 328280 316498 305835 311595 316121
13351 316121 308464 302488 304849 307527 310022 311959 292113 291181 295595 288711 306473 308966 291142 288493
13337 288493 283388 287147 296809 288018 287863 286578 285984 272171 249147 245535 249715 244584 254902 258761
13323 258761 273123 288988 292236 273773 270118 273987 279219 270940 265146 262087 267651 257393 243956
13310 243956 249050 251330 251980 240291 225859 214369 209708 206461 215122 219664 224359 228359 229522 229938
13296 229938 229800 228496 239223 225492 211919 204139 209331 212979 209000 207296 197223 183247 177662
13283 177662 187035 188662 185756 201761 203566 201480 206141 205722 210156 201678 194948 179967 175963 172672
13269 172672 180734 193234 192735 194446 197046 182726 173782 172376 162758 155068 150754 160629 180398 192934
13255 192934 190611 190999 191433 193053 186969 173908 170622 164438 168083 174228 165595 156073 156612 162408 162362
13240 162362 174056 171241 174880 174867 170098 171164 164596 163666 159156 160051 137105 128682 147720 156408
13226 156408 164717 171837 166577 168374 166877 149553 136009 140866 155207 157870 149790 142170 130063
13213 130063 132705 131998 134455 149855 150369 153179 160576 141314 129699 123644 122458 116973 125914 127944
13199 127944 129763 126927 116647 117860 126060 118413 105493 113160 114402 114731 113567 100296 100803 107559
13185 107559 109862 114781 123090 124502 118347 105493 101283 109587 127486 133881 131312 126233 123570 127571
13171 127571 118838 101867 87863 97462 117293 123740 113394 107927 112485 107554 87520 88223 95648
13158 95648 104330 111097 109566 114255 111427 109942 104752 94855 89455 100911 100398 96376 95347 94339
13144 94339 89331 83494 81249 86167 89363 87008 90176 99667 90725 83916 70283 60331 51522 65035
13130 65035 71375 66606 72651 77294 82159 78645 63856 71993 70459 70708 86965 88020 69721 61925
13116 61925 68036 69883 62702 67223 68713 67980 66999 63735 59722 67924 62967 55553 54199 66616 74355
13101 74355 72941 65785 74283 73997 57187 47461 56531 69685 79649 78278 77672 85261 84219 75514
13087 75514 76598 81348 87242 79044 80861 82208 68291 59614 57517 54069 43788 25534 5384
13074 5384 16288 46507 66330 64085 56844 61202 64341 67744 69228 65224 63211 47805 49534 47122
13060 47122 49248 53411 53050 47302 57996 61691 65214 70256 59344 39499 29858 25770 42848 57626
13046 57626 74934 69352 57360 60999 72419 79334 78017 81094 79159 72900 69954 62979 48959
13033 48959 36961 31088 41333 42537 45894 45700 52421 43758 26832 21377 30342 28148 29831 31640
13019 31640 50456 72034 74870 62964 55154 47505 58945 59313 43097 49002 48533 37091 21134
13006 21134 19734 22790 45656 57049 49641 44074 43168 36225 26946 21468 21534 23691 30795 30158 23041
12991 23041 19881 33100 35176 32582 36508 47168 48465 45792 37718 42133 31899 12414 12268 19634
12977 19634 33904 43359 41570 39713 31139 33148 36782 43420 45796 33844 30381 49142 63699
12964 63699 62124 55196 48867 44240 41960 39297 30108 28406 22838 31164 42880 34708 39524 49041
12950 49041 53397 43651 38666 28990 33403 34425 33095 37123 45339 49399 60374 50966 42582 26596
12936 26596 16033 14319 5058 15084 16486 11613 6336 23122 28037 34110 36581 50182 46225
12923 46225 35168 24394 16656 21281 17074 11783 11962 13605 14281 20334 12677 11588 30035 47539
12909 47539 51027 48609 40302 46434 36017 34642 27641 29627 34772 24372 18214 31804 33180 30664
12895 30664 28065 21676 22386 26805 33250 28514 21349 14049 19977 35795 24934 23005 28298 34569
12881 34569 27972 24409 21393 7779 5634 12334 22599 21485 16763 11438 14169 14669 21817 20720
12867 20720 9038 4327 13466 26111 21532 19600 8701 7710 4268 7604 11119 23459 29125 34686
12853 34686 38715 30220 15650 12935 23657 22495 14370 -3077 -1399 -7376 12135 18060 1522
12840 1522 -4867 4208 15641 21298 21720 20345 29527 36788 25018 20316 30707 24538 14316 21137
12826 21137 15099 20643 17839 17374 15960 4492 7877 11102 12249 16928 21114 14178 3826 3416
12812 3416 3279 670 2053 9862 1466 -8353 2463 1626 -12638 -9952 760 15895 14919 15697 18279
12797 18279 15300 15387 30577 28707 8668 6668 10545 8086 -6172 4484 25582 23252 7213
12784 7213 -7160 5373 12282 15678 7515 -7904 -11992 -3889 4409 5250 -471 -9015 -11057 -22052
12770 -22052 -8370 3425 566 -9331 893 6817 1177 10280 12394 818 440 15322 23461
12757 23461 19385 7027 -11331 -16808 -15179 -13856 -3967 16795 22556 25259 5294 -2891 5390
12744 5390 15378 22035 9035 -5980 -5554 13489 8842 4466 735 -6181 -3206 4021 -13016 -27869
12730 -27869 -27234 -14740 2082 7346 -14684 -14404 -3465 -8400 -23217 -18070 -4881 -6392 -14646
12717 -14646 -12494 -18664 -11806 -9912 -18318 -28237 -32489 -26045 -33130 -28436 -19414 -11247 -13960 -19777
12703 -19777 -16223 -1397 9823 -1607 -18761 -24272 -24323 -22018 -10990 -4995 10506 11259 15418 17598
12689 17598 19012 20386 21832 26389 5857 -11168 -12476 -10649 2660 10497 -710 -1438 -2776 -14299
12675 -14299 -7863 13659 24966 17934 937 -10566 -7026 -1858 1822 6869 18444 -8455 1466
12662 1466 6963 -1353 -6636 -10845 -3403 13441 13812 282 -9374 -22306 -28639 -30195 -31346 -28680
12648 -28680 -30850 -20398 -15038 -26638 -39217 -37750 -27521 -13237 -14070 -11990 -15039 -25226 -32009
12635 -32009 -40966 -36943 -38747 -26233 2194 8461 2020 5151 3446 -4400 6324 19329 15523
12622 15523 1166 -9639 -17608 -24327 -17043 -9570 -7150 -8420 -650 1695 -3817 -2866 -7955 -9683
12608 -9683 -6905 9300 8586 -830 -5248 -5846 -6096 2661 -4366 -11208 -2090 -14041 -25876 -26953 -16418
12593 -16418 -14755 -11412 -7581 -17571 -16753 -9039 2599 8210 3368 11887 15819 -4041 -17715 -27552
12579 -27552 -31442 -27023 -12479 -13013 -19751 -12172 -15624 -27695 -15770 -10361 -13328 -12868 -21473 -21563 -15786
12564 -15786 -5308 -3986 -18980 -29559 -21278 -24371 -33497 -24477 -14805 -9031 314 1549 10031 30959
12550 30959 28329 7272 5054 3689 -4715 -9753 -4698 -4276 -4335 4819 -2309 -9456 -5992 -14114 -14573
12535 -14573 -9121 -12149 -24731 -25226 -24171 -21743 -21374 -18261 -26980 -24851 -14565 -18279 -16478 -7497
12521 -7497 -4865 -11673 -13168 -6362 9801 15256 12595 1155 10455 21928 28056 36105 59893 96459
12507 96459 113381 109832 74522 49964 43527 26530 7575 9410 12279 8128 11397 -8900 -19280
12494 -19280 -23282 -20940 -28553 -33769 -23721 -15833 -10826 -10987 -20192 -27040 -32182 -28511 -10833 -8753
12480 -8753 1969 6442 7529 3621 3331 15098 8707 -8094 -11511 -16500 -10830 -10385 -9434 -5623 11362
12465 11362 51164 79520 90010 112895 104269 62575 31640 23527 3707 -24813 -33848 -7040
12453 -7040 10745 16985 17138 -4273 -3796 -3413 -650 -4425 -2801 -10108 -10743 -8623 -8704 4753 13660
12438 13660 10026 9221 9589 11330 2331 -5827 -2809 1269 102 7740 -9614 -35705 -32800 -10505
12424 -10505 13664 11604 11154 16345 27963 33104 38581 32089 18138 20331 844 -5698 -4315 -1551
12410 -1551 -775 -12299 -14106 -3908 -818 -6355 -18214 -21061 -28536 -12760 -4302 -3012 -9103 10797
12396 10797 13350 -4017 3741 4826 6262 -4335 -21856 -24890 -21810 -12105 -4920 -7978 -17770 -32956
12382 -32956 -23091 -10047 -14726 -16573 -7020 3871 3984 2655 3380 1508 -4758 -373 -7401 -34597
12368 -34597 -36375 -30291 -29102 -23540 -1484 5219 -9901 -11194 5414 858 -15502 -33528 -35493
12355 -35493 -26427 -18346 -24201 -31258 -19046 -17599 -5309 4818 18022 7225 -12606 -18442 -21782
12342 -21782 -19871 -18349 -18714 -26975 -28907 -28262 -12366 -5150 -10883 -21475 -27499 -21868 -20753 -33253
12328 -33253 -35872 -34579 -31567 -42316 -53092 -46788 -30750 -21477 -17003 -17845 -23778 -30242 -31075 -28822
12314 -28822 -29481 -36676 -29382 -26015 -24108 -14038 357 -3225 -17414 -12284 -11340 -10873 -14031 -13885 -8501
12299 -8501 -9704 -23968 -41493 -50907 -39100 -27710 -27743 -9615 4593 -6102 -27186 -25781 -18740
12286 -18740 -30010 -38561 -21048 -17035 -5518 -3249 -16992 -25135 -25888 -22827 -15956 -9747 -5766 -19943
12272 -19943 -25093 -16974 -819 -8275 -20621 -36549 -39028 -32873 -33944 -37493 -30426 -15390 -7093
12259 -7093 -13097 -28941 -29297 -22568 -13183 -17766 -14383 -10024 -18593 -16514 -19129 -21682 -26365 -28448 -17140
12244 -17140 -6354 -9863 -31846 -33331 -20807 -11608 -10730 -19710 -9004 -11318 -16708 -23518 -36966
12231 -36966 -45485 -51047 -51903 -44873 -29923 -33736 -29193 -19232 -24780 -29746 -29371 -26233 -33602 -37667 -39187
12216 -39187 -47305 -52912 -43311 -41401 -33555 -15427 -12412 -20068 -12193 -20710 -27780 -28452 -36532 -27259
12202 -27259 -22054 -24518 -23747 -24462 -29029 -42641 -34131 -12395 -11268 -18963 -25275 -28733 -18908 -19449 -9014
12187 -9014 -231 1759 -171 -4656 -7375 -18714 -36052 -24452 48 7063 17244 4271 -5885
12174 -5885 -17037 -20307 -23656 -23178 -18903 -14849 -13997 -16954 -21287 -24402 -34971 -32171 -10470 -11659
12160 -11659 -30014 -34169 -30000 -23369 -19105 -9836 2231 5877 3230 -12189 -24956 -41300 -19680
12147 -19680 -3350 -7635 -21822 -8466 -1046 -6293 -11821 -15640 -5297 -2945 3164 10748 -10634
12134 -10634 -13584 -14264 -17500 -12044 -17183 -12738 -1591 -2601 -8325 -5572 -11835 -18469 -13018 -11485
12120 -11485 -17970 -31074 -43778 -43990 -33703 -27075 -19676 -14336 -22283 -29465 -25977 -14649 -26214
12107 -26214 -39469 -33269 -27226 -19695 -6582 -6411 -27064 -32846 -26513 -30930 -30177 -26568 -23283 -34841
12093 -34841 -53497 -43350 -33522 -35153 -33887 -31903 -28571 -26305 -29625 -32235 -24283 -21497 -15848 -18862
12079 -18862 -17827 -19807 -34284 -44519 -28834 -20194 -31054 -36887 -42726 -38598 -26203 -24407 -29708
12066 -29708 -31141 -31449 -21642 -5530 -242 -9845 -15200 -20443 -20131 -29957 -30831 -29698 -27264 -20962 -8753
12051 -8753 -19835 -43774 -42568 -32710 -22920 -19195 -25955 -12240 -3885 -11773 -29637 -44918 -41638
12038 -41638 -36895 -24072 -16416 -20602 -29818 -23728 -22251 -21568 -19726 -17040 -25787 -23324 -20203 -30483
12024 -30483 -42114 -23726 -16255 -20718 -26767 -29946 -26549 -23687 -22952 -19339 -21402 -10142 -1486 -8040
12010 -8040 -29568 -23897 -12049 -22408 -17181 -4181 -6784 -17017 -13375 -11623 -12875 -12130 -8892 -15647
11996 -15647 -26989 -24513 -15208 -14125 -4046 -9128 -12211 -9108 -12698 -12848 -9739 -14110 -23347 -22480
11982 -22480 -11019 -5678 -11196 -22683 -21674 -26285 -25161 -13343 -11424 -8459 -3475 1120 -5649 -8250
11968 -8250 -13685 -27302 -24356 -31619 -30459 -30734 -27805 -21732 -18781 -10745 -6153 -20716 -22659 -13315
11954 -13315 -30881 -37667 -31543 -28249 -23528 -24110 -14769 -10921 -18034 -30001 -36077 -35644 -30925 -19094
11940 -19094 -5088 -11698 -14531 -13140 -20948 -23156 -20184 -22020 -26811 -25841 -42411 -34559 -35143 -44187
11926 -44187 -36053 -12991 -7088 -15159 -33506 -28759 -23382 -30451 -21431 -30178 -25814 -16589 -5785 -16810
11912 -16810 -24904 -20064 -20043 -25763 -28113 -26752 -28024 -29187 -30183 -31672 -34900 -28785 -26704 -40754 -50294
11897 -50294 -52121 -32559 -27907 -33909 -38510 -45460 -44947 -37332 -28719 -29222 -30231 -16576 -2392 -6205
11883 -6205 -22287 -28350 -33192 -45509 -47898 -33245 -30881 -31506 -21182 -19302 -16510 -16305 -29061 -40191
11869 -40191 -38226 -37214 -36939 -37014 -39624 -34645 -40869 -41774 -32372 -20588 -11494 -14666 -13861 -17681 -15420
11854 -15420 -21690 -36145 -34074 -25628 -33038 -25842 -18566 -15986 -22776 -34121 -35922 -37268 -48809 -45176
11840 -45176 -32402 -11693 -34270 -34900 -21748 -21474 -34105 -41294 -42970 -34400 -20759 -20303 -26663 -29485
11826 -29485 -21699 -14943 -18410 -23394 -9448 -6047 -21354 -19114 -15552 -29163 -46465 -48383 -37856
11813 -37856 -29839 -36208 -35195 -33333 -30801 -28158 -38179 -40258 -27366 -18099 -25136 -21587 -19144 -17837
11799 -17837 -17488 -24015 -28001 -22693 -20623 -15420 -20905 -28158 -22755 -22664 -31532 -15968 -7407 -14183 -26137
11784 -26137 -36370 -37962 -25248 -18625 -19804 -30544 -37068 -32475 -38855 -37923 -29785 -24071 -27795 -25076
11770 -25076 -26389 -40065 -41237 -28740 -30227 -36365 -19095 -2735 3253 -4558 -16168 -27276 -17895
11757 -17895 -6469 -2024 -258 -9987 -15581 -28709 -40823 -29313 -23485 -30766 -33499 -33346 -45098
11744 -45098 -42756 -33896 -29696 -21298 -12702 -11601 -3632 -17331 -29319 -32351 -19127 -21680 -30207 -28607
11730 -28607 -19638 -29605 -42908 -34672 -18834 -9459 -21983 -23922 -13004 -9174 -18754 -25600 -21204
11717 -21204 -10855 -8147 -9119 -11363 -19513 -27276 -34591 -22035 -14229 -11501 -10509 -18087 -21052 -14463
11703 -14463 -13750 -21152 -33793 -51552 -48133 -45434 -39984 -39424 -34520 -32527 -29049 -39311 -58103 -46223
11689 -46223 -25140 -19249 -16345 -18960 -26470 -27136 -35240 -47044 -51316 -41738 -41072 -46021 -55470 -49536
11675 -49536 -42332 -39277 -34908 -27109 -20257 -26276 -23989 -15306 -5404 -14969 -8939 -6041 -13179 -12926 -10581
11660 -10581 -16579 -10877 -3883 -4819 -20596 -29748 -22685 -12413 -9870 -5707 -8398 -9590 3179 5906
11646 5906 -1320 -16431 -20637 -16712 -19677 -28109 -32794 -43114 -45374 -34359 -28166 -20993 -26755 -48698
11632 -48698 -49122 -30854 -31421 -34408 -22877 -20448 -4418 -3502 -16572 -15935 -11900 -24137 -25242 -29998
11618 -29998 -44070 -34042 -33450 -26420 -32708 -40266 -36321 -27459 -22458 -26179 -37207 -47768 -34031
11605 -34031 -27816 -20828 -37162 -27366 -21291 -4306 376 -14141 -13451 -27646 -10176 -11031 -28518
11592 -28518 -36779 -46635 -53497 -50848 -26573 -14201 -14441 -17817 -38329 -45977 -35669 -34295 -32226 -36645
11578 -36645 -33290 -21608 -23946 -35871 -35716 -36305 -48974 -41946 -35678 -30773 -24319 -34894 -32125 -18785
11564 -18785 -24376 -28841 -21414 -8081 -5748 -11707 -21577 -22737 -31986 -37196 -37621 -38080 -44403 -39418 -38191
11549 -38191 -32259 -36979 -43340 -42893 -32392 -30033 -20618 -20476 -17942 -1351 2021 -12702 -26138 -7814
11535 -7814 -1578 -7667 -8211 -1088 -4290 -7815 -15022 -4690 -799 -6190 -18196 -24786 -25784 -25819 -34356
11520 -34356 -32115 -29500 -30329 -26841 -23603 -28421 -25379 -14598 -4603 -8239 -10297 -16224 -19494 -33562
11506 -33562 -35605 -35858 -39558 -42355 -37300 -36014 -27988 -14438 -13085 -6674 -17006 -27398 -30018 -27173
11492 -27173 -22010 -14392 -21428 -27043 -25291 -23860 -13662 -10219 -27204 -21075 -4291 3426 -13600
11479 -13600 -23347 -14203 -14335 -22265 -18371 -8732 -16877 -13672 -15431 -18059 -21123 -32980 -31531 -20101
11465 -20101 -24545 -28463 -8896 -5227 -16849 -25701 -13242 -7593 -9205 -7529 -12382 -11807 -11898 -17974
11451 -17974 -13187 -6653 -9241 -16174 -40871 -31292 925 9999 5694 -597 3016 -3812 -16658 -16191
11437 -16191 -12005 -13454 -15903 -17881 -7014 -8846 -13815 246 -6570 -16199 -21675 -11804 1641 -2599
11423 -2599 -6631 -9319 -8994 -18172 -24525 -23227 -27059 -20532 -21240 -22254 -19073 -24384 -28566 -17870 -10907
11408 -10907 -8164 -8949 -6979 -10721 -24303 -44930 -47174 -48380 -34703 -26298 -25012 -17511 -14375 -21445
11394 -21445 -17776 -21631 -36824 -24833 -9690 -16120 -35892 -52327 -39466 -17978 7330 7631 2918
11381 2918 -25879 -29932 -21999 -15412 -19040 -21624 -29691 -26038 -11134 -13979 -35171 -38776 -19422 -3981
11367 -3981 -1540 4390 -2502 -15766 -24285 -29345 -20016 -16102 -22450 -8783 -11487 -25593 -30247 -41924
11353 -41924 -43476 -38485 -35260 -35344 -26278 -10823 -9808 -19555 -17248 904 12523 -2351 -4489 -14453
11339 -14453 -19003 -18083 -14802 -2140 1146 4769 9480 3266 -3024 -14308 -9304 816 6936 -6251
11325 -6251 -12539 -9735 409 10892 -4536 -18927 -24136 -30247 -37372 -43808 -55082 -48591 -40795
11312 -40795 -44512 -48819 -41090 -30973 -12573 -8416 -14941 -27012 -34337 -32618 -24709 -21739 -13593 -13705
11298 -13705 -9852 -22749 -26395 -24331 -17657 -21519 -28017 -19818 -23092 -11518 -2042 2695 4426 8688
11284 8688 9193 -3220 -4116 -15138 -12230 -729 -2195 386 -1123 -13984 -25455 -30354 -30449 -23892
11270 -23892 -15014 -7208 -2948 6865 12798 10133 5776 1253 6166 1839 3001 -2636 -16570 -18698
11256 -18698 -25373 -16753 -10903 -5165 -4673 -6218 -21432 -30819 -28593 -24918 -25267 -15843 -13131 -12084 -13552
11241 -13552 -21901 -5291 -2458 -17577 -24968 -9128 -11235 -18855 -25460 -27969 -31406 -43859 -43764 -45226
11227 -45226 -39841 -33103 -22383 -17851 -19052 -27181 -31536 -25223 -29474 -22855 -23073 -25467 -31247 -24969
11213 -24969 -32119 -30626 -23747 -17220 -11766 -12128 -28557 -36004 -41151 -50113 -47074 -50033 -56973 -56936 -44003
11198 -44003 -26408 -15963 -23703 -28037 -22739 -8152 -20735 -28693 -31479 -21440 -12310 -21781 -31808
11185 -31808 -30124 -20915 -15063 -1235 -8898 -21762 -23625 -12175 -21721 -24443 -9322 -2726 -6987
11172 -6987 -12828 -10056 -7036 180 3117 5717 13204 9164 3637 -7851 -12017 -3647 10406 4564
11158 4564 5014 18135 12903 8487 -3314 -6996 -2014 -11522 -11318 6011 11754 12515 11308 10977 -7547
11143 -7547 -20326 -16977 -3705 -3127 -18524 -26613 -20297 -17650 -18294 -7351 -8510 -11858 -13925 -12169
11129 -12169 -12997 -13956 -7123 -10031 -15010 -8963 -10845 -32713 -38608 -31697 -23388 -10914 6697 3026
11115 3026 -1434 -10965 -29776 -30122 -16629 -17637 -17805 -9603 -8597 -15693 -21628 -22246 -12243 -11469 -19456
11100 -19456 -26376 -25294 1477 7609 5153 -6733 -3244 1220 -7664 -20173 -10161 -8631 -15343
11087 -15343 -15422 -8692 -8930 -3952 514 3249 4177 12495 22477 24698 3274 -8136 -72 -2610 -1185
11072 -1185 9627 6164 -6937 -8524 -7008 -12188 -10060 -9553 -10278 -1376 -4732 -10693 -2872 -13178
11058 -13178 -18205 -6164 2668 -7423 -12152 -14029 1304 -6598 -17283 -1566 2862 -2831 6865
11045 6865 18970 19456 24641 28836 31001 20661 8168 7122 9918 8971 4885 3322 -1587 -17041
11031 -17041 -18680 -773 4750 12810 7650 2974 9239 14202 18093 12693 -1151 -10536 -14917 -3114
11017 -3114 4042 2031 9759 14689 3535 1732 10916 11362 1563 1745 -3540 4071 10056 17405 11076
11002 11076 10295 1346 -11930 -15672 -13794 -21990 -20400 -8927 -2971 -2311 1020 -4319 -3168 23868
10988 23868 18730 7222 3921 6958 6638 5516 -4647 -8520 5088 16622 12530 4257 6764 15110
10974 15110 27070 25068 11519 5800 4737 18109 24878 33465 40105 36832 42606 36868 36359 38304
10960 38304 29997 25557 20561 23271 13292 -6284 -15842 -15744 -14188 -13003 -6119 -11924 -8957 -7884 6136
10945 6136 19288 16483 2460 -2515 -7632 -10821 736 5980 15654 9040 -94 9139 18931 15922
10931 15922 26534 25077 8718 6807 14342 24550 36640 52264 53395 63712 82257 96855
10919 96855 110983 125508 124003 122006 111044 94942 76393 62537 48260 36155 16751 11722
10907 11722 18462 27016 33568 40893 44969 36727 31602 35503 40245 31525 25357 18435 5835 3365
10893 3365 6674 15385 25124 24617 18869 18278 24948 23237 23075 36728 52988 44929 41860 30896 37892
10878 37892 55711 67683 95642 131111 159509 155586 133327 126279 100583 73763 65449 63616
10866 63616 55767 60410 46190 39459 37697 25099 20209 22568 22572 14925 13018 34899 50801 24087
10852 24087 5122 3288 -3440 10033 14123 694 6593 6242 9565 24206 24361 26366 29361 37230
10838 37230 38093 37133 33830 36723 44910 75631 101710 126695 151092 154068 141765 132919 118353
10825 118353 101187 75586 60424 39647 30481 38995 55853 61687 69309 46572 37661 42803 41740
10812 41740 41488 36107 29172 24640 25617 29121 25759 25804 29188 42844 46118 44714 33128 23960 22936
10797 22936 22517 23343 25064 26102 18410 14660 10635 1373 12632 12635 34088 59342 73962 79265 75233
10782 75233 74963 66997 53882 40813 29053 12675 23634 39042 47925 49923 41347 12230 6682
10769 6682 2558 8072 29179 31148 24026 38059 34374 27523 11506 3894 -1079 -10829 947 17316
10755 17316 11771 4191 12789 7111 791 5066 19740 26641 29403 21061 12000 12404 21573 30185
10741 30185 27382 22279 29850 24832 8415 4082 20715 25405 23136 34128 35665 41397 40206 51008
10727 51008 58279 55131 47863 39921 39450 45134 41820 36449 30892 25932 21410 20731 11043 29028 53652
10712 53652 53938 55429 42707 32719 27177 23539 30850 33302 25143 24311 32379 39025 51805 25386
10698 25386 7303 13404 22281 37078 48916 49262 50593 40029 39221 34996 43783 28521 13976
10685 13976 5096 6347 19831 36247 38988 44315 50270 48510 52066 49785 43070 53836 51008 43905
10671 43905 44888 49887 63091 66817 56943 34878 23576 32059 41163 39914 38804 39377 44104 41429
10657 41429 45271 42650 42543 51460 49966 41573 52085 69103 59975 64060 67588 63106 55079 48612
10643 48612 48970 40335 31147 45800 66721 60655 53646 64573 75790 78102 86706 90734 89390 88824
10629 88824 79294 66727 72034 83035 92170 107266 139277 146792 150448 159534 162770 156845 161241
10616 161241 165071 189221 207972 225930 257885 279164 319204 391584 484672 616491 790731
10605 790731 1024780 1299841 1503566 1566747 1450421 1231845 998038 810876 679115 587056
10595 587056 527732 483772 453052 432264 421171 427735 435339 443350 438210 428435 427349 408024 413889
10582 413889 442353 471834 491548 508677 537073 559572 588513 634286 693048 748514 806557
10571 806557 871879 934804 1028600 1183260 1373056 1635363 2003917 2501803 3189672 4103116
10561 4103116 5326369 6801903 8242989 9121730 8978537 7807291 6266583 4961431
10553 4961431 4005935 3348672 2881857 2555921 2342112 2191758 2070936 1958469 1882377 1822762
10543 1822762 1759732 1682838 1627760 1607415 1601699 1596302 1618446 1648384 1691614 1733962 1776841 1830094
10531 1830094 1890023 1952564 2079666 2260714 2450004 2645554 2877897 3198315 3638335 4252641
10521 4252641 5111457 6285808 7867915 10007590 12826519 16302514 20024309 22897171
10513 22897171 23638994 21735014 17943404 14055361 11096139 9064683 7668730 6694011
10505 6694011 6016646 5513251 5115610 4790811 4525488 4306300 4125642 3972326 3810685
10496 3810685 3666850 3557522 3480102 3437573 3427038 3425087 3446920 3485973 3520886 3552656 3612804
10485 3612804 3730807 3902011 4110168 4343769 4641876 5043688 5595975 6371171 7452058
10476 7452058 8929111 10911574 13602219 17166794 21622442 26639744 31051688 33147284
10468 33147284 31723254 27119101 21469290 16781229 13491622 11279626 9752315 8675697
10460 8675697 7877491 7258853 6777234 6382802 6046313 5749950 5479040 5226786 4982043
10451 4982043 4766612 4609720 4488132 4409186 4358285 4309533 4268133 4232053 4203057 4210513 4257789
10440 4257789 4329294 4436880 4560607 4719926 4966250 5322141 5842389 6589186 7632514
10431 7632514 9043254 10942076 13492840 16787902 20638340 24327670 26528588 26112194
10423 26112194 22969899 18488531 14531442 11682897 9758239 8435582 7480828 6775013
10415 6775013 6226308 5795690 5446740 5152555 4887965 4636478 4402695 4184345 3990991
10406 3990991 3818698 3697902 3599685 3511028 3443345 3351169 3281484 3227185 3165539 3127829 3105141
10395 3105141 3095538 3109183 3144521 3190603 3288287 3445148 3683480 4047954 4581348 5311089
10385 5311089 6279186 7568220 9160040 10782437 11886667 11900431 10641888 8744558 7036394
10376 7036394 5773278 4898677 4284722 3836547 3485438 3228385 3020900 2838564 2691994
10367 2691994 2552673 2429363 2304710 2187758 2089624 1996677 1922199 1876768 1824264 1773176
10357 1773176 1712962 1660110 1620711 1579768 1531384 1507820 1483126 1450840 1414312 1392743 1376206
10346 1376206 1358661 1381791 1449049 1524982 1615424 1753037 1968250 2251571 2558138 2736630
10336 2736630 2701446 2456250 2119257 1816102 1580866 1409326 1282785 1187961 1115957 1059893
10326 1059893 995428 930378 888203 852152 824396 798627 770069 728648 700022 681593 651118
10315 651118 623460 615942 614328 597823 573413 540657 522920 524929 510100 491698 475891 465481
10303 465481 454540 446407 444877 439490 425793 408984 396100 394310 387409 372954 357453 350944 347448
10290 347448 342367 316914 291853 291301 289394 280230 269510 274644 268442 261116 257903 244159 227682
10277 227682 218373 228434 233456 221414 211885 203880 205617 196623 193668 187959 182189 193282 191635
10264 191635 191702 177884 156205 155467 154732 145296 144328 134655 135074 144852 149033 157557 171026 163941 153165
10249 153165 137354 116806 105359 98389 100966 100030 89972 88635 102848 94215 91245 91354 93281
10236 93281 85891 79064 74879 73995 59971 58666 58071 57449 60791 62059 64655 81229 96100 83255
10222 83255 68607 64230 59017 53288 64352 63347 58036 53522 61894 79569 89243 87305 83937 79409
10208 79409 74256 61163 46188 43103 40979 51126 55037 65728 65430 52573 46572 32282 22565
10195 22565 29275 38199 48055 38577 31568 25021 27616 46406 50540 50667 42957 25639 18200 25974
10181 25974 35472 36778 36074 44361 46771 31597 19750 24011 24188 25091 31465 28994 25654 21761 7967
10166 7967 6002 19154 19688 20626 21719 12727 11504 31208 28604 20244 23782 42033 51124 40506
10152 40506 34590 39410 53265 60186 53999 43810 28938 28854 19500 13121 5690 10673 17499 28615
10138 28615 41604 31057 48010 72346 77707 76759 67142 54341 47874 36755 20941 22778 27538
10125 27538 28723 17616 14040 9542 2002 3247 10125 6878 4299 11080 3575 13886 16039 26585
10111 26585 40077 44869 61525 59942 55072 67678 94815 125926 132752 122479 110792 93949
10099 93949 76213 59803 49234 37762 43987 57089 65840 64945 63105 64387 95685 129726 153481
10086 153481 168180 192659 192636 169192 118650 85671 65440 49375 37948 30669 30698 26609 26437
10073 26437 25365 30219 27792 27747 37961 41760 50770 56015 71640 82807 84733 107445 138368 169158
10059 169158 191888 185056 169316 149298 123102 106102 77936 48502 34416 35470 47130 47659
10047 47659 40890 48803 56367 63588 63629 67696 97854 121732 153239 198172 220388 220299 196884 157866
10033 157866 113862 84324 76354 59560 48887 55123 65297 59305 43040 39897 37112 37086 37080 44939
10019 44939 75452 115006 117012 123112 126686 140121 142242 127938 103869 87026 74900 63139
10007 63139 57435 67697 63955 66305 51812 48358 53550 41394 31411 30758 34982 32323 37131 29719
9993 29719 31231 47975 66298 79271 77750 91749 87910 74309 71884 53661 45581 32606 29099
9980 29099 32418 22422 17910 23244 32401 17515 20909 30736 33270 49067 72416 73157 52026 34642
9966 34642 26214 25291 17343 15190 24136 26123 19781 17655 25397 34504 14497 -5670 -1140 10861
9952 10861 10850 2959 6404 13464 21080 6359 800 -12769 -17123 -8890 6963 6886 -8747 -25089
9938 -25089 -20235 -13413 -13338 -9427 -1229 -957 -1888 -769 7111 8460 4788 4367 19359 20449 12144 9091
9922 9091 2151 2616 -5969 -17613 -8189 -9659 -5067 3330 17251 17548 25992 39131 36687 24350
9908 24350 7493 4763 5505 7460 11166 5444 899 21045 35169 44725 29806 15022 3017
9895 3017 322 -8592 -7825 -19689 -14433 -2669 -5629 -5608 1350 3703 -10647 -9350 -1447 4917 4088
9880 4088 7385 4709 8304 13983 -6901 -19973 -12839 3713 11642 10812 16237 13659 2577 -8558
9866 -8558 -13862 -1367 9935 -96 -15789 -18024 -3719 1694 -6739 -7234 -14260 -19273 -7335 2031
9852 2031 -6638 -4102 9297 17532 8928 909 -6818 6090 -291 13579 4742 4417 14321 4639
9838 4639 -947 -7422 442 3514 11436 11791 -7491 -15866 -20288 -23241 -12220 -2763 -4194 -12012 -22463
9823 -22463 -24713 -28713 -29023 -18320 -18777 -16252 -18186 -16276 -12152 -23423 -19665 -12154 -19937 -12637 -20194
9808 -20194 -12269 -8683 -15293 -6855 -2343 -3787 -9578 4643 -3171 3728 16382 18232 1931 -1768
9794 -1768 -9339 -7227 -5194 -5839 5686 18310 8683 1680 8541 19538 8217 -10628 -20838 -14101
9780 -14101 709 1865 586 8161 -1669 -10240 -7567 -2905 -23219 -29650 -30197 -24164 -12342 1375
9766 1375 13411 -6977 -18168 -14196 4811 -5589 -17948 -1771 -4174 -10678 -20372 -25319 -12883
9753 -12883 -12413 -20645 -16079 -15176 -13411 -14855 -21454 -14167 2600 4891 -21297 -37451 -34674 -15283
9739 -15283 -583 14293 15619 3604 -2917 -2226 -2232 -1681 -4215 1436 7140 4342 17234 23407 20514
9724 20514 14429 9923 17124 32236 45517 29499 6080 -1882 7131 16333 9050 2488 94 7108
9710 7108 23437 26144 17168 7614 9624 9055 13402 5737 -2772 6493 12576 5695 2786 8306 11255
9695 11255 8225 6964 -1383 -9238 -12289 -7663 3985 7888 5603 12180 14506 15515 13918 22139
9681 22139 11369 157 1903 -12708 -11749 6907 -6458 -8566 5466 9106 15193 14113 24943
9668 24943 34729 45257 57928 56415 54496 48052 60383 63870 65167 73417 87303 87158 82467 56509
9654 56509 51188 54301 59765 68634 61811 54790 49632 44864 26150 23806 24316 13519 15274 30911
9640 30911 39757 34441 22199 9395 11274 13172 13088 18324 1474 -8207 -7225 -9771 -8510 -5824 8943
9625 8943 16184 19071 20685 14761 11811 -2473 -3878 8785 18681 21249 14716 13442 11659 8364
9611 8364 18241 18237 -3628 -9901 6931 15129 30235 36122 25874 23372 25782 26294 7783 1842 312
9596 312 7852 23105 22955 13492 4820 1237 37 -25 2238 -3507 -20785 -20097 -14628 -5756 11477
9581 11477 28457 45322 47781 47628 38617 39779 38372 36694 25645 1661 6922 12848 15299 18117
9567 18117 9347 805 21974 28016 29391 39784 43038 31910 27688 21980 14771 21414 17812 22015
9553 22015 26874 22733 26007 29843 22788 17687 -4522 -8610 -8610 -10605 -791 -2421 -2443 -896 4237 380
9537 380 7024 15713 26765 36092 35174 25188 29833 33330 49603 72885 82932 69160 48245 41585
9523 41585 26234 19285 23485 23487 26509 34052 14911 7415 -439 -7931 10644 24612 21910 12385
9509 12385 13856 19974 23796 29444 30843 11430 -6381 -1790 18563 17040 -3501 -22460 -26828
9496 -26828 -16289 -13989 -16286 -11475 -14956 -6695 11736 10530 -2534 -7324 -15867 -13647 -5453 9664
9482 9664 14143 23492 26121 15942 14411 20591 20368 31237 29601 6852 -3310 5783 12296 6239
9468 6239 -2013 -4253 7146 26455 26817 6413 -2263 1331 11348 16331 27267 32946 29624 18025
9454 18025 13199 16897 8311 11191 736 -559 2219 5944 25879 21019 14946 5161 2917 16988
9440 16988 27585 10612 6236 4945 10926 8386 -9322 -11154 -24646 -23241 -6431 1660 5217
9427 5217 9753 11076 10916 10411 9455 4881 9389 6694 -1909 -20846 -18335 -15400 -937 6913 2420
9412 2420 5978 8926 6107 -249 -13061 -25733 -12381 4843 3074 -14311 -34218 -22087 -17042
9399 -17042 -17106 -18195 -13133 -17646 -15345 -20075 7778 30423 19851 21645 12115 12978 -370 -8081
9385 -8081 417 2037 -4683 -9423 -13214 -18105 -24601 -25385 -18231 1786 11928 6352 22537 20887
9371 20887 10581 16385 17541 24429 27924 27716 24098 11421 -373 -5069 452 11616 15177 5705
9357 5705 15329 30762 38343 45507 57760 56541 60645 63401 75103 84983 74754 65935 50227 39103
9343 39103 36968 37162 17252 9063 23033 32011 38380 29812 8872 -5446 156 8265 10245 8755
9329 8755 13909 9311 6459 5605 7423 -4633 4799 11545 3350 -2584 173 267 16192 12824 -1216
9314 -1216 -15374 -16200 -13697 -16255 752 18482 16927 13090 17336 10728 780 10591 8582 5764
9300 5764 5478 4165 11619 19895 6722 3443 1396 11685 -561 354 12793 2792 4418 -991
9286 -991 8162 32156 26973 17775 17175 25118 33658 42997 49952 42019 37137 29547 39343 32699 18235
9271 18235 -1186 -13072 -6168 666 6999 11237 12629 19292 16061 15977 20566 19301 4024 -10515
9257 -10515 -8110 8462 12314 11324 13034 8153 -3005 13490 13308 3210 3506 11802 4827 3426
9243 3426 21323 24918 14353 7868 7132 12748 14003 -57 1838 4342 6287 23433 19610 13910
9229 13910 4189 9117 31148 36975 36961 36246 42343 45449 25326 9659 11126 7442 19722 24724
9215 24724 31630 38244 42475 39824 19512 7719 -4142 -153 -562 9481 17587 16345 16084 26839
9201 26839 16807 3348 10458 23171 33836 18151 16807 13879 11256 23925 40351 48907 40961
9188 40961 30516 28890 27578 23877 29190 30929 32410 26363 36098 35765 38316 49767 38989 38525
9174 38525 49465 38369 33079 25453 34797 38452 43087 46140 33976 22805 27764 26362 29796 30745
9160 30745 24690 14477 8499 12634 20171 39445 46162 45737 44539 43045 53707 43828 40554 51079
9146 51079 50723 49970 47077 41803 39803 47566 47452 53786 61995 71441 64312 60380 63633 60630 46404
9131 46404 50077 61422 76310 71902 67593 65689 63275 61523 50718 42019 52010 67499 64834 59497
9117 59497 57988 55006 58809 54806 58726 40535 32684 37115 33324 32780 43675 41306 38656 40706
9103 40706 49061 50509 57992 65446 69716 66765 67235 55123 54897 54140 45790 52340 44495 49496 51646
9088 51646 55382 62070 71320 71259 54939 35890 22643 28312 34643 30765 33944 45250 51174 60031
9074 60031 55785 64287 78023 77139 65081 63384 73721 48656 48806 53740 49295 47554 56051 58825
9060 58825 55509 51640 57537 59924 50746 64002 77862 84471 71978 62613 62598 54299 42562 48393
9046 48393 66758 79033 80194 68078 56473 51033 56831 62304 63549 52311 66762 66058 68914
9033 68914 73993 52929 47797 49744 44712 38014 54475 62161 52596 30380 36038 55621 50472 30907
9019 30907 18845 19202 36571 40773 53501 55562 58184 49572 36629 38678 43970 45021 45358 52594
9005 52594 66174 68932 67196 57076 49836 60454 64386 65069 64664 53707 53828 58001 54805 62938
8991 62938 60150 73892 69060 49960 45792 36182 31529 23657 44719 62743 59678 45669 46748
8978 46748 54957 63160 60609 38871 26850 33908 44240 47289 49413 62869 51522 54102 60755
8965 60755 62192 62581 64233 62876 67103 74914 86240 67914 64211 64736 60469 50853 60255 58961 48393
8950 48393 39271 41828 64628 64215 42307 47339 60341 62690 62192 67979 77772 91247 94664 96663
8936 96663 88289 69672 62189 79571 85994 75193 71477 77432 90011 81619 69103 65250 68666
8923 68666 69783 61603 64938 56691 75710 85639 83617 90556 97670 103100 99753 74907 70560 67113
8909 67113 79485 73021 74767 93725 94088 96365 102897 94196 87690 95172 100387 90526 64096 42003
8895 42003 54759 71000 75499 61531 70760 81161 73293 92603 102144 104598 113287 107034 94359
8882 94359 108975 113987 126327 141341 143841 138674 139771 156820 171518 187702 205078 213685 243511
8869 243511 289255 354195 436588 529521 684381 925024 1246574 1618421 1916657 2012142 1841795
8858 1841795 1506512 1165865 915266 727260 586168 495182 444335 410437 379800 365109
8848 365109 353989 336822 321370 302585 312884 312892 304534 293294 281751 268350 255775 252858 264389
8835 264389 273852 261296 259180 258558 266671 279969 289611 286732 283191 305597 350150 410719 470599
8822 470599 557053 685065 894578 1188953 1542563 1856747 2003205 1920602 1644031 1289735
8812 1289735 1007407 815729 687589 617303 567208 515063 477520 445939 409091 382779 362281
8801 362281 362000 357874 343628 327687 313637 298611 287068 274791 272649 283867 291322 295394 304213
8788 304213 303349 284822 259694 257067 251911 234039 217586 189017 182014 183755 196869 217405 217685
8775 217685 232538 230637 217860 208444 201085 192183 182650 188397 204645 215542 213443 214259 211765 209490
8761 209490 215807 224417 228468 237946 239996 226895 206578 183466 168615 179239 192846 202112 189245
8748 189245 194697 208742 211379 215799 231739 230009 216127 215817 203235 174808 154428 152807 159113
8735 159113 153001 160292 159881 164565 167596 181435 178246 168499 150162 128713 120511 125884 145909 161128
8721 161128 173476 189431 208306 228299 255120 281873 311735 322362 304626 271925 239941 207390
8709 207390 191291 186764 184045 203212 222571 216683 211300 206579 208086 221149 232998 235040 228694
8696 228694 211410 179402 155665 168667 179128 201854 215937 239214 246579 234044 241679 246748
8684 246748 247194 245412 250648 250844 243478 226004 227917 234780 246753 271800 288200 310884 336846
8671 336846 375062 392589 365226 310055 273097 248248 235515 222217 197130 178641 156899 156876
8659 156876 170395 184954 182009 173687 185843 202406 213720 218014 202851 187721 164643 168132
8647 168132 180871 204149 235784 252244 270139 269119 281504 286404 271866 246476 234643 229578
8635 229578 229719 246424 255802 264026 269024 263868 261065 232021 207805 198057 190998 195809 191406 162392
8621 162392 150923 145947 139755 145120 195420 263424 357876 424889 459613 469608 467937 463167 464763
8608 464763 469142 463725 437213 420038 408354 431395 462500 476236 473435 473413 475830 484466 498984
8595 498984 489999 473142 455277 421490 372698 311502 239185 207230 214175 212502 226833 279180
8583 279180 345347 378863 401306 434452 473628 539028 609078 644828 639992 650169 685650 724705
8571 724705 775392 818091 846290 832861 820588 800684 801354 838677 859738 879784 903128 933099
8559 933099 1006317 1077889 1109193 1099996 1047396 984146 929361 910851 917278 938903 946568 937246
8547 937246 925943 906130 870376 860388 886152 910664 952678 1024693 1077614 1097460 1085802 1097585
8535 1097585 1155635 1247957 1345288 1437005 1466931 1446501 1410063 1382509 1378547 1384883 1388081 1399659
8523 1399659 1422058 1472561 1529105 1594011 1677287 1785682 1884333 2007398 2153835 2308744 2427167
8512 2427167 2462654 2425339 2412612 2463115 2561374 2677480 2778466 2870172 2984476 3107687 3218146
8501 3218146 3350724 3546680 3742613 3942713 4175677 4523678 5103336 6014356 7170415
8492 7170415 8144683 8503219 8085891 7378011 6911727 6777956 6882505 7145646 7564472 8183422
8482 8183422 8984292 9984028 11196921 12682583 14440012 16470782 18748569 21150065 23473682
8473 23473682 25694549 28325787 32213122 38079802 46574136 58708563 76678681 104960982
8465 104960982 150820414 221311114 309050156 380576295 399408017 348980257 262594487
8458 262594487 190231823 142945051 113117186 93741350 80725723 71686381 65173691
8451 65173691 60426928 57190433 55215053 53688161 51686676 48715761 45320823 42241349
8443 42241349 39688762 37670777 36164038 35138259 34529282 34220821 34161435 34292330 34624315
8434 34624315 35191751 36038425 37181099 38506911 39857787 41126997 42653968 45199364
8426 45199364 49480611 56137339 65963806 80669951 103730085 141286256 200856973 281477737
8418 281477737 357880740 393291316 363857473 285776128 209600079 157182707 123981635
8411 123981635 102579546 88267429 78290196 70909287 65077828 60427537 56867381 54137254
8403 54137254 51739240 49212979 46398643 43601854 40979372 38579823 36557941 34904141
8395 34904141 33516515 32284385 31132290 30021505 28941856 27882278 26853687 25858574
8387 25858574 24897334 23967280 23063598 22223766 21452901 20739618 20091289 19489875 18923996
8378 18923996 18392263 17908489 17462318 17026310 16595956 16146666 15719612 15323512 14906214
8369 14906214 14492902 14141041 13788577 13421391 13057178 12701088 12368989 12037401 11717624
8360 11717624 11424624 11125059 10796383 10493973 10203714 9900202 9597612 9300100 9003256
8351 9003256 8723190 8451097 8191340 7963848 7784240 7652236 7546885 7440875 7324819 7182283
8341 7182283 7015878 6852676 6753548 6724829 6702618 6673619 6612421 6488525 6304234 6072752
8331 6072752 5815065 5597221 5431371 5290600 5165185 5046280 4902142 4739347 4571862 4395806
8321 4395806 4245301 4100865 3938810 3773136 3602420 3455043 3341581 3259022 3188379 3110125
8311 3110125 3024908 2912805 2825693 2770492 2762593 2755957 2740467 2698522 2658176 2617104 2570633 2543437
8299 2543437 2526919 2513873 2470303 2428374 2409580 2423694 2470628 2528219 2560180 2546632 2469726
8288 2469726 2395341 2292021 2195805 2127991 2070946 2027858 1989250 1943175 1884975 1828188 1785186
8277 1785186 1736265 1673239 1601059 1531602 1449128 1361409 1297580 1243221 1208290 1173803 1146370
8266 1146370 1124482 1088135 1091064 1130552 1175408 1186211 1162746 1121887 1073403 1029836 995932 976814
8254 976814 952890 931099 920854 900080 859746 822648 796308 799269 778600 734233 702855 682390
8242 682390 652195 640024 630424 643671 659908 679096 690420 698109 700506 690546 676922 686390 700734
8229 700734 710776 700865 702194 691861 687250 713387 739632 746754 757632 753779 745151 734797 719214
8216 719214 700479 669761 639976 608191 583365 577190 575180 574990 568844 561955 561753 549048 532019
8203 532019 536563 560409 591554 607371 613153 597327 576184 558387 550245 544561 535906 514843 508071
8190 508071 504175 495270 491876 486730 502866 512315 519394 502254 478269 469598 467311 451997 445414
8177 445414 450354 443109 428318 424123 429453 432624 438181 436361 424034 388816 367486 376924 382855
8164 382855 363060 351912 342561 333566 334172 367344 390430 392473 384628 373327 364453 364311 355588 344007
8150 344007 328728 305622 292507 290778 297363 293339 288456 278248 264334 258365 260196 262800 255392
8137 255392 250044 235858 218874 204845 189088 200275 196629 204025 202236 207555 208216 222445 235487
8124 235487 230756 208248 201190 185963 165652 146730 151233 140133 143484 157431 182543 191002 199006
8111 199006 205683 211867 202160 182826 166251 147546 151424 168017 164854 158716 153078 143541 135678
8098 135678 142759 151619 155915 168206 183500 197744 204576 208359 209454 186622 170099 170263 183435
8085 183435 182523 172520 165549 170124 177124 197004 208462 206608 220612 228329 225275 224794 214716 211024
8071 211024 218252 231185 243333 238751 260236 309269 344159 377828 447893 553143 710737 972552
8059 972552 1329036 1711424 2000527 2060017 1831752 1474706 1131140 895880 744132 646529
8049 646529 597011 546503 502099 464970 421191 380555 360022 359882 364728 349950 327951 303840
8037 303840 287232 286779 288511 311967 322792 332349 343190 328142 315020 309470 298739 305655 313080
8024 313080 334347 360758 374666 401815 446713 509508 591881 729908 955471 1268174 1621356
8013 1621356 1901553 2003054 1866082 1562363 1236080 968532 770415 640701 559487 509640
8003 509640 468130 410058 381854 379068 366506 365350 356556 349731 337544 320222 293189 273442
7991 273442 259578 260370 270261 270421 249587 234078 234832 230440 226777 219940 214775 196159 188604 201073
7977 201073 195718 175702 168769 152257 149708 152294 143446 144908 152183 145919 131410 120053 109115
7964 109115 100643 93096 87230 86219 92621 89813 88443 95338 89950 87199 90504 104844 97125 79114
7950 79114 70012 86011 103134 104947 72910 61171 68536 60977 50458 59685 67160 59081 43913
7937 43913 30452 35380 53795 39064 32714 35110 31729 29542 50217 57611 61223 60481 58634 54732
7923 54732 43039 52601 38880 33990 35877 27506 29873 33063 40667 33776 20954 21833 24842 23766
7909 23766 42273 48509 39721 52079 56270 45598 47431 44329 26142 21276 16258 3053 -5919
7896 -5919 4683 8031 -1085 -7219 -3131 6034 11562 14217 12411 18920 39343 46879 51102 50878 53207
7881 53207 42742 55358 66393 53471 35654 21175 34007 29219 22550 12262 11788 27736 38102
7868 38102 31874 23336 39119 42462 21441 16338 17784 21119 21783 21677 26610 35209 39529 37573 33376
7853 33376 15699 10996 13320 16392 22749 23207 24246 16179 5347 2083 7549 20635 23041 13171
7839 13171 9913 17294 25707 14241 3268 19278 28743 20854 14505 17774 13774 4920 -1785 3342
7825 3342 432 -11021 -21114 1482 10937 13757 19698 28804 24916 19508 11518 7030 17811 14983
7811 14983 1813 -10078 -18471 -19673 -15858 -11427 -11536 -15936 -20341 -22794 -22110 -22352 -13648 -14988 -17324
7796 -17324 -19489 -10040 -20964 -21814 -7710 -1692 -4737 2011 -10369 -1053 6181 -10153 -16473 -3578
7782 -3578 9878 18964 17332 16379 8828 6210 1459 1394 3570 12654 7904 -372 911 -6477 -13837
7767 -13837 272 8728 447 -13816 -9090 4659 9742 22463 18695 17817 16611 14506 13680 20181
7753 20181 14204 13417 3863 -518 550 3805 8771 -6571 -2013 6063 -10453 -16540 -10199 864
7739 864 -3864 -2270 -316 -2859 -13069 -14523 -29 -552 65 -2695 -6280 -12471 -481 5275 -2767
7724 -2767 -8766 1491 -2750 -98 13335 16358 1386 -7427 -1363 -1652 -12040 -15047 -27019 -23979
7710 -23979 -18527 -15078 -9194 -5561 -28217 -37097 -13045 -7396 -10775 -4356 8523 1906 2044 11581
7696 11581 7575 -3762 1239 3072 -871 -10269 -11046 -8430 -15659 -15123 -21782 -39772 -34321 -8152
7682 -8152 8854 13882 5385 -7682 -17889 -14446 -966 7412 3306 -5640 1203 11833 1433
7669 1433 -13378 -673 3474 3809 -2638 1718 6215 7985 2871 6366 12774 13243 16209 18735 13020
7654 13020 -4960 -11831 1266 6377 -2160 3097 4229 -2148 15561 21544 26296 27211 16198 9427
7640 9427 1097 -436 1464 -1039 3279 7317 13838 12022 10856 17882 19287 14542 5125 -2005 -15189
7625 -15189 -9308 -4711 -858 8579 4561 -1980 -15498 -34291 -16301 -7613 -9310 -8704 -4130 9840
7611 9840 16278 12715 9432 12068 10493 1098 -2546 -9928 728 12401 17471 15262 15673 13228 16319
7596 16319 24672 13888 7532 7320 -1582 -14133 132 9079 21538 18525 19702 2225 -12161
7583 -12161 -21370 -23866 -12251 -4818 -1030 8594 15335 13823 1429 -7808 -18477 -35269 -39445 -26731
7569 -26731 -30588 -22604 -17191 -16046 -881 -5233 -865 348 22146 48084 37433 28069 10917
7556 10917 -3270 -2643 -1008 4173 11910 29871 17681 4792 -4382 -8196 -9265 -12663 -4161 -1094
7542 -1094 908 11994 -2592 -15694 -27474 -31878 -39921 -40734 -42436 -43735 -31184 -15294 -3460
7529 -3460 -1249 11112 25776 17107 2788 4074 16451 13104 9947 5786 690 2254 4530 -607
7515 -607 -4886 -13169 1435 1808 -17579 -5152 2399 -13960 -13688 -8529 -8094 -1271 -2391 -13822 -14037
7500 -14037 -25532 -29466 -38600 -38011 -22585 -22325 -24871 -19822 -12476 1606 6374 12947 15510 5037
7486 5037 11228 16003 36359 36611 23233 30772 27665 17467 26705 20035 11329 6983 1588 1859 11717
7471 11717 7977 143 -11393 -11366 -3397 375 -334 9875 7330 324 -10633 -8759 -11088 -19175 -25476
7456 -25476 -27383 -17281 -18536 -29509 -17774 -5159 -2335 -5134 -11426 -14615 -8389 -1373 -2092 5457
7442 5457 1407 1043 -4877 -16656 -11332 -91 -2285 4876 4299 7881 -6953 -16947 -19297 -25790 -10480
7427 -10480 -7046 -5849 -10293 -11119 3438 8686 4927 11810 -7666 -22810 -9825 9285 6539 -14509
7413 -14509 -13903 -14044 -20592 -18270 -20631 -16716 -16332 -15671 -14396 -11501 -8404 -12818 -16268 -9009 -6169 -19769
7397 -19769 -23503 -20370 -29900 -17497 -851 -2842 1654 -7596 4867 8062 1981 1686 -2742 -6273
7383 -6273 9789 14886 2685 -7769 -6964 -5716 -5707 -13842 -4735 6368 -7027 -15261 -8955 -234 7823
7368 7823 -1099 -6731 -3879 6778 11720 10300 2852 -10249 -12002 -18564 -20779 -19498 -20151 -21486 -5372
7353 -5372 -1223 -866 -3604 -5237 -4653 -6172 3203 4916 -850 -8971 -7276 -7970 -13100 -19267 -13389 5866
7337 5866 7777 -298 -6826 -8778 9822 15061 7845 1627 11840 14834 -1073 -15858 -20651 -13861
7323 -13861 -12249 -537 5156 -3941 -7167 -3493 2379 -2306 -7292 -18305 -12470 -8081 -7680 -6758 -10
7308 -10 17712 10785 5843 12891 29365 31285 17216 -5668 -23994 -33901 -26652 -6619 8651 12351
7294 12351 8933 -1122 -13327 -18556 -14426 -22231 -12378 -4935 -2817 -10705 -8436 1389 16439 25565
7280 25565 27548 18986 4897 2404 5800 601 -10091 -23610 -10861 5009 22 5595 18854
7267 18854 11039 -4603 -21155 -23230 -10954 2214 1252 8756 14151 17247 3740 -6301 -15391
7254 -15391 -7864 -979 -4635 -1916 -12801 -12928 1406 741 -6808 -4161 82 -1351 -6355 -962 1105
7239 1105 2178 2772 5240 -6688 6161 -2758 7385 5951 -1427 -3302 2392 7633 4563 -11780
7225 -11780 -21694 -18344 -15287 -14745 -11087 -23712 -17518 -17595 -9671 774 -6098 21248 23793 11844
7211 11844 -1716 -10208 -5012 -2309 831 3005 -192 -1758 -13327 -12070 1891 247 -13338 -14097
7197 -14097 -11140 5119 24390 27710 8503 -7343 -16085 -5798 -6817 -429 16914 17178 433
7184 433 -5264 -4423 -8060 5069 7010 178 5643 12004 9902 18560 24749 38698 32618 32239 13317
7169 13317 -2306 -8632 -430 1200 2264 10842 16835 21881 19255 8600 4396 -5530 -14911 -12901
7155 -12901 -15708 -18796 -20462 -17580 -17501 -11368 -4224 -3272 934 -1007 -8959 -8017 1486 6954 5159 -9827
7139 -9827 -21198 -16945 -17218 -11515 -2526 -7223 -14426 -15212 -8773 1416 3762 9799 203 -6903 9546
7124 9546 15113 14175 5103 -11986 -10291 5286 2292 -8647 -24450 -23128 -14657 -7858 -25380 -33931
7110 -33931 -25338 -21836 -20327 -11416 -12291 -14362 -9519 -6987 -9695 -13315 -25524 -32987 -17199 -8011
7096 -8011 2097 12779 14087 -3652 -3183 -13224 -15292 -12817 -9610 5554 9650 14478 13267 15753
7082 15753 19497 9053 5073 3487 -892 -15259 -6678 2828 1487 5730 835 -9705 -16929 -23105
7068 -23105 -1916 11757 13463 10321 16176 -3896 -18119 -22265 -14636 -4877 5179 3188 9718
7055 9718 11672 -2732 -9911 -5981 -172 -129 -488 12824 24966 17820 4865 -203 6847 1629 -6891
7040 -6891 -6145 -8363 -4026 -3731 -8597 3552 14182 5589 2579 -8404 4757 9460 8091 14893
7026 14893 24924 16848 3790 -2291 -22690 -18524 -11150 -19525 -22498 -3250 348 -4355 -3515 -14531
7012 -14531 -21889 -36580 -20841 -17838 -32246 -34056 -20598 -8748 -15876 -18924 -16684 -30496 -25069
6999 -25069 -19588 -23336 -14827 -12433 -9913 -4452 343 6991 16615 15309 1325 -3843 13719 17260
6985 17260 23563 19696 -1203 4171 4801 5093 3548 -5634 -2533 12177 17446 2510 -9707 -22664
6971 -22664 -37153 -32181 -21691 -10444 10078 20458 8461 -8599 -7419 -11147 -9729 -14744 -20535
6958 -20535 -17921 -3187 16879 15346 3728 -9410 -8787 -3273 -1846 -1307 -4745 -22723 -19451 -10606
6944 -10606 -12930 -18759 -10373 7831 4579 6494 -1457 -9195 -7554 3460 -184 -2151 -4733 -677
6930 -677 9394 2870 6164 19547 26089 18586 10190 -5811 -17370 -27421 -29972 -30132 -26370 -22953
6916 -22953 -25135 -19460 -1571 -1854 -10371 2898 5956 1730 1945 7119 2463 -15739 -9096 -16710
6902 -16710 -26348 -14238 -7110 -6131 -16992 -36954 -31022 -15257 -17660 -20026 -10690 -12041 -4458 21466
6888 21466 38041 29424 12275 3162 788 2482 -2596 -10056 -949 11249 25888 12168 15715
6875 15715 19862 20031 19539 8333 -3741 437 1343 3152 -1431 -20792 -22050 -16410 -5856 8898
6861 8898 24100 24761 16844 -4345 -8518 -12278 -8334 -15941 -22599 -29639 -30015 -25802 -10588 -12294 -19790
6846 -19790 -17813 -13926 -301 11042 13079 -4188 -6611 8364 1325 -6054 -13129 -27983 -22424
6833 -22424 -28703 -26649 -6499 -14593 -20490 -7548 11364 14733 7498 -2719 -15832 -13450 -9313
6820 -9313 -7386 -4832 809 -1990 -4277 -9329 -13354 -92 3629 35 1167 -4010 -1785 4461 10349
6805 10349 11887 -153 -4948 -5281 14526 21009 3715 -2748 -7629 -2885 3363 1099 -7460 -1792
6791 -1792 8128 19902 20924 24095 19784 893 71 -2420 -12567 -4429 2508 17175 19061 13276
6777 13276 19707 20863 11609 13775 2201 -13325 -13867 -12149 -10734 -17620 -16652 -13202 -15293 -19646 -18485
6762 -18485 -11816 -16949 -16440 -3361 -12315 -17916 -63 3993 -7929 -20152 -10858 -705 3690 6293
6748 6293 -12482 -8500 -12970 -23929 -39656 -34532 -31332 -36304 -41386 -43899 -42520 -41573 -23567 -9650
6734 -9650 -10673 -14097 -13672 -13578 -7055 2341 -3343 -12335 -7557 -19526 -26299 -14627 -5953 -7630 -1118
6719 -1118 18664 19374 20438 5789 -7665 -12753 -1882 6971 14337 18470 3668 6030 21003 22677
6705 22677 16212 21028 27883 8255 9572 20053 15635 -946 -4219 8191 10115 9963 16814 13797
6691 13797 4122 11738 -459 4146 -4922 -20301 -23158 -14309 -1420 -6549 -18640 -22097 -14076 -5653
6677 -5653 -6226 -1462 -1370 6593 28064 24133 -1957 -12520 4421 -1728 -5765 -5915 -8019 416 5760
6662 5760 9344 13966 3846 -4155 -7615 -14580 -7958 -5060 -8782 -10265 -11232 -16338 -10123 -12687 -12148
6647 -12148 -2187 7274 2859 -10816 -15597 -11736 -7538 -12248 -20557 -23371 -9790 13087 16745 12257
6633 12257 -335 -17488 -16973 -10685 -16411 -8428 3429 11595 12989 21885 10340 4853 13014 -1535
6619 -1535 -14798 -14420 -19953 -7851 -11493 851 14315 7848 -5021 -4100 -3776 -46 14648 14170
6605 14170 3570 6480 12661 20036 18482 9647 3006 -2873 -951 8390 4851 5558 8131 12616 31141
6590 31141 38281 41596 43407 30334 13799 9588 17426 29877 27957 12112 -51 -9662 -22401
6577 -22401 -16755 -25397 -26568 -24295 -10430 -3730 -5594 -11100 -14945 -2987 -3416 -8783 -18616 -18488 -5775
6562 -5775 3039 5297 5099 9201 2306 -2591 14211 17156 846 12046 8459 874 -12040 -28413
6548 -28413 -39402 -28094 -6980 -16550 -26691 -27899 -19002 -21952 -27742 -22154 -27460 -27016 -30129 -28496
6534 -28496 -30356 -37905 -41876 -25955 -9494 443 7521 3176 697 5884 13491 9161 -14580 -16523
6520 -16523 -8088 -5400 5348 8103 1731 -3274 -2644 -4258 -2388 1123 2908 -9074 -22517 -21180
6506 -21180 -11265 -13825 -15235 3088 19436 17958 9404 6706 -1713 -14425 -9622 -9764 -15500 -13125
6492 -13125 -2508 -2636 -4603 -13391 -30217 -30654 -14906 -11779 -15562 -24731 -15315 -6763 5309 1799
6478 1799 9779 3617 -9280 -6939 10240 22932 11590 5949 -1784 -8686 -7526 -12379 -12468 -7836
6464 -7836 2375 1172 -10576 -15472 -21457 -9181 -5850 -7732 -2230 4441 -10098 -3855 12226 4014
6450 4014 2600 3195 1740 12064 8664 -3725 -7415 -3533 7793 17103 15458 4310 1489 -3246
6436 -3246 7896 8923 -4443 -18696 -19304 -34688 -38315 -23860 -12819 -3414 -5510 18213 22596
6423 22596 19425 20747 9153 67 3422 5106 1107 -2604 7515 22107 18181 11033 11059 12855
6409 12855 3230 -564 3867 -4073 4316 16480 14707 13843 20327 25889 29241 30782 18411 4648
6395 4648 -11636 -2465 8665 5934 16797 30088 24740 20053 9139 6936 9137 17328 23375 5783
6381 5783 3865 -188 -2096 -9428 -6867 -12515 -24796 -23639 -12943 -7050 -7870 -8443 -8133 -11344 -28077
6366 -28077 -40044 -47654 -40596 -36650 -26634 -23189 -9511 3507 -4877 -10064 -10424 173 -10613
6353 -10613 -19270 -6077 447 2723 10776 5134 11350 13809 8460 7888 -4015 -13509 -16173 -1592
6339 -1592 2144 -512 -3303 -7042 -620 5908 728 -5082 -6074 -14441 -4470 3671 -3727 4264 6048
6324 6048 -1807 1338 16396 11530 -1394 -29379 -33952 -21315 -10807 -5724 -10361 -7899 -14254 -12004
6310 -12004 -4419 8200 7690 2149 -6864 -7519 9553 18224 13782 3348 -2595 -334 1828 -13451
6296 -13451 -21539 -21188 -27620 -20065 -11248 -4066 -2647 6455 13041 11862 6077 14011 20266 17133 15790
6281 15790 12770 24981 27049 17145 -4984 -10339 -8625 -2053 -8245 -1697 -9693 -10629 4416 16267
6267 16267 28820 26336 21727 11058 1404 4150 13502 18237 4522 6443 6847 2763 9644 13267
6253 13267 5469 2613 -1464 7967 21356 16969 5905 11297 175 -22430 -23101 -13036 -376
6240 -376 -1785 -87 -3614 -1434 -7323 -10965 -10549 -7140 8905 17111 20453 21014 17594 2202 -1185
6225 -1185 477 -490 -5416 6839 10158 -2007 -7535 -4320 5401 8079 -6346 -13958 -7873 -1519
6211 -1519 -807 3517 -2211 -5133 682 4138 572 -10667 -12751 3223 5870 6285 -1377 4765 13604
6196 13604 -5169 -824 -4352 -9747 -15664 -7658 -692 1964 12286 19677 17548 1222 -5219 -8887
6182 -8887 -15527 -3636 5198 4114 21047 14307 7565 6025 3836 -1047 -5124 -10090 4662 19972
6168 19972 13030 25256 24982 17260 4394 12074 13669 21428 18294 10483 15556 5292 2867 4714
6154 4714 2449 -3983 -2505 -8281 -10622 -14670 -15116 3285 10074 -4495 -6537 1623 3358 1555 -891
6139 -891 1747 97 -9386 -10902 -10573 -14664 -27555 -32009 -31221 -29177 -18311 -14758 -18703 -21677 -20964
6124 -20964 -20341 -10584 -18737 -10757 724 -3939 -9502 -17657 -20953 -17410 -1706 8341 8700 5072
6110 5072 15596 11256 -7190 -15578 -6682 -4223 -4310 -1976 4463 209 -534 -3175 -12594 -13561 8724
6095 8724 16804 8605 16949 22592 3650 877 -2976 -7350 -1996 -7639 -3987 442 -8357 -17519 -10641
6080 -10641 -6529 -2317 2681 4123 -3477 -807 3421 -5996 -11483 -2074 5137 3140 17410 7593
6066 7593 -5046 -6828 -3428 -4655 7754 5918 -6392 638 7526 11320 -13055 -17754 -9071 -6062
6052 -6062 942 3416 3105 210 -10546 -11093 1092 7848 11031 3941 -14002 -14603 -10867 -4891 -15225
6037 -15225 -23898 -19024 -11476 -1559 -4398 -9400 -10462 2019 6254 -6663 3305 10726 9445 14656
6023 14656 18386 10152 -7966 -9104 -8165 -1004 10360 14313 11658 13896 14195 2075 5097 831
6009 831 -6503 -52 -6592 -7777 -7512 -9432 -7704 858 -14225 -16245 -23688 -22939 -15466 -2901 -16911
5994 -16911 -23873 -12036 162 -3016 3298 -6176 -20878 -26478 -21410 -5760 8602 12643 23794
5981 23794 14450 8986 11909 2699 11913 13691 718 -12449 -13878 -13503 -12992 -15069 -1459 -6605
5967 -6605 -26254 -23374 -14293 -11059 -13638 -23337 -11177 4912 8706 376 -7629 859 5861 -121
5953 -121 -3989 245 -1972 6037 -2245 -3746 -12064 -15506 -13276 1318 8182 10008 3986 -7617 -16668
5938 -16668 -11261 -21991 -24909 -7900 3564 903 -11434 -3477 13411 17317 10602 2895 4459
5925 4459 3748 18482 26597 16832 -2567 368 -1627 -8603 -11991 -4139 2529 9029 2363 -7724
5911 -7724 12216 16044 13305 22680 18625 -5017 -4342 1598 -1718 8775 23976 23068 12575 -1733
5897 -1733 763 11246 4117 -1521 705 2016 -2117 -4849 -9131 -1472 -5690 -14530 -16743 -21838 -11008
5882 -11008 -10085 5743 19814 10789 4592 -1071 8179 10778 18705 24072 24232 9196 1202 -7699
5868 -7699 -27670 -34940 -26925 -22330 -12265 -13406 -20312 -23096 -13134 1267 -1296 -7176 -10425 6286
5854 6286 15780 8027 5223 11295 11589 -1475 -2786 -1336 -5979 -15609 -17922 -5301 8624 5289
5840 5289 10976 9494 12562 5018 3615 -30 -4298 -3279 13595 12741 12048 8494 11631 6275 -1728
5825 -1728 7453 11726 3009 -10617 -11773 -4269 -490 -1420 9232 5157 10183 21182 40404 28311
5811 28311 1982 -547 -8427 -21653 -25349 -14774 4069 10560 6081 -5498 -12706 -6199 1106
5798 1106 3685 8444 10377 3447 977 -5863 -10053 -9033 -3743 -8590 -849 -792 -9161 -22839 -25786
5783 -25786 -17765 -12301 -10460 -2441 9970 24052 21763 3208 -9876 -7468 -13782 -6419 -4922 -13306
5769 -13306 -14431 -10740 -10589 -1575 9371 -880 -5581 -4708 1960 -1177 -11672 2068 3054 -7648
5755 -7648 -12807 -30639 -21307 2923 13689 9595 -1800 -3485 1163 699 7965 4453 -2110 -21253
5741 -21253 -26036 -25560 -32372 -19498 -3961 1854 8957 4985 -8385 -11028 -8680 1702 230 11226
5727 11226 10487 3363 7055 19185 15343 7140 -505 -1679 611 -9720 -4070 11944 5279 -5072
5713 -5072 6956 6954 -5045 -13522 -28727 -40576 -25615 -7988 1057 -1296 1171 158 -15981 -18422
5699 -18422 -20072 -12356 -1658 419 -8031 -7045 -854 5719 27462 22713 7127 4567 9346 -182
5685 -182 -1398 1905 3983 5254 -801 1860 2609 2996 3299 207 335 3777 -1029 -14871 -10283 -5370
5669 -5370 -1659 -7 6468 12083 8195 -2494 8044 2396 -3753 -2416 -3125 -21791 -24686 -21372
5655 -21372 -7572 255 3027 5710 -429 1010 -10276 -15374 -6613 -1987 -11263 -9518 -6787 3686
5641 3686 16274 20459 18892 17173 9637 11455 9854 14725 20138 16508 15596 18630 17736 15270 12957
5626 12957 17213 21577 4618 -5067 1839 730 -10465 -9776 -6558 -3543 -5503 -18112 -15344 -14844
5612 -14844 -8576 -419 9881 8480 -9539 -15378 -1745 -605 -20835 -16585 666 1710 14061
5599 14061 8817 -8345 -14990 -25536 -26189 -11408 1623 -1059 1630 -8986 -5196 -4975 -4132 2095
5585 2095 -1335 -10383 -3965 10158 14382 18773 5111 -9980 2428 8198 -3615 -6213 -3817 -4890
5571 -4890 2737 12647 26567 28549 15922 142 -17810 -11722 -9785 -12840 -25244 -25830 -16613 3148
5557 3148 12700 11017 11543 19589 8358 -2445 -14544 -16643 -18895 -26109 -6320 7842 6744 -1059
5543 -1059 -12554 -16873 -14353 -18874 -1430 3520 6966 -161 -8910 -7160 -3046 -3462 -11104 -8640 -2886
5528 -2886 -7368 527 9086 19117 18200 524 -11712 -7148 2065 4283 11651 1843 -14936 -16052
5514 -16052 -6316 -17352 -15136 1242 13774 14691 5514 7245 23414 19384 10956 8656 4111 3344
5500 3344 6374 13362 18703 8847 -7885 -8327 -9100 141 -1919 -3162 16227 16390 10155 3095 -6078
5485 -6078 -9060 834 13780 1620 -6827 -12748 -7537 13143 31870 15841 757 -3701 -2482
5472 -2482 -3674 6530 34433 38378 25547 16117 17588 28463 24273 26339 26460 14979 9474 17414
5458 17414 17902 9921 1045 -4351 -104 837 -5707 -19906 -22127 -16580 -3998 -7667 -1512 4636 -2856
5443 -2856 5623 3031 -6119 -12399 -12386 -10074 2498 -2669 -10772 -9656 -5422 -3819 9251 22004 26901
5428 26901 23676 16722 7138 -249 198 -5898 -5364 -6482 3014 -5041 -11738 2562 14725 -10148
5414 -10148 -22558 -23819 -10756 -1651 8892 1362 -2019 -5694 8670 4643 6433 16112 19431 17270
5400 17270 27185 22626 1723 -6478 -3184 -3116 -17409 -15404 -7055 -1126 9957 10387 1790 4001 -1329
5385 -1329 -5870 -2404 -8554 -5080 500 -8697 -8545 119 2312 -4166 -2001 -7571 -4168 -9900 -6677
5370 -6677 6000 8657 -1272 -2885 -6118 -8494 -1724 964 1455 -2928 -1038 6191 5963 -6017 -8208
5355 -8208 -7860 -11785 -1021 5414 6295 2034 1547 6712 424 -12288 -21970 1716 9086 7544 -506
5340 -506 3705 6075 12222 14395 14073 2108 3156 13631 6454 -8164 1145 10465 4974 -12474
5326 -12474 -3154 15704 22065 3131 2298 8141 14240 13262 3642 -9652 -18118 -24277 -28439 -16244
5312 -16244 -10514 -6150 4626 -1432 -6160 775 12855 2870 -5385 3463 18488 -19 -11505
5299 -11505 -11566 -10041 -12250 -10253 -3740 7927 14213 8534 6624 6189 6256 7521 14427 12155 6952 2273
5283 2273 -6327 -5172 4246 19873 24020 3306 -7782 9144 8830 -5636 -5768 -9255 -5000 969
5269 969 -6846 -21199 -12568 -4222 -12933 -9058 -2278 -144 5429 3186 3508 13586 15914 -1509 -23637
5254 -23637 -23079 -7349 -2563 4412 6768 -1843 -9684 -726 3947 7235 3315 1211 3825 -2848 -6812
5239 -6812 6637 11069 194 -5253 -2121 -563 6643 8409 4528 -5558 -2389 4423 2280 -355
5225 -355 8829 7126 22134 20214 13676 -1427 -9494 -15676 -21809 -15408 -5263 8146 -929 -16378
5211 -16378 -22134 -14170 -9326 -11697 -8509 9151 19633 10067 10788 11668 25212 23718 18789 13748
5197 13748 -1137 -15127 -21645 -20185 -4909 1133 -2336 -11057 -8992 9423 10161 9588 -1840 -6059
5183 -6059 6277 12513 5448 -2915 -5518 -994 6644 -862 -2828 7090 -9481 -14026 -10272 -5022
5169 -5022 -19332 -12238 -13430 -21311 -6083 273 5352 24763 28496 15871 13273 10774 10806 12359
5155 12359 9059 323 4581 2848 -5219 -11610 -5199 -6924 1455 15350 10399 13142 6905 -8519
5141 -8519 -18132 -3894 -2876 -11302 -18570 -23457 -23361 -10219 8122 20115 19979 7555 8954 15099
5127 15099 20720 233 -5579 -13449 -26337 -14085 -11996 -12095 -17998 -15765 -1703 11844 7163 5419
5113 5419 198 -10446 -14417 -28876 -42430 -38176 -24131 -25117 -24746 -12663 -8531 -4504 -1345 -1694
5099 -1694 -2280 -9607 -22987 -24814 -14700 -10215 -16369 -5877 -1275 137 1113 -4725 443 -2329 -1109
5084 -1109 -10392 -13094 -1944 717 -2917 3479 4486 -703 -6934 -4522 -13881 -11334 5265 9293
5070 9293 2677 -563 2220 1882 -825 -5180 -1878 5015 6484 1492 11101 16997 7481 12453 4953
5055 4953 10075 20575 23073 16805 13391 5196 -4050 -5487 -5976 -9331 -13358 -20465 -25583 -11714 -2780
5040 -2780 831 -7387 -20294 -16684 -22849 -20396 -6071 -10859 -13009 -2527 -4500 1942 -4195 -8816
5026 -8816 -4395 -13307 -17261 -11988 -9187 -13731 -18545 -16554 -17052 -6691 7969 11350 -5111 -8464
5012 -8464 -4457 4923 7402 6193 20003 28261 27283 12198 1524 -8956 -2614 12798 4520 -7326
4998 -7326 -2242 -3317 -2760 540 6836 3378 -7928 -10789 2092 6194 -5286 -5571 7243 16623
4984 16623 -6821 -17837 -7620 4326 8878 5555 16635 977 -10321 -13447 -28299 -38583
4972 -38583 -22080 -15070 -21955 -29108 -13458 3741 3547 10384 12544 -2370 -16289 -16593 1119 6370
4958 6370 14582 8105 1553 8148 11668 18970 22335 19765 22529 14902 1730 -688 2660 4836 2101
4943 2101 10422 15683 3719 -12550 -20913 -5226 11951 19308 22451 14671 3115 9430 13723 10507
4929 10507 10761 13263 13021 12850 12675 13000 14981 6915 513 5709 7900 10028 7360 8446 26521 30287
4913 30287 13567 -4184 -20985 -9971 3575 19 947 -5624 -8390 -6550 -6780 -15902 -19250 -2554
4899 -2554 11943 14252 3993 -4931 -2756 -4022 526 -4943 -4153 -11472 -12345 2282 9810 13199 13255
4884 13255 17846 25690 9251 -7304 -4236 11685 13069 6784 7863 8715 18962 14532 13818 15304
4870 15304 16896 20115 15564 14038 18467 8129 2011 -4883 -4448 -2278 12683 19906 20835 24526 18421
4855 18421 13888 5647 2263 10407 5228 1585 980 734 11297 25386 22350 5601 7773 5224
4841 5224 4426 -9088 -14745 -12631 -17634 -13717 -4856 1744 -7126 -12360 -8726 -1373 492 -11524 -9970
4826 -9970 -7418 1213 2314 -2123 -2918 1955 4562 5295 8947 13024 -378 -15289 -14775 -7436 7038
4811 7038 2325 -11499 -21517 -15261 -2842 2226 -6631 -3377 -2792 -2990 -4568 -3188 -1741 -9342 -3112
4796 -3112 -2291 3720 6986 -9150 -12426 -1092 2490 -2019 -20323 -21883 -9219 4220 6565 9156
4782 9156 22653 16728 5233 9653 3549 -644 -1863 -2154 1691 5451 13163 9897 -2054 1131
4768 1131 1645 4034 11863 18705 20174 19199 7244 5211 2352 -5125 -7075 -12237 -6368 -13301 -18014
4753 -18014 -6229 -6345 -9813 3249 10967 17583 8435 -9967 -10066 -893 -632 3867 3014 8719 15987
4738 15987 20377 9331 533 2951 13394 11924 17713 22646 19776 4861 6712 1213 7841 14590
4724 14590 21460 9816 -2032 -4104 -7327 -13982 -5999 -878 24616 32436 33936 25218 16660 7160
4710 7160 -5348 -20944 -29715 -26294 -19151 -12857 -10932 2257 -4623 -4081 3772 8876 1555 -499
4696 -499 -714 -11264 -12172 -9903 -9100 6052 14704 -378 -2042 -2407 -9310 -316 10231 8683 10872
4681 10872 9431 2044 -3117 1215 -1249 131 -2010 -5626 -3584 -3127 -9328 -15563 -8548 2333 1711
4666 1711 8069 11329 -8021 -16533 -12963 -13742 -12048 -5445 -6151 4284 -11818 6337 5415 -12713
4652 -12713 -13225 -9098 -13244 -5473 13515 14550 8734 342 2396 7666 2411 1803 16418 21943 14767
4637 14767 -16637 -28194 -23063 3498 14959 20181 25058 26625 9833 4499 -7355 -8169 13041
4624 13041 17105 26692 19278 13322 13942 12102 12338 2600 8165 -2539 -18872 -14260 2822 13431
4610 13431 17206 8288 10795 10810 5274 13808 13582 14503 24936 22173 23148 7423 6284 11022 10545 13917
4594 13917 10729 -8596 -6224 -6602 -11280 -7312 -9416 -7984 -1300 -13899 -10283 -6236 19173 31422
4580 31422 24281 19033 8587 4993 16088 9886 -2089 2841 8296 8580 8624 1050 -1960 983 2659
4565 2659 -5329 -8444 -3959 -12363 -3683 11482 5529 -1193 11383 21888 21440 17322 -6272 -18731
4551 -18731 -4724 -5755 -4522 -4665 7298 14805 16533 6798 -6499 -17780 -15405 3628 7095 -12939
4537 -12939 -13108 -9160 -19426 -14556 -7229 -10681 -13727 -12403 -6739 3089 6146 -150 -2113 -1399 -11580
4522 -11580 -14345 -8656 -7052 3660 6266 1936 942 -12712 -11232 -6179 8571 8217 13529 24375
4508 24375 9345 -959 -7983 -5534 -3662 7995 13558 4059 11672 25355 23781 10528 8586
4495 8586 8367 8070 -3072 -1156 -12532 -18019 -12119 1532 204 -4222 -2713 750 -6855 -1680 -10904
4480 -10904 4394 11972 6186 -7261 -14852 -7273 -4036 1900 12850 1774 -13313 -17089 -25108
4467 -25108 -27761 -13878 -1145 -1360 3084 4216 3859 -12396 -23348 -9759 2922 -2294 -3111 -7081
4453 -7081 3740 7526 398 -1347 1031 -7608 -4943 18672 22532 6138 9332 18318 15667 8463
4439 8463 8211 3752 1916 4790 -10365 -18601 -11438 -6772 1250 16860 22023 23520 25387 23142 21215
4424 21215 24776 16563 -1364 -2352 -579 5511 8404 10983 7970 4376 -6465 -9994 925 11632
4410 11632 -4510 -21259 -18920 -12861 -5265 17235 20780 11794 9896 3734 1054 -921 -2475 5950
4396 5950 8625 5819 12230 13236 -995 -5679 1844 1818 -1773 -9920 -1304 6140 7183 13787 15970
4381 15970 13674 7859 -6261 -13774 -13187 -8276 15862 17569 4351 10264 19806 25556 5173 -21973
4367 -21973 -19364 -8232 1497 -4895 -12569 -11190 -4398 -9657 -2016 2908 35 -2413 -6181 -754
4353 -754 3637 -1397 -1578 -4042 10043 11984 12447 21194 19733 23021 11772 14972 28982 30011 13425
4338 13425 11826 15110 14251 11514 4208 -4379 -12926 -2398 8244 16307 14807 10915 23819 21710
4324 21710 9794 -804 -376 -13841 -22790 -13884 -9159 -5270 7090 -1208 -3021 1273 9704 16857
4310 16857 22103 12132 -8342 -23428 -15571 5620 2015 -3779 -23645 -23889 -14749 11225 32794
4297 32794 26298 12469 4098 2732 10051 8615 6361 11797 14804 15203 12632 10043 22118 14612
4283 14612 8627 20227 28632 17779 9442 10831 6570 9263 25388 16092 1255 -1877 19671
4270 19671 21580 32400 37062 30862 24748 12344 23292 50005 31747 15219 10689 -3967 -14409
4257 -14409 -16771 -11042 6927 2643 -9732 -8857 -827 14550 12263 -6335 -10862 -9319 -15219 -7230
4243 -7230 3271 4008 18537 31004 31815 26868 20160 8999 -802 -4348 -875 -4925 -9490 -10920
4229 -10920 -664 6019 960 -16938 -13671 -25385 -38222 -28115 -24705 -27553 -26042 -24293 -23947 -25181
4215 -25181 -11537 -5301 -1369 2916 -677 2321 3316 6252 3549 9003 18424 24217 23761 18580 6213
4200 6213 2968 6333 -4211 -17185 -17837 -11048 -7274 -12136 -12939 -9896 -838 -3419 -2037 5533 -7305
4185 -7305 -3581 4351 509 6996 -2965 -14184 -6277 -5852 -3227 4102 3081 4846 469 -10625 -12236
4170 -12236 -3961 1467 3815 7410 17746 28533 28984 21158 6419 -226 -4440 1672 -2656 2874
4156 2874 -4088 -14054 -13385 -444 1564 439 6449 -4042 -6194 3710 6114 3093 7288 4992 -627
4141 -627 4289 4181 21917 31200 10780 5667 2840 11177 4633 -7623 -9855 395 16351 16827
4127 16827 19555 12016 2018 -4877 -7352 -578 -4355 5742 2024 -9721 -14411 -13355 426 22933
4113 22933 21064 18955 9962 -7858 -18984 -20037 -17902 -6604 -1120 7049 4136 12703 21574 361
4099 361 -9870 -3750 11599 25202 23781 12255 2 -5785 -3775 -5567 -2948 -12161 -14187 -11221
4085 -11221 -8306 -8808 -8610 2334 16295 15131 4158 -1344 -13258 -6898 -3055 -7372 320 -2512
4071 -2512 -5091 -10343 -14826 -14713 -16007 -20040 -12366 1210 10172 9340 7341 7452 -1073 -6949 -11377
4056 -11377 -4711 -5217 -3560 -203 -11215 -10204 -10171 -5137 15185 23357 4595 -4891 9506 14868
4042 14868 14037 8507 380 -6788 -4372 11941 27153 23871 3631 -8678 -14610 -11668 1251 -1712
4028 -1712 -6143 -16396 -13124 -3611 2566 1608 -9285 -4060 5336 5404 3854 7283 -1627 -5899 -13853
4013 -13853 -407 5704 12334 19310 18356 4846 -5159 -9984 -12561 7390 23481 11626 437
4000 437 -14864 -17329 -1262 10003 5513 -7617 -14501 -14313 -2879 -3115 -697 2864 759 -42 3381
3985 3381 12622 3172 953 478 -3303 -5359 1102 -1280 5975 13158 -3703 -6785 4802 17334
3971 17334 11830 5934 8032 20204 28817 13360 5136 5457 15210 18882 10162 9530 -7839 -19255
3957 -19255 -11544 6126 -3449 -7431 -18025 -15022 -12921 -7940 3224 28179 27732 14405 6095 -381
3943 -381 -2651 826 9315 14878 5878 -14115 -22893 -14204 -19822 -14497 -16275 -13547 -1435 8382 1140
3928 1140 -14939 -9384 -4872 373 1065 -4216 -152 -4135 2138 9805 17932 5718 -1375 2356 14524
3913 14524 17910 14970 20731 11981 5765 1733 -5766 -3311 -4518 12289 10269 15514 8315 1177
3899 1177 -1441 -7131 -1956 2621 13419 16988 19446 25017 32581 12749 4850 16833 32408 39739
3885 39739 35326 18293 5252 712 7403 7977 3869 -2598 698 -572 15021 32644 14028 9923
3871 9923 7335 14248 16012 21953 20634 12680 3808 6841 -1997 -5246 -12336 -13530 -5704 -12165 -19721
3856 -19721 -31819 -32541 -22948 -17932 -2403 -2685 -707 13635 34708 47342 40388 17314 1877
3843 1877 4487 2041 -144 3641 13637 19511 22012 17789 21972 15783 19154 24784 32661 18398 9922
3828 9922 2206 8335 3215 -2469 887 14551 16181 18992 16430 9002 -453 9936 17243 6779
3814 6779 -8428 -8077 -11985 -14469 -12403 15159 21421 7785 9598 13531 10691 9220 7147 6566 -172
3799 -172 8850 14257 18070 7314 6139 7200 -3465 4154 22472 14655 -6749 -4474 -3472 8657
3785 8657 7398 -4390 -10208 -5084 6469 12675 -2320 -10189 6875 9347 10111 18530 12197 25159
3771 25159 27476 19962 15921 10651 -10731 -18027 667 -1879 -10332 -6887 10355 19510 7331 -12294
3757 -12294 -11703 -4915 -4359 -690 13888 27612 30794 21320 14804 15622 26111 17143 -580 -6501
3743 -6501 -6617 8091 1493 -6592 -9853 -7037 -16665 -7330 10157 -5207 -20039 -3693 2628 -6475
3729 -6475 -12866 -12444 -8186 4718 10570 22761 12116 -7194 -32048 -30700 -22181 6671 -1783 -9411
3715 -9411 326 -1922 -3198 -19303 -21844 -14358 -19737 -10478 -5476 3253 4814 15542 23230 7389
3701 7389 -1374 1731 -2401 -6929 -5071 -11320 -8809 -16157 -19547 -21253 -21023 -9504 7338 6131 -1318
3686 -1318 12984 19392 8080 -5880 4902 20190 25790 20637 19460 29270 20954 10074 5741
3673 5741 -2546 -6811 -6673 -6374 -8218 -7088 -2619 -5252 -9874 -17218 -19564 -11297 -5619 -12684 -12609 10366
3657 10366 19617 1746 -5919 -8315 -7707 -1797 1040 5813 5452 8647 7912 16704 31859 31268 15501
3642 15501 10259 16240 17518 12602 5572 -1297 2140 -8582 -8765 -6471 -8220 1586 6393 387 -1458
3627 -1458 8868 5715 9616 4547 -433 -12636 -13872 -9414 10100 23856 31637 33883 25144 13613
3613 13613 1286 -1406 1861 -4678 -11395 -6653 -3140 3811 15270 9612 -546 -8019 -10008 -15716
3599 -15716 -17174 -11186 -6696 6858 8013 8838 20148 14341 15283 12090 13462 16683 14733 -1897
3585 -1897 702 6525 11630 14081 5654 -5300 -2264 1713 -3456 -5631 -9343 4727 -365 3017
3571 3017 4424 -132 -84 549 273 7221 15710 17248 17786 10698 9387 8942 13643 2203 -2139 5259
3555 5259 13665 -7573 -10780 -598 22313 25188 18828 19406 21697 20809 8748 6243 17182 10602
3541 10602 6787 12474 21676 21256 1104 1579 5660 10613 17216 11056 11210 2987 -12593 -9460 -4770
3526 -4770 -4069 -11544 -12028 -4258 -6911 -2885 -6630 -2035 1060 2271 2132 -5107 -8917 -5224 2187 10477
3510 10477 -1134 -5620 11437 13123 22256 24199 22004 39746 36036 33964 46267 37717 22516
3497 22516 12218 878 -2940 -833 -8577 -20482 -8417 6882 3823 89 -2965 3160 5018
3484 5018 -4467 -21154 -19637 -11793 -3384 -2055 2417 3139 14012 17526 12999 11018 26819 26321 12543
3469 12543 14538 8062 -9505 -15828 -17201 -904 8411 9710 25470 30405 28957 25648 15679 9828
3455 9828 7900 10244 6708 11542 17069 7976 9196 15925 22640 26381 17975 10182 4002 14036 16345
3440 16345 20124 29785 27351 28198 17172 15401 9483 5662 148 -10584 -2262 16774 25861 27430
3426 27430 29349 8728 -3309 294 -6826 -14905 -17474 -14381 -24688 -30833 -21927 -8202 7705
3413 7705 16457 10283 16253 -5012 -20756 -23088 -20198 -4541 6601 1873 4366 3953 4785 -1002
3399 -1002 -11940 -2535 2095 8494 8112 9752 19537 10495 1121 9979 12030 5884 -2463 -3578 7310
3384 7310 8510 4733 2512 -8295 -4592 3860 -1667 -4095 -8218 -6658 -1281 6885 4204 -4502 3226
3369 3226 -6084 2348 3199 536 17336 13345 16790 21796 31012 35404 23508 16804 10756 -7714
3355 -7714 -9101 8493 20764 10486 1048 -3623 17351 25400 21797 14762 9285 3848 5184 11888
3341 11888 18053 27462 28689 14422 2978 -8949 -3730 2237 -1346 3612 -1829 -17129 -7501 -1376
3327 -1376 1427 11652 3496 5111 14879 13564 16866 8490 -2109 4841 14299 9945 3117 9296
3313 9296 16691 12898 19367 30955 31471 38772 22093 12218 -1864 965 13897 7859 7207 6078
3299 6078 12902 6994 12706 11905 16763 9348 1443 -91 -5140 -15683 5372 7853 4071 -6653
3285 -6653 -15097 -7436 -2360 7755 10105 12487 14397 26228 24241 13617 4800 11982 27549 23803
3271 23803 14947 6560 8952 9459 5326 -1346 4600 3922 7585 1529 -10666 -26506 -14383 6573
3257 6573 10177 -7134 -13107 -6948 -2378 -1667 -4468 -6982 -8432 16528 30868 19357 2208 -3153
3243 -3153 6445 -1057 -10985 -1605 -3622 2642 9213 20677 33980 34314 31591 30985 16886 3622
3229 3622 18167 19491 7666 7897 7993 10051 8935 19194 21108 22864 20702 9829 9886 14244 12898
3214 12898 9350 3675 13167 14318 15594 9723 -3043 -13225 7903 11205 -4823 -1212 2268 7132
3200 7132 3950 11195 7990 -6155 -5990 191 14694 24906 19813 5968 4265 13507 18084 8878
3186 8878 13054 19537 12331 16253 12962 11963 9720 -8656 -16520 -2298 -10671 -17604 -15924 -18213 -21291
3171 -21291 -14854 -3837 11869 17641 17763 18666 17406 14886 -4121 -12411 -12220 -18447 -13390 -8747 -12438
3156 -12438 -5576 -1847 -7315 -8716 7301 16865 -5855 3242 11146 13159 10401 7822 6173 6348
3142 6348 11499 8283 11452 3867 1185 -2505 -16399 -19432 -6387 5487 4906 2484 6219 11881
3128 11881 3811 10005 10999 14969 7982 2548 5493 6856 5897 3574 11780 19161 7364 5601 20035
3113 20035 36978 22759 211 549 6743 -9199 -8375 -9004 -8586 -16827 -17361 2351 8123 8550 2558
3098 2558 4264 -4927 -10311 -15283 -749 4092 5406 4953 7528 7658 -5159 -4056 -15780 -21221 -16350
3083 -16350 -13678 -15205 -5770 12043 23196 27984 29307 26244 13745 -13288 -12201 2387 -2989
3070 -2989 -18821 -17986 -11369 -19011 -37709 -38663 -18304 6684 22226 8980 -12099 -10222 -993 -404
3056 -404 4913 -5455 -14078 -5224 6598 420 193 107 -8804 -2473 7781 4336 7324 -746 -8134
3041 -8134 -1652 -2293 3981 6810 5345 2612 3853 -2756 -1171 11777 11548 -2395 -17371 -17769 -14532
3026 -14532 -13938 -8431 -2052 -8892 -4839 -10486 -7690 -9383 -17366 -10762 -1242 13182 8175 -10182
3012 -10182 -16301 -2583 -2393 -2254 -8917 -22960 -5641 17237 5592 -5702 -12859 -27923 -20270
2999 -20270 4621 19577 21469 4271 -2336 -8907 117 5450 6641 -4193 -20211 -16974 -15270
2986 -15270 -20665 -15963 -824 4949 17807 26499 11951 7642 3875 8168 17662 18940 11056 15398
2972 15398 15414 18311 18878 11500 11639 16499 11237 -7864 -6417 7989 12553 3047 -17561 -11013 1834
2957 1834 10813 20766 27120 14760 10416 7138 19 -2351 -1084 16866 29208 34369 27048 11185
2943 11185 6066 21131 26807 27118 2705 -12685 -24049 -23335 -13104 2237 3847 7836 24660
2930 24660 23102 15761 14619 11907 2742 -4342 -15012 -6621 -17731 -14384 -12234 -9479 7649 24072
2916 24072 24475 9535 11447 15065 26839 35183 19758 -1408 5224 5206 2049 11481 14799 26568
2902 26568 28998 18440 1817 -3926 -3158 -2554 9336 17823 21052 13088 -10267 -16125 -15375 -10135
2888 -10135 2107 -2555 -10280 -9401 -10490 -4667 -1751 9548 -1017 2024 7292 14021 6255 -11683
2874 -11683 -11019 1431 16792 12701 1733 12892 3891 -1332 -3521 5269 16913 25047 14910
2861 14910 -3257 -14827 1578 15243 28724 24151 16752 14049 -6830 -8489 -2057 5244 3951
2848 3951 9278 9422 11772 20281 15815 567 1009 -7702 -4457 16318 19301 15212 3345 -20715
2834 -20715 -28567 -17336 -9036 -24290 -21036 -11135 2640 4090 5423 7843 693 10369 20517 26470
2820 26470 15728 2100 -1247 -5932 -5294 -10646 -13930 6080 9303 16807 16224 6568 8213 18150
2806 18150 14017 16268 8559 6470 10868 14729 8841 7783 11460 848 -16473 -19809 -32005 -27934
2792 -27934 -5230 6014 -4336 -8538 -2215 -6797 -4376 14295 16823 23157 23578 19828 19337 5480
2778 5480 4894 15680 6536 1195 -3381 -19724 -12633 -8643 -89 5148 9836 10641 16808 12197 5650
2763 5650 3568 12042 13175 4526 769 1148 17656 13024 -1920 8007 21538 39638 35144 22620
2749 22620 11855 8010 21000 23183 22639 31287 23946 18378 4603 6555 2257 3819 9903 9751
2735 9751 -3246 -9276 -13310 -22042 -17796 -6787 3903 6018 217 -4718 -4503 -2360 5147 15188
2721 15188 706 -9409 -15182 -20177 -19399 -16732 -2730 -1186 -718 -6078 -16049 -11693 1014 3968
2707 3968 2822 -1538 -17076 -18928 -13168 -2305 -2982 -12790 -17644 27 8665 2247 2448 -1108 -1746
2692 -1746 -752 -2155 -2246 -1434 7831 6200 3265 7099 12894 13602 5987 -3768 -3057 8275 20641 31879
2676 31879 24903 13648 19073 28599 10050 1787 2405 12640 17410 20287 19039 16483 16700 19841
2662 19841 12651 9596 9756 11068 10816 21762 6076 -6655 -10843 -9321 -5338 -10029 -2380 4970
2648 4970 -536 11715 20038 18899 27264 25507 19393 2421 3396 6354 5044 8400 15975 6058 -2722
2633 -2722 -809 -7923 -16825 -27955 -18112 4826 -5010 -8116 280 8457 16014 21525 15143 9177
2619 9177 11041 10795 8264 21761 31439 30926 20073 14394 9666 10443 -6250 8089 14909 5821 -3846
2604 -3846 2462 -8395 -14241 -5905 1558 -3937 -5834 406 -11471 -14123 391 22425 30293 19325
2590 19325 4215 14278 9417 -8194 -773 15273 21934 2138 -8061 -12558 -12620 -234 2797
2577 2797 11265 18581 10366 3185 -6803 -15827 -15815 -21790 -11624 3975 4321 10255 14659 17471 -1341
2562 -1341 -7860 -15164 -16973 -10830 -15518 -10481 -8338 -8344 -9482 -13657 -2496 27470 16237 -4221 -2563
2547 -2563 8721 12203 13464 9508 7641 5142 -1000 -1603 2682 6184 -5152 -5374 2539 13511 10860
2532 10860 12711 11632 5183 6348 6699 14848 10941 -2996 -2026 6578 9539 23031 20702 11316 4868
2517 4868 -891 4 8766 16029 24277 18058 5338 -9037 -21975 -35064 -26437 -19556 -27974 -32326
2503 -32326 -34947 -22084 -7863 -3612 -4350 -3605 -5198 5922 12579 7577 1540 -1422 9115 15292
2489 15292 -5998 4759 15714 1768 -11843 -28766 -19456 -15908 -12710 -2831 -5172 -22491 -34462
2476 -34462 -27742 -11893 1103 705 1116 -9832 -18727 -10399 -12314 -12206 -12602 -5156 1734 -5068 -1858
2461 -1858 11905 16486 15455 7185 -4217 -7616 -429 3585 2514 -2922 -12417 -4942 -6144 -4790
2447 -4790 -5980 -2367 -6713 -7273 -14661 -15562 -13175 -4519 -2597 15360 18345 1663 278 350 8153
2432 8153 17792 12869 3310 -16625 -18636 -580 17770 11222 6929 -5586 -3797 6679 4294 -126
2418 -126 -1741 -3705 8781 11250 22992 36272 29053 17802 22030 15756 21057 30034 25994 20464
2404 20464 16560 20595 9892 2624 594 -779 2257 -2750 -4604 5322 4544 2042 13894 4999
2390 4999 -2383 -4991 -9147 -10631 -4867 4968 12882 -1317 -6339 9618 7128 7151 16229 12238 -1623
2375 -1623 -15051 -15814 -3975 1625 -1085 6535 9678 8295 -2172 -11771 -12355 -6016 -8053 -6032 643
2360 643 2005 4514 -2418 1874 3949 2078 802 -2041 -9218 -13864 -7511 -751 12395 22305 13097
2345 13097 -2104 -9343 -13447 -107 14784 19877 15243 12102 -3659 -7785 -1208 -7355 -9949 4751
2331 4751 -6761 -19537 -21779 -23037 -17461 -2337 2098 -450 -9626 -9340 -2260 4173 4577 -10612
2317 -10612 -18307 -2470 -7947 -3976 3433 3437 2663 3160 -3453 -3796 3675 -6145 -18553 -5502 -5287 56
2301 56 15499 11786 20092 12561 6392 8285 9527 -31 -8071 -5611 -7988 -10730 2188 -4396 -3125
2286 -3125 2637 11902 -4219 -21263 -24142 -28058 -30707 -30369 -20200 -6920 -15749 -9805 -11082 3103
2272 3103 1275 -7086 -9601 6316 3157 -10629 7122 10666 1169 -8447 -11779 -6381 -11707 -22511
2258 -22511 -20875 -11000 -15755 -13016 5413 19727 11618 -4949 -13345 -25141 -21052 -11604 -6401 -9115
2244 -9115 -15064 -26323 -14500 3434 18351 -145 1291 8656 15065 16090 11005 4351 21476
2231 21476 11857 14163 14396 17228 16690 6159 8660 3230 -3914 -8289 -6419 -2276 1538 -6526 -13003
2216 -13003 -12428 -3342 4576 1729 -4204 1609 -14019 -13757 -9707 -676 -17431 -4254 1848 -4206
2202 -4206 -7483 2405 11949 21164 16804 19149 13202 14892 14370 15447 4146 1618 3973 4877 3617
2187 3617 13678 12966 -8161 -10157 -5078 -5057 -4629 -2685 -1496 -986 2378 5885 2758 -871 -5733 4742
2171 4742 6539 -2189 -15271 -27749 -35540 -24943 -21797 -24891 3015 19433 5698 -3076 -11833
2158 -11833 -12031 -2047 9921 9592 -5378 -1145 3492 13152 6433 -1190 10113 6350 269 -2645
2144 -2645 3305 5056 4514 -143 7959 -159 -12787 -11587 3617 19333 23844 18855 3557 -3707
2130 -3707 -3290 8515 27699 10173 1385 -2026 -16473 -15750 -1582 10647 1435 -3782 2222 791
2116 791 -5872 10 7931 6023 -1119 -7154 -23450 -22689 -23153 -31258 -23988 -17274 -8039 1323 -2493
2101 -2493 -5281 -7965 -5466 -4864 2981 3153 -2279 -2448 10474 9919 12315 5851 -1065 -1199 -2472 5173
2085 5173 11566 2942 -12079 -8877 7229 12557 21578 24498 15835 7654 -2655 -8775 -14481 -22748
2071 -22748 -29394 -20693 2505 6572 2181 4363 -4746 -7005 -1702 -10279 -13015 -6823 624 885 -10805
2056 -10805 -8293 2974 -2561 -13199 -9690 1136 9813 16182 20353 15534 6380 -16145 -4045
2043 -4045 13613 14340 -3104 -19221 -12916 -7150 -4833 -4594 -15460 -6513 -6234 -8423 -6494 -299 1663
2028 1663 13641 7297 -1833 376 2996 14698 23560 23161 19025 14440 8985 7271 1165 -9762
2014 -9762 -6100 -543 -810 -3535 -5685 -2580 3388 -733 -9664 -17839 -18176 -14742 -9897 701 8554
1999 8554 6654 -2093 -8069 3714 -648 -328 -3832 -14713 -12412 8394 13495 22708 31609 20011
1985 20011 7599 10728 9511 15375 18750 12248 -679 -12866 -6837 -8310 -5932 7169 1466 1443
1971 1443 7915 12067 17705 10716 17775 9340 -128 -6587 -7497 3668 5052 -7724 -1503 -719 -12495
1956 -12495 -27921 -20045 -12695 1686 -6326 -12233 -1166 4962 7933 12199 18222 18623 22543 17787
1942 17787 14603 2134 -7374 2763 6340 1864 -1381 2715 14874 21600 5426 2807 443 5768
1928 5768 747 -17462 -37056 -40975 -16379 3772 15374 -9638 -30361 -33138 -22043 -11717 -11495
1915 -11495 -8667 -3730 -7240 -6138 4714 11177 16150 11535 17802 27199 26802 22053 12481 7039 4200
1900 4200 -4802 -18712 -24757 -15610 -9538 -10997 447 8853 6518 4875 -564 -22573 -15369 -7825
1886 -7825 -10420 -8866 -4870 2840 -1925 -9187 1526 8500 20294 23453 9656 -6060 -5697 17063
1872 17063 20702 4673 -535 12289 31947 12933 -14835 -19555 -15015 -5498 4010 14301 7372
1859 7372 -7086 -19872 -30451 -4123 5522 5340 7838 6967 13905 12439 9206 -1245 -8492 -2951
1845 -2951 14375 21117 12099 10699 23675 22748 12294 11827 9263 -5900 -10774 1805 -723 -3897
1831 -3897 -1987 14730 17238 15471 -927 -5131 -8285 -963 2369 -7514 -4581 -1694 -11538 -14041
1817 -14041 1437 840 -5073 -16661 -19548 -15759 -10306 -7819 -7748 -6323 -9920 -14696 -7724 -3356 3501
1802 3501 -609 -2656 -12072 -11571 -4406 4560 12583 6767 -10243 -13718 -11591 -3430 2722 -4442 3665
1787 3665 6388 665 1658 -9617 -11096 -941 4367 -2272 -11039 -1325 -12054 -29538 -34720 -15372
1773 -15372 -11494 -21505 -15170 12991 31041 16925 2128 8124 -3635 -10511 -10261 -10313 -7313 4434
1759 4434 7831 9300 10959 -11674 -18969 -27380 -17561 -14104 -2791 -9138 -4127 5741 9103 -6403
1745 -6403 -12323 -10372 1917 7903 143 -335 -13791 -12877 10518 5497 -11099 -558 16358 5821
1731 5821 -17260 -14998 -4023 -2581 -2992 745 -6968 -8138 820 -5404 -17997 -22139 -18450 -15467
1717 -15467 -10720 4242 -4739 -3783 9396 13774 -4565 -25058 -13254 -8204 -5733 -10786 -13120 -8134
1703 -8134 -9286 -10531 3553 13538 34623 21882 1350 2349 -9397 -23649 -24330 -10221 -12694 -12712
1689 -12712 -7707 -6093 -1622 16724 15951 5462 6345 4824 -5726 -2416 7167 5614 2081 11246
1675 11246 26430 22569 13751 14743 13205 -1819 -7575 -8566 -10245 -1122 -5799 -6393 -6584 -12120 -7071
1660 -7071 9013 7389 7412 -134 -3263 -10386 -11726 -15500 -26281 -28956 -8973 1060 -2944 -3119 4367
1645 4367 -3474 10728 9708 -12055 -17008 -9653 -19068 -25279 -21480 -496 5841 -5545 -8954 -5813
1631 -5813 -3295 -17215 -18748 -21640 -22064 -11031 6099 9538 1643 590 4976 -7792 -17177 5636
1617 5636 -5042 -17237 -20040 -13384 -1590 -6081 -9001 -3143 9375 11540 20708 33564 35388 26664
1603 26664 22698 4040 -11022 -11785 -3030 11543 13725 4219 -5463 -15951 -4804 -2164 -5885 -11260
1589 -11260 86 11765 4515 -1037 1037 11313 11690 8221 -1079 285 147 4579 -2026 -6701
1575 -6701 -764 -4021 -13148 -16863 -13949 -14812 -11328 -2572 689 -888 13079 17714 12656 2528 -6376
1560 -6376 -1328 4955 14960 20872 14795 -2492 3618 14234 16928 14275 1452 6822 6326 12875
1546 12875 14829 997 -2711 6254 -1507 -2458 -8036 -5036 -10724 -18927 -15351 -17928 -19055 -12250 -25802
1531 -25802 -37216 -27794 -20710 -1635 13608 8375 4364 5684 5260 3297 -5897 -4405 -4357 -8607 -10877
1516 -10877 -15573 -10750 -174 21803 25264 25551 28591 28678 33600 27530 17597 16406 13414 226 -15312
1501 -15312 -17584 -21359 -14232 -19868 -18591 -9098 9 -1124 3074 15266 7826 -7186 -6957 -12456
1487 -12456 -13860 -11049 -2619 -11280 -25081 -23091 -16193 -9925 -8809 -3936 -12058 -16427 -1980 6195
1473 6195 9607 -4549 -3065 8058 -911 -9975 -7775 -5198 3018 7017 2094 7500 16776 15082
1459 15082 11086 15650 24265 24903 23145 14782 939 2648 -14222 -18018 -18756 -13673 -10091 -7848 2534
1444 2534 7317 5632 -8443 -8547 -9587 -9444 -948 15609 8476 3959 3769 -7024 -3513 -5779 -3243
1429 -3243 -2363 -11180 -14464 -23510 -10221 -4583 -5800 2480 10855 5582 -7044 -10022 -10814 -11297 6706
1414 6706 5723 -504 3507 3013 -710 693 5957 -3528 190 7922 -1239 -6896 -10212 -270 -7079
1399 -7079 -32332 -40805 -30088 -5063 16362 24703 26290 20439 13585 10872 15750 4504 3755 14951
1385 14951 14726 14868 22269 4357 3048 5362 9793 6156 9265 -4413 -16176 -35083 -43664 -41811
1371 -41811 -20177 -7680 -12485 -20646 -19114 -17003 -9952 -3888 -8804 -233 2866 -6369 -3462 4606
1357 4606 7942 3547 -376 -12652 -15945 -16595 -4136 -28551 -25963 -10539 -5140 3628 2262 209
1343 209 -8661 -6412 -10717 -12085 -28868 -34117 -32202 -26757 -15715 -15141 -12512 -5016 -4684 -11824 -7881
1328 -7881 -614 5830 3450 20 -2040 -2671 -12362 -21979 -7249 -5357 -15495 -10688 -661 9720
1314 9720 -7357 -34157 -40251 -27432 -19062 -27107 -26244 -16251 -13692 -9205 8643 26159 37385 19922
1300 19922 6524 -1633 13434 15846 7045 -16430 -26965 -24415 -11397 -8278 -16023 -15299 -18922 -25365
1286 -25365 -24099 -25650 -13003 -11832 -15665 -13455 -14575 -4805 -9766 -13499 -6116 -12312 -13023 -32590
1272 -32590 -24870 -18837 -8566 1669 -5798 -3200 -633 4457 13581 8702 -601 -659 -8546 -16601 -14358
1257 -14358 -3049 14215 6216 4191 -4106 -14045 -11831 -18994 -11351 -12420 -18116 -9136 -963 3247
1243 3247 824 -10112 -13490 -15393 -23785 -32303 -8557 12426 12448 12320 523 -4176 -3611 -10458 -14364
1228 -14364 -11943 -5396 -737 -7148 -25907 -15892 -5472 -2808 3063 -8798 -9704 -10724 -8509 -20747
1214 -20747 -21439 -15620 -11430 -8644 5715 17196 16563 1623 -4468 -14343 -21354 -12201 -7412 -16050
1200 -16050 -36827 -38790 -19153 -2131 -11540 -17805 -18187 -5723 -2854 8604 22539 26040 19129
1187 19129 31007 28308 28441 34108 27314 29763 10027 -524 -4870 -6200 -3489 -10071 -11371 -9850
1173 -9850 -12653 -14572 -28685 -46660 -44914 -26603 -22659 -26485 -15027 -5723 -10629 -6228 -9281 -8687
1159 -8687 -10965 -9480 -4132 -6858 1359 12844 17325 13662 7883 7014 -2268 1160 17785 5500
1145 5500 6534 17020 16233 15544 7869 -1946 1634 2559 3358 5250 7308 13305 4247 7229 3495 1622
1129 1622 1943 3633 10716 16079 -153 -11944 -6326 -3070 -14968 -32597 -37697 -10221 -848 1981
1115 1981 3098 -7115 -9005 -18417 -24464 -23878 -16165 -4413 -9576 -4362 12762 17392 6050 4326
1101 4326 14358 6265 2037 12735 15411 6443 -2315 -9966 -4875 -6774 -6505 -7011 -10426 -15583 -16824
1086 -16824 -29124 -19146 -5286 -12962 -19984 -19797 -10723 -10255 -6339 -14952 -10248 -7892 362 -2766 -1607
1071 -1607 -5837 -13983 -4428 986 -3482 -15369 -4146 823 -7516 -3746 6692 -2763 -24104 -25352
1057 -25352 -16562 -6622 3256 12421 18400 7042 6634 18065 22089 11678 -5576 -18346 -3728
1044 -3728 6217 -4359 -423 12231 18037 13963 15739 16485 3052 7634 2118 -3611 -7636 -5066
1030 -5066 -487 -8234 -10712 -4576 -5029 -12284 -15900 -8302 9120 11549 -4978 -19962 -15324 -9739
1016 -9739 -18195 -13753 -15076 -6501 -5857 -16664 -19633 -17896 -16904 -7006 1593 -10049 -17362 -19694 -18979
1001 -18979 -15308 -23314 -26642 -13056 -11593 -6488 518 5461 8518 -4468 -9563 -10045 -10549 -11900 -12117
986 -12117 -10832 -12315 -7644 5726 17509 22223 7676 -3579 -10731 -8139 90 -5358 8361 10280
972 10280 9006 -2696 -7051 -964 -296 3938 -8883 -19227 -12538 -17650 -18136 -16870 -23083 -17672 -1549
957 -1549 6248 10550 22029 9605 -3185 11075 13529 -1532 -7615 -11528 -1823 14151 7957 2918
943 2918 4917 -16004 -28953 -14755 3376 -12826 -5711 -15849 -33203 -12126 9615 1289 -5974
930 -5974 205 -6376 -5751 18159 25337 28785 28404 17811 8198 -5593 -18110 -26108 -40685 -34071
916 -34071 -24098 -16432 -27096 -43154 -26713 -16054 -11985 -10945 -9596 -20955 -19968 -24867 -9532 -3552
902 -3552 2282 10548 11498 11560 13224 9738 -2008 -17062 -11772 2566 1195 -3120 3817 6706 12416
887 12416 -2436 -14971 -19914 -6043 -6252 -13833 -7682 -8798 -15687 -13253 -5952 -5216 -1172 -13763
873 -13763 -23764 -9217 -384 -10492 -26578 -26159 -15636 -10329 -14890 -6815 -2035 -1418 -13315 -21196
859 -21196 -25167 -26434 -28482 -17123 6001 9447 6463 7079 -2847 -11776 -7035 -6521 -24149 -41414
845 -41414 -28642 -14155 -3973 -2555 -6792 4068 -7140 -31318 -38850 -21524 -24887 -28587 -21254
832 -21254 -4893 14412 31866 35358 32377 16703 -5018 -13433 -18243 -25404 -23162 -18188 -10345 -21327
818 -21327 -14138 -3031 3633 4179 -5712 4005 15819 18981 23398 2529 -3881 910 -2519 10582
804 10582 16627 10786 16136 28855 26456 23469 23056 25881 31367 23598 12757 12139 9646 -10070 -25045
789 -25045 -30690 -39368 -34100 -21694 -22178 -23299 3682 15530 14558 15687 3717 -4969 -6905 -12075
775 -12075 -5334 2778 9791 5616 -10329 -4925 5647 8799 2662 -6069 1510 11653 12921 14593
761 14593 12032 -2377 -2238 5967 2656 5263 6796 -5392 -13850 -4447 -4477 -21596 -25963 -13812 -553
746 -553 -2070 697 -8342 -10931 -1944 -1115 -3670 428 4802 5539 6789 18890 17867 14086 304
731 304 1234 4112 -7088 -16207 -29104 -30314 -32665 -30386 -12031 -5000 -8888 -15402 -19817 -17808 -13822
716 -13822 -11440 -7115 -23691 -27452 -23216 -15416 -8506 2688 4634 7661 14912 12911 1793 3425
702 3425 2921 -1512 -1996 6882 12351 12006 12550 9172 1526 113 -4967 -15582 -2450 18528 12846
687 12846 4751 13060 32551 22237 -758 -4719 -5057 -11489 -14247 -16103 -9849 -12577 -5905 -6381 -6897
672 -6897 -7023 -4558 2833 1868 -9381 -17776 -9416 -2729 -7501 -10612 -4848 2017 7228 19343 18690
657 18690 15542 15814 13084 4794 4552 -17798 -13085 14010 13542 -1762 2321 685 -10355 -9234 -4846
642 -4846 8623 20447 26088 35916 32640 22960 20281 81 -5026 -6885 -13195 -12512 -13199 -6606 -201
627 -201 -108 8122 3598 144 3790 16515 29612 22233 23128 20014 9523 1435 6337 8848 6529
612 6529 906 -904 -4079 1788 10820 9336 6914 2953 10070 7919 3447 10977 15631 16257 15094
597 15094 20367 18795 -5080 -12007 -14593 -5336 10326 8613 3067 2006 -6324 -13491 2823 20239
583 20239 28004 18911 13819 7216 6931 4040 10598 12018 6101 -3926 4450 -3381 -4885 -10977 -23088
568 -23088 -18525 -14530 -14655 -6779 11568 314 -17422 -14063 -14149 -24707 -22684 -19242 -15404 -25337 -13027
553 -13027 -2449 8067 2050 7667 -4656 -5262 -481 -3143 -8856 -5802 -2095 -2067 -4264 -8757 -11145
538 -11145 -4866 -7536 -1427 207 -1286 -6226 5575 -2376 -14373 -10396 -8133 1164 -7204 303
524 303 13485 12960 16577 15504 14124 1419 -1363 -6629 -5377 -5646 6771 15509 16684 9244 1321
509 1321 -277 -9251 -12740 -16364 -13733 -9414 -5072 -1876 1844 8537 8484 2671 7415 11398 -4926
494 -4926 -3087 11198 -1506 -9652 -11766 4568 4711 -3339 -934 9934 11676 9290 5969 864
480 864 -6051 -12591 -11480 2874 12902 6386 7158 9955 7612 14010 12154 4338 -4254 -6559 -1611
465 -1611 -7758 -14525 -17188 -5394 -2387 -9922 -229 3902 7484 13675 10509 7530 -56 1914 7813
450 7813 7152 12416 16092 1950 -18056 -26910 -21406 -19573 -19779 -18559 -15637 -16309 -15292 -13510 -10926
435 -10926 -9955 -15097 -8558 6443 14787 18812 6365 9275 6549 2314 18717 23844 9860 -573
421 -573 -291 5301 -6496 -21550 -22726 -19168 -24774 -19448 -5668 4640 2616 -2684 -4088 -5561 -3027
406 -3027 -4284 -9861 -17564 -4644 236 474 11811 27823 23485 10340 3349 5218 12351 14076
392 14076 7404 335 -2940 11056 13073 15232 9032 -5665 -4738 -13288 -18337 -13174 -5904 -17750
378 -17750 -28666 -20775 -9117 1230 -2952 2406 13407 18267 10537 4651 11034 25641 29731 24662
364 24662 10692 -9062 1048 6133 7278 5143 -8656 -21566 -20254 -12057 -9469 -10505 -16351 -18465
350 -18465 -28488 -34628 -24601 -26433 -18723 -16076 -17385 -14843 -22331 -21272 -25674 -25031 -25631 -14457 -3395
335 -3395 5672 3321 1463 1660 6214 -2208 -8904 -16054 -19623 -13649 -9833 -13717 -4010 2747 -2189
320 -2189 -13051 -17098 -11546 -12575 -17058 -20631 -28795 -34260 -17162 -3408 -7675 -6661 2797 -1125
306 -1125 -11276 -20784 -20431 -8937 -5912 2274 16789 24104 19881 14426 2070 8909 16925 6109
292 6109 6919 -6294 -11786 -9187 -3938 -50 3377 -65 -3631 837 -3321 944 3547 -1672 -16589
277 -16589 -24844 -10532 -3707 -1698 -1672 -1411 -4610 -9564 -2820 10557 2755 -358 -2749 -9220 712
262 712 9619 7301 7389 -7426 -5764 -2164 1778 668 -3460 -8100 993 3262 -7406 687 7669
247 7669 7501 9775 13482 10691 4678 540 763 -1463 3573 -573 -8831 -2915 7904 8465 10849 3502
231 3502 -6358 -5566 -2621 -2709 341 4464 2212 3416 5055 -1867 -7603 -4057 3433 2244 1700 -2689
215 -2689 -191 -826 -4620 5283 9173 9795 11226 19555 20156 14067 7232 593 -1152 -5244 -6448 -8956
199 -8956 -4255 1484 7251 11464 -2145 2231 -4452 -12909 -7744 -5873 -3460 2328 5404 13434 17023
184 17023 18056 9910 13665 5254 3501 -1260 2929 8967 -3299 -2109 9744 6964 136 5953
170 5953 5717 10414 3664 2926 4763 1022 3722 5260 2350 -635 -4190 -6365 -14143 -18347 -15309 -18299
154 -18299 -8672 -2787 3148 -6557 -20381 -30960 -30264 -12292 -9466 -11299 -6067 -9078 -6307 -5744 -18347
139 -18347 -24726 -23208 -18416 -18255 -11418 -142 -4038 -5364 5323 746 -2640 23 -10407 -11999
125 -11999 -18503 -23075 -15119 -6995 -5524 -1523 -5376 -5281 -4915 -6321 3824 5690 2021 33 -2081
110 -2081 -2700 1065 1141 -1976 -2342 -4070 -7562 -12471 -15091 -12286 -5264 -2763 2694 10083 15199 -43
94 -43 -20636 -31613 -36840 -30702 -16096 -11962 -7357 -14609 -14617 -7958 -14664 -21911 -16839 -9675 -3357 -9574
78 -9574 -9896 -6657 -5675 -5563 1310 -916 1347 8444 4274 4760 3247 -4024 -10257 -10343 -5713 -4554 -2366
61 -2366 3517 2189 -1695 -2941 719 -16930 -21329 -9175 -7784 1976 6577 6844 2060 -1026 -3083
46 -3083 -12260 -14644 -19420 -10740 -3019 -5768 -3442 -4236 -11620 -17366 -10132 120 -26 -3754 -2509 6796
30 6796 4021 1336 768 4674 1698 7030 9492 174 56 -5133 -6467 -4825 -1777 4640 1522 -1939
14 -1939 3611 4880 4023 -3816 -11366 -6014 -944 -9913 -13834 -11958 -14359 -12219 -4073 518
0E18
$$ Imaginary data points
##PAGE= N=2
##DATA TABLE= (X++(I..I)), XYDATA
32767 44613 50489 58689 57678 55973 56928 61226 61882 55920 51111 47426 42130 57773 58230 47906 40736
32752 40736 49624 57131 58785 63640 72956 74310 70956 74491 81102 78011 69616 65825 68792 68524 61584
32737 61584 63000 67800 80235 80528 75983 75571 77190 81832 87896 90197 91467 91386 94223 90538 85601
32722 85601 85934 80709 78392 77731 81958 82965 79886 83291 86361 80531 80077 85365 89922 91377 99346
32707 99346 110118 116634 111620 107369 109121 110696 104448 98783 100730 104667 107210 103116 106296 110124
32693 110124 112867 107295 97517 101125 107385 114244 114254 105620 107717 107735 104729 104639 104282 100404 105033 107292
32677 107292 105459 106754 113405 118599 119600 120569 111619 107463 114925 125028 130912 137390 135632 123559
32663 123559 121189 127962 128004 128484 126779 141416 137048 124987 119379 128838 132248 128588 125777 134122
32649 134122 132514 129237 134619 137897 145224 145866 140438 144242 143609 134128 123577 123731 123468 126235 122450
32634 122450 126358 132214 139790 150123 149259 141752 139777 146154 148659 146553 139362 130800 131148 149831
32620 149831 156470 148883 150266 159515 170037 182017 175644 165515 158183 162252 161679 153187 148774 144037
32606 144037 139949 133820 137255 142901 139271 145720 149732 150184 150761 149868 152858 161451 168801 164541 169512
32591 169512 174704 180205 171306 171379 176321 181651 180480 175525 179852 172361 168885 162285 156799 163532 165678
32576 165678 173156 183764 182957 174731 176961 184225 184792 180952 180185 191424 201636 201119 192596 180895
32562 180895 180329 182623 184377 177503 183608 187679 184125 195594 203696 203362 205123 202209 189565 182756
32548 182756 186955 196062 196817 202156 201239 196548 200946 207748 211861 209825 194999 181675 172102 166642
32534 166642 166909 174820 189034 193034 200422 198090 195451 195393 208650 209512 210011 203132 201669 210455 218148
32519 218148 217503 209135 200309 196668 192858 208384 216939 213406 218680 205099 203639 209919 216770 214032
32505 214032 218683 216333 213867 223681 226180 225228 225668 218625 217852 212360 205403 210037 205655 206577 225090
32490 225090 239775 243101 232979 222166 225158 222654 212478 221719 235037 229703 215240 209160 208067
32477 208067 205511 209135 211334 221229 234500 229410 230748 235660 234633 235921 241996 239081 236444 242300
32463 242300 240995 225382 216755 217228 223059 225516 229223 228636 219824 212063 216191 220940 230730 239313
32449 239313 244100 240378 235727 238252 237387 230913 231783 240142 239291 232191 234258 235912 242520 252456 253818
32434 253818 243197 235040 229280 217695 223036 234567 232465 242929 240362 248578 251151 245928 242568
32421 242568 247178 250382 255278 254851 251308 256112 257915 245032 235395 247961 254654 257437 255473 244522
32407 244522 229018 227101 238055 246979 252356 254144 253362 255614 238269 235355 227898 227137 241023 242702
32393 242702 253730 266388 278377 262496 255361 256183 255530 260059 256720 260007 265274 264276 253439 258941
32379 258941 260022 268340 263787 264613 270742 254752 244506 232380 233076 238685 246055 242438 241223 253963
32365 253963 248717 260028 266692 271307 259607 259471 263267 274596 283984 274777 260594 251122 254868
32352 254868 256747 251210 255435 269717 281139 263184 245191 237114 240059 244582 258312 270790 276507
32339 276507 272143 277256 282842 284422 283780 287795 284007 274744 268772 266391 268402 270556 263519 242873
32325 242873 241226 255723 258445 254330 258499 262588 265733 262914 268107 272090 267755 259047 249818 253724
32311 253724 247849 254703 264799 268729 260922 264788 256740 249966 241468 248098 252830 262200 264192 255849
32297 255849 256004 262732 268198 261629 262609 267856 258197 264823 276393 266276 255364 254156 263062 257656
32283 257656 243757 257642 269855 270543 268375 273988 276831 275473 275231 267877 272161 267951 261325 261436
32269 261436 263406 268602 263399 261304 263895 266505 275970 288268 297160 281443 288696 281217 274956 289441
32255 289441 297850 293098 295555 295985 297423 298590 287567 279507 273661 275209 280720 290070 291394 279710
32241 279710 269136 257052 255918 262546 270789 273509 272312 273928 279603 286296 288181 283617 277856 274659
32227 274659 284616 284434 278672 280780 300220 299584 293873 285521 260635 260597 268052 272744 279963 283769 272192
32212 272192 264875 266277 271180 268513 261066 267382 270278 270043 272179 288584 285394 283463 269110 257437
32198 257437 243076 241081 251032 276025 279798 282823 291698 299604 300883 297553 285340 282472 274158
32185 274158 264885 260575 265232 261254 264531 261737 261597 272022 292257 294911 301804 299042 301719 298066
32171 298066 288770 284886 277331 277154 269962 276579 287624 285036 282284 271096 265873 261133 267702 271683
32157 271683 277598 276208 267164 277393 278128 283307 277357 273793 280459 276331 264777 265047 273965 275819
32143 275819 284637 291625 288628 283157 275174 264779 260455 257826 262277 272983 282413 283303 279085 277862
32129 277862 272950 272194 261002 260329 261999 264510 273632 281058 269073 262883 256494 256043 267735 287051
32115 287051 294872 301050 277233 273072 284921 288061 299683 299930 286591 284587 289560 286815 277658
32102 277658 281708 288927 304258 311864 294301 285366 292649 295808 301369 300671 287515 278647 277037 256823
32088 256823 257280 254247 252865 267527 273443 284826 294250 293941 278023 264470 270383 292856 283198
32075 283198 290389 292913 300733 286220 296913 307540 317708 303376 302900 293803 290490 291059 290944 288197
32061 288197 295512 295092 283908 281987 297348 305127 298485 290584 283697 278642 280486 279328 284111 276703
32047 276703 280391 287547 300840 291243 275761 265346 271322 273278 275130 279224 278954 282651 285353 292008
32033 292008 306418 305792 302659 288789 297447 296550 300435 302465 290055 285831 286982 294739 300523 301506
32019 301506 293724 289631 287650 293326 294014 290661 284353 279205 277478 270904 275693 272218 279732 287928
32005 287928 283243 295894 302846 286336 285003 289835 291469 296722 280580 275028 278458 277469 273115 283773
31991 283773 272970 276807 271912 276295 280182 277135 275510 260654 263267 245771 241500 254590 260621
31978 260621 268621 273025 273967 271409 283133 288494 291217 283249 278056 277316 282669 287576 292158 294155
31964 294155 292258 296944 312340 309134 308004 303206 294309 290132 290734 295636 298301 299616 308505 299952
31950 299952 282584 280403 279696 294830 299065 304053 301582 287141 276423 287485 294977 288405 281073
31937 281073 282793 275252 278794 295571 289359 300753 308439 308259 312047 314835 309547 313289 302940 301594
31923 301594 300452 296652 295888 290759 271324 274564 274392 276041 291298 285609 289014 291684 282393 286895
31909 286895 298645 300776 303588 299443 284755 258454 260591 272812 268896 271326 272401 278558 281104
31896 281104 296354 308927 297053 293231 287666 280412 279892 274322 275804 284283 296014 290442 283381
31883 283381 285692 278051 274960 292489 296434 286343 286974 293729 304091 299952 297810 298791 283647 283094
31869 283094 297754 286507 271686 259075 267803 277508 281828 281237 283480 284365 292192 292235 290518 295519
31855 295519 302357 304273 298783 293681 289748 288848 299500 296940 288739 289552 283345 284531 299344 302366
31841 302366 303300 301984 292604 287162 287340 306133 310024 300657 285306 277590 277827 286833 292403 290356
31827 290356 278504 287391 296644 295508 292887 283304 294383 290772 288993 281964 281917 283047 285046 288722
31813 288722 292347 296020 314483 308275 302756 310853 292593 278032 274356 273295 267885 277222 293998
31800 293998 289533 280790 276763 284853 297776 298600 295750 285600 286833 300262 315212 313818 319148
31787 319148 304437 294080 288883 285585 292634 299602 303594 301750 303582 296968 278667 273625 287998
31774 287998 292505 287201 279818 289306 298396 306174 303149 286136 282426 289966 276983 263542 272524
31761 272524 288370 301623 295206 291137 281463 274079 268031 286669 291241 287802 284907 285515 291827 277014
31747 277014 265121 274278 277915 287707 279268 283082 285350 275194 275260 283167 278949 283320 277497 264176
31733 264176 257129 270456 274477 274084 270468 268491 265888 274926 288361 294386 300900 311101 306564 301747
31719 301747 298980 308966 307444 301849 282791 281337 291283 297729 298416 298238 304066 305917 308484 303618
31705 303618 295601 301205 318700 324044 317681 301610 289703 301723 315646 305863 288249 282144 293961
31692 293961 300769 293290 303784 309996 301783 285439 278325 278248 281144 276393 285068 291682 295065 284258
31678 284258 276733 268001 270989 280545 282757 279423 274447 267528 269644 288858 296928 286834 287571 295778
31664 295778 317038 311604 297054 284888 266889 255635 258527 268822 276350 279462 272710 287127
31652 287127 293944 296757 283419 296580 305441 307468 300723 294657 282033 266430 264148 266325 270468
31639 270468 276018 283368 280499 279825 281368 271648 277295 278462 296484 324753 321438 310036 301891 296613
31625 296613 285864 295741 299018 294993 296113 298849 303056 287029 288476 295975 292345 296063 301560 288033
31611 288033 282233 285219 290689 298023 309068 309818 293041 277744 280990 278584 293035 308968 303336
31598 303336 299618 305069 313582 319813 315641 312467 298056 299985 310320 312316 311277 312792 302870 283871
31584 283871 279395 276125 292360 289961 293343 299413 291839 284720 292783 294575 288496 291475 290794 291434
31570 291434 283457 296381 301899 304438 290029 293724 311317 303656 306138 313083 305552 288636 282847
31557 282847 285175 292993 289133 294234 303351 303594 298765 298356 296917 298704 297408 306648 299929 294848 298754
31542 298754 294115 287490 295502 290402 287740 295566 288470 289789 287337 289345 290091 291863 292915 281972
31528 281972 283753 299084 305955 304370 300487 287120 277018 281234 274631 270367 278122 295728 305328
31515 305328 304262 308245 315368 317496 309137 298519 300902 292695 299771 310515 303185 294693 295790 287648
31501 287648 278100 282780 278512 273814 274092 279041 275805 280833 287900 286757 288547 293980 302960 299874
31487 299874 289163 287419 293839 301700 292776 293408 295363 299144 303017 295363 285644 281966 285510 293445
31473 293445 298881 313979 320125 322122 317540 320045 317419 315525 301297 291159 284973 289039 284947
31460 284947 290203 300812 303385 300284 295670 295347 295536 296980 290125 292695 308161 304663 310832 311185
31446 311185 309085 311900 310726 296442 301425 311255 304501 284950 292769 318874 320397 324411 317375
31433 317375 315127 312410 312352 310832 307814 308432 308964 299070 283950 305374 317863 315176 308428 302780
31419 302780 296846 292641 291881 296564 288409 292782 296239 293890 307360 311865 298183 302518 308170 310555
31405 310555 308832 301444 303032 287256 271480 266217 275647 274740 276175 267596 271011 281713 284893 282716
31391 282716 291974 287403 273405 268212 273796 287145 281062 279222 293116 295804 301287 302906 308606
31378 308606 299860 295195 293452 290600 283642 284602 274898 279940 274091 288460 295844 296306 297324 310079
31364 310079 310422 304871 304059 306306 302848 298245 304780 305563 300476 294183 290696 298293 318484 317282 303861
31349 303861 285999 285478 284455 272752 275953 292735 297464 297112 289262 288665 296421 297160 301441 296619
31335 296619 296887 300455 297771 309638 312591 294972 297184 295865 297179 306629 313636 311772 305130 284400
31321 284400 273626 271963 280363 287211 281676 291250 293004 290283 281398 288645 292642 283062 285811 281926
31307 281926 276348 285601 294215 293067 292076 290970 283672 285055 284348 284990 287431 291609 302173 314466
31293 314466 323194 313952 298877 287416 282764 283651 291514 283489 281702 288471 288555 288736 287031 288515 287569
31278 287569 292241 290991 298349 299736 305659 321718 323355 315093 308275 291640 299655 307459 300168 297307
31264 297307 291799 291026 284310 286530 291435 293491 301906 301255 298475 299579 301356 304101 302098 311053 302951
31249 302951 306854 313934 303362 299408 283739 269654 280680 290883 295686 298473 300902 305673 312614
31236 312614 308929 302204 308152 300471 310287 311388 296239 289333 290771 298550 294243 298999 304384 305994
31222 305994 302174 295409 290805 296381 320675 324765 314581 315659 327698 320170 312970 319867 331410
31209 331410 338593 330386 322016 313909 307707 295984 291008 304018 295910 286298 271142 281990 283284
31196 283284 288755 305117 320263 328186 319536 290563 280323 275945 275692 287593 298095 307554 315881
31183 315881 336003 335658 317320 307263 301149 302162 311641 321540 321055 317046 313538 305157 297585 301668
31169 301668 302831 287615 284354 288132 287143 281671 278875 290107 294266 281553 279535 287506 283661 280702
31155 280702 283107 299941 313381 313195 303208 301141 293582 296131 298158 291599 297211 304584 304838 306717
31141 306717 313859 302737 308247 318931 316720 295665 290988 300412 311586 314814 308290 317703 328701
31128 328701 322621 304658 294463 306477 309829 311394 314754 312419 295578 293006 286636 287807 286388
31115 286388 288693 288201 283087 268757 279314 293954 302954 311722 313913 311399 306669 307059 310594 297261
31101 297261 297672 285155 285288 294314 293948 293957 295324 288402 287399 293020 294897 286240 281372 289056 288551 296489
31085 296489 295174 286150 279435 279955 274297 266433 261265 259773 274793 295594 304918 289338 284035 291461
31071 291461 309471 330926 336008 325317 316090 312713 286265 269827 282824 280618 296433 302130
31059 302130 304286 308622 307971 311003 321385 313775 300930 304450 304588 306616 300713 299909 298906 285547
31045 285547 285764 290562 287916 279875 277651 286087 298744 294931 297273 292293 306868 314408 316715 314697
31031 314697 308769 296855 288007 280497 283299 291795 288732 300606 299991 287500 286625 272639 280441 281331
31017 281331 293351 286094 288672 300075 304006 300278 298200 296235 295377 297594 299164 302825 315005 313487
31003 313487 295041 287451 294927 303612 313527 311336 308066 303038 298915 299660 312855 311564 298694 292098
30989 292098 287204 298961 298174 299455 295800 298483 309077 309362 292639 289034 290899 292940 286538 294798
30975 294798 292112 290028 289404 294767 298823 313206 311019 320868 337861 337605 316626 306353 312221 321333
30961 321333 315337 304428 315658 326646 325951 316666 314215 314797 317375 304316 303692 304020 295985 282658
30947 282658 286785 300728 307133 309470 311576 300278 290591 275696 273246 274855 275777 283240 303559
30934 303559 309406 314976 302777 293750 291353 298747 306562 294281 287032 287730 304143 311547 305365 306529
30920 306529 294133 294058 288194 292228 293827 288920 301631 309568 322297 316827 299560 299189 319508 336702
30906 336702 330518 319498 317731 308500 297086 303803 306440 306013 314500 321082 314214 316453 303184 300956
30892 300956 302094 306383 316396 323237 317246 309283 308353 301527 307265 313252 309739 329961 332372 326405
30878 326405 322626 315922 309197 305644 303576 313285 313558 290059 285133 302065 313610 305175 295604 293552
30864 293552 299531 314375 312978 298791 288339 301910 296016 298606 313585 308101 307143 306732 302629
30851 302629 302924 312150 317126 311481 289191 295113 295743 293995 298996 295740 281050 287565 297435 284834
30837 284834 280282 291914 305168 314952 312974 288214 278638 279221 290575 298689 303509 314421 318578
30824 318578 307529 299988 302320 304705 306819 310859 313500 303382 303175 314401 310802 306995 301528 309744
30810 309744 312071 314253 305079 313730 307913 298965 293772 297197 314691 319079 312551 315207 321528 318216
30796 318216 312876 318540 311318 301661 288204 287453 295839 280453 278222 284723 296004 301717 310308 315356
30782 315356 322591 327024 319733 308585 311476 323515 308299 298703 296667 301445 306673 310787 310263 312142
30768 312142 296436 290329 287606 293851 300593 309882 304150 311711 309506 304729 298723 299437 298822 306747
30754 306747 323222 323713 325457 338037 348460 323838 308394 308314 307156 322079 315324 316569 341391
30741 341391 350122 339016 332625 328574 330012 321997 310502 310810 334769 333330 324889 322205 326222 316635
30727 316635 321886 332431 325372 321617 314261 302767 305203 310943 309641 295345 296623 305275 314213
30714 314213 321183 321861 326848 318915 300403 290689 301703 319814 317235 307846 291625 294789 307517
30701 307517 313147 310356 311134 304938 297551 299439 302742 309145 310614 308408 317146 312516 302057 301317
30687 301317 309860 311586 312112 314072 309190 297505 297698 310296 304354 302233 301453 301214 302363 286647
30673 286647 285672 290212 288837 266631 280257 285067 290190 298340 288127 280181 292898 303475 297793
30660 297793 309660 304684 292235 286995 280283 296010 301805 297469 301907 309412 319231 324035 329202
30647 329202 313934 306879 298948 291266 308655 320589 323764 315455 307302 303552 299216 298575 290647 284535
30633 284535 297296 302439 300753 302612 308818 302473 292214 283934 292956 302578 311250 307479 312268 315084
30619 315084 313266 314797 311816 309226 302902 294102 288875 304594 318195 311064 299318 300164 323342
30606 323342 335948 334591 319439 310029 318539 325449 314923 296534 296528 298521 298158 300830 304110 303644
30592 303644 297942 285041 285819 283721 282532 286293 297602 291905 279132 288687 302021 299433 298385
30579 298385 310120 318034 305657 295281 294441 295582 298967 302537 305258 293591 292233 291295 295525 314564
30565 314564 312127 300166 303458 294495 289157 290993 287658 294428 308171 310485 313738 316246 318970 320676
30551 320676 321166 329330 317173 310049 309210 310397 307484 324269 328378 319739 306316 287300 280153 296108
30537 296108 292637 296913 309378 324009 311839 296381 290572 291905 302957 292768 295474 299282 294797
30524 294797 295160 295418 304695 308330 305266 306026 316045 323511 315692 312459 310148 313439 308400 311068 311741
30509 311741 311425 308368 304315 295615 306772 311685 315191 321466 329346 329862 316660 317680 314992 320918
30495 320918 337023 345208 326926 321015 311865 306610 307810 306170 304126 313486 313263 307432 299569 301671
30481 301671 307407 295689 296854 306095 307423 314456 311498 297669 302450 314861 317554 323307 312926
30468 312926 305901 302744 306085 309442 296636 301096 308036 312832 324877 308391 309530 304771 307962
30455 307962 316757 310120 315833 317269 317434 327368 335098 327867 312086 313684 313485 316419 320041 312164
30441 312164 312372 316384 319466 316744 327385 327433 318909 312186 300359 312691 322579 311801 305596 307423
30427 307423 317302 320543 310992 303079 282041 287800 297482 303216 308189 301682 296542 304927 312565 302231
30413 302231 288923 292905 291772 300895 296898 294457 298594 307144 308938 299074 287988 291371 302797
30400 302797 301639 299761 288746 281449 283277 300910 296206 292135 286791 300787 324354 334193 315325
30387 315325 302641 296410 293582 301070 307194 308140 309667 314237 307471 305890 314036 314865 321235 327815
30373 327815 322236 312929 311962 322855 313815 321947 310531 298514 305137 318013 319512 317427 313364
30360 313364 309010 305405 304822 305060 309029 297826 278922 287295 304163 311204 301237 295235 298875 302603
30346 302603 312869 306917 305103 306374 312055 321734 309171 297611 306136 302034 295503 307091 313709
30333 313709 317077 314890 301578 302337 300399 293859 292077 300830 303373 301264 296175 297719 296678 305243
30319 305243 320597 319619 318093 319015 310559 299659 308405 320903 317893 299169 301188 323127 331257
30306 331257 333114 322024 310680 302066 300134 304777 313587 313754 315344 310139 302127 289416 281857 281993
30292 281993 287585 289848 298647 293106 309242 318635 317510 320177 316309 311570 314657 315746 328298 337489
30278 337489 343931 334857 323979 324711 320888 302660 304848 307993 308296 307339 301188 299818 299006 284933
30264 284933 284612 303320 326621 329057 316738 312274 319744 321853 304089 284448 297247 309832 315471
$$ [...]
##END NTUPLES=NMR SPECTRUM
##END=
