##TITLE=Analysis number 320940
Compound Code mo 07876
Book Reference 497/22/2 497/20/1
Project Code adrs
Chemist Name avrilr
##JCAMPDX= 6.0         $$ Bruker NMR JCAMP-DX V2.0
##DATA TYPE= NMR SPECTRUM
##DATA CLASS= NTUPLES
##ORIGIN= Bruker BioSpin GmbH
##OWNER= nmr
$$ XWIN-NMR		Version 3.5
$$ Tue Jul 18 13:03:32 2006 GMT Daylight Time (UT+1h)  MAYBRIDGE\nmr@NMR_250MHZ
##.OBSERVE FREQUENCY= 250.131544655141
##.OBSERVE NUCLEUS= ^1H
##.ACQUISITION MODE= SIMULTANEOUS (DQD)
##.ACQUISITION SCHEME= undefined
##.AVERAGES= 16
##.DIGITISER RES= 18
##SPECTROMETER/DATA SYSTEM= dpx250
##.PULSE SEQUENCE= zg30
##.SOLVENT NAME= CDCl3
##.SHIFT REFERENCE= (INTERNAL, CDCl3, 0, 16.522)
##AUDIT TRAIL= $$ (NUMBER, WHEN, WHO, WHERE, WHAT)
$$ ##TITLE= Audit trail, XWIN-NMR		Version 3.5
$$ ##JCAMPDX= 5.01
$$ ##ORIGIN= Bruker BioSpin GmbH
$$ ##OWNER= nmr
$$ C:\u/data/dgb/nmr/ADRS/2990/pdata/1/auditp.txt
$$ ##AUDIT TRAIL=  $$ (NUMBER, WHEN, WHO, WHERE, WHAT)
(   1,<2006-07-18 13:03:04.46 +100>,<MAYBRIDGE\nmr>,<NMR_250MHZ>,
      <created by zg, POWCHK disabled, PULCHK disabled
       configuration hash MD5:
       E2 DF 36 D8 04 B2 41 60 5A D7 A3 38 5A 4B D0 FE
       data hash MD5: 64K
       85 3E 84 5A 51 50 F6 14 5E B5 2C 18 FA C5 BB 1C>)
(   2,<2006-07-18 13:03:19.74 +100>,<MAYBRIDGE\nmr>,<NMR_250MHZ>,
      <Start of raw data processing
       ef LB = 0.3 FT_mod = 6 PKNL = 1 SI = 32K 
       data hash MD5: 32K
       63 4F 4C B9 E6 F8 EF 46 BC 52 23 5F 02 22 00 D4>)
(   3,<2006-07-18 13:03:21.74 +100>,<MAYBRIDGE\nmr>,<NMR_250MHZ>,
      <apk 
       data hash MD5: 32K
       A4 58 9B 20 C8 BE 58 C6 61 28 E3 C6 59 C9 02 E8>)
(   4,<2006-07-18 13:03:22.49 +100>,<MAYBRIDGE\nmr>,<NMR_250MHZ>,
      <abs ABSG = 5 
       data hash MD5: 32K
       8F 14 48 28 2E 2A 33 61 6A 7F 66 1D 48 D9 BA 81>)
$$ ##END=
$$ 
$$ hash MD5
$$ 29 7D 52 AC 11 FF C0 F9 DA DD 0E D5 17 D3 41 30
##$RELAX= 
##$RELAX= 
##$RELAX= 
##$RELAX= 
##$RELAX= 
##$RELAX= 
##$RELAX= 
$$ Bruker specific parameters
$$ --------------------------
##$DU= <C:\u>
##$EXPNO= 2990
##$NAME= <ADRS>
##$PROCNO= 1
##$TYPE= <nmr>
##$USER= <dgb>
##$AMP= (0..31)
100 100 100 100 100 100 100 100 100 100 100 100 100 100 100 100 100 100 
100 100 100 100 100 100 100 100 100 100 100 100 100 100 
##$AQSEQ= 0
##$AQ_mod= 3
##$AUNM= <au_zg>
##$AUTOPOS= <32 >
##$BF1= 250.13
##$BF2= 250.13
##$BF3= 250.13
##$BF4= 250.13
##$BF5= 500.13
##$BF6= 500.13
##$BF7= 500.13
##$BF8= 500.13
##$BYTORDA= 1
##$CFDGTYP= 0
##$CFRGTYP= 5
##$CHEMSTR= <none>
##$CNST= (0..31)
1 1 145 1 1 1 1 1 1 1 1 1 1 1 1 1 1 1 1 1 1 1 1 1 1 1 1 1 1 1 1 1 
##$CPDPRG= <>
##$CPDPRG1= <>
##$CPDPRG2= <>
##$CPDPRG3= <>
##$CPDPRG4= <mlev>
##$CPDPRG5= <mlev>
##$CPDPRG6= <mlev>
##$CPDPRG7= <mlev>
##$CPDPRG8= <mlev>
##$CPDPRGB= <>
##$CPDPRGT= <>
##$D= (0..31)
0 1 0 0 0 0 0 0 0 0.06 0 0 0 0 0 0 0.0002 0 0 0 0 0 0 0 0 0 0 0 0 0 0 
0 
##$DATE= 1153224183
##$DBL= (0..7)
120 120 120 120 120 120 120 120 
##$DBP= (0..7)
150 150 150 150 150 150 150 150 
##$DBP07= 0
##$DBPNAM0= <>
$$ [...]
##$SUBNAM7= <"">
##$SUBNAM8= <"">
##$SUBNAM9= <"">
##$SW= 20.6930455092707
##$SWIBOX= (0..15)
0 0 3 0 0 0 0 0 0 0 0 0 0 0 0 0 
##$SW_h= 5175.983436853
##$TD= 65536
##$TD0= 1
##$TE= 296.16
##$TE2= 300
##$TE3= 300
##$TEG= 300
##$TL= (0..7)
0 120 120 120 120 120 120 120 
##$TP= (0..7)
150 150 150 150 150 150 150 150 
##$TP07= 0
##$TPNAME0= <>
##$TPNAME1= <>
##$TPNAME2= <>
##$TPNAME3= <>
##$TPNAME4= <>
##$TPNAME5= <>
##$TPNAME6= <>
##$TPNAME7= <>
##$TPOAL= (0..7)
0.5 0.5 0.5 0.5 0.5 0.5 0.5 0.5 
##$TPOFFS= (0..7)
0 0 0 0 0 0 0 0 
##$TUNHIN= 0
##$TUNHOUT= 0
##$TUNXOUT= 0
##$USERA1= <user>
##$USERA2= <user>
##$USERA3= <user>
##$USERA4= <user>
##$USERA5= <user>
##$V9= 5
##$VALIST= <valist>
##$VCLIST= <CCCCCCCCCCCCCCC>
##$VD= 0
##$VDLIST= <DDDDDDDDDDDDDDD>
##$VPLIST= <PPPPPPPPPPPPPPP>
##$VTLIST= <TTTTTTTTTTTTTTT>
##$WBST= 1024
##$WBSW= 4
##$XGAIN= (0..3)
0 0 0 0 
##$XL= 0
##$YL= 0
##$YMAX_a= 348933
##$YMIN_a= -662733
##$ZGOPTNS= <>
##$ZL1= 120
##$ZL2= 120
##$ZL3= 120
##$ZL4= 120
##$ABSF1= 16.522
##$ABSF2= -4.171173
##$ABSG= 5
##$ABSL= 3
##$ALPHA= 0
##$AQORDER= 0
##$ASSFAC= 0
##$ASSFACI= 0
##$ASSFACX= 0
##$ASSWID= 0
##$AUNMP= <proc_1d>
##$AZFE= 0.1
##$AZFW= 0.1
##$BCFW= 0
##$BC_mod= 0
##$BYTORDP= 0
##$COROFFS= 0
##$CY= 12.5
##$DATMOD= 1
##$DC= 0
##$DFILT= <>
##$DTYPP= 0
##$F1P= 14.0000005364418
##$F2P= -0.99999901652339
##$FCOR= 0.5
##$FTSIZE= 32768
##$FT_mod= 6
##$GAMMA= 0
##$GB= 0
##$INTBC= 1
##$INTSCL= 1
##$ISEN= 128
##$LB= 0.3
##$LEV0= 0
##$LPBIN= 0
##$MAXI= 10000
##$MC2= 0
##$MEAN= 0
##$ME_mod= 0
##$MI= 0
##$NCOEF= 0
##$NC_proc= -6
##$NLEV= 6
##$NOISF1= 0
##$NOISF2= 0
##$NSP= 0
##$NTH_PI= 0
##$NZP= 0
##$OFFSET= 16.522
##$PC= 1
##$PHC0= 161.8997
##$PHC1= 13.1031
##$PH_mod= 1
##$PKNL= yes
##$PPARMOD= 0
##$PSCAL= 4
##$PSIGN= 0
##$REVERSE= no
##$SF= 250.13
##$SI= 32768
##$SIGF1= 0
##$SIGF2= 0
##$SINO= 400
##$SIOLD= 32768
##$SREGLST= <1H.CDCl3>
##$SSB= 0
##$STSI= 32768
##$STSR= 0
##$SW_p= 5175.98343685301
##$SYMM= 0
##$S_DEV= 0
##$TDeff= 65536
##$TDoff= 0
##$TI= <Analysis number 999999
Compound Code 99
Book Reference 9
Project Code 9>
##$TILT= no
##$TM1= 0
##$TM2= 0
##$TOPLEV= 0
##$USERP1= <user>
##$USERP2= <user>
##$USERP3= <user>
##$USERP4= <user>
##$USERP5= <user>
##$WDW= 1
##$XDIM= 32768
##$YMAX_p= 318186491
##$YMIN_p= -945232
$$ End of Bruker specific parameters
$$ ---------------------------------
##NTUPLES= NMR SPECTRUM
##VAR_NAME=  FREQUENCY,     SPECTRUM/REAL,   SPECTRUM/IMAG
##SYMBOL=    X,             R,               I
##VAR_TYPE=  INDEPENDENT,   DEPENDENT,       DEPENDENT
##VAR_FORM=  AFFN,          ASDF,            ASDF
##VAR_DIM=   32768,         32768,           32768
##UNITS=     HZ,            ARBITRARY UNITS, ARBITRARY UNITS
##FACTOR=    0.157963299565203, 1,           1
##FIRST=     4132.6476996994, 0,             0
##LAST=      -1043.33573715361, 0,           0
##MIN=       -1043.33573715361, -945232,     0
##MAX=       4132.6476996994, 318186491,     0
$$ Real data points
##PAGE= N=1
##DATA TABLE= (X++(R..R)), XYDATA
$$ [...]
22963g2294j15217P0893J25506J64285K36650Q0029k51049l00605j51993K85876
$$ -72294 -187511 -116618 8888 173173 409823 489852 238803 -61802 -213795 72081
22953G2081K6930M2445o4127n2944j35488j16042K9614j2286p0199L20036J74837
$$ 72081 99011 141456 77329 24385 -111103 -227145 -197531 -209817 -280016 40020 214857
22942B14857n2498j84501j01520L3587J04477J0965j38792P0917J42219j76450
$$ 214857 162359 -22142 -123662 -90075 14402 25367 -113425 -42508 99711 -76739
22932g6739k31424P5190L4608J02301l4232O5524J21407K35219J72589k36570
$$ -76739 -308163 -232973 -198365 -96064 -130296 -64772 56635 291854 464443 227873
22922B27873j95943l53289j20567k9831J09993K05384K9834m7441K4566L10102
$$ 227873 31930 -321359 -441926 -471757 -361764 -156380 -126546 -173987 -149421 160681
22912A60681J44303m06792K9033K7409k09711j44589K49237K09105j37215j5888
$$ 160681 304984 -101808 -72775 -45366 -255077 -399666 -150429 58676 -78539 -94427
22902i4427J14718M8239J23129j07512j23404J31614j27112j67204J16248K4473
$$ -94427 20291 68530 191659 84147 -39257 92357 -34755 -201959 -85711 -61238
22892f1238K7072k4201j01466P8916q9834m5533L2655k3994j5408k9096K0270
$$ -61238 -34166 -58367 -159833 -80917 -170751 -216284 -183629 -207623 -223031 -252127 -231857
22881b31857J71186M4780q5505l04334J57352K56257j44953j38401L2308K77632
$$ -231857 -60671 -15891 -101396 -405730 -248378 7879 -137074 -275475 -243167 34465
22871C4465K88845p2612o4548K1634j11213j19438j71219m9399K57455K48339
$$ 34465 323310 250698 186150 207784 96571 -22867 -194086 -243485 13970 262309
22861B62309j0357m9241J35454P75q6528K0565l28697l44175j0475J14884K33166
$$ 262309 251952 202711 338165 338940 252412 272977 -55720 -399895 -410370 -295486 -62320
22850f2320J49268k21235n3205M4282k1904k0940J4480n5327k58873J08501J10266
$$ -62320 86948 -134287 -187492 -143210 -165114 -186054 -171574 -226901 -485774 -377273 -267007
22839b67007L0697L48062j56038L9351n1703j10061P366K86648o0405m51590j38199
$$ -267007 -236310 111752 -44286 -4935 -56638 -166699 -159333 127315 66910 -384680 -522879
22828e22879O6995N4717R4186J49655o2393L6838p210J1589M2292j37550M4718
$$ -522879 -455884 -401167 -306981 -157326 -219719 -182881 -190091 -178502 -136210 -273760 -229042
22817b29042J7621R1163j18594P9584R4907P9603R157j45432P7800m406j45365
$$ -229042 -211421 -120258 -238852 -159268 -64361 15242 24399 -121033 -43233 -47639 -193004
22806a93004K2466L3682J25750J48240J26840k50998m32261J3148L4714J23197
$$ -193004 -170538 -136856 -11106 137134 263974 12976 -419285 -406137 -371423 -248226
22796b48226M0772J86087K31963j92911j01359j99188k8696p6787j3878q5030
$$ -248226 -207454 -21367 210596 17685 -83674 -282862 -311558 -388345 -402223 -487253
22786d87253Q5859l8162k6594J30270J01762Q2421N9896J24359n924L3494L1986
$$ -487253 -401394 -439556 -466150 -335880 -234118 -151697 -91801 32558 26634 60128 92114
22775I2114j43978j37654m991K1076J10206J47046L9538j00928j8626J83878J68241
$$ 92114 -51864 -189518 -194509 -173433 -63227 83819 123357 22429 3803 187681 355922
22764C55922q2770l52566j05047k9306o5608K18699p1978j36891o8682P8777J7601
$$ 355922 273152 -79414 -184461 -213767 -279375 -60676 -132654 -269545 -338227 -259450 -241849
22753b41849j21941j0095J87927j1131n0343L16293L6872j35342j54731L7881
$$ -241849 -363790 -373885 -185958 -197089 -247432 68861 105733 -29609 -184340 -146459
22743a46459Q9075R9772J33071k78030j8808M1113l0359j39450R5630L43741m4950
$$ -146459 -57384 42388 175459 -102571 -121379 -80266 -110625 -250075 -154445 189296 144346
22732A44346J86001p7674l21494j2096L6384o7120K6793K37796P734n4793K8293
$$ 144346 330347 252673 -68821 -80917 -44533 -111653 -84860 152936 160670 105877 134170
22721A34170n0745l76758J00089L38960P5042j58280J58656q5422k32201Q5860
$$ 134170 83425 -293333 -193244 145716 220758 62478 221134 135712 -96489 -10629
22711a0629L10766K23862l38260m32637j10836K06372O1280J79889j74997N0406
$$ -10629 300137 523999 185739 -246898 -357734 -151362 -90082 89807 -85190 -34784
22701c4784N2980o2594r6273r3331j5374J30596J86159L13078N7865k97178l97158
$$ -34784 18196 -44398 -140671 -234002 -249376 -118780 67379 380457 438322 141144 -256014
22690b56014J17396K37457J30971k46351l65105q6921R3039J66123r6323l4757
$$ -256014 -138618 98839 229810 -16541 -381646 -468567 -375528 -209405 -305728 -340485
22680c40485N9115J24116n464N4257K35772J544L1658Q9697J49724J60728J37057
$$ -340485 -281370 -157254 -162718 -108461 127311 128855 160513 250210 399934 560662 697719
22669F97719k86186m31691k89510M6516j15635j59697J86958J75957p1599N699
$$ 697719 411533 -20158 -309668 -263152 -378787 -538484 -351526 -175569 -247168 -241469
22659b41469J99238K19723J32885J1176J57347r5424j38931l61373m4808K01721
$$ -241469 -42231 177492 310377 321553 478900 383476 244545 -116828 -161636 40085
22649D0085K8051P5654J65445N5708j60273J88355R2356j44932j12109n7144r6989
$$ 40085 68136 143790 309235 364943 204670 393025 485381 340449 228340 171196 74207
22638G4207K23805n3113m6480R0668j82475K89137J96205q9747k62810k10681
$$ 74207 298012 244899 198419 289087 106612 395749 591954 502207 239397 28716
22628B8716K88095L7541k7809k17834j96671P2579K20554j77744k00170k23814
$$ 28716 316811 354352 326543 108709 -87962 -15383 205171 27427 -172743 -396557
22618c96557j31321J08240L51094L28859J97371j764p0435k88779N7371K58392
$$ -396557 -527878 -419638 -68544 260315 457686 455922 385487 96708 154079 412471
22608D12471J74825m16093j54486J4889j9877J57962m1628j24266O4872L15009
$$ 412471 587296 171203 16717 31606 11729 169691 128063 3797 68669 383678
22598C83678k0777q0170j86384j02459j66019J03108j1809r4125J43450O6256
$$ 383678 362901 282731 96347 -6112 -172131 -69023 -80832 -174957 -31507 34749
22588C4749j44317J23459L01577Q5808m01949j52048K03768j28036j73573o7258
$$ 34749 -109568 13891 315468 401276 -673 -152721 51047 -76989 -250562 -317820
22578c17820M0209L44541K27307k95219j62076J38827J6474n0916L4282L8573
$$ -317820 -277611 66930 294237 -982 -163058 -24231 -7757 -58673 -24391 14182
22568A4182k5061K82816K7272k77248R4531Q5813l4843j14747j46174j84826k24895
$$ 14182 -10879 271937 299209 21961 116492 202305 167462 52715 -93459 -278285 -503180
22557e03180J32639J77000K5485j19198K77718K17752P059q4560o3530J9250J74200
$$ -503180 -370541 -193541 -168056 -287254 -9536 208216 215275 130715 67185 86435 260635
22546B60635m4238R5606j25267l0065L3362R1284q3835l09874K03970J17486J53982
$$ 260635 216397 312003 186736 156671 190033 281317 197482 -112392 91578 209064 363046
22535C63046n2790p0295l28608k63838J00694M04304l7838o3046k9446l0120K2633
$$ 363046 310256 239961 -88647 -352485 -251791 152513 114675 51629 22183 -7937 14696
22524A4696j9641p7003J28258M8366k0816L8452M6246k56649j29566J06397J23283
$$ 14696 -4945 -81948 46310 94676 73860 112312 158558 -98091 -227657 -121260 2023
22513B023M6026P7651Q6551J2208m0476n8751q6413j60109n3530m6556J52812
$$ 2023 48049 125700 212251 224459 183983 125232 38819 -121290 -174820 -221376 -68564
22502f8564L4711J6534j01179m366o1689q8833R5457k2772o6290j50482J63704
$$ -68564 -33853 -17319 -118498 -122864 -184553 -273386 -177929 -200701 -266991 -417473 -253769
22491b53769J11462P5756j01482j46093N1070J67769J35460J12096R6173Q3015
$$ -253769 -142307 -66551 -168033 -314126 -263056 -95287 40173 152269 248442 331457
22481C31457j44903j47925N1144J06571O0289k18387o9375L9351l8328q1412J74653
$$ 331457 186554 38629 89773 196344 256633 38246 -31129 8222 -30106 -111518 63135
22470F3135K53822l4931k15316r1253k60605j07830O7308J34204J11321J86475
$$ 63135 316957 282026 66710 -24543 -285148 -392978 -325670 -191466 -80145 106330
22460A06330n9512j41629L0958K45323J1659l13150k01089p938j45633K23184
$$ 106330 46818 -94811 -63853 181470 193129 -120021 -321110 -329048 -474681 -251497
22450b51497K26953Q1201j07632n2764o5102q4773m639J85829l3084q5925K20981
$$ -251497 -24544 56657 -50975 -103739 -168841 -253614 -258253 -72424 -105508 -191433 29548
22439B9548k9773l854K98979j748N9979k3594k45519M6401N8395J5660L7605j77366
$$ 29548 -225 -4079 294900 293152 353131 329537 84018 130419 188814 204474 242079 64713
22427F4713j08077r5895R0857J81812L7985o4149J25922J5706j6882O4599k7018
$$ 64713 -43364 -139259 -48402 133410 171395 107246 233168 248874 231992 296591 269573
22416B69573n2748o8850N8098p6624K21271j76483j88743l0108n2463K041M3589
$$ 269573 216825 147975 206073 129449 350720 174237 -14506 -44614 -97077 -95036 -51447
22405e1447J80418P7826r1894j0011k74272l1698J0603J45648J4838j54635j3317
$$ -51447 128971 206797 114903 104892 -169380 -201078 -190475 -44827 -29989 -184624 -197941
22394a97941J49940k5594O8957j40103O4527N4672J9112j47330l0038J03273r9237
$$ -197941 -48001 -73595 -4638 -144741 -80214 -25542 -6430 -153760 -183798 -80525 -179762
22383a79762j8456K64126l0241q4818l7311k18341L239j74271r9471Q6533Q7136
$$ -179762 -198218 65908 35667 -49151 -86462 -304803 -301564 -475835 -575306 -488773 -401637
22372d01637N9621k99716j12367J94902m8157J83842K95497K9922p228M5630Q2363
$$ -401637 -342016 -641732 -754099 -559197 -607354 -423512 -128015 -98093 -105321 -59691 22672
22361B2672j62214q7265j290j1471K68331N8103l7851j42814K8207n2524J29466
$$ 22672 -139542 -226807 -228097 -239568 28763 86866 49015 -93799 -65592 -118116 11350
22350A1350J80575J22816k48551L828R9879J13131k52254K0648j12004k44490
$$ 11350 191925 314741 66190 70018 169897 283028 30774 51422 -60582 -305072
22340c05072j5364L45955P5824k8804L3816m6132n7838p6102K62378k22292j83081
$$ -305072 -320436 25519 101343 72539 106355 60223 2385 -73717 188661 -33631 -216712
22329b16712K30025J12442k948l95290j63911m7796K8737J0556K8903P2664J55922
$$ -216712 13313 125755 122807 -272483 -436394 -484190 -455453 -444897 -415994 -343330 -187408
22318a87408Q9304K2983r8706Q635P3986p622O8145o3687j25935m4839M6672K13547
$$ -187408 -98104 -75121 -173827 -165192 -91206 -98828 -30683 -94370 -220305 -265144 -218472 -4925
22306d925R7171n4494n5138K12203O184l69829J7548m7473r5600Q7345j36019
$$ -4925 92246 37752 -17386 194817 201001 -168828 -151280 -198753 -294353 -207008 -343027
22295c43027k9986O5378o1338k4832K18531J81110K8429l9618j30978j33575K01128
$$ -343027 -373013 -307635 -368973 -393805 -175274 5836 34265 -5353 -136331 -269906 -68778
22284f8778K49199k52806k27033K4396K09454K17447j43214l3488J35469Q3897
$$ -68778 180421 -72385 -299418 -275022 -65568 151879 8665 -24823 110646 194543
22274A94543n8337j90064j32484n4612O4633K3281N3419Q7475l8693J41217J12349
$$ 194543 136206 -53858 -186342 -240954 -176321 -153040 -99621 -12146 -50839 90378 202727
22263B02727M34n0057K08730j30852N101J01399k59487j81942j47204N4039L8198
$$ 202727 203161 153104 361834 230982 236083 337482 77995 -103947 -251151 -197112 -158914
22252a58914P9707N0522M8192R3480J02494j19036k37318j4413j26683k32585
$$ -158914 -79207 -28685 19507 112987 215481 96445 -140873 -155286 -281969 -514554
22242e14554L55360K39378K6006p7133j85002l9940L1011M1801r9935R2874k5394
$$ -514554 -159194 80184 106190 29057 -155945 -195885 -164874 -123073 -223008 -130134 -155528
22231a55528J8105j205P5344J44638k52737j56783P1793k62043J25861L50698
$$ -155528 -137423 -138628 -63284 81354 -171383 -328166 -256373 -518416 -392555 -41857
22221d1857r1598o5083J91731Q5858l90487j18968j37265j78121J33607M15579
$$ -41857 -133455 -198538 -6807 79051 -311436 -430404 -567669 -745790 -612183 -196604
22211a96604J82145k4389J02493O4905j79288n5178K60127O1591O7788J32732
$$ -196604 -14459 -38848 63645 128550 -50738 -105916 154211 215802 283590 416322
22201D16322J6925l2398r8082j28435j76802m3018j80181J06992K11954k3250
$$ 416322 433247 400849 302767 174332 -2470 -45488 -225669 -118677 93277 70027
22191G0027k20525j65839P0885Jq8346K49634k8063J02839J70568k0994p4638
$$ 70027 -150498 -316337 -245452 -245451 -333797 -84163 -112226 -9387 161181 140187 65549
22180F5549M4383M7271j02142J6173k04308O175J6231M2758l2759k9720p4182
$$ 65549 109932 157203 55061 71234 -133074 -126899 -110668 -67910 -100669 -130389 -204571
22169b04571J7251J40195o6129k1998k4630O3297l2594o9953j04916o194n2833
$$ -204571 -187320 -47125 -113254 -135252 -159882 -96585 -129179 -199132 -304048 -310242 -363075
22158c63075J02030n1744q8195K75902J76697k37099j6840L86804k4817N5096
$$ -363075 -261045 -312789 -400984 -125082 51615 -185484 -202324 184480 159663 214759
22148B14759P1498j55042r7922j14518K1991j13407J2709L302r7367K63679j6780
$$ 214759 286257 131215 33293 -81225 -59234 -172641 -159932 -156630 -253997 9682 -7098
22137g098k01793k475O7631j59137J08859P8047l783p9058J8219Q7100J6022P7870
$$ -7098 -208891 -211366 -143735 -302872 -194013 -115966 -119749 -198807 -180588 -93488 -77466 404
22125D04K79105J21304j87630k57146J72967j32926m4118M3033j05957N5721l5625
$$ 404 279509 400813 213183 -43963 129004 -3922 -48040 -5007 -110964 -55243 -90868
22114i0868m0458J29059r9334j55997J06457K15511j3253R0507J81943j77942
$$ -90868 -131326 -2267 -101601 -257598 -151141 64370 51117 141624 323567 145625
22104A45625n5217n7730o2527l6700l6412k84017J3511K43077K38812O3043k00425
$$ 145625 90408 32678 -29849 -66549 -102961 -386978 -373467 -130390 108422 171465 -28960
22093b8960M574R6377Q2619K0102J06213N8605k0781j50831k78719n9752l2730
$$ -28960 -24386 71991 154610 174712 280925 339530 318749 167918 -110801 -170553 -203283
22082b03283j8081k07971K57723J84054l22441R4403K04117j42429j37949L1649
$$ -203283 -221364 -429335 -171612 12442 -309999 -215596 -11479 -153908 -291857 -260208
22072b60208J04980j07278M4510J14567J68525L13150j2247k47752k87833p1512
$$ -260208 -155228 -262506 -217996 -103429 65096 378246 365999 118247 -169586 -241098
22062b41098J6169J79479J16693l3461j41250j93402n3200J50273J0317k31J51939
$$ -241098 -224929 -45450 71243 37782 -103468 -296870 -350070 -199797 -189480 -189711 -37772
22051c7772j62480l6711K6424m6583r6797k8625L9564L0917J16960r7098k98267
$$ -37772 -200252 -236963 -210539 -257122 -353919 -382544 -342980 -312063 -195103 -292201 -590468
22040e90468j52861k9744J81801J99206J56025p157q9511j934P5848l0200K90294
$$ -590468 -743329 -773073 -591272 -392066 -236041 -243198 -332709 -334643 -258795 -288995 1299
22029A299J36118P6616Q327M13Q0589P31k04537j49314p2986j09736J26575J41904
$$ 1299 137417 214033 222360 222773 303362 304093 99556 -49758 -122744 -232480 -105905 35999
22017C5999K56643k6539k45529j85180P3240L8356L38733K1163k10486q3957O6903
$$ 35999 292642 266103 20574 -164606 -91366 -53010 285723 306886 96400 12443 79346
22006G9346j24864q4099j64947J07000J47302N7873J3827R1536O1320K9737J0137
$$ 79346 -45518 -129617 -294564 -187564 -40262 17611 31438 122974 184294 214031 224168
21995B24168k11819n38o5665J21967J83403Q040j35098m5549J04722Q0506j98734
$$ 224168 12349 11811 -53854 68113 251516 259556 124458 78909 183631 264137 65403
21984F5403r3372M4295J13854m236o0292o2475j96646M7992J68699L1651L9582
$$ 65403 -27969 16326 130180 125944 65652 3177 -193469 -145477 23222 54873 94455
21973I4455j03827j26133O2651K28390J41177j38404j93926n7073M4062Q0473
$$ 94455 -9372 -135505 -72854 155536 296713 158309 -35617 -92690 -48628 31845
21963C1845N248J40998o9k32223j40367j27549r341K32368r8427k18746P8198
$$ 31845 37093 178091 178022 -54201 -194568 -322117 -331458 -99090 -197517 -416263 -338065
21952c38065Q9844p9855J61794O117o4935j340o9545k184K50949r9608k37690
$$ -338065 -248221 -328076 -166282 -160165 -225100 -226440 -295985 -298169 -47220 -146828 -384518
21941c84518K26970k5542O4368J8135J65714Q1379j29177k63406m6926J16844
$$ -384518 -157548 -183090 -118722 -100587 65127 146506 17329 -246077 -293003 -176159
21931a76159k1734J83870R1366j55646j26289J74579O7967r7857j46204J941R0540
$$ -176159 -197893 -14023 77343 -78303 -204592 -30013 37954 -59903 -206107 -204166 -113626
21920a13626Q3494J4982j0125j25111Q0929J46787j00181j7765Q0725J34199o4038
$$ -113626 -30132 -15150 -25275 -150386 -69457 77330 -22851 -40616 40109 174308 110270
21909A10270k65787m7138P881m2627j9013J02289K02226l9997K5279J56498k6740
$$ 110270 -155517 -202655 -194774 -237401 -256414 -154125 48101 8104 33383 189881 163141
21898A63141N5907r4244k07971k17318R3314K49602l4233p2125k10384j10322
$$ 163141 219048 124804 -83167 -300485 -207171 42431 8198 -63927 -274311 -384633
21888c84633J21784O7847J04964k09516J66276l0237j93905R7437M29421K0093
$$ -384633 -262849 -195002 -90038 -299554 -133278 -163515 -357420 -259983 169438 189531
21878A89531k27498K1157j5360P2627m8269Q4890J04549P934j90573j45637j65226
$$ 189531 -37967 -16810 -32170 40457 -7812 77078 181627 189561 -1012 -146649 -311875
21867c11875m0982J69071J72891k93527k16710j91333K22889j4013K9721K92R2173
$$ -311875 -352857 -183786 -10895 -304422 -521132 -712465 -489576 -503589 -473868 -473576 -381403
21856c81403K83789L07967k40673N2906l6642k53538l96146l4882M20398J35594
$$ -381403 -97614 210353 -30320 22586 -14056 -267594 -663740 -698622 -278224 -142630
21846a42630j23381O6179J5578J21989m6243j52586q3646J26524k869J00724J38205
$$ -142630 -266011 -199832 -184254 -62265 -108508 -261094 -344740 -218216 -221085 -120361 17844
21835A7844l7419j66970k10541J44097N9431p7869j21444K8245J52619J40792
$$ 17844 -19575 -186545 -397086 -252989 -193558 -271427 -392871 -364626 -212007 -71215
21825g1215j04882j10905j4436K20642J20783J80168J25029J91596j46181k58451
$$ -71215 -176097 -287002 -301438 -80796 39987 220155 345184 536780 390599 132148
21815A32148j70891L3755J46006k56101k66446R6371L41007K50484j59993k63085
$$ 132148 -38743 -4988 141018 -115083 -381529 -285158 55849 306333 146340 -116745
21805a16745r2520m2832q5970l3560o5089j8265J18052J40016J70232J0208l5570
$$ -116745 -209265 -252097 -338067 -371627 -436716 -454981 -336929 -196913 -26681 -16473 -52043
21794e2043j28677j353n974J41058j65455l01800o0605M9510J0042o0202L709
$$ -52043 -180720 -182073 -188047 -46989 -212444 -514244 -574849 -525339 -515297 -575499 -571790
21783e71790K62947R103J56254p4742J48548K64777o4140L5160J26151j26568
$$ -571790 -308843 -299740 -143486 -218228 -69680 195097 130957 166117 292268 165700
21773A65700q5334p1201n0896l8749J7716N0001j68117Q7917j41274j19221O9819
$$ 165700 80366 9165 -41731 -80480 -62764 -12763 -180880 -92963 -234237 -353458 -283639
21762b83639m0179K90350P9040N6622k84767L5022J04596j50792q7120O4138P6069
$$ -283639 -323818 -33468 45572 102194 -182573 -147551 -42955 -193747 -280867 -216729 -140660
21751a40660J40600J40572n5505O5353k4347P0191l6535j42749j8098p8340n8701
$$ -140660 -60 140512 85007 150360 126013 196204 159669 16920 -1178 -79518 -138219
21740a38219J114L94399j47361j81484j05162J00518l7366r8209J88679O1209
$$ -138219 -137105 257294 109933 -71551 -176713 -76195 -113561 -211770 -23091 38118
21730C8118j96373j6575k26225k08356K6251J97985L27590K54150k31314m44319
$$ 38118 -158255 -174830 -401055 -609411 -583160 -385175 -57585 196565 -34749 -479068
21720d79068j4196P5941J41667O1120K73663R8899j00503J1007m497J49631P3616
$$ -479068 -493264 -417323 -275656 -214536 59127 158026 57523 68530 64033 213664 287280
21709B87280j69569l25702j56144L37574J75313k99497n86080j15591M28516J02263
$$ 287280 117711 -207991 -364135 -26561 148752 -150745 -736825 -852416 -423900 -321637
21699c21637o4734L18374J26418j3676p6371J12272K2534J40041K0400k18940
$$ -321637 -386371 -67997 58421 44745 -31626 80646 103180 243221 263621 44681
21689D4681j16638m4117p777k9304j6551Q8874q8805P8464m0494l4645J68533
$$ 44681 -71957 -116074 -123851 -153155 -169706 -80832 -169637 -91173 -131667 -166312 2221
21678B221q9189R5671K8480J04469J1588k80208j35145N7528J63459o2471k88236
$$ 2221 -86968 8703 37183 141652 153240 -126968 -262113 -204585 -41126 -103597 -391833
21667c91833J50849J29618Q1831N5204j18058J8123l6699O8415J7244j61212j10613
$$ -391833 -240984 -111366 -29535 25669 -92389 -74266 -110965 -42550 -25306 -186518 -297131
21656b97131l0241L482K69118K45874N0815k57493l76513J92115J13929L92908
$$ -297131 -327372 -323890 -54772 191102 241917 -15576 -392089 -199974 -86045 306863
21646C06863Q3931k95639j21288o6975j79732k86864j95351J24026K24684L13585
$$ 306863 390794 95155 -26133 -93108 -272840 -559704 -755055 -631029 -406345 -92760
21636i2760j35507j26675K52674J18757N9344j45322o9110o4760l7206J36694
$$ -92760 -228267 -354942 -102268 16489 75833 -69489 -138599 -203359 -240565 -103871
21626a03871l9186K246M0128J55266n950O2562m2675j05336k29674O0965J48933
$$ -103871 -143057 -140811 -100683 54583 48633 111195 68520 -36816 -266490 -205525 -56592
21615e6592j41274j31284l9654m8632j74920K39138j56426J12751K24095L71061
$$ -56592 -197866 -329150 -368804 -417436 -592356 -353218 -509644 -396893 -172798 198263
21605A98263P2275n07245k40281j3029J29866M09809K40693p5963j68610K78675
$$ 198263 270538 -236707 -476988 -490017 -360151 49658 290351 214388 45778 324453
21595C24453M72747j87934l65381J96733l5942n64554r8372Q1716L69926j75107
$$ 324453 797200 609266 243885 440618 404676 -159878 -258250 -176534 193392 18285
21585A8285J11206J15665p0047q131j26481P638k40949N3941j07909p5704M0809
$$ 18285 129491 245156 175109 166978 40497 48135 -192814 -138873 -246782 -322486 -281677
21574b81677J82439L24387J41126r6621L5416J0437k42374k71213J1050K67207
$$ -281677 -99238 225149 366275 269654 305070 315507 73133 -198080 -187030 80177
21564H0177j0005j61631p7890J53610M874m0116J14248O5128j09102n4720j26538
$$ 80177 70172 -91459 -169349 -15739 -10865 -50981 63267 128395 19293 -35427 -161965
21553a61965j71588J43819P2191m8133k37493K5267J07284n1062R764J68502K83771
$$ -161965 -333553 -189734 -117543 -165676 -403169 -377902 -270618 -321680 -311916 -143414 140357
21542A40357J4145k35145k89647M13424L60126J83092j42746n4338l02410p4955
$$ 140357 154502 -80643 -370290 43134 403260 586352 443606 389268 86858 11903
21532A1903R2248J2480q1640k13734J40744J88134n2572m34970k34943Q5494J00390
$$ 11903 104151 116631 34991 -178743 -37999 150135 97563 -337407 -572350 -486856 -386466
21521c86466M7950k9756K46761J89027J09226j21297j20134K1669O6734p1985
$$ -386466 -338516 -368272 -121511 67516 176742 55445 -64689 -43020 23714 -48271
21511d8271k0379J45628p6614k2457R975k11695j14203K11729J62717k30244J20050
$$ -48271 -68650 76978 364 -22093 -12118 -223813 -338016 -126287 36430 -193814 -73764
21500g3764l5585k526k53533J62098J55212j9858q5162O7316k369k48512Q9818
$$ -73764 -109349 -111875 -365408 -203310 -48098 -67956 -153118 -85802 -88171 -336683 -246865
21489b46865L09164l2734q2220n1236N8083J1531j12840O842k2355P4786J17485
$$ -246865 62299 29565 -52655 -103891 -45808 -34277 -147117 -140275 -162630 -87844 29641
21478B9641L2427j33052k8659O4442j74741p6915O4284k04155j82776J60480J16178
$$ 29641 62068 -70984 -99643 -35201 -209942 -286857 -222573 -426728 -609504 -449024 -332846
21467c32846K79687J44322j77631J58985R3870k12737K48387J70947l56481j67534
$$ -332846 -53159 91163 -86468 72517 166387 -46350 202037 372984 16503 -151031
21457a51031k1248J9721j34637j29603J68530J77960j99208k46026J41017J05218
$$ -151031 -172279 -152558 -287195 -416798 -248268 -70308 -269516 -515542 -374525 -269307
21447b69307k36849j94458J27459p8026J34534K8242J35361J5406p9710K31575
$$ -269307 -506156 -700614 -573155 -651181 -516647 -488405 -353044 -337638 -417348 -185773
21437a85773J07270l5334j04522j99584p3247R0325J44184k583o659p1360K42887
$$ -185773 -78503 -113837 -218359 -417943 -491190 -400865 -256681 -259264 -265923 -337283 -94396
21426i4396K89907M4323p7247k34267j84406J91989M4485j2900n7020j5394J2143
$$ -94396 195511 239834 162587 -71680 -256086 -64097 -19612 -32512 -89532 -104926 -92783
21415i2783J63266p1M6005J29097j37411k04773M5323N2071O5306n1194J9971
$$ -92783 70483 70412 116417 245514 108103 -96670 -51347 724 66030 14836 34807
21404C4807l876L80935Q770q1200j48875k34455l1762N4488O6759n9476k7106
$$ 34807 30931 411866 420636 339436 190561 -43894 -75656 -21168 45591 -13885 -40991
21393d0991N6401n4946J0910O3951J09392m9049j3445Q6686j83664j79909j85630
$$ -40991 15410 -39536 -28626 35325 144717 95668 82223 168909 -14755 -194664 -380294
21382c80294N7712K73426L900o8510J59070m9801j30531k39515j276j87695O2703
$$ -380294 -322582 -49156 -45256 -113766 45304 -4497 -135028 -374543 -375819 -563514 -500811
21371e00811J15337J36438Q1692r4964M4573P3708J3374J56441n6613j12660o7441
$$ -500811 -385474 -249036 -167344 -262308 -217735 -144027 -130653 25788 -30825 -143485 -210926
21360b10926J03912n6110J8264P7318J84169L18738j25843j30979m7773j40154
$$ -210926 -107014 -163124 -144860 -67542 116627 435365 309522 178543 130770 -9384
21350i384J1048k2037O9804J55865j71954L0938J13073k63992n1466J8251K42479
$$ -9384 1664 -20373 49431 205296 33342 64280 177353 -86639 -138105 -119854 122625
21339A22625K61691J91831p960j68678j61714j66394p5410k8415k64910n3221
$$ 122625 384316 576147 568187 399509 237795 71401 -4009 -32424 -297334 -350555
21329c50555K7596J22693J33976R0859p1597n7598P5839M3833P9974J58526m1472
$$ -350555 -322959 -200266 -66290 24569 -47028 -104626 -28787 15046 95020 253546 212074
21318B12074k00336k29019k12118J36058J32210m8326m6984j49271K1623L19543
$$ 212074 11738 -217281 -429399 -293341 -161131 -209457 -256441 -405712 -384089 -64546
21308f4546J35771l5702m295j26422k429j73547q6447K26158n8740R7138K01365
$$ -64546 71225 35523 31228 -95194 -97623 -271170 -357617 -131459 -190199 -93061 108304
21297A08304Q895k84900Q3584K36593j52947k91943P7812J12652K24210j31781
$$ 108304 117199 -167701 -84117 152476 -471 -292414 -214602 -101950 122260 -9521
21287i521P5641M8581L0798p8100R2523k4686k77353n5841j18501o7794J90577
$$ -9521 66120 114701 145499 67399 159922 135236 -142117 -197958 -316459 -384253 -193676
21276a93676k06531O0581n9630J3996N6800P8181J10099r0042L4759J44325N4915
$$ -193676 -400207 -339626 -399256 -385260 -328460 -250279 -140180 -230222 -195463 -51138 3777
21265C777j28304j23196L51970q9677k8046J05504k94399k05922M7950O7654J41353
$$ 3777 -124527 -247723 104247 14570 -13476 92028 -202371 -408293 -360343 -292689 -151336
21254a51336j69135p509K3280k08243J32719J19733J26807K39886p9734l30418
$$ -151336 -320471 -327980 -304700 -512943 -380224 -260491 -133684 106202 26468 -303950
21244c03950J1951J33890J02577J72265p5047j07395P1401k47508K0078L14758
$$ -303950 -291999 -158109 -55532 116733 41686 -65709 5692 -241816 -221738 93020
21234I3020J90471n0198j18384j42542K48845j83299j44249J13572J70857N3050
$$ 93020 283491 233293 114909 -27633 221212 37913 -106336 7236 178093 231143
21224B31143n310J50742o0368j42337J8681k65543j73919j1051K61560K04027
$$ 231143 225833 376575 316207 173870 192551 -72992 -246911 -257962 3598 207625
21214B07625M3070L5041L8306M3988K2075j67258o2308M8376J4066J3065q7630
$$ 207625 250695 285736 324042 368030 390105 222847 160539 208915 222981 236046 148416
21203A48416k5172p8502R784N5740K01158O2522j48282k17579j25066J97546P9462
$$ 148416 123244 44742 54526 110266 311424 373946 225664 8085 -116981 80565 160027
21192A60027j39272j87590N6338K60733R0462q0089k27033q464j67593r3838L07305
$$ 160027 20755 -166835 -110497 150236 240698 160609 -66424 -74888 -242481 -336319 -29014
21181b9014J77022k55454p3600K51532K8323m3261q9463P1742K140O0745j681
$$ -29014 148008 -107446 -181046 70486 98809 55548 -33915 37827 39967 100712 99031
21170I9031m1729O6644j69214o9553j92526j60483J44626R8118K67530K04065
$$ 99031 57302 123946 -45268 -114821 -307347 -467830 -323204 -225086 42444 246509
21160B46509l03431k16552N2210m3654K28798Q1108p5243L92703P2991o4202l88397
$$ 246509 -56922 -273474 -221264 -264918 -36120 44988 -30255 362448 435439 371237 -17160
21149a7160r6742L9260J52228Q2582N0884q7633k06504Q7055L56085P8601l77639
$$ -17160 -113902 -74642 77586 160168 211052 123419 -83085 3970 360055 438656 61017
21138F1017j74827J61697L84265J8866k18245j87320R3487n1813r0292J13095
$$ 61017 -113810 47887 432152 451018 232773 45453 138940 87127 -3165 109930
21128A09930n4916m1521k21769J66457P4467N8811j52396M0359J43162P4974j61251
$$ 109930 55014 13493 -208276 -41819 32648 91459 -60937 -20578 122584 197558 36307
21117C6307J33906J77103j07112r1462m3916j12878Q104K18895O1709q2791j60084
$$ 36307 170213 347316 240204 148742 104826 -8052 52 218947 280656 197865 37781
21106C7781o5576J5307M3830M1611J17811J22326j87703k6433l2287j2541r8534
$$ 37781 -27795 -12488 31342 72953 190764 313090 125387 98954 66667 54126 -44408
21095d4408k93956J16884O8562K40246J6232j89704j58993p6379J45052K76326
$$ -44408 -338364 -221480 -152918 87328 103560 -86144 -245137 -321516 -176464 99862
21085I9862l38906j98342J28370K09670n9738J51920l2654p686N1445j9211J32211
$$ 99862 -239044 -437386 -309016 -99346 -159084 -7164 -39818 -47504 3941 -15270 116941
21074A16941J74248M6125j06663k81074k55571r8003J04711K99287K40868l09416
$$ 116941 291189 337314 230651 -50423 -305994 -403997 -299286 1 240869 -68547
21064f8547k85708j02565P3904K83411n3859J2878J57469J37394J580o5946k77322
$$ -68547 -354255 -456820 -382916 -99505 -153364 -140486 16983 154377 155957 90011 -187311
21053a87311j21205M0435J03146J48756O4645j6229k8582k95975n0792J89131
$$ -187311 -308516 -268081 -164935 -16179 48466 32237 3655 -292320 -343112 -153981
21043a53981L2866j32924N4270m2580j97414K24165K57059N6095L05356P5764
$$ -153981 -121115 -254039 -199769 -242349 -439763 -215598 41461 97556 402912 478676
21033D78676p1889j81664j37589r7133j4403m6018n6998p1797O3500j20843R9083
$$ 478676 406787 225123 87534 -9599 -24002 -70020 -127018 -198815 -135315 -256158 -157075
21022a57075K66016l9728k36119q9230J11284J61918j32512J26637K51409K16764
$$ -157075 108941 69213 -166906 -256136 -144852 17066 -115446 11191 262600 479364
21012D79364k46105k62355K48944K10382K06004r5994j91883r2911n7952j26495
$$ 479364 233259 -29096 219848 430230 636234 540240 348357 255446 197494 70999
21002G0999Q6559l2363p8790N2550K05049P0187j46481j92895K7676j12295M6965
$$ 70999 157558 125195 46405 98955 304004 374191 227710 34815 62491 -49804 -2839
20991b839j16652j8772J8525Q330K93293p7057m3102k83175j73999j30922J68472
$$ -2839 -119491 -138263 -119738 -111408 181885 104828 61726 -221449 -395448 -526370 -357898
20980c57898J63479L86722J85216l66048k46543J68132J91937J97842j07871r7515
$$ -357898 -194419 192303 377519 11471 -235072 -66940 124997 322839 214968 117453
20970A17453M5904J19765K34739r2739K03860j3556m45163k57543k43478L0904
$$ 117453 163357 283122 517861 425122 628982 615426 170263 -87280 -330758 -299854
20960b99854o7076J38549J71996p365J30790K84053J22969O5238l08848j02460
$$ -299854 -366930 -228381 -56385 -63750 67040 351093 474062 539300 230452 127992
20950A27992j76612l85405k5390o2217J56113m9862J03923M76270K1675j80263
$$ 127992 -48620 -434025 -459415 -521632 -365519 -415381 -311458 164812 186487 6224
20940F224j49038K2263N7187l9048p9618l5063j1701o8269J75319N2459K25653
$$ 6224 -142814 -120551 -63364 -102412 -182030 -217093 -228794 -297063 -121744 -69285 156368
20929A56368P5120k08650l1737J49012j30987J01370N5228k01131N6068J32986
$$ 156368 231488 22838 -8899 140113 9126 110496 165724 -35407 20661 153647
20919A53647R5425J70342j38613j28879P301P7684K6047n2350k43156k34007k92449
$$ 153647 249072 419414 280801 151922 159223 236907 262954 210604 -32552 -266559 -559008
20908e59008N4171O6539J71390J96521J61067J6746j15364p793J81200r1270l81153
$$ -559008 -504837 -438298 -266908 -70387 90680 107426 -7938 -15731 165469 74199 -306954
20897c06954q2547K72206K06852J42019k54841q2491K63787n6810j74883J6395
$$ -306954 -389501 -117295 89557 231576 -23265 -105756 158031 101221 -73662 -57267
20887e7267J25438o3210k72122J14574K65615K18589j0638k93559q3095j49409
$$ -57267 68171 4961 -267161 -152587 113028 331617 320979 27420 -55675 -205084
20877b05084j87244J86783K8234K63849r005j0753l19103j26006P0249j455P5385
$$ -205084 -392328 -205545 -177311 86538 77533 66780 -252323 -378329 -308080 -309535 -234150
20866b34150J22016J1488k7548q9516m424R1809k87346p6264K13911M2541p7471
$$ -234150 -112134 -100646 -128194 -217710 -222134 -130325 -417671 -493935 -280024 -237483 -314954
20855c14954J37252P3061J04469K13041J2795j13296J71306J59253k03942k79056
$$ -314954 -177702 -104641 -172 212869 225664 112368 283674 442927 238985 -40071
20845d0071j1238J63037J42772k30861k13097l3521K87711R602j49257O4141Q3191
$$ -40071 -51309 111728 254500 23639 -189458 -222979 64732 74334 -74923 -10782 72409
20834G2409j00050m8103O2722j9103q0660K17872J0175M9332N9938K7248J11112
$$ 72409 -27641 -75744 -13022 -32125 -112785 105087 115262 164594 224532 251780 362892
20823C62892K56630l93208q8616l0233o1436n98m4221M1595j20142m9532K92739
$$ 362892 619522 226314 137698 107465 46029 45431 1210 42805 -77337 -126869 165870
20812A65870O8433k70907j55023P4496R8746M9524j3269J4050K43599J16778m03769
$$ 165870 234303 -36604 -191627 -117131 -18385 31139 17870 31920 275519 392297 -11472
20801a1472k06263Q3314j11543r1210K99174K60563k58851j34011J04940P7980
$$ -11472 -217735 -134421 -245964 -337174 -38000 222563 -36288 -170299 -65359 12621
20791A2621J05928k6860j13821j55755L2152J81519r3664J28283K17403J7265
$$ 12621 118549 91689 -22132 -177887 -145735 35784 -57880 70403 287806 305071
20781C05071o9644k5500M7058P3773L1171n5244r0600j68967M6581l9665q7069
$$ 305071 235427 209927 256985 330758 361929 306685 216085 47118 93699 54034 -33035
20770c3035k1188j0866k19571K1114P5917j83257P8489J95945j77543q6828J34890
$$ -33035 -54223 -65089 -284660 -263546 -187629 -370886 -292397 -96452 -273995 -360823 -225933
20759b25933N467K6330J07454M8981j05153J06553L6725r5586k19498M457K33951
$$ -225933 -220466 -194136 -86682 -37701 -142854 -36301 424 -95162 -314660 -310203 -76252
20748g6252M9311j72078J09227M79534P784j11560k10753O8113m1041n12K1149
$$ -76252 -26941 -199019 -89792 389742 397526 285966 75213 143326 102285 101773 122922
20737A22922J90948J43333L12438J33907k62851l61700l57017Q3944O6189p2979
$$ 122922 313870 457203 769641 903548 640697 278997 -78020 5924 72113 -866
20727h66L5356J85548n796j5534k9343J5199J96805K7154q7702j66048k35487
$$ -866 34490 220038 214242 198708 169365 184564 381369 408523 320821 154773 -80714
20716h0714n1565R5246j42869j06756J40823J38730k33544l7263P9213q5484J16315
$$ -80714 -132279 -37033 -179902 -286658 -145835 -7105 -240649 -277912 -198699 -284183 -167868
20705a67868J68397m3550J53112L63375l5421k41301j42125j17209L20913L2522
$$ -167868 529 -43021 110091 473466 438045 196744 54619 -62590 258323 290845
20695B90845j50823J09363k24232j63267R1169p69K18245j21749O9529l4680j04062
$$ 290845 140022 249385 25153 -138114 -46945 -47714 170531 48782 118311 83631 -20431
20684b0431m1048m544j5641r7850k34651l1799L62795J30852j26948Q3909j17723
$$ -20431 -61479 -66023 -81664 -179514 -414165 -445964 -83169 47683 -79265 4644 -113079
20673a13079j86151K09343K59874m2729J20943L0127N8538J0976o2519J02386
$$ -113079 -299230 -89887 169987 127258 248201 278328 336866 347842 285323 387709
20663C87709N9500k21210k92747p8085J16551J96813J19138j56384k41139j0431
$$ 387709 447209 225999 -66748 -144833 -28282 168531 287669 131285 -109854 -120285
20653a20285J36838J73977j77j4730L4895R2749j37845r3972n5277J42969o453
$$ -120285 16553 190530 190353 175623 210518 303267 165422 71450 16173 159142 152689
20642A52689J03580J03908j85458k60028j80290j94195K10538M08874O5375m27520
$$ 152689 256269 360177 174719 -85309 -265599 -459794 -249256 159618 224993 -202527
20632b02527j39563K7153K05130L1536n4281k5417Q5796J26937o274j61176l52813
$$ -202527 -342090 -314937 -109807 -78271 -132552 -157969 -72173 54764 48490 -112686 -465499
20621d65499m9308K01068l8713O6199K34568l1099j06116P7300J44732j43670
$$ -465499 -514807 -313739 -352452 -286253 -51685 -82784 -188900 -111600 33132 -110538
20611a10538j53170j44769M7228K37749q5827J35289q9225M3965J97945L8119
$$ -110538 -263708 -408477 -361249 -123500 -209327 -74038 -163263 -119298 78647 116766
20601A16766k21402K35530O1069j67429j4989J36526k33339j13007J70422j56444
$$ 116766 -104636 130894 191963 24534 9545 146071 -87268 -200275 -29853 -186297
20591a86297r7240m6232J32639L41843O5566P5349L0553j35249k86333n9781J80988
$$ -186297 -283537 -329769 -197130 144713 210279 285628 316181 180932 -105401 -165182 15806
20580A5806M165J89765Q5730n5920O0652j25492Q1377k80822j53480k417J37991
$$ 15806 19971 209736 295466 239546 300198 174706 256083 -24739 -178219 -180636 -42645
20569d2645j04155J34838K29418j57407r5258N0110p0251k11662P3324k0554K83742
$$ -42645 -146800 -11962 217456 60049 -35209 14901 -55350 -267012 -193688 -214242 69500
20558F9500O5407j8709M9688o0371J63697J48951j25928m6627q945l97214j33118
$$ 69500 134907 116198 165886 105515 269212 418163 292235 245608 236663 -160551 -293669
20547b93669R5935K63233O329O6597J17030J74998r3083j32777N5375r8586J69847
$$ -293669 -197734 65499 71828 138425 255455 430453 337370 204593 259968 161382 331229
20536C31229L00735J60581p6417P4022p1441k48395k61866J39693K4742j82989
$$ 331229 631964 792545 716128 790150 718709 470314 208448 348141 372883 189894
20526A89894k5212N7567J7161o2384J35245O7514k26632k62265K3279J67925p6569
$$ 189894 164682 222249 239410 177026 312271 379785 153153 -109112 -85833 82092 5523
20515E523k6056J64214o6508k59112k09696Q6608N1227K72973J58181j47631j63737
$$ 5523 -20533 143681 77173 -181939 -391635 -305027 -253800 19173 177354 29723 -134014
20504a34014J7324l2578q0426L10286J45437K11664o3158l01742K2944J94309
$$ -134014 -116690 -149268 -229694 80592 226029 437693 374535 72793 95737 290046
20494B90046K0801k12033j36076o4949K76710j20211J10761J77665k35866l22069
$$ 290046 310847 98814 -37262 -102211 174499 54288 165049 342714 106848 -215221
20484b15221J88490K00339q1867m5546K2891j27303K22863L06460j1323l72138
$$ -215221 -26731 173608 91741 46195 69086 -58217 164646 471106 459783 87645
20474H7645o7349Q1357j71946l6400j15153J28843L82904O1262J92451k24633
$$ 87645 20296 101653 -70293 -106693 -221846 -93003 289901 351163 543614 318981
20464C18981k86718K56402K12490J20383k11456q8875J14342j32095m89522l80497
$$ 318981 32263 288665 501155 621538 410082 321207 435549 303454 -186068 -566565
20454e66565K93969J67546J18388J00384K26071J0189M9128k17657J47784L0881
$$ -566565 -272596 -105050 13338 113722 339793 349982 399110 181453 329237 360118
20444C60118k63670o6216l9778J04469J71534j75198j84355N0320J02592K198
$$ 360118 96448 30232 -9546 94923 266457 91259 -93096 -42776 59816 62014
20434F2014j16656N0752K05070J6613O3440p935k82853K0863Q6056q6839J07679
$$ 62014 -54642 -3890 201180 217793 281233 273298 -9555 11308 97364 10525 118204
20423A18204J12107q2620k29821j13827k59453L6881m3009k58935L28944L88650
$$ 118204 230311 147691 -82130 -195957 -455410 -418529 -461538 -720473 -391529 -2879
20413b879m3417q356j8733J02926K98219n8797j79125Q1402j2995r3852J5662
$$ -2879 -46296 -54652 -73385 29541 327760 268963 89838 171240 158245 64393 80055
20402H0055M3296k9787R6465q5760j12405O596J07827K30099j24061m9567k80451
$$ 80055 123351 93564 190029 104269 -8136 -1540 106287 336386 212325 162758 -117693
20391a17693j96517J95222N4832K11918r62j93254J77917O7779l05595j74948
$$ -117693 -314210 -118988 -64156 147762 146800 -46454 131463 199242 -106353 -281301
20381b81301J04977J93444q5670L7353J29609J33200p8113J7448K13846k6800
$$ -281301 -176324 17120 -68550 -31197 98412 231612 153499 170947 384793 357993
20371C57993p5682o4819O4340l3572l8129j82966N6874m1567k33361j22824L5078
$$ 357993 282311 217492 281832 248260 210131 27165 84039 42472 -190889 -313713 -278635
20360b78635Q0849Q9341k239J49976j81817l19030j4301L15639M85539K46049
$$ -278635 -197786 -108445 -110684 39292 -142525 -461555 -475856 -160217 325322 571371
20350E71371l19616l27540j23463J61033J54527L8357M9566L0930q738n1688j61313
$$ 571371 251755 -75785 -199248 -38215 116312 154669 204235 235165 226427 174739 13426
20339A3426K67238J0270J35189J82342j10178m58343N925P0924j34731j89771
$$ 13426 280664 290934 426123 608465 498287 39944 45869 116793 -17938 -207709
20329b07709J93012J46959j39729o7955m2901J8354P2203P9231r173j4851q8340
$$ -207709 -14697 132262 -7467 -75422 -118323 -99969 -27766 51465 42292 27441 -60899
20318f0899M9141J46659l2967M2201Q3328k6111j41212n9039r0784q1906J45441
$$ -60899 -11758 134901 101934 144135 227463 201352 60140 1101 -89683 -171589 -26148
20307b6148n7304J60181K60663O6841l9448j17336M3311J22342r2519j38312J01740
$$ -26148 -83452 76729 337392 404233 364785 247449 290760 413102 320583 182271 284011
20296B84011K79815L9485k21878m60410n929J17035m4799O9850j62122l7442J87209
$$ 284011 563826 603311 381433 -78977 -84906 32129 -12670 57180 -104942 -142384 44825
20285D4825K64730j28934r5087p9788J42515J71552L65579J8338k72933r9984
$$ 44825 309555 180621 85534 5746 148261 319813 685392 703730 430797 330813
20275C30813k7262o5898n400j6645j68395J1011L05462r88j19780K1716N4833
$$ 330813 303551 237653 232253 215608 47213 58224 363686 362698 242918 264634 319467
20264C19467j90779k09365J56784L74256J60493l2386p7687j08159Q7094q2304
$$ 319467 128688 -80677 76107 450363 610856 578470 500783 392624 479718 397414
20254C97414j99952J5799q9090k10186q203N2076J93759J15886J9396J45410o1202
$$ 397414 197462 213261 124171 -86015 -94218 -42142 151617 267503 286899 432309 371107
20243C71107K9231k44841j23657j17027M1708J41763k20543m40076j6298K39841
$$ 371107 400338 155497 31840 -85187 -43479 98284 -122259 -562335 -578633 -338792
20233c38792J64258K83270K21158j68222k73021K4213J64917Q2820O6225k95512
$$ -338792 -174534 108736 329894 161672 -111349 -87136 77781 160601 226826 -68686
20223f8686n7761K99693L65246l83946n269q1212J9937J65641J83241m27871k75850
$$ -68686 -126447 173246 538492 154546 149277 68065 88002 253643 436884 9013 -266837
20212b66837J47228J60935J04716m0941P1973J19010M6802p1025J78368J33209
$$ -266837 -119609 41326 146042 105101 177074 296084 342886 271861 450229 583438
20202E83438j82988M8966p5868j31268L0542k40279k98866j80856J0917P4814
$$ 583438 400450 449416 373548 242280 272822 32543 -266323 -447179 -436262 -361448
20192c61448J69214L00839K03312J4002j04056r929R3993J68333k56439k72738
$$ -361448 -192234 108605 311917 325919 221863 211934 305927 474260 217821 -54917
20182e4917M6389J55049l9216k02143k1394k1952J11081J55881K61932N1080k67272
$$ -54917 -8528 146521 107305 -94838 -116232 -138184 -27103 128778 390710 441790 174518
20171A74518l49181p6308L207O4785J83595j63412j13345K39530j7644O7389N5704
$$ 174518 -174663 -250971 -247764 -182979 616 -162796 -276141 -36611 -54255 13134 68838
20160F8838r4701n9109k4343O6894P0698o472N159J46966L1118O9126J5676j06885
$$ 68838 -25863 -84972 -109315 -42421 28277 21805 26964 173930 205048 274174 289850 182965
20148A82965p7637N6790P6324N6222J4478k3792m285j52807j96953M6562M9981
$$ 182965 105328 162118 238442 294664 309142 285350 281065 128258 -68695 -22133 27848
20137B7848M67390j17411l15079j12422M7186R913J36424k5388m8162l8945J3287
$$ 27848 495238 377827 62748 -49674 -2488 7425 143849 118461 70299 31354 44641
20126D4641k4384n2913K1581J55937M1368j24063J47776N1438J79332N7837m2445
$$ 44641 20257 -32656 -11075 144862 186230 62167 209943 261381 440713 498550 456105
20115D56105k99435k16067J15352K78129L6136j13765Q302j75522J87200k5216
$$ 456105 156670 -59397 55955 334084 370220 256455 264757 89235 276435 251219
20105B51219k96095k13315O7323J40983J81414K55873R0224L5933m4397M2391
$$ 251219 -44876 -258191 -190868 -49885 131529 387402 477626 513559 469162 511553
20095E11553M1651K34473j73908p4163j47272k64586j68115K05021K69104m2049
$$ 511553 553204 787677 613769 539606 392334 127748 -40367 164654 433758 391709
20085C91709p0810l4208j05951k27455R9348J70294j04767j45124Q4918M27814
$$ 391709 320899 286691 180740 -46715 52633 222927 118160 -26964 57954 485768
20075D85768J95743J15832k14980j13104J33208J2127k78650j36408J72065o7058
$$ 485768 681511 797343 582363 469259 602467 614594 335944 199536 371601 304543
20065C04543k01096M9984K46949Q5225n4180k45494J67543M19150j28383j30136
$$ 304543 103447 153431 400380 485605 431425 185931 353474 772624 644241 514105
20055E14105j6035p3057j65554K818k1789K0905L54832J73276j46782j04097k60010
$$ 514105 498070 425013 259459 262277 240488 261393 616225 789501 642719 538622 278612
20044B78612k27423l2167L0450L3620J54664k28413k83533J82933K52819Q7084
$$ 278612 51189 19022 49472 83092 237756 9343 -274190 -91257 161562 248646
20034B48646j15499J80732P204J26588J93831K16583L0997k10508j14530p9933
$$ 248646 133147 313879 321083 447671 641502 858085 889082 678574 564044 484111
20024D84111l4011k98294k50147j00483J65833J00085j12045k8085J70594J10943
$$ 484111 450100 151806 -98341 -198824 -32991 67094 -44951 -73036 97558 208501
20014B08501m7155j20831k9890J35221M5918J44389R7230j40021j85666j0645
$$ 208501 161346 40515 10625 145846 191764 336153 433383 293362 107696 97051
20004I7051m8267J76765J06534R7597j54686l07159r7236K40247Q5597j71302
$$ 97051 48784 225549 332083 429680 274994 -32165 -129401 110846 196443 25141
19994B5141m7536P6949J00299j4690J8725L9179M1862J85654J39202j5955k92762
$$ 25141 -22395 54554 154853 140163 158888 198067 239929 425583 564785 548830 256068
19983B56068k26688M3037K84877Q5869M908K2720j17255J00689Q7165j10287j07478
$$ 256068 29380 72417 357294 443163 448071 470791 353536 454225 541390 431103 323625
19972C23625K259K3745O9628j09915N5676m5518j80236J7239R9276K19880J2676
$$ 323625 325884 349629 419257 309342 365018 319500 139264 156503 255779 475659 488335
19961D88335l40852k0119J09573j62513k4105R6091K11065R4699k25555j04251
$$ 488335 147483 127364 236937 74424 50319 146410 357475 452174 226619 122368
19951A22368j35353R3232m2919J09928j02738M7548L84520Q5606p5143j77243
$$ 122368 -12985 80247 37328 147256 44518 92066 476586 562192 487049 309806
19941C09806q0014j7256L80438K08723j47775k15172l706N7999P5012l9030p6499
$$ 309806 229792 212536 592974 801697 653922 438750 435044 493043 568055 529025 452526
19930D52526J15001J49465L4284j86049L3286N2677j6313k39540N3394j31621
$$ 452526 567527 716992 751276 565227 598513 651190 634877 395337 448731 317110
19920C17110k19728J09374o516j230k34762j04207K32940J60154R0790j11858
$$ 317110 97382 206756 200240 199010 -35752 -139959 92981 253135 343925 232067
19910B32067J32952j96920j40009J41429J3479N8150J81441K41243j67178M557
$$ 232067 365019 168099 28090 169519 182998 241148 422589 663832 496654 501211
19900E01211K4171j0825K7898j14084o6123R7061K34200o1039j55305k48366M5646
$$ 501211 525382 514557 542455 428371 362248 459309 693509 632470 477165 228799 274445
19889B74445J89093j925Q6274p3952q0757l62J79462Q5145r6494k76250j93301
$$ 274445 463538 461613 547887 473935 393178 392816 572278 657423 560929 284679 91378
19878I1378K52855K80920J6143k44001j17380M6641j00866k34231R6740Q1005
$$ 91378 344233 625153 641296 397295 279915 326556 225690 -8541 88199 169204
19868A69204o9962N9549K61297Q7566l26068K9159P7184r9163P918r9529r2001
$$ 169204 99242 158791 420088 507654 181586 210745 287929 188766 196684 97155 5154
19857E154N2411K24652J55996j1130k1392j46661j61747J7635L11070P6619N55
$$ 5154 57565 282217 438213 427083 405691 259030 97283 114918 425988 502607 503162
19846E03162j29312J8664O7268L8975k7046Q2829P7852M8731P845j8174j50275
$$ 503162 373850 392514 459782 498757 471711 554540 632392 681123 688968 670794 520519
19835E20519p7062K7817K4399k7558j5369Q4301K84809n3910k64736L7024L092
$$ 520519 443457 471274 495673 468115 452746 537047 821856 767946 503210 540234 543326
19824E43326J00785j22613j89196n95025k10222K65573L46950J20454P0574j13832
$$ 543326 644111 521498 332302 -262723 -472945 -207372 139578 260032 330606 216774
19814B16774j9878j65695J36894J43164P1836q2112J16024K96472j6420j68590
$$ 216774 196896 31201 168095 311259 383095 300983 417007 713479 697059 528469
19804E28469j06446n0217L76439P1572q4755k3330q5576k22526k8640K5226l2828
$$ 528469 422023 371806 748245 819817 735062 711732 626156 403630 374990 400216 367388
19793C67388J5689J6796J98474k1092k87030J74665K17083J35704k04330k40720
$$ 367388 383077 399873 598347 577255 290225 464890 681973 817677 613347 372627
19783C72627K86592J61403R7252J4374r4429k34531M8508O0104P500J0800J1879
$$ 372627 659219 820622 917874 932248 837819 603288 651796 711900 719400 730200 742079
19772G42079O5712J3678j09501j26972O4129j15856k7782j22562j67989N9845
$$ 742079 807791 821469 711968 584996 649125 533269 505487 382925 214936 274781
19762B74781j06018n5103K96994L94812K9451K81547N514l44528k67202J78830
$$ 274781 168763 113660 410654 805466 834917 1116464 1121978 777450 510248 689078
19752F89078K71682k36761j04707M3424j80618k60936R2888M72558k0457j4273
$$ 689078 960760 723999 619292 662716 482098 221162 314050 786608 766151 751878
19742G51878j25665J10362j20834j85326j17030M4828J84506p2343q3617r4134
$$ 751878 626213 736575 615741 430415 313385 358213 542719 470376 386759 292625
19732B92625j39708r3588j664J36878j1350p8503j18841j1797J91891J98384j15325
$$ 292625 152917 59329 57665 194543 183193 104690 -14151 -25948 165943 364327 249002
19721B49002o9068J72851L78802q3119l09501M8992J41724R4051j04508j6594
$$ 249002 179934 352785 731587 648468 338967 387959 529683 623734 519226 502632
19711E02632j26889j2603l6609K80742Q0977P8449k60744k16821j00466P253K72188
$$ 502632 375743 363140 326531 607273 688250 766699 505955 289134 188668 195921 468109
19700D68109J40195j5670m3218l9373k11266j19863K19290K05585J8542J05646
$$ 468109 608304 592634 549416 510043 298777 178914 398204 603789 622331 727977
19690G27977m9433L0958J05282K50440j48603k68422k51671r6350r1362P8206
$$ 727977 678544 709502 814784 1065224 916621 648199 396528 300178 208816 287022
19680B87022L71648J39093j8923r3547k93708j29382J76780K02537K01401J07055
$$ 287022 658670 797763 778840 685293 391585 262203 438983 641520 842921 949976
19670I49976J46403j18958r5226o4770j19861J24722M12893k65387l44624k2587
$$ 949976 1096379 977421 882195 817425 697564 822286 1235179 969792 625168 602581
19660F02581J0564L6451J9018K93844P9432j96273O1049j40342O0364J28439P4472
$$ 602581 613145 649596 668614 962458 1041890 845617 906666 766324 826688 955127 1029599
19649A029599n3058O1297k37095j98287j41747j13619J51490J26818J06329N0046
$$ 1029599 976541 1037838 800743 602456 460709 347090 498580 625398 731727 781773
19639G81773j6141r8822R9837K52832k0704j26859k35475J66979M5741q6496p1392
$$ 781773 765632 666810 766647 1019479 998775 871916 636441 803420 849161 762665 691273
19628F91273J33889j46233k12937J36694K54932P0606j01507m7913j05232o8890
$$ 691273 825162 678929 465992 602686 857618 928224 826717 778804 673572 604682
19618F04682P0368j13680j1320N3538j1594J08660J22076J43423J02355l37884
$$ 604682 675050 561370 550050 603588 591994 700654 822730 966153 1068508 730624
19608G30624j89082K98058J74892k97116j55718J66597K60729K2092j31026J0321
$$ 730624 541542 839600 1014492 717376 561658 728255 988984 1011076 880050 890371
19598H90371k53565j47583p5382M0791J08234K24348Q6028n639J64170j88841
$$ 890371 636806 489223 413841 454632 562866 787214 873242 867603 1031773 842932
19588H42932j24965l6759j72344J3199j8683m0072J12174K9170J57447O0233J90611
$$ 842932 717967 681208 508864 522063 503380 463308 575482 604652 762099 822332 1012943
19577A012943J62272k911k41585R798J41189o6328l54573j62737O8413r4211R9142
$$ 1012943 1175215 1172304 930719 940517 1081706 1015378 660805 498068 566481 472270 571412
19566E71412L22811o7656l5921P0953J13250N3483K108n4871j16356l8504J3130
$$ 571412 894223 826567 790646 861599 974849 1028332 1030440 975569 859213 820709 833839
19555H33839j24962k69405J46551J54042J88583M6829k4675j24922m0136L518
$$ 833839 708877 439472 586023 740065 928648 975477 950802 825880 785744 789262
19545G89262q1427j47312K0701o243R5349Q4245j1957q9124j77736M4191M12361
$$ 789262 707835 560523 581224 574981 670330 754575 742618 653494 475758 519949 932310
19534I32310N7145J3384j54596r1498K02671J32425J264k91694j67764J74619
$$ 932310 989455 1002839 848243 756745 959416 1091841 1093105 801411 633647 808266
19524H08266J75520j80144p5401Q3604j23645j99970m2441J54031n710k7232K96953
$$ 808266 983786 803642 728241 811845 688200 488230 445789 599820 594110 566878 863831
19513H63831M4703n8456j40966o0349J56016J82363p8645K45355K05055r7044
$$ 863831 908534 850078 709112 648763 804779 987142 908497 1153852 1358907 1261863
19503A261863L5100q8602j92337n9934J34642K2110M0337J7280m7596l53871K76286
$$ 1261863 1296963 1208361 1016024 956090 1090732 1112842 1153179 1170459 1122863 768992 1045278
19492A045278K05794p6349p3808N4613K19862J58560j39113j56332j38558l1541
$$ 1045278 1251072 1174723 1100915 1155528 1375390 1533950 1394837 1238505 1099947 1068406
19482A068406J50202O86l7459J50796q0385j69055J78457M0242M4180n0724j9286
$$ 1068406 1218608 1219294 1181835 1332631 1252246 1083191 1261648 1301890 1346070 1295346 1276060
19471A276060J35134m9784l7167j5309l0945L21369K13226L5977j82588p1681
$$ 1276060 1411194 1361410 1324243 1308934 1277989 1599358 1812584 1848561 1665973 1594292
19461A594292Q2492J18418K5210l07941j91373J19555o2231q7855j81480j82300
$$ 1594292 1676784 1795202 1820412 1512471 1321098 1440653 1378422 1290567 1109087 926787
19451I26787J15600P0643K25620J84417k07418J90134J10855j58537j79793L2225
$$ 926787 1042387 1113030 1338650 1523067 1315649 1505783 1616638 1458101 1278308 1310533
19441A310533k4539K54005o3462l2603M3851q6860Q6212j10110J34558J72429
$$ 1310533 1285994 1539999 1476537 1443934 1487785 1400925 1487137 1377027 1511585 1684014
19431A684014N6613l6880P8391J15717J09597K749j61863O2423o2772J3931r0658
$$ 1684014 1740627 1703747 1782138 1897855 2007452 2010201 1848338 1910761 1847989 1861920 1771262
19420A771262k25455L7951Q4944K29634j5978n0154k5101l2717o0624q9469P663
$$ 1771262 1545807 1583758 1668702 1898336 1882358 1832204 1807103 1774386 1713762 1624293 1631956
19409A631956L2257J4806J0043q4488J14147R8356R5880K08188j5789k27879j06560
$$ 1631956 1664213 1679019 1689062 1604574 1718721 1817077 1912957 2121145 2105356 1877477 1770917
19398A770917K6529Q7285J43753Q7371M1961N7431K74702l9385l4445j1806R4743
$$ 1770917 1797446 1884731 2028484 2115855 2157816 2215247 2489949 2450564 2416119 2404313 2499056
19387B499056J96691j41365j99590n2044K4072J2838j67991k25584L5730J35414
$$ 2499056 2695747 2554382 2354792 2302748 2326820 2339658 2171667 1946083 1981813 2117227
19377B117227J14421K29737L5226k34084J86011L7381j08829r4297m0474J95763
$$ 2117227 2231648 2461385 2496611 2262527 2448538 2485919 2377090 2282793 2242319 2438082
19367B438082j87529l73416r0400R9843q1633j57392R0232m1956o47J47635J16846
$$ 2438082 2250553 1877137 1786737 1886580 1804947 1647555 1737787 1695831 1695184 1842819 1959665
19356A959665R1518K1613m662K03661J62445j49922j89426r7246j61749O8439
$$ 1959665 2051183 2072796 2068134 2271795 2434240 2284318 2094892 1997646 1835897 1904336
19346A904336q786j882j03812K0513J44665J68984m6493k63274j93282L07376
$$ 1904336 1895550 1893668 1789856 1810369 1955034 2124018 2077525 1814251 1620969 1928345
19336A928345K93456j36058j78683O753Q1058J730J12284J01263p3394p1431l18840
$$ 1928345 2221801 2085743 1907060 1913813 1994871 1996601 2108885 2210148 2136754 2065323 1746483
19325A746483J03j15997r1369K76802K8652m4100J13419K13882l5321k92566m44971
$$ 1746483 1746586 1630589 1539220 1816022 1844674 1800574 1913993 2127875 2092554 1799988 1355017
19314A355017J15269k7685J56445N1883R2936k32362j35997P7191J35593J33111
$$ 1355017 1470286 1442601 1599046 1650929 1743865 1511503 1375506 1452697 1588290 1721401
19304A721401J36375Q3544o3006Q3759k4994j36822j6670j29330j47202L33254
$$ 1721401 1857776 1941320 1878314 1962073 1937079 1800257 1783587 1654257 1507055 1840309
19294A840309J47502Q4989l90878o4343m8172r1454K63860P3947j74821o1468
$$ 1840309 1987811 2072800 1681922 1617579 1569407 1477953 1741813 1815760 1640939 1579471
19284A579471J60911O1823L4582P0452k7852J28892J61502n1337k35693j62060
$$ 1579471 1740382 1802205 1836787 1907239 1879387 2008279 2169781 2118444 1882751 1720691
19274A720691P7536J65069r4040j12457n7593J583j15206m2151K71688o8535J08064
$$ 1720691 1798227 1963296 1869256 1756799 1699206 1700789 1585583 1543432 1815120 1746585 1854649
19263A854649k9136k37683m2442q4387N0773N6654J09745J50827K23605o2847
$$ 1854649 1825513 1587830 1545388 1461001 1511774 1568428 1678173 1829000 2052605 1989758
19253A989758r4442j39870p2482K3722K16511r7503P6269j32405j6993M9999j6113
$$ 1989758 1895316 1755446 1682964 1706686 1923197 1825694 1901963 1769558 1752565 1802564 1786451
19242A786451j06076R2790M4270M7790j58007j46977q826K03465J36222R336k07955
$$ 1786451 1680375 1773165 1817435 1865225 1707218 1560241 1551415 1754880 1891102 1900438 1692483
19231A692483R4981J55735P3321l09912j20600N0010K16937M4924j44420n75J16828
$$ 1692483 1787464 1943199 2016520 1706608 1586008 1636018 1852955 1897879 1753459 1752884 1869712
19220A869712J09681Q1645R8771j86692k11277k08604R473K26084J39604r4483
$$ 1869712 1979393 2061038 2159809 1973117 1761840 1553236 1562709 1788793 1928397 1833914
19210A833914m9742k8424J54064m7130k25039j28438M1653K5073K07119K95403
$$ 1833914 1784172 1755748 1909812 1862682 1637643 1509205 1550858 1575931 1783050 2078453
19200B078453m4634k31366K9047j03694K07307M5531K61776k9437j07710J8437
$$ 2078453 2033819 1802453 1831500 1727806 1935113 1980644 2242420 2212983 2105273 2123710
19190B123710M3648p2117r9587r6033J34786L3174o984L0476n3224j12057J12844
$$ 2123710 2167358 2095241 1995654 1899621 2034407 2067581 2060597 2091073 2037849 1925792 2038636
19179B038636R9131K6404J26417R9127Q148n6647k38754j63075K46018Q3533j1682
$$ 2038636 2137767 2164171 2290588 2389715 2397863 2341216 2102462 1939387 2185405 2268938 2257256
19168B257256j0370o2910L0293j05831J10784q9149J17500M40615J51663J71097
$$ 2257256 2246886 2183976 2214269 2108438 2219222 2130073 2247573 2688188 2839851 3010948
19158C010948K2482l27015l30196j22776J36611K00180p8500j09966Q3576j60679
$$ 3010948 3033430 2706415 2376219 2253443 2390054 2590234 2511734 2401768 2485344 2324665
19148B324665J17692L40305J86845M9772j1562l15792p5102m63K08920O0513J5242
$$ 2324665 2442357 2782662 2969507 3019279 3007717 2691925 2616823 2616360 2825280 2885793 2901035
19137B901035L0479k34459m9998J31882J20719J9480p9604K14435L37068M7950
$$ 2901035 2931514 2697055 2647057 2778939 2899658 2919138 2839534 3053969 3391037 3438987
19127C438987p5400k20226q756j19612k65947J78700M10726K31501k82463k23401
$$ 3438987 3363587 3143361 3134605 3014993 2749046 2927746 3338472 3569973 3287510 3064109
19117C064109l7243N4776J83905Q5210o4533j24573j20017j25318K07467K01957
$$ 3064109 3026866 3081642 3265547 3350757 3286224 3161651 3041634 2916316 3123783 3325740
19107C325740M030k54783N1148K67758M6277O4672j00897J08975r0963K5037L42479
$$ 3325740 3329770 3074987 3126135 3393893 3440170 3504842 3403945 3512920 3421957 3446994 3789473
19096C789473k16750j72341N1254l7501L258k4770j20645L9563K09966R7908O4166
$$ 3789473 3572723 3400382 3451636 3414135 3417393 3392623 3271978 3311541 3521507 3619415 3683581
19085C683581K27189k25144J0129j9660q7213j12706j53271J6357J17675K6998
$$ 3683581 3910770 3685626 3695755 3676095 3588882 3476176 3322905 3339262 3456937 3483935
19075C483935j19722J06737n306k03649j17292q6068j5367N2277K03623K01245
$$ 3483935 3364213 3470950 3465644 3261995 3144703 3058635 3043268 3095545 3299168 3500413
19065C500413K05634L9561k00854q8615J19346J24838K5605J49513J22186J71925
$$ 3500413 3706047 3745608 3544754 3456139 3575485 3700323 3725928 3875441 3997627 4169552
19055D169552K1620P0088K3739p0985k14623J14487J90185K6117K26720O5377
$$ 4169552 4191172 4261260 4284999 4214014 3999391 4113878 4304063 4330180 4556900 4622277
19045D622277r4912j26649j20726j70306r7145r6041j67904M5652L51222J48746
$$ 4622277 4527365 4400716 4279990 4109684 4012539 3916498 3748594 3794246 4145468 4294214
19035D294214q7084j11465J00263J01262k85397J35250k7609m2086R8004P5167
$$ 4294214 4207130 4095665 4195928 4297190 4011793 4147043 4119434 4077348 4175352 4250519
19025D250519j12517j43811j37224q2430J15148O4914k2785J01210R7632j25478
$$ 4250519 4138002 3994191 3856967 3774537 3889685 3954599 3931814 4033024 4130656 4005178
19015D005178J4934J90673K22577n6015R0493r519j07758J47674L59980K25332
$$ 4005178 4020112 4210785 4433362 4377347 4467840 4458321 4350563 4498237 4858217 5083549
19005E083549j009N3507J02570K5668j1177k8954M2673J69556J52802J73814J44340
$$ 5083549 5082540 5136047 5238617 5264285 5253108 5224154 5266827 5436383 5589185 5762999 5907339
18994E907339M7556Q1588j3361j01994l05880J22532j22149k38267J29525J12549
$$ 5907339 5954895 6036483 6023122 5921128 5615248 5737780 5615631 5377364 5506889 5619438
18984E619438l49161o3105K45736L55188K06147k1200K03312O2454J07197M7507
$$ 5619438 5270277 5207172 5452908 5808096 6014243 5993043 6196355 6258809 6366006 6413513
18974F413513J25465L68074L22479J16375k41468R9552K17657J07142J63297j37175
$$ 6413513 6538978 6907052 7229531 7345906 7104438 7203990 7421647 7528789 7692086 7554911
18964G554911L34871M13150N85770M25419M74379J73629M45840N41488P45527
$$ 7554911 7889782 8302932 8888702 9314121 9788500 9962129 10407969 10949457 11694984
18955A1694984P26959M71773K69286N57453J027881J015469J185720J385881J696391
$$ 11694984 12421943 12893716 13163002 13720455 14748336 15763805 16949525 18335406 20031797
18946B0031797J936868K032804K629827L142207L833664M810799N501035O220115
$$ 20031797 21968665 24001469 26631296 29773503 33607167 38417966 43919001 50139116
18938E0139116O851768P525824Q039489Q225644Q341394Q075465P086370O146820
$$ 50139116 56990884 64516708 72556197 80781841 89123235 97198700 104285070 110431890
18930A10431890N198440M189179L160204J896152L98019j188741k156231l595811
$$ 110431890 115630330 119819509 122979713 124875865 125273884 124085143 121928912 118333101
18922A18333101m750352n820470o659866o928307o828493o290092n884276n171351
$$ 118333101 113582749 107762279 101102413 94174106 87345613 81055521 75171245 69999894
18914F9999894m324866l227280k274459j706844j513048q68444n11875k98697
$$ 69999894 65675028 62447748 60173289 58466445 56953397 56084953 55573078 55274381
18906E5274381K17869N91409Q55819J519612J852847J819754K582433L604677
$$ 55274381 55492250 56083659 56939478 58459090 60311937 62131691 64714124 68318801
18898F8318801M298229M678264N279402O185448P017174Q238217Q673411R622415
$$ 68318801 72617030 77295294 82574696 88760144 95777318 104015535 112688946 122311361
18890A22311361R956539J0101528J0339240R968933R289783Q531976P745182O202942
$$ 122311361 132267900 142369428 152708668 162677601 171967384 180499360 188244542 194447484
18882A94447484M616501L152794J706241M408j744128l162292m795838o029614
$$ 194447484 199063985 202216779 203923020 203927428 202183300 199021008 194225170 188195556
18874A88195556o978358p990828q735517r437470r650126r223734q191413p795022
$$ 188195556 181217198 173226370 164490853 155053383 145403257 136179523 127988110 120193088
18866A20193088p351927o467267n883135n390066m812792m162681l379729k849037
$$ 120193088 112841161 106373894 100490759 95100693 90287901 86125220 82745491 79896454
18858G9896454k226051j903619j478072q10581m10316K41112O29870R45558J083511
$$ 79896454 77670403 75766784 74288712 73478131 73067815 73308927 73938797 74884355 75967866
18849G5967866J363936J564819J756981J419200J375976J236981J033071P88964
$$ 75967866 77331802 78896621 80653602 82072802 83448778 84685759 85718830 86507794
18841H6507794Q09898P16543J16074l11481m02304l23358m94149q25187r38304
$$ 86507794 87317692 88034235 88150309 87838828 87436524 87113166 86619017 85793830 84855526
18832H4855526o29185j040820r42415j169288j233068j240203j114743j352621
$$ 84855526 84226341 83185521 82243106 81073818 79840750 78600547 77485804 76133183
18824G6133183j693788j750809k137470k525581k724607k884547l095910l340720
$$ 76133183 74439395 72688586 70551116 68025535 65300928 62416381 59320471 55979751
18816E5979751l420468l181470l148738l083743k684561k568449k207672j916254
$$ 55979751 52559283 49377813 46229075 43145332 40460771 37892322 35684650 33768396
18808C3768396j669837j469451j254687j342235j103008r35998r95630r09017
$$ 33768396 32098559 30629108 29374421 28032186 26929178 25993180 24997550 24088533
18800B4088533p43462o69328o11366m47341m95773p29880m16153m59630l15035
$$ 24088533 23345071 22675743 22064377 21617036 21121263 20391383 19975230 19515600 19200565
18791A9200565l63812l62964l79061l33336k57197j81688l13518m65316l03430
$$ 19200565 18836753 18473789 18094728 17761392 17504195 17322507 17008989 16543673 16240243
18782A6240243k84165k21103l72801k88231j72916J77817q5947l21975j20613
$$ 16240243 15956078 15734975 15362174 15073943 14901027 15078844 14992897 14670922 14550309
18773A4550309k14866j3375r4295r6455L17926P6420l63758k36774m64063m80096
$$ 14550309 14335443 14322068 14227773 14131318 14449244 14525664 14161906 13925132 13461069 12980973
18763A2980973l67790p7956L0385j91298m4219L4673K2475k46903l46131j94418
$$ 12980973 12613183 12535227 12565612 12374314 12330095 12364768 12387243 12140340 11794209 11599791
18753A1599791j40323J28821o8908j73353j39925j67579l0301L7443k87676p0352
$$ 11599791 11459468 11588289 11519381 11346028 11206103 11038524 11008223 11045666 10757990 10687638
18743A0687638K26502J50490j74332o3127r0477q9559J57044J47791j92457Q779
$$ 10687638 10914140 11064630 10890298 10827171 10736694 10647135 10804179 10951970 10759513 10768292
18733A0768292K20243o5917P1258p8453p322P3034P1203j3404P6324n3794k81504
$$ 10768292 10988535 10922618 10993876 10915423 10908101 10981135 11052338 11038934 11115258 11061464 10779960
18722A0779960N1759Q9319j32690j69052k45039R7414L7866o708O9470L70668
$$ 10779960 10831719 10921038 10788348 10619296 10374257 10471671 10509537 10502829 10572299 10942967
18712A0942967K50855j21159j11995K1999j69183K6202r8057J4631Q8292K51021
$$ 10942967 11193822 11072663 10960668 10982667 10813484 10839686 10741629 10756260 10844552 11095573
18702A1095573J15453J98329Q5691L284q3899j66580j51228K00738J53229q27
$$ 11095573 11211026 11409355 11495046 11498330 11414431 11247851 11096623 11297361 11450590 11449763
18692A1449763Q6791J0580n2103l2386Q2773K02825M22210j66153l01077O4952
$$ 11449763 11536554 11547134 11495031 11462645 11545418 11748243 12170453 12004300 11703223 11768175
18682A1768175J45919K86679L25921j94614j15965K12845M3138L28991J66530
$$ 11768175 11914094 12200773 12526694 12332080 12216115 12428960 12472098 12801089 12967619
18673A2967619J37020L0364Q1213J65075K66822J57470K44629J22405Q8899K59824
$$ 12967619 13104639 13135003 13216216 13381291 13648113 13805583 14050212 14172617 14261516 14521340
18663A4521340K27386J02811K66225L81715P49584M60808M89610N02902O01043
$$ 14521340 14748726 14851537 15117762 15499477 16249061 16709869 17199479 17702381 18303424
18654A8303424N42278P47565R12401J245685J298306J619239J780833K116499
$$ 18303424 18845702 19593267 20505668 21751353 23049659 24668898 26449731 28566230
18646B8566230K589997K480686K703933K905438L697446L945204L842282L703442
$$ 28566230 31156227 33636913 36340846 39246284 42943730 46888934 50731216 54434658
18638E4434658L490279L182547K706577K284397J919992J337619Q10058M42423
$$ 54434658 57924937 61107484 63814061 66098458 68018450 69356069 70166127 70608550
18630G0608550j23445m96208q25021q94850j340559j581243j325457q32803o91839
$$ 70608550 70485105 69988897 69163876 68269026 66928467 65347224 64021767 63188964 62497125
18621F2497125m26139K31790J011665J298970J510816K164213K363865K550526
$$ 62497125 62070986 62302776 63314441 64613411 66124227 68288440 70652305 73202831
18613G3202831K573367K389152K203777J528917J614581J142862L87569J26539
$$ 73202831 75776198 78165350 80369127 81898044 83512625 84655487 85043056 85169595
18605H5169595j7032l73696o17665p72406p37194n27586O1933L24926O36930J099926
$$ 85169595 85152563 84778867 84161202 83388796 82651602 82124016 82185949 82510875 83147805 84247731
18595H4247731J751798K372930K176494K437158K554607K552292K248205J589596
$$ 84247731 85999529 88372459 90548953 92986111 95540718 98093010 100341215 101930811
18587A01930811R86669N85306j49874p73754j174579j457426j958094k370691
$$ 101930811 102917480 103502786 103352912 102579158 101404579 99947153 97989059 95618368
18579I5618368k514013k332583j801717j756699j279547n45441K89289R15337
$$ 95618368 93104355 90771772 88970055 87213356 85933809 85388368 85677657 86592994
18571H6592994J564948J979794K594039K751188K761690L124476K713808K584640
$$ 86592994 88157942 90137736 92731775 95482963 98244653 101369129 104082937 106667577
18563A06667577K220657J566713J226817M18148p3360o06003j021008j455987
$$ 106667577 108888234 110454947 111681764 112099912 112026552 111420549 110399541 108943554
18555A08943554k207319j959403k059836k146976k134551k470435k490112k139996
$$ 108943554 106736235 104776832 102716996 100570020 98435469 95965034 93474922 91334926
18547I1334926k050766k486736k132351j712421j995004k252071k291717j915485
$$ 91334926 89284160 86797424 84665073 82952652 80957648 78705577 76413860 74498375
18539G4498375k144899k302205k173243k431922k419121k294070k271811j795856
$$ 74498375 72353476 70051271 67878028 65446106 63026985 60732915 58461104 56665248
18531E6665248j502030j298609j154950r21674p89070n63563j01162K52044J99691
$$ 56665248 55163218 53864609 52709659 51787985 50998915 50435352 50334190 50586234 50785925
18522E0785925L68003O51138R02306J231944J565422J706378J956185K338388
$$ 50785925 51153928 51805066 52707372 53939316 55504738 57211116 59167301 61505689
18514F1505689K562169K827192L015704L334565L145554L303027L351318K920862
$$ 61505689 64067858 66895050 69910754 73245319 76390873 79693900 83045218 85966080
18506H5966080K766625K392539K148284J731998R35091J88743j83012m15212j241770
$$ 85966080 88732705 91125244 93273528 95005526 95940617 96129360 95946348 95531136 94289366
18497I4289366j872683k349499k909517l194587l267393l525772l523141l429204
$$ 94289366 92416683 90067184 87157667 83963080 80695687 77169915 73646774 70217570
18489G0217570l195281l239844l287774k933765k487401k381971j931342j802655
$$ 70217570 67022289 63782445 60494671 57560906 55073505 52691534 50760192 48957537
18481D8957537j616064r51072p10419n56794k18997r5066M07560M19425L58085
$$ 48957537 47341473 46390401 45679982 45123188 44904191 44809125 45216685 45636110 45994195
18472D5994195N26351J006907J358948J559395J502138J752643J698033J625226
$$ 45994195 46520546 47527453 48886401 50445796 51947934 53700577 55398610 57023836
18464E7023836J799212J601441J506588R06528Q73126M64376j00860n86991r23724
$$ 57023836 58823048 60424489 61931077 62837605 63710731 64175107 64074247 63487256 62563532
18455F2563532q73287j381785j783813j907552k259902k214100k219233k274350
$$ 62563532 61690245 60308460 58524647 56617095 54357193 52143093 49923860 47649510
18447D7649510k189421k418980k211819j888150j856445j684820j402006j344843
$$ 47649510 45460089 43041109 40829290 38941140 37084695 35399875 33997869 32653026
18439C2653026j217956o85128p70725j049376q26323o83294m61886m10937o21111
$$ 32653026 31435070 30749942 29979217 28929841 28103518 27420224 26958338 26547401 25926290
18430B5926290p19989l29003m56216m55899l90380m36799l26764n39344l3527
$$ 25926290 25206301 24877298 24421082 23965183 23574803 23138004 22811240 22271896 22238369
18421B2238369K2912k97411k64695l55451l53194n6517k9744q7095q0390p1224
$$ 22238369 22261281 21963870 21699175 21343724 20990530 20934013 20904269 20817174 20736784 20665560
18411B0665560j39342k04323j06200K20734Q1832m5458o4338K45870K61108k8658
$$ 20665560 20526218 20321895 20215695 20436429 20518261 20472803 20408465 20654335 20915443 20886785
18401B0886785L05597K31944M81913O95959M98906N16694P80058P53424J101687
$$ 20886785 21192382 21424326 21906239 22602198 23101104 23617798 24397856 25151280 26252967
18392B6252967J517794J850269J708138K102121K525453L219715L388475L465839
$$ 26252967 27770761 29621030 31329168 33431289 35956742 39176457 42564932 46030771
18384D6030771L874551L779824L253161L188018K941048K246431J731834J286520
$$ 46030771 49905322 53685146 56938307 60126325 63067373 65313804 67045638 68332158
18376F8332158Q34584O39036L4587p12256j347850j950786k525656k769144k856134
$$ 68332158 69166742 69805778 69840365 69128109 67780259 65829473 63303817 60534673 57678539
18367E7678539k740653k354860k057961j758431j270516q37567n79223J2704K84054
$$ 57678539 54937886 52583026 50525065 48766634 47496118 46658551 46079328 46092032 46376086
18358D6376086K66319O20657P25054R61443J066612J100720J044808J078411J296451
$$ 46376086 46642405 47263062 47988116 48949559 50016171 51116891 52161699 53240110 54536561
18349E4536561J237409J397652J900305K436963K489154K969182M031820M840119
$$ 54536561 55773970 57171622 59071927 61508890 63998044 66967226 70999046 75839165
18341G5839165N845707O284127P151561Q093037Q513336P944444P426190O911777
$$ 75839165 81684872 87968999 95120560 103213597 111726933 119671377 127097567 134009344
18333A34009344N994434M760810L553204K770090J501447M54562j058739k183560
$$ 134009344 140003778 144764588 148317792 151087882 152589329 153043891 151985152 149801592
18325A49801592l189172m246698n077468n694868o030568n898494n391606m639657
$$ 149801592 146612420 142365722 137288254 131593386 125562818 119664324 114272718 109633061
18317A09633061l832620l192773k264956j350858r43429l79082L77228L71358
$$ 109633061 105800441 102607668 100342712 98991854 98048425 97669343 98046571 98417929
18309I8417929O93381O22634M56252M07736r9073l39769n28931r09513j308478
$$ 98417929 99111310 99733944 100190196 100597932 100498859 100159090 99630159 98720646 97412168
18300I7412168r02763l85600l57741l04159J65820O39997J148228K061935L097916
$$ 97412168 96509405 96123805 95766064 95461905 95627725 96267722 97415950 99477885 102575801
18291A02575801L175658L357289L657499L227075K778908K236818J902839J139074
$$ 102575801 105751459 109108748 112766247 115993322 118772230 121009048 122911887 124050961
18283A24050961P37774K38214p4377n31698r53409j300128j785792k213434k260199
$$ 124050961 124788735 125026949 124952572 124420874 123467465 122167337 120381545 118168111 115907912
18274A15907912k321389k373054j848309j924534j372003j156917r44100n16654
$$ 115907912 113586523 111213469 109365160 107440626 106068623 104911706 103967606 103450952
18266A03450952n58460l99502l46049n27141p83422r71492j137610j638092k195366
$$ 103450952 102892492 102492990 102146941 101619800 100836378 99864886 98727276 97089184 94893818
18257I4893818k443784k629241l048705l145547k948594k500980k490817k505025
$$ 94893818 92450034 89820793 86772088 83626541 80677947 78176967 75686150 73181125
18249G3181125j967272j612147j794290j763881j502372p57982k85129M93267
$$ 73181125 71213853 69601706 67807416 66043535 64541163 63783181 63498052 63991319
18241F3991319J216094K006284K967438M030776M322979M581223M976944N248449
$$ 63991319 65207413 67213697 70181135 74211911 78534890 83116113 88093057 93341506
18233I3341506N121234M931592M986658N099115N776982N925038N222962M379417
$$ 93341506 98462740 103394332 108380990 113480105 119257087 125182125 130405087 134784504
18225A34784504L190866J340812l59067j251651j742551k223917k269083k317942
$$ 134784504 137975370 139316182 138957115 137705464 135962913 133738996 131469913 129151971
18217A29151971k915840l583368m126036m489543m098587l903540l420935l112318
$$ 129151971 126236131 122652763 118526727 114037184 109938597 106035057 102614122 99501804
18209I9501804k422820k176927j667988j092814q99840j228560j290822j145232
$$ 99501804 97078984 94902057 93234069 92141255 91241415 90012855 88722033 87576801
18201H7576801o92804r53359p98048m86706k8285K60091O08954Q08386J396949
$$ 87576801 86883997 85930638 85132590 84645884 84617599 84877690 85486644 86295030 87691979
18192H7691979K392596L258043M158700M704017M891646M970393N014525N251586
$$ 87691979 90084575 93342618 97501318 102205335 107096981 112067374 117081899 122333485
18184A22333485N217909N222787N236486N381557M849512L541546K007500J9672
$$ 122333485 127551394 132774181 138010667 143392224 148241736 151783282 153790782 153810454
18176A53810454j603290k575353k870628k498560j935260j688327k190456k602290
$$ 153810454 152207164 149631811 146761183 144262623 142327363 140639036 138448580 135846290
18168A35846290l127010l347397l039977k492458k147162j469418j124230p90051
$$ 135846290 132719280 129371883 126331906 123839448 121692286 120222868 119098638 118308587
18160A18308587o97264o81021j268588j598521k091430k859344l381205k877760
$$ 118308587 117611323 116930302 115661714 114063193 111971763 109112419 105731214 102853454
18152A02853454l157098l428077l661679l230785l205581l338319k650565k311040
$$ 102853454 99696356 96268279 92606600 89375815 86170234 82831915 80181350 77870310
18144G7870310k086242p91352k06811J12307K96877N69623O62857J091455J061892
$$ 77870310 75784068 74992716 74785905 74898212 75195089 75764712 76427569 77519024 78580916
18135G8580916J287868J565956J623302J241694R22123J57419l57760J12533L14658
$$ 78580916 79868784 81434740 83058042 84299736 85221859 85379278 85021518 85134051 85448709
18126H5448709J94572N99499J240719J416810J319153J481322K005765K403745
$$ 85448709 85643281 86242780 87483499 88900309 90219462 91700784 93706549 96110294
18118I6110294L372135N551803R228370J6470996K8663885M1684065L8553268
$$ 96110294 99482429 105034232 114262602 130733598 159397483 201081548 239634816
18111B39634816K4707303K7799210K4084764J960398n2306309o8885103m4998447
$$ 239634816 264342119 292141329 316226093 318186491 265880182 196995079 151996632
18104A51996632k8752549j9291017j3269921r741503p421682o008260n108109
$$ 151996632 123244083 103953066 90683145 80941642 73519960 67511700 62403591
18097F2403591m561569l591785k873090k416948k327616j878646j157271j213594
$$ 62403591 57842022 54250237 51377147 48960199 46632583 44753937 43596666 42383072
18089D2383072j316250j265373j131963j115772j148340j082063q72032p08318
$$ 42383072 41066822 39801449 38669486 37553714 36405374 35323311 34451279 33742961
18081C3742961o91344l39014m71145k79723J58726K14643j81614n1175o1821q8212
$$ 33742961 33051617 32712603 32241458 31961735 32120461 32335104 32153490 32102315 32040494 31952282
18071C1952282K3833l15004m01903n20384n92364m56187n36106p30861j161292
$$ 31952282 31976115 31661111 31259208 30738824 30146460 29690273 29154167 28423306 27262014
18062B7262014j084486r88153j358177j120898r13189j017268j159833q50636
$$ 27262014 26177528 25189375 23831198 22710300 21797111 20779843 19620010 18769374
18054A8769374r43169p28526q69583n89785n81865k46994l56404m20047l10027
$$ 18769374 17826205 17097679 16228096 15638311 15056446 14809452 14453048 14033001 13722974
18045A3722974l45793j38411k42148k68633n53700n89268k71778J5498p565l28950
$$ 13722974 13377181 13238770 12996622 12727989 12174289 11585021 11313243 11328741 11321176 10992226
18035A0992226m38934k60102j79266l46617l35860l02161l26769j14246n6652
$$ 10992226 10553292 10293190 10113924 9767307 9431447 9129286 8802517 8688271 8631619
18026H631619j23857j32588j87799k29343j01721l459j37356J24271p9855j56792
$$ 8631619 8507762 8375174 8187375 7958032 7856311 7852852 7715496 7839767 7759912 7603120
18016G603120j68422j43211J11770q6872Q8315o4628k64976R3549p1715l41706
$$ 7603120 7434698 7291487 7403257 7316385 7404700 7340072 7075096 7168645 7096930 6755224
18006F755224k0552P4034k36890j04415J99777r3154n20437l24679j10893M4210
$$ 6755224 6734672 6808706 6571816 6467401 6667178 6574024 6053587 5728908 5618015 5662225
17996E662225J029k58651m7563q1765m9971j90089j43610Q5781k4329j01074j3405
$$ 5662225 5663254 5404603 5357040 5275275 5225304 5035215 4891605 4977386 4953057 4851983 4838578
17985D838578j37355j45382o002j8269j3431k25706p6941L0640L0568R521N7786
$$ 4838578 4701223 4555841 4549839 4531570 4518139 4292433 4215492 4246132 4276700 4286221 4344007
17974D344007J51922j05086l09803j42896q1402m7126p782J76572p4642m20611
$$ 4344007 4495929 4390843 4081040 3938144 3856742 3809616 3801834 3978406 3903764 3483153
17964C483153k08518j4333J78954m9380j5347R5970K75097R4634j1958j45731
$$ 3483153 3274635 3260302 3439256 3389876 3374529 3470499 3745596 3840230 3828272 3682541
17954C682541k39232j02894Q3405K63127K1598k16975K1331q6784l78958j63400
$$ 3682541 3443309 3340415 3423820 3686947 3708545 3491570 3512901 3426117 3047159 2883759
17944B883759J29700J66268j31778o522K05753N3275k76736k40525j66186J67917
$$ 2883759 3013459 3179727 3047949 3041427 3247180 3300455 3023719 2783194 2617008 2784925
17934B784925J00056K21708J89084j32579j98542J90655o2919j02251R8590L391
$$ 2784925 2884981 3106689 3295773 3163194 2964652 3155307 3092388 2990137 3088727 3092118
17924C092118M67j4403n3707j67916p7159M0365k27225O9717m2070J9988K2371
$$ 3092118 3092585 3078182 3024475 2856559 2779400 2819765 2592540 2662257 2620187 2640175 2662546
17913B662546q6278M9720K16057J21128k84966j25944K30391K670k29364j35832
$$ 2662546 2576268 2625988 2842045 2963173 2678207 2552263 2782654 2785324 2555960 2420128
17903B420128J3093J09301j35047J60680m4842R782Q1481J09625j04434k02316
$$ 2420128 2433221 2542522 2407475 2568155 2523313 2533095 2614576 2724201 2619767 2417451
17893B417451n9127m2570k41557K18099M11597Q3647j54887l047J233J15642L8480
$$ 2417451 2358324 2315754 2074197 2292296 2703893 2787540 2632653 2629606 2630839 2746481 2784961
17882B784961K3067m3876k24243j09103k13626J61725J67776k56738l24554M48311
$$ 2784961 2808028 2764152 2539909 2430806 2217180 2378905 2546681 2289943 1965389 2413700
17872B413700J63942j27198J27498Q5124J00846m49l5398k65685j14591J91240
$$ 2413700 2577642 2450444 2577942 2663066 2763912 2763463 2728065 2462380 2347789 2539029
17862B539029P1153j07195K26599o0840j0855K53512o0194l76131L4653k08211
$$ 2539029 2610182 2502987 2729586 2668746 2657891 2911403 2851209 2475078 2509731 2301520
17852B301520j1041K79056l46017j02657J98m9456M7466Q4933L08425j33622k01734
$$ 2301520 2290479 2569535 2223518 2120861 2121059 2071603 2119069 2204002 2512427 2378805 2177071
17841B177071Q074k79333k24895L58212J74576j0234J2961K41925l4574k28625
$$ 2177071 2185145 1905812 1680917 2039129 2213705 2203471 2216432 2458357 2423783 2195158
17831B195158m73396j25123J47291M59923J00789n5755M6454j4807k74038j23643
$$ 2195158 1721762 1596639 1743930 2203853 2304642 2248887 2295341 2280534 2006496 1882853
17821A882853R6141L15855r869N8997O4776k7342j63754n9245J10743o2960j36704
$$ 1882853 1978994 2294849 2284980 2343977 2408753 2381411 2217657 2158412 2269155 2206195 2069491
17810B069491k6576N0821r7632m2270j65199p4561L19100j42334j60282J11093
$$ 2069491 2042915 2093736 1996104 1953834 1788635 1714074 2033174 1890840 1730558 1841651
17800A841651J56902n3534j23134n366P3934p2301J00663m8107k28284O2878J8037
$$ 1841651 1998553 1945019 1821885 1816519 1890453 1818152 1918815 1870708 1642424 1705302 1723339
17789A723339O6216K6576P7489n7372J17202o5745n5L8689M1587m1729j05509
$$ 1723339 1789555 1816131 1893620 1836248 1953450 1887705 1887650 1926339 1967926 1926197 1820688
17778A820688p4113o6497L2326L9151K05020J25639M6541p7228k4807k32838K9134
$$ 1820688 1746575 1680078 1712404 1751555 1956575 2082214 2128755 2051527 2026720 1793882 1823016
17767A823016O3846r0147O1769N380J2157J18921j59073k6213j58274P6457N700
$$ 1823016 1886862 1796715 1858484 1863864 1876021 1994942 1835869 1809656 1651382 1727839 1733539
17756A733539j7371k5752N5014j4687R4242o916L2147L8389Q7697q7507k45744
$$ 1733539 1716168 1690416 1745430 1730743 1824985 1818069 1850216 1888605 1976302 1888795 1643051
17745A643051k9484j14470J65362L6297j13656j30682J8963K1100Q5186K2315
$$ 1643051 1613567 1499097 1664459 1700756 1587100 1456418 1475381 1496481 1581667 1603982
17735A603982j10374K3771J49248J72612j7624M4293j29891l33945j77863N2919
$$ 1603982 1493608 1517379 1666627 1839239 1821615 1865908 1736017 1402072 1224209 1277128
17725A277128K78573m076K8568J46670n1251r5352q4329j65068r454K69226M8712
$$ 1277128 1555701 1551625 1580193 1726863 1675612 1580260 1495931 1330863 1321409 1590635 1639347
17714A639347l6192J84964P2210k7957k50301j04823j83079K6595K17999P6660
$$ 1639347 1603155 1788119 1860329 1832372 1582071 1477248 1294169 1320764 1538763 1615423
17704A615423M0995J22971q2082k42424K8667j70550L374L4621n9223j67200M8773
$$ 1615423 1656418 1779389 1697307 1454883 1483550 1313000 1316374 1350995 1291772 1124572 1173345
17693A173345J55450K39576J85635j2966K1860J85225O6558k25279j87040R8859
$$ 1173345 1328795 1568371 1754006 1741040 1762900 1948125 2014683 1789404 1602364 1701223
17683A701223o2851j40496J38462N0653M6811M7214J40763l57512p7965J33043
$$ 1701223 1638372 1497876 1636338 1686991 1733802 1781016 1921779 1564267 1486302 1619345
17673A619345j34626R1308k9073k96237o7332J80664K60424j2453L3039r4857
$$ 1619345 1484719 1576027 1546954 1250717 1183385 1364049 1624473 1612020 1645059 1550202
17663A550202j17474K5077j660j33610p7250R6069K00729j66413K8259J06445
$$ 1550202 1432728 1457805 1456145 1322535 1245285 1341354 1542083 1375670 1403929 1510374
17653A510374Q5177N7102Q6562j47691o4023j54438m3163K0332p2780J81916o478
$$ 1510374 1595551 1652653 1739215 1591524 1527501 1373063 1329900 1350232 1277452 1459368 1452890
17642A452890j10960J53112M7652N3498k0884l05447j55616k305M9468K08919
$$ 1452890 1341930 1495042 1542694 1596192 1575308 1269861 1114245 1111940 1161408 1370327
17632A370327K4884k69637k21583L32176J20096J05539J3705l7576l21268l41993
$$ 1370327 1395211 1125574 903991 1236167 1356263 1461802 1475507 1437931 1116663 774670
17622G74670J59928o4617K15679J06589k76667J53029J10586K7681J38384J00463
$$ 774670 934598 869981 1085660 1192249 915582 1068611 1179197 1206878 1345262 1445725
17612A445725k66189j04955l1921q1559j03150O8347L23653J8064j00848J14894
$$ 1445725 1179536 1074581 1042660 961101 857951 926298 1249951 1268015 1167167 1282061
17602A282061O9969J3415l02999p6369M3394L5162p6162Q6893j2975r1191R291
$$ 1282061 1352030 1365445 1062446 986077 1029471 1064633 988471 1075364 1062389 971198 980489
17591I80489K5735J42444j47748j02088R2278l5560p086r5601j09579K7434R4811
$$ 980489 1006224 1148668 1000920 898832 991110 955550 948464 852863 743284 770718 865529
17580H65529P0925N6879J34260J28987j37106j03232K71013R8040j4245J7475
$$ 865529 936454 993333 1127593 1256580 1119474 1016242 1287255 1385295 1371050 1388525
17570A388525j57026k19311k0370O5439J75975M0949k06949j87761o7032R8053
$$ 1388525 1231499 1012188 991818 1057257 1233232 1274181 1067232 879471 812439 910492
17560I10492J10k77338R4905J16512j48363j12456J68973q9726P0928L51898L2247
$$ 910492 910602 633264 728169 844681 696318 583862 752835 663109 734037 1085935 1118182
17549A118182r7678n8144j89442k20416r1901q1353l2045K16167R0168J93264
$$ 1118182 1020504 962360 772918 552502 460601 379248 347203 563370 653538 846802
17539H46802J56685j07883k11443j16503l6524O4319K08315J65602O7275k28280
$$ 846802 1003487 895604 684161 567658 531134 595453 803768 969370 1036645 808365
17529H08365k38199m2731k537q3765j12343O4811J25618o5013q2809L03498P4147
$$ 808365 570166 527435 524898 441133 328790 393601 519219 454206 371397 674895 749042
17518G49042L9621l691j18214O843r9408k62363k17446k4981K74577J43891J77297
$$ 749042 788663 784972 666758 673601 574193 311830 94384 69403 343980 487871 665168
17507F65168Q1593j25354k46901M9172m109R3041k725Q6528q6539K3668K23082
$$ 665168 746761 621407 374506 423678 419569 512610 509885 596413 509874 533542 756624
17496G56624K5452k11062k05521p5062L6379q0014Q3144J62860l40396j83199
$$ 756624 782076 571014 365493 290431 326810 246796 329940 492800 152404 -30795
17486c0795J53697R7442L81690k9417j13716J12033l9796Q9877K65017M9292j93767
$$ -30795 122902 220344 602034 572617 458901 570934 531138 621015 886032 935324 741557
17475G41557m6393K9553j38756l08005o5622k67592k70184K33277J45886K95234
$$ 741557 695164 724717 585961 277956 212334 -55258 -325442 -92165 53721 348955
17465C48955L38039r5571l3290l04196o8488q4603J99514J57926N0419J84559
$$ 348955 686994 591423 558133 253937 185449 100846 300360 458286 508705 693264
17455F93264J38269J61472J06555n8188j32056J40573k601L6556k78771K44235
$$ 693264 831533 993005 1099560 1041372 909316 1049889 1047288 1083844 805073 1049308
17445A049308K96714M7573Q1143K38581j39997l07804l09444k76798n3335p9446
$$ 1049308 1346022 1393595 1474738 1713319 1573322 1265518 956074 679276 625941 546495
17435E46495j55135m8294q525K91080L27284j08505m39965K14828J23627k3641
$$ 546495 391360 343066 334541 625621 952905 844400 404435 619263 742890 719249
17425G19249m12594j97182K62524O7883m9867J24396L02265L06062n8999n9230
$$ 719249 306655 109473 371997 439880 390013 514409 816674 1122736 1063737 1004507
17415A004507R3442j87641k06841J4435Q0643J14268k19057q450k0303p2694J2338
$$ 1004507 1097949 910308 703467 717902 798545 912813 693756 685306 665003 592309 604647
17404F04647P4013Q2173n9640j01070J63976o1894j38471p3387M8385O8036j08554
$$ 604647 678660 760833 701193 600123 764099 702205 563734 490347 538732 606768 498214
17393D98214J35767J97720o6547k55208N0183j72321k36377K00513K62847k0214
$$ 498214 633981 831701 765154 509946 560129 387808 151431 351944 614791 594577
17383E94577j70474j62421j38982R8035q86l1066N2867O7411J25459p2224l9280
$$ 594577 424103 261682 122700 220735 219849 188783 241650 309061 434520 362296 323016
17372C23016J4236l8766J27625j19735j86280m4602K73076j46604k49286J3688
$$ 323016 337252 298486 426111 306376 120096 75494 348570 201966 -47320 -33632
17362c3632N6081K70721J82191Q2816r1455k78503r8819J71094L52918Q4631l0149
$$ -33632 22449 293170 475361 558177 466722 188219 89400 260494 613412 698043 667894
17351F67894q4884J7021j94693j40828L2456O325n7462j95296j59108J65466K47412
$$ 667894 583010 600031 405338 264510 296966 303291 245829 50533 -108575 56891 304303
17340C04303J70502j61678q8594R3414R3118K04968j9952l01246j85177j45323
$$ 304303 474805 313127 224533 317947 411065 616033 596081 294835 109658 -35665
17330c5665m0924P1557K55961j23991l13408j87614J17619K96492J31780J36984
$$ -35665 -76589 -5032 250929 126938 -186470 -374084 -256465 40027 171807 308791
17320C08791J4617k17758k56850L75399M6045o702J21956J09565j34628j07195
$$ 308791 323408 105650 -151200 224199 270244 263542 385498 495063 360435 253240
17310B53240o1566j68368j26783Q3557J24026j45883n0930J27351K07973m9798
$$ 253240 191674 23306 -103477 -19920 104106 -41777 -92707 34644 242617 192819
17300A92819K26089J31463r4471O2689j12233l12350j07004J24990J35040J30225
$$ 192819 418908 550371 455900 518589 406356 94006 -12998 111992 247032 377257
17290C77257R4651l5059N002K44875O4463j81336k42428j90982O6147R7265N5720
$$ 377257 471908 436849 441851 686726 751189 569853 327425 136443 202590 299855 355575
17279C55575l5030j07056k67339N431J26314K25725M3512j67172j22954O2302
$$ 355575 320545 213489 -53850 -48419 77895 303620 347132 179960 57006 119308
17269A19308O6917p1694K1203r5263j89115J54153K36061M40830J38698j41895
$$ 119308 186225 114531 135734 40471 -148644 5509 241570 682400 821098 679203
17259F79203j68734k53659l3690n9822K9615J10658r7231l1300k04290M0766R2198
$$ 679203 510469 256810 223120 163298 192913 303571 206340 175040 -29250 11516 103714
17248A03714n1001K2015J56232q7085K10832J74597N8976p9915j75064j86774
$$ 103714 52713 74728 230960 143875 354707 529304 588280 508365 333301 146527
17238A46527k39752M3601M36410M9537j91022l53563N7513L31114K10823k4759
$$ 146527 -93225 -49624 386786 436323 245301 -108262 -50749 280365 491188 466429
17228D66429r81R1854J0925p2035n0294q9636j8531j20350j1032K3560k74537
$$ 466429 465448 557302 568227 496192 445898 356262 337731 217381 206349 229909 -44628
17217d4628q1214J66199j54000M3887q2829n1820J3455K74260K00157m62p283
$$ -44628 -125842 40357 -113643 -69756 -152585 -204405 -190950 83310 283467 283005 275722
17206B75722L9847p3676j0230q4935R3139N8420m9458J12532N581R5084r9590
$$ 275722 315569 241893 231663 146728 239867 298287 248829 361361 366942 462026 362436
17195C62436n557M807j08154O7853l0779K4390q735k4654Q6686J37640K01062
$$ 362436 356879 361686 253532 321385 290606 314996 306261 281607 368293 505933 706995
17184G06995O0641j76082j50676N5104m4415r1778l3351J7542P3101L4030j88678
$$ 706995 767636 591554 440878 495982 451567 359789 326438 343980 417081 451111 262433
17173B62433q9401J68651n1136j15000N6609m8928J87189L8824K42034j4129l08287
$$ 262433 173032 341683 290547 175547 232156 183228 370417 409241 651275 637146 328859
17162C28859k85146L6885K01341j14656j8177J53201M7592k6501j06132L1834
$$ 328859 43713 80598 281939 167283 149106 302307 349899 323398 217266 249100
17152B49100J8144N3108L6151j25592k55957L9260K10596K8853M8181J14310k52451
$$ 249100 267244 320352 356503 230911 -25046 14214 224810 253663 301844 416154 163703
17141A63703J24353K83197P4239K8075J4939m8277l69458k53779J2879J11481
$$ 163703 288056 571253 645492 673567 688506 640229 270771 16992 29871 141352
17131A41352L7546l498J9882o9119k01865j5879J04444K38308m06127o2206J49258
$$ 141352 178898 175400 195282 126163 -75702 -91581 12863 251171 -154956 -217162 -67904
17120f7904J04199j57902L6184J11283L1326k45379n9184n0104J35083J20204
$$ -67904 36295 -121607 -85423 25860 57186 -188193 -247377 -297481 -162398 -42194
17110d2194j16266l1475Q3757M1628J019o6340j88850P5236J98722j36369j804
$$ -42194 -158460 -189935 -106178 -64550 -63531 -129871 -318721 -243485 -44763 -181132 -182936
17099a82936P6085k6126j08580n8010J80096K18908J81980J2191R9683J5736j3695
$$ -182936 -106851 -132977 -241557 -299567 -119471 99437 281417 293608 393291 409027 395332
17088C95332l87256k70804j2297K82200N0846K5702l8159k14137j45079j2737
$$ 395332 8076 -262728 -275025 7175 58021 83723 45564 -168573 -313652 -326389
17078c26389K22106N2970k8106M2747N521j28412k7842J07759Q6020Q6217j5606
$$ -326389 -104283 -51313 -79419 -36672 -31151 -159563 -187405 -79646 6374 92591 76985
17067G6985N2903m1143J08274j02578k6594o2161j51241J52215M38780L94963
$$ 76985 129888 88745 197019 94441 67847 5686 -145555 6660 445440 840403
17057H40403k02896j10195n4657q7186n3786N84k02520j65057m880J99927J10851
$$ 840403 637507 527312 472655 385469 331683 332267 129747 -35310 -40190 159737 270588
17046B70588k72794l50184J56922N7768J15480K08389K61812J85941j16704l7575
$$ 270588 -2206 -352390 -195468 -137700 -22220 186169 447981 633922 517218 479643
17036D79643l74861j63210M9580p5829K88124J99552k2179j24929j8069p9688
$$ 479643 104782 -58428 -8848 -84677 203447 402999 380820 255891 237822 158134
17026A58134l4590j14933j19403M6107J46345R2542J5755j59668M647k2077r9964
$$ 158134 123544 8611 -110792 -64685 81660 174202 189957 30289 34936 12859 -87105
17015h7105n8878m0621J63863P8746n3494M4398Q2151j25321N3040K07184P5392
$$ -87105 -145983 -186604 -22741 56005 2511 46909 129060 3739 56779 263963 339355
17004C39355k86230P3699k7665K1229J5613P509j02033L27978P9107r9823j36899
$$ 339355 53125 126824 99159 120388 136001 143510 41477 369455 448562 348739 211840
16993B11840m3614K74955j0208k81124k33628K07878J61853j88066m43214j53125
$$ 211840 168226 443181 432973 151849 -81779 126099 287952 99886 -343328 -496453
16983d96453J69005J48535m7850L16206K82623k01417k87306q8679K21573j10155
$$ -496453 -327448 -178913 -226763 89443 372066 170649 -116657 -205336 16237 -93918
16973i3918j76765M3101J94933J52118j54237K42459M0985k5024O1538r5987p785
$$ -93918 -270683 -227582 -32649 119469 -34768 207691 248676 223652 285190 189203 181418
16962A81418j62648q7586j08421o324P8467L4068J67023M7592p7191J10202l5596
$$ 181418 18770 -68816 -177237 -183561 -105094 -71026 95997 143589 66398 176600 141004
16951A41004k49411j3574K36409M7572n456l0184m9569K0091Q269R3490m580k68757
$$ 141004 -108407 -121981 114428 162000 156544 126360 76791 96882 105151 198641 194061 -74696
16939g4696j76250R6839J53959J085n2388k77634j62129P7771K09828L43695K21280
$$ -74696 -250946 -154107 -148 937 -51451 -329085 -491214 -413443 -203615 140080 361360
16928C61360j8377j35555j00892r739r7722l8112k5754L18147K19501k12528k12874
$$ 361360 342983 207428 106536 96797 -925 -39037 -64791 253356 472857 260329 47455
16917D7455j1998O8430k63778k3319P5677P8747M7614k24278j48953J64449l5760
$$ 47455 35457 103887 -159891 -183210 -107533 -28786 18828 -205450 -354403 -189954 -225714
16906b25714L0250L7466p6012K4233j79684J01357L01371J79028q2372J820p0869
$$ -225714 -195464 -157998 -234010 -209777 -389461 -288104 13267 192295 109923 111743 40874
16895D0874K6571p9108K19153J68429j82629j40691r1474l3570j29091j2745K14619
$$ 40874 67445 -11663 207490 375919 193290 52599 -38875 -72445 -201536 -214281 338
16884C38K12207k030k40761n1904K09003j36911L4620J71295N8239r4213p8044
$$ 338 212545 210515 -30246 -82150 126853 -10058 24562 195857 254096 159883 81839
16873H1839j59876l32645J856J84473J53455J6660j31547l0273Q8768k2090J39481
$$ 81839 -78037 -410682 -408826 -224353 -70898 -54238 -185785 -216058 -127290 -149380 -9899
16862i899j84963o922J01148M5511p0993q2931j58782M93998L66880j32088k32160
$$ -9899 -194862 -201784 -100636 -55125 -126118 -209049 -367831 126167 493047 360959 128799
16851A28799j21051j93753L5922K64945J68211k49467j5233L5032K7994J7316
$$ 128799 7748 -186005 -150083 114862 283073 33606 18373 53405 81399 98715
16841I8715l4415m3255j91488n6692J39103K0473J89844l8829J30153J25431m5305
$$ 98715 64300 21045 -170443 -227135 -88032 -67559 122285 83456 213609 339040 293735
16830B93735k04381j17156k1298M8061J32720J00882l18725j19311J54265q2555
$$ 293735 89354 -27802 -49100 -1039 131681 232563 -86162 -205473 -51208 -133763
16820a33763k829k54860j2415j85324L7439J55112J70733j84997l9040L97941
$$ -133763 -136592 -391452 -403867 -589191 -551752 -396640 -225907 -410904 -449944 -52003
16810e2003L82904l26306k72114m5378J54021K84092r5797l4413K0642k6006n3082
$$ -52003 330901 4595 -267519 -312897 -158876 125216 29419 -4994 15648 -10358 -63440
16799f3440j5919k74282M0182K90363K50781k3264k39931q1440j79784q5654R3176
$$ -63440 -79359 -353641 -313459 -23096 227685 204421 -35510 -116950 -296734 -382388 -289212
16788b89212L7967k05734j16222K34910J37134j9154K8100K2227j63709J19488
$$ -289212 -251245 -456979 -573201 -338291 -201157 -220311 -192211 -169984 -333693 -214205
16778b14205K70535j23371L6759M0987j6289J0359q5690l08723J0986R535R0418
$$ -214205 56330 -67041 -30282 10705 -5584 4775 -80915 -389638 -378652 -369117 -278699
16767b78699M6620j06711K5449L4512j8143k9568p5082J21720J29239L0275k8588
$$ -278699 -232079 -338790 -313341 -278829 -296972 -326540 -401622 -279902 -150663 -120388 -148976
16756a48976J33574q58R4785R3178P3645k13644l27036j25844m6552n4277J70562
$$ -148976 -15402 -16260 78525 171703 245348 31704 -295332 -421176 -467728 -522005 -351443
16745c51443J10517K6321Q1878R8437P6206J88169j1491k04760j40119p703j6629
$$ -351443 -240926 -214605 -132727 -34290 41916 230085 218594 13834 -126285 -133988 -150617
16734a50617k25607n1683k02030L7363P1939J28223J11890Q9262p2041J05965
$$ -150617 -376224 -427907 -629937 -592574 -520635 -392412 -280522 -191260 -263301 -157336
16724a57336j05550J5037K45755K81955r2696R2315L7374p2085k6842Q0966J16029
$$ -157336 -262886 -247849 -2094 279861 187165 279480 316854 244769 217927 298893 414922
16713D14922j74179j76173k12285J18064n6119j1622P9155j1341q6346j25103
$$ 414922 240743 64570 -147715 -29651 -85770 -97392 -18237 -29578 -115924 -241027
16703b41027J30004K09607j15321K2069N5800m3406p710j11434m9670n46K33408
$$ -241027 -111023 98584 -16737 5332 61132 17726 10016 -101418 -151088 -151634 81774
16692H1774R9312j78203j07114M7956J19842j9373k27508J92566O8265J4575j7053
$$ 81774 181086 2883 -104231 -56275 63567 44194 -183314 9252 77517 92092 75039
16681G5039k12497m8543J99312m844l57250k02444O2017p682K20760J55019k39529
$$ 75039 -137458 -186001 13311 8467 -348783 -551227 -489210 -496892 -276132 -121113 -360642
16670c60642j6646J04017K36573j39032l05564J85158K90671J93639Q2975j36156
$$ -360642 -377288 -273271 -36698 -175730 -481294 -296136 -5465 188174 271149 134993
16660A34993j86575j13772O1444K44643j37566M1801j09480n2949L12206J75021
$$ 134993 -51582 -165354 -103910 140733 3167 44968 -64512 -117461 194745 369766
16650C69766k03834K0342k17305m2106K06326j31508m68989L3734J80488K67773
$$ 369766 165932 186274 -31031 -73137 133189 1681 -467308 -433574 -253086 14687
16640A4687J11522O1466k15010m3737p6889j16740J37081J33159K96942r939j61741
$$ 14687 126209 187675 -27335 -71072 -147961 -264701 -127620 5539 302481 292542 130801
16629A30801j85002l94652K16098K92054m2968M1610k1906j66373p2133K41658
$$ 130801 -54201 -448853 -232755 59299 16331 57941 36035 -130338 -202471 39187
16619C9187N7500j47308q5576l9204j18977j44968R0954J34262k5662Q6077K23480
$$ 39187 96687 -50621 -136197 -175401 -294378 -439346 -348392 -214130 -239792 -153715 69765
16608F9765k01127j82716K11918J33595j06699p5256j03027L7586J4524m0659
$$ 69765 -131362 -314078 -102160 31435 -75264 -150520 -253547 -215961 -201437 -242096
16598b42096R7407n7945j39430K40198J60180L9917K19461j25773k22507q7888
$$ -242096 -144689 -202634 -342064 -101866 58314 98231 317692 191919 -30588 -118476
16588a18476j07458j9924J42095m1310r1857M7260K8894j39322P7496K21007K41977
$$ -118476 -225934 -245858 -103763 -145073 -236930 -189670 -160776 -300098 -222602 -1595 240382
16577B40382j8456j34289j38802J27777N3929j44296l94231j95426J58106M07235
$$ 240382 221926 87637 -51165 76612 130541 -13755 -407986 -603412 -445306 -38071
16567c8071K90934J0893j98414j94867K001O9857M4889K12400o263L0624p3144
$$ -38071 252863 263756 65342 -129525 -127524 -57667 -12778 199622 193359 223983 150839
16556A50839l73565j53820j4569Q9538K05646M7654N6211J765k1989p2533R1704
$$ 150839 -222726 -376546 -391115 -301577 -95931 -48277 7934 9699 -12290 -84823 6881
16545F881K3256j4861N2798Q0321Q8685j40216j79996j89919J04807J22104N3794
$$ 6881 30137 15276 68074 148395 237080 96864 -83132 -273051 -168244 -46140 7654
16534G654p0216M5616K9275J11331K60088j85099j20609j97114j52182k5904J5001
$$ 7654 -62562 -16946 12329 123660 383748 198649 78040 -119074 -271256 -297160 -282159
16523b82159o4987K3476J79264k29515k55033n0370R0917O6792K73627K53586
$$ -282159 -347146 -323670 -144406 -373921 -628954 -679324 -588407 -521615 -247988 5598
16513E598M74626n7127k62445j21668m5771J52727M4091j37399j36324J6840J59163
$$ 5598 480224 423097 160652 38984 -6787 145940 190031 52632 -83692 -66852 92311
16502I2311J71074k24470k06125L8121J6579K04407J33625m2516j6332N8224j49145
$$ 92311 263385 38915 -167210 -129089 -112510 91897 225522 183006 166674 224898 75753
16491G5753q1803k00608q926K96598J74810k1232J83064l8501k73655k56164m3275
$$ 75753 -6050 -206658 -215584 81014 255824 234592 417656 379155 105500 -150664 -193939
16480a93939K68811Q8130J79600j27580j93455J00831n2081J23078J7946P6305
$$ -193939 74872 163002 342602 215022 21567 122398 70317 193395 211341 287646
16470B87646O7147L2166j17993l18505j89792o7431O101J79979n7837J09373L5447
$$ 287646 354793 386959 268966 -49539 -239331 -306762 -300661 -120682 -178519 -69146 -33699
16459c3699j63794k36989j31273K95657L9972J49468J59932Q4156Q0221Q9838
$$ -33699 -197493 -434482 -565755 -270098 -230126 -80658 79274 163430 243651 333489
16449C33489M2925n3110j96356l20998j40676K74843K84032j94709Q6326l8800
$$ 333489 376414 323304 126948 -194050 -334726 -59883 224149 29440 115766 76966
16439G6966k83180k08105M8171L4752K4929j71960L39655L35194j82090k72544
$$ 76966 -206214 -414319 -366148 -331396 -306467 -478427 -138772 196422 14332 -258212
16429b58212j21637j41528j52321K50111J55042Q5372K889O2876P6015n8467p4094
$$ -258212 -379849 -521377 -673698 -423587 -268545 -183173 -180284 -117408 -41393 -99860 -173954
16418a73954K64722P0989m6737J34469J88906m8584r0536j92236L5834K3149P2141
$$ -173954 90768 161757 115020 249489 438395 389811 299275 107039 142873 166022 238163
16407B38163r8538k35080k92524L1419j14227Q1840K82390j65717K8515K06220
$$ 238163 139625 -95455 -387979 -356560 -470787 -388947 -106557 -272274 -243759 -37539
16397c7539O964K57671J615k05273j03153j48601J26008K13446L20121J25404
$$ -37539 -30575 227096 228711 23438 -79715 -228316 -102308 111138 431259 556663
16387E56663j73285k81566n229j64626Q5046j82792J710J86243k080L8625q6388
$$ 556663 383378 101812 96583 -68043 17003 -165789 -164079 22164 20084 58709 -27679
16376b7679q6332j64138r6928Q5976R0685J13649l1409K6066n0104r1726R7469
$$ -27679 -114011 -278149 -375077 -289101 -198416 -84767 -116176 -90110 -140214 -231940 -134471
16365a34471K67615p7743J9425O0817O87p0383K0160K0876k76824j91575J24264
$$ -134471 133144 55401 74826 135643 136330 65947 86107 106983 -169841 -361416 -237152
16354b37152J49382l7188n6782o6960J22272M7696j0114p518J28629j9012j00851
$$ -237152 -87770 -124958 -181740 -248700 -126428 -78732 -88846 -96364 32265 13253 -87598
16343h7598j75351j14502m095K00243K12024O1256K3341j27214r5109J3376R2943
$$ -87598 -262949 -377451 -381546 -181303 30721 91977 115318 -11896 -107005 -93629 -686
16332f86N8513K12287J13936p6778L1895K01973j90166j27571j64961p4810R7320
$$ -686 57827 270114 384050 307272 339167 541140 350974 223403 58442 -16368 80952
16321H0952J7493K09710k41390j19649m3798j34144m1691J50007n594j04989L591
$$ 80952 98445 308155 66765 -52884 -96682 -230826 -272517 -122510 -128104 -233093 -229502
16310b29502j60174Q6901J06386J88161J48906j88402j96002R0132K40715q1866
$$ -229502 -389676 -302775 -196389 -8228 140678 -47724 -243726 -153594 87121 5255
16300E255O4746N8174q367l32268J74591Q1457r8643k06433K93462J23432m9700
$$ 5255 70001 128175 119808 -212460 -37869 43588 -55055 -261488 31974 155406 105706
16289A05706J47254o3193l01432r908j25388j08519K7789K78737O7529k91328
$$ 105706 252960 189767 -111665 -121573 -246961 -355480 -327691 -48954 18575 -272753
16279b72753j61092J44783K01557j03003r2007O5473M9185N5783M5917R5277m6674
$$ -272753 -433845 -289062 -87505 -190508 -282515 -217042 -167857 -112074 -66157 29120 -17554
16268a7554K3293K63216k6344k8569j24812j60634j10383l6015J10644J11536
$$ -17554 5739 268955 242611 214042 89230 -71404 -181787 -217802 -107158 4378
16258D378q4532m4363m9202k71451q6J38942L57819L6450O1160j32493j36394
$$ 4378 -80154 -124517 -173719 -445170 -445256 -306314 51505 87955 149115 16622 -119772
16247a19772p630k0087J02910J59089O0044r8826J14236M225N8260k13508l23599
$$ -119772 -127402 -147489 -44579 114510 174554 75728 189964 194189 252449 38941 -284658
16236b84658j70870m6326J35002n1702o2882L34444j32522k80624N3101m457L18609
$$ -284658 -455528 -501854 -366852 -418554 -481436 -146992 -279514 -560138 -507037 -511494 -192885
16225a92885K67773N5090j37817K7122J80624K32170k55734l36492j95255J7920
$$ -192885 74888 129978 -7839 19283 199907 432077 176343 -160149 -355404 -337484
16215c37484J44746P4170K53827K45354K3226r3577j08643P4484k16385m8683
$$ -337484 -192738 -118568 135259 380613 403839 310262 201619 276103 59718 11035
16205A1035J29808n0350J85834O9429k0695m93962j70919q4743L5539J42319p7166
$$ 11035 140843 90493 276327 345756 325061 -168901 -339820 -424563 -389024 -246705 -323871
16194c23871r5613J42982j11502q5327j45001K06335J76649m7526J82481J36241
$$ -323871 -419484 -276502 -388004 -473331 -618332 -411997 -235348 -282874 -100393 35848
16184C5848k43842Q8502Q8039J34644j16685K8128j45860j28196q0639J08347
$$ 35848 -207994 -119492 -31453 103191 -13494 14634 -131226 -259422 -340061 -231714
16174b31714O7491O6959N4086o7804L6525J99935J08055q9853j10282j4401j65370
$$ -231714 -164223 -97264 -43178 -110982 -74457 125478 233533 143680 33398 18997 -146373
16163a46373j03932L10574J70694M8617l1522p3521n9537J12955J60600o8271
$$ -146373 -250305 60269 230963 279580 248058 174537 115000 227955 388555 320284
16153C20284L7334K3679M1926o0477k08468L99O8963J40143P0581j20895j9897
$$ 320284 357618 381297 423223 362746 154278 154677 223640 363783 434364 313469 293572
16142B93572n1866P2197J05990j56388k2797J18777P2841j18038k13148j98368
$$ 293572 241706 313903 419893 263505 240708 359485 432326 314288 101140 -97228
16132i7228J6486K38533J58642j05433J00535J65436n2361M6258R1158j92651
$$ -97228 -80742 157791 316433 211000 311535 476971 424610 470868 562026 369375
16122C69375l14392j75983J62652J37960q4516K0887l5870M2964K3912R3246q6038
$$ 369375 54983 -121000 41652 179612 95096 115983 80113 123077 146989 240235 154197
16111A54197L10282J41228K2604J29281J43115q1312O4018r3810N8577p6846O2370
$$ 154197 464479 605707 628311 757592 900707 819395 883413 789603 848180 771334 833704
16100H33704J75847r1205J29406J24990j29722j53394L72261L85026Q9782N198
$$ 833704 1009551 918346 1047752 1172742 1043020 889626 1261887 1646913 1736695 1741893
16090A741893M8651K64217J86215l783K1623J69501M56108O50028M21293L69453
$$ 1741893 1790544 2054761 2240976 2237193 2258816 2428317 2884425 3534453 3955746 4325199
16080D325199P26579O90558Q01000R91060Q38724L67989K70315M9809K04868K8903
$$ 4325199 5051778 5742336 6543336 7534396 8373120 8741109 9011424 9061233 9266101 9295004
16070I295004n02365l28627n29891l78247k1637j09666j53976l12022j0429K33767
$$ 9295004 8792639 8464012 7934121 7555874 7534237 7424571 7270595 6958573 6948144 7181911
16060G181911M9495J25660J25492J47789M44331J57921M14864O96817O46214M61510
$$ 7181911 7231406 7357066 7482558 7630347 8074678 8232599 8647463 9344280 9990494 10452004
16050A0452004M70218O18043Q21746P90088O55828P24056J096864J359262J254675
$$ 10452004 10922222 11540265 12362011 13152099 13807927 14531983 15628847 16988109 18242784
16041A8242784P62766O14789O47187j6535k96021p72145p13019o52725o87701
$$ 18242784 19005550 19620339 20267526 20250991 19954970 19182825 18469806 17817081 17129380
16032A7129380p02547o38574o17851k60561j16260j57138O2739Q0730L2467K02108
$$ 17129380 16426833 15788259 15170408 14909847 14793587 14636449 14699188 14779918 14812385 15014493
16022A5014493M15803O21032P61269Q70198P41536N95369Q13598P49518Q17749
$$ 15014493 15430296 16051328 16812597 17682795 18424331 19019700 19833298 20582816 21400565
16013B1400565O05692N46950N37931N08847L36630K06034L19134j12661m79162
$$ 21400565 22006257 22553207 23091138 23599985 23936615 24142649 24461783 24349122 23869960
16004B3869960l08938l51517p60948r22821q33676n86061p19229p11429m60007
$$ 23869960 23561022 23209505 22448557 21525736 20692060 20105999 19386770 18675341 18215334
15995A8215334l76260k65904o5831J1897K29772M12454L81730L98575O65140O11563
$$ 18215334 17839074 17573170 17507339 17519236 17749008 18161462 18543192 18941767 19606907 20218470
15985B0218470P29047J014676Q27838N30758O49711P07661R45865J228870J088462
$$ 20218470 20947517 21962193 22790031 23320789 23970500 24678161 25624026 26852896 27941358
15976B7941358R47927J156097R61168P98264N57102J6199j80991l55238o19233
$$ 27941358 28889285 30045382 31006550 31804814 32361916 32378115 32197124 31841886 31222653
15967C1222653n67448m18441o02842n88259n37456o51631o46004l41000o09557
$$ 31222653 30655205 30236764 29633922 29045663 28508207 27856576 27210572 26869572 26260015
15958B6260015k19566j70612j3719L89312K69945N99964N10300M50227L94324
$$ 26260015 26040449 25869837 25856118 26245430 26515375 27115339 27625639 28075866 28470190
15949B8470190M79252K36204M6828l703k20615L47550M02176M26640N75522M28137
$$ 28470190 28949442 29185646 29232474 29228771 29008156 29355706 29757882 30184522 30760044 31188181
15939C1188181N61962O27578O39868N80306P01815P63337Q11914N01280L46218
$$ 31188181 31750143 32377721 33017589 33597895 34299710 35063047 35874961 36376241 36722459
15930C6722459q8620l8533p77257j144259j324921j249793j469653j040144p35577
$$ 36722459 36633839 36595306 35818049 34673790 33348869 32099076 30629423 29589279 28853702
15921B8853702q02932m98418p0874K0746K11216L1882L38232J39672J17689L28952
$$ 28853702 28050770 27552352 27481478 27502224 27713440 27745322 28083554 28223226 28340915 28669867
15911B8669867L88353K70630K14188O15743N49097N72243K26843J74176N80864
$$ 28669867 29058220 29328850 29543038 30158781 30707878 31280121 31506964 31681140 32262004
15902C2262004M81511L08009M9101l9654L9266m1667m19159p34075r05900j153373
$$ 32262004 32743515 33051524 33100625 33060971 33100237 33058570 32639411 31905336 30999436 29846063
15892B9846063j091173j029409j143391j099563r76835q19826m13906k40964n8019
$$ 29846063 28754890 27725481 26582090 25482527 24505692 23685866 23271960 23030996 22972977
15883B2972977N0814K4654J00488J23303P08533O87804O32574P05023Q13851N57270
$$ 22972977 23023791 23048445 23148933 23272236 23980769 24668573 25301147 26006170 26820021 27377291
15873B7377291O01589P06292R06297R53610Q23124Q17791J209122P96229N87885
$$ 27377291 27978880 28685172 29591469 30545079 31368203 32185994 33395116 34191345 34779230
15864C4779230J56102p75765j123390j329235j536603j489809j343555j258582
$$ 34779230 34935332 34159567 33036177 31706942 30170339 28680530 27336975 26078393
15856B6078393j101103j049514q31171n67263m82637j35011l12265k55343L89150
$$ 26078393 24977290 23927776 23096605 22529342 22046705 21911694 21599429 21344086 21733236
15847B1733236N50134M66436M41520N60064M75420L07215K0504N5687k46268k80297
$$ 21733236 22283370 22749806 23191326 23751390 24226810 24534025 24554529 24610216 24363948 24083651
15837B4083651m63697o55348n00876l64381j61264k14649r9104j34863j25914
$$ 24083651 23619954 22964606 22463730 22099349 21938085 21723436 21624332 21489469 21363555
15828B1363555l00013p53938r19754r79698j070905p64394n57341p78429q35579
$$ 21363555 21063542 20309604 19389850 18410152 17339247 16574853 16017512 15239083 14403504
15819A4403504l85004n01030m28949m56495l96935k09901j457J87181K71520J8125
$$ 14403504 14018500 13517470 13088521 12632026 12235091 12025190 12023733 12210914 12482434 12500559
15809A2500559k14611M1859j96267k52588k38339m83376m94234m25357o17082
$$ 12500559 12285948 12327807 12131540 11878952 11640613 11157237 10663003 10237646 9620564
15800I620564o35065m28444n02471p66391m28487m39639n00478n90903l89234
$$ 9620564 8985499 8557055 8054584 7288193 6859706 6420067 5919589 5328686 4939452
15791D939452j02726K06425l76357m12059l73816k57263p1650l4094N9122j80105
$$ 4939452 4836726 5043151 4666794 4254735 3880919 3623656 3552006 3517912 3577034 3396929
15781C396929l01204j39434k06541j4004m2433k2706k52506j04863j7053o7118
$$ 3396929 3095725 2956291 2749750 2735746 2693313 2670607 2418101 2313238 2296185 2229067
15771B229067J1379L7377j841j2841j81118j74887k07032j99594j09168j89344
$$ 2229067 2240446 2277823 2275982 2263141 2082023 1907136 1700104 1500510 1391342 1201998
15761A201998j56109m0485N8821J47376k79327r0269K12269p3777j39659j38916
$$ 1201998 1045889 1005404 1064225 1211601 932274 842005 1054274 980497 840838 701922
15751G01922j54845K29942n1655j25576J82417k3985l798J04463P4006j58265
$$ 701922 547077 777019 725364 599788 782205 758220 754422 858885 932891 774626
15741G74626j52794J13566L6843n557k78356R0016J2364j32957j93130J33827
$$ 774626 621832 735398 772241 766684 488328 578344 590708 457751 264621 398448
15731C98448O8353r2449k09195j51662j9702O8313J11545J07600R1040L965j56736
$$ 398448 466801 374352 165157 13495 -6207 62106 173651 281251 372291 376256 219520
15720B19520j39353O3522o6327K41637k9141R4730m0471J134j41464P3097m632
$$ 219520 80167 143689 77362 318999 289858 384588 344117 345251 203787 276884 272252
15709B72252j40168J0927l8973J53789j09662L2956J51419M2823j9122J7374q3797
$$ 272252 132084 143011 104038 257827 148165 181121 332540 375363 356241 373615 289818
15698B89818K0139k5965l77533l53277Q3127K77358L37641K25849L3187j54202
$$ 289818 309957 283992 -93541 -446818 -363691 -86333 251308 477157 510344 356142
15688C56142J12503j10247o8225J11241k96357o2317J6599n4025J55823j11413
$$ 356142 468645 358398 290173 401414 105057 42740 59339 5314 161137 49724
15678D9724j1840J05115l0004k84775j8965n8337J65491k8927j24196K72916K89504
$$ 49724 37884 142999 112995 -171780 -190745 -249082 -83591 -112518 -236714 36202 325706
15667C25706k6679k14101k03147J85058J76453k21374k32687k679m1670M4716
$$ 325706 299027 84926 -118221 66837 243290 21916 -210771 -213450 -255120 -210404
15657b10404J85082K61300Q6949q8609j04606r7835M1770J44816k01151p7636
$$ -210404 -25322 235978 322927 234318 129712 31877 73647 218463 17312 -60324
15647f0324J99709J12969k43180j42663L3310r1686N8399J99254Q7411k70084
$$ -60324 139385 252354 9174 -133489 -100179 -191865 -133466 65788 153199 -116885
15637a16885n0804N0166j65470J33737J28046O4402Q306q4441k73061Q1627l9808
$$ -116885 -167689 -117523 -282993 -149256 -21210 43192 51498 -32943 -306004 -224377 -264185
15626b64185R9231M31009M231Q8879J22538j22500p1090p0651k71251j95651m6765
$$ -264185 -164954 266055 270286 359165 481703 359203 288113 217462 -53789 -249440 -296205
15615b96205J47065m2508k67934j6271M20076K88592q5848p9125k85730k68839
$$ -296205 -149140 -191648 -459582 -475853 -55777 232815 146967 67842 -217888 -486727
15605d86727j82448j6612K21410L94138M9439k13443N7200R9395J40060Q507J50059
$$ -486727 -669175 -685787 -464377 -70239 -20800 -234243 -177043 -77648 62412 70919 220978
15594B20978K0507k04509j14279j81857R7982M19154K37401m1176j23526k97355
$$ 220978 241485 36976 -77303 -259160 -161178 257976 495377 454201 330675 33320
15584C3320J72114J97302q3926J75281j48212k28140l51144J80K33299N7265K05294
$$ 33320 205434 402736 318810 494091 345879 117739 -233405 -233225 74 57339 262633
15573B62633j38824o6557j74244j40116n4445L08069J32189r6756N634K0977k4579
$$ 262633 123809 57252 -116992 -257108 -311553 -3484 128705 31949 37583 58560 33981
15562C3981J52600K0850n8018R7578j27079q4983j4164r0454j72524N5295K48937
$$ 33981 186581 207431 149413 246991 119912 34929 20765 -69689 -242213 -186918 62019
15551F2019J80253j51387k94253q9599m4008Q4400P8879j01264J66354K14141
$$ 62019 242272 90885 -203368 -292967 -336975 -252575 -173696 -274960 -108606 105535
15541A05535r860k82566j40259J63818M42566Q1318K142j29382n641q3785j47167
$$ 105535 95675 -186891 -327150 -163332 279234 360552 362694 233312 227671 143886 -3281
15530c281l2618M3492L36731o69m39750N0317L40379R1402M8082j38875j14589
$$ -3281 -35899 7593 344324 343655 -96095 -45778 294601 386003 434085 295210 180621
15519A80621l0456L74R5626o0024o9249M7822J90963J61837p7175R9711q7612
$$ 180621 150165 150539 246165 186141 116892 164714 355677 517514 440339 540050 452438
15508D52438j63970q9294j20751J47041J16052O8038j31458q5999k79311O0746
$$ 452438 288468 199174 78423 225464 341516 409554 278096 192097 -87214 -26468
15498b6468J61384R4504O9804r5818P0826P781k5944j46745k65398m1000R2791
$$ -26468 134916 229420 299224 203406 274232 282013 256069 109324 -156074 -197074 -104283
15487a04283J40894J58256r1310k99574L7316J97879M6431k52134j86119K16664
$$ -104283 36611 194867 103557 -196017 -158701 39178 85609 -166525 -352644 -135980
15477a35980K12779k8579Q8190L6731j47290m7158K469j31185j72360j40009m1599
$$ -135980 76799 48220 136410 173141 25851 -21307 -18838 -150023 -322383 -462392 -503991
15466e03991J04830K58892L2089q1653J05630K12860J72401l16793j02580Q8079
$$ -503991 -399161 -140269 -108180 -189833 -84203 128657 301058 -15735 -118315 -30236
15456c0236J0765k59346Q770j3981J72323M15796O6503l2229j0556j58139P610
$$ -30236 -19471 -278817 -270047 -284028 -111705 304091 370594 338365 327809 169670 177280
15445A77280Q6676n4411j5774j17757j53778Q2703j15121K00604O0060l46567
$$ 177280 263956 209545 193771 76014 -77764 4939 -110182 90422 150482 -196085
15435a96085K23376J15870j42335J9102J4377J84732J15029k7609j38011j00037
$$ -196085 27291 143161 826 19928 34305 219037 334066 306457 168446 68409
15425F8409p5235J41587K63224N2882k53700j20251Q2729o6236n7501J65175N1148
$$ 68409 -6826 134761 397985 450867 197167 76916 159645 93409 35908 201083 252231
15414B52231R3736k0900p9000M5350M0785k723j86800k06377j6555n9002k70430
$$ 252231 345967 325067 246067 291417 332202 329479 142679 -63698 -80253 -139255 -409685
15403d09685O5960J95824L31299J18482j52092k7626N7983r5847m6650n93J00021
$$ -409685 -343725 -147901 183398 301880 149788 122162 180145 84298 37648 37055 137076
15392A37076k9623j08765n4490J53179j05832n0423K31649j04740j97662M9215
$$ 137076 107453 -1312 -55802 97377 -8455 -58878 172771 68031 -129631 -80416
15382h0416k3630p3596L26123o0241k22059N6310L25462J60261K3731j04149j76536
$$ -80416 -104046 -177642 148481 88240 -133819 -77509 247953 408214 431945 327796 151260
15371A51260j0806r1915m946J62390P2061J62067L13476q4503j41961n1012k18008
$$ 151260 140454 48539 43593 205983 278044 440111 753587 669084 527123 476111 258103
15360B58103k79095k00704K47542J30304j08307O4209j34738O472J39794M0283
$$ 258103 -20992 -221696 25846 156150 47843 112052 -22686 -16214 123580 163863
15350A63863j89493J70775N024j22719l5549J64891J06997j44811l32578r3712
$$ 163863 -25630 145145 150169 27450 -8099 156792 263789 118978 -213600 -307312
15340c07312L516P3545l1832J51797K37786j20979J27490q3609j26864j80186
$$ -307312 -303796 -230251 -262083 -110286 127500 6521 134011 50402 -76462 -256648
15330b56648j3712K4826J47093K33221J92396N6495J48443J06671L0379k72444
$$ -256648 -270360 -245534 -98441 134780 327176 383671 532114 638785 669164 396720
15320C96720p7157k45829k79872j68632M9948K00750n755R2450L84284R7871r5516
$$ 396720 319563 73734 -206138 -374770 -324822 -124072 -129827 -37377 346907 444778 349262
15309C49262p5825K64403J7953q9843j18118j55642M8632J85627M9701k40328
$$ 349262 273437 537840 555793 465950 347832 192190 240822 426449 476150 235822
15299B35822k45709L0397k3098J72952o9149j21111j49009K6015L8276j28464
$$ 235822 -9887 20510 -2588 170364 101215 -19896 -168905 -142890 -104614 -233078
15289b33078k1398K6787n0853J53168l7749N0022N9695P8718J88003n1950j09521
$$ -233078 -254476 -227689 -278542 -125374 -163123 -113101 -53406 25312 213315 161365 51844
15278E1844Q2058K4175N886J34101k4023k80293l11318O2919K67046j6939j63433
$$ 51844 133902 158077 163963 298064 274041 -6252 -317570 -254651 12395 -4544 -167977
15267a67977o6588J58816O568n9244j53333l7598P8319J03707R0256J89193J1574
$$ -167977 -234565 -75749 -69181 -128425 -281758 -319356 -241037 -137330 -47074 142119 153693
15256A53693j18727j1288L19815m4588j44520k07451k9283m7104k90327Q8905
$$ 153693 34966 23678 343493 298905 154385 -53066 -82349 -129453 -419780 -330875
15246c30875K6072l450j11445J74783K08673J21482K76996j302j86621l30427
$$ -330875 -304803 -308253 -419698 -244915 -36242 85240 362236 360934 174313 -156114
15236a56114k12695N8323J05423J65374R6342p7998k8711R6657J52267K70595
$$ -156114 -368809 -310486 -205063 -39689 56653 -21345 -50056 46601 198868 469463
15226D69463j41122k52706l18269j61537m1395n743K64782J4498L12685j44676
$$ 469463 328341 75635 -242634 -404171 -445566 -451309 -186527 -172029 140656 -4020
15216d020k26807j50893j75581J40088J79684p1606q8534J11696J8914m6474j86842
$$ -4020 -230827 -381720 -557301 -417213 -237529 -309135 -397669 -285973 -267059 -313533 -500375
15205e00375j00060K08918K6474j8045J31578K50529L4630l12323j1933K21626
$$ -500375 -600435 -391517 -365043 -383088 -251510 -981 33649 -278674 -290607 -68981
15195f8981j2102J1949p7766n2392j43317K9024P2302J66475l5338j34655j54517
$$ -68981 -81083 -69134 -146900 -199292 -342609 -313585 -241283 -74808 -110146 -244801 -399318
15184c99318o3297L70202j04281J54712L67115J27920k01513K05891j65099l60125
$$ -399318 -462615 -92413 -196694 -41982 325133 453053 251540 457431 292332 -67793
15174f7793l38630L8261J04737K32987J3821J34085R6444j46819J62882J20364
$$ -67793 -406423 -368162 -263425 -30438 -16617 117468 213912 67093 229975 350339
15164C50339j03676o1133j41573M2139J49307J64973J37150o5654O7498J0229
$$ 350339 246663 185530 43957 86096 235403 400376 537526 471872 539370 549599
15154E49599k63112j56336j56284K52241Q217j65389Q2095j65209k4388M0134
$$ 549599 286487 130151 -26133 226108 234325 68936 151031 -14178 -38566 1568
15144A568J75595J53451j43544n5648j37456j94637O6078j58611K13979q7527
$$ 1568 177163 330614 187070 131422 -6034 -200671 -134593 -293204 -79225 -166752
15134a66752r6885J39566J65752M2302O4899O3260M2916N5393J06649Q2033M2815
$$ -166752 -263637 -124071 41681 83983 148882 212142 255058 310451 417100 499133 541948
15123E41948N3695R404k38273l97047j63002K2351K83828K42690j06086K51011
$$ 541948 595643 605047 366774 -30273 -193275 -170924 112904 355594 249508 500519
15113E00519L011l026K67507m1150m8705J33121J60192j49909P6587J16359L48902
$$ 500519 503530 500504 768011 726861 678156 811277 971469 821560 898147 1014506 1363408
15102A363408J13872r4536o8343R5244l0025j92600k9113J39894n203J149J42312
$$ 1363408 1477280 1382744 1314401 1409645 1379620 1187020 1157907 1297801 1292598 1293747 1436059
15091A436059L4629J85594J37102n4546j2871L7404M9797J78389J26607P7396
$$ 1436059 1470688 1656282 1793384 1738838 1725967 1763371 1813168 1991557 2118164 2195560
15081B195560L19982J70220L0363O4302j96316k09883J40661K76804J64143L53006
$$ 2195560 2515542 2685762 2716125 2780427 2584111 2374228 2514889 2791693 2955836 3308842
15071C308842K44576k1058m6041L05173M40222L80377O84285O50384R43572J224679
$$ 3308842 3553418 3532360 3486319 3791492 4231714 4612091 5296376 5946760 6890332 8115011
15061H115011J291776J599170J405476J924596K081789J890103J674074J855516
$$ 8115011 9406787 11005957 12411433 14336029 16417818 18307921 19981995 21837511
15053B1837511J961500K257497K626845K971888L446291L704051L910424L713382
$$ 21837511 23799011 26056508 28683353 31655241 35101532 38805583 42716007 46429389
15045D6429389L802996L005875K086813J358060Q10997N99881J244008J711009
$$ 46429389 50232385 53238260 55325073 56683133 57494130 58094011 59338019 61049028
15037F1049028K037253K213857J778028O55666l74257j186866j570630j693262
$$ 61049028 63086281 65300138 67078166 67733832 67359575 66172709 64602079 62908817
15029F2908817j106274o54811m25215m51301l47542k73652n65590o66424m71465
$$ 62908817 61802543 61147732 60722517 60271216 59923674 59650022 59084432 58418008 57946543
15020E7946543l95324k71168k35990j50286j57367o09286p42397q03695p59005
$$ 57946543 57551219 57280051 57044061 56893775 56736408 56127122 55384725 54581030 53822025
15011E3822025p97983m33342j17590n6782M44208J198232J570485P43999l38257
$$ 53822025 53024042 52590700 52473110 52416328 52860536 54058768 55629253 56373252 56034995
15002E6034995k37176j000273k950208o184855n989706m135332l086414k411890
$$ 56034995 55797819 54797546 51847338 45662483 39672777 35537445 32451031 30039141
14994C0039141k385204k115150k042568j801553j590200j394718r58639r49718
$$ 30039141 27653937 25538787 23496219 21694666 20104466 18709748 17751109 16801391
14986A6801391j095663o33678l71798m92086o66520k18605l81936q20641n44746
$$ 16801391 15705728 15072050 14700252 14208166 13541646 13323041 12941105 12120464 11575718
14977A1575718m27737m27261m39965l49548l1708j06392o9520m48337l03079j38014
$$ 11575718 11147981 10720720 10280755 9931207 9899499 9793107 9723587 9275250 8972171 8834157
14967H834157O6613k35948J2221j01959n170J47115P6687q7927K51174L5514J16776
$$ 8834157 8900770 8664822 8677043 8575084 8569914 8717029 8793716 8705789 8956963 8992477 9109253
14956I109253N29877K93778Q27726Q90770R30670Q40244R53188J425658J510161
$$ 9109253 9639130 9932908 10760634 11651404 12582074 13422318 14375506 15801164 17311325
14947A7311325J545919J551621J842079J668494J771671J992275K241320K662824
$$ 17311325 18857244 20408865 22250944 23919438 25691109 27683384 29924704 32587528
14939C2587528L020793L168685L200595K973077K223370J630696O52555J94073
$$ 32587528 35608321 38777006 41977601 44950678 47174048 48804744 49457299 49651372
14931D9651372P47723J262530J301678J372089J663246J578209P81599j53271
$$ 49651372 50399095 51661625 52963303 54335392 55998638 57576847 58358446 58205175
14923E8205175j057839j623387j158067q23678p37497m43360J03716j39134j70199
$$ 58205175 57147336 55523949 54365882 53542204 52804707 52361347 52465063 52325929 52155730
14914E2155730j15097j38690k82125l71932k26167K80049L79640M8841j09646
$$ 52155730 52040633 51901943 51619818 51247886 51021719 51301768 51681408 51730249 51620603
14905E1620603k52356m74464m73932j93485J0982J46087L55554N25893M18356
$$ 51620603 51368247 50893783 50419851 50226366 50237348 50383435 50738989 51264882 51683238
14896E1683238R2022J38262K71883J77242M70653P27513P71458J289173J755454
$$ 51683238 51775260 51913522 52185405 52362647 52833300 53560813 54332271 55621444 57376898
14887E7376898J931532K085976K203956K059682K253829K376504K323276K344536
$$ 57376898 59308430 61394406 63598362 65658044 67911873 70288377 72611653 74956189
14879G4956189K180248J863065J763675J776664J886929J591406J076565J060194
$$ 74956189 77136437 78999502 80763177 82539841 84426770 86018176 87094741 88154935
14871H8154935O17761J29103m31831o24606o77933j373073j804520j981603k084022
$$ 88154935 88772696 88901799 88469968 87845362 87167429 85794356 83989836 82008233 79924211
14862G9924211k496374k595745k711897k896179k788207k988784k832197l181356
$$ 79924211 77427837 74832092 72120195 69224016 66435809 63447025 60614828 57433472
14854E7433472l169925k794336l201002l127627k767320k424701j906707j917233
$$ 57433472 54263547 51469211 48268209 45140582 42373262 39948561 38041854 36124621
14846C6124621k039129k139325j791832j493776j122818p71849r06050o46951
$$ 36124621 34085492 31946167 30154335 28660559 27537741 26765892 25859842 25212891
14838B5212891l41891l47678n27737o5041Q9824p779K44391O61939R76989J150426
$$ 25212891 24871000 24523322 23995585 23930544 24020368 24012589 24256980 24918919 25895908 27046334
14828B7046334J182993J313627J519244J674795K110153K088620K179679K515116
$$ 27046334 28229327 29542954 31062198 32736993 34847146 36935766 39115445 41630561
14820D1630561K756507K577007K919490L002127K765955K694246K373778K598608
$$ 41630561 44387068 46964075 49883565 52885692 55651647 58345893 60719671 63318279
14812F3318279K452746K075267J748427J873340J691864J387843Q38287M96378
$$ 63318279 65771025 67846292 69594719 71468059 73159923 74547766 75386053 75882431
14804G5882431J54405l24351n48640m30950r33489j595454j878975j945885k320056
$$ 75882431 76036836 75712485 75163845 74732895 73799406 72203952 70324977 68379092 66059036
14795F6059036k309276k018434k206113k584027k907968k875915k822530k663526
$$ 66059036 63749760 61731326 59525213 56941186 54033218 51157303 48334773 45671247
14787D5671247k703480k946287k718590k512675k140667j882228j858662j725517
$$ 45671247 42967767 40021480 37302890 34790215 32649548 30767320 28908658 27183141
14779B7183141j805256j597390j583128j481924j188796j076535j014002j067344
$$ 27183141 25377885 23780495 22197367 20715443 19526647 18450112 17436110 16368766
14771A6368766p88369n76772n76880n41847n79374q10725n65013k99751m92645
$$ 16368766 15580397 15003625 14426745 13884898 13305524 12494799 11929786 11630035 11137390
14762A1137390n05178k67625k10082l13705j47412m27836l32554k00155q7894
$$ 11137390 10632212 10364587 10154505 9840800 9693388 9265552 8932998 8732843 8644949
14753H644949k72937m06298l79716k42305j76748n63117j40934J66095k19672
$$ 8644949 8372012 7965714 7585998 7343693 7166945 6603828 6462894 6628989 6409317
14744F409317j88430o5057j70165j81108k73001l01248j3638j20562j54036k62064
$$ 6409317 6220887 6155830 5985665 5804557 5531556 5230308 5216670 5096108 4942072 4680008
14734D680008l29654P4142m783k03030k06694j30887j42103j80879j01611k02663
$$ 4680008 4350354 4424496 4419713 4216683 4009989 3879102 3736999 3556120 3454509 3251846
14724C251846J25992J51518j41374k44444r5677q0107j10359m4348j14329K114
$$ 3251846 3377838 3529356 3387982 3143538 3047861 2967754 2857395 2813047 2698718 2700832
14714B700832k98771m74815m187j274j17834L00150K7543K6611N1068J42567J97956
$$ 2700832 2402061 1927246 1923059 1921785 1803951 2104101 2131644 2158255 2209323 2351890 2549846
14703B549846l2714j03919j12136p9330l87601j62471N3354j04855K7160O4375
$$ 2549846 2517132 2413213 2301077 2221747 1834146 1671675 1725029 1620174 1647334 1711709
14693A711709P9989j53217j54662l5727M4419J21009n9875p2225j9346j38157
$$ 1711709 1791698 1638481 1483819 1448092 1492511 1613520 1553645 1481420 1462074 1323917
14683A323917p0675P0953j81661k96056J2278L6637m1382J16609N544P2837L5176
$$ 1323917 1253242 1324195 1142534 846478 858756 895393 854011 970620 976164 1049001 1084177
14672A084177P9533j85621J42469q5350n0167J11792q1014r8244n4930K1006j67641
$$ 1084177 1163710 978089 1120558 1035208 985041 1096833 1015819 917575 862645 883651 716010
14661G16010j52520l0416j1650L75340j02614j96457J20902j09638q6593L8924
$$ 716010 563490 533074 521424 896764 794150 597693 718595 608957 522364 561288
14651E61288m2073J38635J59293q611L5368J76219L5346O6931J0059J00780K91077
$$ 561288 519215 657850 817143 808532 843900 1020119 1055465 1122396 1132455 1233235 1524312
14640A524312M60733M22843J01103M48983K37556q6076l52595j59067j16311m31028
$$ 1524312 1985045 2407888 2508991 2957974 3195530 3109454 2756859 2597792 2481481 2050453
14630B050453l14104r0454J5075J10773R164K53012M76674M86963L40946L08829
$$ 2050453 1736349 1645895 1660970 1771743 1780907 2033919 2510593 2997556 3338502 3647331
14620C647331N33371N48165J41851n0556q8836k85471n00641o02352o29612n26581
$$ 3647331 4180702 4728867 4870718 4820162 4731326 4445855 3945214 3342862 2713250 2186669
14610B186669q1725l15272k8865L60097J53490K74502O8143q2840O1624J9359
$$ 2186669 2104944 1789672 1760807 2120904 2274394 2548896 2617039 2534199 2595823 2615182
14600B615182J60694J55812j46206l97151l21281k59487j88147j87718l0616Q4361
$$ 2615182 2775876 2931688 2785482 2388331 2067050 1807563 1619416 1431698 1401082 1485443
14590A485443p3583m3941n5739o3758k34238k87619j45598R0588J47821n8208
$$ 1485443 1411860 1367919 1312180 1248422 1014184 726565 580967 671555 819376 761168
14580G61168l2629K20812j5933P8578j12827k59541r2118O7035p3620L9091J75141
$$ 761168 728539 949351 933418 1011996 899169 639628 547510 614545 540925 580016 755157
14569G55157J7319J73487J42643Q5328k37981k49222k26649K3684M12635Q8188
$$ 755157 772476 945963 1088606 1173934 935953 686731 460082 483766 896401 984589
14559I84589o8395o6476j42592J11046n835k2040j34423n9995m2489J13285p9554
$$ 984589 916194 849718 707126 818172 812337 790297 655874 595879 553390 666675 587121
14548E87121j23374J25171R7091p1263M6793Q6883P695K93551R1788q029K2438
$$ 587121 463747 588918 686009 614746 661539 748422 756117 1049668 1141456 1133427 1155865
14537A155865j35695j21686j76453j33827j1843n882L03785K9983k20719j07079
$$ 1155865 1020170 898484 722031 588204 576361 570479 874264 904247 683528 576449
14527E76449j13051l3996J697K01143J51935J35495k9785k3848J3873N770j65686
$$ 576449 463398 429402 431099 632242 784177 919672 889887 866039 879912 885682 719996
14516G19996p5327J9368J3789j3218j43994m2887p2823J1880K92903J49978P7623
$$ 719996 644669 664037 677826 664608 520614 477727 404904 416784 709687 859665 937288
14505I37288k25906k93096P8394P3315m4175K22720J09103L2449K13849j95842
$$ 937288 711382 418286 496680 569995 525820 748540 857643 890092 1103941 908099
14495I08099j21775j64293j1547j99294N8530M33664M54788R5605q1541O6589
$$ 908099 786324 622031 610484 411190 469720 903384 1358172 1453777 1372236 1438825
14485A438825j50758j56362J23027m9677k29211j70038R4406o5167n6504K45832
$$ 1438825 1288067 1131705 1254732 1205055 975844 805806 900212 835045 778541 1024373
14475A024373N9871j31368k2275O7312J61572N3580r4848j45212m8172L4185J02593
$$ 1024373 1084244 952876 930601 997913 1159485 1213065 1118217 973005 924833 959018 1061611
14464A061611P0831q5065k36732n9152J1692m242k8865J3721K20359m027j10956
$$ 1061611 1132442 1047377 810645 751493 763185 758943 730078 743799 964158 960131 849175
14453H49175j02587J8652J04153j25418J09099M1874p6614J51237J94300J43134
$$ 849175 746588 765240 869393 743975 853074 894948 818334 969571 1163871 1307005
14443A307005P7378J1557M3752J84827J56694k4272o4563k06970J52361l8026
$$ 1307005 1384383 1395940 1439692 1624519 1781213 1756941 1692378 1485408 1637769 1599743
14433A599743k05862j403O7595L33301K42595J20730k74304m9732L6090J92747
$$ 1599743 1393881 1392478 1460073 1793374 2035969 2156699 1882395 1832663 1868753 2061500
14423B061500j93026K6543J42260K05487n050m16312l11998J50603l4839R8969
$$ 2061500 1868474 1895017 2037277 2242764 2237714 1821402 1509404 1660007 1625168 1724137
14413A724137K03415J14973J81570r532K18768N4182J22269k8494l68301l5032
$$ 1724137 1927552 2042525 2224095 2214563 2433331 2487513 2609782 2581288 2212987 2177955
14403B177955p2442O9929O1661q9037P2806L18603L67963R187k63405l23084k84943
$$ 2177955 2105513 2175442 2237103 2148066 2220872 2539475 2907438 2916625 2653220 2330136 2045193
14392B045193n642J39742P6404N7943r836J22741K18556O9890J23245K02323L94209
$$ 2045193 2039551 2179293 2255697 2313640 2303804 2426545 2645101 2714991 2838236 3040559 3434768
14381C434768j0544j05298j84361J59800K17792K09521P640K46208L52706J79895
$$ 3434768 3424224 3318926 3134565 3294365 3512157 3721678 3729318 3975526 4328232 4508127
14371D508127J30807J49596J03512o7111j13693L62424L82995L39038K52053J19460
$$ 4508127 4638934 4788530 4892042 4824931 4711238 5073662 5456657 5795695 6047748 6167208
14361F167208R3959L04891K92359J72718L54282L34577N49654M19426O46401O98513
$$ 6167208 6261167 6566058 6858417 7031135 7385417 7719994 8269648 8689074 9335475 10033988
14351A0033988O11277N67671P06829R39993R38293J001089J263565J431637J416862
$$ 10033988 10645265 11212936 11919765 12859758 13798051 14799140 16062705 17494342 18911204
14342A8911204J271112J532927J909906J974471J839109J781887J929694K184915
$$ 18911204 20182316 21715243 23625149 25599620 27438729 29220616 31150310 33335225
14334C3335225J978326K255523K008310J822319K036738J354648J197120J244270
$$ 33335225 35313551 37569074 39577384 41399703 43436441 44791089 45988209 47232479
14326D7232479J238048J287138P57736N39270M01552L92205K89182l6487j29448
$$ 47232479 48470527 49757665 50515401 51054671 51456223 51848428 52137610 52101123 51971675
14317E1971675n33261l71999l92398j41562k66743k23324J11451L80012O52983
$$ 51971675 51438414 51066415 50674017 50532455 50265712 50042388 50153839 50533851 51186834
14308E1186834P38448O27241N05633Q33577P68035N71442L6416K36669O1376k29047
$$ 51186834 51925282 52552523 53058156 53891733 54659768 55231210 55267626 55504295 55565671 55336624
14298E5336624j04078j64108m59502p32809r70511j129715j379732j337385j371955
$$ 55336624 55232546 55068438 54608936 53876127 52905616 51775901 50396169 49058784 47686829
14289D7686829j495573j563615j670241j839786k065821j950918j937575k032887
$$ 47686829 46191256 44627641 42957400 41117614 39051793 37100875 35163300 33130413
14281C3130413j779795j447118j723584j530542j129333j152676j464157j508242
$$ 33130413 31350618 29903500 28179916 26649374 25520041 24367365 22903208 21394966
14273B1394966j102640q73924p39888q37960o88569n82570o03635n00906p45917
$$ 21394966 20292326 19418402 18678514 17840554 17151985 16569415 15965780 15464874 14718957
14264A4718957o66503n06764n91409l89769l98479m16266m49247p6844k69299
$$ 14718957 14052454 13545690 12954281 12564512 12166033 11749767 11300520 11223676 10954377
14255A0954377l89795m03030k76906k98271m51890l07824O6319r6248k66324j58413
$$ 10954377 10564582 10161552 9884646 9586375 9134485 8826661 8892980 8796732 8530408 8371995
14245H371995m3070p8662j24555k74252k19986j25704l14217k85795k03266o4721
$$ 8371995 8328925 8250263 8125708 7851456 7631470 7505766 7191549 6905754 6702488 6637767
14235F637767n0962r6966j74407J04757k19916j82738q562O3683m5561M0427p9635
$$ 6637767 6586805 6489839 6315432 6420189 6200273 6017535 6008973 6072656 6027095 6067522 5987887
14224E987887j83971l16120j28651k54030j62302Q2158N9858L8423M2591r1159
$$ 5987887 5803916 5487796 5359145 5105115 4942813 5024971 5084829 5123252 5165843 5074684
14214E074684l2045j50191l0888M567j39827n9521R5497j5045j01374j31668k28439
$$ 5074684 5042639 4892448 4861560 4866127 4726300 4666779 4762276 4747231 4645857 4514189 4285750
14203D285750j94921j02932J63742l8461M7926L1402j21082j60112J56609O0111
$$ 4285750 4090829 3987897 4151639 4113178 4161104 4192506 4071424 3911312 4067921 4128032
14193D128032j46241q882l8783J40080K92956P3836m5536J6769J59488M1146n8643
$$ 4128032 3981791 3972909 3934126 4074206 4367162 4440998 4395462 4412231 4571719 4612865 4554222
14182D554222j7554J86753L7441j24130k37290p276L13825P0817p3956J11593
$$ 4554222 4536668 4723421 4760862 4636732 4399442 4392166 4705991 4776808 4702852 4814445
14172D814445K22809K42340o6564k3175M5316l324J55540J64059O6716K53819
$$ 4814445 5037254 5279594 5213030 5189855 5235171 5231847 5387387 5551446 5618162 5871981
14162E871981J79825L55006M33584K91141L51234J66487J58894J86229J95281
$$ 5871981 6051806 6406812 6840396 7131537 7482771 7649258 7808152 7994381 8189662
14153H189662M44361J96222j00527J78051M2182O6582J60341P07313N83201O13644
$$ 8189662 8634023 8830245 8729718 8907769 8949951 9016533 9176874 9884187 10467388 11081032
14143A1081032M77178N87317N23111N28736L91730M44023N65451P33737O77201
$$ 11081032 11558210 12145527 12668638 13197374 13589104 14033127 14598578 15332315 16009516
14134A6009516P34809O25613M97685O04045O61321Q34990J043044R54202P53201
$$ 16009516 16744325 17369938 17867623 18471668 19132989 19967979 21011023 21965225 22718426
14125B2718426P35544M76356P37270R46836P48404O11751P78641M59031K33316
$$ 22718426 23453970 23930326 24667596 25614432 26362836 26974587 27753228 28212259 28445575
14116B8445575K16561L80808O14791L48741j61958j25148J8878n3473L0741Q5272
$$ 28445575 28662136 29042944 29657735 30006476 29844518 29719370 29738248 29684775 29715516 29800788
14106B9800788j3660n77726o59713n38161o54538n69017m89964l78923l10758
$$ 29800788 29787128 29209402 28549689 28011528 27356990 26787973 26298009 25919086 25608328
14097B5608328n61387p34578o39730o57744n48556l43558n00116n53686m31977
$$ 25608328 25046941 24312363 23672633 23014889 22466333 22122775 21622659 21068973 20636996
14088B0636996l78760m62368l97276k48349n92177k94538m15219o33564l32500
$$ 20636996 20258236 19795868 19398592 19150243 18558066 18263528 17848309 17214745 16882245
14079A6882245m34695q8784K7712K4911l65148l31125l3734j1728R0976J55493
$$ 16882245 16447550 16358766 16386478 16411389 16046241 15715116 15681382 15669654 15760630 15916123
14069A5916123L41J58134n555J89396m1263Q8430K80587K1126K47947L82330L54176
$$ 15916123 15916464 16074598 16069043 16258439 16217176 16305606 16586193 16607319 16855266 17237596 17591772
14058A7591772J50334J35152N36568N53765M36217O87619O59452M43658N45833
$$ 17591772 17742106 17877258 18413826 18967591 19403808 20091427 20750879 21194537 21740370
14049B1740370O07522Q16890P15794R52516Q57755P93691J137439J141962J174267
$$ 21740370 22347892 23164782 23880576 24833092 25690847 26484538 27621977 28763939 29938206
14040B9938206J050540Q64055J014504J086066J035667J107738J054834J150981
$$ 29938206 30988746 31852801 32867305 33953371 34989038 36096776 37151610 38302591
14032C8302591J096629R06717R53205Q62280Q28104Q50347P52514L12962K86804
$$ 38302591 39399220 40305937 41259142 42121422 42949526 43799873 44552387 44865349 45152153
14023D5152153J68378J97575L13444J78025j04432k85502m58244l84185k23398
$$ 45152153 45320531 45518106 45831550 46009575 45905143 45619641 45161397 44777212 44553814
14014D4553814l12685n49081n05126k76640q19368q82007o29403n14548n37264
$$ 44553814 44241129 43692048 43186922 42910282 42090914 41208907 40579504 40064956 39527692
14005C9527692m73850p74648n87020l90137k81789k72963j09892q726k30249k22386
$$ 39527692 39053842 38279194 37692174 37302037 37020248 36747285 36637393 36628667 36398418 36176032
13995C6176032l96860l21685J50282R8526m5344j80039l9830J21195j00754j72868
$$ 36176032 35779172 35457487 35607769 35706295 35660951 35480912 35441082 35562277 35461523 35288655
13985C5288655j75230j08796j24499j16166j09548k18808j30186j15951j62231
$$ 35288655 35113425 35004629 34880130 34763964 34654416 34435608 34305422 34189471 34027240
13976C4027240J08687R6904m36494k10202J4559J99317R6393K20913K02427K7901
$$ 34027240 34135927 34232831 33796337 33586135 33600694 33800011 33896404 34117317 34319744 34347645
13966C4347645K52487K79084K19479M04511M03188N23191R88469R61125R33511
$$ 34347645 34600132 34879216 35098695 35503206 35906394 36429585 37418054 38379179 39312690
13957C9312690J017530Q03964J017755J261517J139236J524376J683638J838121
$$ 39312690 40330220 41134184 42151939 43413456 44552692 46077068 47760706 49598827
13949D9598827J806135K080414K159894K009692K280545K244669K250927J925500
$$ 49598827 51404962 53485376 55645270 57654962 59935507 62180176 64431103 66356603
13941F6356603J932772J814702J960744J885566J855326J543285J247089R61193
$$ 66356603 68289375 70104077 72064821 73950387 75805713 77348998 78596087 79557280
13933G9557280Q30732N09199N26187M8765Q0835K32556M1668k08389j50188j38514
$$ 79557280 80388012 80897211 81423398 81472163 81552998 81785554 81827222 81618833 81468645 81330131
13923H1330131j268m2904M8462p3911J93369M56945N18944J002070J274859J470992
$$ 81330131 81328863 81285959 81334421 81260510 81453879 81910824 82429768 83431838 84706697 86177689
13913H6177689K158553K227225K606464L071231L159038L245650L675383L865134
$$ 86177689 88336242 90563467 93169931 96241162 99400200 102645850 106321233 110186367
13905A10186367L809555L612151L474943L177976L193769L378995L298993L016840
$$ 110186367 113995922 117608073 121083016 124260992 127454761 130833756 134132749 137149589
13897A37149589K560837K138659J595903J111555L42609M43856L09977L26660
$$ 137149589 139710426 141849085 143444988 144556543 144899152 145343008 145652985 145979645
13889A45979645N10823P17829P23520M69864k59401j120902j762691j951434k540863
$$ 145979645 146490468 147208297 147931817 148401681 148142280 147021378 145258687 143307253 140766390
13880A40766390k976340l204734k718813k172262j752665j472751p77757m61888
$$ 140766390 137790050 134585316 131866503 129694241 127941576 126468825 125691068 125229180
13872A25229180k30651m8195l41334n10356l26588o00934m12670K08239K26202
$$ 125229180 124998529 124950334 124609000 124098644 123772056 123171122 122758452 122966691 123192893
13863A23192893M59271L05395k6726o62194r21486j310632j426303j279643j229627
$$ 123192893 123652164 123957559 123930833 123268639 122347153 121036521 119610218 118330575 117100948
13854A17100948j027050n90704n07137j86475P8859P6008R5014K16960K84956
$$ 117100948 116073898 115483194 114976057 114789582 114868441 114944449 115039463 115256423 115541379
13845A15541379M90598M29362L25157K86828n31192j259181j947436k722147l152262
$$ 115541379 116031977 116461339 116786496 117073324 116542132 115282951 113335515 110613368 107461106
13836A07461106l553094l552927l165412k815781k593990k426238k074179j781545
$$ 107461106 103908012 100355085 97189673 94373892 91779902 89353664 87279485 85497940
13828H5497940j078717m92064j69981L9863P99308J446387J918395K573579K290331
$$ 85497940 84419223 83927159 83757178 83797041 84596349 86042736 87961131 90534710 92825041
13819I2825041K321853K134079J511372O49383l38667j213623k081823k877467
$$ 92825041 95146894 97280973 98792345 99441728 99103061 97889438 95807615 92930148
13811I2930148k923687l064687k956865k658567k372301k003316j579131j095672
$$ 92930148 90006461 86941774 83984909 81326342 78954041 76950725 75371594 74275922
13803G4275922q15060o81171n60300l16955j16775J25145L42857N27759P75960
$$ 74275922 73460862 72779691 72219391 71902436 71785661 71910806 72253663 72781422 73557382
13794G3557382J119631J245131J586352J663171K217856K387395K508767K907950
$$ 73557382 74677013 75922144 77508496 79171667 81389523 83776918 86285685 89193635
13786H9193635K916665L259239L364788L650049L996024M243537M885340N231578
$$ 89193635 92110300 95369539 98734327 102384376 106380400 110623937 115509277 120740855
13778A20740855M828986M313882L972020K977596J443655k76072k106213l076959
$$ 120740855 125569841 129883723 133855743 136833339 138276994 138000922 135894709 132817750
13770A32817750l853444m273866m574507m778977m314258l559097l275388l137310
$$ 132817750 128964306 124690440 120115933 115336956 111022698 107463601 104188213 101050903
13762A01050903k769519k366620j960686j979823j700473j095910q10094n87437
$$ 101050903 98281384 95914764 93954078 91974255 90273782 89177872 88367778 87780341
13754H7780341k59125o9342n9467M92402O75739O21934N92404P14188Q90595O29656
$$ 87780341 87521216 87451874 87392407 87884809 88560548 89182482 89774886 90489074 91379669 92009325
13744I2009325O29039M54254J12804J28967L227k25268n13516r35371j066838
$$ 92009325 92638364 93092618 93205422 93334389 93337616 93112348 92598832 91663461 90596623
13735I0596623j335103j547314j506776j889653j747421j815894k144628k299835
$$ 90596623 89261520 87714206 86207430 84317777 82570356 80754462 78609834 76309999
13727G6309999k350369k023096j967883j931331k150885j990860j769427j686002
$$ 76309999 73959630 71936534 69968651 68037320 65886435 63895575 62126148 60440146
13719F0440146j431820j445872j459127j297779r90240q96382o08451j006793
$$ 60440146 59008326 57562454 56103327 54805548 53815308 52918926 52310475 51303682
13711E1303682r37881q41837p01211n51165o10066m76472m61335m37984j33778
$$ 51303682 50365801 49523964 48822753 48271588 47661522 47185050 46723715 46285731 46151953
13702D6151953l05991n44124l81209l86773k42019k02519Q5317p70L87317K17630
$$ 46151953 45845962 45301838 44920629 44533856 44291837 44089318 44174635 44173865 44561182 44778812
13692D4778812P18659J000716Q37697J067338J519513J587494K124565K480872
$$ 44778812 45497471 46498187 47335884 48403222 49922735 51510229 53634794 56115666
13684E6115666K745040L098033L159673K778396J811930P82488o43583j616195
$$ 56115666 58860706 61958739 65118412 67896808 69708738 70491226 69847643 68231448
13676F8231448k469045k813957k946244l309975l163435k569414k373376k176802
$$ 68231448 65762403 62948446 60002202 56692227 53528792 50959378 48586002 46409200
13668D6409200j884820j915628j536730j362404j107095r26767r55616p62753
$$ 46409200 44524380 42608752 41072022 39709618 38602523 37675756 36720140 35957387
13660C5957387n38891l87592n01198l38145k34437l34686o2028o5598L34449L70697
$$ 35957387 35418496 35030904 34529706 34191561 33957124 33622438 33560410 33494812 33829261 34199958
13650C4199958N76385P10371J267611J241305J491253J848089K192017K643129
$$ 34199958 34776343 35486714 36754325 37995630 39486883 41334972 43526989 46170118
13642D6170118L416768L679063L706012L837627L763924L264466J718807N49272
$$ 46170118 49586886 53265949 56971961 60809588 64573512 67837978 69556785 70106057
13634G0106057q17251k699570l624206m034746m139364l854558l376724k758953
$$ 70106057 69288806 66589236 62965030 58930284 54790920 50936362 47559638 44800685
13626D4800685k428358j974639j661513j226988j031857q53898o93840K69315
$$ 44800685 42372327 40397688 38736175 37509187 36477330 35623432 34929592 35198907
13618C5198907O36154N38149Q01055M99974L88050M1089M1511m84340j336035
$$ 35198907 35835061 36373210 37174265 37674239 38062289 38103378 38144889 37660549 36324514
13609C6324514j759022j939488j779272j646431j443032j356948j516464j348447
$$ 36324514 34565492 32626004 30846732 29200301 27757269 26400321 24883857 23535410
13601B3535410r92816q09546q50045q41589o42044m82312m77751n18656p7938
$$ 23535410 22542594 21733048 20883003 20041414 19399370 18917058 18439307 17920651 17842713
13592A7842713L0566l33591p4144o2273q2840j12451N4925K04592J87422K97157
$$ 17842713 17873279 17539688 17465544 17403271 17320431 17207980 17262905 17467497 17654919 17952076
13582A7952076L77877O02328O54795P68647J216083J368943J597049J857583K311809
$$ 17952076 18329953 18932281 19587076 20355723 21571806 22940749 24537798 26395381 28707190
13573B8707190K659195K557661K461037J874232R84805J46574o39969j364319
$$ 28707190 31366385 33924046 36385083 38259315 39244120 39390694 38750725 37386406
13565C7386406k127317k562929l031752k697369k178287j864556j797899j253444
$$ 37386406 35259089 32696160 29664408 26967039 24788752 22924196 21126297 19872853
13557A9872853j252881j319801o47590l32556m35625j95291j82305j96438n83861
$$ 19872853 18619972 17300171 16652581 16320025 15884400 15689109 15506804 15310366 14726505
13548A4726505n54243o86820q99709n62032m09134o54221q31474m59362j26761
$$ 14726505 14172262 13485442 12585733 12023701 11614567 10960346 10128872 9669510 9542749
13539I542749r5056q7742l11162l38965l92172k07786k7308R9939k31596j33893
$$ 9542749 9447693 9359951 9048789 8709824 8317652 8109866 8082558 8182497 7950901 7817008
13529G817008k63263j21652j89861k81181Q8998j27939k43064k19872J76117k13748
$$ 7817008 7553745 7432093 7242232 6961051 7050049 6922110 6679046 6459174 6635291 6421543
13519F421543l45505k74959j23226r3502m2537K10219L1506k41308l26928j51494
$$ 6421543 6076038 5801079 5677853 5584351 5541814 5752033 5783539 5542231 5215303 5063809
13509E063809k0646O1009j64219M293r7417j40269M9352q1579J15980j4138k44673
$$ 5063809 5043163 5104172 4939953 4944246 4846829 4706560 4755912 4674333 4790313 4776175 4531502
13498D531502r2277j1740K6209N0886J07855j45270j40614J90286j02827j69115
$$ 4531502 4439225 4427485 4453694 4504580 4612435 4467165 4326551 4516837 4414010 4244895
13488D244895j95239j38958j28363j9964m3421p1952M6347l4404O4324P8428R628
$$ 4244895 4049656 3910698 3782335 3762371 3718950 3646998 3693345 3658941 3723265 3801693 3811321
13477C811321o4504n4621k45364m3066K74841K57921M64220J8720o6432l03287
$$ 3811321 3746817 3692196 3446832 3403766 3678607 3936528 4400748 4419468 4353036 4049749
13467D049749r9435J12277n2191j00936j2107J72078l1903k5205k1536J49082
$$ 4049749 3950314 4062591 4010400 3909464 3897357 4069435 4037532 4012327 3990791 4139873
13457D139873K42872j36935J73202L41377L5744j08628j3206K18911L86723L13975
$$ 4139873 4382745 4245810 4419012 4760389 4796133 4687505 4674299 4893210 5279933 5593908
13447E593908M70444M16187J91743J92846N00669N55412K44879N91227M96431
$$ 5593908 6064352 6480539 6672282 6865128 7365797 7921209 8166088 8757315 9253746
13438I253746N36988Q86626J077445J160589J327583J481928J713278J940947
$$ 9253746 9790734 10677360 11754805 12915394 14242977 15724905 17438183 19379130
13430A9379130K447353K246777K103643J995627K265765K245354J983953J798924
$$ 19379130 21826483 24073260 26176903 28172530 30438295 32683649 34667602 36466526
13422C6466526J669039J428052P94409J03084l0639l39748q67510j147247j792269
$$ 36466526 38135565 39563617 40358026 40461110 40430471 40090723 39223213 38075966 36283697
13413C6283697j646667j534160j765868j656353j609563j884210j355474q28345
$$ 36283697 34637030 33102870 31337002 29680649 28071086 26186876 24831402 24003057
13405B4003057p91734r09109q30579n36299k12523j46423q4186j85505K89004
$$ 24003057 23211323 22302214 21471635 20935336 20722813 20576390 20492204 20306699 20595703
13396B0595703O63305O95960Q66116J260132J283960J733787K055726K460301
$$ 20595703 21259008 21954968 22821084 24081216 25365176 27098963 29154689 31614990
13388C1614990K815998L003189L096215L435574L613844L497534L491992L103009
$$ 31614990 34430988 37434177 40530392 43965966 47579810 51077344 54569336 57672345
13380E7672345K552877K057059J791666J045644J61613r09079j541597j760358
$$ 57672345 60225222 62282281 64073947 65119591 65281204 64372125 62830528 61070170
13372F1070170k328765k817644k821438l171539l113447l070716k909971k748305
$$ 61070170 58741405 55923761 53102323 49930784 46817337 43746621 40836650 38088345
$$ [...]
##END NTUPLES=NMR SPECTRUM
##END=
