##TITLE=Analysis number 321183
Compound Code mo 07903
Book Reference 487/105
Project Code adrs
Chemist Name janh
##JCAMPDX= 6.0         $$ Bruker NMR JCAMP-DX V2.0
##DATA TYPE= NMR SPECTRUM
##DATA CLASS= NTUPLES
##ORIGIN= Bruker BioSpin GmbH
##OWNER= nmr
$$ XWIN-NMR		Version 3.5
$$ Thu Jul 27 09:08:35 2006 GMT Daylight Time (UT+1h)  MAYBRIDGE\nmr@NMR_250MHZ
##.OBSERVE FREQUENCY= 250.131544655141
##.OBSERVE NUCLEUS= ^1H
##.ACQUISITION MODE= SIMULTANEOUS (DQD)
##.ACQUISITION SCHEME= undefined
##.AVERAGES= 16
##.DIGITISER RES= 18
##SPECTROMETER/DATA SYSTEM= dpx250
##.PULSE SEQUENCE= zg30
##.SOLVENT NAME= CDCl3
##.SHIFT REFERENCE= (INTERNAL, CDCl3, 0, 16.522)
##AUDIT TRAIL= $$ (NUMBER, WHEN, WHO, WHERE, WHAT)
$$ ##TITLE= Audit trail, XWIN-NMR		Version 3.5
$$ ##JCAMPDX= 5.01
$$ ##ORIGIN= Bruker BioSpin GmbH
$$ ##OWNER= nmr
$$ C:\u/data/dgb/nmr/ADRS/3720/pdata/1/auditp.txt
$$ ##AUDIT TRAIL=  $$ (NUMBER, WHEN, WHO, WHERE, WHAT)
(   1,<2006-07-27 09:08:11.89 +100>,<MAYBRIDGE\nmr>,<NMR_250MHZ>,
      <created by zg, POWCHK disabled, PULCHK disabled
       configuration hash MD5:
       E2 DF 36 D8 04 B2 41 60 5A D7 A3 38 5A 4B D0 FE
       data hash MD5: 64K
       51 83 00 9A C4 33 30 97 7B 8B FA 3C 03 F5 95 27>)
(   2,<2006-07-27 09:08:25.61 +100>,<MAYBRIDGE\nmr>,<NMR_250MHZ>,
      <Start of raw data processing
       ef LB = 0.3 FT_mod = 6 PKNL = 1 SI = 32K 
       data hash MD5: 32K
       8B 59 B9 78 2A E8 D2 08 20 5F DA 92 DB DA 9E 2C>)
(   3,<2006-07-27 09:08:27.20 +100>,<MAYBRIDGE\nmr>,<NMR_250MHZ>,
      <apk 
       data hash MD5: 32K
       30 31 CC 2D 09 D7 5A B4 43 19 F9 01 1A 74 10 F6>)
(   4,<2006-07-27 09:08:27.90 +100>,<MAYBRIDGE\nmr>,<NMR_250MHZ>,
      <abs ABSG = 5 
       data hash MD5: 32K
       F3 54 FF FC 6C 09 E3 D6 00 2E FC 37 58 14 1D 23>)
$$ ##END=
$$ 
$$ hash MD5
$$ A2 F6 51 CB B7 04 A5 47 D4 CE 9D 99 04 3A DF 46
##$RELAX= 
##$RELAX= 
##$RELAX= 
##$RELAX= 
##$RELAX= 
##$RELAX= 
##$RELAX= 
$$ Bruker specific parameters
$$ --------------------------
##$DU= <C:\u>
##$EXPNO= 3720
##$NAME= <ADRS>
##$PROCNO= 1
##$TYPE= <nmr>
##$USER= <dgb>
##$AMP= (0..31)
100 100 100 100 100 100 100 100 100 100 100 100 100 100 100 100 100 100 
100 100 100 100 100 100 100 100 100 100 100 100 100 100 
##$AQSEQ= 0
##$AQ_mod= 3
##$AUNM= <au_zg>
##$AUTOPOS= <6 >
##$BF1= 250.13
##$BF2= 250.13
##$BF3= 250.13
##$BF4= 250.13
##$BF5= 500.13
##$BF6= 500.13
##$BF7= 500.13
##$BF8= 500.13
##$BYTORDA= 1
##$CFDGTYP= 0
##$CFRGTYP= 5
##$CHEMSTR= <none>
##$CNST= (0..31)
1 1 145 1 1 1 1 1 1 1 1 1 1 1 1 1 1 1 1 1 1 1 1 1 1 1 1 1 1 1 1 1 
##$CPDPRG= <>
##$CPDPRG1= <>
##$CPDPRG2= <>
##$CPDPRG3= <>
##$CPDPRG4= <mlev>
##$CPDPRG5= <mlev>
##$CPDPRG6= <mlev>
##$CPDPRG7= <mlev>
##$CPDPRG8= <mlev>
##$CPDPRGB= <>
##$CPDPRGT= <>
##$D= (0..31)
0 1 0 0 0 0 0 0 0 0.06 0 0 0 0 0 0 0.0002 0 0 0 0 0 0 0 0 0 0 0 0 0 0 
0 
##$DATE= 1153987690
##$DBL= (0..7)
120 120 120 120 120 120 120 120 
##$DBP= (0..7)
150 150 150 150 150 150 150 150 
##$DBP07= 0
##$DBPNAM0= <>
##$DBPNAM1= <>
$$ [...]
##$SUBNAM7= <"">
##$SUBNAM8= <"">
##$SUBNAM9= <"">
##$SW= 20.6930455092707
##$SWIBOX= (0..15)
0 0 3 0 0 0 0 0 0 0 0 0 0 0 0 0 
##$SW_h= 5175.983436853
##$TD= 65536
##$TD0= 1
##$TE= 295.16
##$TE2= 300
##$TE3= 300
##$TEG= 300
##$TL= (0..7)
0 120 120 120 120 120 120 120 
##$TP= (0..7)
150 150 150 150 150 150 150 150 
##$TP07= 0
##$TPNAME0= <>
##$TPNAME1= <>
##$TPNAME2= <>
##$TPNAME3= <>
##$TPNAME4= <>
##$TPNAME5= <>
##$TPNAME6= <>
##$TPNAME7= <>
##$TPOAL= (0..7)
0.5 0.5 0.5 0.5 0.5 0.5 0.5 0.5 
##$TPOFFS= (0..7)
0 0 0 0 0 0 0 0 
##$TUNHIN= 0
##$TUNHOUT= 0
##$TUNXOUT= 0
##$USERA1= <user>
##$USERA2= <user>
##$USERA3= <user>
##$USERA4= <user>
##$USERA5= <user>
##$V9= 5
##$VALIST= <valist>
##$VCLIST= <CCCCCCCCCCCCCCC>
##$VD= 0
##$VDLIST= <DDDDDDDDDDDDDDD>
##$VPLIST= <PPPPPPPPPPPPPPP>
##$VTLIST= <TTTTTTTTTTTTTTT>
##$WBST= 1024
##$WBSW= 4
##$XGAIN= (0..3)
0 0 0 0 
##$XL= 0
##$YL= 0
##$YMAX_a= 281511
##$YMIN_a= -357631
##$ZGOPTNS= <>
##$ZL1= 120
##$ZL2= 120
##$ZL3= 120
##$ZL4= 120
##$ABSF1= 16.522
##$ABSF2= -4.171173
##$ABSG= 5
##$ABSL= 3
##$ALPHA= 0
##$AQORDER= 0
##$ASSFAC= 0
##$ASSFACI= 0
##$ASSFACX= 0
##$ASSWID= 0
##$AUNMP= <proc_1d>
##$AZFE= 0.1
##$AZFW= 0.1
##$BCFW= 0
##$BC_mod= 0
##$BYTORDP= 0
##$COROFFS= 0
##$CY= 12.5
##$DATMOD= 1
##$DC= 0
##$DFILT= <>
##$DTYPP= 0
##$F1P= 14.0000005364418
##$F2P= -0.99999901652339
##$FCOR= 0.5
##$FTSIZE= 32768
##$FT_mod= 6
##$GAMMA= 0
##$GB= 0
##$INTBC= 1
##$INTSCL= 1
##$ISEN= 128
##$LB= 0.3
##$LEV0= 0
##$LPBIN= 0
##$MAXI= 10000
##$MC2= 0
##$MEAN= 0
##$ME_mod= 0
##$MI= 0
##$NCOEF= 0
##$NC_proc= -5
##$NLEV= 6
##$NOISF1= 0
##$NOISF2= 0
##$NSP= 0
##$NTH_PI= 0
##$NZP= 0
##$OFFSET= 16.522
##$PC= 1
##$PHC0= 170.3325
##$PHC1= 4.056306
##$PH_mod= 1
##$PKNL= yes
##$PPARMOD= 0
##$PSCAL= 4
##$PSIGN= 0
##$REVERSE= no
##$SF= 250.13
##$SI= 32768
##$SIGF1= 0
##$SIGF2= 0
##$SINO= 400
##$SIOLD= 32768
##$SREGLST= <1H.CDCl3>
##$SSB= 0
##$STSI= 32768
##$STSR= 0
##$SW_p= 5175.98343685301
##$SYMM= 0
##$S_DEV= 0
##$TDeff= 65536
##$TDoff= 0
##$TI= <Analysis number 999999
Compound Code 99
Book Reference 9
Project Code 9>
##$TILT= no
##$TM1= 0
##$TM2= 0
##$TOPLEV= 0
##$USERP1= <user>
##$USERP2= <user>
##$USERP3= <user>
##$USERP4= <user>
##$USERP5= <user>
##$WDW= 1
##$XDIM= 32768
##$YMAX_p= 510952381
##$YMIN_p= -1283978
$$ End of Bruker specific parameters
$$ ---------------------------------
##NTUPLES= NMR SPECTRUM
##VAR_NAME=  FREQUENCY,     SPECTRUM/REAL,   SPECTRUM/IMAG
##SYMBOL=    X,             R,               I
##VAR_TYPE=  INDEPENDENT,   DEPENDENT,       DEPENDENT
##VAR_FORM=  AFFN,          ASDF,            ASDF
##VAR_DIM=   32768,         32768,           32768
##UNITS=     HZ,            ARBITRARY UNITS, ARBITRARY UNITS
##FACTOR=    0.157963299565203, 1,           1
##FIRST=     4132.6476996994, 0,             0
##LAST=      -1043.33573715361, 0,           0
##MIN=       -1043.33573715361, -1283978,    0
##MAX=       4132.6476996994, 510952381,     0
$$ Real data points
##PAGE= N=1
##DATA TABLE= (X++(R..R)), XYDATA
$$ [...]
21743 556654 26254 34310 253154 182217 129069 188197 150747 214600 282678 237998 141240
21732 141240 416202 387369 179190 135720 571406 730769 763467 545591 625714 946630
21722 946630 1079118 1206423 965612 1269093 1237801 1059642 982510 1408231 1311220 1234159
21712 1234159 1212410 1387819 1782322 1750726 1398218 1167658 938887 811838 849785 814992
21702 814992 755587 587403 321890 45683 107335 -49476 246739 655904 708013 729251
21692 729251 812915 515056 380623 65973 192126 342119 435755 340700 136772 339656
21682 339656 455061 650775 626264 399397 422258 632422 924962 982153 787820 747191
21672 747191 575996 431084 309331 233166 616942 828914 606242 657809 529280 633221
21662 633221 533528 474792 944560 979575 688909 936026 831243 921365 889191 674105
21652 674105 780683 647160 582398 647131 533841 514720 772596 474650 151709 -15356
21642 -15356 -187792 111561 935241 1305755 1038450 466463 354092 153031 -82774 110526
21632 110526 366154 237418 258753 172091 312006 325300 92516 -9883 139502 121046
21622 121046 51641 316207 782837 667499 395372 190609 -172463 -591657 -463016 -244624
21612 -244624 -164335 -100818 -113181 56172 62681 31044 -99808 -168917 -78843 107597 127937
21601 127937 122434 40360 -43987 -86445 -58788 -99820 152263 442010 406700 495374 503686
21590 503686 364359 560671 510239 502122 344175 387680 507188 792418 513638 731462
21580 731462 669913 615541 512555 467636 358019 433333 70915 -172474 -465885 -737796
21570 -737796 -533480 -270381 -269221 -264049 -390128 -528423 -236737 -134778 -326980 -226534
21560 -226534 124650 201101 228535 79441 170076 471089 611346 349456 134781 102224
21550 102224 112023 233970 -29093 -185074 -58502 -149637 45272 302195 351110 267680
21540 267680 7031 -70014 291448 495682 484003 536707 397084 745517 431757 489632
21530 489632 474599 525029 656815 625872 449839 518329 164759 278409 654768 664067 449571
21519 449571 434103 436882 235447 249062 396705 743192 967431 967995 733505 395597 207571
21508 207571 242567 506121 525824 407347 400521 217576 294981 164180 -144803 -407647
21498 -407647 -246249 -13370 60933 236338 416642 235867 75696 297393 -138983 -422916
21488 -422916 -116555 283308 468407 500497 136910 -142633 -226939 -237186 29397 163210
21478 163210 43808 462706 461636 289801 196352 107854 251675 390702 -10862 -185344
21468 -185344 -24335 290020 524293 658731 502476 519102 257050 -80435 -248315 -191786
21458 -191786 -82454 316610 526013 287616 267424 466974 178516 157729 151970 244102
21448 244102 409609 140128 98163 -165471 20722 280774 321877 184399 493186 663428
21438 663428 845377 716048 301994 -94238 -192290 -463205 -549567 -104045 361526 463764
21428 463764 465790 505489 587563 569771 368949 298103 481831 258624 37780 -187816 100392
21417 100392 236617 479985 465529 500370 451260 443361 700691 840190 769464 500847 262410
21406 262410 596809 810227 811012 652355 825557 996825 936339 586539 665010 1090819
21396 1090819 1156652 1351035 1267738 1246660 1336903 1261613 1029439 716854 620295 1080740
21386 1080740 1325187 1177518 1076943 1080855 882949 656990 776118 728466 690945 731229
21376 731229 615270 388985 998182 1363696 1297409 1187516 841939 900492 870441 731404
21366 731404 541549 545814 709546 1016367 751020 319934 335079 662623 547221 279756
21356 279756 430109 319238 253189 694235 704201 662491 920952 894750 515753 505995 484383
21345 484383 185920 353177 426606 789183 885625 816097 1075007 796657 490565 654518
21335 654518 719374 567888 181067 356751 148649 180588 546541 440471 -136048 -7368
21325 -7368 50151 316350 299197 303606 210473 115322 531080 929827 894074 431754 -311391
21314 -311391 -633743 -246782 2289 -4439 350397 369331 147869 239430 363670 421
21304 421 -24466 61007 120408 248772 -6677 -61886 326885 767611 594199 622747 602666
21293 602666 223079 568895 708838 1037283 1318265 1445821 1464073 1490437 1585447 1747958
21283 1747958 1622235 1941038 2364463 2423820 2782448 2919283 3123660 3173250 3352405 3216760
21273 3216760 3365516 3827509 4355020 4829003 5131534 5352710 5647069 6173577 6332564
21264 6332564 6522778 6637430 6929722 6910741 6662619 6595683 6995921 6983842 7138747 7409018
21254 7409018 7554737 6990000 6584047 6710970 6832447 6371151 5810648 5539572 5418860
21245 5418860 5061645 5047518 5210917 5001560 4656089 4290297 3630389 3092116 2810118 2726926
21235 2726926 2345107 2322293 2029385 1753565 1797114 1612621 1656182 1953273 1938884 1923695
21225 1923695 1787863 1901360 2266576 2474703 2682109 2611818 2125447 1891161 1741645 1675329
21215 1675329 1540490 1341714 1341094 1570206 1551231 1255028 1017233 1082929 1419188 1664949
21205 1664949 1784047 1558054 1510602 1557791 1669467 1564185 1699675 1684190 1819351 2019572
21195 2019572 1861913 1356409 1532192 1615118 1482075 1369948 1418930 1578845 2493406 2588043
21185 2588043 2216115 2053396 2162683 2151517 2188502 2349798 2321259 2498696 2775534 2747035
21175 2747035 3097426 3194072 3398944 3411935 3706107 4294714 4703054 5273245 5770530 6089948
21165 6089948 6312692 6439597 6543593 7525971 8141628 8850268 9753148 10607196 10955024
21156 10955024 11544358 12492204 13445329 14488656 15410073 16618074 18192108 19874271 21551715
21147 21551715 23787752 25940682 27989834 30595869 32956777 35922412 39677996 43795052
21139 43795052 47997484 52357721 57168992 62508968 68449827 75502639 84061470 93338606
21131 93338606 103461823 114324178 125774250 138207324 152148516 167342915 183691351
21124 183691351 200900389 217342112 230528281 240490385 249783867 259973792 270464222
21117 270464222 281888335 294007086 303366135 308338323 307099173 294658127 271332357
21110 271332357 243263516 215843413 192356905 173678767 159317289 148677999 140052112
21103 140052112 132718900 126231033 120711182 115936801 111851890 107985887 104484960 100710035
21095 100710035 96766703 92913025 89612402 86390034 83951232 81626156 79509576 77565286
21087 77565286 75950823 74565331 73416656 72281550 71126348 69854731 68424263 66937662
21079 66937662 65913253 65092842 63946829 63128136 62194777 61107558 59772845 58219392
21071 58219392 56437102 54645610 53280870 51838657 50245325 48914092 47460799 46498464
21063 46498464 45484743 44110159 43016981 42232344 41766585 41088834 40356138 39821075 39416986
21054 39416986 39191597 38630410 37828630 37062716 36587125 36060331 35537786 35302765 34620934
21045 34620934 34399024 34567512 34376901 33412806 33113914 33499503 33812661 33847597 33530530
21036 33530530 33112972 33180908 33004886 32969637 33222494 33357941 33284375 33081760 32908173 32969961
21026 32969961 32624827 32659732 32733172 32809122 32928070 33259525 33663783 33844727 33771426 33800884
21016 33800884 33592670 33581287 33562656 33412808 33045555 32946118 32998093 32526808 32333062 32603536
21006 32603536 32535536 32217205 31957171 31621283 30989916 30361041 30177097 29731498 29095689
20997 29095689 28721548 28328797 27615849 26822119 25818314 24972064 23893471 23209449 22566540
20988 22566540 22264116 21859313 21002759 19843430 19606252 19341354 19164260 19069113 18690233
20979 18690233 18225337 17991433 17801918 17437735 17104322 17014886 16663900 16574266 16270444 15896644
20969 15896644 15466013 15174890 14963365 14614520 14757480 14772801 14412173 13829483 13422632
20960 13422632 13184643 12667434 12394793 12527804 12655925 12729890 12443326 12108802 12054191 11794781
20950 11794781 11437137 10900723 10773584 10849262 10851846 10733908 10698874 10251050 10147276 10388040
20940 10388040 10256490 9626026 9649900 9772212 9730444 9909736 10373638 10363442 9992580 9806637
20930 9806637 9746913 9896310 9709306 9814989 9712562 9400230 9161357 8609417 8469386 8417697
20920 8417697 7921043 7722531 7969065 7752062 7047681 6950743 7285356 6776182 6019714 5780216
20910 5780216 5795301 5438184 5233726 4976239 5076294 4997611 4948404 4824891 4521832 4062689
20900 4062689 3816473 4083950 4461078 4193049 4015879 3553040 3456451 3293944 3041889 2895144
20890 2895144 2722187 2683612 2576939 2864419 2775822 2450375 2486043 2488532 2521102 2643375
20880 2643375 2625430 2607398 2486393 2474563 2404529 2545979 2688393 2783188 2869478 2529135
20870 2529135 2629393 2766249 2546423 2303135 2505374 2431473 2394868 2490146 2201772 1589086
20860 1589086 1290081 1580046 1499119 1537485 2054393 2083283 2083732 1868588 1973414 1949850 2049751
20849 2049751 2404928 2597912 2477552 2405061 2117206 2073896 2063732 2038298 2077654 2294568
20839 2294568 1818588 1984464 2485895 2632333 1935285 1812827 2056880 2129265 1715374 1298376
20829 1298376 1200219 1307367 1741022 1785129 1625714 1768605 1859124 1755362 2005480 2238167
20819 2238167 2000365 1713090 1352384 1223150 1215639 1529834 2080581 2246282 2200168 2099148
20809 2099148 2061500 2089156 2043001 2201587 2287172 2225901 2431796 2300183 2034479 2065970
20799 2065970 2269953 2380162 2475936 2375866 2550389 2550980 2676360 2526016 2509634 2343683
20789 2343683 2508518 2428918 2613581 2477072 2361825 2377616 2364469 2252337 2183480 2132654
20779 2132654 2133478 2141533 2041824 2194778 2180142 2445989 2310083 2339358 2366240 2114251 2046695
20768 2046695 1806692 2027546 2057465 1849259 1803127 1721061 1820634 1604702 1384547 1576831
20758 1576831 1451526 1258982 1538480 2118143 2205592 1855136 1733380 1629716 1649178 1824052
20748 1824052 1561267 1458251 1309074 1291333 1085457 951524 626169 884594 862691 545226
20738 545226 734739 1118234 1099721 619142 325095 445570 822306 1075549 1066101 1248231
20728 1248231 959899 1078581 1239146 1396138 1276443 908340 826621 896540 933870 970115
20718 970115 808889 624106 717896 1173424 1213897 1031711 1008916 1086019 738682 385142
20708 385142 36539 5446 179123 525835 469302 262497 112767 343805 639635 332341
20698 332341 191419 178073 348071 321351 409425 338594 467140 717606 779122 654928
20688 654928 465509 163335 32910 428982 74788 -66796 -207536 -300336 -432295 -203431
20678 -203431 161764 58788 161895 230134 472930 400544 306600 18279 -72664 336604
20668 336604 380631 -70220 -169261 -216297 197901 517066 267756 314870 284574 568586
20658 568586 737567 595818 256100 463552 662653 842582 835916 737763 417365 344054
20648 344054 510069 613039 971940 836318 506703 412844 368638 245819 375299 275005
20638 275005 304059 385119 550608 872467 1157819 994863 724775 770072 1139754 1079743
20628 1079743 885086 1025862 1089694 1179951 776535 682076 389742 402680 479696 497618
20618 497618 626222 886134 836473 565110 555847 356717 245438 309437 751905 886997
20608 886997 774574 697954 389855 376960 489817 464100 595053 588505 556796 379283 114083
20597 114083 -86798 -54544 -114395 35417 149226 417901 340522 755577 859810 636362
20587 636362 467810 525723 701565 780545 993447 1115189 896306 835832 494877 623244
20577 623244 430906 373449 518907 695892 787938 668635 635397 846518 860737 548469
20567 548469 669088 595892 594206 654804 346204 -176060 -120356 210029 448091 441391 154278
20556 154278 -19509 -90728 420965 783673 835494 629820 155104 214724 284488 113516
20546 113516 321023 239100 61130 163439 -196458 -257930 120131 378770 647672 573228
20536 573228 543533 709084 778669 424628 229309 377632 554369 777266 993167 1110752
20526 1110752 1259454 1386355 1058324 886247 879023 885102 1138371 1394478 1628829 1622897
20516 1622897 1235964 1160100 1058551 1034377 1194057 1315896 1564146 1641251 1402203 1139582
20506 1139582 1256008 1174730 808470 759217 1158983 1393488 1760477 1669595 1197738 1180671
20496 1180671 1297741 1255371 1045286 939829 875966 971308 779737 1006936 878697 732254
20486 732254 464530 368805 305709 492230 782762 514326 442350 395098 833796 1193462
20476 1193462 1193123 864917 607698 665487 1026827 1212510 1079071 907070 1090202 1253135
20466 1253135 1173230 1157115 1108318 723968 575158 515112 663107 875281 909666 1052112
20456 1052112 1290989 1036863 685803 713174 986150 821373 507502 325754 359538 149023
20446 149023 -379398 -283325 -125617 72617 585834 510551 362526 443141 536654 325225
20436 325225 220827 126623 -72117 361765 739913 741593 634312 569008 719908 901556
20426 901556 428027 31887 125399 53342 253064 617152 786276 881047 896468 464481
20416 464481 597216 581890 663892 939980 513414 18326 -184546 80738 369275 781078
20406 781078 685377 599083 413135 165466 448922 679639 286908 -67687 118242 75512
20396 75512 -23287 320869 375672 467683 813633 774833 521628 428595 427223 -40955 -254667
20385 -254667 -124026 96512 113829 89470 126134 375635 456705 292112 209611 455038
20375 455038 447292 552199 528433 580367 539708 695306 326429 -90454 -248327 -200561 -375991
20364 -375991 -320950 -196142 -73117 -165468 -303688 -261616 -38779 284883 376887 53386
20354 53386 -303142 -353156 -140509 -60341 -661 488864 413974 336134 246605 50480 36399
20343 36399 49035 -286440 -493521 -428958 -169669 -220364 -465526 -648359 -922786 -756747
20333 -756747 -335700 -55653 180693 310898 232775 171780 -120720 -158035 140761 307037
20323 307037 285904 628788 779097 575141 156524 224628 407208 149463 -336974 -291318
20313 -291318 368995 372141 221793 427151 198681 -5239 -58168 166827 231074 371418
20303 371418 244783 43328 176083 39282 29608 -51623 -145636 -190791 -271668 -286424 -54348
20292 -54348 -60867 -223475 12799 230933 134009 -304532 -379987 -60220 -48772 94010 -33590
20281 -33590 -341463 -84816 90511 64343 379037 463175 -45073 -77604 -126868 -350535
20271 -350535 -286406 -167879 177478 411161 471278 224615 191970 -8123 -236505 -293557
20261 -293557 -343060 -258861 -424698 -527162 -436736 -747442 -302418 -2789 -40344 -86840
20251 -86840 -10836 174250 466059 503135 227518 189440 229790 209536 257779 45205 -310260
20240 -310260 -333174 102883 304945 361587 239922 424252 464142 280269 146322 -152067
20230 -152067 154889 378014 365271 128821 -330736 -545940 -382105 -435909 -434773 -473153
20220 -473153 -659029 -639505 -182689 -29415 -116710 -181044 -438770 -299800 -49028 288277
20210 288277 495292 408390 481119 315038 640 386948 474089 455949 -21400 -356773
20200 -356773 -214470 -238515 139201 1134 -64667 -7388 114534 398258 476839 576254
20190 576254 806654 745810 262290 -258181 -312847 106287 439947 545024 663499 342953
20180 342953 111547 492053 918075 822851 484442 42129 101711 300267 472798 594735
20170 594735 152442 -45605 115704 96961 -106722 -113219 -40500 -72006 -296885 -222353 -257384
20159 -257384 -2198 -5751 188145 -68711 -198091 54710 264911 319089 366222 708877
20149 708877 708753 436733 417712 324697 45025 -56555 -159597 -281783 -8192 316480
20139 316480 294355 212763 -73877 -248650 -295782 -347229 -623410 -846801 -724981 -665357
20129 -665357 -489057 -433363 -716735 -460956 -219856 -232060 -318794 -482700 -509027 -535525
20119 -535525 -278581 -380840 -318020 -182243 69028 345142 282998 -154070 -547902 -602875
20109 -602875 -250237 6666 -69949 128737 434792 277128 176325 149808 -156174 -460974
20099 -460974 -209637 78641 -134331 -197209 -340398 -75455 51997 170515 84165 79912
20089 79912 316342 171610 -192 -404248 -248396 -114060 -53951 -76048 -263084 -256431
20079 -256431 -690179 -848906 -852094 -574265 -431543 -511087 -392015 -396193 -466817 143934 64734
20068 64734 -57664 -293653 -462975 -298272 -321148 -28897 -112380 15262 320547 49817
20058 49817 96311 285878 152153 -123245 -259311 -413378 -207045 26216 30146 -243042
20048 -243042 -51668 -14874 -21780 -219209 -216046 -274871 -459003 -739298 -593695 25392 -84355
20037 -84355 -253177 -189094 66562 273175 280585 91377 89288 181356 154024 -52311 -375655
20026 -375655 -453711 -455342 -264239 -99100 -51252 205382 622107 877393 582041 313837
20016 313837 108164 173756 27401 -262283 -144063 47282 -1217 -195318 -373210 -529880
20006 -529880 -416024 -11755 144208 -203960 -391360 -115587 84814 160626 283537 5163
19996 5163 235137 414284 644697 609844 554447 453073 488198 430821 241778 251046 418013
19985 418013 374764 -11963 -23449 444014 609526 570911 296488 74296 153514 577842
19975 577842 443467 -37251 22041 142979 352296 -28247 -84617 -90495 -47635 183579
19965 183579 222328 28093 -42643 -72552 10641 -24421 451 -119760 149391 59109 41622
19954 41622 -15960 339864 541003 399650 22633 -23032 -48393 -2978 233830 72750
19944 72750 -210089 -262380 -189946 70753 77259 -39971 306892 498350 501932 82669 5286
19933 5286 163926 45415 -121639 -11176 225824 -41828 -264063 -155018 -243090 -495886
19923 -495886 -562456 -497105 -486668 -695048 -688261 -432167 -438889 -238043 23031 -79065 108873
19912 108873 -82105 -10882 405883 657700 629447 378479 290264 382615 520343 184429
19902 184429 -134646 -84241 -80294 -33682 -51221 35895 124448 317819 214669 358819 131611
19891 131611 -162061 -178529 -109855 -173166 -123807 -48313 117363 458626 312740 140540
19881 140540 549975 541493 418559 100040 -81663 -133055 118790 236239 700221 472684
19871 472684 420725 187744 127407 197475 -55792 -89125 -418088 -660425 -495477 -364940
19861 -364940 -69827 -216876 -251444 -312300 -487533 -261832 -113449 -5528 12697 19981
19851 19981 -13201 -494793 -124191 -133199 22374 162244 -45042 -334931 -342754 -129225 274616
19840 274616 464608 417758 101250 -275453 -216644 -415306 -265305 -297798 -3920 121515
19830 121515 -285152 7708 225569 99674 70546 209016 377891 512224 403742 482924
19820 482924 550237 559034 259044 44273 -57885 33558 111904 129924 -305013 -189438 80888
19809 80888 211465 280652 459216 276543 97141 13306 64703 60852 98575 -40742 -276660
19798 -276660 -251503 -217728 -221284 -108694 74645 244802 26743 50814 207083 116010 -299949
19787 -299949 -359906 -49361 68731 -263191 -341808 -423782 -602141 -760486 -415346 -594470
19777 -594470 -814772 -673322 -415697 -379672 -67614 299750 377454 249418 207349 499090
19767 499090 549814 378640 -34507 -230056 -110217 -135816 157507 214978 73119 -514545
19757 -514545 -547656 -583250 -393982 -432014 -569029 -550689 -460276 -557595 -459957 -338282 -573968
19746 -573968 -730265 -446814 -506913 -381252 -214339 129206 39356 31026 133479 33713
19736 33713 381931 362075 479054 266128 47507 129136 -157111 -286848 -324825 -284956
19726 -284956 -240914 228147 139912 349461 571366 426908 151808 -87483 -121558 -47686
19716 -47686 2245 339625 593706 502119 160489 -110395 -168295 -349892 -225316 41736
19706 41736 196012 22628 -14650 -240589 -80375 238576 546164 406812 466019 791583
19696 791583 482842 379923 363701 483425 301186 129339 249774 513070 528695 198450
19686 198450 33407 -66137 32317 87409 193166 466118 134188 -428244 -271782 -150854
19676 -150854 -318527 118977 185130 28985 94594 638009 764953 332354 148185 273057
19666 273057 526326 478947 544868 405613 243976 132858 136586 399128 309938 -122328
19656 -122328 -27893 136353 257819 79035 100934 122317 -336683 -331491 14095 71916 -329380
19645 -329380 17501 251299 -113781 -181953 55123 611315 980183 706489 504921 624457
19635 624457 -27668 -162137 -14551 -356808 -312680 -256261 86930 -49638 372675 766688
19625 766688 718568 293164 307129 344162 319907 303099 374695 418681 177485 -91125 -381018
19614 -381018 -303963 351593 84807 -87422 -72536 42317 118514 192456 52642 -380879
19604 -380879 -246619 -395064 -375450 196799 392573 291982 370700 256632 113888 72836
19594 72836 284416 338109 31632 173149 248936 193276 397777 955267 962370 827623 738843
19583 738843 597809 605644 289979 -14709 74641 -171456 -465824 -361542 -72725 -109835
19573 -109835 -122766 215699 15177 158946 397917 513015 587612 226201 -70004 -146131
19563 -146131 -196720 47593 -27725 -198545 -532592 -714555 -442499 -249903 -162920 210521
19553 210521 572073 303685 23431 2742 278082 466179 12766 -123503 27369 107072
19543 107072 -14742 -174576 -225095 -247724 -73998 -37076 183391 182516 277829 -135395 -515053
19532 -515053 -512756 -296501 -221912 87223 -34162 71725 -125614 -172074 -279355 -277336 -130122
19521 -130122 -35788 83997 -152709 -63392 267374 238707 31898 -40254 -11662 202293
19511 202293 -143550 186928 618840 584600 -11458 -328014 -390842 -301241 -15308 454407
19501 454407 373136 281110 414626 436173 337610 68500 -293717 -330171 -44058 30939 -122662
19490 -122662 -86910 70782 -151088 -206626 -428773 -605487 -610428 -560995 -351361 18404
19480 18404 49760 78101 -227289 -256446 -65138 -66520 -289343 -653480 -568269 -245431 -52078
19469 -52078 -60980 75573 207694 59585 -205741 -493150 -283738 -306857 -339118 -86234
19459 -86234 357304 425974 215604 -23923 157963 352434 257376 -88767 -84180 -34628 163308
19448 163308 11385 -31581 51075 213010 -74826 -67159 134128 318410 304424 39574
19438 39574 358163 506321 106053 -426428 -432641 -292431 -266564 -118308 -153304 -370122
19428 -370122 -589362 -566610 -588354 -416790 -403579 57627 348795 -131703 -270060 -393308
19418 -393308 -102057 -55122 555856 652937 391599 109374 -7446 166494 -56389 -221230
19408 -221230 -269143 -573071 -374920 -240551 -209309 -246565 68420 168013 -159415 -391173
19398 -391173 -285339 -424826 -644392 -701869 -617658 -560538 -377692 -368031 -284700 -128569 -396073
19387 -396073 -88130 142234 397531 242807 -2122 -460291 -554177 -568576 -218358 226610
19377 226610 167142 -4026 -319835 -236270 -182634 177832 384219 395829 -145948 -98965
19367 -98965 70083 -170616 -143005 -622281 -224772 187753 46594 96919 383745 131754
19357 131754 -93380 -134757 111896 145891 -73692 -126709 -15605 -58540 53362 201511
19347 201511 66234 -418200 -569673 -672014 -418873 -248382 -476638 -430930 -259428 -379198
19337 -379198 -453259 -335599 -163247 -201949 -329832 -83287 123303 18584 -98387 290729
19327 290729 412389 -251 254928 281781 174338 30477 32278 167526 74574 -198121
19317 -198121 340053 474532 245555 142527 -76318 -104681 -44198 27719 271038 355609
19307 355609 198429 -88705 -89811 -393312 -151664 42107 3239 -230881 -191379 10604
19297 10604 159 -310038 -207146 -151754 -464921 -512239 -467475 -981578 -1005248 -684502 -350788
19286 -350788 -40756 504468 668539 468882 540656 481379 518877 311730 -9462 -135720
19276 -135720 -132136 -92377 -150897 89733 376186 619455 511563 105015 -333875 -388817
19266 -388817 -228231 -285325 -265401 -276204 -319765 -376432 -598410 -620803 -408527 -564591 -172717
19255 -172717 103868 -10306 -249415 -448867 -135471 116334 261377 374391 320603 12603
19245 12603 -126334 -322179 -532260 -515952 -59636 370686 547167 392716 236937 -81716
19235 -81716 -107509 126796 331718 182865 497521 632041 345795 299837 440078 149555
19225 149555 185745 58763 -222559 16853 -9432 -188565 -681540 -681373 -337721 -265741 -431053
19214 -431053 -317684 -186748 -216953 -243173 156427 217566 299984 330757 156362 55598
19204 55598 6373 -260738 2139 60877 -418570 -418336 -270266 19129 421003 413490 128872
19193 128872 28789 -327934 -240278 87490 69228 91212 68027 -32197 -79050 67278
19183 67278 30808 108917 52934 76196 201270 60299 187050 21215 -247571 -526792
19173 -526792 -504073 -527537 -400604 -489450 -393285 -432007 -188737 -125277 -164461 -148895 -118388
19162 -118388 -137388 -375424 -426961 -114095 -25453 -151041 -23663 -2881 -77688 200544
19152 200544 113489 -10694 -304838 -489915 -662700 -284546 41287 195556 370981 314252
19142 314252 127422 94013 -263470 -515338 -439029 -559408 -151598 570203 413837 190250
19132 190250 446364 462545 644232 505629 246422 201869 7750 84614 263688 153430
19122 153430 264632 463671 281778 365342 320922 -114804 -219869 -346597 -553186 -474917
19112 -474917 -42960 -112815 -368449 -384483 -436108 -310105 -193805 -73464 -168121 -449616
19102 -449616 -424611 -463212 -475499 -491473 -293186 -153180 -632754 -614339 -621858 -482950 -231248
19091 -231248 -293225 -193302 30851 162365 134709 -235065 -558179 -420196 -221551 -297905
19081 -297905 -678481 -271751 187978 443079 404616 101938 -110190 -418332 -583961 -280640
19071 -280640 -78198 -56910 17444 84491 -120865 -122512 -472612 -582149 -504174 -237783 -121950
19060 -121950 -271848 -227012 -245766 144436 398137 281292 202167 -79640 302547 408155
19050 408155 110343 -26261 -260484 -230485 -370952 -311504 -550832 -248802 -268743 -326527
19040 -326527 -309049 -417116 -92101 56825 355411 231761 371000 425026 368649 109151
19030 109151 174598 504916 381987 195386 16662 32298 -260961 -295653 -371626 -138456
19020 -138456 -103598 -32445 -173108 -340749 -360707 -217777 -166706 -131828 -436760 -267398
19010 -267398 110059 643208 535851 401351 484664 384391 202478 163161 -190614 -502974
19000 -502974 -322538 77352 119119 226475 14888 -390800 -676507 -789954 -493129 61611
18990 61611 73782 333680 376160 121126 -132993 -295728 -246987 -232618 -251318 -53647 -39427
18979 -39427 156066 122618 -162140 9634 158172 -24776 -24432 -141327 -83215 200248 540434
18968 540434 604747 587540 343945 26432 -60163 -3314 -233718 -461468 -398388 -45549
18958 -45549 9329 520479 724828 514127 144916 167475 348762 750952 283079 -327257
18948 -327257 -424466 -546154 -543473 -426573 -214836 -69094 -426488 -624651 -575894 -854008
18938 -854008 -987433 -323471 -41907 -259791 -448667 -184753 -133046 -286738 -394400 -377157
18928 -377157 -213468 -435472 -470831 -396508 -232660 10449 225020 211995 -319107 -626882
18918 -626882 -870974 -533163 -90885 208581 410322 196156 99847 -67653 -197588 -321872
18908 -321872 -168097 151607 588597 425184 202785 -247281 -516092 -508676 -344662 -67075
18898 -67075 -9650 145086 303221 141453 -198061 -4388 -31121 -154300 -95574 92978
18888 92978 36196 -172521 -309507 -126012 233314 235842 28514 -141487 -167245 -123406 79575
18877 79575 154789 106619 -91828 -296012 -163085 -77033 153217 123937 -194287 -399514
18867 -399514 -229505 -164423 -107692 -302435 -293009 -426353 -272973 -67860 -314459 -764255
18857 -764255 -800707 -201676 -156663 -194352 -328412 -263881 136340 236329 -17634 -201646
18847 -201646 -149346 -123407 -155222 -80795 176592 -89659 -281340 -323982 113485 360216
18837 360216 62348 -123413 184205 271343 -69502 -315321 -529715 -568245 -573439 84211
18827 84211 335018 -258944 -281408 -115795 35036 -410903 -555692 -621200 -781017 -703233
18817 -703233 -458938 -329999 -254865 -167363 -292902 -366754 -180236 -75800 -135814 -462132
18807 -462132 -609436 -534653 -377929 -273512 -484704 -145183 -196770 -655949 -722150 -986185
18797 -986185 -736045 -523989 -341518 -171527 -31500 -98379 -125578 -18003 -142783 -147958
18787 -147958 263120 169783 -73470 -367496 -163737 -86761 -243184 -226653 -65187 133628
18777 133628 -177094 -212358 -238809 -215696 -187256 359598 908460 1082358 690668 443068
18767 443068 527720 730478 551080 571308 733313 857798 533741 385207 460757 319820
18757 319820 262800 360659 115037 205413 458103 489261 266522 279108 187879 335030 276315
18746 276315 -176906 -181835 -266172 81715 233988 -94368 202057 411800 391615 49992
18736 49992 -391701 -308572 -196224 -45748 37638 -167549 -177595 -168624 -241965 165658 318982
18725 318982 185298 -7562 -367800 -409674 -398597 -496116 -82205 49351 -14538 -42283
18715 -42283 -129734 -336228 -666862 -846759 -827248 -934464 -528093 -431585 -365380 -151373
18705 -151373 24252 -23726 -281283 -232736 -427775 -734778 -434875 73367 -116306 -235729
18695 -235729 -232421 -351069 -437924 -303969 -114347 67496 -139839 -134525 6683 212998
18685 212998 267057 -128045 -329957 -313168 -80772 338321 231206 127557 -131487 -99761
18675 -99761 -184949 -438116 -487399 -454805 -372608 -392171 -252981 144944 86398 146961 128606
18664 128606 21015 -61003 -291258 -537857 -537672 -211210 39458 460472 -28076 -83698
18654 -83698 -381195 -350298 3462 247020 209066 -272 -178075 -111971 84064 128003
18644 128003 -3988 26033 -54847 17839 281482 319034 191753 -21245 -364207 -443107
18634 -443107 -482794 -673702 -660934 -507892 -184669 4970 125631 -20199 -54151 -191304
18624 -191304 -574850 -634199 -321148 -155244 -88001 35808 215060 245968 52439 130534
18614 130534 83528 102976 -191515 99581 343555 214429 130234 138028 366493 305577 83054
18603 83054 221370 315927 124062 -220195 -401079 -240364 14254 197257 -106171 131821
18593 131821 256161 -66511 -174647 -52358 3509 16125 -68222 137038 63189 -265913
18583 -265913 -424269 -515198 -538258 -182661 -295907 -360252 -574834 -367014 -28078 404030
18573 404030 153676 31258 -67028 -84358 137772 270420 346033 -64283 62344 30709
18563 30709 -18129 -342186 -792919 -336206 110632 -116507 158052 363058 131559 -248289
18553 -248289 -576385 -647079 -233776 207050 -59718 5337 190948 75628 -384260 -519340
18543 -519340 -258204 -239051 -433644 -300035 -336386 -396316 -274334 -348423 -587148 -297691
18533 -297691 -308885 -431076 -607416 -513540 -439020 -379831 -358156 -245247 -264354 -229569 -359990
18522 -359990 -186212 -322383 -430964 -405786 -208042 -66800 -43247 142214 -299370 -386654
18512 -386654 45468 188492 42096 151310 235064 -49866 -492296 -238686 71892 132098
18502 132098 -49953 -490006 -364301 -114145 -83487 62088 260320 348804 385513 206075
18492 206075 46257 162976 324113 55110 -313685 -608885 -407397 195280 134290 -18566
18482 -18566 -50968 71353 64065 -201656 -381885 -473038 -58253 455642 427278 309041 37100
18471 37100 -155367 -230000 -468036 -524696 -144483 49921 514263 570646 474006 167425
18461 167425 274705 465170 364177 89542 -25431 44229 27097 73729 -200613 -220313
18451 -220313 316968 156314 143995 -155564 -327151 -54516 173321 -75287 41623 312974
18441 312974 373199 358023 309737 159026 -72665 291629 170869 48556 250954 247337
18431 247337 397215 450479 325988 312955 442346 579980 620563 608202 274629 147691
18421 147691 182631 4863 110221 376972 40919 82441 216890 337103 361855 331868
18411 331868 236429 303448 126904 -86524 395568 628490 481432 403094 276384 -315
18401 -315 -160874 -46081 141270 390286 578214 669340 729641 558983 686514 721439 927427
18390 927427 757271 824406 627034 650385 964081 837297 652135 612546 216010 -11807
18380 -11807 -52246 32347 47638 75199 133548 187207 -23917 -294513 -252747 -307868 -436969
18369 -436969 -224701 -104490 -249754 -98746 122382 703305 1275947 853132 436779 704435
18359 704435 663915 545752 433707 157458 351139 792886 856240 702892 360726 720540
18349 720540 1069367 922502 465425 269740 122041 207817 215997 241214 603519 567129
18339 567129 155452 311366 532163 583947 377172 118509 236908 137201 -44592 27990
18329 27990 115592 102220 99954 -115236 -211235 -400646 -229903 -9454 309829 665378 747744
18318 747744 547926 382961 -455620 -851447 -736893 122327 249205 121617 75233 237759
18308 237759 212009 191622 -27821 -115159 -62424 -33725 -419518 -500281 -408922 -185828 10416
18297 10416 183155 296826 455306 248987 19254 -197120 -425714 -243244 -251264 -151605
18287 -151605 227245 204921 -198384 253443 402037 300618 36598 -4752 118770 326327
18277 326327 327673 402142 607832 756348 1011513 1032013 1069660 733010 381921 483723
18267 483723 950480 1019667 708021 1035726 1492042 1568849 1351140 1412249 1675808 1643655
18257 1643655 1730604 2103764 2204561 1907725 1688936 1624462 1830556 2082462 1944770 1847653
18247 1847653 1909476 1795833 1685945 1653342 1617112 1399801 1340106 1241014 1423547 1473921
18237 1473921 1494495 1381595 1194385 884242 313888 406387 422375 547328 440647 342444
18227 342444 514324 408845 280119 443494 720908 599056 556488 675439 401266 138969
18217 138969 419184 565731 317604 300052 287776 269555 65844 -57010 312439 524697
18207 524697 784687 769649 613253 694210 519568 521792 282261 157763 252636 284802 445786
18196 445786 683254 722789 226756 29373 -82748 170791 520224 620766 503101 264347
18186 264347 107155 290529 132662 42918 453544 719148 520562 409860 -3223 17699
18176 17699 166232 350383 239487 117456 581121 349833 262482 400498 796371 853805
18166 853805 685865 409578 489918 681190 959934 903604 743576 712307 1069308 1282016
18156 1282016 1037194 1055900 1356096 1700059 2041428 2167183 2611351 2753499 2979623 3315508
18146 3315508 3721995 4078147 4064825 4394669 4665257 5677448 6828609 7702234 8176515
18137 8176515 8888196 10024226 11155817 12275841 13486260 14839640 16410378 18332223
18129 18332223 20207372 22094347 24736795 27907027 31001908 34107091 37803809 42073666
18121 42073666 46645266 51475162 56813748 62206781 66407850 69100602 71502645 74487774
18113 74487774 77850682 81709836 85910211 89082727 91457220 92312241 88044792 79211615
18105 79211615 69459520 60600434 52904507 46781274 42577762 39891464 37786874 35669746
18097 35669746 33969141 32458430 31147981 29827247 29227455 28764086 27524015 25890124
18089 25890124 24642614 23595072 23152653 22621323 21709914 20824066 20475704 20340402 19934282
18080 19934282 19660081 19308055 18843775 18603382 18204341 17835541 17588234 17260953 17007052
18071 17007052 16654550 16397540 16000170 15206238 14564383 14242779 13756189 13297375 13142285
18062 13142285 12483802 11898808 11953353 11610637 11067984 11079295 11332048 11013910 10880315 10702325
18052 10702325 10221689 9967573 9669794 9657733 9733964 9570471 9240115 8898274 9395020 9724153
18042 9724153 10081074 10184999 9772438 9271421 9158538 8888650 8823341 9070032 9079548 9323801
18032 9323801 9237127 8943609 8668456 8555889 8597833 8436046 8444689 8506789 8532182 8545561 8734959
18021 8734959 8880212 8745900 8924732 9043084 9012605 8731693 8887281 9332922 9625349 9446714
18011 9446714 9296466 9185571 9319952 9248750 8686752 8473590 8861300 9416722 8943623 8651965
18001 8651965 8621201 8896978 8922904 8741433 8779274 8652138 8454951 8247435 7998706 7761634
17991 7761634 7768337 7448978 7275929 7273921 6939874 6690249 6572924 5962567 5762490 5730952
17981 5730952 5495259 5134001 5012204 4995982 4719315 4399926 4307756 4240845 4134221 4177309
17971 4177309 4281384 4374738 4195536 4160499 4074419 4250847 3928508 3598964 3687374 3788197
17961 3788197 3774761 3461492 3560250 3657790 3456451 3692694 4007070 3632748 3479895 3537920
17951 3537920 3047791 3045755 3218561 3028164 2827517 2629003 2617999 2655052 2457509 2274237
17941 2274237 2040818 2242146 2012276 2131628 2440866 2394232 2096993 2203794 2274907 2653090
17931 2653090 2853199 3029933 2846324 2784764 2650445 2651133 2899807 2675831 2294596 2342960
17921 2342960 2428269 2320875 2402678 2231591 1853249 1622325 1808947 1870930 1862911 1872179 1883239
17910 1883239 1350340 1189725 1501845 1605413 1588033 1578985 1304820 1180979 1291786 1235428
17900 1235428 873648 1063582 1391433 1053560 843607 941144 971772 792718 400886 287812
17890 287812 279678 570065 676841 805454 633184 727056 567693 -126178 -663415 -448467
17880 -448467 197678 498510 434266 643756 511533 700959 848772 711591 451826 295801
17870 295801 347251 486066 252457 269026 141321 343316 273492 368213 269616 86993
17860 86993 246390 293405 413736 347654 220394 -51487 -242834 -125200 84071 42089
17850 42089 -202950 -146832 96443 304432 417445 461985 401013 203830 -20542 -270112
17840 -270112 -184297 31445 720363 631597 340866 157968 271765 785154 626961 288998
17830 288998 181368 353061 293795 -127382 -466893 -330757 129267 214254 532351 590565
17820 590565 281343 142018 317372 418355 415150 273295 204014 148613 198768 395234
17810 395234 310099 396823 491306 765049 710884 965165 852123 613583 527125 537019 466782
17799 466782 631975 653384 867755 881053 833642 777784 839550 1122701 1369029 1165609
17789 1165609 671830 341570 136763 -39632 147305 482395 819231 622131 827173
17780 827173 765352 613902 533611 460107 388009 845731 939552 627842 530215 410703 484846
17769 484846 451956 567493 66831 8925 39719 79357 183359 483591 568033 371811
17759 371811 258422 480265 510001 34313 92206 229427 448421 662653 166025 -274195
17749 -274195 -258096 -73628 368891 547534 309076 81475 55790 195109 234765 -183796
17739 -183796 -276060 -70965 57351 342478 602117 353461 128807 -106119 -61114 -86462
17729 -86462 63793 326538 546194 374469 232286 310174 392516 541686 406080 144631
17719 144631 14235 -188561 -226470 -147244 -32566 317735 400816 418675 245551 63006
17709 63006 -262424 -468778 -138754 -221243 -255630 -177437 -489987 -577927 -222524 -216992 -358408
17698 -358408 -653265 -1044670 -761051 -369095 -242756 -248175 -237886 -480529 -683849 -645864
17688 -645864 -357737 14188 119219 313411 427183 37805 125995 -46128 -196721 -156360
17678 -156360 -38925 114967 310034 362290 357530 182269 173907 367795 361440 -95866 -347808
17667 -347808 -402451 -415896 -92236 67175 48522 -227239 -131278 102843 41949 -275654
17657 -275654 -446968 -192216 124561 387170 166691 -78675 131244 243740 489462 237390
17647 237390 109283 76346 112195 188738 669229 608294 462167 831716 622140 452051
17637 452051 397011 541073 576507 430506 423621 502529 742268 678722 329949 209318 116503
17626 116503 -74442 -56516 29500 192782 166227 -145172 -128118 -52364 138495 411171
17616 411171 578211 641722 580397 554197 576237 473649 81199 -64533 66321 123747
17606 123747 282640 533689 186843 44545 141961 183588 365049 436281 323787 412100
17596 412100 379390 123995 -4564 261759 177937 343672 485614 219694 -34208 241001
17586 241001 248976 520954 548361 784188 720226 531023 173452 320053 306345 144083
17576 144083 276510 198032 28618 -101901 -198829 55735 220479 223526 65367 88117
17566 88117 305581 527779 417212 161100 180583 -30575 -32007 247179 290215 489963
17556 489963 556155 350475 44999 -53147 185942 327997 131976 -278661 -393612 -444223
17546 -444223 -388813 -290608 -109043 -134961 -198877 -250522 -293773 -445808 -461065 -158148 -221822
17535 -221822 -278645 -408963 -547237 -177997 275516 276673 250974 127157 194843 -37656
17525 -37656 -247458 -189978 -316872 -67680 -395904 -634258 -634975 -831541 -653277 -462607
17515 -462607 -154661 -79103 -99779 157743 41774 -8198 -48547 225109 187501 184950 298823
17504 298823 231783 174792 87968 115854 50789 -22844 -43046 -320923 -266848 -370308 -457597
17493 -457597 -398257 -438680 -299150 -108754 -257393 -106306 98511 139329 93440 276219
17483 276219 307416 502565 252339 265049 476866 170329 -32861 122612 313745 203690
17473 203690 86093 -146513 -267066 -348157 58269 269031 24935 75497 105796 43126
17463 43126 69030 108351 104644 -14880 -319342 -374114 -274896 100035 410951 536895 405176
17452 405176 547087 916153 951040 786417 726373 627636 308978 441788 498187 634421
17442 634421 796750 431235 546878 118177 -7482 672 -181603 105569 89647 263596
17432 263596 178680 116392 100480 15673 209074 515892 313749 -11019 114550 90492
17422 90492 -225634 -106552 -26617 34932 -103685 -322840 -140199 423770 653546 561834
17412 561834 207421 196949 27091 109623 136712 -17270 -238297 11459 185276 275638
17402 275638 -144352 -394771 -308934 -287000 4183 160395 -66339 -159059 -50254 39987
17392 39987 224279 -14884 -106638 -524828 -640376 -436904 -276458 -412038 -517099 -284606
17382 -284606 18196 135627 266242 143108 -119887 -465495 -199184 -417328 -276562 -4554
17372 -4554 -196065 -627224 -703528 -299188 -377725 -99893 21171 -18333 -211396 -481796
17362 -481796 -480665 -200881 -10585 -134367 -47476 -260059 -146762 255527 386349 299861
17352 299861 176795 534135 738095 323539 -71633 -365415 -224085 -240801 -353092 -234522
17342 -234522 -343471 -385840 -42952 -45844 -346250 -531565 -327285 -311240 -406181 -125032
17332 -125032 220152 33298 -62619 -100632 4278 36140 -42431 -343267 -267329 -311369 -314468
17321 -314468 -66388 -28622 -220513 -25706 497168 384733 247008 281539 15734 -44813
17311 -44813 398440 80072 -25817 -208589 -396214 -272241 -39489 247592 190442 -64612
17301 -64612 270317 230388 -50394 -170054 -323496 -191142 -58911 -132525 -174594 -332108
17291 -332108 -176618 2126 64467 -95056 -136185 43067 381325 227498 -56063 -284916
17281 -284916 -289951 -184090 -67061 -149641 -89550 -145873 -114938 -56021 264637 -49334 -512455
17270 -512455 -488206 -155650 111561 195120 -147336 -427615 -496094 -460084 -113017 -102388
17260 -102388 -300696 -224829 -274811 -209099 -280007 10239 155507 210338 543484 469127 181262
17249 181262 -38362 181833 517567 472702 228987 278278 435106 25907 -49624 -103788
17239 -103788 -20561 99268 -30216 -245363 -336245 -174040 -289274 -217976 -191336 40402
17229 40402 373220 456363 788680 437592 125089 341407 528565 397593 188417 243937
17219 243937 325008 400089 28342 -14836 243245 511637 802335 796531 479734 220791
17209 220791 288330 377329 308295 309473 394425 410019 644801 425285 484132 551428 316575
17198 316575 -54865 -72462 23651 79661 207773 555714 586217 120791 72218 -180877
17188 -180877 -76337 -42639 141455 240258 28990 -95226 -20658 -214630 -362965 -374040
17178 -374040 -280863 -430917 -457071 -380593 -196919 -119791 -98036 -174047 112532 -38614 -198596
17167 -198596 -222983 -300070 -163258 -153392 -611611 -428655 -323526 -762144 -436625 37455
17157 37455 -182002 -337064 -695206 -730232 -366372 164790 459130 559867 393088 116514
17147 116514 305229 522783 425362 319244 99936 241299 -108272 -94338 131578 184103
17137 184103 -30383 167006 197788 258360 -40413 814 -121026 -314704 -654047 -647533
17127 -647533 -635675 -408607 -13323 167365 73777 136368 369041 696328 607430 140374
17117 140374 -21918 59916 133510 -112478 -242058 -375116 -270995 -111068 -155804 -379782
17107 -379782 -211427 -451280 -716522 -473361 -345197 -502828 -337481 162584 429847 352835
17097 352835 277436 162752 -254073 -452732 -532073 -581723 -258708 -1427 155843 348657
17087 348657 239974 -15804 -113489 75559 140377 265529 247898 44329 -255766 -297767
17077 -297767 -287207 -190376 -179203 36160 268976 51919 -93697 -205920 -131979 -10730
17067 -10730 -89420 -200993 -117430 74576 164511 117982 -200904 -327773 -307487 -60057 280525
17056 280525 150134 -242295 -45817 66734 357644 109470 47373 338482 839086 693370
17046 693370 273298 86724 47672 95001 431905 651269 158994 -234500 -240082 -515068
17036 -515068 -583506 -430068 -274251 -99748 -214486 -20923 175447 541738 478163 222572
17026 222572 123227 57211 68699 322179 326711 208863 153341 -107239 -229656 -143543 164275
17015 164275 -33643 -171950 -280324 -413978 -608739 -364230 87922 256178 191392 511685
17005 511685 571184 432487 230527 90384 31042 13809 59449 -132488 -310229 -274498
16995 -274498 -542814 -762625 -670945 -571757 -307067 -112980 376872 149832 60177 525061
16985 525061 441924 117970 58333 9629 219720 73615 164224 538866 467217 280774
16975 280774 240764 -35147 -42920 110514 -257868 -526075 -553162 -542286 -397853 -70675
16965 -70675 -150422 23381 273958 363421 336513 232595 139992 -122737 -89990 -442138 -487322
16954 -487322 -400086 -366571 -276954 -146731 -174779 -335602 -198167 -366498 -452381 -485864 -637308
16943 -637308 -695478 -284064 -169626 -63865 -5960 -337853 -525320 -238129 -3801 -210309
16933 -210309 -107231 236648 191002 49087 -69873 89145 156713 290086 114273 -58884
16923 -58884 -35874 -86910 -119379 -123500 -147801 -209128 -138252 -154672 -110597 -130498 -380243 -569848
16911 -569848 -262544 -261486 -680578 -375018 83434 211250 -84756 -326910 -646555 -468598
16901 -468598 -60331 -121929 -412494 -416679 -312827 -305239 -385652 -410569 -318028 320667 236182
16890 236182 101430 215147 93786 -135111 -310631 -621369 -516614 -321929 -77622 -416365
16880 -416365 -865102 -788745 -730104 -331036 11574 -309129 -400393 -406724 -532421 -502542 -7368
16869 -7368 -34975 -189554 -100035 121954 311747 360890 -6534 -81534 -304932 -481399 -587736
16858 -587736 -99041 22117 -60494 -130422 -390003 -362197 -444961 -354546 -244366 111178
16848 111178 311419 266534 213923 88683 411574 364033 83386 -202854 -387309 -302242
16838 -302242 -251359 -414917 -416156 -334345 -217011 -203083 -362332 -402432 -216225 73310 171596
16827 171596 -679 196739 225681 229505 327832 56778 36013 -30536 -395544 -668532 -551472
16816 -551472 -585532 -544405 185845 343992 -162687 -338291 -66047 -84995 -369366 -236781
16806 -236781 -152782 -88796 42428 306645 323893 336967 -26102 -291833 -328825 -303163 -317296
16795 -317296 -224541 -77511 218778 -27620 -383472 -145089 -93122 -12107 -80824 -189509
16785 -189509 -507927 -522952 -835590 -880647 -610810 -523991 -570337 -433070 -213614 -174769
16775 -174769 376907 236453 240726 218764 133759 -239052 47891 241120 246445 -40596 -183055
16764 -183055 -121970 90648 152580 138173 69279 117542 -189952 -336668 -107109 95880
16754 95880 134707 390683 487211 364946 -131234 -190107 -101025 -16571 413268 319983 124052
16743 124052 -21885 -58899 -374529 -564291 -625111 -555919 -327228 -165549 -57027 175830
16733 175830 118861 -78064 196604 174985 170810 164657 136870 156694 175069 -338563 -592789
16722 -592789 -612078 -171604 381799 438487 377888 202505 162821 -9631 17749 -47579 40219
16711 40219 186815 128023 22773 377797 223313 -63876 256372 673182 533835 581447
16701 581447 402418 216019 285644 341492 -34431 -485573 -503345 154512 282203 32429
16691 32429 -119042 -559163 -686646 -482854 -709664 -469732 197782 417173 170489 315261
16681 315261 464916 242300 -165341 -357549 80655 216464 298700 255447 48441 -134118
16671 -134118 -154958 -329369 -191712 -54270 -248533 -676002 -663276 -831179 -1003089 -675385
16661 -675385 -459883 -451662 -183063 -171613 -210970 -40498 -83673 -132731 -311663 -76313 -46709
16650 -46709 -211904 -264278 -280982 -241218 -454899 -870552 -847701 -468335 -356988 -496727
16640 -496727 -68887 349 -158835 39888 329824 379472 9225 83738 213244 -69631
16630 -69631 -54401 49572 255997 415482 546449 -31976 -207728 120600 148981 5334
16620 5334 -217998 -270559 -284178 -180610 -192042 -439945 -487486 -214486 -42067 -42075 -201898
16609 -201898 -167956 -316562 -248980 30901 213688 122764 78072 158670 238237 257682 245037
16598 245037 -39745 -301257 -151228 -230886 -440942 -282906 4742 -76981 -108030 -80473
16588 -80473 -2891 17067 -37655 -236159 -184615 -133208 19305 295348 267246 -131564 -270865
16577 -270865 -342417 -461434 -566949 -421038 -263252 -166212 -388018 -93778 26572 -304160
16567 -304160 -390867 -376553 -637322 -883665 -602563 -421695 -460709 -477987 -613114 -364127
16557 -364127 -392444 -799199 -927923 -693853 -497601 -205845 -116464 -426340 -121572 -63065
16547 -63065 226054 718102 598414 166386 -20844 -47570 -399190 -592468 -448275 -245645
16537 -245645 -24285 -1893 -512957 -761116 -461722 -109905 34001 -269929 -724819 -712365
16527 -712365 -906963 -931559 -782204 -356004 -57794 -413201 -102992 239074 12493 -402310
16517 -402310 -527931 -418622 -503991 -494421 -514608 -649812 -393043 -156416 -105153 1394
16507 1394 329498 174138 105475 -299332 -133829 -744 41321 80327 188433 192687 77499
16496 77499 62713 -118316 -411914 -74980 59200 191483 203441 -212430 -99926 -16490
16486 -16490 -73888 300952 123094 178716 254205 -98123 -450864 -695582 -753141 -551506
16476 -551506 -453081 -551301 -560709 -588543 -561397 -227629 -44295 225902 -201656 -402809 -21771
16465 -21771 14529 115941 274748 91128 -327459 -181356 110913 169482 227425 483106
16455 483106 510228 269375 89575 49177 227920 210719 -40138 -227410 -333065 -490617
16445 -490617 -671352 -384586 -68498 -532563 -764465 -337537 -564015 -770974 -707883 -601108
16435 -601108 -166033 76440 -139728 -155536 92093 267816 81958 -244911 155437 -81795
16425 -81795 -361321 -326131 54182 78260 -168799 -389129 -245981 -158497 -506072 -579649
16415 -579649 -160847 -134176 -123967 -227745 -341125 -435975 -318429 -29297 208457 365964
16405 365964 521760 332125 -100299 -99173 -277879 -191064 -110588 -232120 -171110 139442
16395 139442 273857 318986 147544 38463 164046 228168 218418 233798 57381 72087 134575
16384 134575 -88272 -376843 -368892 -154543 54951 181150 480155 379639 -10436 -104619
16374 -104619 95474 -202725 -52338 201035 323456 189603 263800 262312 267891 420615
16364 420615 414645 708684 822094 519316 376809 222440 -33580 -231775 -204121 -195546
16354 -195546 -68189 77925 117962 185442 -348244 -413725 -355218 -249344 -48981 -223020
16344 -223020 -302663 -793190 -979989 -702460 -401973 -293184 87987 254466 -56020 -269780
16334 -269780 -214476 -86837 113874 419070 496171 343281 441166 360914 287601 216447 -74523
16323 -74523 -253120 -251877 -392068 -455590 -90589 164184 255336 -1210 150500 125877 68272
16312 68272 96729 99016 -378917 -414469 -99539 27764 -40124 25666 -232317 -356477 212412
16301 212412 273212 255205 176058 263287 117762 250395 203683 239754 293988 319401 266038
16290 266038 247000 -44368 300649 782441 497746 427033 558639 199028 -192787 -364927
16280 -364927 -433797 -473874 -366501 -53709 -145973 -371600 83133 86626 -28648 42749 333764
16269 333764 773577 654005 355392 473916 231793 182520 221584 274989 558386 252472
16259 252472 340981 560409 452858 -103288 27438 190436 223563 89842 307986 445470
16249 445470 331523 437694 377066 -12241 92138 169954 302 -428766 -689486 -260894
16239 -260894 -83022 121599 61565 318771 456147 3627 -68399 45470 -82325 37664
16229 37664 6758 -135301 -381634 -58813 308219 721768 397898 -229914 -362114 -355476
16219 -355476 -264714 -293353 -725962 -835347 -806505 -887667 -526759 -118842 64159 86226
16209 86226 529377 511221 8763 -65537 681518 870938 762906 390610 220283 494362
16199 494362 619026 245910 -103398 -116889 102030 192856 333596 3083 18906 407499
16189 407499 125581 -143076 -189983 -38132 -56067 -102919 -120867 -9195 178806 92516
16179 92516 28814 -176062 -656938 -727913 -637666 -72122 23408 -157312 -188757 -124643 -37296
16168 -37296 -456658 -538572 -274205 -82197 32228 31956 -143363 -17567 266243 461520
16158 461520 552283 502003 263746 487926 593517 335602 102560 -385544 -617174 -280334
16148 -280334 247012 114215 -269476 -128515 210523 398295 347281 164990 203280 78118
16138 78118 -449554 -686789 -582594 -471953 -188950 -154095 -165460 -110285 -129778 -57058 171891
16127 171891 681117 736868 240887 198295 427074 643289 390113 176432 20815 9589
16117 9589 -400776 -360462 -309995 1148 -104352 -200950 -16659 212905 318459 37673
16107 37673 -193964 -492928 -303746 -285638 -172219 -321008 -585501 -1056878 -1151037 -814186
16097 -814186 -302517 -103759 -148535 -109040 51745 195685 216773 133549 45005 81972 248982
16086 248982 130977 -227419 -300607 -267531 -557948 -585523 -379054 -181316 -355252 -524718
16076 -524718 -322352 11223 196550 -21007 62599 -220885 -222952 -282871 -203293 -81076
16066 -81076 -345473 -164595 -40693 -278112 -144396 151944 519792 112255 -13526 170316
16056 170316 261030 811465 1031043 765309 489869 379060 365062 366443 226668 74579
16046 74579 86962 45782 -182019 -349065 -450095 -352702 -289183 -708742 -183001 251111
16036 251111 145356 162949 57671 101440 118869 380443 133599 -15052 191656 213644
16026 213644 315160 211604 137175 155982 107106 33340 52683 165513 56045 -154213
16016 -154213 -64419 90171 -3571 -220163 -457505 -557242 -444073 49379 111830 49971
16006 49971 456384 415314 100385 72828 73370 13139 -113138 79475 212124 48297 -208893
15995 -208893 -315171 -197772 -197898 -334135 -297722 -236194 -89829 30231 -5790 209960 318281
15984 318281 202933 -115941 -629300 -597646 -223162 56521 -26962 -195953 -103795 -100458
15974 -100458 -357991 -527891 -449729 -315086 -284512 -36839 -84606 46020 148930 11817
15964 11817 -283816 -465952 -114460 32906 -82503 -73433 -232612 -551253 -561797 -416952
15954 -416952 -214718 -588569 -781476 -694072 -39678 388595 528595 443324 372658 295935
15944 295935 139917 -26376 35861 -20958 122077 147865 328480 140859 -188215 -216008
15934 -216008 -222822 -99808 -59707 -50788 -328873 -454120 -388369 -262175 189032 697610 558379
15923 558379 656340 697636 117415 -112409 -236776 132521 104898 123063 416889 437042
15913 437042 305707 526487 486512 41019 -343813 -379776 -302791 -143322 219091 73694
15903 73694 -214362 152281 128141 -34831 45382 297694 270911 298798 116460 -128424
15893 -128424 -299844 -538181 -691346 -258951 403462 804838 845497 443460 -257619 -464165
15883 -464165 -632176 -590155 -501581 -393316 -118097 32583 94271 185915 158115 4833
15873 4833 98402 355862 -117277 -255130 -313793 -328416 136808 339894 268469 -23571 -170753
15862 -170753 -32085 276766 356006 195940 -68741 116945 241195 176102 140707 13551
15852 13551 -212249 -66358 367934 207263 127669 66355 -3243 292866 478909 214670
15842 214670 33136 20039 133575 55789 -124339 -149110 -265964 -490560 -327068 -4988
15832 -4988 61654 -3133 -11670 127840 29681 -364142 -378372 170473 402458 225277 -185719
15821 -185719 -208202 89710 271373 159009 -42821 -259461 -246012 -240730 -517096 -197171
15811 -197171 63138 125384 171541 -68413 333653 480975 327119 270299 -5070 -239394
15801 -239394 -153633 -188480 -6299 405017 253725 36390 -100048 -362524 -674299 -708100
15791 -708100 -433626 -407982 -56729 135725 153015 123905 -128677 -61397 -345875 -147939
15781 -147939 139638 40831 -413807 -576720 -263722 -56092 -226340 -375261 -247661 93678
15771 93678 67252 32622 -46887 178802 51760 -323950 -314835 -124760 -54912 59526 -73504
15760 -73504 -64382 -280621 -227231 -83205 9966 12969 284449 279231 176513 236278 400152
15749 400152 520845 520899 320307 136841 -75981 -280432 -60624 157295 213121 -448018
15739 -448018 -789935 -596719 -587483 -486340 -432936 -604184 -688932 -700982 -486026 40214
15729 40214 209189 53144 -58515 -177914 -294327 -395037 -198419 66656 77364 123610
15719 123610 341658 240443 -89626 -76738 -325002 -421340 -277570 -12804 -55267 -126296
15709 -126296 77788 -77019 -250722 -68633 -29051 -201976 -597661 -675124 -368944 -212052
15699 -212052 -412791 -719570 -695584 -725564 -635080 -251310 77325 262022 238222 48223
15689 48223 -68198 -56045 -229568 -198711 -130745 -103018 -117544 -60105 255317 -16190 105539
15678 105539 289597 23623 166514 642021 796508 829765 366187 -305324 -397211 -229993
15668 -229993 -14946 155272 315348 57591 -122975 154717 195406 311513 52942 -50327
15658 -50327 -239329 -58573 -237524 -471798 -372332 -315639 -109270 -56337 -47416 -102323 45596
15647 45596 249171 60768 -182444 -236667 23052 148051 243389 680770 339475 -155180
15637 -155180 -184952 -229690 -340851 -190987 -108033 -75756 196961 17872 -225516 79482
15627 79482 185909 244125 286165 389743 537284 423627 503798 554346 324168 119454
15617 119454 -14635 -164358 -72497 -171483 -398508 -739262 -496490 -121702 -513003 -721922
15607 -721922 -906323 -916641 -710085 -452901 -216749 24063 143998 -100561 65029 321455
15597 321455 199841 -269964 71284 77621 -66681 -47105 207016 111687 -143648 94653
15587 94653 -44064 -39571 87561 244611 545267 333797 367315 261779 55523 96759
15577 96759 56541 -20029 63443 -98580 5498 -1036 -59955 312130 394057 423087 455723
15566 455723 653957 551801 138339 94456 -138409 -16187 99405 -155647 -130536 88504
15556 88504 161580 308787 286993 414810 57139 -104685 -169210 -378734 -639576 -689437
15546 -689437 -703076 68084 337891 370611 367347 281482 416017 259127 -1560 -252473
15536 -252473 -12767 -264742 -260332 -233725 -9806 -7893 -221326 -313182 -5951 144078 152886
15525 152886 96192 421960 370753 220179 -220418 -81918 225291 234587 86512 -331507
15515 -331507 -418520 -18350 302137 66782 -269859 -469203 -576404 -194163 -49147 270063
15505 270063 314932 240333 322459 398556 43510 -168571 194028 321277 -172444 8741
15495 8741 525370 501490 373723 90073 -23034 86666 -104118 -160258 -233415 27765
15485 27765 -115678 31381 244365 231310 309376 135496 -139170 205453 20661 -151564
15475 -151564 32791 -76271 -192031 -313524 -210061 -206548 -166117 -669470 -502656 -251435
15465 -251435 -383879 -341471 -500614 -331124 -335542 -334835 -524998 -200028 -330666 -290020 -428826
15454 -428826 -816631 -723045 -513414 -705090 -732644 -864356 -530365 -367891 -259598 -70771
15444 -70771 -82267 -70920 -140202 -197664 164651 -65642 -281882 -93980 -415929 -387785 -255788
15433 -255788 -164836 -22286 340504 342108 -94581 -440342 -386133 -232975 -60604 -185437
15423 -185437 -135197 21895 20785 256028 231687 189291 230078 -107746 -113996 219253 284466
15412 284466 -6859 -42206 105472 184806 -14722 -319017 -237194 -86428 267628 371419
15402 371419 -31952 -240050 -329289 -442172 -342624 -148763 -308372 -518456 -445424 -559718
15392 -559718 -419503 70025 164963 266681 215607 -210014 -295973 -345554 -488491 -763453
15382 -763453 -732120 -550937 -351671 -50910 102958 188816 38640 -8101 19938 -243057
15372 -243057 -88987 258909 88712 43613 -46424 -119106 30016 -61227 -243651 -371000
15362 -371000 -368741 -585610 -584367 -540975 -380788 -495821 -218929 -122482 -124357 -75048 166595
15351 166595 231636 120924 -187217 -342258 -139736 -166462 -149208 -89460 -218245 -257781
15341 -257781 -80487 176028 271306 330118 406492 265449 149694 -84166 -91355 90836
15331 90836 45068 -66426 -177001 -121097 129236 -40930 -551571 -426301 -83907 421424
15321 421424 567523 332539 407286 251264 451522 635019 490037 239245 4209 380710
15311 380710 367367 341073 117921 -265189 -395032 -429824 -588015 -562631 -258538 -117085
15301 -117085 -371521 -677926 -286552 -420332 -488765 -566559 -404194 -274511 -15241 193133
15291 193133 -56198 -87370 235155 404431 221550 -91215 -544437 -620075 -498974 -553674
15281 -553674 126282 226868 168854 9018 302310 432950 3461 -479085 -640639 -224605
15271 -224605 428925 394662 511219 424508 91739 -287547 -301439 -445023 -153037 192704
15261 192704 52840 70578 -124188 -108747 -114040 -247255 -311103 -185774 -150231 -87700 -131802
15250 -131802 -168988 -197411 -152019 -427576 -591777 -239175 -150494 -272851 -337959 -365844 -252399
15239 -252399 -121653 -501202 -696759 -422556 67531 315229 274710 166442 -106752 -127984
15229 -127984 102831 132104 92889 472789 615245 336309 335709 354302 450484 490522 520252
15218 520252 685985 377126 25490 -79333 89027 -142143 -254161 -40734 -23106 128693
15208 128693 213125 -104712 -505619 -357488 -516465 -588376 -766241 -748569 -985298 -1039982
15198 -1039982 -907505 -678744 -553317 -680866 -779586 -493780 -243519 -193612 -222167 -53674
15188 -53674 -102014 -199401 -326703 -213977 -244088 -415833 -457724 -370715 -328368 -668186 -842723
15177 -842723 -545574 -321486 -251500 -10799 61286 -177191 -447872 -137207 -384639 -390244
15167 -390244 -161652 20967 322705 247455 24797 154326 346563 297464 245177 -132804
15157 -132804 -301686 -14829 266046 458419 596521 1017497 996675 671604 610063 649926
15147 649926 247173 -18838 97724 323713 405194 511013 689595 978616 683653 514319
15137 514319 534058 490219 -28922 -726206 -703247 -442383 -90664 80734 116406 194895
15127 194895 148702 -113392 -549100 -467444 -261064 -310438 -143317 -259774 -114729 160026
15117 160026 198120 310303 153717 28678 -260465 -164826 -16845 -291764 -650497 -679886
15107 -679886 -480211 -386687 -530775 -114035 108224 266883 257241 32831 -489405 -601954
15097 -601954 -237927 114389 449508 659087 588395 45222 -47426 250734 521592 228174
15087 228174 59217 131405 -104017 -188350 -337696 -493555 -739119 -705253 -315503 -391712
15077 -391712 -103129 334884 137821 36491 -43949 -33568 -1818 106668 -77557 -254220
15067 -254220 -138480 -121996 -274816 -188318 119503 783818 975382 394358 219038 279015
15057 279015 -3812 -64920 163636 150825 52569 78628 710991 933759 619875 147802
15047 147802 -305139 -530005 -243190 291623 339156 201908 106833 140227 293332 116969
15037 116969 -254257 -599088 -726931 -111195 43833 -51370 -204462 -237838 -198555 -113786
15027 -113786 -378247 -792254 -751613 -535961 -564932 -699592 -590592 -450582 -433509 201301
15017 201301 233148 -43369 -161642 63227 -300835 -489992 -429277 -267278 -62541 -127472
15007 -127472 -331870 -367240 -336852 -378820 -460683 -601049 -616903 -463983 -130370 194367
14997 194367 327131 308487 281618 84104 15707 53731 130963 272180 389864 386796 357746
14986 357746 363342 134724 -141140 -99796 52758 190037 175495 272380 582647 259850
14976 259850 118645 -79764 -481151 -428096 -306340 -49819 25223 -144479 -224802 -115258
14966 -115258 117349 -9595 29682 -29414 -222727 -348106 -115564 -115749 -139005 -256867 44638
14955 44638 134938 342511 86545 -199358 -145097 -71967 -224046 -307513 -69979 -90338 -319708
14944 -319708 -256714 -104760 -567310 -529023 -647634 -624349 -453070 -284501 15005 67652
14934 67652 316025 651634 791897 228158 -276847 -395324 -358478 -54923 197523 284497
14924 284497 219996 156762 114020 -347578 -572948 -482194 -56773 136643 32013 -71692
14914 -71692 -156591 -112498 99425 442659 718671 466355 620229 573151 555154 300155
14904 300155 149534 215214 343575 293138 226550 -137461 -62048 -95998 110182 297836
14894 297836 -86199 -385108 -126520 -220418 -105298 -16157 -110022 -166513 -345934 -712640
14884 -712640 -822394 -473122 -285814 -110364 109250 298748 405656 72842 -195628 -121748
14874 -121748 -125229 -478375 -328309 72183 297771 504430 64764 -159461 -464365 -528550
14864 -528550 -201076 -68707 -83407 -260349 -392072 -83921 89920 164510 245270 24684
14854 24684 -48845 5218 30217 3975 426685 541360 600711 404861 315932 -16667 1121
14843 1121 166376 285887 42699 -152638 -88562 -251822 -234676 -66348 -228838 -413728
14833 -413728 -255719 -40759 30277 -18550 34826 -30471 -156859 -633591 -844682 -648181
14823 -648181 -526466 16197 206145 -94031 -176655 141459 347480 403393 320483 164212
14813 164212 -15564 -225193 -86692 351918 80950 -46984 -369394 -495578 -231889 -251854
14803 -251854 -443243 -247818 -15020 273967 367875 118995 253568 169783 104457 4104
14793 4104 -246074 29731 279063 181449 40630 -315848 -450567 -2101 25026 248830
14783 248830 41552 -20429 -155859 -197015 22655 156467 304652 196404 -130194 -163129
14773 -163129 151778 108885 -96655 164166 63817 -122047 -208764 -345516 -157159 199911
14763 199911 348168 349545 242884 113189 -279713 -552607 -779984 -517772 129332 246726
14753 246726 -114599 -138266 -141473 -206283 -237621 -177978 -171480 -227328 -138064 -4454 323955
14742 323955 417148 507935 362461 130115 209465 176911 -152078 -162052 -81217 13260 8101
14731 8101 -186299 -245234 -315901 -192632 211796 365743 52548 -121171 -332288 -318767
14721 -318767 -192024 -62613 3043 113027 25477 12189 -264833 -823677 -925845 -905605
14711 -905605 -591306 -469614 65651 396891 230491 17095 77569 -43956 -210608 -135907
14701 -135907 314462 568515 499265 291888 364755 383134 -120742 -553295 -339623 56859
14691 56859 59451 79595 -23818 -38804 145843 26399 -143898 -133684 184015 164976 -257445
14680 -257445 -322537 -281913 -349671 -425004 20272 324380 436493 132738 477 10660
14670 10660 59235 292443 361114 221173 -133585 -324428 -185026 118672 250757 265596
14660 265596 -155937 -253760 -130439 -192453 29632 188320 192259 44004 -220634 -345394
14650 -345394 -287262 -523131 -357057 -1862 -96596 -396342 -460017 -363463 -391375 -324257 -411238
14639 -411238 -555949 -323779 -26677 158817 160435 141075 -2028 50844 162649 302155
14629 302155 341787 62826 -117947 -63129 117372 191952 291762 318859 -20781 -231787
14619 -231787 39303 -194353 -294572 -313207 -736360 -596379 -91760 -277901 -338195 -163577
14609 -163577 -70931 454435 526883 344102 418884 444255 148573 350007 717828 543424
14599 543424 -95380 -146366 -193744 -308714 -310918 -48456 -155546 -496465 -652772 -920948
14589 -920948 -658534 -26161 243320 243296 307333 419586 309900 121816 180250 61256 -287543
14578 -287543 -333566 -443442 -382478 -487676 -643221 -446031 -401590 -336676 -3514 245999
14568 245999 142350 -68333 -321293 -472429 -790644 -765506 -765995 -795215 -819581 -629700 -333965
14557 -333965 7301 343540 -17706 -172151 4067 76201 76816 468 -67168 -33853 -241651
14546 -241651 -751398 -920694 -706294 -540810 -417238 -158500 10719 -123102 -127319 -261439
14536 -261439 -103292 137138 -251020 -505454 -444299 -804982 -680056 -613184 -679043 -196093
14526 -196093 -92222 -97919 -399994 -729507 -446460 -110922 -185486 -384529 -55535 -44893
14516 -44893 -236241 -241006 -196900 -355826 -158458 164095 121414 192761 202751 410040 368845
14505 368845 12771 -413179 -275153 204087 317372 196774 -168502 -428054 -545154 -694749
14495 -694749 -444294 -224522 -118633 -76376 77560 110584 74593 40168 197827 454584
14485 454584 456937 121260 -91006 -211238 -719492 -970297 -737328 -258975 -52130 164461
14475 164461 165655 513507 259948 65701 62973 -142498 -222881 168653 236319 25182 141395
14464 141395 426960 135239 -32694 -123158 -329961 -612271 -759546 -218806 198893 339538
14454 339538 495581 486888 379682 468039 -105534 -323849 -268466 -515093 -261547 -56800
14444 -56800 203084 -61856 -341379 -60274 131049 71917 -4156 205100 231343 297732
14434 297732 248152 277973 163455 39082 -6936 -85939 -74340 530104 512035 113056 148242
14423 148242 343859 229298 -89938 -292792 -112030 -90026 -187896 -53785 -50423 -56387 46829
14412 46829 87918 195072 384212 280203 311294 484564 448715 360140 550896 858312
14402 858312 647531 202584 89063 368955 295510 55378 -100523 -63499 -281893 -412610
14392 -412610 -259876 -385271 1282 138845 -222251 -526141 -252719 -44391 -71320 -68103
14382 -68103 284824 202729 311858 671352 462765 403042 375403 280250 38999 -35721 -203908
14371 -203908 -766716 -613766 -211273 -351241 -723268 -937716 -616391 -521810 -609005 -975280
14361 -975280 -704992 -296652 -366464 -525290 -507218 -637514 -695367 -616332 -698009 -916128
14351 -916128 -811889 -659705 -568239 -161936 30124 299127 416897 108723 -8211 46570
14341 46570 186122 250366 24658 -374506 -259987 214239 263622 -406007 -750985 -792283
14331 -792283 -304033 -98791 188362 418602 99588 62207 335789 547045 504708 -14176
14321 -14176 -214770 -401369 -278117 -198057 -56844 -32341 -307949 -324692 -593887 -362134
14311 -362134 1023 110654 81331 78366 225452 -78339 -385 357409 223666 -152970
14301 -152970 -456819 -375515 -187062 -102123 -412506 -692338 -584529 -413693 -137434 181431
14291 181431 296946 214546 79030 392888 212018 -120560 -187883 -359594 -494763 -218074
14281 -218074 76223 157259 522901 170266 -438981 -551119 -646386 -767384 -384978 -30961
14271 -30961 146986 44685 286711 437063 117767 -249718 -448416 -374645 -133296 177211
14261 177211 -28048 305298 581603 706014 579074 330221 245808 48587 49958 -57246
14251 -57246 98126 145870 -223458 -204834 17800 -95468 -431032 -539512 -369801 -47183
14241 -47183 106645 430102 665501 625333 337521 -40119 -240001 -405729 -619279 -563368
14231 -563368 -265980 -338940 -382437 -472439 -78507 320270 98904 -5275 -17796 4177
14221 4177 -140089 -291248 129484 280879 131683 88240 257360 335022 342757 556054 67882
14210 67882 22660 -120465 -522495 -540817 -423808 -326415 -190160 -91717 -12289 6238 7838
14199 7838 26371 175762 551116 332153 13444 -125994 -33214 -119350 -17686 -29124 -96983
14188 -96983 -242869 149809 405217 398231 135303 -68040 81595 32584 -214569 -537559
14178 -537559 -564580 -398455 -101912 -152557 -170805 24543 323878 435524 136292 -362076
14168 -362076 -371048 -24731 -19925 -339782 -290024 -190366 -256249 -447964 -114187 229551 218580
14157 218580 -314715 -616691 -338937 20631 245199 233414 70405 -177532 -288922 -773579
14147 -773579 -685425 -623383 -467983 -383504 -297513 -293737 -420787 -371588 -261901 -433401 -629007
14136 -629007 -655421 -470314 -227788 -74824 -91962 -121958 66056 295481 371475 204840
14126 204840 314539 53594 -170899 -52108 -24646 -390856 -184346 311448 496677 215542
14116 215542 17902 152084 187861 3867 -175209 -313154 -61779 -198304 -243236 -137140
14106 -137140 -298476 -255713 -252845 3425 99530 198648 111205 -156514 -301694 -121813 -167303
14095 -167303 -58917 -274462 -573050 -211095 194737 568593 629815 677228 875955 1361529
14085 1361529 1023221 669771 421314 272967 -251939 -590637 -230872 91055 -168238
14076 -168238 -129262 174947 214420 169451 195024 259392 327942 5851 131464 386782 409715
14065 409715 514196 145890 -108794 -151460 26637 -16655 -64167 21407 -21768 -2907 -51941
14054 -51941 -233725 -361272 -379048 -343813 -529958 -468947 -341897 -123408 104600 363413
14044 363413 124745 -181964 -14134 31991 139270 136353 269735 456013 82782 -268270
14034 -268270 -93382 318103 250625 317141 167248 417602 287756 -115093 -117619 330808
14024 330808 382278 42328 -93065 185611 134019 -80854 109064 167970 87008 -49382
14014 -49382 -145901 -350807 -456196 -273352 231793 355794 172135 332503 283198 143069
14004 143069 -36287 -123305 179991 578646 625740 733974 473058 82979 329735 534888
13994 534888 508558 198151 70901 34202 96379 -107367 -24724 145175 288936 41586
13984 41586 -146443 165735 520583 259386 220934 303066 472 -19054 -100218 4059
13974 4059 276180 236532 266449 322145 422425 2208 -285526 -273711 -244420 207598 489181
13963 489181 282415 -214489 -550888 -335634 -399682 -354253 -281247 -192469 -306238 -228229
13953 -228229 105582 296873 196665 152236 215482 -219366 -325323 -283976 181235 37870
13943 37870 -361769 -388553 -126939 71631 275742 353282 548095 363529 50564 238464
13933 238464 517186 444463 152474 178808 372928 386236 -81909 -237361 -48322 -128913
13923 -128913 33053 384770 235835 126027 -188770 -242259 -77898 307365 119722 244907
13913 244907 316837 -38547 -155039 -180576 -61666 385353 42657 -345937 -421921 -334357
13903 -334357 -320473 -93567 -146019 -417582 -353556 -256916 -597412 -500146 -199404 101876
13893 101876 515430 391382 108724 34974 -88512 19448 12917 28450 437296 464727
13883 464727 404936 572136 702021 329357 254005 539656 673354 447457 220859 311541
13873 311541 222152 254124 574733 559271 322123 225517 101454 -56923 101832 445087
13863 445087 466714 432239 308562 286814 104484 -22535 176248 443674 839774 878916
13853 878916 642988 377752 -39319 -271109 -353174 -110365 136748 392100 173466 -44235
13843 -44235 11246 -200395 -208760 -1932 -21455 64131 365384 85287 -180493 47404 240875
13832 240875 -114100 -92629 12490 484756 400926 -79923 -514537 -416790 -259407 -314953
13822 -314953 -453884 209305 184662 55670 148024 293405 257541 371111 348371 284480
13812 284480 369824 387157 594245 1061196 1272702 1175099 948145 768226 505212 425103
13802 425103 709102 884112 423949 326408 469339 629572 643951 449462 75532 -206407
13792 -206407 -237599 -335572 -386315 -335461 -122902 -176289 -433296 -525930 -407447 -426402 -212543
13781 -212543 183714 -11021 -360840 -727862 -678196 -389309 -200671 -182396 -168288 -166803
13771 -166803 -125918 -392692 -184604 76142 152340 10946 750 324537 -222039 -711534
13761 -711534 -509885 72137 342745 232336 297911 31873 33815 -18534 44878 9129 -249286
13750 -249286 -522629 -408877 -413915 -3120 175042 -62411 -152460 -415169 -273963 -190221
13740 -190221 -386829 -259797 -401450 -563350 -412457 -108869 27326 -310958 -631913 -501124
13730 -501124 1437 120070 353524 101889 -454695 -427475 -514777 -378320 -42367 -229057
13720 -229057 -520170 -319395 318488 215928 162358 523527 225869 -204921 -76190 149130
13710 149130 345346 426254 351056 164191 131641 114858 205079 247388 62354 -25874 214103
13699 214103 -39655 -416697 -670997 -373884 -228799 234185 232790 109152 -111552 -206991
13689 -206991 -180137 200882 171809 104993 -109699 67797 90426 151219 245319 482958 355059
13678 355059 209565 502757 537356 158723 -229933 -514484 -393656 -294997 -600642 -557390
13668 -557390 -602648 -144710 391463 484622 412070 348605 172275 -183846 -128172 -273173
13658 -273173 -233750 -452086 -177263 -209812 -133264 145116 -89441 -399124 -403834 -287496
13648 -287496 -6701 -23567 -134259 78738 216958 433321 284060 5490 83784 153125
13638 153125 138066 89921 -96960 -156587 -66629 -43144 116588 65294 62901 -52579 202220
13627 202220 253453 152539 168969 201281 54613 -239764 -508754 -254954 169509 305720
13617 305720 189521 -197549 -332357 -109433 -58314 282390 550557 601242 358422 325143
13607 325143 182545 -133408 54309 242444 99755 -94824 -64201 -361690 -351516 -215715
13597 -215715 253255 1022288 848957 762223 664217 359495 -6648 -139252 -62762 -17256
13587 -17256 38174 -194169 -455788 -567037 -202271 -324724 -398786 -225403 -249979 -464515
13577 -464515 -324505 -98774 -15606 68577 227040 125610 -100614 -22125 -121620 417888
13567 417888 586561 358123 486610 324593 -11120 39450 311623 531112 480 -457969
13557 -457969 -87282 521442 260266 -12388 -128341 -401675 -178382 554948 793170 364425
13547 364425 104109 -89060 -170613 -258960 -455968 -537477 -111603 40711 19524 -242902
13537 -242902 -393194 -312440 -283475 -450879 -425295 -203317 -327155 -236194 220077 448384
13527 448384 753550 578198 61351 -341614 126505 564558 575374 549344 171455 39614
13517 39614 -45248 207179 164178 176954 -9205 -262419 18763 -135375 -275042 -393440
13507 -393440 -247858 -112003 295347 474453 510827 348340 427485 461246 527764 403620
13497 403620 225952 491042 822448 876117 502204 721205 826370 691154 548915 567122
13487 567122 561535 469533 296438 241537 284501 577974 657935 415128 483625 505305 459837
13476 459837 703705 786919 375464 59142 65047 374295 757612 608278 304251 335319
13466 335319 9020 283547 488125 317608 353362 527619 352926 253987 460406 377507
13456 377507 349640 259987 104964 375161 415705 371525 188114 74381 202010 188923
13446 188923 12199 226936 271687 337104 923072 1128670 1050028 784020 373046 424270
13436 424270 498376 438964 780556 637953 482717 503639 744458 753254 1093005 1148213 695189
13425 695189 627860 932465 1418204 1287726 1191596 1482061 1521870 1397270 1476425 1691378
13415 1691378 2194358 2423483 2555542 2473918 2642909 2714757 2690972 2597813 2646852 3058804
13405 3058804 3104303 2614463 2338169 2221515 2391686 2806443 2686800 2201192 1936529 1713798
13395 1713798 1641143 1613888 1579361 1332755 1307957 1253657 887368 819796 1150618 1292079
13385 1292079 1277361 1076791 799374 918774 953281 1399658 1402288 1240216 1405046 1208622
13375 1208622 1144782 1046600 681377 478007 728881 1211454 1426272 1479663 1742708 1697490
13365 1697490 1449989 1370881 1853023 1908177 1583048 1089595 1154043 1218269 918761 1138167
13355 1138167 1285035 1392729 1284278 1100837 1281710 1505055 1770147 1753524 1614263 1437584
13345 1437584 1144911 965320 1148458 1413112 1499716 1632291 1384528 1218467 1301316 1293438
13335 1293438 1139025 1244726 1083596 847601 719675 885223 768975 910041 1157907
13326 1157907 824051 860254 1163761 1111181 1321213 1303891 819321 491790 505864 508915
13316 508915 774967 976960 846797 787909 821255 831608 905698 893467 891094 889145 525725
13305 525725 588591 818280 1039210 911108 894405 613846 396762 332322 377060 57608
13295 57608 127663 389114 517258 323132 -10624 237508 770933 717358 920908 982416
13285 982416 1405271 1560717 1104167 961469 895784 718519 839120 774709 665623 583621
13275 583621 782231 651815 457133 188032 -154822 -122741 153926 483279 623572 809347
13265 809347 830990 882730 884014 721358 874834 703203 792234 707478 670988 253989 -60811
13254 -60811 65644 520021 816379 865934 881179 823672 583690 320623 8118 199393
13244 199393 282437 748872 883515 736474 967012 1161947 1510494 1573960 1511726 1624558
13234 1624558 1724451 2001890 1936892 1987953 2041581 2179765 2181722 2186702 2418234 2291103 1955202
13223 1955202 2076272 2356509 2013302 2000483 1933309 2300718 2494110 2193424 2064108 2162582
13213 2162582 2178136 2127360 2224858 1950730 1869684 2110472 2077538 2147272 2210179 2047089 2087136
13202 2087136 2049317 2107113 2473827 2298573 1980929 1938539 2031919 1864790 1589670 1480114
13192 1480114 1501955 1225313 1247164 1418810 1367375 1280731 1285850 1012700 938681 855845 720595
13181 720595 655303 722348 916437 766299 986994 781453 801439 1033522 914608 966327
13171 966327 1146582 1127919 969348 885049 966477 1052078 1145350 1214294 1246357 987194 905224
13160 905224 877568 1011282 874264 920053 1032637 1042899 775019 608078 760333 845249
13150 845249 785355 417837 480507 143198 -47002 384300 801454 834119 634900 542259
13140 542259 704664 608124 735988 1144220 1308304 1305134 1196238 856349 911382 843848
13130 843848 562170 698713 1239537 1330324 1713666 1912788 1751038 1779711 1987000 1865005
13120 1865005 1857611 2107434 2319515 2142556 1841068 1775662 2148686 2533019 2519241 2502214
13110 2502214 2698315 2686792 2638742 3157960 3596106 3980148 4515249 4728329 5299813 5666658
13100 5666658 6495306 6639945 7138286 7154737 7320670 7648448 8219582 8441785 8670043 8765154
13090 8765154 9486732 10119984 10586303 10656254 10575760 10952619 11042096 11045263 11074034 11342100
13080 11342100 11519610 11562436 11011784 10644434 10275371 9677700 9174033 9161895 9176502 9190529
13070 9190529 8979403 8483661 7795988 7410321 6881928 6346742 5529117 5095468 4632960
13061 4632960 4150947 4014139 4243664 4252283 4187026 4130874 4213701 3867872 3265671 2848390
13051 2848390 2825042 2863485 2950575 2941760 3224935 3469122 3204320 3160205 3094370 2648652 2598885
13040 2598885 2740466 2894936 3064783 3277573 3060743 3503525 4114593 3790705 3636965
13031 3636965 3443967 3311846 3364218 3473973 3368666 3310706 3687186 3799186 3560549 3472336
13021 3472336 3503601 3388046 3427383 3186514 2816622 3213030 3445877 3187183 2958568 3071348
13011 3071348 3068684 2859598 3038891 3239914 3397880 3412609 3632172 3814233 3891317 4127842
13001 4127842 4652305 5171599 5078957 5302104 5482304 5662225 5416873 5606628 6224986 7026166
12991 7026166 7221216 7685478 8486655 9296112 10207563 11091441 11923908 12676788 13627093
12982 13627093 14778625 15984704 17373185 19105641 20966880 22887132 25171329 27456850
12974 27456850 29995612 33120044 36371105 39783527 43850833 48409771 53153354 58253306
12966 58253306 64031922 70204935 76895854 84546730 93298319 103017408 114021269 126715803
12958 126715803 141370974 157451824 175287597 193991723 214096677 236812646 262340006
12951 262340006 289836955 318531493 347539484 371882250 388188896 401662859 417611629
12944 417611629 434571716 453011990 474320382 493856586 506514007 510952381 496421179
12937 496421179 457175149 406274406 356816647 313426239 278695741 253369139 235722344
12930 235722344 221831946 209591688 199168930 190493723 183128831 176734842 170425284
12923 170425284 164013021 157642233 151009106 144468402 138638256 133407932 129141289 125573130
12915 125573130 122259386 119541097 117394547 115106521 113037602 111200141 109314645 107869053
12907 107869053 106369123 104401965 102838285 101305419 99677830 98157918 96475494 94748664
12899 94748664 92587428 90021395 86939114 83568283 81169151 78665947 76421307 74487744
12891 74487744 72394755 70794407 69512240 68201519 66912944 65797844 64585517 63542264
12883 63542264 62894878 61936096 61080685 60592230 60102828 59437132 58506828 57465062 56481630
12874 56481630 55631553 55351914 54871986 53985911 53437603 53160304 53223093 53147426 53202812 52927248
12864 52927248 52411831 52133558 52208171 52155236 51668859 51217807 51240311 51172342 51437356 51448543
12854 51448543 51364291 51223917 51235304 51468578 51985349 52280530 52288746 52425339 52798848 52665633
12844 52665633 52263299 52053132 52105903 52291955 52300941 52206997 52152985 52262666 52248691 51822726
12834 51822726 51514095 51496988 51162354 50885054 50504001 50335332 49993805 48911429 48308970
12825 48308970 47560160 46104340 44788741 43367299 42208163 40970104 39820322 38650287
12817 38650287 37433812 36119406 34651146 33790762 33218677 32613912 31783339 31314747 30705050
12808 30705050 29488296 28518303 27993447 27778138 27316953 26718341 26323816 25939837 25919023
12799 25919023 25832411 25100363 24496720 24389831 24191220 23998447 23695900 23054104 22325955
12790 22325955 21656355 21107914 20657515 20577594 20465555 20428290 20022431 19865554 19652822 19373165
12780 19373165 18728288 18328416 18142403 18047931 18157859 18244591 17962223 18175409 18568538 18256740
12770 18256740 17515479 16892189 16655200 16156928 16110411 16358613 16410278 15954885 15646969 15280188
12760 15280188 15253366 15857966 15970267 15550231 15647400 15691388 15647189 15502826 15767657 15555043
12750 15555043 15361248 15178552 14992795 14584611 13988829 13575419 13169461 12526833 12334311
12741 12334311 12200615 11639827 11089282 10473966 9824898 9614182 9460130 9139251 8720203
12732 8720203 8340367 8305138 8262025 7672031 7027328 6935259 6881745 6831507 6940090 6683513
12722 6683513 6106140 5656687 5665629 5343480 4884462 4588971 4319975 4053320 3710887 3772020
12712 3772020 4072854 4014223 4077007 3810532 3664667 3495689 3135182 2737652 2770479 2970627
12702 2970627 3071641 3273950 3082041 2840766 2882262 2941444 2772558 2489994 2405807 2299876
12692 2299876 2267024 2259138 2361289 2353366 2376342 2253671 2055225 1800120 1864495 2348666 2790562
12681 2790562 2596493 2576963 2512904 2271067 2206355 2086793 2099515 2010379 1794871 1975470
12671 1975470 2007929 1604473 1463084 1668729 2013093 2338574 2453847 2582959 2361567 2205395
12661 2205395 2041253 2194144 2240843 2382400 2421396 2758348 2935686 2690496 2350274 2353215
12651 2353215 2741168 3089446 3108774 2927902 2623028 2713229 2611995 2562182 2711505 2862298
12641 2862298 2716885 2778746 3025382 3109799 3088389 2949833 3332736 3544536 3573477 3407343
12631 3407343 3231027 3223857 3157433 2959816 2872458 2865140 2925887 3008332 3087219 2603512 2645819
12620 2645819 3019556 3102437 2959772 3100646 3317129 3625594 3924325 3987617 3978405 4046158
12610 4046158 4080014 3972859 3650964 3596161 3559597 3733359 3791668 3706220 3130517 3139595 3355178
12599 3355178 3684859 3352391 2828981 2802710 2687756 2658079 2689056 2606349 2677573 2407743
12589 2407743 2306323 2577887 2906092 3036596 2791355 2380443 2081774 2157924 2300976 2466076
12579 2466076 2569814 2609561 2278692 2173104 1852216 1772319 1734147 1574121 1274706 1142762
12569 1142762 1448464 1692202 1920062 1807875 1576789 1539350 1228403 1187209 1269464 1296889
12559 1296889 1058106 1049331 824362 290983 194608 592395 1006845 1135385 1221980 1009056
12549 1009056 918462 1259016 990339 903449 940263 922213 661358 709761 1086207 1392658
12539 1392658 1172012 716069 458794 420378 711624 858938 827242 876657 626453 593188
12529 593188 438086 465606 600965 476133 426758 569322 925157 1019121 780323 351903
12519 351903 402696 769138 727043 252384 39133 -151193 -512463 -386509 132946 182214
12509 182214 506223 667368 941942 1084019 953042 813870 948477 1147075 765006 205182
12499 205182 409504 1150520 1661716 1666386 1510633 1337371 1339863 1136372 1130650 1068739 739254
12488 739254 1167968 1648686 1856523 1859979 1925484 1720141 1802978 1804981 1986213 2352926 2614602
12477 2614602 2946665 2861091 2428017 2571469 2716610 2767949 3128220 3143056 3593704 3648025
12467 3648025 3944118 4236856 3629430 3455978 3634548 3384425 2889084 2620966 2762425
12458 2762425 2692903 2354711 1760738 1801249 1697987 1714879 2231364 2648958 2531836 2000919
12448 2000919 2213633 2134012 1949822 1869938 1968003 1659489 1568186 1474796 1305152 1587428
12438 1587428 1666806 1634159 1752183 1630840 1530223 1528493 1596429 1784306 1771884 1485109
12428 1485109 1761308 1699419 1895293 2142096 2147379 1927700 1803385 1534489 1313368 1069097
12418 1069097 1174023 1028692 1056562 1650445 1620951 964025 951452 1199723 1465299 1411498
12408 1411498 967911 792081 700850 701120 1054282 1280687 1218567 1171418 993537 773889
12398 773889 906045 1002993 868528 865969 950491 1216584 1145489 1095206 990353 962512 712535
12387 712535 473922 693466 726170 324287 305558 695039 761486 644893 531675 501264
12377 501264 271943 134716 42538 385626 726804 665596 649999 985692 662326 491371
12367 491371 734490 541123 -26838 178731 191665 22683 67702 -137255 67558 586895
12357 586895 544361 501729 492501 804042 880974 1022166 963926 786139 226977 41037 230556
12346 230556 -67170 48386 479042 619676 864285 979577 775860 797847 769620 443523
12336 443523 189260 92000 -130266 26021 430862 162215 -177109 -234710 -222629 -483853
12326 -483853 -292501 -91237 90891 303117 191619 294163 247525 356797 425911 663412
12316 663412 916354 770957 838683 900580 823723 1007694 1082564 1004169 736546 965063
12306 965063 1128878 909408 822944 522597 271041 552419 916644 964973 864369 532474
12296 532474 404716 188359 170376 139565 350497 371209 268303 758291 668950 403062
12286 403062 189256 257310 334131 245528 267217 462496 580732 423158 200880 156386
12276 156386 55670 411835 925046 1191536 1122991 1025080 688976 387610 344528 333122
12266 333122 346664 -17466 172951 441831 195381 62377 -92842 -64121 545594 637881
12256 637881 515860 438200 258839 220420 308073 550234 466862 490424 507356 525378 473497
12245 473497 459675 585030 658385 296626 94730 545805 564930 467552 335271 534181
12235 534181 513647 206245 55424 56791 19683 65222 -8732 -325956 -351114 -306494 -361888
12224 -361888 -221687 -29862 -176940 19435 -104553 244502 557714 208049 173021 278543
12214 278543 230091 220719 510920 562724 662663 590301 583735 552656 423611 537263 506188
12203 506188 677181 955547 837536 613321 672369 764875 856666 616151 556750 628995
12193 628995 507512 161484 -57691 -105492 -183963 161727 475120 514750 331841 482905
12183 482905 515981 461121 270250 -30438 -74002 164252 -173751 -268270 -23907 182894
12173 182894 116540 153585 93913 77629 358141 559600 310782 97667 199545 182194
12163 182194 -25593 -74551 200559 22426 253107 228859 -18025 -10895 -51583 -138107 61574
12152 61574 334950 577118 717521 662187 687534 928507 787022 189946 -55513 -296847
12142 -296847 -131033 286872 645682 597569 565096 587656 464292 645296 806680 402361
12132 402361 134985 173949 94962 165232 7339 393972 530404 297899 200545 249
12122 249 -421828 -796456 -394156 60548 342623 386176 219778 172576 -162314 -245205 -329220
12111 -329220 -496622 -263352 -198322 -427992 -585978 -328234 -143991 -348952 -104944 25021
12101 25021 40549 364919 79823 -112776 -80528 -238364 51750 190109 431658 501379
12091 501379 -28120 -183461 -304705 -495677 -320495 -120814 74010 441019 297431 237555
12081 237555 232562 185552 27299 141922 -205442 -351538 80889 334750 255068 -80494
12071 -80494 -138452 51197 188571 -254171 -195491 41824 78494 -38068 -85314 6813 21179
12060 21179 10367 341603 388506 388887 564069 649442 238908 -108462 68014 25823 -31520
12049 -31520 -56788 31666 499829 464123 543558 232616 55072 509938 714647 734635 411085
12038 411085 214753 194034 -25354 -73165 -63474 -12376 205288 388607 424149 432393 359132
12027 359132 130056 174253 353571 640911 853927 825682 415119 314482 115763 122346
12017 122346 160455 74191 17674 242236 396296 268590 44566 -216468 -6201 478845
12007 478845 547125 462413 156301 -81651 -236931 -294582 -185156 -65960 298221 443310
11997 443310 314834 118857 -88498 -151736 -16438 94525 381989 450806 412378 190180
11987 190180 407518 376041 191158 357258 402852 691521 930825 658999 231172 257794
11977 257794 227847 563589 739852 595115 332192 64009 -3243 -73471 -99643 -142196
11967 -142196 -365894 -521123 -274589 -51353 -220435 -218491 -237325 -424461 -594101 -463952
11957 -463952 -343321 -312866 -35118 104947 -165594 -56164 -85264 -14695 -133739 -557500
11947 -557500 -609180 -356917 -183368 -287797 107254 354151 504139 211261 -206377 -159717
11937 -159717 -470795 -414282 -326239 -171795 -309530 -59015 196087 75936 59885 -32992
11927 -32992 -581430 -509264 -458583 -330338 149920 159117 150957 -88378 -234114 -568000 -980323
11916 -980323 -1203083 -879151 -98681 -97618 -56097 179240 128374 99183 458050 524228 401903
11905 401903 -86756 -349609 -58921 129233 186778 322043 433086 222259 78595 283965
11895 283965 302342 141710 -96256 -275791 -448655 -291761 78037 104045 -11353 -47273
11885 -47273 -253169 -243637 -128555 -360968 -372548 -115333 -22208 177145 528543 547104 249325
11874 249325 363448 245571 257540 231302 369370 662899 344433 109097 325528 203543
11864 203543 39764 322027 437176 434151 76874 -61973 422856 707863 351866 26720
11854 26720 -154885 -66057 -73341 -271108 -169578 -221954 71472 361434 205556 -207988
11844 -207988 -258506 -102717 67417 215446 446706 407284 433161 342813 -112869 -72275
11834 -72275 -70525 -348186 -355908 78507 60783 -113366 -170493 -94585 -138524 -191310 -47589
11823 -47589 161953 174837 -36073 -178663 -138090 118005 414227 286414 -120946 41378
11813 41378 -50564 -268676 -138299 170397 386758 540319 386181 -113101 -60652 88476
11803 88476 2893 -20385 -86475 119107 115722 169763 40923 -187716 -410109 -167792 -21030
11792 -21030 96872 445848 256880 -88594 -19086 -142164 -280883 82079 511755 664079
11782 664079 417449 -58793 -6040 -143790 -104384 139325 280766 232414 -74988 -6761
11772 -6761 161883 283920 51586 -334313 -502455 -494935 -262154 -118766 -61914 241264
11762 241264 62495 -133982 100874 279897 133203 -191250 -308717 -16271 236289 357223
11752 357223 235874 346964 67661 -93080 -171320 56082 135676 366870 222332 266903
11742 266903 415135 421341 471324 467679 469011 331854 68205 -96909 -485149 -473820 -217109
11731 -217109 -206800 -170863 -231747 -315798 -166794 -109885 -126666 -226875 -159247 57077 415852
11720 415852 565673 630930 261220 340203 259818 -157122 -131058 -231280 -270395 -201783 -42351
11709 -42351 -220419 -277123 -459077 -523438 -237514 226420 70049 98711 117316 282026
11699 282026 319375 358970 -41011 -327968 -480922 -193848 117384 455893 262228 1987
11689 1987 372866 830117 693263 -72425 -138807 1039 122273 351565 -307800 -440432
11679 -440432 -33957 69667 -123790 -93397 -44240 235483 303714 35443 -96425 -57201
11669 -57201 219138 216446 162939 187245 234587 95664 -126268 124214 133053 46136 -69122
11658 -69122 389072 802985 460836 -64244 -242084 16521 97494 -233540 -157696 -80286
11648 -80286 -32778 312786 209783 132692 478638 406664 523776 127987 -68143 180853
11638 180853 234247 208095 309757 358993 260046 573363 904996 664245 293793 397653
11628 397653 177837 -265952 -295844 -11509 -32026 -716785 -646945 -552947 -506812 -386281
11618 -386281 -249614 35367 224568 180969 -14810 49052 334965 601504 663295 298280
11608 298280 303455 50834 -369097 -410818 197404 389755 357166 167001 -44515 -150321
11598 -150321 -461141 -240560 -418630 -509804 -420936 -663649 -587982 -416209 -427312 -117200
11588 -117200 114715 80001 -309156 -237876 84198 87802 -14811 -28283 -170973 -376233
11578 -376233 -330469 -245329 -77263 -223306 -266761 -290334 -161786 -253702 -127883 180897
11568 180897 65342 -446197 -743225 -628278 -464028 -243864 -246850 -626066 -894612 -815608
11558 -815608 -196978 -40166 -351899 -190350 52463 166156 364561 495323 310439 173053
11548 173053 56717 17579 207473 299593 180850 -25278 -368698 -869008 -1072535 -663482
11538 -663482 -47573 334331 116267 116308 109637 217123 210802 -206672 -305664 -306904 -383566 -479724
11526 -479724 -296983 109473 94320 75226 134153 221116 137994 214515 338820 291958 351553
11515 351553 486553 300611 217731 10652 -198420 -578676 -507862 -451080 50529 27888
11505 27888 -112547 -68269 99393 407829 249938 201819 -34555 -431787 -510344 -368587
11495 -368587 -207741 -106814 32333 165169 365697 285505 212198 193798 66055 -256625
11485 -256625 -559349 -570759 -425899 -298415 -379874 -180880 -96948 -73523 -292330 -226558
11475 -226558 -15271 130383 -21954 -251700 -327021 -365223 -325949 63102 130708 -416502
11465 -416502 -570753 -545861 -489010 -212483 -266345 -315030 -315733 -532252 -766667 -415099 -225657
11454 -225657 -231758 -278391 -122175 -123669 -184104 -234354 -658857 -413663 -228444 -312090 -524371
11443 -524371 -300454 204892 497556 574507 319609 173159 245072 23732 -120006 -356072
11433 -356072 -337514 -76749 -187982 -78964 63983 -35132 -108757 -412544 -453020 -33030
11423 -33030 155146 148963 309426 -124437 -146543 -106947 62160 177970 -85262 -375866
11413 -375866 -416266 -277518 -484529 -601377 -648339 -701066 -347373 -340099 -55103 -25663 95992
11402 95992 123494 -29564 -65867 -288798 -461957 -189713 59998 246912 125243 -179650
11392 -179650 -156315 -219690 -329528 -341874 -509318 -615693 -306065 -87093 119993 307755
11382 307755 322179 545527 618715 670009 624268 7485 -307433 -192399 400398 475921
11372 475921 206949 -49509 -82066 135545 246483 -28467 -374367 -133531 -255755 -232057
11362 -232057 -43010 39684 -88139 -118319 -259887 -642015 -461122 -272785 -207511 -193014
11352 -193014 -386317 -386319 -136956 -267490 -515159 -699592 -800978 -463524 -412563 -353000 -308876
11341 -308876 -155618 3289 -138904 133191 75809 20453 -47870 -341617 -95400 35563
11331 35563 132739 334774 295136 188885 238424 347009 57883 30517 104570 320357 192812
11320 192812 -82308 22872 263164 553028 247149 104222 -5771 29569 302508 64958
11310 64958 -527910 -635174 -466949 -498726 -539800 -288826 13756 329209 -196751 -260275
11300 -260275 -403694 -899008 -799375 -659880 -494926 -581075 -701770 -517539 -120458 192855
11290 192855 10134 -274730 -435358 -620085 -583179 -133353 -185863 -358026 -280679 -618605
11280 -618605 -624063 -299835 213196 140629 -10279 -33791 -14331 -116718 -115086 456258 229888
11269 229888 -388837 -271128 -225452 -532892 -353380 -553300 -504851 -51052 112288 60050
11259 60050 -201291 -69194 124769 -293778 -198308 -71611 -10179 293803 324477 425451
11249 425451 529631 379680 -243827 -446583 73178 507502 661163 584886 390303 -93418
11239 -93418 -108001 127221 279824 302024 -99376 -206496 -204731 -97619 -288195 75639
11229 75639 352727 298262 221619 218900 238257 101887 -60276 -148208 -503493 -452899 -775501
11218 -775501 -635912 -474729 -377982 -129210 228634 264603 250227 650568 399628 -24248
11208 -24248 -153023 153232 499251 194967 -56998 -216925 105683 54308 220258 301599
11198 301599 94025 229091 369789 9859 39867 13550 406438 362680 153073 -234670
11188 -234670 -150137 -41321 -77834 -85577 125412 330215 95521 -7274 154796 159323 96085
11177 96085 -45957 -303157 -199494 -56766 357 -330689 -240835 -50645 114437 -139596
11167 -139596 -25757 -149480 -68027 -151124 -50127 85565 168894 -103036 -177973 -353970
11157 -353970 -175318 -197620 -100568 -110924 -312143 -490613 -199744 -299645 -273674 -84669
11147 -84669 -177198 -25086 161469 -26606 -240072 -73337 64267 356289 310350 191655
11137 191655 102310 -30693 -357537 -790129 -858151 -736721 -478028 -57979 27083 2433
11127 2433 -404813 -601832 -420382 -235553 -281362 -293873 -160529 -244655 -330041 -234020 -462472
11116 -462472 -488366 -606531 -918231 -858830 -337601 -246469 -136354 -115671 -253866 -102577
11106 -102577 198296 691107 814330 577673 180621 172850 -203491 -108860 -223839 -57088
11096 -57088 -111110 -2209 224645 371409 551712 394192 539889 473292 172253 97995
11086 97995 -19456 33274 411710 369583 397077 576874 492106 315841 108025 145116 98172
11075 98172 -98778 -381815 23742 271428 -42440 13007 23686 -99723 33238 310665
11065 310665 192944 -290967 -143534 -177471 -222742 -121785 122791 -184570 -280347 -264375
11055 -264375 -162514 168689 324266 282414 29168 34146 -329723 -392949 -272356 -217293
11045 -217293 -394583 -104854 96341 -33916 -156057 -266746 -476453 -210117 -213828 -312972
11035 -312972 -55766 -42216 -52922 52357 -149408 -236008 -218254 -83060 170733 46819
11025 46819 -492818 -590455 -846980 -800530 -683606 -637178 -441158 -357840 252701 396341
11015 396341 97441 -14251 -171816 -372739 -277092 -439722 -412366 -315116 -337872 -307310
11005 -307310 -460703 -664007 -648400 -502952 -70171 232015 129716 453773 258807 -121000
10995 -121000 -198751 -156954 -171216 -45017 145661 183641 -230597 -151652 -38338 -166829
10985 -166829 74136 294361 217187 173580 159121 47885 -95870 218477 368653 356767
10975 356767 167068 -243693 -506646 -500748 -217714 39331 -249727 -351351 -336112 -153787
10965 -153787 26602 -61083 -196656 -457678 -423798 -426730 -197286 -154471 -378216 -635273
10955 -635273 -846644 -599009 -689334 -779105 -248023 -267457 -465596 -488623 -89224 171047
10945 171047 403619 170860 -82752 -36267 39654 85045 -140733 -286563 -168306 -205212
10935 -205212 -341866 -319911 33909 511256 907459 602926 316170 22759 -58033 -159866
10925 -159866 -85821 135656 155080 175217 205669 293427 164427 93391 -136374 -58555 -24091
10914 -24091 -359502 -725054 -814031 -490320 -27496 -112649 -159780 -244922 -367365 28179
10904 28179 545169 376888 -77983 -619691 -551338 -536868 -443018 -232456 -381163 -587790
10894 -587790 -278250 -166249 -248298 -199064 -170167 51734 169122 -328901 -298193 -439363
10884 -439363 -430562 -280528 -64875 35968 -481037 -592007 -169875 41527 -77930 -459288
10874 -459288 -355290 -414830 -334863 -160292 214830 175996 -151736 -240432 -236181 25118 220705
10863 220705 370422 367909 544560 325959 130559 128512 70639 4353 181150 409228 208642
10852 208642 12970 -95900 115398 -85639 -291542 -99369 301509 240528 -115150 -258737
10842 -258737 -218469 -28623 -240336 -313062 93856 294400 332444 222531 -352372 -593292
10832 -593292 -678990 -733043 -455300 -450312 -480687 -187267 185343 446031 268787 165571
10822 165571 116632 109921 198335 180922 207947 -10161 -346873 -355845 96724 252040 225687
10811 225687 -60297 -121217 187330 -45912 -121678 185063 81664 -35079 -32811 73592
10801 73592 102059 -129536 -429339 -346967 -332890 -150598 156294 -121393 -504898 -236818
10791 -236818 -277117 -187314 -47203 -94744 -386876 -306022 -100813 61049 105352 298846
10781 298846 563332 623772 279472 10229 -56744 -324280 -98951 271552 194461 -168497
10771 -168497 -271907 -153392 -348747 -225601 -160846 5249 89686 -349439 -448294 -429229
10761 -429229 102361 252699 222918 129030 -60452 -172016 137770 51831 17427 183555
10751 183555 -64502 -559532 -394842 -536095 -370306 143046 252444 -31976 -371855 -713291
10741 -713291 -662532 -683369 -720016 -315027 -67155 -579 -64271 52388 144769 189228 258028
10730 258028 264693 102880 11373 -58554 -285584 -485868 -179595 -82911 -368356 -616450
10720 -616450 -759145 -625899 -687963 -672344 -646001 -303103 -206515 -326372 -414269 -456171 -170426
10709 -170426 246931 585598 318581 -207206 -322119 64379 -420883 -535249 -674491 -991064
10699 -991064 -561138 115969 -234797 -380474 -74656 221311 440556 132714 192694 197845
10689 197845 341905 84966 -117147 -165704 155507 703900 730369 683962 327990 296258
10679 296258 298131 293595 323560 394192 310206 205366 -105538 -222792 -174914 -184691 -143259
10668 -143259 -414516 -41294 139632 108858 -331768 -234587 -385157 -471938 -188954 53709
10658 53709 290243 28508 302993 426457 348956 -36385 29116 107659 331222 235910
10648 235910 130556 177951 158259 219073 2855 6219 31128 314361 356142 35488 -366977
10637 -366977 -216271 2083 -237075 -419549 -208376 -82748 -259423 -393163 28555 334615
10627 334615 284570 47786 59961 -146063 -71010 168524 270651 200215 104967 281851
10617 281851 350321 156559 -78215 -347891 -517918 -519860 -273821 3407 -75575 -75221 71818
10606 71818 230443 51592 -416949 -231838 107923 87943 -352536 -151933 157292 -30242
10596 -30242 -368666 -631935 -660734 -424112 -193876 -529618 -72001 76622 -362218 -689580
10586 -689580 -332663 104056 302036 90863 -112098 -52670 228299 197423 -39195 310208
10576 310208 422095 79057 -398632 -380687 -332505 -384004 -556809 -477056 -210689 -66543
10566 -66543 -115898 -305371 137621 493089 530877 287892 191715 157276 394139 337190 106458
10555 106458 412928 631120 413601 223086 161315 208615 -11307 -273917 -89532 63552
10545 63552 -68017 -27115 -6461 419609 218399 -232266 -562539 -731248 -681256 -135656
10535 -135656 155790 239647 36859 -296322 -425001 104407 112748 -96151 -190956 -187649 145480
10524 145480 32636 8412 -39023 -132067 -127738 -70584 82290 118257 95408 -98952 -19649
10513 -19649 -116477 -432025 -156029 185585 414414 475634 57845 -422364 -148313 82526
10503 82526 -146548 -263435 -284738 -110953 -77877 -36740 -37625 -1456 -170637 3738 175841
10492 175841 414946 104907 -398114 -314604 -453443 -493502 -819428 -1023527 -1171644 -891353
10482 -891353 -339214 -217410 -258344 -27144 -140061 -446776 -175773 268818 205947 23484
10472 23484 -52797 -58464 -135181 -381140 -196745 -118879 -7890 193225 188214 303047 187005
10461 187005 176998 115035 -246488 -151475 -189040 -339019 -439838 -514979 -460690 -293220 237487
10450 237487 409483 198858 184320 -248012 -717780 -827837 -752410 -588600 -477331 -663290
10440 -663290 -826080 -929670 -440725 -321594 -279222 -138138 -182255 -70090 227154 341473
10430 341473 -105533 21157 30488 -92032 -111132 -162348 73192 13150 -485349 -626252
10420 -626252 -426216 -261968 -339123 -297437 125806 11186 -206696 -308353 -427915 -167979
10410 -167979 451432 451604 574059 533765 410934 178846 -257333 -290849 89990 308693
10400 308693 457726 541453 304172 106386 67574 449987 463210 312281 244808 97481
10390 97481 -131760 -133077 -47064 260837 252922 38420 46881 185825 -198766 -258997 -242510
10379 -242510 -551628 -433284 -380899 -385908 -364071 -508765 -384566 -676960 -781682 -624237
10369 -624237 -307187 109757 104967 -75850 -122898 -108072 -181062 -165367 -297153 -448949 -254360
10358 -254360 50362 12480 -84087 -466287 -594953 -534026 -215000 -19021 -191038 251750
10348 251750 561880 399413 469668 513960 472909 165797 99793 45781 -298327 -26302
10338 -26302 116832 152770 230935 330247 185575 32578 -235535 -358240 -302438 -49045
10328 -49045 203474 144896 123502 -146981 -174097 -159940 -341893 -291923 -157130 -96133 248032
10317 248032 623580 558805 576027 507928 279104 5862 735 -20243 -102334 -185949 -103780
10306 -103780 -392849 -299519 -350315 -332866 -530239 -586669 -591873 -655440 -249815 -254162 -493088
10295 -493088 -488406 -356840 -430003 -604765 -631454 -171253 -50006 207012 -204542 -568971
10285 -568971 -515767 -384476 -225283 -73505 -44247 -338977 -561063 -475981 -432521 -630126
10275 -630126 -334685 -205976 -79602 29009 51922 319587 420161 166083 -75661 -168448
10265 -168448 -255071 -222734 18442 86265 -61218 -409106 -394486 -316803 -205937 -23012
10255 -23012 55593 -61397 87620 140016 10585 -195859 -131590 306323 298613 305637 278552
10244 278552 29025 60843 250860 159861 171383 129790 185173 -22486 -25982 3696 188757
10233 188757 213216 252234 193843 289566 116988 -74999 -381290 -564158 -452716 -421508
10223 -421508 -317690 -253893 -192350 -415950 -560891 -625365 -573083 -244092 81243 344135
10213 344135 434722 12487 -147028 -121046 -17473 273929 722157 865993 816798 413573
10203 413573 -52102 -609319 -899039 -837616 -556809 -612704 -643031 -755807 -552682 -274892
10193 -274892 -6655 -385944 -805327 -786111 -744495 -861924 -496273 -177752 -153828 -237386
10183 -237386 -309989 -311593 24724 76856 -141163 -235685 94141 34288 -203604 185589 181309
10172 181309 -64534 -285483 -238577 -205598 -182974 -187402 -194174 -479829 -609280 -383098 -185465
10161 -185465 -177384 -54164 11105 -107493 -353446 -359599 -12937 200246 315221 354851 382527
10150 382527 529835 487483 -25268 -348194 -56244 -76178 -295969 -381089 -404210 -589519
10140 -589519 -410508 -61622 -148112 -265638 -297948 -508728 -338933 100782 162639 372283
10130 372283 84747 -101045 -68422 149112 188121 -270155 -332517 -497019 -207595 -159195
10120 -159195 -523002 -648965 -113808 248655 45808 87214 154453 137306 -175435 -296777
10110 -296777 -555745 -436299 -72885 -106709 -282992 -221237 -131203 -233761 -65154 -85829
10100 -85829 -19074 8311 143021 596873 480532 2721 -74244 -15551 -52899 -26538 -371918
10089 -371918 -381069 -483373 -548470 -319286 -467258 -264104 -96491 -84846 -201095 -28090
10079 -28090 273880 -42204 -512870 -185891 123955 -226953 -105467 -127400 -62156 -240063
10069 -240063 -323880 -238676 -36601 -39382 -269405 -455119 -321708 -421571 -346845 -227606 -188270
10058 -188270 -16192 -177724 -293794 -543146 -1022891 -662008 -487886 -315663 -168444 -102409
10048 -102409 -382422 -326321 -290805 -200476 118066 -45507 -307091 -688748 -654953 -290593
10038 -290593 -87509 -112392 -330208 -423320 -272091 -196757 -338904 -246981 -43101 118876
10028 118876 526749 344711 248888 313694 354703 334000 345352 198559 -141272 -16667
10018 -16667 212496 363406 352868 493205 417327 375859 373773 185660 104828 -15722 -94430
10007 -94430 -302184 -340492 -268769 -30206 145120 46707 -399912 -287048 101143 44934
9997 44934 308374 644756 708801 443692 159754 -4101 -60192 30416 -226737 -709375
9987 -709375 -445879 -411832 -417976 -245148 -25567 69278 157026 45093 -4671 106977 293041
9976 293041 515112 615897 352166 44462 324065 350157 3577 -5591 -196237 -374795
9966 -374795 -373256 -333828 -238414 -39754 319852 366094 65061 4326 -176364 -139595 -263463
9955 -263463 -246572 68704 -31952 -301828 24312 -22726 235462 284100 173642 -182953
9945 -182953 131316 387124 223715 67647 349724 701081 277995 -22877 36787 136039
9935 136039 -176457 -603414 -761228 -663752 -573932 -273873 53220 386266 439795 409474
9925 409474 75725 -22723 177394 -95441 -184740 -82994 327777 -6862 -252639 -207972
9915 -207972 -375940 -809240 -629609 -544244 -164727 180867 412407 344698 240376 -195578
9905 -195578 -132206 249343 70451 -111811 1402 272472 478978 479576 303250 -99149
9895 -99149 -191762 -342813 -523283 -235850 2972 253679 480428 35312 -308745 -400664
9885 -400664 -350676 -370626 -316880 -678267 -812851 -246294 -322948 -379210 -81650 33373 202986
9874 202986 144899 40671 67609 126549 283971 419757 495958 339046 182355 26030
9864 26030 -229998 84430 455030 643980 577174 380849 182424 365070 257383 415277
9854 415277 661820 681385 420898 260475 -208108 -61240 85823 210334 330905 721300
9844 721300 726085 835990 578665 277185 2435 -40956 -174828 -437840 -188776 234932
9834 234932 541353 695726 662243 633671 451943 241959 -163927 -338684 -177134 191248
9824 191248 445009 469551 117932 -154202 -459037 -664632 -69433 434633 101017 -197218
9814 -197218 -458634 -616982 -950468 -811877 -447827 -200572 -50237 200667 291856 163743
9804 163743 -23059 368066 58712 15210 38264 94060 295840 388165 202844 102585
9794 102585 -183695 22877 28736 -180899 -385733 -230724 -55995 -121578 -112158 300594 106375
9783 106375 -33239 -181521 -255349 -457554 -698709 -310660 126072 352434 628223 735777
9773 735777 743046 824878 819192 347350 367713 192259 217616 125446 -31687 -172957 142164
9762 142164 149994 84837 396673 421942 73813 -152251 -138655 118959 145311 -15769 -50466
9751 -50466 132536 34942 115559 280528 406977 457851 472768 -37712 -484934 -691243 -597448
9740 -597448 -467548 -490216 -578735 -611202 -360166 -256198 -484961 -374562 -375479 69325 410505
9729 410505 393950 280049 212322 276426 439334 350150 254598 372901 154386 -309167 -430915
9718 -430915 -302477 -185481 -220298 -60967 600045 561962 633437 652678 539684 -59800
9708 -59800 -498186 -514271 -297002 -30785 -102079 99046 319772 429478 474688 521494 538777
9697 538777 358365 433339 544363 284890 -351382 -532681 -354468 -315351 -485802 -453385
9687 -453385 9941 102073 86276 291220 143663 92865 -15368 151571 275760 -170820
9677 -170820 67219 251354 -47651 -29871 283590 308901 278137 233131 357085 150423
9667 150423 -25286 -137866 183205 407232 380420 230816 324452 172418 127476 -13432
9657 -13432 -115366 122725 529766 708900 681274 470643 324034 117612 4944 244835
9647 244835 332847 472226 452710 181062 -25332 -109600 143389 224591 152874 36832 -48098
9636 -48098 -70340 396928 101465 -58290 435083 424274 276379 16268 -64949 66131
9626 66131 55398 7724 284093 23461 -678502 -872627 -902800 -957917 -493462 35845 42764
9615 42764 189321 143986 -122099 111693 83288 108233 47540 -208000 -246136 -435166 -294758
9604 -294758 -237380 -224626 -31705 -51329 76300 87395 56315 275150 262361 202583 225300
9593 225300 319138 174978 56261 68324 160893 334999 530903 556164 492331 638439 458997
9582 458997 336558 688644 886018 484586 122884 -124178 14133 84584 -27233 -47209
9572 -47209 -61330 275052 491491 838842 976146 549666 314539 640662 584083 136196
9562 136196 19290 63293 146175 172786 105013 279169 312942 -89188 -207345 50421 347418
9551 347418 623894 600851 471254 327789 -154154 -425778 -210836 44771 -95530 -13684
9541 -13684 206888 58107 -233705 -35416 216726 191345 582820 512607 677029 722130
9531 722130 167168 -181398 -155750 163014 231143 593302 686080 672975 318320 170355
9521 170355 61754 -277444 -291691 -82841 232312 413369 245567 125336 -50933 -90057
9511 -90057 -193250 -364381 -357712 -44978 417585 307460 126813 -74779 184899 188780 281869
9500 281869 457305 467576 90846 -228805 -732158 -707834 -260499 223016 418669 394904
9490 394904 476065 106128 -429090 -440357 -240751 -502260 -309402 -182199 -187291 24606
9480 24606 180615 312048 -4373 -49149 176848 44230 187917 553964 461201 -120065
9470 -120065 -371863 -414526 -457583 -445950 -280811 -178312 -212426 -304974 -178830 -83050 -277328
9459 -277328 -151089 8031 317971 600522 622687 565775 437396 176070 148949 -126190
9449 -126190 130968 269318 94020 172185 332516 123990 81768 65230 -267659 -700799
9439 -700799 -579607 -400717 -153954 -112965 -270569 -227471 -42207 172094 172609 13160 255029
9428 255029 281497 317495 458476 429255 331056 151537 103108 6106 -71618 -2950 -94242
9417 -94242 -221323 100076 589834 656731 810845 564268 426506 435706 -40043 79030
9407 79030 335301 370713 558535 376775 411811 439871 616147 886466 912423 1045961 703102
9396 703102 453277 548984 520413 113745 29396 144548 231199 -182278 -396159 -137541
9386 -137541 188290 279967 221250 254852 438666 689527 749257 491727 565610 752680 498708
9375 498708 284268 503754 391961 169089 167152 282024 587452 436276 33754 -53459
9365 -53459 123398 464139 512340 301599 41666 -39095 96149 60865 113 370517 670625
9354 670625 441784 -28062 367870 779389 488875 382291 233667 544378 932932 535302
9344 535302 30897 -290176 -25490 392898 411047 280824 208607 105245 320781 294567
9334 294567 211518 534197 514160 723859 671341 457154 715219 837155 237462 -88296
9324 -88296 71284 345433 531340 321391 239642 151062 173170 150205 265983 251931 253663
9313 253663 540150 601688 351609 676722 1040374 874437 662396 321725 -101101 -74619
9303 -74619 140197 345678 573012 327037 -95019 -522781 -558169 -274679 -250349 -58172
9293 -58172 30289 240952 70573 90719 -15330 -103908 68915 33318 38800 300057 372873
9282 372873 527294 806826 938081 971525 942937 1080681 947066 1051023 893569 831081
9272 831081 1262960 1545773 1694276 1636306 1677099 1403336 1300550 1233153 1235815 1502381 1919280
9261 1919280 1888123 1997768 1878053 2185988 2119256 2192921 2677738 3021607 3217227 2972163
9251 2972163 2658025 2479751 2239022 2040208 2266553 1985066 1681022 1792637 2104258 2193623
9241 2193623 2034490 1570699 1534184 1937920 2064437 2176868 1906707 1489086 1283979 1050797
9231 1050797 775918 564725 576927 747108 793885 634116 502644 708210 998997 797187
9221 797187 570037 568360 580587 800063 1050186 938478 450037 649078 671401 398828
9211 398828 655966 547483 463759 784332 715771 440070 294163 -14286 -25270 125324
9201 125324 87501 87689 434392 503333 381210 89868 -57799 156151 815938 1109626 897013
9190 897013 850001 604617 253657 509430 575766 436261 663302 614021 266353 217088
9180 217088 435555 572973 692735 793846 749449 1060661 1240045 1072601 998105 1114705
9170 1114705 1323919 1357601 1339061 1458738 1588532 1596409 1539560 1369915 1644376 1653308 1713711
9159 1713711 1720048 1797997 1978071 2169538 2124279 2306541 2682113 2977641 3255628 3450172
9149 3450172 3578378 3666469 3758177 3840311 4034035 4514255 5110802 5729194 6193641 6730735
9139 6730735 7020421 7850359 8804339 9602354 10433063 11225130 12409318 14038429 15402648
9130 15402648 16849172 18304604 20071343 21999336 24116009 27349728 31205984 35201482
9122 35201482 39160265 42980921 47280671 52626625 58199043 63680698 69743751 75872925
9114 75872925 80420081 83688164 86969917 90694729 94563628 98362104 102745710 105676242
9106 105676242 107681301 106874198 100360669 89790730 78401255 68217548 60314914 54674924
9098 54674924 50417128 47438182 44898003 42244863 39801450 38251932 36742743 35376794
9090 35376794 34081893 33168853 31935210 30619427 29874570 28875233 27574552 26838252 26125378
9081 26125378 25346889 24565718 24125968 23777546 23493042 23296879 22872278 22264345 22077882
9072 22077882 21738448 21175449 20704972 20733558 20536416 20128457 19507755 19087591 18733763 18133029
9062 18133029 17417084 16917571 16208025 15732215 15184197 14771038 14428593 14134690 13656204
9053 13656204 13508589 13250750 13127318 12581868 12124311 11837268 11698919 11614178 11629782 11668445
9043 11668445 11643221 11513516 11587170 11471474 11202099 11000457 11133540 10759899 10363119 10250281
9033 10250281 10469524 10571100 10549370 10679678 10852141 10768979 10752041 10939327 10799439 10551002
9023 10551002 10376482 10521394 10663812 10724360 10406034 10185458 10244669 10172388 10448764 10815658
9013 10815658 10857437 10816080 11008085 10917795 10440946 10464004 10474145 10531434 10719075 10442941
9003 10442941 10435135 10672791 10650744 10644439 10492592 10185669 10402854 10512090 10517239 10333195 10634847
8992 10634847 10446937 10128145 10009484 9514647 9237255 8829230 8476289 8220571 7645110
8983 7645110 7331381 7310588 7458983 7246834 6898533 6734230 6463714 6504185 6329234 6283806
8973 6283806 6183244 6060540 6064144 5688086 5827269 5589612 5288583 5300058 4944844 4649139
8963 4649139 4613059 4610267 4396817 4311441 4508482 4498017 4618541 4643697 4658279 4773689 4826306
8952 4826306 4656940 4539350 4256103 4152066 4223029 4187324 4311370 4060493 3752106 3714984
8942 3714984 3640513 3603815 3560492 3616754 3248501 3030996 2984504 2954694 3168888 3371658 3094236
8931 3094236 2994557 3217416 3257880 3192991 3094825 2947938 3201778 3564897 3455004 3077007
8921 3077007 2847299 2980026 3192356 3305862 2950818 2983849 2914068 2928927 2817889 2895096
8911 2895096 2745189 2996914 2790757 2271137 2383949 2496408 2329758 2274835 2179811 1940439
8901 1940439 1925208 1356356 990567 905622 1267588 1181412 1103788 1156525 1189070 1434049 1710594
8890 1710594 1920630 2059401 1811883 1720673 1480531 986696 905682 961062 1406757 1621103
8880 1621103 1457608 1139112 1008794 896187 977873 1305269 1316776 810995 615251 792710
8870 792710 893686 1149444 1197090 776933 361350 528385 604010 601930 523205 683198 887148
8859 887148 750336 413590 197115 284718 412126 762380 461385 407656 766347 983215
8849 983215 1030649 813404 314372 328382 551602 544856 478145 542789 850870 1067490 1154043
8838 1154043 724683 378683 9206 2024 100515 294393 553536 563937 -29126 -520454
8828 -520454 -421449 -139713 200015 485344 383090 449336 868676 1256767 1418560 1135675
8818 1135675 792494 518497 339795 280738 396762 558600 655057 355942 316544 430644
8808 430644 448880 462386 451167 363620 399393 397776 370400 653783 1142669 964912 808634
8797 808634 619379 865630 913215 1054095 809412 813104 821761 760086 782840 806130 988699
8786 988699 1017392 898914 1000161 960688 927205 835870 626981 722411 755941 695497 524085
8775 524085 594080 566339 500703 442254 491794 511400 685255 581553 622301 730808 813379
8764 813379 448961 493066 744953 1116829 1054914 925758 820045 661544 698133 741281
8754 741281 901111 1227882 1416188 1311966 1111094 915753 500968 291194 296589 473216
8744 473216 509165 425778 500051 851572 673001 802206 920508 1042387 854803 671882
8734 671882 363686 232316 -43225 -95640 8387 486191 753203 646092 499091 57189
8724 57189 -49088 156621 717610 763817 752056 544797 790553 1169933 983085 781408
8714 781408 867565 917041 762255 575895 667603 696482 760596 985021 790259 475522 600198
8703 600198 597876 355312 520910 598309 565281 711143 860288 800884 851425 1008502 838485
8692 838485 404077 289058 441405 731442 805300 881447 710877 266827 236737 343784
8682 343784 286221 281159 314020 359592 249034 115877 61309 149771 360322 406590 248784
8671 248784 407629 412912 511522 747848 667241 561931 352212 397205 172515 23908 238612
8660 238612 179172 183047 328128 637594 614349 679269 552404 384983 678578 729238 586675
8649 586675 759764 695138 550494 544164 747157 793260 657639 736853 805766 1119789 1489034
8638 1489034 1540692 1282155 1280672 1226635 1141429 846850 1096895 1260261 1167318 741412 534888
8627 534888 807534 905507 1120661 1506047 1447114 1190757 1560757 1936482 2048229 1854246
8617 1854246 1593796 1464511 1402735 1489537 1577030 1894984 1856576 1634146 1617869 1850460
8607 1850460 1902673 1704833 1745520 2009086 2083818 2130816 2344330 2128126 2338010 2353265
8597 2353265 2479435 2783342 2759347 2675548 2928843 3093934 2756100 2893168 3087562 2998129
8587 2998129 2611229 2252837 1790566 1787025 2038779 1881235 1558368 1591601 1414367 1243449
8577 1243449 1265320 1485650 1680925 1722068 1582906 1597409 1535614 1343793 1339443 1443499 1435093
8566 1435093 1522277 1283595 1247937 1204928 1113089 1063016 1228060 1211112 1282370 1153250 1253141
8555 1253141 1531587 1462060 1130473 736055 757673 991633 901392 787814 909248 947396
8545 947396 740790 880533 631710 425852 776803 1287906 1381693 1639378 1741917 1682649
8535 1682649 1646820 1099465 935962 1279431 1161862 1136983 834200 747280 1214733 1495802
8525 1495802 1060845 717916 825579 1092821 1215992 1185918 1243944 1426790 1262248 1156353
8515 1156353 1132950 983800 881014 843799 1142238 1065768 958215 813009 800613 1322477
8505 1322477 1441541 767383 370527 280469 174183 151657 478661 710570 1004306 1294614
8495 1294614 1234024 980053 633443 492662 648003 705359 790794 855754 648930 329724
8485 329724 153898 223244 479635 281362 428464 529620 886667 1361245 1314594 1085591
8475 1085591 596168 516568 338068 358239 568868 406741 603945 766133 979864 1468925
8465 1468925 1262971 800561 349503 676966 923864 985130 879466 866820 813168 686056
8455 686056 849361 708142 405111 535170 674919 382174 234716 339566 724444 553848
8445 553848 750182 901822 770879 654099 366038 354086 595294 640578 450143 559792
8435 559792 341712 165962 101041 39787 -2108 67055 -219023 -284629 -222190 -72651 356937
8424 356937 487479 604863 668093 850094 902467 426596 477237 416086 457510 657161 555512
8413 555512 273226 219683 141361 508611 796776 733415 309289 -4244 275936 519166
8403 519166 277660 432334 330127 229758 445016 518087 664828 629612 337909 -80186
8393 -80186 -80949 -145361 203808 41117 -302839 -447256 -555172 -570102 -389450 -202452 -88554
8382 -88554 -147936 59156 418962 255804 31461 119789 369674 146328 -171551 -172628 180386
8371 180386 282281 314863 624274 709517 645128 609374 459226 386539 363152 303643 153894
8360 153894 -76118 52003 -35917 62889 -102747 -74606 -9277 168035 395081 -149988
8350 -149988 -346027 -28512 12922 143220 247612 305303 -1800 43901 151553 118479
8340 118479 59164 -147087 -79684 -82398 305279 334704 401157 672091 886682 620214 261658
8329 261658 85118 306789 432460 517833 432693 414973 543237 381987 138381 37509
8319 37509 297933 396509 279205 342727 289436 9868 110461 203729 145283 221957 228193
8308 228193 536965 321988 187758 170207 142373 41034 25614 74437 347954 227570
8298 227570 -191689 -445512 -404868 -52829 162832 292453 331965 131666 -9812 252040
8288 252040 85457 120190 287092 402263 489946 428613 339594 -16283 -676716 -737220 -185949
8277 -185949 -111747 32156 446592 266606 333717 473014 514849 672698 554336 163862
8267 163862 -75444 -6934 317145 324027 214703 111318 284096 452511 627722 464397
8257 464397 -229210 -582839 -328716 59012 567525 596820 72634 -38117 21062 -301745
8247 -301745 -431694 -292995 -275356 -227555 -289323 -148221 -10407 -26564 -266962 -385416
8237 -385416 -463037 -735506 -714614 -372314 207453 476637 232441 -52421 -527646 -848695
8227 -848695 -552792 -142815 -29761 86623 285481 626079 728312 669636 545236 539045
8217 539045 230676 143115 196538 277705 75083 -95709 -76737 -199852 64780 421365
8207 421365 270098 201303 -10928 -242100 -341927 -134908 -83954 -21102 -84043 -340838 -389329
8196 -389329 -374779 118658 363312 593523 601718 300950 234272 274522 180430 44545 -178703
8185 -178703 -240702 -204103 -259615 -310588 -158983 311070 876519 797303 656188 606307 652870
8174 652870 515841 290899 70336 123226 166277 -113551 -289746 -313027 -74847 44785
8164 44785 444073 584451 555783 674763 331343 568369 566039 60304 -14312 171650 373623
8153 373623 696509 1096228 1252663 1266799 801049 527165 285192 406735 -59970 -604634
8143 -604634 -302655 35136 114515 -157406 -346739 -313550 -524944 -104078 75383 -53439
8133 -53439 20003 150445 -77400 -463398 -501034 -205767 4463 -83633 101733 370668
8123 370668 81142 -171254 -335888 -318975 -105541 76676 212071 -190210 -496823 -323801
8113 -323801 117284 175831 9136 129621 325815 368801 323603 268699 -97357 -112916 184337
8102 184337 399498 585075 412569 239941 323525 488385 543502 196370 -86105 14404
8092 14404 317316 477098 596350 454883 394768 120636 254998 353426 315291 254895 246048
8081 246048 368132 954514 1193915 754057 416030 461030 496168 397532 389071 7586 -559131
8070 -559131 -604707 -265706 99016 335483 360354 543228 848088 759295 975415 1254195
8060 1254195 829732 242492 88484 470476 732205 877823 614091 684188 578111 861677
8050 861677 1151807 939091 792890 721465 743067 705845 396716 540083 921077 812810
8040 812810 658999 148926 -8533 -4108 280135 448779 378702 440186 389232 501312 483006
8029 483006 455381 346769 265221 17946 -30168 142687 812368 1003645 1154892 873253
8019 873253 658855 353812 261967 528347 360018 752024 1063671 1207634 1488970 1787445
8009 1787445 1890542 1607560 1469154 1405250 1047732 835865 859725 766292 890880 1092072
7999 1092072 1250940 1198712 784201 339060 606744 848275 882895 648583 620479 576854
7989 576854 782358 587502 566425 606016 467938 609965 732825 1000624 1003813 780934
7979 780934 1083657 1393249 1553068 1389920 1425860 1471619 1255436 1066876 918841 646617
7969 646617 1256115 1382341 1445174 1410234 1564050 1549957 1401722 1464021 1449849 1745763 1606217
7958 1606217 1606173 1211198 1073272 957489 951215 889354 916022 1266255 1364607 1711887 1684678
7947 1684678 1317636 1305713 1522856 1544005 1776076 1534478 1519670 1426476 1250730 1100965
7937 1100965 1170443 1312597 1479241 1642402 1517961 1480540 1607676 1414883 1469407 1349173
7927 1349173 1096073 1254444 1221208 1359190 1361548 1462170 1905151 1877270 1868552 1624620 1337795
7916 1337795 1023358 857444 1148209 1326921 1077054 846687 873594 783578 742714 606694
7906 606694 544387 982725 1137274 1269262 1353692 1492843 1705575 1738152 1482874 1500217
7896 1500217 1770193 1448521 1218316 1205732 1334439 1352841 1282126 1259808 1038466 455213
7886 455213 564421 849406 728527 748914 968713 995076 895405 717309 641570 861145
7876 861145 1070904 1267731 1172312 762129 735920 1083778 1356163 1245776 1211466 1053680
7866 1053680 854720 570207 377025 374717 728938 847757 1038248 783323 961345 697500
7856 697500 691949 635728 826010 757999 510694 446851 510099 610089 744599 738060 709127
7845 709127 953760 1084330 1106185 888872 686042 562983 851735 816408 701758 860166
7835 860166 954748 620601 359476 304243 261307 332310 -45958 -168861 6005 -44785 75972
7824 75972 333800 414132 394114 370758 452863 356088 310700 446149 751413 762537 1048618
7813 1048618 1088441 1025824 987092 1022629 931089 647372 597929 390008 136192 341969 549433
7802 549433 405988 129526 -525818 -475507 12565 140417 273572 172124 -37886 42505
7792 42505 369413 482994 466298 301943 244834 294145 548759 648625 599868 417859 638677
7781 638677 517212 420287 490694 731511 601169 556850 192139 -496254 -666328 -460666
7771 -460666 128425 143488 203786 385092 484810 447477 533168 555468 649456 550827 -37012
7760 -37012 -132772 394257 523501 507168 504285 884655 923250 502631 414383 392278 263017
7749 263017 369357 522538 734306 620820 668459 695961 434659 329228 598310 672787
7739 672787 388466 281945 305310 269475 89376 -246532 -364148 -302184 -73585 218928
7729 218928 34436 -327283 -614739 -412672 -31968 17211 104223 239508 411582 116286
7719 116286 -229495 -221025 15992 274465 581616 733734 610377 232183 -91731 -311067
7709 -311067 -356463 -556953 -426454 -190630 437674 354300 -209498 -534941 -449721 -27709
7699 -27709 11709 54470 305488 356193 257413 528504 666495 562746 855559 980598 516334
7688 516334 277896 277558 464148 287078 168796 310945 400866 427526 273453 -40103 -21467
7677 -21467 255828 472279 27320 -65685 -259001 -673267 -530439 -375626 -840665 -786761
7667 -786761 -548398 -165425 -10193 109178 23262 -167872 -186921 -271664 -141995 -21352
7657 -21352 20768 257095 413790 295793 -111509 170214 196606 -38656 -393404 -9524
7647 -9524 184375 375440 480350 500803 199929 -32279 270984 712057 560039 228157
7637 228157 -34408 177537 185697 224592 266881 192394 187384 524649 538365 516388 629695
7626 629695 762426 618264 618161 530796 24481 -117565 236045 -27866 57677 364453 30070
7615 30070 -164748 -403733 -547718 -726756 -547147 -90633 -146948 -305086 -625826 -404475
7605 -404475 -225442 -270928 -351130 -250051 1075 244190 665249 678922 413140 198952
7595 198952 26889 280742 426388 43341 -118807 -439352 -280630 79381 144913 130144
7585 130144 -71726 -119611 -194877 -147625 -177755 -381161 -286450 169358 326094 318844 367217
7574 367217 216876 -46103 -216449 -509463 -736991 -785703 -420416 -88909 11320 20081
7564 20081 -53813 -136712 56885 -72395 -357623 -761849 -718893 -908225 -898224 -286785 63367
7553 63367 261927 -151905 -532269 -807955 -776623 -256618 -256818 -196425 128106 -27306 -501488
7542 -501488 -438720 -72077 -104092 -376867 -150357 308698 474832 166446 -131391 -476662
7532 -476662 -713193 -796125 -658215 -599450 -761867 -732325 -680205 -455701 -118025 161674
7522 161674 -251638 -221089 -194215 -142282 -96332 -340917 -431711 -254678 -253611 135958 -1555
7511 -1555 -76261 157255 560171 473586 145830 159494 337111 612027 619540 370429 184676
7500 184676 14919 639656 534604 362085 208861 279896 371508 83800 -26087 -100073
7490 -100073 -150811 -321848 -127491 -123329 -137603 -38876 26758 -2031 -200740 -250049 -324408
7479 -324408 -513904 -183305 183369 -224203 -280231 -549279 -609179 -262045 77513 174259
7469 174259 485132 589737 444397 246211 256032 142987 -301121 -260028 -7274 284918
7459 284918 191927 -111158 -462372 -94188 18500 -51491 93821 159952 103001 118378 155639
7448 155639 39816 -99111 -188262 -320010 -144436 98633 316128 534914 628717 341492
7438 341492 389768 526260 609142 708513 615715 205376 182530 211835 -52615 -273110 -224888
7427 -224888 -206432 33785 -131874 -348639 -224767 16042 -224036 -147074 -272323 -247448
7417 -247448 -258822 -779020 -830537 -310059 -33475 -173947 -222450 -188912 -96481 -127757 -124815
7406 -124815 -111254 -41648 159467 -139675 -34018 270145 269517 -14054 170736 100679 -53452
7395 -53452 -100066 -109047 -143247 127102 106848 187618 281135 271635 -158979 -76397 -119432 -85698
7383 -85698 42219 -25479 -232851 -314507 -324642 -536694 -366015 -110874 -285618 -272197 -135320
7372 -135320 -100776 -223382 -352631 -411649 -402011 -436694 -273945 -170274 -84038 138300 621013
7361 621013 664386 474844 331909 35351 -237105 -588379 -412570 -147853 -74435 42139
7351 42139 171341 -282097 -494997 -259573 -60079 203705 402810 479149 132633 -182865
7341 -182865 -271664 -514597 -822162 -658013 -320249 -196850 -383029 -709887 -829840 -751481
7331 -751481 -184241 -259008 -648367 -551969 -520890 -479010 -332595 -587439 -359223 -321933 -283373
7320 -283373 40019 139748 235582 -22271 -220504 -150206 -266314 -346343 -248992 -17853 202032
7309 202032 -13606 -181543 -139094 -166755 162879 509680 752462 630584 211969 -315610
7299 -315610 -373146 -325658 -289126 -466277 -472671 -163085 -327923 -126554 31570 -266824 -517930
7288 -517930 -383545 -77840 -14827 -182607 -86494 -73784 16413 -249521 -392634 -205713
7278 -205713 -44352 202795 146448 -140255 -10385 36690 -53074 -199964 -119023 -79491 120577
7267 120577 151643 -100857 -92848 -280911 -685351 -917594 -615252 -449257 -308878 -374656
7257 -374656 -246377 -229457 -471228 -566723 -548878 -135678 168565 47861 21798 -106422
7247 -106422 -201326 -244780 -210877 -141093 96664 415810 458586 642148 624793 724453 528559
7236 528559 130417 -159769 -225974 -55609 136063 -157637 -103983 -77168 -172511 332420
7226 332420 431750 -188794 -227526 -53279 -35151 15968 35225 3741 -71184 316397 360308
7215 360308 387988 637235 701628 505663 289979 465203 266965 -31458 38006 -189576
7205 -189576 -634157 -545593 -187075 170425 -32876 -375804 -186983 -92289 69135 278744
7195 278744 530170 166400 102978 165216 184921 242903 -216762 -266403 -31032 -110594 -132345
7184 -132345 -120379 -253779 -152487 4456 191056 22237 201125 -35163 -532850 -566822
7174 -566822 -184283 195367 -350472 -206732 37896 87180 381916 321116 101338 33007
7164 33007 235584 510680 477213 347079 307767 132534 -72899 207227 486653 -41433
7154 -41433 -171676 -34657 129255 528210 313771 129488 -86467 274379 24146 -223927
7144 -223927 -414975 -253186 89073 11652 118751 133440 79872 -173230 -295858 -167320
7134 -167320 13051 142148 53618 237876 195569 -115728 -600942 -475343 -266491 -480037
7124 -480037 -475890 -368149 -390970 -411878 -269163 -307367 -164448 -221258 -284406 -79813 -81633
7113 -81633 243995 225186 333234 262616 -133422 -327149 -350643 -354171 24986 -329922 -342268
7102 -342268 -57147 93985 63716 -204524 -214839 -360612 -150457 -415792 -547766 -380707
7092 -380707 -51671 -72646 -69476 134884 340628 658895 542839 248916 -270633 -195757
7082 -195757 -79821 -80214 281006 455557 234285 148934 44561 -137716 51452 147924 -275678
7071 -275678 -303338 -332053 -99207 283583 569474 486258 479169 282192 -5703 -237881 -378203
7060 -378203 -398464 -425558 -345905 -280068 -247707 -225006 -104552 -138827 -202526 -303264 -542253
7049 -542253 -743264 -434856 -446506 -505012 -423653 -162533 -338962 -648569 -517341 -299136
7039 -299136 -69554 -107506 -250522 1646 147032 -75602 -496546 -520219 -726691 -524768
7029 -524768 -222425 -61167 95276 292435 252640 100890 201313 406192 584223 301441
7019 301441 171760 -167071 -223484 -148264 -304808 -436133 -66174 176090 11505 -172771
7009 -172771 -440783 -492753 -413287 -270938 -222559 -178761 -119298 -226962 -364849 -371272 -590712
6998 -590712 -492750 -256870 78829 18870 -157018 144591 277019 176718 -58068 -89123
6988 -89123 -58637 -188436 -22249 111425 -39496 -361772 -526722 -474368 -62317 -10222
6978 -10222 50442 217638 40677 -300558 -159571 -106822 106398 -46931 43599 -76734
6968 -76734 -269586 -186298 -160102 -139779 -153000 -223721 46818 317747 112301 -138686 -257826
6957 -257826 -137413 57952 32902 169839 295152 27215 133554 270979 331167 281004
6947 281004 73732 -62247 -35955 -90523 -557402 -590280 -226582 -68340 114376 155444
6937 155444 247928 279789 120700 100025 -170552 -181616 76275 -22784 -475711 -637786 -493064
6926 -493064 -83346 152512 98809 120331 -48062 79696 -137202 -304243 183859 812393
6916 812393 1090055 683785 218212 312365 35582 -445297 -434032 -339891 -346964 -284560 -162099
6905 -162099 -101729 -50167 21543 -89181 -16280 252725 49245 -160053 -42657 -49893 69963
6894 69963 201712 -201444 -339459 -198249 -148973 -418070 -380569 -175422 -119561 -96175 -185260
6883 -185260 -248692 -414293 -528220 -236285 279068 553590 620599 379335 42247 -247797
6873 -247797 -297369 -202199 -248146 -334781 -141652 -254261 -330966 -314435 83011 341806 -56414
6862 -56414 -254963 -313176 -557193 -31661 194807 255056 94120 -159012 -181257 15148
6852 15148 292641 264603 239899 689538 496011 -109575 -237731 -185265 -487067 -505289 -307696
6841 -307696 -338494 -225874 -245497 -578311 -863998 -748772 -406157 -356501 -276866 49890
6831 49890 55786 -153546 -683270 -402237 99269 -45407 -204638 123765 154759 34523
6821 34523 -216056 -199660 -128098 -329769 -149690 -57981 -235390 -356919 -553839 -709351
6811 -709351 -433434 -355508 -294822 -310287 -83594 94514 -362359 -209108 -150075 -386703
6801 -386703 -527933 -626021 -464479 -599382 -488831 -104165 242758 442488 89292 -247402
6791 -247402 -199004 44037 -266002 -111334 -60113 200342 251666 180062 21678 -509 -283665
6780 -283665 -123228 119557 -112195 -281851 -332217 -96267 -7222 -110308 -124036 -14672
6770 -14672 54980 -207673 -560954 -670217 -550615 -3980 177784 -51659 -203779 57761
6760 57761 451324 219152 82125 -102636 164749 -53448 -349855 -251159 277 222619
6750 222619 605900 542054 4241 -141319 -510983 -376446 -271867 -152209 -57603 96187
6740 96187 30420 90861 241592 255330 601172 1082034 814783 368463 383014 231549 192936
6729 192936 162459 402291 350963 65946 4228 144779 282937 281445 163169 175425 610862
6718 610862 683849 196586 105605 314554 430827 177540 -105346 170482 680468 766823
6708 766823 438667 542350 357408 315273 435078 370084 -70694 183748 641826 579331
6698 579331 329889 548242 488414 205490 267855 50075 -201080 -260304 -407381 -527502
6688 -527502 -426575 -47280 113713 -13480 134058 75626 196320 561295 499454 254866
6678 254866 260855 238317 -93965 -472135 -620104 -470235 -5826 136739 317140 229494
6668 229494 -230202 -414820 -486693 -565974 -332855 -750 216762 -46442 -173492 -220944
6658 -220944 -572666 -623883 -365511 -55871 -148412 -337710 -256270 -274671 -207587 23465 49864
6647 49864 -468322 -684688 -510147 -454796 -189599 181404 -36373 100539 404296 223639
6637 223639 -70893 -124283 13132 210190 1407 -69940 38858 -176794 -621432 -493057
6627 -493057 -246046 -174238 -295172 -378480 -276523 -340520 -107053 138993 103166 13492 -138477
6616 -138477 -113732 -157323 67297 352603 140099 7981 466691 461608 191068 168646 101892
6605 101892 -6722 210670 285727 -64380 -327823 -764739 -456671 24467 -365019 -716524
6595 -716524 -481641 -75158 182585 539123 441422 86479 80161 316071 58947 -126828
6585 -126828 281032 451524 261624 206774 56226 -189133 -180628 -26007 215270 282966
6575 282966 340074 460319 262710 -16157 -97699 -200222 -379932 -619911 -293984 -253947
6565 -253947 -159705 -158247 -311619 -161327 30260 240744 233871 137702 97160 -94225 -422751
6554 -422751 -725836 -556941 -523623 -298310 -16716 18208 -25826 -149017 -422509 -426431 -244809
6543 -244809 15110 241558 276950 282607 10638 -142869 -158087 -19683 14092 -27685 -100068
6532 -100068 146651 326484 379990 246318 -28160 -215355 -212227 -179802 -261138 -577340 -487631
6521 -487631 -388285 -207486 111712 2566 -475649 -936049 -904117 -708528 -524270 -437676
6511 -437676 -401895 145718 205328 119148 238220 333138 616345 452093 374260 250961 334270
6500 334270 444300 345636 202519 -21173 19856 392448 378594 244884 231568 -57479
6490 -57479 -391803 -361887 -389158 -117359 20326 -75359 -250855 -132737 -140761 -179947 -118930
6479 -118930 -175566 -172867 -237150 -372049 -211593 -77101 -5680 122850 30947 -63547 59639
6468 59639 87635 221062 177544 122258 69484 58483 87704 -77731 -100172 69068 355792
6457 355792 369916 515498 114840 -155708 -42790 195426 528713 592175 233570 -25678
6447 -25678 109963 235389 279633 427439 315399 110516 3192 100838 196617 -278723
6437 -278723 -359664 -254077 -330585 -307642 -279265 -422881 -721141 -394072 -611705 -1005763
6427 -1005763 -764342 -643903 -736967 -716525 -572546 -705568 -448583 -237623 -228791 20266
6417 20266 384686 49696 -121163 -413646 -508197 -209090 -235798 -507395 -521133 -621382
6407 -621382 -445006 40102 496186 420985 206899 -50004 -245169 -89997 222109 233133
6397 233133 -25522 47558 -27930 -221948 -149648 164491 -105392 -6160 -49237 -131486 -245820
6386 -245820 -99968 158529 148638 -255221 -323761 -8680 69966 -113808 88383 386179
6376 386179 154236 -279367 -873037 -754315 -598486 -371718 -256499 -133653 -172787 -107122
6366 -107122 -46574 -22503 -276724 -347533 -46535 -295724 -652257 -953532 -823185 -502331
6356 -502331 -49651 -189055 -290934 -435609 -292126 -169204 -282940 -46489 136975 48942
6346 48942 97945 880409 942679 387695 -79934 -121998 -32196 -45566 -223230 -566958 -658123
6335 -658123 -463824 -131376 -244684 -373741 -85100 28920 -214179 -191075 -150374 -29963
6325 -29963 95155 34813 425339 540444 129817 -20920 -294261 -241565 209086 525723
6315 525723 395889 159388 156900 214455 326207 -2048 -335395 140609 370148 671210
6305 671210 533009 47083 -468834 -716567 -348523 -210363 -238194 -452373 -376670 -273102
6295 -273102 -172018 -185716 -259700 -287814 -81229 253965 325793 60019 -219307 -407943
6285 -407943 -208609 62715 -90215 -94523 -364964 -140391 -178102 -217490 -396586 -598828
6275 -598828 -459319 193107 448342 51646 72620 155804 -69917 -193193 229982 106875
6265 106875 -158451 -501874 -356359 -383734 -273730 -346672 -466354 -466639 -416242 -504994 -339017
6254 -339017 -222598 -75224 262727 444991 481615 344893 438021 496306 477982 169742
6244 169742 -81420 -494055 -840703 -497740 -189460 -333279 -291354 138707 410115 111927
6234 111927 103776 137000 -120302 -345172 -418135 -355906 303049 405502 153249 -234854 -511077
6223 -511077 -540271 -341481 143757 318683 216332 81786 70249 143350 90286 105619 8244
6212 8244 165182 59391 302112 442268 275278 -114581 -212912 -115781 -77904 -197416 -46856
6201 -46856 -27133 97612 151983 114868 -107409 -119016 -274194 -430865 -300699 45925 277120
6190 277120 9511 207045 195324 44840 -268547 -414648 -445808 -646925 -548226 -293368
6180 -293368 -353444 -618580 -415625 -525594 -673706 -285512 -134048 33807 438920 200245
6170 200245 -220602 -335650 -361980 -438970 -208940 -194431 -387851 -845642 -933164 -460518
6160 -460518 -81229 132819 350317 226735 -58626 -261486 -288239 -172295 -59190 141981
6150 141981 220125 111276 -92399 -153704 -230615 -452937 -230238 103718 -343681 -616211
6140 -616211 -537740 -451134 -109949 -187477 174334 427883 14788 -223508 327594 544500
6130 544500 -89605 170885 41560 -394859 -433886 -414140 -400892 240301 238513 -18298 42920
6119 42920 482262 562031 229851 178881 123958 -8639 -60692 -59040 -114677 -83704 -169701
6108 -169701 -219058 -73524 -100083 -129579 -14967 177938 196986 153713 448868 387039 205050
6097 205050 252037 470989 274215 -150227 -658220 -727172 -436658 -236745 -82011 60616
6087 60616 171872 177594 -1810 73572 228425 391380 197791 91588 359169 493922
6077 493922 676154 357474 1280 -319278 -539701 -513225 -385945 -32430 -168072 -452259
6067 -452259 -418954 -292072 156684 475434 582846 532409 396412 147604 -45462 -42341
6057 -42341 152600 -97391 -231261 -281247 10073 208025 195535 30357 199368 216861
6047 216861 101417 -194188 -169181 185064 288765 362302 -21621 -291034 -329086 -261474
6037 -261474 -308162 -364863 94408 379875 -20221 -45033 -302029 -312514 -256382 -60839 213779
6026 213779 112214 -25044 -20100 5970 -113979 -139378 -79952 92091 346307 318849 428693
6015 428693 184586 -169061 -105703 74335 -123762 -540622 -348947 -177819 141657 365237
6005 365237 198364 92387 -277244 -541620 -585067 -166349 168611 245615 211868 464677
5995 464677 437383 371292 242724 34797 -57762 -123285 -152154 39 279166 152727 277303
5984 277303 358892 271016 347215 506561 648230 560246 414684 -122023 -186505 -310191 -277036
5973 -277036 -338813 -489229 -652464 -908089 -501125 -205402 -74378 -169991 -711362 -715507
5963 -715507 -836266 -673582 -711595 -393204 -371769 -189161 -89429 -107413 -99553 -129966 -322215
5952 -322215 -298446 31461 122426 34855 -187421 -330464 -530508 -547450 -174384 -119070 -57803
5941 -57803 108547 257587 354419 -145980 -259568 34184 541680 758499 390935 219462
5931 219462 113052 159496 89962 126498 -147649 33691 521310 613018 246266 203222 -67366
5920 -67366 -76725 -89330 46742 303352 394750 550273 543820 716114 542605 467286 428236
5909 428236 537264 564925 421609 439632 239797 -52039 -110766 25913 40763 315794
5899 315794 546013 389714 354109 85635 -231469 -311371 -77152 64178 92332 -229797
5889 -229797 -252928 -243115 -230976 861 255654 225746 572940 6387 89175 145781 -226341
5878 -226341 -264924 -345381 -414917 -233903 -54059 -139336 -252374 -63655 -31560 112670 163838
5867 163838 21039 -352653 55761 272352 467172 371662 393848 356504 184732 -336324
5857 -336324 29854 459454 620634 541057 612299 510291 352488 285595 101550 249167
5847 249167 104935 -74477 -169452 -122511 -259671 -358803 -57586 200622 -26314 43134
5837 43134 317426 259301 42202 189520 75015 -167576 -261146 -509823 -348436 -5980
5827 -5980 157747 214886 174378 566628 489294 312849 72250 -136046 -1988 85147 92789
5816 92789 145783 -117401 -218706 4128 -264562 -136230 -466302 -436779 -396535 -397110 -180528
5805 -180528 -206360 254368 524518 299140 271710 362825 449331 352088 238496 64139 276199
5794 276199 320907 -127047 9756 282200 351543 213741 55084 113373 168420 53652
5784 53652 226412 386799 118084 131815 14831 -44417 -115836 -322865 -27327 223079
5774 223079 128144 -63415 -381940 -372030 -398865 -579628 -475723 -776941 -421553 -46578
5764 -46578 -81984 132099 251549 378416 456296 194060 231917 215351 184336 179390 35197
5753 35197 -415292 -867944 -945433 -919836 -155035 201894 438559 77420 -190007 -260916
5743 -260916 -208716 -32438 -333333 -712458 -731918 -698806 -637918 -740964 -686509 -147810 104224
5732 104224 76098 -126968 -244811 -216326 -204081 -665754 -688836 -121053 45874 -98527
5722 -98527 -3924 75989 -21034 -253326 140036 472856 231950 -87504 2636 78252 -266078
5711 -266078 -150569 492592 642202 72200 152510 330457 555497 418558 200769 196260
5701 196260 25607 -285570 -271989 -42170 -72333 -371447 -412797 -599914 -440472 -385480
5691 -385480 -547487 -524324 -230866 -239213 -309066 -197176 278916 444781 423130 459132 476271
5680 476271 397700 202891 151003 72107 -112383 -47889 36272 201035 65001 -212448 219055
5669 219055 239870 -60399 -66544 -315236 -272823 66252 -150120 -148144 90435 -165457 -259836
5658 -259836 -207111 -309608 -217249 -207924 -322926 -477864 -207581 -225384 -343171 -88402 -307357
5647 -307357 -134162 129685 -78199 -316271 -340651 -140999 -30714 93944 53061 179971
5637 179971 -66741 -143259 -279117 -80520 259795 223889 383874 359730 276317 268283 351829
5626 351829 95341 15666 -283847 -528918 -364140 357150 436815 261715 239302 282974
5616 282974 53806 -80940 -415449 -221121 218992 107678 185469 -165109 -126353 45653
5606 45653 43954 75511 190192 230442 338850 134845 -73510 44659 84218 -100361 -244028
5595 -244028 79589 223371 77244 -195841 -153026 -141645 -29321 45028 -91948 -253832
5585 -253832 -245213 -388119 -347288 232705 728186 450319 130307 191890 474393 489502 533748
5574 533748 293810 219218 265477 281613 173862 242494 205991 220679 16556 -159304 -325708
5563 -325708 -154326 -237258 -329739 -314930 -63696 116969 46878 -83789 204386 152317 5788
5552 5788 137082 208745 702896 502037 46584 -220380 -305149 101119 487650 119030
5542 119030 -27750 -216964 -678017 -797073 -645103 -510466 -411847 -412389 -24101 -67243 -200565
5531 -200565 -276652 20732 296913 247773 -190427 -573493 -447092 74956 243175 300251
5521 300251 132169 -197890 -398946 -476309 -488286 -445339 -406975 -349591 -219365 -183941 -183735
5510 -183735 27015 168926 288867 10680 101898 222867 179689 52972 22018 -117563
5500 -117563 -387582 -381360 -249432 -128040 103553 307679 206931 15733 186554 219126
5490 219126 178505 232081 389283 519757 273051 -183204 -133734 36472 34193 65733 213431
5479 213431 254930 48314 77272 110666 112529 -39089 -227288 -227893 -9877 -105564 -392497
5468 -392497 -476887 -323023 -81499 -322686 -550846 -466852 -196193 -14793 -81648 -195381
5458 -195381 183243 -63730 -446264 -257262 -155475 -114084 139039 100689 282457 5724
5448 5724 -154500 -201650 -182643 -153156 -16572 -118378 -240532 -297617 -515951 -419325 73299
5437 73299 127036 -475209 -371069 -311061 -77144 -25118 -171048 -295375 -243473 95039 344998
5426 344998 -17043 -110779 -29567 -231824 -601062 -322583 -90636 -82505 -370704 -104577
5416 -104577 295816 424747 249864 67389 356231 179177 -120275 -221356 -637124 -778369
5406 -778369 -504413 -195667 -47196 111607 -56132 107851 137661 -96007 -398004 -219260
5396 -219260 129158 353543 433369 321646 49707 -20034 43884 -41593 -26271 78950 142444
5385 142444 70832 -22311 -64368 3168 -193097 -136683 -31383 -104670 -342831 -83564 233323
5374 233323 195493 537153 658398 225806 -277483 -611479 -366751 -132246 -316972 -244676
5364 -244676 -199291 -764640 -831361 -596385 -596460 -327675 140023 159710 193349 197653 67259
5353 67259 -53429 178089 132690 -81502 18505 270288 575250 632574 387832 473849
5343 473849 429376 261083 -35201 266969 330313 196385 138465 -217248 -271991 39189
5333 39189 370943 302470 69228 -246654 -434147 -463440 -311536 -289989 149188 305372
5323 305372 402202 212412 -87506 -362705 -540230 -729706 -426904 68272 339085 566831
5313 566831 221052 194180 -440 -171099 -220241 -181472 -79895 -330717 -336886 69295 365803
5302 365803 292467 82561 261895 397610 287957 136107 12079 -276645 -60581 -68031
5292 -68031 -165768 -6040 33992 -57287 56378 81072 217871 397845 450532 396520 690346
5281 690346 459464 218680 46436 -37850 3664 105399 -83742 -350968 -38240 367031
5271 367031 361815 -90551 -482351 -630363 -266089 -213322 -335992 -371745 -126981 80771
5261 80771 148382 132551 244941 301305 248024 -137975 -329697 -183484 29629 -219929 -167148
5250 -167148 -203082 -215482 -329280 -155968 -412269 -471796 -113526 -131571 -258580 -172190 -100972
5239 -100972 -157545 -337293 -383051 -330859 -138926 -24326 97940 334718 166233 -235143
5229 -235143 -271427 -479925 -579415 -98757 244252 348318 120236 -38561 -20771 262292
5219 262292 517858 447258 354376 128185 -41058 -147205 -247172 18031 269880 480272
5209 480272 192612 -24067 261106 294006 227802 -103693 -137303 250276 122293 181306
5199 181306 46598 -88020 47222 107841 27981 49942 -49590 60279 92132 185989 48925
5188 48925 -290938 -164945 184437 183350 27826 140715 97925 -186708 -301107 -185766
5178 -185766 45695 196064 223696 158755 366672 345347 519825 445516 62844 164392
5168 164392 -61813 -91736 -206901 -183468 -173350 56841 296074 56130 -173721 -146421
5158 -146421 -184748 -325367 -227756 -207323 -245983 262904 680425 802174 683838 314308
5148 314308 188923 534914 843095 873312 630649 261083 25744 -167011 -440326 -433370
5138 -433370 -398396 -338187 -609632 -711379 -494555 -309398 -377838 -88197 346576 200678
5128 200678 32799 -275248 62258 68197 -168469 -265589 -218909 -182775 -367031 -179489 5987
5117 5987 -176506 -143884 179822 292682 76799 259880 206942 -69110 -148948 260646 -266114
5106 -266114 -662751 -285651 -335654 -284103 -79488 137412 377570 468100 595636 237977
5096 237977 47442 27397 -311196 -531119 -406680 -622363 -654242 -528804 -442740 -209752
5086 -209752 -416087 -616439 9997 216933 282425 -39575 -309508 -192798 -130764 102269
5076 102269 69803 -25401 -78106 -9257 -282754 -403070 -80583 -218040 -188064 -196132 -348595
5065 -348595 -241424 -293432 -356055 -279170 -130103 -100460 125501 -24658 19830 42366 -307676
5054 -307676 -296659 -163101 88373 159848 334441 588729 859545 645080 475820 302380
5044 302380 273812 209598 21699 -185145 -344612 -100023 30111 -89492 -336394 -367260
5034 -367260 -15945 35846 166983 -17404 -100030 -55756 -61856 26662 169232 304022 157401
5023 157401 160491 189696 161190 371311 4405 -145197 -479993 -589864 -471803 -303050
5013 -303050 -220912 -255504 -188504 -354299 142478 214030 4275 139120 235093 215015 375295
5002 375295 519877 222930 201103 215979 137103 296946 294883 302107 139602 -93309 -339603
4991 -339603 -199574 -337252 -293141 -226668 -388909 -410707 -34519 219020 12708 91913
4981 91913 314243 392120 953139 799195 422005 227825 10817 252696 278691 236824
4971 236824 685632 548105 487088 604509 592690 426299 -24596 -70271 -171441 -364253
4961 -364253 -56159 235892 -214570 -331315 -254092 -194693 -257216 -332469 -557257 -512700 -308791
4950 -308791 -355923 -908200 -1202989 -656047 105850 170386 -96699 -403089 -226016 62288
4940 62288 34740 -312220 -381382 -388789 -281699 37542 127274 93241 -328197 -898952 -621613
4929 -621613 -608864 -519653 -694967 -749242 -277394 175355 521350 308030 -51159 95590
4919 95590 77617 140819 212922 193456 12701 -198748 184925 438914 554914 432620 -42171
4908 -42171 -234315 -333839 -109302 180952 286463 314305 143990 123287 244432 211978 218136
4897 218136 315932 459327 381698 183470 103331 285781 347246 78598 -102976 -10718 343871
4886 343871 218564 42828 -77252 92248 218118 164287 223360 657655 451566 -89570
4876 -89570 -329173 -538640 -589027 -681537 -472858 -446066 -712921 -650111 -581796 -506897 -491188
4865 -491188 -293530 -124870 -68744 -28504 -223176 -664848 -689238 -449739 -110783 -119014 -68702
4854 -68702 73657 155154 82494 -71275 247783 80687 -93058 -284519 -256039 -176550 -592298
4843 -592298 -739341 -429394 125408 -104566 -198605 67387 -187076 -231457 -103200 66326
4833 66326 -275391 -745911 -837010 -693913 -761070 -583347 -328372 -103112 66960 -247103
4823 -247103 -360588 -477097 -160377 -290222 -334203 -443573 -117992 295082 193976 53402
4813 53402 -58821 -62729 38370 38077 358927 444569 263333 195386 203385 571002 525090 166608
4801 166608 -267126 -544886 -463919 -196535 -210805 -1609 -85686 -88728 293935 501487 525089
4790 525089 438232 82126 -65871 -228843 -14502 433214 435865 407897 199423 -79894
4780 -79894 934 111128 -75712 -212425 -119812 40546 42201 72452 -31294 110808 220679
4769 220679 564734 735318 573956 294345 6160 7 363070 236952 7366 -127636
4759 -127636 264921 164217 226136 249016 -13758 -287405 -409097 -163457 76 41240
4749 41240 235235 110652 417848 370105 358256 327132 24197 99512 -65619 22863 231424
4738 231424 26686 -77459 -226377 -40139 208572 -52912 -230747 -11848 -30345 67355
4728 67355 -296248 -500547 -149882 152492 166385 -90064 -47579 350823 305535 -11428
4718 -11428 9203 -18636 -108327 -315499 -422083 -456021 -381393 -191147 -152839 62076 101530
4707 101530 -7627 5671 -436676 -319972 48913 18168 -80372 -335501 -64133 -79114
4697 -79114 182674 380701 350248 79950 84141 16770 6480 31939 -374123 -472035 -482691
4686 -482691 -228000 300371 342183 314129 68916 -51100 123394 60034 22374 -263109
4676 -263109 -562531 -752906 -842007 -643605 -627506 -330117 -295719 -256762 -405620 -56650
4666 -56650 163883 254981 -111023 -658398 -500926 -471804 -437556 -329479 -7412 -52383 -92802
4655 -92802 -101202 -168642 -16992 127643 -80408 -242462 -192588 37086 117080 61967 -93902
4644 -93902 -16844 11607 11321 -496186 -535407 -702235 -632546 68705 376169 -21851 -123543
4633 -123543 143836 57085 -80421 -262872 -515038 -199371 125861 61159 304419 620379
4623 620379 339743 41944 29812 368783 638975 693306 301186 79425 -116766 99339
4613 99339 126658 -42671 256321 500688 274994 108066 101404 131167 -378807 -706455 -487971
4602 -487971 -188099 -356432 -375876 -270288 -109395 -51951 60616 53626 3530 -24944 -296902
4591 -296902 -386495 -292243 -274008 -254859 -138890 -345160 -691411 -601352 -319021 38695 190410
4580 190410 81118 -35228 12627 15473 -496980 -729629 -753335 -537436 -49645 104215
4570 104215 128278 437570 330519 249246 51739 72279 -119988 -394343 -450160 -236586
4560 -236586 -38734 83030 123797 149791 106114 80781 -73842 -121050 -180914 -288016 -121357
4549 -121357 -324094 -455162 -242448 -330757 -503465 -565230 -710853 -541205 -653303 -653643 -183830
4538 -183830 -149218 -185330 -103361 130938 58664 -19322 -88003 -282688 71389 173876 464490
4527 464490 477791 462658 635675 213796 -78711 -48384 -187692 -24406 -125094 -209999
4517 -209999 -640846 -701108 -412907 -263013 -378493 -81507 134489 87242 -51901 -228256
4507 -228256 -636862 -688535 -652939 -618252 -535163 -353880 -91795 -55582 110990 -61264 -18347
4496 -18347 -179741 -10101 74436 -198323 -537850 -871998 -1121448 -1043487 -600333 -458352
4486 -458352 -389654 7631 146280 263620 573868 456206 14277 85549 -10466 -124073
4476 -124073 1603 -130521 -66918 -38429 233889 -133476 -384250 -176564 101472 10735
4466 10735 -161268 -214775 -390377 -273663 1417 -7936 -51139 -66587 -287236 -276189 83891
4455 83891 86542 -73014 -279573 -404149 -518747 -213490 105368 84828 -219316 -454625
4445 -454625 -333116 145128 -47500 -285842 -488718 -630676 -731649 -571547 -212062 -392498
4435 -392498 -621775 -741190 -358412 -111009 10978 312341 540772 248746 -29478 -386302
4425 -386302 -158554 -250523 -405079 -201832 -70108 83812 31552 -319688 -149089 137406
4415 137406 23395 -337644 -479995 -172250 -132919 176825 23012 -139866 -257811 -212970
4405 -212970 -214627 -340606 -185635 -39950 77141 -112189 80968 460652 571305 331602
4395 331602 471835 498289 291421 124181 136320 333861 490833 104905 -275054 -74972
4385 -74972 -204293 -236976 -137262 25983 138930 46858 -107322 -197345 -353276 -266978 -197163
4374 -197163 -187033 -62723 34025 288865 97881 26191 450052 756867 746620 683473 604681
4363 604681 430926 437443 235069 -82110 -9219 -41782 -120225 133080 143975 -54418 -216810
4352 -216810 -74940 54772 -95941 -146925 -298612 -471498 -605838 -427453 -549784 -897991
4342 -897991 -920910 -401819 -292806 -121262 4488 167284 731998 925545 334211 -31438
4332 -31438 -16589 127068 227278 -78855 -116387 -65769 171673 537420 778452 997961
4322 997961 1037998 429450 203793 371262 381281 244860 132625 157466 128370 -145079
4312 -145079 -277501 -159685 223811 441791 254843 295361 367403 601778 794995 771900
4302 771900 381078 -32184 7149 -222079 -303853 -318124 -397970 -171643 -171072 218095 69728
4291 69728 152235 255504 512394 324408 314210 241219 297726 416696 215389 239036 3513
4280 3513 -569450 -688650 -234841 -6594 -180643 -192800 -97803 265613 394463 307641 217077
4269 217077 205488 228648 34495 -252525 -315738 26268 389734 433672 342365 51670 -231402
4258 -231402 594 471777 495257 169870 -91484 -309338 -245352 -21578 182184 105723
4248 105723 194621 370139 -51902 -70085 -41731 227898 197892 77704 203143 385411
4238 385411 556876 513686 412059 264879 375853 223108 228034 236256 207826 339591 511508
4227 511508 354423 202413 88057 -86035 -62040 4514 268629 258598 -13914 -205135
4217 -205135 -274483 -38255 -166834 -22757 -16442 205159 -60367 -343581 -349639 -385003 209965
4206 209965 452961 -58696 -350198 -510525 -199702 -274025 -238647 -207110 -247132 -426356
4196 -426356 -324500 127284 286495 146096 217899 -112813 -399866 -325892 153572 298205
4186 298205 429889 328646 359236 277828 20260 -260723 -552588 -646546 -907848 -743267
4176 -743267 -188825 35511 -134798 126485 173174 168637 249019 352371 302685 -202517 -653862
4165 -653862 -601494 -568387 -284803 91443 325162 256560 70480 11420 -21260 56789 118224
4154 118224 85628 185926 40890 33144 409624 729610 557859 293772 85175 -124394
4144 -124394 25942 128467 227976 142085 109531 144820 542910 820785 727456 685906 661016
4133 661016 490906 395002 191277 536647 967999 628262 305162 299916 187863 219227
4123 219227 334429 -29036 27967 131441 -88581 -672 -83185 -281173 -429634 -360494
4113 -360494 -266712 -145435 -48688 -231 -24027 -192998 -12996 357431 313784 620515 540934
4102 540934 7156 70103 116984 -70900 -76631 284367 644161 862238 428875 33070
4092 33070 99550 -109764 -358061 -568242 -763670 -806488 -827545 -608141 -477683 57905
4082 57905 378770 238414 94940 -309833 -34751 404462 490350 373637 490115 411308
4072 411308 295832 96510 -188334 -120819 33859 141740 343660 140757 -137058 -255424
4062 -255424 -140342 -81747 104996 95405 24710 65349 303938 69302 -186346 -171301 -297937
4051 -297937 -389844 -635080 -634198 -628395 -502185 -358491 -432759 -323045 -367640 3423 29856
4040 29856 -145861 -135092 -290755 -448750 -575975 -260758 -3766 260775 52149 -154146
4030 -154146 -22366 -66992 -72176 233297 217119 222157 298866 -102232 -386913 -136654 34610
4019 34610 63737 -83918 -388038 -278373 -56254 -218534 -271834 -506403 -132554 245897
4009 245897 350947 282661 385410 332332 556584 410443 420032 367938 -27615 -272428 -23152
3998 -23152 199061 554604 561556 316500 465281 368029 236536 121093 127571 133103 71348
3987 71348 -186684 -375663 -458292 -411199 -323485 -217241 -202984 -105608 172504 266811 367440
3976 367440 634911 850410 764898 518638 -29105 -120647 -24814 10705 317948 363692 3823
3965 3823 -496995 -410901 -328463 -40129 119770 -29183 -327297 -542082 -365965 64176
$$ [...]
##END NTUPLES=NMR SPECTRUM
##END=
