##TITLE=Analysis number 321131
Compound Code ac 13693
Project Code adrs
Chemist Name acros organics
##JCAMPDX= 6.0         $$ Bruker NMR JCAMP-DX V2.0
##DATA TYPE= NMR SPECTRUM
##DATA CLASS= NTUPLES
##ORIGIN= Bruker BioSpin GmbH
##OWNER= nmr
$$ XWIN-NMR		Version 3.5
$$ Tue Jul 25 18:29:10 2006 GMT Daylight Time (UT+1h)  MAYBRIDGE\nmr@NMR_250MHZ
##.OBSERVE FREQUENCY= 250.131544655141
##.OBSERVE NUCLEUS= ^1H
##.ACQUISITION MODE= SIMULTANEOUS (DQD)
##.ACQUISITION SCHEME= undefined
##.AVERAGES= 16
##.DIGITISER RES= 18
##SPECTROMETER/DATA SYSTEM= dpx250
##.PULSE SEQUENCE= zg30
##.SOLVENT NAME= CDCl3
##.SHIFT REFERENCE= (INTERNAL, CDCl3, 0, 16.522)
##AUDIT TRAIL= $$ (NUMBER, WHEN, WHO, WHERE, WHAT)
$$ ##TITLE= Audit trail, XWIN-NMR		Version 3.5
$$ ##JCAMPDX= 5.01
$$ ##ORIGIN= Bruker BioSpin GmbH
$$ ##OWNER= nmr
$$ C:\u/data/dgb/nmr/ADRS/3550/pdata/1/auditp.txt
$$ ##AUDIT TRAIL=  $$ (NUMBER, WHEN, WHO, WHERE, WHAT)
(   1,<2006-07-25 18:28:48.99 +100>,<MAYBRIDGE\nmr>,<NMR_250MHZ>,
      <created by zg, POWCHK disabled, PULCHK disabled
       configuration hash MD5:
       E2 DF 36 D8 04 B2 41 60 5A D7 A3 38 5A 4B D0 FE
       data hash MD5: 64K
       BE 7F F3 2C DA 6A 06 7A E5 E3 22 56 FF 04 F7 ED>)
(   2,<2006-07-25 18:29:01.16 +100>,<MAYBRIDGE\nmr>,<NMR_250MHZ>,
      <Start of raw data processing
       ef LB = 0.3 FT_mod = 6 PKNL = 1 SI = 32K 
       data hash MD5: 32K
       35 B9 09 38 23 FB A2 BE 1F F0 BD 4F 46 8A B7 69>)
(   3,<2006-07-25 18:29:02.99 +100>,<MAYBRIDGE\nmr>,<NMR_250MHZ>,
      <apk 
       data hash MD5: 32K
       44 6E C1 51 9F 3F E5 81 15 1A 2E 82 B3 BE 84 CA>)
(   4,<2006-07-25 18:29:03.73 +100>,<MAYBRIDGE\nmr>,<NMR_250MHZ>,
      <abs ABSG = 5 
       data hash MD5: 32K
       F6 E6 9E C2 D5 1D A4 01 92 B3 45 51 D0 1C 2E 6E>)
$$ ##END=
$$ 
$$ hash MD5
$$ 8B 96 35 66 B1 02 C1 F1 06 2B 8C 04 08 E6 38 0B
##$RELAX= 
##$RELAX= 
##$RELAX= 
##$RELAX= 
##$RELAX= 
##$RELAX= 
##$RELAX= 
$$ Bruker specific parameters
$$ --------------------------
##$DU= <C:\u>
##$EXPNO= 3550
##$NAME= <ADRS>
##$PROCNO= 1
##$TYPE= <nmr>
##$USER= <dgb>
##$AMP= (0..31)
100 100 100 100 100 100 100 100 100 100 100 100 100 100 100 100 100 100 
100 100 100 100 100 100 100 100 100 100 100 100 100 100 
##$AQSEQ= 0
##$AQ_mod= 3
##$AUNM= <au_zg>
##$AUTOPOS= <8 >
##$BF1= 250.13
##$BF2= 250.13
##$BF3= 250.13
##$BF4= 250.13
##$BF5= 500.13
##$BF6= 500.13
##$BF7= 500.13
##$BF8= 500.13
##$BYTORDA= 1
##$CFDGTYP= 0
##$CFRGTYP= 5
##$CHEMSTR= <none>
##$CNST= (0..31)
1 1 145 1 1 1 1 1 1 1 1 1 1 1 1 1 1 1 1 1 1 1 1 1 1 1 1 1 1 1 1 1 
##$CPDPRG= <>
##$CPDPRG1= <>
##$CPDPRG2= <>
##$CPDPRG3= <>
##$CPDPRG4= <mlev>
##$CPDPRG5= <mlev>
##$CPDPRG6= <mlev>
##$CPDPRG7= <mlev>
##$CPDPRG8= <mlev>
##$CPDPRGB= <>
##$CPDPRGT= <>
##$D= (0..31)
0 1 0 0 0 0 0 0 0 0.06 0 0 0 0 0 0 0.0002 0 0 0 0 0 0 0 0 0 0 0 0 0 0 
0 
##$DATE= 1153848527
##$DBL= (0..7)
120 120 120 120 120 120 120 120 
##$DBP= (0..7)
150 150 150 150 150 150 150 150 
##$DBP07= 0
##$DBPNAM0= <>
##$DBPNAM1= <>
##$DBPNAM2= <>
$$ [...]
##$SUBNAM7= <"">
##$SUBNAM8= <"">
##$SUBNAM9= <"">
##$SW= 20.6930455092707
##$SWIBOX= (0..15)
0 0 3 0 0 0 0 0 0 0 0 0 0 0 0 0 
##$SW_h= 5175.983436853
##$TD= 65536
##$TD0= 1
##$TE= 295.16
##$TE2= 300
##$TE3= 300
##$TEG= 300
##$TL= (0..7)
0 120 120 120 120 120 120 120 
##$TP= (0..7)
150 150 150 150 150 150 150 150 
##$TP07= 0
##$TPNAME0= <>
##$TPNAME1= <>
##$TPNAME2= <>
##$TPNAME3= <>
##$TPNAME4= <>
##$TPNAME5= <>
##$TPNAME6= <>
##$TPNAME7= <>
##$TPOAL= (0..7)
0.5 0.5 0.5 0.5 0.5 0.5 0.5 0.5 
##$TPOFFS= (0..7)
0 0 0 0 0 0 0 0 
##$TUNHIN= 0
##$TUNHOUT= 0
##$TUNXOUT= 0
##$USERA1= <user>
##$USERA2= <user>
##$USERA3= <user>
##$USERA4= <user>
##$USERA5= <user>
##$V9= 5
##$VALIST= <valist>
##$VCLIST= <CCCCCCCCCCCCCCC>
##$VD= 0
##$VDLIST= <DDDDDDDDDDDDDDD>
##$VPLIST= <PPPPPPPPPPPPPPP>
##$VTLIST= <TTTTTTTTTTTTTTT>
##$WBST= 1024
##$WBSW= 4
##$XGAIN= (0..3)
0 0 0 0 
##$XL= 0
##$YL= 0
##$YMAX_a= 562014
##$YMIN_a= -441590
##$ZGOPTNS= <>
##$ZL1= 120
##$ZL2= 120
##$ZL3= 120
##$ZL4= 120
##$ABSF1= 16.522
##$ABSF2= -4.171173
##$ABSG= 5
##$ABSL= 3
##$ALPHA= 0
##$AQORDER= 0
##$ASSFAC= 0
##$ASSFACI= 0
##$ASSFACX= 0
##$ASSWID= 0
##$AUNMP= <proc_1d>
##$AZFE= 0.1
##$AZFW= 0.1
##$BCFW= 0
##$BC_mod= 0
##$BYTORDP= 0
##$COROFFS= 0
##$CY= 12.5
##$DATMOD= 1
##$DC= 0
##$DFILT= <>
##$DTYPP= 0
##$F1P= 14.0000005364418
##$F2P= -0.99999901652339
##$FCOR= 0.5
##$FTSIZE= 32768
##$FT_mod= 6
##$GAMMA= 0
##$GB= 0
##$INTBC= 1
##$INTSCL= 1
##$ISEN= 128
##$LB= 0.3
##$LEV0= 0
##$LPBIN= 0
##$MAXI= 10000
##$MC2= 0
##$MEAN= 0
##$ME_mod= 0
##$MI= 0
##$NCOEF= 0
##$NC_proc= -4
##$NLEV= 6
##$NOISF1= 0
##$NOISF2= 0
##$NSP= 0
##$NTH_PI= 0
##$NZP= 0
##$OFFSET= 16.522
##$PC= 1
##$PHC0= 12.11566
##$PHC1= 4.590423
##$PH_mod= 1
##$PKNL= yes
##$PPARMOD= 0
##$PSCAL= 4
##$PSIGN= 0
##$REVERSE= no
##$SF= 250.13
##$SI= 32768
##$SIGF1= 0
##$SIGF2= 0
##$SINO= 400
##$SIOLD= 32768
##$SREGLST= <1H.CDCl3>
##$SSB= 0
##$STSI= 32768
##$STSR= 0
##$SW_p= 5175.98343685301
##$SYMM= 0
##$S_DEV= 0
##$TDeff= 65536
##$TDoff= 0
##$TI= <Analysis number 999999
Compound Code 99
Book Reference 9
Project Code 9>
##$TILT= no
##$TM1= 0
##$TM2= 0
##$TOPLEV= 0
##$USERP1= <user>
##$USERP2= <user>
##$USERP3= <user>
##$USERP4= <user>
##$USERP5= <user>
##$WDW= 1
##$XDIM= 32768
##$YMAX_p= 306344943
##$YMIN_p= -51840
$$ End of Bruker specific parameters
$$ ---------------------------------
##NTUPLES= NMR SPECTRUM
##VAR_NAME=  FREQUENCY,     SPECTRUM/REAL,   SPECTRUM/IMAG
##SYMBOL=    X,             R,               I
##VAR_TYPE=  INDEPENDENT,   DEPENDENT,       DEPENDENT
##VAR_FORM=  AFFN,          ASDF,            ASDF
##VAR_DIM=   32768,         32768,           32768
##UNITS=     HZ,            ARBITRARY UNITS, ARBITRARY UNITS
##FACTOR=    0.157963299565203, 1,           1
##FIRST=     4132.6476996994, 0,             0
##LAST=      -1043.33573715361, 0,           0
##MIN=       -1043.33573715361, -51840,      0
##MAX=       4132.6476996994, 306344943,     0
$$ Real data points
##PAGE= N=1
##DATA TABLE= (X++(R..R)), XYDATA
$$ [...]
16139h549n94l718Q069O378J0281l854k1831j4241J4502J1968o153l863n08L045
16125i068R13L803P950J840n831m405L243n719j2745r9J624n542n407L177Q602
16110a7664q147l870J9542J3120j5285q075J1641K29Q66O60M934q098K674R031
16096A558k19j541p523j1211n425J6036P136j1788j2896o910L691K0484M718N9
16082c831O622l075j1759J1920O251n043p824q165Q585J2063o738n092Q148K2216
16068B4278j3522j8956N376L636k502l196M790j2646k449O400O849J0114J5474
16055B3646N412r18L5m678Q734J49q408j9847j8084J5683J147m080n094m219L190
16040g332R731N054r185Q743J607r835R51P425J053J149l56o90p388p443q090
$$ y = [-8549, -9143, -12861, -4792, 1586, 11867, 8013, -13818, -28059, -13557, -1589, -7742, -11605, -12113, -9068, -8155, -4352, 3598, 5438, -393, -4798, -1555, -7274, -20019, -20118, -18494, -24036, -29443, -26266, -17664, -25811, -29681, -10139, 2981, -12304, -20379, -8738, -8509, -7643, -6983, -2049, -10147, -7473, 1558, 1339, -202, -7725, -18936, -24361, -8325, -1189, -12977, -25873, -32783, -29092, -8608, -3890, -3831, 2791, -284, -12043, -123, 6128, 1085, -6739, -14904, -6319, 5744, -994, -6086, 2062, 24278, 10756, -8200, -2824, 812, -1690, -4886, -96, -12742, -15191, -8791, -1942, 8172, 23646, 29058, 28140, 28175, 23497, 32231, 32380, 23972, 4125, -13959, 1724, 2871, -1209, -6303, -10522, -7332, 2399, 7453, -1732, 7011, 8618, -1217, -266, 7159, 8212, 9361, 9005, 8315, 927, -6516, -14606]
16025a4606k742K2028L664Q725n988k401j2053o254j6065O848Q123J4313L438
16012G030j8129j0855P296P638o651m249P507J2459J2829k322n576M687R351j5449
15998E566n694R571o553m708j3380n509J4668M640L992j069n782R454O50J928
15984G774n27J385L483P577J0641j932j1862q334J2786J516j3550J456o185J750
15970E978J4552q457K072n460J4N288m527o394Q618K164M135j383m706M636L808
15955B0338l175p963p816l268R98q294J7569J8363p246k0994j0380m397j1994
15942b8259M411N292k521P726P698m959o606O63J3636q700o033R117J0002p56
15928G11p54m064k210J922q369j1188m759J5755J0286p048L703l212o661k73R524
$$ y = [-14606, -17348, 4680, 8344, 17069, 11081, 8680, -3373, -9627, -25692, -18844, -10721, 3592, 7030, -11099, -21954, -14658, -7020, -13671, -17920, -10413, 2046, 14875, 12553, 6977, 11664, 21015, 5566, -128, 9443, 2890, -1818, -15198, -20707, -6039, -1399, 2593, 1524, -4258, 5196, 5846, 7774, 7247, 8632, 12115, 19692, 30333, 28401, 16539, 8205, 20991, 22507, 8957, 10413, 4228, 5978, 20530, 12073, 14145, 8685, 8699, 13987, 9460, 3066, 11684, 13848, 17983, 16600, 11894, 16530, 20338, 17163, 9200, 1384, -1884, -886, -9180, 8389, 26752, 19506, -1488, -11868, -16265, -28259, -23848, -18556, -21077, -13351, -5653, -10612, -17218, -16555, -2919, -11619, -17652, -8535, 1467, 711, -43, -4107, -6317, -4395, -12764, -23952, -28711, -12956, -2670, -9718, -6015, -9227, -15888, -16161, -6637]
15913f637N147l654n220N636K495m107l301j595l233P729Q598N741o268o379n415
15898a0463j7166j1031Q651K8196K78r304n987m589q256J6031J5300n460j2083
15885a5883P323P501MM949l959m678O562M430N161K887O2l71p920k066m249p685
15869g932r776J1030L837j6251M787L541J8065O749p365Q597J4105j977k2978
15856D432M212P230j0619m81j0390n574N168J4566N998j0850l971M913P298m3
15842A1889j3760q324j0064K446O757n45o201p699j1460k567M950Q290L928J1855
15828a0505L940P967j10L79J3436J563R103n819j5790j512q171K543J3737k433
15814H328j0592j0267r930m05j250L117J3624J5223j3854j2467p998o48J3114
$$ y = [-6637, -1490, -5144, -10364, -4728, -2233, -6340, -9641, -11236, -14469, -6740, 1858, 7599, 1331, -5048, -10463, -27629, -38660, -30009, -1813, -1535, -10839, -16826, -21415, -29671, -13640, 1660, -3800, -15883, -8560, -1059, -1055, 3894, -65, -4743, 1819, 6249, 11410, 14297, 14359, 13988, 6068, 4002, -247, -7932, -17708, -6678, -2841, -19092, -14305, -10764, 7301, 14050, 6685, 15282, 29387, 27410, 4432, 8644, 15874, 5255, 4774, -5616, -11190, -6022, 8544, 14542, 3692, -279, 4634, 11932, 11889, -1871, -10195, -20259, -17813, -11056, -11601, -17802, -25501, -36961, -39528, -34578, -26288, -22360, -10505, -6565, 1402, 1292, 1671, 15107, 16670, 25773, 19954, 4164, 2652, -5519, -2976, 10761, 8328, -2264, -12531, -22461, -22866, -24116, -20999, -7375, 7848, -6006, -18473, -26471, -27119, -14005]
15801a4005P784j3392J09J845M53k180q014P887L186J1510J2462N866L155j1799
15787D867j7194M946M246L268j7516J073K2097J3037j3879j5756o663J578M033
15774a1863Q060j3380q141J4454P958l390j221n309L159R49p787P113L545J70
15760e683L519j0793j0196N701O025O21P530k344p580m896O679J589o568Q640
15746g756P424N91J1198n190j1534O056Q433l05j4202K574K943p936j1135o066
15732b4905j038N483O667J2290N270j1308n137J0036Q606K690n204L298l973j3093
15718a0318L689M352j5639j9344O242K0176N635J791r130M348J0385J3682J4296
15705C0165r290j4470M591M847k775j807p25J813j7968k032J753J4646n620j3499
$$ y = [-14005, -6221, -19613, -19504, -17659, -17206, -19386, -27400, -19513, -16327, -4817, 7645, 13511, 16666, 4867, -12327, -7381, -3135, 133, -17383, -16310, 5787, 18824, 4945, -10811, -17474, -15896, -11863, -3803, -17183, -25324, -10870, -2912, -6302, -7523, -12832, -9673, -8724, -16511, -9398, -5853, -5683, -2164, -12957, -23153, -17452, -11427, -10806, -3276, -5620, -13200, -18096, -11417, -9828, -16396, -7756, -332, 259, 11457, 6267, -5267, 789, 9222, 8917, -5285, -2711, 232, -7704, -18839, -24905, -25943, -20460, -13793, -1503, 3767, -7541, -12678, -2642, 5964, 8654, 3450, 6748, 2775, -10318, -6629, -2277, -17916, -37260, -31018, -10842, -5207, -3416, -12546, -8198, 2187, 15869, 30165, 20875, 6405, 10996, 15843, 13068, 11261, 10536, 12349, -5619, -7651, -5898, 8748, 3128, -10371]
15691a0371j3554j5832j697J2632J2982o154j3954O447P467O07Q144k340N772
15678i851J1890o934j4585m376R046J5968k545j662J1355K179j2960J770O720
15665F015N061o763n300l983l752J4228J062m853j5483j0213l086Q306N749J253
15651a1759L663J0939L561n545O145P97O97p170p240l981n640r31J701k518M962
15636a2319Q513k325P846O871k356n463k269m74O345K94k757k939j2007o732q853
15621b8625j0367J1680M988K552N445M754J4023J977j2656q732j273J488L010
15608a1736K954n281p57K279M797O918K925L360j0342j7331m949J929J2877p81
15594a3138p748o50Q265J3556K170q078n585K213P687r07m03q015l539J361r59
$$ y = [-10371, -23925, -39757, -41454, -28822, -15840, -21994, -35948, -29501, -22034, -21427, -13283, -15623, -9851, 2039, -4895, -19480, -23856, -14810, 1158, -1387, -3049, 8306, 10485, -2475, -705, 6015, 11076, 4313, -987, -4970, -8722, 5506, 6568, 1715, -13768, -23981, -27067, -18761, -13012, -11759, -8096, 2843, 6404, 859, 7004, 7801, 8498, 1328, -5912, -9893, -15533, -16464, -14763, -17281, -12319, -3806, -6131, 1715, 8586, 6230, 767, -1502, -1976, 4369, 4663, 1906, -1033, -13040, -19772, -28625, -38992, -27312, -22324, -19772, -14327, -9573, 4450, 6427, -6229, -14961, -16234, -14746, -11736, -8782, -14063, -14820, -12541, -7744, -826, 2099, 5459, -4883, -22214, -27163, -25234, -12357, -13138, -20886, -21536, -13271, 285, 2455, -5623, -11208, -8995, -1308, -2215, -2618, -10633, -14172, -12811, -13770]
15579a3770j769P038o172q334n352M339J5878K009o748J3585j0797l222J5223
15566A908l607n665n86o216m474m384L090r34j603k759N357N980M981j373P040
15551c245J7993Q223j1962m752n006K835j0057l662K24N064M802l424K355L042
15537B430Q850l774j3571j2844m32R812J459N184k235j6906q95J3390j692l161
15523a4385L274j885m674j315j645P586o623j231J4065k063K147m30j881J913
15509g147j2772L285M113J2161R598J1893o908p846j0789j4775j2723P8J0825
15496b1007N572R786N305k1900N073J8587M541j1930j232N950J30J6367Q491p273
15482A6460k6430K285R434M68K316r451k953J3655l2j7586l974N264J4984l054
$$ y = [-13770, -15539, -8501, -14673, -23007, -28359, -24020, -8142, -6133, -12881, 704, -10093, -13315, 1908, -1699, -7364, -7950, -14166, -18640, -23024, -19934, -20868, -22471, -25230, -19873, -13893, -8912, -10285, -3245, 14748, 22971, 11009, 6257, 1251, 4086, -5971, -9633, -9409, -4345, 457, -2967, -612, 2430, 11280, 7506, -6065, -18909, -19341, -9529, -8070, -2886, -5121, -22027, -22922, -9532, -11224, -14385, -11111, -12996, -17670, -18985, -20630, -13044, -19667, -20898, -6833, -8896, -6749, -7179, -9060, -7147, -19919, -16634, -12521, -360, 9238, 21131, 14223, 6377, -4412, -19187, -31910, -31832, -21007, -15435, -5649, -344, -22244, -17171, 1416, 5957, -5973, -7205, -1255, -1125, 15242, 23733, 16460, -9970, -7685, 1749, 2217, 4533, -4918, -7871, 5784, 5752, -11834, -15808, -10544, 4440, 1386]
15468A386j6544K148l785L574J21o539M937m809m985L75o965O781K0926j4984
15454a8363m446J6280L973P53J428k56m005j1440N354J1897j1682m072J2808R993
15440H222r75R163M121p359l054j3920j5160o142L663L714L40j080k89J952M588
15425a2216n2k795o276q871P07p946K953M750N191J803k245P947O297N326j460
15410f887n549J3405j3766r487M536J211n878M764j675p783j3825N102j289J667
15396c5454O901O124N983j067J494q166N095P967j525o818k40R504j418O975j627
15381f272o634o18R97n987Q033P091q023o143q41L121N110R220j1717n094P085
15366a0672j012J5501P905j6795q618j463n544J97P276p34K1181R302l929p192
$$ y = [1386, -15158, -13010, -16795, -13221, -13100, -19639, -14702, -19511, -24496, -24121, -31086, -24305, -3379, -18363, -22809, -6529, -2556, -1803, -375, -631, -4636, -16076, -10722, 1175, -10507, -14579, -1771, 8222, 7247, 16410, 20531, 13172, 10118, -3802, -18962, -25104, -21441, -17727, -17387, -18467, -18756, -16804, -12216, -12268, -15063, -21339, -30210, -29503, -37449, -34496, -29746, -24555, -22752, -24997, -17050, -10753, -5427, -6887, -12436, 969, -12797, -22284, -17748, -16537, -22415, -17651, -19326, -27109, -40934, -35832, -37121, -35454, -28553, -22429, -16446, -17513, -16019, -24185, -19090, -11123, -12648, -19466, -19706, -10202, -11620, -4645, -6272, -12906, -13524, -12527, -18514, -10481, -3390, -11413, -17556, -18397, -15276, -10166, -946, -12663, -17757, -10672, -11684, 3817, 11722, -5073, -13691, -15154, -20698, -20501, -13225, -13959, 7222, 16524, 12595, 5403]
15352E403j993K473O84o662n895L736O090M260Q165J2346k2909l5134o620N258
15338c0798P259R291M551J0362L723n377k274j779q013k938j0985K086P400J1174
15324f318R126l556j6771j918J1189K052j3017q293J0399J2408K779M212k679
15311c87r416J572J218L841M135j2709r253K650j93o963J885J2882L973K127j1137
15296a5775q964J1242P415J75j1392J70J1857J1740k385L43K215j2134p191O009
15282f675j369Q780L246k827j739O678L507k0914p236P974Q293J1817j1732j5092
15268a7289J2832P068K136p625m830L350k649r401m815L281Q140j695k107L431
15254a0173O549r390m251k384L913O47p604k890j0230j945j0275R723J7252k329
$$ y = [5403, 3410, 5883, 6567, -95, -5990, -2254, 3836, 8096, 16261, 28607, 5698, -29436, -36056, -30798, -23539, -14248, -9697, 665, 4388, -989, -3263, -5042, -13055, -15993, -26978, -24892, -17492, -6318, 2808, -748, -17519, -19437, -8248, -6196, -19213, -27506, -17107, -4699, -1920, 2292, -387, -9803, -8231, -7013, -3172, 963, -11746, -20999, -18349, -18542, -25505, -23620, -10738, -6765, -4638, -15775, -24739, -13497, -6082, -5907, -17299, -17129, -5272, 6468, 4083, 4426, 6641, -5493, -12684, -6675, -8044, 736, 3982, 1155, -584, 6094, 9601, -11313, -18549, -10575, -2282, 9535, -2197, -17289, -4457, 2611, 4747, -2878, -7708, -4358, -7007, -16408, -21223, -17942, -9802, -11497, -13604, -10173, -3624, -13014, -17265, -19649, -15736, -15089, -22693, -25583, -35813, -37758, -48033, -38310, -21058, -23387]
15240b3387l607P605n583Q1J7889P523m340J291p460m292n353l521p734l697J1331
15225b3254J2084M597QK684r43j4694m985R072L017j448K617j7875Q076R430L7
15210a1577L03K894K1696Q875J198N3r740m658o551o796J1830J48p307j494J223
15195I7J571J7362L698k6596q274J4249P192n931q22K69N694q095q277Q448q539
15180g954m827K238J0386j2362j838J4694k859l309m223L097J600L707K391P767
15166H508l920j4177J633l440r816M12M393J4146J6262r097j2253P615P974q331
15152i1j3223L686P994J3637n194j0211j2322K356M495l138P04j3920J3698J3014
15138A485j3316k30j058l410m300o33M352J1505J755j3603q939J6059m381o791
$$ y = [-23387, -26994, -19389, -24972, -24891, -7002, 521, -3819, -2528, -9988, -14280, -19633, -23154, -30888, -34585, -23254, -11170, -6573, -6565, -3881, -4824, -19518, -24503, -15431, -12414, -13862, -11245, -29120, -21044, -11614, -11577, -11274, -8380, 13316, 22191, 23389, 23442, 13702, 9044, 2493, -4303, 7527, 7675, 368, -1126, 97, 1668, 19030, 22728, -3868, -12142, 2107, 9299, 3368, 2546, 2815, 8509, 414, -7863, 585, -7954, -12781, -10543, -157, -12519, -14357, 337, -2522, -5831, -10054, -6957, -5357, -1650, 741, 8508, 4588, -9589, -7956, -11396, -21212, -20800, -16407, -2261, 14001, 4904, -7349, 266, 8240, -91, -13314, -9628, -1634, 12003, 6809, -3402, -15724, -13368, -8873, -12011, -11307, -25227, -11529, 1485, -11831, -12061, -13119, -16529, -20829, -21462, -17110, -5605, -3850, -17453, -26392, -10333, -14714, -21505]
15124b1505K645N425q58R513k034j1528j6123o004J7797M805R145M329k0995k376
15110b7764l876O35J3724J2684r519j313K609n83j3348j191O444J102j341j0019
15096c1756J89M683L95N574J0401O209q78N444M300j8415m433J1104m138j6687
15082b8008M718N613L899J4317j1396k41q352J401O297O071k5P406M079r82n150
15067c53o178n87j1786k883J1105J6539R093j6840o05P900J578j0410N033L174
15053D780j0769k136M091J871j5216o885O858m626L139J4690R226j128j1389j6269
15039b3763m59K2254m044j0319j0613L926O741p007K800o963j0312k687O970J7372
15025a6104J048o357p273l384M105l908J0115L535Q986k339r224J1566M347P110
$$ y = [-21505, -18860, -13435, -14293, -4780, -6814, -18342, -34465, -40469, -22672, -17867, -8722, -4393, -25388, -27764, -31640, -31005, -17281, -4597, -14116, -15429, -12820, -13403, -26751, -27942, -21498, -20396, -21737, -31756, -31567, -26884, -26489, -20915, -10514, -4305, -5183, 261, 4561, -13854, -18287, -7183, -11321, -28008, -23290, -17677, -13778, 539, -10857, -11098, -19450, -18049, -11752, -5681, -5706, 1700, 5779, 4797, -353, -6531, -7118, -18904, -21787, -10682, 5857, 14950, -1890, -2495, 5405, 6983, -3427, 1606, 4780, -5989, -8125, -4034, -2163, -17379, -24264, -17406, -22032, -18893, -4203, 5023, 3895, -7494, -23763, -24222, -1968, -6012, -16331, -26944, -23018, -16277, -23284, -20484, -27447, -37759, -40446, -33476, -16104, -15056, -21413, -28686, -32070, -27965, -31873, -21758, -18223, -9237, -11576, -20800, -9234, -4887, 2223]
15011B223j618j0628n050j1920j44j809J080N419J702N703j990m113M47k694J245
14996b2147J3804m817o006j0217O407O709J2777o286k409M61J7456M979n919j5892
14982a1100m703J906L305P107J080O230J2113j0377k482k074J074K886j886l03
14968B776l670j2754j569K205O484K018n313L895O1n345N924J057n218N117k321
14953f653N349O288j0856j2890j3153Q374R301P894N255p707M062N986m451p544
14939a0745m07M968K564L840n776j5R78j0891k955J8120Q553j917K949O275J5242
14924C0783N409k1577j6789J759j181l555l516j102q395r327J3313J7773m575
14911i80l644M216j907j1139o235m995q587j0563K0531K0659R026m558n013p427
$$ y = [2223, 605, -10023, -15073, -26993, -27137, -28946, -27866, -22447, -20745, -15042, -17032, -21145, -20698, -23392, -22147, -8343, -13160, -19166, -29383, -22976, -16267, -3490, -9776, -12185, -11724, 5732, 10711, 4792, -11100, -15803, -13897, -10592, -3485, -2405, 3825, 15938, 5561, 3079, 1005, 2079, 4965, 3079, 2776, -894, -13648, -15217, -13012, -6528, -4510, -9823, -5928, -5867, -11212, -5288, -4231, -9449, -4332, -6653, -1304, 4984, -5872, -18762, -31915, -23541, -14240, -6346, -1091, -8798, -4736, 1250, -3201, -10745, -11152, -6184, -3620, 220, -5556, -5571, -4593, -15484, -18439, -319, 8234, 6317, 9266, 15541, 30783, 36192, 14615, -2174, -415, -1596, -5151, -8667, -9769, -18164, -27491, -14178, 3595, -980, -4624, -408, -2315, -13454, -19689, -24684, -33271, -43834, -23303, -2644, 6382, 1824, -3189, -10616]
14897a0616m618J1611M23m143J072N633q512l60k758p42L028M393q58J506J897
14882c044Q986r753j0458M313L659Q149J8395p567r389P289L382K570M182O102
14868B6816k469j1137m490L329N26q503J033j798j2867j633l583J0257l300k625
14854a0444j534J00p746P552J0248k996p987N896m706m918M93m631l147J0244
14840a3576K685o706P619j612k645O148o441J4121n237j4659m666K481o697r566
14826c8751l713J0267J6987M414p491k675m279J7088R871l067p162p468J465N008
14812i506m71j0139j914l043K311J1793M906j9460o019R320N624j1509k888R081
14798b1914J3656p191N579M033L95j0121J0936N291p925o686j0288j439R305K057
$$ y = [-10616, -15234, -3623, -3200, -7343, -6271, -638, -9150, -9510, -12268, -13010, -9982, -5589, -6447, -4941, -3044, 5942, -3811, -14269, -9956, -6297, 1852, 20247, 12680, 3291, 10580, 13962, 16532, 20714, 26816, 24347, 13210, 8720, 12049, 12575, 4072, 5105, 3307, -9560, -11193, -14776, -4519, -7819, -10444, -11978, -11878, -19624, -12072, -1824, -4820, -12807, -6911, -11617, -16535, -16042, -20673, -23820, -13576, -10891, -17597, -9978, -11590, -14235, -8087, -14528, -407, -5644, -20303, -24969, -22488, -29185, -38751, -42464, -32197, -15210, -10796, -18287, -20962, -25241, -8153, 1718, -1349, -8511, -15979, -14514, -9506, -9977, -20116, -22030, -25073, -22762, -10969, -6063, -25523, -31542, -22222, -16598, -28107, -30995, -21914, -8258, -15449, -9870, -5837, -5442, -15563, -4627, 664, -7261, -13947, -24235, -25674, -16369, -14312]
14784a4312J0354j693Q902j2036q469m585J6406K958j6027o74j353O128J3513
14771h88q836j1968N782q339O09J3990M095j823L603o356m218M808R626J284J641
14756C010P364j18m605n39J5650o017j863j6497j9273M282R481J810j1516m0P879
14741a0992M8j3206l006K685J963J33O791J0604P194J1959l190j7695j1098k007
14727a9817P412Q276M831J5114o419o322r909p086P480j715k975J0929n396p680
14713a3277N10Q68N058l900n135j924J656j0287K894Q037R36K519J700m733M826
14698a0252L616l1o162j244j0494J0775R391j0625P285Q006M356J0181P276j6664
14684E414j0435q958j3971N830k139J420J2788j0727o777Q374J2011j1639J4711
$$ y = [-14312, -3958, -5651, 3251, -8785, -17254, -21839, -5433, -2475, -18502, -19176, -20529, -14401, -888, -9724, -21692, -15910, -24249, -23640, -9650, -5555, -7378, -3775, -10131, -14349, -9541, 85, 1369, 3010, 10374, 10256, 5651, 5112, 20762, 14745, 12882, -3615, -22888, -18606, -9125, -7315, -18831, -18871, -10992, -10944, -24150, -27156, -24471, -22508, -22375, -15584, -4980, 2214, 14173, 10983, -6712, -17810, -19817, -12405, -4129, 702, 15816, 9397, 3075, -6834, -13920, -6440, -8155, -11130, -201, -5597, -13277, -12767, -11899, -6841, -10741, -15876, -17800, -16144, -26431, -23537, -15500, -14564, -12045, -10345, -15078, -10252, -6636, -6667, -12829, -14073, -24567, -13792, -4401, -15026, -7741, 265, 4621, 14802, 22078, 5414, -5021, -13979, -27950, -22120, -24259, -22839, -10051, -20778, -27555, -19181, -7170, -18809, -4098]
14671d098j0750j1798L646j902m086P524P120m346k991K3813J2057r193m935n573
14657e512q538j731l931L285J1914L880q526k829k190q22P11J187P739O438p053
14642e978p708l594k549k65l637p009j828O122J1161J0265o190R46P796P575k927
14627B180J075m327j2614j1107M19N297K1764O151O142q446k83K409r526J3534
14613A2668K770j3621j0439l521q324n313P058r500J090J8036k148p993J2771
14600f466O872m352n301O537O024o880m829L761m669l119l237n580J045N480K646
14585a2068Q451n62j3429j481M785J047L899m176j3483O957N308rJ0487J0859
14571F585P279n84j1559m674Q499J755j7414J076J1756L665j2575m656M581L358
$$ y = [-4098, -14848, -26646, -23000, -24902, -28988, -21464, -14344, -18690, -21681, 2132, 14189, 4996, 61, -5512, -14050, -15781, -19712, -16427, -4513, -633, -9159, -11988, -14178, -15000, -14289, -13102, -5363, 1075, -5978, -13686, -17280, -19829, -20094, -23731, -30740, -32568, -26446, -15285, -5020, -11210, -10264, -2468, 5107, 2180, 3255, -1072, -13686, -24793, -24374, -19077, 2687, 8838, 14980, 6534, 6251, 8660, -866, 12668, 15438, 1817, -8622, -12143, -20467, -25780, -18722, -28222, -27132, -9096, -11244, -19237, -6466, 406, -3946, -9247, -2710, 3314, -3566, -8395, -4634, -9303, -12422, -15659, -21239, -20194, -14714, -12068, -3617, -4179, -17608, -19089, -14304, -13257, -9358, -13534, -27017, -20060, -14752, -14761, -4274, 6585, 13864, 13280, 1721, -2953, 5546, 7301, -10113, -9037, 2719, 6384, -6191, -10847, -6266, -2908]
14557b908j1019p697L371j776n420m830O378j356O888J0158j617m270q735l759
14543b6592L877J4333J7401q637q621j4711n165J2428K0640K344o129J015Q950
14530A1133o576k892j1800Q836o420j7435Q084J641N754J964q211m072R255j126
14516a1865J2520K352K578m015l290j0177o373J385L281j3419r942R664N038J6870
14502e393P681n741j0211j1966N621J3711K010p540l393j76r780K249K2183O565
14488E820n25j3670Q7Q917l621m948J71k500K776k941L810n078j3097J0686J1271
14473b842J84J605J300o230o546L209L765O207n042j3285r035J5674J2320k594
14459a310k3501Q93J7360n552N636K148o241P942q375m787l401N34L946J143P153
$$ y = [-2908, -13927, -21624, -18253, -20029, -25449, -30279, -23901, -25257, -18369, -8211, -9828, -14098, -22833, -26592, -22715, -8382, 9019, 382, -8239, -22950, -28115, -15687, 4953, 7297, 1168, 2183, 11133, 4557, 1665, -10135, -1299, -7719, -25154, -17070, -15429, -9675, -7711, -15922, -19994, -10739, -11865, 655, 3007, 5585, 1570, -1720, -11897, -18270, -16885, -13604, -27023, -36965, -27301, -22263, -5393, 2288, -3453, -13664, -25630, -20009, -6298, -4288, -11828, -15221, -15397, -25177, -22928, -745, 5820, 5295, -8375, -8288, 629, -2992, -7940, -7769, -10269, -7493, -10434, -6624, -11702, -24799, -14113, -2842, -2658, -1053, 247, -5983, -12529, -9320, -5555, 652, -4390, -17675, -26710, -11036, 1284, -1310, -24811, -23918, -6558, -12110, -6474, -4326, -10567, -2625, -11000, -15787, -19188, -18654, -14708, -13565, -6412]
14444f412L996p686j556J385j2612k217M766o454J0437J0528K578k155K593K038
14430g71p283j784J2963o77l922J2166m250m087l668n876L71q551L76K154p22
14415a3561n366J99o997n908Q247J1852J131J2035J5717p377j2193k94k642q323
14401a3480o255m407o311j1945j403L962r308J0265J5890J4169J835n665O473
14388f180j1149k55N251J2510R72o071n922j350L566k145Q623R014n474P699L314
14373A2403M41N681m976j7934m129r156j2978Q738M351J1323J984J4035l155j8112
14359a1484K220n73J578J3046o588j4385m031O191R697j6037K106J9920N560q885
14345a665j8K779J0956K932j0585n355r797k296K723q515j640M674N561p794q211
$$ y = [-6412, -2416, -10102, -11658, -10273, -22885, -25102, -20336, -26790, -16353, -5825, -3247, -5402, -2809, -771, -8054, -9838, 3125, 2448, -1474, 10692, 6442, 2355, -1313, -7189, -6818, -15369, -14993, -12839, -13561, -18927, -18728, -25725, -31633, -23386, -11534, -10403, 1632, 17349, 9972, -2221, -2515, -5157, -13480, -19735, -24142, -30453, -42398, -43801, -39839, -49147, -38882, -22992, -8823, -6988, -12653, -6180, -17329, -17584, -12333, 177, 1149, -4922, -10844, -12194, -8628, -10773, -2150, 6864, 1390, 9089, 12403, 12844, 18525, 13549, -4385, -8514, -17670, -30648, -21910, -17559, -6236, -4252, 9783, 6628, -11484, -9264, -9837, -8259, 4787, -1801, -16186, -20217, -14026, -4329, -20366, -18260, 1660, 7220, -1665, -1683, 1096, 12052, 14984, 4399, -956, -10753, -13049, -10326, -18841, -20481, -15807, -10246, -18040, -26251]
14330b6251r936J0380J694P307J324J391n158K336J2411N612k700Q971j0770j1916
14316a5305p985J3531k99j4674n716O374P92Q973j613J65r18k853L662r351M066
14301b1151K776J2861Q956K008n767p856J8627M977j135j7483q87J0653J852n454
14287B977j2198j743k17M910k548j913q812j3853j4146K54K3342J4492j2J809
14273g658M694j3165j3048q58J0708P658J567O070J1144M039l33p820j2148m510
14259a3660L422Q768j2713n486P07Q467J8219l08k976Q814j4141j6034J4539J953
14245d29J205n763r111J2945J789p177m575Q208P128j0233j0289N242P969J14
14231b977k0522l5R720R700m523J3N630R015J1652M407n891j1483j982J5502J0437
$$ y = [-26251, -36187, -25807, -24113, -16806, -15482, -14091, -19249, -16913, -4502, 1110, -1590, 7381, -3389, -15305, -23290, -9759, -10058, -24732, -30448, -24074, -23282, -14309, -15922, -15757, -16675, -19528, -15866, -25217, -21151, -18375, -5514, 3442, 5450, -317, -8173, 10454, 15431, 14296, -3187, -4074, 6579, 8431, 2977, -9221, -10964, -11181, -6271, -8819, -10732, -19544, -33397, -47543, -47289, -23947, -9455, -9467, -7658, -2964, -16129, -29177, -30035, -19327, -11669, -10102, -4032, 7112, 11151, 10818, 2998, -9150, -13660, -10238, -1470, -14183, -19669, -18962, -10495, 7724, 7416, 4440, 13254, -887, -16921, -2382, -429, 776, -4987, -14098, -1153, 636, -6541, -11116, -2908, 4220, -6013, -16302, -11060, -3091, -2977, -23499, -23534, -13814, -4114, -8637, -8624, -2994, 6021, 17673, 22080, 16189, 4706, 2724, 18226, 28663]
14216B8663L594K56l360j1816j5927j0951R458j3085l878J0817J7715M160n612
14203A0034n838J723J093L86j850K691q162q806K899M32L461J934O374m261l078
14188i68k372L62m954O991n842L410O988O680O37p842n39P39o246J700J0027m688
14172D083k482Q66J312l396K340N786n97l374k200k606j3060l978J7438o17j847
14157b332P654J0759J502P790n234k1620o380j0417j2806j2756K504J4594O589
14144b0153J4247M492p543p44n496k569J6442K892j1668q031J289l915j632J0519
14130a1870K128o459m165Q052n187p125o008K511N945N837k990M031R203K277
14116c820Q337m151q152m848J4084J926j5819j6262o997Q24M87J2249R800n426
$$ y = [28663, 32257, 32513, 29153, 17337, 1410, -9541, -83, -13168, -17046, -6229, 11486, 15646, 10034, 4196, 5919, 7012, 7398, 5548, 8239, 77, -8729, -5830, -5398, -1937, -3, 6371, 2110, -968, -3340, -2978, -7932, -941, -6783, -3373, 3615, 10295, 10932, 3090, 2551, 3290, -2956, -1256, 8771, 4083, 1601, 2467, 3779, 383, 2723, 8509, 7912, 4538, 2338, -268, -13328, -17306, 132, -485, -2332, 5322, 16081, 17583, 25373, 20139, -1481, -7861, -18278, -31084, -43840, -41336, -26742, -20153, -5906, -1414, -8957, -9701, -15197, -17766, -1324, 1568, -10100, -18131, -16842, -20757, -22389, -11870, -9742, -16201, -20366, -12314, -17501, -24626, -30634, -28123, -22178, -16341, -19331, -15300, -6097, -3820, 4517, 366, -7786, -12634, 1450, 3376, -12443, -28705, -35702, -34878, -34391, -22142, -12342, -17768]
14102a7768l161J4006Q699p506p531n861j1588j805P072O474Q296n054O863l94
14088i258p609j876K142J2965J5916p014m703Q429M423l363j7370k2636k451L0205
14074b200K8024j1055l411q50J55j4085j2436O735m300m460N083q013P273J735
14060a1805k254k22J1375L064R610m604O238J1804J585j8435j4716k518O075j0868
14046a5671k0N9O059J9923q12n214j2086R07r907n287J5134K327j5880k512J1240
14031a1740j5217m513K301K415Q563O617Q379j778L009O347p784j3200J420Q061
14017g120r133J3677j07N33J6838l510m299o536o279K32j445O805j0653j2671
14003b3668M088K157k842J2984q976n377J0096P129J1271L05j6263O775o974j914
$$ y = [-17768, -20929, -6923, 1776, -5730, -13261, -19122, -30710, -32515, -25443, -18969, -10673, -15727, -8864, -9258, -16867, -18743, -16601, -3636, 12280, 5266, 563, 8992, 13415, 10052, -7318, -29954, -32405, -2200, 25824, 14769, 11358, 10508, 10663, -3422, -15858, -9123, -13423, -17883, -12800, -20813, -13540, -11805, -14059, -14281, -2906, 158, 9768, 5164, 11402, 23206, 24791, 6356, -8360, -10878, -4803, -15671, -15691, -15632, -9573, 10350, 9538, 4324, -7762, -6855, -16762, -22049, -6915, -4588, -20468, -22980, -11740, -26957, -31470, -29169, -26754, -18191, -11574, -3195, -4973, -1964, 4383, -3401, -16601, -15181, -7120, -16253, -2576, -2683, -2150, 14688, 11178, 6879, 343, -5936, -5704, -7149, -344, -10997, -23668, -19580, -17423, -20265, -7281, -16257, -21634, -11538, -4409, 6862, 7167, -9096, -2321, -9295, -11209]
13989a1209L786j426j339j583o780J976J7187k429j3652Q552L0648j355j2971
13976I405j0930j9696n941K1714J3529R311j2318k852J3469J973j0205Q083p102
13963H440l636j1198L092n305N034N569m154k5641K124K634K975J6554J8560n335
13949I713q668j2478L06P507K6p01p399L91k290m215R701O839j3465j352j78j222
13933a7485R665j059j4211k666n495o950M86J1318J4806M609j1790K252J3351
13920c169q659L105o315L323N782M828P858J363K014K579j3609q5m697J181J4722
13905A0221j0587p463k649J782L966m304J353J1623N2r696j9940k0154N787Q418
13891c1591k641N741M450O451P421k335L590J3328L866O469p563k0907j1792K813
$$ y = [-11209, -7423, -8849, -10188, -11771, -18551, -16575, 612, -1817, -15469, -6917, 23731, 22376, 9405, -1525, -21221, -27162, -5448, 8081, 17392, 5074, 2222, 15691, 17664, 7459, 15542, 8440, 4804, -6394, -3302, -8607, -3573, 1996, -2158, -27799, -25675, -23041, -20066, -3512, 15048, 9713, 1045, -11433, -11127, -3620, -3594, -4295, -11694, -11303, -13593, -17808, -8107, -1268, -14733, -16085, -16263, -17485, -7820, -8879, -23090, -25756, -31251, -38201, -37715, -26397, -11591, -6982, -18772, -16520, -3169, -11828, -8723, -15038, -11715, -5933, -1105, 6753, 8116, 10130, 12709, -900, -985, -5682, -4501, 10221, -366, -7829, -10478, -8696, -4730, -9034, -7681, 3942, 3994, -5702, -25642, -45796, -40009, -31591, -34232, -28491, -24041, -17590, -10169, -12504, -8914, 4414, 8280, 14749, 7186, -13721, -25513, -22700]
13877b2700J7013N632n989o310K861j375q16o324l196Q816J3230J488M075N406
13863A1811m555J312L956J0649L375j6748j5872j3597j4839P363J5354n102n872
13850b2765J702Q129j2896j2983R544M368l915p240J0662Q045J0185Q18j62p114
13836a3622j628j526l917o274K994L568o197J6535P144q117p37J2690J4015J363
13822A6291o640k2162o559L135nN058J1048q756j378J8533j973k3052o833n339
13808b8632J4670J8379J0198J067j6982r027m299P4l824j1368J0068J084R75J2295
13794e322O575n104P857p244n132j827o683o133M653Q694J2978M838n439O02Q013
13779A1326j483q272R09p069k422P847j240r346K55L906K6173P047q154p230j4500
$$ y = [-22700, -5687, -55, -6044, -12354, -9493, -10868, -11684, -18008, -21204, -12388, 842, 2330, 6405, 11811, 7256, 8568, 12524, 23173, 26548, 9800, -6072, -19669, -34508, -27145, -11791, -16893, -22765, -21063, -12934, -25830, -38813, -29269, -24901, -28816, -36056, -25394, -17349, -7164, -6346, -6508, -13622, -15250, -16776, -20693, -26967, -23973, -20405, -26602, -10067, -2923, -11040, -11777, 913, 14928, 16291, 9651, -12511, -19070, -15935, -15940, -10882, 166, -8590, -9968, 8565, 6592, -16460, -23293, -28632, -13962, 4417, 14615, 15682, -1300, -10327, -14626, -14552, -18376, -29744, -19676, -18592, -17617, -5322, 1253, -3851, 4006, -3238, -8370, -10197, -16880, -23013, -18360, -9666, 3312, 8150, 2711, 3313, 11326, 9843, 1571, 2480, -4589, -7011, 836, -404, -9750, -9495, -5589, 20584, 27631, 19477, 12247, -2253]
13764b253r576j5002n848J0801J2053Q112N872n911p852k731q027j038m823j829
13750b8052K958o326k973J76N837J3985J532J817R720k525J445N94R952l315j2427
13735g602o394O751m242K152K852k510J1389J0119q628o844K483J588n118k473
13721f477j101O042l085j728N041O136j5799j0073M892K910j1152l114M935J2639
13707i934K25o028o682R784P082j550O802l891k847n293M100J2207q067n327o056
13692a5475P618J7859j1025j3056L010J6517J0881j969q812n213P868j1032j3064
13679a5893Q217j293K841J175L504L078N647k191L293N900m584k964R657j0991
13665E396j4128O509J2232l93l354M898l574j3305J725J1640M759j922k681M784
$$ y = [-2253, -11829, -26831, -32679, -21878, -9825, -1713, 4159, -1752, -9604, -12335, -20362, -21400, -26223, -28052, -25094, -31420, -34393, -34217, -28380, -14395, -12863, -11046, -1326, -3851, -2406, -1812, 8140, 4825, -7602, -13996, -7245, -11487, -9335, -6483, -8993, 2396, 12515, 3887, -2957, -474, 1114, -4004, -6477, -7578, -1536, -4621, -6349, -1308, 4828, -10971, -21044, -16152, -13242, -24394, -27508, -22573, -9934, -9709, -15737, -22419, -12635, -5553, -7103, -301, -4192, -7039, -12332, -8232, 3975, -4092, -9419, -15475, -7857, 10002, -1023, -14079, -11069, 5448, 16329, 14360, 5548, 335, 8203, -2829, -15893, -7676, -8969, -6128, -4953, -1449, 1629, 7276, 5085, 8378, 14278, 9694, 6730, 16387, 5396, -8732, -2223, 10009, 9616, 6262, 11160, 7586, -5719, -3994, 7646, 12405, 10483, 7802, 12586]
13651A2586n128j076J5568j850n251m246o269K789O113l851m823r367J0638L475
13637I308k182j5205l120M025k297j156n627M560Q212N633l274j0961n661N355
13623a2390L666L451J506l087j0084n589P62J2071R00k4003k120L278o12J0187
13609b2064J6240Q87l803m213J0089O331n999n020P728n82L707o771J2630L924
13595A3084J654l885Q200Q116r004j4195n215l550m011j9294p160J4454J0658
13582a0148J5458k27k152k786Q560j0299j3626K082J1687L131p712r403k794J9992
13568A763n627O134K514l685m704k0367O975P865P16p208P05J400j851R746R782
13553D158N154J515n109j1701o674R893M923j5356J652P68n275J4439Q935p644
$$ y = [12586, 7458, 6382, 21950, 20100, 14849, 10603, 4334, 7123, 13236, 9385, 4562, -4805, 5833, 9308, 7126, -8079, -11199, -7174, -9471, -10627, -16254, -11694, -3482, 2151, -1123, -12084, -17745, -12390, -8724, -5273, -3767, -6854, -16938, -22527, -21765, -9694, -8794, -32797, -34917, -31639, -32251, -22064, -5824, -4937, -8740, -12953, -2864, 3467, -2532, -7552, 176, -406, 3301, -3470, 9160, 13084, 14738, 10853, 19053, 27169, 18165, 3970, -1245, -4795, -8806, -28100, -35260, -20806, -10148, 5310, 5083, 2931, 145, 8705, -1594, -15220, -13138, -1451, 1680, -6032, -15435, -18229, 1763, -3864, 2270, 4784, 1099, -3605, -23972, -16997, -9132, -8416, -15624, -14919, -13519, -15370, -5624, 4158, 9312, 10827, 5718, -5983, -12657, -2764, 2159, -13197, -11545, -10777, -16052, -1613, 7322, -322]
13539c22q448k954m855k589R683P399J996q507j3883R295K182r677Q24p640K611
13524b4885N955J6698K255k197K618l627L560R420P569j1807j1262K229J553p803
13510i724R852l297j2647Q451R573J2647L873k1212q297O556p15P811j684r448
13496h261RJ299J0526M085M414r161m906k836N083M218k7302n640J1787K1702
13482E017K556Q47p531r010j1255l550j4400P513j221J6155J0135j3839j5627
13469c4210J0918K0617r317j0903K920J0680J1462n790r950k640J1419n506j1540
13456b1840j0468J0819J7539q199r4j0354j785N168O13R028j297p543m829j4374
13442c7616P00P009q018J2898J5157J1364O429P619Q07r777o476j4323j3535N428
$$ y = [-322, -8770, -11724, -16579, -19168, -9485, -2086, -90, -8597, -22480, -13185, -11003, -20680, -19856, -27496, -24885, -18930, -2232, 23, -2174, 444, -3183, 377, 9797, 17366, 5559, -5703, -3474, -1921, -9724, 128, -3169, -15816, -7365, 2208, 14855, 18728, -2484, -10781, -4225, -4940, 2871, 1187, -8261, -8252, -6953, 3573, 7658, 12072, 2911, -1995, -4831, 252, 4470, -22832, -28472, -16685, 5017, 7573, 8420, 889, -8121, -19376, -22926, -37326, -29813, -31034, -14879, -4744, -18583, -34210, -23292, -2675, -11992, -22895, -19975, -9295, 2167, -3623, -13573, -16213, -4794, -10300, -21840, -32308, -21489, -3950, -12149, -12243, -22597, -24382, -19214, -18601, -9573, -10870, -18413, -23242, -37616, -36916, -29907, -37925, -25027, -9870, 1494, 7923, 15542, 16349, 6572, 96, -14227, -27762, -22334]
13428b2334J6581N958n919j1267q232J0681m057J0272P849n499N938q861N774
13415c116J1564n507K881p041r458m913P144J1396l520j4329R219P104J207J4788
13401A7419n934j1015p765K299O988M459o156r554n283J8728L444m044j451r498
13387g363m234J585J0350k949p899o005P942J100N889J4485o1p174q844J777j1242
13372a2643l951O199J937m32p814p665j30O046Q348j224O824O229J012N423K089
13357A0248J0916r450j1994p466q449l455O976J2934j116j9575K83j0628J0930
13344a9846P526J3164R775J0865j515j0620P17m697J997K277m159k653N490P138
13330A5459L067O865q163j1948L728L121P110l543j7897Q939L491R24q09L241
$$ y = [-22334, -5753, 205, -5714, -16981, -25213, -14532, -18589, -8317, -468, -5967, -29, -8890, -3116, 8448, 2941, 5822, -1219, -10677, -15590, -8446, 2950, -570, -14899, -5680, 1424, 2631, 17419, 11485, 470, -7295, -4996, 1992, 6451, 295, -9259, -14542, 4186, 7630, 3586, 2135, -7363, -11597, -10012, 338, -2611, -10510, -16515, -8573, -7473, -1584, 12901, 12840, 5666, -3178, -1401, -12643, -16594, -10395, -8458, -8890, -16704, -24369, -24499, -18453, -10105, -11329, -4505, 1724, 2736, 8159, 10248, 21164, 11714, -280, -7746, -16195, -19650, -12674, 260, -856, -20431, -20148, -30776, -19846, -12320, 844, 10619, 21484, 19969, 9349, 10066, 5369, 7366, 9643, 5484, 2831, 8321, 15459, 18526, 25391, 17228, 5280, 9008, 12129, 19239, 15696, -2201, 6738, 10229, 11153, 10344, 13585]
13316A3585Q672j1924m130N71m130L931J0249L420M888o389j3147q54P461N137
13302A7340m238n93r219r784P152P999j088m624O49J0828L904l2k0600j0671J418
13287a1559r748o456J341M470J1085Q645j0580K085n687j5869Q845O865m090j705
13273b2358p915P80J4930K1041O08q354R46Q649n103q947n059J1147m542j1726
13259a5903J538l52J1256M556l600r848j5403j1484J6977K84m741j141M054L300
13245b0507N031R91j2399l628J424N718J9355M384o567j379k044J2620Q232j0163
13231A068k1836m645O607P996J4222k379k342o964N845J1018l124K267j800n34
13217E399J5992L647r48k682J253k696p014n976j0158k104n783N182J4756m305
$$ y = [13585, 22257, 10333, 6203, 6774, 2644, 6575, 16824, 20244, 25132, 18743, 5596, 4742, 12203, 17340, 13102, 12509, 3290, -6494, 658, 8657, 7569, 2945, 3594, 14422, 18326, 18294, -2306, -12977, -11559, -21307, -27763, -26422, -21952, -10867, -2222, -12802, -10717, -16404, -32273, -23428, -16563, -20653, -22358, -30273, -29493, -14563, 6478, 7086, -1268, -322, 8327, 3224, -5723, -10782, 365, -4177, -15903, -14365, -14717, -3461, 1095, -2505, -12353, -27756, -39240, -22263, -21979, -26720, -27861, -23807, -20507, -15476, -14485, -26884, -30512, -29088, -23370, -4015, 369, -6198, -7577, -9621, 2999, 11231, 1068, -20768, -25413, -18806, -10810, 3412, 1033, -1309, -8273, -2428, 8590, 5466, 7733, 5933, 5399, 21391, 25038, 24090, 21408, 22661, 19965, 12951, 6975, -3183, -5287, -11070, -5888, 8868, 4563]
13203D563j4247J5203K4227M254j3449n687j4840j1149K120j720M396K409N530
13190A610n648N212j4127K1J8663Q793m7n411n10J1241L561m984J060o229j0601
13175B604M199M047m054Q361J218j3678p91P966l691n03P804m611j0406j362J3065
13160A0168q33P700q942j7243j913M739j182L087O177l671l502o726Q362J870
13146a909K086k946n700O381j10Q033L554j2177J927m13L534J018o418N492L730
13131F082J2764l623j3815j5336L323N714n129j0792j8862n826L405K9638J7375
13118D918p902K994M710j786j253q611n275N209r38M996M42J4204Q259j1772j0711
13103b516j1572K616p512M36L078J8397K901j3021J6414J5740o278j2458j98j447
$$ y = [4563, -9684, 5519, 29746, 34000, 20551, 14864, 24, -11125, -9005, -10725, -6329, -3920, 1610, -4038, 1174, -12953, -12932, 5731, 14524, 14477, 9066, 8556, 19797, 23358, 18374, 19434, 13205, 2604, 6803, 10850, 6796, 15157, 16375, 2697, 1906, 9872, 6181, 5678, 13482, 8871, -1535, -2897, 10168, 9335, 17035, 8093, -9150, -11063, -6324, -7506, -4419, 1758, -1913, -5415, -12141, -3779, -1909, 177, -2769, -8469, -2088, -2198, 5835, 9389, -2788, -861, -1274, 2260, 3278, -3140, 2352, 6082, 18846, 15223, 1408, -13928, -10605, -4891, -10020, -20812, -39674, -45500, -42095, -12457, 4918, -2984, 10, 4720, 2934, 1681, -6930, -12205, -6996, -7934, -2938, -2496, 11708, 19967, 8195, -2516, -14088, -11472, -18984, -18548, -15470, 2927, 5828, -7193, 9221, 24961, 18683, 6225, 6027, 4580]
13089D580Q884R534P57K119M121O900m638j7727j3390j958K676l761L885k357
13075c75k914p785J972N568J631o124p032J144K1715R775L525l589j2885o005
13061a379J5430P726R191P215k1839k7503P178K1741P093j3176j4527j632K898
13048a584K182j635R510r069l960L66M734K440J0046J7745J12R996P835m135j0324
13033C4259q755l85l599j1285n767J0942M64L919N946m830J250p502n312K955
13019A2300J4122m639r430l443l019Q557R16l731n077J2157J0370k70n470j4013
13005I330j004M097j724j7277k307R111k940o851R841j5261L103M436n217J1276
12991a387k450J282N675J3333J2124J3102j2303k918m139k582q239j050Q124P513
$$ y = [4580, 13464, 22998, 23755, 25874, 29995, 36895, 32257, 14530, 1140, -818, 1858, -1903, 1982, -375, -3289, -11074, -9102, -3534, -1903, -8027, -15059, -13915, 7800, 17575, 21100, 17511, 4626, -1379, 14051, 21777, 30968, 38183, 16344, -11159, -3981, 17760, 24853, 11677, -2850, -4482, -1584, 598, -1037, 8473, -596, -4556, -4190, 544, 2984, 13030, 30775, 30887, 40883, 48718, 44583, 34259, 25504, 25119, 21520, 10235, 4468, 15410, 15874, 19793, 25739, 20909, 22159, 14657, 9345, 12300, 26422, 21783, 12353, 8910, 5891, 14448, 15364, 11633, 6556, 18713, 29083, 28813, 23343, 9330, 8326, 12423, 10699, -6578, -8885, 226, -2714, -9565, 276, -14985, -11882, -7446, -12663, -1387, -3837, -2555, 3120, 16453, 28577, 41679, 29376, 26458, 22319, 19737, 11498, 10448, 18572, 26085]
12977B6085P011o534R63m29J3812j134j6464O719N288J0335K400N458n801k1613
12963B6096k377o855K388l258k843J799K667J195K776j3091q591O243R67K0565
12949B7681J2208q117l357o434q640j0378p633k56R747R746Q052L822n198L039
12935B4282J2564J169n769k874m227M272j327j7057P066J0204P752k1141p023
12922G891K0127J622J089K503K160Q740j2430K622n029n837n729J874J007J0418
12908C1028P097l181q834n531j2738R613O571j594R518J0782K426l642k041P237
12894D6711k816n319M202k61p198j4159k3268p91J4266P454o465J283K958N506
12880B2103j810j0167k760N455Q97L35R12M85l573n489m617J0565N283j0628r989
$$ y = [26085, 33096, 26562, 27525, 27096, 40908, 39774, 23310, 30029, 35317, 45652, 48052, 53510, 47709, 26096, 23719, 16864, 19252, 15994, 13151, 14950, 17617, 18812, 21588, 8497, -94, 6149, 7116, 27681, 39889, 31772, 28415, 21981, 13341, 2963, -4670, -4926, 4821, 14567, 22619, 26441, 21243, 24282, 36846, 38015, 32246, 29372, 25145, 29417, 28090, 11033, 18099, 28303, 36055, 14914, 7891, 28018, 29640, 30729, 33232, 35392, 44132, 31702, 34324, 29295, 23458, 17729, 19603, 20610, 31028, 38125, 34944, 26110, 20579, 7841, 17454, 24025, 22431, 31949, 42731, 45157, 41515, 39474, 46711, 43895, 38576, 42778, 42517, 35319, 21160, -2108, -2899, 11367, 18821, 12356, 13639, 16597, 22103, 20293, 10126, 7366, 12821, 13718, 14053, 14965, 15450, 11877, 6388, 1771, 12336, 17619, 6991, -2998]
12865b998J0207J1938j1769r062J932N384Q676l682J4433J998l039M895L701l376
12851B9238n796Q324o522p209M978k934J512M459R643P820j1486j6179j0807Q568
12837A3609J222M464Q29q872l0j886M637P689j0916q333j220J5410K4492l318
12823C7777n377q879r604O133J0308J855P784L749j3291K326j515k582k61N205
12809C3628r366l967K531n846K070M951j970j501M319R169O615j707q208J2230
12795D2948l394n440m568Q121J4642k0m705M841p303l410q267k605q523j5247
12781G070j0224K2162J9562O276j721M969k476n454L037m793l887N603l001k261
12767C4862L37J1091k008r806O564J3419M692r363j1046K160j908l313k487p97
$$ y = [-2998, 7209, 19147, 7378, -1684, 248, 5632, 14308, 10626, 25059, 27057, 24018, 28913, 32614, 29238, 23442, 31766, 25244, 18035, 23013, 20079, 21591, 26050, 35693, 43513, 32027, 15848, 5041, 13609, 14831, 19295, 20124, 11252, 11222, 9336, 13973, 21662, 10746, 2413, 1193, 16603, 41095, 37777, 32400, 23521, 13917, 20050, 30358, 32213, 39997, 43746, 30455, 32781, 31266, 28684, 28423, 33628, 24262, 20295, 22826, 16980, 19050, 24001, 22031, 20530, 24849, 34018, 40633, 38926, 30718, 42948, 39554, 34114, 29546, 37667, 52309, 52289, 47584, 52425, 45122, 41712, 33445, 30840, 22317, 7070, -3154, 19008, 38570, 44846, 43125, 48094, 45618, 40164, 43201, 38408, 34521, 40124, 37123, 34862, 35199, 46290, 44282, 34476, 41040, 54459, 59151, 49788, 38742, 40902, 38994, 35681, 33194, 32397]
12753C2397j493r188j0343l553K269q41J6713P727k351p057o221P888j636q958
12739A5353j2532k25J0549j078J1302J3725J3505Q178j0986j5885J383Q735p949
12726C4075j3458N134K168N592Q147N38l090l869k919L92k246j4041j5094K2237
12712B3566J2152p808R012j781P070O976K520r965j2110L829O605m884M559n334
12698C4407o599k927j0010J629N980J5013J7615R122j1769l154j0924o06k225
12685C5552o143m366J0509K138k84J0316L898r746p87m958J975P797q268p160
12671C0473J3247J1030J6866Q475o651k4985j2233K376P570l49J4378M92j8390
12658D2299k609M087Q336K1003m536j3531q980k132r08N402L718P988J1832L947
$$ y = [32397, 30904, 21716, 11373, 7820, 10089, 9248, 25961, 33688, 31337, 24280, 18059, 25947, 24311, 15353, 2821, 2596, 13145, 12067, 23369, 37094, 50599, 58777, 47791, 31906, 33289, 42024, 34075, 20617, 25751, 27919, 33511, 41658, 42196, 39106, 35237, 32318, 32710, 30464, 16423, 1329, 23566, 35718, 27910, 36922, 35141, 42211, 49187, 51707, 41742, 29632, 33461, 40066, 35182, 39741, 34407, 27808, 24881, 14871, 16500, 22480, 37493, 55108, 64230, 52461, 49307, 38383, 37777, 35552, 29409, 25043, 35552, 37690, 37406, 47722, 51620, 41874, 41087, 36129, 38104, 45901, 37633, 30473, 43720, 54750, 71616, 80091, 73440, 48455, 36222, 38598, 46168, 45819, 60197, 60689, 42299, 39690, 43777, 52113, 73116, 68580, 55049, 46069, 43937, 43029, 48431, 52149, 60137, 71969, 75916]
12644G5916j752k53M21N96k915j2440M03j0139o788k995o615J6658J1750J31q255
12629E3723L014L129L707J600L06o764r54J0011L507j13o392P089O168J564j3863
12614F5732j5429o812o308R632L995J0726J7289m858m348j9769q151J4545K41
12601E6485R39L912j046N073K911J4604J0848J295Q974j1660j8899p304n670N743
12587F6205K784n252L084o471J3489J34O48J802m089N318Q574p510o511R124l021
12572G8308l625O458m076q407n815k589J2629M657J885M766q725q060N890P773
12558H1069R121O845l591j4177L921k392m655J0094l281q661O334L197J3861O317
12544A04002p738q332P883K619n925L304K907J1031M896J965j0906n140J415r879
$$ y = [75916, 74164, 73911, 74332, 74928, 72013, 59573, 59976, 49837, 43049, 40054, 33439, 50097, 61847, 61978, 53723, 56737, 59866, 63573, 65173, 65479, 58715, 57761, 67772, 71279, 71166, 64774, 71863, 78031, 79595, 65732, 50303, 43491, 37183, 46815, 50810, 61536, 78825, 73967, 69619, 49850, 41699, 56244, 56485, 57424, 61336, 60290, 65363, 68274, 82878, 93726, 95021, 103995, 92335, 73436, 66132, 60462, 66205, 68989, 63737, 66821, 60350, 73839, 73973, 74621, 76423, 72334, 77652, 86226, 78716, 72205, 81329, 78308, 74683, 81141, 77065, 68658, 62843, 60254, 72883, 77540, 79425, 84191, 75466, 67406, 73296, 81069, 90190, 97035, 93444, 79267, 83188, 80796, 76141, 86235, 82954, 74293, 80627, 83824, 97685, 104002, 96264, 87932, 95815, 98434, 92509, 95813, 98720, 109751, 114647, 116612, 105706, 100566, 101981, 92102]
12530I2102P510P463m975j4490j1292k130Q244J1775K251q251j4594J648J4550
12517H9811j1337k813J4933J6410j0660l466Q717Q260N647O612m28J562p983j2022
12503A03243r990l10P03J0412K909J473j0443Q88n704Q180j3867r26M729J2779
12489A04076p10q019M678Q334M949P468j0793o573L444l439L08L195M161p355
12475A03724k2886J593M681K153L135J4511L748J1578R533r98j0980r760j1409
12462I8623l263P964O650j755n383P98J877o41o564r197J2705J1238k490o433
12448A04129K455r391j728N221m260R81j28m906K5p179k525J2112L891m942M914
12433I8669l535o163N859N615L133m6R629r436O20N737j2250R463L017o167n359
$$ y = [92102, 99612, 107075, 102100, 87610, 76318, 74188, 82432, 94207, 96458, 88207, 73613, 75261, 89811, 78474, 75661, 90594, 107004, 96344, 92878, 101595, 109855, 115502, 122114, 121686, 123248, 115265, 103243, 93253, 92943, 93646, 104058, 106967, 108440, 97997, 98885, 93181, 101361, 87494, 86568, 91297, 104076, 103366, 95347, 100025, 108359, 113308, 120776, 109983, 103410, 106854, 103415, 103723, 106918, 111079, 103724, 80838, 82431, 87112, 89265, 92400, 106911, 110659, 122237, 131770, 130772, 119792, 110032, 98623, 95360, 103324, 109974, 108219, 102836, 103634, 105511, 104870, 98306, 89109, 101814, 113052, 110562, 104129, 106584, 97193, 95465, 100686, 96426, 97407, 97279, 92373, 92398, 85219, 82694, 94806, 98697, 93755, 98669, 95134, 88971, 94830, 100445, 103578, 103532, 113161, 103725, 104345, 110082, 97832, 107295, 110312, 104145, 98786]
12418I8786P349q274o027K1258J4829P209J419o806k1835l2488n766P267O400
12405H3321O764L724J5825K144K114L421l565N339n80j0660j0421J4531R046n102
12391A15901p780q509m152j1335k791K0490R317n869l776J8805M366n068m69K797
12377A21927j0479p571J766J2122O79p691N074q596R31J6053N103p397p802J5702
12363A29821j255j40k467m154p208K469J080J1468k09k1978j7730j145O793R259
12349A04604L754N683P762J8166k69j4799m616m987r650L243k400k713Q356J2473
12335A24607N112O702k1451k38m580j1191o25J1235L293q372j303j312N476o410
12321A00943M624J6270N974J0236j5419n876r968j9270j1835J2931O450k238L219
$$ y = [98786, 106135, 97861, 91834, 113092, 127921, 135130, 136549, 129743, 107908, 75420, 69654, 76921, 83321, 90085, 93809, 109634, 111778, 113892, 117313, 113748, 119087, 118507, 107847, 97426, 111957, 121003, 115901, 108121, 99612, 95460, 84125, 81334, 101824, 111141, 105272, 101496, 120301, 124667, 119599, 119130, 121927, 111448, 103877, 105643, 117765, 118444, 110753, 115827, 107231, 108162, 124215, 129318, 121921, 114119, 129821, 128566, 128426, 125959, 121805, 114597, 117066, 118146, 129614, 129405, 107427, 89697, 88552, 95345, 104604, 108358, 114041, 121803, 139969, 139700, 124901, 120285, 115298, 105648, 108891, 106491, 103778, 112134, 124607, 129719, 136421, 114970, 114732, 110152, 98961, 98336, 109571, 112864, 104492, 103189, 101877, 107353, 100943, 105567, 121837, 127811, 138047, 122628, 116752, 106784, 87514, 75679, 88610, 95060, 92822, 96041]
12308I6041m509o200J8751K255l749J916j492Q802L43j530j057k1775j4755k41
12294G2800l010J0649J3087M886N156k688q023L462P541P273r508k625o321j0523
12280H2156q62K0640J5290j0101j083j3297Q946k000n052J7912M472l515R398
12267A22904n653o277L214j5630l292M52m987j0824O268J5923J0475M6P502j835
12253A18286j0843j2791j3453O374J2892J4419o481l805M074N4J2482q282o613
12240A06313J9262J5546Q095J0631J1993K4704K8836m46K2185K6393K4710N627
12228C03849K902J1916J3279o332l5303j6224j0914l0090j8036j811m58j1653
12216B01125j3441R087J4370J9596N024n79K86J0592N805J1223K1900L0261J7954
$$ y = [96041, 91532, 85332, 104083, 106338, 102589, 104505, 103013, 111815, 112158, 110628, 109571, 87796, 73041, 72800, 69790, 80439, 93526, 98412, 103568, 100880, 92857, 96319, 103860, 111133, 101625, 99000, 92679, 82156, 81294, 101934, 117224, 107123, 106040, 92743, 101689, 99689, 94637, 112549, 117021, 113506, 122904, 117251, 110974, 114188, 98558, 95266, 95718, 90731, 79907, 86175, 102098, 112573, 112619, 120121, 118286, 107443, 94652, 81199, 87573, 100465, 114884, 108403, 104598, 108672, 108726, 121208, 112926, 106313, 125575, 141121, 149216, 159847, 171840, 196544, 225380, 224934, 247119, 273512, 298222, 303849, 306751, 318667, 331946, 325614, 290311, 274087, 263173, 233083, 215047, 213236, 212778, 201125, 187684, 196771, 211141, 230737, 235761, 235182, 235468, 246060, 251865, 263088, 284988, 315249, 333203]
12203C33203K0706R672J146L979K382J2433Q316p212r791N815j1930o002l510
12190C59207p327q593m779l4779k4770m038n191k2728j8424L388j397r122M25
12177B21872k671R147J4412J0074K721K3334K1629P532N537J4809J7492J5500
12165C61388p243j1639j5142o149n233j5324k6170j5529k0754j7960o478o719
12153B07048o377m223k0330j0529o962M769l030r042j3328j0118J1914j2899m562
12140A22331l016J836M963l251N960j485K931M217q981p825m816n412J1933J4616
12126A34001j4019r529J6358J3528k372m966m274J389K79q020m296j774l697o856
12112A05752r7J1312q338j4678N458J0520M647N041m581j0105l486k127j4475
$$ y = [333203, 353909, 363581, 364727, 368706, 371088, 383521, 391837, 384625, 374834, 380649, 368719, 362717, 359207, 351880, 343287, 338508, 303729, 278959, 274921, 269730, 247002, 228578, 231966, 230569, 221447, 221872, 219201, 228348, 242760, 252834, 255555, 278889, 300518, 308050, 313587, 328396, 345888, 361388, 354145, 342506, 327364, 321215, 315982, 300658, 274488, 258959, 238205, 220245, 213767, 207048, 200671, 196448, 176118, 165589, 158627, 163396, 160366, 151324, 137996, 127878, 139792, 126893, 122331, 119315, 121151, 126114, 122863, 128823, 127338, 130269, 134486, 125505, 117680, 112864, 107452, 119385, 134001, 119982, 110453, 126811, 140339, 137967, 133001, 128727, 130116, 130395, 122375, 118079, 116305, 112608, 105752, 105655, 116967, 108629, 93951, 99409, 109929, 114576, 119617, 115036, 104931, 101445, 99318, 84843]
12099H4843P002j462O2J1902m428l364J8648J1268l269l309q190o86m35L282L581
12084A15445J1493J0889p157j5316j6822m852J636L625j332P113O214J558j0152
12071A02342n878M150J1819K466o389J0605m851J129O265m509P541p237j8201
12058I9252k158Q500O137N433m853o884j714r696p922Q690m603K1659M355K210
12044A18406l909m097K963J838j0J107l229l429r868K183O442L464L612j849q6
12029A13538k952J585r483N811Q513J6916Q271p676j1467j9148j9061J5343K445
12016A02635J3934K2455O119j0998j1756J2352N426K742k16j928m01j253K444
12003A41555k57N318j3442j5116n00J4279q954K987J1449J420r243k3471j4201
$$ y = [84843, 91845, 90383, 90445, 102347, 97919, 94555, 113203, 124471, 121202, 117893, 109703, 109017, 108582, 111864, 115445, 126938, 137827, 130670, 115354, 98532, 93680, 95316, 98941, 97609, 104722, 110936, 112494, 102342, 96464, 100614, 112433, 114899, 108510, 119115, 114264, 115393, 121658, 117149, 124690, 117453, 99252, 97094, 105594, 111731, 117164, 112311, 105427, 103713, 94017, 86095, 94785, 90182, 111841, 116196, 118406, 114497, 110400, 113363, 115201, 115191, 116298, 113069, 109640, 99772, 101955, 108397, 111861, 115473, 113624, 113538, 110586, 112171, 102688, 108499, 117012, 133928, 142199, 134523, 123056, 103908, 84847, 100190, 102635, 116569, 139024, 145143, 134145, 122389, 134741, 140167, 142909, 142693, 140765, 140364, 139111, 141555, 141298, 146616, 133174, 118058, 117558, 131837, 122883, 125870, 137319, 138739, 129496, 106025, 91824]
11990I1824J1039P480Mq312j729O586J574l038K41J0332L585q637n862m393o290
11975I4404j2287P091J20J9440J2998J0534l16p76j4253q686R029J6816J048r55
11961A34207m027j0843m839J044q936R317M581O872l058j235J1765k296l880o438
11947A22234O7L682K704J5311j2180j2440J806k237J562j182M035P489p771j3507
11933A09573M048P875R447Q006q048j53R050l013r59j808l012p076k758J0518
11919A31690P511L633j2737r221l451J805P875J0483J952j2653j2569N526Q470
11906A28314n393J4632J389N326O192J2342q70p495O554R113L920p075j980J7002
11892A81971J0136m780J1137n213p600l165o307R926J7973J9024j555K458O526
$$ y = [91824, 102863, 110343, 110347, 102035, 100306, 106892, 108466, 105428, 105669, 116001, 119586, 110949, 105087, 100694, 94404, 82117, 89208, 89328, 108768, 121766, 132300, 131984, 131208, 116955, 108269, 117298, 134114, 135162, 134207, 130180, 119337, 114498, 115542, 106606, 115923, 120504, 127376, 124318, 123083, 134848, 132552, 128672, 122234, 122301, 125983, 128687, 143998, 131818, 119378, 121184, 118947, 120509, 119327, 123362, 130851, 123080, 109573, 113621, 121496, 130943, 138949, 130901, 130748, 139798, 136785, 135826, 134018, 131006, 123930, 121172, 131690, 139201, 142834, 130097, 120876, 117425, 119230, 127105, 137588, 139540, 126887, 114318, 119844, 128314, 122921, 137553, 138942, 144268, 150460, 162802, 161932, 154437, 160991, 170104, 174024, 166949, 164969, 181971, 192107, 187327, 198464, 193251, 185651, 182486, 176179, 186105, 204078, 223102, 221547, 224005, 230531]
11879B30531J8172K9907M2631M7754L7261L3732O1521O5009M4464L4431J2910
11868F58323J3143r132m6690n0310m0309m7894k6253j2642j971j564k538k733
11856D29430L801J3162J7368K3459L2942K6472J9433K7075K5161K6791K2816K9527
11844F97437J9496K1997J9608Q377N834M394J4610j180q741r586j9505k7073p341
11831G18327r393k6266j6296k4312l0150k5788l1236j1523p387p923m521j4256
11819E09276j3224K788J3724J9754L4530M9398N0352M2810N1909M0895K6002R981
11807H38195j0120k7489n3670o3219o5947o1872o1813n3426k8163k0106r315r749
11795C73306k1244k3427k0812j8233j3275j0193j1188L413Q579q112L487J7487
$$ y = [230531, 248703, 278610, 321241, 368995, 406256, 439988, 501509, 566518, 610982, 645413, 658323, 671466, 662334, 615644, 565334, 525025, 477131, 450878, 438236, 436265, 434701, 432163, 429430, 433231, 446393, 463761, 487220, 520162, 546634, 566067, 593142, 618303, 645094, 667910, 697437, 716933, 738930, 758538, 766915, 772749, 777143, 791753, 790573, 781832, 772246, 752741, 725668, 718327, 708934, 682668, 666372, 642060, 611910, 586122, 554886, 543363, 535976, 528053, 523532, 509276, 496052, 498840, 512564, 532318, 566848, 616246, 666598, 709408, 761317, 802212, 828214, 838195, 828075, 800586, 746916, 683697, 617750, 555878, 494065, 440639, 412476, 392370, 383055, 373306, 352062, 328635, 307823, 289590, 276315, 266122, 254934, 258347, 266926, 258814, 262301, 279788]
11783B79788P511r113l822j1783m940j7719p617O070n163l325k553M215J0498
11770B42047m217J478J2148J4149R256l671q058J2067Q255J456N869N005J1546
11757C07330M745l785j7386j1886l254R40l362L793q310k1849q610j20r451J2374
11743B41169O807K893r827r793Q775J256J0284o431j0267R150P995J6043J0958
11730B79012J4544J6610K2012K0582J7400K5769N258J255j2271q35p307l258J828
11717C80599M004K677k186j5719k923q033o513j5160p959j692L834j130K456N890
11703C38145m137K836M179p690j1696n158K040l813n054P170J4042m57o892P140
11689C30655J1714J7412R114J7421K6767O108J3701j967m515M364l339k0715k6302
$$ y = [279788, 287299, 278186, 274364, 262581, 257641, 239922, 232305, 238375, 233212, 229887, 227334, 231549, 242047, 237830, 239308, 251456, 265605, 274861, 271190, 263132, 275199, 283454, 284910, 290779, 295784, 307330, 312075, 308290, 290904, 279018, 275764, 276704, 273342, 277135, 268825, 246976, 238366, 238246, 228795, 241169, 247976, 250869, 241042, 231249, 240024, 241280, 251564, 245133, 234866, 244016, 252011, 268054, 279012, 293556, 310166, 332178, 352760, 370160, 395929, 401187, 402442, 390171, 389336, 382029, 378771, 380599, 384603, 387280, 385094, 369375, 366452, 358419, 351906, 336746, 328787, 327095, 330929, 329799, 332255, 338145, 334008, 336844, 341023, 333333, 321637, 316479, 318519, 314706, 309652, 316822, 330864, 330407, 323515, 330655, 342369, 359781, 368895, 386316, 413083, 419191, 432892, 430925, 426410, 430774, 427435, 406720, 380418]
11676C80418K962o832r051o596J766j936M139K322J912l156n374M238J3454q813
11662C69453m39J7408P746L455j0145j3900j3859K865K423q611j232P932J4212
11649C77308n664j2260L982L850r765n45j5542j4510J5880L1839J9886Q873K725
11636D06057j899m947J3069K651m661j7737J098R380m890J25J3143O521j6258
11623D01652j5876N183J0993J860J2265J2869K733k549J0960K0735J6237J8481
11611D95543K688p657N331M254l536K472O967q312J15k132J274K478Q147J9164
11597E26796J5378K1794J7863M178J057K5167J6419J7693N252K098J2242K4532
11585F90469L2388L9656K9503J5967J4127L2340K0883K1044J7913J4868L2169
$$ y = [380418, 383380, 376548, 367497, 360901, 362667, 360731, 364870, 367192, 369104, 365948, 360574, 364812, 378266, 369453, 369014, 386422, 394168, 397623, 387478, 373578, 359719, 362584, 365007, 356396, 355164, 363096, 377308, 371644, 359384, 363366, 367216, 357451, 356906, 341364, 326854, 342734, 374573, 394459, 403332, 406057, 404158, 399211, 412280, 414931, 410270, 392533, 393631, 403011, 398121, 398246, 411389, 417910, 401652, 385776, 390959, 401952, 403812, 416077, 428946, 431679, 429130, 440090, 460825, 477062, 495543, 498231, 490574, 495905, 500159, 496623, 499095, 506062, 497750, 497865, 495733, 497007, 499485, 507632, 526796, 542174, 563968, 581831, 586009, 587066, 612233, 628652, 646345, 651597, 653695, 665937, 690469, 722857, 762513, 792016, 807983, 822110, 854450, 875333, 896377, 914290, 929158, 961327]
11574I61327L112j5690k1540Q286o963K1948J6671J8708L3233K9077K6030K0137
11562A094336L0300K1976K9947L1971K2597Q687J7367R490N808J2169L569Q501
11550A296718J2070j2231k3492j3751j0869j2245m837M456q836o552P361J5009
11538A242801K3553J2867P819K013Q986J5087J4767J2862J9495L9175L1635M1506
11526A472566L9890L4719J8677L1375J1159m48J3369J0604J4754J0242Q963J1714
11514A677584J8973Q293j3695k2547q211p787m503R32M469N097J2181J4372P016
11501A692174L567J8222J3265J4895Q657L791L198M1906N1708L8672M6489N2535
11489A989079N2499O0328M9545N0731O3079P5463O5983P9538Q1012P8362J07144
$$ y = [961327, 964439, 948749, 927209, 935495, 928532, 950480, 967151, 985859, 1019092, 1048169, 1074199, 1094336, 1124636, 1146612, 1176559, 1208530, 1231127, 1239814, 1257181, 1266671, 1272479, 1284648, 1288217, 1296718, 1308788, 1296557, 1273065, 1259314, 1248445, 1236200, 1231363, 1235819, 1226983, 1220431, 1227792, 1242801, 1266354, 1279221, 1287040, 1289053, 1298039, 1313126, 1327893, 1340755, 1360250, 1399425, 1431060, 1472566, 1512456, 1547175, 1565852, 1597227, 1608386, 1607938, 1621307, 1631911, 1646665, 1656907, 1665870, 1677584, 1696557, 1704850, 1691155, 1668608, 1660397, 1652610, 1648107, 1649039, 1653508, 1658605, 1670786, 1685158, 1692174, 1695741, 1713963, 1727228, 1742123, 1750780, 1754571, 1757769, 1799675, 1851383, 1890055, 1936544, 1989079, 2041578, 2101906, 2151451, 2202182, 2265261, 2340724, 2406707, 2486245, 2567257, 2645619, 2752763]
11478B752763J14718J17202J31911J53042J76137K08370K13395K50245K78603
11469D396386L13900L63084M19363M82108N59035O21263P17935Q38748R76083
11460I687905J184580J487517J845764K343616L003878L851626M922170O201660
11452C4528716P586597Q716256R284623R038821P880832N915130L344037L52326
11444H6647338k712584n313591o881110p183048o538397n345433l955115k565866
11436D6152194j284286j37347R18789J911417K866691L785915M660322N510691
11428F4384386O273422O853412P172262P173686O836151O163198N180387L983892
11420A14020796K685148J396915K65575o52275j318879j766050k003722k168550
$$ y = [2752763, 2867481, 2984683, 3116594, 3269636, 3445773, 3654143, 3867538, 4117783, 4396386, 4710286, 5073370, 5492733, 5974841, 6533876, 7155139, 7873074, 8711822, 9687905, 10872485, 12360002, 14205766, 16549382, 19553260, 23404886, 28327056, 34528716, 42115313, 50831569, 60116192, 69155013, 77035845, 82950975, 86295012, 86647338, 83934754, 78621163, 71740053, 64557005, 58018608, 52673175, 48718060, 46152194, 44867908, 44730561, 45649350, 47560767, 50427458, 54213373, 58873695, 64384386, 70657808, 77511220, 84683482, 91857168, 98693319, 104856517, 110036904, 114020796, 116705944, 118102859, 118368434, 117716159, 116397280, 114631230, 112627508, 110458958]
11412A10458958k312157k429233k542622k659971k784324k882905k970389l024679
11404H8852678l072143l076206k997348k851218k562264k154067j573848p66049
11396F9799535L09102J712657L482948N653420Q038453J0322213J1865372J2115615
11388A23299315J0746966P825149L752485j019379o035637j0686136j4015895
11381A13866868j5188800j4270075j2177417r829371p730328o031527m739469
11374D3899881l770009l043239k505770k111823j811724j597993j441434j291734
11366B6326155j189799j094891j018610r46062q75130q47001q10675p80205p46378
11357A8017404p29541p00460o47084n88897n44737n01964m80291m42617m08872
$$ y = [110458958, 108146801, 105717568, 103174946, 100514975, 97730651, 94847746, 91877357, 88852678, 85780535, 82704329, 79706981, 76855763, 74293499, 72139432, 70565584, 69799535, 70108637, 71821294, 75304242, 80957662, 88996115, 99318328, 111183700, 123299315, 134046281, 141871430, 145623915, 144604536, 138568899, 127882763, 113866868, 98678068, 84407993, 72230576, 62401205, 54670877, 48639350, 43899881, 40129872, 37086633, 34580863, 32469040, 30657316, 29059323, 27617889, 26326155, 25136356, 24041465, 23022855, 22076793, 21201663, 20354662, 19543987, 18763782, 18017404, 17287863, 16587403, 15940319, 15351422, 14806685, 14304721, 13824430, 13381813, 12972941]
11348A2972941l71653l53740l47270l24772l30246l19599l05468l05562l05703
11339A0008928l08436k94218k84556k71352k59173k46008k39148k28082k05108
11330G672847k04868k12164j95101j72487j62495j68726j55658j43072j44069
11321F114207j40594j59363j37155j29647j31203j21013j17890j15322r9104q3869
11311D879047q5791q9766r4952q5728p1948o8008p1968p1073p3579p7475q5169
11300D003590q7414q7652o4450n3340o0091o0657m9282m0453l2864l0317l6883
11289C400187k7612j9348K763J1715O402K7335O2171N7591P4284Q0938P6874Q9512
11277C842812J06321J25530J41896J21649R9421P4046L5769J6571m0536p4222
$$ y = [12972941, 12601288, 12247548, 11900278, 11575506, 11245260, 10925661, 10620193, 10314631, 10008928, 9700492, 9406274, 9121718, 8850366, 8591193, 8345185, 8106037, 7877955, 7672847, 7467979, 7255815, 7060714, 6888227, 6725732, 6557006, 6401348, 6258276, 6114207, 5973613, 5814250, 5677095, 5547448, 5416245, 5295232, 5177342, 5062020, 4962916, 4879047, 4793256, 4703490, 4608538, 4522810, 4450862, 4382854, 4310886, 4239813, 4166234, 4088759, 4003590, 3916176, 3828524, 3764074, 3710734, 3650643, 3589986, 3540704, 3500251, 3467387, 3437070, 3400187, 3372575, 3353227, 3355990, 3367705, 3374107, 3401442, 3463613, 3521204, 3595488, 3676426, 3753300, 3842812, 3949133, 4074663, 4216559, 4338208, 4437629, 4511675, 4547444, 4564015, 4523479, 4449257]
11267D449257j21813j37281j42301j66083j60920j40094j40751j38031j33109
11258C168874j21187p4129n6509n0095m6143n1885n7264n4722m9043l7714l3635
11247B536548k0150k7787k9078k0085j0499o787j4008N708o577o978j0721O284
11235B395870j667k895N020k481L585J5712K0544J5180J2265O328K1033J8533
11223B507027K6055L0767K7007M0693L4198K8784L2656L3719M8701N0066M3010
11212B902683L4393L9442L3275M4948M9701N4261N7719N8905N8311O5332O3203
11201C462173Q4458R1495R2644J00250J14379J08589J18978J17195J33608J57773
11191D581542J66804J68748J89117J96696K00992K25920K68237L10283L32795
$$ y = [4449257, 4327444, 4190163, 4047862, 3881779, 3720859, 3580765, 3440014, 3301983, 3168874, 3047687, 2973558, 2917049, 2866954, 2820811, 2768926, 2711662, 2656940, 2607897, 2570183, 2536548, 2516398, 2488611, 2459533, 2439448, 2428949, 2422162, 2408154, 2413862, 2407285, 2400307, 2389586, 2395870, 2394203, 2391308, 2396328, 2393847, 2397432, 2413144, 2433688, 2448868, 2461133, 2467461, 2488494, 2507027, 2533082, 2563849, 2590856, 2631549, 2665747, 2694531, 2727187, 2760906, 2809607, 2859673, 2902683, 2937076, 2976518, 3009793, 3054741, 3104442, 3158703, 3216422, 3275327, 3333638, 3398970, 3462173, 3546631, 3638126, 3730770, 3831020, 3945399, 4053988, 4172966, 4290161, 4423769, 4581542, 4748346, 4917094, 5106211, 5302907, 5503899, 5729819, 5998056, 6308339, 6641134]
11182F641134L69157M20185M76284N08025N84955O46537P34128Q23404R33433
11173A2137242J062470J220177J409980J635276J916176K241569K667269L188039
11165B7478198L820171M588259N510160O538345P579432Q525635R169491R293253
11157H2502944Q757649P507930N628357L307799P37109j770081l849757n195155
11149I7626795n688018n446515m614996l454923k172308r15124J50930R48883
11141G6434724J435309J603323J521254J215069P95737L74058P6634j851J99837
11132H3654094O54635J332852K090213K826525L412687L733332L723768L370084
11124A04798190K649869J647354N18435n97090j558556k290103k741596k908315
$$ y = [6641134, 7010291, 7430476, 7906760, 8414785, 8999740, 9646277, 10380405, 11203809, 12137242, 13199712, 14419889, 15829869, 17465145, 19381321, 21622890, 24290159, 27478198, 31298369, 35886628, 41396788, 47935133, 55514565, 64040200, 73209691, 82502944, 91260593, 98768523, 104396880, 107704679, 108441788, 106671707, 102821950, 97626795, 91938777, 86492262, 81877266, 78422343, 76250035, 75334911, 75485841, 76434724, 77870033, 79473356, 80994610, 82209679, 83005416, 83379474, 83456108, 83454257, 83654094, 84308729, 85641581, 87731794, 90558319, 93971006, 97704338, 101428106, 104798190, 107448059, 109095413, 109613848, 109016758, 107458202, 105168099, 102426503, 99518188]
11116I9518188k905871k844545k839496k916916l069168l259064l391084l365069
11108G4926975l161356k755635k187992j512620p51557O4763Q91114J621994K223473
11099F9359159K630589K761075K558443J991728J131888M7441j165590k406409
11091G6908324l480404m305636m806560n005382m906894m596207m166561l708620
11083D1932060l256097k823648k466864k164105j883787j665636j484310j332941
11075B4854672j211875j092809r95050r29571q68009q01734p56453p20039o90189
11066A6788943o47293n91532n39585n19373n02804m71201m40132m28590l98134
11057A2250299m02434l88536l50528l18242l07544l02677k93567k80108k77969
$$ y = [99518188, 96612317, 93767772, 90928276, 88011360, 84942192, 81683128, 78292044, 74926975, 71765619, 69009984, 66821992, 65309372, 64557815, 64622578, 65513692, 67135686, 69359159, 71989748, 74750823, 77309266, 79300994, 80432882, 80480323, 79314733, 76908324, 73427920, 69122284, 64315724, 59310342, 54403448, 49807241, 45640680, 41932060, 38675963, 35852315, 33385451, 31221346, 29337559, 27671923, 26187613, 24854672, 23642797, 22549988, 21554938, 20625367, 19757358, 18955624, 18199171, 17479132, 16788943, 16141650, 15550118, 15010533, 14491160, 13988356, 13517155, 13077023, 12648433, 12250299, 11847865, 11459329, 11108801, 10790559, 10483015, 10180338, 9886771, 9606663, 9328694]
11048I328694k49164k47957k59961k60018k21377k14079k01214k17211k15161
11039G242552j85428j82004j74859j73165j78325j81884j59069j38898j29025
11030E739895j33509j33935j32993j21102j07384r5226r9685q7704p9222n5968
11020D693167l9288o1630m5400m9816m9565p6977o1579p3520p2435o5777o3960
11009D033220p8257q7355p9565j01639j23531j23118j07992r2189q2321p9668
10999C077585p0334o5659n4335m6703m2464l1328m8413m5768m1365l4304l6184
10988B560728l9665l5495k2620j1202k1587k6765j8963l7484l5368k3991o246
10977B281342q767l4839l4244m8083m5552m8195n7102n8105p8697o8601p4915
$$ y = [9328694, 9079530, 8831573, 8571612, 8311594, 8090217, 7876138, 7674924, 7457713, 7242552, 7057124, 6875120, 6700261, 6527096, 6348771, 6166887, 6007818, 5868920, 5739895, 5606386, 5472451, 5339458, 5218356, 5110972, 5015746, 4916061, 4828357, 4749135, 4693167, 4653879, 4592249, 4546849, 4497033, 4447468, 4370491, 4308912, 4235392, 4162957, 4097180, 4033220, 3954963, 3867608, 3788043, 3686404, 3562873, 3439755, 3331763, 3239574, 3157253, 3077585, 3007251, 2941592, 2887257, 2840554, 2798090, 2766762, 2718349, 2672581, 2631216, 2596912, 2560728, 2521063, 2485568, 2462948, 2451746, 2430159, 2403394, 2384431, 2346947, 2311579, 2287588, 2281342, 2272575, 2237736, 2203492, 2155409, 2109857, 2061662, 2004560, 1946455, 1867758, 1799157, 1724242]
10966A724242n3653m8122n1723n7244n4455k5698p359j1576j3464K396n869k319
10954A395156m196j4384j2227k7475l9342k3362j6815l2440m1764l7446l6275
10943A109430l1890l5367l7453l7480l2838l0756l3203j7059l0691j2112Q897
10932H19478o363j2503j5884k1755k5786j5775j1950J558L266J1876j020o035
10920G19107j6426j6672j384l454o938R917p721m173m396l184j6076k455j406
10907F44739L93r411j3542k923o1J244O989R721P603j6070j9989o848K212j997
10893F02060r141j4478p334j338L456R27n921j1776l768n339n378r391j487j566
10879E29526P976j2131j946m70K752N5o506k3015q175j0386J855j1007n654J1843
$$ y = [1724242, 1670589, 1622467, 1570744, 1513500, 1459045, 1433347, 1425988, 1414412, 1400948, 1403344, 1397475, 1395156, 1390960, 1376576, 1364349, 1336874, 1297532, 1274170, 1257355, 1224915, 1183151, 1145705, 1109430, 1077540, 1042173, 1004720, 967240, 934402, 903646, 870443, 853384, 822693, 810581, 819478, 813115, 800612, 784728, 762973, 737187, 721412, 709462, 711020, 714286, 726162, 725142, 719107, 702681, 686009, 684625, 681171, 674233, 684150, 676429, 672256, 667860, 664676, 648600, 646145, 644739, 645132, 635721, 622179, 619256, 619195, 620439, 627428, 637149, 644752, 628682, 608693, 601845, 604057, 602060, 592919, 578441, 571107, 569769, 573225, 574152, 568231, 556455, 552687, 547348, 541970, 532579, 531092, 529526, 537502, 525371, 523425, 522955, 525707, 525762, 519256, 496241, 488066, 477680, 479535, 468528, 462874, 474717]
10865D74717o374p073O728l892j4499J794p803p219q511J20p055r852k299p21
10851D08061R45K709K783j1144j7469k9M0p643m16q567j0378r052m422l991P227
10836C48654n634k0015r870l520N089l51N921j2672j5681l68k906j0967P87q948
10822B69519O911J1615J2073j1517j5566j8669j1818K493j185Q092l116k719J477
10809B47590L791p962j7498J559K0027M3j0178j6219j751J1656J4235r129j0993
10796B25171J684m88L241L834k085J9j3957j369j726J6681J4685j176k0661j4581
10782B09272k703Q695J865Q736R267o049q393j961M671n462n625l441J7300k051
10768B24121k2141l522K8260n32R508j902r491q520Q179j095O44O996J9580m31
$$ y = [474717, 468343, 461270, 467998, 464106, 449607, 451401, 443598, 436379, 427868, 427988, 420933, 411081, 408782, 408061, 409006, 411715, 414498, 403354, 385885, 385856, 385896, 378253, 377837, 369270, 358892, 349840, 345418, 341427, 348654, 343020, 323005, 313135, 309615, 314704, 314353, 320274, 307602, 291921, 291553, 288647, 277680, 278467, 269519, 276430, 288045, 300118, 288601, 273035, 254366, 242548, 245041, 243856, 251948, 248832, 246113, 247590, 251381, 243419, 225921, 227480, 247507, 247550, 237372, 221153, 219402, 231058, 245293, 236164, 225171, 226855, 226367, 229608, 233442, 231357, 231376, 217419, 216050, 214324, 231005, 245690, 244514, 223853, 209272, 206569, 215264, 217129, 225865, 235132, 229083, 220690, 218729, 223400, 217938, 212313, 208872, 226172, 224121, 201980, 198458, 226718, 226186, 235694, 233792, 224301, 215781, 223960, 222865, 223509, 230505, 250085, 249654]
10754B49654M303j183j1998j7249N798J0024p467J0504J6705M856K0299J4055
10742B98301J0836J2914J8114K5985L9434J3730R879L0360L8501M2156L7733L5593
10730F13536M1055L1925J6691j977k729j4926k0864l4238l7380j5561j3752j2478
10718E49302l831m960j0387Q204J5571J3145J7140K2585N161j5234J2746J0733
10706F20175n328R516K5139J6125K0956K3738K9363J8701O270p069p161j6480
10694G33945L323j7144j5945j2431k0068j6318k169p156j6195j3909q480j6338
10682E91115k9248j7373p75M606l306j8128n768K116J5442J5538J4885K0169J8631
10669F07904Q012J0340k788j4862j0308j5898j5142j0330j0888m2256l0959k7027
$$ y = [249654, 253957, 252774, 240776, 223527, 229325, 239349, 231882, 242386, 259091, 263947, 284246, 298301, 309137, 322051, 340165, 366150, 405584, 419314, 429193, 459553, 498054, 540210, 577943, 613536, 654591, 686516, 703207, 701230, 698501, 683575, 662711, 628473, 591093, 575532, 561780, 549302, 545471, 540511, 530124, 538328, 553899, 567044, 584184, 606769, 611930, 596696, 609442, 620175, 614847, 624363, 649502, 665627, 686583, 710321, 739684, 758385, 764655, 757586, 750425, 733945, 737268, 720124, 704179, 691748, 671680, 655362, 653193, 646037, 629842, 615933, 607453, 591115, 561867, 544494, 543719, 548325, 545019, 526891, 521123, 523239, 538681, 554219, 569104, 589273, 607904, 615916, 626256, 623468, 608606, 598298, 582400, 567258, 556928, 546040, 503784, 472825, 445798]
10657D45798k6846j7757k3803j4561j4105k9227j5175j902O45j0282M73O084k77
10644B99065n794P303J4677k631P581J2893J6242J709j2504n9Q176K2931J7012
10631C86601J3729L0834N9249Q3502Q8686J06687J10671J39698J63118J71397
10621A354172J64909J36990R3300O3356L453m3947r0474j22810j37518j47095
10611A274336j35858j47943j32353j18444r9577o2223m6536k9862q278j3966l1656
10600D47640j9650j9333k8322k4353O306R454q149n564R067P533r806k2447j8901
10587C23475j6822p875m723L928n886k12N81J920l00N353J0196Q943J1019J3055
10573C42652K0582J8646M2580L7700M5704O9713R6105J15258J28751J32736J52819
$$ y = [445798, 418952, 401195, 377392, 362831, 348726, 319499, 304324, 302422, 303067, 292785, 293258, 299342, 299065, 293271, 300574, 315251, 312620, 320201, 333094, 349336, 351045, 338541, 338482, 346658, 369589, 386601, 400330, 431164, 490413, 573915, 662601, 769288, 879959, 1019657, 1182775, 1354172, 1519081, 1656071, 1749371, 1812727, 1816180, 1772233, 1681759, 1558949, 1421431, 1274336, 1138478, 990535, 858182, 739738, 640161, 577938, 531402, 501540, 493262, 479296, 447640, 427990, 408657, 380335, 355982, 362288, 371742, 363593, 358029, 367096, 374629, 364823, 342376, 323475, 306653, 298778, 294055, 297983, 292097, 291885, 292466, 294386, 294086, 299439, 309635, 318578, 329597, 342652, 363234, 381880, 424460, 462160, 507864, 577577, 673682, 788940, 917691, 1050427, 1203246]
10562A203246J68007J53338J30241J09461P1070L961m5530j00078j31062j47082
10552A415572j63454j63807j36797j16124j07852q4185m4330l3375l7722n5762
10542D72164k2834m256j0188j5399j4882o830N799k1763j7001r350j7404j6471
10530C21585R982r175j0527J262j5046k4323j8736r438m92L752k26p130Q53K430
10516B44771j2014J2580n869o464R223q103j504m337P333P398j2540R53p62J5465
10502B46130O33J1320j1260j3668k863j7980M999K5516R398M297J3707L753L761
10489B77743p743P495o412K188J9371J1946M059J3536Q53J435l137O421J4993
10476C42748L558P830P998K4257K607j5106j2562j0328L456o19r286j6934K163
$$ y = [1203246, 1371253, 1524591, 1654832, 1764293, 1835363, 1839324, 1793794, 1693716, 1562654, 1415572, 1252118, 1088311, 951514, 835390, 727538, 643353, 599023, 565648, 527926, 472164, 449330, 445074, 434886, 419487, 404605, 397775, 403574, 381811, 364810, 355460, 338056, 321585, 331567, 322392, 311865, 313127, 298081, 273758, 255022, 245584, 245092, 248844, 248618, 241488, 242341, 244771, 232757, 245337, 239468, 233004, 242227, 234124, 232620, 228283, 235616, 243014, 230474, 231427, 230665, 246130, 246763, 258083, 246823, 233155, 230292, 212312, 217311, 242827, 252225, 256522, 270229, 273982, 277743, 270000, 277495, 271083, 273271, 292642, 304588, 308647, 322183, 323036, 324471, 321334, 327755, 342748, 346306, 354136, 362134, 386391, 388998, 373892, 361330, 351002, 354458, 353839, 344553, 327619, 329782]
10463C29782J379j723j3565p488J5820P550o516J051J7135j5538j6710m949n808
10450C00420q08M532P511L511O71k6237j1100j3479N124M165L061R733J990N563
10436B94657M461J138P455Q388j8707j9054j629J3644O93j3225m377O249Q286
10423B87979r212j683R702J5519K5455J7748J1596K6285K8981L2467L0880L0255
10411E05972L653L499O014j7517K563o388L029Q580J2358K987K228q873m136j0845
10397E03124n777J9024P234l362j928N207J5186J6986K0961m32K948P054J2210
10384E98435K630q501o732J142j2409j5862j6090k4260l0697k2231j3529j7429
10372D34467j9481j7104k733k3771o689j3596N127j703P92n20j303o971K837K2765
$$ y = [329782, 331161, 329438, 315873, 308385, 324205, 331755, 325239, 326290, 343425, 327887, 311177, 306228, 300420, 299612, 304144, 311655, 315166, 315837, 289600, 278500, 265021, 270145, 274310, 277371, 287104, 289094, 294657, 299118, 300256, 307711, 316099, 297392, 278338, 276709, 290353, 291046, 277821, 273444, 279693, 287979, 278767, 277084, 286786, 302305, 327760, 345508, 357104, 383389, 412370, 444837, 475717, 505972, 509625, 513124, 519138, 501621, 504184, 497796, 500825, 509405, 521763, 524750, 526978, 518105, 513969, 503124, 497347, 516371, 523605, 520243, 518315, 523522, 538708, 555694, 576655, 576223, 579171, 586225, 598435, 601065, 592564, 585832, 586974, 574565, 558703, 542613, 518353, 487656, 465425, 451896, 434467, 414986, 397882, 395149, 371378, 364689, 351093, 356220, 354517, 355309, 354789, 353486, 346515, 349352, 372117]
10358C72117P879J2493K8834M7830N1619K3821L2722M9982M4394M1957L0431J6687
10346G60766J0094O687J0382P124k596J0389R965N570M783J9935J0839K4310L3356
10333I11604M9186N1296K3186J9405J7012L4736K7751J0053O152j3575o609j854
10321A128343k0929m997r712m0957l3817j5156j8296k4032l4071j8111k3265n643
10309H79357J932J4047J5689O050J703J7804K0284J8038J4627K1629K0571L0833
10297A062564K5536L9142M3785N2323P0101O5160O3356Q5793R4969Q1586O9548
10286A753863P2868P0865M5592M1793L9249K1284J1986L1255N2821J1648j0116
10275B143108J408N485P478K1741L3023L2496L4004O2025Q7797R4835R8974J18150
$$ y = [372117, 379996, 392489, 421323, 469153, 520772, 544593, 577315, 627297, 671691, 713648, 744079, 760766, 770860, 777547, 787929, 795053, 792457, 802846, 812811, 818381, 823164, 843099, 853938, 878248, 911604, 960790, 1012086, 1035272, 1054677, 1071689, 1106425, 1134176, 1144229, 1150381, 1136806, 1130197, 1128343, 1107414, 1102417, 1092705, 1051748, 1017931, 1002775, 984479, 960447, 926376, 908265, 885000, 879357, 881289, 895336, 911025, 917075, 918778, 936582, 956866, 974904, 989531, 1011160, 1031731, 1062564, 1088100, 1127242, 1171027, 1223350, 1293451, 1358611, 1421967, 1507760, 1602729, 1684315, 1753863, 1826731, 1897596, 1943188, 1984981, 2024230, 2045514, 2057500, 2088755, 2141576, 2153224, 2143108, 2144516, 2150001, 2157479, 2179220, 2212243, 2244739, 2278743, 2340768, 2428565, 2523400, 2622374, 2740524]
10263B740524J33496J25779J50742J38278J52577J68745J87334K11162K31428
10254D240065K85206L46727M15512N00377N91048P01861Q47348R81861J121190
10245A0031195J259987J359799J448125J571369J672408J794430J965974K247630
10237B3350917K672127L351845M404186N932386Q023991J0780873J4230692J8068651
10229I0815668K1908186K5503268K8322836K9683638K8936010K6051444K1499717
10222B72720767J5124437P065525j601802r724058j6719154k2348474k6152896
10215B18364345k7879001k7322228k4934321k1960390j8526695j4623281j1154714
10208G1963715q439199o302665m702171l626870k923394k438423k107555j864750
$$ y = [2740524, 2874020, 2999799, 3150541, 3288819, 3441396, 3610141, 3797475, 4008637, 4240065, 4525271, 4871998, 5287510, 5787887, 6378935, 7080796, 7928144, 8910005, 10031195, 11291182, 12650981, 14099106, 15670475, 17342883, 19137313, 21103287, 23350917, 26023044, 29374889, 33779075, 39711461, 47735452, 58516325, 72747017, 90815668, 112723854, 138227122, 166549958, 196233596, 225169606, 251221050, 272720767, 287845204, 294910729, 293308927, 283584869, 266865715, 244517241, 218364345, 190485344, 163163116, 138228795, 116268405, 97741710, 83118429, 71963715, 63524516, 57221851, 52519680, 48892810, 45969416, 43530993, 41423438, 39558688]
10200C9558688j674743j536368j422105j339413j257013j171461j096777j015747
10192B9045061r48431q45954p44233o12478m59603l13775j18108N2976K01148
10183B5256603L88690N89332P94927R91511J206037J450868J750335K163104K783907
10174C7375314L650864M951191O817120R328162J2591721J6531597K0633457K4713694
10166A36593120K8407309L0533896L0721380K8691917K4259608J7905590R232123
10159C06344943k06184q576698j7033725k4119661k7498699k9112542k9201291
10152A70596143k6412931k2649762j8891607j4869471j1262235q482030o428534
10145F1599573m935289l928639l258669k788195k469320k232633k065348j919204
$$ y = [39558688, 37883945, 36347577, 34925472, 33586059, 32329046, 31157585, 30060808, 29045061, 28096630, 27250676, 26506443, 25893965, 25434362, 25120587, 25002479, 25055455, 25256603, 25645293, 26234625, 27029552, 28021063, 29227100, 30677968, 32428303, 34591407, 37375314, 41026178, 45977369, 52794489, 62122651, 74714372, 91245969, 111879426, 136593120, 165000429, 195534325, 226255705, 254947622, 279207230, 297112820, 306344943, 306138759, 297562061, 280528336, 256408675, 228909976, 199797434, 170596143, 144183212, 121533450, 102641843, 87772372, 76510137, 68028107, 61599573, 56664284, 52735645, 49476976, 46688781, 44219461, 41986828, 39921480, 38002276]
10137C8002276j794565j677440j588587j504220j415500j324412j230398j159202
10129B6307952j075425r89806r13986q43158p81276p18362o74210o40105o03822
10120A9067802n61352n53787n38570n24938n23952n27483n19621n07588n06866
10111A4303645n06780m91710m67557m58774m37221m35338l95336l60804l69306
10102A0380819l38146l08581l04831k84537k56047k28779k30847k12462k01860
10093H014729k17582j99409j85864j79300j85694j66302j38582j41277j42090
10084F458629j43564j20409j12024j40939j56054j54782j33029j32582j63618
10075E201628j63624j61827j62700j55534j45269j40879j56678j37702j49688
$$ y = [38002276, 36207711, 34530271, 32941684, 31437464, 30021964, 28697552, 27467154, 26307952, 25232527, 24242721, 23328735, 22485577, 21704301, 20985939, 20311729, 19671624, 19067802, 18506450, 17952663, 17414093, 16889155, 16365203, 15837720, 15318099, 14810511, 14303645, 13796865, 13305155, 12837598, 12378824, 11941603, 11506265, 11110929, 10750125, 10380819, 10042673, 9734092, 9429261, 9144724, 8888677, 8659898, 8429051, 8216589, 8014729, 7797147, 7597738, 7411874, 7232574, 7046880, 6880578, 6741996, 6600719, 6458629, 6315065, 6194656, 6082632, 5941693, 5785639, 5630857, 5497828, 5365246, 5201628, 5038004, 4876177, 4713477, 4557943, 4412674, 4271795, 4115117, 3977415, 3827727]
10066C827727j51812j29860j26680j23393j26133j24661j03091p9684q3063p4150
10056B705200n1869m4403m9171m8733l2912k8144n0741m5866l9225n8196n2622
10045B203318k3273l6495l0590l2623l1909k9683j7084k0501k8145m1868k0521
10034A890626k0582l1585l6762k4226l5112k4983k0364l2644k5288l3252l8020
10023A567808m4727m5747l7191l4566l1350l0546l8816m5698m6218m6799l9480
10012A126670k3323j6260m2421n0027l0135l5520m8072m0179m0850l6368m9685
10001G13830n0002k3551l2544k3116q393j8831o424o229J8234K42j1115j407l07
9988E50387M414N326k051J1952J2521R088j4982j1036r069K215JP72p042n754
$$ y = [3827727, 3675915, 3546055, 3419375, 3295982, 3169849, 3045188, 2942097, 2862413, 2779350, 2705200, 2653331, 2608928, 2559757, 2511024, 2478112, 2449968, 2399227, 2353361, 2314136, 2255940, 2203318, 2180045, 2143550, 2112960, 2080337, 2048428, 2018745, 2001661, 1981160, 1953015, 1911147, 1890626, 1870044, 1838459, 1801697, 1777471, 1742359, 1717376, 1697012, 1664368, 1639080, 1605828, 1567808, 1523081, 1477334, 1440143, 1405577, 1374227, 1343681, 1304865, 1259167, 1212949, 1166150, 1126670, 1103347, 1087087, 1044666, 994639, 964504, 928984, 880912, 840733, 799883, 763515, 713830, 663828, 640277, 607733, 584617, 576224, 557393, 550969, 544740, 562974, 563216, 552101, 550694, 550387, 554801, 560127, 558076, 570028, 582549, 591637, 576655, 565619, 556550, 558765, 558766, 559538, 552496, 546742]
9974E46742j960Q236N710j0205l865O090O194K3736K2702J5084J1552L734L578
9961F37328J2106K101j3247j644j2396k0207j5200p050m571j3834o893K469k163
9948E56799j4376j3853j9379j5480o310K834J612n355K845p586j2644p630Q476
9935D69953R741j388j2197L388J7683J085k297m498m446J5444J6660K566K0716
9922E32410L9895N7292P9747J01013J35187J44298J47856J47472J38219J06280
9912A629669O0397j270l2166p3372j00554j30084j53499j50705j13281q6835q1947
9901G66353n7038k3194k3913k5324l4126k0825j6613k3412k7936q156l847l620
9889D98349M656j2627j1593j7689k735q956j5616l046j2880M20L667j0322k0670
$$ y = [546742, 544782, 553018, 558728, 548523, 544658, 550748, 556942, 580678, 603380, 618464, 630016, 633750, 637328, 649434, 651535, 638288, 636644, 624248, 604041, 588841, 581791, 577220, 563386, 556493, 558962, 556799, 542423, 528570, 509191, 493711, 487401, 490235, 491847, 486492, 489337, 481751, 469107, 461477, 469953, 479694, 478306, 466109, 469497, 487180, 488265, 485968, 481470, 477024, 492468, 509128, 511694, 532410, 572305, 629597, 709344, 810357, 945544, 1089842, 1237698, 1385170, 1523389, 1629669, 1690066, 1688796, 1656630, 1583258, 1482704, 1352620, 1199121, 1048416, 935135, 848300, 766353, 709315, 686121, 662208, 636884, 602758, 581933, 565320, 541908, 513972, 505816, 501969, 498349, 503005, 490378, 478785, 461096, 458361, 449405, 433789, 430743, 417863, 418283, 421950, 411628, 390958]
9876C90958r321o29j2277r442M071j756j0241p390L624q698K513N580q184o98
9862C38110p263n60q367p047j1723j5182n014J1733O593R217O353J2590m887o72
9848C23881J4244R029k612k6433p203J4516K5029J0141P477Q535N901L106O950
9835C92561J8813J6645L8145M1910M1724O4622Q6660Q8802J04680J27344J59060
9824A180966J63740J54836J43578J22109Q0312K4530k5103o1817j18619j32805
9814A531727j38519j44509j36397j26975j19570j07879q5724n4565k6627l0801
9804E60161l1320l3470k600j2279p491j1237m523o443j2645o564j1537j2051p293
9791D00708J933m799j2503n811m127L696K317Q194J9979m246p205k831L757J4671
$$ y = [390958, 381637, 381008, 368731, 359289, 363360, 361604, 351363, 343973, 347597, 338899, 341412, 346992, 338808, 338110, 330847, 330287, 321920, 314873, 303150, 287968, 282954, 294687, 301280, 310497, 316850, 329440, 324553, 323881, 338125, 347154, 344542, 318109, 310906, 325422, 350451, 360592, 368069, 376604, 382505, 385611, 392561, 411374, 428019, 466164, 508074, 549798, 614420, 701080, 789882, 894562, 1021906, 1180966, 1344706, 1499542, 1643120, 1765229, 1845541, 1870071, 1844968, 1783151, 1664532, 1531727, 1393208, 1248699, 1112302, 985327, 865757, 757878, 672154, 617589, 590962, 560161, 528841, 495371, 492771, 480492, 473001, 461764, 457241, 450798, 438153, 431589, 420052, 408001, 400708, 402641, 397842, 385339, 379528, 375401, 379097, 381414, 389608, 409587, 405341, 398136, 395305, 399062, 413733]
9777D13733J3021r879J1390K096n535R730K4931K8154L6909M4145N8870Q3376
9765G10941R2021J10085J41891J63843J58468J62874J46628J19317Q8313L0347
9755A924728j8567n6442r5791j38588j55091j50731j49938j34094j14630j03861
9745H06995p5969n1058m2682l2159k1346j4590j3666o228j1485j0515P527j5090
9733E19734n239j0052k7082j4074r650j903R436p69r793R86J833j4542k251K377
9719D39011j282N480k200M381N832q66l702K92j772j446M713j5704j348l989r037
9704D18363j0237j0606Q799R59j817K31N672J5662p352J4175m951k198L777j138
9690D29339L991J4682p917q120o487M435J1762J6766P720J1913L976j0014j4376
$$ y = [413733, 426754, 416875, 428265, 430361, 424826, 434556, 459487, 487641, 524550, 568695, 627565, 710941, 802962, 913047, 1054938, 1218781, 1377249, 1540123, 1686751, 1806068, 1894381, 1924728, 1906161, 1849719, 1753928, 1615340, 1460249, 1309518, 1159580, 1025486, 910856, 806995, 731026, 679968, 637286, 605127, 583781, 569191, 555525, 549297, 537812, 527297, 534824, 519734, 514495, 504443, 477361, 463287, 453637, 451734, 461170, 460401, 450608, 451594, 453427, 438885, 436634, 439011, 437729, 443209, 441009, 445390, 451222, 450356, 446654, 446946, 445174, 443728, 448441, 432737, 431389, 427400, 418363, 408126, 397520, 406319, 407278, 405461, 405692, 411364, 427026, 419674, 433849, 428898, 426700, 430477, 429339, 433330, 448012, 440095, 431975, 425488, 429923, 441685, 458451, 466171, 478084, 482060, 472046, 457670]
9677D57670l399J2103K4505k159R343N145O233P724K994n194M941K4597R969r912
9663E44560n535j636J5261k0N645J849R75P675R856O123J1508N84n005J7298J0186
9648F19324m281k884k228J0698L318l477J2176Q212J6235R327L424J381k674N045
9634F73596P729r46j782N936J0068J3185J8001J1802J5786J1411k242J7027J9870
9621G99441O768R684J0256O067J5744K4271J5857Q1J6143J2312J9092n104J6249
9608I46861K7826J6951K2039L743O344J1671o60J2136K5441K3160K0572K7081
9596A143165L5417K6534J0913J0719J0907J5402K6590K9518K2526K1880K3099
9585A376670K1430L6297K6020K9396K9030K3232J2113K3173M5667L9964K4372
$$ y = [457670, 454271, 466374, 490879, 488720, 498063, 503208, 509441, 517165, 520159, 514965, 519906, 544503, 554472, 544560, 539025, 537389, 552650, 552630, 558275, 560124, 561099, 568774, 578630, 584753, 596261, 596845, 591840, 609138, 619324, 615043, 612159, 609931, 620629, 623947, 620470, 632646, 640858, 657093, 666420, 669844, 671225, 668551, 673596, 681325, 680379, 678597, 684533, 694601, 707786, 725787, 737589, 753375, 764786, 762544, 779571, 799441, 806209, 815893, 826149, 832216, 847960, 872231, 888088, 888169, 904312, 916624, 935716, 930612, 946861, 974687, 991638, 1013677, 1017420, 1023764, 1035435, 1034775, 1046911, 1072352, 1095512, 1116084, 1143165, 1178582, 1205116, 1216029, 1226748, 1237655, 1253057, 1279647, 1309165, 1331691, 1353571, 1376670, 1398100, 1434397, 1460417, 1489813, 1518843, 1542075, 1554188, 1577361, 1623028, 1662992, 1687364]
9574A687364K6849L5260L1111K5321L9320K8956M1596L7545M6047M5373L9157
9563B083899M7060N1412N7652O1618O0759P9078O9048O1661O7861O9684N6888
9552B766620P6175P6980Q3283P2949Q9258R5194R8998R5930R7139J12501J25450
9541C790477J15968J16780J25838J42597J42889J51593J40760J60035J70893J90504
9531E248334K02072K01605K24397K51759K57508K67493K76939K97997L25733L55481
9521G909318L79455M14305M22926M44213M91048N26188N65124O11405O44025P12135
9511A3120142P50885P94627Q67645R41463J012573J088396J160973J257134J366380
9502B2360218J435679J531514J628359J725710J835663J925726J983776K021871
$$ y = [1687364, 1714213, 1749473, 1780584, 1805905, 1845225, 1874181, 1915777, 1953322, 1999369, 2044742, 2083899, 2130959, 2182371, 2240023, 2301641, 2362400, 2441478, 2510526, 2572187, 2640048, 2709732, 2766620, 2842795, 2919775, 3003058, 3076007, 3165265, 3260459, 3359457, 3455387, 3552526, 3665027, 3790477, 3906445, 4023225, 4149063, 4291660, 4434549, 4586142, 4726902, 4886937, 5057830, 5248334, 5450406, 5652011, 5876408, 6128167, 6385675, 6653168, 6930107, 7228104, 7553837, 7909318, 8288773, 8703078, 9126004, 9570217, 10061265, 10587453, 11152577, 11763982, 12408007, 13120142, 13871027, 14665654, 15533299, 16474762, 17487335, 18575731, 19736704, 20993838, 22360218, 23795897, 25327411, 26955770, 28681480, 30517143, 32442869, 34426645, 36448516]
9494C6448516K059643K058135J991856J879431J741089J544654J300965J021598
9486E0045887P15379L57471N576l30405o53810r46958j191816j388090j543382
9477D5069852j652427j719692j771948j766411j716068j656101j600552j547715
9469C1638938j480288j399678j321965j256223j164189j094694j035296r82869
9461B1903736r17908q53288q05778p83003p24224o83399o52732o10027n86520
9452A5286857n44415n19343m89609m47556m26420m35295m26788m01064l84238
9443A1212129l54313l36803l26032l25951l13322k97599k72063k73015k58453
9434H454578k40892k42501k46086k11582j96206k12886k15944k00955j99980j80644
$$ y = [36448516, 38508159, 40566294, 42558150, 44437581, 46178670, 47723324, 49024289, 50045887, 50761266, 51118737, 51124313, 50793908, 50140098, 49193140, 48001324, 46613234, 45069852, 43417425, 41697733, 39925785, 38159374, 36443306, 34787205, 33186653, 31638938, 30158650, 28758972, 27437007, 26180784, 25016595, 23921901, 22886605, 21903736, 20985828, 20132540, 19326762, 18543759, 17819535, 17136136, 16483404, 15873377, 15286857, 14742442, 14223099, 13733490, 13285934, 12859514, 12424219, 11997431, 11596367, 11212129, 10857816, 10521013, 10194981, 9869030, 9555708, 9258109, 8986046, 8713031, 8454578, 8213686, 7971185, 7725099, 7513517, 7317311, 7104425, 6888481, 6687526, 6487546, 6306902]
9424F306902j67194j56816j45189j48543j43685j30502j20532j34276j28488j24701
9414D906976j16674j05303j11675j12369r7463j02707r4271j07227r9030p8955
9404C881302p8816q8742q9006r8293q6482p4037p2960p1699p6008n8228n6192
9393C030839q0169p1392o3599o4640o1101o6485n3047n6006n5222m9207n0204
9382B359767n1076m3815l1493m6839n3016m3972l6771l8346k3884k4685n0647
9371A915223l9268m9647l6930l4304k6402k6270j4110k2659m6548l2331k9575
9360A557179k2758j8084k0630k3971l0773l2453k6931j9756k5613k8031j5003
9349A293176j5734j5399k6573k4943l7092k8406j8092m2036k1560j8656j7290
$$ y = [6306902, 6139708, 5982892, 5837703, 5689160, 5545475, 5414973, 5294441, 5160165, 5031677, 4906976, 4790302, 4684999, 4573324, 4460955, 4363492, 4260785, 4166514, 4059287, 3960257, 3881302, 3802486, 3713744, 3624738, 3526445, 3439963, 3365926, 3292966, 3221267, 3145259, 3087031, 3030839, 2950670, 2879278, 2815679, 2751039, 2689938, 2623453, 2570406, 2514400, 2459178, 2409971, 2359767, 2308691, 2264876, 2233383, 2186544, 2133528, 2089556, 2052785, 2014439, 1990555, 1965870, 1915223, 1875955, 1826308, 1789378, 1755074, 1728672, 1702402, 1688292, 1665633, 1619085, 1586754, 1557179, 1534421, 1516337, 1495707, 1471736, 1440963, 1408510, 1381579, 1361823, 1336210, 1308179, 1293176, 1277442, 1262043, 1235470, 1210527, 1173435, 1145029, 1126937, 1084901, 1063341, 1044685, 1027395]
9338A027395j5707j7522q865o109j5890l3588k6741j9343j3300j6978j9575k8059
9326H05718j7192q929r456q069j3636r789j1523k3909j8252j941j6153k2145r206
9313F35518J325l080n121n048k1847L79N583k0850J529J1925q112j7753j9314
9300E55134k0078p387J727M721l630n956o873n697n254p61M866q370q069O888
9286E01261o432j9493j6267p547j016Q217o096p170N75j1579j9202p422M499J7263
9272D29591O859q154N622j364q19O086j1132j3164n352j8661N484o179M259J6894
9258D09970N813k4132m559M513p271n537k0562j2592K543n206L117l43p277m794
9244C33683k728J4553O270j5205K284J024O601j422l199j0383R961N619r681j0571
$$ y = [1027395, 1011688, 994166, 985301, 979192, 963302, 929714, 902973, 883630, 870330, 853352, 833777, 805718, 788526, 779597, 770141, 762072, 748436, 738647, 727124, 703215, 684963, 683022, 666869, 644724, 635518, 636843, 633763, 628642, 623594, 601747, 602126, 607709, 586859, 588388, 600313, 592201, 574448, 555134, 535056, 527669, 529396, 534117, 530487, 524531, 517658, 511961, 506707, 505946, 510812, 502442, 494373, 501261, 494829, 475336, 459069, 451522, 450506, 458723, 452627, 445457, 446032, 434453, 415251, 407829, 412328, 429591, 436450, 428296, 433918, 432554, 431735, 437821, 426689, 413525, 408173, 389512, 394996, 388817, 393076, 409970, 415783, 391651, 387092, 391605, 384334, 378797, 358235, 345643, 348186, 342980, 346097, 345754, 338477, 333683, 330955, 345508, 351778, 336573, 338857, 339881, 346482, 345060, 341861, 331478, 341439, 347058, 337377, 326806]
9230C26806q992k459J8083J88O051R381J681j3017j4550j1978j0549k0822M511
9217B84334q642j0726j0280j4911R208M003K588J0997n507Q07j4421m274L411
9204B46587L274K505j1925j2536M626j1166q689N898l912m433k689L041L373K826
9190B16780l742q071m045p36Q168l993l481r087j9792M587K178m552o296P134
9176A75052M037N988j305P576N486O391J0663l412j6888j3678O843o819N481J4674
9162B00089j1942k1974J136R296L145o438j588J941K036j027O634O503p007o629
9148A74175l350N004j172q264j2423N537j004l799l117K477J7687J2537r730q286
9134A66272J4090m876j5719L35l553J014o177l388J5342n637q519J1687j7979
$$ y = [326806, 317814, 315355, 333438, 333626, 339677, 349058, 350739, 337722, 323172, 311194, 300645, 279823, 284334, 275692, 264966, 254686, 239775, 248983, 252986, 255574, 266571, 261064, 261871, 247450, 243176, 246587, 249861, 252366, 240441, 227905, 232531, 221365, 212676, 218574, 214662, 210229, 207540, 210581, 213954, 216780, 213038, 204967, 200922, 200186, 208354, 204361, 200880, 191793, 172001, 176588, 178766, 174214, 167918, 175052, 179089, 185077, 183772, 191348, 196834, 203225, 213888, 210476, 193588, 179910, 186753, 179934, 185415, 200089, 188147, 166173, 167309, 176605, 179750, 173312, 171724, 173665, 175701, 174674, 181308, 187811, 180804, 174175, 170825, 175829, 174657, 166393, 153970, 159507, 158503, 154704, 151587, 154064, 171751, 184288, 174558, 166272, 180362, 175486, 159767, 160102, 156549, 157563, 151386, 147998, 163340, 157703, 149184, 160871, 142892]
9121A42892o011J208k870J1536q195m398k299j0364N683N379j2239M748q586n520
9107A10964K78Q067R77K374K21J0643K728Q23K938J2678P372n443k1898l948Q553
9092A37327q00L766J5249Q964q967k0093r992r854m451P518N490r810j0587r29
9078A02831J157J1956P786R458j775N981J3142o881k3834j4191P519J121P838
9065A22108j2944j7014m646J4297P221q965J9458j116j4351l670j1239Q371J8481
9052A15991R891j1946j7439L65N996R57J152l074q58j1016J3626p845j3514n156
9038G7130K865J2270j0500k207N927J8M18q929j4846O637Q503M56o770k098j4055
9023E4819q583p07J7273J1939J9788Q621P95o718j6669p704r04j718N692K949
$$ y = [142892, 136881, 138089, 135219, 146755, 138560, 134162, 131863, 121499, 127182, 132561, 120322, 125070, 116484, 110964, 111242, 119309, 120286, 122660, 122881, 133524, 136252, 137075, 140013, 152691, 160063, 154620, 132722, 128774, 137327, 136527, 140293, 155542, 164506, 155539, 135446, 125454, 115600, 111149, 118667, 124157, 114347, 103760, 102831, 103988, 115944, 123730, 133188, 131413, 137394, 150536, 143655, 119821, 105630, 113149, 114270, 122108, 109164, 92150, 87504, 101801, 109022, 100057, 119515, 118399, 104048, 100378, 89139, 97510, 115991, 125882, 113936, 96497, 96862, 102858, 103815, 104967, 101893, 101035, 90019, 103645, 95800, 82286, 77130, 79995, 92265, 81765, 79558, 85485, 85503, 85921, 76992, 62146, 68783, 77286, 77742, 70972, 68874, 54819, 46236, 45529, 62802, 74741, 94529, 103150, 103945, 97227, 80558, 72854, 71950, 70232, 75924, 78873]
9009G8873j1982j2760j2640N662J5678J4505Q731J1171N179k699J192R379L617
8996A13906L965J0641k490p589n945j5483M595J2565q999k4117k5769j3282n34
8983D1464J5712J2420L074l222j0588J3973J3304m260l25n68O684p583L939M087
8969H8111l965O227o434p753q96M816N810r622K434J5801o988j0341N281J4361
8955I6842M045j2891p057o816J447j0973j1946K179J245k168q879O822J2704J7430
8941H1984l790k739O782k875N266J6507l588L805k785q361j2789o524j488n184
8927F4221o767J806p237j494l082j0231L979J7822J1498J496j2031j2824J743
8914D8899J1765K443j2911o842k147N125K811P633k789j5152j5318K0409J2852
$$ y = [78873, 66891, 54131, 41491, 47153, 62831, 77336, 86067, 97238, 102417, 99718, 100910, 110289, 113906, 117871, 128512, 126022, 118433, 112488, 97005, 101600, 114165, 105166, 81049, 55280, 41998, 41464, 57176, 69596, 72670, 69448, 58860, 72833, 86137, 81877, 81552, 80984, 87668, 80085, 84024, 88111, 84146, 90373, 83939, 76186, 75290, 80106, 85916, 76294, 78728, 94529, 87541, 77200, 82481, 96842, 100887, 87996, 80939, 74123, 75570, 64597, 52651, 54830, 56075, 53907, 45028, 51850, 64554, 81984, 78194, 75455, 82237, 79362, 84628, 101135, 97547, 101352, 98567, 90206, 77417, 70893, 69405, 64221, 57454, 59260, 52023, 50529, 47447, 37216, 41195, 59017, 70515, 72011, 59980, 47156, 48899, 60664, 63107, 50196, 43354, 41207, 46332, 49143, 56776, 53987, 38835, 23517, 43926, 56778]
8901E6778O349J471p883m212N069O763J423l920K028q787Q503L422J67j2248L852
8886E8775j109p227m495j470q651l14M071j2980k078O264J0327L420j301R766
8872E2998j2858n732l269L670j82N726M402N745k430J2383J708q991j1381N451
8858D7240k606k106l387q737OJ7177p031j4054J0095J4557M600j2236q824K914
8844C7608K658J1945J877J715J035j3337j1728j555N311J3333J1472Mj1294q088
8830D0956N91N483O904O676q354j7234J6904J2259p286N892O585p020q160n015
8816D9181J0333O050o559q296J2803q29j1342o6J8461K372q107j0358o842j0486
8802C6315q869J3577L938O70Q244J1779n310j1345j0292r46J5361J5161k402j8331
$$ y = [56778, 63127, 64598, 56715, 52503, 57572, 64335, 65758, 61838, 63866, 55079, 63582, 67004, 67171, 54923, 58775, 57666, 50439, 45944, 44474, 35823, 35509, 39580, 26600, 24522, 30786, 41113, 44533, 43232, 52998, 40140, 34408, 31139, 34809, 34627, 40353, 44755, 50500, 48070, 60453, 62161, 53170, 41789, 47240, 44634, 42528, 39141, 30404, 30410, 47587, 40556, 26502, 36597, 51154, 55754, 43518, 34694, 37608, 40266, 52211, 54088, 55803, 56838, 43501, 31773, 30218, 35529, 48862, 60334, 60338, 49044, 40956, 41547, 47030, 53934, 60610, 52256, 35022, 51926, 64185, 56899, 62791, 69376, 62356, 54196, 49181, 59514, 65564, 59005, 50709, 63512, 62683, 51341, 51275, 69736, 72108, 64001, 53643, 46801, 36315, 27446, 41023, 44961, 45631, 53875, 65654, 60344, 48999, 38707, 37761, 53122, 68283, 65881, 47550]
8788D7550J559P339r70j729J555n605K387J1830M800l594k6466k0848K3727Q998
8774E0533j0758p892j918j6619M147J0198J0961J580L873n134Q768J9136J769
8761F8644m43j6946n390M574P006N650J904L830P969r49L771m922J2150j145J260
8746H6963j0972j629J805R26j6372j5697M089O025J921J553J3606j235p333l833
8732E9817j1434k483J4835Q17p680n682o066R760K9638K73j4349j73n135J868
8718F4006R303n89m781j887J5220o381j7261J410R945O02j9465M540q087r800
8704C6775j064n16J057N034N030J3851N544j0381n301L118L105k104q71j312j842
8689E0123K668j8005q333K232J0558M355M034L654j6k964n812J5525J2580N983
$$ y = [47550, 49109, 56448, 55478, 53749, 55304, 49699, 52086, 63916, 68716, 65122, 38656, 17808, 41535, 50533, 39775, 31883, 29965, 13346, 17493, 27691, 38652, 40232, 44105, 38971, 47739, 66875, 68644, 68201, 51255, 45865, 50439, 57445, 63095, 64999, 68829, 76798, 75849, 79620, 74698, 86848, 85703, 86963, 75991, 74362, 76167, 77093, 60721, 45024, 49113, 55138, 57059, 58612, 72218, 70983, 63650, 59817, 48383, 45900, 60735, 61552, 53872, 48190, 42124, 51884, 81522, 81795, 67446, 67273, 62138, 64006, 73309, 72720, 67939, 66052, 81272, 74891, 57630, 59040, 68985, 69587, 50122, 54662, 46575, 36775, 35711, 35195, 36252, 41286, 46316, 60167, 65711, 55330, 50029, 53147, 56252, 54148, 53277, 51965, 50123, 52791, 34786, 26453, 28685, 39243, 43598, 47632, 51286, 51270, 48306, 42494, 58019, 70599, 76582]
8675G6582L725J8407J3457K831J803q69l179L875M592j4085j0572l063O354l025
8661I6833o583J1330o59r14n126l040P243k434J2533J1660j1019q213O452m818
8647A03245Q344J7279N340N656L572K923j4603p072L574J0630l358J7152K6299
8634A78981J2650J0312P299K0868J5160J8130K4582J8299Q674J1298q68m699o00
8621C20086q868j4149k3053k3250o646k2452l0405j4411j7579r906q066l523m74
8608A37304l033R033k200j8676L177P436j37j0260j6498j7834j4327L071L472
8595H0528j754n659M751K482O572Q662q94p161k10j878J1646N990O234j2594J692
8580I8407l128K747K367k2426j1172J1259R220j755l302J5199O402k116j4983
$$ y = [76582, 80307, 98714, 112171, 115002, 116805, 115936, 112757, 116632, 121224, 107139, 96567, 93504, 99858, 96833, 90250, 101580, 100921, 100007, 94881, 91841, 99084, 96650, 109183, 120843, 109824, 101611, 108063, 103245, 111589, 128868, 134208, 139864, 143436, 146359, 131756, 124684, 128258, 138888, 135530, 152682, 178981, 191631, 201943, 209242, 230110, 245270, 263400, 287982, 306281, 314955, 326253, 325385, 320686, 320086, 311218, 297069, 274016, 250766, 244120, 221668, 191263, 176852, 159273, 149367, 141301, 137778, 137304, 134271, 143304, 141104, 122428, 125605, 133041, 132904, 122644, 106146, 88312, 73985, 77056, 80528, 78774, 73115, 77866, 80348, 86920, 95582, 94688, 87527, 87317, 85439, 97085, 103075, 109309, 96715, 98407, 95279, 98026, 100393, 77967, 66795, 78054, 87274, 85519, 82217, 97416, 103818, 101702, 86719]
8567H6719j6311j1710M99O431Q653N378N660P047o065r708k092k259n562p191
8553E9489Q180K4176O744o283k809j4739n341K508K217p28k28p101j0696k0322
8539C5067L409J0795Q485K120l581Q38Rj2342p662k862K875K609N74m970O345
8524D1709O037J8284N655r060k356J0795O0r552k573R43L314Q247j100l294j3368
8509E3741n289l266N495O52p54j824M976m526n927L4P261l405p475q631Q500Q856
8493D8418K187J747l63L208r148n620r001n116k446j544J5790N668J374J811k29
8478D6736j8035j4538O077O302L582M728N831O697Q124R35j7743j7196P635K233
8464C1368Q268M433p949n670j563j113J2973J1318n303j4103j0791k666L878J5009
$$ y = [86719, 70408, 58698, 59197, 65628, 74281, 79659, 85319, 92366, 86301, 76593, 74501, 72242, 66680, 59489, 67669, 91845, 98589, 92306, 89497, 74758, 69417, 71925, 74142, 73414, 73186, 66085, 55389, 35067, 38476, 49271, 57756, 59876, 56295, 57133, 57142, 44800, 37138, 34276, 37151, 39760, 40334, 35364, 41709, 47746, 66030, 71685, 62625, 60269, 71064, 71124, 61572, 58999, 59942, 63256, 71503, 70403, 67109, 53741, 48452, 45186, 50681, 51333, 50579, 48755, 53731, 49205, 43278, 43312, 50573, 47168, 39693, 31062, 39562, 48418, 50605, 52352, 51989, 55197, 46049, 40429, 31428, 26312, 23866, 22322, 38112, 43780, 45154, 46965, 46736, 28701, 14163, 20240, 26542, 30124, 34852, 40683, 47380, 55504, 56439, 38696, 21500, 29135, 31368, 39636, 44069, 36120, 30450, 28887, 27774, 40747, 52065, 46762, 32659, 21868, 19202, 23080, 38089]
8450C8089J613k533R24J672R396Q794j0834l005q841q004j3332j031J0738J7697
8436D1343m84M302J64o640o302o402Q819M489L472J5075K004r789J0557n197k798
8421E2613j6778r100J138P187j524K894k793L717k920M690K900p22p973N972J1241
8406E0542j477q032O576R23k2635L487P12N127J1033L673M352m650p537k693q861
8391C0540n586O903Q642q26l543J505j1850q336M907O899q193o590R364j1496
8377A2340N709J0618J1753j1502j8897k799o401K149M015Q665J2948N696J1820
8364D6114K093q62J115m487j032j8618j6263M868M681M683o037j029J3243j675
8350B6794q318L536Q301O435n50K978n076j1661m337m367p382K359J2761J6248
$$ y = [38089, 39702, 37169, 38093, 39765, 49161, 57955, 47121, 44116, 35275, 27271, 13939, 12908, 23646, 41343, 40859, 45161, 45325, 38685, 32383, 25981, 34800, 39289, 42761, 57836, 59840, 50051, 60608, 55411, 52613, 35835, 26735, 27873, 35060, 33536, 36430, 33637, 37354, 34434, 39124, 42024, 41302, 33329, 39301, 50542, 49065, 41033, 47609, 48532, 25897, 29384, 30096, 35223, 46256, 49929, 54281, 49631, 42094, 39401, 30540, 24954, 31857, 40499, 39673, 36130, 37635, 25785, 17449, 22356, 29255, 21062, 14472, 23836, 12340, 18049, 28667, 40420, 28918, 10021, 7222, 821, 2970, 6985, 15650, 28598, 34294, 46114, 48207, 47345, 48460, 43973, 42941, 24323, 8060, 12928, 17609, 22292, 16255, 15226, 28469, 26794, 18476, 22012, 30313, 36748, 36198, 39176, 34100, 22439, 18102, 13735, 6353, 8712, 21473, 37721]
8336C7721n198J487J791K364P135j2152p681r364o957Q071J1770p845r509J5557
8322B7190o416l551L333L560o405j295J055R175Q973J894n952j5660K393P615
8308B5909j247l441K460j2425Q561n351o297K568j663q64l407L40K527k000J743
8293G413R034o72o857L548J2397J0309n470M893J9749J496j4014q31n720q72J2166
8278D6569J004p91l363j0836K194M283k895o132J199q35j3014j0690J0261J55
8264A7109k886j29M266j1081m394J1188N117M618K459J5270J1356o287j0542n834
8250C0230j2518k481J1198J9007k00j8757j1833r66L433O910O743k572m093m530
8236A9571P818O845p449j335P648Q732R926K000j2649o929L265J0865q922p477
$$ y = [37721, 32523, 34010, 35801, 38165, 45300, 33148, 25467, 16103, 9146, 17217, 28987, 21142, 11633, 27190, 20774, 17223, 20556, 24116, 17711, 16416, 17471, 26646, 35619, 37513, 31561, 15901, 18294, 25909, 24662, 21221, 23681, 11256, 19817, 14466, 8169, 10737, 9074, 8210, 4803, 5143, 7670, 5670, 7413, 16447, 15775, 8918, 12466, 24863, 35172, 29702, 34595, 54344, 55840, 41826, 40995, 35275, 34403, 46569, 47573, 46782, 43419, 32583, 34777, 39060, 36165, 30033, 31232, 30397, 17383, 6693, 16954, 17109, 14223, 14094, 18360, 7279, 2885, 14073, 19190, 23808, 26267, 41537, 52893, 46606, 36064, 30230, 17712, 15231, 26429, 45436, 45236, 26479, 14646, 13680, 17113, 24023, 30766, 28194, 24101, 19571, 27389, 34234, 26785, 25450, 33098, 41830, 51756, 53756, 41107, 34178, 37443, 48308, 39386, 31909]
8222C1909j283Q51R427J903n439K539l216m199j559n729Q76L583l270p053P913
8207B7253L485j4972o636M167O637J1008N071j4143R058J2488j549j0701j835
8194B9331r287m790J4358j940j7167p762J0609O70o983Q152O3O234R073q541o575
8179A5445p073J5034P178m700p519q57j853O539J0992O904l330R377J7662j1377
8165E2422p135j0600r540K479R81j3715p289L578N117P784l635n030P781P090
8151C0288R286P52K918j1118o562K990J04j974K98m389m636j3676o964R887j344
8136E860j5956K510J7411J3538M101k797o253l126r822p234M916J4667J1205J3809
8122D2829j538m580n573l824N228M726P233k801o233p068P300j7556J714J6079
$$ y = [31909, 30626, 31477, 40904, 42807, 37368, 39907, 36691, 32492, 30933, 25204, 26080, 29663, 26393, 19340, 27253, 30738, 15766, 9130, 13297, 19934, 30942, 36013, 21870, 30928, 43416, 41867, 31166, 29331, 20044, 15254, 29612, 27672, 10505, 2743, 13352, 14022, 7039, 15191, 15254, 21488, 30561, 22020, 15445, 8372, 23406, 30584, 25884, 18365, 17508, 15655, 22194, 33186, 40090, 36760, 46137, 63799, 52422, 45287, 34687, 25147, 27626, 28607, 14892, 7603, 11181, 16298, 24082, 20447, 15417, 23198, 30288, 39574, 40326, 43244, 32126, 25564, 28554, 28658, 26684, 26982, 22593, 17957, 4281, -2683, 7204, 5860, -10096, -7586, 9825, 23363, 27464, 24667, 18414, 15288, 5466, -1768, 3148, 17815, 29020, 42829, 41291, 36711, 31138, 27314, 32542, 37268, 44501, 41700, 35467, 28399, 35699, 18143, 19857, 35936]
8108C5936L748n715j0861n113j199K543L125K036O57L27M472j077J3861J0076
8094E2816r554j1062j1093n934K143P010N088P169M481N49o950l102r44J0448
8080D1065K281N620J509J5999j0076l0147P313P81Q285P203O776p97L017j574
8066E7255r421m970n681l279n670j0973O309P523k402j009N355R740J2488O720
8052F1985j5084n446k619K035N373J2050M484J1913M93o98L667j2754j062r071
8038E5266p901P797J0492L286q302R095J4647O312q409L139L790R447l755k0692
8024G4212j1468k615N192L183J4453J0016j175j3126p251J3843j1997j2102L886
8011F5051O124K903k134R01P063O312j3951p821L588J4950J7622l974n595K124
$$ y = [35936, 39684, 33969, 23108, 17995, 16796, 19339, 22464, 24500, 25157, 25484, 29956, 28879, 42740, 52816, 43262, 32200, 21107, 15173, 17316, 24326, 29414, 36583, 41064, 41613, 34663, 31561, 30617, 41065, 43346, 48966, 50475, 66474, 56398, 26251, 33564, 34345, 42630, 49833, 56609, 55812, 58829, 57255, 47834, 42864, 37183, 33904, 28234, 17261, 23570, 31093, 28691, 27682, 33037, 42777, 55265, 61985, 46901, 41455, 38836, 40871, 46244, 58294, 62778, 74691, 75184, 74486, 78153, 65399, 64337, 55266, 47365, 55162, 65654, 68940, 60638, 69733, 84380, 90692, 82283, 85422, 89212, 98659, 94904, 74212, 62744, 60129, 65321, 68504, 82957, 92973, 91798, 78672, 71421, 85264, 73267, 61165, 65051, 71175, 74078, 71944, 72845, 79908, 86220, 72269, 64448, 68036, 82986, 100608, 96634, 91039, 93163]
7997I3163J911k046J4600J6354K869j1246j616J3711Q328L881j52j4536J372o39
7983A25954J961n128k0094p070J0820J1929R764n761j7542J660L385p265r62J377
7969A03028n540J3668J3771m452j6546L68J4143K416j9200O921K4200P523j5257
7956A25043M00J301m348L246j0591K884L000O619N123N385J0610j3079J6194q154
7942A43633K559m470j0206J095L819O80j8169j7539J7493J501m071N782k393j0509
7928A09205o465j1596o429M440j0909j3909Q580k565K008P034Q945N284Q186R939
7914A11748p555J256R381j534j8776k1256P398R604j5931K4m02j6169m072O573
7900F0289n919M519J2364k872K122l362k06j952j2036N785j296P40L9n698j0073
$$ y = [93163, 95074, 93028, 107628, 123982, 126851, 115605, 113989, 127700, 136028, 139909, 139757, 125221, 126593, 125954, 127915, 122787, 102693, 95623, 106443, 118372, 128136, 122375, 104833, 106493, 109878, 102613, 101651, 103028, 97488, 111156, 124927, 120475, 103929, 104297, 118440, 120856, 101656, 108577, 132777, 140300, 125043, 125443, 126744, 122396, 125642, 115051, 117935, 120935, 127554, 132677, 138062, 148672, 135593, 151787, 143633, 146192, 141722, 131516, 132611, 136430, 137110, 118941, 101402, 118895, 120396, 116325, 122107, 119714, 109205, 102740, 91144, 84715, 89155, 78246, 64337, 72917, 70352, 72360, 79394, 88339, 93623, 101809, 111748, 104193, 105449, 114830, 113296, 94520, 73264, 80662, 90266, 74335, 74359, 73957, 57788, 53716, 60289, 54370, 58889, 71253, 68381, 70503, 67141, 66935, 64983, 52947, 58732, 57436, 58176, 58215, 52517, 42444]
7885D2444O938J0653o462j857j2764p639J2120k76j634q272Q307P145M672R207
7871F2582L836j837j4058j1083m277O014n612o553j800O400R990J0402k360n887
7857D5757n343J459K734J433r70r133j5320N397L957o85J1132N186J107n970n028
7842C5713N30o760Q354L880q274N502o86K282j385j5343r94R044j3669j9004j402
7827b212M861M058m825J032m722L461R762j801k266J0108J4945J8046J885j4082
7813C8250q340l855q382o578j171K57m810J6034K931J1619l985o246m603R713
7799C0834k308j2266j0112k337O025l942o825q363m154m638P805L86J2671J7072
7785A9848m79k345j944Q85M736L52M455j6068l556k234q404o555j514K47R357
$$ y = [42444, 49382, 60035, 53573, 51716, 38952, 31313, 43433, 43157, 41523, 33251, 41558, 48703, 53375, 62582, 66418, 64581, 50523, 39440, 35163, 41177, 35565, 29012, 27212, 33612, 43602, 54004, 51644, 45757, 40414, 41873, 44607, 46040, 45070, 35937, 20617, 26014, 29971, 29286, 40418, 45604, 46711, 40741, 35713, 36243, 29483, 37837, 41717, 33443, 38945, 38259, 40541, 39156, 23813, 22819, 31863, 18194, -810, -2212, 2649, 6707, 1882, 2914, -1808, 1653, 11415, 9614, 7348, 17456, 32401, 50447, 52332, 38250, 29910, 26055, 17673, 11095, 9924, 10181, 5371, 21405, 24336, 35955, 31970, 25724, 21121, 30834, 28526, 16260, 6148, 3811, 9836, 5894, -931, -9294, -13448, -18086, -10281, -9895, 2776, 19848, 19369, 17024, 15080, 15965, 20701, 21053, 25508, 9440, 5884, 3650, -4754, -11309, -12823, -12576, -3219]
7770c219n30j647M887K717K68J4801l512L71P570j0262j354n131K296o11j983
7755D661n48J5890L025J318j8513k0472O524J5469N679n072m769R133J8072J443
7741C1840r704K825J737L365j2197r873M754j0620p470N83K317J1427q029j3996
7727a3041l917K815J7563Q306P96j2760j706o36l305m168l388r8J9681R830l92
7712A5580j0455j5758j2273j177N117q96N6p638J612l502M081K1593K1139N996
7698B3475L063m299j3994p79J5729p492k06j6848J624N479J7666J4126j4689p720
7684A5135j601l305L601K532j9445j4130K824M942L945J0720P60q371J999j074
7670a468j2264p746J9916J2178M6m42P897K406r469M882k970n86j1920j0286j640
$$ y = [-3219, -3749, -5396, -509, 2208, 2476, 17277, 13765, 14136, 21706, 11444, 10090, 4959, 7255, 6644, 4661, 4113, 20003, 23028, 24346, 5833, -14639, -8115, 7354, 13033, 7961, 3192, 12325, 30397, 31840, 22136, 24961, 26698, 30063, 17866, 7993, 12747, 2127, -5343, -4760, -2443, 8984, 955, -13041, -16958, -14143, 3420, 11726, 12522, -238, -1944, -2580, -5885, -10053, -13441, -13539, 6142, 15972, 15580, 5125, -10633, -22906, -24083, -18966, -19862, -19806, -27444, -25832, -29334, -25253, -3660, 17479, 23475, 26538, 22239, 8245, 7466, 23195, 15703, 15497, -1351, 273, 5752, 23418, 37544, 22855, 15135, 13534, 10229, 13830, 16362, -3083, -17213, -14389, -9447, -5502, 5218, 5978, -2393, -394, -1468, -13732, -21478, -1562, 10616, 10662, 10220, 18117, 20523, 11054, 15936, 12966, 12380, 460, -9826, -11466]
7655a1466R824J027R423q42q282j255o544M37K3597J5639q818j4165p387Q13Q812
7640A0813k029j9460j686J2764M33p865J8095l771O176N736k919j5772q697k78
7626h460p778R050K613j3010M44R698n519o606P685M553Q442P286J1008L018j9820
7611B604k162o00M561P936O863j9917j0276k64l884n688J36J6622J1419q83Q736
7596A5203j1341q890p000j624m103Q259J2384J5197l031j6917J2805m451k307
7583D184N796N882N003j48j8951m621J474J695r84N146k040J21R869m196j9364
7568a1134j6679J3569J8446M838O867p419j5M28r999n649M163O535q520o465m881
7553a5915M995J4393J6850j0374j8417n713q927K176J5920K0293M229j367r339
$$ y = [-11466, -1642, -615, 8808, 7966, -316, -1571, -8115, -7678, 15919, 31558, 22740, 8575, 1188, 2001, 10813, 8784, -10676, -12362, 402, 835, -7030, 11065, 7294, 13470, 19206, 16287, 515, -8182, -8460, -16238, -7188, -4575, -17585, -17141, -7443, -12962, -19568, -11883, -7330, 1112, 8398, 19406, 22424, 2604, 442, -158, 4403, 12339, 19202, -715, -10991, -11255, -15139, -20827, -20691, -4069, 7350, 6467, 15203, 3862, -5028, -12028, -13652, -17755, -9496, 2888, 18085, 15054, -1863, 10942, 6491, 4184, 9980, 15862, 20865, 20717, 1766, -2855, -1381, 314, -670, 4476, 2436, 2557, 12426, 8230, -11134, -27813, -14244, 4202, 9040, 15907, 8488, 8473, 8901, -1098, -6747, -2584, 3951, -4569, -11034, -15915, -10920, 3473, 20323, 9949, -8468, -14181, -23108, -20932, -5012, 15281, 19510, 18143, 8804]
7540H804j6752L165n911L736J5672L903O81J62o747l908J1656O093m12m73K221
7525B1890K638n171l853k1587p001Q021r171L824j940P161P861p276j0755m293
7511a9652J496J6825J8456j6061r587R147q22J569J533P457j6163p676P562K210
7497c706J9975k528p098k001j455q245q899Q388n52o496Q795J458M49m354Q040
7482A771n223J012j258l088J73Q738l637j570J6640m208m393k644l319j9792M554
7467a6244L136j033L336P467k213n754K53O446L243O150K649M406p36k775O126
7452A4457r728k785J3531K952j4079n122J2994K985k1273j1611j451N542P143
7439f445O333N763j0692q476J2946l822j882L567J1587K014J546j4925l875P655
$$ y = [8804, -7948, -4783, -10694, -6958, 8714, 12617, 13298, 13460, 6713, 2805, 14461, 20554, 20142, 19669, 21890, 24528, 19357, 15504, -6083, -13084, -5063, -14234, -10410, -12350, -5189, 2672, -4604, -15359, -19652, -18156, -1331, 17125, 1064, -8523, 624, -198, 1371, 2904, 10361, -5802, -13478, -5916, -3706, 16269, 13741, 6643, 4642, 3187, -5058, -13957, -5569, -6121, -12617, -3822, -2364, -1915, -6269, 1771, -3452, -2440, -3698, -6786, -6613, 2125, -1512, -3082, 13558, 9350, 4957, 2313, -1006, -20798, -16244, -13108, -14141, -10805, -3338, -5551, -11305, -11052, -4606, -1363, 4787, 7436, 11842, 11106, 8331, 14457, 4729, 1944, 15475, 18427, 4348, -774, 12220, 15205, -6068, -17679, -19130, -13588, -6445, -112, 5651, -5041, -13517, -571, -4393, -6275, -2708, 8879, 10893, 12439, -2486, -6361, 1294]
7425A294k922k4263J035J8125M417j619k402K594m578O848k036j3610l342o37
7411b1096P493O465M099P556l607N270J0613j2227n975J976n016l665L92J716
7397f006Q330J940q498m136K17L907m199M919J6330P404J368m792l693r284j1517
7382g710j4620o420J6624o164k706J569J0596j0372O731r533m06M557Q418j2022
7368b1458j0931P635M164J627k776P476l244P903Q017j372m517K674p724r415
7354b1941Q404J0983M123l7q798N201M645k042k136j896m195j2917J0218r27j973
7339a3288P612n630l289M279j042k655J2452k871l066m170J3154j235n105p760
7325a2614L22J778n335J45p220K903J9833J3177j5804r17J1235r6O632J0209Q515
$$ y = [1294, -1628, -25891, -24856, -6731, -2314, -3933, -6335, -3741, -8319, -1471, -3507, -17117, -20459, -21096, -13603, -7138, -3039, 4517, 910, 6180, 16793, 4566, -1409, 567, -4449, -8114, -7722, -6006, 2324, 4264, -4234, -8370, -8153, -4246, -8445, -3526, 12804, 20208, 21576, 16784, 13091, 3807, -7710, -22330, -28750, -12126, -18290, -20996, -19427, -8831, -19203, -12472, -22005, -22411, -17854, -9436, -21458, -32389, -24754, -20590, -18963, -21739, -14263, -17507, -9604, -1587, -2959, -7476, -4802, -12526, -21941, -13537, -2554, 1569, 1532, -7266, -2065, 2580, 538, -1598, -3494, -7689, -20606, -10388, -11315, -13288, -5676, -11306, -14595, -10316, -11358, -14013, -1561, -4432, -7498, -11668, 1486, 251, -4854, -12614, -12292, -10514, -15849, -15704, -22924, -20021, -188, 12989, -2815, -3732, 7503, 7407, 14039, 24248, 32763]
7310C2763j0331j6777r528K856l188J262J2668P625P910j3052l635O442J2425
7297B7440q284k866l027M348R888n988j1828M539M196M92q017j5884N247N205
7283E461J4656N726m379j6436P12M17J2931J391k372m211m460L944O247l970q142
7268G515j3672K656M003J3415R405j2851r979K422L2R58Q928N107l708q612J979
7253G598n521j6320j4227J1810R705K214L61J621k85M130J2973j1418q818O208
7239C1L203n104j7022K086M693j96j2190l757J0356n275Q623Q208P434l227n149
7224g286r006m814J642P093J7920Q821L202N061P25j1815p405J751l085j103J0771
7209A2472M248J1797J2015j4319k0197m979J1391k811j2251K057Q59m06q329j8805
$$ y = [32763, 22432, 5655, -3873, -1017, -4205, -2943, 9725, 17350, 25260, 12208, 8573, 15015, 27440, 19156, 16290, 13263, 17611, 27499, 21511, 9683, 14222, 18418, 18910, 10893, -4991, 256, 5461, 20117, 25843, 21464, 5028, 5740, 6157, 19088, 20479, 18107, 13896, 9436, 13380, 19627, 15657, 7515, -6157, -3501, 502, 13917, 23322, 10471, 492, 2914, 2946, 3904, 12832, 17939, 14231, 5619, 7598, 2077, -14243, -28470, -16660, -6955, -4741, -4380, -2759, -3044, 1086, 14059, 2641, -6177, 31, 3234, -1870, -18892, -16806, -12113, -12309, -24499, -28256, -17900, -23175, -14552, -6344, 1090, -2137, -7286, -16292, -21106, -19464, -12371, 5549, 14370, 17572, 22633, 23358, 11543, 4138, 5889, 2804, 1701, 12472, 16720, 28517, 40532, 26213, 6016, 1037, 12428, 9617, -2634, -577, 282, -124, -8453, -27258]
7195b7258o267N687Q835J4892M600L94J377l525m229j880n804o86L471P904p411
7180i900R15O841l075l05P690l310n041n230p21n695k529l451J1000N216K350
7165e245M138N087n676j7828N592O497J064j4386L141m017p369P179J5546J7490
7151A1213R373l454r886j0078j849q400j4152N454k095N856K349J1227r349j037
7137a4828R465J6212q91K444m181p662r369k705k661J301k167N415n955j4082
7123b9664P182J0840R623M994k84j0260l596P280N901n157r005J2270J0077M321
7109A4522J275r892M587n068J438Q197p210k180m189o702k354j2557j0809R461
7095b1481P068J0026L60O158L50n019j2146K374J0275M885K122k213k1429M666
$$ y = [-27258, -33525, -27838, -19003, -4111, 489, 883, 2260, -1265, -5494, -7374, -13178, -13864, -10393, -2489, -9900, -8985, -2144, -5219, -5524, 2166, -1144, -6185, -11415, -12136, -17831, -20360, -23811, -12811, -7595, -5245, -1107, 3980, -1696, -19524, -13932, -7435, -6371, -20757, -17616, -21633, -29002, -21823, -6277, 11213, 20586, 17132, 7246, -2832, -4681, -13081, -27233, -21779, -23874, -18018, -15669, -4442, -13791, -14828, -5363, 10849, 9958, 12402, 8221, 559, -8810, -11515, -14176, -12875, -15042, -9627, -15582, -29664, -22482, -11642, -2019, 2975, 2691, -7569, -11165, -3885, 2016, -3141, -12146, 124, 10201, 14522, 15797, 5905, 10492, 5424, 6862, 15059, 7849, 5669, 1480, -5222, -7576, -20133, -30942, -21481, -14413, -4387, -4027, 2131, 2481, -2538, -14684, -12310, -2035, 2850, 4972, 2759, -18670, -14004]
7081a4004K1441Q849m616j5808J775K664o907j2741r621J5399J0351L575k435
7068b078N081j371j5926p38J916j6387Q700P243M175K860p802n133J4239P533
7054B312o198m668j734P659P532n914M071r317L504R943l771J1018O432k428l207
7039A5234L39N083k613j322r717L076K344j646L000r748m641m115N673L567m847
7024c33j0687q782L457M638L432N565o321M839q310L301R112k494j938j006p145
7009a2672M845o623j973M665m703m298N159M835O291j1650N453J0375o438Q456
6995A722Q184o530j8601k693Q038M112r093n76L435k479L704O37R296M793p062
6980c113M474K021l794o83Q653J2044O776p539m30j5793j7392K578j1217N449
$$ y = [-14004, 7437, 16286, 11670, -4138, -2363, 301, -6606, -19347, -28968, -13569, -3218, 357, -2078, 3003, 1632, -14294, -15032, -13116, -29503, -20803, -13560, -9385, -6525, -14327, -19460, -5221, 2312, -3886, -8554, -10288, -2629, 4903, -1011, 3060, -6257, -2753, 7190, 3419, 14437, 20869, 18441, 15234, 15573, 20656, 18043, 16721, 7004, 10080, 12424, 10778, 13778, 4030, -611, -4726, 947, 4514, -333, -11020, -19802, -16345, -11707, -8275, -2710, -9031, -4192, -12502, -9201, -89, -2583, -4521, -5527, -12672, -7827, -14450, -16423, -11758, -16461, -20759, -15600, -10765, -4474, -16124, -10671, -296, -6734, 1722, 9906, 3376, -15225, -17918, -9880, -5768, -14861, -15437, -12002, -14481, -10777, -10140, -844, 3949, -3113, 1361, 3382, -412, -1095, 7558, 19602, 26378, 18839, 18409, 2616, -14776, -12198, -23415, -17966]
6966a7966M289J2759Q722l055L107L785K962m105k834j3377j892M148p572P331
6952c698J556L097j480P573m60o344l731K83P935l813j1511N150l1n291o214q815
6936b5794J3093J6681J5134k203k1130j166q933N864J1839P31J95n646p754J829
6922g260N461J2177M177n999K052M191q44j295j7560p133R01j637n409l774J1297
6907a0655J7090P384P658l384k051j2529l360j390n143J577p982J350J4705J5504
6893A8774N777K505j3608j8928o119j0673j2216L47K1482J2582j7341k0663K686
6880c5395J3814J0444l400o72P983j498j8348J0376N551j27O038p240j798J1569
6866b703J1359o010q999N780J550k651J3185O667k753q964j1886j2710l918L864
$$ y = [-17966, -13677, -918, 7804, 4749, 7856, 11641, 14603, 10498, 7664, -5713, -7605, -3457, -11029, -3698, -2142, 955, -525, 7048, 6588, 244, -3487, -3204, 4731, 918, -10593, -5443, -5474, -10765, -16979, -25794, -12701, 3980, 19114, 16911, -4219, -5385, -14318, -8454, 3385, 4116, 4311, -1335, -9089, -7260, -1799, 10378, 14555, 8556, 10608, 14799, 13955, 12660, -4900, -12033, -11132, -12769, -18178, -21952, -10655, 6435, 13819, 21477, 18093, 16042, 3513, 153, -1237, -6380, -4803, -12785, -11435, 3270, 18774, 24551, 27056, 13448, -5480, -11599, -22272, -34488, -34141, -12659, -77, -17418, -38081, -35395, -21581, -11137, -14537, -15209, -7226, -8724, -27072, -16696, -11145, -11272, -5234, -12474, -14272, -2703, 8656, 2646, -6353, -573, 977, -1674, 11511, 18178, 15425, 6461, -5425, -18135, -22053, -18189]
6852a8189J3518J2576J0327j6588o642N637M457N983M497m353k0546j127O469
6839c981K59O20J2142j4620k1795P298J5247J3249O679j0349l385R88R650L147
6825A5149p758J058r822n223l120q247M051J7858j3386p315P389n851q327r907
6811c3451J5094J0376N028J22q565O673q251j7814j942J4854L234J1663R729j8752
6797a2002o573m526L973N546j087j1163q26q78P568N339J7482M202q922M715M139
6782F987J4932r476j622k500Q893j6169p362P497K888L169p041k036o651q526
6768a7017N112O376j423j864j5204k601q10J0179J725M273J1790R076K0079N047
6754C4738J354n184j0295L676q87O596n033j5068j4542r228J2046m156p502K1007
$$ y = [-18189, -4671, 7905, 18232, 1644, -4998, 639, 5096, 11079, 15576, 11223, -9323, -10450, -3981, -3722, -3102, 9040, -5580, -27375, -20077, -4830, 8419, 15098, 4749, 1364, 2352, 12002, 15149, 7391, 8449, -1373, -6596, -9716, -17963, -13912, 3946, -9440, -16755, -9366, -15217, -23544, -33451, -18357, -7981, -2953, -2831, -11396, -4723, -12974, -30788, -32730, -17876, -14642, -2979, 6750, -12002, -18575, -23101, -19128, -13582, -14669, -25832, -26658, -27536, -19968, -14629, 2853, 7055, -1867, 2848, 6987, 21919, 12443, 10821, 8321, 17214, 1045, -6317, 1180, 4068, 7237, 196, -1840, -8491, -17017, -11905, -5529, -6952, -8816, -24020, -26621, -27431, -17252, -15527, -11254, 536, 9612, 29691, 34738, 36092, 30908, 20613, 24289, 23402, 29998, 24965, 9897, -4645, -13873, -1827, -5983, -13485, 7522]
6740G522l710k825k470n629M48j669J4764M350K618j087j3350m893j494n720Q003
6725e142L189M178l921p696J124K410p053j590O012P070M226p132J0424k23j492
6710D384j398j2933j1862M15R39P947q547J87N678R80m776L10N740L506J6213
6695F783P767J586o950r587J118K950r750r732Q585J2759p52j0801n985o556R411
6680i154M705R279j09R92Q666J1622J0375r592m010o876r87k479m234o364j8283
6665a6449N362J0446L556J1653r286j5476j845p16N589j2086o526P022r513M318
6651b3951p460j506R150q83p84L1170J7253k954m867o420j3732o899n940o835
6637b4658n270J0561L390P655P617r892j7243l259K070J7398K1970J808p763q304
$$ y = [7522, 3812, 987, -1483, -7112, -6664, -8333, 6431, 10781, 13399, 12312, -1038, -5931, -7425, -13145, -5142, -1953, 2225, -1696, -9392, -8268, -5858, -12911, -14501, -8489, -1419, 2807, -4325, 6099, 5876, 4384, 2986, -9947, -21809, -21394, -20455, -12508, -21055, -20868, -15190, -14210, -18986, -18676, -12936, -9430, 6783, 14550, 16136, 9186, -401, 717, 3667, -6083, -15815, -7230, 5529, 4777, -6024, -12009, -18565, -9154, -4449, 4830, 4721, 5713, 14379, 26001, 36376, 26784, 22774, 15898, 14911, 12432, 8198, 1834, -16449, -11087, -641, 2915, 14568, 5282, -10194, -12039, -12755, -7166, -19252, -25778, -18756, -28269, -23951, -31411, -32917, -23767, -24650, -25434, 5736, 22989, 20035, 15168, 8748, -4984, -11883, -17823, -24658, -29928, -19367, -15977, -8322, -705, -10597, -27840, -31099, -29029, -11631, 10339, 12147, 4384, -3920]
6623c920q502p957M180J071Q81N177l87n008J2061l518j6484p546J9140Q934r491
6608a1369p994p12Q630J3519l913j4423K503J1861R953o902k250P45Q22k010N496
6593C956R301m120J877K482j7211m071J2212n21m464j3638J678J2756m851P795
6579C181O063l625K587j0206m420K76L67j444J371N183J1713Q941m968k4538p204
6564a6723N574M064r883K202l869l371J3999Q798O40R020l63R347l645l559m062
6549H169j6409j845M873J535J2521J0087r221k0404N012J0932k544p645r253J032
6535a3160o079n222j355R798J564Q165L129Q413J5282k631l907o018p216m313
6521c550J3843j944k4111L452N066j558n71J6486Q985j8621m644J751q13O115
$$ y = [-3920, -12422, -20379, -16199, -15128, -14247, -9070, -9457, -14465, -2404, -5922, -22406, -29952, -10812, -1878, -11369, -19363, -20075, -11445, 2074, -1839, -16262, -13759, -1898, 8055, 1153, -1097, -352, 470, -1540, 3956, 13257, 9137, 11014, 13496, -3715, -7786, 4426, 3905, -559, -14197, -12519, 237, -4614, 3181, 9244, 5619, 8206, -2000, -6420, -6144, -5777, -7221, -5850, -667, 11046, 19987, 15019, -9519, -16723, -11149, -7085, -16968, -14766, -18635, -22006, -8007, 791, 1431, 10451, 10088, 19435, 15790, 12231, 8169, -8240, -10085, -5212, -3677, 8844, 18931, 9710, -10694, -5682, 5250, 2706, -4939, -14192, -13160, -19239, -24461, -25816, -16018, -14454, -6289, -3160, 5253, 20535, 17904, 13997, 7979, 763, -3550, 10293, 8349, -15762, -12310, -7244, -8802, -9373, 7113, 16098, -2523, -7167, -5416, -6229, -114]
6507a14P115j6100j0959r059M869M488K0645k285j0725J6284P366l894j3913p039
6493a3321O220N869o87k121P851m870r302k1233n582K491J8855J4096o60j0061
6479a2455M58K2373K579j4366J094K119n128Q212j0066k368P412M726n047L521
6465C064O823m683m432k461J0522N161o107Q800q823o521n030m591n14O812J1858
6450I878O786j0113O22q76p995j3998r232J5868Q901Q375J8874L443j4393j5250
6436H90l090j1550j2245m40L227K973r707P987J6444N223r69P819p983o583k448
6421a0452K873Q029N721J9235j2615k45r791j6142q505L479k033k657R528R038
6407d537J3748k825j0502p107Q77J3616J4345R15k2618o710q711K09P709j639
$$ y = [-114, 7001, -9099, -20058, -29117, -24248, -19760, 885, -1400, -12125, 4159, 11525, 7631, -6282, -13321, -7101, -1232, -1919, -4040, 3811, -1059, -10361, -31594, -37176, -34685, -15830, -1734, -2394, -12455, -11997, 10376, 12955, -1411, -317, 1802, -3326, 4886, -5180, -7548, -136, 4590, -457, 3064, 9887, 5204, 772, -1689, 8833, 13994, 7887, 16687, 7864, 1343, -3687, -8278, -8792, -1980, 9878, 16664, 6551, 7173, 6297, -1698, -15696, -24928, -9060, -159, 8216, 27090, 30533, 16140, 890, -2200, -13750, -25995, -26435, -23208, -20235, -29942, -21955, -5511, -288, -1257, 6562, -1421, -8004, -10452, -7579, 450, 6171, 25406, 12791, 12546, 2755, -13387, -21892, -18413, -20446, -23103, -13575, -4537, 9211, 6386, -4116, -11223, -10346, 3270, 17615, 18530, -4088, -10798, -19509, -19300, -11591, -13230]
6393a3230l091p220o901J2243J2028J081k0333R369J1321R407O866L67j9078r812
6379a6983n039R239J0763R1K071j0258k3597Q26J1837J580j352k106R756K3099
6365I927R130p289p983k1158N14J4473Q719K76k597j96O36j900K925L217j5254
6350f560r207j0305M698N762N799N150m035j124M94m817J841O270j466n490Q385
6335d605J1539O136J10P321r516j0490l801j031j4624o824L004l758j703k43m125
6320c2610M389n52m217J3890J4363M169J30j1204K099j224n202P085L874J7838
6306A2828J5802j1377j3117M309K795j713k801m445o9l358p194q120N405n214
6292a6269l716n019K715N534K896N093k606K136n041k404j2618P643l143j2222
$$ y = [-13230, -16321, -23541, -30442, -18199, -6171, -5090, -25423, -16054, -4733, 4674, 11540, 11907, -7171, -16983, -22022, -12783, -2020, -1929, 142, -10116, -33713, -32887, -21050, -19470, -20822, -22928, -13172, 9927, 19057, 11768, 3785, -17373, -16859, -2386, 6333, 6609, 4012, 3816, 4452, 2552, 5477, 8694, -6560, -15767, -26072, -21374, -15612, -9813, -4663, -8698, -9822, -9328, -14145, -12304, -6034, -7500, -12990, -4605, 6934, 13070, 13180, 20501, 10985, 495, -3306, -4337, -18961, -25785, -22781, -26539, -28242, -28485, -32610, -28221, -28773, -32990, -19100, -4737, -568, -438, -11642, -9543, -10767, -15969, -8884, -5010, 12828, 28630, 17253, 4136, 8445, 11240, 9527, 6726, 2281, 2212, -1146, -8340, -16460, -11055, -16269, -19985, -25004, -22289, -16755, -13859, -8766, -11372, -9236, -14277, -16681, -29299, -21656, -24799, -37021]
6278c7021k477K0049N333O631j013p345J062K1194J4567o978j0312j4339N224
6265e425P282m513m719m497P587k104j2995n300Q99J3019R176m80Q85r667j2239
6250b3091N787J2490k572l732N129Q976m889j0416O689L961o868l907j3690O397
6236a9736n30O770j063j4224m480Q726L792n299p982J1692J2491J5063k638q070
6222e488j19l499m338k704R00J0610J0407L501M972j0569J899Q661L82n063l350
6207F202l060n66N784p024p167M675M837L99p950q444l985L513R349J1368N746
6192A3677m853M161j2303l625O659L229M213n164q631j0885m57K920n285K882
6178a3462J2921L890q910O195q951q915K900O412m81q196j6808j853J0376J247
$$ y = [-37021, -39498, -19449, -14116, -7485, -8498, -15843, -14781, 6413, 20980, 14002, 3690, -10649, -5425, 1857, -2656, -7375, -11872, -4285, -6389, -19384, -24684, -23785, -10766, -1590, -2070, -1185, -10852, -23091, -17304, -4814, -7386, -11118, -5989, 2987, -1902, -12318, -5629, -1668, -8536, -12443, -26133, -19736, -20266, -13496, -14559, -28783, -33263, -24537, -20745, -26044, -34026, -22334, -9843, 5220, 2582, -5488, -5607, -9106, -13444, -16148, -15248, -4638, 5769, 9270, 14242, 3673, 5572, 14233, 14615, 9552, 6202, 3142, 2576, 8360, 1336, -5831, -1156, 3681, 4080, -3870, -12314, -16299, -12786, -3437, 7931, 13677, 8824, 12985, 682, -2943, 3716, 6945, 11158, 5994, -2637, -13522, -13979, -11059, -16344, -13462, -541, 3349, -5561, 634, -8317, -17232, -14332, -7920, -8401, -16597, -33405, -35258, -24882, -23635]
6164b3635L977J2388J416o00n21L933j1900L030L758O906q51q854p097P525P195
6149c330p431j906K756O353J3930M590j0323N890R413q520l499l285P203j535
6135A0306j1690j7002L834J1801J1721L56j0865K350L802J124K838q463p839L404
6121d323P893O377J2307p097j4975O393K392j2910n530P087n386j6639K21J3680
6107a0510J1859P882r597N71O998j723R43L112J99j0513m629L866J7281m848o192
6092D699j021p201j0766J220J3554j8222k118J278P680Q481L237m112o512k0M617
6077e206o63l239J7914P639j2386q994m534Q626P286K443j0042j714o923m382
6063a4175m339O452o093J0436j605q425R985J6631K399j3662j3536j7741Q036
$$ y = [-23635, -19658, -7270, -5854, -6454, -6975, -3042, -14942, -11912, -8154, -1248, -2099, -10953, -18050, -10525, -3330, -10761, -12667, -9911, -3558, 10372, 14962, 4639, 10529, 19942, 11422, 7923, 4638, 11841, 10306, -1384, -18386, -14552, -2751, 8970, 9326, -1539, 811, 4613, 5737, 8575, 112, -7727, -4323, 3570, 9947, 22254, 15157, 182, 6575, 8967, -3943, -9473, -2386, -7772, -24411, -24190, -10510, 1349, 9231, -366, 205, 7203, 5480, 6423, 9535, 9734, -779, -5408, -1542, 15739, 10891, 4699, 3678, -3523, -14289, -13069, 485, -17737, -19855, -18577, -10897, -2416, 821, -3291, -9803, -9823, -5206, -5869, -9108, 8806, 16445, 4059, -4935, -9469, -843, 6443, 8886, -1156, -2870, -9793, -14175, -18514, -12062, -18155, -7719, -9324, -17749, -7764, 8867, 11266, -2396, -15932, -33673, -25637]
6050b5637J6471n05q111M22p277P744J0517n135J158J6637P859k1886j5637Q176
6036a5204J1380L001l491j2715N957J11J3269m037j8095M482J4601l884J872M333
6022A580m135K660N130m451j0780J4045Q881l035l355p435p171N00j570j0069
6008a9205l317j703L965J3291N618J5151M441p285l209j0595o244q989m384O884
5994a5581j853r526J1986J9730J785o264L271m628o266j0835J0126R39M644J2020
5980I548q4j98O255M234j3272j4067o36N272k445M843M557J817n215p6j584L007
5964A956J771p536j2145M362K074m89l994l379m556J2708J4353Q337K006o885
5950H583M849r638n084q585K092O476L776j7704J759M27m085k374l996J1208l77
$$ y = [-25637, -9166, -9671, -17782, -17360, -24637, -16893, -6376, -11511, -10353, 6284, 14143, -7743, -23380, -15204, -3824, -823, -4314, -17029, -11072, -10961, 2308, -1729, -19824, -15342, -741, -4625, -2753, 1580, -2555, 105, 5235, 784, -9996, 4049, 12930, 9895, 6540, -895, -8066, -7566, -9136, -19205, -22522, -24225, -20260, -6969, -1351, 13800, 18241, 10956, 7747, -2848, -9092, -18081, -22465, -15581, -17434, -26960, -14974, 4756, 6541, 277, 3548, -1080, -7346, -18181, -8055, -7116, -2472, 9548, 9464, 9266, 15521, 19755, 6483, -7584, -8220, -2948, -5393, -550, 4007, 5824, 609, 533, -1051, 1956, 3727, -3809, -15954, -11592, -9518, -10007, -14001, -17380, -21936, -9228, 5125, 13462, 15468, 8583, 13432, 3794, -1290, -9875, -7783, -1307, 2469, -15235, -13476, -13049, -17134, -19508, -23504, -12296, -12673]
5935a2673k279J0426O447j972q695J419N428P153p560j5524J1345r44n196n686
5921a8311j0801J273K4231J0841J921o940p137J242j3840L796P040O33n972n297
5907a7321j7072k359K3535O673j9869M897L411K0355p225k948M951j486n490j4235
5893b4183L677J9923K810q244o888j3375L317j290o809O340Q509j1333q58K353
5879b6051k369k458J4766J3026K794Q809K516j0723j600j3806R043p518n118M808
5865a3881P793J761K098R84J650n681n264n02J337M489P236N32M452J3812N225
5850B6041o600q192k2040K762R806j540M959q831j3925k044J0698K4062M337q664
5836A0829j0170n172k975l687j1642J1155K598P330N946J852m235j1376R415M854
$$ y = [-12673, -14952, -4526, 1921, -51, -8746, -7327, -1899, 5254, -2306, -17830, -6485, -7429, -12625, -18311, -29112, -27839, -3608, 7233, 9154, 2214, -4923, -3681, -17521, -13725, -6685, -6052, -12024, -17321, -34393, -36752, -13217, -6544, -26413, -21516, -18105, 2250, -4975, -7923, -2972, -4458, -9948, -24183, -20506, -583, 2227, -6017, -12905, -26280, -22963, -24253, -31062, -24722, -16213, -27546, -28404, -26051, -28420, -30878, -16112, -3086, -292, 8517, 11033, 310, -1290, -15096, -6053, -13571, -18689, -13881, -6088, -4327, -2229, -1245, 405, -5276, -10540, -11042, -9705, -5216, 2020, 2552, 7004, 20816, 26041, 19441, 11249, -10791, -8029, 1777, 237, 5196, -3635, -17560, -19604, -8906, 15156, 19493, 10829, 659, -4513, -7488, -11175, -22817, -11662, -9064, -1734, 4212, 6064, 1829, -9547, -132, 4722]
5822D722L799J4869L348K279K416p802n017O3M351N82m787n316j8386m085J5839
5807F875J0209Q244j935k0848N134O591j743r221j6521L36j1182J2143q698J0049
5793a0567J5920Q413o233j0228O022p985P008l079n411k495o19P587R953J2286
5779B0572l373L810j535q689K318L85j4000p469o998m400K20P380Q837J1913K0319
5764B9290M858j4265m104k876k682j204n695k828N727P694R727J22j7145j430
5750E189l650L912n179j0087J0704N347M399J031j1018O509L138k281j6737k729
5736a1452J163j844k132j2113J7680R144K797k648k648j4217o953J8508J7566
5723A2851K037j4476J921O100Q649j1506J401j131M826L479j2088o682k260j943
$$ y = [4722, 8521, 23390, 26738, 29017, 31433, 23631, 18614, 18677, 23028, 23610, 18823, 13507, -4879, -8964, 6875, 17084, 25328, 23393, 2545, 7679, 14270, 12527, 3306, -13215, -12879, -24061, -11918, -20616, -10567, 5353, 13766, 7533, -2695, 3327, -4658, 2350, -729, -6140, -8635, -9254, -1667, 8286, 20572, 17199, 21009, 19474, 10785, 13103, 13488, -512, -7981, -14979, -19379, -19159, -11779, -2942, 8971, 29290, 34148, 19883, 15779, 12903, 10221, 9017, 3322, 494, 6221, 13915, 23642, 23764, 6619, 5189, 1539, 5451, 272, -9815, 889, 6236, 10635, 11666, 648, 7157, 10295, 8014, -8723, -11452, -10289, -12133, -14265, -26378, -8698, 446, 3243, 595, -2053, -16270, -23223, -4715, 12851, 14888, 412, 2333, 8433, 17082, 5576, 6977, 5846, 10672, 14151, 2063, -4619, -6879, -8822]
5709h822K248n802K980j493J5842m666k254Q754l796L538n402j3366j0394r260
5695c1893L313K1749l891P484J5114K126o72j4323k577n697l173N810n088n667
5681a7385K237L348l025l050R551O111M849q689j2745o14K5015P906q159j0418
5667e068L254K0716j055n005L330O782j2998q506R361P465k1828q262R959J2085
5653A0230o013p172O784R551r957j2168p725o807m255J497J3322J2207N70r562
5639i498r820K754j538p692N174o47J4214J1610j879M407l516L04k373l644o604
5624h748k669q773M619Q028l597p006J4480p32r12Q345l184n148k692m663m116
5609a6768J2106K0108J3255l430j6761j685M983J216k102n995q108N473J72l48
$$ y = [-8822, -6574, -12376, -9396, -10889, 4953, 287, -1967, 6787, 2991, 6529, 1127, -12239, -22633, -31893, -28580, -6831, -10722, -3238, 11876, 14002, 13330, -993, -3570, -9267, -12440, -6630, -11718, -17385, -15148, -11800, -14825, -17875, -8324, -2213, 2636, -6053, -18798, -19412, 5603, 13509, 5350, -5068, -1814, 18902, 17847, 12842, 16172, 22954, 9956, 1450, 10811, 18276, -3552, -11814, -1855, 10230, 4217, -2955, 3829, 13380, 3423, -8745, -16470, -23277, -27532, -26035, -12713, -506, 64, -9498, -19318, -16564, -18102, -25794, -20620, -21267, -7053, 4557, 2678, 7085, 3569, 3873, 1500, -2144, -8748, -11417, -20190, -15571, -7543, -11140, -18146, -3666, -4398, -5310, 3035, -149, -5297, -7989, -12652, -16768, -4662, 15446, 28701, 25271, 8510, 6825, 11808, 13024, 10922, 4927, -3181, 2292, 2464, 2116]
5595B116m549p694n026p432m206N574m693K783K4431l487j3473m858O884J1747
5581a883L751m236o234l152J8314J2111r109n131R427N156O223q656R286K444
5567B8311o185n689j1295j0312k616L485K648o864m349J844Q164P339J163n309
5553C35j3368o149m289J0891K0595K031j3829p459j347r734k49o824l246Q293
5539b4349R421N101K055R063Q193Q707r63l008p487j0326k411L065q395r395J125
5524a9604o7J21P437N398p44n009L279J1518j320r68j5273M531Q161k610J668
5509c482j289K952Q300M166q267K553M048l981O83L190r569l515L095q360k644
5494a2120l369P547N617o612N685j679Q3m591N114Q665l668J0473J3671p415l018
$$ y = [2116, -2433, -10127, -15153, -22585, -26791, -21217, -25910, -23127, 1304, -2183, -15656, -20514, -13630, -1883, 1868, -2368, -8602, -11754, 6560, 18671, 9562, 4431, 13858, 19014, 25237, 16581, 25867, 28311, 22126, 16437, 5142, -5170, -7786, -4301, -1653, -8517, -12866, -11022, -2858, 4481, 5644, 335, -13033, -19182, -23471, -12580, 8015, 10046, -3783, -11242, -12589, -22323, -22572, -29396, -32642, -24349, -14928, -9827, -7772, 1291, 9484, 18191, 17228, 14220, 6733, -3593, -6004, -2939, -11334, -20729, -19604, -19671, -19550, -12113, -6715, -7459, -12468, -9189, 2329, 1009, 41, -15232, -10701, -2540, -5150, -3482, -4771, -1819, 6481, 10647, 2380, 4933, 8981, 5000, 5683, 8873, -696, -4211, -1116, -9476, -12120, -15489, -7942, -2325, -8937, -3252, -4931, -4848, -9439, -4325, 4340, 672, 11145, 24816, 17401, 14383]
5479A4383j8399p461p723O357j896N957k670P622M635m058N567M47n570j3074
5465a5883r700M914R305K0265J0086j0393j8538j2661m396Q615J2315O011Q54
5452G94r931r074L072j896J054J6399Q443r257J139j845M45L972Q980l375k9085
5437b0165j2783L50J4178q36l823J3037j179Q123Q781L404n704J93j1891m413
5423a2728L115L565P578R189j454j3026K165j659k123j1422j5463R790K4480J6550
5409A8557j2241m523R431k152O495j1276p597N999L397j0650p364Q195P140j0230
5395f819k0354Q80P600M411M430M102J2516q837m834J6581Q222j3149l447J6870
5381A8172L708j1867j1677j0503L304Q176M37O620M347l536j2529m037L263M09
$$ y = [14383, -4016, -11477, -19200, -12843, -14739, -8782, -11452, -3830, 805, -3253, 2314, 2761, -2809, -15883, -25583, -20669, -11364, 8901, 18987, 8594, -9944, -22605, -27001, -18386, -6071, -60, 794, -9137, -18211, -15139, -17035, -15981, 418, 8861, -396, 743, -1102, -657, 3315, 12295, 8920, -20165, -32948, -32598, -18420, -19256, -23079, -10042, -11221, -3098, 5683, 9087, 3383, 3576, -8315, -12728, -9613, -6048, 1530, 10719, 9265, -3761, -1596, -3255, -5378, -16800, -32263, -22473, 2007, 18557, 6316, 1793, 11224, 9072, 15567, 4291, -3306, 2693, 6090, -4560, -11924, -3729, 3411, -6819, -27173, -26293, -18693, -14282, -9852, -5750, 6766, -2071, -6905, 9676, 17898, 4749, 1302, 18172, 21880, 10013, -1664, -12167, -8863, -687, -250, 6370, 10717, 7181, -5348, -9385, -6122, -5713]
5367e713q726j3613R186Q444n427K312P34Q922P591m931M40l502n661K414Q71
5352f659N014j85Q569O336j2940M6k665j8484M498J1565J2611R588n407r1R20
5337A2716k873L585m439j1599m192l065J761n83p415P608J2659J24O81N792j2181
5322a421k405R719P068J235j2947o767q538Q796J3888J2678l650j0031k6924j9921
5308c9220J3720J9370J0626j013j3157Q924N047j849l572o524j732J6041m595
5295B066L744n224j199m596R122J2837O707J419j8914k2272L594K2686r194n223
5281d447j185L717N687j0257j0156l335J9006K0561N545j1450j011R118n405j689
5267A4699l766l0764k0372N45J4488Q227J1689P649Q637k596J34n700J2480p714
$$ y = [-5713, -14439, -28052, -18866, -10422, -15849, -13537, -12803, -3881, 3710, -1221, -781, -4283, -9944, -7530, -6659, -1645, -1830, 6739, 13075, 135, 181, -2484, -20968, -16470, -4905, 7706, 17294, 11887, 11796, 12716, 9843, 13428, 8989, -2610, -6802, -9867, -8106, -8689, -16104, -8496, 4163, 4287, 4968, 10760, -1421, -3826, 5893, 12961, 14196, 1249, -5518, -14056, -5260, 8628, 21306, 17656, 7625, -19299, -39220, -25500, -6130, 4496, 3483, -9674, -750, 4297, 2448, -1124, -7648, -9380, 6661, 2066, 5810, 586, -613, -5209, 3913, 16750, 23457, 24876, 5962, -16310, -12716, 9970, 776, -4447, -5632, -1915, 3772, -6485, -16641, -19976, -970, 19591, 25136, 13686, 12675, 21793, 16388, 14699, 10933, -19831, -40203, -39658, -25170, -16943, -5254, 2395, 11032, 8436, 8570, 2870, 15350, 7636]
5253G636r871q752r546R344M236m769l574o371P208J9727N188m371m120M403j203
5238E165j0506m56M211K853M947o905j0465m385N670R172L847o172Q90K825J2917
5223A3608M458k379J1712N10p727j8269j2698m96k110o376m875J0646l293Q325
5209h964M65N496l32l73J3314J2362q208q639k167j2441M501J462m605M084P696
5194C651j926l583j754R734n811Q548N799K457j1615j2200p442l650Q415L56o062
5179a5083L77K449P475M950m62m358k819k691n039j1533P852J6836J2236N068
5165A5258o916q929J3289q169j2050M653N555j3693r892P03K3685J6542J292j2021
5151I307j0849m699n594J47N281N775Q038Q566j98N168L553j2344j9317q085j601
$$ y = [7636, -2235, -10987, -20533, -11189, -6953, -11722, -15296, -21667, -14459, 5268, 10456, 6085, 1965, 6368, 5165, -5341, -5797, -1586, 1267, 6214, -691, -11156, -15541, -9871, -699, 3148, -3024, -2134, 691, 13608, 18066, 15687, 27399, 27909, 20182, 1913, -10785, -11281, -13391, -19767, -24642, -13996, -17289, -8964, -8499, -3003, -3335, -3708, 9606, 21968, 13760, 5121, 2954, -9487, -4986, -3524, -8129, -4045, 3651, 1725, -1858, -3612, 6122, 311, 8859, 14658, 17115, 5500, -6700, -14142, -17792, -9377, -9021, -15083, -14706, -12257, -4782, 168, -294, -4652, -7471, -10162, -15201, -26734, -18882, -2046, 10190, 15258, 8342, -587, 12702, 4533, -7517, -2864, 2691, -11002, -20894, -20191, 3494, 20036, 21328, 9307, -1542, -6241, -11835, -11688, -6407, -632, 7406, 15972, 15774, 20942, 24495, 12151, -7166, -15251, -16852]
5136a6852J0677M962M143O302N804k541j62n084j677N546j596r730j003M833J703
5121E325q659K502R336O879j7803k832L3j4455M92P577O500J3762O600m858j6242
5106e843j0436k395j436n585K835R983N797k225O75j4491M336J5613n074M056
5092d190J696J2659J6159l035j919N30j2042j5276M157Q542J1568R729j5783j8134
5078e339K656L118n80j692J1164N197R54o523j1103l988j7745j2332J2305M982
5064a8926l403P523K262O894j259r834J0251J785O29J2419j5385m651o409m04
5050a8508R683J8153L263p137j1314n420m311q091J2410R719q142k17k532O776
5036e668K641R071l811p697P183M274l638M706k789p314N841j569j1910p569k589
$$ y = [-16852, -6175, -1213, 2930, 9232, 15036, 12495, 12333, 7249, 5572, 11118, 9522, -208, -1211, 3622, 5325, -3334, -832, 8504, 15383, -2420, -5252, -5219, -19674, -19182, -11605, -5105, 8657, 15257, 10399, -5843, -16279, -18674, -20110, -25695, -22860, -12877, -7080, -9305, -8630, -23121, -18785, -3172, -8246, -4190, -2494, 10165, 26324, 23289, 21370, 21900, 9858, -5418, -1261, 7281, 18849, 28578, 12795, -5339, -2683, 435, -145, -1837, 9327, 14524, 15478, 8955, -2148, -6136, -23881, -36213, -23908, -18926, -22329, -14806, -12544, -5650, -6909, -16743, -6492, -4707, -4078, 8341, -7044, -11695, -18104, -18508, -8825, 9328, 12591, 5454, -5860, -11280, -15591, -23682, -11272, -1553, -9695, -9912, -12444, -5668, -3027, 6044, 2233, -5464, 1719, 5993, 2355, 7061, 4272, -3042, 2799, 1230, -10680, -18249, -20838]
5021b0838K1072L324n44r054q756j8341M332J5936J2121m826k620k633q693J428
5007a8092J1572P885R669M731j130l809o967N761j115L015r360R21n138j2028
4993a4085N683k287J141L441K214j071j501q340P891K666n007J2357P377l384
4979G095J848o31J12n102J2462K868m237P159O87r841N571k227p651N592q005
4964E700O27J5007N353m889j5854o04M776P332p355n232M338j217N161o987j5363
4949i207J281l861O828N896P295o236M948J2639J6O80q051o837p669m040K317
4934d001L56k982N529j560n95L618o894m213M749J3785N136k57J410j255j9298
4919f472J00p677k450K6221R306j4154j0780M699m48k184j4389p311J1928J1404
$$ y = [-20838, 234, 3558, 3014, -6040, -14796, -33137, -28805, -12869, -748, -5574, -8194, -10827, -19520, -18092, -6520, 1365, 11034, 15765, 14635, 10826, 3859, 9620, 8505, 11520, 2160, 3081, -2057, -14085, -8402, -10689, -9548, -6107, -3893, -4964, -6465, -14805, -6914, -4248, -9255, 3102, 10479, 7095, 8943, 8312, 8424, 3322, 15784, 18652, 14415, 21574, 22261, 12420, 17991, 15764, 8113, 13705, 5700, 6327, 21334, 26687, 21798, 5944, 5340, 10116, 17448, 10093, 4861, 9199, 7982, 13143, 6156, -9207, -7926, -11787, -4959, 937, 8232, 1996, 6944, 19583, 19599, 20279, 12228, 5391, -2278, -6318, -4001, -3645, -6627, -1098, -2658, -3253, 365, -6529, -10742, -5993, 7792, 12928, 12671, 14081, 12826, -6472, -6372, -14049, -16499, 9722, 19028, 4874, -5906, -1207, -1655, -3839, -18228, -25539, -13611, -2207]
4905b207Q382R76m381p57l309m67O746N729o867j8633M008J5734k884J440M675
4890H185N701P119j4547J147K015j1040J0175R279r431j347q725o585M551P508
4876D005J3568O031n178n977o555K452J095M954N519R769M417k8n363l831n815
4861A9063o813O717q0p317j5567m689j927J1721j1577R57R62K352O304m74k253
4846b621P93J296K08m900l256J139Q550R412j2271j4859J5390R024k620k813j0419
4831g947M669r54k954N696J4715M091o419l00J316j4911n654J3378J0762J565
4817A7053j2989Q132j802j105m692j3901n950N01N611Q146j245L302o153m468
4803i560O382l206J682j089Q951K097m529j981Q607M422j725j478o651j3785l824
$$ y = [-2207, 6175, 7151, 2770, 2013, -1296, -1763, 4983, 10712, 3845, -14788, -10780, 4954, 2070, 3510, 8185, 13886, 21005, 6458, 7605, 9620, -1420, 8755, 18034, 8603, 7256, -1469, -8054, -3503, 4005, 17573, 23604, 18426, 12449, 5894, 8346, 9441, 14395, 19914, 29683, 34100, 34072, 28709, 24878, 19063, 12250, 18967, 18887, 11570, -3997, -8686, -10613, 1108, -10469, -9512, -8550, -6198, 106, -368, -2621, -1828, -532, -324, -5224, -8480, -7341, 1209, 10621, -1650, -16509, -1119, 7905, 5285, 2472, -7947, -3278, -4232, -7186, -1490, 13225, 17316, 10897, 10597, 11913, -2998, -8652, 4726, 15488, 17053, 4064, 12196, 10394, 9289, 4597, -9304, -15254, -14753, -9142, -996, -2241, 1061, -5092, -9560, -3178, -6384, -4702, -5791, 3160, 5257, 728, -1253, 7354, 11776, 10051, 8573, 1922, -11863, -15687]
4788a5687O312p728k767J6203p37j138J038L172O97p64p729j145J190J9612Q902
4773A9431L614k362q889k435K30m287q314j5656j1203k647P19J2860J3381R235
4759C677j501O995J3417j942j4462j1611j2988j629J8607k328k067q35O182K891
4745B406N001K1969M280j8402j4789j6144O97K1051M656K3n770Q936k808o1l636
4730G409J744M332j223q672m273O318R692m073j895K536k0342j7100Q084J5258
4716b205r380l71J473m067r57N691O725P90N673J734n550l691j0087j0175K058
4701b2339j827N644N995o296l507K008L866M283J2403N091R97j193k329j828o63
4686C05L197R059K516j5373k3916K150Q001J448M293o583j555R097L928n627N998
$$ y = [-15687, -9375, -17103, -19870, -3667, -4404, -5542, -4504, -1332, -635, -1399, -9128, -10273, -9083, 10529, 19431, 23045, 20683, 11794, 9359, 9589, 5302, -3012, -18668, -29871, -32518, -31799, -18939, -5558, 3677, 2176, 9171, 22588, 20646, 6184, -5427, -18415, -20044, -1437, -3765, -5832, -6667, -485, 2406, 7407, 29376, 33656, 15254, 465, -15679, -14982, 6069, 10725, 10748, 4978, 13914, 11106, 11045, 7409, 9153, 13485, 12262, 3590, -683, 5635, 15327, 11254, 9359, 11895, -8447, -25547, -17463, -2205, -11585, -11956, -10483, -14550, -15507, -9816, -3091, -2301, 3372, 5106, -444, -4135, -14222, -24397, -22339, -24166, -18522, -12527, -18823, -22330, -20322, -16456, -12173, 230, 5321, 6318, 5125, 2796, 968, 305, 3502, 12561, 15077, -296, -24212, -22062, -14061, -12613, -8320, -14903, -16458, -7361, -3433, -9060, -3062]
4671c062r383j1175N00R90m306J0938l548O408Q715J1205J800m573J709m310m074
4656b166P995m204M110q682m127j5572o142J3434L526K749R025Q889M599j6934
4642c500o998K573R032j0751p457J1241N513p310Q84J4209P291o558J644L360
4628A3173o855j1904Q409J5923J5908m431j3004r960k659p561l089P540Q360N130
4614A4980k875j0427j936K951Q374p152P794J1335j5160r168l644K3582Q757j1564
4600A5847n266q240m090p467O511L068O211j033J026Q492N964M869j5176k705
4586H011p153r0j485O136j955M120K069Q650l560j194K906j1587N5J0957Q442
4571B4322k575k1742j1809l682k010n480R796J4589J3884r445j2464J897L400
$$ y = [-3062, -12445, -23620, -23120, -22130, -26436, -15498, -19046, -12638, -3923, 7282, 9082, 4509, 6218, 1908, -2166, 5829, 1625, 5735, -2947, -7074, -22646, -28788, -15354, -11828, -9079, -54, 8835, 13434, -3500, -10498, -7925, 1107, -9644, -17101, -5860, -347, -7657, -6773, 7436, 14727, 8169, 9813, 13173, 6318, -5586, 2823, 18746, 34654, 30223, 17219, 7259, 4600, -2961, -6050, 1490, 9850, 14980, 12105, 1678, -258, 2693, 11067, 3915, 11709, 23044, 7884, -1284, -4928, 18654, 27411, 15847, 10581, 2341, -1749, -9216, -2705, 363, 6574, 5541, 6567, 15059, 21023, 25892, 10716, 8011, 858, 768, -717, 5419, 3464, 7584, 9653, 18303, 14743, 13549, 16455, 4868, 4923, 15880, 24322, 21747, 5, -11804, -15486, -17496, -22976, -13180, 1409, 15293, 5848, -6616, -4719, -1319]
4558a319p381L178N161m620q111M885L270p120l614O851O941k741P676J1633K006
4543A6695j3030j493R399o875j0903j2401j4019K0846Q192p741r739L557O254
4530a1258J679o098k30j257k089J385j0118j9454Q9J5334J0178K0060Q347q470
4516a902o46r138P281J1235L074r776Q194J576J05j3232O627j486n576j6668k896
4501b3228N092p439O055K3153J080n390m199l465L403J3147J995j4883M301M890
4487D512P595K491j2632l026Q388M167j6224P389R922n558l935j0109j269R171
4473H82J1093M819j9010j042J0080L27n648j0725l910j037J0310J2318J379N304
4459A5140N31R328j060o136n207q846o901j848r17J169R069j1139Q994Q92q076
$$ y = [-1319, -8700, -5522, -361, -4981, -13092, -8207, -4937, -12057, -15671, -8820, -1879, -4620, 3056, 14689, 16695, 3665, 2172, 11571, 4696, -6207, -18608, -32627, -11781, -3589, -11330, -21069, -17512, -11258, -9579, -15677, -15907, -17164, -19253, -17868, -27986, -47440, -47351, -32017, -21839, -1779, 6568, -1902, -2548, -11686, -4405, 6830, 9904, 128, 8322, 9898, 10003, -3229, 3398, 1912, -3664, -20332, -23228, -18136, -25575, -19520, 3633, 4713, -677, -4876, -8341, -4938, 8209, 10204, -4679, -378, 4512, 12107, 14598, 1966, -1060, 7328, 11495, -4729, 2660, 12582, 7024, 3089, -7020, -8289, 882, 11975, 16794, -2216, -3258, 6822, 7149, 1501, -9224, -13134, -14171, -3861, 8457, 9836, 15140, 15671, 24999, 23939, 17803, 12596, 3750, -3151, -4999, -5916, -4747, 4322, -6817, 2177, 3069, -5007]
4444e007J540p56p867K11L482M185L504l912j218r524n179J3342J6582l966n759
4429c42M758J0395q122j4875M888j026j185j362j305Nj1679J651K651l194R866
4414h876J3172K113K398j8076j0681R728M543j4083m474n33J2745J5133k885P458
4400G682r5k330j0437q106R195Q260J054j4322r025O279J0290L433L431L084n075
4385C318J821l227R81J0431j1068m045J3338J2456J060j2386l119J095J191n167
4371F679j1379k3078M611J1195K115j210m144P274j3642j3137J0339K2683l005
4358d699r999j739N523O746n890j0481Q638n389n182j2357j620K7611Q028j08
4344i18J2714P88N049r741l858P926j6642j8756M56K214N302J6941P228m351n07
$$ y = [-5007, -3467, -4223, -12090, -11879, -8397, -4212, -708, -4620, -5838, -15362, -20541, -7199, 9383, 5417, -342, 4416, 14811, 6689, -8186, -3298, -4324, -5509, -6871, -8176, -8171, -19850, -18199, -15548, -18742, -8876, 4296, 6409, 8807, -9269, -19950, -10222, -5679, -19762, -24236, -24769, -12024, 3109, 224, 7682, 7587, 5257, -5180, -13286, -4091, 4169, 5223, -9099, -18124, -11845, -1555, 1878, 5309, 8393, 3318, 5139, 1912, 2893, 13324, 2256, -1789, 11549, 24005, 25065, 12679, 9560, 10655, 11846, 6679, -4700, -27778, -23167, -11972, -9857, -11067, -15211, -7937, -21579, -34716, -24377, -1694, -4699, -14698, -16437, -10914, -4168, -10058, -20539, -11901, -17290, -22472, -34829, -36449, -8838, -810, -918, 11796, 12584, 17633, 7892, 4034, 11960, -4682, -23438, -22982, -20768, -15466, 1475, 8703, 4352, 3845]
4329C845k568o229n25N612J729k754R090p471O599O738J626K316j146j8026k043
4314c207N233N660Q004o669n328j2725o018N890N741k00k712k213J6725Q500o306
4299A0375j3132p871R929O992N096P01j4004j1867M408p038n913J7780R156O898
4285A1510j5326j868J3331R178p458k923q157p692J511Q717L780j0941K430J235
4271b673j1808O634Q462l441K968o910r84j1571q768J0219k535R638J6812n807
4257B36j3153j1512l224J028p211J1150M393o01P121R695M097J696J970J196P759
4242A4640l600j1990L368P892k863k01n370j147M773r524j735J507k4R053Q675
4227A3454n161m406R850j4368j3809P491P270L414J2685l482l579j521o209j7227
$$ y = [3845, 1277, -4952, -5477, 135, 1864, -890, 8200, 729, 7328, 14066, 15692, 18008, 16862, -1164, -3207, 2026, 7686, 15690, 9021, 3693, -9032, -15050, -9160, -3419, -3619, -6331, -8544, 8181, 16681, 10375, -2757, -10628, -699, 6293, 11389, 12090, -1914, -13781, -9373, -16411, -22324, -4544, 4612, 11510, -3816, -5684, 7647, 16825, 9367, 6444, -1713, -9405, -7894, 823, 4603, -6338, -3908, -2673, -14481, -7847, 615, -2826, 142, -6768, -7752, -19323, -28091, -17872, -20407, -10769, 6043, 236, -12917, -24429, -27653, -26625, -33836, -22686, -18293, -18894, -11773, -2078, 2019, 3715, 5685, 6881, 14640, 11040, -950, 2418, 10310, 7447, 7246, 1876, 729, 5502, -4022, -5757, -4250, -4274, 4779, 13454, 8293, 3887, 13737, -631, -14440, -6949, 321, 3735, 16420, 12938, 9359, 7838, 1629, -15598]
4213a5598m14N439N182J0226L72R507J4810m345j1787L193L083j1433r69M6j4546
4198g234k105N921l048J4769J2000n060q08l446m345J0171L234J428J0767j7031
4184A5213k3321J367K953Q32j817M350Q568O595J4231j6379J138R500Q89n383
4170A8736k4661j9148p165J5873P843j4223n247N538J2116K3086J2802l711j1479
4157A0360p583p959P879o260j6049k905N241P345j589J9398M786o587n799O130
4143F408r67o863j4120n667J8405J7153l060N636k938n442l111J283J0537M658
4129B1912q557r723j7794j1350m794P618J3409m626m525p730N678P885j1900j015
4115b5512R363J1193J699L17l171L886n092n562l949n194R171J1085K1627N312
$$ y = [-15598, -16012, -10573, -5391, 4835, 5207, 14714, 29524, 25179, 13392, 16585, 19668, 8235, 7266, 7312, -7234, -9339, -3418, -6466, 8303, 20303, 15243, 14435, 10989, 6644, 16815, 20049, 21477, 32244, 15213, -8108, -6741, -3788, -2956, -4773, -423, 8145, 14740, 28971, 12592, 13730, 23230, 24119, 18736, -5925, -25073, -32238, -16365, -8522, -22745, -27992, -22454, -10338, 12748, 25550, 21839, 10360, 2777, -5182, 2697, -3563, -19612, -22517, -17276, -9931, -11520, 7878, 12664, 6077, 278, 6408, 5441, -1422, -15542, -21209, -2804, 14349, 11289, 16925, 13987, 8545, 5434, 6717, 17254, 21912, 13355, 3632, -14162, -25512, -30306, -22688, -9279, -13905, -18430, -26160, -20482, -12597, -24497, -25512, -16149, -4956, -3257, -2940, -6111, -2225, -7317, -12879, -16828, -22022, -12851, -1766, 19861, 25173]
4101B5173K866j8239q287L521O775j1998j543m55N926L881j544j3357N20K568
4087d193R86J3813L611n097L89K699p535j580l093j5356n149J6515q46J1922J4934
4072B2020K65l619m487l985k3298j0222O673J1257P825l475J345N41p33m568O97
4057c764N120j1389p873N052P370M090j1315L00J3896J6597m592j364J4443n990
4043B0581p549n185o551K211j651m235j0011J0298m605L420N039l391l113j123
4029e865o615M956J305J063M694q0j3545j3024m663Q199J0305J1024O870q040
4015c416r221N502J298j1706r331O41p186J5082J3263P861q751J2830n703r395
4001h232l913J0063O338J0101n553k0362p563O500n85j669M7J1905J0378j4757
$$ y = [25173, 28039, 9800, 1513, 5034, 11809, -189, -1732, -2187, 3739, 7620, 6076, -7281, -6761, -4193, -3207, 10606, 14217, 9120, 9509, 12208, 4673, 3093, 0, -15356, -20505, -3990, -4836, 7086, 22020, 22285, 18666, 14179, 10194, -13104, -23326, -16653, -5396, 2429, -1046, 299, 840, 107, -4461, -3764, 1356, -10033, -17906, -12854, -5484, -1394, -12709, -12409, 1487, 18084, 13492, 12128, 26571, 20581, 13032, 7847, 1296, 3507, 1856, -2379, -12390, -2092, -6697, -3277, 1762, -1629, -4742, -5865, -12480, -7524, -6219, -5156, -462, -542, -14087, -27111, -31774, -23575, -13270, -2246, 4624, -3416, -12637, -7135, -5837, -17543, -26874, -26233, -33419, -18337, -5074, 2787, -5964, 6866, 1163, -8232, -12145, -2082, 4256, 14357, 8804, -11558, -19121, -12621, -13206, -14875, -14828, -2923, 7455, -7302]
3987g302J057P827L437R078J5521j255r985j3589j6216P56J916O032O914P058
3973A1249Q86q273L419k363q618p775M273L222j55K127Q238R037O903j0882j7737
3958f449n429J437J2075K260q982p398L128J679R113O56l415j6067p579L445L373
3943a8153M139p19m118J2005J6518j4500r973O237J1347Q425j6535p224O802N488
3929b61l926m481N99n2j549J6338J7895m249r918o253j1662q915R616j841m497
3914a3156m831O727L845n96k732j162L381J1811r738m283L343j843p871p961m324
3899b9390J5335M918J1445J7340O226o059r056p994q876j2594N571K475M974J4883
3885I198J3694r242j5090o277p450M950J0178m703j419Q853J294N074Q97J1171
$$ y = [-7302, -6245, 1582, 5019, 14097, 29618, 28363, 18378, 4789, -11427, -10671, -8755, -2723, 4191, 11249, 12135, 3862, 7281, 4918, -3700, -11475, -7202, -3980, -4135, -2008, 6230, 15267, 22170, 11288, -6449, -11878, -10441, 1634, 3894, -5088, -12486, -9358, -7679, 1434, 2090, -1325, -17392, -24971, -21526, -18153, -14014, -14733, -18851, -6846, 9672, -4828, -14801, -8564, 2783, 11208, -5327, -12551, -5749, -261, -4187, -8668, -8069, -8121, -9670, 6668, 24563, 20314, 10396, 4143, -7519, -16434, -6818, -8659, -13156, -17987, -11260, -7415, -8011, -10743, -11905, -8524, 3287, -6451, -10734, -7391, -9234, -17105, -25066, -29390, -14055, -9137, 2308, 19648, 25874, 19815, 10759, 2765, -6111, -18705, -13134, -10659, -5685, 9198, 22892, 13650, -1440, -7717, -15167, -10217, -39, -4742, -6161, 2692, 3986, 9060, 9957, 21128]
3871B1128L269j1198l187k984m168l893M057P105m615J660o773j835o709N301
3857b842q35J62r49j6246M494J3479J730k327P383o042l430j1655p322J1710J0246
3842b444Q64J204K259m151l422K633J6256M563k807J4525j006j3458k2219j234
$$ y = [21128, 24397, 13199, 10012, 7028, 2860, -1033, 3024, 10129, 5514, 7174, 401, -1434, -8143, -2842, -3677, -3515, -4464, -20710, -16216, -2737, -1007, -3334, 4049, -1993, -5423, -17078, -24400, -12690, -2444, -1580, -376, 1883, -2268, -5690, -3057, 13199, 17762, 14955, 29480, 28474, 15016, -7203, -8437]
$$ [...]
##END NTUPLES=NMR SPECTRUM
##END=
