##TITLE=Analysis number 320950
Compound Code ac 29229
Project Code adrs
Chemist Name acros
##JCAMPDX= 6.0         $$ Bruker NMR JCAMP-DX V2.0
##DATA TYPE= NMR SPECTRUM
##DATA CLASS= NTUPLES
##ORIGIN= Bruker BioSpin GmbH
##OWNER= nmr
$$ XWIN-NMR		Version 3.5
$$ Tue Jul 18 15:47:49 2006 GMT Daylight Time (UT+1h)  MAYBRIDGE\nmr@NMR_250MHZ
##.OBSERVE FREQUENCY= 250.131544655141
##.OBSERVE NUCLEUS= ^1H
##.ACQUISITION MODE= SIMULTANEOUS (DQD)
##.ACQUISITION SCHEME= undefined
##.AVERAGES= 16
##.DIGITISER RES= 18
##SPECTROMETER/DATA SYSTEM= dpx250
##.PULSE SEQUENCE= zg30
##.SOLVENT NAME= CDCl3
##.SHIFT REFERENCE= (INTERNAL, CDCl3, 0, 16.383)
##AUDIT TRAIL= $$ (NUMBER, WHEN, WHO, WHERE, WHAT)
$$ ##TITLE= Audit trail, XWIN-NMR		Version 3.5
$$ ##JCAMPDX= 5.01
$$ ##ORIGIN= Bruker BioSpin GmbH
$$ ##OWNER= nmr
$$ C:\u/data/dgb/nmr/ADRS/3040/pdata/1/auditp.txt
$$ ##AUDIT TRAIL=  $$ (NUMBER, WHEN, WHO, WHERE, WHAT)
(   1,<2006-07-18 15:47:23.13 +100>,<MAYBRIDGE\nmr>,<NMR_250MHZ>,
      <created by zg, POWCHK disabled, PULCHK disabled
       configuration hash MD5:
       E2 DF 36 D8 04 B2 41 60 5A D7 A3 38 5A 4B D0 FE
       data hash MD5: 64K
       3B AA 40 F5 A5 00 31 6E 5F 61 B8 82 53 5E C7 A1>)
(   2,<2006-07-18 15:47:37.88 +100>,<MAYBRIDGE\nmr>,<NMR_250MHZ>,
      <Start of raw data processing
       ef LB = 0.3 FT_mod = 6 PKNL = 1 SI = 32K 
       data hash MD5: 32K
       A7 0F E9 6A FF 17 C8 7B 0D C4 81 51 24 19 88 3D>)
(   3,<2006-07-18 15:47:39.51 +100>,<MAYBRIDGE\nmr>,<NMR_250MHZ>,
      <apk 
       data hash MD5: 32K
       F0 B3 C1 0A 65 00 D6 86 FD 93 4C 4F 67 7C E2 42>)
(   4,<2006-07-18 15:47:40.27 +100>,<MAYBRIDGE\nmr>,<NMR_250MHZ>,
      <abs ABSG = 5 
       data hash MD5: 32K
       75 A5 15 80 A9 B1 FE E7 5B 97 31 0D 06 2D C3 30>)
$$ ##END=
$$ 
$$ hash MD5
$$ AD E8 33 1F 0D 63 5D 80 94 CD F8 43 C1 9E 57 91
##$RELAX= 
##$RELAX= 
##$RELAX= 
##$RELAX= 
##$RELAX= 
##$RELAX= 
##$RELAX= 
$$ Bruker specific parameters
$$ --------------------------
##$DU= <C:\u>
##$EXPNO= 3040
##$NAME= <ADRS>
##$PROCNO= 1
##$TYPE= <nmr>
##$USER= <dgb>
##$AMP= (0..31)
100 100 100 100 100 100 100 100 100 100 100 100 100 100 100 100 100 100 
100 100 100 100 100 100 100 100 100 100 100 100 100 100 
##$AQSEQ= 0
##$AQ_mod= 3
##$AUNM= <au_zg>
##$AUTOPOS= <51 >
##$BF1= 250.13
##$BF2= 250.13
##$BF3= 250.13
##$BF4= 250.13
##$BF5= 500.13
##$BF6= 500.13
##$BF7= 500.13
##$BF8= 500.13
##$BYTORDA= 1
##$CFDGTYP= 0
##$CFRGTYP= 5
##$CHEMSTR= <none>
##$CNST= (0..31)
1 1 145 1 1 1 1 1 1 1 1 1 1 1 1 1 1 1 1 1 1 1 1 1 1 1 1 1 1 1 1 1 
##$CPDPRG= <>
##$CPDPRG1= <>
##$CPDPRG2= <>
##$CPDPRG3= <>
##$CPDPRG4= <mlev>
##$CPDPRG5= <mlev>
##$CPDPRG6= <mlev>
##$CPDPRG7= <mlev>
##$CPDPRG8= <mlev>
##$CPDPRGB= <>
##$CPDPRGT= <>
##$D= (0..31)
0 1 0 0 0 0 0 0 0 0.06 0 0 0 0 0 0 0.0002 0 0 0 0 0 0 0 0 0 0 0 0 0 0 
0 
##$DATE= 1153234041
##$DBL= (0..7)
120 120 120 120 120 120 120 120 
##$DBP= (0..7)
150 150 150 150 150 150 150 150 
##$DBP07= 0
##$DBPNAM0= <>
##$DBPNAM1= <>
##$DBPNAM2= <>
$$ [...]
##$SUBNAM7= <"">
##$SUBNAM8= <"">
##$SUBNAM9= <"">
##$SW= 20.6930455092707
##$SWIBOX= (0..15)
0 0 3 0 0 0 0 0 0 0 0 0 0 0 0 0 
##$SW_h= 5175.983436853
##$TD= 65536
##$TD0= 1
##$TE= 296.16
##$TE2= 300
##$TE3= 300
##$TEG= 300
##$TL= (0..7)
0 120 120 120 120 120 120 120 
##$TP= (0..7)
150 150 150 150 150 150 150 150 
##$TP07= 0
##$TPNAME0= <>
##$TPNAME1= <>
##$TPNAME2= <>
##$TPNAME3= <>
##$TPNAME4= <>
##$TPNAME5= <>
##$TPNAME6= <>
##$TPNAME7= <>
##$TPOAL= (0..7)
0.5 0.5 0.5 0.5 0.5 0.5 0.5 0.5 
##$TPOFFS= (0..7)
0 0 0 0 0 0 0 0 
##$TUNHIN= 0
##$TUNHOUT= 0
##$TUNXOUT= 0
##$USERA1= <user>
##$USERA2= <user>
##$USERA3= <user>
##$USERA4= <user>
##$USERA5= <user>
##$V9= 5
##$VALIST= <valist>
##$VCLIST= <CCCCCCCCCCCCCCC>
##$VD= 0
##$VDLIST= <DDDDDDDDDDDDDDD>
##$VPLIST= <PPPPPPPPPPPPPPP>
##$VTLIST= <TTTTTTTTTTTTTTT>
##$WBST= 1024
##$WBSW= 4
##$XGAIN= (0..3)
0 0 0 0 
##$XL= 0
##$YL= 0
##$YMAX_a= 673396
##$YMIN_a= -758786
##$ZGOPTNS= <>
##$ZL1= 120
##$ZL2= 120
##$ZL3= 120
##$ZL4= 120
##$ABSF1= 16.38299
##$ABSF2= -4.310181
##$ABSG= 5
##$ABSL= 3
##$ALPHA= 0
##$AQORDER= 0
##$ASSFAC= 0
##$ASSFACI= 0
##$ASSFACX= 0
##$ASSWID= 0
##$AUNMP= <proc_1d>
##$AZFE= 0.1
##$AZFW= 0.1
##$BCFW= 0
##$BC_mod= 0
##$BYTORDP= 0
##$COROFFS= 0
##$CY= 12.5
##$DATMOD= 1
##$DC= 0
##$DFILT= <>
##$DTYPP= 0
##$F1P= 14.0000005364418
##$F2P= -0.99999901652339
##$FCOR= 0.5
##$FTSIZE= 32768
##$FT_mod= 6
##$GAMMA= 0
##$GB= 0
##$INTBC= 1
##$INTSCL= 1
##$ISEN= 128
##$LB= 0.3
##$LEV0= 0
##$LPBIN= 0
##$MAXI= 10000
##$MC2= 0
##$MEAN= 0
##$ME_mod= 0
##$MI= 0
##$NCOEF= 0
##$NC_proc= -1
##$NLEV= 6
##$NOISF1= 0
##$NOISF2= 0
##$NSP= 0
##$NTH_PI= 0
##$NZP= 0
##$OFFSET= 16.38299
##$PC= 1
##$PHC0= 164.3683
##$PHC1= 6.114287
##$PH_mod= 1
##$PKNL= yes
##$PPARMOD= 0
##$PSCAL= 4
##$PSIGN= 0
##$REVERSE= no
##$SF= 250.1300347688
##$SI= 32768
##$SIGF1= 0
##$SIGF2= 0
##$SINO= 400
##$SIOLD= 32768
##$SREGLST= <1H.CDCl3>
##$SSB= 0
##$STSI= 32768
##$STSR= 0
##$SW_p= 5175.98343685301
##$SYMM= 0
##$S_DEV= 0
##$TDeff= 65536
##$TDoff= 0
##$TI= <Analysis number 999999
Compound Code 99
Book Reference 9
Project Code 9>
##$TILT= no
##$TM1= 0
##$TM2= 0
##$TOPLEV= 0
##$USERP1= <user>
##$USERP2= <user>
##$USERP3= <user>
##$USERP4= <user>
##$USERP5= <user>
##$WDW= 1
##$XDIM= 32768
##$YMAX_p= 357024346
##$YMIN_p= -13755
$$ End of Bruker specific parameters
$$ ---------------------------------
##NTUPLES= NMR SPECTRUM
##VAR_NAME=  FREQUENCY,     SPECTRUM/REAL,   SPECTRUM/IMAG
##SYMBOL=    X,             R,               I
##VAR_TYPE=  INDEPENDENT,   DEPENDENT,       DEPENDENT
##VAR_FORM=  AFFN,          ASDF,            ASDF
##VAR_DIM=   32768,         32768,           32768
##UNITS=     HZ,            ARBITRARY UNITS, ARBITRARY UNITS
##FACTOR=    0.157963299565203, 1,           1
##FIRST=     4097.87782915746, 0,            0
##LAST=      -1078.10560769555, 0,           0
##MIN=       -1078.10560769555, -13755,      0
##MAX=       4097.87782915746, 357024346,    0
$$ Real data points
##PAGE= N=1
##DATA TABLE= (X++(R..R)), XYDATA
$$ [...]
14649B90N59j69j729J375J625k75J564o67l894K763L205K933j767j213j687J151
14633D064p61k710L240L625j772l057k591k474j848k253J397K889L160Q38J15
14618A862l056j372k98L80K185K634K212j228j730N21k157k913j62JJ643L25J299
14601A46J205l386J61m58O09J186O4n40m04p80Q72K385K249J055k482k536r69
14584a623j344j265k526j681L182K334j115J231O24k437j443J790M65P006K686
14569E884k620q36l692j434J413k053k075K843K510M25j630P58k310l8j029J101
14553b783J033Q66m58J056O824K580j591J055L386l236n731l784Q25J73l164n98
14537c547K605J28J872j058k121k869j518J886N81J6M841j048j590J268m714J494
$$ y = [290, 849, 680, -1049, 326, 1951, 1676, 3240, 2573, -1321, 1442, 4647, 7580, 5813, 4600, 2913, 4064, 3303, 593, 3833, 7458, 5686, 2629, 38, -2436, -4284, -6537, -5140, -2251, 909, 1747, 1862, -1194, -2566, -2864, -2484, -299, 2335, 4547, 3319, 1589, 2110, -47, -2960, -3122, -3121, -1478, -1153, 146, 1351, -2035, -1874, -2332, -1723, -537, -473, -1013, -1417, -2197, -1325, 1060, 3309, 4364, 1882, -654, -1623, -2967, -4232, -6758, -8439, -5257, -2923, -4038, -2807, -2183, -4620, -6063, -4273, -3808, 3198, 5884, 3264, 2428, -1264, -2698, -1285, -3338, -5413, -2570, -60, 365, -1265, -507, -2817, -2855, -3884, -2783, -1750, -884, -1342, -286, 6538, 9118, 7527, 8582, 11968, 8732, 3001, -783, 42, 215, -2949, -3547, -942, -814, 1058, 0, -2121, -4990, -6508, -4622, -4041, -4025, 816, -232, -1822, -554, -5268, -3774]
14521c774O652j415j416o31k774J93o80J998r47J465J076j820K82k905K883K184
14505C71Q3J15j313k158J102j30K267L345j368n636m389J241J180J037L532K733
14489B012j227k94J918M03j167N06j740k574M748J494o35k041m084j793K885J814
14473B25R17nj575J659l977p62k680J724P83K603J57J411j560n80J751o80L018
14456B429k607n884r68M509K670L329l86r90r28M401K153r14j869m010k729J150
14440f44k010j413L975L898r37k277J968J603m757J072L437L758j024j400j144
14425D105J014j256k066k124k453j657j82L87j70J02K390k76J982L069L10k853
14409C22j666M4j380r85r94K547O34l593M7L287N65m52k424R06K643j557j975
$$ y = [-3774, 2878, 1463, 47, -584, -3358, -3165, -3845, -1847, -2794, -1329, -253, -2073, -1791, -4696, -1813, 371, 454, 569, -744, -2902, -1800, -1930, 337, 3682, 2314, -3322, -7711, -6470, -5290, -4253, -721, 2012, 785, 491, 2409, 2812, 1645, 2151, 411, -2163, 2585, 4079, 3444, 1403, -2681, -4474, -1589, 225, 1142, 1137, -438, 1221, -2756, -3518, -6198, -4474, -3691, -1088, -931, 480, -1080, -1660, 91, -589, 2429, -178, -6062, -7030, -2521, 149, 3478, 3092, 2102, 1174, 5575, 7728, 6814, 4945, 935, -1794, -644, -2654, -4067, -92, 3806, 2869, 592, 2560, 4163, -594, 478, 3915, 7673, 6649, 5249, 4105, 5119, 3863, 1797, -327, -2780, -4437, -4619, -4232, -4402, -4300, -1910, -2186, -204, 2865, 3175, 322, -1344, -1300, -2680, -3665, -4659, -2112, -1478, -5071, -5024, -1737, -1172, -1624, -4048, -3142, -499, -2056, -4031]
14392d031j743J4M363K799j354j724j185J263J086J857J281n16j329q92k652J245
14376a518J944j137q1R56l62K51k158k07J396L635J71k195L521J730k200j959
14360A787K67k466n7j39p55J029j294k124k09K624o58J270j90J157L653j335l611
14343a051j629j390R6k069P5K421O62j201j747R61Q74K133n39K697P24k658L576
14326A935K990l62j198m186k05j977m96r43K605J085J530N45m7L575j994n119
14310b262K337K675j34j972Q64M39j9j389P5j894m05K877k224K24J263J185L62
14293B002l91Q82Q10l255m470l444L76K313k281j251J834L369k549k052M609J212
14277b286J693K560J906n68k684m616K067M053M72N07k797k019L71J625n4J721
$$ y = [-4031, -5774, -5760, -1397, 1402, 48, -1676, -2861, -1598, -512, 1345, 2626, 2110, 781, -111, -2763, -1518, 426, -711, -792, 164, -198, 53, -2105, -2312, -916, 2719, 2890, 695, 4216, 5946, 3746, 1787, 2054, -412, -469, -608, -1363, -334, -1628, -3752, -3961, -1337, -1995, -725, -915, 242, 3895, 2560, -1051, -2680, -4070, -3974, -6043, -5968, -3547, -2885, -4086, -5833, -4872, -3998, -1865, -2404, 293, 1017, -1641, 1935, 4925, 4563, 3365, -821, -1026, -3003, -3499, -4442, -1837, -752, 778, 1323, 1276, 4851, 2857, -2262, 75, 2750, 2616, 644, 1508, 1947, 1928, 539, 614, -1280, -1685, 1192, -1032, -808, 455, 1640, 2002, 1611, 2493, 3303, 48, -4422, -7866, -7490, -5177, -7458, -8709, -6875, -3506, -6055, -8107, -3498, -2286, -593, 1967, 3873, 3305, 621, -3995, -1928, 2125, 2597, 3104, 307, -1712, -1341, 284, 230, 1951]
14261A951M25j60l765k827j093j833L266K356J621J068j455j310j334Q1M12k580
14245e177O76O629J46j093K10j459k074r59j08j98o69j601R46L421K722Q44J166
14228C422k186j108J208K917n34j946J195k968M75K383O00q47m170k084O51J733
14212a259J7m380O28K440J138N00nL50J190k657Q86L130L786p60J972k244l266
14195A466k587q48P9L379J807j221l715l291K935M162N55j283j445j978O977Q82
14179E874l328O22k348Q56L49k841N42M8j982o79J017m17l313r22M273K297L186
14162C234l8j466j940j532L27j51J366Q60J143l06K71l20l190N23O10J31J333
14145H55J265k940m28J600k880j709K633K368J572J156J975m82j960p50Q23l161
$$ y = [1951, 2376, 2216, -1549, -4376, -5469, -7302, -4036, -1680, -59, 1009, -446, -1756, -3090, -3009, -2597, -5177, -4501, 2128, 2274, 1181, 1391, -68, -2142, -3101, -3209, -3407, -4076, -5677, -4731, -1310, 1412, 2256, 3422, 1236, 128, 1336, 4253, 3719, 1773, 2968, 0, 475, 2858, 3458, 2611, -1559, -3643, -2992, -1259, -1242, -5622, -4994, -2554, -1416, -916, -921, -571, 619, -2038, -1152, 1978, 5764, 5004, 6976, 4732, 1466, -1121, -1969, -1890, 1489, 3296, 2075, -1640, -4931, -1996, 2166, 2721, 1438, -7, -1985, 4992, 5874, 2546, 3168, 820, 1676, 2025, -816, -274, -226, -2208, -2887, -1870, -2287, -5600, -6522, -2249, 48, 3234, 3196, 1730, -210, -1742, -1415, -1566, -200, 660, 1803, 1497, 1768, 1448, -1742, -1219, -609, -478, 855, 2120, -820, -1248, 352, -2528, -4237, -1604, 764, 2336, 3492, 5467, 4985, 3025, 2275, 3098, -63]
14129f3l427o39K093r96M841K125O1k566j060K032n05N01k433n080j560K169R48
14112c559j817j298J134J008K849K861K333L4l171j721K226K764j274m44j429
14097D96J574M877K362l433l524j728m120P78K338J149qk502k335M406M809l682
14081A457j3J472j39J141k270j063R45J045o24J540n15L79m052K086j899J267
14065G57L929p20j470P21k082m73K293J463m263J17l57k991l70L627K248l67J490
14048C552p88k918J286J422K994j357l587j247j256k896J648K292k347p06q04
14033d712o03J684J553o182j552J028K282M733K606k898J134P89l030k310M434
14018a044M806M79p52J487m95p55k26J482J308K59m31k982k907j531P76J413K802
$$ y = [-63, -3490, -4129, -2036, -3032, 1809, 3934, 3995, 1429, 369, 2401, 1896, 2397, -36, -5116, -6676, -4507, -3559, -5376, -6674, -5540, -4532, -1683, 1178, 3511, 3545, 374, -1347, 879, 3643, 2369, 1925, 496, 2070, 6947, 9309, 5876, 2352, 624, -3496, -2718, -380, 769, 761, -1741, -4076, 330, 5139, 1457, 1444, 2916, 2777, 3918, 1648, 585, 1530, 2575, 1951, 3491, 2976, 3355, -697, 1389, -510, 757, 4686, 3966, 2496, 3217, 1135, 662, 2955, 4418, 155, 272, -85, -3076, -3446, 181, 2429, 2062, 3552, 2764, -154, 1132, 2554, 5548, 4191, 604, -643, -1899, -4795, -3147, -855, -3202, -3908, -4712, -5315, -3631, -2078, -8260, -9812, -8784, -6502, -1769, 837, -2061, -927, -138, -3168, -5478, -1044, 3762, 4241, 3489, 4976, 4481, 3726, 3500, 4982, 6290, 6549, 6118, 3136, 229, -1302, -526, 887, 3689]
14001C689Q01k609l725K66k94L39K693r06l213R3K665J704K139j063m647k299
13985d367M86M17p96K087K324J577j597N75K9l055k881J541J390O48N52l346J013
13968c403m70K556m56l915q00R5L595L158j66J579J415j867m898J381J146M220
13952C170J862j41K757j777n96j258K44k96j089n92K907j059l594j379l89J738
13936E08R39K511r81j629j018p03K93M440J923L88j264k765R60K552j815l16j625
13919B398l049p68q34j30L397K060j172l84P38O99k190k000j292K227l090n19
13903c909j017k02l087n21J628J205L001L473K58K292K274J597l533n821k129
13888d491k87K8M186O82j67M28L589J413l280k766k262K532J52j532J552J77K399
$$ y = [3689, 4490, 1881, -1844, -1578, -1872, -1533, 1160, 254, -2959, -2866, -201, 1503, 3642, 2579, -2068, -4367, -3881, -3464, -4260, -2173, 151, 1728, 131, 706, 735, -2320, -5201, -3660, -2270, -1622, -1070, -4416, -3403, -3873, -1317, -1773, -5688, -6488, -6393, -2798, 360, 194, 1773, 3188, 1321, -3577, -2196, -1050, 3170, 5032, 4891, 7648, 5871, 5275, 4017, 4261, 3965, 2876, 2284, 5191, 4132, 538, -841, -1230, 508, 1447, 3958, 2977, 1348, 330, -373, -80, 4360, 6283, 6671, 5407, 2642, 3602, 6154, 4339, 4023, 2398, -651, -1419, -2253, -2383, 1014, 3074, 1902, 1518, 2256, 2955, 765, -1235, -2527, -300, -3390, -3909, -4926, -5128, -8215, -8736, -7108, -5903, -2902, 571, 829, 3121, 5395, 6992, 3459, -2362, -4491, -4778, -4750, -564, 118, -49, 379, 3968, 5381, 2101, -665, -2927, -395, -243, -1775, -223, -46, 2353]
13871B353j476k445r66K085J344K60j587q2P69J843j143K045L995l409l491m324
13855d229J068P5L953J697j333M516N04l839k695k095l337L15N275K661k15n6
13839B265r2j278J007K901k647Q99Q65l771N87L596R58k934m79q87J037J481l129
13822C79k378m265j443K039L524J883k4J684K464Q84j558k761M31J371k058J055
13806A227q70l922j700L168R68M190P59J063K099l143j477l00l190n12L096P84
13790B240q90k315n688N85O091K100j289p56j544n007N89M246p6j102j894k99
13774e009k173k294L616L644K804j957R03L808n85o00K935J431q286k734J377
13759c120j325l182M142P388R44o07m834l527J704L197p18j187K222K864o248
$$ y = [2353, 877, -1568, -2534, -449, 895, 1155, -432, -514, 255, 2098, 955, 3000, 6995, 3586, 95, -4229, -3161, -3086, 867, 2564, 1231, 5747, 6251, 2412, -283, -2378, -5715, -5400, -125, 2536, 2321, 2265, 2173, 895, 1902, 4803, 2156, 3055, 3920, 149, 736, 4332, 5290, 2356, 1877, 990, 2027, 3508, 379, -1999, -6264, -7707, -5668, -2144, -261, -285, 1399, 3863, 4747, 3189, 428, 859, 2230, 172, 1227, 357, -3565, -5265, -2097, -1129, 3061, 3820, 4883, 6982, 3839, 2362, 2062, -1128, -1640, 1456, 2240, 1350, -965, -6653, -6068, 23, 2123, 834, 78, -1466, -6473, -5884, -1638, -1714, -2816, -4710, -5009, -7182, -9476, -5860, -2216, 588, -1369, -466, 3342, 2757, 2157, 5092, 6523, -1763, -4497, -3120, -4445, -7627, -3485, 3903, 4847, 4240, -594, -4121, -2417, 780, 62, -1125, 1097, 3961, -2287]
13744b287q94L729K538P32k528l980K007M144J11N28j078m894J557L106k167r0
13728E34j519j029J326j646J423M113K546j352l717J69j65j644M46J178K227Q44
13712C734j255n086L21n54l37J333K62J999p7J196j868j796p8p55L219l3L58J676
13694B259p5P49J825m80O54Q86J863Q36k018l1J051k428k851j688k711K528j00
13677B69K489j825k331j045K694Q34p36j424O46J333J064k317j994J47K679j766
13661a283k398j413K9J879o23J085K026L779O15q85j587l01L739K374j185j558
13645D293l414k99j014q64J185k609q20M312j054r51K8n34j492L242LJ531K390
13628C933j031m538m069L8M616M438j081j614J796L50R71J771k512j737M78k35
$$ y = [-2287, -3181, 548, 3086, 3818, 1290, -2690, -683, 3461, 3572, 4100, 3022, -1872, -315, 2791, 624, 534, -985, -2014, -688, -2334, -911, 3202, 5748, 4396, 679, 848, 683, -961, -515, 663, 2890, 3734, 2479, -2607, -2286, -2840, -3177, -1844, -1582, 417, 340, 1536, -332, -2128, -2206, -2961, 258, 225, 583, 2259, 2184, 2933, 4758, 4278, 4932, 5818, 7681, 8517, 6499, 6468, 7519, 5091, 2240, 552, -2159, 369, 269, 2758, 933, -1398, -2443, 251, 1085, 349, -1075, -429, 904, 1968, -349, -2343, -2196, 483, -1283, -3681, -5094, -5065, -3186, -3809, -2724, -698, 3081, 3696, 2811, 1224, 923, 4662, 7036, 5851, 4293, 879, 580, -434, -1298, -113, -2722, -3542, 770, -284, -1235, -1207, -1741, -3233, 9, 12, 1543, 3933, 2902, -1636, -5705, -5667, -1051, 3387, 2306, 692, 2488, 2838, 3809, 5580, 3068, 1331, 1809, 1574]
13612A574j200J260K348j386p48J432k846l572p8K095J521J727q33j706j888j654
13596c954l18J492j43J486L39R02J835k034k390k587J890M849J535j90K427j438
13580C701k418l273r59l129k045J982L26K512R42L14r66K561l94o30J278j45j519
13563a862K22J032p16Q91Q66Q78n5l772k36K240J627j752k039M50P99L35k041
13546c133K067K579J052K44k849o46L139K793N64k336k057l531m32k259N67L616
13530f22j315R44L26l229k101K042M565L26J298L08j842r62K749K451K57m589
13514F06k289L50p39j962J957N073K890j897m781r65K348j290J223M27O00j522
13498B9l335R78K857J956l964n185K049J931K422K25M68J967j153J068K88m84
$$ y = [1574, 374, 1634, 3982, 2596, 1848, 3280, 434, -3138, -3216, -1121, 400, 2127, 1294, -412, -2300, -3954, -4272, -2780, -2923, -1437, -1098, -196, 1639, -395, -2785, -5372, -3482, 1367, 2902, 2712, 5139, 3701, 1283, -1990, -2949, -6078, -8123, -6141, -5815, -3303, -2361, -2047, -3013, -452, -846, -1476, -198, -343, -1862, -1640, -608, -1324, -433, 433, 1311, 1256, -2516, -2752, -512, 1115, -637, -2676, -2226, -1427, -1092, -3133, -1066, 1513, 2565, 2809, -40, -686, 2453, 5246, 5810, 3474, 1417, -2114, -2546, -4805, -4238, -622, -1937, -993, -667, -3896, -5997, -3955, 610, 936, 2234, 2542, 700, -262, 2487, 4938, 5195, 606, -1683, -1333, -2072, -4034, -2077, 2996, 5886, 3989, -792, -1757, 591, -699, 524, 951, 1551, 29, -3306, -2328, 529, 2485, -1479, -6664, -4615, -2684, -262, -37, 431, 2398, 1245, 2313, 2601, 2117]
13482B117J043R6k335j571q59l3o14l641Q23j114J783L446K045n20j939k645K028
13465a890l4L21J24m51l144r69J134J070K210o71J226M648p58j953j84M945Q52
13448F476j068k713j694j129N60J488n10j332jl58M058J207J428k04k025j516
13432B667j677R54j562N99j371k600p42p43j044K165J919J702J997R4k067k548
13416b257Q70L652K292m237m865p03P68M243M955J80n215k791K088K295p70o26
13400a21r36l91N80J36k04O01J933K165k156q39L29l75K17L76l502RR34J04j192
13381b332N03K237n77J511K218L81k943l479R8q13P62K750K191p17K40K5k623
13364e68M11k76j200q0m20l890N69K088L194j450k227m68P91L97m27m26l326l232
$$ y = [2117, 3160, 3256, 921, -650, -1509, -1542, -2156, -5797, -4974, -6088, -4305, -859, 1186, 666, -1273, -3918, -1890, -1924, -1603, -1479, -1930, -5074, -6043, -4909, -3839, -1629, -2300, -1074, 3574, 2816, 863, 679, 5624, 6476, 5408, 2695, 1001, -128, 432, 1920, 1410, 78, 77, -281, 3777, 4984, 6412, 6208, 4183, 2667, 990, 1944, 382, 981, -390, -2990, -3732, -4475, -5519, -3354, -1435, 267, 2264, 2358, 291, -2257, -1387, 2265, 4557, 320, -4545, -5248, -4480, -237, 4718, 4898, -317, -3108, -1020, 1275, 505, -121, -1057, -1448, -868, -732, -936, -335, 1598, 3763, 1607, 768, 1097, 722, 939, 1315, -2187, -2178, -1244, -1140, -2332, -1829, 408, -169, 1342, 3560, 3941, 998, -2481, -2383, -3196, -2434, 316, 2507, 1790, 2030, 2055, -568, -157, -433, -1633, -1713, -2133, -6023, -5454, -3366, -172, -1622, -3849, -4317, -3526, -3129, -3556, -3982, -7308, -10540]
13346a0540J360L286J966m97J273M412j146k147m49j637R84M789K523k542k06
13331A429j677k718M983M460j562k471l340O8r88M71K294R08j773J456r33p33
13315a26j341J486L49n410j322L482N74n73J041k367J940N18N85j277j531N58
13299c414K24P68o02J65j240K64Q76l355k84J873k182R37L654K513O16R55M924
13282F692K229j594k648J81l158m178n43R41K531K230k07k187k237j10N610Q94
13266D446m28k103l764j769J080O80M536K406O1J303J366j153J664k544j118k706
13250A957n917j370K737l118j019L891M135r74k053J82n2N12K24n39j044k952
13234e400J524K015J945K727K314J095n138j606m81R34L163k319j096J420k005
$$ y = [-10540, -9180, -5894, -3928, -4425, -3152, 1260, 114, -2033, -2482, -4119, -3135, 1654, 4177, 1635, 1429, -248, -2966, 2017, 6477, 4915, 2444, -896, -828, -1816, -1345, 949, 1857, 84, 1540, 607, -126, -1467, 19, 368, -5042, -6364, -2882, -2308, -2881, -1840, -4207, -2267, -1749, -1164, -2441, -3972, -3414, -3190, -2422, -3024, -2859, -4099, -3835, -2959, -6314, -6598, -4725, -6907, -5970, -2316, 197, 813, 1768, 6692, 8921, 7327, 4679, 4860, 1702, -2476, -3019, -2078, 453, 2683, 2476, 289, -1948, -2058, 3552, 4446, 4018, 1915, -1849, -3618, -2538, -1858, 2678, 5084, 5145, 6448, 7814, 6661, 8325, 5781, 4663, 1957, -3960, -5330, -2593, -5711, -6730, -2839, 1296, 322, -1731, -1549, -1601, -1089, -865, -1404, -2448, -5400, -3876, -1861, 84, 2811, 5125, 6220, 1082, -524, -1005, -71, 3092, 773, -323, 1097, -908]
13219i08p19o57l818J409m81O49J237j788j010L950J78L240L270k456j122l95
13203E79l772k639O47J859O37L190J503l865j920K608J253j213N86j269J283n30
13187a063k726k613k48P70J04l918N38J833K704J19M094J212l788k939L562J328
13171a031j050k23j561L810L309l96k623k6M35j088k298j76J733L5O76P48j023
13154g49m02J350j914j927l066J933K681k206n56j575P57J698L841K340j560m420
13138c775j978j70m84J360K322J96o36k113J35L703K155J027q15N12n78l625q45
13121c609R81K38K75J150o9j762J781K748k142J253M637K39l89q67k160k334J347
13104A317J74l861n29mj481R46K923M99l920k589J363L372L289q3j351l978k07
$$ y = [-908, -1627, -2284, -6102, -4693, -5174, -4525, -3288, -5076, -6086, -2136, -1958, 1282, 4552, 2096, 974, 579, -3193, -5832, -5185, -3326, -2689, 501, 2004, -1861, -3781, -1173, 80, -1133, -547, -1816, -533, -1063, -3789, -6402, -6650, -5880, -5776, -9694, -9156, -7323, -4619, -4500, -406, 806, -2982, -5921, -2359, -1031, -2081, -2304, -3865, -55, 3254, 2858, 235, 209, 644, -444, -2742, -2918, -1185, -1150, -474, 274, -749, -1151, 199, -1715, -3642, -6708, -4775, -2094, -4300, -4856, -6431, -5674, -3976, -135, 2205, 645, -3775, -5753, -5923, -6407, -5047, -2725, -2529, -3165, -5278, -5143, -1440, 715, 1742, 927, 1439, 861, -2764, -3609, -2628, -2390, -2115, -965, -1034, -2796, -1015, 1733, -409, 844, 5481, 5720, 5331, 4464, 2304, -30, 1317, 1491, -2370, -2899, -2903, -4384, -3438, -515, -16, -3936, -6525, -5162, -1790, 1499, 1416, 65, -3913, -4120]
13087d120N116J848o88l12p12J936r1q42m35J176j187j429l305j127K164j265
13071c273j266J951K340Q66j956j162K453L019l98m355k162J795K133K956k256
13056F85p70k78n53O38K075P54k921j278o45k16N2R61L740J023K78j603j987r50
13038i95P99j519j91n46K69J330j943K014j14l618k482K094J141J065K137j338
13022a897k850l037j723J45M57J134K230K982l60J739J018j466j957L764O68j136
13006b89j183m2m038J301K763J199l238J176J395J51K367o69k216j931k521L024
12990b751q78L913K229j749m11L89J537r30k560k490K773L279m9k76m425k691
12974e090K543J698J520M31k545j305j08j756J740k89R52K536k118j57n360Q33
$$ y = [-4120, 996, 2844, 2156, 1844, 1132, 3068, 2977, 2135, 1700, 2876, 1689, 260, -3045, -4172, -2008, -3273, -4539, -2588, -248, 618, -1338, -2500, -47, 2972, 2574, -1781, -3943, -2148, -15, 2941, 685, -85, -363, -916, -278, 1797, 2551, -370, -1648, -2293, -2509, -2457, -1496, 2244, 3267, 3545, 1942, -45, -995, -196, -1715, -1906, -2452, -2183, -853, -2796, -782, -896, -4514, -6996, -4902, -3761, -2696, -559, -1897, -4747, -7784, -9507, -9362, -8905, -7771, -5541, -2559, -2919, -1180, -162, -1628, -3585, 179, 847, -289, -1472, -1514, -5552, -4251, -1488, -289, -3527, -2351, -956, -805, 1562, 893, -1323, -3254, -5775, -2751, -3629, 284, 2513, 764, 353, 742, 2279, 1349, -1211, -3701, -928, 2351, 2302, 2026, -2399, -5090, -2547, -849, 671, 1102, -1443, -2748, -2856, -4612, -2872, -3161, -2209, 327, -1791, -1948, -7308, -6475]
12958f475L774m71O14K63Q77J422m75N63j638j401J699j492N08k073q76k531K036
12941e676K606K60K710N39k689j809j239n907j522O863L284J065K078J450J68
12926B181J553O64k431r34q78J147q62J145L709J345j798o89j785n558l0N34o12
12909c299J660R38j50N85J552k504m464l51q86j74J954K415J083j645R24j24M766
12892B280K837j054j698L186j9r78k47J143k742l253J177R36k574l058n40J346
12876c258O08M19k82n96M522P22j335M7K21J348q38l498n87Q3l611j119P31L34
12858f089k199k312K044M242j875l5R4K181J11j204j204L855J650j640N562J030
12842D211m873l85L391K81j657q95k71J592J43L58j114j93K271k48j107q54M63
$$ y = [-6475, -2701, -3172, -2558, -2295, -1418, 4, -471, 92, -1546, -2947, -1248, -2740, -2232, -4305, -5181, -7712, -5676, -3070, -2810, -100, 439, -2250, -4059, -5298, -11205, -12727, -5864, -2580, -1515, 563, 2013, 2181, 3734, 4398, 1967, 1033, 155, 1302, 440, 1585, 5294, 6639, 4841, 4152, 2367, -3191, -3221, -2687, -3299, -1639, -701, -851, -266, 1286, -1218, -5682, -6033, -6919, -7093, -5139, -2724, -1641, -3286, -2362, -2486, 2280, 5117, 4063, 2365, 5551, 5532, 4554, 4307, 5450, 2708, -545, 632, 1568, -1006, -4064, -4604, -3258, -2650, -2231, -2513, -3109, 1413, 2135, 800, 847, 1068, 2416, 1578, -1920, -2507, -2424, -6035, -7154, -6423, -6089, -8288, -10600, -8556, -4314, -6189, -6224, -6130, -3949, -3838, -5042, -6246, -2391, -741, -2381, 3181, 4211, -662, -1047, 2344, 2625, 968, 73, -198, 1394, 1537, 1895, 781, 588, 2859, 2611, 1504, 650, 1113]
12825A113p78l219j68o09L712K932k981q19j901P38J539N63k511k107j128k055
12809g679k256K854O98J295q11N72K656k07m436J441J162j998M692L085J160j763
12793D65l264J84J660K60k395j402j249J896k720m87P009q80j058K596J556k650
12777d79j212M28o53j352O96O99P16K37k314k348r70J719M602J082k764K866J916
12760B869j19k546k758K693L924k176o48J078l313m056k066L773J642M00l8J436
12744I5k962m763K310M425j69Q58J249p23n67L311l311l656K480K120J663P66
12728C126l642j087J984j299p06J355K292K061m57m087n697J700M834J964K44
12713B585j136K608J389j328k229k277J121J048j713k227L95J53l262k465J927
$$ y = [1113, 335, -2884, -3052, -3661, 51, 2983, 2, -817, -2718, -1980, -441, 122, -2389, -4496, -5624, -7679, -9935, -7081, -6383, -5088, -5899, -5327, -2671, -2878, -7314, -5873, -4711, -6709, -2017, 1068, 2228, 465, -2799, -2615, -955, -695, -3090, -4492, -5741, -3845, -6565, -7052, -43, -923, -1981, 615, 2171, -479, -1691, -1263, -1916, -3268, -2572, -1873, -1157, -920, -3234, -5582, -6552, -4833, -231, 851, -1913, 953, 2869, 2750, 204, -2554, 139, 4063, 1887, 1239, 2317, -996, -5052, -7118, -3345, -1703, -1303, -1341, 95, -2867, -7630, -5320, -895, -1064, -206, 1043, 320, -247, 3064, -247, -3903, -1423, 697, 2360, 3126, -516, -1603, 381, -918, -1624, -269, 2023, 4084, 3627, -460, -6157, -4457, 377, 2341, 2585, 1449, 4057, 5446, 4118, 1889, -388, 733, 1781, 68, -2159, -1764, -1611, -4873, -7338, -5411]
12698e411J212j240j927j544K582M100K349l006j612P70Q01L332r66J22J714m68
12682H08k314q71K023K37n91R3L022K144N12n49j566r62k891P14M85l683n82K925
12664a046P00K077J71j44j315j000J493l977r74N610R41k938k891j060m668j194
12648a0215j075J925P140K836k60J519J093J441J157j802p94N9r77N10j672r81
12632i6k81K666j455o239J057J156q45L994k15l50j949k35J51j220n76L47K189
12615a901k18j142P99r68o34P01L01J86R87R5m1L928J466l977l154j302K364J13
12597b397q62k856k339K891M620J18k070J759P67P05r91k597J466m06r24K26q89
12580c779Q62J424j129j623J843M56J390J085J102j345Q05J106j548l172J3Q71
$$ y = [-5411, -4199, -5439, -7366, -8910, -6328, -2228, 121, -2885, -4497, -3727, -2926, 406, -560, -438, 1276, 808, -1506, -2377, -354, -117, -708, -615, 2407, 4551, 5063, 4514, 2948, 1986, -905, -191, 294, -3389, -3971, -1046, -346, 1731, 1902, 1758, 443, -557, 936, -3041, -4015, 1595, 2536, -402, -3293, -4353, -9021, -10215, -11290, -9365, -2225, 611, 351, 1870, 2963, 4404, 5561, 3759, 2965, 3024, 2047, 2557, 885, -96, -377, 2289, 834, -5405, -4348, -3192, -4037, -43, -258, -608, -2557, -2792, -2641, -3861, -4437, -4090, -1901, -2119, -3261, -2462, -3430, -4064, -3363, -3062, -2876, -1889, -1794, -1835, 2093, 3559, -418, -3572, -4874, -2510, -2397, -3259, -6115, -8454, -5563, -943, -825, -2895, -1136, -369, 336, -655, -3252, -1786, -2192, -3116, -2890, -3779, -2917, -1493, -2622, -4245, -2402, -1946, -556, 529, 1631, 286, 1091, 2197, 649, -2523, -2510, -1639]
12564a639n15J368M131j690l049k819N56P42R33K783J731R81k238j094k467L488
12548A202K388m01l415l095J441K905l871l022k480J241L988N654j21j537j001
12533a24j416K04n37l788j069M676J719j224n30J968o9k294K529J005j874J007
12517A83n05l236M93j136L25Q01M70K29r27K77L70n40k81q09M34P99n82J970K806
12498A141J291l96n74J596k346j011K390j761o97j648K395J503j829j107J504
12483D51j583l7R05j716K94R92J963Q80J201J113l72j181j259J593m63k039l153
12466b411O23j402O43N43J7j771L98j896q89M502J476l84L269n89m92j991K70
12449h4j925j070J039J781k24l299j609j819N75M083K684N5j887p28l98J54J631
$$ y = [-1639, -2154, -786, 3345, 1655, -1394, -4213, -3657, -2915, -1982, 801, 2532, 3513, 1275, 181, -2286, 1202, 3590, 3189, -226, -3321, -1880, 1025, -2846, -5868, -8348, -7107, -3119, 2535, 2414, 877, -124, -1540, -1336, -1873, -5661, -6730, -2054, -335, -1559, -2089, -121, -190, -2484, 45, 1050, -824, 183, -322, -3558, -3065, -4201, -3876, -3075, -2605, -2376, -3303, -3026, -2656, -3196, -3477, -4286, -3852, -3053, -3635, -1665, 1141, 2432, 2036, 1462, 3058, 712, -299, 2091, 330, -367, -2015, 380, 1883, 54, -1053, 451, -1132, -1169, -264, -1980, -1686, -694, 1269, 2149, 3350, 4463, 4091, 2910, 1651, 3244, 2781, 742, -2411, -1788, -3190, -2547, -2004, -1987, -3758, -3360, -5256, -6145, -1643, -167, -551, 2718, 2129, 1637, -354, -84, -2009, -3079, -2040, -259, -483, -3782, -5391, -7210, -6635, -2552, 132, 187, -1700, -2428, -2826, -2672, -1041]
12432a041K224j332j83J519n07J664j544k155N42K946L45J109J636L85N2k553
12416C107l062l721J015K869J73k46j679N64K680l49J18l821j656r62J633J847
12400a490M06k882M7J287J403K743J831M65K36j421o79J78R96o23m131k55L10
12383a579O05k457j779J047L479q59J281J634K316J18l55l73k010k544k420M5
12367c851j771J832J08P80M619P6k064O66o09j555k370L88K110M125J512K60k479
12350A777j204J443k301k851q88r5L225J537j477l665j697L46N049M170k654j442
12334g27k75R97J344L060r81k134q68O37m28K92M281O12l215m149m09j402K173
12317a192K410J496K676J555k918l050j428r61J547l36J874k421J177P78l66l67
$$ y = [-1041, 1183, -149, -332, 1187, 680, 2344, 800, -1355, -813, 2133, 2478, 3587, 5223, 5608, 5660, 3107, 45, -3676, -2661, 208, 381, 135, -1544, -980, 1700, 1351, 1469, -2352, -4008, -4970, -3337, -1490, -1084, -3966, -3919, -2632, -1229, 1514, 3345, 3810, 4046, 2625, 1946, 2124, 3120, 2497, -1634, -1889, -1579, -974, -3431, -5210, -4163, -684, -1543, -262, 1372, 3688, 3806, 3451, 3078, 1068, -1476, -3896, -3851, -5622, -3790, -3682, -2902, 1717, 1793, -271, 395, -214, -1769, -4139, -3751, -1641, 2484, 3996, 4256, 1777, 573, 2016, -285, -3136, -4024, -4119, -894, 643, -834, -4499, -6196, -5850, -801, 3369, 715, -727, -1002, -5, 1339, 4399, 3418, 1284, 416, 1053, 625, 917, 5198, 5810, 2595, -1554, -1963, -3365, -1192, 1218, 2714, 5390, 6945, 4027, 977, -451, -1412, 135, -201, 1673, -748, 429, 1207, 841, 474]
12301D74k431J667N66k238m628j443K672Q26p21K468K478L302k461n012L482M963
12285C964k515l083l566K060K179k370M20J46J858J627J812n46K66m54R13M28
12269C139j562p18j350K690J384Q80N31m929l072O12LK446J663P68J244j063O86
12252C352k451m455k742J551L080L755L441l18j483k010o64J001j138j541P02
12237H0O54j383k070N312K021k871k445J544p94m66k327j354o5J015n81LK310
12220a417R44K567m586l564J208j770n55L414M223j041r33K561k408k493K270
12205a580K552J205j817l162J268J738n73k24j29j145J347L622p09k509n713o11
12189f440K635J198J533j350J650k1Q05j387j304l092j018j884k873q5j180M92
$$ y = [474, -1957, -290, 276, -1962, -6590, -8033, -5361, -4535, -5256, -2788, -310, 2992, 531, -4481, -999, 3964, 1449, -1634, -5200, -3140, -961, -3331, -2911, -2765, -907, 720, 2532, 1986, 2252, 1798, 2711, 3139, 1577, 859, -491, 2199, 3583, 4463, 4994, 65, -3007, -2395, -2392, 54, 1717, 2485, 3729, 2666, 3352, 901, -3554, -6296, -4745, -1665, 2090, 5531, 5213, 3730, 1720, 1056, 2057, 919, -622, 80, 734, -649, -2719, 2593, 4614, 1743, -702, 842, 48, -418, -2745, -4099, -4164, -3149, -3730, -3727, -1417, -473, 2094, -2492, -6056, -4848, -6618, -7173, -3759, 464, -577, -1510, 1051, -1357, -3850, -1580, 972, 2177, 360, -2802, -1534, 204, -369, -593, -722, -1867, -520, 3102, 2393, -116, -5829, -6440, -3805, -2607, -1074, -2424, -774, -795, 10, -1377, -2681, -5773, -6791, -8675, -11548, -11633, -12813, -12321]
12173a2321N065J982L984N42P29l21K949l40P09l979o70q98j374J595N59J856
12157F7N64j236k60n92J502j30p37K303J208J200K257k485J047j003j083k754
12141a32j629MQ12J126O01L3j257j706k438N80q85K069J805j216n48K738J833
12124A790n41N5j839l257L516K236Q52k376m871k318P04p84J393L399O732j551
12108C140m385m16J927K244j226j520j576j500L482K203K787l785m13M42J157
12093B561k252k716k584j8M320K523J253K379J235k750O6j543O4j989k962k374
12077d787m98j025J383j254j46J690L80J757K533l90J87L9L63L140P16k261J020
12060B847o31k313J724L044n13m175j484J592J786J676K56l700j448J197j006
$$ y = [-12321, -7256, -5274, -1290, -748, -19, -340, 2609, 2269, 2978, -1001, -1671, -2569, -3943, -2348, -1789, 67, 631, -605, -865, -1457, 45, -85, -822, 1481, 2689, 3889, 6146, 3661, 4708, 3705, 2622, -132, -1761, -1757, -945, 181, 782, 815, -442, -2148, -4586, -4006, -4891, -2822, -1017, -2233, -2781, -43, 1790, 1249, 1304, -535, -3792, -276, 1960, 2812, 436, -4435, -6753, -6049, -6833, -5440, -2041, 4691, 3140, -1245, -1661, 266, 2510, 1284, -236, -1812, -3312, 170, 2373, 5160, 1375, 962, 1404, 2561, 309, -2407, -4991, -5009, -689, 1834, 3087, 5466, 6701, 3951, 4017, 2474, 2538, 549, -2413, -4787, -5285, -6310, -4927, -6181, -6327, -4637, -4257, -2500, 33, -357, -170, -131, 232, 3372, 4088, 1827, 2847, 2216, -97, 1627, 4671, 4158, -17, -1501, 91, 1877, 3553, 3809, 109, -1339, -142, -1148]
12045a148J456l89j898K793K247K545k107J70l50l130n29k928r55N324L821j043
12029C879P37j774l849j141L836J321m09O78k318k181r83Q87L891j179m485j375
12013d465K22J414J493l979q03m12K289J559L303J297L44J74N50o504k153k541
11997h212J957K505J552m46j25K405K076m075J062J795P80j823k412J446N97j083
11981b001l88j281J725J026j947q2J46k597l131J211L23K703K514l60k466K773
11965a832J505L76r36n44j345j640k290M489O08j425m15L78K128J091j841l313
11949e006J130K620L002N99k168l701j965J888K857M22K232m726l925J075K231
11934c435L069J196k921r51j103M98N562M543j206k893j964Q95m81j824j441l30
$$ y = [-1148, 308, -81, -1979, 814, 3061, 5606, 3499, 3669, 3319, 189, -340, -3268, -4223, 1101, 4922, 3879, 4616, 2842, -1007, -2148, 1688, 3009, 2600, 3278, 960, -1221, -2204, -1317, 2574, 1395, -3090, -4465, -4243, -2829, -1336, -5315, -6118, -6530, -4241, -2682, 621, 1918, 2262, 2436, 2986, -3518, -5671, -8212, -6255, -3750, -2198, -2644, -2769, -364, 1712, -2363, -1301, 494, 1274, -549, -2961, -1515, -918, -2001, -2389, -3670, -1945, -919, -2866, -2948, -2802, -5399, -8530, -7319, -6996, -4293, -1779, -2139, -4605, -1832, -327, 49, -887, -1431, -2776, -4416, -6706, -2217, -1609, -3034, -3449, -3071, -943, 148, -1693, -5006, -3876, -1256, 1746, 2345, 177, -3524, -5489, -3601, -744, -322, 1910, -2816, -6741, -5666, -3435, -366, 830, -2091, -3042, -4145, -3647, 1915, 6458, 5252, 2359, 395, 1290, 809, -1015, -2456, -2786]
11918b786k040j976J728K414M609j434l670J159j801o03P33q74k302n90K691K472
11902b270j34j573J865K033K695L99p69k463n21k530j866J343J432j818l215L299
11886d093J718K154j822l958k192j014R99L921K249j631k321N46L495J715J227
11871I93m053l104K958K741J20k173p09J344L079M35j840k132k639j26K71J476
11855c359P03K763J32j261Q98M043j878O92N07l022J436o32m09N80l146j100q05
11838c858J933j746l011j213l12N69K509K240J745l752J229J760L07k224j267
11823e091K50J07L773K563l173L43J554j902j170k490J165J920K651k633m914
11808g047q15M23J241J504M244k4R54j098j873p21j338K086K390O11J030j600
$$ y = [-2786, -4826, -6802, -5074, -2660, 1949, 515, -3155, -1996, -3797, -4400, -3667, -4541, -6843, -7433, -4742, -2270, -2404, -3977, -2112, -79, 2616, 3015, 2246, -217, -738, -3268, -5134, -3791, -2359, -4177, -7392, -4093, -2375, -221, -2043, -6001, -8193, -9207, -8208, -4287, -2038, -3669, -5990, -5444, -1949, -234, 993, -3060, -6164, -3206, -465, -345, -2518, -3227, -1883, 1196, 1631, -209, -2341, -4980, -5106, -4835, -3359, -2656, 107, 239, -1022, -124, 3919, 2041, 2733, 3240, 218, 1654, 1022, 613, 1193, -1953, -3053, -3858, -1925, -3671, -6682, -7895, -8207, -7638, -5129, -2889, -1144, -4896, -3667, -1907, -1600, -3824, -5091, -4841, -4734, -961, 1602, -1571, -1228, 326, -1576, -2746, -5236, -4071, -2151, 500, -2133, -7047, -7862, -7439, -6198, -4694, -450, -474, 480, -618, -2491, -3212, -4550, -2464, -74, 537, 1567, -33]
11792c3r79o40j531k183L473L823P01k474q14k34J182j726p93q63j96l10Q73Q54
11774a870K436J371j460K241N80j126K786P81k286n94K484r24r86L19l091k035
11758a374K989J817k630l166j494Q72O8O3J728Q51l628j250P96J908K491p31j887
11741b577j059k232P16L233J059J372K44j203j745K355r92k320J658J826J954
11726B289k022j801n060j943K483K175L720M425Q95j342l421l581J230M154r63
11711A238q79K07j092k311K56q6j067J722N96r24j280J275k897J668k6N89K210
11694h01Q06J820K313K337j533m052J11L976J589j66p74l223q35K237o52j787
11678A366J12p44j695j162l349J475K514P83N09L570j077k369j164k550J048k463
$$ y = [-33, -1012, -1652, -3183, -5366, -1893, 1930, 2631, 157, -657, -891, 291, -1435, -2228, -3091, -3287, -3597, -2724, -1870, 566, 1937, 477, 2718, 3298, 2172, 4958, 5739, 3453, 2859, 5343, 4419, 3433, 3752, 661, -1374, 1615, 3432, 802, -2364, -3858, -2986, -2918, -2855, -1127, -276, -3904, -5154, -4358, -2450, 41, -690, -2577, -3636, -5868, -5152, -1919, -860, 512, 756, -447, -2192, 163, -829, -3149, -1491, 335, 2289, 267, -1534, -6594, -8537, -6054, -3879, -159, 4266, 5161, 3819, 398, -3183, -1953, 2201, 1238, 359, 566, -526, -2837, -2581, -2667, -3734, -2012, -1416, -2340, -3620, -2345, -5242, -3574, -3600, -3011, -801, 5, 1825, 4138, 6475, 4942, 890, 1001, 4977, 6566, 6400, 5626, 2403, 1568, 3805, 3153, 1366, 1478, 734, -961, -2123, -5472, -3997, -1483, -700, -191, 3379, 2302, -67, -1231, -3781, -2733, -5196]
11662e196j701K858O41k478j722J665K371L424o9l798k22K005K348L619l483J728
11646A990J67m114P59M95k30L178K193k305J196K27m436l86J630q57k937j815
11630e245J48M410J341K109n75l337K3L180J119m376N58J057j386M28L399N75
11614C428O28j060J418m93q06Q38N7O26k649l589J885O84N9o00J69L95j204j966
11596b180K151o53q04n581P08L036L007N589j336k222l40l44J131L45k175j864
11580a532M20J541l538l164j021J943K014P14j216p01M20m89J93J902J772j496
11564b238M0k624k350J786L015n35j733K349M225K27l393j429k097K02j475k552
11548h582M087L621J639m85K462l815l358K09J978J204J5l648m19L754K468r09
$$ y = [-5196, -6897, -4039, -3398, -5876, -7598, -5933, -3562, -138, -207, -4005, -4227, -2222, 126, 3745, 262, 1990, 2157, -1957, -1198, -703, -933, 2245, 4438, 2133, 3329, 3556, -880, -1266, 364, -493, -3430, -5245, -5097, -687, 654, 2763, 2188, -1149, -1126, 2054, 3173, -1203, -645, 412, -974, -546, 2853, 3428, 4056, 2996, 4414, 3921, 3115, 3953, 4010, 4636, 1987, -1602, 283, 967, 1026, 426, 595, 990, -214, -2180, -29, -682, -1486, -7067, -6359, -3323, -316, 5273, 3937, 1715, 1375, 1031, 2162, 2507, 332, -1532, -1112, 429, -3109, -6273, -7294, -5351, -3337, -2623, -3839, -4540, -4120, -4609, -4416, -2514, -742, -2238, -2198, -4822, -7172, -5386, -2371, -2906, -4639, -2290, 1935, 2162, -1231, -2660, -4757, -4555, -6030, -8582, -4495, -874, 765, 280, 2742, -1073, -4431, -4222, -2244, -1040, -1025, -4673, -5092, -1338, 1130, 221]
11532B21k406l54K22l225M008J375m168K58q09K163J052q85K283n37p24J654K263
11515B391r03q40j495j145L70O24m05m90J966M54k281J58K465j109j007O36J127
11498E16j686J656j747P70M241N35J316J608j345k856j960R20j087j935r19k500
11482d473P8J620j451N42K386O392J244K85J14J266L446j738n613k130L87k069
11466B86L07l174j928M18j928j263O42K478L73K588k159j504J78k65N20J086Q3
11449c262J086Q0J388m02j558K069l693J551K939Q07k997l610Q64M801J285j326
11433B2j332q55j827L633M81k479o68K25k691O58K012O22L83p63k148j721J053
11416e395K439p68j435l949m31K011K678K83k61J393k149O42L187M813p58j709
$$ y = [221, -2185, -2539, -2317, -5542, -1534, -159, -4327, -4069, -4878, -2715, -1663, -2548, -265, -802, -1526, 128, 2391, 1488, 648, -847, -1992, -1622, -998, -1403, -1893, 73, 527, -1754, -1596, 869, -240, -1247, -611, 516, -1170, 486, -1261, -491, 3750, 4285, 5601, 7209, 5864, 3008, 1048, 1968, 881, -1054, -1973, -4473, -4395, -2775, -4226, -3684, -1298, 5094, 6338, 6623, 6737, 8003, 11449, 9711, 4098, 1968, 2355, 286, 593, -2581, -4509, -4091, -6019, -7282, -6640, -4162, -3789, -1201, -3360, -4864, -4686, -4951, -4431, -3345, -3262, -2176, -2096, -708, -1110, -2668, -599, -4292, -2741, 198, 1005, -1992, -5602, -4738, 63, 1348, 22, -1310, -2165, -3992, -359, 122, -2357, -3025, -2800, -5491, -4833, -2821, -2199, -1816, -2579, -4727, -6448, -5395, -2956, -3724, -5159, -9108, -9539, -7528, -4850, -4567, -4828, -3435, -5584, -4942, -1755, 3058, 2300, 591]
11400E91q58L44M124O70k413P73L90k988m26o67j694J467K18J708j440p62M92
11383d71J395K146J478k819j891M585k532k768J24P40J053j42L582R63m630k523
11367a710J110j340M000j013k956k725l334N74K486M392J228J205j310k21j618
11352a232J329J322k551j478j038P20J411J335O82J983j762l930k627J92J451
11337d193j282J291K803m30l178j031L603o48k298j384L744M098J078J033J858
11322E064l709l692J45L973l748k273o9J643J951n94j196l541p10L79n64K207
11306d734O96j40l32L586L255J539j132l147n271M07Q30L710J089J447j43l343
11290a683r43k317j00J750P35L37j66J240J034k141J048l87k837j545J57k023
$$ y = [591, -267, 77, 4201, 4871, 2458, 3231, 3621, 633, 207, -460, -2154, -687, -469, 1239, -201, -963, -471, 924, 3070, 4548, 1729, -162, 4423, 1891, -877, -753, -13, 1040, 898, 4480, 5443, 813, -1710, -600, -1940, 2060, 1047, -1909, -4634, -7968, -7394, -4908, -516, 712, 1917, 607, 386, -1232, 97, 1419, -1132, -2610, -3648, -2928, -1517, -182, 500, 2483, 721, -3209, -5836, -5644, -4193, -5475, -4184, -1381, -1811, -4989, -6020, -2417, -3065, -5363, -6747, -3003, 1095, 2173, 3206, 5064, 1355, -2337, -2192, 1781, -1967, -4240, -4309, -2666, -715, -1309, -2505, -6046, -6756, -6377, -6941, -4734, -4038, -4178, -4510, -924, 2331, 3870, 2738, -409, -5680, -5273, -4443, -733, 356, 1803, 1660, -1683, -2626, -4943, -5043, -3293, -2558, -2221, -2387, -1147, -113, -2254, -1206, -1593, -4430, -5975, -5818, -7841]
11274g841J714o89K724M541K661K383Q6k530j851k662l40K665p50r11j454l749
11258f003PK790K662p51n128o2J788j846O02K969J435m34j400J838J700j16P0
11241A21l600M89L641m3j053K06J284l089q07j418r1J774J55J444J194p94l359
11224c946O58J838m011J189M304K825o55k864j931j422J989Q89J344N77r50j304
11208a470J276j11op33K67K137J139j119j615M67J228k636j242N149P9k50k524
11191C6l706k04K608K053l119l715K361J923K033J035j623j396L019j849M5L92
11175a07l336j057K995J090j591k043j581m35J917L544j728j750k07J155K141
11160i93j005l295R38J145K804L175p99j03K83k60m08k075J58j657L404J277k073
$$ y = [-7841, -6127, -6816, -4092, 449, 3110, 5493, 5579, 3049, 1198, -1464, -1804, 861, 111, -800, -2254, -6003, -5996, -3206, -544, -1295, -6423, -6485, -4697, -6543, -5941, -2972, -1537, -1971, -3371, -1533, 167, 51, 121, -3479, -2990, 651, 608, -445, -239, 1045, -2044, -2851, -4269, -4360, -2586, -2431, -987, 207, -587, -3946, -3288, -1450, -5461, -4272, 32, 2857, 2202, -662, -2593, -4015, -2026, -1137, 207, 784, -166, -1470, -194, -305, -311, -1044, -777, 1360, 2499, 1380, -235, 232, 1460, -1176, -2418, 2731, 2810, 2560, 36, -3670, -3874, -1266, 787, -2332, -6047, -3686, -1763, 270, 1305, -318, -1714, 1305, -544, -499, -107, -3443, -4500, -1505, -415, -2006, -4049, -5630, -6065, -4148, -604, -2332, -4082, -4289, -3134, -993, -1998, -5293, -4355, -3210, -406, 2769, 1970, 1867, 2150, 1890, 1482, -593, -435, -2092, 1312, 2589, 516]
11143E16J92k032R93R25j881j835K964M128j778k584j43k588o92m144n80M121
11127d418J468m20j687n37K904N001J212k22o16k027k450k167L321J528j054L34
11111A70j048J720J266o4m747j908L19J789L666j553n52o50l63j50j514J361j783
11094d041k844K388L499K318j525j690l889k87M062L701L932J183l788l219m461
11079d661N68j366J691K015j736l000N434J204j072J047l847l354K13M678j997
11064d183J544k31j725j378j029J751K658N27l736k228K630L852o8j880N21J918
11048a057j087k963k766j060K647j81J656M501M321L49k294k74k330o657j7L786
11032c426J565j075K287J969L09k491j659j984j773k731K400K682K717k386k566
$$ y = [516, 708, -1324, -331, 594, -1287, -3122, -158, 3970, 2192, -392, -535, -3123, -3815, -7959, -8539, -4418, -2950, -3370, -5057, -5594, -2690, 2311, 3523, 3301, 2685, 658, -1792, -3959, -638, 890, -164, 170, -878, 842, 2108, 2044, -2703, -4611, -4292, -2503, 1163, -390, -942, -1592, -1955, -2105, -3619, -2258, -4041, -6885, -4497, -998, 1320, -205, -1895, -5784, -6071, -2009, 1692, 5624, 6807, 3019, -200, -4661, -4093, -5459, -3768, -1753, -3489, -6489, -1055, 149, -923, 124, -3723, -7077, -6864, -2186, -4183, -2639, -2870, -4595, -5973, -7002, -5251, -2593, -2066, -5802, -8030, -5400, -1548, -1616, -3496, -2975, -1057, -2144, -5107, -7873, -8933, -6286, -6467, -4811, -310, 4011, 4360, 2066, 1792, -538, -7195, -7212, -3426, -1861, -2936, -649, 1320, 1629, -862, -2521, -4505, -6278, -9009, -6609, -3927, -1210, -3596, -6162]
11017f162l591l68j61K330K112p64M38L409L119j187j352k414K770J942k969P90
11001b058r13K970J940n77J385r93l373m79r33L798j019j620J793P97Q03k367
10985h46o56J152M270j709l576k007k649N03M66M10J2J213o10R64J991J867K004
10968B799m99n56J249J903J463k815l133Pr39r26o78K253K919q81k878N46P04
10951E38R85p97J953j693J33J478k426k990L295M308m35L74J228Q53r16j581l719
10934E88j56R93O25p83l897L41j094m79j183j090J985N102J045l478q92j65j702
10917d240n37n94J950L953J1j50R59l73k707m192l982M166L555l566j778K238
10901e287q98K392P8J0q73j748K646M391M601m965m803J1qm15j477P47O88K034
$$ y = [-6162, -9753, -10121, -10282, -7952, -5840, -6604, -6166, -2757, 362, -825, -2177, -4591, -1821, 121, -2848, -2058, -2971, -1, 1939, 1362, 2747, 1754, -1619, -2098, -3031, 767, -252, -1872, -79, 718, 1521, -846, -1502, -350, 3920, 2211, -1365, -3372, -6021, -5518, -5052, -4642, -4630, -3417, -4027, -3063, -1072, 795, 2799, 2300, 1744, 2993, 4896, 6359, 3544, 411, 418, -521, -1447, -2125, 128, 3047, 2166, -712, -166, 538, 1523, 726, 2679, 986, 1119, 2597, 171, -2819, 476, 4784, 4349, 4723, 5951, 6804, 5888, 4307, 588, 432, 1425, 2050, 1267, -2630, -2289, -3383, -3862, -5045, -6135, -4150, 952, 1997, -1481, -2373, -2538, -4240, -4777, -5371, -3421, 532, 543, 393, 1352, 979, -1728, -5920, -9902, -5736, -2181, -5747, -7525, -5287, -6185, -3793, -3715, -3705, -4578, -6326, -3680, 711, 5312, 347, -4456, -4445, -4453, -4868, -6345, -5598, -4910, -2876]
10883b876P51N09j723k634M52M425J952l153m09j487j570J915J486M527J440J794
10867E399k479l974o04K144j01M255M525k691l954m124j457m316k207j276K778
10852h082M986O62j169J34M778j667j943j469m61j465l23l57o04l50K805m09M563
10835c71L728M66K182J365l530J006L663J159k719o377k076n0L41j129J601j090
10819a831o7N374J197m204j76J575j243n32K526K152j132k554J061J174j458l73
10803A489k816j170J583j965j567K314O86j401K5K140L037K073l259l038J107
10788g62OL202J585j397N46Q07K625J857O92J970K626K673J953K416M947M057
10772B9803L80K856L324R593J2262J9335L0280M3414O0217P3998P6173N3240N681
$$ y = [-2876, -2125, -1616, -3339, -5973, -5521, -1096, 856, -2297, -2706, -4193, -5763, -3848, -2362, 2165, 3605, 5399, 2920, -1054, -1658, 486, 385, 4640, 9165, 6474, 2520, -1604, -3061, -7377, -9584, -10860, -8082, -3096, -2434, -3603, -3469, 1309, -358, -2301, -3770, -4231, -5696, -6019, -6376, -6980, -7330, -4525, -4934, -371, 3357, 3823, 6005, 7370, 3840, 4846, 8509, 9668, 6949, 572, -1504, -1554, -1213, -2342, -741, -1831, -1898, 3476, 4673, 469, 293, 1868, 625, 93, 2619, 4771, 3639, 1085, 2146, 3320, 1862, 1489, -1327, -2497, -914, -2879, -4446, -2132, -1446, -2847, -2822, -682, 2355, 4428, 1169, -1869, -762, -756, 2446, 4031, 2634, 3180, 3987, 6612, 8469, 9161, 11131, 13757, 16430, 18383, 20799, 25746, 29803, 30183, 33039, 36363, 45956, 58218, 77553, 107833, 151247, 211464, 285462, 361635, 414875, 420556]
10759D20556n0330p8258p1098n0579l4945k4501j7794j1625j0435o766m103j948
10747E8174j783l094n081j634M61q35k095k241M277L869k209q20l80J339p64l163
10731D4021j280k611j830j945j018l003o707n41N180m47m443q54j470q28o30j587
10715B0007J368J831N29k951J424n80l288NJ152j056j114K77l077j836k549j278
10699H864L237M45J878j98j723k983j924J353J418j77p37j894L623J01l408j939
10683E936L61J475n52q62J916J556o87K756k28m27j798n40l682j866J40K69J731
10666E498K738J223j483K80L41k81m73l367k197r38L846R91P99j75o81M64j011
10649E574j105o07L181k904m265k82j408j531K855K492r74K428k87j305J08j569
$$ y = [420556, 370226, 291968, 220870, 170291, 135346, 110845, 93051, 81426, 70991, 64225, 60122, 58174, 56391, 53297, 48216, 46582, 47043, 46208, 44113, 41872, 46149, 50018, 47809, 46989, 46609, 47948, 47184, 44021, 42741, 40130, 38300, 36355, 35337, 32334, 25627, 25086, 30266, 29819, 25376, 24522, 23052, 22224, 21594, 20007, 21375, 23206, 23735, 20784, 22208, 21628, 18340, 18345, 19497, 18441, 17327, 17604, 14527, 12691, 10142, 8864, 12101, 12546, 14424, 14226, 12503, 9520, 7596, 8949, 10367, 10190, 9453, 7559, 11182, 11283, 7875, 5936, 6297, 7772, 7220, 6358, 8274, 9830, 9143, 11899, 11671, 11244, 9446, 8906, 5224, 3358, 3498, 3767, 5498, 8236, 9459, 7976, 8256, 8597, 8316, 7843, 4476, 2279, 1341, 5187, 6178, 6977, 6802, 6121, 6585, 5574, 4469, 3862, 7043, 4139, -126, -408, -1816, -3347, -492, 2000, 1026, 3454, 3167, 1862, 1970, 401]
10633D01j014J272m99j718k72K818J72L372k41k201k068l91j611j930p64J798
10617b876K450K579J336j196k507K76J296J360m010m568J696L276L186l51j835
10602A12j417J191j150k53N170j654o91j805M522N461q13k682j884m779k111k102
10586d885L781K118J3M424P12k697k366J073j323J282L115j265j145K721l163
10571B395k413j17r86n136j946N16K867L352j014j506RK699P61k787q42j184J937
10554c395l172j366J483r14R12J312P47J408J703K550J18L77o49j946J933l268
10538b167j518j02n1L07m351J443N997N89k969L75O64P93K049k154j57J556j728
10521a424p31R25L080K513k517l374k255J512K55K915J843k031m296k716K262
$$ y = [401, -613, 659, 160, -1558, -1830, 988, 1160, 4532, 4291, 2090, 22, -369, -1980, -3910, -4674, -2876, -426, 2153, 3489, 2293, -214, 62, 1358, 2718, -1292, -5860, -4164, -888, 2298, 1947, 112, -1305, -114, -1264, -1517, 3653, 1999, 1308, -497, 4025, 9486, 8673, 5991, 4107, -672, -2783, -4885, -1104, 1014, 1027, 5451, 6163, 3466, 1100, 2173, 850, 2132, 5247, 3982, 2837, 5558, 2395, -18, -135, -1121, -6257, -8203, -7687, -4820, -1468, -2482, -3988, -3979, -1280, -519, -3306, -4148, -5332, -3395, -6567, -7933, -6450, -7364, -6452, -5140, -4393, -2985, -1282, 1268, 1386, 1763, 1114, -832, 1101, -2167, -3685, -3787, -3838, -3531, -7882, -6439, -442, 147, -2822, -2447, -1783, -990, 1059, -1095, -1252, 304, -1424, -2155, -1230, 1850, 4363, 1846, -1528, -3783, -2271, -2016, 899, 2742, 711, -3585, -6301, -4039]
10506d039J311J720J829J87j211K302K476n05j849k18J034M77L55q96k493k214
10490a734j565j655J828K968J748j023r03o71q21O81j180p98P78J530M74o57k413
10473c413j040R89P01k065r01M056P17K315o17o29L84J334J067l119j117p06l097
10456e141J370L114j066J52j724K164J430J513J23L509J050l528k372l763J12
10441c057J376N12N07J628j942q17r34j23K107R2K79N262K81j566k340n183j058
10424d976L251j613q79K403M604J485L57j634k653r16k471k290o20J976N216j52
10408A088j97j329j246o33l492j637M232J032J260J774J881M308o93n207j045
10393I6N92J904P19o37L088l106m362L277j334M37K123l78j290J138N76k048k139
$$ y = [-4039, -2728, -1008, 821, 1008, -203, 2099, 4575, 4070, 2221, 2003, 3037, 3514, 3869, 2973, 480, -1734, -3299, -4954, -3126, -158, 1590, 567, -336, -1007, -1828, -1147, -2327, -3125, -2347, -817, -343, -1000, -3413, -4453, -3464, -2763, -4828, -5729, -1673, -956, 1359, 742, 113, 497, 1831, 2898, -221, -1338, -2044, -5141, -3771, -657, -1723, -1571, -3295, -1131, 299, 1812, 1935, 5444, 6494, 2966, 594, -3169, -3057, -1681, -1169, -662, 966, -976, -1793, -2727, -2850, -743, -651, -372, 4890, 5171, 3605, 1265, -3918, -4976, -1725, -3338, -4217, -1814, 2790, 4275, 4632, 2998, 345, -571, -3042, -5332, -5952, -3976, 1240, 1088, 891, -438, -1684, -2317, -5809, -7446, -3214, -2182, -922, 852, 2733, 7041, 6348, 1141, 96, 688, 2592, 3311, 2674, 5762, 2656, -1706, 1571, 237, 674, 2797, 2419, 1129, 2267, 2843, 795, -1344]
10376a344j090J919J491k243q8K78J336k144L440n93L97P14R82L556k171n119
10360f79k730J241N68j26L16l07O35K213k722J128M578oj284n45n135l178K700
10343c333J921K195J462n30k454j09J496k56q78j56j344J813L285J25o87R1Q39
10326C480n44n77k184r60J88j865K784K889J727j552k291n105l19j295J37L015
10310b472J627j79K057P55j649O26K053j87K161n55k91j433m9J81Q23j857l094
10293a483J432R01k253K638l38J274j650j49O58l59L239j869k349K872M89n70
10277B483P49k371k255J421p08J773J776j199k975k456J820J888k321k127R4L705
10261g03M167J525l065l075P46k459m026K520K372K335K093K912k106k164k162
$$ y = [-1344, -2434, -515, 976, -1267, -1355, -1077, 259, -1885, 1555, 962, 1359, 2073, 3055, 6611, 4440, -679, -3409, -2168, -1600, -1726, -1410, -1717, -1082, 1131, -1591, -463, 4115, 4109, 2825, 2280, -2855, -6033, -3333, -1412, 783, 2245, 1715, -739, -848, 648, 392, -486, -642, -1986, -173, 3112, 3237, 2550, 2641, 3480, 2936, 2359, 175, -785, -597, -2462, 322, 3211, 4938, 3386, 1095, -4010, -4329, -5624, -5487, -2472, -845, -1024, 1033, 1788, 139, 765, 2818, 2631, 4792, 4237, 3946, 2513, 2464, 2645, 3468, 1611, -1483, -51, 850, -1403, 1235, 897, 2171, 521, 372, 1030, 671, 3910, 2041, -308, 2564, 3053, 2483, 3232, 861, -1394, 27, -681, 1092, 2868, 1669, -1306, -3762, -1942, -54, -2375, -4502, -4408, -703, 3464, 4989, 1924, -1151, -405, -2864, -6890, -4370, -1998, 337, 2430, 5342, 3236, 1072, -1090]
10246a090K539P74k501j008L01j438M91Pj755j39k186K898L448J037L309n15l016
10229A156o10K512K307J262m11l004L50k704k948K323o50Q75M9k065K225J74k896
10212b055k068j269O6L898l04r48L669K303j919j255K484K797O42j302N94J148
10196F481K32j930n70J065k502J23q78J106k431j502j089k049L062J264P71M352
10180E505j598l276K679p81k69J64P82l39l893K186J639O02J891K481j000m851
10164A922k493j150M38j14K757J014j19j989k2j176J270l07p44J863K910K021
10148F081j375j944j177j616J442M37k895Q84J231j663j356n13j652k214r16K391
10132d855L581K728n7k646l564P9L510K561j939k279j695j420L539N707K879j384
$$ y = [-1090, 1449, 2223, -278, -1286, -985, -2423, -1932, -1925, -3680, -3819, -6005, -3107, 341, 1378, 4687, 4172, 1156, 546, 3058, 5365, 6627, 6216, 3212, 3562, 858, -2090, 233, -417, 458, 507, -1558, 667, 841, -2055, -4123, -5392, -5326, -1428, -1732, -2680, 989, 3292, 1373, 118, 2602, 5399, 6041, 4739, 5333, 6481, 6713, 4783, 4213, 5278, 2776, 2899, 2021, 3127, 696, -806, -1895, -3944, -882, 382, 1153, 5505, 3907, 631, 3310, 2529, 2260, 2424, 3206, 2867, -1026, 1160, 2799, 3401, 5292, 7773, 6773, 1922, -571, -1721, -1283, -1397, 1360, 2374, 2255, 266, 244, -932, 338, 31, -713, 1150, 4060, 6081, 4706, 2762, 1585, -31, 1411, 1848, -1047, -163, 1068, -595, -1951, -2464, -4116, -6330, -7246, -4855, -1274, 1454, 1397, -1249, -4813, -4734, -1224, 1337, -602, -2881, -4576, -5996, -2457, 3250, 6129, 4745]
10116D745k881l340K336K798L81l64k560j958J68p99j584J939L211r72R2o62l035
10099b485j607k00K331j350p26J266J628n017k183K060K540N429K647j235j650
10084A448l251k252k335j284K96L262L510L403j45Q87J45P94j712j871J882k36
10068B541j661k878k33K045L133J783j664r91m047l775Q35K545L304J124R3k701
10052e47p67J574r39R19K469l01j083k4K033k69m142J687j144l81J999N11J816
10035C411k507k098k502K427N784k447k956Q34P93J60K107P9N527O894M919l07
10019B0118N011N580o099j0659n070j767n656l719M65k8P21n31L872R30J25r46
10003B347j437L459j891K24K37j651J248j029q58J08N5j874k082k668R59K302
$$ y = [4745, 1864, -1476, 860, 3658, 4039, 3675, 1115, -843, -675, -1474, -3058, -1119, 2092, 1120, 1212, 550, -2485, -4092, -4292, -1961, -3311, -4037, -2771, -1143, -6160, -8343, -6283, -3743, 1686, 4333, 3098, 1448, -1803, -4055, -6390, -7674, -7378, -4116, -606, 2797, 2652, 3539, 3684, 4478, 2766, 895, 2777, 2541, 880, -1998, -2231, -186, 2947, 4730, 3066, 2075, -1972, -5747, -4912, -2367, 937, 2061, 2154, -547, -1314, 260, -679, 240, 2709, 2408, 1325, 1301, 3334, 3065, -1077, 610, -534, -915, 1084, 1595, 3411, 904, -1194, -3696, -1269, 4515, 2068, -888, -54, 739, 899, 3006, 3085, 8612, 15506, 20425, 20118, 25129, 30709, 24610, 13951, 8881, 7114, 1458, -2261, -1796, -1824, -1103, -1634, 2238, 3168, 3293, 2347, 910, 4369, 2478, 2702, 2939, 1288, 2536, 1507, 649, 757, 812, -1062, -3144, -5812, -4853, -2551]
9987b551J107j190Q89M403J302M66K237P09k710N20k161j584J050O56J100K183
9971F426k686l013K02j811N57J444j5M868j226j828J28k914j321k426l963L217
9955d361N987O855L18j242m80j97k313J518k067k547r58r98m35k281P16p95P80
9938b500K004L702L946O3j489P6o65m484J116O13K0k608l73O75J644O85k845q30
9920a250p48J68J428K549K859L317j063m08m082K78M29O15K535J679J964M42j525
9903I187j706J729J139L670J067L212N53k38L48M95K150k617j783J32P46L249
9887B1333K95j707P69K657N154K104l24m09M541P303Q326O061P275O277P459J4053
9871I1167J4344J4011K1561K6401M1288O1555R3262J63213L10489M68507L78798
$$ y = [-2551, -1444, -2634, -1745, 2658, 3960, 4426, 6663, 7372, 4662, 5182, 3021, 1437, 2487, 3143, 4243, 6426, 3740, 727, 929, -882, -325, 1119, 1104, 5972, 4746, 2918, 3046, 132, -1189, -3615, -7578, -4361, 1626, 8481, 8799, 7557, 7077, 6880, 4567, 6085, 4018, 1471, 513, -485, -920, -3201, -2485, -3280, -2500, -496, 3206, 7152, 7215, 5726, 5802, 5137, 653, 1769, 2382, 2402, -206, -579, 96, 1740, 2425, -420, -1250, -1998, -1830, -402, 2147, 5006, 8323, 7260, 6852, 2770, 3048, 3477, 4092, 6627, 8306, 10270, 10712, 9187, 7481, 9210, 10349, 14019, 15086, 18298, 18851, 18613, 18961, 19456, 21606, 18989, 17206, 17338, 18084, 21333, 21628, 19921, 20690, 23347, 28501, 30605, 30281, 29872, 34413, 41716, 50042, 56103, 63378, 69655, 77114, 91167, 105511, 119522, 141083, 167484, 208772, 270327, 363589, 526802, 837291, 1305798, 1684596]
9860A684596L24991L99679o4510p05237n80430l11681j75733j10088p0914m7981
9850C42692l0035j9206p258r93K339k664j2741j6341k1594k2739j6830j7860j1884
9837A64886j0162r209r123o569n777n223n700l832j708J139m212l930l423j009
9823I6148k478k492o181k180k734P11j519m965l090j770j043k61m203m099k414
9808E7430k438l538m411J53J29J892K242j644j98k883k472k618O94k525k870k055
9792C4888j737J92L545J203p81k132o6j180j696j320J540k272j819K163M23m497
9776B6454J278L712J842m919m599m184m664Q84j063k42O94p55Q40K340J412j070
9760A7960n656m033M32J684k0J919j107K655j271m231K476K258J868p38L845J349
$$ y = [1684596, 2009587, 2409266, 2344756, 1639519, 1059089, 747408, 571675, 461587, 390673, 342692, 312657, 293451, 286193, 285200, 287539, 284875, 272134, 255793, 234199, 211460, 194630, 176770, 164886, 154724, 145515, 136392, 129823, 124046, 118823, 113123, 109291, 107583, 108722, 104510, 100580, 97157, 96148, 93670, 91178, 84997, 82817, 80083, 80794, 79275, 74310, 71220, 69450, 68407, 68146, 63943, 59844, 57430, 54992, 51454, 47043, 47196, 47325, 49217, 51459, 49815, 49617, 46734, 44262, 41644, 42338, 39813, 36943, 34888, 33151, 33343, 36888, 38091, 37310, 35178, 35112, 33932, 32236, 30916, 32456, 30184, 28365, 30528, 30951, 26454, 27732, 31444, 33286, 28367, 23768, 19584, 14920, 15804, 14741, 14499, 15193, 14438, 15278, 17618, 19030, 17960, 12304, 8271, 8703, 10387, 10367, 12286, 11179, 13834, 12563, 8332, 10808, 13066, 14934, 14196, 18041, 19390]
9744A9390l482k262K798r06j108J829l21k461K25l276k196j417L824L379l2n3
9728A3931n834r37m96j646P35K643L200j296j522M61l707J541M40k211K844K168
9712A0314n92j231k193j520N23m911l461J692L28l379Q54K495M126J235j147M83
9696C616m94k365l24L488L958L165k705m801k325K640j29j441L11j475j191k832
9680b904k371K196M275j69J451j61j291p24K637R29N00P35l73J80M257m037j890
9663C240K423p64m371N83J627R69q16k189m214m20J732K982M630K357k743o55
9647D371P98j684j721j058J403J849j189k011N67MN78P47k380r7K9M88l1j705
9629a042j453r02O6L669J79q67K8J49J836j577j093K406K502q59K8p16L935p32
$$ y = [19390, 15908, 13646, 16444, 15538, 14430, 16259, 15938, 13477, 13702, 10426, 8230, 6813, 10637, 14016, 13984, 13931, 8097, 7160, 6664, 5018, 5753, 8396, 11596, 10300, 8778, 9239, 5532, 7073, 7513, 5302, 8146, 10314, 9722, 8491, 6298, 4778, 5301, 390, -3071, -1379, -1051, -4430, -3576, -1081, 3045, 4280, 3133, 3616, 3122, 757, 433, 3921, 7879, 11044, 8339, 3538, 1213, 3853, 3724, 2283, 2594, 1119, -72, -2904, -5275, -3079, 1196, 1027, 2478, 2317, 1026, 302, 2939, 3868, 4368, 5103, 4730, 4910, 9167, 5130, 3240, 5663, 4899, 528, 1111, 2738, 3707, 2891, 702, -3512, -3932, -2200, 782, 5412, 7769, 5026, 4371, 5169, 3485, 1764, 706, 2109, 3958, 2769, 758, 1325, 1329, 1907, 2654, 274, 177, 206, 694, 663, -1042, -2495, -3397, -3331, 338, 517, -350, -322, -173, 1663, 86, -1007, 1399, 3901, 3042, 3070, 2354, 6289, 5557]
9611E557p046l984K185K174N38J391M36m557j977L077O40j318j238J711N6n114
9595g469l036J267K554J459J319L09K01K791J08j576k719K865P62j819j595L636
9579i43K198J396j181L319K97K62K101J443M04n34m584k104J807j06k234p14J570
9562B397j033k799j758L10K619P31K503J691O28K232k185m231q30K408n85M24
9546B522K3n512J54L89J62J248M72N2jO11j113j836J368J052j630j657j973K245
9528c424K328Q79R88K032m073k538J470L652K482j412q00k549j749r28M091J717
9512B166K82k991l622J635L220K19J137j007n4Q73J450j150M56j400j202K9k147
9495b106J74K609Q79j906j790j324m65q74M439J095m88j017j462j257l42O15j43
$$ y = [5557, -1489, -5473, -3288, -1114, -576, 815, 1251, -3306, -5283, -2206, -1566, -2884, -4122, -2411, -2355, -7469, -10505, -9238, -6684, -5225, -3906, -3597, -3396, -605, -497, -2073, -4792, -1927, -1165, -2984, -4579, -943, 1255, 2651, 1470, 4789, 5086, 5348, 7449, 8892, 9296, 8762, 4178, 2074, 3881, 3775, 1541, 827, 2397, 1364, -1435, -3193, -2883, -264, 467, 2970, 4661, 5289, 7521, 5336, 1105, 275, 2683, 2098, 2522, 2545, -2967, -2813, -2424, -2262, -1014, -542, -490, -491, 120, -993, -2829, -1461, -409, -2039, -3696, -5669, -3424, -1096, -217, 771, 2803, -1270, -3808, -2338, 1314, 3796, 2384, 1584, -965, -2714, -3642, 449, 2166, 2448, -543, -4165, -2530, 690, 909, 2046, 1039, 985, 1858, 3308, 2158, 2614, 1214, 12, 41, -2106, -1932, 677, 1556, -350, -2140, -3464, -3929, -4803, -364, 731, 243, -774, -2236, -3493, -3835, -3220, -3363]
9478c363K054K398q31M85J02J537l20k297J526K046K51n04j159K517J94q37O6
9461C865n92Jm942o21K192J242K078K329k451k494l269j336K148m46PK457K383
9444B551l232l480K58L308J839J576p66o68J508J073k453n160J961M401o21k438
9428c43j120K908k126k507j069J347K986J560l338J356P03J516q05k271J975J717
9412B489j582n07J408J441J413m39n281l197R90J792J863j407K352N412J721m146
9396D322l880K387o46j802J812Q87l429l316P78J731J848J962k499j04L912j448
9380B515k148K953m061j852L285M078M658j724k092l097l161j233l81L832K508
9365D080J568j779k867M19K732J469m167l876J851j5j118K668K142j958j228r19
$$ y = [-3363, -1309, 1089, 258, 743, 845, 2382, 2062, -235, 1291, 3337, 3588, 3084, 1925, 4442, 4636, 3799, 3865, 3273, 3274, -1668, -2289, -97, 1145, 3223, 5552, 3101, 607, -2662, -3998, -1850, -2296, -2289, 168, 2551, -681, -4161, -3903, -595, 1244, 2820, 2054, 1386, 2894, 3967, 1514, -3646, -1685, 2716, 2095, -343, -1463, 1445, -681, -3188, -4257, -2910, 76, 1636, -1702, -346, 357, 1873, 1068, -1203, 772, 2489, 907, 400, 1808, 3249, 4662, 4223, -1058, -4255, -3265, -1473, 390, -1017, 1335, 6747, 8468, 4322, 442, 2829, 2183, 381, 2193, 3080, -349, -3665, -2887, -1156, 692, 2654, 155, 51, 3963, 2515, 367, 3320, -741, -2593, 692, 4770, 9428, 7704, 5612, 2515, -646, -1879, -2260, 1572, 4080, 5648, 3869, 1002, 1421, 4153, 5622, 1455, -2421, -570, -585, -1703, 965, 3107, 1149, -79, -998]
9349i98J95p54j247J644J674J615M25l090K196J156j3k403M25j791j608M538M005
9332E969M46k466r06q26k88k219Q57J309J109r93J80q29m57l080N83n86j73L510
9314A140O07m41K775r27k476k473p35j209L333j826k046J372Q78l32K942k088
9298a506k512N95q4J912L554o32j664j72j995k44J133J360K498K044J255m619
9282I23o26J98L236K550K751j981m908j288P55k779N40k014j923M18J61K914P74
9265b99k626l493K104M650j159M86J364K79J260N276K235j939m606N14K643O38
9249G327j610K5l64j641n91l02K728l152n540N0J268K832N09n60K327Q6J891L040
9231H323M81k121l169m075p85J452J263K628k212k61K48r77r92j64n69K899L099
$$ y = [-998, -803, -1557, -2804, -1160, 514, 2129, 2554, -536, 1660, 2816, 2803, 400, 825, -966, -2574, 1964, 5969, 6415, 3949, 3043, 2217, 1929, -290, 567, 1876, 2985, 1992, 2172, 1343, 886, -2194, -1611, -2197, -2370, 1140, 1747, 1306, 4081, 3154, 678, -1795, -2530, -3739, -406, -2232, -4278, -2906, -2028, -2360, 582, -1506, -4018, -3423, -3507, -1595, 1959, 1327, -337, -509, -2504, -2748, -1615, -255, 2243, 4287, 5542, 923, 297, 495, 3731, 6281, 9032, 7051, 2143, 855, 1610, -1169, -629, -2643, -4566, -4148, -3987, -1073, -299, -2925, -6418, -4314, 336, -823, -337, 1027, 1306, 2566, 7842, 10077, 8138, 3532, 4046, 6689, 7327, 5717, 5742, 5378, 3737, 3146, 2844, 5572, 2420, -3120, -3070, -1802, 1030, 1539, 979, 3306, 3392, 5283, 8323, 8804, 6683, 3514, -561, -1346, 106, 1369, 3997, 1785, 1524, 1772, 795, -197, -361, -930, 1969, 5068]
9214E068K711K888j904k544L968J295j763j623l775K543J628k464j981N09m39
9199D117k474k73j035R51k153k350k297K949M72q33K012J14Q26r52o68P78K579
9182A763k317o088K387J521l31P87k807K030N25j69M46J442L229P86l60n4l6O49
9164C403j990j732k754M893N151Rm870l904L804L782o49J56J703K24N8k106K004
9147G182N10J813J337J051j702j132l644J333Q17j988r72K435L31l361M92j76
9131D326k039n54L919M082j088o3K202k443k083j461Q89k579k755j973J605L563
9115C548j460n203j725L348N134L237j452j386K940K667k576m63M44k216J825
9100F662L447k235j557K829J64k325o06m11p97J04L875J876j81j17j914J908k379
$$ y = [5068, 7779, 10667, 8763, 6219, 10187, 11482, 9719, 8096, 4321, 6864, 8492, 6028, 4047, 4556, 4117, 1643, 1370, 335, 1286, -867, -3217, -5514, -2565, -2093, -2926, -914, -800, 26, -926, -1594, -816, 1763, -554, -6642, -4255, -2734, -3065, -2278, -5085, -3055, -2530, -2699, -2253, -811, 2418, 3204, 2844, 2790, 2754, 3403, 1413, -319, -3073, 1820, 6971, 6980, 2110, -1794, 2010, 5792, 5143, 5299, 7002, 7226, 7284, 5178, 7182, 7692, 9505, 10842, 11893, 10191, 9059, 5415, 6748, 7565, 5577, 4605, 7040, 7371, 4010, 4502, 4326, 2287, 1733, 5652, 9734, 8646, 8583, 10785, 8342, 6259, 4798, 5687, 3108, 353, -1620, -15, 3548, 2088, -3115, -4840, -1492, 3642, 6879, 5427, 4041, 6981, 9648, 7072, 6609, 7053, 4837, 6662, 10109, 7874, 6317, 9146, 9310, 6985, 6379, 5968, 5171, 5275, 9150, 11026, 10845, 10728, 8814, 10722, 8343]
9083H343n748n83L002M355N19k275k87L387l640k58m739m323K082K313m6j709
9067C93L29K604L581N85k122J270j226l348J475l425n645L021J91j398K507K669
9051A461K217j4q10Q92J042J468m49J44j045j807J462R13n69n68p25J690m17j703
9033C182k859N89L39K392P86K474J532N91n24n058l816N70P19K646J52O03J417
9016E735K58J77p42k035Q6l079j073p5j598j229K492J500K456N35j10k520L79
8999A157o95l997L271L078j632J332K604J046R86k535n066m66L345J681J049k79
8983D879r04k25J047j011k71L921j48r24m49q17k347k113k201J606P70M31K303
8966C547n43J704M95l150k363j063K238J698J79j831j424M25M317K275j151r45
$$ y = [8343, 2595, 2012, 5014, 9369, 9888, 7613, 7326, 10713, 7073, 6815, 2076, -2247, -165, 2148, 2102, 393, 722, 3326, 6907, 7492, 5370, 6640, 5414, 2066, 3541, 116, -5529, -2508, -2317, -3715, -1208, 1461, 3678, 3664, 2854, 3746, 4788, 6256, 5807, 5951, 4906, 3099, 4561, 5474, 4905, 4337, 3612, 5302, 4885, 3182, 323, 912, 1251, 3643, 4429, 6903, 8435, 9026, 8502, 3444, -372, 198, 917, 3563, 3715, 4318, 5735, 5993, 6170, 5428, 3393, 3479, 400, -673, -748, -2346, -3575, -1083, 417, 2873, 3408, 3298, 778, 1157, 462, -3535, -264, 2814, 1182, 2514, 5118, 6164, 7150, 4615, -451, -917, 2428, 4109, 5158, 4879, 3975, 3750, 4797, 3786, 3515, 7436, 7288, 6364, 5915, 5098, 2751, 638, -1563, 43, 813, 1244, 3547, 3004, 4708, 5203, 2053, -310, -1373, 865, 2563, 2742, 911, -513, -88, 4229, 6504, 5353, 4408]
8950D408k206k0J235J851J777o95l855p07J710Q2L31J294m74j770q71k729j546
8933b185P3J396k668L258K198j022K010L338L884r9j359K46K14k694J714K401
8917A0705j58l991J288M715l513k509k375k046j696j306K693J340K35j87j433
8902A762j581m39J990R95J972l773l788j766K865L122L324J284K622K383J38k254
8886H856k955l55K994R1l056n316J252n01O03K533n71L55K871K592k438j339k075
8869C541K047K528J451J257L583j609k710j428l10r01j322P58j538l64R69P83
8853F735o90k620j532j982O238Q82k148j801R86Q10J746J2L94J393k035k045L372
8836G715N421N04n098r43N66k475j10K785M8j259J677m04l33R41r75J182K101
$$ y = [4408, 2202, 2182, 3417, 5268, 7045, 6350, 2495, 1788, 3498, 3580, 3911, 5205, 4731, 2961, 2090, -639, -2185, -2112, -716, -3384, -126, 2072, 1050, 3060, 6398, 10282, 10183, 8824, 9070, 9284, 6590, 8304, 10705, 10547, 6556, 7844, 12559, 9046, 6537, 4162, 2116, 420, -886, 1807, 3147, 3382, 3195, 1762, 181, -258, 1732, 2727, 4699, 926, -2862, -4628, -1763, 1359, 4683, 5967, 8589, 10972, 11110, 8856, 5901, 5546, 8540, 8631, 5575, 259, 1511, 1010, 1613, 4146, 3575, 3930, 6801, 9393, 6955, 5616, 3541, 5588, 8116, 9567, 10824, 14407, 12798, 10088, 8660, 8350, 7449, 6127, 6885, 5347, 4983, 5952, 6735, 6045, 3425, 1893, -89, 6149, 7031, 4883, 3082, 4068, 4878, 6624, 6636, 7030, 8423, 6388, 4343, 7715, 13136, 13640, 8542, 7599, 8165, 5690, 5580, 8365, 8413, 7154, 8831, 8427, 8094, 9035, 8060, 9242, 11343]
8819A1343jj953j619l156J990L870J545j987o49J537p51Q37p03m925k395O51J319
8802D953L475L339r39n35J178M00k922m745O75J987K400j25R05j722j192P23J614
8785I469N77q26j246J70k04j376j166J516K671K99j344l52J580K468k283l79J629
8768A1203j317m172J721L703J875O1j429q87J16K89J00P88k161j290l380O54R38
8751F812l183m640k73M383M383Q95j174K91J86m19l52L50L179K066j30l947J043
8734I470k72m264J468K738L501M44K098j428r98k452j958p09m981k405J426j084
8718E94L867M1j690j478K654K752j158J094K232j146K58j04O04L655j277j698
8702I200O93Q20k348k920K96P77k346k027J685L800L798Q93m18l522J063R93K14
$$ y = [11343, 11342, 9389, 7770, 4614, 6604, 10474, 12019, 10032, 9383, 10920, 10169, 11006, 10303, 5378, 2983, 3634, 4953, 8428, 11767, 10828, 10293, 11471, 11871, 8949, 4204, 4879, 6866, 9266, 9141, 10046, 8324, 7132, 7855, 9469, 10046, 9220, 7974, 8144, 7940, 6564, 5398, 6914, 9585, 9884, 8540, 8188, 9768, 12236, 9953, 9574, 11203, 9886, 5714, 7435, 11138, 13013, 13074, 11645, 10758, 10874, 11163, 11263, 12051, 9890, 8600, 5220, 5874, 6812, 3629, -1011, -1284, 3099, 7482, 8377, 7203, 7494, 7680, 7261, 6909, 7259, 10438, 12504, 12374, 8427, 9470, 9198, 4934, 6402, 9140, 12641, 13085, 15183, 13755, 12757, 10305, 8347, 7638, 2657, 252, 1678, 594, 4461, 4502, 2812, 1334, 3988, 6740, 5582, 6676, 8908, 7762, 8020, 7916, 8520, 12175, 10898, 9200, 9893, 10713, 8365, 5445, 5741, 6518, 4172, 2145, 3830, 7630, 11428, 12321, 11903, 8381, 9444, 10437, 10651]
8685A0651k870j982J664J404K162J29j007j450K838N39j294k196m649l317K5L968
8669D615L008M054M345L686j323n965l745n40K219J067R2J220k576j517R55j3
8653I582p17O97P65M13k196j440R60J704J171q39k863J960j443j429K128L260
8637A1713n62p57J514R15j649j822O49K429Q35j204K173J25Q39j199j897L171
8621A5273K44k072l859J512J539P50j350j984k071J700j046j7k00L238J264pj547
8604A1367J001q66j325p12k285K249j639k7Q58J757L03m43k48j733J757j198k190
8587F626j262K667J90K276L270k952q97K95n82k318n23J498K84k603L37J086l00
8570G092J302L051o4n58j035L032J492j912n70P19L125J591k523j038J150r79
$$ y = [10651, 7781, 5799, 7463, 8867, 11029, 11158, 10151, 8701, 11539, 12078, 10784, 8588, 3939, 622, 647, 4615, 7623, 11677, 16022, 19708, 18385, 12420, 8675, 8135, 10354, 11421, 11513, 12733, 10157, 8640, 9595, 9582, 8865, 9562, 10327, 10740, 8544, 7104, 8064, 9768, 10939, 10100, 7237, 9197, 7754, 6325, 8453, 11713, 11151, 10394, 11908, 12823, 11174, 9352, 10001, 12430, 13265, 12061, 14234, 14359, 15198, 13999, 12102, 15273, 15517, 13445, 9586, 11098, 12637, 13387, 12037, 10053, 7982, 9682, 8636, 8619, 8419, 11657, 12921, 12914, 11367, 12368, 11502, 10177, 9465, 7180, 9429, 7790, 7763, 8621, 10378, 10681, 10238, 9990, 8257, 10014, 8816, 6626, 5364, 8031, 8221, 10497, 13767, 10815, 9918, 10213, 9631, 7313, 6790, 8288, 8572, 5969, 6306, 7392, 7092, 8394, 11445, 11381, 10823, 9788, 12820, 14312, 12400, 11830, 12549, 15674, 17265, 14742, 13704, 14854, 13875]
8554A3875l134k440j299J756j496J230j093p19J526Pj385J360L907O50l006j916
8538G823m47J562M55j358R92M155q92l541k850N90K02L18k66p21j956K310O045
8521A2421j891j399k623M67l52J586M471Q72l574L97L762k358m425j314o13j372
8505D055M336P46j3J385Q22k999r21j30R22J014J025R4j548j90j58q32k973k077
8487B558K668J963k309M45K347R76K864K130k349l086K005O06o32M31J30k793
8471G954l425K14K00k137J116K550l146R8J606K019L38l762J624J825J67m15K729
8454I555j387L92k061K46O85k305N16J212J298j022J57M070P30k362Q14j033l891
8437E614K382K209j611M40J145M61j434r19J539j910l881K567L075J592N09J905
$$ y = [13875, 10741, 8301, 7002, 8758, 7262, 8492, 7399, 6680, 8206, 8213, 6828, 8188, 12095, 12745, 9739, 7823, 7376, 8938, 9393, 8035, 9027, 13182, 12290, 8749, 5899, 6489, 6691, 7009, 6743, 6022, 4066, 6376, 12421, 10530, 9131, 6508, 6975, 6623, 8209, 12680, 13552, 9978, 10375, 14137, 11779, 7354, 6040, 5427, 4055, 8391, 9137, 9124, 10509, 11331, 8332, 7411, 7281, 8203, 9217, 10242, 10336, 8788, 8598, 8440, 7608, 4635, 2558, 5226, 7189, 4880, 5325, 7672, 8648, 11512, 13642, 11293, 8207, 10212, 10818, 10186, 10617, 10747, 7954, 4529, 4743, 4943, 2806, 3922, 6472, 3326, 3424, 5030, 7049, 7387, 3625, 5249, 7074, 7241, 6826, 9555, 8168, 8560, 6499, 6745, 7430, 5125, 5641, 6853, 8151, 7129, 7286, 11356, 12086, 9724, 10538, 9505, 5614, 7996, 10205, 8594, 9034, 10179, 10640, 9206, 8287, 9826, 7916, 4035, 6602, 9677, 11269, 11778, 13683]
8421A3683j439j630m175j902J680J392L831K816j86l585j861M34k198j642J027
8406F245j900O5O66k81j702K931K57J281K18J454J311M239J955j256k880J885
8390A4488J088j641l861k275j315J52J721L20m33k362j641J749P57R16j133n29
8374F001l214k136L962M591j342m746Q84O41J765j516j755J968K070L59R09R33
8358I374l64j647l530k88J049K198N651M80j525l937M24k27k820J061K137n652
8342B384M75K457J596J054m314J402M363K93r32k638j01m53j075J724J720j7m02
8325G536j083r26M416O26l732j952K569K377m28k361l421j432q77K068M178P12
8309H270K148L923O80L093p83j384J848P25n0j028k574l507r55l9O61J446o00
$$ y = [13683, 12244, 10614, 6439, 4537, 6217, 7609, 11440, 14256, 14070, 10485, 8624, 9058, 6860, 5218, 6245, 4345, 4410, 5076, 4795, 3093, 6024, 6281, 7562, 7780, 9234, 10545, 14784, 16739, 15483, 12603, 14488, 15576, 13935, 10074, 7799, 6484, 6636, 8357, 8677, 8244, 5882, 4241, 5990, 6747, 7663, 6530, 6001, 2787, 651, 4613, 9204, 7862, 3116, 4000, 4641, 6406, 4890, 3135, 5103, 7173, 7532, 8441, 9374, 9010, 7363, 3833, 3545, 4594, 6792, 12443, 12923, 11398, 7461, 7885, 7658, 4838, 5899, 8036, 2384, 2859, 5316, 6912, 7966, 3652, 5054, 9417, 9710, 8778, 6140, 6039, 5586, 4511, 6235, 7955, 7938, 7536, 6453, 5527, 9943, 10569, 6837, 4885, 7454, 9831, 9403, 7042, 3621, 2189, 1312, 3380, 7558, 8270, 10418, 14341, 15021, 18114, 17331, 15947, 17795, 18520, 18470, 17442, 14868, 11361, 10406, 10367, 11028, 12474, 11874]
8292A1874k494O00j549k530K495J587J869k772o92J160O78q75j098M92J076L309
8276A3130M03j808K735p54n39k916l68K475M59j12J968k30j131j276j093P51k139
8259I555J006K272O43j628k609P65J724j103K948M343j204k408k466J797Q1r51
8243A2765l4r37N28n300l742L618l81J011L142K24l061l647J485K816J676r39
8227I224n13l80J61J095L182K573O43L080J37m372r70k204j746K176n73l371K2
8210H164j753K819N31O89L84n1r24k690K889K377K911N10j736k66J137L398R19
8193A9308j12o238o66K897N83j413O19r79j664k062O57J732k162j514R26j534
8177H378N71K396L234m592k695Q27Nk09J167l03J866K909j832J135r80L64l113
$$ y = [11874, 9380, 9980, 8431, 5901, 8396, 9983, 11852, 9080, 8388, 9548, 10226, 9351, 8253, 8745, 9821, 13130, 13533, 11725, 14460, 13706, 13167, 10251, 9883, 12358, 12817, 12705, 14673, 14443, 13312, 12036, 10943, 11694, 9555, 10561, 12833, 13476, 11848, 9239, 10004, 11728, 10625, 13573, 17916, 16712, 14304, 11838, 13635, 13716, 12765, 12731, 11794, 12322, 7022, 3280, 6898, 6517, 7528, 10670, 10894, 7833, 4186, 5671, 8487, 10163, 9224, 8711, 8331, 8492, 9587, 12769, 15342, 15985, 19065, 19202, 14830, 13860, 11656, 9910, 12086, 11513, 8142, 8164, 6411, 9230, 9761, 10450, 10834, 10783, 9859, 7169, 10058, 12435, 15346, 15856, 14120, 13854, 14991, 18389, 19308, 19196, 12958, 12292, 15189, 15772, 14359, 14978, 13999, 12335, 10273, 10930, 12662, 10500, 8986, 9912, 8378, 8949, 11345, 14579, 9987, 7292, 8119, 8124, 7915, 9082, 8779, 10645, 13554, 11722, 12857, 11877, 12241, 9128]
8160I128J025k17L333J560j926k270j888K125M522q21o24j146j290q46j366L393
8144A2692J886K73l162N14j2K308K78o38o66J047p86k334p47Q90J406L54q51M102
8126A6554K58r32q02j432j087j161J786k553j482J626J091J36J069q70J761k729
8110A1233M88M379m028l065j769J789K128J083M677K498J459O91l506l275J659
8095A6441J555m123k211J26J108J763J063O45j534N943J517n666r79J517l540
8080A3625j749J759K866Q87K538n22J901L354n11L1k339P68N78K011R61l627J852
8063B4383K648j13j916k616R11J189l991r56r89L284K746P30j095k566l206q98
8047A7545M085K307k676r31r38J700J918N64J560K107Q88k948n699K486L875M952
$$ y = [9128, 10153, 9936, 13269, 14829, 12903, 10633, 8745, 10870, 15392, 14571, 13947, 12801, 11511, 10665, 9299, 12692, 14578, 14851, 11689, 12203, 12191, 14499, 14777, 14139, 13473, 14520, 13734, 11400, 10653, 11543, 12949, 13303, 12452, 16554, 16812, 15880, 15078, 13646, 12559, 11398, 13184, 10631, 9149, 10775, 11866, 12002, 13071, 12201, 13962, 11233, 11721, 16100, 12072, 9007, 7238, 9027, 11155, 12238, 16915, 19413, 20872, 21563, 18057, 14782, 16441, 17996, 13873, 11662, 11788, 12896, 14659, 15722, 16367, 14833, 20776, 22293, 16627, 15648, 17165, 13625, 11876, 13635, 16501, 17388, 19926, 19404, 21305, 24659, 24148, 24179, 21840, 22608, 23186, 25197, 26158, 22531, 24383, 27031, 26918, 25002, 22386, 23297, 24486, 20495, 19539, 18550, 21834, 24580, 25310, 24215, 21649, 18443, 17545, 21630, 23937, 21261, 20330, 19392, 21092, 23010, 23574, 25134, 27241, 28129, 25181, 19482, 21968, 25843, 30795]
8031C0795M213K763J577K248j936k606l391j720j475J65J384j958l64L095N954
8016C8744L365n135k980q2J884K472j294l648J273J471j773m162k170n027k784
8001B0154M93L461J799R38L529k32j45J741j276l53l47K885k637j766L99k62M79
7984B8860N191L155p80O04l064o61P37j396M6p9L83R8L392K341j178m220J531
7967C4960M038R17r2J426k3k643m234k527l830J042L929J984j008J233K010J512
7951C8694J596k319j851l525J919R44J613J68o26j533K91k13M085K38j823j093
7935C6565k678j865J381R93L0J750L814K616j591r60N17m90l216k897O74R32K009
7918C7584k529l218r09j931K625O380L172j272o82J860R41q3j613m223k721J282
$$ y = [30795, 35008, 37771, 39348, 41596, 39660, 37054, 33663, 31943, 30468, 30633, 32017, 30059, 29695, 32790, 38744, 42109, 36974, 33994, 33912, 35796, 38268, 36974, 33326, 34599, 36070, 34297, 30135, 27965, 22938, 20154, 20647, 24108, 25907, 26845, 30374, 30142, 29997, 31738, 30462, 30109, 29762, 32647, 30010, 28244, 28643, 28381, 28860, 34051, 37206, 36426, 37030, 33966, 33305, 34042, 32646, 32692, 32613, 32996, 33094, 36486, 38827, 37649, 33429, 34960, 38998, 39915, 39823, 41249, 41226, 38583, 34349, 31822, 27992, 29034, 32963, 34947, 33939, 35172, 37182, 38694, 40290, 37971, 36120, 32595, 34514, 35458, 37071, 37239, 36613, 35080, 35371, 35158, 39243, 39481, 37658, 36565, 33887, 32022, 33403, 34396, 34426, 36176, 39990, 42606, 41015, 40055, 40572, 40082, 36866, 33969, 34643, 35575, 37584, 35055, 31837, 30928, 28997, 31622, 38002, 41174, 39902, 39220, 41080, 42021, 41938, 40325, 36102, 33381, 34663]
7902C4663L340J869K890l089l561L018j072J739r79k800J678K490R25j607L009
7887D2513L993q89n502k243L156J087n261j217j459j915J857N294L908l90P25
7872D3657j716m093k587K147K600J645P72j762l029o16M84Q27p07j156l226o64
7856C2576J392Q09J168r31R2K85L20k823k170K910l33m281L734J719l175oM588
7839C5874L538p81m696J573L361K095J45L348n46j821R64J538L288k59k241l756
7823D1624o67L06J303M190n58m116k109j506j462j677J02l330K449K83k924k090
7807B9818J07m88j62K438j677o84K569R25K65K816m09j778P87J402J202J231L2
7790C8394j239J680L937L981j779%K530J683k842o468k477k349K502K250J34l122
$$ y = [34663, 38003, 39872, 42762, 39673, 36112, 39130, 38058, 39797, 38818, 36018, 37696, 40186, 41111, 39504, 42513, 46506, 45617, 40115, 37872, 41028, 42115, 36854, 35637, 34178, 32263, 34120, 39414, 43322, 42932, 43657, 41941, 37848, 35261, 37408, 40008, 41653, 42425, 40663, 37634, 37018, 37502, 38329, 37622, 36466, 33240, 32576, 33968, 34777, 35945, 35014, 35106, 35391, 35711, 32888, 30718, 33628, 33295, 29014, 32748, 34467, 31292, 31286, 35874, 39412, 38631, 33935, 35508, 38869, 40964, 41109, 44457, 43911, 42090, 43054, 44592, 47880, 47621, 45380, 41624, 40957, 41263, 42566, 46756, 46198, 42082, 39973, 38467, 37005, 35328, 35430, 32100, 34549, 34832, 31908, 29818, 29925, 29437, 29275, 31713, 30036, 29352, 31921, 32846, 33111, 35927, 35518, 33740, 34527, 35929, 37131, 38362, 38394, 37155, 38835, 42772, 46753, 44974, 44974, 47504, 49187, 46345, 39877, 37400, 35051, 37553, 39803, 39937, 36815]
7774C6815J019L47N29l838k562l026K45K806L215N5J637K010N25J073M235L982
7758D9067K970k792l017l507m74j27J354j197m989o619p32M268L184N789l31m219
7742C8628K004L540k304k026K621J538K216l738R87N880N267K477j901k45K050
7727E6994L068K286O647M188K237m60k621k405l071m284J688L959l123m158l665
7712E7280j647m05l788n427N39M783k07n377m993L176J737k01k067K507L824P90
7696E0524K000K685qL057L593O72J447Q414P359k831q287r851k774k313m219k286
7680D7182R12j563J449J019l350j167J04P00J35M034O720L906L228K308K184j883
7664F5918J080K612J141J243J480L403L487M341Q657R315Q170Q063P501L280j106
$$ y = [36815, 37834, 38181, 38710, 34872, 32310, 29284, 29529, 32335, 35550, 35605, 37242, 39252, 39777, 40850, 45085, 49067, 52037, 49245, 46228, 42721, 42247, 42120, 43474, 42277, 37288, 30669, 29937, 34205, 37389, 43178, 42847, 38628, 40632, 44172, 41868, 39842, 42463, 44001, 46217, 42479, 43466, 49346, 54613, 57090, 55189, 54944, 56994, 60062, 62348, 68995, 73183, 75420, 74960, 72339, 69934, 66863, 62579, 64267, 68226, 65103, 60945, 57280, 55633, 55228, 51440, 46013, 46552, 51335, 51128, 45751, 40758, 43934, 45671, 45470, 43403, 45910, 49734, 50524, 52524, 55209, 55201, 58258, 61851, 62523, 63970, 72384, 79743, 76912, 68625, 58774, 56000, 53687, 49468, 47182, 48094, 46531, 47980, 48999, 45649, 44482, 44586, 45286, 45421, 49455, 56175, 60081, 63309, 65617, 67801, 65918, 66998, 69610, 70751, 71994, 73474, 76877, 80364, 84705, 93362, 102677, 110847, 118910, 126411, 129691, 128585]
7649A28585l987q72O90j715j430O725J2663J7507K0895K5182M5149P7203J10287
7636D36882J60263K13948K37162K23691J97491J71504J31937J2083j58151k87020
7626A339790l05542k42802j66300j11000p7514n8151m6614l6360k9352j8410j3827
7615B33918j2581r187m131j014k734l304j091j819m588m653r022j1694m828J53
7601A63425n740n710m778j133n212m797j793j024q41q58O66J523k423m040l444
7586A23821j386l11j046k520r00L125J341n710o905J209K905l665k392K747K731
7571A13044n62m005o367q508M83N384M565j220j048j081K162N027o67n014M653
7556A06846M626N266O833J888M232M571P011Q220Q884P602L778m450N598L461
$$ y = [128585, 124598, 123726, 124416, 122701, 121271, 127996, 140659, 158166, 179061, 204243, 249392, 326595, 436882, 597145, 811093, 1048255, 1271946, 1469437, 1640941, 1772878, 1784961, 1626810, 1339790, 1034248, 791446, 625146, 514146, 436632, 378481, 331867, 295507, 266155, 247745, 233918, 221337, 212150, 208019, 207005, 204271, 200967, 199876, 198057, 193469, 188816, 179794, 168100, 163272, 163425, 157685, 151975, 147197, 146064, 140852, 136055, 134262, 133238, 132397, 131539, 132205, 133728, 131305, 127265, 123821, 122435, 122124, 121078, 118558, 117658, 120783, 122124, 116414, 109509, 110718, 113623, 109958, 107566, 110313, 113044, 112482, 108477, 102110, 93602, 94085, 99469, 104034, 102814, 101766, 100685, 102847, 107874, 107207, 102193, 106846, 111472, 116738, 123571, 125459, 129691, 134262, 141273, 149493, 158377, 165979, 169757, 165307, 170905, 174366]
7542A74366p328k1818j6976r641q094n480j087K240J804m36q69o79l902k317l64
7527I9419j441q090m253K795K847L284J279j076J470l672o198k517J293J074P255
7512I3469Q905J0285K9622L8966J0472N041K3215Q604j7114k85O679Q663J1496
7499B38018J2820n509j2216j1123j4272j4918j7423j7293j7460j3398l642l790
7487A19794J997L979K720m822o488k91q78m987q571r372J295N237P259J119p244
7472A00747n338M468L855q315j5831j0195n337r829j2074O304J5939K953Q3J1586
7458G9016K4282Q742l851O622J5240Q935k993n861q518j6071j6352r406p758L382
7444G5409J7145J4603R762J2437L9588N4882J9948n344j2563q882M117P179M346
$$ y = [174366, 167038, 145220, 128244, 118603, 110509, 105029, 103942, 106182, 107986, 107550, 106681, 106002, 102100, 99783, 99419, 97978, 89888, 85635, 88430, 91277, 94561, 95840, 94764, 96234, 92562, 86364, 83847, 85140, 86214, 93469, 102374, 112659, 142281, 181247, 191719, 196760, 219975, 228579, 211465, 211180, 217859, 226522, 238018, 250838, 245329, 233113, 221990, 207718, 192800, 175377, 158084, 140624, 127226, 123584, 119794, 121791, 125770, 128490, 123668, 117180, 116889, 116011, 111024, 102453, 93081, 94376, 99613, 106872, 107991, 100747, 95409, 99877, 103732, 95417, 79586, 69391, 64054, 54225, 42151, 48455, 64394, 67347, 67430, 79016, 103298, 112040, 108189, 114811, 130051, 138986, 135993, 130132, 121614, 105543, 89191, 79785, 72027, 75409, 92554, 107157, 116919, 129356, 168944, 223826, 243774, 238430, 225867, 216985, 221102, 228281, 232627]
7431B32627N63K52J97k468Q36p699r503j2804j6820r993j466l974m073k631k835
7416A60209q749r882j1697j294O982J646N195J9777K7013J7377J0786O150K959
7403B26472L533k995j2097m565P288N326J832M007M420O574M797J156L605P861
7389B57214O067L790M581J5392K5633K3653J8267L3521M9971M0139K3950K3307
7377E25485K3451o845l5957l1399j7098j5333j8256k3261k4860k7739j6461m267
7365C27460j974n080k475Q896K3727K7717J8081J0586J5803K5514K0001k153q616
7352D57487J3699K1930P427l897L844J6426J3140P915P351L973n850j2849j5186
7339E15410j2309j4455j2452K405K7118K4922K0698L2178M2466K3895J2008P309
$$ y = [232627, 233190, 233442, 233639, 231171, 232007, 224308, 214805, 202001, 185181, 175188, 173722, 169748, 165675, 163044, 160209, 151460, 141578, 129881, 128587, 135569, 137215, 142410, 162187, 189200, 206577, 217363, 223513, 226472, 230005, 227010, 214913, 210348, 217636, 222962, 224794, 228801, 233221, 239795, 244592, 245748, 249353, 257214, 263281, 267071, 271652, 287044, 312677, 336330, 354597, 388118, 438089, 478228, 502178, 525485, 548936, 542091, 506134, 474735, 457637, 442304, 424048, 400787, 375927, 348188, 331727, 327460, 325486, 320406, 317931, 326827, 350554, 378271, 396352, 406938, 422741, 448255, 468256, 466103, 457487, 471186, 493116, 500543, 496646, 500490, 516916, 530056, 537971, 545322, 549295, 543445, 530596, 515410, 503101, 488646, 476194, 478599, 505717, 530639, 551337, 583515, 625981, 649876, 661884, 669193]
7327F69193n935k4546k2185p510r059M553J5629J2920l536k556J7591J2310l549
7314F53320O421M2887N4523L7157M2519N5789O7183O5551K4019L547l265k307
7302A047344M0793O7311O8883O6796P2993J12990J25020J12301R3256Q5058R9495
7291A992240J46152J78646J64480J50017J83559K56802K95648K67033K74950L78629
7281D288156N78360Q20440J141498J660718J795527R82772O82573J460774K249119
7272A5659937L31402k297122j274744K5607O87195J133923J679483K403718L323463
7263B1672862M352269N316306O856467R999457J5857955K5678216M1393764N7204334
7255A88331630M5660849J2919637J2966865M3032285N4113080k8716112r8822196
$$ y = [669193, 663258, 638712, 616527, 609017, 599958, 604511, 620140, 633060, 629524, 626968, 644559, 656869, 653320, 659741, 702628, 757151, 794308, 836827, 892616, 959799, 1025350, 1049369, 1052916, 1049651, 1047344, 1088137, 1155448, 1224331, 1291127, 1364120, 1477110, 1602130, 1714431, 1807687, 1892745, 1992240, 2138392, 2317038, 2481518, 2631535, 2815094, 3071896, 3367544, 3634577, 3909527, 4288156, 4866516, 5686956, 6828454, 8489172, 10284699, 11267471, 11950044, 13410818, 15659937, 15991339, 13694217, 12419473, 12445080, 13132275, 14266198, 15945681, 18349399, 21672862, 26025131, 31341437, 38197904, 48197361, 64055316, 89733532, 131127296, 188331630, 233992479, 246912116, 259878981, 302911266, 357024346, 328308234, 229486038]
7248B29486038o9782758l5928335k1298035j6016563j2783525j0090949q244797
7241E5341076o731606n218212m049253l152052k403852j763573j040732k50707
7233C0731089j39384o90133l55808P96774J258468j583199l744728k700584j703517
7224B1868978j240268j102506j036054q45932o69476o41188o56748o39127n84390
7215A4453289n09978m80380m97858m84507m12033l32749l02734k90837k62331
7206A0879882k19851j92658k23098k98370l55528l56758l37583l07559k62532
7197H325945k26492j86083j64522j48655j16033j23266j67369k04071k06419j81713
7187F601322j81549k09772k03265j66970j51707j63133j55981j49037j62071j55963
$$ y = [229486038, 159703280, 123774945, 102476910, 86460347, 73676822, 63585873, 55341076, 48609470, 43391258, 39342005, 36189953, 33786101, 32022528, 30981796, 30731089, 30591705, 29901572, 29545764, 30342538, 31601006, 30017807, 26273079, 23572495, 21868978, 20628710, 19526204, 18490150, 17644218, 16974742, 16333554, 15676806, 15037679, 14453289, 13943311, 13462931, 12965073, 12480566, 12068533, 11735784, 11433050, 11142213, 10879882, 10660031, 10467373, 10244275, 9945905, 9590377, 9233619, 8896036, 8588477, 8325945, 8099453, 7913370, 7748848, 7600193, 7484160, 7360894, 7193525, 6989454, 6783035, 6601322, 6419773, 6210001, 6006736, 5839766, 5688059, 5524926, 5368945, 5219908, 5057837, 4901874]
7177D901874j44982j39409j40724j19396q8651q0155q4880p2358p4340r8008j14790
7166C744181j17167j18269j29340j20652r6538p6968o6820n4275n2367n4434n3376
7155B803975m1969q620J9379J1405l3683k7987J3662L9639o3300j88667j33318
7144B390516p2059n8069n5915m4285k7269l2472n4945o1760n7933m1831m3569
7133A840409m6930m2232m4331n9456o1230m6821l9468m2994l8728l0381k5754
7122A362084m8197l5130j4721k6700m3326m3410l2537k7146k4083k0678j8699
7111A027457j1892j1615j3895j6303o846j791m057o104m648J425j063j4177k9269
7098I07222k8302j7637j6046k3429k4104j9611j9646l3550m5002l5341l2255k9832
$$ y = [4901874, 4756892, 4617483, 4476759, 4357363, 4268712, 4188557, 4103677, 4031319, 3956979, 3858971, 3744181, 3627014, 3508745, 3379405, 3258753, 3162215, 3085247, 3018427, 2964152, 2911785, 2857351, 2803975, 2762006, 2753386, 2772765, 2784170, 2750487, 2722500, 2736162, 2775801, 2712501, 2523834, 2390516, 2318457, 2260388, 2204473, 2160188, 2132919, 2100447, 2045502, 1983742, 1925809, 1883978, 1840409, 1793479, 1751247, 1706916, 1647460, 1586230, 1539409, 1499941, 1456947, 1418219, 1387838, 1362084, 1313887, 1278757, 1264036, 1237336, 1194010, 1150600, 1118063, 1090917, 1066834, 1046156, 1027457, 1015565, 1003950, 990055, 973752, 966906, 965115, 961058, 954954, 950306, 951731, 950668, 936491, 907222, 878920, 861283, 845237, 821808, 797704, 778093, 758447, 724897, 679895, 644554, 612299, 582467]
7086E82467l2364k6870j9687j6282j7075j8299j6169j6060k3050k5962k0383j4082
7074C36184k2021j7321j2989j8362j9123j7052j4365n044J0662P062n184L534
7062B25981L0408N0269K0130j3052j9479k1004k1934j7126j1441m159o717q049
7050B03827r44k961K145J9392K1171O609o08J1906J8164n31r331Q02R80j0267
7036B60354j6614j1552k084l110n208K186J1061K675n647n223m479m202j674p060
7022B09423j8225j1681r77L565J961n549k289j94j937J893k075l737q511p562
7008A54105o066j0620p647n31k43L08L933L631N743Q735J3155J0996R375P45j065
6993A84554n091o568p501j511J033Q2n241r101p779l047o36r38m6K489J521L451
$$ y = [582467, 550103, 523233, 503546, 487264, 470189, 451890, 435721, 419661, 396611, 370649, 350266, 336184, 314163, 296842, 283853, 265491, 246368, 229316, 214951, 209907, 220569, 227631, 222447, 225981, 256389, 306658, 326788, 313736, 294257, 273253, 251319, 234193, 222752, 218593, 211876, 203827, 202883, 199922, 202067, 221459, 242630, 249239, 248631, 260537, 278701, 278170, 268839, 269641, 270621, 260354, 243740, 232188, 230104, 226994, 221786, 223972, 235033, 237708, 232061, 226838, 222359, 218157, 216483, 209423, 191198, 179517, 178540, 182105, 184066, 178517, 176228, 176034, 174097, 175990, 173915, 170178, 161667, 154105, 148039, 137419, 129772, 129241, 128998, 129306, 133239, 136870, 142613, 151348, 164503, 175499, 184874, 185619, 184554, 179463, 172895, 165394, 163883, 164916, 164998, 159757, 150656, 142877, 139830, 139194, 138256, 138210, 140699, 142220, 145671]
6977A45671J164m929r495p068k41J793j599P36q53r118p724n507j2213j4287j0684
6962F5646p639n432j2178j2904J01P693J0050O329K193j204P07L264J338k279
6948E5685J217L581L337k162k525p130r086k070J707Q3K88k983K16L186M091l426
6932D4009o629n152m717j276K355P33j450n50o93k337j875J487N515o64l177o237
6916A9342j702J645M731N77L54N495K811O15j286R98L910oj992m17K958N029K952
6899D6014Q981Q250O238Q038J1142O665L514Q579L310L621O942K438K638m305
6885A22065J740O114J2318R262J690Q146K3510L2266N6038R2455J39860J90373
6873F95837K26233K28379K07730J88093J55772O2667r6918k48096l06984k64295
$$ y = [145671, 146835, 141906, 132411, 125343, 125102, 126895, 125296, 126032, 125179, 116061, 108337, 102830, 90617, 76330, 65646, 58007, 52575, 40397, 27493, 27594, 35287, 45337, 51666, 53859, 52655, 53362, 56626, 57964, 55685, 56902, 60483, 63820, 61658, 59133, 52003, 42917, 40847, 42554, 42637, 42925, 39942, 40158, 43344, 47435, 44009, 37380, 32228, 27511, 26235, 28590, 29323, 27873, 27323, 26630, 24293, 22418, 23905, 29420, 28756, 25579, 19342, 17640, 19285, 24016, 24593, 24947, 30442, 33253, 33868, 32582, 33580, 37490, 37484, 35492, 35075, 38033, 43062, 46014, 54995, 63245, 69483, 77521, 88663, 95328, 98842, 107421, 110731, 114352, 121294, 123732, 126370, 122065, 123805, 129919, 142237, 151499, 153189, 161335, 184845, 217111, 273149, 365604, 505464, 695837, 922070, 1150449, 1358179, 1546272, 1702044, 1764711, 1667793, 1419697, 1112713, 848418]
6863H48418j83657j15681q3625o7685m8844l9109k6340j9069q559m346K444J4032
6851B67979K1558J2818M256J5593K8035J2162l2867l1864j4042n875K039Q715
6839B88507K1082L0512M3289N6061Q0161J30699K28338M04530O80655Q34725M84641
6828C283200J50953L85752Q81996M31776j275094j365098p01634l52583k47015
6819A192253k02084j56326j10121q5034o9990n6560m0319k7855j5803j0534J18
6808D17745Q83j1051q586J3803J5533j8435m1937l2646k4468j9154j6458j5697
6796B59532j4251j2142m070o643p893r545n174n056q772j0490j1072q821n207
6783A50396n277o731P83l206p927n29j388m351m332m697k573p63J496Q85M743
$$ y = [848418, 664761, 549080, 465455, 397770, 348926, 309817, 283477, 264408, 255849, 251503, 253947, 267979, 289537, 302355, 306611, 322204, 350239, 362401, 329534, 297670, 283628, 277753, 279792, 288507, 309589, 340101, 383390, 439451, 519612, 650311, 878649, 1283179, 1963834, 2798559, 3283200, 3434153, 3819905, 4701901, 5133677, 3858583, 2493485, 1791851, 1439268, 1192253, 990169, 833843, 723722, 638688, 568698, 512138, 471819, 443964, 428161, 417627, 417745, 418628, 407577, 398991, 412794, 428327, 409892, 367955, 335309, 310841, 291687, 275229, 259532, 245281, 233139, 229069, 222426, 214533, 204988, 199814, 194758, 185986, 175496, 164424, 155603, 150396, 145119, 138388, 139171, 135965, 128038, 127509, 126121, 121770, 117438, 112741, 110168, 109405, 110901, 111786, 116529]
6768A16529P712R175Q752P462J639j022L315L347r615j3592r433j0388r312m316
6754A00253P06l197n156j592j189k491k103k593l783k106k303K694K101m04m69
6739G8368j612K44K26n83j430j738k267j512N34j56m41J84j039o7j281J775l57
6722F8848q18K145L273P193J2651J6261J0854J0211J7090K8399J1055l315R89
6709A84836J0072J3953J6226P292p749RK1322L6821N3770R5011J67471L02091
6697I01125M69801M29036J38997J12183L85764N43793l16778r47209n61097k63995
6687H91620j54256j21571r3720p5652n9675m1497l3515k8096k2685j1709o012
6676B43232m606m64o659j0386O79J6893O374k7593k3528j3150p978n650o183q034
$$ y = [116529, 124241, 133416, 142168, 149630, 151269, 150247, 153562, 156909, 147294, 133702, 124269, 113881, 104569, 100253, 100959, 97762, 92606, 91014, 89825, 87334, 85231, 82638, 78855, 76749, 74446, 77140, 79241, 78837, 78368, 76756, 77000, 77226, 76643, 75213, 73475, 71208, 69696, 70230, 70074, 69633, 69817, 68778, 68711, 67430, 69205, 68848, 68030, 70175, 73448, 80641, 93292, 109553, 120407, 130618, 147708, 176107, 187162, 183847, 184836, 194908, 208861, 225087, 232379, 224630, 224639, 245961, 282782, 336552, 431563, 599034, 901125, 1370926, 1799962, 1938959, 2051142, 2436906, 2980699, 2663921, 1716712, 1155615, 891620, 737364, 615793, 522073, 446421, 386746, 345249, 311734, 283638, 260953, 249244, 243232, 238626, 238162, 231503, 221117, 221796, 238689, 245063, 217470, 193942, 180792, 172814, 167164, 160981, 152947]
6662A52947n174o559o811k412n900n748l502n371m413k244q540o559l137M32k612
6647H4397l185J30P4j411k133k086j746l000n115o062k669J798J547k206J37J340
6631E9810l190l684k526j959k167j924p28k295n006L61O82p972l951J090K549
6616B9090Q90j6K6L447R40K05l789J226M813j854k096j156l81k805j617j966K045
6599B7002K161J271m19l322n019k461j377L759P06k454j195q4L935J357j969k491
6583A9400q94L192L505M23l725n689j249J449J44r15j645k563K776K872o46k645
6567A3790n342K638l173j530J61m95J888J5m342j233M098j755L65Q72n387K544
6551C114q70r94Q95L8p58k717K363N125r44l063j177l435K304J465k32L414J866
$$ y = [152947, 147773, 141214, 134403, 131991, 126091, 120343, 116841, 111470, 107057, 104813, 96273, 89714, 86577, 87009, 84397, 81212, 81342, 81416, 80005, 77872, 75786, 74040, 71040, 65925, 59863, 57194, 58992, 60539, 58333, 58470, 59810, 56620, 52936, 50410, 48451, 46284, 44360, 43632, 41337, 36331, 36692, 37374, 29402, 25451, 26541, 29090, 29980, 29964, 29990, 33437, 34377, 34582, 30793, 32019, 36832, 34978, 32882, 31726, 31345, 28540, 26923, 24957, 27002, 29163, 30434, 30015, 26693, 21674, 19213, 17836, 21595, 22301, 19847, 18652, 18568, 22503, 23860, 21891, 19400, 18506, 21698, 25203, 25626, 21901, 16212, 14963, 16412, 16556, 15641, 13996, 11433, 14209, 17081, 16435, 13790, 8448, 11086, 7913, 6383, 6544, 6049, 7937, 7952, 3610, 2377, 6475, 4720, 5085, 5957, 570, 3114, 2244, 1250, 2145, 2183, 1425, -1292, 1071, 6196, 5252, 2189, 1012, -2423, -119, 1346, 1114, 4528, 6394]
6534F394m321p61q92o28n1m07M90K347J504j68j260k343j595j660j55L005M439
6517C938K67L797K026k002m284k621k787J339M923o13j984L65K043l548l032L44
6501a829L487K43k289K574M05k166j895j927o97l9l62k218K84J078J345L011R58
6484c7m461n11L542j404L375M27J895k024j588J842K095J946p40M486L667K33
6468A2743m151j700j997j806l501N50R69l98j260N49K729M191L6J007L517J710
6452A3188r46k400J354K087J738q85j913p96p12l506k758kk81N02j920k972K703
6435B481K331r78O26J304p45K176M944o38k485J202j522k943l706n155o39K857
6419h90M162Q52j975k954k565K063N332M96l172j85q43l319j497q07J674O407
$$ y = [6394, 2073, 1312, 420, -208, -259, -666, -176, 2171, 3675, 3507, 2247, -96, -1691, -3351, -3506, -501, 3938, 4205, 8002, 10028, 8026, 3742, 1121, -1666, -327, 4596, 3983, 1999, 2364, 4407, 859, -2173, -1829, 1658, 1901, -388, 2186, 2591, 425, -1470, -3397, -4094, -4133, -4495, -6713, -6429, -5351, -4006, -995, -37, -4498, -5009, -1467, -2871, 504, 931, 2826, 802, -786, 1056, 3151, 5097, 4357, 8843, 12510, 12743, 8592, 6892, 4895, 3089, -412, 138, 1107, 709, -551, -2, 2727, 6918, 6954, 7961, 11478, 13188, 12242, 9842, 11196, 13283, 15021, 14136, 12223, 11427, 10715, 7209, 4451, 4449, 4168, 4670, 2750, -222, 2481, 4812, 3834, 4460, 5764, 5019, 7195, 12139, 11501, 9016, 10218, 8696, 5753, 2047, -3108, -3747, -890, 3272, 4124, 2149, -805, -3370, -1307, 4025, 4521, 1349, 1164, 321, -2998, -4495, -5302, -3628, 2779]
6403B779l11k021l874j30L126L55m11j022J049L469K982M795J296l391l21q24
6387G546M96j078n81k555j374m83l223o88N2P33k986M70J6o18l320j908K453r66
6369h014Q25M634J123J778m355k28K243K862j712j165k057o84L141M409j898N8
6353I60J113J381l500L07J369k559L16r85L48K238K262O56j500l778K382L275
6337D285l342N0k39k467k596o14j2M483K567l075n982N94J186K643L414L244R1
6320D230K247J073M152Q55Q82k719m246m661k427j644n47n70n89j995J721J314
6304b924L808L643l214K675J269m134J87J574o83K39k712K119K592N42J213j796
6288D398Q27j3l223r16K899K158J390j373k233N20K48k049k510N6R00r09j275
$$ y = [2779, 2468, 447, -3427, -3557, -431, -76, -487, -1509, -460, 3009, 5991, 10786, 12082, 8691, 8370, 7546, 8042, 6964, 6383, 3828, 2454, 1971, -1252, -1940, -1888, -1155, -4141, -3671, -3655, -4273, -7593, -9501, -7048, -8014, -7189, -2555, -1432, 346, -4009, -4237, -1994, 868, -844, -2009, -4066, -4750, -1609, 2800, 902, 960, 2073, 3454, -46, 261, 1630, -929, -613, -1598, -1250, 988, 3250, 3906, 2406, -1372, 1010, 4285, 943, 993, 754, -1713, -4309, -4923, -4935, -452, 2115, -960, -6942, -6348, -5162, -2519, 895, 4139, 4230, 6477, 7550, 11702, 12557, 13439, 10720, 6474, 1813, -614, -2258, -2805, -3375, -3964, -5959, -4238, -2924, 884, 4527, 1313, 3988, 5257, 1123, 1310, 2884, 2201, 2440, -272, 1847, 4439, 4981, 6194, 4398, 5225, 5212, 1989, 1073, 3972, 6130, 7520, 6147, 3914, 4434, 4682, 2633, 123, 179, 1079, 170, -1105]
6271a105J455k569j357J425K422L902N07O55k133k364J544r37n75O99j424k187
6255b042k460m17N455L434R18k576l340l869p08N381N4N67j420m000K19J479j177
6238d502J683O15J85j30p33q95l5J216J026J745l93k438k310l56L059K60k640
6221d643J691L29j384j587j132L257K382m32k798j935J397O09Q84J728J769J683
6205A818j215J022q09r61J058J93K365J429k904k382J980J561k888k41r98j174
6189b146l378J34K33N17J315Q33N374j369O20k94k016p5q84k068m659k481L301
6172g043L332r08L83K557N79N78j256r00R72j518j48l974j497L205l48P0K282
6155c634K141K264p4J366J661j932r63Q85k759l577J70r15k083J664j13K024L710
$$ y = [-1105, 350, -2219, -3576, -2151, 271, 4173, 4680, 5335, 3202, 838, 2382, 1445, 870, 1569, 145, -2042, -4502, -4919, 536, 3970, 4888, 2312, -1028, -4897, -5605, -224, -170, 397, -1023, -5023, -4804, -3325, -4502, -2819, -2204, -2019, -2149, -2882, -3777, -3812, -2596, -1570, 175, -218, -2656, -4966, -5322, -2263, -2003, -4643, -2952, -2623, -4007, -5594, -6726, -3469, -1087, -1519, -4317, -6252, -4855, -4246, -3362, -1634, 135, 1818, 603, 1625, 816, -145, 913, 1106, 3471, 4900, 1996, -386, 1594, 3155, 267, 26, -972, -2146, -5524, -5390, -5157, -4640, -3325, -2492, 2882, 1513, 2133, 1839, -177, -252, -1136, -3204, -7863, -10344, -7043, -3711, -4619, -4236, -1679, -1100, -522, -1778, -2678, -1706, -3224, -3372, -7346, -8843, -5638, -5986, -5916, -3634, -1493, 771, 697, 2063, 3724, 1792, 829, 1714, -1045, -4622, -4452, -5367, -7450, -5786, -5899, -3875, -165]
6138a65j327J195J437n24m51k023l907K184N991K963K73l431k209m06L583k63
6122B920l170k232j28m70j092Q94j21Q67k321k868J3N160K720k898l684J172R59
6105d279R88K682j096n95J08p19L379L579L025k99k023l009m32j303k251Q06Q62
6088e77j767l853k232J459N847L808L59j659m221m18P12j977m840m396N581L159
6072e015O64K020Q22K165R21o8M89j45m393k002J503N91j55K503N11k162k751
6055d502l169L077N324n027j346L85L710K222K980j915K94j900l29q78p80J473
6039c81K310P60k50k672K527n81k635q71l184M071K036r60j586k138j177j524
6023f255k49k289j347J147L322N041R99j281j641K83R89j707k266L253J219n067
$$ y = [-165, -1492, -297, 1140, 616, 165, -1858, -5765, -3581, 2410, 5373, 5646, 2215, 6, -400, 3183, 2920, -250, -2482, -2610, -3080, -4172, -3278, -3399, -2532, -4853, -7721, -7708, -2548, 172, -2726, -6410, -5238, -4279, -3291, -609, -1705, -2300, -2192, -2911, 468, 4047, 7072, 6773, 4750, 1741, 1309, 6, -2245, -1439, -577, -2344, -6197, -8429, -6970, -1123, 2685, 3044, 1385, -2836, -3254, -2542, -4519, -9359, -13755, -8174, -5015, -4351, -2331, -1509, 656, 1577, 1509, 1998, 1853, -2540, -4542, -3039, -2448, -2603, -100, 411, -1751, -4502, -7671, -4594, 730, -4297, -5643, -5258, -1548, 674, 3654, 1739, 2033, 133, -196, -1074, -1854, -381, 1929, 2689, 2439, -233, 2294, 1713, -922, -1793, -4977, -906, 1130, 170, -1416, -3554, -4731, -6255, -6504, -8793, -10140, -8993, -5671, -630, 369, -912, -2553, -2270, -1281, -2988, -5254, -2001, -782, -5849]
6007e849q69K460K564N36K961L08k814j859l27J763K303k903R50j57j248j122
5991c303J089K076J008Q83k651m649J627p3j175M54L934P52m63N77j19K275K94
5974B536j51p60M71p34j395p33p75L330j171l636M44q21l72j283Q51O36j099R77
5956c685N399J558j93p61n46k328k302K66j836K44j699j199L492M766K050K606
5940E832j767k405p03j210N54q26l118J395J743J205j931j190l91j310j87Q69
5924c440J624Q40P3M29N092p69l357K266J418Mk101l763K45K346j478p81J468
5907A16K068L148o90l665J043L387k52j475k062O16j125j721J71M32j453K389
5891I27l095N44o8l604L317L106k660R61J492P44J53J639m103k105L969K262q18
$$ y = [-5849, -6718, -4258, -1694, -1158, 1803, 2111, -703, -2562, -2889, -1126, 1177, -1726, -776, -933, -2181, -3303, -2214, -138, 870, 1753, -898, -5547, -3920, -3993, -5168, -4714, -780, -28, -491, 86, -33, 2242, 2536, 2385, 1625, 2096, 1362, -33, -766, -1541, 1789, 618, -3018, -2574, -3395, -3767, -5050, -4199, -3563, -4662, -3685, 1714, 3272, 3079, 2318, 1772, -556, -2858, -2592, -4428, -4184, -5883, -7082, -3590, 1176, 3226, 5832, 4065, 1660, 957, -253, 301, -525, -3643, -2248, -505, 700, -1231, -2421, -2812, -4122, -4309, -3440, -1816, -976, -903, -474, 4618, 3849, 492, 2758, 4176, 4180, 2079, -1684, -1439, 907, -571, -1352, 116, 2184, 5332, 4642, 977, 2020, 5407, 5155, 3680, 1618, 2234, 1109, -612, -441, -9, -1462, 927, -2168, -1624, -1692, -5296, -1979, 1127, -1533, -572, 920, 1664, 1817, 3456, -647, -2752, 1217, 3479, 2661]
5874B661j00K485J004r09l944j671J071k523j549r75M58Q71K277K145M31j141
5858E91k402K399M387L935l278j954m311O06K310k876j24n6r48r56j780K791K081
5841D15j021K754j468m743n58K295m29Q33m75j217j47j470J973P86J739K614N95
5824B476J873R33k939l636l67K803M56r23l648l978l425L420M034K005J040k809
5808b685l319r63j96R12o44l246O85J640J467L51m81N346K407k804r52k229R58
5791c753J605M763j411k841Q74M32l95L544J517l22j593k138o59J953j27j908
5775d59J645Q21j042N29o13n632O92P349L189k018l156l081K379j161j463K696
5759F75n35m76K52P56O61K403L046l133l183p75l571k7L563K260k04j541K229
$$ y = [2661, 2561, 5046, 6050, 5141, 1197, -474, 597, -1926, -3475, -4450, -3992, -3121, -844, 1301, 1732, 591, -1811, 588, 4975, 8910, 5632, 3678, -633, -27, 2283, -593, -717, -773, -1721, -2677, -4457, -1666, 415, -606, 2148, 680, -4063, -4621, -2326, -2755, -1922, -2397, -3614, -3761, -5231, -3258, -2472, -733, 1881, 2476, 4349, 5282, 2343, -1293, -1660, 1143, 1599, 676, -2972, -6950, -10375, -6955, -2921, -916, 124, -2685, -6004, -6967, -7163, -6251, -6895, -10141, -9456, -7816, -6349, -5998, -6479, -1133, 1274, -1530, -2482, -4711, -3753, -2148, 2615, 1204, -1637, -763, -331, -726, 2818, 4335, 4013, 2420, 282, -377, 1576, 1449, -459, 1186, 2007, 965, 1494, 881, -4751, -4059, 3290, 6479, 4461, 1305, -1776, 603, -558, -2021, 675, 140, -336, -84, 672, 1333, 3736, 6782, 3649, 466, -309, -3880, -3907, -344, 1916, 1712, 171, 2400]
5742B400j031m560j026L155L91l190K33j87R14J972n3n77J463K538j519k415J913
5725D21L348k688k92n33j525j61m7k296J237M044j103j650L249l5l684k075p0
5708c860L945K16JJ665P17k222J257L155j454j283l953j608M14M96M88Q53O83
5691d90l995j890J665K925k6K46k24j154j040J311k69k134Q63n66N13J371pQ26
5673b075M611J732j454k03q02l859k959p21K376J839r51N67L085K133j497j309
5657E13j6j487R65M99J608O32K75k50j415j17P81J772J304j314l137J27l11K972
5639C401P94j90o60n97J362k317k333J61m81j896j337N75K511J311l05L63L59
5622G21R02Q7j169k486j489j820j539N58M969J861J934M785j701j356L81QJ905
$$ y = [2400, 1369, -3191, -4217, -1062, -671, -3861, -3628, -3815, -2901, -929, -982, -1559, -96, 2442, 923, -1492, 421, 3769, 1081, 789, 256, -1269, -1430, -1477, -3773, -2536, 1508, 405, -1245, 2004, 1969, -1715, -3790, -3860, 85, 301, 302, 1967, 2684, 462, 1719, 4874, 3420, 2137, -1816, -3424, -3010, -2514, -2026, -1173, -490, -4485, -6375, -4710, -1785, -1811, -1565, -1789, -2943, -3983, -2672, -2941, -5075, -4212, -4778, -4265, -2894, -2901, -2075, 2536, 4268, 2814, 2611, 1809, -2050, -5009, -5730, -3354, -1515, -2466, -1899, 1186, 3319, 1822, 513, 497, -990, -25, 474, 2082, 2714, 2989, 2739, 1324, 1207, 1988, 3760, 5064, 3750, 613, 740, 429, 3401, 4195, 4005, 3345, 2748, 4110, 1793, -540, -379, -860, -2756, -4093, -3518, -1007, 304, -1, 362, 721, 1623, 1710, 541, -1945, -3434, -5254, -6793, -6235, -1266, 595, 2529, 7314, 5613, 4257, 4638, 4646, 6551]
5605F551j15l919j616J391l27l019l060K298j358m77l77j365J738M25j687r85
5589e902n41J950L249j137K668K362n86o15K000q94m657r79K917M341P84j289
5573C671k481n362m565M78N27K391K424M62j539l76J133j025j215J467j56K37
5557c929r37J665l506m58N118M217K262J416o078K3M649P69q36k133j65l959K53
5540a629j605P16K027J54j706j656P06P25P86o24j582r30M311J899L922j180k351
5523A983j250l038j749K127J911k869j423p50L658L107M99J378j8K94L738J994
5507I592P52q25l820l339k46O03P63j33q77j036m339k508n7R40K853K413j428
5490f92j666j967R80p23R85K634K119p43J356l141n744k555N378M308L30k989
$$ y = [6551, 6436, 2517, 901, 2292, 1965, -1054, -4114, -1816, -3174, -3651, -4028, -5393, -3655, -3230, -4917, -5902, -6443, -4493, -1244, -2381, 287, 2649, 2063, 1448, 3448, 2554, -2103, -3082, -165, 4176, 4960, 3671, 1190, -4172, -8737, -8259, -7732, -5341, -2917, -2455, -3994, -4370, -3237, -4262, -5477, -4010, -4166, -3929, -4866, -3201, -6707, -7165, -2047, 2170, 4432, 5848, -230, -207, 4442, 5211, 4375, 2242, 2077, -1882, -1629, -3234, -2518, -491, -337, -2043, -3699, -2993, -2268, -1482, -2106, -3688, -4618, -307, 1592, 5514, 4334, 1983, 733, -2305, -4054, -1927, -16, -2885, -4308, -5058, -1400, 1707, 2206, 3584, 3566, 3860, 7598, 9592, 10344, 9519, 5699, 2360, 2114, 2717, 3480, 3347, 2470, 1434, -2905, -5413, -5470, -4530, -1677, 736, -692, -2358, -4325, -3345, -4068, -3083, -449, 1670, 927, 2283, -858, -6602, -9157, -3779, 529, 859, -2130]
5474b130J95L254j156j8K164l975K563J218l298j487j252n43J72K082l132J269
5458d074K745L032j670j952k738J443J128j666j545q58K308k301R25K819K92j887
5442c999J352j617l240K84M531K47l661%J028K408L320L823J070k383n086j614
5426c537J850j592M35r37N79j484n1l104L879K42J226K148K262J169k373k48J722
5409B186l762m858L087P86j4K589M658j325J033j655m293N0K331p21k24M38L86
5392F92k222p31M41j35j407j678K531k79o15q48p88O37K643K075L61r57M222k049
5374A893m550j097J082K144k82J074p88j538j29K483K631J147j559q95R61k531
5358D6K959p91k210j914K384j42J068k9O27p25M75M95k293m52j077q87L503J213
$$ y = [-2130, -1935, 1319, 163, 145, 2309, -1666, 897, 2115, -1183, -2670, -3922, -4465, -4293, -2211, -5343, -4074, -1329, 1703, 33, -1919, -4657, -3214, -2086, -3752, -5297, -6155, -3847, -6148, -5223, -2404, -2112, -3999, -2647, -4264, -7504, -7220, -2689, -2442, -6103, -6103, -5075, -2667, 653, 4476, 5546, 3163, -1923, -3537, -1687, -3279, -2844, -3781, -3202, -4686, -4737, -7841, -3962, -3720, -2494, -346, 1916, 3085, 712, 464, 2186, -1576, -6434, -3347, -2561, -2575, 14, 4672, 3347, 4380, 2725, -1568, -1518, 813, 92, -132, 306, 692, -1530, -2261, -1820, -1955, -3362, -5040, -2509, -2788, -3403, -4251, -5039, -4402, -1759, 316, 677, -280, 3942, 1893, -2657, -3754, -2672, -528, -810, 264, -524, -2062, -2191, 292, 2923, 4070, 2511, 1616, 2577, 46, 3005, 2214, 4, -1910, 474, 332, 1400, 1371, 1998, 1273, 1748, 2243, -50, -502, -1579, -2466, 1037, 2250]
5340B250k496j580j506k635j477J231K983k07j791J790J148N392m70m892j212
5325c472J690K110J123K175k161o82l056m390J383J682O84k021L556N109L87j558
5309B559r25l94L9J78K16r60L90j460J568k5l788k84j511J936j0j080k651R26
5291e276M244m365n10J500J844K60J25J48M28q46n85j171J205M240J077Q23K02
5274C343j389k85o45l340l041l228M39K361j541N5K102L060k599r15L504q38k82
5257c239J262N15k51J837L660l585l271J09J153J895k92K739R47l766m936l598
5241h821J716K069K401K779j401j850r99q85j580K381L474j185O18J115l588n425
5225i181J497L486J698J493nk433k473R5L621O718J43j034j135j86N79j270m732
$$ y = [2250, -246, -1826, -3332, -5967, -7444, -6213, -3230, -3437, -5228, -3438, -2290, 3102, 2632, -2260, -3472, -1782, 328, 1451, 3626, 1465, 783, -2273, -6663, -5280, -3598, -2914, -4935, -1379, 3730, 4117, 2559, 1634, 1240, 1279, 1457, 1673, 713, 1103, -357, 1211, 1186, -2602, -2886, -4397, -2461, -2471, -3551, -6202, -5276, -1032, -5397, -5907, -4407, -2563, -2303, -2178, -2030, -1602, -2448, -3033, -4204, -2999, 1241, 2318, 3141, 3343, 1954, 1669, 1024, -2316, -5357, -8585, -8146, -5785, -7326, -7271, -5169, -2109, -4708, -5623, -2119, -2957, -3239, -1977, -1462, -1713, 124, 3784, 199, -3072, -2963, -1810, 85, -207, 2532, 3479, -287, -5223, -8821, -7105, -5036, -2635, 144, -1257, -3107, -4106, -4991, -6571, -4190, -716, -1901, -1283, -168, -3756, -9181, -7684, -4198, -2500, -1007, -1012, -3445, -5918, -5823, -2202, 4516, 4659, 3625, 2490, 2304, 2883, 1613, -3119]
5208c119L337P93Q39l645q03N40K601J53j620m24J14K273K434k435O13K574l676
5191E49l20J381J351n60j719n098j532j053K489K413J540J395p90P44o13j606
5175a429J63J918K057l332l360J000j321m221m78L429K703K793k37k052J2K14
5159b141k183K871J445j682j327L299J933j247j262l270k645k475p2M888M619
5144G51L412R82n015k264M11P5J97J049K470r70P01j321k414j055q10L047J862
5127A108L46N79k511N98K732J658J068n767j329Q63j408J564N22J260K223Q29
5111D335k389J889M94k427o31j487O30n21k35J221K334j107j354K658K704j749
5095D365l435K268J643n04l162j257K06n12r41L87k666N76L868K337o85K481M11
$$ y = [-3119, 218, 1011, 1850, -1795, -2598, -2058, 543, 696, -924, -1348, -1234, 1039, 3473, 1038, 1651, 4225, 549, 229, 1610, 2961, 2401, 682, -4416, -5948, -7001, -4512, -2099, -559, 836, 46, 790, 177, -1429, -1266, 652, 2709, -623, -3983, -2983, -4304, -8525, -9003, -5574, -2871, -78, -315, -2367, -2355, -2141, -4324, -1453, -8, -1690, -3017, 282, 2215, 968, -294, -3564, -6209, -8684, -8756, -3868, 751, 4163, 5145, 130, -2134, -1723, -1648, -1451, -402, 2068, 1098, 1799, 478, -1936, -2991, -3801, -754, 1108, 1454, 2033, -478, 120, 2852, 4510, 5578, -189, -1518, -655, -2063, -499, 23, 1283, 3506, 4335, 1946, 3835, 4329, 1902, 1271, -216, 414, -107, -342, 879, 3213, 2106, 752, 3410, 6114, 4365, 930, 3198, 4841, 4337, 1175, -82, 124, -388, -1329, -942, -3608, -3032, 836, 3173, 2488, 4969, 5380]
5078E380J746J317m722l959J189L056J441l248j24K138K12O34k53l466k134k59
5062a052JJ320l88RK201j366m772j277J134K184j958j167L219P72k27k516j359
5045e242n24N67N376k225k363K722P22K387l22J491n02m234j148n60L46l59O67
5028c201J869j315L164J523k447j596m28M741M58k113j967k426J648M73j458j123
5012d198K318J980J747k555l18R20j329Q21j518j773K534j402r48j687j07J902
4996c613j564q11M184J644L21j080o87J610K921M115j840k001J40k056O3j247
4980I9Q78J976J235m777m424L472M182K485l35n27l277r25r4K048L62r65k731
4963a318P15L037j260j58o1K393L67k936J228j524k077k891J678Q13M275M427
$$ y = [5380, 7126, 8443, 3721, -238, 951, 4007, 5448, 2200, 2076, 4214, 4426, 5060, 4807, 1341, -793, -1052, -1051, 269, -119, -110, 2091, 725, -4047, -5324, -4190, -2006, -3964, -5131, -1912, -1140, -1367, -3883, -5242, -5766, -5199, 177, -2048, -4411, -1689, -967, 1420, 1098, 2589, 2087, -2147, -3295, -3855, -3509, -3868, -3201, -1332, -2647, 517, 2040, -407, -2003, -2431, 2310, 2768, 655, -1312, -3738, -2090, -1617, -3075, -4198, -1880, 100, 1847, -708, -1026, -106, -1435, -614, -2132, -3905, -1371, -2773, -3721, -5408, -5515, -3613, -5177, -5988, -1804, -160, 161, -919, -1606, 4, 2925, 7040, 5200, 3199, 3339, 1283, 1346, 99, 977, 2953, 4188, -589, -5013, -1541, 2641, 5126, 4791, 4264, 987, 62, -32, 2016, 2378, 1413, -1318, -603, 2434, 1174, 1016, 955, 3348, 3715, 779, 2007, 483, -1594, -4485, -2807, -1994, 2281, 6708]
4947F708o43j347l852Q97j054k379j198m93J371J824L89j073J83J246n53l62n67
4930i03J236k658r89M320M018n61P75K71Q60o42j581J387j612j869j436j194L934
4913C356K551q46m320j533J163r2j73j70J394k735J796K202P44M42m00M37r68
4896B848k074l367l28l60L55M761J725k105P36p72l061k78L689n86K479N93l181
4879A074n58K583l119j839L004k11k750k934o75K2P12L35K437l29p23J184R73
4862h14L07m43q49j787N51j239j352K980M747m02l167J429K909j631m89L459j21
4845D088k793j568J763o99Q33K198N61m32k968j381l87m83k418J530l2j276q31
4828d295J592L025J674j7L37k351q41M582K807K01l943k455J79O63n20k267m585
$$ y = [6708, 6065, 4718, 866, 1763, 709, -1670, -2868, -3361, -1990, -166, 223, -850, -667, 579, 26, -336, -903, 333, -2325, -3314, 1006, 5024, 4463, 5238, 5509, 6369, 5727, 4146, 5533, 3921, 2052, 616, -578, 3356, 5907, 5061, 741, -792, 371, 279, 106, -64, 1330, -1405, 391, 2593, 3337, 3779, 3379, 3816, 2848, 774, -2593, -2921, -3281, -2926, 1835, 3560, 1455, 2191, 1419, -1642, -1920, 1769, 1183, 3662, 4255, 1074, 516, 3099, -20, -1859, 1145, 934, -1816, -4750, -5425, -5403, -4691, -4356, -1919, -2248, -2971, -1787, -814, -507, -950, -1799, -3586, -3035, -4274, -5626, -2646, 2101, 1699, -1468, -39, 2870, 1239, 750, 4209, 4088, 1295, -273, 1490, 791, 1624, 3822, 4383, 3951, 983, -398, -785, -1268, -3686, -2156, -2188, -3464, -4295, -2703, 322, 1996, 1979, 2316, -35, -876, 3706, 6513, 6714, 2771, 316, 495, 1158, 638, -1629, -6214]
4811f214J103K433J270N51j195n74o08k63K265Q43k380R64j452p15j745N98k35
4794e354j108P88k30J878K687r83J108j287m086j694j942K135J523K014L64k04
4778d391J222j779J580J731q6j265k150M18K233p65l462m87K277j036L782O327
4762D149L673n58o736l869l83L35K492n012K833K894L464j9l773J115M088Q41
4746E534K17k74l87J781k08n478l227M18J738J506k260%K955j091n025N61N479
4729B239l328m334j806N64K27j113N79J934R39m071j020P10J684L890K650J232
4713I76k570L40j202J841N42r4j314m150K919J284K119Q87j268K734m07j033J453
4696C057n215o799l59L023L727N487J750m270j358j984j844J332J627L56K480
$$ y = [-6214, -5111, -2678, -1408, -857, -2052, -2626, -3234, -3497, -1232, -389, -2769, -1805, -3257, -3972, -5717, -5119, -5354, -6462, -5674, -5904, -4026, -1339, -2322, -1214, -2501, -6587, -8281, -10223, -8088, -6565, -4551, -4187, -4391, -3169, -4948, -3368, -1637, -1723, -2988, -5138, -4720, -2487, -3252, -6714, -7201, -4924, -5960, -2178, 4149, 7822, 7264, 528, -3341, -3724, -3389, -897, -5909, -3076, -182, 3282, 3263, -510, 605, 4693, 5534, 5751, 5477, 5090, 6871, 6663, 1185, -2042, -1624, 114, 1620, -640, -640, 2315, 1224, -3801, -3240, 2239, -1089, -5423, -7229, -6665, -6438, -7551, -6972, -5038, -4099, -8170, -9190, -8480, -6796, -2906, -256, 976, -1594, -1254, -2456, -615, -73, -167, -1481, -5631, -2712, -1428, 691, 1578, 310, 3044, 2637, 1604, 3057, -2158, -8957, -9316, -6293, -2566, 2921, 4671, 401, -957, -2941, -4785, -3453, -1826, -1470, 1010]
4681A010m7k463j261J444K62l808l701k449M71J543L569l53l61J497P24L425J863
4664A365k347p26j337o76K447K421j341k571K982J79n3j625J579J844P08q20k339
4647c10m734p47P32p11L001O170R36P22M67k393l760r07j520J452M2l487k156
4630g203K627N408L898k963k923j042R92k81j433J533L147l110n98J995R57K30
4614A234r40j520k568K81J289N18k467k449j660J385L189L516J657P43m48O77
4598B437K063K665k221j490l23J055k182k340m409J595M153j597j294J048K853
4583B013m080J072O17M77j208R37j682k942L390L40K075r53J636J687j054l225
4567i00m06K781j918p16J551j928l169j282l49O14j747Q27O558P6q13k451j169
$$ y = [1010, 963, -1500, -2761, -1317, -1055, -4863, -8564, -11013, -10542, -8999, -5430, -5783, -6144, -4647, -3923, -498, 1365, -982, -1708, -3045, -3721, -1274, 1147, -194, -2765, 217, 396, 343, -1282, 297, 2141, 2849, 2029, -310, -5044, -5791, -5059, -5770, -2769, 3401, 4337, 5059, 5526, 3133, -627, -1534, -3054, -1602, -1560, -5047, -7203, -4576, 832, 4730, 1767, -1156, -2198, -1206, -1487, -2920, -1387, 1760, -1350, -1948, 47, 1004, 1234, 294, -1226, -3794, -3513, -2224, -1706, -4173, -6622, -8282, -6897, -3708, -192, 1465, 2208, 1760, 2437, 4500, 7165, 4944, 3454, 3131, 4186, 2004, -336, -4745, -3150, 1003, -594, -1888, -840, 2013, -2067, -995, -378, 99, -1109, -172, -1854, -4796, -1406, -1066, 1009, 56, 1692, 3379, 2325, -900, -1306, 1475, -443, -1159, 392, -1536, -4705, -5987, -6336, -5722, -7469, -6642, -84, -8, -821, -3272, -4441]
4550d441L648M865n91J166n64k6j3j50L75N86n87j967j874j75k144r58L437L092
4532C679P73P81n61k527K316j33k038P51k471l499K212r35J236q32J430O55k623
4515a786m25L23j657K294K738J397j402r10J979K645l252n181n02q48J782l194
4499e999k70L401J178k09o9J98J369r66N45J099J172J749K155k26k653m38p34
4482A302k731K235J711p67J120j146l460j388q19j940J100J68J157L20Q52m03
4466b689m16K627J517p02l713j406M34J115J126L144J62J78j098k969K94J06R51
4449a339Q61k5j58j170K91L819J37j589N04j315j847k412K751K88K356J271k200
4432B23k454K56K871j692k352q90J746m70j424j279p15R40K694j96k227M180L034
$$ y = [-4441, -793, 4072, 3481, 4647, 4083, 4057, 4044, 3894, 4269, 4855, 4268, 2301, 427, 252, -1892, -2850, 587, 3679, 4452, 5233, 4672, 2145, 4461, 4328, 2290, 3041, 570, -2929, -717, -1652, -416, -1248, 182, 837, -1786, -2211, -1888, -3545, -1251, 1487, 2884, 1482, 572, 2551, 5196, 1944, -3237, -3739, -4587, -2805, -5999, -6269, -2868, -1690, -1899, -1968, -1770, -401, -1367, -822, 277, 1449, 3198, 5353, 5127, 2474, 2036, 1302, -1429, 806, 2517, 1750, 2870, 1724, -1736, -3124, -3943, -5883, -4783, -4615, -3458, -3138, -2286, -2689, -3105, -478, 1039, 337, -3376, -4782, -4348, -3233, -2107, 1037, 1199, 1377, 279, -2690, -2396, -2290, -1339, -478, -503, -661, -1831, -1540, 2279, 2416, 827, 1331, 16, -1831, -4243, -1492, -1204, 1152, 2423, 223, -2231, -1975, 896, -796, -3148, -4038, -2292, -2762, -4186, -5465, -6180, -5240, -2546, -2742, -4969, -789, 2245]
4415B245k184l015j188J343N367Q39m756m608L786J480R88J348O93Q18O34J170
4399D960J423l3O03l424L0q05k91l398l670J34N743K455k947m225J063M43k801
4382d740J892L470M55k380k104m81M297J036J27k783M45o23J364K193m89M53k209
4365g7l62m018n47J100J189M25p4p66K917K642k374j320J413J394q73R34J42N87
4347B332l524p16j633k001Q58J414J408J668J330j420n55L705K961o60l741n045
4331c619k315Q29K76R82R47J193J438J390J084j244j716J915R89m520J32K767
4315E28p37n81Q61J043K885j08J398l88p87k907j313O74K4q0j270K222p3J715
4297C106q90k312k101R78q59O29M44k291j200l8Q06J730o28K421K372L25l841
$$ y = [2245, 61, -2954, -4142, -2799, 2568, 3407, -1349, -5957, -2171, -691, 297, 1645, 2338, 3156, 3790, 4960, 6383, 6350, 6953, 3529, 3559, 2754, 2463, -935, -4605, -4471, 1272, 3727, 780, -3445, -2382, -1939, -4740, -2848, 622, 1077, -1303, -3407, -3888, 409, 1445, 1572, -1211, -766, -1389, -25, 2168, 1679, 2132, -77, -439, -4457, -5004, -3904, -2715, -2290, -2364, -3130, -213, 2429, 55, -1265, 148, 1542, 669, 1603, 1745, 2332, -1192, -1908, -3541, -5542, -4684, -3270, -1862, -194, 1136, -284, -839, 2866, 5827, 5167, 1426, -3619, -5934, -5105, -4829, -3847, -2900, -1707, -269, 1121, 2205, 961, -755, 1160, 2149, -2371, -2239, 528, -209, -790, 71, 1114, 3999, 3891, 5289, 4901, 4114, 1207, -106, 568, 592, 512, -758, 1464, 1391, 3106, 2216, -96, -2197, -1219, -2078, -1449, -1005, -3296, -4496, -4534, -3728, -1998, -2626, -205, 2167, 2492, -1349]
4280a349k505r10q58M004J350O95J475j509m770j506L462n05j852j89M875M581
4264D489l260j531k313K326L396K253R3l197p3r3m112o61M167J700J196j232m85
4247B663k124On93N35l127m357L890J97q09n86j739r37K756J495k734K745J686
4230a033M84o78k73J206l62k14n68q59k919N29K124Q82k672N9L220P46M4J127
4212H43j560l67l681l47j062J401J485k61L604o71P75M248L73o56j653j571K299
4195C199n06k962j393l080k188n19L636P90m35ML451O57j460k961L101J991k034
4178g09j608O8K766J185J393J350q23n161k532j85J810K542K295j046n90j343
4162e88l367R67L010K093O45J093k272L65j715m661p70N010K912k418l171k574
$$ y = [-1349, -3854, -4764, -5622, -1618, -268, 427, 1902, 393, -4377, -5883, -2421, -2926, -4778, -4967, -92, 4489, 1229, -302, -2615, -289, 3107, 5360, 5453, 2256, 2183, 2090, -2022, -2683, 1484, 3184, 4380, 3148, 2663, 539, 545, -48, 487, -2640, -6997, -3107, -2910, -3719, -4305, -6044, -6981, -4225, -2730, -5464, -2719, -1033, -549, -1227, -1500, -294, -656, -870, -1438, -2297, -5216, -4687, -2563, -1681, -4353, -4294, -1074, -328, -284, 843, -717, -1084, -4765, -5112, -6174, -4773, -3288, -3549, 55, -616, 159, 4407, 4780, 4124, 2471, 900, 3199, 2693, -269, -1662, -4742, -6930, -7449, -3813, -3023, -3458, -3454, -3, 654, -806, -3767, -666, 1325, -709, -2317, -2249, 517, 1702, 3095, 4445, 3622, -1539, -4071, -4256, -2446, 96, 2391, 1345, 755, -588, -3955, -2988, 22, 2115, 2760, 3853, 1581, 1946, 231, -4430, -5200, -190, 2722, 304, -2867, -5441]
4146e441j416j718L576L162q94J126R96k192K39K65K17J501J927J336K02j375
4130A511L16K690j889n751l316M318K533j142J191Q2J8M05k397P71L79nl110K590
4112h06L513K252r68l080m310j570r5J048R58K108L604K706k112M57q61j341j835
4095c32L54J415l562l75n41L09M857M152j702n542q28j09j054j193r32J250l4
4078c867o3K873J010J554K640p39o30j499j308M992j345p05l05j958N45K230M
4061C429k234q44K081K740j29k808j630k102r85J004M77K608j40l702Q48K547
4045A160k134J032J293j828r89J961L771J98l392k793J760K010j225o26K133L439
4029E770j823l279P74K311p10l145j633p93N6J163J768q27k077m01O72J632n7
$$ y = [-5441, -6857, -8575, -4999, -1837, -2731, -1605, -609, -2801, -2562, -2297, -2080, -579, 1348, 2684, 2886, 1511, 1827, 4517, 2628, -3123, -6439, -2121, 412, -730, 461, 543, 561, 966, -1431, -660, -281, -286, -3396, -806, 2707, 4959, 3991, 911, -3399, -4969, -5064, -4016, -3058, -950, 2654, 5360, 3248, 3705, 2844, 1503, -332, 22, 1437, -2125, -2500, -3041, -2732, 2125, 6277, 4575, -967, -1795, -1904, -2958, -4151, -5083, -3833, -3867, -3930, -1057, -47, 1507, 4147, 3408, 2778, 1279, -29, 4963, 3618, 2913, 2608, 650, 1195, 3425, 3429, 1195, 351, 2432, 5172, 5043, 2235, 605, -1497, -2482, -1478, -1001, 1607, 1467, -2235, -1387, 1160, -974, 58, 1351, -477, -1466, 495, 4266, 4464, 1072, -1721, 39, 2049, 824, 198, 2331, 5770, 3947, 668, 1442, 3753, 3043, -102, -1735, -2528, -2472, -1309, 459, -368, -2445, -2846, -2174, -542, -599]
4012e99o56L613L673m84J094j568o765L02K752q26J191J011k318j04m75j994K697
3995E44K828j333j914k321J973Q73j436K204L079o87k030n761j50N382J583l17
3979B517L52k232O14n49K97J413J689p79m104l224P43J494p41k128L36Q5L256
3962i61L163j929j543K488l53n327L55O96o51K401p23J384j896r46J961J980n0
3945D9n31L803j708k891J920l43m90M93k356o71k106o06l898n34P08n67J757L127
3927d844K803J04k864L047K823J561j552n62k944J658K724N09j764k22j298O76
3911a45k160r55L40J721j566K96R11l520J400lj119L468L291J832k768n059k049
3894f085M203M007m30o71J321N28l235j143l394o58m70N7K411R32k485N66o3q00
$$ y = [-599, -1255, 2358, 6031, 5547, 6641, 5073, -1692, -1390, 1362, 536, 1727, 2738, 420, 316, -159, -2153, 544, 3372, 2039, 125, -2196, -223, 650, -786, 1418, 4497, 3810, 1780, -3981, -4131, 1251, 2834, 2517, 2869, 637, 1251, 702, 999, 2412, 4101, 3322, -782, -4006, -3263, -1769, -2510, -4638, -4302, -4217, -961, 2202, 273, -1270, 1218, 865, -4462, -4107, -3411, -4062, -1661, -2384, -1000, -2896, -3842, -1881, 99, 49, -482, 3321, 1613, -1278, 642, 299, -191, 302, -2054, -2725, -4831, -5437, -9335, -9869, -9161, -9728, -7971, -4844, -2041, -1937, -4801, -1754, 1069, 2630, 1078, 516, -2428, -770, 1954, 2463, 699, 477, -821, -145, -2305, -3260, -2920, -1199, -2765, -2469, -1558, -5078, -3678, -3681, -4800, -1332, 1959, 3791, 1023, -4036, -6085, -1882, 2125, 1695, 1024, 2345, 2873, -362, -1505, -4899, -5557, -6027, -5970, -3559, -2627, -5112, -4546, -4609, -5409]
3876e409R97L368K579j795l180k629j949J556K944M586j100j885J935j012j853
3861b847j218J683K476m52L220r18j469k072k337j683k086L213K816J226L169
3846B721K070k944j354J575j436k739J197M85N54K356k041j916q10Q52K881k433
3830i82n47m81r32k249k01L119P01L521j893k289j214j89m96j693P09N405O071
3813F360K140j869m186k501j058j093K728k717O80j080j349M47K05J631j464J99
3797b927K3k013L52M6m60M142M137r36m180l858m63k702L908M090j737R85P60
3780h33l32j703j104L521j78k779j21k655M567L053J484m4P22j350jj58L056k476
3762B669k114K61j229J915L46k875j533K104R86j569k269J199K993k26j126k905
$$ y = [-5409, -4412, -1044, 1535, -260, -3440, -6069, -8018, -6462, -3518, 1068, -32, -1917, 18, -994, -2847, -4065, -2382, 94, -358, 2862, 1944, 475, -1597, -3934, -5617, -7703, -4490, -1674, -448, 2721, 4791, 1847, 493, 2068, 632, -2107, -910, -425, 129, 2485, 444, -1472, -2282, -1430, 1451, -982, -1529, -2010, -2942, -5191, -5392, -2273, -1572, 1949, 56, -2233, -3447, -3636, -4132, -5825, -5116, 289, 6360, 8500, 6631, 2445, -56, -1114, -2207, 521, -2196, -1516, -2596, -3945, -3498, -3293, -1662, -3126, -2927, -2904, -4917, -4565, -4519, -4979, -837, 3300, 2364, -1816, -5674, -6137, -8839, -4931, -841, -2578, -1593, -833, -1165, -2868, -3972, -451, -629, -3408, -3529, -6184, -1617, 1436, 2920, 2876, 3598, 2248, 2247, 2089, 5145, 2669, 555, 816, -413, 1502, 1848, -1027, -2560, -456, 530, -1039, -3308, -2109, 884, 658, -468, -3373]
3746c373J786K300L99J988J687j465j4m795K07J621k922q7M276K119n49o058j938
3729d818L570R49J417j285m910j29K39m15K228M880J449J27m658n758K211K974
3713a929L183R44l312k568j067J589o60j8L077O80J676k45k179k217K474k513
3697c085k806j860J832M366j228J20m66R68L197J075k758j594L30l05J429j327
3681b112N93J676J722k574k118r34J747q3J277J000j642O227j240j104r50j821
3665c36r79j851J110K792J204j045k683L58L119K193J819J17k6l137k19J533L22
3648D291j178j617n648m603k22L387N103q50k526L90J664J441M388M221j253k734
3632D254m51J574j977q13L563q46j49j288j606k813P64J023J290j162l403q63
$$ y = [-3373, -1587, 713, 1112, 3100, 4787, 3322, 3308, -1487, -1280, 341, -2581, -2668, 1608, 3727, 3178, -2880, -4818, -1248, -299, 1118, -167, -5077, -5206, -4967, -5382, -3154, 1726, 3175, 3302, -1356, -7114, -4903, -1929, 1254, 2198, -1114, -3682, -4749, -3160, -3820, -3838, -761, -81, 1595, 1350, -829, -3046, -572, -3085, -5891, -7751, -5919, -1553, -2781, -2661, -3127, -2159, 1038, 2113, -645, -2239, -1909, -2214, -785, -2112, -1519, 157, 1879, -695, -2813, -3747, -2000, -2083, -806, 194, -1448, 4779, 3539, 2435, 1485, -336, -1315, -3166, -2056, 736, 1940, 895, -1788, -1430, 1689, 3882, 5701, 5818, 5792, 2655, 2436, 3969, 4291, 3113, 1496, -4152, -8755, -8977, -5590, -487, -1337, -3863, -3473, -1809, -368, 4020, 8241, 6988, 4254, 3803, 5377, 3400, 2587, 6150, 5304, 5155, 3867, 2261, -552, 212, 1235, 2525, 1363, -2040, -2903]
3616b903K103P49j572l198j09K286L802M048J936P14n602k193J85o88k616N67
3600b491K220J120K060N1L26N70k481J5j730k989J277J276r78P52j049n03J973
3583e81J898m203K39k74K529K715J446o72r72R26K262l219k463K185k30K1o9K11
3565A749j049N07k607j654j799j859M265P41p65j909K435K589K118j943m45M35
3549H09q7N3K18K489K047J530j31n747O81o2j030O38K94j408j318J291j611R87
3531c57l0k965l879m1q22K858R95l137L808M928L76Q37j531j956j036l96J930
3514d18L005r28K30j336o29k834k641K773j999L440M90j199J386L90n146p86N2
3497f150L022J44J017J275k39k438j733p02M671J982n62k317k6N83J611m842M12
$$ y = [-2903, -800, -51, -1623, -4821, -4930, -2644, 1158, 5206, 7142, 7856, 2254, 61, 246, -442, -3058, -2491, -271, 849, 2909, 2960, 3286, 3856, 1375, 1390, -340, -3329, -2052, -776, -1754, -1002, -2051, -2554, -581, 1317, -2886, -2647, -2921, -392, 2323, 3769, 3097, 2125, 3051, 5313, 2094, -369, 1816, 1586, 1607, 1538, 1749, 700, 1207, -1400, -3054, -4853, -6712, -2447, -1706, -2471, -4380, -1945, 644, 2762, 819, 374, 809, 722, 775, 993, 3482, 5529, 7059, 6928, 1181, 1862, 1800, 770, 1408, 1702, 294, -1024, 267, -1344, -357, -387, -3352, -7231, -7272, -8094, -5236, -4241, -7378, -3570, 1358, 1734, 2571, 1040, -916, -1952, -2348, -418, 2587, 1659, 1889, 553, -76, -2910, -5551, -2778, -4777, -1337, -847, -2046, -660, -270, -5416, -6202, -6150, -3128, -2984, -1967, -692, -931, -3369, -5102, -5804, -1133, 849, 287, -2030, -2056, -1473, 138, -4704, -4292]
3480d292Q36l17j503L396J221K575K411J115k0n6k999l391k385j634L164j134
3464c013m546r37L540J506J313j15K732J87J282j367j336M061K246j650k360J226
3448B769l722k280M69K285M486K00m658l742J36P42j680m105K103K432N231K805
3432C471j589k999p55O21J149o2j04j20p33N54R50J538j31j995K763L101j865
3415C794n239J246p43J42m57M252J188l52K359p25K655j183k351p88l12o01k048
3398H37j172q09j193O05P39Q61l61n88L326J074q91J106k000l380j985J692L54
3381a785k134k3O11J657n58n436O36J621K144J648m716o60M000J171J94J279n40
3364h91k107K564M413J457l978j981J666M58r51l303J336K091j049j257L904m370
$$ y = [-4292, -3456, -3773, -5276, -1880, -659, 1916, 4327, 5442, 5422, 5366, 2367, -1024, -3409, -5043, -1879, -3013, -7559, -8496, -4956, -3450, -2137, -2252, 480, 667, 1949, 582, -754, 3307, 5553, 3903, 1543, 2769, -953, -3233, -2764, -479, 4007, 4207, -451, -4193, -4057, -3315, -4995, -9100, -6997, -4565, 666, 3471, 1882, -1117, -1872, -1251, -102, -164, -268, -388, -1121, -567, 383, 1921, 1790, -205, 2558, 5659, 3794, -1445, -199, -942, -800, -1257, 2995, 4183, 3831, 6190, 5465, 8120, 6937, 4586, 3798, 3486, 2885, 837, -335, -1144, -2337, -1732, -993, -132, -493, -1081, 2245, 3319, 2428, 3534, 1534, -1846, -3831, -2139, -1785, -3919, -3942, -3331, -1674, -2232, -7668, -7032, -5411, -3267, -1619, -6335, -6995, -2995, -1824, -1630, -351, -891, -2998, -434, 3979, 5436, 1458, -523, 1143, 1601, 650, -2653, -1317, 774, -275, -1532, 2372, -1998]
3348a998l893o77K170J955J753N96J256R0m82R23J999Q6k174J10j649l073j466
3331d474J041K617J80j69K897K682K760p04k248m328j017o3K925j115J157J245
3315C386r57r01l883m022k249L059K825J569K171J53K085J471J326m97M57m725
3299A268k391J300J438l487K30K760M74K236j563k87n87L29k649J39q99r11M45
3282b155M52Q03q1L375m264m563o38J364L503L495j078n08J780l662r74J831J112
3265b08k150K61K562j283R32K316M41j172J063l49J04j79k913J773J187L75j23
3248B637j592k411l294J52p93j067J190K896J990p21l95l15K304J391K728n04
3232D196K301M03n955l895K093J814O19k195J778R51k450j531N30L051K290j284
$$ y = [-1998, -5891, -6568, -4398, -2443, -690, -94, 1162, 1252, 770, 1693, 3692, 3778, 1604, 1714, 65, -3008, -4474, -3433, -816, -636, -805, 2092, 4774, 7534, 6830, 4582, 254, -763, -826, 2099, 984, 2141, 3386, 2429, 1528, -2355, -6377, -8626, -5567, -2742, -1173, 998, 1151, 3236, 4707, 6033, 5536, 5993, 1268, -1123, 177, 1615, -1872, -1642, 1118, 1592, 3828, 2265, 1978, 1391, 1720, -929, -790, -1689, -2600, -2155, -1703, -900, -981, 2394, -1870, -6433, -7071, -5707, -2204, 1291, 213, -295, 1485, -2177, -3151, -1320, -208, -2358, -2097, 465, -818, 114, 2430, 2871, 1699, 2762, 2413, 2517, 2338, -575, 1198, 2385, 2760, 2637, 1045, -1366, -4660, -4508, -5301, -6368, -5178, -2282, -292, -1013, -1408, -1723, 581, 1972, 4700, 4196, 6497, 6900, 945, -2950, -857, 957, 1576, -619, 1159, 2110, -340, -1871, -1341, 1710, 4000, 2716]
3216B716J95j814K943l886k125L882p98l766L27L118k563Q55m08R93M35L76k780
3199b300j4J127j86m32j755L247J957q94j184R08n386o4M802J037k670n07J87
3182b127J749n49k028Q26P42o83L262j499N04N45mK665L737J793m51j08k952k164
3164C258j419q09l067k590n62K686M598J850j653k775p21K675k8k047j890j573
3148d067j172J059j083L10j07j017L6J252J130K140L22p76j345k00Q86q77K738
3131g71K684K583J338j070k350j683m461J766J319J614j372K457J705p20j498
3116A541m51L360M48n622l367k48J734K654L084j170j423K60k813R33L063k751
3100g68m427l51K166K097j083k171j825K29J415l96M704k243l388j46N187N086
$$ y = [2716, 2911, 1097, 4040, 154, -1971, 1911, 1113, -2653, -2326, 792, -1771, -916, -1324, -331, 104, 480, -2300, -2314, -1187, -1373, -1805, -3560, -313, 1644, 750, -434, 474, -4912, -4976, -174, 863, -1807, -2314, -2127, -378, -927, -2955, -2129, -1387, -2070, 1192, -307, 197, 742, 738, 3403, 7140, 8933, 8482, 8374, 5422, 3258, 1839, 1030, -2037, -4627, -5189, -2503, 2095, 3945, 2292, -483, -1204, 1471, 1443, -604, -2494, -4067, -5239, -4180, -5263, -4953, -5060, -6077, -6041, -4789, -3659, -1519, -1197, -1973, -3318, -3518, -2632, -3509, -771, 1913, 4496, 5834, 4764, 2414, 731, -3730, -1964, -645, 969, -403, 2054, 3759, 3039, 1541, 1090, 4450, 4898, -724, -4091, -4339, -2605, 49, 3133, 1963, 540, 800, -2013, -1080, 1983, -768, -5195, -5546, -3380, -1283, -2366, -4537, -6362, -6133, -4718, -5114, -410, -2653, -6041, -6187, -1000, 4086]
3084D086k220k857M98Q60j286J265K633p90k823j356N49K012M2j871j46Q63k214
3067b755o18M42K397n41J076L997J644j677j997M50O71p15j267K032q6n499J64
3050b282J599m69k378J159K516r69j368J614j15j233K875j923k423m701j291J788
3034g601K886L954J45K685J304l169j623L674K978L28q11n345j997J88J153J60
3018a091J564J40M2J397j629j72J623k388j32R1K9K298j524k55P41j307L252K040
3000D719m051j355o03R5K337K720P96j933j092m89m067J324l77j619j64JK896
2983h62O630l312k088j563q46R36J131j212r85J158L356J022l650m755J230J128
2967b682o70K729J548O01J900J912O49J058J016L64m098m454l639p03Jq2j052
$$ y = [4086, 1866, -991, -493, 367, -919, 346, 2979, 2189, -634, -1990, -1441, 571, 613, -1258, -1404, -541, -2755, -3373, -2931, -534, -1075, 1, 3998, 5642, 3965, 1968, 2418, 3089, 2374, 1107, 3139, 3053, -2446, -2282, -683, -1152, -3530, -2371, 145, -824, -2192, -578, -693, -1926, 949, -974, -3397, -8098, -9389, -7601, -4715, -761, -616, 2069, 3373, 204, -1419, 2255, 5233, 5561, 4750, -595, -2592, -2404, -1251, -1091, 473, 613, 655, 2052, 423, 251, 1874, -514, -646, -555, -526, 1772, 248, -7, 734, -573, 2679, 4719, 668, -687, -1290, -1195, 1142, 3862, 4658, 2725, 1633, 1144, -2923, -1599, -1976, -3595, -3759, -3758, -862, 5768, 2456, 368, -1195, -2041, -1105, 26, -1186, -2171, -1013, 2343, 3365, -285, -5040, -3810, -2682, -3352, -623, 925, 1526, 3426, 5338, 5987, 7045, 8061, 8425, 4327, -127, -3766, -4469, -4468, -4550, -5602]
2950e602J26N411M657J814m043l869k03J826J034k732J438k34J433J790j90n391
2934b735j161L328K113j381q98j057O78l497Q80J317J127K118r96R71q57n122
2918e172J59J540J168K737o24j977J090K806q1k251J796L534j298L06O42j438
2902B937l678j632k8j107J139P82J670M36o50L43K359K649J182k225n248r52K660
2885F37K084L24k560m93K231j254P32k476j454k337m2L597K8J830J620j320m666
2868c519m48J417K543L611K646l373n84k339JQ08K524q63m348k429k42N274m39
2851B40l447R33K610j549N21Q20j361M523k371j067l08l48K20k020m2k0l95m83
2833c544K793L783m444l208J642J15J560N54j098m52j622r6M348K800j987m946
$$ y = [-5602, -5476, -65, 4592, 6406, 2363, -1506, -1709, 117, 1151, -1581, -143, -377, 1056, 2846, 2656, -2735, -3896, -568, 1545, 164, -734, -1791, -1113, -4610, -3730, -2413, -1286, 832, -164, 807, -50, -5172, -5013, -3473, -2305, 432, -192, -2169, -1079, 1727, 1646, -605, 1191, 4725, 3427, 3733, 4375, 2937, -741, -2373, -2401, -3508, -2369, -1587, 83, 519, -131, 212, 2571, 5220, 6402, 4177, -1071, -2023, 637, 2721, 3045, 485, -8, 2223, 969, 1701, -775, -2229, -4566, -4608, -1011, -983, 847, 2467, 1147, -3519, -3967, -2550, -7, 3604, 6250, 2877, 2293, -46, -45, 763, 3287, 2424, -1924, -4353, -4595, 679, 240, -3207, -2274, 336, -1213, -692, 128, -1233, 3290, 919, -148, -456, -804, -584, -2604, -2646, -2666, -3061, -3544, -751, 3032, -1412, -4620, -2978, -2863, -1303, -749, -1847, -2299, -3921, -4017, 331, 3131, 1144, -3802]
2817c802m306J822L970k43m547P07N537J671l170j042K169K352k513l784k475
2802g654Q52J886M637K951L868l60l380l915j730K32J249j024j15r09J197K379
2786A64J166l098K43J957j42K904L245L58j539j25N43q79r57j584L80J107j987
2769A756l041Q75q19n30L084L66j136j72j938L887R26j696J989l53J708n9j592
2752C255j966m249J461J013J738J852k118k760k08j14M577K471Q56J004q91j230
2736D691j724j821k299n35J469J070L74Q20k549k339m37l63Q03N69L06L059J730
2719B824n49M98j508r08J408l277k769l538J44P55M737K24J631k295k403r06L355
2702b577J368p65n834m37p73M595M104L407J798o756l836J156J562k692J71K953
$$ y = [-3802, -8108, -6286, -2316, -2559, -7106, -6399, -862, 809, -2361, -3403, -1234, 1118, -1395, -5179, -7654, -6802, -4916, -279, 2672, 6540, 6180, 2800, -1115, -2845, -2613, -1364, -2388, -2503, -3412, -2215, 164, 1330, -1768, -1525, 432, 290, 3194, 6439, 6797, 5258, 5133, 5676, 4797, 3840, 2256, 2636, 3743, 1756, -1285, -410, -1229, -1759, 1325, 1691, 555, 383, -1555, 2332, 3258, 1562, 3551, 3198, 4906, 4847, 3255, 1289, -2960, -1499, -486, 1252, 3104, 986, -1774, -1982, -2096, 2481, 4952, 5808, 6812, 5921, 4691, 2967, 1146, -1153, -1688, -219, 851, 1225, 2045, -504, -2843, -3280, -3643, -2840, -2271, -1965, 1094, 2824, 2275, 2773, 1265, 357, 1765, -1512, -4281, -7819, -7675, -6920, -2183, -1959, -328, -2623, -5026, -5932, -2577, -1209, -1974, -7808, -8245, -9018, -4423, -319, 3088, 4886, -1870, -5706, -4550, -2988, -5680, -5509, -2556]
2686b556N48l69L851L960J110O27j054P74l488m96L64k152j231M363N80m207P06
2669A330j025N81N01o515l361K900K911K306K810k058l76K949j874Q62K963j8
2653D886k640l20j821j723m00N132K247J462K173n08n532k223J138q3R04j473
2637A219l094j16J737k661j145k20N79n73L605K252J978K347R40k310k535k802
2621g99N42K446L11k210K891m119l393j247M81r43j621j696M409J374j398L131
2605a841J75K76l477l125L067J268m99J080J438K141l973R50o8j174L422K056
2589A716j551L85k341O95K446j833r48N34M08n47K34J925N2k634j46K775J173
2572B343M1j551L49J547k27j762j023o96M355K637j239n112J160n45o24K37k049
$$ y = [-2556, -2008, -2377, 1474, 5434, 6544, 7171, 6117, 6891, 3403, 2907, 3271, 1119, -112, 4251, 4831, 624, 1330, 305, 886, 1387, -5128, -8489, -5589, -2678, -372, 2438, 380, 4, 2953, 1079, 1941, 4904, 4886, 2246, 1926, 105, -1618, -2018, 3114, 5361, 6823, 8996, 8488, 2956, 733, 1871, 1788, 2692, 1219, -1875, -1991, -254, -2915, -4060, -4280, -3701, -4274, -669, 1583, 3561, 5908, 6848, 4538, 2003, -799, -257, 2189, 2500, 290, 3181, -938, -4331, -5578, -5097, -6040, -7661, -9357, -4948, -3574, -4972, -1841, -1666, -1390, -4867, -7992, -4925, -3657, -4156, -3076, -1638, 503, -3470, -2520, -2588, -3762, -340, 1716, 165, 550, -1791, -1096, 1350, -483, -1431, -897, -489, -1036, -802, 1123, 1175, -1459, -1605, 1170, 2343, 2384, 833, 1182, 2729, 2502, 740, -283, -979, 3376, 6013, 4774, -338, 822, 277, -347, -110, -2159]
2555b159k75M10m49R45L246R41k559M16k184q02n95l144J463L040j292m722k606
2538a0326J778P61q85j759L813P46j366j60L63J127n98J55J810m33L09J458l127
2521f334k77L15n34K746Q87N771J569o064l654k454J810N977J271k842J201L97
2505b15r06J034l674n3J408J20r98j223K090J026m00l027L286J235j855J253L422
2488B523N415j104m801l054j803p50n67J606q61N02K665J258J587K410J262k516
2472C772k034K612k183n194k743K557M413O911N34k617j601l44M458k289n124
2457A128n053k994L328N080K149l603o07K437L091J209j748k64J93k486m110L064
2441H14M846K096j088j774j953m02k053P01J617J825J725p49j465L97j512j779
$$ y = [-2159, -2434, -2024, -2473, -1528, 1718, 2659, 100, 516, -1668, -2470, -3065, -6209, -4746, -1706, -2998, -7720, -10326, -8548, -7787, -8672, -10431, -6618, -5872, -7238, -7398, -7035, -5908, -6506, -6351, -4541, -4974, -4665, -3207, -6334, -6611, -6296, -6830, -4084, -3197, 2574, 4143, -1921, -5575, -8029, -6219, -242, 1029, -1813, -612, -215, -1121, -87, -3761, -3814, -2406, -2286, -3284, -4507, -2417, -1391, -1791, -4818, -1532, -297, -2152, -899, 2523, 7938, 6834, 2033, -1021, -2824, -3574, -4141, -2535, -3396, -2894, -229, 1029, 2616, 5026, 6288, 3772, 1738, 4350, 2167, -3027, -5770, -3213, 1200, 8111, 8645, 6028, 4427, 4083, 8541, 6252, 1128, -3925, -6919, -3591, 1489, 3638, 35, -572, 1865, 4956, 6165, 4417, 4153, 4346, 1860, -2250, 814, 5660, 7756, 6668, 4894, 2941, 2539, 486, 1187, 2804, 4629, 6354, 5605, 4140, 4537, 3025, 1246]
2425A246J015j582p73k00J596K100j015j464q8J59j793r49j211M18n96l066l34
2408f537K790L488j772k604L413q45O5Q3j422n86j203J121K373M52j375p28K473
2391h14j40J874L063o8j660n45J82j705J031K8r73j359L379K526L313K967j798
2374I301l441j293j368l394J656L551j763m973j258M175J502l3p66K255j008k357
2358G86J00J426K271R64J078K010l11k519n098j165L1K566j37j184l066o70%n85
2340c503J465l88L6K448n6K823q26m044Q33L050M455q97k985K809R46j619o118
2323a571q50L47M234K533l25j351k320l823k248K914K953m57K665j895k551L97
2307a348J41q21j096l62k367K827L698K78k708m85M909Q14j737J920r32l711n22
$$ y = [1246, 2261, 679, -94, -294, 1302, 3402, 2387, 923, 835, 994, -799, -1748, -2959, -2541, -3137, -6203, -6537, -3747, -259, -2031, -4635, -1222, -2067, -2002, -1919, -3341, -3927, -5130, -4009, -1636, -1184, -2559, -3287, -814, -954, 920, 3983, 3915, 2255, 1710, 1892, 187, 1218, 1246, 273, -1086, 2293, 4819, 8132, 11099, 9301, 5860, 4567, 3199, -195, 1461, 5012, 3249, -1724, -2982, 1193, 2695, 2662, 1896, 4151, 3143, 786, 886, 2312, 4583, 5547, 6625, 8635, 8324, 5805, 707, -458, -427, 2139, 2002, 818, -2248, -2918, -2918, -3503, -2038, -2426, -2390, 58, 2, 2825, 1999, -2045, -1212, 1838, 6293, 5396, 2411, 5220, 6166, 4547, -1571, -2421, -2074, 2160, 4693, 4368, 3017, 697, -3126, -5374, -2460, 493, 36, 2701, 806, -1745, -1348, -1207, -2028, -3124, -3486, -5853, -3026, 672, 950, -1758, -2243, 2666, 3480, 1743, 3663, 2731, -980, -1502]
2290a502M38M126j750j459L04O47K19j496o34J173r08k155j865J166j795L67Q53
2273d271K140P96L14K980L927J91p64J090l388l713j668n47l10J108K220K154
2257B259R86k920Q84J731l17k321k151l355L778L950k027j450k060J141L248p4
2241A302k47p93r97L52J068K30k25J739J268O44j71n764r80O308k555j990j034
2224a845K42K564K700l351p41J627j012j293J032M76j254J18k889M19M020J155
2208A968q51j371j735k630O29M257N674J909j219m637k139P93J395K984k433k02
2192B392J34N36P31j740m198R47J111J574O42K46L326k111j444M80Q73P11L89
2175D599j711j757q57k225J058L549p31L89K20Q35p23L17j580p26j085K621k281
$$ y = [-1502, -1064, 3062, 1312, -147, 157, 804, 1023, -473, -1107, 66, -842, -2997, -4862, -3696, -5491, -5124, -4271, -2131, -1335, -1021, 1959, 5886, 6077, 5313, 6403, 3015, -698, -2366, -2913, -3223, -2115, 105, 2259, 3245, 325, 1209, 2940, 2623, 302, -1849, -5204, -1426, 2524, 497, -953, -3013, -1872, 1376, 1302, 1055, 262, -735, -383, 685, 915, 690, 2429, 3697, 4341, 4170, -1594, -2574, 3734, 1179, -811, -1845, -1603, 961, 3661, 310, -431, 1196, 184, -1109, -77, 399, -855, -737, -3626, -3207, 813, 1968, 1117, -254, -1989, -4619, -3990, 267, 5941, 7850, 6631, 1994, -145, 648, 2043, 5027, 2594, 2392, 2526, 3062, 3793, 2053, -2145, -1198, -87, 1487, 2129, 2375, 5701, 3590, 2146, 2626, 3499, 4210, 4599, 2888, 1131, 274, -1951, -893, 2656, 1925, 2314, 2534, 3369, 2646, 2963, 1383, 657, -428, 2193, -88]
2158h8r23J378q75j370J500j460r21L16K495K770M520J124o63o860n9L525K630
2141G039j015l728Q03J299j301k850M84l140l847K161J371J724M641k90K220J396
2125F967J288q90n053k570M334J518J61j919l854m82J611K535J14l433o42l3K811
2108B463j035N8J43n452j309L422L011K007k361l238j416K638k375O47M205Q26
2092B234J863K231L75j083j659l721J019K339l499n140K432J545J797j07j919
2077a293j161k262k051K206J628q55L87J993J840j101J10q87j607j227N89J875
2061a816J046J615L939k150m067m800j329r34P50P305M046k125j361l131J326
2046a686L084J481K961j289l444J56j043J614M632R57J031P30l966n004r39L251
$$ y = [-88, -1011, 367, -508, -1878, -378, -1838, -2759, -2443, 52, 2822, 7342, 8466, 7803, 943, 884, 4409, 7039, 6024, 2296, 3099, 4398, 3097, 247, 731, -2409, -6256, -4095, -2724, -1000, 3641, 3351, 5571, 6967, 8255, 7365, 2312, -258, 4076, 5594, 5755, 3836, -18, -500, 1111, 3646, 3760, 327, -315, -348, 2463, 1428, 1486, 1629, -3823, -5132, -1710, 1301, 3308, 947, -2291, -3707, -1069, -3444, -2797, 1408, 2234, 4097, 6328, 6703, 5620, 3961, 240, 1259, 3598, 99, -5041, -2609, -1064, 733, 626, -1293, -2454, -4716, -6767, -4561, -2933, -3788, -3401, -1408, 432, -669, -559, -1446, -3053, -4280, -3691, -1816, -770, 845, 4784, 2634, -1433, -6233, -7562, -8496, -7746, -441, 3605, 1480, 119, -3012, -1686, 1398, 2879, 5840, 4551, 1107, 1263, 220, 1834, 6466, 7423, 8454, 9184, 5218, 214, -725, 2526]
2030B526J708r59n53j152o92J760L093j398k027J658k3j979m816j124K232J620
2014a26K743O07l700q84L198R33l014j243O988L289j372l899k717J277M187m34
1998E833l966m182K277J293j474l006O57j563q91p20q85M71K634j201J49K494
1982b080N06M710J790m84o46l112j007q43k057n90K347J553J092m76K504J925
1966E132p31k461j663K047K472l353j913n71j894j690M97K276n71N781N258l352
1950E264l694m55n75k559o68J452K66L691N574j567l425j087J25r97l61Q99l541
1933a658K82M91m34j275N76k627R82L245K817j146Q28l273M527L500j691j708
1917C436j276j626j326M92L217J479o88K268l756l99l71l662O14L070J969R34
$$ y = [2526, 4234, 3275, 2722, 1570, 878, 2638, 5731, 4333, 2306, 3964, 3941, 1962, -2854, -3978, -1746, -126, 2617, 3224, -476, -1360, 1838, 2771, -243, -1486, 5502, 8791, 7419, 3520, 803, 2080, 6267, 5833, 1867, -2315, -38, 1255, -219, -3225, -2568, -4131, -5022, -5742, -6627, -6156, -3522, -4723, -4574, -2080, -1574, 3136, 4926, 4442, 3796, 684, -323, -1166, -3223, -3813, -1466, 87, 1179, 703, 3207, 5132, 4401, 1940, 277, 2324, 4796, 1443, -470, -1041, -2935, -4625, -4128, -1852, -2423, 3358, 8616, 5264, 1570, 1115, 540, -2019, -2687, -1235, -969, 2722, 8296, 6729, 3304, 2217, 2342, 1345, 984, 1883, -1658, -1376, -885, -1319, -2594, -2018, -4645, -3663, -418, 2399, 1253, 2081, -1192, 3335, 6835, 5144, 3436, 2160, 534, -792, -300, 2917, 4396, 3708, 5976, 2220, 1821, 1450, -2212, -1598, 1472, 3441, 4375]
1901D375L578K9j486n65m310l203L055K68N45M069l219k586O54J563J21l96Q96
1884C388J895J48p51k041r94j196q15l057K338L00J97R95K497J426m76j105k146
1867F03k20j81L77K045j20J2j562J846L92l448k089k422J673M972J736j259m13
1850A942j626k020r3N45L078j068k686J422K445J461p55j733K179j430k328J648
1834I81l622J537j743Q12K709R09l619j638K856L433j756j817n21k486K202N438
1818C675J118o169l875O94N794K530k192k121J400P4r34J97J381l384p93M439
1802A834j626m460K820J606J579J855j443j095q97k429J84K613K588l486l185
1787c542J634K391J991k520j770l17o69l261m36K740K216L038j66P9r1O2J409
$$ y = [4375, 7953, 7982, 6496, 5931, 1621, -1582, 1473, 1741, 2286, 6355, 3136, 550, 1204, 2767, 2888, 2492, 3388, 5283, 5431, 4680, 2639, 1645, 449, -366, -3423, -1085, -785, -588, 407, 2904, 4330, 3854, 2749, 603, 383, 202, 579, 2624, 2504, 2516, 954, 2800, 3192, -256, -2345, -4767, -3094, 1878, 3614, 2355, 1942, 316, -1704, -1797, -1252, 1826, 758, -1928, -506, 1939, 3400, 2645, 912, 3091, 1661, -667, 981, -2641, -1104, -2847, -2035, 674, 1583, -2036, -3674, -818, 2615, 859, -958, -1479, -3965, -1763, 3675, 4793, -1376, -5251, -4557, 1237, 3767, 1575, -546, 854, 928, -6, 191, 1572, -1812, -2605, 1834, 208, -4252, -1432, 174, 1753, 3608, 2165, 1070, 173, -2256, -2072, 541, 3129, -357, -3542, -1908, 483, 2474, -46, -1816, -2133, -2802, -6063, -6499, -3759, -1543, 1495, 1329, 1408, 1317, 1379, 2788]
1770B788j225O9l536m603L675K719J972K486r28j199J231j341l821n84K737J234
1754A674k523P47p03r64K814J735J182k516l98j171l09K978k259n58J696J27j909
1737c57l80o48n67j331j375K510L322j393l624j584J004L603m3r21J725N426J486
1720F853j886j324k068j558k873J124k79R07j432n82J607L415p37n19K254N96
1704C498k89J850r10l061l295l945o83J550L224j080J377m47L642J280n88j018
1688A105J111L57l97j159M026k64m012j939k497o38M410R15j942J716J368J661
1672C821k002J260J692k104j537j708l824j760N95j263L606L144R76k998j761
1657c863P5r23K460J086l25J240R45l06j277J428R34o21n062P51K931N369K7k506
$$ y = [2788, 1563, 1632, -1904, -6507, -2832, -113, 1859, 4345, 3417, 2218, 3449, 2108, -1713, -2297, 440, 1674, -849, -102, -805, -1769, 1045, 2780, 3962, 1446, 1048, -123, -432, 2546, 287, -271, 1425, 1552, -357, -737, -1385, -1952, -3283, -4658, -2148, 1174, -219, -3843, -5427, -4423, -820, -863, -1784, -59, 5367, 6853, 4967, 3643, 1575, 17, -2856, -1732, -2011, -1104, -2536, -3118, -1511, 1904, 1167, 648, 2902, 3498, 3209, 5059, 4149, 1088, -2207, -6152, -6835, -5285, -2061, -3141, -1764, -2211, 1431, 2711, 2123, 1105, 2216, 2573, 2176, 1017, 5043, 4779, 767, -1172, -3669, -4307, 103, 1018, -924, 792, 2160, 3821, 1819, 3079, 4771, 2667, 1130, -578, -4402, -6162, -5567, -6830, -3224, -80, 896, -2102, -3863, -3788, -4711, -2251, -1165, -1490, -250, 695, 389, -888, 540, 1474, 853, -4209, -3458, -527, 4842, 4869, 2363]
1639B363j781k58M81L509L18k38M089j148j135R51j500k533M52j200k810o03l25
1622a368k0M78K518N2M77m95p92k560l019J819J970J450K477k174k447r60M122
1605A528J240k796k697k079r01j054r29L796R54L877K059p86m110k606M932j75
1589B53l329J957O145M86l417k414J088J737N02j44k252J143L08o27q46l326p22
1572c458q85j054K91J330K830J33j598k130J612J203K275n21j001q45k39L171
1556A114l28J734k679j361J872O03l502n14k974m73n41J404j52K996L406Q46j105
1539C46n27l63k69J828m074J99J607L580J475J598l4j037L68k839K966K099k397
1522D526J56k454j129K296j158n007l102p35J803M007J883K938J392j862m466
$$ y = [2363, 582, 324, 805, 4314, 4632, 4394, 8483, 7335, 6200, 7151, 5651, 3118, 3570, 2370, -440, -1043, -1368, -1388, -910, 1608, 1660, 2137, 1642, 850, -1710, -4729, -2910, -940, 510, 2987, 813, -1634, -2594, 1528, 2768, -28, -2725, -4804, -5705, -6759, -7688, -3892, -2938, 939, 2998, 2212, -1898, -4504, 428, 253, -3076, -1119, 5026, 5512, 2095, -319, 769, 2506, 3008, 2864, 612, 1755, 2063, 1436, 590, -2736, -3458, -4343, -5397, -5106, -3776, -946, -813, -2411, -4541, -2929, -1726, 549, 28, -973, -1818, -2057, 1114, 786, 2520, -159, -1520, 352, 955, -2547, -3061, -6035, -6508, -7049, -5645, -5797, -2801, 605, 1451, 346, -181, -544, -813, 1015, -3059, -2860, -1253, 2327, 3802, 5400, 5366, 4329, 4697, 1858, 4824, 6923, 4526, 4682, 2228, 1099, 3395, 2237, -2770, -5872, -6607, -4804, -797, 1086, 4024, 5416, 3554, -912]
1507i12K18L596o63L22K042J260n34k087K628k694m256j044K272L9j443K545J980
1490C269m51l198j392J681J894K708j104k261m830l067L610M353J724l939k552
1475c555J684N06l157J117m97K000K708K510J739J994k816k305k862j644R06j507
1459c179k82k678r7M88K436K231P87k815j436M096O07k192l255K11J195J562k389
1442d710K055Q77L505J911k311m727j79K197L579J498j445%p88j796p87J267K966
1425C112L80j213N17k513m167l04K260K42N38L092q27l030j376J50L59J728Q62
1408a90K008L99j782l281K304L462j326R8j4j445k609l57K977k71J35K554O85
1391C347j256m012m783p16J940K676K049P79M14J325j478m36J401J933j368l03
$$ y = [-912, -694, 2902, 2239, 2561, 4603, 5863, 5329, 3242, 5870, 3176, -1080, -2124, 148, 187, -1256, 1289, 3269, 2818, -380, -1772, -91, 1803, 4511, 3407, 1146, -3684, -6751, -3141, 1212, 2936, -1003, -3555, -1871, -1365, -4522, -3405, -3902, -1902, 806, 3316, 5055, 7049, 4233, 1928, -934, -2578, -1672, -3179, -3461, -6139, -6236, -5748, -3312, -1081, -294, -3109, -4545, -449, 158, -2034, -5289, -5078, -3883, -2321, -4710, -2655, -1778, 1727, 3638, 1327, -3400, -3579, -1382, 2197, 3695, 2250, 2250, 1462, -334, -1121, 146, 3112, 3492, 2279, 2796, 283, -3884, -4188, -1928, -1686, -1148, 1944, 1117, -1913, -3289, -3139, -2780, -1052, -190, 1818, 2217, 435, -2846, -542, 2920, 1594, 1692, 1678, 233, -2376, -2733, 244, -27, 108, 2662, 3347, 2091, -1921, -6704, -7420, -5480, -2804, -755, 24, 438, 1763, 285, -151, 1250, 3183, 1815, 1512]
1375A512N96j077P58L160J68k855k488K770j068r90M96k377j571k81J264m16K12
1358b187l590L324J857l42R86K197J541j65l486j253M30K265L889j142l550l38
1342D36J584J368k555j237l0J668L426K316q98r00m75Q8l696l258j009O24J325
1325a223P01O38O54m11K218L18k653R53M415L012k58R31k505l831k683M09j52
1308E33K553N471k890j829m77j053j426J518j503l016J144K632o21j952j853p23
1292c492L933N58o98j353l225l549J801J312P57j546k055M520K486r61j255L262
1276D95L967J611k453j592J320l401K210J911O37J1j903p0k33r75L49p28j709
1259e53M74k92m324j232M235p40P42N715J023l668j029K813K410q34m591l252
$$ y = [1512, 2108, 1031, 1789, 4949, 5117, 2262, -226, 2544, 1476, 486, 982, -1395, -2966, -3247, -1983, -2399, -2187, -5777, -2453, -596, -938, 48, 2245, 3786, 3621, 135, -1118, -688, 1577, 5466, 4324, 774, 436, 2020, 3388, 833, -404, -434, 1234, 4660, 6976, 6078, 5178, 4703, 4791, 1095, -2163, -3172, -2548, -1223, -522, 116, 770, 359, 2577, 2895, 242, 1195, 5610, 8622, 8364, 9295, 6790, 2959, 276, 685, 533, 3086, 8557, 5667, 3838, 3361, 2308, 882, 2400, 897, -2119, -975, 1657, 1036, -916, -2769, -3492, 441, 999, 301, -1052, -4277, -7826, -6025, -4713, -3956, -5502, -7557, -3037, -551, -1512, -2767, 495, 4462, 6073, 3620, 2028, 3348, -53, 2157, 4068, 4705, 4716, 2813, 2743, 2510, 1535, 1884, 1156, -553, -79, -371, -4695, -5927, -1692, -2432, -1690, 4025, 5048, 1380, 351, 3164, 5574, 4740, 149, -3103]
1243c103K150J969L275J740J007L75n071k944l359J618J131P02K259k376l481
1228d108J822J652J481j150k599j910J823K516j032m41J260Q43M46p42R8L427
1212C386J576k6j070m094k300J104J392K283J260l72p71l328j665P23P50j222
1196b374K664K729j008k744k740J345K395k376k098J056L484l11l79j69J010j365
1180h81K382M754J79l473j742K142Q52j731j579j529j024N00L915N271o81l714
1164C641K30K576j183k569j394J228k407j409M59P06k030N53N501J343l346Q82
1148B781MK209J023l692k494P1j009j382N90K6j099j181K561J188k238k84M93
1131b433m9q19l56J408K97L558m0l099k438J584M989q47m489J740K926j182k335
$$ y = [-3103, -953, 1016, 4291, 6031, 7038, 7413, 2342, -602, -3961, -2343, -1212, -510, 1749, -627, -4108, -2286, -634, 847, -303, -2902, -4812, -2989, -473, -1505, -1946, -686, 157, 603, -139, -41, 3386, 4962, 4936, 3866, -228, -2528, -1424, -32, 2251, 3511, 3139, 2368, -960, -2625, -1902, -1152, -2374, 290, 3019, 2011, -733, -3473, -2128, 267, -2109, -4207, -3151, 333, 22, -357, -526, 484, -881, 1501, 6255, 6434, 2961, 1219, 3361, 4213, 2482, 903, -626, -1650, -1150, 2765, 8036, 7355, 3641, 3871, 6447, 5264, 2695, 1301, 2529, 122, -1287, -828, -122, -2152, -1599, 3902, 5245, 1899, 2781, 2785, 4994, 6017, 2325, -169, -98, -1107, -2489, -1899, -1873, -2972, -4153, -1592, -404, -2642, -2926, -2433, -2482, -3301, -3657, -2249, -1952, 1606, 1566, -1533, -3971, -2387, 2602, 1755, -2734, -994, 1932, 750, -1585]
1114a585M054o67m39j665j185j17l206j878j730Q00l3K783J30O49R04L083k522
1097b624l328J197K890K959L397r55l174K12j596J751k692k222O394K808l195
1082A822k605K763n2j315J151J991l780O60k25k337k329J073j890L63M235n03
1066i78k254Q03l83K604j86J047Q37K862L167j251m005M49J67j182j03L81J142
1049C117j25j014J688P54m04l20J543N156P16k926m520m357o1K183J935q56m418
1032a909m478n45J186K296K817k632l435O67K413J293k681j683L211N027j930
1017c83k194L61N58K299j05j765l830j758P268J938j214J325M096J433l922k294
1001A813J873J231l312j47J07p27R65K481j217j655O25M99j991p8n11m833J512
$$ y = [-1585, 2469, 1802, 1363, -302, -1487, -1604, -4810, -6688, -8418, -7618, -7651, -4868, -4738, -4089, -3185, -102, -2624, -5952, -4755, -1865, 1094, 4491, 3536, 362, 574, -1022, 729, -1963, -4185, 2209, 5017, 1822, -783, 1980, 1928, 613, 1764, 3755, -25, 635, 410, -1927, -4256, -3183, -5073, -4710, -475, -978, -3232, -2429, -2812, -208, -394, 653, 1490, 4352, 7519, 6268, 2263, 2712, 2879, 1697, 1594, 1975, 3117, 2992, 1978, 3666, 4420, 4016, 3696, 5239, 10395, 11111, 8185, 3665, -692, -753, 1430, 3365, 2509, -1909, -6387, -6932, -5746, -3450, -633, -3265, -6700, -6033, -3620, -2327, -5008, -6691, -3480, 1547, -383, -2577, -2216, -1658, 641, 536, -1229, -5059, -6817, 451, 2389, 1175, 2500, 6596, 8029, 4107, 1813, 3686, 4917, 1605, 1458, 1565, 838, 1803, 4284, 3067, 1412, 2037, 2536, 545, 467, -44, -4877, -3365]
984c365M523P90J254L102j837j943j933J187K298Q44L49P47k657l059N64n21k117
967a774M60K504O05k360K030J322l473j534P47j6r2n23M18J77J79J277M05J53
949E05k760m011k086l73N014M766K186k363J1j973k043r28J700K989K295j429
933A500O32K53q39m831J204l1L97q67J973K528l70k171k617k76j128k90m05J125
915d213L833L391P67p27l193l206q14j852Q00J373Q08o0K643p23J799L410Mm170
897a30J599K530p27j713J324Q21l660K636M11j61j097l701K299k425M23J743R56
880A128K357j445n35p35j820P57l06l58j934K131j570q24R4K280J375R93N75J159
862C322M73k183r76K738K253l050l819r13Q85K82O77J222L335M502j12r85k792
$$ y = [-3365, 1158, 1948, 3202, 6304, 4467, 2524, 591, 1778, 4076, 4920, 5269, 6016, 3359, 300, 864, 343, -1774, -1314, 1190, 1795, -565, 1465, 2787, -686, -2220, -1473, -1489, -1581, -2104, -1686, -1509, -1330, -53, 352, 505, -2255, -6266, -8352, -8725, -3711, 1055, 3241, 878, 889, -1084, -3127, -4055, -2355, 634, 2929, 1500, 2132, 2385, 1546, -3285, -2081, -2112, -1715, -2582, -609, 1919, 1549, -622, -3239, -3515, -4643, -4933, -5338, -4213, -380, 3011, 3778, 3051, -142, -3348, -4162, -6014, -5214, -3841, -3033, -3093, -450, -1173, 626, 4036, 4040, -130, 1469, 3999, 3272, 1559, 2883, 3704, 44, 2680, 3091, 2930, 1833, -1868, 431, -1994, -1571, 172, 1128, 3485, 2040, 1505, 770, -1050, -293, -599, -957, -2891, -760, -2330, -3154, -3060, -780, 595, 1588, 2163, 3322, 3795, 1612, 636, 3374, 5627, 2577, -1242, -2155, -1270, -988, -311, 911, 4246, 8748, 8636, 7651, 4859]
845D859k573j326M19j875j808L188R80J34K10K21j705M50J400k640K180n519j655
828e060K045p27j819J919J244J91L620M96l266J437N822p33k558k360J59j114
812g04P88N385l84j237l8N25K827k586p17m079k978N18K173Q81L766K143k942
795C341N03k711k648K640n72l061j581j70J794K549j7k80J780j780K679L093J196
778F755l249j960K580L776k357k112R03M031Qj011m31j935K01p71l764J441J880
761C985L63o66q79l464j396P20l93l48J621K031K73K67L553J680j076k833J515
744D953p11m00M81K882J58k394J44L754n161k345L759K714j186k216l90K302P26
727G070J277l00J29K33J085j403l301j119L487Q01j016n372k755N3J294L170J060
$$ y = [4859, 2286, 960, 1379, -496, -2304, 884, 1864, 1998, 2208, 2429, 724, 1174, 2574, -66, 2114, -3405, -5060, -3015, -3742, -5561, -3642, -2398, -2207, 1413, 1909, -1357, 80, 5902, 5169, 2611, 251, 410, -704, 84, 5469, 5085, 3848, 3810, 4335, 7162, 4576, 3859, -220, -3198, -2680, -507, 374, 4140, 6283, 3341, 3844, 1133, -1515, 1125, 553, -2508, -4089, -4259, -2465, 84, 67, -213, 1567, -213, 2466, 5559, 6755, 3506, 1546, 4126, 7902, 5545, 3433, 4336, 8367, 8375, 7364, 6933, 4998, 5199, 4428, 664, 2105, 3985, 4348, 3682, 2803, -661, -2057, -1337, -1730, -2078, -457, 1574, 1847, 2114, 5667, 7347, 6271, 3438, 4953, 4242, 3842, 4323, 7205, 7363, 4969, 5113, 8867, 3706, 1361, 5120, 7834, 6648, 4432, 4042, 6344, 7070, 8347, 8047, 8176, 8409, 9494, 8091, 4790, 3671, 7158, 7959, 6943, 1571, -1184, -1131, 163, 3333, 4393]
710D393o95j645R41J844n70j303o68M52L479J211l82J438J789J070j301l076l743
693C234j267J331K49M11k38J182j70K113k917J014K024J517j475k133o25J007
677E257o55k962R45j291J182j633j476K71J096M581j972l939k702P31J552J810
661G95J158J552l687m89q35J026K437j674r73O73k365k28M578M48q00k265J136
644D87K737O28O90j807m38k790J612K910n97L855m82j235l342n009k550L31j001
627f001L395L870K67K309N317j551k658j43l244l565q86J568J585L206J176m569
611G6j779l62J183J167K001L249J103j808n114Q4j35K510r52M83J535m321k969
594d049L511K796J038J671m142m036k533L053K410j63Q91n95M80P29J342k591
$$ y = [4393, 3698, 2053, 2994, 4838, 4268, 2965, 2297, 2749, 6228, 7439, 7057, 8495, 10284, 11354, 10053, 6977, 3234, 1967, 3298, 3547, 3958, 3720, 4902, 4732, 6845, 3928, 4942, 6966, 8483, 7008, 4875, 4250, 5257, 4602, 1640, 2585, 1294, 2476, 843, -633, -362, 734, 5315, 3343, -596, -3298, -2567, -1015, 795, 1953, 3505, -182, -671, -1506, -480, 1957, 283, -690, -17, -2382, -2610, 1968, 2416, 1616, -649, 487, 3224, 3852, 4542, 2735, 2297, -493, 1119, 4029, 3432, 7287, 6805, 5570, 2228, -2781, -5331, -5000, -6001, -2606, 1264, 1531, 3840, 9157, 7606, 4948, 4805, 1561, -2004, -2890, -1322, 263, 3469, 4645, 76, -1703, -2065, -882, 285, 2286, 5535, 6638, 4830, -284, -200, -335, 2175, 1223, 1706, 3241, -1080, -4049, -538, 2258, 3296, 4967, 825, -3211, -5744, -2691, -281, -444, 447, -148, 332, 1061, 2403, -188]
578a88J865J490R25L15j707j563M76L512K152K130k454n36K90K72r23j094J99
561E161J740J355O21j079n809p95K518L42K667k85PJ783q51k222j11k242l893
544a093m265n4N13J565J200N842L239j21j017l006p30k11j282p63M55N327K378
527G977O20k970l58l70l181o91N52O89p88m72J122J126J090O19L994j533m989
510B437L85J168j666l532K16N76J314K161J192j404j607K808M48m757j076J486
494A49j722L08K787J075L54Q15r05P79j813j338J36P59J391j938j643m34L353
477B113M454J853q53K422m212l32J592K95j775j880M94l55r65m81j190Q58J976
460D014o63r10K04K592j520K18K095m765j742O76K692K542J778k452k067N06K996
$$ y = [-188, 1677, 3167, 4092, 4407, 2700, 1137, 1613, 5125, 7277, 9407, 6953, 6417, 6707, 6979, 6056, 4962, 5161, 6901, 8256, 8877, 7798, 1989, 1194, 3712, 4054, 6721, 6436, 6443, 8226, 7375, 5153, 5042, 2800, -1093, -5358, -5412, -4899, -3334, -2134, 3708, 6947, 6826, 5809, 2803, 2073, 1862, 580, -183, 272, 5599, 7977, 8597, 5627, 5269, 4899, 1718, 1027, 1579, 2268, 1480, 1008, 2130, 3256, 4346, 4965, 8959, 7426, 2437, 2822, 3990, 2324, -1208, -992, -416, 898, 3059, 4251, 2847, 1240, 4048, 4496, -261, -1337, 149, -1573, -1265, 1522, 2597, 2951, 3766, 2861, 3640, 1827, 489, 625, 1384, 2775, 837, -806, -1240, 2113, 6567, 8420, 7567, 9989, 5777, 5445, 7037, 7332, 5557, 3677, 4171, 3816, 2851, 2370, 1180, 2038, 4014, 3351, 2441, 2645, 5237, 3717, 3935, 6030, 1265, -477, 199, 2891, 5433, 7211, 4759, 2692, 3198, 6194]
443F194k057l005k65K463k80J288R22j117l428N88L747O7j546K307j749P00j050
426C779r98j955J185M901K969p19o86n49j287l8r43k486l343k066k532J460N187
409A879K575J498J341l131P47M20k284O20J832o74k533q55k79J847K284p58j110
392C419q4j832P82J604J569J112m53J326K464j861j951N5l079k390m8p99J483
375A317N3J315L196j659J90l81o52o12l968j773k37K700L143J599j376j299J258
358B814J11j597K087J52r3R14k64k760J788J183k839J17K004Q17k608l32J817
341C311j63J832M230r93k703j142Q12j150k327K061r94o51J244J245l845l213
325b446l76M09J87L765j77r0j141L5K154K347K564J013k801l482l408m07L43M401
$$ y = [6194, 4137, 1132, 867, 3330, 3050, 4338, 5260, 4143, 715, 1303, 5050, 5117, 3571, 5878, 4129, 4829, 3779, 2781, 826, 2011, 6912, 9881, 9162, 8476, 7927, 6640, 6602, 5659, 3173, -170, -2236, -4768, -3308, 1879, 4454, 5952, 7293, 4162, 4909, 5329, 3045, 3665, 5497, 4823, 2290, 1435, 1156, 3003, 5287, 4529, 3419, 3335, 1503, 2285, 3889, 5458, 6570, 6117, 7443, 9907, 8046, 6095, 6150, 3071, 681, 633, -166, 1317, 1370, 2685, 5881, 4222, 4412, 4031, 3379, 2767, -1201, -2974, -3211, -511, 2632, 4231, 2855, 1556, 2814, 2925, 1328, 3415, 3567, 3474, 4388, 4124, 1364, 3152, 4335, 1496, 1613, 3617, 4434, 1826, 1494, 3311, 3148, 4980, 9210, 8217, 5514, 4372, 5184, 4034, 1707, 3768, 2774, 2123, 3367, 4612, 767, -2446, -2822, -2413, -2226, 1539, 1362, 1272, 131, 166, 2320, 4667, 7231, 8244, 5443, 1961, -1447, -1854, -1511, 2890]
307B890Q51j1Q69o82L681M58j156K463k203j214k258m2j899o94J322l527m82L331
289A697l88J689L61j28J197j503n83J155j757P26j140n39l15O21R19L81K515k70
271D638j467j532K111K030j610k756m23K034k619k422K345K822k814j342L239
256B234J095m80J578o74O90J995k032k299L90J059j590l110n78L027L191K089
240F585J458n62l515k574K286K63Q48j647P96k810N81M640N04Q17j451n442m907
223d130L949L278J941j570r88J980j193k513l206O26n88R88K567K623J861m83
207E142k039l69j751k80o84K487m91K220Q53k190J017L614o3l260j415O46K077
190E514O82l053j328J602L492M12k019K90l712O07j755K042L484o91l442P46K51
$$ y = [2890, 3741, 3730, 4599, 3917, 7598, 8056, 6900, 9363, 7160, 5946, 3688, 3646, 1747, 1053, 2375, -1152, -1634, 1697, 1309, 2998, 3359, 3231, 4428, 2925, 2342, 3497, 1740, 2466, 1326, 787, 472, 1093, 2012, 2393, 4908, 4638, 3171, 1639, 3750, 5780, 4170, 1414, 991, 3025, 406, -2016, 329, 3151, 337, -1005, 2234, 3329, 2849, 4427, 3753, 4443, 6438, 4406, 2107, 2497, 3556, 1966, -1144, -1722, 1305, 4496, 6585, 8043, 7481, 3966, 1392, 3678, 3941, 4789, 3142, 3938, 1128, 1709, 6349, 6853, 7670, 6219, 777, -4130, -181, 3097, 5038, 3468, 2480, 4460, 3267, 754, -2452, -1826, -2414, -1426, 1141, 3764, 5625, 5142, 3103, 2734, 983, 703, 19, 2506, 2015, 4235, 5088, 2898, 3915, 7529, 7466, 4206, 2791, 3437, 5514, 6196, 3143, 1815, 3417, 6909, 7321, 5302, 5592, 1880, 2487, 732, 2774, 6258, 5567, 2125, 2871, 3122]
173C122j428P07n27j581j123k21L194K610j415j773L40j088P14K618K083o62j866
156C704k666j456M559J945m391q86Q75J903k806P83J767k084k141K479J004o49
140A940n90J316K585J4j491J838J353j593j951J686j79k63J256K33l115j785R01
123B155Q76J375O23k900L94j41l711J172J030M53n14J690j16n92R10J801K176
106F681p22J83N7l386k407J101m2j422J114L644J351k767k927j061O92J364L73
89A826K496J567j373j217j930j505K991J870k470j112K173L99J240J64n31r81
73C607k72r47J219J120l08k418l040J342K097J787j089j681j452j716K276K330
57B855K84K143Q18l08j304R35L57M33l866j938N91j371K254L344L03J214j214
$$ y = [3122, 1694, 2401, 1874, 293, -830, -1051, 2143, 4753, 3338, 1565, 1905, 817, 1531, 4149, 6232, 5570, 3704, 1038, -418, 4141, 6086, 1695, 809, 1684, 3587, 781, 1564, 3331, 1247, -894, 1585, 2589, 1940, 1350, 2666, 5251, 5265, 3774, 5612, 6965, 5372, 3421, 5107, 4928, 4665, 5921, 6154, 3039, 1254, 2155, 3031, 4406, 5029, 2129, 2523, 2382, -1329, -157, 873, 1326, 812, 2502, 2386, 1794, 2704, 4505, 6681, 5959, 6142, 6199, 2813, 406, 1507, 1465, 43, 1157, 4801, 6152, 3385, 458, -603, 89, 1453, 1826, 4322, 5889, 4516, 3299, 1369, -136, 2855, 4725, 2255, 1143, 3316, 3715, 4955, 5119, 4588, 3607, 3335, 2388, 3607, 4727, 4419, 2001, -1039, 303, 2400, 4187, 3098, 1417, -35, -1751, 525, 2855, 3139, 5282, 6100, 5792, 4488, 5423, 5780, 6213, 2347, 409, 1000, -371, 1883, 5227, 5530, 6744, 5530]
40E530j359K202P38J093p84p35l70o29j687k079k198K091R36p52J149J241j062
23C325M99m06N70k68k315N75k51j080p43N08R68O10J210R04o91O34J043k100l130
4a38J206J358l79r87
0A060
$$ y = [5530, 4171, 6373, 7111, 8204, 7420, 6685, 6315, 5686, 3999, 1920, -278, 1813, 2749, 1997, 3146, 4387, 3325, 3824, 3418, 3988, 3720, 1405, 1980, 1729, 649, -94, 414, 1382, 1992, 3202, 4106, 3415, 4049, 5092, 2992, -138, 1068, 2426, 2047, 1060]
$$ Imaginary data points
##PAGE= N=2
##DATA TABLE= (X++(I..I)), XYDATA
32767E62k98K78O53Q12j856J49M02k549J337L004J362n93R49j471J033K248K048
32750H070M79N59J110j192k426o65P86R38j115j17J100O60N89J118k752n53q66
32733E723K525J669J014L219k47J330j981j045K59P42r06j487J593K068j852K204
32717A4828K892O11j538l90j185J804M00N33P31j256k032N79K321J45J597K112
32701B2152R36r86k127p85O8K458n40J09N48j50J505K2J073J420j275R34K215
32684B7577o6j628k613k56K624J094q51Q90J058k37L1k537J265M288L756N84K1
32667C5000j069k536L85J907L29j711r14K140K739J895M81j260l452j155K010
32652C4789K87j312o31P98J698l4P88n67j608L8J993K223J756Q26J190J20n2P09
$$ y = [562, 264, 542, 1195, 2007, 151, 300, 702, -1847, -510, 2494, 3856, 3263, 4212, 2741, 3774, 6022, 8070, 8549, 9108, 10218, 9026, 6600, 5935, 6721, 7659, 6544, 6427, 7527, 8187, 8776, 9894, 7142, 6589, 5723, 8248, 9917, 10931, 14150, 13903, 15233, 13252, 12207, 12466, 13208, 12302, 10815, 12408, 14476, 12624, 14828, 17720, 18331, 16793, 16403, 15218, 17022, 17422, 17955, 18686, 17430, 15398, 15977, 18298, 18443, 20040, 22152, 23088, 22102, 19975, 19190, 19258, 21716, 21176, 21285, 21833, 21683, 23188, 23210, 24283, 25703, 24428, 25362, 27577, 27511, 25883, 23270, 23014, 25638, 26732, 25881, 26771, 27829, 27592, 27623, 25086, 26351, 30639, 34395, 34979, 35000, 33931, 31395, 31780, 33687, 34016, 32305, 31391, 33531, 36270, 38165, 38646, 37386, 33934, 32779, 34789, 35076, 33764, 33133, 33931, 35629, 35595, 36383, 35816, 34208, 34246, 36239, 38462, 40218, 41044, 42234, 42354, 42302, 43011]
32634D3011J38J258J42m96n7M93J019k362k598R47J569O9j461j676K1o54J104
32617D0467K735O15k170j043J626L79l3O73J471J07K83q37j511j34p64n00N50
$$ y = [43011, 43149, 44407, 44549, 44053, 43996, 44489, 45508, 43146, 40548, 41495, 43064, 43133, 41672, 39996, 40017, 39363, 40467, 43202, 43817, 41647, 40604, 42230, 42609, 42576, 43249, 44720, 44827, 45110, 44273, 42762, 42628, 41864, 41364, 41914]
$$ [...]
##END NTUPLES=NMR SPECTRUM
##END=
