##TITLE=Analysis number 320947
Compound Code ac 33010
Project Code adrs
Chemist Name acros
##JCAMPDX= 6.0         $$ Bruker NMR JCAMP-DX V2.0
##DATA TYPE= NMR SPECTRUM
##DATA CLASS= NTUPLES
##ORIGIN= Bruker BioSpin GmbH
##OWNER= nmr
$$ XWIN-NMR		Version 3.5
$$ Tue Jul 18 15:23:38 2006 GMT Daylight Time (UT+1h)  MAYBRIDGE\nmr@NMR_250MHZ
##.OBSERVE FREQUENCY= 250.131544655141
##.OBSERVE NUCLEUS= ^1H
##.ACQUISITION MODE= SIMULTANEOUS (DQD)
##.ACQUISITION SCHEME= undefined
##.AVERAGES= 16
##.DIGITISER RES= 18
##SPECTROMETER/DATA SYSTEM= dpx250
##.PULSE SEQUENCE= zg30
##.SOLVENT NAME= DMSO
##.SHIFT REFERENCE= (INTERNAL, DMSO, 0, 16.522)
##AUDIT TRAIL= $$ (NUMBER, WHEN, WHO, WHERE, WHAT)
$$ ##TITLE= Audit trail, XWIN-NMR		Version 3.5
$$ ##JCAMPDX= 5.01
$$ ##ORIGIN= Bruker BioSpin GmbH
$$ ##OWNER= nmr
$$ C:\u/data/dgb/nmr/ADRS/3010/pdata/1/auditp.txt
$$ ##AUDIT TRAIL=  $$ (NUMBER, WHEN, WHO, WHERE, WHAT)
(   1,<2006-07-18 15:23:14.51 +100>,<MAYBRIDGE\nmr>,<NMR_250MHZ>,
      <created by zg, POWCHK disabled, PULCHK disabled
       configuration hash MD5:
       E2 DF 36 D8 04 B2 41 60 5A D7 A3 38 5A 4B D0 FE
       data hash MD5: 64K
       8A 0C EE C0 FC 95 4C 6C DF C2 CD D5 99 AD F3 D1>)
(   2,<2006-07-18 15:23:29.38 +100>,<MAYBRIDGE\nmr>,<NMR_250MHZ>,
      <Start of raw data processing
       ef LB = 0.3 FT_mod = 6 PKNL = 1 SI = 32K 
       data hash MD5: 32K
       38 F3 13 9E B4 8D 7A 94 5A 11 0F C8 5E D2 1B B2>)
(   3,<2006-07-18 15:23:31.04 +100>,<MAYBRIDGE\nmr>,<NMR_250MHZ>,
      <apk 
       data hash MD5: 32K
       47 04 75 32 FC 3D 37 AF 0C 20 77 77 BD 32 4C F9>)
(   4,<2006-07-18 15:23:31.83 +100>,<MAYBRIDGE\nmr>,<NMR_250MHZ>,
      <abs ABSG = 5 
       data hash MD5: 32K
       67 ED 6F D5 A7 06 ED ED 74 C1 AE 03 5D 75 A6 74>)
$$ ##END=
$$ 
$$ hash MD5
$$ F5 8D 4B 90 4B D8 81 0E 44 0D 17 1A 58 D8 04 E9
##$RELAX= 
##$RELAX= 
##$RELAX= 
##$RELAX= 
##$RELAX= 
##$RELAX= 
##$RELAX= 
$$ Bruker specific parameters
$$ --------------------------
##$DU= <C:\u>
##$EXPNO= 3010
##$NAME= <ADRS>
##$PROCNO= 1
##$TYPE= <nmr>
##$USER= <dgb>
##$AMP= (0..31)
100 100 100 100 100 100 100 100 100 100 100 100 100 100 100 100 100 100 
100 100 100 100 100 100 100 100 100 100 100 100 100 100 
##$AQSEQ= 0
##$AQ_mod= 3
##$AUNM= <au_zg>
##$AUTOPOS= <48 >
##$BF1= 250.13
##$BF2= 250.13
##$BF3= 250.13
##$BF4= 250.13
##$BF5= 500.13
##$BF6= 500.13
##$BF7= 500.13
##$BF8= 500.13
##$BYTORDA= 1
##$CFDGTYP= 0
##$CFRGTYP= 5
##$CHEMSTR= <none>
##$CNST= (0..31)
1 1 145 1 1 1 1 1 1 1 1 1 1 1 1 1 1 1 1 1 1 1 1 1 1 1 1 1 1 1 1 1 
##$CPDPRG= <>
##$CPDPRG1= <>
##$CPDPRG2= <>
##$CPDPRG3= <>
##$CPDPRG4= <mlev>
##$CPDPRG5= <mlev>
##$CPDPRG6= <mlev>
##$CPDPRG7= <mlev>
##$CPDPRG8= <mlev>
##$CPDPRGB= <>
##$CPDPRGT= <>
##$D= (0..31)
0 1 0 0 0 0 0 0 0 0.06 0 0 0 0 0 0 0.0002 0 0 0 0 0 0 0 0 0 0 0 0 0 0 
0 
##$DATE= 1153232593
##$DBL= (0..7)
120 120 120 120 120 120 120 120 
##$DBP= (0..7)
150 150 150 150 150 150 150 150 
##$DBP07= 0
##$DBPNAM0= <>
##$DBPNAM1= <>
##$DBPNAM2= <>
##$DBPNAM3= <>
$$ [...]
##$SUBNAM6= <"">
##$SUBNAM7= <"">
##$SUBNAM8= <"">
##$SUBNAM9= <"">
##$SW= 20.6930455092707
##$SWIBOX= (0..15)
0 0 3 0 0 0 0 0 0 0 0 0 0 0 0 0 
##$SW_h= 5175.983436853
##$TD= 65536
##$TD0= 1
##$TE= 296.16
##$TE2= 300
##$TE3= 300
##$TEG= 300
##$TL= (0..7)
0 120 120 120 120 120 120 120 
##$TP= (0..7)
150 150 150 150 150 150 150 150 
##$TP07= 0
##$TPNAME0= <>
##$TPNAME1= <>
##$TPNAME2= <>
##$TPNAME3= <>
##$TPNAME4= <>
##$TPNAME5= <>
##$TPNAME6= <>
##$TPNAME7= <>
##$TPOAL= (0..7)
0.5 0.5 0.5 0.5 0.5 0.5 0.5 0.5 
##$TPOFFS= (0..7)
0 0 0 0 0 0 0 0 
##$TUNHIN= 0
##$TUNHOUT= 0
##$TUNXOUT= 0
##$USERA1= <user>
##$USERA2= <user>
##$USERA3= <user>
##$USERA4= <user>
##$USERA5= <user>
##$V9= 5
##$VALIST= <valist>
##$VCLIST= <CCCCCCCCCCCCCCC>
##$VD= 0
##$VDLIST= <DDDDDDDDDDDDDDD>
##$VPLIST= <PPPPPPPPPPPPPPP>
##$VTLIST= <TTTTTTTTTTTTTTT>
##$WBST= 1024
##$WBSW= 4
##$XGAIN= (0..3)
0 0 0 0 
##$XL= 0
##$YL= 0
##$YMAX_a= 372813
##$YMIN_a= -509341
##$ZGOPTNS= <>
##$ZL1= 120
##$ZL2= 120
##$ZL3= 120
##$ZL4= 120
##$ABSF1= 16.522
##$ABSF2= -4.171173
##$ABSG= 5
##$ABSL= 3
##$ALPHA= 0
##$AQORDER= 0
##$ASSFAC= 0
##$ASSFACI= 0
##$ASSFACX= 0
##$ASSWID= 0
##$AUNMP= <proc_1d>
##$AZFE= 0.1
##$AZFW= 0.1
##$BCFW= 0
##$BC_mod= 0
##$BYTORDP= 0
##$COROFFS= 0
##$CY= 12.5
##$DATMOD= 1
##$DC= 0
##$DFILT= <>
##$DTYPP= 0
##$F1P= 14.0000005364418
##$F2P= -0.99999901652339
##$FCOR= 0.5
##$FTSIZE= 32768
##$FT_mod= 6
##$GAMMA= 0
##$GB= 0
##$INTBC= 1
##$INTSCL= 1
##$ISEN= 128
##$LB= 0.3
##$LEV0= 0
##$LPBIN= 0
##$MAXI= 10000
##$MC2= 0
##$MEAN= 0
##$ME_mod= 0
##$MI= 0
##$NCOEF= 0
##$NC_proc= -5
##$NLEV= 6
##$NOISF1= 0
##$NOISF2= 0
##$NSP= 0
##$NTH_PI= 0
##$NZP= 0
##$OFFSET= 16.522
##$PC= 1
##$PHC0= 157.7754
##$PHC1= 2.83981
##$PH_mod= 1
##$PKNL= yes
##$PPARMOD= 0
##$PSCAL= 4
##$PSIGN= 0
##$REVERSE= no
##$SF= 250.13
##$SI= 32768
##$SIGF1= 0
##$SIGF2= 0
##$SINO= 400
##$SIOLD= 32768
##$SREGLST= <1H.DMSO>
##$SSB= 0
##$STSI= 32768
##$STSR= 0
##$SW_p= 5175.98343685301
##$SYMM= 0
##$S_DEV= 0
##$TDeff= 65536
##$TDoff= 0
##$TI= <Analysis number 999999
Compound Code 99
Book Reference 9
Project Code 9>
##$TILT= no
##$TM1= 0
##$TM2= 0
##$TOPLEV= 0
##$USERP1= <user>
##$USERP2= <user>
##$USERP3= <user>
##$USERP4= <user>
##$USERP5= <user>
##$WDW= 1
##$XDIM= 32768
##$YMAX_p= 399416330
##$YMIN_p= -430783
$$ End of Bruker specific parameters
$$ ---------------------------------
##NTUPLES= NMR SPECTRUM
##VAR_NAME=  FREQUENCY,     SPECTRUM/REAL,   SPECTRUM/IMAG
##SYMBOL=    X,             R,               I
##VAR_TYPE=  INDEPENDENT,   DEPENDENT,       DEPENDENT
##VAR_FORM=  AFFN,          ASDF,            ASDF
##VAR_DIM=   32768,         32768,           32768
##UNITS=     HZ,            ARBITRARY UNITS, ARBITRARY UNITS
##FACTOR=    0.157963299565203, 1,           1
##FIRST=     4132.6476996994, 0,             0
##LAST=      -1043.33573715361, 0,           0
##MIN=       -1043.33573715361, -430783,     0
##MAX=       4132.6476996994, 399416330,     0
$$ Real data points
##PAGE= N=1
##DATA TABLE= (X++(R..R)), XYDATA
$$ [...]
19824 59851 114562 92700 146032 155308 167506 120570 62535 17431 -14349 -94194 -72354 47184
19812 47184 -9737 -174359 -237855 -165531 -237505 -211349 -39669 58415 -37409 -88742 -52961
19801 -52961 15253 22813 -149801 -175951 -87146 -73737 -105388 -182083 -280841 -304625 -298473 -286877
19789 -286877 -239780 -268273 -217598 -200057 -160332 -179539 -202047 -173464 -101484 -64253 -44824
19778 -44824 -57683 4289 85358 50827 93950 109493 85966 11908 -76276 -127955 -51839 8261
19766 8261 -49229 -67139 -110394 18536 167497 199462 112605 -80032 -99325 -108615 -165692
19755 -165692 -136643 -2779 -53714 -148956 -152392 -81658 20157 -25641 -36932 -123302 -307529
19744 -307529 -260031 -229871 -214650 -215433 -277614 -251328 -226709 -258795 -136199 -88062 -182866 -233963
19732 -233963 -217699 -232486 -175399 -169081 -268735 -274626 -225978 -67443 39175 47117 86074 150472
19720 150472 87222 4361 -103719 -42808 43951 24578 -38129 -70873 -59656 -123319 -34860
19709 -34860 -92873 -143502 -108879 -128249 -167700 -196234 -239087 -154995 -18518 -38417 2975
19698 2975 22097 13201 -151271 -120753 -53291 -11251 -39571 -29162 -66014 -32274 -20701 107450
19686 107450 151129 43588 -31705 -143764 -171042 -126313 -211929 -155409 -30214 -97670 -233860
19675 -233860 -241430 -183167 -154843 -108194 -264744 -313528 -220669 -190990 -202596 -122595 -104403
19664 -104403 -63663 -50087 -163793 -229235 -194957 -203413 -126709 -10668 -22477 52852 -59061
19653 -59061 -120578 -56558 31466 -15334 -127149 -198831 -186451 -200361 -161061 -66811 -81929
19642 -81929 -159823 -24619 -3882 -127762 -228670 -198367 -149758 -96859 36259 -22955 -97512
19631 -97512 -96446 -126737 -165237 -163511 -211132 -153565 -85424 -28377 -46475 2557 21342 7889
19619 7889 -41195 -37420 61791 11377 -23466 -41019 -167079 -226279 -200570 -124611 -93754 -156793
19607 -156793 -164520 -104345 -39731 -29548 -38500 -11977 -118067 -168520 -216487 -305477 -265959 -137831
19595 -137831 -89192 67749 118740 36132 -1268 -61171 14605 -94758 -102610 -74333 -102917
19584 -102917 -65701 -7698 45065 56120 34278 17373 -33993 -49903 -52542 21062 -15090 -62864
19572 -62864 -72706 -53408 -44220 -81008 -150554 -136331 -160554 -158760 -183460 -184357 -140179 -220061 -192552
19559 -192552 -12602 80475 -5734 -11522 12215 81093 32719 -58286 -189097 -219330 -203233
19548 -203233 -227508 -243281 -223517 -208503 -222394 -312745 -230503 -124311 -66333 -95001 -66799
19537 -66799 -97140 -174617 -165460 -169867 -137433 -155361 -233355 -172389 -229006 -131552 18202 -31241
19525 -31241 -76833 -78173 -10836 -34458 -31573 -9224 38606 112504 -151103 -219236 -39726 57380
19513 57380 156617 276923 307823 145734 -31599 -80184 -15469 -52084 -137640 -181863 -184553
19502 -184553 -101868 -112980 -83034 -81379 -37816 -39832 -5963 -53608 -101129 19000 44179 -36623
19490 -36623 -155919 -230267 -269989 -237520 -121423 77090 179053 13061 -150472 -208480
19480 -208480 -154158 -135483 -112420 -43410 -4414 -64671 -116195 -194786 -47759 29563 -1004
19469 -1004 -57252 -111820 -38377 -12048 35299 36614 -335 -97970 -137246 -24290 105815 85022
19457 85022 148635 63786 14741 -80986 -93941 -147436 -66414 20453 89153 130219 61356 -127767
19445 -127767 -120165 -7086 -10191 -100513 -35593 13237 101492 57493 4225 -28688 -65533 -89146
19433 -89146 -93470 -96546 -1799 59904 70085 21062 4085 -28113 27850 91045 109942 50110
19421 50110 -60703 -89904 10358 715 4875 -65308 -173338 -213263 -35794 -70854 -167588
19410 -167588 -70497 -30490 -106531 -145896 -103093 -14640 13545 38742 -27647 -67783 152046
19399 152046 219891 86577 28144 63657 -27970 -110448 -23910 20175 -72846 -161030 -150688
19388 -150688 -100890 -131323 -129493 -158391 -284625 -350742 -243384 -241689 -160547 67204 139337
19377 139337 26264 -42113 -81278 -110088 -36181 -9955 64786 135908 162707 176090 52165
19366 52165 122881 102858 -59721 -152823 -195361 -75582 -19937 -90225 -220271 -312554 -322909
19355 -322909 -252893 -150410 -60920 15672 -69654 -18101 25987 -40237 -142206 -141588 -218154
19344 -218154 -202989 -80450 8947 60981 54203 21306 18112 42254 108598 90472 103229 82589
19332 82589 26006 23115 -118476 -106448 -112771 -126677 -203224 -93448 -103438 -84851 -79632 -192308
19320 -192308 -216155 -167458 -103978 -57360 -74843 -16434 -19648 39891 46589 87105 -2759 -3010
19308 -3010 25265 -84530 -88110 -84494 -178201 -153900 -188988 -274154 -209745 36467 154962 145241
19296 145241 38221 -124192 -95463 122352 117354 73225 78489 33608 -31253 -131201 -105340
19285 -105340 -170805 -144766 -39682 19714 -39695 -80836 -144973 -158725 14290 24380 10163
19274 10163 -28115 -71833 -67030 32665 27800 9300 161902 138479 105791 -19475 -36843 -41992
19262 -41992 28943 63267 -42206 -89463 -82803 -82306 -9732 63035 -9930 -37762 -102690 -102832
19250 -102832 -206030 -235022 -163889 -34872 -27990 -124386 -48467 -28858 32444 98766 182424
19239 182424 31227 -94642 -107599 -189907 -291311 -292511 -202408 -152189 -77276 -19413 17171
19228 17171 -28886 35784 71357 37091 11253 39789 -7801 -62799 -19593 -99188 -29588 7647
19216 7647 26890 30891 120408 246918 150675 114366 25331 -81343 -59575 -132112 -223693 -249443
19204 -249443 -275120 -201934 -193549 -33719 39000 44294 150029 123542 -12915 27454 -12846
19193 -12846 -217833 -153180 -81941 -13930 -35020 -149361 -162780 -102124 -81497 -52446 -4186
19182 -4186 31734 47760 -13486 -74896 -103590 -97773 -88603 -58732 870 82043 151871 135201
19170 135201 150004 52030 55290 122452 274597 281500 344339 430714 532896 698234 805270
19159 805270 870044 942349 1092299 1028542 1068728 1211392 1365911 1476846 1663283 1689947
19149 1689947 1627373 1554729 1546141 1542896 1470307 1423571 1462522 1547431 1549565 1386437 1294787 1034335
19137 1034335 831425 799473 776614 559355 433384 330208 223510 188684 100104 131692
19127 131692 105578 55547 -17507 65915 203725 183994 77859 -68743 -97316 -44741 -13150
19116 -13150 -55020 -36814 -21503 -83417 -137577 -73744 65177 45219 56508 2981 -67228
19105 -67228 -42243 -62239 -72289 -93022 -47644 -39918 -8034 89299 54420 30138 -115582 -123868
19093 -123868 -56669 41619 135046 232067 181649 13503 -35590 -39930 20916 -17649 23742
19082 23742 51772 -40742 -110095 -23218 -8384 -19111 22438 10805 3362 46931 116885 105391
19070 105391 2842 -38902 22126 42874 97244 198825 299211 95515 70413 233769
19060 233769 173121 102274 80994 -14300 5441 -20744 53391 103769 -40115 -192423 -137106
19049 -137106 13870 -7856 -13553 -82085 -108365 -51422 -20647 -79446 -61045 86659 127459
19038 127459 146038 -68970 -127326 -142943 -200540 -180155 -73043 -13489 -29574 -50270 -46937
19027 -46937 -42645 -53501 -18280 53759 81686 117710 164501 57185 -55687 12379 27642
19016 27642 -67849 -237327 -163502 -48806 -8039 -38067 -70539 -55404 115332 126057 82823
19005 82823 61331 62502 71604 -48438 -25260 20169 -29445 -82997 -160000 -159235 -161012 -134016
18993 -134016 -118329 -114678 -134798 -15425 15209 -29463 -23522 -21478 -154140 -228289 -235081 -185120
18981 -185120 -81909 -101348 -13024 -12781 3124 -72531 -79695 -191448 -64966 -57850 -90897 -142268
18969 -142268 -159354 -97355 -108909 -210323 -235162 -81216 -94641 -250934 -268527 -213200 -170309
18958 -170309 -136366 -183548 -124609 -135695 -277278 -254192 -134902 -119176 -96929 -138951 -292522
18947 -292522 -349451 -98453 13265 -68511 -132709 -97719 -88800 -93836 -171921 -174871 -86070 46737
18935 46737 -5242 -68703 -31702 697 -28653 -143993 -214757 -113901 -83305 -97981 -127776
18924 -127776 -132444 -67553 -104751 -129458 -105239 -157671 -87317 -129428 -159501 -183709 -237604 -183204
18912 -183204 -51301 -82106 -205317 -140205 -72494 -18832 50442 58009 103942 146612 41752
18901 41752 68843 113498 90059 -62253 -120543 -9025 -10880 -68245 -547 11580 -13509
18890 -13509 -34912 -20156 -24602 26648 -61725 -156526 -172412 -247988 -275146 -326165 -255704 -274708
18878 -274708 -299197 -217073 -135465 -142401 -113982 -19494 33002 8967 -4704 7261 -20823 -5839
18866 -5839 -56462 -58538 46603 104316 22199 -138219 -155811 -18397 142817 158566 7723
18855 7723 -64353 -81615 -247559 -271533 -196657 -135763 -166498 -189088 -161134 -70877 -77925 32355
18843 32355 32490 -51858 32144 71572 18313 -48293 -174309 -198676 -141122 -12832 -26663 -136484
18831 -136484 -152605 -111178 33586 66099 -35237 -197972 -216907 -140281 -131179 -19923 63548
18820 63548 -8196 28034 -4515 -39821 -86434 -206337 -164233 -47879 29965 107164 39447
18809 39447 -11276 -39233 -22261 -35689 -66698 -28139 12410 14148 -13273 -15509 8109 -12017
18797 -12017 40630 20182 -38929 -89166 -29282 -48545 -33983 -103747 -157623 -227573 -114721
18786 -114721 -85219 -143973 -115738 -50275 -22465 42887 24752 7896 11112 74996 78893 17520
18774 17520 -89299 106345 257959 209213 104784 147349 159568 239687 107990 86532 167050
18763 167050 184007 64738 69478 188459 164673 154390 117475 108325 141438 120416 65484
18752 65484 37140 90445 121390 12458 -31212 37734 53392 170250 258581 304118 206369
18741 206369 233763 215900 90818 49653 -68224 -105742 -124827 -64519 5728 -78418 -168276
18730 -168276 -114006 -128285 -180101 -165266 -163451 -199964 -184397 -118433 -181467 -269965 -253833 -278270
18718 -278270 -297160 -261947 -157825 -25293 25443 -85757 -53191 -45603 -47401 -87690 -134737
18707 -134737 -128857 -199158 -60793 -64456 -161480 -204992 -73946 -57447 -134441 -221136 -322328
18696 -322328 -219404 -111424 -166557 -135899 -8249 -7178 -59063 -110416 -50684 -11584 -100001
18685 -100001 -210509 -259338 -306427 -284651 -291438 -289805 -316115 -105883 -16720 24444 -16651
18674 -16651 -228876 -238743 -63980 -90617 -172676 -201957 -108855 -64221 -101409 -139121 -25642
18663 -25642 -24760 -40308 6313 -35728 -77230 -30343 -75221 -140657 -48807 -62337 -155427 -175359
18651 -175359 -119129 -50210 -116387 -48172 53753 -16735 67958 37754 -10514 -29137 -51545
18640 -51545 -25642 81541 95849 125547 139699 317155 321274 247736 119989 39524 -64460
18629 -64460 -26014 7402 96894 120797 47323 28377 31047 -14546 -476 33877 245754 324565
18617 324565 174498 142620 171272 399080 294882 258565 206882 161344 186903 219410 232425
18606 232425 283655 345032 394738 402188 299627 277983 312648 367068 439155 379193 282009
18595 282009 64555 101441 229164 389028 416001 364879 315442 222500 288057 253769 314263
18584 314263 383555 397295 395862 269303 276664 167480 82106 50754 88352 165627 236971
18573 236971 245198 255347 336695 354752 528792 659097 655952 679454 763279 895590 1042690
18562 1042690 1265360 1447395 1633728 1728575 1849415 1889856 1927005 2010680 2146503 2216219
18552 2216219 2247391 2287226 2375818 2561843 2732406 2823894 3052754 3213761 3366207 3647797
18542 3647797 4082290 4606156 4983428 5415628 5973535 6545943 7159375 7948615 8874583
18533 8874583 10013183 11530216 13408506 16086583 19966935 25852107 35173054 48704261
18525 48704261 65874835 84745304 101866029 118583646 139189167 165239461 195191217
18518 195191217 221664904 238899108 247085472 244335542 244263440 250690886 258403663 263279795
18510 263279795 258675518 248691575 246577080 253101732 261596676 264771468 259282354 241223622
18502 241223622 224322354 210957379 198160145 184184334 160203393 128665569 100600977
18495 100600977 78636841 64218097 55396489 49560143 45411294 42268986 39736086 37600234
18487 37600234 35735267 34056160 32607428 31184015 29683496 28401777 27150117 25914037
18479 25914037 24761900 23630732 22599326 21707039 20936788 20383593 19770862 19043735 18365900
18470 18365900 17867641 17408750 16931469 16375019 15927965 15525218 15078029 14605233 14308924
18461 14308924 13863362 13482377 13004325 12578581 12114883 11719093 11387397 10973617 10528429
18452 10528429 10100652 9666715 9353980 9110357 8881250 8659615 8355198 8043980 7856038
18443 7856038 7602645 7366539 7087492 6802900 6708611 6625201 6434366 6194825 6013366 5929350
18433 5929350 5799832 5569902 5328222 5198592 5200394 5196066 5000484 4772999 4581869 4393064
18423 4393064 4286476 4126772 4007332 3865767 3562616 3407893 3451943 3500214 3356069 3270183
18413 3270183 3196531 2981380 2813408 2737131 2849763 2918760 2832610 2752470 2729335 2716272 2703603
18402 2703603 2696153 2739276 2652942 2546748 2474633 2361474 2322844 2338350 2369556 2290832 2336833
18391 2336833 2369442 2405229 2365327 2241244 2149842 1991214 1763326 1755965 1891253 1841611 1839650
18380 1839650 1861823 1843220 1722760 1640884 1744059 1719020 1656603 1645482 1655106 1664701 1613627
18369 1613627 1567354 1600993 1582671 1563060 1477606 1316165 1309623 1370167 1429974 1434436 1322744
18358 1322744 1152608 1015427 979836 1015800 1016623 972527 969022 1009271 1036632 1071560 995654
18347 995654 909975 780031 746868 774267 731888 771873 797309 785475 876988 871884 700501
18336 700501 806109 838502 727451 592770 519524 568975 574128 572836 526732 466726 550106
18325 550106 403406 333279 400130 512495 587838 473484 437850 470181 383973 399554 492513
18314 492513 513423 442802 427342 384622 274859 278806 226478 268367 263332 284751 278793 255169
18302 255169 327399 456144 554619 662230 650228 580244 488906 504166 554063 585746 703119
18291 703119 695310 661521 605535 516708 371503 379142 437820 404804 281713 362672 456491
18280 456491 413236 302197 299395 273765 268034 213783 218635 224343 289876 381054 321565 311797
18268 311797 238074 181369 188721 293097 333459 317176 368624 334554 211240 106537 94160
18257 94160 185069 216622 272477 322136 228543 168654 206549 251582 239259 384471 383610 313334
18245 313334 160939 103698 225148 223983 244335 327323 261379 146029 114431 123271 200534
18234 200534 242711 170405 246702 425380 387177 230287 117298 70230 48748 172456 159548
18223 159548 98994 79139 122613 239325 242306 135258 25417 -20231 21627 -4577 7707
18212 7707 130983 180835 213803 222776 241311 42938 -95249 -94971 -65164 88820 160411 240949
18200 240949 206978 56454 5271 66663 122737 85962 22692 108278 222341 238868 130470
18189 130470 67462 -19314 59303 161625 197083 108511 75902 114420 176434 212862 175512
18178 175512 155854 -26733 -85778 -24175 18795 -96962 -66918 52310 73113 42573 134095
18167 134095 133815 102966 225436 254448 219011 323727 353088 303898 188575 115328 40513
18156 40513 -19281 -48955 -102464 -190285 -201088 -188818 37526 151530 129478 101041 -33010
18145 -33010 -80419 -73927 15199 152533 114314 44154 55700 93190 -48530 -18122 -31021
18134 -31021 -121717 -62703 -41462 8134 120560 122963 99318 112654 138575 35788 17993
18123 17993 -42313 10489 141175 157194 181145 193481 177402 218723 268872 219702 191532
18112 191532 205432 188455 39164 -43947 43233 -99 -23592 -87465 -90373 55994 -51704
18101 -51704 -37223 -41058 -99529 -79155 47675 101923 174938 211888 190145 64405 3233
18090 3233 14595 -5219 -17667 -16721 -50807 -51258 91482 57082 108845 47597 49237 97649 -20747
18077 -20747 -99910 -41050 18958 -102923 -137501 -22037 -10786 -27268 -149751 -212847 -221520
18066 -221520 -161567 -131794 -53335 -23029 -63708 -89575 -212299 -281559 -217622 -164463 -108244
18055 -108244 -95363 -75856 -60309 -126278 -1257 95414 110413 5078 -75382 -182537 -280250
18044 -280250 -268208 -150131 -22210 6731 512 -44090 -28043 44636 219498 279010 155892
18033 155892 -45894 -58683 50373 57435 15235 -17519 -57076 85746 39357 -87969 -144921
18022 -144921 -201440 -128299 -172174 -102392 -30110 -122036 -153377 -124237 -29238 -6759 -44529
18011 -44529 -43384 -23339 -5623 -59635 18375 -20994 -35426 132702 237881 150747 37790
18000 37790 126493 65779 -6495 -7282 -17379 -67366 78763 23466 -139588 -157722 -34613
17989 -34613 -13041 -67011 -169679 -150971 -121291 -68969 -43102 -8348 -682 22682 93153 3103
17977 3103 -71551 -35189 -20700 41668 -29430 -35508 -125291 -76893 103645 160550 43497 -122466
17965 -122466 -125301 -104778 -129393 -125624 -111891 -194787 -169147 -132593 -18267 -651 -59074 -190714
17953 -190714 -162085 -121682 -146906 -170137 -168945 -207904 -238312 -250027 -120595 -35557 20030
17942 20030 37193 -108933 -88301 -68413 -44330 19149 2628 1154 -109974 -139043 -95594
17931 -95594 35702 95760 20104 -71330 -55206 -98715 -58448 -116029 -55146 -26326 -55775
17920 -55775 -128436 -238638 -244009 -269322 -208548 -216350 -178724 -164856 -174225 -107169 51784 161261
17908 161261 271653 127048 -11096 14739 -58130 -34981 -172241 -202447 -99409 13378
17898 13378 -17837 -33542 -12074 146007 256876 214997 137925 80437 57633 78881 120184
17887 120184 188543 58126 -62303 -20165 44660 110849 162641 135633 277522 449683 630583
17876 630583 728194 951455 1060809 1153442 1244348 1272149 1317289 1292172 1216305 1090894 1124993
17865 1124993 1148964 1223975 1276768 1187105 1018886 1133647 1276570 1336385 1434614 1366354 1382086
17854 1382086 1355556 1212792 990253 761385 564051 487690 421660 295283 161847 104043
17844 104043 105754 42916 4486 129566 243398 279477 272503 299271 163567 15709 -15666
17833 -15666 -5931 -26916 -89853 21585 191458 211824 171386 170628 178838 187535 242214 183108
17821 183108 58410 -53722 -52650 32704 76946 62178 -19203 19846 46057 33719 -118822
17810 -118822 -191285 -164779 -133016 39066 -55996 -115383 -121317 -51354 -33480 45319 96072
17799 96072 -76253 -168124 -210331 -110563 -16785 33493 36155 2388 -79803 -16819 54227 56147
17787 56147 80653 81540 89984 6013 -79642 -92082 -93253 -143694 -236206 -195281 -97515 27408
17775 27408 95214 136952 123597 40935 -37091 -100295 -95077 -102870 -19201 -34350 -17265 -41828
17763 -41828 68088 90586 132362 205053 85319 201033 332968 259513 65488 -32681 59601
17752 59601 9180 -69356 -60050 3167 -41677 -140360 -92039 -250618 -223039 -112339 -141240
17741 -141240 -129512 9941 69303 -54022 -12710 -53473 -236043 -333355 -218282 -36316
17731 -36316 -14605 -112593 -119224 -55021 23734 -68131 -117405 -46995 -53021 -50904 -28588 -25016
17719 -25016 -32079 7809 44863 141290 85167 108049 60197 -56905 -117486 -246621 -318194
17708 -318194 -160303 -71303 54876 183065 279349 209795 15865 19614 9945 -98241 -129344
17697 -129344 -165168 -137202 -108968 -78452 -125412 -184019 -142665 -150190 -72546 50534 55646 -99506
17685 -99506 -61421 -17759 6920 7270 -61802 -45882 51007 107166 48269 38853 -6325 -196717
17673 -196717 -178873 -243934 -261147 -139245 -207048 -192001 -149663 -31599 84414 -35383 -58340
17662 -58340 -90444 -78670 16542 114991 39236 -77001 -129314 -76442 -19569 -45714 -26458
17651 -26458 8399 21677 74340 69832 -109630 -99833 -93817 -46775 -35830 24207 31295 -64836
17639 -64836 -48991 -31328 -102815 -123646 -156438 -163293 -95433 -90887 -60582 13601 155 -1193
17627 -1193 -11582 -13646 3657 -7762 -58859 -18764 -13769 64408 182870 278807 153131 -17899
17615 -17899 26189 -7245 -31089 -75803 -90738 -64223 -156037 -200359 -74302 -58194 -84336
17604 -84336 -120512 -142114 -81021 -102700 -82130 -86895 -48104 27773 67128 1450 -12762 -2661
17592 -2661 54470 22625 -10321 98605 195405 143843 73644 16470 -108151 -226945 -179500
17581 -179500 -31955 26856 -57216 -84332 -75729 -45114 -78770 -52641 -86541 -32364 -2731
17570 -2731 -67162 -142935 -99860 -70037 36943 66066 132094 81960 -64687 -111062 -65880
17559 -65880 -100883 -187382 -278103 -323112 -226481 -100379 -183380 -212106 -174104 -65167 -27432
17548 -27432 -6336 -128531 -83890 10357 93889 267237 287072 182231 195903 124958 56963
17537 56963 8067 -17993 21109 -89991 -94167 -59390 -163423 -320144 -262861 -84611 28141
17526 28141 -31359 -32727 15314 76590 -64902 -166066 -89922 41802 -17011 17380 87427
17515 87427 -42118 -241604 -157127 -84647 -22101 -50312 643 254 -79564 -165308 -74757 -39044
17503 -39044 -76007 -94770 -80912 -121187 -111389 -105203 -267053 -287423 -169561 -65018 -119608
17492 -119608 -42130 59045 134999 87552 -8218 -1134 67201 175267 66832 -39916 -20752
17481 -20752 34024 18839 -19381 -124307 -168207 -45969 -31873 -54534 -68238 -73412 -53725
17470 -53725 8454 12705 -15995 -70442 -227517 -289081 -326727 -419035 -298120 -100116 -21343
17459 -21343 -26734 45995 26134 -104894 -106446 -51036 59097 -11695 -108359 -161058 -211782 -244925
17447 -244925 -124484 -156549 -267271 -152763 -15905 34298 46546 -91021 -109572 -78180
17437 -78180 -150551 -118436 -71490 -55310 -118356 -63236 -6509 -33432 115338 150106 144318 76040
17425 76040 48946 59184 -51730 41828 60331 -61528 -130627 -77109 60092 112965 80801
17414 80801 -36999 -119302 -6742 156276 140739 224490 263551 68975 -69053 -58427 -98997
17403 -98997 -207157 -154418 -115926 3802 260042 340381 207828 209043 165001 117467 37951
17392 37951 -13138 -49950 -79911 4276 70991 45422 36171 23123 26385 17382 -49727 -73460
17380 -73460 -58210 32929 123120 90867 72298 49855 2690 -14166 -73231 -84130 -72950 -147044
17368 -147044 -190621 -124782 -63927 52470 128730 139458 214832 149008 52956 33462 -86471
17357 -86471 -14960 26017 165293 46581 38441 59402 54226 82214 71555 23057 -16132 57484
17345 57484 100851 97257 56596 130640 218405 136640 76379 -40466 -33097 -1760 108128 112099
17333 112099 3570 -55503 -47181 -158487 -99230 -30274 -5029 -124360 -150267 -18976 16439
17322 16439 122343 172672 67872 3645 62679 95072 184190 96816 93380 141989 161364
17311 161364 102076 108380 139998 25757 7163 6397 -37268 -140369 -204013 -204522 -184882 -158566
17299 -158566 -156437 -157788 -260015 -151141 -29901 21517 38532 23929 22907 -106642 -168781
17288 -168781 -158824 -62721 -153598 -108514 -23177 88054 217385 156005 -37773 -93514 -11259
17277 -11259 170475 147276 120563 66527 39725 -40451 -8330 -172017 -333007 -349884 -274413
17266 -274413 -289391 -159277 -129403 -120768 -36877 -16965 -94236 -161872 -202206 -166556 -122303
17255 -122303 -112329 -134644 -202955 -209500 -154658 -110727 -199588 -94756 96084 212630 278794
17244 278794 297813 265848 227203 270300 253165 376572 543976 726087 987876 1087088 938902
17233 938902 812766 943222 960005 856585 664738 683212 714895 837117 935428 977179
17223 977179 958765 963150 995262 1057820 1058974 1075496 1006023 912499 864286 803941 724778 710280
17211 710280 808126 786357 726449 692328 674412 715761 780516 808400 731365 660594 837860
17200 837860 830086 723035 629897 505793 346607 157760 184549 255219 224471 181122 125476
17189 125476 134799 268254 342934 318431 319582 316532 196503 162700 191011 204374 251009 172020
17177 172020 141345 172321 223439 221689 138850 74844 38499 60264 -19657 -98192 -30495 110918
17165 110918 161921 133436 120366 142929 114318 78841 -21267 -26851 -32081 -139149 -126104
17154 -126104 -52058 -88838 -74783 -23118 -46984 -152207 -185201 -107629 -179880 -214018 -76334
17143 -76334 2240 -50933 80902 63484 88475 166201 180274 159499 176768 175658 210004 262753
17131 262753 334699 235604 167881 124196 96138 29606 78697 181171 103820 -13629 -144700
17120 -144700 -61333 38919 123523 153740 147035 121334 59516 120074 77312 39942 -45366
17109 -45366 -31183 -11480 -3005 54503 141077 146703 178077 123922 -10031 -78191 -17643 96856
17097 96856 133973 128463 37493 -62658 -127983 -149422 -99703 -189467 -179568 -68748 3721 -3751
17085 -3751 -42480 -110584 -95586 -89117 -69374 -48304 55321 12470 -8748 -37991 61005 210185
17073 210185 179589 100829 72298 142281 130434 152909 85275 76997 45305 87142 104979 103331
17061 103331 91675 69840 172080 325412 248672 166259 137472 162627 224557 114632 53602
17050 53602 76653 -8925 -29309 62378 85933 1296 -32166 72374 48396 10927 -90792
17039 -90792 -56144 40305 146827 128314 86826 122722 45244 54735 61144 17759 50731 113661
17027 113661 89574 -63971 91455 99856 -36454 -66836 -38593 -31025 -110916 -181412 -97706
17016 -97706 -55515 96212 94014 36705 -16027 -81154 -111139 -60740 -20530 39591 27990 -58470
17004 -58470 -74368 -11830 -59032 -138291 -147442 -99685 -15372 -12328 16333 -43113 -30939 -101817
16992 -101817 -103790 -165690 -114458 4157 47960 54242 -41137 -83468 -84626 -110885 -31329 29170
16980 29170 19576 29948 52821 30772 -166551 -224511 -65908 -34658 -107600 -138226 -150496
16969 -150496 -160400 -227777 -192076 -154654 -120822 -148076 -90505 -24059 55089 78520 19516 53041
16957 53041 138819 262546 230011 133273 85593 36928 -6461 -1581 11875 9964 64658 183952
16945 183952 107304 111115 106688 202347 198925 181902 147015 206523 262855 252129 146650 44080
16933 44080 59562 122040 146570 65263 77868 195723 102638 78882 85836 122697 202748 235887
16921 235887 267833 273068 384464 450244 396111 323025 250436 155006 156509 143593 165829 61079
16909 61079 19380 94338 125630 267987 264230 201584 249670 234251 154600 123584 135955 92903
16897 92903 66076 85518 132427 168943 97765 -67376 -131115 -70665 51469 150765 167940
16886 167940 174469 326671 432406 387006 196309 149203 175867 216577 392997 467070 520487
16875 520487 455514 354281 235076 169092 67660 -36898 -89318 -38633 -74548 -83497 -56474
16864 -56474 27556 36819 -861 12254 -32051 -29907 26563 89052 186563 104378 111024 173810
16852 173810 214984 207680 179811 187666 343902 434678 417024 505520 637276 561682 674099
16841 674099 821227 878178 964038 1025071 1159348 1089157 920840 802960 787749 781808 888433
16830 888433 975931 892762 829185 924049 966194 920219 955411 1001788 1055745 932647 892060
16819 892060 1069853 1281832 1388112 1363558 1363960 1302208 1231448 1251056 1186273 987994 840523
16808 840523 858314 948080 829865 606502 632934 751488 721402 573528 445164 433942
16798 433942 332237 253370 255855 413536 539160 561245 446045 437250 442234 310119 206978
16787 206978 229281 234764 343982 473256 616601 654061 554548 535080 443651 392422 417741
16776 417741 479614 535395 476083 420329 445167 441958 445978 500546 493670 392307 379789 437675
16764 437675 633134 693351 517394 347728 268587 313965 380725 449207 403810 360881 446291
16753 446291 403135 464022 479097 563296 544737 439432 288517 176715 298854 466611
16743 466611 378528 319042 278343 213378 415155 370810 483873 566034 515218 471100 511562
16732 511562 492297 642551 841648 967716 907695 934603 1043610 1268075 1349220 1314237
16722 1314237 1365924 1439708 1530736 1671058 1809964 1989698 2231059 2346079 2466418 2581647
16712 2581647 2903984 3157674 3372697 3658629 4087017 4554744 5085166 5522500 6139946
16703 6139946 6818594 7639530 8643148 9810287 11596216 14476644 18739250 25241592
16695 25241592 34739008 46527360 60375146 75514381 88391470 98912733 110087545
16688 110087545 122746781 135604658 143276719 148025075 148561150 137000348 126845859
16681 126845859 122184301 121442833 124046646 129908330 140172318 155018967 172775318 187868716
16673 187868716 201645642 208695287 200044524 189548598 182494328 179940598 183062638 185116387
16665 185116387 185555613 182784726 168040328 154429395 147182391 143775087 143115916 145203992
16657 145203992 150730240 159012467 167591756 169894469 167787684 157664999 132083330 106761615
16649 106761615 85130506 66446614 53858353 46055652 40957306 37537476 34949656
16642 34949656 32757169 30893918 29391318 28214338 27235338 26206766 25175215 24170733
16634 24170733 23150429 22208216 21424842 20577415 19813398 18987051 18175034 17436546 16722165
16625 16722165 16044042 15482566 14867195 14429411 14164240 13807988 13395336 12947146 12491019
16616 12491019 12199142 11879479 11520968 11029172 10528638 10052776 9715134 9382464 9007045
16607 9007045 8661515 8293161 7959433 7808408 7701002 7464688 7216128 6951652 6691571
16598 6691571 6482332 6341007 6241004 6100410 6000300 5830590 5629919 5414196 5138548
16589 5138548 5130180 5096192 5081426 4991988 4730409 4529857 4423261 4301653 4196143 4108640
16579 4108640 3966032 3796465 3717192 3570271 3427570 3376693 3270799 3186970 3079085 2968295
16569 2968295 2841532 2787963 2738982 2761616 2760878 2757332 2823555 2749914 2664751 2565429 2584689 2568810
16557 2568810 2562190 2461555 2415204 2377997 2322691 2320450 2366354 2277224 2341695 2303008 2194394
16546 2194394 2208478 2218474 2195920 2121154 2040011 2084677 2054952 2087846 1964614 1786270 1795690
16535 1795690 1847681 1723755 1546395 1620370 1624101 1460303 1428793 1507664 1585905 1655786 1589806
16524 1589806 1526390 1591090 1629061 1637348 1622548 1409213 1276536 1260251 1170239 1046518 991515
16513 991515 1044711 1085105 1034512 1000242 907679 830686 755174 595319 575946 590164 646796
16502 646796 731379 848704 775166 695353 773961 849539 916852 909438 758745 592764 554002
16491 554002 497777 442997 453010 452349 477364 557715 625754 599891 461319 359718 414680
16480 414680 520423 565779 423810 415047 581996 708062 594628 595359 523441 533516 694885
16469 694885 649951 678821 676654 576794 622695 707152 594516 482390 553166 531751 553061
16458 553061 609709 640129 604406 613314 585261 561187 564718 615306 581505 455679 372301 352392
16446 352392 349570 383449 388341 426646 551879 597534 715331 775527 632838 704697 661514
16435 661514 750425 742498 550006 502463 606239 703623 596180 524184 534486 610387 563618
16424 563618 398380 489010 530731 547428 485801 484249 504184 517903 541090 350339 383983
16413 383983 475379 584367 622493 687004 751325 826852 823333 886109 806196 874966 975700
16402 975700 961693 869235 863276 912468 1043866 1079674 1000483 911592 893055 924607 883415
16391 883415 734286 758242 864917 954103 914652 986468 1008606 880585 873757 953913 1021574
16380 1021574 1043339 1140844 1263291 1301328 1174541 1154225 992291 936634 842703 788527 816535
16369 816535 958638 973136 856322 743777 802464 846720 758374 721543 730133 651585 630566
16358 630566 571246 545009 658201 617098 482167 291570 238540 410771 508380 519288 584635
16347 584635 642130 670498 741526 869508 858368 739618 695814 796955 861385 847681 829382
16336 829382 990843 988465 1016845 1122571 1279411 1338805 1287771 1368561 1436281 1574198 1794977
16325 1794977 1879114 2001683 2189609 2493938 2981288 3238285 3461984 3743490 3948820 4232178
16315 4232178 4764801 5314020 5826080 6336325 7002125 7704977 8591364 9820671 11532188
16306 11532188 14013712 17681869 22771607 29172530 35704796 41684897 49133161 60725873
16298 60725873 77719110 98186807 116812753 128229950 133607869 141749947 159311011
16291 159311011 181992884 200640697 209249418 201278103 183564706 176575637 179361333
16284 179361333 185960103 190100445 176802769 152873854 137692177 135172845 142453417
16277 142453417 154822745 162840257 161693710 156888549 157055133 167763326 184955491 199840009
16269 199840009 206586449 198569353 179620954 169194185 167473558 168339839 166880917 150409273
16261 150409273 123409554 102650462 90379837 82790115 76842123 68578865 57591796
16254 57591796 48326259 42159011 38118104 35300629 33316367 31565219 29898219 28309915
16246 28309915 26811367 25540035 24388613 23433103 22596592 21815697 20871348 19880217 19225545
16237 19225545 18503819 17820224 17326043 16782464 16045881 15481464 15119868 14772434 14312683
16228 14312683 13782903 13221431 12685782 12236718 11867463 11503719 11259903 10935197 10504174
16219 10504174 10104990 9925846 9751229 9481216 9164100 8955573 8726338 8526236 8256795
16210 8256795 8053073 7891186 7759055 7631979 7406669 7167705 7062700 6980317 6849165 6693356
16200 6693356 6512313 6355575 6254041 6210216 5958010 5648429 5548544 5541425 5316563 5138892
16190 5138892 5047279 4935780 4776511 4662524 4543052 4503738 4577059 4476988 4413968 4458936
16180 4458936 4383240 4181016 4032194 4071530 4022753 3987959 3857395 3626189 3509828 3560399
16170 3560399 3543221 3385994 3134080 2962253 2917045 2923849 2879386 2791248 2789578 2837191 2986646
16159 2986646 2949119 2826539 2854081 2841525 2884284 3018533 3063899 2997936 2966642 3002085 2947417
16148 2947417 2920032 2830255 2819652 2867320 2928611 3021928 3218123 3202920 3127252 3025525 3093787
16137 3093787 3167791 3224536 3272344 3218181 3141638 3296433 3413815 3347511 3300805 3248510 3124632
16126 3124632 2930998 2821725 2862718 2921775 2922304 3013015 3103517 3097994 3131510 3040801 2877052
16115 2877052 2710015 2529919 2532144 2558251 2441825 2481206 2604289 2573197 2584592 2523920 2548769
16104 2548769 2442774 2316204 2437468 2571540 2488772 2270229 2093456 2058721 1986229 1838047
16094 1838047 1631807 1585710 1547437 1332946 1216511 1307973 1405803 1443119 1433757 1390850 1288159
16083 1288159 1208301 1204738 1148123 1122873 1157128 1202180 1220062 1205792 1059747 879316 789307
16072 789307 806984 799084 786642 760439 754986 637927 645463 612081 588827 590436 562780 567227
16060 567227 600222 566524 516958 507863 546240 621612 607065 655986 705199 607835 553959 627172
16048 627172 547753 444799 515962 607847 602491 459154 386580 377458 360495 353214 387076 473155
16036 473155 442367 412139 491304 543883 518797 528943 564438 643306 779964 795653 568595
16025 568595 542609 450828 344869 284578 354088 420324 448390 388628 330087 320226 406372
16014 406372 470092 506104 591984 641019 590605 462529 528345 646495 659933 739154 704324
16003 704324 625224 460394 319119 381823 339448 363517 435510 283088 290225 344108 329524
15992 329524 305953 273833 253273 265866 278140 265077 138665 157501 200083 157690 100115
15981 100115 54766 78928 216754 318656 403160 419429 403639 270712 177719 60376 30986
15970 30986 73378 63762 76313 50987 32656 53527 17150 -4726 93448 164008 170557 85182
15958 85182 204675 318549 259279 188164 114989 115428 176718 161116 76514 171835 158418 173980
15946 173980 143602 95093 91281 58530 62010 78032 28524 -111 36751 33888 -23768 -909
15934 -909 94394 91866 16913 104637 199651 241104 279846 308044 235899 216299 279789 369083
15922 369083 221005 16776 29097 81999 67000 57801 45161 33534 27820 -18988 -65704
15911 -65704 -45739 62154 41761 98329 155162 156223 87283 154088 161502 12173 77109 58150
15899 58150 15610 35950 39676 112103 78916 67314 134541 206584 127102 110585 185818 282046
15887 282046 275676 262748 135118 -39756 51648 106944 146082 92115 113341 206386 90848
15876 90848 34376 160165 221889 112429 73676 174447 203171 130518 134521 207925 170420
15865 170420 120791 198335 226217 145050 36020 43899 -58454 -64900 -32216 118470 237521
15854 237521 216843 197078 164940 188810 135782 44601 -51128 -49605 -102019 -174391 -69187
15843 -69187 -82729 -48840 34709 -6287 -34733 -77196 1899 74063 -12152 86314 190894
15832 190894 251492 324346 277326 232619 246161 134483 99333 110094 90347 100382 101413
15821 101413 166508 251555 160486 75614 -22029 -3760 4185 -60022 -22249 -86007 -235426
15810 -235426 -215223 -79488 24828 76968 -24452 -48234 58705 18261 37103 36722 22781
15799 22781 71198 114848 86831 53895 65842 56160 27062 729 62334 91450 96593 153064
15787 153064 147925 197426 277686 248471 238864 39114 -12171 -2920 98479 213252 168971
15776 168971 51424 83951 233215 188452 148518 146337 59970 -68776 -121772 -42148 46583
15765 46583 102868 159603 120052 58721 -6406 44670 -69634 -98145 14346 131710 142494
15754 142494 51840 93404 174058 236001 203727 333105 409565 396684 380461 498478 651675
15743 651675 815229 731126 652411 775365 995465 1201683 1175469 1214887 1245946 1222718 1248103
15732 1248103 1407910 1388328 1200265 981721 869452 799721 792812 792373 877822 989456 1062691
15721 1062691 1079195 1121585 1169938 1171100 1125669 1090650 1120953 1099967 1198616 1233516 1181548
15710 1181548 1231753 1004801 707560 493446 510603 519035 410974 296890 349042 405781
15700 405781 408806 301789 236463 361335 415728 293354 174290 121430 146415 254551 236283
15689 236283 152970 128106 141891 18976 -85156 26971 183241 282436 293014 107005
15679 107005 -12000 -38308 -52921 114174 276573 237405 198720 203446 66833 50730 117364
15668 117364 144190 8360 -68437 125184 245164 278506 26655 -8692 68418 252519
15658 252519 220623 100123 -1683 -4582 31610 47734 26486 52728 74518 49381 -96818
15647 -96818 -130185 -8187 74498 80978 33616 -4599 -32087 -5870 -23863 30956 32156 37338
15635 37338 -3780 -73186 -9069 -53948 -167131 -318429 -229725 -91833 -18017 81490 152758
15624 152758 143088 149630 161820 108235 40241 -83621 -84951 -73797 68535 140721 215559 176174
15612 176174 108937 12378 96549 8319 -57055 37957 81624 -1910 5351 55382 30874 28342
15600 28342 -60049 -122341 -80183 -109457 -122246 12557 72010 115660 9868 56884 111625
15589 111625 194372 213649 122672 25033 24006 127895 198753 73216 -114467 -99076 -87317
15578 -87317 -38133 -32818 -39265 -14245 18631 13174 -33795 85285 132964 83818 129009 65666
15566 65666 -34733 -60963 -15789 -109600 -97032 -116912 -90276 -75254 -111759 -209813 -277384
15555 -277384 -253710 -167313 -101672 -108593 -148354 -126239 8558 -8764 -30843 -19666 36996
15544 36996 43816 -20383 24873 75382 -30111 -137432 -4503 91953 44731 -106536 -111360
15533 -111360 -82684 28205 114189 106247 8773 7980 14238 10679 -49066 -116290 -21049 26709
15521 26709 19140 39306 30659 -30086 82890 118659 35444 -45188 -49892 15669 10952 -65255
15509 -65255 -99012 -9133 -15799 -55284 -121193 -121487 -151112 -162124 -118094 -88320 -47358 -61457
15497 -61457 -4779 -97824 -24197 78871 98095 -33872 -61491 -53688 -128494 -181980 -151728
15486 -151728 -76886 27658 80307 86464 228391 191547 271535 418361 357944 205198 129043
15475 129043 133877 86508 40230 20136 60500 -831 -60689 -66743 -63917 1174 -51334 -55483
15463 -55483 119954 253338 146992 173957 67569 -32010 -39852 -18553 -71598 -88267 -93851
15452 -93851 -83976 -79120 -100213 -87472 -93973 -185672 -108968 -105098 -99690 -27822 37474 150100
15440 150100 79510 -103771 -145096 -36368 -103354 -105673 -78638 -52739 -10943 -83382 -218474
15429 -218474 -151247 -4589 44419 41985 93723 160458 238359 42659 -75610 -93986 -72622
15418 -72622 -114736 -31557 -54394 -161441 -143997 -151633 -134047 -54522 -70693 -93940 -72591 -73045
15406 -73045 -51589 -50918 -61542 -34544 -17888 41091 117584 129755 62804 63996 189277 294011
15394 294011 127000 76618 97895 167363 153344 158125 93280 -16073 -105468 -89755 -107581
15383 -107581 -36864 25432 -56117 14460 186491 193044 191747 140445 61737 -26027 1024 -23200
15371 -23200 -91356 -136118 -233576 -162136 -35587 89107 -4730 129229 330753 175015 107289
15360 107289 93729 77886 -34734 -119474 -135489 11190 8878 -19582 -200988 -83315 -328
15349 -328 -37534 -27283 -32695 20803 -60919 -58718 -112583 -237560 -224640 -151589 -39967 -39554
15337 -39554 -32519 -48948 -53211 -57859 -150290 -46018 -25376 -30086 -124691 -130514 -56629 34473
15325 34473 140518 41417 51445 247613 319660 290889 224831 195182 140392 21367 9445
15314 9445 90878 59221 135463 104009 57460 113132 78880 97504 65510 -32092 -39718 13027
15302 13027 36013 -12856 -71015 -2838 146622 96136 63831 85834 170085 159806 45214
15291 45214 66001 640 -31458 -16550 45188 -87019 -170425 -196325 -104612 -87668 -81898 -130610
15279 -130610 -194988 -137281 -86927 -40476 -97348 -71241 -90737 -102289 -138581 -87943 -1077
15268 -1077 14215 137327 157154 32470 -65261 -20987 -1793 -82636 -84368 -15265 -11300 -28881
15256 -28881 -42007 -97485 -140446 -170705 -232952 -164104 -54461 -28914 5884 -113542 -54033
15245 -54033 -71064 -59926 -32876 -14307 -47043 -89069 -129548 -54189 82434 53745 23397
15234 23397 78350 51291 124783 111994 69979 71382 2567 -60667 -63904 -28085 71938 35157
15222 35157 40585 54744 23838 -28882 -18266 23712 102708 118779 38121 -33696 -8164 46606
15210 46606 38841 -2823 -17808 76917 12014 -137147 -118393 -127208 -197838 -174435 11080 152380
15198 152380 91464 10677 -96550 -130288 -30294 -45152 -67712 -46853 56070 44054 -25363
15187 -25363 -94406 -182340 -206402 -62466 -36600 -98210 -137682 -177357 -109311 -44012 20395
15176 20395 14470 32671 55942 101783 156100 48386 -29123 74004 80417 -109793 -142036
15165 -142036 -65645 -60873 -69561 -91308 -12929 10847 -44644 -141218 -22423 105774 155806
15154 155806 201537 208742 141807 111885 27214 83904 64198 -62960 -58727 109989 257086
15143 257086 283278 70425 -89178 -64509 -150168 -133741 -127525 -23237 4219 64485 67358
15132 67358 21593 -8265 6333 -4237 17241 8819 8536 35593 -25451 2400 -9624 -31365
15120 -31365 -98071 -74073 -60029 -114631 5774 13016 25885 -57437 -97733 -130346 -20322
15109 -20322 121482 110870 59219 -878 5118 113238 136423 43827 -83353 23630 46282
15098 46282 -24829 -104416 -82876 -152315 -169604 -173315 -164316 -61014 36214 -4888 -59665 18733
15086 18733 69247 -19181 -79396 21544 36907 25010 29510 108927 179693 146963 -30770
15075 -30770 -74941 -28939 175735 329964 311239 207814 152132 62256 -17396 -19325 -56542
15064 -56542 -89942 -46071 26249 -39268 -165323 -167671 -179841 -125805 -329974 -319413 -55872
15053 -55872 3422 27927 411 -18932 -47003 -65267 30862 33649 -40821 -8163 -59287 -89567
15041 -89567 -75400 78647 130127 64414 -22562 -54096 -38586 121310 205251 224555 159621
15030 159621 77674 -6475 -6488 -3976 -23555 -6459 -93656 -129072 -91456 -68156 -140204 -125922
15018 -125922 -81487 -83868 -9190 -23159 35194 6841 -40181 -119293 -80388 -58688 -132781 -124373
15006 -124373 -65927 -92080 -12000 103138 216318 229604 249591 205065 98019 136507 175059
14995 175059 126870 -48948 -44590 -133367 -73605 -125114 -85061 61785 8648 15692 932
14984 932 16227 1981 16502 -7893 80244 138048 71357 50300 3627 28282 55192 125549
14972 125549 175311 65866 50354 23421 44890 26649 1391 -28534 -17145 111297 111244 23661
14960 23661 -2006 49620 70848 102342 160132 149026 63304 93006 96842 60163 -62437 -109460
14948 -109460 -39137 77639 108078 81176 -38521 -102232 8024 64530 -36296 -28138 -81655
14937 -81655 -146585 -66892 26542 179525 148108 40903 47004 -2227 -53610 -101206 -140227
14926 -140227 -45738 45239 37196 35542 92347 97320 72229 -27841 128115 188773 73110
14915 73110 -13404 -49135 -146271 -92579 20541 23121 29065 55879 116916 76872 71026 130542
14903 130542 140509 79809 -20295 -86459 -17757 -51681 -103090 -84677 -17092 -47852 -64825
14892 -64825 96553 93917 13904 46181 88700 39062 -41350 -25947 145907 200922 78502
14881 78502 -76434 -137596 -144464 10981 104820 46446 -73774 -188574 -251681 -241241 -141186
14870 -141186 -62113 -80026 -72500 -30796 -62944 1659 157797 213970 159764 86856 134799
14859 134799 101745 2941 -75036 13194 41686 -41267 23135 63469 58297 55816 20438 -133786
14847 -133786 -77912 -65772 -6042 142259 165048 110846 81749 42338 -15890 -17054 28472
14836 28472 30769 -45443 27107 70724 50532 54244 30054 16820 -93757 -95680 -99558 -80415
14824 -80415 66892 40908 -86476 25187 213266 178943 104043 -34447 -145757 -7469
14814 -7469 125368 22208 21086 106161 79659 -2115 -26517 44680 88460 -52731 -140989
14803 -140989 -88002 61951 96949 127718 203202 200790 213534 213656 79559 -29976 -7597
14792 -7597 13617 119683 142606 203411 178628 119668 69700 121342 -55726 -119705 -62178
14781 -62178 -96162 -6562 36182 84803 91656 -26409 -55846 -147556 -86182 -20844 70672 75647
14769 75647 150625 260221 262574 169197 65049 -11522 -25274 -24106 95952 20963 -91687
14758 -91687 -39474 70710 135358 36515 -80032 -141379 -75526 -54482 24859 64590 89137
14747 89137 187471 218572 91031 15924 48286 162514 177953 112988 235957 325871 226101
14736 226101 219688 240292 174306 144855 158010 135484 65186 -79210 -91153 61866 284606
14725 284606 255537 72771 -13484 8329 -25465 -70593 -43943 -106883 -159057 -110347 -5029
14714 -5029 12593 -29366 28962 40353 -1132 1975 -26146 117982 167764 113503 95803 41741
14702 41741 128622 77344 39522 58588 -41282 6249 126221 93990 82316 161943 169635 154910
14690 154910 177843 140889 -1502 -58840 -40511 48845 66255 -96940 -17479 -20676 90083
14679 90083 110053 163259 121811 -21646 -49316 -10173 17953 -69130 -64013 52778 131686
14668 131686 122911 96231 -26205 -14141 64397 -32637 -120740 -101143 38665 58463 -23817
14657 -23817 31411 52700 53438 -18094 57188 114360 162556 120638 50254 10473 47309 -8224
14645 -8224 -55034 -124872 -59647 -11342 8166 -88751 -136222 -239141 -325643 -240800 -81351
14634 -81351 7825 133915 81612 179359 212933 224671 241387 240344 286064 221268 45654
14623 45654 -7381 -88511 -26795 178028 171615 15227 -79596 75370 51933 81970 158018
14612 158018 202405 63030 -56714 -53194 -9902 11353 -29210 -179586 -119675 71546 108952
14601 108952 6762 22396 33265 113390 110014 -128630 -72266 102617 73033 67039 76770
14590 76770 145900 128665 65274 -42339 -42004 4440 -18130 -103932 -53169 -25430 -43770 9589
14578 9589 -1184 19300 -39624 -60576 457 27968 -33119 -115954 -122457 -63373 -50784 45772
14566 45772 111988 127810 60459 35428 84723 2236 -43444 83200 118418 155853 205030
14555 205030 187559 80676 74844 143321 135104 -4616 -29429 -36840 -50411 -137481 -179620 -227415
14543 -227415 -162054 -135779 -50662 52213 52616 49432 119641 123308 81351 68694 67132 -14485
14531 -14485 -36533 -51325 -73225 -149099 -278153 -330982 -321615 -214964 -108967 -9651 29005
14520 29005 16497 -74043 -34482 -43792 -84619 -34624 19671 -28154 -73143 -21947 -81385 -169407
14508 -169407 -100300 18659 51734 -21411 -175192 -191532 -147176 -91303 -103331 -61419 -125053
14497 -125053 -233158 -208695 -124819 -8704 -61726 -182229 -148455 -78140 -11139 -25766 -110466
14486 -110466 -240583 -171149 -174485 -217116 -172955 -98377 -96347 -147558 -146860 -144386 9631 104768
14474 104768 55909 54003 99679 135452 138721 -61913 -77809 28437 -1771 10558 -19688
14463 -19688 6216 -35492 -26613 111260 196579 111747 -50891 -83476 -22423 54639 -16756
14452 -16756 -15693 -28158 -3764 9224 39647 6192 71575 15868 88028 181635 168645 220393
14440 220393 249663 290150 250490 233212 190764 209733 164055 169071 135790 79513 141549 190864
14428 190864 71199 -54169 -73948 -83920 -58058 -29056 -64972 -99126 -250337 -207891 -108209
14417 -108209 -74937 -117022 -91114 -53748 -35230 -30070 -6505 19625 49020 181077 115289
14406 115289 75168 28360 29618 7225 26522 14427 -122989 -161180 -196015 -79708 1865
14395 1865 -68301 -34563 52728 71750 11870 27435 45797 172449 124935 88931 107610 25370
14383 25370 -37995 -16741 86489 149596 127939 160300 99926 126420 71579 -8600 28597
14372 28597 50670 23636 45717 121730 106627 71134 19758 -43931 -37554 -944 -75481 -170957
14360 -170957 -144124 -80087 -36346 -89457 -43355 -4623 -65566 -168165 -197004 -301921 -298105
14349 -298105 -225083 -120088 -53781 -88570 -105942 -39020 15505 21793 -27790 -122019 -51276
14338 -51276 79494 132803 19307 -53995 -87694 -54812 67985 7943 -78747 -96781 31573
14327 31573 125136 150202 65300 61395 74744 -29932 -91579 -71599 -65629 -116330 -21759 -67059
14315 -67059 -143825 -130345 -119025 17547 -32064 -72370 -44035 23403 11697 -93141 -120865
14304 -120865 -111883 -125486 -253384 -197319 -10137 75891 25056 26061 82252 -23409 31294
14293 31294 25609 -101068 -103933 -43963 -29246 56331 49050 -30076 -87162 -106896 -136200 -49885
14281 -49885 -69941 11716 38913 137007 108603 123873 97154 -61256 -102865 -50059 34988
14270 34988 107983 -55137 -158486 -118948 -71835 -129821 -142338 -112757 -101504 15488 48398
14259 48398 73729 78768 146392 147473 154559 116004 96072 161313 65397 -81456 -40411 36673
14247 36673 -39929 -121891 -41382 -94858 -134447 -133108 -133434 29396 99580 23810 -35984 34927
14235 34927 -12696 66054 127936 165499 139439 118314 104202 48044 54060 42609 81976 100024
14223 100024 140147 46671 -10171 -66514 -10346 32876 -13228 -59781 -61577 -93388 -116666 -7556
14211 -7556 2615 56208 42336 -83661 -101122 30770 53865 154725 210326 188292 129181
14200 129181 112443 93537 39142 57049 134519 77667 -17014 -86180 -109457 -77769 -121515
14189 -121515 -92595 -127501 -139971 -161445 -190946 -158284 -139449 -134462 -202076 -229626 -169692 -90299
14177 -90299 -116827 -72853 9284 -54346 -164969 -130561 -112823 -13549 -40174 -170179 -134122
14166 -134122 -52351 58426 84703 43196 59475 90644 102622 23830 -37159 -85823 -36927
14155 -36927 -72031 -101155 -118655 -107848 -94680 -108485 -178946 -80338 -129948 -87095 65848
14144 65848 128010 156194 99661 -1928 -26597 30799 3973 -1325 27410 66222 46466 36739
14132 36739 18211 2923 -63560 -101621 2876 79771 10158 -24583 -59292 -156405 -126129
14121 -126129 -66468 -87436 -69081 -145994 -129362 -45454 -120455 -59752 -7729 -22367 -28830 -25774
14109 -25774 70225 58020 -31303 -29316 37555 91144 104803 48212 32997 41465 4803 55622
14097 55622 93718 71612 162968 14593 -111732 22617 83493 47306 -97396 -147567 -70900
14086 -70900 -59583 11658 -152947 -235851 -163327 49336 -1996 -118196 -140349 -91835 -67705
14075 -67705 -48909 -19597 60869 67501 32175 -68343 -147408 -42252 3080 -2475 23283 72683
14063 72683 -19848 -95395 -155292 -216547 -158546 18218 80561 102364 119470 150185 153582 80853
14051 80853 80903 130201 -4745 -68683 -17855 -60083 -26337 70647 229738 197480 -47188 -160019
14039 -160019 -118381 -53163 -55241 -114673 -218120 -246783 -167586 -94569 -123544 -98665 -105782 -131985
14027 -131985 -84539 -44857 105492 128857 26623 -24683 -27021 -883 -11984 -121832 -212205
14016 -212205 -125615 -21949 -110883 -126296 7006 59799 106788 157300 -14007 -62744 81960
14005 81960 107063 45260 -85518 -71181 7599 143009 176725 150075 115703 60694 -31615
13994 -31615 -25348 152808 266420 218881 70045 34528 7457 -76892 -57362 -13008 37596
13983 37596 162888 260682 183434 78169 112509 141816 130082 145194 56232 44626 35716
13972 35716 119423 199767 142063 101 -15502 -3258 28356 -8712 22900 -57569 -220718
13961 -220718 -189855 -127960 -185706 -110270 -30916 10403 -469 113225 120681 53464 93399
13950 93399 107119 100002 59825 -32053 -48807 48359 60022 -34655 -18617 48102 -11465 -91241
13938 -91241 -235975 -187978 -75769 20243 19860 -33156 71603 72924 43291 -27673 -69329 -72597
13926 -72597 -15392 58807 40525 75207 53515 11552 -43058 21301 128679 87374 3908
13915 3908 -26353 -119077 -223129 -126762 26585 11147 -28416 -57197 -28956 7995 -93251
13904 -93251 -137575 -211147 -191832 -149807 -34583 -20613 -83852 -116036 10072 120287 36835
13893 36835 -20786 -82580 34723 49486 4087 17950 140768 162364 108689 16055 -82828
13882 -82828 -26403 5725 29908 12366 -60896 1564 12378 -77544 -162032 -188121 23261
13871 23261 -23009 -201992 -133076 -39127 17566 58729 150230 154088 102340 56666 23574 47994
13859 47994 145396 203214 57933 -42938 -142525 -11377 -3241 21973 43832 75922 34158
13848 34158 99801 17844 -16610 -30794 -119 -31136 -131088 -139298 -59965 4346 -6187 -113363
13836 -113363 -202145 -200160 -89199 23593 -132343 -101274 -8727 21377 -7411 -32232 3296
13825 3296 -34410 -77945 -125092 -70013 -59247 18340 56340 73748 76760 116401 33616 -31099
13813 -31099 -160957 -223635 -141310 -87074 6153 101719 258696 257997 272073 275509 147196 72366
13801 72366 19643 -15214 15814 90550 109819 51353 38961 32398 4858 -134087 -277436
13790 -277436 -233475 -134891 -127165 -65271 36782 122488 91035 73393 28920 40821 145564
13779 145564 136292 93519 34341 -69492 -138268 -50638 -27576 -36133 -47247 -6428 1716 -59260
13767 -59260 -151448 -91590 -11719 77640 22005 -48638 -3870 -9156 57925 146164 138407 136236
13755 136236 47522 -132679 -94096 -120473 -70751 -147441 -137307 -67163 20938 -20252 -41576
13744 -41576 92883 113031 75437 87624 51351 -7359 -46681 -31487 78713 152058 172496
13733 172496 53170 25864 107558 32628 35601 19301 37384 -68262 -53727 20937 -28797
13722 -28797 -51493 -120367 -175332 -82150 -13692 -61596 -97272 36309 187915 194873 98255
13711 98255 48650 -94848 -78737 42905 83465 216524 223268 117187 36829 91165 103316
13700 103316 -33647 -14978 102761 -25011 -257177 -344580 -207240 -146407 -39977 -60791
13690 -60791 -56097 -8885 21938 -4008 -30173 -40676 1952 -22169 -161255 -61226 -88709
13679 -88709 -75136 -91446 -110870 -11704 -2056 -106928 -34247 701 -39312 32866 211095
13668 211095 181453 26461 -6571 67065 6801 -73100 -87871 -73938 51558 106735 133295
13657 133295 40122 44292 -71890 -189470 -186029 -29202 -518 -21992 -30158 -148848 -238432
13646 -238432 -260812 -228997 -154383 -32317 -60317 -62519 -52675 96701 148974 108845 43493
13635 43493 -122313 -87913 -39126 40619 234312 203991 265147 241025 48442 53546 245042
13624 245042 354648 169372 55403 71200 4422 -12854 -25414 -75475 46628 68851 54055
13613 54055 -9629 -58639 -83119 -6437 37221 22772 -76271 -71851 -18135 -43130 -139225 -39874
13601 -39874 -52755 -126472 -100850 -9681 124880 156920 143043 51455 103215 28670 2470
13590 2470 -49845 -91453 -68663 -23529 -46379 -46536 -77452 -85731 -67785 6759 -46887 -102975
13578 -102975 -79595 -19515 82569 44607 -88594 -146142 -191030 -284902 -255951 -187493 -14231
13567 -14231 23241 -38435 -22733 183806 292683 298974 156976 113981 77043 -2089 98638
13556 98638 59957 -16487 -22655 144305 184182 133280 119074 78325 82928 69444 670 -132604
13544 -132604 -95543 -71650 -47698 15456 81460 63831 52525 16216 -19640 67386 88911
13533 88911 -67294 -148591 -63613 -29026 -11891 35188 143835 214544 107711 -83139 -114209
13522 -114209 -73579 -59907 17400 108056 42549 18161 -26818 55292 -21807 -136255 -115359
13511 -115359 -115679 -104956 -67971 -193114 -159720 4470 164634 274629 202153 57124 -55690
13500 -55690 -206323 -264201 -276856 -188456 -90788 34794 37304 -69180 23391 211055 285335
13489 285335 227601 114906 36723 -38043 -125371 -109117 83202 137825 46500 -48883 -43975
13478 -43975 -32029 -179962 -249823 -225067 -55949 19288 89680 27942 -63255 -20779 -80037
13467 -80037 -160266 -148110 -120817 -115974 -93898 -148102 -163850 -378 117417 142991 65461
13456 65461 45071 79158 105893 -124295 -98599 88874 35847 -131461 -225097 -79295 69824
13445 69824 89333 31831 -33014 8915 113454 145978 59802 -73695 -179992 -264078 -181377
13434 -181377 -43388 14857 -40666 -91884 4975 53287 6180 -52162 -106097 -89120 -8028
13423 -8028 49517 -12438 -109778 -94410 -128555 -41939 -9203 -21257 455 -80100 -184007 -56831
13411 -56831 124118 61638 20459 -11174 -32125 3451 -10440 -18649 51101 32389 39114 87729
13399 87729 21177 -78392 -126927 -96009 -88466 -113940 -100124 -116329 -180911 -113189 -70631 -27492
13387 -27492 -33773 -100489 -59388 -28396 -31248 56055 114453 108522 49611 -41879 -125991 -177284
13375 -177284 -354251 -305709 -177186 -111347 -104493 22952 107453 125867 118256 50237 105282
13364 105282 4866 54522 71869 -48721 25740 -41293 -178032 -144625 -100566 -173883 -238455
13353 -238455 -264922 -324580 -164569 36943 -73216 -152304 -150761 -122168 -31658 19808 85775
13342 85775 113192 115143 106973 87180 11531 -53275 -49853 83000 139231 114580 113702 84617
13330 84617 90759 100399 74724 -33718 -106887 -89785 -84958 -40659 -36165 -27915 30419 54180
13318 54180 73823 147432 174467 105672 94206 49396 -32136 9638 79006 80809 125483 118618
13306 118618 151120 181315 164430 96995 76756 69509 149850 195782 158096 164844 153636 97678
13294 97678 55720 74030 137701 124757 112859 108252 110833 189443 133273 61909 -44325 -25022
13282 -25022 50479 47396 20074 -31911 -14462 170696 217063 156894 80923 -53613 -53535 -10157
13270 -10157 -46451 -54163 39648 89900 120992 168208 265102 231024 234063 226157 137011 115199
13258 115199 80214 34245 -27296 -118505 26950 110922 72175 56233 113266 88686 105075
13247 105075 37759 -15758 -18664 119462 109922 43119 18265 94990 195875 164040 140239
13236 140239 107727 81591 95632 8166 159357 235238 135409 83451 -7505 51265 36589
13225 36589 86828 31955 114783 249820 292099 262508 248140 329347 221545 99182 105210
13214 105210 155317 148807 73224 28809 147246 182811 116763 108181 188254 196459 168637 178225
13202 178225 95584 -29237 -17142 -20502 -19516 -6618 70028 52102 -678 -108407 -132969 -121245
13190 -121245 -22025 -49802 -60018 -9804 46176 12909 70468 68361 4950 -79356 -20006 53296
13178 53296 58294 98 -32329 19924 3824 42840 109312 202814 137660 21326 21296 -3564
13166 -3564 51599 97999 15025 22466 69738 97287 181904 114870 76828 165470 124137 107030
13154 107030 70679 -58083 13436 129298 177799 206651 172925 239553 193303 145337 77611
13143 77611 127871 235908 161557 154844 126129 133597 163869 123507 33065 68932 60913 -42905
13131 -42905 -217973 -206013 -208101 -219568 -208461 -170136 -116778 -47319 -33894 -29339 -35951 24400
13119 24400 167775 141291 111419 53600 -179379 -180767 -39871 19215 25547 3825 -101568
13108 -101568 -14739 -27887 -117356 -75413 21641 54792 -1394 -3529 -36925 -76549 -18009 -47088
13096 -47088 59642 134255 206445 209316 118426 -28685 -80504 -61083 5599 -24715 23555
13085 23555 16753 40390 74798 63689 28464 17704 16336 86939 130438 102565 -12397 -35964
13073 -35964 80569 84135 12861 -35244 11551 78070 170273 198198 160171 49655 39658 31435
13061 31435 33579 9963 39932 84678 121774 144218 221570 261888 275367 282255 231270 305763
13049 305763 288417 167706 99505 105283 108013 72053 41947 46552 54676 150636 184244 211018
13037 211018 146585 147629 102867 -4550 31132 151096 133551 11439 24290 -58454 13216
13026 13216 147629 156001 128137 116279 135573 158101 118851 66083 72906 43318 -26589 -80347
13014 -80347 -71859 -22676 70603 135967 131842 55486 -1812 -59967 -33263 26692 82633 65977
13002 65977 115419 120851 43473 65755 56095 -27092 2576 63783 128679 22468 5133 72617
12990 72617 210535 151450 54033 18780 19901 42381 101596 121145 71487 57560 5826 19873
12978 19873 18381 39455 11665 12460 67436 37510 99320 80849 111525 143078 118928 129450
12966 129450 91987 16498 -4800 53360 56610 95675 71501 44341 52511 53914 21779 45485
12954 45485 76435 144004 166544 114372 116033 54266 15088 1131 2017 -25621 54635 165587
12942 165587 185723 204613 229944 247813 226144 207420 148197 48345 11031 24295 83678
12931 83678 169619 204753 136477 91231 84550 87748 66853 78834 148873 125869 15934 67244
12919 67244 73038 168166 339863 287995 136942 70801 65140 43459 150755 164442 -56914
12908 -56914 -146650 -161605 -18472 -22866 -91557 -139971 -14387 101046 129623 125182 161975
12897 161975 254235 270350 300273 313298 211595 210837 86367 92549 12712 30606 9375 -4924
12885 -4924 63061 104309 53149 -36962 -53570 54165 39746 -24723 -96709 -70206 10856 45890
12873 45890 3054 214654 381771 284298 298352 324093 304801 201589 134427 172946 155433
12862 155433 170916 38663 -53079 -109146 -71960 90959 111722 97765 102798 157895 70759
12851 70759 34241 92332 212356 222458 112769 116297 92900 9347 105140 189413 144250
12840 144250 98692 103654 47153 39599 133541 155644 193670 164590 154504 97291 33753 7145
12828 7145 19391 71980 173457 293870 245798 182465 261672 111920 75194 133124 159667
12817 159667 197344 107144 77931 99178 46183 103513 162892 105557 19610 43768 283713
12806 283713 278806 197058 331961 321778 209321 252160 195678 160457 119274 7375 -142382
12795 -142382 -112404 -34924 29242 121610 28014 126224 198378 138039 112079 129686 34334
12784 34334 158707 148922 108242 39795 -48484 24718 50523 -19858 48140 77080 142168 105307
12772 105307 74610 114390 125582 9958 54749 -3857 3527 -19848 -49335 3209 23575
12761 23575 33665 -7187 -34765 -112352 -139522 17134 72792 -38676 -30402 20479 125385
12750 125385 158616 265226 256435 212866 154889 195134 262280 254160 287172 275055 191602 248596
12738 248596 217559 177259 140808 201887 253274 99252 48513 -505 40782 133589 131410
12727 131410 177923 63928 65809 182275 186362 204777 102589 87684 204262 248101 248566
12716 248566 136764 112041 154601 211062 203154 169144 253289 228908 250795 298233 231085
12705 231085 232913 303938 256652 149843 185632 117864 67919 14322 134359 254073 284483
12694 284483 96644 84983 82604 44890 64496 32297 45319 108106 116873 67121 157753 211364
12682 211364 230977 184618 159447 286979 420413 422617 401911 341478 298431 316825 419920
12671 419920 414346 448790 407237 304804 313537 431046 444816 500987 573798 575534 458117
12660 458117 298405 310118 292908 332114 369427 355920 292710 299624 175343 233193 345897
12649 345897 293036 347122 344434 100642 -2183 40717 112468 83676 100494 154753 200803
12638 200803 145333 96411 175325 221980 245882 230960 253008 338035 351889 417737 436895
12627 436895 466307 514348 545471 499557 382282 398562 310936 375068 353018 261496 258444
12616 258444 173992 238865 299877 383270 429383 328364 277708 297087 314493 349031 359695
12605 359695 286064 356747 312368 161955 -24354 72250 181517 182298 226286 203245 156307
12594 156307 158096 218301 304451 362422 344952 328813 265579 273320 332998 361456 342272 366197
12582 366197 349450 376080 417527 294234 214846 151282 89316 74374 91923 110188 169441
12571 169441 156799 85527 48989 39131 93178 115367 152153 223437 263991 115320 92746
12560 92746 144071 91725 27537 -11501 -11770 -76082 -74471 -2139 154677 213551 247717 136384
12548 136384 216865 304103 327504 348456 200735 248904 469537 458867 442237 447470 406231
12537 406231 378593 384924 517110 588261 572570 455422 428405 460868 482224 466262 447833
12526 447833 367395 227774 185945 201893 244302 264234 272821 227204 188955 218741 279589
12515 279589 292217 262620 179724 278133 366948 312940 188860 220083 289236 387804 367357
12504 367357 325035 436662 562025 546984 429130 352252 399477 391328 418879 391772 462649
12493 462649 533233 625417 655973 622932 479481 393866 445278 433551 353157 337011 336126 304328
12481 304328 216662 118000 80124 85956 171141 308907 459910 359822 267895 258735 257309
12470 257309 230374 237562 264439 237492 249416 398819 500267 429783 331000 464036 412526
12459 412526 302737 260665 119935 87198 198522 178901 126681 117689 168069 164106 198127
12448 198127 251816 290467 362134 411374 356423 302505 330054 255432 180416 116690 47016
12437 47016 127514 75870 7061 16644 107970 177732 226921 174899 117837 207933 282766 324950
12425 324950 284314 313228 377684 432361 486963 564508 504483 305933 262968 364199 454205
12414 454205 436340 358413 276610 380430 295957 201850 359194 501441 427430 351974 333721
12403 333721 324112 347978 267318 280875 340596 485786 503694 397550 309614 391998 379241
12392 379241 461264 473547 425301 410108 421141 472323 455562 413171 415764 327423 311677 351203
12380 351203 296896 287406 301578 420200 375085 297796 270071 291815 325642 395156 483506
12369 483506 492428 366239 301972 241237 176226 206511 365322 375716 362828 411547 418389
12358 418389 475538 536530 641349 651217 525772 447740 495814 568295 622418 651898 841731
12347 841731 866323 773527 787238 905056 759871 570204 535197 599285 600374 565189 398155
12336 398155 302489 422639 479437 417111 395656 534660 495773 380141 227952 195403 307658
12325 307658 333263 452902 494782 409940 423644 482423 455779 344498 500051 590440 573972
12314 573972 546978 613050 700534 789632 749437 722080 823895 824569 790987 850533 884327 869492
12302 869492 870682 791555 781299 809366 865759 980326 855618 835627 888207 932445 725776
12291 725776 596235 575611 648623 730990 694915 574417 516311 542428 540283 510857 440118
12280 440118 402846 580013 716741 779894 644950 443534 429095 497035 515063 419649 357361
12269 357361 428204 580005 537802 494909 479119 535943 497600 505705 535185 556323 567133
12258 567133 576291 607538 562715 594702 660481 632797 676704 766896 872023 731020 497017
12247 497017 540450 643298 645132 624428 563520 562993 627045 703506 705025 706608 612253 607826
12235 607826 682008 682988 605804 619371 804614 889081 925801 860748 708113 681777 673972 711530
12223 711530 643272 629807 761091 781186 667706 721499 763579 807684 655459 671466 763231
12212 763231 888049 974121 900054 882290 886005 848809 800044 710700 733655 768512 773996 812439
12200 812439 796673 977125 896118 820499 844244 928442 851738 874325 884423 866598 876681
12189 876681 896324 924417 901722 965483 844417 827018 757416 874460 768603 671524 733183
12178 733183 793256 830007 827066 826205 749571 784613 863751 925349 935249 926250 984872 937411
12166 937411 815923 752980 773166 791961 850933 886755 900576 957285 930619 984414 956332
12155 956332 939612 941498 953459 1093000 1264556 1397867 1408516 1298360 1300714 1159110 1017840
12144 1017840 1011425 1054135 1077956 1028499 921539 904593 1007064 1079168 1064889 1023783 933553
12133 933553 1041933 1128522 1102535 1169120 1182207 1172037 1196005 1295728 1318973 1311575 1241424
12122 1241424 1092312 1155352 1215029 1329134 1499647 1508830 1394769 1338687 1316634 1460953
12112 1460953 1649422 1661564 1627782 1573053 1551391 1575215 1640839 1678134 1706998 1735609 1799751
12101 1799751 1739932 1626560 1746306 1895656 1897976 1860778 1883859 1875899 1966714 2048262 2038547
12090 2038547 1917025 1891186 1972362 1997543 2108727 2095951 2057133 2173046 2275845 2229827
12080 2229827 2088126 2203733 2338318 2464901 2568139 2668944 2686378 2667117 2725555 2759604
12070 2759604 2769064 2732000 2809476 2769244 2860113 2819199 2805071 2867500 2862724 2913144 3035332
12059 3035332 3157522 3143477 3103968 3182485 3340313 3276105 3227004 3316103 3369302 3395159 3475202
12048 3475202 3528536 3529626 3628645 3717043 3840255 3826353 3919971 3946752 4063823 4197409 4237147
12037 4237147 4314631 4303433 4382928 4457595 4551911 4708773 4717911 4749228 4842969 4986854 5115862
12026 5115862 5224589 5245471 5400694 5508126 5603057 5627993 5738147 5900801 5976994 6143626
12016 6143626 6328787 6464281 6773910 7025904 7124082 7212254 7388036 7637856 7812231 8037107
12006 8037107 8124272 8182591 8342242 8515433 8723296 8962629 9195385 9470247 9625359 9774047
11996 9774047 9992871 10277156 10570777 11004801 11314008 11581285 11831031 12131714 12573331
11987 12573331 12839076 13230410 13637079 13950045 14228255 14651231 15180994 15713317 16279825
11978 16279825 16738758 17252537 17853152 18365722 18818129 19378611 20056019 20696164 21371063
11969 21371063 22041441 22794764 23538227 24301557 25032207 25888366 26629168 27530408 28333834
11960 28333834 29222427 30196811 31088463 31936340 32849022 33965405 34974649 36049371 37094060
11951 37094060 38024769 38973599 39873007 40697620 41578776 42366186 43129166 43878369 44629955
11942 44629955 45210170 45657431 46174348 46623964 46987554 47205929 47362291 47285974 47202444 47190395
11932 47190395 47030605 46810943 46505598 46026217 45471550 45019213 44581577 43987748 43250985
11923 43250985 42521682 41742429 40922193 40060546 39193004 38347448 37611623 36848296 35973392
11914 35973392 35032546 34199470 33421363 32680722 31854841 31154888 30370747 29552522 28741884
11905 28741884 28046050 27425134 26714976 25889684 25064673 24422244 23863520 23239569 22617257
11896 22617257 21974323 21440930 20855872 20386095 20004523 19600425 19145637 18681184 18109294
11887 18109294 17700055 17341623 16928165 16410933 15977849 15631660 15250140 14933720 14653169
11878 14653169 14288290 13924435 13639590 13244585 12853150 12631940 12377135 12060644 11782773
11869 11782773 11583231 11385230 11060031 10827766 10630833 10403080 10090375 9864221 9610431
11860 9610431 9442047 9362752 9167236 8867831 8729176 8593837 8421698 8270618 8109553 7916812
11850 7916812 7775111 7665481 7517828 7318813 7209866 7177892 7170211 7007830 6912049 6720891
11840 6720891 6506240 6450876 6359302 6314516 6154020 6025659 5995579 5998665 5839787 5667398
11830 5667398 5538771 5360511 5123526 5083465 5040658 5057492 5074769 5093555 5077356 5001319 4856627
11819 4856627 4755084 4633832 4488147 4349548 4304237 4204696 4000367 3957208 3918713 3882468
11809 3882468 3825840 3706607 3867674 3974423 3855895 3702606 3575011 3539805 3511462 3366660
11799 3366660 3300057 3307530 3245291 3196216 3123678 3086948 3037246 3088890 3006154 2908956 2932317
11788 2932317 2917220 2827074 2837598 2829891 2825045 2762512 2800709 2647434 2525691 2510459 2493401
11777 2493401 2488185 2600106 2651783 2663422 2524830 2397756 2442892 2464420 2288156 2213621 2304769
11766 2304769 2307454 2191865 2202623 2209853 2106316 2050194 1955323 1914563 2036909 1984047 1917116
11755 1917116 1905316 1881502 1958189 2075188 1963059 1790844 1679628 1711977 1873522 1852754
11745 1852754 1746542 1650028 1632603 1584137 1574208 1653536 1645685 1514184 1456022 1392116 1382713
11734 1382713 1331205 1337534 1349484 1393767 1385762 1420106 1492532 1515386 1564920 1535075 1472725 1388143
11722 1388143 1347950 1307272 1275814 1260158 1305613 1340624 1364470 1323342 1327623 1281773 1219779
11711 1219779 1129405 1132106 1191375 1259436 1245055 1303264 1323247 1296561 1246669 1253998 1169537 1241794
11699 1241794 1358179 1250567 1183964 1061355 1020863 1124026 1189489 1216131 1254776 1176021
11689 1176021 1034365 1041071 1092640 1061590 976617 866543 808191 822806 766343 858583 975014
11678 975014 1096379 1117844 1068188 1064274 1031088 1135389 1168124 1194270 1078889 977880 949975
11667 949975 881392 814143 800604 900092 975487 947723 879092 886167 909936 940130 959116 972834
11655 972834 847290 919956 922509 865806 723458 609433 603373 573975 582378 567414 576467 591976
11643 591976 716091 822024 812569 786885 791656 757441 705904 682804 757665 929000 791810
11632 791810 671829 752734 781172 755633 799378 804905 813298 704564 583617 665528 653827
11621 653827 583759 701906 698616 705443 832429 749557 752415 808067 746455 686694 694184 607842
11609 607842 579150 600798 654283 595814 550379 529874 488516 533222 605077 575256 517438
11598 517438 556845 547681 510679 559699 647935 639250 600842 720598 766218 698466 612211 541807
11586 541807 559101 565970 622097 729411 689689 612243 668973 817417 857292 932691 1074469
11575 1074469 1081980 1145640 1172666 1226655 1271598 1196031 1245303 1345499 1436052 1422222 1215650
11564 1215650 1070728 1049405 977011 986543 997584 980350 878955 854963 848712 888920 783284
11553 783284 678227 623494 705967 602060 670266 723324 724650 659030 559180 487072 582981
11542 582981 495346 550781 741960 717704 726912 864529 925297 872819 984347 1020828 1092610
11531 1092610 1111097 1263660 1488579 1622715 1727889 1830403 2054303 2244997 2248651 2308815
11521 2308815 2416761 2367989 2275897 2316472 2160454 2033091 1958989 1881525 1775055 1691932
11511 1691932 1472133 1236224 1143960 1048396 1010800 1101399 1122191 1016579 862513 794407
11501 794407 928354 947196 932111 957498 896630 828489 840435 774300 690136 651577 629900
11490 629900 661913 572328 576815 538092 612298 764519 831488 838141 932729 1034445 1141289
11479 1141289 1162511 1183820 1391606 1632847 1658940 1616706 1617641 1537242 1543968 1659315 1619572
11468 1619572 1453948 1297292 1229082 1105708 980438 911627 822387 800606 807456 722091 748456
11457 748456 775436 744315 796905 680496 673350 731320 704320 659914 659040 657779 612920 546015
11445 546015 481885 504258 435199 391758 430199 476577 486327 553313 546131 501280 514192 437258
11433 437258 539034 575315 498230 445244 557738 680357 697531 651892 492748 358213
11423 358213 430980 520979 612419 588007 550334 603276 679643 561671 510303 500703 503968 398391
11411 398391 449779 524373 544342 534953 538557 512328 419503 443034 434086 385559 341543 425693
11399 425693 435346 358347 262718 280699 417988 493996 458703 423648 488706 587440 512924
11388 512924 480134 453187 408098 394645 303201 392690 475844 449970 525289 603089 667030
11377 667030 654056 661211 685877 595734 603681 736334 800706 668098 663424 738917 818714 872427
11365 872427 835536 701577 659766 700591 724110 769540 790368 759763 838094 940817 837744
11354 837744 792314 809617 685130 639771 658857 673944 715441 838869 896955 814563 712542
11343 712542 689408 558531 506646 490159 504505 568023 466717 523528 563075 561093 566266
11332 566266 536381 570500 543236 519644 579444 749646 838073 868339 908058 783443 795726
11321 795726 805043 702203 631439 758612 742308 758332 787847 755890 687076 656720 761629
11310 761629 836476 883201 801264 944037 895502 753936 672331 606744 623100 722406 736463
11299 736463 662322 631193 700286 778514 750957 817971 761606 767317 752535 724257 636769 634795
11287 634795 606327 612198 599685 621547 672957 736102 754340 667526 685491 753897 911848
11276 911848 952141 819918 770825 803639 763123 788184 870880 876089 862641 989201 1077354
11265 1077354 1003275 994096 1059103 1110782 1090304 999840 981403 1017177 991031 933763 863182
11254 863182 764974 817018 874361 902949 911424 968548 1077574 1070383 1185879 1276905 1372309
11243 1372309 1362589 1419063 1502140 1421617 1319754 1223981 1379836 1420021 1453680 1517144 1565573
11232 1565573 1493003 1413524 1347774 1328747 1336262 1409011 1392042 1421458 1443132 1471130 1580558
11221 1580558 1658385 1756351 1863648 1971450 1988484 1945186 1929327 1996053 1900787 1965713 2082466
11210 2082466 2191816 2270755 2270820 2254649 2276019 2325747 2399725 2389463 2457075 2422755 2498587 2750791
11198 2750791 3106158 3362351 3430663 3644370 3779638 3900213 4068530 4267016 4538505 4840050
11188 4840050 5312739 5731523 6290126 6924761 7471112 8047724 8822964 9827984 10932904
11179 10932904 12101600 13568505 15461212 17839819 20952535 25131241 30401424 36707178
11171 36707178 43972400 52224854 61467946 72110106 84045446 96507846 108697326
11164 108697326 119456886 128386574 135410026 140896654 144954549 146932723 146154059 142126640
11156 142126640 134588122 124738706 114123642 103513258 93417656 83860159 74156197
11149 74156197 64576758 56035873 48799204 43186398 39309509 36655366 34802680 33590513
11141 33590513 32829630 32491407 32378449 32371038 32552474 33127830 34120064 35358555 37022531
11132 37022531 39460943 42658196 46983272 52905352 60664503 70988724 84104127 100029406
11124 100029406 118565908 139351178 162348995 187495171 214322676 241931413 269218393
11117 269218393 294090070 314377833 328721145 337145334 340300081 338533907 333696172
11110 333696172 324817247 310986330 293190283 271272099 246776988 221934299 198815393
11103 198815393 177543048 159270002 142601583 126926721 113224037 101165131 90737054
11096 90737054 81878989 74826459 68935231 64203918 60860269 58287446 56402378 54992024
11088 54992024 53968989 53245148 52957056 53206447 53963721 55407532 57677701 61012116 65715028
11079 65715028 72119067 80251802 90112483 101801082 115166969 130112317 146686155
11072 146686155 164407149 182412270 199326974 214017425 226127958 234642525 239227328
11065 239227328 240218971 237041391 229232634 217668220 203265901 186575015 168929931
11058 168929931 151134962 133408213 115915345 99798184 85738125 74025212 65017675
11051 65017675 58251674 53152032 49208522 46092664 43446740 41101174 39018197 37256585
11043 37256585 35612948 34065312 32571332 31107941 29773150 28550486 27420823 26395866
11035 26395866 25456084 24511936 23605152 22808810 22043218 21370593 20630358 19987840 19390910
11026 19390910 18813482 18342923 17849809 17480798 17051243 16611487 16090656 15665211 15282937
11017 15282937 14869054 14614739 14154653 13793599 13328960 12905325 12635095 12311432 11945827
11008 11945827 11690719 11443845 11151589 10795955 10529314 10303828 10001400 9853617 9768588
10999 9768588 9492620 9117184 8901622 8785863 8510514 8344548 8240431 8200427 8062155 7870494
10989 7870494 7722593 7535857 7332194 7104929 6987874 6948561 6896025 6784939 6631615 6390577
10979 6390577 6166413 6088149 5977472 5811369 5666744 5399837 5159730 5096483 4984548 4904879
10969 4904879 4976755 4874066 4743578 4651231 4522449 4456334 4424895 4422923 4257210 4107584
10959 4107584 3939391 3764646 3705379 3619329 3626269 3651134 3514313 3384877 3338129 3261995 3212017
10948 3212017 3199677 3133869 3065869 3093699 3073966 2912565 2867396 2841558 2695711 2623987 2743983
10937 2743983 2762776 2608243 2659820 2688865 2609958 2528579 2553886 2439286 2323268 2283685 2263780
10926 2263780 2272579 2188414 2237076 2284747 2266008 2242304 2128911 2080713 2017628 1874089 1944273
10915 1944273 2152391 2194802 2148280 2136153 2168742 2191940 2041056 1906157 1881724 1953245 1941480
10904 1941480 1933761 2005730 1976313 1995304 2011821 1897149 1823518 1840047 1719786 1651006 1701579
10893 1701579 1744150 1626076 1566961 1541687 1516899 1480714 1451195 1515591 1485101 1607956 1651826
10882 1651826 1555156 1535905 1445790 1351301 1352560 1389171 1377248 1366741 1304606 1294569 1310906
10871 1310906 1398981 1405753 1349806 1352568 1371205 1280128 1265358 1329414 1479221 1518085 1523516 1549281
10859 1549281 1585929 1655440 1817209 1921054 2018699 2074807 2071566 1974123 1893514 1934988 2015958
10848 2015958 1919213 1834984 1810552 1864318 1835927 1685209 1637845 1552718 1566030 1559701 1628741
10837 1628741 1794733 1888583 1797833 1763161 1868199 1851642 1893079 1709949 1629887 1701281 1777495
10826 1777495 1837539 1825067 1648549 1607507 1637285 1469253 1515631 1523713 1590725 1680744 1652756
10815 1652756 1593523 1686376 1676177 1766656 1820446 1842051 1811714 1749607 1692158 1687660 1776267
10804 1776267 1754441 1704890 1770464 1834916 1857395 1879860 1907394 1853511 1774912 1756395 1760040
10793 1760040 1660252 1643069 1598092 1585048 1743942 1871518 1967502 2000064 1948514 1974232 2035814
10782 2035814 2021691 2001695 2069070 2120152 2196967 2316293 2347691 2499824 2587594 2559367 2471527
10771 2471527 2428951 2465018 2363198 2250223 2216328 2228756 2213111 2236466 2177127 2266538 2305119
10760 2305119 2381721 2486441 2493593 2486162 2453597 2546705 2702120 2734071 2764215 2891665 2918471
10749 2918471 2838239 2973573 3101283 3176615 3290767 3403011 3514010 3635012 3697248 3741169
10739 3741169 3945375 4146173 4196963 4239331 4426855 4583303 4718362 4879857 5030083 5379592
10729 5379592 5804534 6160808 6601718 7142874 7737566 8356816 9034381 9816784 10629127
10720 10629127 11575505 12706524 13882963 15157678 16545187 18245414 20380766 22930548
10712 22930548 26133037 30325441 35984397 43791314 54816470 70451958 91119255 114858786
10704 114858786 137990915 159856944 184242694 212630993 240205774 261138004 275148940
10697 275148940 280598904 271434501 252240367 232572240 212085083 183551148 149410060
10690 149410060 119607460 97974810 83351503 73497291 66783203 62194747 58734973
10683 58734973 56242574 54379736 52721720 51167108 49782078 48512251 47251912 46130491
10675 46130491 45202649 44603452 44435647 44596949 45291078 46635897 48845018 52123592 57062291
10666 57062291 64202277 73466611 83819567 95229736 110843550 131848549 154358899
10659 154358899 174362632 196186227 225467913 259339979 292599553 323692154 351736069
10652 351736069 369455896 375502937 380555825 389799390 399416330 393737777 365823735 326343715
10644 326343715 283060588 234694999 186863022 149849223 124998137 108481607 96977661
10637 96977661 88458956 82249593 77512634 74038063 71174869 68676596 66360662 64366969
10629 64366969 62751134 62024008 62049944 63051108 65050792 68122876 71724284 75499390
10621 75499390 79410714 83665429 88460846 93977535 100253620 107418248 115606567 125328545
10613 125328545 138335651 155713961 175248490 193126638 209456153 228490801 252803649
10606 252803649 279049815 300836905 314151365 315454540 304046640 289595408 280399470
10599 280399470 275778510 269171432 254776503 237253100 224748973 218181928 214466058
10592 214466058 210267090 202292088 189471039 175483235 164421198 157308007 152531490
10585 152531490 148989149 147204856 146918632 147119486 146380650 143125501 135853405 124976428
10577 124976428 113128520 103404845 96498007 91430194 87628161 84820998 82801134 80908632
10569 80908632 78525990 74986804 69659960 62851907 55862393 49654411 44663876 40790475
10561 40790475 37812432 35416177 33458364 31929357 30505186 29160666 28005315 26922275
10553 26922275 25880073 24930105 24069312 23201248 22456303 21722674 21006925 20396638 19751861
10544 19751861 19158184 18576906 18006397 17446311 16951262 16527030 16161971 15866211 15275482
10535 15275482 14681317 14152756 13733534 13451556 13157900 12775461 12537748 12182724 11875970
10526 11875970 11583062 11308175 10954846 10604496 10384237 10158713 9972424 9791607 9541585
10517 9541585 9273246 9059425 8931249 8738094 8443215 8139661 7909675 7782516 7572349
10508 7572349 7401885 7240262 7054302 6786324 6515040 6300060 6212147 5988657 5753699 5537431
10498 5537431 5417484 5342226 5085854 5072470 5061698 5071687 4953306 4853732 4803755 4743388 4710114
10487 4710114 4656202 4490327 4388519 4313493 4306032 4327194 4301978 4281141 4116840 4030315 3955456
10476 3955456 3858118 3756374 3852940 3919316 3860765 3887642 4023788 4029864 4082467 4256508 4471388
10465 4471388 4592622 4619831 4674297 4793215 4816479 4872603 5008175 4996267 4762779 4218131
10455 4218131 3724685 3466163 3272629 3174480 3123946 2977474 2902279 2900606 2755696 2718208
10445 2718208 2642121 2587774 2544215 2489355 2505773 2300293 2225630 2333301 2357053 2380415 2314623
10434 2314623 2243118 2174346 2059412 2006866 2021509 2052627 1998134 1825280 1825383 2019006 2077810
10423 2077810 2079542 2012165 2030179 1930425 1719169 1672261 1684729 1694490 1724422 1608976 1528949
10412 1528949 1529168 1536895 1512965 1429327 1281583 1309272 1388471 1397824 1420705 1358624 1388042 1441419
10400 1441419 1594278 1602214 1564208 1621661 1727825 1684021 1672168 1762290 1842152 1762035 1690736
10389 1690736 1644370 1601155 1545849 1554915 1594834 1705972 1744510 1686412 1545007 1415408 1372399
10378 1372399 1345347 1473694 1580349 1537998 1371237 1301926 1296406 1207752 1151031 1262243 1236723
10367 1236723 1156564 1106865 976778 968516 986226 1101916 1197129 1246570 1265421 1220802 1130521
10356 1130521 1088792 1053678 1239754 1302400 1219708 1239200 1351162 1519042 1539906 1504266 1428603
10345 1428603 1336034 1286741 1409607 1552693 1526292 1342742 1191937 1237586 1256837 1077855
10335 1077855 1048881 1074265 1071942 1009739 949420 982832 1020740 1114838 1161077 1151010 1018987
10324 1018987 918089 884735 698614 727337 751517 792421 762038 639321 625614 630751 724103
10313 724103 740562 779194 821761 798532 966655 989943 997062 1031102 986551 861899 911156
10302 911156 1017098 1075652 1102253 1089561 1138710 1262507 1402239 1442725 1462025 1454216 1563381
10291 1563381 1652076 1662489 1682149 1670442 1728764 1668914 1542998 1450066 1281612 1094657 929937
10280 929937 732057 592992 534375 531479 612674 623029 557288 655010 654623 579126 424819
10269 424819 243678 322217 473420 494808 535961 559432 568687 469469 520986 582442 692380
10258 692380 775597 783992 950445 989049 899067 882371 924890 955511 1138691 1381627 1562648
10247 1562648 1674958 1673081 1944453 2161910 2285054 2428391 2530494 2516416 2429731 2320200
10237 2320200 2295007 2191181 2009535 1793289 1506984 1198869 1084205 1011143 897039 847084
10227 847084 880524 800817 867771 910278 882378 733864 619635 646697 578454 552458 464050
10216 464050 418163 455154 531837 586124 672824 685509 744196 727719 613232 616921 605959
10205 605959 570516 655311 651545 732511 886055 979733 1125627 1191189 1228349 1223101 1416050
10194 1416050 1765091 1819480 1761732 1694256 1668683 1571741 1390296 1357702 1241257 1225444 1165706
10183 1165706 1041442 1037193 997878 938526 781743 740869 852288 918311 850252 695913 655056
10172 655056 829142 931917 985326 1094235 1154094 1206171 1192732 1185466 1271392 1305486 1448355
10161 1448355 1459223 1533725 1668009 1638664 1671555 1627685 1649007 1714578 1722866 1597486 1489193
10150 1489193 1362862 1246629 1263937 1176934 1070436 1093732 1236720 1363461 1273681 1136208
10140 1136208 1143018 1127259 1132391 1048973 1005496 938048 964820 998743 932833 807813 691078
10129 691078 718943 769215 885799 957997 760449 586787 469496 509293 328733 361854
10119 361854 379558 368070 352450 378273 429437 636552 626039 601116 551566 572301 692790
10108 692790 726636 759219 790872 696637 686270 398983 262240 357313 457654 400190 381021
10097 381021 405133 370216 409125 429492 429626 345044 328400 475669 554630 523881 434403 420487
10085 420487 416796 401918 402685 278515 281773 300701 245947 324768 364673 248029 103573 124584
10073 124584 125617 25631 -19385 170840 408349 347882 260663 299503 369523 249335 308564
10062 308564 475487 483918 354702 209104 158718 186447 174306 131925 204406 285600 87139
10051 87139 43286 132742 232052 236519 264668 280961 183133 109735 160109 196934 199217 248106
10039 248106 199110 201485 200266 322095 317798 199071 143233 121534 235584 306770 272689
10028 272689 208303 144147 130686 183591 154564 116360 258502 312395 314016 291579 234320
10017 234320 250841 288737 322690 232646 195673 184203 123290 24013 -63135 76441 147994
10006 147994 107538 29398 8949 40634 144044 149251 83028 196579 229123 112822 9559
9995 9559 99207 155143 187900 213447 187189 165677 39190 -12697 -78076 -9180 37486 75878
9983 75878 42538 134389 113351 -39359 -13587 11123 -97860 -79057 14518 94610 186903
9972 186903 44845 -11280 84136 200779 198074 177786 248546 286214 255436 252448 268520 293152
9960 293152 389885 598214 795270 876511 1089779 1302839 1403224 1497575 1486630 1551417 1565810
9949 1565810 1602259 1442531 1208961 1131013 968647 875645 901378 1082533 1327414 1756820
9939 1756820 2520333 3497254 4084751 4182823 4362570 5000896 5934941 6459654 7034685 7402225
9929 7402225 5433978 3149301 1989985 1378105 1025642 761643 613996 551506 588428
9920 588428 558432 565615 547259 613594 659216 636215 527731 413295 346699 448297 530479
9909 530479 439349 222554 141448 218410 225693 236102 198487 183540 297908 380337 374450 316109
9897 316109 231293 368837 492379 484072 377115 280331 283514 331241 144872 92372 102502
9886 102502 117101 282826 248884 279339 317796 161472 75949 85505 198132 172862 141992
9875 141992 131028 230136 337832 416995 328741 253051 222794 181161 215584 272290 306883
9864 306883 134914 113961 240041 271465 190245 133613 42334 88627 82935 87492 159861 181619
9852 181619 148469 109934 86492 219446 214595 122747 19544 -64097 -122197 -56109 84929
9841 84929 135827 97169 19292 -114102 -144108 -154363 -35947 160301 122412 60429 121517
9830 121517 154825 216260 278719 346114 243060 237028 231770 227798 226724 117141 32607 43442
9818 43442 -36244 106140 71630 159983 143380 67881 120160 255288 201058 45653 -43550
9807 -43550 -8357 130910 160715 154421 86118 147137 118489 159362 161608 114247 190599 231306
9795 231306 259836 187645 223777 293982 207838 63325 65021 213784 201205 108252 159830
9784 159830 219851 183070 101957 137013 116725 174215 202434 129516 -15157 -172428 -93431
9773 -93431 65765 18905 41404 114820 223157 216342 240862 254888 281618 322594 288159 182495
9761 182495 162063 165085 66090 -44852 37526 79719 -3024 5523 57828 79257 28126 -13238
9749 -13238 1793 22013 110082 124914 27476 -43141 -63186 -111904 -33484 25603 15195 45578
9737 45578 59697 124264 102015 33571 123059 148437 181234 124987 79101 -56104 -68430 39117
9725 39117 138090 232015 304505 241931 152055 110319 209468 316712 145227 38882 5172
9714 5172 96921 131082 151583 201164 259800 289757 191482 -22283 -78606 59084 162706
9703 162706 125996 114897 140426 146914 243460 296985 239380 228926 158962 107414 149785 146772
9691 146772 148544 159458 162851 6024 -36301 156558 196640 120132 178880 157796 37123
9680 37123 116975 242372 226404 158758 44387 51761 130825 255190 319655 254051 189204
9669 189204 115009 46578 15316 75281 162483 128451 124760 102985 70003 140739 163674 202238
9657 202238 135842 155548 131890 118438 44317 -28422 -24664 -24722 5888 97057 191421 58604
9645 58604 12299 57842 54955 -13396 84424 87012 33269 -9687 59088 51029 1905 -3018 101546
9632 101546 86725 113175 143695 180915 54745 6464 -81406 -74415 92826 120251 153268
9621 153268 209409 344997 380054 317146 208508 167086 41144 144491 192528 251913 275430
9610 275430 259045 10696 -118886 -28212 31137 71828 -5364 28625 86100 136987 212705
9599 212705 276245 328102 238023 261405 160370 40248 -18214 1281 38240 168425 209299
9588 209299 151136 188671 178452 191723 183529 116516 27804 147148 196674 134196 36076 -60387
9576 -60387 -40864 14307 -18801 20954 32687 137949 187534 128379 70837 156889 230857 301589
9564 301589 260857 204510 96237 76879 81501 81021 86795 61124 200290 234238 208260 194618
9552 194618 289059 355864 389009 314906 265288 149343 148305 99414 80123 37608 -24508 78644
9540 78644 37442 -66463 40178 73836 47396 117362 173156 197988 258219 165082 172761 153018
9528 153018 195628 155118 38822 -40729 -3256 61562 49866 7048 67010 155092 31943
9517 31943 -15938 68643 184382 261394 252498 149820 -1147 -61624 6918 58601 40082
9506 40082 103755 126598 250413 310466 219226 155623 226620 158061 113849 22643 142852
9495 142852 219808 113212 41563 66590 111181 160682 234845 291095 146129 71687 1985
9484 1985 58989 182237 67780 62762 63247 131677 183114 118658 77779 94301 130010 162509
9472 162509 168419 117127 -1750 99705 246040 316223 339801 242198 190954 205839 325281
9461 325281 344254 225697 221522 337843 333739 245005 151489 136887 145597 127342 269158 419276
9449 419276 315513 205663 138784 88190 197136 324973 393566 218235 113298 253574
9439 253574 271848 143615 -21059 24159 76635 16028 71046 163747 211514 246341 196413
9428 196413 45239 -89379 -90841 -30481 -34196 -2467 127124 173516 265038 407453 288324
9417 288324 134961 202933 95034 -2270 33410 -17126 -120002 -106658 -92317 -32930 90852
9406 90852 209676 169803 34963 12780 82704 34678 28191 1654 1456 23594 -70629 -82994
9394 -82994 94 -40793 -25617 169766 198858 108940 80469 111047 39782 -143010 -168500
9383 -168500 -58742 35774 29417 36747 77072 -619 -107008 -144391 -53193 16165 119260
9372 119260 43897 -58983 -19234 13618 80869 78015 -18460 113542 124631 52831 57906 61594
9360 61594 -13469 35546 -45727 2667 111904 134932 26137 52923 56813 18989 15913 -186624
9348 -186624 -255543 -101148 31952 546 -34053 29839 -11849 -31638 41838 -52991 -207587
9337 -207587 -255578 -211177 -31093 93006 -13159 -57021 -17021 -111548 -79645 -24603 14162
9326 14162 21073 -79911 -223567 -312989 -282157 -178991 -106696 -45371 113638 177116 55736
9315 55736 -15402 -34548 -63667 25938 32114 -17387 71314 107936 179076 231749 230253 156338
9303 156338 98708 65071 22393 -34618 9851 55389 -74873 -194978 -37419 62791 -133063
9292 -133063 -159333 -42595 114675 106088 -11506 -46995 14333 -200 -51100 -17324 42030
9281 42030 39975 83918 109874 211379 90594 -44649 -81669 -37951 65897 231679 304228
9270 304228 244921 252622 345938 319334 242662 236151 334078 327559 215087 256652 199911 177229
9258 177229 232630 322300 221148 213918 140015 137151 149261 180177 124676 101623 67554 8936
9246 8936 578 45267 -38592 -33040 64368 12201 87488 112683 115204 152416 -7925 -128392
9234 -128392 -70245 -77097 -84096 -12218 105164 144029 -51007 -35233 -69950 -25480 27755 113320
9222 113320 140468 57782 128792 172584 242223 320322 259871 240247 277636 236006 235288 460768
9210 460768 452759 270172 134590 162234 264127 182030 180519 271658 262147 257427 221678 51790
9198 51790 -100306 -200479 -70805 82260 94708 122006 85163 32711 98444 108675 123232
9187 123232 106511 130592 40630 -1848 -71735 -9074 5179 21277 12604 -89096 -16499 115408
9175 115408 171848 148244 165294 43874 23178 85714 75326 -27592 98232 141610 28690
9164 28690 22688 33748 117920 240614 152025 140014 138247 128878 111385 79820 94473 132017
9152 132017 71597 34194 -41628 -83801 -182992 -146246 -169044 -77060 54683 108317 73737
9141 73737 47808 -19054 -6096 36412 99621 121535 30041 -19705 -13657 -27548 51367 70147
9129 70147 199703 116718 9738 107111 44520 -97168 -106800 28154 89412 112464 96584
9118 96584 64823 14659 9529 76474 -47220 -27127 111647 154617 89901 20488 54265 -11873
9106 -11873 -74906 -112062 -66238 39097 -44340 -177625 -154165 -82371 -111193 -156732 -98744
9095 -98744 -6502 38847 68511 46330 29742 155876 212924 287061 319528 260142 156185
9084 156185 67164 8529 4987 25851 59716 66279 61839 36316 79688 165113 182623 215871
9072 215871 175082 206130 156878 48528 94369 79924 3851 95612 32443 -44930 23390
9061 23390 75369 116104 162953 134650 19581 -5080 38595 45034 2198 -55596 -73769 -89012
9049 -89012 12226 -13300 52214 4198 -94314 -88345 -133071 -65127 -13667 -53389 -98976 -63230
9037 -63230 -34834 29826 56773 -1944 59075 -38237 -14764 140000 21632 7890 213340
9026 213340 226281 185242 65851 51023 81968 97917 126404 160718 100730 -10058 124272
9015 124272 168889 104112 96305 -124502 -90175 44871 165247 231400 216366 89063 61508
9004 61508 98508 11664 -48640 -32121 -46795 -14706 -33057 -2414 -18534 -3689 46798 99698
8992 99698 114023 20096 -109641 -116078 -47118 -24374 24251 23997 1194 -99142 -123718 -14886
8980 -14886 34161 116657 146438 79165 -27841 -119630 -93505 -128821 -251060 -238198 -168328
8969 -168328 -153037 -79477 2711 117149 134803 44139 -43479 -50034 29039 133648 185054
8958 185054 164945 100635 156947 153495 138657 232302 244040 277629 277806 178105 142132 78086
8946 78086 90029 80012 -55681 -113482 -116317 -169365 -103685 -42589 -79454 -117933 -82634 2059
8934 2059 91109 40347 50530 113012 -18411 -139847 -205425 -43361 26843 120523 155389
8923 155389 75273 33106 46499 -78701 -94910 -34877 114861 76543 -59185 -173720 -185830
8912 -185830 -135664 -115727 -33744 49663 34487 30703 -31667 7562 82446 95329 -15008 -33218
8900 -33218 -1818 -1655 33702 58963 -66997 -124782 5509 52764 66646 47364 91642 95932
8888 95932 148916 84742 70752 145101 115084 128977 25660 -33154 99115 168785 178799
8877 178799 171778 63937 40643 -13069 -17197 39081 -34728 -103532 -44039 83607 171361 175924
8865 175924 210641 63638 -68168 -39999 51844 187966 78803 32362 -98878 -83079 -26118
8854 -26118 -11395 -73206 -33194 -39030 41152 64696 87259 104954 193355 301617 230567 64700
8842 64700 47431 88826 53688 -47434 -157879 -139806 -55632 34843 149413 142527 41951
8831 41951 38797 -29043 -75738 -61573 -54695 19486 207845 254909 105521 155073 186118 93726
8819 93726 20324 -47511 42687 101577 133725 101415 65124 49724 216804 220409 159289 21439
8807 21439 76757 233864 263256 255083 147659 93565 -26587 -18568 -57813 1500 35509 57775
8795 57775 108731 117508 105020 110771 103617 70290 111017 178501 87018 -48675 -196125 -133132
8783 -133132 -54419 2613 236234 303797 181326 107546 94365 71943 44471 118559 77301
8772 77301 -36962 76495 158165 275301 283910 205930 19218 -77720 -103453 -26919 -28706
8761 -28706 -85898 -62234 12706 34896 14990 19290 112320 130660 66817 75304 74369 39448 -16094
8748 -16094 79283 169174 185742 161904 154983 85946 51326 39519 13066 19833 -113782 -158755
8736 -158755 -109846 -214589 -223291 -195023 -122366 -39380 92358 148747 61032 -106397 -79036
8725 -79036 -34363 17678 -49744 -127171 -77785 -101880 -69119 -119355 -51824 25743 172984 197081
8713 197081 182730 216691 181164 61083 -35360 -58528 -119873 -130666 -169779 -110295 -86686
8702 -86686 -40858 -142311 -146894 -97972 -142819 -204633 -250729 -247019 -86684 -64310 16834 503
8690 503 31198 146954 83432 59535 134237 -7306 -85492 -25414 30151 33765 113681 133667
8678 133667 122951 77792 -30442 -66078 -20265 80388 52013 40171 122852 111615 56949
8667 56949 60011 -30136 21941 211627 313453 331868 268902 195368 149586 221016 309567 358951
8655 358951 350284 262856 186779 165138 35299 -84428 -42749 -32022 -51577 10574 23827
8644 23827 13957 -8362 -27542 89946 14771 26770 -12258 -16184 55648 10218 -108013 -21307
8632 -21307 116280 122841 143977 205724 187284 42525 3027 13073 103389 71660 55354 129497
8620 129497 178064 214418 215590 198536 207722 191449 142531 229913 102004 65347 281648 300372
8608 300372 296876 265957 323987 303840 207104 276984 294636 197162 141999 137046 159538 295278
8596 295278 332204 290259 303414 390724 392098 433425 500211 635316 704522 536818 367979
8585 367979 434688 525799 542805 510566 528581 510868 464415 258990 186557 243118 266547
8574 266547 248640 305234 285857 252363 197367 163538 246571 212288 201131 201046 130429 141288
8562 141288 226668 215003 148646 62985 -20888 -144094 -112659 13564 10422 -5493 11300
8551 11300 37738 47010 107381 63970 36016 -5874 6175 67336 68384 21933 11957 99014
8539 99014 60392 -129704 -252500 -213003 -139525 -12393 113481 157716 142648 118759 100786
8528 100786 150550 170554 113696 67525 31194 23199 -81508 -119625 42479 103977 107471 -41755
8516 -41755 73451 96237 149259 251901 90578 31457 62491 32757 -74642 -57864 -13581
8505 -13581 -32031 23872 86551 117784 62866 116511 102637 -75740 -109118 -63541 -37538 -29594
8493 -29594 10591 37095 30495 105127 180943 203322 173199 146105 106099 146644 287120 238385
8481 238385 170512 104691 73970 137769 95537 7377 -29584 138589 147918 71792 -31858
8470 -31858 13473 68424 158353 148099 20522 44275 13878 -126298 -50297 35137 27934 112120
8458 112120 134848 186817 131697 196413 287488 153169 97720 -38740 -141430 -50177 120181
8447 120181 129304 124503 90731 45893 -55037 -116146 -197603 -174286 -184189 -167914 -152641 -154013
8435 -154013 -82090 -19148 143970 199367 132485 105711 64413 57335 103555 161855 47758
8424 47758 47763 179232 133871 156693 76184 118485 128007 85026 21073 -18862 -33300 -48713 -34109
8411 -34109 -122374 -170170 -107592 -17532 -85600 -41658 11283 -114035 -54280 -15309 -5825 102935
8399 102935 79943 30912 44773 82883 46392 15583 -58441 -41308 183214 128261 95851
8388 95851 101273 101795 108424 88612 15583 -23726 63911 105542 196605 196850 173796 173794 109904 54967
8374 54967 184696 224180 123157 97667 223817 222469 125723 71747 64879 97145 41429 -83105
8362 -83105 -61903 -13863 -5296 -97780 -23253 57050 71950 117299 36897 -24376 -75090 -54583
8350 -54583 5876 -18595 -26705 49639 113054 273442 234254 227906 258454 178281 117352 95948
8338 95948 198338 33065 -87854 -11138 29812 164977 34388 -83332 -28926 78155
8328 78155 183661 156105 91697 65773 56733 39830 56990 68169 140277 188437 73799 88463
8316 88463 46955 127226 99554 60803 -52811 -50690 -77312 2931 86272 -41891 -100422 -95120
8304 -95120 -71877 28126 92503 102203 5101 40037 160345 171636 127357 82803 84161 91904
8292 91904 -5653 -19274 -74889 -48669 -75313 -182996 -173164 -7504 132236 165415 160220 76738
8280 76738 162621 226 -184146 -325064 -351430 -223073 -129118 -136387 -128348 -117931 -94534
8269 -94534 22211 -77497 -182082 -124253 -137520 -161883 -110453 -65093 -65517 -43099 38350 75103
8257 75103 77057 53371 18503 55561 70246 -18870 -158844 -60982 43573 91065 -6440 30506
8245 30506 103428 29688 94477 151351 221391 250488 297435 389980 440833 491595 388859 163428
8233 163428 74529 108208 123694 1171 32473 132698 79183 -25794 -224 153562 64731
8222 64731 20346 192677 251169 206685 148838 61287 65231 159773 115763 69281 79008 -12858
8210 -12858 -71130 -117121 -124013 -79387 -94314 -51706 -74203 -104736 -87916 -64200 5370 143082
8198 143082 315661 504683 519890 365305 357804 428029 404862 489162 330278 73253 -71962
8187 -71962 -74317 1635 -7928 -64484 -131993 -106331 50850 135720 173295 135893 252 -52978
8175 -52978 -65800 -55531 -90189 -60408 -100993 39630 95995 29581 -65960 25131 102979 25035
8163 25035 29692 218523 168679 92095 25910 -81346 -102943 33216 -19035 -50172 -27573
8152 -27573 57716 96513 221200 226750 172963 179713 252501 237642 285296 323555 207292 102096
8140 102096 94701 -3480 -84412 -150717 -105743 -9470 -13802 -49506 20303 14648 14420 -85354 -34000
8127 -34000 -73506 -96523 5160 232856 147815 98565 -6862 -164791 -185697 -122590 -75269
8116 -75269 12529 34603 73063 120035 198727 72540 56112 114563 143410 -73716 -217185
8105 -217185 -158841 -103587 -129793 -92622 -40007 53511 -13318 -10943 41443 -37623 -105506 -87143
8093 -87143 13357 143678 56444 -78804 -49436 89737 129854 181459 185237 136032 13213
8082 13213 -3047 134445 212225 113353 98761 71938 44674 144291 197550 36165 -141771
8071 -141771 -99617 62994 71069 -24326 -192076 -142669 -14776 -32731 29001 -3685 90566
8060 90566 178453 9290 -35202 -155160 -148435 6997 76417 67127 63469 9320 14051 45548
8048 45548 53045 16857 85411 57894 112244 196228 257447 233834 32371 546 128980 81259
8036 81259 1399 97143 168783 188684 285147 323934 324509 324128 334109 234189 130541 134944 112491
8023 112491 145976 158439 120441 80265 62870 44745 71429 115954 88030 101154 140476 98838
8011 98838 100791 94562 198579 199770 121040 188052 262827 310202 260217 181304 118097 -3142
7999 -3142 -54229 -96060 19184 68035 113419 174898 123882 25109 77990 109092 13843 155758
7987 155758 280155 313382 249032 272354 228079 46890 -44916 -87874 -75413 37427 18756
7976 18756 10968 -30495 4071 108777 132688 106792 118987 169639 160182 209687 263443 226637
7964 226637 176430 185082 178838 64496 73326 148123 175200 344990 324033 189233 194825 296761
7952 296761 292481 346006 337044 239945 221087 238022 224743 173661 140373 156329 188129 72115
7940 72115 -19152 -33028 28750 -31695 77303 94726 12823 11811 44483 102475 238936 164063
7928 164063 127242 249912 237457 132256 -7351 -108333 -136849 -130124 -71019 17008 75153
7917 75153 61818 -26002 -61631 87445 81350 26422 -21624 -74637 -716 53220 -862 -28439
7905 -28439 83942 102450 84364 116402 65700 -16865 -1188 117376 222337 117273 3749
7894 3749 7728 -50473 8686 4664 16497 62505 65800 -34100 -78546 -3919 -32379 -4520 -33773
7881 -33773 -45265 -74935 -36855 -58108 -123318 -117628 -80303 11941 33810 -34782 84980 196800
7869 196800 217483 179475 112199 -44467 -64661 -75754 -120988 -93929 -84387 -48422 -10940 -36444
7857 -36444 83622 178277 94185 169659 113700 -4369 -44208 19157 110075 173922 125559
7846 125559 -45691 -184513 -219188 -210934 -243126 -123072 -32246 -143526 -26434 44799 14983
7835 14983 13470 -73241 -147430 -23042 70620 73454 -5767 -42043 76309 95293 164445 245068
7823 245068 206803 207188 158622 121831 25921 24042 23114 291 -46359 -147887 -105598 32484
7811 32484 117731 57193 -777 -29103 -24355 32706 58460 97982 130838 87123 12566 -137989
7799 -137989 -30557 51531 -48791 -129435 -125679 -9586 431 -46222 2548 -52413 -46919
7788 -46919 61230 128729 3579 -137583 -158375 -118932 -39133 29178 -55872 -89714 -59285
7777 -59285 -17939 -57813 -217406 -224425 -93231 25045 69400 173087 288610 279687 261750
7766 261750 94543 -15071 -10674 67195 -42789 -57242 -62384 -83268 -134950 -127131 -23177
7755 -23177 265 13030 135972 63748 -13337 9065 27503 -14569 -169118 -128026 -206125
7744 -206125 -44337 87237 107980 133554 52170 75739 90700 15711 -5987 -18798 -96418
7733 -96418 -168130 -176141 -211525 -309560 -246985 -82836 -61942 12110 77167 54311 102455 72404
7721 72404 65009 45604 -11878 52627 177432 133030 143093 179897 214598 222805 141305 81480
7709 81480 132406 143405 85232 205727 317776 229528 38884 25517 81539 167026 129949
7698 129949 71300 42903 133546 118804 72983 59410 128718 151670 136441 -10516 -120358
7687 -120358 -221033 -210645 -204212 -269457 -202740 -153730 -135986 -146973 -121633 -95783 -98581 -153843
7675 -153843 -121707 -23391 12165 -33455 -163622 -191534 -173671 -182681 -19580 56446 4050
7664 4050 -51729 -77212 -216835 -284613 -210586 -91111 89524 37220 -102785 -77023 -110872
7653 -110872 -36245 -26644 -194666 -176341 -138869 -179729 -173762 -100197 -103684 -197475 -261124 -252200
7641 -252200 -136579 -18558 9428 15986 429 90326 223659 337380 215264 109654 85146
7630 85146 124839 171108 158537 84649 101281 24664 -60385 35861 -26970 -152515 -105054 -89839
7618 -89839 20457 83201 134269 62022 -39562 -112571 -109158 -57860 -59064 -68286 -233891 -168042
7606 -168042 -27614 -76644 -181757 -153365 -28386 -31279 -92758 -145256 -178849 -159874 -37581
7595 -37581 43179 12173 23312 -9437 -726 43570 -38571 -137692 -126853 -65721 3978 147768
7583 147768 149278 173877 140871 66154 -29467 -61673 9397 112058 282456 283671 52447
7572 52447 -141755 -137101 -71032 -52287 -66176 -26187 -43381 70232 129068 133528 116906 27422
7560 27422 -78148 -85247 -40790 11999 -66800 -30821 116305 175216 168614 25849 -23912 -85140
7548 -85140 -87079 -86534 -108361 -85754 -48336 -44424 39947 -53181 4969 38727 -41075 -53416 -30163
7535 -30163 -31782 -204 51028 32710 -11921 -104392 -79709 -140994 -96338 -73993 -162654 -273741
7523 -273741 -226335 -224663 -163219 -178685 -231752 -202772 -139594 -143291 -39631 34567 39672 -77428
7511 -77428 -139076 -175974 -224667 -124304 -113724 -145103 -120283 -130306 -20813 23986 116730
7500 116730 99028 107481 73833 50186 -2897 -33208 -81378 -26626 -35457 -20473 -22090 -112524
7488 -112524 -67560 -14108 -26682 15574 112215 83222 51250 27559 56094 96405 81402 116776
7476 116776 77868 51880 57636 102671 123379 -9740 -48869 -102624 -152604 -74005 -12466 -100060
7464 -100060 -102712 -24337 -47393 36570 60296 5827 -133426 -199352 -90408 80664 12466
7453 12466 18979 87357 127845 88719 33634 4254 -21478 20380 -70061 -152126 -248613 -363030
7441 -363030 -234279 -42132 -29870 -94155 -60269 -90043 -160653 -196083 -131734 -51434 -121687
7430 -121687 -51888 -29311 -9521 -56167 -64666 -63552 -98831 -64584 -38582 -87182 -139682 -233524
7418 -233524 -192815 -27919 46399 -41840 -43915 -186118 -191195 -230428 -137591 -46477 -31179 -104348
7406 -104348 -145783 -235479 -260933 -226844 -110529 30424 89451 -56569 -145223 -118931 -106232
7395 -106232 -57968 -83173 -147744 -172621 -163430 -46921 -16913 -33967 -18002 37655 60523 69594
7383 69594 -110512 -78347 -50846 -80675 -129133 -100604 -125164 -120272 -33227 -109253 -187684 -176028
7371 -176028 -147671 6398 112450 77348 56834 150069 -2802 -129870 -138954 -268490 -215050
7360 -215050 -79919 -19178 37138 14772 16211 17472 194134 104761 21876 112020 11892
7349 11892 -45723 -109385 29780 104557 92724 63721 30320 35798 24037 -107803 -110677 -136572
7337 -136572 -228487 -179041 -93662 -150578 -34155 3756 -11920 -88426 -60520 -74877 -226039
7326 -226039 -187056 -80804 -9667 41116 53400 -19347 -78431 -119999 -133522 -194319 -121410
7315 -121410 -86918 -99271 -6609 83068 138861 113920 26553 -66519 -197798 -171229 -93579
7304 -93579 7193 125140 198417 183855 93797 119868 29661 33114 -49598 44545 250334
7293 250334 163650 174828 245925 90457 -16031 -85801 -84967 -165964 -79596 -28121 27981 34134
7281 34134 -15336 -46307 3764 -1246 -110294 -146468 -57667 -57544 -43106 -57222 -99881 -73844
7269 -73844 36176 -84155 -102826 -59038 -195875 -175508 -172900 -239993 -128780 -91685 1417
7258 1417 107859 146464 77791 -176 -88765 -315181 -322225 -311802 -289629 -308695 -348449 -257449
7246 -257449 -198594 -168698 -174892 -203596 -196615 -120756 -56472 45574 -30986 -129764 -65516 -87225
7234 -87225 -14488 -260 28188 -2730 -84437 -93433 -109944 -98498 -3036 -7012 -91077 -114880
7222 -114880 -144361 -152942 -181816 -122675 -133758 -157941 -62418 -16492 69421 56988 26342 69094
7210 69094 120050 84365 112178 87003 91543 75521 -10488 -43897 -93559 -101515 -41239 19502
7198 19502 -60465 -135972 -135831 -52889 23852 -35616 -74945 -75824 8152 96419 -675 -132435
7186 -132435 -38008 -18717 -50423 -81525 35945 32780 -161546 -113565 -7871 62752 -56414
7175 -56414 -81865 37834 46555 -16890 83057 79561 135202 -6485 -62860 12872 24319 76204
7163 76204 2189 -34322 -36862 -219180 -257741 -297558 -162305 48074 90952 16932 -60236
7152 -60236 -38072 25102 49133 13060 -51011 -163513 -155545 -59238 -53053 -19693 6580 -81174
7140 -81174 -111478 -26971 17438 36999 74839 30653 -30684 -50894 18336 34400 -111926 -130073
7128 -130073 -62512 -59732 -96886 -97768 -9307 -4895 47258 104879 -61518 42399 114516 -30795
7116 -30795 -27479 9971 15283 -32630 156245 107098 74974 26533 18289 17346 -68923 -115697 -151175
7103 -151175 -59625 60518 -40858 -120090 -110692 -72400 -48388 -18472 26665 -68265 -164230
7092 -164230 -214385 -140472 -87159 -142027 -149548 -107352 -221354 -291590 -229631 -240733 -168915 -154132
7080 -154132 -176297 -220148 -159993 -120987 -143467 -85838 -94974 -71161 -113287 -101126 -115134 -101747
7068 -101747 -104651 -9701 110158 123623 127305 85912 62249 65606 -819 -65835 31529 -8445
7056 -8445 -5445 22344 13351 -21041 58415 95689 -64833 -127196 -33370 125679 41621 -91541
7044 -91541 -153962 -55653 -44036 -62551 -102758 -187968 -246231 -201894 -62273 -18095 -18291 -9782
7032 -9782 -62882 -20862 -10124 -87180 -172924 -179562 -92827 -84525 77567 176516 57204 60105
7020 60105 143633 162522 246801 202492 110756 175204 87725 37209 65610 133087 128302 -59464
7008 -59464 -2300 80589 30510 -35475 -72532 -32219 -36663 -77918 -65977 -15183 9267 -2654
6996 -2654 -25757 -78239 -125428 -58019 -12644 -3624 1814 46172 -90644 -195067 -176998 -84292
6984 -84292 -5936 77243 73635 -67857 14614 119846 32727 8225 34870 14786 -17141 -57437
6972 -57437 -127625 -194858 -174365 -207932 -116077 -33272 -67921 -114284 -227239 -295290 -222574 -195150
6960 -195150 -137776 -20707 21861 3542 2366 62998 -79525 -100219 49479 54573 15072
6949 15072 4335 -120554 -31604 54848 94499 90423 123732 84172 -60239 -120993 -151492 -54576
6937 -54576 -65109 -188217 -158314 -134137 -170378 -186359 -94837 -173386 -288893 -274285 -127192
6926 -127192 14380 28669 5549 -49076 -102571 -89403 -88524 2970 -110460 -177306 -177167 -174162
6914 -174162 -208489 -227989 -238603 -256417 -202884 -218781 -267146 -175481 -105018 -33482 -32992 -94420
6902 -94420 -191813 -173384 -169883 -159288 -169996 -92163 58163 86032 -16989 -83616 -24021 80381
6890 80381 86451 151390 165930 97780 58581 63778 18436 -19182 -62153 41476 56948 105901
6878 105901 23962 -75431 -7732 102300 56740 6496 40723 -20471 -80581 -47188 -47657 -75089
6866 -75089 -65366 -15704 136415 215428 89851 -8874 -82154 -38368 61121 64371 -1552 47397
6854 47397 -16255 -73990 -115068 -74870 -164183 -263391 -276315 -134651 -107449 -58468 -183629
6843 -183629 -131972 50417 120373 177599 127503 -40803 -88861 -66440 -19162 -72967 2192
6832 2192 3877 -89874 -91093 -98920 -76035 9375 76331 112562 81416 -6763 -22699 19800 46447
6819 46447 24100 -33763 28277 72742 122240 105891 -20084 -37314 9147 -80864 -26558 100500
6807 100500 241181 142594 131230 130872 2777 -11382 54292 53691 -7456 -68619 -66623 -42671
6795 -42671 -95928 -101740 -141977 -202585 -268085 -262224 -305702 -276007 -93632 -26719 -100138 -265209
6783 -265209 -257603 -216902 -213209 -212799 -170447 -160889 -199594 -147782 -113048 -31548 -53062 -72188 -31985
6770 -31985 58920 37030 27446 42797 30656 -68309 -124679 3598 -13128 -50545 -44734 -71855
6758 -71855 -39634 -92639 -114332 3774 93211 35567 -14382 13253 10905 -71396 7468 21158
6746 21158 -49625 -100127 -89822 -145748 -194445 -212737 -212185 -225060 -245702 -206269 -137166 -124275
6734 -124275 -131495 -152593 -90750 13861 11993 -58021 -124939 -213336 -265861 -284776 -158188 -120230
6722 -120230 -91470 -159999 -111194 -219645 -159749 -100294 -55020 -48385 -61345 -37002 33483 45300
6710 45300 123700 123528 108123 40668 -70196 36895 78293 36606 -3828 -124981 -46171 181532
6698 181532 129063 100177 18894 -59299 -80054 -103735 -92131 75120 165970 13786 -95784
6687 -95784 -125951 -116885 -129890 9055 14070 -8634 -20194 -79512 -39602 -59373 6853 80224
6675 80224 162296 170738 40583 -66704 -144308 -136626 -148104 -169864 -141239 -99292 6265 10227
6663 10227 -118269 -110903 -122675 -199481 -127955 -28237 -69755 -20204 75941 93330 -18983 26444
6651 26444 -29257 16929 112836 129839 146395 74464 22860 -51353 -67423 46330 -25001 -28616
6639 -28616 -104510 -32644 42851 4451 -3376 47871 73457 163297 134935 104069 200263 230056
6627 230056 176521 12206 -61182 25724 33830 18325 82734 248223 184144 16811 -57666
6616 -57666 -2401 -7908 -59231 -51462 33801 152879 110203 -67069 -189522 -168788 -151491 -71624
6604 -71624 -99739 -13397 16017 -133340 -216335 -102432 4217 63594 44963 12438 -2555
6593 -2555 -46924 -105985 -67187 -80214 -18503 -132037 -150948 -86773 -12268 22413 -28195 -59676
6581 -59676 -141053 -209304 -264252 -186376 -78884 -48003 -52452 -34871 -20089 -54459 -68676 -48594
6569 -48594 -21955 26327 41119 98565 39538 -167355 -249330 -265653 -389963 -345669 -116804
6558 -116804 26135 90936 234524 206122 101369 133860 70533 183365 236398 112609 -14529
6547 -14529 -91408 -107854 -52503 -47499 -2770 -123595 -118347 79637 167201 110095 56432 15397
6535 15397 27868 100850 123010 136419 -38857 -11774 160206 128638 59127 35496 19676
6524 19676 -76505 -54941 -107705 -63294 -4699 70588 12881 -35433 28323 35790 27453 -14046
6512 -14046 -108567 -160335 -169754 -229068 -199738 -99863 -112130 -168469 -78229 -48355 -37628 35892
6500 35892 3764 -108698 -72189 -20742 -12190 66009 82790 43090 54206 54069 78506 -37599
6488 -37599 -122767 -87150 -34009 15 -71790 -177319 -181567 -85532 -81352 -41534 -35550 -35017 -120035
6475 -120035 -123033 -47970 -34849 -155444 -146233 -76578 -58063 -104552 -94486 -86433 -44689 32303
6463 32303 29777 -39224 -88103 -23999 -36102 -101130 -63396 -146894 -190459 -162554 -184025 -173407
6451 -173407 -123133 60811 173189 111725 34173 -52957 -6175 31012 9516 -76719 -70989
6440 -70989 -150323 -131933 32689 69991 -71552 -32392 114375 113316 -36216 -95376 -10248
6429 -10248 -81989 -161925 -185121 -84558 10309 -19083 -27975 95354 148560 357 39522
6418 39522 87598 52591 -3104 -52721 -133220 -57557 66530 132891 -46310 -160907 -130024
6407 -130024 -129939 -156232 -148052 -177959 -187727 -138059 -118551 -167003 -140920 -94485 -213955 -147344
6395 -147344 -17708 -2817 76088 60747 30533 20195 -123032 -222683 -181994 -80525 -62589
6384 -62589 -57918 -8044 124581 66671 101652 4870 -75480 -186183 -202549 -63088 -102164
6373 -102164 -67742 -36956 -66526 76652 211400 150775 42018 125755 67197 -9533 12802
6362 12802 -74842 -74559 -61608 -67154 -2863 83513 148490 78392 -71677 -93931 -24698 55854
6350 55854 88677 100274 -14512 -7362 -42590 12242 71023 29935 23969 2568 -22445 -31075
6338 -31075 -61018 -133230 -160778 -140589 -70409 -37402 -34093 -4958 3552 -16825 51375 93579
6326 93579 38637 -52222 -68053 -73859 -187563 -208872 -298032 -369821 -206666 -156323 -172818 -241827
6314 -241827 -227563 -130046 -119942 -172779 -101388 46593 -117183 -123634 -1352 -14373 8813
6303 8813 -54878 -145842 -122780 -38415 28126 86789 65183 47411 51913 -69611 -70346 51767
6291 51767 137393 20295 4747 11404 -30048 -110822 -81192 -125920 -108852 -87319 -44297 39233
6279 39233 99779 8636 -107344 -107383 -39362 21043 32624 -46832 -137745 -18634 38375 29672
6267 29672 -10076 358 -85446 -119313 -69560 -39911 12593 23260 -22038 -84326 -500 -5317
6255 -5317 -55952 -38481 -40888 -2474 -8983 -94597 -82736 50197 113272 94193 62332 7040
6243 7040 -52794 1925 -26265 -108528 -134095 -97611 -105698 -209238 -157179 -54473 44811 66310
6231 66310 -30095 -88309 -64065 -96099 -195151 -106525 56061 100211 45212 -9408 19041 23818
6219 23818 89531 53611 -161395 -119272 -29040 -71652 -162631 -107734 -25850 -22302 6152 16155
6207 16155 11454 -61678 -180313 -326299 -256847 -209538 -147432 -107264 -144375 -114870 -153935 -269768
6195 -269768 -244107 -115193 -67345 -79932 -98884 -159665 -81280 -79897 -208043 -346010 -272577
6184 -272577 -107268 -32143 26872 -29990 45412 130949 156124 168392 80996 11393 -37062
6173 -37062 -41197 9774 -42510 -138351 -293172 -358125 -398989 -312003 -155384 -113197 -48418 -93250
6161 -93250 -69301 -74203 26539 56595 -28671 -137930 -154729 -96881 209 104197 202432
6150 202432 134574 27109 -30877 -90758 -242679 -244947 -131780 -102856 -37292 -702 95607
6139 95607 68156 -11666 -124066 -72539 -123835 -204969 -186448 -142118 -31332 -13242 63613
6128 63613 40561 32543 73487 144578 129643 42062 -12736 -36562 -47780 -51868 -62735 -112706
6116 -112706 -72553 -54909 -6564 75204 111029 13949 -31127 -56996 -36977 -47332 -75163 -78440
6104 -78440 -63545 40003 32322 -42495 -119793 -113618 -56877 -37464 -56216 -16366 12870 -33113
6092 -33113 33250 47972 47937 44153 109398 148331 116882 -58715 -285213 -384248 -337996 -378599
6080 -378599 -332175 -220040 -64227 78653 84058 13336 -2731 -73757 15887 214938 219459
6069 219459 116753 137009 117361 7967 -36719 50325 106670 39200 -54825 -48489 -22108
6058 -22108 42114 139947 180438 45981 93953 81614 49922 42135 -39315 33413 -6196 -29907
6046 -29907 -90045 -120730 -102798 -58693 -33817 -16505 78337 66907 13437 29765 42484 178801
6034 178801 94107 32720 31871 23685 -4116 -22690 -77513 -174631 -264703 -243366 -203885 -229584
6022 -229584 -149973 -37348 -70897 50991 116475 104547 145867 99238 24565 31974 105231
6011 105231 117341 103649 9289 -89151 -261229 -199141 -91292 14223 -48024 -47117 33904
6000 33904 61192 -107198 -175896 -212966 -175325 -280857 -217866 -191411 -26131 71288 29583
5989 29583 -71529 -57462 -47430 -8331 -24687 3911 46885 60764 -58826 -39516 -14327
5978 -14327 -574 -8158 15909 6606 19730 43497 29589 163187 214510 205585 102771 77046
5966 77046 4581 -35728 42875 -23422 12302 26621 21976 -43309 -14682 24317 28029 -63223
5954 -63223 -39171 12633 -31508 -94773 53073 37424 -9131 -14047 -42576 -52903 -63040 -25239
5942 -25239 102977 172240 259611 240484 140989 204771 361523 310495 286153 233640 261316
5931 261316 264495 110683 95046 62884 -17442 -23028 19876 79381 933 -122758 -96797 -25142
5919 -25142 20332 -77271 -101398 -120998 -171788 -206684 -49975 -56774 -73557 19635 -4000 45641
5907 45641 -4895 -14241 -98949 -38944 6695 -24091 -3757 -27000 -84608 -165037 -54440 -51972
5895 -51972 -35076 100712 124472 93289 86021 62530 62263 12006 -15240 -53090 -73627 -58721
5883 -58721 -70343 -103869 -63828 -158391 -171976 -107686 -64060 -43194 -44474 -80916 -91732 -104925
5871 -104925 -71435 -23590 -20231 119797 137424 101601 -67901 -187124 -149348 -239719 -297140
5860 -297140 -156785 -139308 -126849 -10843 -6543 -4761 -80605 -69742 -48940 24833 74270 96436
5848 96436 -89361 -114704 -42160 -36701 -118962 -87030 -33261 14408 -26486 -47302 -145542 -121074
5836 -121074 -58220 -47516 -105706 -97301 -167259 -188363 -160041 -84856 -117729 -140098 -97056 -64175
5824 -64175 71624 97916 -56387 -155971 -142004 22731 93353 -34118 -4529 34274 83859
5813 83859 73683 -5496 -157015 -247023 -197997 -74153 -16093 -11874 -26713 40497 11659 -58064
5801 -58064 -136535 -169827 -117952 -175308 -75954 -116808 -100988 -104187 -62123 -45397 -135824 -136671
5789 -136671 -178102 -130195 -68484 -115161 -44416 -71393 -134020 -103080 -83273 -133663 -127891 -102682
5777 -102682 -228938 -234097 -204363 -99873 -53984 -60611 -208130 -230584 -105407 8645 -62678
5766 -62678 -226524 -169795 -136347 -16525 -3108 -38723 -94404 12318 -9719 -108044 -184446
5755 -184446 -114723 -87809 -31681 1797 -43634 -151833 -179104 -99692 -76092 43248 -41265
5744 -41265 4515 70190 151300 200516 107474 73458 40985 46931 72127 -24594 -112398 -155177
5732 -155177 -179721 -114040 -55621 -72562 -75701 6210 -22640 -142852 -144105 -100658 -106098 -113284
5720 -113284 -1019 15832 -43743 -9821 -21099 -47413 -69492 -216069 -254886 -143203 -103418
5709 -103418 1715 142090 168441 82725 34799 -46375 17001 44336 61831 86510 33237
5698 33237 -96396 -153553 -40434 45714 -7154 -68220 -71641 -169899 -196184 -71825 -26652
5687 -26652 -73330 -65918 -30930 83082 28364 -47501 -28284 -25654 -84037 -30746 -108702 -167828
5675 -167828 -89327 -79350 -158041 -109041 -16115 -3638 -88871 -101400 -86298 34938 -63202 -141775
5663 -141775 -58893 54795 -56848 -238971 -95163 234 -7046 -26797 -101437 -100019 -71105
5652 -71105 103799 152364 -13124 -83306 -166509 -217352 -113325 -46079 -107129 9095 55336
5641 55336 42606 110685 53932 -15154 18498 -14466 -11146 -101855 -64139 -71739 79358 230527
5629 230527 241283 176902 -40201 -115231 -128201 -216853 -144631 -16133 -49936 -49014 -49562 -22687
5617 -22687 -148980 -110264 -112873 -128094 11411 12806 42018 20318 27938 159 -32023 -96207
5605 -96207 -60475 -109194 -121312 -132205 -177429 -56349 -65529 15234 94815 111177 48735 -31982
5593 -31982 -67634 -83124 -131940 -175375 -72334 80781 65453 -33229 -34991 -25746 97541 6019
5581 6019 -24721 -39318 -37694 -24896 -34833 -102867 -139046 -99392 -479 4657 -45396 -70074 -143188
5568 -143188 -44007 66417 172483 145163 64032 29594 -44612 -169293 -179944 -195671 -67144
5557 -67144 -832 -29894 -19807 -2521 -43764 -67515 36011 119992 186373 174477 79922 -6161
5545 -6161 103385 225985 115389 49787 35087 -61705 -203271 -157178 -37979 72854 132592
5534 132592 76863 7023 -21041 -5986 -63008 50781 124947 127910 18938 -133392 -218175
5523 -218175 -225607 -201319 -194916 -174880 -220248 -231754 -181480 -98023 -84304 -2212 105802 125526
5511 125526 -36656 -257045 -255873 -242893 -255775 -153704 -72696 -1773 -24565 -75394 -105193
5500 -105193 -115011 -10476 7512 -109025 -182981 -73043 -12485 -78839 -126622 -111385 -120662
5489 -120662 -181552 -192346 -154420 -91616 -171274 -122618 -157634 -170108 -46050 -7924 1714 -2219
5477 -2219 8151 66602 -115601 -116538 -30980 7555 135302 149388 54264 -13006 -166304 -195908
5465 -195908 -190699 -109396 1453 -89299 -171496 -136391 -98330 -160613 -156103 -112263 -48948 20411
5453 20411 45523 130692 237162 108102 31695 91035 -13559 -90992 -69876 -102214 -141440
5442 -141440 -85673 -26830 -34117 -184666 -127816 -41387 18327 120088 131843 99271 41866
5431 41866 -4928 -43307 -135527 -131058 -153960 -140483 -189830 -265340 -189666 -32530 -122344 -95500
5419 -95500 -49329 -41354 -29693 44738 -17775 21657 24433 -115644 -220804 -139301 -89682 -35939
5407 -35939 -25438 -89521 -131644 -133703 -96971 -61967 -13070 37602 1287 -13041 -15921 -139173
5395 -139173 -167596 -162654 -105532 -62842 -3810 76891 -70753 -122662 -126722 -155484 -202817 -144460
5383 -144460 -54449 -74104 -54924 -45354 -73928 -198117 -195170 -23059 19863 -23000 21701 106247
5371 106247 101092 35411 116112 101035 101467 163130 160281 26729 46686 213894 230303 82041
5359 82041 -21035 -76415 -221976 -178221 50905 140825 33373 58934 166278 238368 117435
5348 117435 31791 144291 200405 192089 104043 -100277 -173474 -147180 -28285 -18156 -75074
5337 -75074 -87978 -38384 32418 147444 157513 -2634 -170314 -104928 12020 18963 55454
5326 55454 218679 170147 80939 22219 1626 -21042 -146929 -114866 -154537 -138027 -29990
5315 -29990 -50418 -171766 -114495 -151343 -40073 -8420 -50513 -100790 -116305 -73944 69075
5304 69075 254787 242778 146667 28809 -19577 -62530 -97835 -141128 -133039 8998 14268 -85492
5292 -85492 -87267 -111217 -135496 -109634 -113949 -12008 30234 10270 -93912 -173920 -192553 -32802
5280 -32802 10831 6471 25784 -25258 56140 56306 79158 38823 -229 -39639 -172107 -98762
5268 -98762 -12173 -28235 4966 84095 143234 86108 86337 78376 68624 137782 114468 228047
5256 228047 300690 300104 107451 26161 77698 68960 27998 -139694 -145027 -47579 -38133 -10095
5244 -10095 -20231 -76487 -112836 -47583 33769 73442 26171 -7078 -49059 -66076 -78061 53546
5232 53546 43698 141282 153396 39333 -22122 -46435 23189 13155 28710 -22425 15915 83396
5220 83396 193346 211221 226128 134909 140241 9992 41445 73290 102853 110510 38957 15836
5208 15836 -7773 15161 -64974 -94745 -118776 -36801 102607 159479 224556 128797 32090 73707
5196 73707 898 -64762 -133416 -51611 -89808 -161505 -158284 -163762 -119104 -64022 -44923 8581
5184 8581 -51333 -76387 -151894 -226173 -153505 -14908 10819 -89589 -126417 -196417 -151470 -32252
5172 -32252 -23719 -43714 -102717 4816 87604 30776 -23774 -104397 -169873 -65562 95448
5161 95448 22103 -42785 -149721 -253634 -246824 -238964 -242310 -221696 -185868 -29223 21832 7991
5149 7991 39260 186607 200800 219916 95177 -32607 -128815 -199579 -206009 -52143 -97214
5138 -97214 -74454 14970 -47712 -95621 -102447 -62669 -66857 -217750 -235863 -226528 -191699 -167410
5126 -167410 -233387 -184553 -232543 -252254 -287334 -276367 -89601 94179 77598 109617 115794
5115 115794 126851 12102 58545 88263 36283 -15690 -134897 -140644 -48921 102583 99551
5104 99551 73282 13950 -63197 -106861 -210754 -171051 -24140 21867 59672 153637 134968
5093 134968 36515 19044 -25594 53149 38619 17994 67607 39937 -47531 -79922 8164 1592
5081 1592 -80725 -66023 35973 6317 -75395 -35868 -50996 -103368 -162070 -180807 -234098 -245315
5069 -245315 -202033 -97928 -71009 -140861 -32170 78491 -34663 -78762 11092 23059 -36436
5058 -36436 -93785 -134445 -222244 -117425 84782 165946 157837 122565 85964 -29945 -74820
5047 -74820 -6407 -21378 -16625 74448 97355 48470 145092 79874 -25212 -121384 -159793 -99477
5035 -99477 -99989 -103269 -71093 -105614 -114872 3344 153314 140904 71745 160504 288522 310486
5023 310486 219227 105704 94377 53295 15312 43318 127511 84683 -29229 -53018 16440
5012 16440 83332 144969 94826 142586 66924 -13268 -13198 -22358 21043 111771 2541 -100515
5000 -100515 -237177 -153701 -123748 -118652 -23762 -6381 99634 -9076 78782 95123 184805
4989 184805 147693 -2944 -144663 -118215 -51235 10249 -17531 -24976 -60113 -141847 -210301
4978 -210301 -225222 -208279 -216308 -267006 -231985 -154281 -125051 -100911 -114772 7322 26069 13118
4966 13118 -90122 -37619 -42398 -133055 -211352 -140062 62662 136470 -24272 54586 65249
4955 65249 52393 -111797 -96937 -34183 16275 91243 111015 141984 114403 26800 -33906 -92724
4943 -92724 -75487 18472 11475 -5546 -23831 -93016 -70987 79717 107553 149090 75853 -45654
4931 -45654 -78979 -82885 -151191 -233600 -169476 -82463 -120042 -114470 -91163 -8582 -29999 -133991
4919 -133991 -146159 -53616 50916 22585 -56745 -76519 -1116 -30445 -122029 -74408 -104995
4908 -104995 -25089 186414 116847 17973 128146 136420 98982 -6911 -95383 -97645 -153792
4897 -153792 -134298 -54006 -60127 -170308 -148319 -64677 112029 305884 254271 159945 76764
4886 76764 31407 -59243 -181998 -230340 -93833 104460 48128 -55109 -125779 -153351 -173988
4875 -173988 -229358 -53357 -11785 -178276 -216471 -172411 -160745 -205501 -246974 -97689 34555
4864 34555 70623 59491 82588 79110 186040 217427 81343 -40975 12311 -22450 1646
4853 1646 -11615 19555 141280 117798 22875 81280 141509 8167 -193836 -98897 -13787
4842 -13787 -243512 -315082 -348208 -285574 -237015 -240958 -215355 -161068 -29907 -66687 -155403 -206777
4830 -206777 -221808 -222586 -168517 -150056 -31821 53834 -54920 -77576 41825 20060 -31441
4819 -31441 -83918 -90045 -227388 -137582 -20284 -7000 -6142 -48086 -123986 -155690 -168793 -15532
4807 -15532 31290 60625 52615 -27344 -12487 81642 -38385 -46757 -20715 -94013 -110385 -82766
4795 -82766 -81822 48224 10616 -100383 33016 44649 -19247 33787 66137 22480 -5132 -125825
4783 -125825 -217845 -155673 -41174 -15096 -21345 -111519 26203 36933 -40990 -104106 -40445
4772 -40445 40858 59450 10855 -53377 -11528 -57926 23091 95995 89356 106248 -5242 -107745
4760 -107745 -97853 32455 92946 57688 115168 14837 -25094 28643 25229 40763 86334 16263
4748 16263 69770 117059 32699 1229 152 -386 120162 90521 67699 3071 8428 -136867
4736 -136867 -234301 -228259 -211019 -266602 -220015 -188898 -42285 111700 86216 112341 8358
4725 8358 -10751 -5208 -33451 3318 76874 121557 -90985 -122923 -66958 -66376 -50442 25831
4713 25831 54426 68042 59696 -81593 -177140 -198268 -145129 -179443 -244236 -232865 -235330 -95027
4701 -95027 -70479 -12570 63266 161722 150922 93451 206292 152582 86278 5162 43139 -79367
4689 -79367 -122750 333 -37137 673 -53943 -32905 22653 -4264 -9734 89077 110411 72395
4677 72395 251464 231783 165200 138339 116982 30264 -4485 -38996 27797 62134 67484 159566
4665 159566 222398 108472 33137 -45073 -157988 -146356 -46969 29541 -106539 -87979 -43695
4654 -43695 -61005 -79529 -95524 -67328 -28194 -112371 -82041 -55361 15613 125483 107325 30271
4642 30271 97144 113086 19717 -39796 -89855 -44077 -30665 13805 -39451 -85886 -140389 -100897
4630 -100897 -187095 -141551 -144388 -176270 -205339 -183626 -183045 -185202 -168646 -22988 -15750 -70752
4618 -70752 -85894 -137306 -181442 -138529 -2762 42487 73927 123208 68901 32502 6744 -50642
4606 -50642 -4054 277 109100 145144 19122 -36258 -708 -65347 -70650 -138169 -245623 -159736
4594 -159736 -96934 55824 139434 121349 75498 103884 129742 46894 15121 106264 116790
4583 116790 77061 48231 166079 226738 311798 248376 128856 85001 5361 -2963 21495
4572 21495 20245 22117 -6948 -117097 -179764 -177045 -108955 -97225 -17374 -126160 -149484 -125362
4560 -125362 -45041 -26621 17075 -29073 -99052 -188561 -78765 61017 -65655 1015 39612
4549 39612 30147 6409 19312 38025 50246 13681 82320 253812 275431 182400 240314 234975
4537 234975 78679 -72570 -37831 7779 -57678 -12035 -6818 -65163 -127023 -43540 94024
4526 94024 149942 78951 128193 97236 -61627 -124466 -108950 -111974 -162090 -177783 69089 131001
4514 131001 57506 86373 136687 82919 48751 8267 32360 -14457 56694 61041 15678 19449
4502 19449 -18279 -17782 -82570 -5752 114051 -54011 -92639 -69850 -97770 -123105 -92728 14589
4490 14589 -34573 -152740 -121770 -81556 -162802 -137823 -48938 -42083 62433 93372 75598 36118
4478 36118 27742 60382 39811 -62699 -96689 -45459 -87778 -61572 -41990 -100128 -127347 -14458
4466 -14458 108321 -5841 -121430 -95745 -47446 93520 58857 -51162 -9689 53275 102149
4455 102149 -34239 -85237 -50040 -82883 -144306 -154910 -169798 -155375 -76423 -40264 -89243
4444 -89243 -59900 -92575 -212470 -222699 -106752 -78439 -28100 88268 36154 -8670 58509
4433 58509 93507 1998 -62099 -131297 -122208 -18627 152836 106999 62181 8659 44982 152783
4421 152783 164213 222387 98249 42455 -8538 -6152 -40282 -84036 -115146 -69071 -55019 -50159
4409 -50159 -36025 -21901 30623 78715 58068 46330 41256 -29615 -105321 -69338 49781 31713
4397 31713 -25154 -3391 87644 62638 146778 62451 5675 -14933 -17837 -136313 -115387 -7396
4385 -7396 109037 184751 30279 -122758 -263836 -216751 -260452 -345454 -210164 -134833 -86021
4374 -86021 -68558 -54682 7225 100872 118564 126647 15202 18211 -87421 -187532 -78691
4363 -78691 16480 101054 276198 398306 365496 255430 126637 -35196 -125335 -149053 -222478
4352 -222478 -207908 -23264 26993 66261 1406 -186172 -242330 6891 164525 70756 -92005
4341 -92005 -95276 -120253 -105129 -86908 -57047 21332 6512 -62661 -241574 -293099 -232992 -173605
4329 -173605 -137104 -65893 -93680 -163368 -138316 -44186 -131102 -95896 49871 146343 188606
4318 188606 265957 365996 267787 249583 232945 194341 -10724 10448 140646 114668 101141
4307 101141 114904 48464 -66455 -160488 -246582 -252163 -242430 -169084 -51021 -51289 -141035 -28475
4295 -28475 -45419 -104399 -159402 -184173 -232492 -237863 -71631 -15462 -56565 -44650 -23733 -89902
4283 -89902 -16408 -11021 -56444 -73721 -144039 -54324 -54522 -109511 -34242 -43610 15076 -53619 -17873
4270 -17873 -9730 -149276 -173595 -255578 -324351 -165445 -34392 -70475 -90238 10573 38068
4259 38068 -78679 -109968 -66960 -95171 -99269 -97919 -158728 -252464 -176248 -59757 -104019 -134550
4247 -134550 -156449 3822 44017 -19152 87803 97642 60090 22903 53955 39632 116987
4236 116987 198317 229261 138015 53251 83228 108535 111260 7154 8581 -50634 -82643 -88964
4224 -88964 -87929 -37765 97990 46428 70747 62790 -51465 -153995 -185630 -170006 -166108 -49407
4212 -49407 -53631 -39741 -71988 -52329 66503 51479 15688 21062 45455 59252 -52389 -114621
4200 -114621 18575 99852 -7074 25369 -29199 -106740 -111966 14733 8072 -37153 -74057
4189 -74057 -33809 83870 5429 -31262 2783 -101706 -94764 68509 140278 246847 163366
4178 163366 49518 33379 71857 118886 66270 -355 -33260 -60881 -50882 -53522 -126443 15704
4166 15704 31169 39754 -1940 -16142 -24080 -127157 -290088 -358805 -250055 -231993 -229670 -216630
4154 -216630 -183565 -108151 -75705 -37601 94635 98134 26437 -41507 -141737 -221931 -220066 -87992
4142 -87992 -13521 -95198 -65803 -6480 16779 -10250 -3049 -148447 -225883 -238216 -183532 -94854
4130 -94854 -152921 -168271 -172043 -158762 -22536 4132 19567 -33622 -240527 -286308 -110797
4119 -110797 -139664 -134475 -117346 -51323 11070 27674 185722 271204 232822 221527 185122 100615
4107 100615 -69756 -145756 -167178 -28708 10808 -40222 -117164 -39402 29699 22649 23220 29027
4095 29027 121337 108212 -56877 -104854 -122783 -98236 27283 47990 -84063 -157858 -177531
4084 -177531 -113703 -66958 -76831 -34720 27859 -138632 -114509 -20531 -62230 -113042 -467
4073 -467 15782 -156358 -205427 -37129 28799 19449 1865 -72203 77686 203165 99527
4062 99527 17008 -29464 -55882 -100174 -243145 -144238 -86437 -162039 -210067 -171924 -226754 -212532
4050 -212532 -106255 -26235 20785 46141 -80298 -75581 -52247 -116799 -97566 -80205 -21441
4039 -21441 102889 151366 -64932 -114704 -142651 -158104 -104035 -44545 -70940 -137341 -175942
4028 -175942 -252874 -175979 -61496 108307 111710 6794 -9468 -8027 103890 196126 125645
4017 125645 29482 -84043 -50238 -51740 46211 178597 156004 83675 -67661 -8275 -31269
4006 -31269 -75308 -162370 -157785 -179465 -51206 -69340 -130279 -188430 -202149 -119527 -105384 9114
3994 9114 -3678 15849 35656 137778 222942 139743 25308 22936 124157 137534 157584 161841
3982 161841 163935 117084 81217 68869 86612 62498 -52285 -44621 39274 145604 158493 131817
3970 131817 183194 140801 166301 135709 -39136 -111102 -62969 -94100 -109359 -87400 -52403
3959 -52403 -5748 -33250 29452 -52339 -103142 -109199 -43840 -66534 -133944 -65355 83356 37931
3947 37931 7241 -36546 -120883 -147702 -187388 -70170 64883 40167 115630 159649 30001
3936 30001 4856 31453 -143461 -252137 -187247 -168859 -160512 -164835 -119620 -135061 -145331 -57696
3924 -57696 -101749 -29335 -17512 82658 28971 96651 41877 3284 -114394 -106776 -85046 -97389
3912 -97389 -11935 -47786 -139528 -67116 -71122 -27915 -87276 -152633 -195922 -176902 -94650 -24540
3900 -24540 -27670 -150338 -170288 -176221 -128017 -60777 -8752 -46174 -74298 -19444 -104914 -116058
3888 -116058 -12354 -8633 -55632 -34612 -55153 8233 -18351 -4455 11018 -140472 -257588
3877 -257588 -270242 -185847 -129666 -138198 -74832 -64850 2117 -37047 54737 150818 93070 98840
3865 98840 115988 116377 83729 40455 25170 63373 88512 68917 99049 27503 -29782 -23827
3853 -23827 2515 113544 141310 48639 90219 8716 16014 148860 315713 245503 125637
3842 125637 96992 34349 40966 -65399 -93222 22780 -57333 -4711 36149 75294 72355 -14998
3830 -14998 -63379 -65187 -28315 -56126 -26190 47386 84778 -32444 -94334 -17982 4548 -77821
3818 -77821 -16400 -61291 46935 12991 39719 136101 19084 -112364 -59785 -67264 -106585
3807 -106585 -11102 71430 135063 110195 76404 80575 58179 51813 43652 -54755 -69866 -82029
3795 -82029 -90129 69837 74254 100131 172212 185245 123575 59572 65061 81756 131040 95949
3783 95949 43851 115230 29767 28339 -6987 10710 13124 103670 87572 93125 47135 -11722
3771 -11722 -65923 -27486 -25037 -123605 -113975 -55837 -2409 -34840 -65865 -36520 44035 -57042
3759 -57042 -112605 -164941 -158330 -228497 -176460 -95020 -125768 -239559 -233107 -62090 27637 -101357
3747 -101357 -117394 -22800 61269 132481 35386 -85450 -99154 -41798 -631 70978 -105784
3736 -105784 -80618 -21519 -78348 46548 91361 96562 119583 141411 3824 -28452 25553
3725 25553 37604 24144 92627 123983 90079 -4667 -55356 -36246 -21662 -53777 -28875 -48386
3713 -48386 -23968 -67297 -42205 -24 -38961 -105538 -84208 -56876 -42994 10887 131200 132256
3701 132256 46873 -19385 -178708 -298469 -184967 -165779 -124854 -83357 -112975 -131267 -15186
3690 -15186 -850 109441 80949 -5439 25858 31052 44832 -64517 -154620 -192700 -165374 -59462
3678 -59462 -22936 59464 -23989 -817 49410 47922 -113841 -117963 82778 110325 72137 -26286
3666 -26286 -1425 2018 52000 6986 64571 104243 52687 -26717 -87372 -46055 -24431 -70331
3654 -70331 -20632 88993 101349 112004 145472 120117 113180 80175 96364 148057 70241 14571
3642 14571 98259 214529 250768 105261 -72302 -43518 87559 24208 -83418 -14458 108619
3631 108619 276794 319268 197891 70619 -5996 -166747 -129731 -70864 -37758 -36570 -52046
3620 -52046 79084 123345 88162 132574 223795 128007 -55867 -49484 -76501 -136165 -113877 -58761
3608 -58761 -317 -28198 -50022 -27009 -144003 -245814 -205074 -55248 9858 79344 34867
3597 34867 -2725 -47000 -56645 37420 182259 111860 -4858 -3505 21565 32808 94234 125241
3585 125241 36676 -38658 -37354 -54103 -191859 -181023 -68038 -6469 18464 -13638 -4528 -98801
3573 -98801 -87689 16286 75247 22246 -27575 32078 56083 -16267 -28524 -36284 -40262 -149638
3561 -149638 -210350 -158991 -38336 33006 55920 -89623 -127146 -84150 -122183 -189182 -132545
3550 -132545 -29872 -78590 -138948 -96244 -79677 -33780 -1023 -4368 -96237 -30286 46353 51814
3538 51814 74099 110196 186216 202361 164272 123697 122634 19574 -15857 114974 184046 203750
3526 203750 137922 144428 22974 37070 145009 135806 43157 30090 -70368 -159904 -84976
3515 -84976 51528 98156 70020 139130 167258 39338 -38056 -111947 -99243 -56794 -126733
3504 -126733 -97701 -46668 -8079 -56518 11672 135562 112931 161464 84198 116807 109658 43637
3492 43637 -62171 -60651 28736 30803 12257 -72117 -85637 -141731 -58228 192364 318231 315732
3480 315732 187908 -53317 -138969 -118560 -135256 -84985 -80627 46224 133190 45096 13037
3469 13037 -19739 -8006 -29233 -191463 -230747 -94092 14231 104117 149136 109014 40730
3458 40730 -135498 -122659 -34833 17406 67460 67817 11226 -149036 -47969 14947 13754 101423
3446 101423 62362 32235 100727 282364 241361 131905 103463 154303 89952 23371 20653
3435 20653 54670 111262 135189 68108 140561 223587 161059 147997 285051 218158 103091
3424 103091 67641 141500 177384 200646 96052 77033 214116 149621 18669 128567 300445
3413 300445 157029 -44872 -79323 -117128 -46454 -7644 12585 52909 -25771 -37602 -45928
3402 -45928 -51561 91410 151982 112316 45070 -106813 -103836 -18394 34360 2157 3982 24597
3390 24597 51629 53873 107760 112329 85880 8446 -31703 -24545 59885 104390 63662 -17587
3378 -17587 -163619 -202141 -39705 63487 98126 57903 21892 27865 2143 14887 34599
3367 34599 41837 20321 -5889 27707 -14482 -183414 -318839 -260060 -28699 -30678 42052 91727
3355 91727 45405 71769 87304 111314 41623 -48664 -1913 129628 127735 102551 91691 142438
3343 142438 46356 54167 122603 176208 208679 221470 128871 -8105 57650 236858 315902
3332 315902 200265 126896 5454 -27152 82391 77276 50974 169314 186593 242985 285591
3321 285591 224980 95134 135853 184233 236497 149133 24486 74837 90094 135941 101089
3310 101089 38053 48522 -5060 24554 80345 25229 148872 187363 102984 124032 93086
3299 93086 155994 161066 111864 62024 5197 -30349 2954 99917 154440 169094 117667 37748
3287 37748 15820 -114319 -32347 29764 88091 98846 37746 -39752 -84094 -115435 -13909
3276 -13909 41449 -74660 -94786 -28907 22816 69275 36328 -22109 78322 178028 60837
3265 60837 -21356 16515 9863 113569 195619 195142 837 -98271 -104910 -45419 42772 21072
3253 21072 6959 -54931 -115891 11537 89207 74510 33548 89582 90621 3676 -128461 -54834
3241 -54834 28421 -5639 -49349 24163 38431 43240 13288 -62728 -134998 -44378 143480 171623
3229 171623 -12730 -182667 -40923 76116 -22181 12017 157340 126662 92003 136858 125980
3218 125980 118763 127834 16111 -96525 -203127 -160269 -113874 -70513 -72096 -62793 38517 56756
3206 56756 -52021 41866 188510 146554 46639 31644 85085 55745 -1459 5752 27266 41498
3194 41498 195380 66752 -131393 -138548 -90303 -111304 -112545 -202007 -229188 -283457 -225363 -177069
3182 -177069 -163691 -66520 -101736 -58137 -30253 -66286 -204749 -233140 -108819 -17360 42534
3171 42534 -71615 -195382 -153585 -28205 78094 136718 24228 32134 146693 159660 197007
3160 197007 186789 163818 27517 2974 8463 26511 27249 73357 77144 63666 21698 91146
3148 91146 115720 24543 -22618 27268 54247 83134 80677 133885 197776 124314 -4696 -27162
3136 -27162 7710 54660 57037 -34179 -91681 -56645 -10822 35305 8307 -78113 -159199 -176315
3124 -176315 -18665 -342 58145 146405 116326 123384 85837 101626 122265 16630 48766
3113 48766 -64816 -51761 89751 130971 35525 -121690 -90158 98610 46142 -125155 -91410
3102 -91410 15360 111899 104878 107553 76543 137899 -7749 -52690 126790 141869 9084
3091 9084 -126326 -44671 23140 -57828 -40900 40249 117 26152 50166 31342 -12709 36006
3079 36006 -796 19216 60998 124478 92966 -5465 33642 204448 248594 204908 82159
3068 82159 -35309 -72081 -89639 25726 211491 162084 115720 60152 -9748 -71845 -184013
3057 -184013 -218201 -181991 -59279 -85986 -193347 -68638 42429 41617 -5892 -21309 -70984
3046 -70984 63065 72433 40310 -7352 -81266 -159085 -121231 -30750 28934 -1917 31903 173039
3034 173039 223664 144704 60018 -6116 12092 63513 103326 -51616 -81946 -98144 -117759
3023 -117759 -27060 -21537 -37625 -25012 18400 -68417 -112268 -82918 2851 -8979 -90049 -186632
3011 -186632 -124909 -13943 -36113 -69462 43396 16809 12184 125095 103330 74343 45205
3000 45205 42517 118557 -11386 -16155 67446 -9352 -109706 -102619 -82221 -74880 -83396 -54703
2988 -54703 76826 164649 147656 68520 13720 -12597 23507 -28336 -29925 -50821 -93288 -43289
2976 -43289 -97323 -44425 -26930 -137004 -173218 6038 89882 57000 31264 -28061 -35843 37840
2964 37840 107525 77703 88541 19842 -81113 -218202 -157278 -62916 51305 62911 -31380
2953 -31380 -88625 -80916 -20176 36126 85150 167154 126310 67292 28228 -30877 2035 17136
2941 17136 53915 117115 117117 53492 49811 134985 125183 65240 126928 90571 55270 24098 72441
2928 72441 62577 27630 -16933 -1466 -27987 39821 121275 78942 -5229 -65756 -33197 79601
2916 79601 106743 125360 13981 -96799 -136384 -216190 -205584 -251820 -279042 -118250 44
2905 44 16061 7175 81179 50448 36669 -22505 -73221 -81113 55893 115746 36705 17658 30163
2892 30163 25352 17990 -70621 -167677 -195410 -136968 -191400 -51982 74716 108129 100160 -14771
2880 -14771 30594 34538 -65624 -5456 37223 -15714 -20168 59220 -14841 -124147 -145724 -116462
2868 -116462 -46722 -13967 -99615 20005 100064 167604 130057 44063 -62517 -46986 -51579
2857 -51579 22852 42194 -90408 -170717 -164136 -106610 -76292 -153738 -178103 -172831 -191502 -36810
2845 -36810 131111 116369 -17075 -141982 -141879 -38970 117964 117222 168822 42126 25382
2834 25382 44848 13047 13514 13951 -18235 29377 -14683 61891 217397 240146 177977 104295
2822 104295 11474 2102 3592 10589 176805 261523 251627 281769 309421 130510 78091 -74247
2810 -74247 -34391 26449 65954 119096 45616 22838 68914 147655 57883 -15696 -86191 -88221
2798 -88221 -119336 -119122 -133786 -23882 -38681 17786 45623 92045 65899 55184 118715 25379
2786 25379 -55258 63036 108476 -26747 -91353 -109045 -5616 23936 75854 1549 -106322
2775 -106322 -179435 -85625 -24496 -12247 -114062 -129045 -100369 -118492 -123282 -220008 -203799 -127675
2763 -127675 -140321 -113175 -62863 -85014 -118780 -30482 30758 29448 -52843 5782 69518 66926
2751 66926 -111661 -174325 -61630 37634 -13592 -41618 -75718 -41330 -15249 129127 178149
2740 178149 51190 -15421 -16607 20533 -34744 -44675 -107095 -70956 -80227 -149844 -24421 -3588
2728 -3588 -91942 -150921 -76615 -50032 -79505 -46924 -13884 -92566 -114167 -96112 -121868 -91165
2716 -91165 6079 61920 -34824 87086 239196 267853 138132 97557 130566 123222 73491
2705 73491 188497 103043 -30720 48252 37663 -15942 -152922 -113028 -126959 -120035 -93503
2694 -93503 -39513 -142071 -209473 -232788 -73602 60929 -7970 -69711 57035 106234 43124
2683 43124 -73988 -85024 -74086 36743 67491 73778 155568 4976 -71220 25419 93280
2672 93280 80279 55549 35929 93556 103271 108908 268374 340252 156918 -19372 -50631 8101
2660 8101 -14935 -183818 -204343 -278911 -224926 -214207 -144465 -137586 -76095 -14827 -54175 -85890
2648 -85890 -87539 -48031 -11572 -29230 -92579 -100734 -115904 -21119 -45929 -73978 -142345 -129146
2636 -129146 -68694 -97960 -135249 -133981 -120577 -144980 -166613 -148816 -129949 -140352 -93720 -41884
2624 -41884 -71957 -50078 -16780 13383 25944 -63706 -86960 349 -112894 -205949 -138718 -14606
2612 -14606 -53700 -46841 -33222 43950 246803 216225 -4157 -77188 -82328 -90962 -61757 -15269
2600 -15269 -97589 -243402 -303383 -140803 -21251 28740 6174 -24932 -71105 -64625 111030
2589 111030 115954 87322 80176 145937 216189 90421 -127283 -49553 153323 153021 45449 53040
2577 53040 -11470 49516 129074 80343 115030 88548 -72128 -192690 -158425 -82739 -13894
2566 -13894 47849 21055 44949 76261 84439 141521 212380 95773 -26034 -53508 -155061
2555 -155061 -139388 -80227 -25514 33160 -50230 4175 22280 178449 183201 40501 51235
2544 51235 48486 117576 22879 6801 99838 9980 -72664 -194705 -167817 -205891 -205993 -165575
2532 -165575 -308275 -271777 -199868 -140933 -94769 384 32026 148277 144615 63406 24505
2521 24505 60158 104984 148429 15116 -92848 -25855 -22578 91281 74858 -40715 -48051
2510 -48051 -7830 -104053 -138766 -126646 -121405 -140995 -125741 -99133 -48031 -20433 -201367 -205775
2498 -205775 -167240 -146560 -142689 -83805 -34420 -93671 4160 3675 -139520 -219442 -232463 -56726
2486 -56726 -34912 -66216 -67687 95937 189588 106601 -30313 -31553 -53861 26170 60604 58663
2474 58663 127768 164624 106579 -108484 -201920 7452 33877 -25601 21395 23781 -120624
2463 -120624 -31163 43183 40319 51908 31724 17271 -76822 -44834 -10259 -58137 -79773 -53496
2451 -53496 -13018 34300 20660 53707 182762 202256 182401 143642 -52611 -135993 -89439
2440 -89439 -87535 -151890 -111890 -117344 -57326 -17134 -130305 -87918 30004 51769 -11043 -138378
2428 -138378 -193368 -138318 -88672 -67465 -85170 -1239 66348 57254 58539 26877 108130 107409
2416 107409 38464 43731 152630 39401 -76627 -26111 27653 5173 -24176 103486 123999
2405 123999 129353 96438 89773 84940 107186 -3871 -2143 8828 -45806 -135424 3584 57906
2393 57906 22881 127881 144755 40234 78891 -6217 -49659 14867 66112 100647 71364
2382 71364 81677 51096 -25553 -34727 70107 165434 48240 70668 176759 141156 126177
2371 126177 185111 119138 87447 109771 67510 76096 10849 -10597 11755 32757 24163 -41864
2359 -41864 -24974 -92719 -101116 7049 45089 11722 -7111 98842 103337 122575 101045 91858
2347 91858 69108 -79480 -124570 -78695 797 7150 54388 94986 -33818 55789 150181 118441
2335 118441 171617 126840 -12717 -87643 -147359 -59489 -5862 -139980 -206667 -144065 -56639
2324 -56639 -138786 -150212 -68412 -41207 -24109 19562 -30915 -108069 -149561 33339 109708 38697
2312 38697 56855 50150 48706 65537 56633 98655 102904 37684 -43524 -72133 -16904 45217 -30453
2299 -30453 -97154 -138382 -18889 59770 -17802 -75041 -137238 -122926 -24660 4605 -4163 -38140
2287 -38140 32080 26398 85262 34420 -58122 6654 180040 120603 77598 86403 -9977 -22390
2275 -22390 -32201 37783 -46668 1948 35026 -16518 -183926 -237395 -279927 -209461 -121615 -38384
2263 -38384 -26603 -15303 -124292 -87074 12043 58728 233228 238028 195740 183310 91244 137179
2251 137179 3460 50859 40982 -29357 -49540 -112899 -112955 -115107 -146418 -16660 48213 63258
2239 63258 47501 -34891 21297 71170 127195 115952 237750 246259 183689 55076 11686 122792
2227 122792 126163 -117636 -237044 -149053 -132795 -23565 96793 75829 117348 128206 156146
2216 156146 45427 72811 5980 -50195 -39112 17339 60787 -8208 -154722 -125733 -90858
2205 -90858 77535 268787 289704 187163 176988 104265 -29352 -34129 66986 149672 117586
2194 117586 49626 -15533 -15002 32449 13877 65622 82038 38546 -22044 -4877 -39745 -46869
2182 -46869 -65904 -37547 27111 -30302 -48339 -2301 -98251 -89538 -46956 26917 42956 -45207
2170 -45207 -38534 42757 32872 -8551 2681 31116 112244 190957 249579 245864 328497 227970
2158 227970 219135 140614 222614 323530 290382 254405 159261 109667 -46662 -41772 121541
2147 121541 263848 255350 225910 231111 158301 29279 4976 -65165 -51892 -17309 24537 130670
2135 130670 184063 139817 22790 104723 166862 86895 77995 27155 56394 62150 58957 56784
2123 56784 116605 130659 133124 88328 -102291 -160156 -34697 164223 216942 151904 38983
2112 38983 94430 80435 -48717 -7784 7198 -49513 39694 9470 -7667 -18963 -93604 -13164
2100 -13164 -98674 -122586 -70784 83173 138597 -34100 -102115 -118765 -111556 -135910 -137459 -23495
2088 -23495 2782 -24279 -49935 26204 53428 -144664 -207570 -53844 -77614 -120062 -131576
2077 -131576 -74779 -151011 -125392 -36656 1484 85272 13228 -33763 35994 26302 -34659 -12814
2065 -12814 1917 108042 174775 213767 226965 95146 -15091 -3805 39832 47477 43073 -6483
2053 -6483 31575 25936 9431 -65356 -92353 87392 79168 38412 -48371 -82620 -52955 15645
2041 15645 122902 107083 67089 -96780 21998 170350 72117 -31247 -57569 -24571 108889
2030 108889 149394 41466 -88809 -49827 15440 -59035 -58926 -111611 -129000 -181922 -217856 -74680
2018 -74680 -43671 15978 -84838 -27295 -25279 -37975 14428 105815 142785 141066 48539 47796
2006 47796 -24617 -152947 -52342 -38326 -8212 94428 170264 54733 -70229 -108976 -107941
1995 -107941 -103658 -54555 -96807 -173225 -132206 -103531 -179371 -140337 -62534 1176 35658 -57782
1983 -57782 -15912 46775 35366 -7721 -7789 40206 -14359 -104490 -95059 3614 111348 7326
1971 7326 -51523 -49561 -19205 8728 -74087 -105187 -142849 -112248 -101062 -172207 -11762 32648
1959 32648 82051 84618 99734 128986 186686 103213 32418 -13144 -90362 -124017 53944 -37594
1947 -37594 -73934 -20706 -51728 -90943 -94611 -50301 -93769 -25679 -1183 13836 -14062 -60377
1935 -60377 29138 34480 91428 248614 296463 102077 -14963 93463 204331 142679 69457
1924 69457 129487 162134 165975 130246 81909 32830 -52226 -74915 -43077 52324 -38207 -37924
1912 -37924 -23196 50236 -6773 -34705 18025 72247 123387 171667 173496 55233 -40083 -105148
1900 -105148 -85872 -144886 -29701 96773 79252 117781 98096 -82298 -77836 -154057 -77340
1889 -77340 -15893 50999 105813 52606 77791 64796 -562 -3581 -9435 14534 83165 48169
1877 48169 -53130 -37966 12733 -13092 -95232 30373 91672 38332 -18758 -16178 34400 43486
1865 43486 -60525 -130982 -136439 -97384 -186772 -176669 -4708 155799 76963 7492 2363 29531
1853 29531 -87209 -137451 -61194 150875 211977 253626 99538 -138259 -124918 -161562 -190414
1842 -190414 -77915 -20408 -113148 -14055 -86044 -143357 -116498 -50251 -48883 -60553 -107574 -5906
1830 -5906 4734 22505 210814 191308 189630 87987 43062 83088 29587 22230 30787 -15818
1818 -15818 84601 173487 225191 259450 167180 73392 66729 51009 45146 -61667 -12547 12676
1806 12676 44929 46343 40259 44705 150498 86292 -23718 -58897 -166714 -124187 -51322 -30225
1794 -30225 -7104 -37 33240 -74332 -168951 -167151 -84437 -104183 -27060 46596 109037 84342
1782 84342 -45459 -95520 -14970 11071 22227 38592 -38303 -23760 -105822 -115595 -115327 -103844
1770 -103844 -142614 -83805 -86844 2182 103621 168004 194817 46960 -21045 57283 -630
1759 -630 -7315 51914 74912 85525 84561 82716 26055 -90108 -57864 58046 83156 -1336 -16158
1746 -16158 -194503 -249337 -209592 -27759 7791 -75765 -52799 10847 33244 10262 -30424
1735 -30424 41754 140009 165207 171472 101864 190841 195901 149950 255353 221900 206305 6636
1723 6636 26352 56574 40666 56115 93409 63740 -3792 -28278 -53356 -4562 -83125 -155908
1711 -155908 -241744 -169253 -81912 13134 -65372 -147736 -138796 -148905 -120116 17786 22670 11172
1699 11172 239341 258630 34053 -42280 2127 53723 19884 -17107 61844 62640 8006 20154
1687 20154 114962 107592 96507 144633 -17012 -39261 -2395 60722 24825 -93698 -56951 12919
1675 12919 15220 124943 103234 4068 -62403 -117475 -33987 63894 74857 36470 -33632 -99778
1663 -99778 -45868 -33428 13397 -29057 -4471 -10421 7035 -30785 -88513 -202955 -198357 -156435
1651 -156435 -61851 -45771 -94287 -141871 -138962 -58507 -10483 51470 123534 90999 -51517 -27900
1639 -27900 -75595 2689 -16459 -12690 -86553 -37707 -10789 -12837 25488 -4983 32977 97209
1627 97209 132180 65496 56843 170220 138920 235712 196751 31015 -52269 -42275 25022 -3395
1615 -3395 -42054 10624 54211 -94598 -203976 -142160 -142412 -136095 -64710 66344 40702 93948
1603 93948 64493 42813 -52550 -19664 -43311 -200349 -118357 27995 -6849 -28924 -53881
1592 -53881 -75566 -23401 24428 98132 142669 95158 216087 262189 230223 105431 34047
1581 34047 111178 178573 170531 190088 212895 196270 124858 2710 -37302 -32873 -29052 -88256
1569 -88256 -102285 5013 97754 103100 165030 97525 97970 7978 -100811 -143507 -59693 63403
1557 63403 211034 186461 159385 68039 -5408 -94397 -187676 -143526 -147844 -207974 -260873 -247110
1545 -247110 -74005 -45735 85866 136191 35697 -33884 -14809 52583 167720 143478 91175
1534 91175 -36264 -4116 121728 100500 -7505 -195 72746 71378 -52046 -122578 -104834
1523 -104834 -77823 -92104 10780 115871 177525 109847 18667 -40134 -165334 -61215 89063
1512 89063 117397 184893 119944 41388 -52891 -63854 -28736 -35608 -25636 -55949 -33522 6287
1500 6287 -67388 -156784 -161979 -46779 18062 2670 -109838 -46853 7246 -78120 39300 114675
1488 114675 20796 12404 129 25933 -1845 -81134 -112936 -80400 -114166 -102329 -80239 8887
1476 8887 91335 31209 -57205 -110514 -72446 -175092 -144687 -156739 -146194 -5410 22985 31440
1464 31440 93482 119004 57424 91552 64654 29399 -13079 72518 124111 214738 266055 304530
1452 304530 268177 44600 43019 22898 8265 33723 17289 97216 164271 121694 223716
1441 223716 236550 336678 311085 253449 245412 181226 83053 167742 185436 237761 201014 81590
1429 81590 -22666 67713 141844 67990 68160 159788 185093 145938 117160 172937 51626 -10381
1417 -10381 29829 24466 65684 139981 11252 -151172 -237564 -230839 -35623 239982 214100
1406 214100 119384 21640 28637 107195 72141 -794 -36294 -14420 52660 37144 40996 -10418
1394 -10418 -15265 47382 58848 18590 17447 -24054 -99562 -142725 -216482 -171132 -162552 -178177
1382 -178177 -50965 100006 31955 68900 119095 205689 153641 133724 218781 136235 74
1371 74 -145857 -157379 -144373 49459 59060 88775 163169 198526 170954 20904 -110219 -131405
1359 -131405 -110497 -38682 -604 -46162 -91050 -9020 116511 69418 -8669 19671 -13659
1348 -13659 -211418 -92578 2452 -18819 11164 76421 19290 -67453 -103683 -134065 -124313 7138
1336 7138 7544 -34143 -36768 -29219 -60801 -72293 -71172 -45108 10648 -21238 -111795 -62725 -12658
1323 -12658 78480 118337 135759 214109 189983 114249 71548 -44034 -66083 11492 7413 8581
1311 8581 185 -68208 -16183 -40234 -43997 -55909 -7609 13178 -13174 -36449 2464 5780 92843
1298 92843 197221 140678 13479 71182 202759 231731 170153 230861 233092 90603 59972
1287 59972 -69162 -89063 85135 236026 233447 15082 32006 179064 114697 31455 54376
1276 54376 -34773 -20010 39771 42859 -13 -54134 -98152 9020 107692 122118 114409 112822
1264 112822 42511 86215 65432 24420 -14837 -24254 -46550 -131688 -69335 -17712 -20673 -18272
1252 -18272 -28708 -23491 23320 -10222 71952 169474 264010 291740 265156 293922 243761 195507
1240 195507 157499 -39017 -143540 -12707 13702 94886 27145 -42361 29910 88659 85057
1229 85057 9250 69363 56042 123625 129785 56750 23640 1044 -63495 -79739 -84225 -202659
1217 -202659 -215673 -164866 -134223 -124818 -101036 -44470 -4167 10583 -32575 -70360 -100711 -90680
1205 -90680 -79309 -118592 57387 249439 268027 248900 205762 203163 120927 -26630 -77851
1194 -77851 -10820 -44193 -3742 49133 22467 18879 49360 46879 219159 258396 98202 -56524
1182 -56524 -98262 35242 193381 200667 30139 -116027 -50889 -5036 13557 -834 -22926
1171 -22926 -71695 -23712 2432 -48377 -118836 -10427 12398 -36713 55290 40613 -50032 -93139
1159 -93139 -86916 -115784 -137445 -101117 4082 104961 90908 48283 71234 82187 104228 60032
1147 60032 88758 115726 93511 173434 224136 251857 271026 170952 99541 67031 -12997 47962
1135 47962 119869 49038 176667 271494 247442 49318 -15218 -32008 52032 120632 134917
1124 134917 140060 252547 279250 267059 266199 220833 137764 210017 134500 171348 197578 239343
1112 239343 237970 219506 266424 274190 315016 262820 240554 273201 143815 13921 -94341
1101 -94341 -42355 1288 -73141 13688 113117 220195 248079 185691 170447 153854 107039 1938
1089 1938 53080 116875 111781 6889 -187519 -164598 -39225 -4097 -127310 -77662 -4176
1078 -4176 172797 190016 151321 30249 11114 -72139 -184012 -109932 21995 88332 28971
1067 28971 -8116 -16893 2736 -7341 -57120 -23621 21308 23177 829 -28421 -111621 -106591
1055 -106591 -14102 183627 177540 94016 -22491 -35943 85438 45419 -28912 2154 -20478
1044 -20478 -21295 13216 -36158 -118756 -111933 -83755 -23659 17483 68562 116419 98384 132312
1032 132312 65951 -14241 -38804 7805 141173 205325 165676 76261 -20202 -3993 -66332
1021 -66332 -58359 95791 169019 37883 -117279 -65980 -67163 -74736 -99191 -97967 -48522 -74730
1009 -74730 -37107 -9319 -60777 -26233 -32927 -9270 -44729 75793 137745 108889 110132 108792
997 108792 118275 127776 135681 126116 114484 178563 134904 36722 131192 203689 115587 134675 145437
984 145437 -43995 -177542 -124565 -136964 -72209 -16340 41194 91912 40461 38572 48212 1490
972 1490 79333 132592 165512 238357 160093 -28989 -171481 -28254 146211 252112 190832
$$ [...]
##END NTUPLES=NMR SPECTRUM
##END=
