##TITLE=Analysis number 320882
Compound Code btb 13668
Project Code adrs
Chemist Name fudan
##JCAMPDX= 6.0         $$ Bruker NMR JCAMP-DX V2.0
##DATA TYPE= NMR SPECTRUM
##DATA CLASS= NTUPLES
##ORIGIN= Bruker BioSpin GmbH
##OWNER= nmr
$$ XWIN-NMR		Version 3.5
$$ Mon Jul 17 09:31:43 2006 GMT Daylight Time (UT+1h)  MAYBRIDGE\nmr@NMR_250MHZ
##.OBSERVE FREQUENCY= 250.131544655141
##.OBSERVE NUCLEUS= ^1H
##.ACQUISITION MODE= SIMULTANEOUS (DQD)
##.ACQUISITION SCHEME= undefined
##.AVERAGES= 16
##.DIGITISER RES= 18
##SPECTROMETER/DATA SYSTEM= dpx250
##.PULSE SEQUENCE= zg30
##.SOLVENT NAME= CDCl3
##.SHIFT REFERENCE= (INTERNAL, CDCl3, 0, 16.522)
##AUDIT TRAIL= $$ (NUMBER, WHEN, WHO, WHERE, WHAT)
$$ ##TITLE= Audit trail, XWIN-NMR		Version 3.5
$$ ##JCAMPDX= 5.01
$$ ##ORIGIN= Bruker BioSpin GmbH
$$ ##OWNER= nmr
$$ C:\u/data/dgb/nmr/ADRS/2780/pdata/1/auditp.txt
$$ ##AUDIT TRAIL=  $$ (NUMBER, WHEN, WHO, WHERE, WHAT)
(   1,<2006-07-17 09:31:22.28 +100>,<MAYBRIDGE\nmr>,<NMR_250MHZ>,
      <created by zg, POWCHK disabled, PULCHK disabled
       configuration hash MD5:
       E2 DF 36 D8 04 B2 41 60 5A D7 A3 38 5A 4B D0 FE
       data hash MD5: 64K
       4F AD E8 BD 9D BF D9 CF 7A FD 48 44 F5 79 C9 4C>)
(   2,<2006-07-17 09:31:33.85 +100>,<MAYBRIDGE\nmr>,<NMR_250MHZ>,
      <Start of raw data processing
       ef LB = 0.3 FT_mod = 6 PKNL = 1 SI = 32K 
       data hash MD5: 32K
       12 8C B9 C8 3B 56 78 02 B0 5D 55 BC 9C 44 C5 D9>)
(   3,<2006-07-17 09:31:36.46 +100>,<MAYBRIDGE\nmr>,<NMR_250MHZ>,
      <apk 
       data hash MD5: 32K
       33 18 2D 54 83 EF D9 93 17 0A D4 8F CB E3 C3 B4>)
(   4,<2006-07-17 09:31:37.23 +100>,<MAYBRIDGE\nmr>,<NMR_250MHZ>,
      <abs ABSG = 5 
       data hash MD5: 32K
       B5 86 E8 00 52 00 66 53 82 16 9A AB 8D C9 C5 12>)
$$ ##END=
$$ 
$$ hash MD5
$$ E5 45 B8 92 9D 6C A6 BC 96 68 54 08 99 6F BE AA
##$RELAX= 
##$RELAX= 
##$RELAX= 
##$RELAX= 
##$RELAX= 
##$RELAX= 
##$RELAX= 
$$ Bruker specific parameters
$$ --------------------------
##$DU= <C:\u>
##$EXPNO= 2780
##$NAME= <ADRS>
##$PROCNO= 1
##$TYPE= <nmr>
##$USER= <dgb>
##$AMP= (0..31)
100 100 100 100 100 100 100 100 100 100 100 100 100 100 100 100 100 100 
100 100 100 100 100 100 100 100 100 100 100 100 100 100 
##$AQSEQ= 0
##$AQ_mod= 3
##$AUNM= <au_zg>
##$AUTOPOS= <5 >
##$BF1= 250.13
##$BF2= 250.13
##$BF3= 250.13
##$BF4= 250.13
##$BF5= 500.13
##$BF6= 500.13
##$BF7= 500.13
##$BF8= 500.13
##$BYTORDA= 1
##$CFDGTYP= 0
##$CFRGTYP= 5
##$CHEMSTR= <none>
##$CNST= (0..31)
1 1 145 1 1 1 1 1 1 1 1 1 1 1 1 1 1 1 1 1 1 1 1 1 1 1 1 1 1 1 1 1 
##$CPDPRG= <>
##$CPDPRG1= <>
##$CPDPRG2= <>
##$CPDPRG3= <>
##$CPDPRG4= <mlev>
##$CPDPRG5= <mlev>
##$CPDPRG6= <mlev>
##$CPDPRG7= <mlev>
##$CPDPRG8= <mlev>
##$CPDPRGB= <>
##$CPDPRGT= <>
##$D= (0..31)
0 1 0 0 0 0 0 0 0 0.06 0 0 0 0 0 0 0.0002 0 0 0 0 0 0 0 0 0 0 0 0 0 0 
0 
##$DATE= 1153125081
##$DBL= (0..7)
120 120 120 120 120 120 120 120 
##$DBP= (0..7)
150 150 150 150 150 150 150 150 
##$DBP07= 0
##$DBPNAM0= <>
##$DBPNAM1= <>
##$DBPNAM2= <>
$$ [...]
##$SUBNAM7= <"">
##$SUBNAM8= <"">
##$SUBNAM9= <"">
##$SW= 20.6930455092707
##$SWIBOX= (0..15)
0 0 3 0 0 0 0 0 0 0 0 0 0 0 0 0 
##$SW_h= 5175.983436853
##$TD= 65536
##$TD0= 1
##$TE= 297.16
##$TE2= 300
##$TE3= 300
##$TEG= 300
##$TL= (0..7)
0 120 120 120 120 120 120 120 
##$TP= (0..7)
150 150 150 150 150 150 150 150 
##$TP07= 0
##$TPNAME0= <>
##$TPNAME1= <>
##$TPNAME2= <>
##$TPNAME3= <>
##$TPNAME4= <>
##$TPNAME5= <>
##$TPNAME6= <>
##$TPNAME7= <>
##$TPOAL= (0..7)
0.5 0.5 0.5 0.5 0.5 0.5 0.5 0.5 
##$TPOFFS= (0..7)
0 0 0 0 0 0 0 0 
##$TUNHIN= 0
##$TUNHOUT= 0
##$TUNXOUT= 0
##$USERA1= <user>
##$USERA2= <user>
##$USERA3= <user>
##$USERA4= <user>
##$USERA5= <user>
##$V9= 5
##$VALIST= <valist>
##$VCLIST= <CCCCCCCCCCCCCCC>
##$VD= 0
##$VDLIST= <DDDDDDDDDDDDDDD>
##$VPLIST= <PPPPPPPPPPPPPPP>
##$VTLIST= <TTTTTTTTTTTTTTT>
##$WBST= 1024
##$WBSW= 4
##$XGAIN= (0..3)
0 0 0 0 
##$XL= 0
##$YL= 0
##$YMAX_a= 494419
##$YMIN_a= -487842
##$ZGOPTNS= <>
##$ZL1= 120
##$ZL2= 120
##$ZL3= 120
##$ZL4= 120
##$ABSF1= 16.522
##$ABSF2= -4.171173
##$ABSG= 5
##$ABSL= 3
##$ALPHA= 0
##$AQORDER= 0
##$ASSFAC= 0
##$ASSFACI= 0
##$ASSFACX= 0
##$ASSWID= 0
##$AUNMP= <proc_1d>
##$AZFE= 0.1
##$AZFW= 0.1
##$BCFW= 0
##$BC_mod= 0
##$BYTORDP= 0
##$COROFFS= 0
##$CY= 12.5
##$DATMOD= 1
##$DC= 0
##$DFILT= <>
##$DTYPP= 0
##$F1P= 14.0000005364418
##$F2P= -0.99999901652339
##$FCOR= 0.5
##$FTSIZE= 32768
##$FT_mod= 6
##$GAMMA= 0
##$GB= 0
##$INTBC= 1
##$INTSCL= 1
##$ISEN= 128
##$LB= 0.3
##$LEV0= 0
##$LPBIN= 0
##$MAXI= 10000
##$MC2= 0
##$MEAN= 0
##$ME_mod= 0
##$MI= 0
##$NCOEF= 0
##$NC_proc= -6
##$NLEV= 6
##$NOISF1= 0
##$NOISF2= 0
##$NSP= 0
##$NTH_PI= 0
##$NZP= 0
##$OFFSET= 16.522
##$PC= 1
##$PHC0= 167.8607
##$PHC1= -3.197088
##$PH_mod= 1
##$PKNL= yes
##$PPARMOD= 0
##$PSCAL= 4
##$PSIGN= 0
##$REVERSE= no
##$SF= 250.13
##$SI= 32768
##$SIGF1= 0
##$SIGF2= 0
##$SINO= 400
##$SIOLD= 32768
##$SREGLST= <1H.CDCl3>
##$SSB= 0
##$STSI= 32768
##$STSR= 0
##$SW_p= 5175.98343685301
##$SYMM= 0
##$S_DEV= 0
##$TDeff= 65536
##$TDoff= 0
##$TI= <Analysis number 999999
Compound Code 99
Book Reference 9
Project Code 9>
##$TILT= no
##$TM1= 0
##$TM2= 0
##$TOPLEV= 0
##$USERP1= <user>
##$USERP2= <user>
##$USERP3= <user>
##$USERP4= <user>
##$USERP5= <user>
##$WDW= 1
##$XDIM= 32768
##$YMAX_p= 458370806
##$YMIN_p= -855099
$$ End of Bruker specific parameters
$$ ---------------------------------
##NTUPLES= NMR SPECTRUM
##VAR_NAME=  FREQUENCY,     SPECTRUM/REAL,   SPECTRUM/IMAG
##SYMBOL=    X,             R,               I
##VAR_TYPE=  INDEPENDENT,   DEPENDENT,       DEPENDENT
##VAR_FORM=  AFFN,          ASDF,            ASDF
##VAR_DIM=   32768,         32768,           32768
##UNITS=     HZ,            ARBITRARY UNITS, ARBITRARY UNITS
##FACTOR=    0.157963299565203, 1,           1
##FIRST=     4132.6476996994, 0,             0
##LAST=      -1043.33573715361, 0,           0
##MIN=       -1043.33573715361, -855099,     0
##MAX=       4132.6476996994, 458370806,     0
$$ Real data points
##PAGE= N=1
##DATA TABLE= (X++(R..R)), XYDATA
$$ [...]
17265i2094J41798j90M6670J1345k13463k18173J37285o9251k36425Q919L10830
17254a72749J57911j54011j51100M3263J08903J3362j50887J95658J09465n709
17244e894J4794P4388J32753o2755j56961K6985l059O5005j31034n0010J26142
17233C0354l8807l62589j877L96217K85253r783k07022m1229P2134M2950j05959
17222E9642J025r7095j22893r2491Q5410L9951M315m5378J22151K0390J61383
17211A36410j54905j97075m5028j45989j91872j23133K16606K33118J16397L65740
17201B10269j06562r6397M8254k33681j68875J13235J41622J18797M1893j47482
17191g8927K2395K70890j8871k01349l54136J2574R8692j5659l5536r3001L23446
$$ y = [-92094, 49704, 49514, 96184, 107529, -105934, -324107, -186822, -256073, -492498, -483579, -172749, -14838, -168849, -319949, -276686, -167783, -154421, -305308, -109650, -185, -5894, 8900, 83288, 216041, 153286, -3675, 23310, 20251, 85256, -45778, -95788, 30354, -8453, -371042, -372919, 23298, 308551, 298768, 91746, 50517, 122651, 165601, 59642, 60667, -36428, -159321, -251812, -166402, -126451, -122136, -167514, -45363, -24973, 136410, -18495, -215570, -260598, -406587, -598459, -721592, -504986, -271868, -155471, 210269, 103707, 7310, 55564, -178117, -346992, -233757, -92135, 26662, 68555, -78927, -56532, 214358, 195487, -5862, -359998, -347424, -248732, -264391, -299927, -392928, -69482]
17180f9482J58169o3357Q6770J55892J67586q7541J17688J52902k23633k53639
17170A41355O4943R6101j32154k3255k5634n1620r2759j31787J32287p6362j18215
17159b17100P524K02381O9993j75801j7012M8753J40574j70621k20406M5386J79833
17148a06496O5201m4535P1870k13671K5118p3558j1572J75920K91762k77179j99040
17137b96180K6961Q7921J8754j09876j91788o89K44484R3457J38532j67498k62386
17126d18308j97270P1743N11693K96785J62541p9272k51595k11669j98601J6072
17116b97881J032n2364P7172J84526J84239L6733j64430N0327L619k70943r2551
17105c40521l9985k9265N0221N4870Q371j18481p918M11952j20917l18786J09247
$$ y = [-69482, 88687, 25330, 112100, 267992, 435578, 348037, 465725, 618627, 394994, 141355, 206298, 302399, 170245, 146990, 121356, 69736, -23023, -154810, -22523, -98885, -217100, -209576, -7195, 62798, -113003, -130015, -81262, 59312, -111309, -331715, -286329, -106496, -41295, -85830, -13960, -227631, -202513, -276071, -287643, -111723, 180039, -97140, -296180, -269219, -181298, -162544, -272420, -464208, -464897, -220413, -126956, 11576, -155922, -418308, -615578, -543835, -32142, 264643, 427184, 347912, 96317, -115352, -313953, -297881, -296849, -349213, -272041, -87515, 96724, 133457, -30973, 19354, 22973, -247970, -340521, -380506, -409771, -359550, -304680, -296309, -414790, -422708, -10756, -131673, -450459, -341212]
17094c41212Q4970j7970k50538R1054K96096l091p3680j06477J52417J93552J0177
17083C5298k57016k25417P3776L7456L2425J51472M130J02077K20844k8093j67825
17072b0873q5232p0672J06356M2167j49868j59121K70881J33908m6452N4314J47760
17061B23168j9340l5361j3950k86806q5317l2114j2645J82867J43541j02883K0497
17050a8343m0520K6807J43786P1535p9824o0714j01282L6307J80941k0126l84
17039A38183m1029n8858k12921n3032J12880j81029o6754J11389l4433K103K7276
17028b56225r8254M5518J38561J97704N5795j96780p6574K21420N6404M4518j47128
17017a5041P8661M2328j80274k26718j43787K34609K65320q1167o7948k63771
$$ y = [-341212, -256242, -274212, -524750, -433696, -137600, -140691, -214371, -320848, -168431, 25121, 35298, -221718, -447135, -373359, -335903, -303478, -152006, -147876, -45799, 175045, 146952, -20873, -106105, -176777, -70421, -28254, -178122, -337243, -66362, 67546, 21094, 75408, 223168, 203828, 168467, 154517, -132289, -217606, -249720, -262365, -79498, 64043, -38840, -18343, -58863, -32056, 111730, 183265, 103441, 42727, -58555, -22248, 158693, 138567, 138183, 97154, 38296, -174625, -227657, -114777, -295806, -362560, -251171, -285604, -283501, -256225, -354479, -308961, -170400, 27304, 83099, -113681, -190255, 31165, 87569, 132087, -15041, 63620, 105948, -74326, -301044, -444831, -210222, 55098, -26069, -94017, -357788]
17007c57788L1947K17830M1613J54063m0940J54823J03673j27281k36923P3959
16997A4976N5386N0370J09108lJ12312j3132j32840N4512j13756l64851q7904
16986c15822R2652k1869K43739l0655j4956j6104J69793l3946j30143o8876J53733
16975B7546P3516r0612j00859J3074K09948K13165K5742k00290j0797J6258j33187
16964D3504k12505p029J73529J76179l4456l5434P2509j03498l3577J77817j54638
16953F2401j703j35338k19063o4965J92316k3429k6962K79950j94552j83338J6778
16942b97905R224O3018O5935O9112j44037K40761O1640j02446r8765J25122J39445
16931A31104K4704J06891L854k10263o1146j16367p0895j8016q4729O9700J24749
$$ y = [-357788, -325841, -108011, -66398, 87665, 46725, 201548, 305221, 177940, -58983, 14976, 70362, 120732, 229840, 229837, 342149, 329017, 196177, 250689, 136933, -227918, -315822, -223170, -245039, -1300, -31955, -46911, -63015, 106778, 72832, -57311, -126187, 27546, 101062, 10450, -90409, -77335, 132613, 345778, 371520, 171230, 160433, 176691, 43504, -169001, -176030, -2501, 173678, 139222, 103788, 176297, 72799, 39222, 217039, 62401, 60698, -74640, -293703, -358668, -166352, -189781, -216743, 63207, -131345, -314683, -297905, -288681, -225663, -159728, -90616, -234653, 6108, 67748, -34698, -133463, -8341, 131104, 155808, 262699, 266553, 56290, -4856, -121223, -192118, -210134, -294863, -225163, -100414]
16920a00414R9410o1263j68566J4702m821L3643j36127L3246K38614K19431k79413
16909a11558j39481j67496L0310Q9385J8493L7176J74287j03436j77365L8055
16899c11630K19994P0419J57990j47535L3910J52169p453k36308r5367J11602
16889e2209L14652J82087j14243q8038K7927j86250l32821N454J3845K47799J33893
16878A52096m2266o5005O240p7670l29278j82112K54101K03402N0141J95240K5523
16867A90412K3422P8759k0684j55387j28789k06710n4031J38982R6902J55785
16857A18661J42837j61830l17918j03484o105L01077Q2742l8768O4184j20345
16847c8949j64666o8419J653J64783o7355L9108J76380k56201j21612N4678R8657
$$ y = [-100414, -1004, -62267, -230833, -216131, -220952, -187309, -323436, -290190, -51576, 167855, -111558, -251039, -418535, -388225, -298840, -280347, -243171, -68884, -172320, -349685, -311630, -91636, -21217, 136773, -10762, 23148, 175317, 167864, -68444, -163811, -52209, 262443, 444530, 330287, 242249, 270176, 83926, -248895, -243441, -229596, 18203, 152096, 109830, 44825, 51065, -26605, -355883, -537995, -283894, -80492, -30351, 164889, 190412, 213834, 292593, 271909, 116522, -12267, -218977, -273008, -134026, -37124, 118661, 261498, 99668, -218250, -321734, -327839, -26762, 55980, 17212, 81396, -38949, -203615, -272034, -270381, -105598, -172953, -133845, 42535, -213666, -335278, -280600, -181943]
16836a81943Q3878J90140Q8998J0887l68856k75542O9988R4007M0922K27878J29283
16825A09640J16202j08914l3222l4528L0569k35153q9490l9528l3318R9203O8859
16814a49680L85648N0031p580j42307j17571J9265J04167n3570q6408L6146J33926
16803A72067R4392n3902q7492o3149O3819q5549J0449k5654j262M40021j58474
16792C05266q8294l7304j98906o0800N6953M0257k11757j22269O4049r9724l325
16781c55854q3150K05750M3622K8788p2727j27346p4591j68991K0555N71196J8779
16770F031p9414N6349k49203q8261Q4288k848L36005L95412j58250l21047m2439
16759f3377J51598K27468M1622q8444j15173j96269J23868q1912j84405k31219
$$ y = [-181943, -98065, 92075, 181073, 191960, -176896, -452438, -382450, -288443, -247521, -19643, 109640, 225842, 116928, 83706, 49178, 79747, -155406, -244896, -284424, -317742, -218539, -149680, 235968, 285999, 278419, 136112, 18541, 37806, 141973, 88403, 1995, 38141, 172067, 266459, 212557, 125065, 61916, 125735, 40186, 50635, 24981, 23719, 463740, 305266, 216972, 179668, -19238, -80038, -23085, 17172, -194585, -316854, -252805, -352529, -355854, -439004, -233254, -189632, -160844, -233571, -360917, -435508, -604499, -583944, -12748, 6031, -73383, -17034, -266237, -354498, -270210, -273058, 62947, 458359, 300109, -20938, -63377, 88221, 315689, 357311, 268867, 153694, -42575, 81293, -619, -185024, -416243]
16749d16243J67250J61288o1375O0270j96443j46459J54744Q2620M7541J95651
16739D8844j1204P9386K12332J02818k23512J8343k303K9847l26114k95492q3970
16728d51025J9615J43235J00352R8631J09377J3226j726K12186p7080k89056k8321
16717a50586p8968j99941p9455J45029L28165L0725k7336k3844P4022K2572L497
16706D3880j72416o6994K47436Q3367j69489J32610J74450l1837m2088j29562
16696F9357p2216r1685k07596L07178M5897n7067q8082K52270L4032j90991k07925
16685b06828j42838K763n532Q732L0405J86663k6707L0331J01119K116R5929J03598
16673A79751k07874j94563J43640o5643k9157K43127J47560Q1965j36437k36726
$$ y = [-416243, -248993, -87705, -149080, -88810, -285253, -431712, -276968, -194348, -146807, 48844, 37640, 117026, 329358, 432176, 208664, 227007, 224704, 254551, -71563, -367055, -451025, -431410, -288175, -187823, -89192, 20185, 33411, 31685, 243871, 166791, -122265, -150586, -229554, -429495, -508950, -363921, -35756, -5031, -32367, -56211, 17811, 40383, 43880, -128536, -195530, 51906, 135273, -34216, 98394, 272844, 241007, 198919, 69357, -2859, -94544, -302140, 5038, 50935, -6132, -94214, 158056, 192088, 1097, -206828, -349666, -346903, -352435, -343703, -313298, -126635, -153342, -123011, -21892, -19776, 76153, 179751, -28123, -222686, -79046, -144689, -173846, 69281, 216841, 298806, 162369, -74357]
16663g4357k00274N7934p8793L633K67394P9168o7369K91741M9389L726j34528
16652A97664j77190q6301P1732O2063J21962r625k66192j22466K71874J54438
16642B17959Q1659P8287q2690k23111K3589M4039j50797j25011o2272j3998J15937
16631i6409q8201L4148K25702l0952K70121o1704j77336p2075J6318P4719k9507
16620F4824R395L1850P4901j11335m5519J2076N3669M1107l703M4765J678J30480
16608C04188l6108p7351k67083j91991J14885k213O5707K95702K00795J61069
16598E67600N585j92453k19274j30885J55521l6027n7398p298l9257k5142K5235
16587D6207j335k65494j17581R9174J49555j54251j51569J86556R103k5636J44838
$$ y = [-74357, -274631, -216697, -295490, -291857, -24463, 54705, -12664, 279077, 328466, 332192, 197664, 20474, -65827, 5905, 67968, 189930, 180305, -85887, -208353, 63521, 217959, 299618, 377905, 295215, 72104, 95693, 139732, -11065, -136076, -198348, -212346, -96409, -184610, -150462, 75240, 44288, 314409, 252705, 75369, 3294, 19612, 94331, 64824, 74219, 106069, 180970, 69635, 24116, 36192, 89861, 130968, 127265, 172030, 173708, 304188, 268080, 190729, -76354, -268345, -153460, -155673, -89966, 205736, 406531, 567600, 573185, 380732, 161458, 30573, 186094, 150067, 92669, 85371, 46114, 20972, 46207, 44872, -220622, -338203, -239029, -89474, -243725, -395294, -208738, -199635, -225271, -80433]
16576h0433P2068k1808J47046J82037N3985J84918k46641m05602j33062j43456
16566c90948p4991Q9637M64424J64145K1308o0132j7379l0634k34719J28901K19259
16555B78871j55817j69466k56636R869L5936j3488N8957J07486m9352K07641J85116
16544B39117J81715N6205k33503o6723j07568P923j83455J0132r8881q2308K7439
16533b49907K02486M603j89308p7214J2980m7526K4798j13847m0989J48085K47483
16522g8356n267r591r5883P5102n2063j85351j0371j49282J16238N3883M7592
16511b93349L29805M4628r2035J791l28932O899K70901J1319N9790K30350M5581
16500B86748q8398P3901O8650n1996q7761m2720k22550J49492k0519j48435K2320
$$ y = [-80433, -8365, -30173, 116873, 298910, 352895, 537813, 291172, -114430, -247492, -390948, -465939, -376302, 88122, 252267, 273575, 213443, 196064, 165430, -69289, 59612, 278871, 123054, -46412, -303048, -293179, -257243, -270731, -211774, -104288, -153640, 54001, 239117, 420832, 477037, 243534, 176811, 69243, 77166, -106289, -96157, -195038, -277346, -249907, -47421, -42818, -232126, -309340, -296360, -343886, -319088, -432935, -473924, -325839, -78356, -83623, -93214, -189097, -113995, -166058, -351409, -361780, -511062, -394824, -340941, -293349, 36456, 81084, -10951, -9160, -338092, -331193, -60292, -48973, 10817, 241167, 286748, 198350, 272251, 340901, 288905, 201144, 158424, -64126, 85366, 64847, -83588, -61268]
16489f1268J55812Q5714J61471J3004k12826j49438k56978J89880J84742R2747
16479B02860j3540j59051j70437o5931R3670r2236q7254j71825j50652N0517J68385
16468c95494j9559q2641O3096j2683P4052K94992J14998k60618r8609J76574j58859
16457c04751J32950j018r3191q9776N5489J29823L2343K05256K38420J63372m2878
16446D26039r664N8329n8597m30555Q846j07508k20435n5877l1054l3402K91205
16435a62673R4516k9003o5950k14968k1347M0105L6556K48702J00376P9924J8134
16424A24372L5416N7009j67680M2515m5792j83288Q7239L2066o430k05759J65790
16413f4542K11865j45998r8641j41430J22696J16841k74360O8426J33620J74628
$$ y = [-61268, 94544, 180258, 341729, 354733, 141907, -7531, -264509, -74629, 110113, 202860, 189320, 30269, -140168, -206099, -112429, -204665, -291919, -463744, -614396, -563879, -395494, -415053, -497694, -434598, -447281, -373229, -78237, 36761, -223857, -322466, -145892, -304751, -171801, -172819, -266010, -355786, -300297, -170474, -138131, 67125, 305545, 468917, 426039, 416375, 474704, 416107, -14448, -5602, -113110, -333545, -389422, -420476, -453878, -162673, -68157, -97160, -163110, -378078, -399425, -359320, -322764, -74062, 26314, 106238, 124372, 159788, 216797, 49117, 91632, 45840, -137448, -50209, -18143, -24573, -230332, -64542, 147323, 1325, -97316, -238746, -116050, 791, -273569, -205143, -71523, 103105]
16403A03105J74584q2332r6853l6639r686N8241J36015N5134j55931k22848J29266
16392E2056J04532j28131k07475j74933J87947L59316j12204k56755R5751J17165
16382C7269m6356n3898k1040o3126j78663J00739J31737M3685K3931j8602K40998
16371A96674n0050l17887j80479N5055L20486J08356k60188J33760J07055j06057
16361F725n4391J3683J22674j1323k66116n8118J96340Q9020j86249j80438K10578
16350a17615J5963j18143K12801Q5295J6668k25305j68700J16220p314l530m2346
16339b36006j25250K21726K67520K2106j15288r6437J30583J62344j6893k3187
16329A91218J8520R8884J3873K44255j63341k29206P7447L7807j93555m7127M9789
$$ y = [103105, 277689, 195357, 98504, 61865, 52179, 110420, 246435, 301569, 145638, -77210, 52056, 156588, 28457, -179018, -353951, -166004, 193312, 81108, -175647, -79896, 37269, -9087, -62985, -84025, -147151, -325814, -225075, -93338, -49653, -25722, -44324, 196674, 146624, -171263, -351742, -296687, 23799, 132155, -128033, 5727, 112782, 6725, -47666, -33983, 88691, 77368, -188748, -246866, -50526, 38494, -147755, -328193, -117615, -101652, -219795, -6994, 78301, 94969, -130336, -299036, -182816, -190130, -193660, -236006, -361256, -139530, 127990, 150096, 34808, -61629, 68954, 231298, 214405, 191218, 209738, 308622, 322495, 566750, 403409, 174203, 251650, 289457, 95902, 48775, 98564]
16318I8564O8342L06522K6521k49894k0656j23704j70459J47087J13357L9983
16308B35663R7526K36313l753j20617k07000k98l4697J55654J11776J28295K3096
16297F21958m70022n03679J03238N48764L8567k81690j71060k1144R5666R8029
16287E8627O6171m4063j64209J1834J70097p0529O9646Q0681j7993j07065P5639
16276A28836j13726k9023K1192j03027J60350L46592j28386j96779J11336j60906
16266C6459M3217R7431p0259j73625O2318R2083j58511j70017R9244Q6249k949
16255e8360N5753p9940k04197M0925J3164K15129j57858m3708J05564o398j01101
16244b21027J4887N3331l40548j70888J66565M12826L93929j56759j72925k41419
$$ y = [98564, 166906, 473428, 499949, 250055, 229399, 105695, -64764, 82323, 195680, 235663, 333189, 569502, 565749, 445132, 238132, 237834, 203137, 358791, 470567, 598862, 621958, 151936, -351743, -248505, 300259, 338826, 57136, -113924, -135068, -39402, 58627, 124798, 80735, -83474, -71640, 98457, 27928, 97574, 178255, 160262, 53197, 128836, 15110, -13913, 7279, -95748, 64602, 411194, 282808, 86029, 197365, 36459, 79676, 177107, 106848, -66777, -4459, 87624, -70887, -240904, -141660, -55411, -58360, -2607, -82547, -286744, -245819, -232655, -17526, -175384, -219092, -113528, -119926, -221027, -206140, -152809, -493357, -664245, -497680, -84854, 309075, 152316, -20609, -262028]
16234b62028l31515j79540J48484K54616N981J44583M3107j04490k00889j56856
16224f38547l9775J78846K01491J5653j25374J16226j21188j38835J41802K60557
16214a49144K47076L9843l9152m5591q222p2847j16803L3464J92659J27837l0076
16203A79044j09341j78624N9317m7517j14771j04983K20098L8626K07405P4137
16193B23391k23740j03435J42006o5643P3718o813j35372k17058q8783m6935J21609
16182c27055J3571l5097J60945J13510J106o5185k62699j38310L34296J45343
16172e9575J25572L0685m0336Q4306o9766o7170j69926j95887L51386K75459k20042
16161D4706k56510j39257J65798J71989J63873K2406j36379q7782k2897O2973
$$ y = [-262028, -593543, -773083, -624599, -369983, -364002, -219419, -176312, -280802, -481691, -638547, -678322, -499476, -297985, -282332, -407706, -291480, -412668, -551503, -409701, -149144, 97932, 137775, 98623, 53032, 44810, -28037, -144840, -111376, 81283, 209120, 179044, 69703, -108921, -49604, -97121, -211892, -316875, -96777, -58151, 149254, 223391, -349, -103784, 38222, -27421, 46297, 39484, -95888, -312946, -401729, -448664, -327055, -313484, -348581, -187636, -74126, -73020, -138205, -400904, -539214, -204918, -59575, 65997, 96682, 56346, 140652, 70886, 3716, -166210, -362097, -10711, 264748, 44706, -211804, -351061, -185263, -13274, 150599, 173005, 36626, -51156, -74053, -11080]
16151a1080R5619N590J34742k84793J17552K69187K19300K8112R9297j11198j23614
16140D38714j52059k26437j06964j59601o0470k84889q5532L17511K47264L1177
16130d1286l5126n289L1658m3585L2789M67597Q334j24671q6184j84501j15469
16119i5733p4240j74545N4234L47655K94295M0649J61936k99482m50571j2110
16109b07912L31242L6709k27832k38397L20851J06402k17367N0403K03529j48097
16099I531j90781K3931J59210j0430r7722l97128K548J18249J00317O0733j68204
16088c89746J11592K02250K42415J40163j11562r9038j3580J78237J47945N9909
16078D68585p960O1354J0960K4927k13516j38991m64408J19533K69425n3224L7484
$$ y = [-11080, 84539, 90129, 224871, -59922, 57630, 326817, 546117, 574229, 673526, 562328, 438714, 286655, 60218, -46746, -206347, -266817, -551706, -637238, -319727, -72463, -41286, -76412, -81701, -50043, -93628, -60839, 406758, 415092, 290421, 204237, 19736, -95733, -169973, -344518, -290284, 57371, 351666, 392315, 554251, 254769, -195802, -207912, 123330, 160039, -67793, -306190, 14661, 121063, -96304, -45901, 157628, 9531, -181250, -157319, 1891, -8539, -106261, -503389, -500841, -382592, -282275, -221542, -389746, -278154, -75904, 166511, 306674, 195112, 96074, 82494, 260731, 408676, 468585, 460625, 521979, 532939, 557866, 344350, 205359, -259049, -139516, 129909, 76685, 114169]
16067A14169j30119J60662m9117q9268J41105R4865j28134n7238M7649k6293j52035
16056g3754K10698Q7170j63500M70R2104l3817j19859r1832J53845K66841k9196
16045B99170j16414O6032j2994j86954N3144J75553R7073j23822j01044j8101
16035A31643J15922k32191N4723Q4609j20209J44801J31715j87456k53343M3804
16025h5982l5017p664N7026M2926m670R9197J23203J056r5820k10747p472J60944
16013C6980M9954n343j13176q0032j34800L79878k625O7143O5144R9405P0464
16002D32992m2309k47667j86103P3922q163L00000k58706J9209J24072M1353j44076
15991A04524n8762k7822K5816l0896j0783l3988m3162o2696L37251J10230K4011
$$ y = [114169, -15950, 144712, 95595, 6327, 147432, 242297, 114163, 56925, 104574, 78281, -73754, 136944, 224114, 60614, 61084, 153188, 119371, -488, -92320, 61525, 328366, 299170, 182756, 248788, 235794, 48840, 101984, 277537, 374610, 250788, 149744, 131643, 247565, 15374, 70097, 154706, 34497, 179298, 311013, 123557, -129786, -85982, -120999, -128663, -71637, -28711, -33381, 65816, 189019, 190075, 94255, -116492, -123964, 36980, 86934, 81591, -31585, -111617, -246417, 133461, 130836, 197979, 263123, 362528, 432992, 390683, 143016, -43087, 30835, 22672, 322672, 63966, 83175, 207247, 248600, 104524, 45762, 17940, 43756, 12860, 2077, -31911, -75073, -137769, 199482, 309712, 333723]
15980C33723k62392q5274L3839j11469R096L4670K1569j60787R7025J9322k3733
15969i4411j72447K21681K41795l6438Q6905j11159l59676j14184J07544l0692
15959b61082K38785J59447n6513K1006j10699p1933J54020l2988k53170O1556
15949a51571M1620r3980K3193k02973J11877J45372K67074l0262q5457N9559K18737
15938C03189Q1246M9773J55066j13791l09854r936O1335k08213j75308j68357
15928c34850J08435K82753k8252k1q8248p2911J34119J19022K03287p7007k60532
15917a4205j87505R870J2529J32970J23530o2249J44154J36475J2359k30392k63763
15906a86227j42925l0170J38068L49152N9627j42967L2751l084q4034j17487R7642
$$ y = [333723, 71331, -13943, 19896, -91573, -82477, -47807, -26238, -187025, -90000, -70678, -94411, -266858, -45177, 196618, 160180, 247085, 135926, -223750, -337934, -230390, -261082, -22297, 137150, 80637, 101643, -9056, -80989, 73031, 40043, -213127, -151571, -109951, -203931, -180738, -383711, -271834, -126462, 140612, 110350, 24893, 84452, 303189, 384435, 434208, 589274, 475483, 165629, 155693, 217028, 8815, -166493, -334850, -226415, 56338, 28086, 28065, -60183, -133094, 1025, 120047, 323334, 246327, -14205, -201710, -191840, -179311, -46341, 77189, 14940, 159094, 295569, 307928, 77536, -186227, -329152, -359322, -221254, 127898, 187525, 44558, 77309, 74225, -9809, -127296, -29654]
15895b9654J60635Q8029j16307k49634J5644K51533J77501p5314q7895n0141L1998
15884A16395J27562J24192N6981J5521m02054j98837J66484J88828j667j17448
15874G5957k11197k23293K343J48880J27173r9742K30800J1870j87609j88293
15864c13111L3928M6827k06024j76647l4356R1603K11302J36329J52289J37800
15854G9940j80078J27868J60084j0387k85030j38996J03512p9034J38576L0632
15844e2913K24612J17894k70086J7796N7999J73111n7142k65805k45839Q567K41884
15833d9922M872K35395R43j84950k3881o960k16480k09368K834J59578p5061j76743
15821e39743J18835J64101n1009j35451J89615j34635J06784R2301J48063J53019
$$ y = [-29654, 130981, 219010, 102703, -146931, -131287, 120246, 297747, 222433, 134538, 84397, 116395, 243957, 368149, 425130, 440651, 38597, -160240, 6244, 195072, 193405, 75957, -135240, -358533, -356190, -207310, -80137, -179879, 50921, 62791, -124818, -313111, -279183, -232356, -438380, -615027, -649383, -557780, -346478, -210149, -57860, 79940, -100138, 27730, 187814, 177427, -107603, -246599, -143087, -222121, -83545, -52913, 171699, 289593, 19507, 37303, 95302, 268413, 211271, -54534, -300373, -291806, -49922, -45050, 190345, 191288, 6338, -17543, -24503, -240983, -450351, -447517, -287939, -363000, -539743, -420908, -256807, -307816, -443267, -253652, -388287, -281503, -189202, -41139, 111880]
15811A11880n2542k29292o9241j53508l3431Q4395K35679J23641k3444J14045
15801A08182K1830J15276J53604q6319k15300j78998J27768k9150r7917j75649
15791b56673J10602k0164J95799K60579K16467p0151j00705j13131l4019j10050
15781G8554L504j18441j94845j46480p2840r581L26234K5444j04652J68266R5212
15770E0375J6555P6757j29862M4583J15355j29995L4192R5730p6795R8486J62781
15759C58162O609k13047j15315m0683K6651j16328k486l1332m1294k16380j44757
15748e30200L01470P4283R387K19704K5427J59550J29996n4879k77350j70581
15738a13193K98001K10937o0060k54574p1001j31064R6494K6248J60440J59205
$$ y = [111880, 59338, -169954, -239195, -392703, -426134, -341739, -106060, 17581, -5863, 108182, 130012, 245288, 398892, 312573, 97273, -81725, 46043, 16893, -81024, -256673, -146071, -166235, 29564, 290143, 506610, 436459, 335754, 222623, 188604, 78554, 82058, -36383, -231228, -377708, -450548, -460129, -133895, -108451, -213103, -44837, 50375, 66930, 143687, 13825, 58408, 173763, 43768, 77960, 173690, 96895, 195381, 358162, 364771, 151724, 36409, -4274, 22377, -93951, -96437, -127769, -169063, -385443, -530200, -228730, -154447, -145060, 74644, 100071, 259621, 389617, 334738, 57388, -113193, 184808, 395745, 335685, 81111, 10110, -120954, -24460, 1788, 162228, 321433]
15728C21433J50175j28213K6835n6035J5849K57666Q2179k82439k48300j10530
15718B8620J48894M8144k10250o3962Q9974J25226J2179O3321J55315m0303m19674
15707f2516K3718K82572K4956k24989k77595j73248j60242J53301R2422M9014
15697b72607Q9209n1351J1527n7661j58733K3554K08832L63916R9248j71952j96886
15686a12904J29529q6594n3219Q7760k83968q8099j7984Q7648K30704n2138j02782
15675b62047L8200K71914J59034P4295R8576m6636J12781j03625L5430j067l2258
15664C44597j19306j71406q1315M9666r8802k11378J93020L68192J79231k10373
15654B42126l42927J52358P4909j45185p1956M878k6824k558K98855K29287j66940
$$ y = [321433, 471608, 343395, 370230, 314195, 330044, 587710, 669889, 387450, 139150, 28620, 177514, 225658, 15408, -48554, 41420, 166646, 178825, 242146, 397461, 357158, -62516, -38798, 243774, 268730, 43741, -233854, -407102, -567344, -414043, -321621, -272607, -183398, -234749, -223222, -280883, -439616, -416062, -207230, 156686, 255934, 83982, -112904, 16625, -69969, -123188, -35428, -319396, -407495, -425479, -337831, -107127, -159265, -262047, -223847, 48067, 207101, 281396, 379972, 333336, 446117, 342492, 377922, 376855, 344597, 225291, 53885, -27430, 22236, -76566, -287944, -94924, 273268, 452499, 242126, -100801, 51557, 126466, -18719, -90675, -85797, -112621, -115179, 183676, 412963, 246023]
15643B46023j40822j24877Q3323Q5805J3120J68147J02802j78234j22787p8419
15633E4081j6375J30535K35333k98392l63796K14642l307J2406J03539J15870
15623A84536K8541L037k22611K4453n3911L5471o7725o8877J00521P2081N3796
15612H9312O9119j84841j24397o6317M999K0420N3406K35691J28268J0316j86111
15601D9865m3240r0627J50461J07275J01496J8997j16710j73578r6946K4431K10940
15590A42364K95752p1785k71766K6348l0267P0627N417j44504m8773K68167N1402
15579B92982k44539j74786K30325O4325m6733j91307L3891j56664l98617L2256
15569e58867J34184J79142J24564L7875q4697j37340J12888J01875M8851P5644
$$ y = [246023, 105201, -19676, 63647, 149452, 162572, 330719, 433521, 255287, 132500, 54081, 37706, 168241, 403574, 105182, -258614, -43972, -47279, -34873, 68666, 184536, 213077, 216114, -6497, 17956, -35955, -484, -68209, -137086, -36565, 35516, 89312, 158431, -26410, -150807, -217124, -212125, -191705, -138299, 97392, 225660, 235976, 49865, 6625, -84002, 66459, 173734, 275230, 294227, 177517, 3939, -93007, -68576, 142364, 438116, 366331, 94565, 120913, 90646, 161273, 166690, 22186, -26587, 241580, 292982, 48443, -126343, 103982, 168307, 121574, -69733, -35842, -192506, -591123, -558867, -424683, -245541, -120977, -83102, -167799, -305139, -192251, -90376, -41525, 34119]
15559C4119n3036N0347J38903J23116J13029j70324m06903l39572J13800J97058
15549a99463N2082J4921j4946J78747J69014q0652j85279j05654N9480M4427j683
15538f9006J43250j8514n7394j70931Q2120P6459J71526q0732k74631j5611k23780
15527d37244o9037n7460L9319L02953J77637j08613j28972J63322J66063k6486
15517B1482P5990J44439k4100o8516q4136J03778r1069O742J49545K3088n0189
15506B07054j16839L6270m6551L79852J36954J1364J8613l50454n01062Q5954
15496a38845J10833N9536m7880j75153j98908J5666K69504J53293N8830J85867
15486B92743j58550J5536K07145J1146l24466k51936K80206K72579j67220r8212
$$ y = [34119, -18917, 31430, 170333, 293449, 406478, 236154, -170749, -510321, -396521, -199463, -147381, -132460, -147406, 31341, 200355, 119703, -65576, -171230, -111750, -67323, -69006, 74244, 55730, -1664, -172595, -90475, -14016, 157510, 76778, -197853, -213464, -437244, -506281, -563741, -524422, -221469, -43832, -152445, -281417, -118095, 47968, 21482, 97472, 241911, 217811, 149295, 65159, 168937, 77868, 84610, 234155, 257243, 207054, 90215, 126485, 79934, 459786, 596740, 608104, 626717, 276263, -224799, -138845, -28012, 31524, -16356, -191509, -390417, -374751, -105247, 48046, 106876, 292743, 134193, 149729, 356874, 368020, 43554, -208382, 71824, 344403, 177183, 78971]
15476G8971M5389n2385J39155M2069j5182j26511j0725q8728k45204k7634p8403
15465c39188K22012L38205P6129j09153l7552k9094l900q5204j37363j31707J96794
15454d0021P390N6204J04234L4123m7908K420J3329J28387j05799q7774q6995
15443b2410j50618J15478j40574N1345L19176J36229l2369n9945j18498j48585
15433e0771l98693J80365l0805N6279M5337J84761R9386j15236q3077n7004j81262
15422c50720L488J00087O2320K21029K33551k3818J763J18756j48434l72314J57191
15411B899m1428L3950K62382p3211j62780q1464J6222J29041J25502j48872L2503
15400I4744J36728J33487k27816k35601J23452k02140j81030j18855L3646O4248
$$ y = [78971, 124360, 71975, 211130, 253199, 238017, 111506, 100781, 12053, -233151, -260785, -339188, -117176, 221029, 297158, 188005, 150453, 121359, 117459, 32255, -105108, -236815, -40021, -32631, 23573, 127807, 161930, 114022, 116442, 129771, 258158, 152359, 64585, -22410, -173028, -57550, -198124, -146779, 172397, 308626, 276257, 216312, 97814, -50771, -449464, -269099, -299904, -243625, -198288, -13527, 85859, -29377, -112454, -169458, -350720, -347232, -247145, -184825, 36204, 269755, 245937, 247700, 366456, 218022, -154292, 2899, -38529, -4579, 257803, 184592, 21812, -59652, -43430, 85611, 211113, 62241, 94744, 231472, 364959, 137143, -98458, 24994, -177146, -358176, -477031, -443385, -379137]
15390c79137Q2883J1000J52279l8278j36889k770q6718j31325N7038M1356l9440
15379d70001L3480O1933o8868q9623K76835L37286j55291k1769Q1080j25951J31999
15368h890J78333O6518n3279j09968l9637l48333p0420O5482q3834J20407J07967
15357a75654M9446J61403J49473l28365j21808K40970K89521J30402P1265J6635
15347D83288j22099k39801j85775j38784J2358J2503k6644J31808N3330J50966
15337A31150J95322K46812m5487j51835k25558p5930O2524K32854j99082m24414
15327b53644j36458K84402o892o0414N4169N0586n0178O2166O4518o8598M362
15316e5981j0412K29120J3131j15120n2426K58812J88854r5495j76991L43847
$$ y = [-379137, -296254, -285254, -132975, -171253, -308142, -310912, -397630, -528955, -471917, -430561, -470001, -436521, -374588, -443456, -533079, -256244, 81042, -74249, -96018, -14938, -140889, -8890, 169443, 235961, 182682, 72714, 33077, -315256, -385676, -320194, -404028, -283621, -175654, -126208, 35195, 184668, -143697, -265505, -24535, 264986, 395388, 466653, 483288, 361189, 121388, -64387, -203171, -190813, -178310, -204954, -73146, -19816, 131150, 326472, 573284, 527797, 375962, 150404, 74474, 136998, 369852, 170770, -253644, -390102, -105700, -112592, -173006, -118837, -68251, -118429, -56263, 8255, -60343, -55981, -66393, 162727, 175858, 60738, 8312, 267124, 455978, 360483, 183492, 527339]
15306E27339j47265j96210j47483j53106J03176P9926P761n5887J05939K5905
15296A50095k76261r6033M181O0854J30489O2668l8565N4604n6791j77041L1742
15285a50058K7844j50664j33259J2951K01994K26846K44842N91n7396j27777j65090
15274f9176j41582r8117J96613L0991K2837j39342k06104N1053L32000J36621
15264A15794J52756K4558J22976M1768k93966J430o4274L417m2798m0220N5301
15253G6742J80427j18425j98813P3771N8344o5558n7650L6535J91248L6080K8055
15242B40756k68591l5923N9007K07957N5264n6580J14357r7352l01340j50796
15232b33241J67426M4219K3982k1818K0961k52319M3853O0771Q8117K34091N1262
$$ y = [527339, 380074, 183864, 36381, -116725, -13549, 66377, 74138, 18251, 124190, 150095, -126166, -222199, -218018, -157164, -26675, 35993, -2572, 52032, -4759, -181800, -150058, -122214, -272878, -406137, -393186, -191192, 35654, 280496, 281087, 223691, 95914, -69176, -210758, -308875, -112262, -81271, -58434, -197776, -403880, -352827, -20827, 115794, 268550, 293108, 416084, 457852, 163886, 165316, 101042, 104459, 61661, 21441, 76742, 257169, 138744, -60069, 13702, 72046, 6488, -51162, -14627, 176621, 212701, 240756, -27835, -63758, -4751, 203206, 258470, 201890, 316247, 218895, -82445, -233241, -65815, -21596, 2386, -19432, 1529, -250790, -206937, -146166, -58049, 176042, 227304]
15221B27304j69642o7700L18002r6883O2290j66270j38432J68521j2137j35523
15211a0470k37510k963L00416J41101J32346r411j40404p7655N9152l4173o6308
15200E4121p5467j04106P6277J95246R074l20020l96370N6225K75010m8860n9148
15189c38018p0889J34525K51953L35021L1312j39126j45773O273j74739k99089
15179d08550j2822K0413M9861L15309M6833j23580k21891J59136K37057j8957
15169D2809r5796m6874J85561K59804l6838k47351j35094P8135p1483J32238L0872
15158I5983j11857K02086J54164k3363j52287k89836L2490J23177j54523N1648
15148g2318Q6559P8653K3167j27927N3735j42594j29829m0151O3673K6757j20690
$$ y = [227304, 57662, -10038, 307964, 211081, 273371, 107101, -31331, 137190, 125053, -10470, -247980, -250943, 49473, 190574, 322920, 313509, 173105, 95450, 154602, 120429, 54121, -21346, -125452, -49175, 146071, 155145, -164875, -561245, -505020, -230010, -278870, -338018, -408907, -274382, -22429, 312592, 343904, 204778, 59005, 65278, -109461, -408550, -421372, -400959, -351098, -35789, 11044, -112536, -334427, -175291, 61766, 42809, -52987, -99861, 85700, 345504, 308666, 61315, -73779, 4356, -67127, 65111, 95983, -15874, 186212, 340376, 317013, 164726, -125110, -92620, 30557, -123966, -72318, 14241, 92894, 116061, -11866, 41869, -100725, -230554, -270705, -207032, -180275, -300965]
15137c00965j8292k8172j03062J15003M2671L16106M08639j39583k25545q5041
15127a8241j85525L1736J77542m7183J83596j45399o6174m3012l58531Q6557L62162
15116b2472R7083m4507j18306R5556J35937J26781j72771j57733M2087Q6627M1608
15105A09890K9871j90789j58637Q4873J79695j6262k2952l20066l7591J34992
15095b06976k12779L2850L53601J76794j23566k48176o5705L78383K24751L0180
15085C39357J06045m56071k03346J90859R9090R4734O3285J74127r9004j30244
15075A78832n26k08941p829l4446m5055J86327L07566j21855j45105L7537j72824
15064b6319r9274o018n5918L816J54475K07093q8982m5293R4342j24032j01557
$$ y = [-300965, -319257, -347429, -450491, -335488, -292817, 23289, 431928, 292345, 66800, -18241, -203766, -172030, 5512, -41671, 141925, -3474, -69648, -112660, -471191, -384634, -22472, 74611, 30104, -88202, 7354, 143291, 270072, 97301, -60432, -18345, 68282, 109890, 139761, -51028, -209665, -124792, 54903, 38641, 15689, -304377, -341968, -206976, -419755, -386905, -33304, 143490, 19924, -228252, -293957, 84426, 309177, 339357, 445402, -10669, -214015, -23156, 75934, 170668, 233953, 408080, 309076, 178832, 178306, -30635, -38464, -72910, -117965, 68362, 375928, 254073, 108968, 146505, -26319, -125593, -131611, -187529, -183713, -29238, 177855, 88873, 43580, 137922, 13890, -87667]
15053h7667j83856R2641J21250J54055M3341J72174R2638j33543J973J7695j26618
15042A64083J32243J93179J89367o6740k73020j97411J98074k7163q5846N3779
15032B80545q9849q6278K63663K7302K1811j0798O6790L3368j12635j46733J03501
15021C50687J83886k43317j05186r8188m0034K83439L2617M9507Q976j33879O6430
15010C54938l7950j15313k24974j46075R9286L9697R0169l3375J17231j43122
15000E12j02298J211m4280p6993J89583M8704o2153j72832k61924o7615j00476
14989f48561J47916J98099K86602J84328Q5810j41239j52992L03685n4397j68160
14979D1091j12628k05708J57524K03443p9724j08140J36780J07143P798j48442
$$ y = [-87667, -271523, -178882, -57632, 96423, 139764, 311938, 404576, 271033, 273006, 290701, 164083, 296326, 489505, 678872, 612132, 339112, 141701, 339775, 312612, 226766, 280545, 190696, 104418, 368081, 395383, 417194, 406396, 473186, 506554, 393919, 247186, 350687, 534573, 291256, 186070, 87882, 47848, 331287, 363904, 413411, 422387, 288508, 354938, 316988, 201675, -23299, -169374, -70088, -30391, 59778, 26403, 143634, 512, -101786, -100575, -144855, -221848, -32265, 16439, -45714, -218546, -480470, -548085, -648561, -500645, -302546, -15944, 168384, 254194, 112955, -40037, 263648, 209251, 41091, -71537, -277245, -119721, 83722, 3998, -104142, 32638, 139781, 147579, -863]
14969h63j87709J27345J77246l6902j29264k32715J64685K37932M0146k62942
14959a03041k21707J16326J4499N9408M3092J81245J33997m7907L9534j92J30861
14948C46115j81500m9675J48107n329q1130k87778j02574N7282N8825q4007j20033
14937c01697l14119R8778L43017L58642n4381J56029Q8247k23834l0943L03747
14927D23486j40289q6952o4295j01047J2724j12437M2735L02512j07593J69406
14917C38250J15001j4523J7901j80329j26631j30394j18823Q7109J6674o5947
14907f1712j92929j78919J90727K34438P0433j80606j78645N5715o760O8700K30873
14896E1315J22641N7280m0810j19444r7234J14433L25224p982k66651j6024J59202
$$ y = [-863, -188572, -61227, 116019, 79117, -50147, -282862, -118177, 119755, 159901, -103041, -324748, -208422, -193923, -134515, -91423, 89822, 223819, 175912, 215446, 215254, 346115, 164615, 114940, 263047, 257718, 176588, -111190, -213764, -156482, -97657, -181664, -301697, -615816, -517038, -174021, 184621, 130240, 286269, 374516, 150682, 119739, 423486, 283197, 196245, 131950, 30903, 43627, -68810, -26075, 276437, 168844, 338250, 453251, 438728, 456629, 276300, 149669, 19275, -99548, -12439, 4235, -61712, -254641, -433560, -242833, -8395, 62038, -118568, -297213, -241498, -248258, -179558, 51315, 173956, 231236, 190426, 70982, -26252, 88181, 413405, 405423, 138772, 122748, 281950]
14885B81950J34386M4045O8532j78341k84615k86760P970M4105L8083J45191P9825
14874I4371P739j04930o500Q3954j65458l02343J88241J92249L3258p562K4250
14863C7269n7238m9340J32364j0534O8998J73068J03872j29861k74042J27514
14853A22070J57703J4702Q9460O3060k089k55964R9269K20315k19107j41060j62376
14842a4017K4091J34092Q3295m7589p7025l7767L13293K14605j46891j9674j35081
14831B91332j35619P6184l5251q4300J53929J42379o7652l96263J40258K08640
14821B93637q7383k02848k42008J62788K89978O9139o6601k3580k08276j15572
14811a30726j34995n5353k02044Q07L04040K83245J26231J00052j26378j80880
$$ y = [281950, 416336, 460381, 528913, 350572, 65957, -220803, -212833, -168728, -130645, 14546, 94371, 102110, -2820, -9320, 74634, -90824, -393167, -204926, -12677, 20581, 13019, 37269, -19969, -69309, 63055, 52521, 121519, 294587, 398459, 268598, -5444, 122070, 279773, 294475, 383935, 446995, 444906, 188942, 288211, 508526, 289419, 148359, -14017, 10074, 144166, 227461, 179872, 102847, 65080, 378373, 592978, 446087, 426413, 291332, 155713, 231897, 196646, 112346, 266275, 408654, 341002, -55261, 84997, 293637, 206254, 3406, -238602, -75814, 214164, 283303, 216702, 193122, -15154, -130726, -265721, -321074, -523118, -522311, -218271, 64974, 191205, 291257, 164879, -16001]
14801a6001j95762j007J12365j2492l1608q576J32394J87944j17609k98706M2028
14790b07030Q7566J82529j10509L2973J78637p3713k7732L09677J05300J60047
14780F37745J6406l32524K4883n0003J14219L8373j67939J44703q8789l36011
14770A063J40416J46178j0204j06673L0818p8874k83916r624J62744P7535o6618
14759B845j46354Q13N9141Q6108M131k7311o9562p7313J4942N7065R7768K04221
14747B06494M4408k3942j09461p4938J49003J18620J57507l00261l58450J85991
14737e029J72389n8436J5557j7266l2820q9545M6410j20462j23288J46690J90751
14726A24951J44757J3754k0840j09409M632j80194O099J38800J9935p2564r8913
$$ y = [-16001, -211763, -212770, -100405, -112897, -144505, -153081, -20687, 167257, 49648, -249058, -207030, -119464, 63065, -47444, -14471, 164166, 90453, 62721, 372398, 477698, 637745, 654151, 321627, 346510, 296507, 410726, 449099, 281160, 425863, 337074, 1063, 141479, 287657, 277453, 170780, 201598, 122724, -161192, -170816, -8072, 69463, 2845, -143509, -142696, -83555, 2553, 6684, -20627, -90189, -167502, -152560, -95495, 2273, 206494, 250902, 226960, 117499, 42561, 191564, 310184, 467691, 167430, -191020, -5029, 167360, 108924, 124481, 107215, 74395, -15150, 31260, -89202, -212490, -65800, 124951, 269708, 283462, 262622, 153213, 157845, -22349, -16250, 122550, 142485, 69921, -28992]
14715b8992K61781J08576j54519r1571j7763j8382k84634k5018J68761j4939J15050
14704A8350n2577J21770j49189J67382J20117Q1603j29387l13622M3243l9540
14694a31850k34837J36162P4371Q5214J47681j1743K7202M5854J0432j32555l58643
14683c42712o1281q4282M0622K36453Q8462J89431k3609J61796j9160j24797J64309
14672B25232J44077j89918k73889R1779R1724M02721Q6152j47986j82052k63330
14662a5490J25487J15117j23955l08907J7235K0197n2363q6089M04151R5819k46616
14651e5414k87409m8010M1452L44987k34j14852K0508k25334r5503J9199K43548
14640a57062K63032n5399j41324m7111k275K37126J06047Q043O5827L6508k34178
$$ y = [-28992, 232789, 341365, 186846, 95275, 77512, 59130, -225504, -250522, -81761, -96700, 18350, -34227, 87543, -61646, 105736, 225853, 307456, 178069, -135553, -92310, -131850, -366687, -230525, -156154, -70940, 76741, 64998, 92200, 138054, 148486, 15931, -342712, -403993, -488275, -447653, -211200, -122738, 66693, 43084, 204880, 185720, 60923, 225232, 369309, 179391, -94498, -2719, 89005, 491726, 577878, 429892, 247840, -15490, 109997, 225114, 101159, -207748, -190513, -170316, -222679, -308768, 95383, 191202, -55414, -342823, -390833, -349381, -4394, -4628, -119480, -98972, -324306, -419809, -400610, -157062, 105970, 50571, -90753, -137864, -140139, 96987, 203034, 211077, 276904, 313412, 79234]
14629G9234L1402J71722J04640J75628j30657j63378k80062o9826p0623q3356
14619b35276J57853N1338K0677K11133k6383j52748J72844j52412o9794J14044
14609I1276J00329M3500j95719k93584Q3622O117q2252M4936o4988J97722J20507
14598E1466k13024k09143j19671M4788R9753k066Q8184J31512k3189j25261M0535
14587b36116J00104J58032J70997k5018n6880o9151j57080q8472J34027K5081
14577d4476j39441j72046K54442K1683l09713K37175K95353R1323n3578M7496
14567B28218j74441n1240P4248j91777J33943l0120J23262L4551n6991k17779
14557a28126p1270j43837j7830j26383q0903J10391K56588J46242P3330M1476
$$ y = [79234, 110636, 282358, 386998, 562626, 431969, 268591, -11471, -81297, -151920, -235276, -77423, -26085, -5408, 205725, 179342, 26594, 199438, 47026, -22768, 91276, 191605, 235105, 39386, -254198, -170576, -164459, -246711, -201775, -266763, -69041, 51466, -161558, -370701, -490372, -445584, -345831, -347897, -259713, -128201, -151390, -276651, -236116, -136012, 22020, 193017, 167999, 111119, 41968, -115112, -203584, -69557, -44476, -183917, -355963, -101521, -79838, -389551, -152376, 142977, 234300, 180722, 228218, 53777, 2537, 76785, -114992, 18951, -11169, 112093, 146644, 89653, -128126, -199396, -343233, -361063, -487446, -568349, -457958, -201370, -55128, 18202, 59678]
14547E9678j18254O76Q0868j43247J65286L3333m4000q6194L0309Q5226J297j59222
14535i4244J51548m670J4422J15206j98596j80107O6938K70542k83429q0263N1543
14524a71110m1313j60845k16210J49138J60794L6164n1572N9375O1480P5524q5423
14513a83998k15928L24196K68564J54086k6056k23223r5721o568j8653k34119
14503b57420Q2740j57048k88254J941J00822R2384K23604J99269Q2795J25284
14493B06117n4488l6728k01636l7038p8849p3258J08612J20961j35431N5299r4951
14482b21390k16194J09278K50522r0313o3012L14129J31787k05785k49128k1486
14472b61592L50746J74767K8701m6385P289K994p0359l94474l2733J56359o165
$$ y = [59678, -58576, -57900, 22968, -120279, 45007, 78340, 34340, -51854, -21545, 63681, 64978, -94244, 57304, 52634, 67056, 182262, -16334, -196441, -129503, 141039, -142390, -222653, -171110, -212423, -373268, -589478, -440340, -279546, -243382, -294954, -235579, -174099, -98575, -183998, -399926, -75730, 192834, 346920, 320864, 97641, 1920, -4648, -23301, -257420, -174680, -331728, -619982, -618041, -517219, -424835, -201231, -1962, 80833, 206117, 151629, 114901, -86735, -123773, -202622, -275880, -167268, -46307, -181738, -126439, -221390, -437584, -328306, -77784, -168097, -231109, 83020, 214807, 9022, -240106, -261592, 89154, 263921, 292622, 246237, 253526, 256520, 186161, -208313, -241046, -84687, -90852]
14461i0852K6253J25842N5747j8167j10504j99833r712K43875P5996k91864o4368
14450b57587R9464O2989K2070K330M21747K08323l26301j24690M0851J088p1182
14439G9102L0035K10961J74740q1724J06529R5130l16567j26270N0790l7274L9489
14428B24941Q9197K31211J42059k64833k15912j47129j22504j19494n3709J07315
14418a28858k5016J27999J64797N6936k63956j14235q4760j530p2542l36164k9931
14407g07260J46509L14453l1473J05202J17419k84343k36573J56545K46320J74675
14397A474j65555K4742n6710J42586K05462m0743k51943o5144L28045J76781q307
14386B90688p3307k71994k80696K11343K67303j34812q4892J13420Q2909M6482
$$ y = [-90852, -64599, 61243, 116990, 98823, -11681, -211514, -221226, 22649, 98645, -193219, -257587, -158123, -95134, -73064, -70734, 351013, 559336, 233035, 108345, 149196, 150284, 79102, 109137, 320098, 494838, 413114, 519643, 614773, 298206, 171936, 222726, 185452, 224941, 314138, 545349, 687408, 422575, 206663, 59534, -62970, -182464, -236173, -128858, -153874, -25875, 138922, 195858, -68098, -182333, -267093, -268623, -341165, -677329, -707260, -560751, -246298, -277771, -172569, -55150, -339493, -576066, -419521, -173201, 1474, -164081, -139339, -196049, -53463, 151999, 111256, -140687, -205831, 122214, 298995, 290688, 217381, -54613, -335309, -123966, 143337, 8525, -76367, 37053, 119962, 166444]
14376A66444q8541L2512j41601L0987M2905k78363k41491O4238j248P0324J93313
14365a50521j58961q24N9412K42505P5896K9626j10301l55K19098j63567K1090
14354F3098k9796l56166N2372K0644J89345j31886j89760J48652K14643p8886
14344i7740k64160L49525J43101j45266j52274k3727K5394K60092K17983J90851
14334E03779k6405l26132l01786m01919N5214J79859J72706L5032o6326j02249
14324b78227R4611K30774J13557l5642n4364r2210k63828N3737J80870K1967m2498
14313g1253l2007L35831O1605j59748K3218n4361k5431j4119k26251j24240J29474
14302a57282j02211j02347k544K32625J67021J04497J44502K1931P4754m7965
$$ y = [166444, 77903, 110415, -31186, -199, 42706, -235657, -477148, -412910, -414158, -343834, -150521, -309482, -310306, -250894, -8389, 67507, 97133, -13168, -13523, 205575, 42008, 63098, 33302, -322864, -270492, -249848, -60503, -192389, -382149, -233497, -18854, -97740, -361900, -12375, 130726, -14540, -166814, -190541, -165147, 94945, 312928, 503779, 477374, 151242, -150544, -552463, -497249, -317390, -144684, -109652, -175978, -278227, -183616, 47158, 160715, 125073, 70709, -21501, -285329, -231592, -50722, -28755, -71253, -103260, 232571, 294176, 134428, 157646, 103285, 77854, 63735, -162516, -286756, -157282, -259493, -361840, -364384, -131759, 35262, 139759, 284261, 306192, 380946, 332981]
14292C32981j44595j69300j85753j09129K70252K80575p3489j54034L664J10963
14282A62135j06236m5052r2278Q5460K72829K09036J5868j64768J00715k1902
14272D15807j3075j97255q2095J74672O3164k23703k75882l9540J7391J71097
14262A0581M4999o5637q6356Q0994K20742j38708j49063R1389O1170j02429n1105
14251h3423K44142J18483o7321K53762N7724q4076k00164k69654J76616q8648
14241E7441j40889N1090K94139o4346k14799J45754k43642j90364J11890J73483
14231b0243M09780r9432l09017p6108L14433Q5748K9800j87630k15420J4712K9214
14220b4163K04692l7566j28189J14652k3404J1459j04432q5885k38135O6239L37510
$$ y = [332981, 188386, 19086, -166667, -275796, -5544, 275031, 201542, 47508, 51172, 162135, 55899, 10847, -81431, 4029, 276858, 485894, 501762, 336994, 437709, 415807, 402732, 205477, 123382, 298054, 361218, 137515, -138367, -177907, -160516, 10581, 55580, -10057, -96413, -15419, 205323, 66615, -82448, 8941, 70111, -32318, -83423, 160719, 279202, 211881, 465643, 523367, 439291, 239127, -30527, 146089, 57441, -83448, -32358, 261781, 197435, -17364, 128390, -115252, -305616, -193726, -20243, 389537, 290105, -18912, -95020, 219413, 305161, 334961, 147331, -68089, -53377, -24163, 180529, 142963, 14774, 129426, 106022, 117481, 13049, -72836, -310971, -244732, 92778]
14209I2778q3011k43600L6070J36305J77751r69M8862L69473J30099j15134j78585
14198C70039n9570R3593j73735j64725p9210K10804J09830m2097p4270J62820
14188C53479r6409k3787j96040j13481J7926K62829K84914J8976k78846j24965
14178A04596j52346k5179L70195p2407k1762m7784O5594J8957l58198J79068J30222
14167A90956o547P0251L8442m885K2825o756j70928k8876K7902L2125r4746r8879
14155b9116J27895M51389l5008j69950m9077j26812L1060n4741J23717J0182j24226
14144A55313q0664j49411J17356J85091Q6401j04351j52875r4810j29416M0495
14134a26871M7815j84531K88167J6535r6445M1789j15194k69691J97541K61996
$$ y = [92778, 9767, -233833, -197763, -61458, 116293, 115324, 164186, 533659, 663758, 548624, 370039, 310469, 404062, 230327, 65602, -13608, 197196, 307026, 264929, 190659, 353479, 257070, 233283, 37243, -76238, -58312, 204517, 489431, 508407, 229561, 104596, -47750, -72929, 297266, 224859, 203097, 155313, 220907, 239864, -118334, 60734, 190956, 184409, 254660, 293102, 288217, 311042, 304286, 133358, 104482, 132384, 164509, 69763, -29116, 98779, 550168, 515160, 345210, 296133, 169321, 200381, 145640, 269357, 279539, 155313, 74649, -74762, 42594, 227685, 314086, 209735, 56860, -37950, -167366, -126871, -79056, -263587, 24580, 41115, -55330, -13541, -128735, -398426, -200885, 61111]
14124F1111J87554O209p1902O8549J1823r4125L3284O3168k53636q2630k5962
14113i6557n0741J28790o383J84974l8613j43849r8620L18724j69056o4432J02503
14102F6740j63619j31596n0449K80070K18026O7690O1693L0134j94531j67377
14092A6781l72264O5160L79973P6364m4967j75686J4510l0027r7639J4317J07628
14081d5850K68643K8423j43156k55319J2819N2921j31354M6244o8566j7300O1346
14070a91149M3257J3507j98025n0094L57509K68868k2400j70706p4779J90843
14060A66831J9870L52722m4350k16239j85808r8012N2734P5842k7094J15401M31488
14049F43385r1116j77197R9847j89738j29028k84579l0109J35993J61264k6763
$$ y = [61111, 248665, 254874, 182972, 251521, 263344, 169219, 202503, 265671, 12035, -70595, -96557, -147298, -18508, -24891, 160083, 121470, -22379, -120999, 197725, 28669, -35763, 66740, -96879, -228475, -278924, 1146, 219172, 286862, 348555, 378689, 184158, 16781, -355483, -290323, 89650, 166014, 121047, -54639, -40129, -70156, -167795, -153478, -45850, 222793, 251216, 108060, -147259, -134440, -81519, -212873, -166629, -235195, -252495, -191149, -147892, -134385, -332410, -382504, -24995, 243873, 221473, 50767, -24012, 166831, 186701, 539423, 495073, 278834, 93026, -4986, 47748, 123590, 96496, 211897, 643385, 552269, 375072, 474919, 285181, 156153, -128426, -158535, -22542, 138722, 111959]
14039A11959J6605L5212P7939K58992Q8767n0692j76585l19374p8519L1540J8919
14028A4763j39526l33329k8152K15257l8430L40648J59200l6305K28303O2089
14018D44518j85748O6825l8500j5315m4110j31341J82421J17382p3386j07091
14008B15655N8655J8875J14636j24429O3175J36351j41402k91728P8318j55689
13998b7583o5668J81096J83631j9294J0251q406j19627j82008j17737K88960K84431
13987D08046J88716j58876k0743m9702q6072j14492K17758J9138j05294K01848
13977E00327o0139j3310N0116k93491k20458L1162L02087R0182k35141k81330
13967a29995K6457J65572J53629k8133K9730k02204l8067J24876K60297n7163
$$ y = [111959, 128564, 163776, 241715, 500707, 589474, 538782, 362197, 42823, -35696, -4156, 14763, -124763, -458092, -486244, -270987, -309417, 31231, 190431, 154126, 382429, 444518, 258770, 325595, 287095, 271780, 227670, 96329, 278750, 396132, 322746, 215655, 274310, 293185, 407821, 283392, 346567, 482918, 341516, 49788, 128106, -27583, -93251, 87845, 271476, 252182, 262433, 254027, 134400, -47608, -165345, 123615, 408046, 596762, 437886, 417143, 367441, 281369, 166877, 384635, 403773, 298479, 500327, 440188, 426878, 476994, 183503, -36955, -5793, 296294, 386476, 151335, -129995, -103538, 62034, 215663, 187530, 217260, 15056, -23011, 101865, 362162, 304999]
13957C04999p8121m9566j10767J08130J14459O3950p9634j34185o4440P3565K63716
13946D12106K91875Q0622k7859k75890m06551P257M3729j49458M845O8384M6676
13935I5736P6905j48146M6449K55432J25816j42122r2576O7234O7874J35303N5723
13924E43628j99931j90138m0225q4971P6919j37045j06062M1797Q9329k32363
13914b39062Q2309l286L43823K45573j69781m90616N9597M4631n3306j51465K96790
13903c4793J18010j13172J71796K08750k85618o0636m2943L4514k3801n597J71086
13892A37596Q0711k23997J31793L48656O1718l15966p4505L2612n5389r4420j59332
13881a30523m0769J15185J17249M2213j91473M2877j0825k88741L5877j1782j39322
$$ y = [304999, 226878, 177312, 66545, 174675, 289134, 353084, 273450, 139265, 74825, 148390, 412106, 703981, 784603, 756744, 480854, 74303, 81560, 125289, -24169, -19324, 49060, 95736, 172641, 24495, 70944, 326376, 452192, 310070, 217494, 284728, 352602, 487905, 543628, 343697, 153559, 113334, 28363, 105282, -31763, -137825, -96028, -6699, -239062, -156753, -160039, 183784, 429357, 259576, -231040, -171443, -126812, -180118, -331583, -34793, 83217, -29955, 141841, 350591, 64973, 4337, -38606, -4092, -27893, -33490, 137596, 218307, -5690, 126103, 474759, 536477, 220511, 146006, 178618, 123229, 28809, -130523, -171292, -56107, 61142, 103355, -88118, -45241, -56066, -344807, -308930, -320712, -460034]
13870d60034J81870Q1862J36592j35330O7267K39599J2924k95996k5303R1127
13860a05422K7792o7094j7368J90677M9328O8423L7730j03799j09824K6559J27591
13849A24593q3440j10958q9679j53237k2807K10964J02432j12742J16052J13996
13839I5174l38994J0262J78069J42665k1840j27809J5750L09895k9993q9596J36502
13828B80085P6498j15680m0460k1672K79597M8331k24613p7466j67664O3131J55493
13817B55580p5922k47289j44950J72045m9816n9834m4292M707m8834K12835J00989
13806G5219J63467o8181k88649N4286J18019J49635p217n8390L9244j48499O3184
13795I2118N2499o1924j76229j08785n1241N7302K18647P6131j33241O2874j90267
$$ y = [-460034, -278164, -196302, -59710, -195040, -127773, 111826, 124750, -171246, -196549, -105422, -77630, -144724, -162092, 28585, 77913, 146336, 184066, 80267, -29557, -2998, 124593, 41153, -69805, -159484, -312721, -335528, -124564, -22132, -134874, -18822, 95174, -243820, -233558, -55489, 87176, 65336, -62473, -46723, 263172, 233179, 143583, 280085, 356583, 240903, 200443, 178771, 458368, 506699, 282086, 204620, 36956, 100087, 255580, 179658, -67631, -212581, -40536, -90352, -150186, -194478, -189771, -238605, -25770, 75219, 238686, 170505, -118144, -63858, 54161, 203796, 196579, 138189, 177433, 28934, 92118, 144617, 82693, -93536, -202321, -253562, -196260, 22387, 98518, -34723, 28151, -162116]
13784a62116j26338J08410n0566K34305K11685j51985k4880J03624L0776M6597
13774B19512j6161n5443j3566J10779J04980N2879o69J96201j94056j59953l46992
13763a02489r2940P597O4480J59894q071j76851J84638J79762j40312m1097M5662
13752H0273M7478J71364K8589j40492P5767m7702j73919J05863j51970O8185J13400
13741A76836m9084P1568q5774j9580J63677j4940O46k599k00277j19665J8720
13730f0472l1343O4539L44558K15528K7663j31432k2647j29269J02773j42555
13720B37343r0277j37743j34869m6989P6250J51552l1641J54038Q1413m4513M657
13709B19221j52478k02683j262R1783j80228K12174J46878J38080j30235q4191
$$ y = [-162116, -288454, -180044, -230610, 3695, 215380, 63395, 38515, 142139, 172915, 219512, 203351, 147908, 134342, 245121, 350101, 402980, 402311, 598512, 404456, 244503, -102489, -195429, -187832, -123352, 36542, 28471, -148380, 36258, 216020, 75708, 34611, 80273, 127751, 299115, 327704, 187212, 262979, 215277, 41358, 147221, -4749, 63436, 176836, 127752, 199320, 113546, 93966, 257643, 242703, 243349, 240750, 40473, -79192, -60472, -91815, -27276, 317282, 532810, 560473, 429041, 406394, 277125, 379898, 237343, 147066, 9323, -125546, -172535, -96285, 55267, 23626, 177664, 259077, 214564, 219221, 66743, -135940, -137202, -45419, -225647, -13473, 133405, 271485, 141250, 57059]
13699E7059L27360O7814K0508k81250j13288j42256q794J33227J62743j18115
13689A05008p8583J1413j13489r652J65624J09266K1076j907J5544J915J38665
13678C64880K9968M4421j59344j44506J78384O8974j74162j39919K38105J51009
13668D57810q9081j7629K8050l0912k18923n4142J16788j02041K21757R67k18948
13657I3696j77858J1819j56451n7842J56680R1210J44596j5028J39903j74644
13647E6081l38296l1509K78825M4517j26949m5916K0105Q4560K58095J55270k52360
13636A02423j18345n2037m1149J68091J1008j9750J34172J866l1573J07192j41718
13625A20180j42548J74571J80298N6949J15906q3175j57541m46803o7771R430
$$ y = [57059, 384419, 452233, 472741, 191491, 78203, -64053, -72847, 60380, 223123, 105008, 26425, 37838, -75651, -85303, 80321, 189587, 210663, 208756, 224300, 226215, 364880, 394848, 439269, 279925, 135419, 313803, 382777, 208615, 68696, 306801, 457810, 368729, 351100, 379150, 348238, 129315, 75173, 191961, 89920, 311677, 312644, 93696, -84162, -72343, -228794, -286636, -129956, -38746, 105850, 90822, 230725, 56081, -282215, -313724, -34899, 9618, -117331, -163247, -143142, -58582, 199513, 354783, 102423, -15922, -67959, -109108, 58983, 69991, 50241, 184413, 186279, 154706, 261898, 120180, -22368, 152203, 332501, 389450, 505356, 422181, 264640, -182163, -249934, -240504]
13615b40504K7019K32158P7932R9509J66688N4365q5498k10950J20114J13181
13605C54014j29812m7076j32873M3808J22992p8605m3989p997k2118K46229k25280
13594G9293l8700M9239m7324j19208M8106K9045J72922o2941k85448j368K31364
13583E4980K10054J09343r0650j6022k04361j73798J09322L9439q1229r5048k01371
13572c39341M6504K14478J62017j4346K35198J52986M8199j9315m0870j29418
13562C16092k35367O7331J19357J12983k60080j17275J10922K58412J28549o5466
13552D35458k01994j40318L4410K4479M307M46951J89315k63027j56221k0670
13542C52690K49095n9872k42269k11166j46329K30249K42992l1090k15505o4444
$$ y = [-240504, -213485, 18673, 96605, 196114, 362802, 417167, 331669, 120719, 240833, 354014, 224202, 177126, 44253, 88061, 211053, 132448, 88459, 80462, 58344, 304573, 79293, 40593, 89832, 42508, -76700, -28594, 451, 173373, 110432, -175016, -176384, 54980, 265034, 374377, 283727, 267705, 63344, -110454, -1132, 38307, -42922, -137970, -339341, -292837, -78359, 83658, 69312, 304510, 457496, 505695, 486380, 445510, 316092, 80725, 148056, 267413, 380396, 120316, 3041, 113963, 372375, 500924, 435458, 233464, 93146, 127556, 152035, 156342, 603293, 792608, 529581, 373360, 352690, 601785, 541913, 299644, 88478, -57851, 172398, 415390, 384300, 168795, 104351]
13532A04351j30148J20880o3000p3108P8869K47603J58338J09743j0115J53777
13522F97190k51719j88092m9555o5463l423J3639J09303k75476k30496J98830
13512d5262K85923M7260K01407K11118p4048r2076j09188n4319j39485n9591n3541
13501A18198J16567K3097L183K18745P3886N4630k53277k58830j91400J69801
13491G4600K32612j67090J56785J65713J78243J26656k60575k7756j07820k32339
13481A39029M8039J7538j28161M529J38876p0815K3436j3510M2629P4042J69990
13470D45622j73206j77621j54196o0944j6032R0408j17407N6585m4111J73285
13460B2383R2912j78994o7284K55659M06827j02119l61069J61743J00470K9590
$$ y = [104351, -25797, 95083, 32083, -41025, 37844, 285447, 443785, 553528, 543413, 697190, 445471, 257379, 207824, 142361, 138938, 152577, 261880, -13596, -244092, -45262, 240661, 287921, 489328, 700446, 626398, 534322, 425134, 370815, 231330, 171739, 118198, 234765, 257862, 261045, 479790, 553676, 608306, 355029, 96199, -95201, 74600, 307212, 140122, 296907, 462620, 640863, 767519, 506944, 479188, 371368, 139029, 187068, 204606, 76445, 80974, 219850, 149035, 172471, 158961, 201590, 275632, 445622, 272416, 94795, -59401, -120345, -136377, -45969, -163376, -106791, -150902, 22383, 115295, -63699, -130983, 124676, 531503, 429384, 68315, 230058, 330528, 360118]
13450C60118j10396J9417j29293j99033P1656m4028l22738P841M6739L1432P0122
13439a98163K02046K86860K10415P3340k26174j39978p8836q204m0505K762J12653
13428A96216L1449l3875N1718J78073J24435j87652k87864J19631O7384J77364
13418D36879j6113j69104k1546k7577j16365K9426l4786q5997J12594q1394K07209
13407B33226K03627R590o8784k6371K1010m3863j04570J7976Q3074P6838k09347
13396A92406j74469j47379J25462J64661o8159m4822J6464q6404P9333J7084k5249
13385D8928j55210q7756P5492K28247K61284j519m3970k87227j19570p3633Q7883
13374f7051L6267M2116n9637K080j2213J77520K53075O5445j28021j21988Q4892
$$ y = [360118, 249722, 269139, 139846, -59187, 12469, -31559, -354297, -346456, -299717, -268285, -198163, 3883, 290743, 501158, 574498, 348324, 208346, 129510, 121306, 80801, 83563, 196216, 227665, 193790, 245508, 423581, 548016, 360364, 72500, 192131, 259515, 436879, 420766, 251662, 230116, 202539, 86174, 115600, 80814, -5183, 107411, 26017, 233226, 436853, 446443, 377659, 351288, 372298, 328435, 223865, 241841, 324915, 401753, 192406, 17937, -129442, -3980, 160681, 92522, 47700, 64164, -22240, 57093, 74177, 48928, -106282, -194038, -118546, 109701, 370985, 369466, 325496, 38269, -81301, -154934, -67051, -30784, 11332, -48305, -46225, -58438, 119082, 372157, 437602, 309581, 187593, 272485]
13363B72485J75360L11487j39198k01534k02814l72239L3962J17267k3100L8415
13353A0091R3260K45151O6676k93116n3937j9328O4524J20107n8115Q6906k13127
13342D9092j62504J63962J33930n7699p7709j17860k8642Q2003J79737k33004
13332f8694Q7336K39511N2622M0607j96977o1057r083k8034J19212r2448k57725
13321a74730J36757J70815P4294J26460R2889r8330K9811O4298Q4665k5507j99768
13310B81654R0118K25322k09254j56276J5638j6970j16569L0752r2348J47131
13300A99198J31510K05652J56822k05651j34564k6757J42726j90713L5482O0993
13290C74698K1834k16351L237R7661j9797J12189o1305j6779j6756J81927M0406
$$ y = [272485, 447845, 759332, 620134, 418600, 215786, -156453, -122491, -5224, -28324, 10091, 103351, 348502, 415178, 122062, 68125, 48797, 113321, 233428, 175313, 262219, 49092, -113412, 50550, 184480, 126781, 49072, -68788, -97430, -15427, 164310, -68694, 18642, 258153, 310775, 351382, 154405, 93348, 84265, 56231, 175443, 82995, -174730, -37973, 132842, 207136, 333596, 426485, 328155, 357966, 422264, 506929, 481422, 281654, 371772, 597094, 387840, 231564, 247202, 230232, 113663, 144415, 52067, 199198, 330708, 536360, 693182, 487531, 352967, 326210, 468936, 278223, 313705, 374698, 396532, 180181, 183418, 281079, 261282, 373471, 312166, 295387, 278631, 460558, 500964]
13279E00964j47725q9255J81498J23366p9966k05790o0594o4822j54123N103j50968
13268a42312j7480Q6899j79519p661J47808J66331K30079j00961J8651J55145
13258C56980J52574N4868r3182j49210k42637j6810K50892o7394j94505K75126
13248C26702L7847q9230j21630M05k73641K460L7491K02121J25798O2627j51495
13237A59455m6163N5605k20693j74834K52402M51997O0905j8884P0721N1271j91763
13226D50019m9499Q2447J32325P1482l38772k64934J01372Q7633J20247J2010
13216D04330J2633J79879L5272m3500n7679k25159J4736o3756j79631m6644L6466
13205F6947o0858K8873J59956J95637J2706j38760j53092J870J40380N4438l5383
$$ y = [500964, 353239, 263984, 445482, 568848, 488882, 283092, 222498, 157676, 3553, 8656, -142312, -159792, -72893, -252412, -260073, -112265, 54066, 284145, 183184, 201835, 356980, 509554, 564422, 471240, 322030, 79393, 62583, 313475, 246081, 51576, 326702, 364549, 275319, 153689, 154094, -119547, -117087, -79596, 122525, 248323, 310950, 159455, 113292, 168897, -51796, -226630, 25772, 477769, 538674, 519790, 590511, 641782, 450019, 400520, 482967, 615292, 686774, 348002, 83068, 184440, 272073, 392320, 404330, 416963, 596842, 632114, 588614, 530935, 305776, 320512, 256756, 77125, 30481, 66947, 6089, 34962, 194918, 390555, 403261, 264501, 111409, 113279, 253659, 308097, 272714]
13194B72714J34268L01214n5563l16188K7376j77470q8203O1428L237P4296K96
13183B37405J71116q2469n1783k145k89148P4813J56735J20057l2444J10738p965
13172D04910k94160M2776P8653j50885K05472K90102n1990p1617J34918O5137
13162F53316j97244O742P5901k58473m5121K6919J3839J96256p2332R6938K58206
13151G54947l92705j85071r4346K103k03509m3407O0314K58712L19845k2194j57017
13140B97672j92945j36623J80631K13037j57934j4221K8089K23721K42190n5721
13130F27896j44582k07208j52434N4039M4628R234M503J39076J02082k16436n9717
13119B01081o9436j76303J38059J07152j8867j56755R414m4635K82335J9373n2882
$$ y = [272714, 406982, 708196, 652633, 336445, 363821, 186351, 98148, 159576, 162813, 237109, 237405, 408521, 326052, 274269, 272124, -17024, 57789, 214524, 334581, 302137, 412875, 404910, 110750, 153526, 232179, 81294, 286766, 576868, 524878, 453261, 588179, 653316, 456072, 462814, 538715, 280242, 235121, 262040, 275879, 472135, 399803, 496741, 754947, 362242, 177171, 82825, 84928, -118581, -161988, -101674, 157038, 476883, 454689, 297672, 104727, -31896, 148735, 361772, 203838, 189617, 217706, 441427, 683617, 627896, 483314, 276106, 123672, 177711, 222339, 231573, 236076, 375152, 477234, 260798, 201081, 131645, -44658, 93401, 200553, 181686, 24931, 34345, -10290, 272045, 291418, 238536]
13108B38536q4932J60156Q0871r2266J59584q8758j94838j6310J30737J67125
13098D59905l0673k58200m475o6421j7594K48786R4485O7577K78834j95771j32667
13087D43786j44276j58497l8200N4440l926Q3079j76139O9349L16122P1067j25797
13076C91008J9670K48311L7130k69718k08059j75582M0962J94008N8663k21216
13066A15177j01455J82826J8938j59569n4959q0945j88833J82602M16679l7320
13056B93141J15762J64987K0153j73655n5749l6424j26524J09757j66833p9294
13046F5321o9906k1556J17713K37458n5339l2277l9503j9452m8341l0485Q866
13035A12499K24222j76515K02122Q8674o2648J7029r8604P917M4870J10673k681
$$ y = [238536, 153604, 313760, 394631, 302365, 461949, 373191, 178353, 162043, 292780, 459905, 429232, 171032, 166557, 100136, 82542, 331328, 425813, 493390, 772224, 576453, 443786, 299510, 141013, 102813, 157253, 153327, 236406, 60267, 129616, 445738, 516805, 391008, 410678, 658989, 696119, 426401, 218342, 42760, 83722, 277730, 336393, 115177, 13722, 196548, 215486, 55917, 958, -79987, -268820, -86218, 330461, 293141, 408903, 573890, 594043, 420388, 364639, 328215, 201691, 311448, 144615, 65321, -4585, -26141, 91572, 329030, 273691, 241414, 201911, 182459, 134118, 103633, 112499, 336721, 160206, 362328, 451002, 388354, 405383, 306779, 314696, 359566, 470239, 467558]
13024D67558L9318Q3022n776l9972k35839l01594j90463l7305j11961J82583J38693
13013a1736j84j9063J4772L37941L2031k05058J73005J90352j52128N3668q3740
13002C29860k41780K36037J99549j40946l1921L458R3104K2947j38603n0043P872
12991B89534k3928M0476K01586L7099j10482K67707j12061j91462j43025q0867
12981A74577j73600j34810K5020J84980J34638N5530q1815q4432J99391j2953
12971B86526k84002M6481O9334Q5001m1181j09432K3136J62268Q6630O1396R9557
12960D85714j61116Q6831J02201l01564j45474m9111k25117n0180J96793J52790
12950I1767L8689K55311p799j12293J66617J31605j14387k35491N0810R1202j08633
$$ y = [467558, 506876, 589898, 584122, 544150, 308311, 6717, -183746, -221051, -333012, -150429, -11736, -11920, -30983, -16211, 321730, 353761, 148703, 321708, 512060, 359932, 413600, 329860, 88080, 324117, 523666, 382720, 350799, 354257, 447361, 470308, 331705, 281662, 289534, 265606, 306082, 507668, 544767, 434285, 701992, 589931, 398469, 255444, 174577, 977, -133833, -108813, 76167, 210805, 266335, 184520, 100088, 299479, 286526, 2524, 49005, 118339, 203340, 162159, 52727, 75863, 238131, 324761, 386157, 485714, 324598, 411429, 513630, 212066, 66592, 17481, -207636, -257816, -61023, 91767, 130456, 385767, 377968, 265675, 432292, 563897, 449510, 214019, 264829, 356031, 247398]
12939B47398q1727R9259n4094k38133m1011J92380K41495j35406n4659J41807
12929C17309M7674J21200J41346q8021o6222J88627j98392N7883J07565K9098
12919F58067l89352r3648q8093k8791J34181J65040m4109J8306J90203j29549
12909C92255K0625J48432o4122j05693J11730K10182J68199n543n6056j86729
12899F33280k35654j80432k0147Q3267l47097k5888J17500j07823j38999K32580
12889A0587K35503J04218J06190J89065k27801l0682j01031J04690M4784J70965
12879F06488n0514l17056J04487R0032j51820o344m8392K3699K63437P3503j28498
12868D59022j55755r8041l4945M3833P7160m1624m0956j36791l7434J72192L61621
$$ y = [247398, 165671, 264930, 210836, -27297, -68308, 124072, 365567, 230161, 175502, 317309, 364983, 486183, 627529, 539508, 473286, 661913, 463521, 521404, 628969, 658067, 268715, 175067, 86974, 58183, 192364, 357404, 313295, 331601, 521804, 392255, 412880, 561312, 497190, 391497, 503227, 713409, 881608, 876065, 820009, 633280, 397626, 217194, 197047, 280314, -66783, -92671, 24829, -82994, -221993, 10587, 246090, 350308, 456498, 645563, 417762, 387080, 286049, 390739, 435523, 606488, 555974, 238918, 343405, 433437, 281617, 275273, 226881, 250580, 514017, 587520, 459022, 303267, 205226, 170281, 214114, 291274, 249650, 208694, 71903, 34469, 206661, 568282]
12857E68282p7044k46664k7731R6378P5565r5347j81918P9283K3453K27522j45491
12846B96288k02322M2672J46772N7724M042N0354K39293J42283p0121j64417L6149
12835E78717K40421J3351j77536j15586l41695j24465p4856J30544l3287P3964
12825A69572N0223N7733P857O470K98685Q9024k18346k17976K30029l4261j69163
12814B69847K2008K30981J33750j04422k65356p0472M6224J47221P7860m8896
12804D38745n7866j00307K4226L43261Q1439l1444o9979k40927j77440J49296
12794C59004j00569k30998J50747K47021J69288R0794P7416n2091j68797j93968
12784C47847Q753J25619j06010k08828l7399n6957K26613L9090J92280m1929l27619
$$ y = [568282, 491238, 244574, 216843, 313221, 388786, 293439, 111521, 190804, 214257, 441779, 296288, 93966, 136638, 283410, 341134, 345176, 395530, 634823, 777106, 706985, 542568, 578717, 819138, 832489, 654953, 539367, 197672, 73207, -1649, 128895, 95608, 169572, 219795, 277528, 285385, 291855, 590540, 679564, 461218, 243242, 473271, 439010, 269847, 291855, 522836, 656586, 552164, 286808, 216336, 262560, 409781, 487641, 438745, 380879, 280572, 304798, 648059, 729498, 698054, 628075, 387148, 209708, 359004, 258435, 27437, 178184, 425205, 594493, 685287, 762703, 710612, 541815, 347847, 356600, 482219, 376209, 167381, 129982, 73025, 299638, 338728, 531008, 489079, 161460]
12773A61460j63607J71240k0179J20157J04076J15992K54794L8522k86319L6410
12763E32546O0014j1763P4839J14024k20331k09624m1654K33759J83187K47503
12753I62500R9204K43875L39396L5857J2688l814Q3133k11001k45396k6870j36206
12742A153366r1535l2865n1031n5239j89878j6873K14213K19781K3423K04125
12732A377487Q3542J02178m6036j37821J84019J28129J19640n4294l17903r8016
12722A340925j36752p8824k10369j81600J26839q2501K18685o4373J96860L54864
12712A483754J70205O8152J31220K92323J03128k80568k36305n4496J60253l1221
12702A806445J015J43189J81252j32669O0599L57669N4586j12403L3826J44854
$$ y = [161460, -2147, 169093, 148914, 269071, 373147, 489139, 743933, 782455, 496136, 532546, 592560, 580797, 655636, 769660, 549329, 339705, 298051, 531810, 714997, 962500, 1061704, 1305579, 1644975, 1680832, 1693520, 1689706, 1772839, 1561838, 1316442, 1289572, 1153366, 1061831, 1028966, 977935, 922696, 732818, 715945, 930158, 1149939, 1173362, 1377487, 1461029, 1563207, 1517171, 1379350, 1563369, 1691498, 1811138, 1756844, 1438941, 1340925, 1204173, 1125349, 914980, 733380, 860219, 777718, 996403, 932030, 1128890, 1483754, 1653959, 1722111, 1853331, 2145654, 2248782, 1968214, 1731909, 1677413, 1837666, 1806445, 1807460, 1950649, 2131901, 1999232, 2059831, 2417500, 2472086, 2359683, 2393509, 2538363]
12692B538363l66885m69194q3801K86292R3001j5737j78076P7915K85695J41537
12682B309110j57598r3391q4940K18077K65204M8977J19462K56162J62787n8246
12672B985604j64535J1555O2578k32775J04868J22652J63459p6219r1649l01920
12662B583618m98085j06115M1919m7556M00302M92457L59948M3377k71311l56770
12652B641784k57113J14906k30707l47449P9005q8879J15380j43674j56524k73285
12642A453444j22306l2006J58854J96851K47955j45447j836p5486q6268n4919
12632A538836p8815J20432J41196p045J92022q7655k97706K38958K21583j07512
12622A874294m8292Q631R0413Q461k79415j31860R293l11546L30162J67296r8824
$$ y = [2538363, 2171478, 1702284, 1618483, 1904775, 1997776, 1982039, 1803963, 1881878, 2167573, 2309110, 2151512, 2058121, 1973181, 2191258, 2456462, 2505439, 2624901, 2881063, 3043850, 2985604, 2821069, 2832624, 2895202, 2662427, 2767295, 2889947, 3053406, 2977187, 2885538, 2583618, 2085533, 1979418, 2021337, 1973781, 2374083, 2866540, 3226488, 3269865, 2998554, 2641784, 2384671, 2499577, 2268870, 1921421, 2000426, 1911547, 2026927, 1883253, 1726729, 1453444, 1331138, 1299132, 1457986, 1654837, 1902792, 1757345, 1755509, 1680023, 1593755, 1538836, 1460021, 1580453, 1721649, 1714604, 1906626, 1818971, 1521265, 1760223, 1981806, 1874294, 1826002, 1834633, 1925046, 1933507, 1654092, 1522232, 1531525, 1219979, 1550141, 1717437, 1618613]
12611A618613P4099P9151p9202j28844j25650k65304J11421j3465K9942r2804
12601A207957J2051k56199q8731J8201J24457K37620j9027j820J7293j50962j41702
12590I59138J93960j3572p6864j48943J23331n901o9300Q6850J73420r8723L0850
12579A154246q5572j00647J00295j00448j23975r4283M981q4337K6068K15026
12569I11354J32894j33453L4154j51649J25830J0001k11476k69463q3915K83943
12559F48220J81092J44312J53131p9125l52645Q054K39498J82479r8662n0133
12549I76221m641O511j8282J75206P5382j82902k29361j02047O9547K97733L38243
12538A401610K78543j0718l84281m44700k19470J72103K90903J62037j34816k08309
$$ y = [1618613, 1692712, 1771863, 1692661, 1563817, 1438167, 1172863, 1284284, 1270819, 1300761, 1207957, 1220008, 963809, 875078, 893279, 1017736, 1255356, 1236329, 1234509, 1251802, 1100840, 959138, 1153098, 1139526, 1062662, 913719, 1037050, 1031149, 961849, 1048699, 1222119, 1123396, 1154246, 1068674, 968027, 1068322, 967874, 843899, 749616, 754597, 670260, 696328, 911354, 1044248, 910795, 944949, 793300, 919130, 929131, 717655, 448192, 364277, 648220, 829312, 973624, 1126755, 1047630, 694985, 703039, 942537, 1125016, 1026354, 976221, 971580, 978091, 959809, 1135015, 1210397, 1027495, 798134, 696087, 765634, 1063367, 1401610, 1680153, 1669435, 1285154, 840454, 620984, 793087, 1083990, 1246027, 1111211, 902902]
12528I02902j13243j33464M2232J71580R878J68303K07074Q0467j12558k50726
12518I72445k25853Q8655J82123j5860L0557j26764J08382N4590r304q701P8617
12507A128887J4212n5502l563P0888Q8563k78991l6887K86327J94242l3998Q0716
12496A454894J02682k95713k46629J82608K61209J38543J59017L321o9589K91938
12486A982281q637k12751l96111k81637j76761L96770M3302j81580P3180k7084
12476A210972K6351L6832R4712j05969m3489j06202K7324j57376m2061K14919
12466A156013J0709K2779J4664J56850n8887k6934j09559j13281O4371N54033
12456A670758J05676j20489l9056j12504Q3266J05o1546J0280p715j40519j97563
$$ y = [902902, 789659, 656195, 698427, 870007, 879885, 1048188, 1255262, 1335729, 1223171, 972445, 746592, 835247, 1017370, 1001510, 1032067, 905303, 1013685, 1068275, 1058971, 1050270, 1128887, 1143099, 1087597, 1084034, 1154922, 1243485, 964494, 927607, 1213934, 1408176, 1374178, 1454894, 1557576, 1261863, 1015234, 1197842, 1459051, 1597594, 1756611, 1759932, 1690343, 1982281, 1973644, 1760893, 1364782, 1083145, 906384, 1303154, 1346456, 1164876, 1238056, 1210972, 1237323, 1274155, 1368867, 1262898, 1219409, 1113207, 1140531, 983155, 941094, 1156013, 1166722, 1189501, 1204165, 1361015, 1302128, 1275194, 1165635, 1052354, 1116725, 1670758, 1776434, 1655945, 1616889, 1504385, 1587651, 1587756, 1526210, 1536490, 1528775, 1388256, 1190693]
12445A190693m0564L3380o8207O0191J1080K55047K8723n997R2560J34631P9791
12434A771328n3312Q479l9345j17267Q8289K56113P5463R5752k85924l25270j83750
12423A290556M5046O8315Q0416k9235k35384j29240J62800J87974K3851P2177
12413A537276r98J5823M9135j30314k6536j24985J92841p9806L9469L6536k21278
12402A287163j12868J6262J33744r4175j98830J12041L694R8395J82848R3523
12392A521797q6147n4820J89704k1508J0499Q4587r3613M663J67546K40149Q6626
12381B049483J84001k1180J15572q5369j91552k75348j06850L4673J13429j89918
12371A626941j7118J10161J71002L97639L15499J77403N7298M9607j93757j07429
$$ y = [1190693, 1150129, 1183509, 1115302, 1175493, 1186573, 1441620, 1470343, 1464346, 1556906, 1691537, 1771328, 1718016, 1726495, 1687150, 1569883, 1658172, 1914285, 1989748, 2085500, 1799576, 1474306, 1290556, 1335602, 1403917, 1484333, 1455098, 1219714, 1090474, 1253274, 1441248, 1465099, 1537276, 1536278, 1552101, 1601236, 1470922, 1444386, 1319401, 1512242, 1432436, 1471905, 1508441, 1287163, 1174295, 1190557, 1324301, 1230126, 1031296, 1143337, 1147031, 1245426, 1428274, 1521797, 1435650, 1380830, 1570534, 1549026, 1559525, 1644112, 1550499, 1555162, 1722708, 1962857, 2049483, 2233484, 2212304, 2327876, 2242507, 2050955, 1775607, 1668757, 1703430, 1816859, 1626941, 1609823, 1719984, 1890986, 2288625, 2604124, 2781527, 2838825, 2888432, 2694675, 2587246]
12361B587246j83480L23769J62399j58993J18798J85233K39363R9990J789O4398
12351C440512p8078q4823K4588K17080K57843M36834N01891P15042J140414J423539
12341G994842J330933R99316P37724p3532j320830j554511j113589o57910n80533
12332E761910k36940j98095k82691R2318L36124J57069j62652j06227l70846k07342
12322D782628J25608q1419o2906Q1018N9677O02756N57353O12756J022779R06022
12312H606272O57542M40489k00425l13721O8662Q37308J026747P84135O00166
12303A2507175k15755j324139j039241R6326N30826J344011K022795K835933L527397
12294B0285328L623848K478999O61674k508432m398831l147394j744919q77445
$$ y = [2587246, 2403766, 2727535, 2889934, 2730941, 2849739, 3034972, 3274335, 3374325, 3376114, 3440512, 3362434, 3277611, 3302199, 3519279, 3777122, 4213956, 4715847, 5430889, 6571303, 7994842, 9325775, 10325091, 11062815, 10989283, 9668453, 8113942, 7000353, 6342443, 5761910, 5524970, 5326875, 5044184, 5136502, 5472626, 5629695, 5467043, 5360816, 4989970, 4782628, 4908236, 4826817, 4763911, 4844929, 4904606, 5507362, 6064715, 6677471, 7700250, 8606272, 9263814, 9704303, 9503878, 9190157, 9258819, 10096127, 11122874, 11907009, 12507175, 12291420, 10967281, 9928040, 10024366, 10555192, 11899203, 13921998, 16757931, 20285328, 23909176, 26388175, 27049849, 24541417, 20142586, 16995192, 15250273, 14372828]
12286A4372828l94772k3408K08915M53268P16315O05420O15270N42359M03364
12277A7499559O53343J054633J370451J269190J552024J581782L009505N128010
12269C3118497Q031337J1667931J4476979J3268594R519254L117432n490725n095211
12261H2614088K031876P104494R648256J0797342J1803171K0821398L8460170
12254A83280795N1620176M8411222L1350241J996537m1267711n9163356l8774143
12247A77453761j3697933L709985J3382191J6224072J5743819J1264720O181655
12240B30262270J2246984K1911189K5099270K0375566O786596o582440n351964
12233C04747471J284666N662927K0345189L6955055L8281763K7753216j761399
$$ y = [14372828, 13978056, 13954648, 14163563, 14616831, 15333146, 15938566, 16553836, 17096195, 17499559, 18152902, 19207535, 20577986, 21847176, 23399200, 24980982, 27990487, 33118497, 41149834, 52817765, 67294744, 80563338, 90082592, 93200024, 87709299, 82614088, 84645964, 91750458, 101398714, 112196056, 123999227, 144820625, 183280795, 234900971, 283312193, 314662434, 316658971, 275391260, 216227904, 177453761, 163755828, 167465813, 180848004, 197072076, 212815895, 224080615, 230262270, 242509254, 264420443, 289519713, 309895279, 316681875, 310099435, 304747471, 306032137, 311695064, 332040253, 368995308, 407277071, 435030287, 433268888]
12226D33268888l1543001k6153722q885798m148305j6537412m0923568m6576778
12219B58500304k7440992n481336J1063742J8852020K0921995J9951596J1891650
12212C08258979R390109K1905543L0807706J9612641J332859j2728116k7125729
12205C51453992k1290568M782634K6858787L4799699L1661671J7253222j1410667
12198D34108770l1280295l2548988m3785872n5327214m2637382k3465169j0491255
12191A94572595j50418J0517652K2997425L6432762M4759772M2524765L3835897
12184C85490450J7993893K883134P987117J9428119K1774212K294459l8033374
12177D19818010n0907293m0645636k5573566p8661K4799816L8098308L7020429
$$ y = [433268888, 401725887, 375572165, 366686367, 362538062, 346000650, 305077082, 258500304, 231059312, 225577976, 236641718, 255493738, 276415733, 296367329, 308258979, 317649088, 339554631, 370362337, 389974978, 391307837, 378579721, 351453992, 330163424, 334946058, 361804845, 396604544, 428266215, 445519437, 434108770, 402828475, 370279487, 326493615, 271166401, 228529019, 205063850, 194572595, 194422177, 204939829, 227937254, 264370016, 309129788, 351654553, 385490450, 403484343, 406367477, 414354594, 433782713, 455556925, 457851384, 419818010, 368910717, 328265081, 302691515, 302612854, 327412670, 365510978, 402531407]
12170D02531407K4492339K765521k0627978k8040576j9519637j4235737j7252127
12163C30113212j9113338o048343J5481791L2416030M1293669K9629086K165592
12156D25937699j7230936m5200068o1766761m2468381k0131517q446645q184279
12149B22509112j5502225j8371155k0130805k0574308j5627008j0189736o945064
12142A15168811n103961l523761k376932j377472J7526J874342K198222N83854
12134A07460629j733458o257898q691559p131907m648325l420297k666133k249725
12126G0661327j948380j437994r12464j052604j284164n84118L62782J678231
12118F5482616L073540L190768K122281L97119l357630o426446n388403l235559
$$ y = [402531407, 427023746, 429789267, 409161289, 381120713, 361601076, 347365339, 330113212, 310999874, 304951531, 320433322, 352849352, 394143021, 423772107, 425937699, 408706763, 363506695, 301739934, 259271553, 239140036, 230693391, 222509112, 207006887, 188635732, 168504927, 147930619, 132303611, 122113875, 115168811, 110064850, 106541089, 104164157, 102786685, 102804211, 104678553, 106876775, 107460629, 105727171, 99469273, 90777714, 83645807, 78997482, 75577185, 72911052, 70661327, 68712947, 67274953, 66362489, 65309885, 64025721, 63441603, 63804385, 65482616, 68556156, 71746924, 73869205, 74266324, 70908694, 64482248, 59093845, 55858286]
12110E5858286k637024k641686k605828k423981k088413j555132j115877r20577
12102C9869768o23217K7353O66283J086497J404075Q95584P45964K92123n82829
12093D3781601j264853j746787k592112l053715k296473j404563o43659l24213
12085C0455226P5912O98437J138243N18633j51174j340137k878955k677266j608053
12076B4230866q56080p43045o87396m20914n93336r46350q24191o34565m91973
12067A8033016j04883K56035L69913O41807K62250K84582n2401m05382o30414
12058A8654523n03411m40517l84526k96234j055466j216541q41809o39283n15607
12049A2761129o61147p36167l78500k86756n53694q27061j97988K50384J66902
$$ y = [55858286, 53221262, 50579576, 47973748, 45549767, 43461354, 41906222, 40790345, 39869768, 39246551, 39273904, 39940187, 41026684, 42430759, 43326343, 44072307, 44364430, 43781601, 42516748, 40769961, 38177849, 35124134, 32827661, 31423098, 30779439, 30455226, 30531138, 31229575, 32367818, 32886451, 32735277, 31395140, 28516185, 25838919, 24230866, 23374786, 22631741, 21944345, 21523431, 20930095, 19983745, 19159554, 18524989, 18033016, 17928133, 18184168, 18554081, 19195888, 19458138, 19742720, 19690319, 19284937, 18654523, 18151112, 17710595, 17326069, 17029835, 15974369, 14757828, 13916019, 13276736, 12761129, 12099982, 11363815, 10985315, 10698559, 10144865, 9317804, 9119816, 9370200, 9537102]
12040I537102p8819j82531l8243q7797l6037j73715l93118o41599n91843m23557
12030F889843j14664l22662j48500j01989l01005m0328J9006m8193j28545k12989
12020E489974j60413k1460j32838n0402o2407j22521j52650m4149p3936k23029
12010D446169k9687k7259k49666k99288k81391q1728K33071j48760j01315p2197
12000C387949J18423n6034k58889j3525R9978J57365K33779K60799j27680m20874
11990C381291k96612L33901K6085l49843j61979j45945j82058j66747K15059l6789
11980B616363N2149L30107k17017m1092J68227M2110j53092K4409j0122m6166
11970B765876k31237m9174K24278k26820k80033O302Q5145N5015M6677O879L246
$$ y = [9537102, 9458283, 9275752, 9237509, 9149712, 9113675, 8939960, 8546842, 7905243, 7313400, 6889843, 6775179, 6452517, 6304017, 6202028, 5901023, 5860695, 5879701, 5831508, 5702963, 5489974, 5329561, 5308101, 5175263, 5124861, 5062454, 4939933, 4787283, 4743134, 4669198, 4446169, 4416482, 4389223, 4139557, 3840269, 3558878, 3477150, 3710221, 3561461, 3460146, 3387949, 3506372, 3450338, 3191449, 3177924, 3277902, 3435267, 3669046, 3929845, 3802165, 3381291, 3084679, 3418580, 3444665, 3094822, 2932843, 2786898, 2604840, 2438093, 2653152, 2616363, 2668512, 2998619, 2781602, 2740510, 2908737, 2950847, 2797755, 2822164, 2812042, 2765876, 2534639, 2485465, 2709743, 2482923, 2202890, 2209192, 2294337, 2349352, 2396029, 2402908, 2406154]
11959B406154j46179M9793p5032j68862J28551J20701p661M8613J59035l4936
11949B480177p6915k33333k76723j33408J22854R6417J14315j13777m1082r2377
11939A846148q9248J83561K09762o8607l10845J54223J38899r9942j19967M3015
11929A886999k64904j53291k4436j75376P1788p3806l12555j7286j28426K29172
11919A037879J25553j94930K78745J04095j87693j02163L96777M6280n6117L29360
11909A777786n0853K1364O8885k00469K6714J96095j68134m10344k08401Q7584
11899A140227M90858L26182J1455J26571M1673j45374j70694j15561k17116k27963
11889A260258L8404n579L89723O1531J65079m4379j40313J8898J09365M4429l6908
$$ y = [2406154, 2259975, 2309768, 2234736, 2065874, 2194425, 2315126, 2307465, 2356078, 2515113, 2480177, 2403262, 2169929, 1893206, 1759798, 1882652, 1979069, 2093384, 1979607, 1938525, 1846148, 1756900, 1940461, 2150223, 2081616, 1770771, 1924994, 2063893, 1963951, 1843984, 1886999, 1622095, 1468804, 1444368, 1268992, 1340780, 1266974, 954419, 937133, 808707, 1037879, 1163432, 968502, 1247247, 1351342, 1163649, 1061486, 1458263, 1504543, 1448426, 1777786, 1726933, 1748297, 1817182, 1616713, 1643427, 1839522, 1671388, 1261044, 1052643, 1140227, 1631085, 1957267, 1968722, 2095293, 2136966, 1991592, 1820898, 1705337, 1488221, 1260258, 1298662, 1293083, 1682806, 1744337, 1909416, 1865037, 1724724, 1743622, 1852987, 1897416, 1860508]
11878A860508l73284J65208J58774j03249p0600j8269K8804j1127j7706J41174
11868A760233R1364n2505r7428j65930k00212k3625J69427J87617J96517j39311
11858A726147J4990k53972q8652n1816J15548K40165J00458k23718k44496K76719
11848A611373j5678J25477M45133K12414r8617k45888j16054j06225j26231j87267
11838A498437j67286n2480J49479J30433K16378K11391r681Q1564l4449k09401
11828A814385k24378L9313M9193K80741K17618N515k91840m06431P8793K5695
11818A588604m7826O176J83142j12134J21720K1162k04880o3000K08145L20385
11808B021494o3406l4983J00187J29642j16300j92369m0527j31378l3437p0165
$$ y = [1860508, 1487224, 1652432, 1811206, 1707957, 1637357, 1619088, 1647892, 1636765, 1619059, 1760233, 1851597, 1799092, 1701664, 1535734, 1335522, 1311897, 1481324, 1668941, 1865458, 1726147, 1741137, 1487165, 1398513, 1346697, 1462245, 1702410, 1802868, 1579150, 1334654, 1611373, 1595695, 1721172, 2166305, 2378719, 2280102, 2034214, 1918160, 1811935, 1685704, 1498437, 1331151, 1278671, 1428150, 1558583, 1774961, 1986352, 1976671, 2058235, 2023786, 1814385, 1590007, 1629320, 1678513, 1959254, 2176872, 2182387, 1890547, 1484116, 1562909, 1588604, 1540778, 1546954, 1730096, 1617962, 1739682, 1760844, 1555964, 1492964, 1701109, 2021494, 1958088, 1923105, 2023292, 2152934, 2036634, 1844265, 1803738, 1672360, 1638923, 1568758]
11798A568758k6223N9113k03871J90611J72945L81370K37321J73978J32170N549
11788B691721l20845l29600J29268k6587q3233k62210k700j61559j20618O9011
11778A582648q665l1472J28875J21192j43865k93049N7256P8755n7713o439J81838
11767A609361K46501j4170m7484j39216j1428K01561j04416p3471J79936J45994
11757A993168N2192O8273J55378j35277R6408k38320K1344K75287K04869J28403
11747B621725J90294o4288j14623P7748o7260j39660j50175J33188N9092K462
11737B548503K03566j3296k03171o9479p8356K39502K03020j90906j35945K46725
11727B750163M37908O1300j04669l92671j72527j11100k3548p2235k88463k6440
$$ y = [1568758, 1542535, 1601648, 1397777, 1588388, 1761333, 2142703, 2380024, 2554002, 2686172, 2691721, 2370876, 2041276, 2170544, 2143957, 2060724, 1798514, 1795814, 1634255, 1513637, 1582648, 1573983, 1542511, 1671386, 1792578, 1648713, 1355664, 1412920, 1491675, 1433962, 1427523, 1609361, 1855862, 1841692, 1794208, 1654992, 1643564, 1845125, 1740709, 1667238, 1847174, 1993168, 2045360, 2113633, 2269011, 2133734, 2230142, 1991822, 2013166, 2288453, 2493322, 2621725, 2812019, 2747731, 2633108, 2710856, 2643596, 2503936, 2353761, 2486949, 2546041, 2548503, 2752069, 2738773, 2535602, 2466123, 2387767, 2627269, 2830289, 2639383, 2503438, 2750163, 3188071, 3249371, 3144702, 2752031, 2579504, 2468404, 2444856, 2372621, 2084158, 2057718]
11717B057718Q5399n7964j70958N753m6333K5302J28958K52079K97111K44324
11707B821389L38377J5269j94098k15886n7061k82472j99287m7360O1673J51713
11697B392257M14051M08590K74850j17295k54175k64743k31609k64145m03476
11688A954305j93604j15961l8139J42094J94254j851j99053K35469p7363J1308
11678A911459l521J44328L69566K06216M7336j64939k79747j16807J47858L50451
11668B612200k4731m20652n01713k61395r6029K24787K83767J34054R1583J87047
11658B228918J4912J56545J62279J56871Q2652k25478k85246m68773l63130j94248
11648A265302j09986p767J03012o982M6257J35806J6J28803r6762K25701o2690
$$ y = [2057718, 2143117, 2085153, 1914195, 1919948, 1873615, 1898917, 2027875, 2279954, 2577065, 2821389, 3159766, 3175035, 2980937, 2765051, 2707990, 2425518, 2226231, 2178871, 2240544, 2392257, 2806308, 3214898, 3489748, 3372453, 3118278, 2853535, 2621926, 2357781, 1954305, 1760701, 1644740, 1606601, 1748695, 1942949, 1941098, 1742045, 1977514, 1900151, 1911459, 1907938, 2052266, 2421832, 2628048, 2675384, 2510445, 2230698, 2113891, 2261749, 2612200, 2587469, 2166817, 1665104, 1403709, 1307680, 1532467, 1816234, 1950288, 2041871, 2228918, 2243830, 2400375, 2562654, 2719525, 2802177, 2576699, 2291453, 1822680, 1459550, 1265302, 1155316, 1147549, 1250561, 1243579, 1289836, 1425642, 1425658, 1554461, 1457699, 1683400, 1620710]
11637A620710k12506o8081j14894k80072O1322M2951P2929L8007l23035k02588
11627F34743M4807J26024R4640K23406J36932n2326l6388J03726o9761K9148P2346
11616A307297j67601o8010R7969N9671j01862j79297j18801J07830P0028J35139
11606A142363O9188o1588O4966K11355K4135j38817J0134J51135J66448M09425
11596B048744q6268j82356j42172k62597k58174k3686j372k3672J67408l097n2476
11585A180282m144O3661k0019j70613M3957L49976j41343l26640J19253k3190
11575A071180J14187K46699K61587j06233j42279l53616j73652O5834J66585l9595
11565A110697J34179p9356N228R7863n1883N4403J49648L075j35530K8013J60273
$$ y = [1620710, 1408204, 1340123, 1225229, 945157, 1006479, 1049430, 1122359, 1160366, 837331, 634743, 679550, 805574, 900214, 1123620, 1260552, 1208226, 1171838, 1275564, 1205803, 1234951, 1307297, 1139696, 1071686, 1169655, 1229326, 1127464, 948167, 829366, 937196, 1007224, 1142363, 1211551, 1149963, 1214929, 1426284, 1450419, 1311602, 1321736, 1472871, 1639319, 2048744, 1962476, 1780120, 1637948, 1375351, 1117177, 1093491, 1092119, 1068447, 1235855, 1232758, 1180282, 1176138, 1239799, 1219780, 1049167, 1093124, 1443100, 1301757, 975117, 1094370, 1071180, 1185367, 1432066, 1693653, 1587420, 1445141, 1091525, 917873, 983707, 1150292, 1110697, 1244876, 1165520, 1170748, 1268611, 1216728, 1271131, 1420779, 1423854, 1288324, 1316337, 1476610]
11554A476610k12119k93809j91421m440K46483J33473J65434L40335M37006k19089
11544A878463m34131k94354O1717K09452j48243j31278L11628Q2850r327n2997
11534A473780l41013n3015J74004L05998n3683o9966J71659L02014L86073n384
11524B290467k71448n7948j15139O6833k40558j65890K9177K49433R0225R2852
11514A968004o1328k50014J3002N9955L7843J48261P3529J41503j90273j14419
11504A826063p1909k7136N3293J26336o3250J97409J11123j26920j97455O4362
11494A891916J37606k46789J49525Q49j23526k24054N9485J2994R2415R1264J87015
11483B028700Q7674j05304p6861r8350n4379J20110p439p3215J16818L72540J5201
$$ y = [1476610, 1264491, 970682, 779261, 774821, 1021304, 1154777, 1320211, 1660546, 2097552, 1878463, 1444332, 1149978, 1211695, 1421147, 1272904, 1141626, 1453254, 1536104, 1526777, 1473780, 1132767, 1079752, 1253756, 1559754, 1506071, 1436105, 1607764, 1909778, 2295851, 2290467, 2019019, 1961071, 1845932, 1912765, 1672207, 1506317, 1535494, 1784927, 1875152, 1968004, 1906676, 1656662, 1669664, 1729619, 1767462, 1915723, 1989252, 2130755, 1940482, 1826063, 1754154, 1727018, 1780311, 1906647, 1843397, 2040806, 2151929, 2025009, 1827554, 1891916, 2029522, 1782733, 1932258, 1933107, 1809581, 1585527, 1645012, 1658006, 1750421, 1841685, 2028700, 2116374, 2011070, 1934209, 1835859, 1781480, 1901590, 1894151, 1820936, 1937754, 2310294, 2325495]
11472B325495p3096J93992M68j31096m8949r3886L513j3346m25710j55106O9368
11461A651647L8332K48260P7536k19096k44135N066P4248L19923J74377K42398
11451B368556K48353O6736J4204J04441N2387K46670m7878k92425j75157j24202
11441B461685r4044k11396k55174J25608J89762j42436j42941j88568n2687n7559
11431A632250J20034J24699j68572N3373P0325l13573k58868J6439L27371L17858
11421A921336J58902m5450Q2229j9492m5115J22057j12410r0061o7316N9303K19275
11410B183258L69004J11535n8537k20782j54759j52524J52344J98223j1636J77002
11400B593128j5105l03883k98805Q8784L15706J83849N5908j2947j27183k01327
$$ y = [2325495, 2252399, 2446391, 2446859, 2315763, 2266814, 2172928, 2176441, 2163095, 1737385, 1582279, 1651647, 1689979, 1938239, 2015775, 1796679, 1552544, 1557610, 1631858, 1951781, 2126158, 2368556, 2616909, 2683645, 2697849, 2802290, 2854677, 3101347, 3053469, 2761044, 2585887, 2461685, 2367641, 2156245, 1901071, 2026679, 2216441, 2074005, 1931064, 1742496, 1689809, 1632250, 1752284, 1876983, 1708411, 1761784, 1832109, 1518536, 1259668, 1276107, 1603478, 1921336, 2080238, 2034788, 2117017, 2097525, 2052410, 2174467, 2062057, 1971996, 1904680, 1963983, 2183258, 2552262, 2663797, 2605260, 2384478, 2229719, 2077195, 2229539, 2427762, 2416126, 2593128, 2578023, 2274140, 1975335, 2064119, 2379825, 2563674, 2619582, 2606635, 2479452, 2278125]
11390B278125j6012k40145L153J39861j01029j25480R0348J2831k02644j42258
11380A696750k6850J44413K46104j07185J4584J93767J02837q8197L11793P84548
11370C272564R76424P84647N50439J62437r71790j257835o45240n83244k13176
11361B075226R725m6479j68871q8916K99232J51512j71048j08271K86701K77589
11351B516400J18871m4594j14613j81793m18110m7778K76414j61494k26747q9371
11341A627185j2376l7539L2444J61714K72926j8757k2385n4916k17605J01740
11331A832431M60098L14702k51142j14961r3632k12860q4531O3291J11266n7986
11321A966676n1815k8954J13520P5693k81443K303q4643j06941m2809n2789o2950
$$ y = [2278125, 2262113, 2021968, 2025121, 2164982, 2063953, 1938473, 2028821, 2041652, 1839008, 1696750, 1669900, 1814313, 2060417, 1953232, 1967816, 2161583, 2264420, 2176223, 2488016, 3272564, 4248988, 5033635, 5584074, 5746511, 4774721, 3516886, 2871646, 2288402, 2075226, 2084951, 2038472, 1869601, 1780685, 2079917, 2231429, 2060381, 1952110, 2238811, 2516400, 2635271, 2590677, 2476064, 2294271, 1876161, 1828383, 2104797, 1943303, 1716556, 1627185, 1614809, 1577270, 1609714, 1771428, 2044354, 2025597, 2003212, 1948296, 1730691, 1832431, 2292529, 2607231, 2356089, 2241128, 2147496, 1934636, 1850105, 1913396, 2024662, 1966676, 1914861, 1885907, 1999427, 2075120, 1793677, 1795980, 1711337, 1604396, 1561587, 1508798, 1445848]
11310A445848J37805K75502K03291J30396j22401j09865n2177P3500l704j63897
11300A814298j5907K49108q7742j04301q6807j9991r3540N8326P6603N1936R7918
11289A939901J78617n7594k62134J75318J81111k03811q333k51529o225N3364
11279A738685J12620K37370Q9397P8386k2859K3856j73812l12190J7267K41534
11269B030254q2199k76362Q62J30189o6113k28559j14256J25549J35285M8503
11259A703153p7440j88158K69496J31802N873P3034j04039r2007j38432j1472
11249A571810k3866o668K84674J41819j49038K32129J4377j79991P0966O1046
11239B017258p4702k61881L4208J80652K16217n8267n9876O5642l1504q2647r0134
$$ y = [1445848, 1583653, 1859155, 2062446, 2192842, 2070441, 1960576, 1908399, 1981899, 1978195, 1814298, 1798391, 2047499, 1959757, 1855456, 1768649, 1748658, 1655118, 1713444, 1790047, 1841983, 1939901, 2118518, 2060924, 1798790, 1974108, 2155219, 1951408, 1943075, 1691546, 1685321, 1738685, 1851305, 2088675, 2178072, 2256458, 2233599, 2257455, 2083643, 1771453, 1788720, 2030254, 1948055, 1671693, 1672555, 1802744, 1736631, 1508072, 1393816, 1519365, 1654650, 1703153, 1625713, 1437555, 1707051, 1838853, 1844726, 1917760, 1813721, 1721714, 1583282, 1571810, 1547944, 1541276, 1825950, 1967769, 1818731, 2050860, 2065237, 1885246, 1956212, 2017258, 1942556, 1680675, 1714883, 1895535, 2111752, 2053485, 1993609, 2059251, 2027747, 1945100, 1854966]
11228A854966J85638L69038P4538J05413k6310J74154l4604j0135J58738M28336
11218C279772M84015N44850Q67437N64296O4580m38492m75409o18980n69646k94726
11208C407697k96321k35853k64073J68757J92674K68096M16657M09076K51620
11199D318330L84572O52991J158487J631686K054020K275844J692158R99526o12498
11190A4555116k722869k628393j816920j416720m49574j57155l87628k85023J32898
11181D823732L68106P2719M6035j51367j17214k13719j66769Q4155j09591K5766
11171D661853K22055j98464L1210J45867J21713j9777M53565K85371M30963M17680
11161F552036N79976Q50577J479639J976268K950156M125730M308070L252987
$$ y = [1854966, 2040604, 2409642, 2484180, 2589593, 2563283, 2737437, 2702833, 2692698, 2851436, 3279772, 3763787, 4308637, 5176074, 5740370, 5804950, 5366458, 4891049, 4272069, 3702423, 3407697, 3111376, 2875523, 2611450, 2780207, 2972881, 3240977, 3657634, 4066710, 4318330, 4702902, 5355893, 6514380, 8146066, 10200086, 12475930, 14168088, 15167614, 14555116, 11832247, 9203854, 7386934, 5970214, 5520640, 5363485, 4975857, 4690834, 4823732, 5191838, 5264557, 5310592, 5159225, 5042011, 4828292, 4661523, 4745678, 4636087, 4661853, 4883908, 4685444, 4716654, 4862521, 4984234, 4964457, 5418022, 5703393, 6134356, 6552036, 7132012, 7982589, 9462228, 11438496, 14388652, 18514382, 22822452, 26075439]
11153B6075439J921690j383555m594425l846725j655803n57965j74977M01020
11145A6184699N60641M38601M94529M51652k57233j960553k393482j528344p06365
11136A1284145m99096n09669l7573j5024p2991J60541N17747P01224R15256J247640
11126A3692200J661584K131141J987075J982403K233610K451712L041740L332849
11118C2514314L768754O277294J0331214J3392133J4179348J2602147N904738
11111I8969942j002227j970247j930911j165299p27551m963961j4131320j7039179
11103E6039247j1989491o899749l982887k503446j813961q79701n41854k60346
11095B7167812K09205P75053J976118L513985N069181P737631J0166902J0191469
$$ y = [26075439, 27997129, 26613574, 22019149, 18172424, 16516621, 15958656, 15783679, 16184699, 16745340, 17183941, 17678470, 18130122, 17872889, 15912336, 13518854, 11990510, 11284145, 10785049, 10275380, 10237807, 10222783, 10149792, 10310333, 10828080, 11529304, 12444560, 13692200, 15353784, 17484925, 19472000, 21454403, 23688013, 26139725, 29181465, 32514314, 36283068, 42560362, 52891576, 66283709, 80463057, 93065204, 98969942, 97967715, 95997468, 94066557, 92901258, 92173707, 87209746, 73078426, 56039247, 44049756, 37150007, 33167120, 30663674, 28849713, 27970012, 27428158, 27167812, 27377017, 28152070, 30128188, 33642173, 38711354, 46448985, 56615887, 66807356]
11087F6807356P371480L000455n362439j0379307p854617m906662k552630O5406
11079D6189042K400183N176488R471281J4992877K0644942K2863312K0920949
11072A42659074J7237448J0583501J0722494K2639760L1297173K8682845J6389187
11065B80211482o342633k3823368k2120176j5587917j7186557k8753101l2555507
11058A33842223k3368864j3376121o698778k274299R59931L736381P356765J1291775
11050A11469013J3660875J3519152J1465941M854806o148943r347372m819289
11043A34654183o94347J970034L254398J847385M832229J6852726K9892583L8649189
11035B31258380M0956806L3092955J7779585J077599p338293r134790j0260583
$$ y = [66807356, 74178836, 77179291, 71816852, 61437545, 53582928, 48676266, 46123636, 46189042, 48589225, 53765713, 63236994, 78229871, 98874813, 121738125, 142659074, 159896522, 170480023, 181202517, 203842277, 235139450, 263822295, 280211482, 273868849, 250045481, 227925305, 212337388, 195150831, 166397730, 133842223, 110473359, 97097238, 90398460, 88124161, 89084092, 92820473, 100177238, 111469013, 125129888, 138649040, 150114981, 154969787, 148820844, 139473472, 134654183, 133959836, 135929870, 139184268, 141031653, 145863882, 162716608, 192609191, 231258380, 272215186, 305308141, 323087726, 324165325, 316827032, 307692242, 297431659]
11028B97431659p095606r103411j3073211N52916K2257090L6724631L9711253
11021C67405321K6846560M724266j5298616k6640425k6965084j8879955p254483
11014C03937584m834989j1241812r682920k036618n654190j7460786j9642977
11007B33383292k0224974j9729690r726816L306807J5223294K3500587K6260479
11000B51992979K5876282K4007438K2811136K9830118L4874568K7897406Q709303
10993D25999230k9439082m7244972k6890779m919652N324439j173169j3413348
10986C08242667j6112091j7917602j1129312K103681J3248308K3410997K7558228
10979C29404876J7298285k187857j9584476l4237536m0831968l3639883k1169302
$$ y = [297431659, 290336053, 281232642, 268159431, 268712347, 290969437, 327694068, 367405321, 394251881, 398976147, 383677531, 357037106, 330072022, 311192067, 303937584, 299102595, 287860783, 278177863, 276141245, 270487055, 253026269, 233383292, 213158318, 193428628, 183701812, 187008619, 202231913, 225732500, 251992979, 277869261, 301876699, 324687835, 354517953, 389392521, 417289927, 425999230, 396560148, 349315176, 322424397, 317504745, 322829184, 321656015, 308242667, 292130576, 274212974, 263083662, 265187343, 278435651, 301846648, 329404876, 346703161, 344515304, 324930828, 290693292, 249861324, 216221441, 195052139]
10972A95052139j2578707q936336m735805L105152Q377407P428890K673367p058426
10964A83327681j8353883j6470858o084658M808595J3946697J9327632J8485040
10957A98986246J3078903K715339j1658340j3492939J003610J8072045K8791763
10950B37496627K8010844J9577568K734611k0199916k2364571q916960k554700
10943B33783503n219362j8755591l4172517l1259738j9482630r915169l202343
10936A11776153K613851Q190664J1348191R741990N471101l458409j5661105j8036676
10928A11985760j4604885j0727957p246674m265164k012524p53865L02646J718964
10920G4396301M559020R295482J4535246J7278229J5581480J3042308O224455
$$ y = [195052139, 182473432, 173537096, 168801291, 171906443, 180283850, 187712740, 190386107, 183327681, 164973798, 148502940, 142418282, 147226877, 161173574, 180501206, 198986246, 212065149, 214780488, 203122148, 189629209, 190632819, 208704864, 237496627, 265507471, 285085039, 287819650, 267619734, 245255163, 236338203, 233783503, 228564141, 209808550, 175636033, 144376295, 124893665, 114978496, 111776153, 114390004, 122580668, 133928859, 143670849, 149141950, 145683541, 130022436, 111985760, 97380875, 86652918, 79406244, 75141080, 73128556, 72374691, 72677337, 74396301, 78955321, 88250803, 102786049, 120064278, 135645758, 148688066, 154912521]
10913A54912521j246074J043706N337275J489195r253721j8153224k3999875k1285304
10905H8844499j4065095q810700n631104m307283l658496k985689k234305j317775
10897D5834052o63565j58357R99708K224528M096180N581970N595365M367313
10889F7877194J737367k497132m627843m152139l466424m491498n523258m517479
10881D0338788k670192j089924q6398K39230J45331j56407p46620j214384j144531
10872C3614893K0054J684740K830375L745720M380795L989575K785241N77462
10864E3628855m085725q209833p271176m242921k718103k111131j562372j185695
10856B2241899p62765j118585j210402p71626o53013q88153o06002o60931l46365
$$ y = [154912521, 153666447, 154710153, 160047428, 161536623, 152282902, 134129678, 110129803, 88844499, 74779404, 65968704, 60337600, 56030317, 52371821, 49386132, 47151827, 45834052, 45170487, 45012130, 46011838, 48236366, 52332546, 57914516, 63509881, 67877194, 69614561, 67117429, 62489586, 58337447, 54871023, 50379525, 44856267, 40338788, 37668596, 36578672, 36492274, 36731504, 36876835, 36720428, 35973808, 34759424, 33614893, 33634947, 35319687, 38150062, 41895782, 46276577, 50266152, 53051393, 53628855, 49543130, 41333297, 34062121, 29819200, 27101097, 24989966, 23427594, 22241899, 21479134, 20360549, 19150147, 18378521, 17725508, 16837355, 16231353, 15570422, 15224057]
10847A5224057m4836j0835j48429k81649k71710k17590k82104j2481k63742k94059
10837A3396622m97174j91709Q6524l19151k71144o7188R7153r9371K97130P30393
10827A3162085J143779J933231L010680L484782L720906M096819M013124L296493
10819C7861899K080358L02826l259002p095186o737346l989276k587432j811895
10811A4764946j287670r25691o97079l34703l07318k28477l43251j96878R0248
10802A0534127K29677M50332Q59117J431849J462248R75038J34333o80360j836810
10793A3559551k212657j566154p74186o37608n17343l65295k60038j7442j47832
10784G060996q2372P9324j55198n25793j40440k4532j74810j84152k95419j50893
$$ y = [15224057, 15179221, 15168386, 15019957, 14738308, 14466598, 14249008, 13966904, 13954423, 13690681, 13396622, 12899448, 12707739, 12794263, 12475112, 12203968, 12136780, 12233933, 12134562, 12431692, 13162085, 14305864, 16239095, 19249775, 22734557, 26455463, 30552282, 34565406, 37861899, 39942257, 40245083, 36986081, 29890895, 23153549, 19164273, 16576841, 14764946, 13477276, 12551585, 11854506, 11519803, 11212485, 10984008, 10640757, 10443879, 10534127, 10763804, 11214136, 12073253, 13505102, 14967350, 15942388, 16076721, 15396361, 13559551, 11346894, 9780740, 9006554, 8368946, 7851603, 7486308, 7226270, 7208828, 7060996, 6978624, 7057948, 6902750, 6376957, 6236517, 6211985, 6037175, 5853023, 5557604, 5406711]
10774E406711p7020q7241j31500k00826j40618R4123j5193j54675k3176j59294
10764D511291o9985K06083L16193L1999P7687O5719j59792j70563j12594m09307
10754D286731k15151O157j88476p0164n5173J1407J83459Q9459j38006K0747K08124
10743D139114p4643k72546m5639L5707q5866r8495m0622p1371J7422N9236J06291
10732C668588j77433k11558j89047k24078R6733K08779N0255J5249Q0893r5713
10722C222668k6801j79235r5624j7408P96j3781p0685q23K36818O0018N2415J85724
10710C354082R0448k69433k44709M2775J29185J89444J72129Q5373M09722M9433
10700D008449j07388j03678k72371k89643r9304J67293M5121R3429l3547k18434
$$ y = [5406711, 5329691, 5242450, 5110950, 4910124, 4769506, 4863629, 4848436, 4693761, 4670585, 4511291, 4441306, 4647389, 4963582, 4995581, 5073268, 5138987, 4979195, 4808632, 4696038, 4286731, 4071580, 4077737, 3889261, 3819097, 3763924, 3775331, 3958790, 4048249, 3910243, 3930990, 4139114, 4064471, 3791925, 3746286, 3781993, 3696127, 3597632, 3557010, 3485639, 3503061, 3562297, 3668588, 3491155, 3279597, 3090550, 2866472, 2963205, 3171984, 3222239, 3237488, 3318381, 3222668, 3195867, 3016632, 2921008, 2903600, 2904396, 2890615, 2819930, 2819107, 3055925, 3115943, 3168358, 3354082, 3444530, 3175097, 2930388, 2973163, 3102348, 3291792, 3463921, 3549294, 3959016, 4008449, 3901061, 3797383, 3525012, 3235369, 3136065, 3303358, 3348479, 3441908, 3408361, 3189927]
10690C189927J16446L50550K56738J34798O875P739l8711j35084j25484K44623
10680D008417j54078k12256j87538j74976J41467Q6718K5456L14439J27993N9426
10670D035068M2049R581J88162J27751J89719N5627Q4677L12682J40934l20725
10660D865525j43849j42601j33932P2817J86170J6951k75861k14830j44876J53128
10650D238642M8386k73151K42233J08744J78596L27375N51838L31955L74214L96167
10640F524999J070804J263212O09354L22734n70720j181602j293735o63659l57293
10631E724094l21499k09606n6635q1J25724P8204q5647P9016n3302J2198N17724
10620E810190R26661J165804J440296J532563J226928J04640r96827j646881j280471
$$ y = [3189927, 3306373, 3656923, 3913661, 4048459, 4055334, 4063073, 4024362, 3889278, 3763794, 4008417, 3854339, 3642083, 3454545, 3279569, 3421036, 3507754, 3533210, 3847649, 3975642, 4035068, 4077117, 4086698, 4274860, 4402611, 4592330, 4647957, 4732634, 5045316, 5186250, 4865525, 4721676, 4579075, 4445143, 4517960, 4704130, 4721081, 4445220, 4230390, 4085514, 4238642, 4287028, 4013877, 4256110, 4364854, 4543450, 4870825, 5422663, 5754618, 6128832, 6524999, 7595803, 8859015, 9468369, 9791103, 9220383, 8038781, 6745046, 6081387, 5724094, 5402595, 5192989, 5136354, 5136273, 5261997, 5340201, 5254554, 5333570, 5280268, 5292466, 5810190, 6736851, 7902655, 9342951, 10875514, 12102442, 12207082, 11210255, 9563374, 8282903]
10611H282903p40561k76015j18178P9786J84783j36485k30268R2738R5037K94657
10601G528397n2727K85552Q7073l11709J0486L45358N28706R70180J220430J788664
10591A2400410K946595M387709N538798N481764L599311J109967l409618o912928
10583B5142008n706803l222890k068555j293298o63419l08261k03147J04114j1847
10574A1767902K7572J60503P1303L70339J012413J405891K048377L020919M675092
10565B4560311N827123N750640L975777J023151l988626o708633n563093l377175
10557B1499475j539695k01595P48184J620629K825020N451790Q805261J1181624
10549E0390693J0369500P178198J731240p413337j3803353j1083563o535093m093579
$$ y = [8282903, 7542342, 7266327, 7148149, 7227935, 7412718, 7276233, 7045965, 7138703, 7233740, 7528397, 7475670, 7761222, 7848295, 7536586, 7547072, 7892430, 8421136, 9391316, 10611746, 12400410, 15347005, 19734714, 25273512, 30755276, 34354587, 35464554, 32054936, 25142008, 19435205, 16212315, 14143760, 12850462, 12187043, 11878782, 11675635, 11779749, 11767902, 11795474, 11955977, 12027280, 12397619, 13410032, 14815923, 16864300, 19885219, 24560311, 30387434, 36138074, 40113851, 41137002, 37148376, 30439743, 24876650, 21499475, 19959780, 19758185, 20506369, 22126998, 24952018, 30403808, 39209069, 50390693, 60760193, 67938391, 69669631, 62256294, 48452941, 37369378, 30834285, 26740706]
10541B6740706k930992k039896j098997j277453j219670q05115p38769j97316
10533A6432498K53474K11024L851j29355q0291J1138N7179J54175M38222L90269
10523A7742184Q16065O17008O74450J080692J222152J164195J682504K736479
10515B7735729L920904M740626N709760P328551R406598J1665955J3532194J1421331
10507I5461648N295050k766000j1736915j3792594q324023k652771J071467N118214
10499F7674076J1025388J5244715J5311680J3534402J0748770N131526R372912
10492A48043469J9740059K5038426J9350335Q08932j6245640k8579279l4158906
10485A33997396k8268334j7571575j0008650o049337l648794j484802L45907K115155
$$ y = [26740706, 23809714, 21769818, 20670821, 19393368, 18173698, 17368583, 16629814, 16432498, 16685972, 16896996, 16900847, 16771492, 16691201, 16702339, 16759518, 16913693, 17351915, 17742184, 18558249, 19175257, 19849707, 20930399, 22152551, 23316746, 24999250, 27735729, 31656633, 36397259, 42107019, 49435570, 58842168, 70508123, 84040317, 95461648, 100756698, 97990698, 86253783, 72461189, 64137166, 61484395, 62555862, 67674076, 78699464, 93944179, 109255859, 122790261, 133539031, 138670557, 148043469, 167783528, 192821954, 212172289, 212981221, 196735581, 168156302, 133997396, 105729062, 88157487, 78148837, 72099500, 68450706, 66965904, 67311811, 69426966]
10477F9426966N004525Q581488J3691791J7953484J7773195J5429721R269117
10470A57130287r96146q29748M743370O632876Q187656P947932L618936N404798
10462A91839961J2086481J5075971J3661459P726467J0519694K2149837K8574029
10455C01633899K6115743J1421170N54207L741218J3484088K9671344L8559096
10448D25180765K9712853L477188k4934940m1316061m2309214l6879682k3208694
10441B89722215l961228R712300J2382649J0733984J1041589J1019566J6597361
10434C57248436J9430137J1921323n598212k7403730k5924937m041603J4208792
10427C39840206J9924864J2774842m826357j7285788k4857651l2319021k3194904
$$ y = [69426966, 74431491, 83012979, 96704770, 114658254, 132431449, 147861170, 157130287, 156134141, 155304393, 160047763, 166680639, 174868295, 182816227, 186435163, 191839961, 203926442, 219002413, 232663872, 240390339, 250910033, 273059870, 301633899, 327749642, 339170812, 339725019, 343466237, 356950325, 386621669, 425180765, 454893618, 458370806, 433435866, 392119805, 349810591, 312930909, 289722215, 285760987, 295473287, 307855936, 318589920, 329631509, 340651075, 357248436, 376678573, 388599896, 383001684, 355597954, 329673017, 325631414, 339840206, 359765070, 372539912, 367713555, 350427767, 325570116, 293251095, 270056191]
10420B70056191o452078N374596J1761954J2418203J2421216J7299929K5631951
10413C48511962K8100555K8230017K7310884J5574954j3022179m9861051n7740926
10406C27104216l0958544K548391K9200825M3935495M2000274K5440286o843498
10399D32427445m2536993n1979267l5895490j3706867O253678K0823298K3917015
10392C39302819J6933270J1896727K623424q138354r057641q325437j3951866
10385C31282942l5674338n5538060m7142344k9684428j7950060j1502285p414993
10378A26376434m073520p72281K498715N186809O222976P244179O538652P16245
10370A49938209l837620m795459r156421j1648338n952339M64108K573060J149263
$$ y = [270056191, 263604113, 268978709, 280740663, 293158866, 305580082, 322880011, 348511962, 376612517, 404842534, 432153418, 447728372, 434706193, 384845142, 327104216, 296145672, 298694063, 327894888, 371830383, 413830657, 439270943, 432427445, 389890452, 337911185, 302015695, 288308828, 294562506, 315385804, 339302819, 356236089, 368132816, 370756240, 362617886, 353560245, 345234808, 331282942, 295608604, 240070544, 192928200, 163243772, 145293712, 133791427, 126376434, 122302914, 121530633, 124029348, 129216157, 135439133, 142683312, 149221964, 149938209, 146100589, 141305130, 132148709, 120500371, 114548032, 115012140, 117585200, 118734463]
10362A18734463k381703r922526j2870220r097801n252894k486130j92367K483081
10354G9013903M966236O571844O608945O353737N280104M122741P711666J1801607
10346A32430783J0314998M748336n895448j5736967j2427477m733685j674483
10339A07026057j877873o626815j0485487p571510m009094k068143j321242Q92948
10331G3958841L160849K798210J440425k178664q031343r277006p496881o390024
10323D7984407n043831l575950k676424k117869j540176j034061r99423r59608
10315C0037065o98196q56441j131856o72249n77208n18998n28694o93419m98052
10306B3861952o7168K47959O87633O86147J221689J638784J479705J289749K78830
$$ y = [118734463, 116352760, 106430234, 93560014, 84462213, 79209319, 76723189, 76530822, 79013903, 83980139, 90551983, 97160928, 103514665, 108794769, 112917510, 120629176, 132430783, 142745781, 147494117, 141598669, 125861702, 113434225, 108700540, 107026057, 105148184, 98521369, 88035882, 80464372, 76455278, 74387135, 73065893, 73958841, 77119690, 79917900, 81358325, 79179661, 71148318, 61871312, 54374431, 47984407, 42940576, 39364626, 36688202, 34570333, 33030157, 31996096, 30996673, 30037065, 29338869, 28482428, 27350572, 26678323, 26101115, 25582117, 25053423, 24360004, 23861952, 23794784, 24042743, 24730376, 25416523, 26638212, 28276996, 29756701, 31046450, 31325280]
10297C1325280j082424j077133M07832J942865K861120J897091L51280k355948
10289C4269963m647833l429037j111440M56321M64806O0939o84262j883659k832575
10280B0663223k599997j735108j178697p24799r10015l87611J25231l9769k14966
10271A2997492j68870m3498j5252J84888K67926L88859Q29314J684637J663802
10262A7789298R10310j42074j813974k679377k059351j166652m32460j21928J8967
10253A0302759M882J7367j53797l7995j00252N7965n85734p22390n28516k03060
10243H051229j86657j73731j99797K71503N7311m4350k7490j91018m28954j18560
10233G009486K66894L34903R301J70953K80596L13124K27614J5026r5372j43627
$$ y = [31325280, 30242856, 29165723, 29573555, 31516420, 34377540, 36274631, 36625911, 34269963, 29622130, 26193093, 25081653, 25537974, 26002780, 26063719, 25379457, 23495798, 20663223, 18063226, 16328118, 15149421, 14424622, 13514607, 13126996, 13252227, 13212458, 12997492, 12828622, 12785124, 12769872, 12954760, 13222686, 13611545, 14440859, 16125496, 17789298, 18699608, 18557534, 16743560, 14064183, 12004832, 10838180, 10405720, 10283792, 10302759, 10307641, 10325008, 10171211, 10133216, 10032964, 10090929, 9505195, 8782805, 8254289, 8051229, 7864572, 7690841, 7491044, 7762547, 7819858, 7775508, 7748018, 7557000, 7128046, 7009486, 7276380, 7611283, 7620584, 7791537, 8072133, 8385257, 8612871, 8627897, 8532525, 8388898]
10223H388898k27337q9857j72396k95638j83763P1223l75592j62925k39257k64841
10213F448515K43166L59999L52406P5814K4402k36191m11599j2815l27797k82107
10203F233793J18105P9493K19548L62132K10737L68771J30019J30955J19430L37493
10193H310476M29757K82071O90698M81441o8293j09117j31868P0487J74979K06731
10183A0337362M3639K19939o3129j38335J72170K56691j08428l83902l71910l56357
10173I607740j76420k96776j47277p931N9424k05528l31863k03158R7121N46394
10163H941726O13757J59659J60923J83388j11397o0892N7001J39764L5491J85212
10153A0304632J77435M02625K13728j4812J00117j64068n78134o61036n61363
$$ y = [8388898, 8161561, 8071704, 7899308, 7603670, 7419907, 7491130, 7115538, 6952613, 6713356, 6448515, 6691681, 7051680, 7404086, 7479900, 7504302, 7268111, 6856512, 6843697, 6515900, 6233793, 6351898, 6431391, 6650939, 7013071, 7223808, 7592579, 7722598, 7853553, 7972983, 8310476, 8740233, 9022304, 9713002, 10194443, 10126150, 10017033, 9885165, 9955652, 10130631, 10337362, 10381001, 10600940, 10537811, 10399476, 10571646, 10828337, 10719909, 10336007, 9964097, 9607740, 9431320, 9134544, 8987267, 8979336, 9038760, 8833232, 8501369, 8298211, 8395332, 8941726, 9555483, 9715142, 9876065, 10059453, 9948056, 9887164, 9944165, 10083929, 10119420, 10304632, 10482067, 10884692, 11098420, 11083608, 11183725, 11019657, 10441523, 9780487, 9219124]
10144I219124p20293o86194k55340J81778l9887k67074J09078K45055N3659r2009
10134G747897l60558k11229l8712j22764r6368N9254J55553J33177K82193n3184
10124G495259n0489K81306J55260K9394k0725n6659N9233m2974j32644j32545
10114G584416p504k87289k56226m71329o48504o21816m40019j20857k64528r6458
10104D369886l90328k53347j20313j74685o0428p9929o4005L71692j05720j26737
10094C366086j00791q1131j06602j90695k01807M0139r267J12959L3909J32141
10084B994941J79581m4165j97783L02335J98731j75283n4417J56251L09958J99440
10074C869589k04597l120k63032k61057j85654k28003l09377k41644N0842K93808
$$ y = [9219124, 8498831, 7812637, 7557297, 7739075, 7699188, 7432114, 7541192, 7786247, 7839906, 7747897, 7387339, 7176110, 7137398, 7014634, 6918266, 6977520, 7133073, 7266250, 7548443, 7495259, 7444770, 7726076, 7881336, 7910730, 7890005, 7833346, 7892579, 7849605, 7716961, 7584416, 7576912, 7289623, 7033397, 6562068, 5913564, 5291748, 4851729, 4730872, 4466344, 4369886, 3979558, 3726211, 3605898, 3431213, 3370785, 3290856, 3226851, 3598543, 3492823, 3366086, 3265295, 3184164, 3077562, 2886867, 2685060, 2725199, 2715932, 2828891, 2862800, 2994941, 3174522, 3130357, 2932574, 3234909, 3433640, 3258357, 3203940, 3360191, 3670149, 3869589, 3664992, 3661872, 3398840, 3137783, 2952129, 2724126, 2414749, 2173105, 2223947, 2517755]
10064B517755q5305j42549N4791k07234q4870n2310k15178k10201q06K6054o7035
10053A533112J45435K52765J86767P0979J91997m17353k39957J9615L3882j77297
10043A599945j63479O7831K42471J95509j10794j9321n0486J3781j62510j04205
10033A508742k3890J9617N8830r2121L9070J50051J48381q975l18590l1197j40771
10022A309147k53903j58448J06164P872J51871k6550K83489L59557P2003o7453
10012A783749L8156j67684P414K1263k38251Q0376k29564k48423j9692K15564
10002A242908j91135r6773K00355J47380M6934P4542L03014L87503R9349k26556
9992A987521l29736k89643j45580J34563K41387J18514r7533M6304O2083p0471
$$ y = [2517755, 2432450, 2289901, 2344692, 2137458, 2052588, 2000278, 1785100, 1574899, 1574093, 1600147, 1533112, 1678547, 1931312, 2118079, 2189058, 2381055, 1963702, 1723745, 1743360, 1777242, 1599945, 1436466, 1504297, 1746768, 1942277, 1831483, 1812162, 1761676, 1775457, 1612947, 1508742, 1484852, 1504469, 1563299, 1471178, 1510248, 1660299, 1808680, 1799705, 1481115, 1449918, 1309147, 1055244, 896796, 1002960, 1010832, 1162703, 1136153, 1419642, 1779199, 1851202, 1783749, 1821905, 1654221, 1661635, 1682898, 1444647, 1525023, 1295459, 1047036, 1027344, 1242908, 1051773, 955000, 1155355, 1302735, 1349669, 1424211, 1727225, 2114728, 2214077, 1987521, 1657785, 1368142, 1222562, 1357125, 1598512, 1717026, 1619493, 1665797, 1727880, 1657409]
9982A657409n9370j5510k80657M7293J59770K07254R4389k5817L1871J69153J87309
9971B173094k84691m75369j85613j73712j77283L961R0074J35904m2583j693l9862
9960A022227J67256J28090k4495m5954K70685K19545J69177L94353R6638k5043
9950B372479l49191m69479l15948l01808k2377J12955M6708k09497l670J39298
9940I99470J15588O5678K13096K07844K14138K10564r7909j52832o5098J37437
9930A847976M5476O8919L53621J88038j1352J8510l07512k13491k20764j28509
9920A640912K13249K24480j33644j67199M3413J98329K33795m22343m94227j25792
9910A210973k49991j73320r7822J28373K99037q5223k64626j0031L9451L42485
$$ y = [1657409, 1598039, 1582529, 1301872, 1349165, 1508935, 1716189, 1810578, 1784761, 1816632, 1985785, 2173094, 1888403, 1413034, 1227421, 1053709, 876426, 880387, 970461, 1106365, 1063782, 1062089, 1022227, 1189483, 1317573, 1293078, 1247124, 1517809, 1737354, 1906531, 2300884, 2397522, 2372479, 2023288, 1553809, 1237861, 936053, 913676, 1026631, 1073339, 863842, 860172, 999470, 1115058, 1180736, 1393832, 1601676, 1815814, 2026378, 1928469, 1775637, 1710539, 1847976, 1893452, 1962371, 2315992, 2504030, 2492678, 2511188, 2203676, 1990185, 1769421, 1640912, 1854161, 2078641, 1944997, 1777798, 1821211, 2019540, 2253335, 1830992, 1336765, 1210973, 960982, 787662, 689840, 818213, 1117250, 1032027, 767401, 757370, 796821, 1139306]
9900A139306r2155l36629k01112M412n8429j61578K21291L18945P59k96718j02858
9889D35234M6199J20416J03158Q6934R8076N2557l26459k05098n9770J63852K84647
9878G99746L6397j80242k11439j80125q183J33685j19498r9197R0029K87837K39743
9867G88753o2874O9326j16984k98586p1252K81938J20206K25414R7927n2173R0569
9856A072264K74916j0936r1441N1794o8901L63833J25243J13082O3967K9267l18404
9845A604684j9162l1262R8273m4899k30890k85261l01814J0312J59726k2192j50441
9834G87074o2962K4227j27846j41519P0858l2253J67537n3162J33396M7282k33428
9823E79204j7197n8922j4220m642j44841n7623J1850L13493O3823P9848J9746
$$ y = [1139306, 1047151, 710522, 509410, 513822, 455393, 293815, 515106, 834051, 834810, 538092, 435234, 481433, 601849, 705007, 791941, 890017, 942574, 616115, 411017, 351247, 515099, 799746, 836143, 655901, 444462, 264337, 256154, 389839, 270341, 171144, 261173, 549010, 788753, 725879, 795205, 678221, 379635, 308383, 590321, 710527, 935941, 1033868, 981695, 1072264, 1347180, 1336244, 1244803, 1296597, 1227696, 1591529, 1716772, 1829854, 1893821, 1923088, 1604684, 1585522, 1554260, 1652533, 1607634, 1376744, 1091483, 789669, 799981, 959707, 937515, 787074, 724112, 748339, 620493, 478974, 549832, 517579, 685116, 631954, 765350, 812632, 579204, 562007, 503085, 488865, 484223, 339382, 281759, 293609, 607102, 670925, 750773, 770519]
9812G70519J10136K65282p8217k85325k5707j00622j51618j51612J44541K60846
9802G58223R3927j12303k12500k7387J85623J14661R2691J83457l8348J58058
9792A196102j4890n6805m8753J1788r2947j76461l37831K4971K7966N5223q4919
9781E03444k00121j48891r6742J4175O8198J57612n665n3388j30377L5043J69518
9770C12806Q8846j49179r9782k72144p5802J52277K23308K20663j05320j26633
9760A69040M5680o6394r0261L02969J49400m4470J49326o2346p7737j63559J01438
9749D13086k8960j50931L0238K14700l1829q4222L2139q8676j02381j15023M6331
9738A34472K27255n3455R111Q1030J73861k36781p16J4908P2426k1518J45520
$$ y = [770519, 880655, 1145937, 1067720, 782395, 756688, 656066, 504448, 352836, 497377, 758223, 852150, 739847, 527347, 499960, 685583, 800244, 892935, 1076392, 1038044, 1196102, 1181212, 1124407, 1075654, 1087442, 994495, 818034, 480203, 505174, 533140, 588363, 503444, 303323, 154432, 57690, 71865, 140063, 297675, 292010, 238622, 108245, 143288, 312806, 401652, 252473, 152691, -119453, -195255, -42978, 180330, 400993, 295673, 169040, 214720, 148326, 58065, 361034, 510434, 465964, 615290, 552944, 475207, 311648, 413086, 384126, 233195, 263433, 478133, 446304, 362082, 394221, 305545, 203164, 88141, 134472, 361727, 308272, 317383, 398413, 572274, 335493, 334777, 349685, 422111, 400593, 546113]
9727E46113j21955j04953j11801j10689l1967O7680N5051j37647j28235j28046
9717b06449K77962K26606N227j287m2445j50807q5742m93730J392K09324M8567
9706b11382J53582Q1109J21082J91934P0706k46867M3411K13831J30848j71573
9696C76681N3465N7706o4341J17781j75885K764J2377K39708l7068k83678J13707
9685D13217N0849r0393O5117J01173L9647L0704j47690N287L0690j60760k31005
9674A06836k02424K43918J97124k08206j81589K7672P765R1596J77868J85336
9664D45896j13620j35026l21745r8206p7240L596L07417J44450J24420j42603
9654A37339l51730J80758K50375q841q2729j78973j64931Q4725J5173K54956o6524
$$ y = [546113, 424158, 319205, 207404, 96715, 64748, 132428, 187479, 49832, -78403, -206449, 71513, 298119, 303346, 302059, 259614, 108807, 23065, -470665, -469273, -259949, -211382, -57800, 23309, 144391, 336325, 407031, 160164, 203575, 417406, 548254, 376681, 430146, 487852, 423511, 541292, 365407, 368171, 380548, 620256, 583188, 299510, 413217, 464066, 373673, 438790, 539963, 579610, 610314, 462624, 467911, 498601, 337841, 106836, -95588, 148330, 345454, 137248, -44341, -16669, -8904, 82692, 260560, 445896, 332276, 197250, -124495, -222701, -299941, -296345, 11072, 155522, 279942, 137339, -214391, -33633, 216742, 207901, 125172, -53801, -218732, -134007, -118834, 136122, 69598]
9643F9598k86009L4027L90042o7896j13010O569k2146q1754J73634n6050j039
9632D5966n2291K26186j05801j49451k28961J81878L0456J15586L720R9696R0440
9621B57424J0421j69249q8348k53786J26556L13655J99676Q6284j04133p1381
9611C07119j45004k50460j30275K5642P8208j66730K04050K54363k40963j11264
9601a75314Q0613J04910o9188j95263j61408Q1507N3183N5310J7112J09363j83238
9590b82413j6280P8895K02471P1797p3620P9971J42634m9709n6031m0197l7305
9579B0213j09323k49826P5613J80186N9642J18500J00315j47721j363j11537j54118
9568b19419J23497j63695j62793J87100J65282n8315j41706r1454Q4424K47428
$$ y = [69598, -216411, -182384, 207658, 139762, 26752, 33321, 11175, -70579, 103055, 47005, 45966, -6325, 219861, 114060, -35391, -264352, -82474, -52018, 63568, 67288, 166984, 257424, 267845, 98596, 10248, -243538, -116982, 196673, 396349, 482633, 378500, 307119, 162115, -88345, -218620, -192978, -114770, -281500, -77450, 176913, -64050, -175314, -94701, 10209, -58979, -254242, -415650, -334143, -280960, -225650, -208538, -99175, -282413, -298693, -219798, -17327, 54470, -19150, 60821, 203455, 153746, 97715, 57518, 20213, -89110, -338936, -263323, -83137, -23495, 95005, 195320, 47599, 46236, -65301, -219419, -95922, -259617, -422410, -235310, -70028, -128343, -270049, -361503, -277079, -29651]
9558b9651J67780P82P0410M4839j36921j32024k34061P0206J79598R3128j48228
9547e4142j56822J8747K6643J31083R6064j64965j41180J98362j5565M021j54985
9536b12739K20473j3662j44415q9443J02010Q2163O2494k3798j35521n3153K66826
9525F1235P1883k95129n0750J52756j77553K463J4057J63882K3111J38234L00129
9514D04318k18348k75867o0128p1007L6864J01229M8645r7447O8656J20783J21250
9503A78948P4384j10281k23739k7799Q9686m1614j72124J9840J76538P4747K544
9492D1130k10852l85112o0561N8563J91712j1434K36652J70453j15988k72408
9482c57845R9215L21262k407k46479o1339m7211J58451k9223O7131l494N7375
$$ y = [-29651, 138129, 138911, 209321, 254160, 117239, -14785, -248846, -178640, 958, 94086, -54142, -210964, -192217, -165574, -34491, 61573, -103392, -244572, -46210, -61775, -57754, -212739, 7734, -5928, -150343, -239786, -137776, -55613, 6881, -16917, -152438, -205591, 61235, 133118, -162011, -212761, -60005, -237558, -235095, -221038, -57156, -34045, 104189, 404318, 185970, -89897, -150025, -221032, -184168, -82939, -34294, -131741, -63085, 57698, 178948, 253332, 143051, -80688, -108487, -18801, -60415, -232539, -212699, -36161, 38586, 41130, -169722, -554834, -615395, -556832, -365120, -376554, -139902, 30551, -85437, -357845, -258630, 62632, 60225, -186254, -247593, -294804, -136353, -165576, -98445, -101939, -44564]
9471d4564j7913L70058j03606k47342m28257q1439J66969K42869J69337j51261
9461a25149k18078m3442K033n4053K21508Q1667J486q6133j64217o7L2395K38996
9449a13054J01967L5493j13655P8463J64268k5684j27263J41153j27384j09288
9439i4984L6924k34235L9635J41754m1509j51096K23816J15040O9792R841j53921
9428c8943N0847k7112q0019k34781R1004J05077J74790J76543j02186j63220k41792
9417b89792O2462K29827l6674q55K13951m2777o9360j39930N212K06068o0239
9406G7893q4989l8222j15939O9700K45573r2865Q8439J9025j90939j90455O4958
9395a47821K67956k909J33631K03906M9879k19902l18788k39409K3662M3515J30267
$$ y = [-44564, -62477, 307581, 203975, -43367, -471624, -553063, -386094, -143225, 26112, -125149, -343227, -386669, -384636, -438689, -217181, -135514, -134028, -220161, -384378, -384445, -352050, -113054, -11087, 24406, -89249, -10786, 153482, 127798, 535, 141688, 14304, -94984, -58060, -292295, -252660, -110906, -152415, -303511, -79695, 35345, 105137, 114978, -38943, 11904, -15208, -95227, -330008, -239004, -133927, 40863, 217406, 115220, -48000, -289792, -227330, 2497, -34177, -35032, 178919, 136142, 66782, -73148, -67936, 138132, 77893, -7096, -45318, -161257, -91557, 154016, 61151, 149590, 168615, -22324, -212779, -147821, 120135, 117226, 250857, 454763, 504642, 284740, -34048, -273457, -249795, -206280, -76013]
9384g6013L53458K29049k03828n3202P4794l2564j31070o2982j08760j12668J22267
9373a519L03840J28834k5765j20492k10337j52539k13924J03781N6395q7575j41921
9362c61222P7636K32858j5589l6058j13753J03683K43245M7506J2364J33927r1384
9351B33213j72676J08872j45292j35083m3967P440K58212J86442l3861k31642
9341C1658J61028r1743j8703p0902j69909j35934j19789M0817J91393R2305Q1450
9330h329q0353j79870o8982K6882p931n5555L6422R8805L26170N1745L615p0632
9318G1987R4404m7625J00528J28928j87694m2333n6064m8984j56811n2329J44390
9307e1603J46762j63393P1798j06344j31538J82665K00994m7948k57605J00589
$$ y = [-76013, 277445, 506494, 302666, 249464, 324258, 291694, 160624, 97642, -11118, -123786, -1519, 302321, 431155, 405390, 284898, 74561, -77978, -291902, -188121, -131726, -219301, -361222, -283586, -50728, -66317, -102375, -216128, -112445, 130800, 178306, 190670, 324597, 233213, 60537, 169409, 24117, -110966, -154933, -147493, 110719, 297161, 263300, 31658, 192686, 100943, 82240, 11338, -158571, -294505, -414294, -373477, -182084, -89779, -8329, -88682, -268552, -337534, -310652, -318583, -374138, -337716, -238911, 87259, 139004, 142619, 71987, 166391, 118766, 219294, 348222, 160528, 118195, 62131, 13147, -143664, -195993, -51603, 95159, -68234, 3564, -102780, -234318, -51653, 149341, 101393, -156212, -55623]
9297e5623J60458k4981k64821P1633K31334J80786P9453k05435j70349l0459k0507
9286d8511J62995N4259j80980k14345L2963P6185J56471N7435J60979J03575J32096
9275D93122L3787l8644l39501k37384k18539R0893K06200m8568j02518o3741j191
9264b26084j8302R7845m3947J81897R7177J09858n3149j81731J0843J87231j03461
9253E8177l74812P2263Q6023p3209P2768k0895m0722L1135K12363K3981J19408
9242A66480M7808M6362K04023N2407l19254j04768J48284j48878j13758L8511
9232A7217K32276j03160M1769K8786j0495j98580j14729L001p7191J78099M7879
9221D4872m3149n2468o0513k40947Q2482J56808m5013p03k28466J21810K6185
$$ y = [-55623, 104835, 79854, -184967, -113334, 118000, 298786, 378239, 172804, 2455, -28004, -48511, 114484, 168743, -12237, -226582, -193619, -117434, 39037, 96472, 257451, 361026, 493122, 526909, 488265, 148764, -88620, -307159, -216266, -10066, -58634, -161152, -224893, -226084, -244386, -146541, -190488, -8591, 88586, 198444, 145295, -36436, -25593, 161638, 58177, -316635, -244372, -158349, -231558, -158790, -179685, -220407, -189272, 23091, 47072, 166480, 214288, 260650, 464673, 517080, 197826, 93058, 241342, 92464, -21294, 17217, 249493, 146333, 188102, 216888, 206393, 7813, -106916, -103915, -181106, -3007, 44872, 1723, -50745, -111258, -352205, -269723, -112915, -157928, -158631, -387097, -265287, -239102]
9210b39102Q9867k4983J51425K3754J64137n3466j10327j01822j93960J25971
9200a68506L18326l3795k39978J0293Q2610J87193J34967l7945j41076J24984
9190B37073Q4700r38m32700j61047K57460J95889m7345J66999K2182j35057M6017
9179B33233Q7403p1948m88281l84317J54713L06962J86967M4006l6252K7288J4058
9168G3832J70982K32551j74566j95956K46960M0340j54205N5129j02412m48792
9158b56137j93605J0651M0752K17577J52526N7942k67178j23283Q3534m538l1613
9147c13372Q0146J21265r6049m8648J30627K12547K0969n0465j84315n2050J31480
9136d7865j27459j06580N8348k6806J39806Q065J81161P6148j63873k96235n6490
$$ y = [-239102, -149235, -174218, -22793, 961, 165098, 111632, 1305, -100517, -294477, -168506, 149820, 116025, -123953, -113660, -31050, 156143, 291110, 253165, 112089, 237073, 321773, 320835, -111865, -272912, -15452, 180437, 133092, 300091, 322273, 187216, 233233, 320636, 248688, -239593, -623910, -469197, -162235, 24732, 68738, 32486, 59774, 73832, 244814, 477365, 302799, 106843, 353803, 394143, 239938, 295067, 192655, -256137, -449742, -439091, -398339, -180762, -28236, 29706, -237472, -360755, -277221, -281759, -313372, -233226, -111961, -208010, -256658, -126031, 86516, 107485, 57020, -127295, -179345, -47865, -175324, -281904, -223556, -250362, -110556, -102491, 78670, 154818, -9055, -305290, -361780]
9125c61780J29099k6516K86473J20111k70869P9501J55740j18487k6280L4794
9115A786k13224j26442J80377l4757J60329R6280K10616J32985j33492j06898
9105A67560K99372j23812k59069O6849l1479L7745O4084n2024o7775k57746k17461
9094c73756K0460k3450j0243J38198K58301J21629M6923k09394n1593J70125p6032
9083A1168o2534k21910K87277J81717m7848j61861k35945L0167J48938K05562
9073A34731L1114q0896j01434j06444j30677K59562j23681k01086K21295J62641
9063F5125L9661j08424k01344K11572R153r9359r7839m7899K25166P1193J16841
9052A83846M9355J06426M3760r8727J36882J04846j01528O3469j81979j88558
$$ y = [-361780, -232681, -259197, 27276, 147387, -123482, -43981, 111759, -6728, -33008, 1786, -211438, -337880, -157503, -192260, -31931, 64349, 274965, 407950, 274458, 167560, 466932, 343120, 84051, 150900, 119421, 157166, 221250, 169226, 101451, -156295, -373756, -353296, -376746, -386989, -248791, 9510, 131139, 178062, -31332, -82925, 87200, 11168, -51366, -273276, 14001, 195718, 147870, -13991, -249936, -219769, -70831, 134731, 165845, 84949, -16485, -122929, -253606, 5956, -117725, -318811, -97516, 65125, 104786, -3638, -204982, 6590, 15743, -83616, -181455, -229354, -4188, 67005, 183846, 233201, 339627, 383387, 284660, 421542, 526388, 424860, 488329, 306350, 117792]
9042A17792J42191n9834l8260J37199J1966q7306m80828j31612M47460O3882j45090
9031b2440j51234L4300R559j29187j24517K03826L15273J95106L9003j18855l21705
9020g0871j05377j51446k9455Q5534J65860J74455P896J01449n5329k69685k14662
9009c61631j3097K57693Q4281j18571J58580J49483l40608n0915J86397k92836
8999c41224j87490M1562p8153N3592J31707P8257Q7781J82038J90962O2635j74733
8988D6934J74472J87472J08840J4788n7661k00252N2625k39302j40582L20290
8978B67624K4278k83246j89268R7175J59895J01238J29794j17753j02568P7636
8968A64805P6398m3354o9033K57438k58845k09688r1834K66106J41486n1583k11747
$$ y = [117792, 259983, 200149, 161889, 299088, 311054, 223748, -257080, -388692, 58768, 122650, -22440, -173674, -139374, -129815, -259002, -383519, -179693, 135580, 330686, 369689, 250834, -70871, -176248, -327694, -357149, -271615, -105755, 68700, 76596, 178045, 122716, -146969, -361631, -374728, -117035, -32754, -151325, 7255, 156738, -183870, -234785, -48388, -341224, -528714, -487152, -565305, -511713, -380006, -301749, -213968, -31930, 159032, 221667, 46934, 221406, 408878, 517718, 532506, 474845, 274593, 327218, 87916, -52666, 267624, 291902, 8656, -180612, -83437, 76458, 177696, 307490, 189737, 87169, 164805, 241203, 197849, 128816, 386254, 127409, -82279, -174113, 91993, 233479, 181896, -29851]
8957b9851m7463j57123k90219J29885J86083O1997N3818K44956j35087j26120
8947a09124j99784J60048Q7011l3892Q1558O0998L2600j68718n5276J73599J82503
8936B11523j58527o6013J85745j58883l18181k0443j35705p23k19K62531o90J5144
8924a84441J2858J5314J44043K13914n0780l64679q7481J87115K74200j1300o2541
8913H6222R7583j62880n0143j40118J4084J97877j26615j13573K17621R0155q927
8902A01286O7117K4974L8317Q8715J69185l03470k61011j94768K29043J47648
8892A07036k51354n3295P5930J4400P8375j70286O8162n7865j52969o2523R8430
8881c05959K91588J4304k72448j59740p1317O6378J32152j23934p8915K01415
$$ y = [-29851, -77314, -234437, -524656, -394771, -208688, -146691, -92873, 152083, 16996, -109124, -308908, -148860, -61849, -95741, -14183, 46815, 79415, -89303, -144579, 29020, 211523, 52996, -13017, 172728, 13845, -304336, -324779, -460484, -461207, -461426, -198895, -199585, -184441, -171583, -156269, -12226, 201688, 150908, -213771, -301252, -114137, 160063, 148763, 86222, 183805, 20925, -29218, -169336, -155252, 42625, -83990, -197563, 20058, 110213, 101286, 168403, 193377, 231694, 320409, 489594, 186124, -74887, -269655, -40612, 107036, -144318, -197613, -121683, -107283, -28908, -199194, -131032, -188897, -341866, -404389, -305959, -14371, -67, -272515, -432255, -503572, -437194, -305042, -428976, -507891, -306476]
8871c06476K76240P5274J22812J62177j84095R2748k2343j42618j51588l29498
8861d07367R6487J93439K4816k35192l19591K19697J09668Q8078M05270j12824
8851F2481j12755j44097K36114K18512N6800j06546m8785K9176J0236l13349J01269
8840a0944n1459k5580R062n742N9699j04851N2491j40860j69998k5955N7706p3835
8828d30266p6978O2884M26667L97072J39530k35656j40746N4664M3239R2196q9823
8817B42783Q4602j2905J11367J71230K33002L23489K74882J13034j83406k61063
8807A097015l03577k22570k41573n8447j68114M1487O6072l8615r8873o0296j32635
8796a20126p3801Q2592J28659N7551Q6818j90965j06386m6676r72K16910j92141
$$ y = [-306476, -30236, 45038, 167850, 330027, 145932, 238680, 216337, 73719, -77869, -407367, -310880, -117441, -92625, -327817, -647408, -427711, -318043, -229965, 175305, 62481, -50274, -194371, 41743, 260255, 317055, 210509, 161724, 190900, 201136, -112213, -10944, -62403, -87983, -78921, -84663, -24964, -129815, -77324, -218184, -388182, -414137, -356431, -430266, -507244, -444360, -17693, 379379, 518909, 283253, 142507, 197171, 240410, 332606, 242783, 327385, 314480, 425847, 597077, 830079, 1153568, 1428450, 1541484, 1358078, 1097015, 793438, 570868, 329295, 270848, 102734, 144221, 210293, 171678, 72805, 12509, -120126, -193927, -111335, 17324, 74875, 161693, -29272, -135658, -182334, -183306, 33604, -158537]
8785a58537J7822K92072l3162k7509J2788J66325j15046j57897J47593L09337
8775D53786K9588l95353n5715J6946K93882L21737J09943O2492J29736p2921q2914
8764H11207k1205m7588k00440k69040Q7857J12930P685j11177r2742j00150k37046
8753e9709K8725M3678J34754o2549j67435O6930j6610l18309l4327R9391N3176
8742b32285J49432K00169K37148r2991l30021J12213J63430K03841R9447k17678
8732B92705k82109J28222O5181J46287M6703n0331o0163J03329j65639q1008J57074
8721C00251K996j04775M2211j61873k855P2044k14228J56911K05641J18206O1696
8710D76225k73368k21608p1711J99790M7314q4180j28051k7413o8675K57137J4324
$$ y = [-158537, -140715, 151357, 118195, 90686, 103474, 269799, 154753, -3144, 144449, 453786, 483374, 88021, 32306, 49252, 343134, 664871, 774814, 837306, 967042, 894121, 811207, 790002, 742414, 541974, 272934, 360791, 473721, 481406, 370229, 277487, 177337, -59709, -30984, 12694, 147448, 84899, -82536, -15606, -32216, -350525, -384852, -285461, -232285, -82853, 117316, 354464, 261473, -68548, 43665, 207095, 410936, 510383, 292705, 10596, 138818, 203999, 350286, 396989, 346658, 286495, 389824, 224185, 143177, 300251, 303247, 198472, 240683, 78810, 75955, 147999, -66229, 90682, 296323, 414529, 476225, 202857, -18751, -90462, 109328, 156642, 72462, -55589, -83002, -151677, 105460, 119784]
8699A19784m7195j61098j15399j27066q7374J14734j6664J59967m3941J67534
8689c6718P8984j7006k49319p8233R178M0144O9261J50975J97323K51256k5342
8678C90503k46584j30315r748j07694k51918j82873K46049K12849M1056j10841
8668a49516k92282J62300K35862O4345J14700J52191K16462N0977m3382j69742
8658C41915j28991R7742J35427m0214j18006k26585m4869l9783K2521O0181J61143
8647B20481N6714m8215j69059j91454j43756O0637L54896O0046m380p1417l11191
8636a86698m0523Q9690J35979J92991J20584n0251k42037J31667k7967k2308o5799
8625C5328k6993K02870O0739j39337Q2387P0699j80709o7751j35700k0376J25321
$$ y = [119784, 72589, -88509, -203908, -330974, -418348, -303614, -320278, -160311, -204252, -36718, 42266, 25260, -224059, -302292, -293114, -252970, -183709, -32734, 164589, 415845, 390503, 143919, 13604, 3856, -103838, -355756, -538629, -292580, -79731, -38675, -149516, -441798, -279498, -43636, 20709, 135409, 287600, 504062, 555039, 511657, 341915, 212924, 310666, 446093, 405879, 287873, 61288, 16419, -23364, -843, 59338, 220481, 277195, 228980, 59921, -131533, -275289, -214652, 140244, 200290, 195910, 124493, -186698, -227221, -137531, -1552, 191439, 312023, 261772, 19735, 151402, 123435, 101127, 35328, 8335, 211205, 271944, 132607, 214994, 285693, 104984, 37233, -98467, -118843, 6478]
8614F478L1522R9505N6803q1698L1609j37190k30786k47031K51496K51254P927
8603C9889N6393l3318R0144q9373j92325K22393L31578P8836k36848J74412J90803
8592F32584M2434k46010n2411O4763j96253j13817q2354J21447K93006J15349
8582E78738k61158j18401q8602J92549Q3458O5332j44746r717K09433K19936l47116
8571C79706j36814K59614K85939j00327L3896j04564p5884o2864Q3113J11130
8561F72945K87597K71478K01189R9651k58702o9412l46102n54235R4722l3343
8551C65788m3012K07021j457k12215o8969N0500j42913k54684L8071J15287k1506
8540C1911k05262J88719Q1116q946k2574J36406R5901j46404j2722N4045J22598
$$ y = [6478, 38000, 137505, 194308, 112610, 144219, 7029, -223757, -470788, -219292, 31962, 39889, 96282, 62964, 153108, 63735, -128590, 93803, 425381, 504217, 267369, 441781, 632584, 675018, 429008, 376597, 441360, 245107, 131290, 48936, 170383, 463389, 578738, 317580, 199179, 110577, 303126, 386584, 451916, 307170, 297453, 506886, 726822, 379706, 242892, 502506, 788445, 688118, 722014, 617450, 541566, 478702, 561815, 672945, 960542, 1232020, 1433209, 1532860, 1274158, 1204746, 858644, 304409, 399131, 365788, 322776, 529797, 528340, 316125, 247156, 297656, 154743, -99941, -61870, 53417, 31911, -173351, 15368, 96484, 87538, 64964, 201370, 297271, 150867, 138145, 192190, 314788]
8529C14788k03535k5155J18903J61715n0219k21285q836J35664R4506J10059N4149
8518D80754K35987L0515J70523M2512L3007J39054k1184n6375j82494l19837k22123
8507C30339M6280J4026o7745l28850k26810J08918O5870M0223m927J58058J60810
8496B96192P5338k82702r6670l9735j80305K7852J60569J15940L0497j9994j242
8485H5740J10726j37639r0258J59036J80126j8948L9094j87433o2672K0559j70708
8474g2377r5422O7465J53027L20090L31211j57177o1441q1583K6415Q1396j13259
8463C98345j71645J9792k59572n104J19060P9869j7846n0399k45896j46440K48972
8452c0864K66777R2473O2399J40571M3170k17871k48057p4261K90769m7599l35235
$$ y = [314788, 111253, 86098, 205001, 366716, 316497, 95212, 86376, 222040, 316546, 426605, 480754, 716741, 747256, 917779, 960291, 993298, 1132352, 1111168, 1054793, 872299, 552462, 330339, 376619, 390645, 322900, -5950, -232760, -123842, -57972, -17749, -22676, 135382, 296192, 371530, 88828, -7842, -47577, -227882, -200030, -39461, 76479, 106976, 86982, 85740, 196466, 58827, -31431, 127605, 307731, 288783, 327877, 140444, 77772, 98331, -72377, -167799, -100334, 52693, 372783, 703994, 546817, 485376, 403793, 430208, 511604, 398345, 226700, 246492, -13080, -18184, 100876, 180745, 162899, 112500, -133396, -279836, -30864, 235913, 328386, 390785, 531356, 574526, 356655, 108598, 34337, 325106, 277507, -57728]
8441e7728L0288J26303l1390m7053j38495k36331j30810Q9792L61882j88152j10210
8430c31904J06998J45194n2640n7629q650K0081n8154L7506J95352J28323m66
8419A24011N5438n4037n1975k2263q6868k75663j22321l5711K02888K33975p8710
8408a11236j67802K3477k9041p3061K53238L75198r3033o9113K01326j37418j0296
8397A62239L7413K24729j40041j09106j14673L6577j38875n2433Q4402J53695
8387A43927p2439N2147K2838m5853Q5282Q6579O8952k1672Q0425J49485N1485
8376F01156j97619k20606j57288n4975Q2362o0923M4578m5985J25744l2894Q0535
8365A64085m2943q3999N958q1033Q0182J06197K21081J13326j60459l18278L1067
$$ y = [-57728, -27440, 98863, 67473, 20420, -118075, -354406, -485216, -395424, -33542, -221694, -331904, -224906, -79712, -132352, -189981, -198631, -178550, -236704, -199198, -3846, 124477, 124011, 179449, 125412, 73437, 51174, -35694, -311357, -433678, -469389, -266501, -32526, -111236, -279038, -255561, -284602, -357663, -104425, 270773, 177740, 108627, 309953, 172535, 162239, 199652, 424381, 284340, 175234, 60561, 97138, -41737, -94170, -9768, 143927, 71488, 123635, 146473, 100620, 185902, 272481, 341433, 319761, 400186, 549671, 601156, 403537, 182931, 25643, -29332, 53030, -7893, 36685, -9300, 116444, 83550, 164085, 121142, 37143, 43101, -37932, 42250, 148447, 369528, 482854, 322395, 4117, 35184]
8354C5184J42125P9201q9361n1729j01618j06425J86963J23490q3302J98784o3125
8343B70187l2138o9025k13740q4007Q7859J94994L7227k01978J20422K4407Q0016
8332B14224J28948l84071j06787Q8125k0958k13195L5955K31906k1436O5606J76925
8321A95242K3490q1150q5392l45209J86236J28548k15588p2913K20099J15807
8311F9170P1751n8186m5116J32965j6726j75113k9384l783j39298j97576K1098
8300c70198p7786p3556J92458K25363L7571o037o7481J2655j0616j50498J87099
8289a01026L28957K85579l21533k11236P2894j64338j13447J58289M76687k7452
8279C83374k95109L9534k4079k73967p8227J34432K25240p9526k82738P6279L6856
$$ y = [35184, 177309, 256510, 167149, 115420, 13802, -92623, 94340, 217830, 134528, 333312, 270187, 238049, 169024, -44716, -128723, -40864, 154130, 191357, -10621, 109801, 134208, 214224, 343172, -40899, -147686, -59561, -80519, -293714, -257759, -25853, -47289, 18317, 195242, 218732, 137582, 52190, -293019, -106783, 21765, -193823, -266736, -46637, 69170, 140921, 82735, 37619, 170584, 153858, -21255, -50639, -54422, -193720, -391296, -370198, -447984, -521540, -329082, -103719, -66148, -72185, -139666, -127011, -137627, -288125, -101026, 227931, 513510, 191977, -19259, 53635, -110703, -224150, -65861, 410826, 383374, 88265, 127799, 103720, -170247, -248474, -114042, 111198, 31672, -251066, -174787, -137931]
8268a37931j1336M9097L4211M9587J94498k53872o0461j26988k19374J84384K16732
8257h1453O1635K128j66458j0896J64888K60567n6810j8898q1798j7994q1575
8246b6664p5309R2836n9224n0088J01298J93610j0799o8384K6871k3307J2745
8235A13585R2888k11941n608J48492J83968J64908K4799k72006n17163m2624K41777
8224g8925J02659n2480R8757m0165j86116l66113l303O9129J10445J95415J1642
8213a39055p0103p0219K5870J06432J30634O6545J2318m1655K61524J33829K8197
8202D44317k18166l09827j47029L1909J66722p8522L6609J93647J7209n9600j15235
8191c7966Q6663J69744J32707m7632n9000k02753l0833R0136K75023K85229l11923
$$ y = [-137931, -149267, -100170, -65959, -16372, 178126, -75746, -136207, -263195, -482569, -298185, -81453, -19818, -17690, -184148, -195044, -30156, 230411, 173601, 154703, 72905, 54911, -26664, -101973, -9137, -68361, -118449, -17151, 176459, 165660, 97276, 124147, 100840, 113585, 206473, -5468, -11076, 137416, 321384, 486292, 511091, 239085, -278078, -320702, -78925, 23734, -28746, 70011, 29846, -156270, -522383, -525686, -456557, -346112, -150697, -139055, -209158, -279377, -253507, -147075, -16441, 50104, 62422, 20767, 282291, 416120, 444317, 226151, -83676, -230705, -198796, -32074, -110596, -73987, 119660, 136869, 77269, -37966, 48697, 218441, 351148, 303516, 244516, 41763, 10930, 101066, 376089, 661318, 349395]
8180C49395l70214M737N592K41022J23150j39150j28012N2012p9315n8716p686
8169g185j74746k72540R424K47240J92165m2766J6428J2620j64641k30940K52556
8158a62385L39005M0245p814L17130K1128j29168k50115l78936q5451K95354j0700
8147a1707j31237J79254Q4217j41502J54969P9682J08006l77684k95089J6687
8137c34404K34340P6111R297j24257M3949l411K14590P0317j98373j88413o5446
8126b65700K77413O9204j09220K4704O6027j6623r4253N1419J26950j61893O4401
8115C2429r4072l08286p3231L79270J81104M5498J942j04135j29755p6074L0168
8104a15142K12823j07600J07251L0913r9526J8440j69495m0904N8604J33709J08652
$$ y = [349395, -20819, -16082, -10490, 230532, 353682, 214532, 86520, 138532, 59217, 501, -7185, -181931, -454471, -445047, -197807, -5642, -48408, -31980, -19360, -184001, -414941, -162385, 176620, 216865, 209051, 526181, 547309, 418141, 168026, -210910, -296361, -1007, -11707, -142944, 36310, 120527, -20975, 133994, 213676, 321682, -56002, -351091, -334404, -100064, -23953, -14656, -138913, -94964, -98375, 116215, 186532, -11841, -200254, -265700, 11713, 80917, -28303, -3599, 62428, 45805, -48448, 2971, 129921, -31972, 32429, -61643, -369929, -443160, -63890, 117214, 162712, 164654, 60519, -69236, -145310, -115142, 97681, -9919, 97332, 128245, 28719, 47159, -122336, -163240, -104636, 29073, 137725]
8093A37725o3228k47540M0812N4781O744J08074J33763J07695r2627l08383k01448
8082c23632M1059J11703K00142n655o6228J81293L7422J6242j31423j89930L259
8071a25748q0009o933K69712K07394j87696Q3465J6641j50569j32702j17823j21561
8060c45829J39601K89690R6735k56478j92163j2015j91386J42347K11043J63092
8050D4637k4587p848j23248n8738r0257q9267j18455l1809N3217j8378J57271
8039c07462J21258N6262J80038J2288J03829O5844k03533n2564K5217R9395j41552
8028d0980K0843j14440N9384L07199J74509k91221j43596P8294K05543j57958
8018I7577j31100J71978q2156q4362j40356q1167N3747L8254J3237j06723P5630
$$ y = [137725, 74497, -173043, -132231, -77450, -70706, 37368, 171131, 278826, 186199, -122184, -323632, -282573, -170870, 29272, 23617, -42611, 138682, 176104, 192346, 60923, -129007, -125748, -205757, -212690, 57022, 264416, 76720, 160185, 176826, 26257, -106445, -224268, -345829, -206228, 83462, 180197, -76281, -268444, -280459, -471845, -329498, -118455, 44637, 20050, 12202, -111046, -169784, -260041, -349308, -467763, -499572, -446355, -464733, -307462, -186204, -129942, 50096, 62384, 166213, 232057, 28524, -24040, 1177, 100572, -40980, -20137, -134577, -75193, 232006, 406515, 115294, -28302, 49992, 255535, 97577, -33523, 138455, 56299, -28063, -168419, -249586, -195839, -157585, -144348, -251071, -175441]
8007a75441O2312J35111J75108j78112N5070L51872L06982q3337m17009k29825
7997B731P5683n07j84347l7644J17947J05068k24520P418J41423q9440j49650
7986b35838K1744R1719J78009m0133j23858K09264j53147L9401k7925j11661j04021
7975b56446O8569R4946J06602J93666P9561k82122k29312q4431J00584K05109
7965c274N4964j85109k75882n4425J62635o8603J13718J60583J88085k9484J19339
7954A82547j16314k17088k2336N2476L0189J03122q1905l7451L17957O3468m8730
7943B25935j24436j45978K73350L42746l8625j97131k97049P306P3867j20585
7933f00J39386K18477J00071L39K06849k29953O163n3225j7696j84117j89429
$$ y = [-175441, -113129, 21982, 197090, 18978, 74048, 425920, 732902, 649565, 232556, 2731, 78414, 77907, -106440, -144084, -26137, 78931, -145589, -138171, 3252, -86188, -235838, -214094, -122375, 55634, 15501, -108357, 100907, -52240, -12839, -40764, -152425, -256446, -187877, -92931, 13671, 207337, 286898, 4776, -224536, -308967, -208383, -3274, 51690, -133419, -409301, -463726, -301091, -369694, -255976, -95393, 92692, 63208, 182547, 66233, -150855, -173191, -120715, -90526, 12596, -69309, -106760, 211197, 274665, 225935, 101499, -44479, 228871, 571617, 532992, 335861, 38812, 46118, 119985, -600, 138786, 357263, 457334, 457673, 664522, 434569, 440732, 387507, 369811, 185694, -3735]
7922c735k23291o8715K77316K17541J5839R3525p3804J56994m2172k47388n2826
7911D9284Q7878k762j57124J6209o7589j63521J02019Q7471K57716k39791k1545
7900e1755l4278j97152R7475j57282L9945R5385J39517L00412Q2852o6773j87437
7889F0909q3107J80436N2651j32722J5801K0041k22555j09299l9062k03573K2593
7878d37887J16909K19655J61016p9592j20935K68391j600o4576P3774J00592r9670
7867A36077L24785p3866l49225N432J43557P1732L5459m3549m7241P0288J7339
7856B90788k40165k09291K31312J09381j45250j36982L0574K06210M4835J45660
7846C27072k85197j55970J38019M10278O1752o9114j60256j16399J74029L16106
$$ y = [-3735, -227026, -295741, -18425, 199116, 214955, 308480, 234676, 391670, 349498, 102110, 49284, 137162, 134400, -22724, -6515, -74104, -237625, -135606, -48135, 209581, -30210, -51755, -86033, -283185, -185710, -342992, -303047, -207662, -68145, 232267, 315119, 248346, 60909, -22198, 158238, 210889, 78167, 93968, 114009, -108546, -217845, -256907, -460480, -437887, -320978, -101323, 59693, -19899, -140834, 127557, 125957, 61381, 135155, 235747, 136077, 460862, 386996, 37771, 43203, 186760, 258492, 293951, 250402, 203161, 273449, 290788, 50623, -158668, 72644, 182025, 36775, -100207, -69633, 136577, 181412, 327072, 41875, -114095, 23924, 434202, 495954, 426840, 266584, 150185, 324214, 640320]
7836F40320n9886l47372j49966o8050j49023k71856K8162p8491K4157K04690P1569
7825a55746l7568J88657M7930N9850L3921k8639J05395m8707o0110j66878n124
7814f7019K44610M2382r1275j48752k05898N7609J06243n7407J35603j3018q2772
7803g9694P439O8395n2484J91021K93230L7120j64226k78645q0862P7349J0456
7792B9099K3063J45692N3695J99190k08279k42176L4074R0733j09146j2163n2764
7781d8982k24634j64254Q7736J37713J38445q7925J15620K64147R2123J7860o0975
7770B66874J59008N433k00732k11926q2109J0197j55944q3400K14081R4170j28363
7759a12711n3737K25760j0100J33796j30491m48198O5093J72098q3928p6947J93818
$$ y = [640320, 580434, 233062, 83096, 15046, -133977, -405833, -377671, -456162, -432005, -227315, -155746, -193314, -4657, 43273, 103123, 137044, 108405, 213800, 165093, 104983, -61895, -67019, 177591, 219973, 128698, -20054, -225952, -168343, -62100, -119507, 16096, 3078, -79694, -72255, -3860, -56344, 134677, 427907, 465027, 300801, 22156, -58706, 18643, 29099, 52162, 197854, 251549, 450739, 242460, 284, 34358, 125091, 15945, 3782, -48982, -273616, -437870, -350134, -212421, -73976, -161901, -46281, 217866, 309989, 327849, 266874, 425882, 431315, 230583, 18657, -63452, -53255, -209199, -292599, -78518, 15652, -112711, -166448, 59312, 49212, 183008, 52517, -395681, -330588, -158490, -242418, -319365, -125547]
7748a25547O7346J67481O1822L5335k73755k13631J0453q8561K799K03611J11568
7737d1079J56368J61805j50173O6248J51295q3422r4984k29433j24780L47746
7727A59591n6583j1741M5312N4532p3988j4701j26469j78618K2978J65589J58642
7716A44544K7323j3527q2622J57193K39716n4835k43332k35368l39744j49058
7706e49710K56576J40393p4111j27842j93048o5110J0806k1946J35686J35885
7696c52421O5089j05950L081K29438K49020L6940M3177J88283j24723j80472O8022
7685A19484j73282j48270J28244j13026l6768N3049J66443J29192p3424j59876
7675a08234J08231J03325n1184M7561n5745k90580K3027J69357L08077J67053
$$ y = [-125547, -58201, 109280, 171102, 206437, -67318, -280949, -270496, -359057, -356258, -152647, -41079, 115289, 277094, 126921, 193169, 344464, 261042, 166058, -63375, -188155, 159591, 103008, 91267, 136579, 191111, 117123, 102422, -24047, -202665, -179687, -14098, 144544, 171867, 158340, 75718, 232911, 472627, 417792, 174460, -60908, -400652, -549710, -293134, -152741, -226852, -354694, -547742, -612852, -602046, -623992, -488306, -352421, -287332, -393282, -390201, -160763, 88257, 125197, 168374, 356657, 231934, 51462, 119484, -53798, -202068, -73824, -186850, -223618, -170569, -4126, 125066, 51642, -108234, -3, 103322, 52138, 99699, 43954, -246626, -223599, -54242, 253835, 420888]
7665D20888m7633j41728M4298k1724K6647j21604j20020J58751p8212l6341j58964
7654g5642k38724q8313q5106K69910K92635K14588Q3719r8435q7072j24622j51748
7643h8810J40899j51608j33881J54393j0461n9037K12644n6679k32648J230M7253
7632a76705M8690J26285O4598j02559j76701k34860R6096J68738j35162j64142
7622d85722J27996J83574l5062j68889J21974J02683j52106o3337K75253J7458
7612g6178j28752J35038J56986l8514q9440j04122K34760J08891M7330j29767
7602A16232K03L8282j22007n9493J27493O9971l51475l14315K17148J55245K32997
7591A10281J07368n6658j7272j53352n4105Q5540j73032j42298L02584J20584
$$ y = [420888, 373255, 231527, 275825, 254101, 280748, 159144, 39124, 197875, 119663, 83322, -75642, -314366, -402679, -487785, -217875, 74760, 289348, 373067, 274632, 187560, 62938, -88810, 52089, -99519, -233400, -79007, -89468, -148505, 64139, 7460, -225188, -223958, -176705, -128015, -1730, 62868, -39691, -216392, -451252, -355156, -186418, -321580, -485722, -357726, -174152, -209214, -378103, -256129, -153446, -305552, -368889, -93636, -76178, -204930, -69892, 87094, 48580, -40860, -144982, 89778, 198669, 245999, 116232, 116435, 154717, 32710, -26783, 100710, 170681, -180794, -495109, -277961, -122716, 110281, 217649, 160991, 143719, -9633, -63738, 21802, -151230, -293528, 9056, 129640]
7581A29640M248j80287k44942j46406J40009L00092K0497M4966L837l7291K24206
7570B58569J02060k9818j60092k53831q7859n238J86462p2143J06541l6139m5412
7559c6900j43470R228K5639n4096m59955Q3006J48873K00203K70627r8578J3162
7548d2261K18882k61578k04944j07417o619Q9033L03970K50945P9649J0701j85228
7537A45133O1516k62211k78350K29294J62499n7043J19882q9811K45076J99742
7527D75727k98684j62542k80674L3272r633j72838J42699K30970j07306k3218
7517a72227J55682K29419j63535j19059k2045j15127K5369K01071J14543q8982
7507D5109N7276Q62q2400K03635N0859j04642j18116j86779J41181M1748m7466
$$ y = [129640, 133888, -46399, -291341, -437747, -297738, 2354, 22851, 67817, 71654, 34363, 258569, 360629, 330811, 170719, -83112, -170971, -176209, 10253, -61890, 44651, 8512, -36900, -180370, -171142, -145503, -199599, -659554, -576548, -427675, -227472, 43155, -55423, -42261, 176621, -84957, -289901, -397318, -403937, -314904, -10934, 240011, 319660, 330361, 145133, 206649, -55562, -333912, -104618, 57881, 838, 120720, 30909, 275985, 475727, 177043, 14501, -266173, -232901, -242534, -415372, -272673, -41703, -149009, -172227, -16545, 212874, 49339, -69720, -91765, -206892, -181523, 19548, 134091, 45109, 102385, 103247, 20847, 224482, 275341, 170699, 52583, -134196, 6985, 48733, 1267]
7496A267J41679q0766j67814j55122J98760L54339J31211r4827o7164k0555J7311
7485B58319M1790J37825j42761k20220k6790M7197M2993j53991j14679K65754
7475A35437O3669k41213J25806J12167k65733n48510K4113J3165j34587M2258
7465f73428K24757J03332j6039J37670O7211J17915K04199J00102o879M2634j12069
7454A89405j87966O0100J1427j01577J14467j23953o4787n545p3425j10383m8113
7443c40350J07948N9794J43229J89801m1223L5172J13143j02819j17425M3599
7433I0869j89214L0612l5897P669K1197J66588L9556n958L19037j07324j81602
7422A55533m2059j17568j91904K471K70542J0020j25217J40845j88749P4214J93074
$$ y = [1267, 142946, 62180, -105634, -260756, -61996, 292343, 423554, 328727, 261563, 241008, 258319, 300109, 437934, 295173, 74953, 48163, 95360, 138353, -15638, -130317, 135437, 199106, -42107, 83699, 195866, -69867, -618377, -594264, -581099, -715686, -673428, -448671, -345339, -361378, -223708, -156497, -38582, 165617, 265719, 258840, 301474, 189405, 1439, 61539, 72966, -28611, 85856, -38097, -102884, -108429, -181854, -292237, -340350, -232402, -172608, -29379, 160422, 119199, 154371, 267514, 164695, 47270, 90869, -98345, -67733, -103630, -95961, -74764, 91824, 131380, 125422, 444459, 337135, 155533, 113474, -4094, -195998, -193527, 77015, 87035, -38182, 102663, -86086, -11872, 181202]
7411A81202p5763p7371j0668P5914j65064j54813K5506J16379n132j156J72323
7400H1357P9218j56660J46813M2895J65482P8290j23496j50189r2213j3664m1270
$$ y = [181202, 105439, 28068, 17400, 93314, -71750, -226563, -201057, -84678, -89810, -90966, 81357, 160575, 3915, 150728, 193623, 359105, 437395, 313899, 163710, 71497, 57833, 16563]
$$ [...]
##END NTUPLES=NMR SPECTRUM
##END=
