##TITLE=Analysis number 321088
Compound Code cc 13006
Project Code adrs
Chemist Name scarfell organics
##JCAMPDX= 6.0         $$ Bruker NMR JCAMP-DX V2.0
##DATA TYPE= NMR SPECTRUM
##DATA CLASS= NTUPLES
##ORIGIN= Bruker BioSpin GmbH
##OWNER= nmr
$$ XWIN-NMR		Version 3.5
$$ Mon Jul 24 14:15:47 2006 GMT Daylight Time (UT+1h)  MAYBRIDGE\nmr@NMR_250MHZ
##.OBSERVE FREQUENCY= 250.131544655141
##.OBSERVE NUCLEUS= ^1H
##.ACQUISITION MODE= SIMULTANEOUS (DQD)
##.ACQUISITION SCHEME= undefined
##.AVERAGES= 16
##.DIGITISER RES= 18
##SPECTROMETER/DATA SYSTEM= dpx250
##.PULSE SEQUENCE= zg30
##.SOLVENT NAME= CDCl3
##.SHIFT REFERENCE= (INTERNAL, CDCl3, 0, 16.522)
##AUDIT TRAIL= $$ (NUMBER, WHEN, WHO, WHERE, WHAT)
$$ ##TITLE= Audit trail, XWIN-NMR		Version 3.5
$$ ##JCAMPDX= 5.01
$$ ##ORIGIN= Bruker BioSpin GmbH
$$ ##OWNER= nmr
$$ C:\u/data/dgb/nmr/ADRS/3280/pdata/1/auditp.txt
$$ ##AUDIT TRAIL=  $$ (NUMBER, WHEN, WHO, WHERE, WHAT)
(   1,<2006-07-24 14:15:23.90 +100>,<MAYBRIDGE\nmr>,<NMR_250MHZ>,
      <created by zg, POWCHK disabled, PULCHK disabled
       configuration hash MD5:
       E2 DF 36 D8 04 B2 41 60 5A D7 A3 38 5A 4B D0 FE
       data hash MD5: 64K
       A6 5F 02 D3 C7 8E 33 EA 7C 57 3F CA 20 F2 B4 AC>)
(   2,<2006-07-24 14:15:35.88 +100>,<MAYBRIDGE\nmr>,<NMR_250MHZ>,
      <Start of raw data processing
       ef LB = 0.3 FT_mod = 6 PKNL = 1 SI = 32K 
       data hash MD5: 32K
       03 D9 FD A8 EF 44 40 B8 DC 3C 03 C0 59 53 03 6F>)
(   3,<2006-07-24 14:15:37.57 +100>,<MAYBRIDGE\nmr>,<NMR_250MHZ>,
      <apk 
       data hash MD5: 32K
       B8 18 FD 53 C0 65 78 FC 83 C3 2E 25 55 92 91 8A>)
(   4,<2006-07-24 14:15:38.35 +100>,<MAYBRIDGE\nmr>,<NMR_250MHZ>,
      <abs ABSG = 5 
       data hash MD5: 32K
       57 BA D9 54 26 49 29 06 60 F9 D1 8D BE 3B BA F6>)
$$ ##END=
$$ 
$$ hash MD5
$$ 22 C3 43 FC BB 8C AA F7 9D 11 4D A2 E0 24 B5 80
##$RELAX= 
##$RELAX= 
##$RELAX= 
##$RELAX= 
##$RELAX= 
##$RELAX= 
##$RELAX= 
$$ Bruker specific parameters
$$ --------------------------
##$DU= <C:\u>
##$EXPNO= 3280
##$NAME= <ADRS>
##$PROCNO= 1
##$TYPE= <nmr>
##$USER= <dgb>
##$AMP= (0..31)
100 100 100 100 100 100 100 100 100 100 100 100 100 100 100 100 100 100 
100 100 100 100 100 100 100 100 100 100 100 100 100 100 
##$AQSEQ= 0
##$AQ_mod= 3
##$AUNM= <au_zg>
##$AUTOPOS= <41 >
##$BF1= 250.13
##$BF2= 250.13
##$BF3= 250.13
##$BF4= 250.13
##$BF5= 500.13
##$BF6= 500.13
##$BF7= 500.13
##$BF8= 500.13
##$BYTORDA= 1
##$CFDGTYP= 0
##$CFRGTYP= 5
##$CHEMSTR= <none>
##$CNST= (0..31)
1 1 145 1 1 1 1 1 1 1 1 1 1 1 1 1 1 1 1 1 1 1 1 1 1 1 1 1 1 1 1 1 
##$CPDPRG= <>
##$CPDPRG1= <>
##$CPDPRG2= <>
##$CPDPRG3= <>
##$CPDPRG4= <mlev>
##$CPDPRG5= <mlev>
##$CPDPRG6= <mlev>
##$CPDPRG7= <mlev>
##$CPDPRG8= <mlev>
##$CPDPRGB= <>
##$CPDPRGT= <>
##$D= (0..31)
0 1 0 0 0 0 0 0 0 0.06 0 0 0 0 0 0 0.0002 0 0 0 0 0 0 0 0 0 0 0 0 0 0 
0 
##$DATE= 1153746923
##$DBL= (0..7)
120 120 120 120 120 120 120 120 
##$DBP= (0..7)
150 150 150 150 150 150 150 150 
##$DBP07= 0
##$DBPNAM0= <>
##$DBPNAM1= <>
##$DBPNAM2= <>
$$ [...]
##$SUBNAM7= <"">
##$SUBNAM8= <"">
##$SUBNAM9= <"">
##$SW= 20.6930455092707
##$SWIBOX= (0..15)
0 0 3 0 0 0 0 0 0 0 0 0 0 0 0 0 
##$SW_h= 5175.983436853
##$TD= 65536
##$TD0= 1
##$TE= 295.16
##$TE2= 300
##$TE3= 300
##$TEG= 300
##$TL= (0..7)
0 120 120 120 120 120 120 120 
##$TP= (0..7)
150 150 150 150 150 150 150 150 
##$TP07= 0
##$TPNAME0= <>
##$TPNAME1= <>
##$TPNAME2= <>
##$TPNAME3= <>
##$TPNAME4= <>
##$TPNAME5= <>
##$TPNAME6= <>
##$TPNAME7= <>
##$TPOAL= (0..7)
0.5 0.5 0.5 0.5 0.5 0.5 0.5 0.5 
##$TPOFFS= (0..7)
0 0 0 0 0 0 0 0 
##$TUNHIN= 0
##$TUNHOUT= 0
##$TUNXOUT= 0
##$USERA1= <user>
##$USERA2= <user>
##$USERA3= <user>
##$USERA4= <user>
##$USERA5= <user>
##$V9= 5
##$VALIST= <valist>
##$VCLIST= <CCCCCCCCCCCCCCC>
##$VD= 0
##$VDLIST= <DDDDDDDDDDDDDDD>
##$VPLIST= <PPPPPPPPPPPPPPP>
##$VTLIST= <TTTTTTTTTTTTTTT>
##$WBST= 1024
##$WBSW= 4
##$XGAIN= (0..3)
0 0 0 0 
##$XL= 0
##$YL= 0
##$YMAX_a= 413203
##$YMIN_a= -507625
##$ZGOPTNS= <>
##$ZL1= 120
##$ZL2= 120
##$ZL3= 120
##$ZL4= 120
##$ABSF1= 16.522
##$ABSF2= -4.171173
##$ABSG= 5
##$ABSL= 3
##$ALPHA= 0
##$AQORDER= 0
##$ASSFAC= 0
##$ASSFACI= 0
##$ASSFACX= 0
##$ASSWID= 0
##$AUNMP= <proc_1d>
##$AZFE= 0.1
##$AZFW= 0.1
##$BCFW= 0
##$BC_mod= 0
##$BYTORDP= 0
##$COROFFS= 0
##$CY= 12.5
##$DATMOD= 1
##$DC= 0
##$DFILT= <>
##$DTYPP= 0
##$F1P= 14.0000005364418
##$F2P= -0.99999901652339
##$FCOR= 0.5
##$FTSIZE= 32768
##$FT_mod= 6
##$GAMMA= 0
##$GB= 0
##$INTBC= 1
##$INTSCL= 1
##$ISEN= 128
##$LB= 0.3
##$LEV0= 0
##$LPBIN= 0
##$MAXI= 10000
##$MC2= 0
##$MEAN= 0
##$ME_mod= 0
##$MI= 0
##$NCOEF= 0
##$NC_proc= -5
##$NLEV= 6
##$NOISF1= 0
##$NOISF2= 0
##$NSP= 0
##$NTH_PI= 0
##$NZP= 0
##$OFFSET= 16.522
##$PC= 1
##$PHC0= 162.5181
##$PHC1= 8.59389
##$PH_mod= 1
##$PKNL= yes
##$PPARMOD= 0
##$PSCAL= 4
##$PSIGN= 0
##$REVERSE= no
##$SF= 250.13
##$SI= 32768
##$SIGF1= 0
##$SIGF2= 0
##$SINO= 400
##$SIOLD= 32768
##$SREGLST= <1H.CDCl3>
##$SSB= 0
##$STSI= 32768
##$STSR= 0
##$SW_p= 5175.98343685301
##$SYMM= 0
##$S_DEV= 0
##$TDeff= 65536
##$TDoff= 0
##$TI= <Analysis number 999999
Compound Code 99
Book Reference 9
Project Code 9>
##$TILT= no
##$TM1= 0
##$TM2= 0
##$TOPLEV= 0
##$USERP1= <user>
##$USERP2= <user>
##$USERP3= <user>
##$USERP4= <user>
##$USERP5= <user>
##$WDW= 1
##$XDIM= 32768
##$YMAX_p= 517734754
##$YMIN_p= -483473
$$ End of Bruker specific parameters
$$ ---------------------------------
##NTUPLES= NMR SPECTRUM
##VAR_NAME=  FREQUENCY,     SPECTRUM/REAL,   SPECTRUM/IMAG
##SYMBOL=    X,             R,               I
##VAR_TYPE=  INDEPENDENT,   DEPENDENT,       DEPENDENT
##VAR_FORM=  AFFN,          ASDF,            ASDF
##VAR_DIM=   32768,         32768,           32768
##UNITS=     HZ,            ARBITRARY UNITS, ARBITRARY UNITS
##FACTOR=    0.157963299565203, 1,           1
##FIRST=     4132.6476996994, 0,             0
##LAST=      -1043.33573715361, 0,           0
##MIN=       -1043.33573715361, -483473,     0
##MAX=       4132.6476996994, 517734754,     0
$$ Real data points
##PAGE= N=1
##DATA TABLE= (X++(R..R)), XYDATA
$$ [...]
22394B52293K1982j34211O0149K9456m4575q0320J5234k30025j38132n9188J18775
22383a88562J94125J5890l4672L3233j67651R4720K9131J06431j37519j34808
22373a89682K5709L5533m1923K1953J34395n1994m3659j2529l4147Q9419N2089
22362a4836O2301J04927j13281o3957J112K227j6815J42159j0659k6899K5129
22351I1408n3717k9874P1872M1252k7554n4822q8826p9952J1653Q7763J31425
22340A00628Q8894j29866N9337j2141L3275J40151p2901r7253n2305j2507N3289
22329I8601n9206j59478k05113J08906J18484M5438J59373J11166L485L3040k0259
22318B34437k1127j82520j9190J2147K5664k9769M0545N8059P4210p5701j5763
$$ plain form
22394 252293 274275 140064 200213 229669 185094 104774 120008 -110017 -248149 -307337 -188562
22383 -188562 5563 21453 -13219 20014 -147637 -52917 -23786 82645 -54874 -189682
22373 -189682 -163973 -128440 -170363 -148410 -14015 -66009 -109668 -122197 -156344 -66925 -14836
22362 -14836 47465 152392 39111 -24846 -23734 -21507 -38322 103837 93178 66279 91408
22351 91408 37691 7817 79689 120941 93387 38565 -50261 -130213 -118560 -30797 100628
22340 100628 189522 59656 118993 106852 140127 280278 207377 110124 57819 45312 98601
22329 98601 39395 -120083 -325196 -216290 -97806 -52368 107005 218171 221656 254696 234437
22318 234437 213310 30790 11600 23747 49411 19642 60187 118246 192456 116755 100992
22307A00992M7589j14462q0875N0913K0396j53392l3458m1946P8321L3146k3239
22296a16015q7127m3290p369k9070O6528q706r1199P234K22913K28030j50116
22285h187r5541j2143r6726J38116R2851J13276J735p8120j03626K496N8477K2476
22273C5084k3693m9935R3488l6356o8028J3158r2656j07113R7541k4432j09444
22262b72386N7709J52357O6793n7826j19191o7369L3836R2069N7821j24834q0067
22251b61088R5932N8195K5317O9197J39467o0878j12163L0167L0017N956l1116
22240a0997j1717j6803j4547j1P8851M383q5518J1632O8334J2368r8664k2151
22228h4840p274K1899N6761L6256k20993K9540K22304P2132j80968p7371Q662
$$ plain form
22307 100992 148581 34119 -46756 4157 24553 -128839 -162297 -204243 -125922 -92776 -116015
22296 -116015 -203142 -246432 -253801 -282871 -216343 -225049 -316248 -309014 -86101 141929 -8187
22285 -8187 -103728 -115871 -212597 -74481 18370 131646 133381 55261 -48365 -45869 12608 35084
22273 35084 11391 -38544 54944 18588 -49440 -36282 -128938 -236051 -138510 -162942 -272386
22262 -272386 -214677 -62320 4473 -53353 -172544 -239913 -206077 -114008 -56187 -181021 -261088
22251 -261088 -165156 -106961 -81644 -12447 127020 66142 -46021 -15854 14163 20119 -10997
22240 -10997 -22714 -39517 -54064 -54075 24776 29159 -56359 -44727 23607 35975 -62689 -84840
22228 -84840 -92114 -70215 -13454 22802 -198191 -168651 53653 125785 -55183 -132554 -123892
22217a23892R6880k1513r7326J16651N0478j026n9580J9543M2175J25948m418
22206A43920k5416o3611n280K3654Q7012J0696j18983j66675J84946M6314j26107
22195i530r7028J62268R1966j04849l4176M1676J0590j07885j10312k10433n1259
22184d18972J35358K8488J5660j6756Q5595J45720M5440J4001n9336q7947j3019
22173a25768O1142r3145j49926J39243J94812r9878o1765L7496N6042q7617J1392
22162a17972N0662o3005l2184L9876R9271L8630j33936k160J8462J8584q2487
22151a66259m4182J44026J30105M6188K0756k48995k3J14253j43297j87374J4550
22140c20252J07366n1412m641R3332j6713J05214J72558l8947r0678j1612j6777
$$ plain form
22217 -123892 -27012 -48525 -145851 -29200 21278 20252 -39328 -19785 22390 148338 143920
22206 143920 118504 54893 49613 73267 160279 170975 51992 -114683 70263 116577 -9530
22195 -9530 -106558 55710 147676 42827 8651 50327 60917 -46968 -157280 -367713 -418972
22184 -418972 -283614 -255126 -239466 -256222 -170627 -24907 20533 34534 -24802 -112749 -125768
22173 -125768 -64626 -157771 -307697 -168454 26358 -73520 -135285 -97789 -41747 -129364 -117972
22162 -117972 -67310 -130315 -162499 -122623 -23352 15278 -118658 -120818 -102356 -83772 -166259
22151 -166259 -210441 -66415 63690 109878 130634 -118361 -118384 -4131 -147428 -334802 -320252
22140 -320252 -212886 -264298 -268939 -175607 -192320 -87106 85452 46505 -44173 -55785 -72562
22129g2562j20L631N9931M0054M099K1093K9638M5281R2811J4669j46656j17493
22117b5624K1914J04232R8066J6056j26036n7092k4129n1170J1915K8759m9215
22106e2324m2153P7357N2025j31743r4740R1634O5588j877M4477j9634l5007k5252
22094g1649J4641n9340m2197K6835L0917m1242m6834L0537N0293J38573J22914
22083A53448o4852m2283K5053K9233R6934o7695o3461J5683n8999L6340P6504
22072A35905N6016l3344j8505J95998P1441m2906j53782k71434k18461L933P8556
22061a96583K15649o2791n6913m586L2401J66049J40060j07481n626j15146k5834
22050b0801Q4660j53044Q9488p540j5623Q117k3448M9570R2641R787m9335k74808
$$ plain form
22129 -72562 -72682 -69051 -9120 30934 35033 56126 85764 131045 223856 238525 91869 -25624
22117 -25624 -3710 100522 198588 214644 88608 31516 7387 -43783 -31868 -3109 -52324
22106 -52324 -94477 -17120 34905 -96838 -191578 -99944 -34356 -36233 8244 -11390 -46397 -71649
22094 -71649 -57008 -116348 -158545 -131710 -100793 -142035 -188869 -158332 -108039 30534 153448
22083 153448 88596 46313 71366 100599 197533 129838 66377 82060 23061 59401 135905
22072 135905 191921 158577 140072 336070 407511 364605 210823 -60611 -279072 -275139 -196583
22061 -196583 19066 -43725 -100638 -105224 -72823 93226 233286 125805 120179 5033 -20801
22050 -20801 63859 -89185 303 -7237 -22860 -14743 -38191 11379 104020 113807 64472 -210336
22038b10336j54932N377R1263J02481R9134R9002L384k29784J8453J12828J05936
22027D2806j46615p0598O4700L0746J0376P8471j29577m4131J11987J08961l1642
22016B5484p9690P2644q7466Q3031N9615P788J9501N5593K3179j07006M097K8294
22004A05064R7785n9052j81246q1637O9361r603j27207J1976J5540J99298o0150
21993a9871o1555K3304Q8836j00421p7083o195M454o6712q9820r7079J62192J63925
21981g6025R6003k623j41085L3375J15950Q2180M8746j9671P4687J26634j36629
21970B01542p6592j07854L378O2938n6944l9563r432M15P5823l206o5862p3588
21958h8945o8636J06790o8103k6207O7312J89330Q9889l3778n1704l3390j2905
$$ plain form
22038 -210336 -365268 -359891 -268628 -166147 -67013 31989 35373 -194411 -175958 -63130 42806
22027 42806 -103809 -174407 -109707 -78961 -68585 9886 -119691 -163822 -51835 57126 25484
22016 25484 -54206 18438 -69028 14003 73618 81406 100907 156500 179679 72673 76770 105064
22004 105064 202849 143797 -37449 -119086 -49725 -59328 -186535 -174559 -159019 40279 -19871
21993 -19871 -81426 -58122 30714 -69707 -146790 -152985 -148531 -215243 -305063 -402142 -239950 -76025
21981 -76025 19978 17355 -123730 -90355 25595 107775 156521 136850 211537 338171 201542
21970 201542 124950 17096 20474 83412 26468 -13095 -22527 -22112 53711 50505 -15357 -88945
21958 -88945 -157581 -50791 -118894 -145101 -77789 111541 201430 167652 115948 82558 69653
21947F9653J50355J20937M6909O3217j94259j30931o4538p4548K8553P3646J6186
21936A05180J01255k8115k8618m2304j6625p0544k0204R1797j9161k5992l9939
21925F730j6970K2929J09457r2691k0039J29094J25950N8690l704j01183j19500
21914I8763j41349j44778K3336R3922O7416K484J9619K8093K4909p31J2871q2403
21902B152J008o9719K5266Q271k7679J8974J06930O390o7848p0646j6385N1990
21890c1296m0549m2873J7729Q7356J52284n3185q0254N7941o3850n4490K5729
21879b5458O9149p7568K2280n1274j26396O6190J29896K2782r1153j05820n0510
21868b17882O3102J14165J1892K1194l5057J24017Q3919L2505j24905j64431J1642
$$ plain form
21947 69653 220008 340945 387854 451071 256812 125881 61343 -13205 15348 88994 105180
21936 105180 206435 178320 149702 107398 90773 20229 25 91822 72661 46669 6730
21925 6730 -10240 12689 122146 29455 9416 138510 264460 323150 319446 218263 98763
21914 98763 -42586 -187364 -164028 -70106 -2690 -206 19413 47506 72415 71684 84555 2152
21902 2152 3160 -66559 -41293 -33022 -60701 -41727 65203 71593 3745 -66901 -83286 -31296
21890 -31296 -71845 -114718 -96989 -9633 142651 89466 9212 67153 3303 -51187 -25458
21879 -25458 43691 -33877 -11597 -62871 -189267 -123077 6819 29601 -61552 -167372 -217882
21868 -217882 -154780 -40615 -28723 -7529 -42586 81431 165350 197855 72950 -91481 -79839
21857g9839Q4971J13852m724K5659K1037q6759l6799J4766j8116N4497n6155k1906
21845A0484l9095J26371J29297Q946k94791j12319J08150N9333j07573p992R7894
21834b1295P8735Q5062O084j4030k5988j87974k19149N2233K86136J60588L5690
21823B36092l2259k57144j8147P6774M3055r450O9897J7974q409r6310n4903m3910
21811g6740J110N5174O6817M1697o6040n8070J44679L2138j06195L7676R401q805
21799G2842m3456J0731j8206r846j09173P1037o3094j01721N1270J8522N895L5094
21787h0105M2671J04918k2063q1673j8094l9491R0299L4264J3256r727m725J08954
21775A38484J2902M8246q1258j10091j3293O2028m567j11790m9321o9186K8682
$$ plain form
21857 -79839 5132 118984 114260 139919 160956 74197 37398 52164 34048 88545 32390 10484
21845 10484 -28611 97760 227057 236003 -58788 -171107 -62957 -3624 -111197 -119189 -21295
21834 -21295 57440 142502 148586 134556 108568 -79406 -298555 -246322 39814 200402 236092
21823 236092 203833 -53311 -71458 5316 48371 38921 108818 126792 118383 22073 -32830 -76740
21811 -76740 -75630 -20456 46361 88058 22018 -36052 108627 140765 34570 72246 81647 72842
21799 72842 29386 40117 21911 12065 -97108 -26071 -89165 -190886 -139616 -121094 -115199 -80105
21787 -80105 -37434 67484 45421 -36252 -54346 -93837 -3538 30726 43982 34255 29530 138484
21775 138484 151386 199632 118374 8283 -5010 57018 52451 -59339 -108660 -177846 -149164
21764a49164j4699R5185J42834J22850L7925Q7343q145j07223j19813r4551J0031
21753B573L2068J42687R3816N9684j65678j00981l9084N9072n078m2344Q0188
21742A16923M2968n0254l8412K6871L9254J28900k1099j22139m536j03537R1878
21731A06817j0315O7160p7019p9822J0202k8447J9472J19039J08904J8350R5856
21720C50197o1899j00607J411L9191r2034O9726M3310j0521R8609N8496j68532
21709B27347r6464r3954J17387l4200r5698M9857o6025J00526K4297Q6965M4789
21698B64827p4374m4016j8510j38268J1532K780J45039K1688J0357M4481q8468
21687A37068q1979M5275R6653L7827m3272r2502r7663K5216k8549N049q0950J0218
$$ plain form
21764 -149164 -163863 -68678 74156 197006 234931 322274 314129 206906 87093 -7458 2573
21753 2573 34641 177328 271144 330828 165150 64169 25085 84157 79079 36735 116923
21742 116923 159891 109637 71225 98096 137350 266250 245151 123012 118476 14939 106817
21731 106817 96502 163662 86643 6821 17023 -11424 8048 127087 235991 254341 350197
21720 350197 288298 187691 189102 228293 136259 205985 249295 238774 337383 395879 227347
21709 227347 130883 36929 154316 120116 24418 74275 8250 108776 133073 220038 264827
21698 264827 190453 146437 127927 -10341 1191 3971 149010 170698 181055 225536 137068
21687 137068 55089 100364 197017 234844 191572 99070 1407 26623 -1926 3123 -77827 -67609
21675f7609O824N7257N2094O9102k6605n1726R7903J40663K7327p7261r0994J4895
21663A51870p6289r5613k6063n0347l9894J26989R4393N6439J21627R2897j33602
21652B22407k11823q281J7552J1162l1113n0188J03392N9923j5725J07770K422
21641B07498m2394j15487M6124L3587o6064n7360q1423n5665M4100P8289l7260
21630d6055l8268M8976o6820L8818O0846j08334K6929J26307p0786k2217k0047
21619g0651k0822N6043l1455m9429q6019M8801O2072L3213N8340J25695R6621
21608B22409k9443j14784o5605q8627n4094M3348l3139R7491J32038L1127p1906
21597F8815r2431J37434M9380m5587N905k7998m7857p7054j6417P188o9664l2933
$$ plain form
21675 -67609 -60785 -3528 48566 117668 91063 39337 137240 277903 305230 227969 136975 151870
21663 151870 75581 -20032 -46095 -96442 -136336 -9347 85046 141485 263112 356009 222407
21652 222407 10584 2303 19855 31017 -96 -50284 53108 113031 97306 205076 207498
21641 207498 165104 49617 95741 129328 63264 5904 -75519 -131184 -87084 -8795 -46055
21630 -46055 -84323 -35347 -102167 -63349 -2503 -110837 -83908 42399 -28387 -50604 -70651
21619 -70651 -91473 -35430 -66885 -116314 -202333 -153532 -91460 -58247 93 125788 222409
21608 222409 192966 78182 12577 -76050 -130144 -86796 -119935 -22444 109594 140721 68815
21597 68815 -23616 113818 163198 117611 123516 95518 47661 -29393 -45810 -38622 -108286 -141219
21585a41219O6350J6701j1759m5905R083n296P616J07433J38919n4543j18522
21574c1142k9431n4210l0802o0456N4257R1545l6643p4382O7233J20430P2891
21563H9290J8595P9029k6855K3107o4665n7988m2489l8404o7245J3668N8739N4617
21551C9399R805n0500R9361J78239P0356k9596J1332l6629j34434o3341m6386
21540D7606j9675r1745R0802J23872l0645j14601q4783r3284J24482N7796k4205
21529a4380J02294P7423l105M3741K9749r0984n6340r3672p9864L15Q2668P6720
21517G4565q937k9587r179K1397r4267m4064j4250k2738m1910r7350K7713J85735
21505e2872J71909k8466N4396m6158l7659j31781m5468N454O0009j15982k3716
$$ plain form
21585 -141219 -74869 -58168 -69927 -115832 -106749 -112045 -104429 3004 141923 87380 -31142
21574 -31142 -60573 -114783 -145585 -206041 -151784 -60239 -96882 -171264 -104031 16399 89290
21563 89290 107885 186914 160059 183166 118501 60513 18024 -20380 -87625 -73957 -15218 39399
21551 39399 49204 -1296 98065 276304 346660 317064 328396 291767 157333 93992 47606
21540 47606 27931 -63814 26988 150860 120215 5614 -79169 -172453 -47971 9825 -14380
21529 -14380 87914 165337 162232 205973 235722 144738 88398 -5274 -85138 -84823 -2155 74565
21517 74565 65628 36041 26862 48259 -46008 -90072 -104322 -127060 -168970 -266320 -238607 -52872
21505 -52872 119037 90571 144967 98809 61150 -70631 -116099 -110645 -50636 -166618 -190334
21494a90334m5716J31400R55j02256K1904J98115P8646M2274m3242k6126j17483
21483e1863j09988o2015J35292R6088J05385M063o2698k165p2121j0207J05355
21472G5126M8398p5110m9595m6873n8635m8711Q5173J41845P0053j5893N6314
21461A82092k286k14276j39017o5628J62559J34901J31964q6794j34793N8344
21451B7066P4810m0459P2657l0433r4941o8904Q6186j0983j81647Q2653M056L9669
21439d0270l56K3917Q9361j20627j12670Q6956J40824J27433j6926p4585p009
21428I6048P1126j35285p2374k1546P7682j1709L1584o5311q5137j53810l411
21417b72143J06428l0788O050P2128P2762Q804j5411j6029k8734K3820O6107j0133
$$ plain form
21494 -190334 -236050 -104650 -103695 -205951 -184047 14068 92714 134988 91746 65620 -51863
21483 -51863 -161851 -223866 -88574 7514 112899 116962 54264 52099 -20022 -30229 75126
21472 75126 123524 48414 -1181 -48054 -106689 -155400 -70227 71618 141671 125778 182092
21461 182092 179806 -34470 -173487 -239115 -76556 58345 190309 103515 -31278 27066
21451 27066 101876 61417 134074 103641 8700 -60204 25982 14999 -166648 -83995 -79939 -40270
21439 -40270 -40626 -16709 72652 -47975 -160645 -73689 67135 194568 177642 103057 96048
21428 96048 167174 31889 -40485 -62031 15651 3942 35526 -29785 -114922 -268732 -272143
21417 -272143 -165715 -196503 -190453 -118325 -45563 -36759 -52170 -68199 -96933 -73113 -7006 -17139
21405a7139j46046j36872L9267J27102J14333r0525n9775N2483J14212n205N5843
21394D7678O5442m1444n8304j6838j5264k2874N1816M8028P231L6439k8268k62602
21382a88960j69406P9733o3346p2991K5661J95171J65561K1906J5816l2472q7514
21371a10841J07382K8035k1426p5924m9169O9534N1706o3192j36505n3871r6650
21360c50921L7173M3739J56162R2121K3057j01266l6457Q2407Q6267k5321r4230
21349h7269o7548l3650O1977J95929J12070l4380R907J593j54816k0486k9985
21338d6658j0311P9763K8843n9366r4684J4938j73648k2388J62670l1822J5768
21327a36895J05268L0063N9352K9478p362j36729K2045J0394m3346n5212P1250
$$ plain form
21405 -17139 -163185 -300057 -260790 -133688 -19355 -109880 -169655 -117172 -2960 -8165 47678
21394 47678 113120 71676 13372 -3466 -18730 -41604 10212 58240 65471 101910 73642 -188960
21382 -188960 -358366 -278633 -341979 -414970 -389309 -194138 -28577 -6671 9145 -23327 -110841
21371 -110841 -3459 24576 3150 -72774 -121943 -52409 -703 -63895 -200400 -254271 -350921
21360 -350921 -313748 -270009 -113847 -21726 1331 -99935 -136392 -53985 32282 6961 -87269
21349 -87269 -154817 -188467 -126490 69439 181509 147129 157036 158629 3813 -16673 -46658
21338 -46658 -56969 22794 51637 -7729 -102413 -87475 -261123 -283511 -120841 -152663 -136895
21327 -136895 -31627 -1564 57788 87266 79904 -56825 -34780 -24386 -67732 -122944 -51694
21316e1694J65640j9024k4312L6172m9213j40959r641Q2770J09336k8910l7098
21305C3067k1401r4763j21616k0768N3552J64943R3766J17051q026j10960M663
21294H9508j17153p481J14110L4966M9647L5144o8592L7200j2213n1813J6456
21283A19779k1935p653J00414m8448j01857j45640k1026M615p8745k9707n337
21272b35540M922m348L6416M942L2204K4297J64948J59470O2728L4829q7442j30682
21260F6744M2452J65786M9947q2108j09943j46620N217K07491M6294j139j5029
21249B29092j10240k4566J95444p1629j37555O151P799j09479P9362M2068J3980
21238A20427m9447N430j1974o1520O9514j62136n6301Q8461R7698J67724P2612
$$ plain form
21316 -51694 113946 94922 70610 106782 57569 -83390 -93031 -10261 99075 70165 33067
21305 33067 11666 -83097 -204713 -225481 -171929 -6986 86780 203831 195805 84845 89508
21294 89508 -27645 -35126 78984 113950 163597 198741 130149 167349 155136 103323 119779
21283 119779 97844 90191 190605 142157 40300 -105340 -126366 -121751 -200496 -230203 -235540
21272 -235540 -230618 -234966 -198550 -193608 -161404 -137107 27841 187311 250039 284868 197426 66744
21260 66744 109196 274982 324929 242821 132878 -13742 -8525 198966 245260 244121 229092
21249 229092 118852 94286 289730 218101 80546 86697 94496 -14983 64379 106447 120427
21238 120427 70980 76410 64436 2916 72430 -89706 -146007 -57546 40152 207876 280488
21227B80488j75875q7538O603P1107J2996R0886o5775r0786r9314l5901Q7541
21216e568Q1913M6749o0895j3277o392J9549R4961O0558K6869J23319J3546o5564
21204C15768j54361j35452O7908o6586l3783J5645J31539J60977k3727j8767q5292
21193A73869m3662k13002R8448J72308j13269j66626q4085k3866k6256P2940O2732
21182i0469n1947J22m1168K1146K32291L7177j09382J721P3963m4589n7455J00563
21170G1973Q1591l614L6392L3405L3373p5312q219r1154K5800q2500j37376r9819
21158b15460j8727J10954M8551J02177m4585j12723J10511P9089p046K2186K1773
21147I6700o849k10205K0846J20202J48680j30602j29911n8329L2838Q6367J01756
$$ plain form
21227 280488 104613 17075 23678 94785 107781 198667 132892 42106 -57208 -93109 -5568
21216 -5568 76345 123094 62199 48922 42530 62079 157040 217598 244467 367786 381332 315768
21204 315768 161407 25955 93863 27277 -6506 9139 140678 301655 277928 259161 173869
21193 173869 130207 -82795 15653 187961 74692 -91934 -176019 -199885 -226141 -153201 -90469
21182 -90469 -142416 -142294 -183462 -162316 69975 107152 -2230 -509 73454 28865 -28590 71973
21170 71973 153564 149950 186342 219747 253120 177808 169589 78435 104235 21735 -115641 -215460
21158 -215460 -234187 -123233 -74682 27495 -17090 -129813 -19302 59787 52741 74927 96700
21147 96700 89851 -120354 -99508 20694 169374 38772 -91139 -149468 -116630 -30263 71493
21136G1493J36093P2763O4296j31543k41102k02J87418j8238j73763o7787j4170
21125a14742m7490O0634M1522N8653L0840M5297n640j20852r0736j0643O9926
21114h3231r4567L555K4458J09121j3519L0499r2102K0780l9211k1457j905j4159
21102a71738M1892j446j47295r7184R2515J10584J32529R0959J07796l6738j40962
21091a9088K4565l0899K9797L6693M9750j56516K2644O7681J10899n4990p3071
21080G465k230k5660o5507N9204O3442n9342j3510M8149M077n4323j62137n2302
21068b52674P893M4867O3146J52626j17549q4407r312Q6908K64302M3376j84406
21057A4770j29817N0131n9438k444O7774P0624Q0155M2259k22079q0967K0364
$$ plain form
21136 71493 207586 280349 344645 213102 -28000 -28202 159216 140978 -32785 -100572 -114742
21125 -114742 -162232 -101598 -60076 -1423 29417 74714 69074 -51778 -142514 -153157 -83231
21114 -83231 -177798 -174243 -149785 -40664 -54183 -23684 -115786 -95006 -134217 -155674 -157579 -171738
21102 -171738 -129846 -131292 -278587 -375771 -283256 -172672 -40143 50816 158612 121874 -19088
21091 -19088 5477 -25422 4375 41068 90818 -65698 -43054 24627 135526 80536 7465
21080 7465 5235 -20425 -85932 -26728 36714 -22628 -36138 12011 16088 -38235 -200372 -252674
21068 -252674 -244781 -199914 -136768 15858 -101691 -186098 -195410 -108502 155800 199176 14770
21057 14770 -115047 -64916 -124354 -126798 -59024 11600 91755 134014 -88065 -169032 -148668
21046a48668Q6625J3167j75225o8805n0084J22163K02846m4717j08378l6833l5214
21035b43123P7797l0665Q734O1833p1393j47332M1220J32299p7517p0866N0560
21024b68453k9817J20677N3737m3369l3967M2247L3246o9847n5257N4425J87274
21013i104P7315P1141j5924j8711k4908n7867j37436o6801J9701K4844P1030J75409
21001A08689q983N7265L2405q9245m7314j34293p174J03493q0834J48094p0375
20990A1728j09613O9240J83751K8639o5341Q5635P6684p3513O7666k9997r2112
20979A52767p23o7713j06742m478J475O481N0413l9168q0545J27486J97711r1782
20967A45182k20492r1374M92J83186J51047J3510n2679J14370k018j09659R200
$$ plain form
21046 -148668 -62043 -48876 -224101 -292906 -342990 -220827 -17981 -62698 -171076 -207909 -243123
21035 -243123 -165326 -195991 -187257 -125424 -196817 -344149 -302929 -170630 -248147 -319013 -268453
21024 -268453 -298270 -177593 -123856 -167225 -201192 -158945 -125699 -195546 -250803 -196378 -9104
21013 -9104 68211 139352 123428 104717 79809 21942 -115494 -182295 -162594 -137750 -66720 108689
21001 108689 99706 156971 189376 100131 52817 -81476 -88650 14843 -65991 82103 11728
20990 11728 -97885 -28645 155106 183745 118404 204039 280723 207210 274876 244879 152767
20979 152767 152044 84331 -22411 -26889 -25414 -18933 31480 -7688 -88233 39253 236964 145182
20967 145182 -75310 -166684 -166192 16994 168041 181551 128872 243242 241224 131565 140765
20956A40765p4755m0439L7903o9555o5074Q0720M8972J14829j18151j33307K2890
20945e5202M0454q4268M776j18836J30612N6150J9708R2497n4340r1467j2925
20934g2841P4066k6362r6334J33063O4157q2665k2116L8071O7648R2643m1673
20923A27657N7879Q0375r2861j41783p5387m151n4175m3427q3517K9120j1556
20912b11826l2223P0208m128J0927R7665K6659n9459O3602J48800r4320m9246
20901c3341J3502q1572P6980m5625q0506J16534P8310L1598J3178n3093r2549
20890e6584J5250P9376j29329l6246k1418J25490J6659k3280P2737n8922n50O580
20878a0237J8849R929o5078k2981O5511l8798j14012L4689l797M1082k3745o9103
$$ plain form
20956 140765 66010 25571 63474 -6081 -71155 9565 58537 173366 55215 -78092 -55202
20945 -55202 -14748 -99016 -94240 -213076 -82464 -26314 -6606 85891 31551 -59916 -72841
20934 -72841 1225 -25137 -121471 11592 75749 -6916 -29032 9039 76687 169330 127657
20923 127657 185536 265911 173050 31267 -44120 -48271 -102446 -145873 -229390 -200270 -211826
20912 -211826 -244049 -173841 -177969 -167042 -69377 -42718 -102177 -38575 110225 15905 -33341
20901 -33341 -19839 -101411 -24431 -70056 -150562 -34028 44282 75880 89058 35965 -56584
20890 -56584 -41334 38042 -91287 -127533 -148951 -23461 -6802 -30082 42655 -16267 -16817 -10237
20878 -10237 8612 18541 -46537 -69518 -4007 -42805 -156817 -122128 -125925 -84843 -108588 -177691
20866a77691N6091K12760o8754m7687j34763q2895M0891J31057K408Q299R6851
20855C6567J65652m2858p4794k07735k8732J24345n4196j01825O8252J27452M0659
20844E2787j41151L135l9639N8024P2157J60094J85474q8554k71347q7750j71321
20833b68091Q4292n3876j1318j0646L5845R6726q6515n3810J66302R4474m7185
20822e3802j29733q055L0244l3368K9717J67467J09584j10574L1095J10631L3303
20811A76509j93089P9669R2879L0160J2945J0843j65618k43761J02730J31305
20801C4572l6551o3632Q7149o567K5569J1151R922j7111J1797N9229j14769J11947
20789A12706L4623K8216n4169l0140O4682J06423P1781j12578J09223j08307k20130
$$ plain form
20866 -177691 -121600 91160 22406 -25281 -160044 -242939 -202048 -70991 -68583 -60284 36567
20855 36567 202219 159361 84567 -123168 -151900 -27555 -81751 -183576 -115324 12128 52787
20844 52787 -88364 -85229 -124868 -66844 5313 165407 350881 262327 -9020 -96770 -268091
20833 -268091 -183799 -237675 -248993 -259639 -223794 -127068 -213583 -267393 -101091 -6617 -53802
20822 -53802 -183535 -191590 -161346 -194714 -164997 2470 112054 1480 32575 143206 176509
20811 176509 -16580 63089 155968 186128 199073 209916 44298 -199463 -96733 34572
20801 34572 -1979 -65611 21538 14971 40540 51691 61613 44502 56299 115528 759 112706
20789 112706 147329 175545 121376 91236 155918 262341 334122 221544 330767 222460 2330
20778B330J3963L6476R240J72624m7550j43211k2227j9856m8439j892L7115M2532
20766C1105J23523J03075o0552m7675j49010m4540o3168N346N0955J45023K454
20755I6536k9561K8561n8458L0821L2767j89232j1546r0595N2214P3260q5842
20744a51075O1116J13134N60r2272l5407J1048l4484j9872M5477L6995O2711K1620
20732A9551m0813K7973O9424q754k9021j68458p046L1219p1351L2865M2509P0746
20720c1156l1226J8850K5369J34870Q7103l1301j03564j6490r2401m391J20672
20709G6335J3203O4113n1498j62967m8261Q0158m6215n1162q1748J4195J26093
20698f7754J62918M625K6989K6421m6226j86723j15629J6346N4750J3019l7637
$$ plain form
20778 2330 16293 52769 62009 234633 187083 43872 21645 1789 -46650 -48542 -11427 31105
20766 31105 154628 257703 197151 149476 466 -44074 -107242 -101896 -50941 94082 96536
20755 96536 66975 95536 37078 67899 100666 -88566 -100112 -190707 -138493 -65233 -151075
20744 -151075 -89959 23175 23735 -68537 -103944 -92896 -127380 -147252 -101775 -64780 -2069 19551
20732 19551 -21262 6711 76135 67381 38360 -130098 -137144 -105925 -177276 -144411 -101902 -31156
20720 -31156 -62382 -43532 -18163 116707 203810 172509 68945 52455 -39946 -44337 76335
20709 76335 89538 153651 102153 -60814 -109075 -28917 -75132 -126294 -208042 -193847 -67754
20698 -67754 95164 99789 126778 153199 106973 -79750 -195379 -179033 -124283 -111264 -148901
20687a48901o7520O3012R6080J850K7311R1834J203n0578j8433q6607Q9883K7215
20675B6349j40180q8224K1819R7994l2281n7410L5022L4901l8364J0253O1334
20664f8787J23825j06131l7515M7969L7806n1726j20571q1894R438P5732l2498
20653b04352m1196J3127l1179O179L335J19374j42702q1348J55151Q38Q2733p310
20641a27350R6951N3037j22734k5130Q8593R7862J1054Q495J18193J4058j76948
20630C6081r9078Q9079J2943M8179J21690l95o5162K3046o1372k3971q4675l7163
20618d0798Q9511P8201q7942P0745L3204L949q5656j24193M6588J8049j4183M5408
20606C2883n8558r0420p5977L4226l6565J57208M9515j58638l6610L980J3186
$$ plain form
20687 -148901 -216421 -153409 -57329 -55479 -28168 63666 64869 14291 -4142 -90749 -866 26349
20675 26349 -113831 -202055 -180236 -82242 -114523 -171933 -136911 -102010 -140374 -130121 -68787
20664 -68787 55038 -51093 -88608 -40639 -2833 -54559 -175130 -257024 -247586 -171854 -204352
20653 -204352 -245548 -232421 -263600 -257421 -254086 -134712 -277414 -358762 -203611 -202773 -120040 -127350
20641 -127350 -30399 22638 -100096 -125226 -36633 61229 72283 80778 198971 213029 36081
20630 36081 -62997 26082 39025 87204 208894 208499 143337 166383 105011 81040 -3635 -40798
20618 -40798 48713 126914 38972 109717 142921 146870 61214 -62979 -16391 1658 -12525 32883
20606 32883 -25675 -116095 -192072 -157846 -194411 -37203 12312 -146326 -182936 -178956 -165770
20595a65770L2021J7576j00673Q2805N0288p1285J03155j7877j7833Q0212J04800
20584I7419R396l5842P13N9092m2660L3670N6920n6754N3326k8496P5466J25420
20572C47670j98822k68493l8077O1644J4919Q9867O0300J595p6355L8722Q9357
20561A22327J22697Q0576q6975j07724o4927j28896K3595J17522j31008n9290
20551a12103N7837k694P1396l9303p869K8511L1904n700k841o3983n6734J28126
20539B6547j72956P644J06780K8301k6575R092l2775J03707J31502M2883n1703
20528A72447j5328N7836J52790J7229k68840k76077j16036R8204P8900J61246
20518F2371L2341P718M3338q8886n9891P4539O1249p5760J563O7309n6037j2661
$$ plain form
20595 -165770 -133749 -116173 -216846 -134041 -83753 -155038 -51883 -69760 -87593 -7381 97419
20584 97419 106815 70973 71686 130778 88118 121788 178708 121954 175280 146784 222250 347670
20572 347670 148848 -119645 -157722 -96078 -81159 8708 69008 70603 -5752 32970 122327
20561 122327 245024 325600 238625 130901 65974 -62922 -39327 78195 -52813 -112103
20551 -112103 -54266 -56960 14436 -24867 -32736 -4225 27679 21979 19138 -44845 -101579 26547
20539 26547 -146409 -138765 -31985 -3684 -30259 -21167 -53942 49765 181267 224150 172447
20528 172447 157119 214955 367745 384974 116134 -159943 -275979 -177775 -98875 62371
20518 62371 94712 102430 145768 56882 -3009 71530 132779 57019 58582 125891 69854 57193
20506E7193J1207k026l2050J64j09125n7326L3201l9204J37064N5293O1510M8057
20494A63958m4570j7120q4755o6381j93482M8818J63416N2547j37328K0028L0590
20483f4279m0459K086p022O9205o4577p8512J87112R8183k2293N5719J5890J6973
20471A68026q0174j53158o0353n8253m6525r2434J41866J19752n1021J6159J69919
20460G3804Q8909o3375P066O118k065K7117K9162j11187j24400o8534K7083N6294
20448e4008N4306P7368p5091j35701J36567J21512j16983l5276Q6492J1916o8207
20437B895M7915j0786j244j2166L3960q5336o5172l1855q6819K4533L3417J26224
20425b4434M8529l1954k3875k6627J72652L2937o3888j15759L588J27779J16129
$$ plain form
20506 57193 68400 66374 34324 34488 -74637 -131963 -98762 -137966 -902 54391 115901 163958
20494 163958 119388 102268 17513 -48868 -242350 -193532 -30116 22431 -114897 -94869 -64279
20483 -64279 -104738 -102652 -109674 -40469 -105046 -183558 3554 101737 79444 135163 151053 168026
20471 168026 87852 -65306 -125659 -183912 -230437 -322871 -181005 -61253 -112274 -96115 73804
20460 73804 162713 99338 106404 112522 110457 137574 166736 55549 -68851 -137385 -110302 -54008
20448 -54008 298 77666 2575 -133126 3441 124953 7970 -27306 59186 71102 2895
20437 2895 50810 40024 38780 26614 60574 -24762 -89934 -121789 -208608 -184075 -150658 -24434
20425 -24434 24095 -7859 -31734 -58361 114291 147228 83340 -32419 -28831 98948 215077
20414B15077n0835k25099k9071L1933J04347K2464N9763k4672o0703j03727M5360
20403a5163Q5347j05576n019O8626l8429L425j2637J19995P3326p6029o8782J5931
20391D5015p1125K8153K3345l7122J37712J7885n634R1915o7902J53J13854k5723
20379B50526j29309r9745N4210Q7829j64M8210P8328q9352j22975K3682q0399
20368B0841R149l6529j07370J1494o506k3984J51848n9805n1322j2641O1898O1998
20356A9071N6263k0409l9286K9603O8199j620l8849l9083N3457O1231J53256Q0103
20344C81936j48475l4071q9923L8482N8365j0981l7692j36250q5936K0912R5797
20333E2164l802j09868L1391J23408O107n2604k8045j86665p3122J36261J06753
$$ plain form
20414 215077 164242 -60857 -89928 -57995 46352 68816 128579 103907 43204 -60523 -15163
20403 -15163 70184 -35392 -40411 28215 -10214 -6789 -19426 100569 173895 97866 29084 45015
20391 45015 -26110 2043 25388 -11734 125978 143863 138229 230144 162242 162395 276249 250526
20379 250526 121217 21472 75682 163511 163347 211557 289885 200533 77558 101240 20841
20368 20841 29990 -6539 -113909 -102415 -108921 -132905 18943 -40862 -92184 -104825 -42927 19071
20356 19071 75334 54925 15639 45242 113441 111821 72972 33889 87346 148577 301833 381936
20344 381936 233461 199390 109467 147949 206314 195333 157641 21391 -64545 -43633 52164
20333 52164 48362 -61506 -30115 93293 99400 46796 18751 -167914 -241036 -104775 1978
20322A978r4587j3647l6920p5863m9091J32472J02263M0243O7971J04059l4455
20311A44423k1129n7290j2850O9104k8093j72726j27460N4983K03564j05242m7742
20300a00458j4045k168M84J15113Q1038K3366l9738L0071r5300j76640J10878
20289f7399J22781P5011J420j08818L9179L6806n1690r3953j1081K5432K3799
20278h513M4178K5818R6965J06676P5915j32546k63001j24700J00163J26117k2995
20267B4077J8746J17841J12737p1652n3043O0486k9590j06012J57309p0681j10195
20256E0023r6907O632Q7099Q9838M0494M6710k0723m3106l479k7244j29087M7854
20244D8104k2607j83753m0556J64297J09809J523J95378r60o9861n1970m4124
$$ plain form
20322 1978 -92609 -106256 -143176 -219039 -268130 -135658 -33395 6848 74819 178878 144423
20311 144423 123294 66004 53154 122258 94165 -78561 -206021 -151038 52526 -52716 -100458
20300 -100458 -114503 -116671 -116187 -1074 79964 103330 63592 93663 -1637 -178277 -67399
20289 -67399 55382 130393 131813 22995 62174 98980 47290 -46663 -57744 -32312 -8513
20278 -8513 35665 61483 158448 265124 341039 208493 -54508 -179208 -79045 47072 24077
20267 24077 42823 160664 273401 201749 148706 209192 179602 73590 230899 160218 50023
20256 50023 -46884 -40252 46847 136685 177179 223889 203166 160060 156581 129337 250 48104
20244 48104 25497 -158256 -198812 -34515 75294 76817 272195 271235 201374 149404 105280
20233A05280N5558M9307k57788q6751M7509O4491p6112n319J600q1772Q0965O1228
20221d1804l0550p0295p8578J38182J67246j30888p0887K5655R3888J5886j73701
20210a55846j13931j4539R9756J08568m743n5743k282R2125L7993K5247p9861
20199f3256j09555R8175J10377j15576K9642K47231J10265P857M0066k11458l8427
20188A05341J61550j08768j08747J3119j02108n2188l8571p6327j02113L5920
20178b72892R8195j5716l9426O9328K14878J90511l8520j11686M8575o4157k8129
20167E0961R1617L0363k4336l0104J1445j01842j8847q1523P2990l2849p0618
20156a02743K23281J73727j9144j47091j07000j29732J7128J8350j4193o7843
$$ plain form
20233 105280 160838 210145 -47643 -134394 -86885 -22394 -98506 -103825 -102225 -183997 -103032 -41804
20221 -41804 -72354 -142649 -221227 -83045 84201 -46687 -117574 -91919 1969 17855 -155846
20210 -155846 -269777 -284316 -184560 -75992 -80735 -136478 -138760 -46635 -8642 16605 -63256
20199 -63256 -172811 -74636 35741 -79835 -50193 197038 307303 315160 355226 143768 105341
20188 105341 266891 158123 49376 62495 -39613 -91801 -130372 -206699 -308812 -272892
20178 -272892 -174697 -190413 -229839 -160511 54367 244878 206358 94672 143247 79090 50961
20167 50961 142578 172941 148605 118501 129946 28104 9257 -72266 724 -32125 -102743
20156 -102743 120538 294265 275121 128030 21030 -108702 -91574 -73224 -87417 -155260
20146a55260Q3315J97444N9193R2212j3064q4536j1720n0479j59635N2210J5990
20135B5670j06174R5400Q9877j7165K2622k9303p823J24729J09971n3450q6536
20124A67818k26371J0152J25010J94248J9831p6487n7364l4529j90018j00505
20114a68215J25342N7819n8777m366J5136j35766M0749J63394M5116O0123j7782
20103A22773L5792P1331q9439j47883r4332m5597M6659J61838J6554k001O7563
20092A43258R8362r0159L3558q5613p3677K33967M8050j47620r0022j08534P4877
20081C6447J19805n7542O3120N8950K8953J4040j86898j22230n8286R9196j0050
20070a4495j54264q8506J79556K02246M3979J17839j07300j32322O7654M8677
$$ plain form
20146 -155260 -71945 125499 184692 276904 263840 179304 167584 117105 -42530 9680 25670
20135 25670 -80504 14896 104773 87608 110230 80927 73104 197833 307804 254354 167818
20124 167818 -58553 -48401 76609 270857 290688 214201 156837 122308 -67710 -168215
20114 -168215 -42873 14946 -43831 -48197 -33061 -168827 -128078 35316 80432 140555 122773
20103 122773 158565 229896 140457 -7426 -101758 -147355 -100696 61142 77696 75695 143258
20092 143258 241620 151461 185019 99406 25729 259696 307746 160126 70104 -38430 36447
20081 36447 156252 98710 161830 220780 249733 263773 76875 -45355 -103641 -4445 -14495
20070 -14495 -168759 -257265 -77709 124537 168516 286355 179055 46733 114387 163064
20060A63064K647j12616p6704l2124J1275r041m49J80760L2864r6047j53184q679
20048i8234J44965n6534j86278l7532J19125k7871n0804J36460J9849J8850N5739
20037C7735q2908p377q7243M7146Q1087J33065k4063n5049L3166K4741N1286J4074
20025A65660p1907l3278j1537j22859j81544K8383N2201K23547R6844j02100r0391
20014d6981J18187Q4324o3651q0386q9009O0065j56281j6541O0885K8494J18699
20003A7805l1552P9475r618k1492L9545N8466m3716j82508j29578J9712Q4653
19992a18808N3848J61221J00153M8515j64331j62763p7649p8475k567R2659L9749
19981a08448J42773q8779m7847l2831O9774k3841o1496R0441J07285j1841q2217
$$ plain form
20060 163064 165711 53095 -23609 -55733 -44458 -53499 -53948 126812 159676 63629 -89555 -98234
20048 -98234 46731 -9803 -196081 -233613 -114488 -142359 -193163 -56703 -36854 -18004 37735
20037 37735 -45173 -52550 -139793 -92647 -11560 121505 97442 42393 75559 100300 151586 165660
20025 165660 93753 60475 48938 -73921 -255465 -227082 -174881 48666 145510 43410 -46981
20014 -46981 71206 155530 91879 11493 -77516 -17451 -173732 -190273 -129388 -100894 17805
20003 17805 -13747 65728 56110 34618 74163 132629 88913 -93595 -223173 -203461 -118808
19992 -118808 -64960 96261 196414 244929 80598 -82165 -159814 -238289 -240856 -148197 -108448
19981 -108448 34325 -54454 -102301 -135132 -65358 -89199 -150695 -60254 47031 35190 -47027
19970d7027N9649R290r7985o065J12486M9731j21277j26295j14534J058J22390
19959a58579R4693L0030l9023n8104p827R62J01880K3985O7753N0719r1054L3063
19947D8498n260M9824M4062J3062q1407K4027L5555l0436o2559l3562M3886P7889
19935A23579P2250r4356N4488q0118j09416n8177R2916K0946K0882l0172j20751
19924a07929J1919J95235k3955k70453N4014L5882q2297j53608L2435R0880K13496
19913d381J01662R592n60l4874R1678q0341r9132L8431P6527Q1333o7560m8063
19901F4312j8935l7533J23985n7849j02060M0746O2119J9838J386M0577m3349
19890I3237n2683o4783m05J7936l2394K6050o1108J6873M4078j0249l2400k745
$$ plain form
19970 -47027 12622 21912 -76073 -82138 30348 80079 -41198 -167493 -282027 -280969 -158579
19959 -158579 -63886 -33856 -72879 -130983 -138810 -137848 -35968 -11983 55770 106489 15435 48498
19947 48498 43238 93062 137124 150186 68779 92806 128361 97925 35366 1804 45690 123579
19935 123579 195829 101473 155961 75843 -33573 -91750 1166 22112 42994 12822 -107929
19924 -107929 -96010 99225 75270 -195183 -141169 -105287 -187584 -341192 -308757 -217877 -4381
19913 -4381 97281 106873 106313 71439 163117 82776 -16356 22075 98602 179935 112375 64312
19901 64312 45377 7844 131829 73980 -28080 12666 74785 94623 96009 136586 93237
19890 93237 40554 -24229 -24634 -6698 -39092 -13042 -74150 -57277 -13199 -23448 -55848 -58593
19878e8593P6139O568Q0239J4404M8930j37351j8735J5500n3292q3237O1568R3736
19866D5876o5953r5741o5107R1800L0094Q5825P2542r7550j13399Q3857L5536
19855G780r1775L862J09711R0520K340o3291q460O0166K21493j30311j22251j30747
19843e0963q5205p8333j38J62628R6246M5383O9536L5410k5777q573p1205R873
19831I8882J3078j04866p4935R3114K481l9268L0635m4508J03666n2329J1548
19820C7498O8474L7145q6402n6999k1893K1812K2100Q8801J2329j12821k46377
19809b36333j0870J01250J74867q198k2540n525q8341j4967Q689n0047L9744J40469
19797B8198L7209n6272N9546j76818j42957J04984M7491K8637Q6358j04995L1224
$$ plain form
19878 -58593 17546 24114 104353 118757 167687 30336 11601 27101 -26191 -109428 -47860 45876
19866 45876 -20077 -115818 -180925 -89125 -59031 26794 99336 1786 -111613 -27756 7780
19855 7780 -83995 -80133 29578 120098 122438 59147 50687 110853 332346 202035 79784 -50963
19843 -50963 -136168 -214501 -214639 -52011 44235 89618 159154 194564 168787 160214 89009 98882
19831 98882 111960 7094 -67841 25273 27754 -11514 19121 -25387 78279 25950 37498
19820 37498 105972 143117 56715 -284 -22177 -365 21735 110536 122865 10044 -236333
19809 -236333 -247203 -145953 28914 20716 -1824 -7349 -95690 -110657 -101968 -152015 -112271 28198
19797 28198 65407 9135 68681 -108137 -251094 -146110 -98619 -69982 16376 -88619 -57395
19786e7395O6351O2962k4131k4841K1060K9415M6197J8099K762m992n6317p986
19774G1184r9401l8760k7598O0245K370K9499P0572M7237j7654M2557L681r7665
19762D6267j13693J3490n3452J0508J50632J27535k48465j36813J2114P807M4723
19751a39347l2532Q7233J35831q682O9637k763m9847j03852q222M3255K7754j15805
19739i7340o3543O9155R5322M3400m1175k2264J51739j03056q7484j7237K5733
19728d6750q409j12614j6503P7475m3072q8542N6106R9925j5962P4977q7721k753
19716a13843o9994O5717J65178M7013q1407j31870N5058P2119j9474J864k8143
19705c7782m2720J24304o611K4754j8269O3123n9644M9962O3138J26500L3012
$$ plain form
19786 -57395 8956 71918 47787 22946 44006 73421 119618 137717 140479 135487 79170 71184
19774 71184 -28217 -66977 -94575 -34330 -31960 -2461 68111 115348 97694 140251 143932 46267
19762 46267 -67426 -53936 -107388 -96880 53752 181287 -67178 -203991 -191877 -184070 -139347
19751 -139347 -171879 -84646 51185 42503 112140 109377 59530 -44322 -52544 -9289 18465 -97340
19739 -97340 -160883 -91728 3594 46994 5819 -16445 135294 32238 -55246 -72483 -46750
19728 -46750 -55159 -167773 -184276 -106801 -149873 -238415 -182309 -82384 -98346 -23369 -111090 -113843
19716 -113843 -183837 -118120 47058 94071 12664 -119206 -64148 7971 -11503 -9639 -37782
19705 -37782 -80502 43802 37191 61945 43676 106799 47155 97117 160255 286755 319767
19694C19767k21613n3942m459l3884q4663R4925L6780j6719P1778J69167K5845
19683C02982o9376r952q350m6346P235j08561n2512J2283O5689K6710p3351p3356
19671b6905n1701j5392K9042l6465n8998j75834R5257J51505J28651j1864J3260
19660D0556o8082k1491M0122O3392M8104r1600m6308M0089O6494j9865P1666n9458
19648F3619J8725j71290j71096N9403j4937J32830K20318N7690o1914p3424j0756
19637D9168Q7831l6328l3671J9909j1091k4928j25867q8562J6910N1409J28481
19626C3261j6797j7866J26105k1047N574Q1656l3822L7880N4090O8997r3733j6615
19614B07683m1278j00424o5310j04169j4020R1858L3955N9621J51830r2711q1743
$$ plain form
19694 319767 98154 44212 39753 5869 -78794 16131 52911 36192 107970 277137 302982
19683 302982 233606 223654 215304 168958 176193 67632 15120 27403 93092 119802 46451 -26905
19671 -26905 -78606 -93998 -64956 -101421 -160419 -336253 -240996 -89491 39160 27296 40556
19660 40556 -27526 -49017 -8895 54497 102601 11001 -35307 4782 71276 51411 123077 63619
19648 63619 82344 -88946 -260042 -200639 -215576 -82746 137572 195262 133348 59924 49168
19637 49168 136999 100671 67000 86909 75818 50890 -74977 -163539 -146629 -95220 33261
19626 33261 16464 -1402 124703 103656 109230 190886 157064 194944 249034 318031 224298 207683
19614 207683 166405 65981 671 -103498 -117518 -25660 8295 67916 219746 127035 45292
19603D5292m7561o6289J5673l2037j57391K2511k5770J18120L4580q3843m6981
19592b23696O6093l5854J03974J19580N1399k5704L5462J8760J9477j18787p1992
19581f1288j5693q637R6L7602K2385O821k4751p0674N0722M3977L6958k8431j40461
19568a51374o5943Q5621J18117p4066o1839J35910k6621l1911p726P046J13084
19557D0298n0180l804R2440N976k3375j17245J7367K0933J6020j42876n7641J54959
19545d7128P6674L3726N1468n9345j5826O904M7078p9357j16603N0755N6179M3976
19533D8501p6458n4610M0203o206j77958J28880J52569m6455N353J7055m9680
19522a8806j35741j56578M3700P0577J8687K1407R5813K53386p5987l8471k1915
$$ plain form
19603 45292 -2269 -68558 -52885 -84922 -242313 -219802 -245572 -127452 -92872 -176715 -223696
19592 -223696 -157603 -193457 -89483 30097 81496 55792 91254 110014 129491 10704 -61288
19581 -61288 -76981 -85618 -85522 -47920 -25535 -18714 -43465 -114139 -63417 -19440 17518 -10913 -151374
19568 -151374 -217317 -131696 -13579 -87645 -149484 -13574 -40195 -72106 -79832 -72786 40298
19557 40298 -9882 -13686 78754 84730 61355 -55890 -38523 -17590 -1570 -144446 -202087 -47128
19545 -47128 29546 63272 114740 55395 39569 46473 93551 14194 -102409 -51654 4525 48501
19533 48501 -27957 -82567 -42364 -48570 -226528 -97648 54921 8466 13819 30874 -18806
19522 -18806 -154547 -311125 -267425 -196848 -178161 -156754 -60941 192445 116458 77987 56072
19511E6072m457J2949k3585k3014L3852N9331o417k5907O8847K8220n3986N579
19499A27484O4819o917j83824q9500J22474P1513O906j16654o7303l3983J63382
19488E8397J51093q1270l9547O8049l0159k6116o435l6673l5063J6005j4868m1818
19476a8405P3388J17374j11698q9059O0929k6136j5430P979r6424k9527P0362
19465e6647J7996J44742J46864R2869j11065l6618j15929j57794k6570N7929J09538
19454F5315M2836r023n2729o0299m646J8201J766j12110n9886R7596J25853K6364
19442G9238L8887p392l7064P8271J55678j7820m8312j6273J3025K986J524O6699
19430C09447j14603n3722l9405J2381o7912k7070j3771J95172k3458p3136j18227
$$ plain form
19511 56072 51615 64564 40979 17965 51817 111148 104731 78824 147671 175891 121905 127484
19499 127484 192303 185386 1562 -87938 34536 106049 112955 -3699 -71002 -104985 58397
19488 58397 209490 128220 88673 156722 126563 100447 94012 57339 22276 38281 23413 -18405
19476 -18405 54983 172357 60659 -28400 32529 6393 -9037 -1058 -97482 -127009 -56647
19465 -56647 -38651 106091 252955 345824 234759 198141 82212 -75582 -102152 -44223 65315
19454 65315 108151 99128 46399 -13900 -18546 -345 1421 -110689 -170575 -72979 52874 79238
19442 79238 118125 110733 73669 151940 307618 289798 241486 225213 238238 241224 242748 309447
19430 309447 194844 141122 101717 114098 46186 19116 5345 200517 177059 103923 -14304
19419a4304L8090l934R6405M7546K5733M5642J9077M7652j5042o0118K1952k3749
19407B24950q4893j7312M2729N6516J72127N1962j74151m4853l8877k10076q0539
19396a02417K7862J1806J47813J2535J3978n663n4593p0203p0473J22048P7724
19385A10417M5599j63284P9157n817m8071r8692R1714N7604K9437r5k3469j9313
19373E5187p856M2493P4948p2404q2874j0400J4030j32080j0296L10066N9241
19362B40055n1493K4070j33020j44154j01427M5394L2208J30941L8454K5873j2915
19351I3986m9856k8466o7703J4092p0366N6574j05929n4104O3584L5683J65562
19340E3057n3384j02671J3037p6278K0902j06994m6407J00356Q1032K17288J02243
$$ plain form
19419 -14304 23786 19852 116257 163803 189536 235178 254255 301907 286865 226747 248699 224950
19407 224950 140057 122745 165474 221990 394117 446079 271928 227075 188198 -21878 -102417
19396 -102417 -74555 -62749 85064 97599 111577 105914 51321 -18882 -89355 32693 110417
19385 110417 156016 -7268 71889 66072 18001 -80691 11023 68627 98064 97969 74500 55187
19373 55187 47331 89824 164772 92368 9494 -906 13124 -118956 -129252 180814 240055
19362 240055 188562 212632 79612 -64542 -165969 -120575 -88367 42574 81028 106901 93986
19351 93986 44130 15664 -52039 -37947 -108313 -51739 -157668 -211772 -148188 -112505 53057
19340 53057 -327 -102998 -89961 -166239 -145337 -252331 -298738 -198382 -117350 99938 202181
19329B02181j4210k5162p548J3867L5252R2231o6687M687O7172o3675j35270l5070
19317F7768o8437j0987M0782m290k8588L8867P5711o1491Q9135l8804J5405k0037
19305I5034j13561M0310j0202J16666P9612K3042K5728j20005j06327L6195l0472
19294C6020l0951O7243J76544j32654r5961l8639K0990M0831n2579K1637m101
19283H380p9778O3503Q9849j53894k0241K013n05j0026L4503K1315R0763p7791
19271c1909J8850k4746O4001k0433o8124Q4154J24032J10312k4203j44706j82884
19260i5656P4689K11638m0279j39304J6528L3784J38246l0629j26294L5630K483
19249H0836m5372j1101m718m9778r5344r1318J84826M1964J11692J23001N1156
$$ plain form
19329 202181 187971 162809 155261 169128 204380 296611 229924 234611 301783 238108 102838 67768
19317 67768 -669 -11656 29126 24836 -3752 35115 110826 49335 138470 99666 115071 95034
19305 95034 -18527 21783 11581 128247 207859 230901 256629 136624 30297 66492 36020
19294 36020 5069 72312 248856 116202 20241 -18398 2592 43423 -9156 12481 8380
19283 8380 -71398 -7895 81954 -71940 -92181 -90168 -90673 -100699 -66196 -44881 45882 -31909
19271 -31909 -13059 -37805 26196 5763 -62361 21793 145825 256137 231934 87228 -95656
19260 -95656 -20967 190671 150392 11088 27616 61400 199646 169017 42723 78353 80836
19249 80836 35464 24363 19645 -30133 -125477 -216795 -31969 9995 121687 244688 295844
19238B95844p2707j40916j02774l2138L6246K5211q5834J26465J68585j6525j17021
19227H4436K2264K3618R4289l9218j52158j04649j02998J04132J17024Q3806j01105
19216B9441k04954k5753q8071M502J87657N3563J4608r968j24570m0575L0175
19205a73945J28776J12981p2932k71n9418O9664J46431L1871j7121r2751R752
19194H3037J19679K5273l694J955j79278k7475o9894q2201o2806O6480N8089j16098
19182a86933R6038J19998k0664j8625J82782j46648K2280L4749q1574P7996J42590
19171B21989j3019j38363q5068J2003Q2582p6018l9185J6294L86m6008N4421P0114
19159F0128Q2355L054N9218l2196j03872j43759k3354R724M3518M9316J11012
$$ plain form
19238 295844 223137 82221 -20553 -52691 -16445 8766 -77068 49397 217982 201457 84436
19227 84436 106700 130318 224607 185389 33231 -71418 -174416 -70284 46740 130546 29441
19216 29441 -175513 -201266 -289337 -284835 -97178 -43615 -29007 -38975 -163545 -204120 -173945
19205 -173945 -45169 67812 -5120 -5391 -64809 4855 151286 183157 166036 73285 83037
19194 83037 202716 227989 224295 226250 46972 19497 -50397 -132598 -195404 -128924 -70835 -186933
19182 -186933 -90895 29103 8439 -10186 172596 25948 48228 82977 1403 79399 221989
19171 221989 208970 70607 -14461 -2458 80124 4106 -35079 -18785 -18399 -64407 -9986 60128
19159 60128 142483 145537 204755 172559 68687 -75072 -98426 -88702 -45184 4132 115144
19148A15144L3461p7320j68177m4952J02342J31814M5484l4757j55500J7092o115
19137d1484O1604J39452R2218l3349J9620j19015n0265J05835L0218J7687k2246
19126B00275o4935Q6483p204k678j05666l21O8845L8663j15473j92085j8639M5129
19114f7606O5218j2673o2821M7714J19457J89167P444k25039L4315Q3482Q7832
19103B66490J26816j62754j22394Q0648l8270j6410M4194l3009n7691p6574k5614
19092a4568n1890L3619L6182q3781O6771K61926M1581r8175k8310M4253l5179
19081A72429m1315N2894K5349J3076j2322M458O0523j02317m6755O9346L768j2714
19069A86420L4216o4964k6580O8310J34495j00028k1673n8687o2409j58519K4481
$$ plain form
19148 115144 148605 71285 -96892 -141844 -39502 92312 137796 103039 -52461 -35369 -41484
19137 -41484 20120 159572 251790 218441 238061 119046 68781 174616 204834 222521 200275
19126 200275 135340 221823 214619 211941 106275 105954 174799 213462 97989 -94096 -112735 -67606
19114 -67606 -2388 -15061 -77882 -30168 89289 278456 285900 60861 95176 178658 266490
19103 266490 393306 230552 108158 188806 150536 134126 178320 145311 87620 11046 -14568
19092 -14568 -66458 -32839 3343 -80438 -13667 248259 289840 191665 163355 207608 172429
19081 172429 131114 184008 209357 222433 210111 214569 275092 172775 126020 195366 199134 186420
19069 186420 220636 155672 129092 197402 331897 231869 210196 151509 89100 -69419 -44938
19058d4938J39512Q76J4986q5666r9603N170n8316O0441J35858J537m4227J3072
19046C8702K1332J21008P1061k1376j25085n7474r3862K2256J66310J62089J66916
19035D71877p7017p3063K4166J9214L143L6743j39063L0450J4610q5412j49873
19024G5775J50458J02577l2026m8739j5223j2611j06779M4297R0801k8428K061
19013B22163o0374r0804q4531J1970O1562J51077p9946j43496j27570L0020J22565
19002A2636O0170J16863l57j16875n4391L9558n7953l0608m494k2877k7374o5396
18990a51098J19078K15263L6781r0976J6196o1856R6648j8706r2962q268L1035
18979I1135j08207j06695L1286j6867L5570J13266o5367q3189o0487K18768R5758
$$ plain form
19058 -44938 94574 95450 110436 24770 -74833 -69663 -127979 -67538 68320 69857 25630 38702
19046 38702 60034 181042 252103 230727 105642 48168 -45694 -23438 142872 304961 471877
19035 471877 394860 321797 345963 365177 368320 405063 266000 296450 311060 225648 75775
19024 75775 226233 328810 296784 248045 232822 220211 113432 157729 248530 220102 222163
19013 222163 161789 70985 -13546 -1576 59986 211063 131117 -12379 -139949 -109929 12636
19002 12636 72806 189669 189312 72437 18046 57604 -349 -30957 -35451 -58328 -85702 -151098
18990 -151098 -32020 183243 220024 129048 145244 83388 180036 161330 68368 60100 91135
18979 91135 -17072 -123767 -92481 -109348 -73778 39488 -25879 -109068 -169555 49213 144971
18968A44971O4791K670r762m2574n1281j6481J5865K4092o4301m8511l1363J05843
18956I3959L7235m9163q5761k05861J57644J72435k2867L754O5223J38507P533
18945C12638n4632M2664j3315O973q0906j35762Q5248J97545J13502j88054n7864
18934B28037l2623r6398O7621R3018J09169n8383J8327m9772L9053R042K423q2579
18922B46935l4569n9674n3977k1874j2399k5426r0034N9840P4920p4627k2100
18911a2985J9152J20200P7352K53L9218N6759l0185N0565n1745j33655L632N0675
18899A89236O3511o2273p4520k9104m1039k5850J77417m3131Q332J136J6449j14698
18887F5466P8775P0951k2291M3569p9827n4295K4452j13845L0710K1756j3000
$$ plain form
18968 144971 209762 212432 202670 160096 108815 92334 108199 132291 67990 19479 -11884 93959
18956 93959 131194 82031 -3730 -209591 -51947 120488 97621 101375 166598 305105 312638
18945 312638 258006 300670 287355 294328 213422 77660 162908 360453 473955 285901 228037
18934 228037 195414 99016 166637 259655 368824 310441 328768 278996 318049 327091 329514 246935
18922 246935 212366 152692 98715 76841 64442 39016 -51018 8822 83742 9115 -12985
18911 -12985 6167 126367 203719 203972 243190 299949 269764 320329 268584 134929 138561 189236
18899 189236 252747 190474 115954 86850 45811 19961 197378 154247 162579 163715 180164 65466
18887 65466 144241 215192 192901 236470 156643 102348 126800 12955 43665 65421 52421
18876E2421k8565m2898O2576P3754j3907L4292K0010n7785R7351J97870J930j13962
18864B83087j13236K7286J06870P155Q774r9522j10634j30885J6252m332O596
18853b589M5986J53060J300k22022p5297P7595O0155r1877Q2238J03676r0625
18842D1600q9277N7070Q4296Q7468M5625L55R6982K0665k38006j70120q6222l068
18830a52632Q753J46209Q5151r8863p6375k8175M809o4349m9300N8311O1115R5302
18818a0044J41805p567q0201K5693J50979J31004o6882J1835J35640j54314J1969
18807B89917k2128J535N8773m8534r910r8314l8487q1744j15250K0822M2655Q3744
18795H3079J930o737J13936O3543J81465n98j46816o0911k1748p7735N4736N2127
$$ plain form
18876 52421 23856 -19042 43534 117288 103381 137673 157683 99898 197249 395119 397049 283087
18864 283087 169851 197137 304007 311162 319936 220414 109780 -21105 -4853 -9185 -2589
18853 -2589 43397 196457 197757 -24265 -99562 -21967 38188 -53689 28549 132225 41600
18842 41600 -47677 9393 93689 181157 226782 227137 324119 344784 106778 -63342 -149564 -152632
18830 -152632 -143879 2330 87481 -11382 -87757 -115932 -111123 -175472 -224772 -166461 -105346 -10044
18818 -10044 131761 124194 43993 69686 220665 351669 284787 296622 432262 277948 289917
18807 289917 267789 269324 328097 279563 269653 171339 132852 51108 -64142 -43320 -665 83079
18795 83079 85009 78272 192208 255751 437216 436618 289802 228891 207143 129408 184144 236271
18783B36271j23916q8607k249r750R3315P6052O824l1095m7458M9030m8003R5757
18771B06171K12670J49696Q3970k7673l6514n2198O4403J39814p1697j91932k08563
18760B68147j22250M011O0574J47555j3j11100l8210N003n4578o7759J12163Q0895
18748B84438j848n5412J1677j02572o6410L8653j2059q6285o2770L9706N2172
18737C9290L4578R918n6887P4615q760n1087j00200q6311m5107J33J00430J10198
18725B0810J17160m3935l0329R5830O9034N2950K2890m5815n2945j17305L0194
18714A18539j8658J7602k7467P5938o7709l8074k7547j43659P5408N9454N7334
18703H1161Q424Q8545J6694P0645p8275o8079q660o6655l6261l3335J7953M6106
$$ plain form
18783 236271 112355 23748 21499 11749 105064 181116 187940 156845 109387 158417 110414 206171
18771 206171 418841 568537 652507 624834 588320 536122 600525 740339 668642 476710 268147
18760 268147 145897 149908 210482 358037 358024 246924 208714 213717 159139 91380 203543 284438
18748 284438 282590 227178 238855 136283 69873 108526 96467 10182 -52588 -12882 39290
18737 39290 73868 83786 26899 101514 92754 41667 -58533 -144844 -189951 -189818 -89388 20810
18725 20810 137970 94035 63706 159536 228570 281520 304410 258595 205650 88345 118539
18714 118539 99881 117483 90016 165954 98245 60171 32624 -111035 -35627 23827 81161
18703 81161 89585 178130 194824 265469 187194 119115 110455 43800 7539 -25796 -7843 38263
18691C8263J617K1957o507J10261M1483Q234j786j2592p7146q5143L7954l6097
18679D0498L4523J06203J51039P8580k29972J9693o3887l7491J11105L6954J05823
18668C53068J06637k4551j49693j62377p5043l6890N3876J7804P0209J027p6379
18657G7688J82837N993M5430N2916l6978J5732p0597j87816r3195J25815o4657
18646E3168j420j964o3342k3847M8469L5582k7903r1322l5278J70844Q0371J6926
18634A60284n3773j03947J95491J71769J17981q7316j60578j9903j4891N8216
18624B63333p5862p1479j1226l6892Q2229K5403j6873j8105Q624Q5954r3074j46182
18612d150m6793J14702J40740j88825J7068l056O586R7068M4370Q3408r9826o5010
$$ plain form
18691 38263 39880 61837 55330 165591 207074 215308 213522 200930 123784 38641 76595 40498
18679 40498 75021 181224 332263 410843 180871 200564 136677 99186 210291 247245 353068
18668 353068 459705 435154 285461 123084 48041 11151 65027 82831 153040 154067 77688
18657 77688 260525 266518 311948 364864 327886 343618 273021 85205 -7990 117825 53168
18646 53168 51748 49784 -13558 -37405 11064 46646 18743 -72579 -107857 62987 143358 160284
18634 160284 106511 2564 198055 369824 487805 400489 239911 220008 205117 263333
18624 263333 187471 115992 104766 67874 150103 175506 158633 140528 149152 235106 142032 -4150
18612 -4150 -50943 63759 204499 15674 32742 29686 36272 133340 177710 261118 161292 96282
18600I6282O5236O9633m6380L0847j36195K1371n143J14370k5136r6362L3039
18589A21562J10465R9625j28558r4813l44J2908M0748J5316j3535m1579J6065
18578A37860k4316M3819n0557k536J17394L2409j07206j90164j4652k7291J59712
18567G4472J15294Q2138Q2923k12124n8286P4404J07853J07395L5798P8210K7199
18556E15276j16191r2541J05533N4421q5993j04067N5016j8683j09245k8040n5360
18545A20126n8067J21874O2402l5756J16389N1540R5127q7230r9351n2669j6581
18534B17804m2220j31694j7133L6392J01407L2380n6430j06515M6301r4799Q9185
18523G4678J21592J55470J10725l6592k2661p027N4996m0989o8774Q7811j8424
$$ plain form
18600 96282 161518 231151 184771 215618 79423 100794 95651 210021 184885 88523 121562
18589 121562 232027 331652 203094 108281 107937 120845 161593 176909 163374 121795 137860
18578 137860 113544 157363 106806 104270 221664 254073 146867 -43297 -57949 -85240 74472
18567 74472 189766 271904 354827 142703 84417 158821 266674 374069 409867 488077 515276
18556 515276 399085 306544 412077 466498 380505 276438 331454 312771 203526 175486 120126
18545 120126 62059 183933 246335 210579 326968 378508 473635 386405 287054 234385 217804
18534 217804 175584 43890 26757 63149 164556 196936 140506 33991 80292 -14507 74678
18523 74678 196270 351740 462465 425873 403212 396185 451181 410192 341418 429229 410805
18512D10805M4179M306l2632Q5555q3898j01062l7646n0481L1085J01200k1157
18501C50254j1618K18844k7597m508J74j36207k0966m690J4249o7861n0754K8834
18489B88154k1150k3699j1517Q8563q1258N6705Q5M8457m0773m3011j57073p7341
18477B6142J43491L6626j28145j04506N7266M4136P5074k6766J03172M1409o2397
18466B05502O3000P1934m4166J8918K3468p7222n6602m7702m4423p1463M1577
18455H2821J49623j44078Q1843J30885p029m5877j0918P1637N2023l4207q5420
18444B41303J7301r3043n5369p659n0846J8335J79991N7714j4052n4187n1872
18433A87616l651P4775j0203o7251R9654M842j75212J05686L6632m4164M3509
$$ plain form
18512 410805 454984 459290 426658 512213 428315 327253 289607 239126 270211 371411 350254
18501 350254 338636 557480 529883 525375 525549 389342 368376 363686 377935 310074 259320 288154
18489 288154 267004 243305 231788 320351 239093 295798 295883 344340 303567 260556 103483 26142
18477 26142 169633 206259 78114 -26392 30874 75010 150084 123318 226490 267899 205502
18466 205502 268502 340436 296270 315188 338656 261434 204832 157130 112707 41244 82821
18455 82821 232444 88366 170209 301094 294065 248188 237270 308907 360930 326723 241303
18444 241303 258604 165561 110192 102533 51687 70022 250013 307727 293675 239488 187616
18433 187616 183965 258740 248537 181286 280940 285782 110570 216256 252888 208724 252233
18422B52233k9806n0128M7966Q7227J00196j49156j67112O48J27722N7599o567
18411B70822J9239p6995q3045l043K31098l5010r4131N6144J9000o3187p6005
18400A64887M2519l3872j9319r6021K072J6144R4920J4736M2709l9604r5Q2748
18388B71824J04985L2200j0016O3247r0611j9362l953j89528M0585J93552K6818
18377D19741j79102k9117O7443J57805Q1839l8316M3181n9639n1251J13171m1183
18366D84572J45691K6530K8112M3067p8614j38155j45888k2534j10174J40812
18356C73419J1944O6667L7686j24201j2215O0519O6162p2510j85716q9403k231
18345A30121L803K9382O0887J4517p2379o5040N0698q764o083L2277L1576m4889
$$ plain form
18422 252233 222427 172299 220265 307492 407688 258532 91420 92068 219790 277389 270822
18411 270822 290061 213066 130021 126978 358076 323066 228935 285079 304079 240892 164887
18400 164887 207406 173534 154215 58194 60266 76410 171330 186066 228775 189171 189076 271824
18388 271824 376809 409009 398993 462240 371629 352267 348314 158786 199371 392923 419741
18377 419741 240639 211522 278965 436770 518609 480293 523474 463835 412584 525755 484572
18366 484572 630263 656793 684905 727972 649358 511203 365315 342781 232607 373419
18356 373419 385363 452030 489716 365515 353300 413819 479981 407471 221755 132352 130121
18345 130121 133924 163306 224193 238710 166331 101291 151989 143225 137142 169419 200995 156106
18333A56106K5496N3994q7140J13329K04230L840L4196o4271p8311K2495M5677
18322D29641l9846o9643J06579n363K8974Q0933j64000L1713j34862j56927J04945
18311B12144k6527Q446O6860O1149n3975j04227O1846q4449j39544K9065Q3823
18300A14611R0383L2100n5363m9884k4991K961J74152K20943p4507o708o3316
18289C60381N5550m9573J8516Q6150n8896J23764l0820j49381K1497j0840j58700
18278B07648L2492L1203R4889j88r7914J05032R4291R9185o0156j57552L2879
18267C81809k6886P3856P9149P9696O7228n5910N6893j07793r8278o4545j5178
18256C70041Q3731l8889k16362m2407K37146O6467N7212j36142J5188K1884J0733
$$ plain form
18333 156106 181602 235596 148456 261785 466015 469855 504051 439780 361469 383964 429641
18322 429641 389795 320152 426731 421368 450342 531275 367275 398988 264126 107199 212144
18311 212144 185617 194063 260923 322072 268097 163870 225716 141267 1723 30788 114611
18300 114611 204994 237094 181731 131847 106856 109817 283969 504912 430405 423697 360381
18289 360381 415931 366358 384874 471024 412128 535892 505072 355691 377188 366348 207648
18278 207648 240140 271343 366232 366044 268130 373162 467453 566638 506482 348930 381809
18267 381809 354923 428779 507928 587624 654852 598942 655835 548042 449764 385219 370041
18256 370041 453772 414883 198521 156114 393260 459727 516939 380797 395985 417869 428602
18245D28602J36357O5421Q911M0101r62n0817P1857J86467J9590j01084j50025
18234F54418j6927J15879P4882j01122N8419J02040j10666r5596R9293N6964P4645
18223I12229p0720j15040j8065J69059J68549Q0143m1548k3928j8251n7790J2943
18212I97581l8973J32596N8456o9282J58080M8664J8013Q358N4156m9550K0340
18201A338439J80891J57211J86448P5059P1354O7148L53164N12997L42508l702
18191C281517J3801m5841n2941k195N5721J60970L46224J67873j65408j14318
18181C645403p0235m8392k61186j83921k13111o7203J64828Q7512N3059k691P8406
18170C182469M3625J29187K51716K11023J56038K00475J35657k1669P405J58000
$$ plain form
18245 428602 564959 630380 639291 679392 678430 627613 699470 885937 905527 804443 654418
18234 654418 637491 753370 828252 727130 785549 887589 776923 681327 780620 837584 912229
18223 912229 841509 726469 708404 877463 1046012 1126155 1084607 1060679 1042428 984638 997581
18212 997581 958608 1091204 1149660 1080378 1238458 1287122 1305135 1313493 1367649 1318099 1338439
18201 1338439 1519330 1676541 1862989 1938048 2009402 2076550 2429714 2942711 3285219 3281517
18191 3281517 3295318 3249477 3196536 3194341 3250062 3411032 3757256 3925129 3759721 3645403
18181 3645403 3575168 3526776 3265590 3081669 2868558 2801355 2966183 3053695 3106754 3104063 3182469
18170 3182469 3226094 3355281 3606997 3818020 3974058 4174533 4310190 4288521 4295926 4453926
18160D453926K43397K94799N48598L09970j3568m6379O7615K01607n870P0730
18150F124825J06959N51655M45744J60785J34534o781K3007n0281j47377j04167
18140G238903J95662L08420L56079K75138K48683K72930N35572M87971N87931
18131A0507289R35997J040964J184892P12060J24315K37428N34943N59469N67533
18122A6404890O32452N72109Q92580J514432K036415K879350L969708N662670
18114C4564606R262588J6656163K8330799K8225896J330989j0588584p182630
18107A00599827m868518o039058j2521774j6847431j5152782j1002138o869684
18100B7298442m299594k722339j500531o17026n95684j192174j158437p95261
$$ plain form
18160 4453926 4697323 4992122 5540720 5850690 5837122 5790743 5858358 6059965 6054095 6124825
18150 6124825 6231784 6783439 7229183 7389968 7524502 7517721 7540728 7490447 7343070 7238903
18140 7238903 7434565 7742985 8099064 8374202 8622885 8895815 9431387 9919358 10507289
18131 10507289 11443286 12484250 13669142 14381202 14505517 14742945 15277888 15837357 16404890
18122 16404890 17037342 17609451 18502031 20016463 22052878 24932228 28901936 34564606
18114 34564606 43827194 60483357 88814156 117040052 118371041 107782457 100599827
18107 100599827 95731309 89692251 77170477 60323046 45170264 34168126 27298442
18100 27298442 22998848 20276509 18775978 18158952 17563268 16371094 15212657 14417396
18092A4417396p31183q07966r31327q90945q01978q00027o70138l82991j15071
18083H285770r2614j66733m3059K75193M75233P91754J045132J078291N48710
18074A2197677j24147m06574m28854m12899m32757p71997q98485q51510o91901
18065G178553n81943o29118o31805n31696l06945j02405j37541k35868k00077
18056C821155j00446j72415j83237j48299L5886M322j77062j83179j12823k4037
18046B759865j85511n6727p045j19587k09416k802L843p3360j77585N3065N37
18035A985277K1896P4868K9293L5141N2157Q8465K6509J51286m589N0849K7577
18024B538729Q5705L16400K32743J15263K05842K82739M03647K99512K74479M15887
$$ plain form
18092 14417396 13686213 12878247 11946920 11055975 10253997 9453970 8783832 8400841 8285770
18083 8285770 8193156 8026423 7983364 8258557 8733790 9525544 10570676 11648967 12197677
18074 12197677 12073530 11666956 11238102 10825203 10392446 9620449 8721964 7870454 7178553
18065 7178553 6596610 5967492 5335687 4803991 4497046 4394641 4257100 4021232 3821155
18056 3821155 3720709 3548294 3365057 3216758 3252644 3256966 3079904 2896725 2783902 2759865
18046 2759865 2574354 2517627 2510582 2390995 2181579 2178777 2182620 2109260 1931675 1984740 1985277
18035 1985277 2007173 2082041 2111334 2146475 2198632 2287097 2313606 2464892 2460303 2511152 2538729
18024 2538729 2624434 2940834 3173577 3288840 3494682 3777421 4181068 4480580 4755059 5170946
18014E170946N30571M79044M10435M75167M44373L20417K25272M7676K85419K49067
18004H638387M4844q3580j94880k13503l83867o54709n14005l73871m60795n79162
17994E224859n41645l87743j96681j32864k35515k55675p2215J20p8654j8430
17984C305557p9078j16539r0554Q4719Q156m3031k733J0330J5168J10551K40282
17973C442828L47089K10512R9984L54597L74417N25821M50357L34491J47951l3772
17963F254275n7941Q6419q6813k56556j46515q1347j05283l2196j11468r5381
17953E367194k24722k22061k34378l22183k92522j29004p7358k7743J26723J90701
17943D154647N8325j21992k94736l13689j35340N6572j88906k50516j55676k0992
$$ plain form
18014 5170946 5701517 6180561 6590996 7066163 7510536 7830953 8056225 8103901 8389320 8638387
18004 8638387 8683231 8599651 8404771 8191268 7807401 7152692 6638687 6264816 5804021 5224859
17994 5224859 4683214 4295471 4098790 3965926 3730411 3474736 3402521 3402641 3323987 3305557
17984 3305557 3226479 3109940 3019386 3104105 3112261 3069230 3066497 3076827 3091995 3202546 3442828
17973 3442828 3789917 4000429 4100413 4455010 4829427 5355248 5805605 6140096 6288047 6254275
17963 6254275 6196334 6282753 6195940 5939384 5792869 5711522 5606239 5574043 5462575 5367194
17953 5367194 5142472 4920411 4686033 4363850 4071328 3942324 3864966 3837223 3963946 4154647
17943 4154647 4212972 4090980 3796244 3482555 3347215 3403787 3214881 2964365 2808689 2787697
17933B787697J92828L45472K74668r0670k01434j40604j18536q3373m01615l08551
17923B255882j77892j16288n1389o4839J9477q6950r8280L936n799Q2257J08209
17912A868324N2127J74263N03408N16502N34562j116k91409j80489P103j48362
17902C034913l25389l93768l30169j29992n9842j34940j86328M5044M8149k88045
17892A279633j50325k00862j57571K0739J99666O1222k7276p6011J2791k6309
17882I35697j30845m3018p7092j772Q2408j7350J16152J10135k3285j02121l8139
17871H10770L4999j12412j3419j28717o9712J37610P4019r859r6708J5563N0825
17860F92959P6814o5608o2238O4473M4825j8845J12688J4516O0621O7397R436
$$ plain form
17933 2787697 2980525 3325997 3600665 3509995 3308561 3167957 3049421 2966048 2564433 2255882
17923 2255882 2077990 1961702 1910313 1845474 1864951 1778001 1679721 1683657 1677858 1760115 1868324
17912 1868324 1920451 2094714 2598122 3114624 3649186 3648070 3356661 3176172 3183275 3034913
17902 3034913 2709524 2315756 1985587 1855595 1795753 1660813 1474485 1519529 1567678 1279633
17892 1279633 1129308 928446 770875 791614 991280 1052502 1025226 949215 962006 935697
17882 935697 804852 761834 684742 682970 765378 748028 864180 974315 951030 848909 810770
17871 810770 845769 733357 719938 591221 521509 659119 733138 723279 626571 642134 692959
17860 692959 769773 704165 641927 706400 751225 732380 845068 859584 920205 987602 997038
17849I97038K7334m1440q5288K633m119R5014N6788q18O2723j9661l4525j75700
17837H79979N897L41842K25487j20185r6209j20776k9885M9456J31740R8212j17631
17826A247927p7194o0973j82425J9405J08508j6607J12300K98478M3551L253O0055
17815A556278j7633j67475q085n574R3775J56851m5822o5367N7961K475o0375
17804A497009j12352r7794K5658N2126n7922J44825M5711L1282j24174n7733k4571
17793A322065j27051Q4210O1516M1218J31504R6055p6450k8035P3206J49914R8152
17782A826304Q0089j07349j3122j37703n0152l1651q9401L4071J9313O7470o8733
17771A529136J5914O2053R9188O3154J0810n7091j3696P2160L4018P758R6996
$$ plain form
17849 997038 1024372 982932 897644 900277 896158 991172 1047960 1047142 1109865 1090204 1055679 879979
17837 879979 885876 1227718 1453205 1333020 1236811 1116035 1086150 1135606 1267346 1365558 1247927
17826 1247927 1170733 1109760 927335 946740 1055248 1038641 1150941 1449419 1492970 1496223 1556278
17815 1556278 1538645 1371170 1363085 1357511 1451286 1608137 1562315 1496948 1554909 1557384 1497009
17804 1497009 1384657 1286863 1312521 1364647 1306725 1451550 1497261 1528543 1404369 1346636 1322065
17793 1322065 1195014 1279224 1340740 1381958 1513462 1609517 1533067 1505032 1578238 1728152 1826304
17782 1826304 1906393 1799044 1785922 1648219 1598067 1566416 1477015 1511086 1530399 1597869 1529136
17771 1529136 1545050 1607103 1706291 1769445 1780255 1723164 1709468 1781628 1815646 1823404 1920400
17760A920400L6654j04895J2364K7492R3705J27142J79574L47230K46527K02964
17750C089157K50969L65735K71751J22774l5650k0869J39847J2560j05791j08957
17740C981526K01149K69085r938O7056j08763j75661j30012l9867j48996j52760
17730C752819P1610Q9353j9936J80167L96697M80081J53199j03293M517J10437
17720E115651J12454k2227J3714Q1515J29716O8599j98110j74691j69403j71608
17710D785610k29467k45909k57506k30771j23704o9338N1123j22095J2549J15947
17700C686439K66159K06832L5345J08800J77799J03071J61640K54087R3705r4257
17690D999620K0295O2448l6815J02803J61819L46216K82222Q3976j27817l8306
$$ plain form
17760 1920400 1957054 1852159 1864523 1892015 1985720 2112862 2292436 2639666 2886193 3089157
17750 3089157 3340126 3705861 3977612 4100386 4064736 4043867 4183714 4196274 4090483 3981526
17740 3981526 4182675 4451760 4441822 4508878 4400115 4224454 4094442 4054575 3905579 3752819
17730 3752819 3824429 3913782 3893846 4074013 4470710 4950791 5103990 5000697 5005214 5115651
17720 5115651 5228105 5205878 5219592 5301107 5430823 5499422 5301312 5126621 4957218 4785610
17710 4785610 4556143 4310234 4052728 3821957 3698253 3628915 3680038 3557943 3570492 3686439
17700 3686439 3952598 4159430 4194775 4303575 4481374 4584445 4746085 5000172 5093877 4999620
17690 4999620 5019915 5082363 5045548 5148351 5310170 5656386 5938608 6022584 5894767 5856461
17680E856461m9061Q2367K23279L2200L2922J18468J05289k7075M3077K21722
17670F639649K10258K23442J70830J80952J76603J58389K56901M52537K85842
17661H755403K98480R3081R4872K45867L55523L32795K33222L24824L37591M40233
17651A1511891L88665L84022N92882L64315K59981M55664N12145M71084N23525
17642A5464174N74377O82040O90194O83773O67032R23292J029070J135350R23690
17633B2772992J121763J199228J258194J428300J688504J674022K021135J981879
17625C5146017J627628J309114J492631J582912J753873J816790J725806J839593
17617D8294364J948440J986320K158171K465165K756047L046855L392298M078655
$$ plain form
17680 5856461 5807400 5889767 6113046 6145246 6178168 6296636 6401925 6374850 6417927 6639649
17670 6639649 6849907 7073349 7244179 7425131 7601734 7760123 8017024 8469561 8755403
17661 8755403 9053883 9146964 9241836 9487703 9843226 10176021 10409243 10734067 11071658 11511891
17651 11511891 11900556 12284578 12877460 13241775 13501756 13957420 14469565 14940649 15464174
17642 15464174 16038551 16720591 17410785 18094558 18761590 19684882 20713952 21849302 22772992
17633 22772992 23894755 25093983 26352177 27780477 29468981 31143003 33164138 35146017
17625 35146017 36773645 38082759 39575390 41158302 42912175 44728965 46454771 48294364
17617 48294364 50242804 52229124 54387295 56852460 59608507 62655362 66047660 70126315
17609G0126315N155790O958468R269528J2398262J8460777L0336968N1482603
17602B04188711P1596350M0408824r472840j3599364l469655K143070l86527l149020
17594B88259549J4142566M3184937K6888580k2416718k8806356j8289966j3457271
17587B89505321k0191685l4561734l8250647l0851429j9911006j1064209o476052
17580A28198559l955452k521413j279007P5527J223557J818007L050103N216337
17572A31826218P764473J0937503J6275739K6151719M5200784P7661757J04413185
17565D20231378N1236463j9877022k2905424p419056N18524m990420q581891J9055952
17557D27268504O0315232L0151018m0223385m6227354k9820302k3314314l5341496
$$ plain form
17609 70126315 75282105 82240573 91510101 103908363 122369140 152706108 204188711
17602 204188711 275785061 316193885 306721045 293121681 289652026 291795096 291408569 288259549
17594 288259549 302402115 345587052 372475632 350058914 321252558 302962592 289505321
17587 289505321 269313636 234751902 196501255 165649826 145738820 134674611 128198559
17580 128198559 124243107 121721694 120442687 120518214 121741771 123559778 126609881 131826218
17572 131826218 139590691 150528194 166803933 192955652 238156436 315818193 420231378
17565 420231378 471467841 451590819 428685395 421266339 421784863 416794443 408212552 427268504
17557 427268504 487583736 517734754 477511369 431284015 401463713 378149399 342807903
17550C42807903n6500705o0771825m9342988l3472574k1429410j4276962r976285
17543I7037154p965574o720957n121209m288181m176511m044944l311366k888427
17535E8519985k867097k870828k479999j808111j721815k154600k266539k040451
17527D0310545j849500j686643j850751j783990j772297j582142j521338j129054
17519B7134830q52291r47290p62853o01734m69925m09052k35645M2213N22365
17510B3420618Q97581Q5092o85459m19571j69699l43766k88013m67515k08820
17501B1820448J99199l86362o53262n12169m86065n16987p08528p49777p08944
17492A7297553o06827m93290l59387l08929p2937J07798R9488J15230J5910K36136
$$ plain form
17550 342807903 286307198 225535373 176192385 142719811 121290401 107013439 97037154
17543 97037154 89071580 82350623 77229414 72941233 68764722 64719778 61408412 58519985
17535 58519985 55652888 52782060 50302061 48493950 46772135 44617535 42350996 40310545
17527 40310545 38461045 36774402 34923651 33139661 31367364 29785222 28263884 27134830
17519 27134830 26282539 25335249 24572396 23970662 23500737 23091685 22856040 22898253 23420618
17510 23420618 24318199 24403291 23717832 23298261 23128562 22784796 22496783 22029268 21820448
17501 21820448 22019647 21633285 20980023 20467854 19981789 19464802 18756274 18006497 17297553
17492 17297553 16690726 16197436 15838049 15529120 15456183 15563981 15663469 15778699 15794609 16030745
17482A6030745L71519L39959O31942R07862J301952Q39939K57320L60098O73619
17473B1714955R06913O01934K86528O42373J049509O34680K10605J55672M36721
17464B6639890M84842N67765N03366O13663R58830J041413J327548J482986J555820
17455C5176123J621625J792369J900947K099027K541772K561794K058598J788872
17447E1541127J917199J958150K018450K246746K505412K873975L752230M605900
17439G3419189N860428P956686J0969164J4953191K1659870L4894259N9790887
17432B29503674R1937151P4397043m468976k9442527j9346549j2373368j9371879
17425C10834569l9331549m8681195m1939891k8439235j6378417r195670m720937
$$ plain form
17482 16030745 16402264 16742223 17374165 18282027 19583979 20423918 20681238 21041336 21714955
17473 21714955 22621868 23223802 23510330 24152703 25202212 25836892 26047497 26203169 26639890
17464 26639890 27124732 27692497 28195863 28809526 29768356 30809769 32137317 33620303 35176123
17455 35176123 36797748 38590117 40491064 42590091 45131863 47693657 49752255 51541127
17447 51541127 53458326 55416476 57434926 59681672 62187084 65061059 68813289 73419189
17439 73419189 79279617 87236303 98205467 113158658 134818528 169712787 229503674
17432 229503674 321440825 395837868 391368892 361926365 342579816 330206448 310834569
17425 310834569 271503020 222821825 180881934 152442699 136064282 126868612 122147675
17418A22147675j702451N44992K905777N874016R490982J4107643K0434887L2047554
17410B05851075N5110980R2577968J08806368L0758470l4124036l1693546j8959632
17403D08327647j7774066l5648780n3564180m9691711l0961626o029194K1049286
17396B35707376M7425085L6303335j2450175k4498803j6440631j1206236j5363617
17389B39476334k8221694l4156947k9455297k0423075j2835437q430430n643769
17382A00309685l724242k139498k92763J987562M701109Q208295J2861684K1290676
17374A43202508L8236386O5226067P4140076J5045614k7534737k3785976j5221467
17367B69308471j5528532k9824514m3431895m1754494l1160715j9880080j2702945
$$ plain form
17418 122147675 120445224 120990216 123895993 129770009 139260991 153368634 173803521 205851075
17410 205851075 260962055 353540023 462346391 493104861 458980825 427287279 408327647
17403 408327647 390553581 354904801 301340621 251648910 220687284 214658090 235707376
17396 235707376 283132461 319435796 306985621 282486818 266046187 254839951 239476334
17389 239476334 211254640 177097693 147642396 127219321 114383884 105953454 100309685
17382 100309685 96585443 94445945 94153182 96140744 100841853 109050148 121911832 143202508
17374 143202508 181438894 246664961 320805037 335850651 308315914 284529938 269308471
17367 269308471 253779939 223955425 180523530 138769036 107608321 87728241 75025296
17360G5025296q882856o494092n105198m139256l349181k473246j562003j298497
17352D1720967j859012k135187j894685j782379j723638j693954j836714j667063
17344B7128335j485920j467678j042100r71496q06761q94323r06961q01663p98820
17335A7952613q05435n34209k92653j87611O0107j82437q53174p45035o43115
17326A3769051o66016n53394m55226n89293l54260l73378m83510k99546l3229
17317I961199j21880o246l5109k46355j49323k05996r0433n5872N2468N9878k53162
17306H909169m29134k65459j78016j41484j27342j03728j24900n8852q8000k4619
17296G367635k6557J18110K20594J53344K14574m5128o1424J33659J12973J01351
$$ plain form
17360 75025296 66142440 59648348 54543150 50403894 47054713 44581467 43019464 41720967
17352 41720967 39861955 37726768 35832083 34049704 32326066 30632112 28795398 27128335
17344 27128335 25642415 24174737 23132637 22161141 21354380 20460057 19553096 18751433 17952613
17335 17952613 17147178 16612969 16320316 16132705 16192812 16010375 15157201 14412166 13769051
17326 13769051 13103035 12549641 12094415 11505122 11150862 10777484 10293974 9994428 9961199
17317 9961199 9839319 9833073 9797964 9551609 9402286 9196290 9105857 9049985 9102453 9162331 8909169
17306 8909169 8480035 8214576 8036560 7895076 7767734 7664006 7539106 7480254 7392254 7367635
17296 7367635 7341078 7459188 7679782 7833126 8047700 8002572 7941148 8074807 8187780 8289131
17286H289131L28632L52895K38851K4617R5124J41006P4722n5687J54557K09546
17276I853394L36549K94488J81794O6789L25190L16450L90329K32526L21012K97280
17266A2615801N00994M83834N72537N81768N74570N31923O23231O07930O45370
17257A7737958O72015P07218P46012O51922Q02419R98706J008399J200561J397585
17248B5922795J605366J558204J254327J259434J381262J453196J662388J660551
17240C7757523J731758K014945K280073K146053J893535K096284K244522K221703
17232E4386396K321459K231042K288348K418839K621514L533107M019579M097705
17224G7917989M472618M883565N594170O585296Q287852J0416477J3544096J8692223
$$ plain form
17286 8289131 8617763 8970658 9209509 9234126 9329250 9470256 9544978 9489291 9643848 9853394
17276 9853394 10189943 10484431 10666225 10733014 11058204 11374654 11764983 11997509 12318521 12615801
17266 12615801 13116795 13600629 14173166 14754934 15329504 15861427 16484658 17092588 17737958
17257 17737958 18409973 19117191 19863203 20515125 21317544 22316250 23324649 24525210 25922795
17248 25922795 27528161 29086365 30340692 31600126 32981388 34434584 36096972 37757523
17240 37757523 39489281 41504226 43784299 45930352 47823887 49920171 52164693 54386396
17232 54386396 56707855 58938897 61227245 63646084 66267598 69800705 73820284 77917989
17224 77917989 82390607 87274172 92868342 99453638 107741490 118157967 131702063 150394286
17216A50394286K7468712M4261528P3764293J00251917N6836689j2161383j9995263
17209D20820779p004174N88267l940358q769784J3779046N2190836L2718709l1112624
17201D69270697l9873839k5267905j7565933k5183931m3323362m7210973l5545442
17194B35299312j7911075j520099J4334393L6614349O5230757O1527580K099518
17187C95674735k3788405j5638325o118635m585271j0710141l692582K4841520
17180C55982896L6502984j0477565l6859740k8863686j9830460k0306375l3755489
17173B42392565m3938379m0369466k9673698j8994608j2530952r413879p630339
17166G9841244o149105n374868m894184m271704l877770l534895l149272k715430
$$ plain form
17216 150394286 177862998 222124526 295888819 396140736 452977425 440816042 420820779
17209 420820779 413816605 414404872 410464514 401694730 415473776 467664612 500383321 469270697
17201 469270697 429396858 404128953 386563020 361379089 318055727 270844754 235299312
17194 235299312 217388237 215868138 230202531 266816880 332047637 393575217 395674735
17187 395674735 371886330 356248005 350129370 345544099 334833958 331141376 355982896
17180 355982896 392485880 382008315 345148575 316284889 296454429 276148054 242392565
17173 242392565 198454186 158084720 128411022 109416414 96885462 87471583 79841244
17166 79841244 73692139 68317271 63423087 59151383 55273613 51738718 48589446 45874016
17158D5874016k600694k151551j708453j448176j327890j488336j522782j487119
17150C2139015j280034j164317j079760j127047j151145r56577j149507j255480
17142B2975148j077337r47850r35037j040534j114084j236749j197442r11494
17134A4514621n52621l97474m26040n90569n57925n71806m85983m31360m86634
17125A0014209m28537m14543n25595n31303l31263j21175k66741n24266m33891
17116F436895l33752m56142m27513l44302l88699m16213j59569j46910l78440
17107C385355l54980j39328j63090k43628l6194Q1856K9739p8139k1211r9092
17097B361288m5227m2978j44305q2212j01423j42963K200l6337J31225p805p7846
$$ plain form
17158 45874016 43273322 41121771 39413318 37965142 36637252 35148916 33626134 32139015
17150 32139015 30858981 29694664 28614904 27487857 26336712 25380135 24230628 22975148
17142 22975148 21897811 20949961 20014924 18974390 17860306 16623557 15426115 14514621
17134 14514621 13962000 13564526 13138486 12547917 11989992 11418186 10932203 10500843 10014209
17125 10014209 9585672 9171129 8645534 8114231 7782968 7661793 7395052 6870786 6436895
17116 6436895 6103143 5647001 5219488 4875186 4486487 4070274 3910705 3763795 3385355
17107 3385355 3030375 2891047 2727957 2484329 2448135 2529991 2559730 2481591 2460380 2361288
17097 2361288 2316061 2273083 2128778 2046566 1945143 1802180 1804380 1768043 1899268 1891463 1813617
17086A813617j17108P1064P0973m2560j37351r8565l5726n5855j2028l2340m9105
17075A375016N3378K7746j3067l6206M0971j21572j57079M828J23660P2362j58290
17064A211747n8453j01106P9730K7617O1660N3976o8406Q325J04189n4277L4224
17053A299226j08665j52922p4450l6400J0944N630L0933o583L862J34508k0255
17042A085828o2507o9309N666J46633R3905P8899P9577q8741j20019m9332m042
17031A096558R5781r0401j8914r5363r985k7945R1079J11095o5595l1001L8594
17020A093903O4043P1638j45250q488J23712K1050J52418N2267l9644K2699O2110
17009A470458p8729n4990J9058J02617J31493j9325Q3613M0179L4127J77409M03278
$$ plain form
17086 1813617 1696509 1767573 1838546 1795986 1658635 1560070 1524344 1468489 1456461 1424121 1375016
17075 1375016 1428394 1456140 1443073 1406867 1447838 1326266 1169187 1174015 1297675 1370037 1211747
17064 1211747 1153294 1052188 1131918 1159535 1221195 1275171 1206765 1215090 1319279 1265002 1299226
17053 1299226 1190561 1037639 963189 926789 937733 943363 974296 967713 971575 1106083 1085828
17042 1085828 1023321 954012 959678 1106311 1200216 1279115 1358692 1269951 1149932 1100600 1096558
17031 1096558 1192339 1101938 1083024 987661 977676 949731 1040810 1151905 1086310 1055309 1093903
17020 1093903 1157946 1229584 1084334 1075846 1199558 1220608 1373026 1425293 1385649 1408348 1470458
17009 1470458 1391729 1336739 1355797 1458414 1589907 1570582 1654195 1694374 1728501 1905910 2309188
16998B309188N35097L40296m9143k37396r3125l2684j19485j16032P1028L48603
16988B956347K80944n8567j57081k70875k07054K1003l26916m90720l90995k48885
16978A107201j5532K2671j63282o4823n6781j61166L8537Q8308r323J6735j11110
16967F91435r6756J42219J60807K51405L73902M26207K53053p6348n5223o792
16957B063909j58110k40585j42848K48046L56918R6699o1664j23744k90991k80220
16947A467410j12074j46298k64495k15755j96860n5188p2855p9251l2873J07084
16937C98845N8151P5018J68451r0723j3009o1100k2246M5979p5672j00985j40093
16926B42616j0247J78805J34973q472j64973M6949l3890R6109j03754n5825j5995
$$ plain form
16998 2309188 2844285 3184581 3135438 2898042 2804917 2772233 2652748 2536716 2607744 2956347
16988 2956347 3237291 3178724 3021643 2750768 2543714 2564717 2237801 1747081 1356086 1107201
16978 1107201 1091669 1114340 951058 886235 829454 668288 706825 795133 785810 802545 691435
16967 691435 594679 736898 897705 1149110 1523012 1949219 2202272 2125924 2070701 2063909
16957 2063909 1905799 1665214 1522366 1770412 2127330 2224029 2162365 2038621 1747630 1467410
16947 1467410 1355336 1209038 944543 728788 531928 476740 403885 324634 291761 398845
16937 398845 456996 532014 700465 609742 596733 535633 513387 559366 483694 382709 242616
16926 242616 232369 411174 546147 537675 372702 419651 385761 481870 378116 322291 306296
16915C06296Q3039O4895o1931k32224R6652J33901M3603j33584O3943J31316j03169
16904C92737J7044m0743J01054Q2779J22734o3561L7431P777n9094P136R3485
16893F98779L56265N13740N36511J20022j47808j36244j60716M7173j79598l05084
16883A343040k70403j60948j76545o0763k3067j953K1712j0533j2381J51800L2857
16872H32816N5749j954K71239L75585M16293L20331J2485j10318q0167p9240j96987
16861A815832k74126j41047j41977j16994J11901N10570N67824k5560k48281r1932
16851A966210L7376j23107k66202l21329k83979l4825L9507o1526j78145q3349
16841F90631m7049N844J4224j14839l1591J06322L8998J58686L14812N32103L28243
$$ plain form
16915 306296 389335 454230 392299 160075 256727 390628 434231 300647 364590 495906 392737
16904 392737 409781 369038 470092 552871 675605 612044 649475 657252 598158 605294 698779
16893 698779 1055044 1568784 2105295 2225317 2077509 1941265 1780549 1827722 1648124 1343040
16883 1343040 1072637 911689 735144 674381 651314 649361 671073 660540 648159 799959 832816
16872 832816 888565 886611 1157850 1533435 1949728 2270059 2282544 2172226 2092059 2012819 1815832
16861 1815832 1541706 1400659 1258682 1141688 1253589 1764159 2331983 2306423 2058142 1966210
16851 1966210 2003586 1880479 1614277 1292948 1008969 974144 1013651 952125 773980 690631
16841 690631 643582 649426 663650 548811 517220 623542 662540 821226 1136038 1668141 1996384
16830A996384k05551j11424j27453j66275j56642k01543k80839k05086Q527P6916
16820F27014k7549j25096k6153L9117p8489j78225R573R9916M859j8154o4547
16809B62266r0109j7437Q056J4265j56482j36010o1869J61106K02228L5715o4210
16798A57519r8700j24036j3506J24387N6331k2663J2058n0985q2970j39683K9874
16787a52374J60394J8011R1750P1215k4041N4467K7752q7621k19617K8647j9573
16776e0990l0364J16423J13616K6208N4526j8963k09J3668n5986r2319Q122M6733
16764A30465j14605M4763o2410O622O1243J03992n169j35897Q202r1543k11082
16753b65419n8883N8378P7679R841J6478Q7055l2657J7582M1326j13122m165Q4160
$$ plain form
16830 1996384 1790833 1679409 1551956 1385681 1229039 1027496 746657 541571 550098 627014
16820 627014 599465 474369 448216 487333 408844 230619 240192 340108 344967 326813 262266
16809 262266 172157 154720 162776 177041 20559 -115451 -177320 -16214 186014 221729 157519
16798 157519 58819 -65217 -78723 45664 101995 79332 91390 40405 -42565 -182248 -152374
16787 -152374 8020 26031 117781 188996 164955 219422 247174 159553 -60064 -31417 -50990
16776 -50990 -81354 35069 148685 174893 229419 210456 210247 223915 167929 75610 83732 130465
16764 130465 15860 60623 -1787 4835 66078 170070 164901 29004 37206 -54337 -265419
16753 -265419 -324302 -265924 -188245 -178404 -161926 -74871 -107528 -89946 -48620 -161742 -165907 -81747
16741h1747p8690p5388J02331J53751O5846M3541p7976m9728j14085l5775J11287
16730c6633j47857k9720R3686K01383J56226J7373j92831j00572P3918J19698
16720A54671m9890K9628Q6738q2262k2904m6742l9360L2913m5377r6490J47385
16709F8310J74355M247K2635K8344q0510j0271l8339q2751j01079M8768R8648
16698A32357l7058J0030Q3593Q9720l7880n8154J06740J2974k6173N8303J12050
16687D46502j6222q6994m6557K693J2970j5740p3234O0722K0938J80802L18606
16676H04486J51240J2091L08830N69151M22740j2930m7194m062l3155K0246k8009
16665B163434n8068J21800L06070L9476l41113k21888r5964j96439j02286j38239
$$ plain form
16741 -81747 -160437 -235825 -133494 20257 86103 129644 51668 1940 -112145 -147920 -36633
16730 -36633 -184490 -214210 -120524 80859 237085 254458 61627 -38945 34973 154671
16720 154671 104781 134409 221147 138885 115981 69239 29879 62792 17415 -79075 68310
16709 68310 242665 246912 269547 297891 217381 207110 168771 86020 -15059 33709 132357
16698 132357 95299 105329 188922 278642 240762 182608 289348 302322 276149 334452 446502
16687 446502 430280 343286 296729 299422 312392 296652 223418 284140 305078 485880 804486
16676 804486 955726 967817 1276647 1845798 2268538 2255608 2208414 2204352 2171197 2191443 2163434
16665 2163434 2105366 2227166 2533236 2572712 2231599 2009711 1913747 1717308 1615022 1476783
16655A476783k12406o1407J17552L8025J49229M09137M40056J9073j94450k54847
16645A926745o9781M6250k6875m7489O7377K26734J89867j80520l04453j81091
16635A646764r896P0401k70857l30661j98747k17574j25395r0856n4608m6032
16625C72539j0509Q1361q882n9758M4016j84256p241j20081j14632O1483p009
16614D7031p6791O5179N318n012p3046k0598J43797J4612p056L1668J2154n7272
16602G9984M8284K6440n1325q688j74740m4640J12290N7266q5853k4149j4086
16591g9217o38J10729k966K8370P5700j07253o3793R3242n9786j63270k442Q8581
16579h2743M3652j04765n2269m1184P1004J42766K6162K35192O0411j64283j97236
$$ plain form
16655 1476783 1264377 1202970 1320522 1358547 1507776 1916913 2356969 2376042 2181592 1926745
16645 1926745 1856964 1903214 1876339 1828850 1896227 2122961 2312828 2132308 1827855 1646764
16635 1646764 1636868 1707269 1436412 1105751 907004 689430 564035 473179 418571 372539
16625 372539 362030 443391 434509 374751 418767 234511 227270 107189 -7443 54040 47031
16614 47031 -29760 35419 40737 35725 -37321 -57919 85878 100490 93434 125102 137256 79984
16602 79984 128268 154708 103383 94695 -80045 -124685 -12395 44871 -40982 -65131 -79217
16591 -79217 -79855 30874 27908 56278 131978 24725 -39068 54174 -5612 -168882 -171324 -82743
16579 -82743 -39091 -143856 -196125 -237309 -166305 -23539 2623 237815 298226 133943 -63293
16568f3293j90863J1045J92203M3461j07826j41231j65368K833J01847J98043
16558a19149J11246n7112l427q4009L01N3431j9505o4269k5700k7805N996k1333
16546b51335P085j04064Q1270J11653J895J801N007k1068O2088J12576J1913M3824
16534F2645N8024l5258k5917j25383j60498o2545J78234J59931p7535j03960j8080
16523a50342O0633J745o381Q1752N2348n3131m7409m1693j24089Q6597K13027
16512G3057K976q5868n8569j06738N6277p592P7018J04869K2046m8905j04263
16501g5692R9233r9022r8568J00391J02201J7133j8737k5041L1702j05471j17226
16490a89097J9573M8699J32880R9705m2873L5911N7539o5166q5055J33543o184
$$ plain form
16568 -63293 -254156 -243111 -50908 -7447 -115273 -256504 -421872 -419039 -317192 -119149
16558 -119149 -7903 -65015 -68442 -152451 -152150 -98719 -118224 -182493 -208193 -235998 -230002 -251335
16546 -251335 -244250 -348314 -267044 -155391 -153496 -151695 -146688 -167756 -105668 6908 18821 62645
16534 62645 120669 85411 59494 -65889 -226387 -288932 -110698 49233 -28302 -132262 -150342
16523 -150342 -89709 -87964 -94345 -12593 39755 -13376 -60785 -102478 -226567 -139970 73057
16512 73057 76033 -9835 -68404 -175142 -118865 -126457 -49439 55430 77476 28571 -75692
16501 -75692 23541 -75481 -174049 -73658 28543 45676 26939 1898 33600 -71871 -189097
16490 -189097 -169524 -120825 12055 111760 68887 104798 162337 97171 12116 145659 139475
16479A39475q1058q2589m2438Q7678M865J4309J21340p4983N2171M1253m0004
16468A40019q2358o3943l1941j8560o8710n5079M0538O1288j4288n6488J17229
16457c2293Q8109N8128j5906L449L1066p9015M6424O7608m9456j58954j08790
16446a49630M7776j9607j3800Q1901M2189k6994j49111j13712J52759P7449j09974
16435a80754l2509J48300N5842M7296M682k9610p5796r0626K871J05866q2879
16424a27317j24902m0800J18056M1949Q3411j8549J9004P0866j09908m8327L3115
16413a03402J35935L447r9392n6793l4121J32613J10422L8161j6967j41919p7589
16402a09605j9955K1902k3275m5186j5946L204Q6141J107J847l3792L2636P2814
$$ plain form
16479 139475 58417 -24172 -66610 21068 25933 40242 161582 86599 138770 180023 140019
16468 140019 57661 -6282 -38223 -56783 -125493 -180572 -140034 -78746 -93034 -149522 -32293
16457 -32293 55816 113944 98038 101487 132553 53538 99962 167570 118114 -40840 -149630
16446 -149630 -101854 -121461 -135261 -53360 -11171 -38165 -187276 -300988 -148229 -70780 -180754
16435 -180754 -213263 -64963 -9121 38175 42857 13247 -62549 -153175 -150304 -44438 -127317
16424 -127317 -252219 -293019 -174963 -133014 -49603 -68152 -49148 21718 -88190 -136517 -103402
16413 -103402 32533 35980 -63412 -120205 -154326 -21713 88709 126870 109903 -32016 -109605
16402 -109605 -129560 -107658 -130933 -176119 -192065 -188861 -102720 -101613 -99766 -133558 -100922 -28108
16390b8108J6620Q3457N7190j20286l9687j36562m6230J10186m330L2035J9493
16379e6222P1842L0385P1119q9474n7132N2438K2621L8166q9896m9903r864j60214
16367b26134p6354J18531O1666o4814J27419j56r4253n1039K4533P8519l9275
16356a41357O5011J49467p4655j70715n5890O8403L324L9310p1311O9761J56237
16345C7585n1182L415l5402l0194o6882k7935p3451J465Q6181R975N8191N7639
16333c0595r229P9367J1113L7254n0136j4828L8639j60274j71978O390m816N4323
16321b14770l3787M7735J14631J21584K7014l4422k7393j4486n9395J4498m0866
16310i9657k7759r8010k9332N8394R6349k6145j1505K8631j2829o343L8788K8029
$$ plain form
16390 -28108 -11488 71969 129159 8873 -30814 -167376 -213606 -103420 -107750 -75715 -56222
16379 -56222 15620 46005 117124 27650 -29482 22956 45577 83743 -6153 -56056 -65920 -226134
16367 -226134 -302488 -183957 -122291 -187105 -59686 -59842 -154095 -205134 -180601 -102082 -141357
16356 -141357 -76346 73121 -1534 -172249 -228139 -159736 -156412 -117102 -188413 -118652 37585
16345 37585 -13597 -10182 -45584 -75778 -142660 -170595 -244046 -242581 -156400 -146425 -88234 -30595
16333 -30595 -39824 39543 50656 87910 37774 22946 61585 -98689 -270667 -264277 -269093 -214770
16321 -214770 -248557 -200822 -86191 35393 62407 27985 592 -13894 -73289 -58791 -99657
16310 -99657 -127416 -225426 -254758 -196364 -100015 -126160 -137665 -109034 -121863 -128206 -89418 -61389
16298f1389L1103O7441n4906P655K2544p5430j22196q7207M2705J67670k5764
16287h7774j19040n6575J9110J12427N7284l0568m9754O9125K01630l6309j00762
16276b1206M7619k9279j5331r063o019L324l5539j86159j0856q7419o2068J84786
16264b27210J96485L2214l4178Q254q4188p5788p898M9720l2553j1911J26606
16253f0447n4423M7169n6480n9849N5938m0643r821Q6381n8539K734J14274q0292
16241a13998K337K417L0138J15664r7697K2505q0188o4865R2406L0108j19546
16230a80719m6228R6292O5793o9156o5896O8663k3945K0554M4937r6262l9357
16219b25324K67323j004L5019m6819O612o0495j46995K2196L8006p4118k505L5166
$$ plain form
16298 -61389 -30286 37155 -17751 -10096 12448 -62982 -185178 -272385 -229680 -62010 -87774
16287 -87774 -206814 -263389 -244279 -131852 -74568 -105136 -154890 -85765 115865 79556 -21206
16276 -21206 26413 -2866 -18197 -27260 -33279 -29955 -65494 -251653 -262509 -349928 -411996 -227210
16264 -227210 -30725 1489 -32689 -24435 -108623 -184411 -192309 -142589 -175142 -187053 -60447
16253 -60447 -114870 -67701 -124181 -184030 -128092 -168735 -178556 -92175 -150714 -147980 -33706 -113998
16241 -113998 -111661 -109244 -79106 36558 -61139 -38634 -118822 -183687 -91281 -61173 -180719
16230 -180719 -226947 -130655 -64862 -134018 -199914 -131251 -155196 -134642 -89705 -185967 -225324
16219 -225324 41999 40995 76014 29195 35807 -24688 -171683 -149487 -111481 -185599 -188104 -152938
16207a52938j8787j41640J9253N7826O4306J24760J73554j08937o5624r7191J7311
16196a28107r520J22394N3405r2000K4848J9046o9008p6039K0393O7999R5587
16185B8998k2575k10546j42247L4244J27897M8169R8503Q9434q629N52j59254
16174a15454l3726P8717O0393n1821j21340N0749k3319L3761n2654m2334J9996
16163a97032N8408K8637J32246Q6843Q3860j28769k00954j39877O8438J57160
16153e1040K4583L8355K7972P9966Q2624k9916j76002K9688n0040j6926P4070
16142C3334l0802j34111N545k3429J5922K03806N0430m423n7148n1376k2311j11214
16130a25777L4209J25210l5101j21434n0415m4625r362J64665J34119j22329p5209
$$ plain form
16207 -152938 -171725 -313365 -294112 -236286 -171980 -47220 126334 17397 -48227 -145418 -128107
16196 -128107 -137627 -15233 38172 -53828 -28980 -9934 -78942 -154981 -134588 -66589 28998
16185 28998 6423 -204123 -346370 -312126 -184229 -136060 -37557 51877 43248 43800 -115454
16174 -115454 -149180 -70463 -10070 -61891 -183231 -132482 -155801 -122040 -174694 -217028 -197032
16163 -197032 -138624 -109987 22259 109102 192962 64193 -136761 -276638 -208200 -51040
16153 -51040 -26457 11898 39870 119836 202460 172544 -3458 26230 -23810 -40736 33334
16142 33334 2532 -131579 -126034 -149463 -133541 70265 120695 116272 59124 7748 -14563 -125777
16130 -125777 -91568 33642 -1459 -122893 -173308 -217933 -227295 -62630 71489 -50840 -126049
16119a26049Q3841P900j04989j16618p1799R8178J13422J64351j785M6836Q9368
16108A82656j2361j47304n8118J42429O4126l8847o4370k0261k0999m7317p7309
16097i7675n0344L5010P8181o715K268J05719j00146j18317j15826j3190k5952
16086c06987p5437K9234L1673O1544J33944J22611L9538J3512O7185k9016o3261
16075B4540q1358m9133R7478l2302Q1668O1006P778j67255j24153m9009k0782
16064b51522k4683J85796N5475J876Q9336o548q7250j49380J48149N9580r13K7696
16052D7612O3953J26818N83q6996o7812N2036o5665R0321J9168j90349q0441M6730
16040d4042L410k2667K6344O9834m0101p4491o6866K1823m070J23780p3516r1243
$$ plain form
16119 -126049 -42208 -34308 -139297 -255915 -327714 -229536 -116114 48237 46452 93288 182656
16108 182656 170295 22991 -35127 107302 171428 132581 68211 47950 26951 -20366 -97675
16097 -97675 -148019 -113009 -34828 -41543 -39275 66444 -33702 -152019 -267845 -281035 -306987
16086 -306987 -382424 -353190 -321517 -259973 -126029 -3418 36120 49632 116817 87801 24540
16075 24540 -56818 -105951 -8473 -40775 40893 101899 109677 -57578 -181731 -230740 -251522
16064 -251522 -276205 -90409 -34934 -33058 56278 49730 -37520 -186900 -38751 20829 19916 47612
16052 47612 111565 238383 238966 151970 84158 136194 70529 160850 180018 -10331 -90772 -44042
16040 -44042 -40632 -63299 -36955 32879 -7222 -81713 -148579 -126756 -130826 -7046 -80562 -171805
16028a71805J0145o9886J15333R6859q7065j47356M8281P4505J08720o8406j28047
16017b18722K1522J25529J32258q6617k03404q7819J17785J41969J45319M7306
16007A35126j70753q5190J45583N7260j24401o1630Q4208P2836n3941k55886n6689
15996c13477L4313J31454J37067K2910O5054r8592q0035n040m687j2664k0688
15985a44385J06264p7616o8106J96755J8354r020m9883n9298j3564L8526J79423
15974A17450m7722o9833j2292q9809O1668Q2926m0966j9712R5926j0892j16172
15963d9428M2242k3792K6029K0640L9715k1532j20403Q0621K15885j20017J4406
15952A04366J49863l0647k3194j86453q0338R7747Q1788M8791q010Q030n4203
$$ plain form
16028 -171805 -161660 -231546 -116213 -19354 -106419 -253775 -205494 -130989 -22269 -90675 -218722
16017 -218722 -197200 -71671 60587 -26030 -229434 -317253 -199468 -57499 87820 135126
16007 135126 -35627 -120817 24766 82026 -42375 -104005 -19797 53039 -902 -256788 -313477
15996 -313477 -279164 -147710 -10643 12267 77321 -21271 -101306 -106346 -111033 -123697 -144385
15985 -144385 -38121 -115737 -183843 12912 31266 22246 -27637 -86935 -100499 -61973 117450
15974 117450 69728 -105 -12397 -102206 -40538 42388 1422 -18290 77636 66744 -49428
15963 -49428 -7186 -30978 -4949 15691 55406 33874 -86529 -5908 209977 89960 104366
15952 104366 254229 223582 200388 13935 -66403 31344 113132 161923 153913 161943 107740
15941A07740j81643p3865p6115J14013L0593m8855M3933m465n0128r9443K5326
15930b12909J72819n0543o9845M4158P3814J7040j07749q2872R5650m2770k323
15919a65530J62889l7210j87710j3436m6608J28312O9954J7363J32719J47316
15909B08059j20684j17163m2933M0814L4681o2787J2594K0460J27406J18300q8587
15898A30160n9243j37330j26738j43128O9673J24867J62811M7947M0937Q6493
15888A96449L8101l2048n2360k07499J5656M5261p9536O9827P1213J3781n5401
15877B3444o1194N238l5432q6845p9974M8039M8696O3997m5868L2906J64587J594
15865G9188k7668k0536K5289L3864j10477n5139q0718J1063L112J30134j19480
$$ plain form
15941 107740 -73903 -147768 -223883 -109870 -79277 -128132 -84199 -88664 -138792 -238235 -212909
15930 -212909 -40090 -90633 -160478 -116320 -42506 -25466 -133215 -216087 -120437 -163207 -165530
15919 -165530 -2641 -39851 -227561 -240997 -287605 -159293 -89339 -71976 60743 208059
15909 208059 87375 -29788 -72721 -31907 2774 -60013 -47419 -26959 100447 218747 130160
15898 130160 70917 -66413 -193151 -336279 -266606 -141739 21072 69019 109956 196449
15888 196449 234550 202502 150142 -57357 -41701 3560 -75976 -6149 65064 78845 23444
15877 23444 -37750 -32512 -67944 -154789 -234763 -186724 -138028 -74031 -119899 -86993 77594 79188
15865 79188 51520 30984 56273 90137 -20340 -75479 -156197 -145134 -142022 -11888 -131368
15854a31368j25957J49251J02933q39n5348p8281N8458K5771m752j06705N1232
15843a15605J14724l992o6184L774Q2560j04799m0358K8240J40225J13571J3343
15832A65499j80461j46589k6233K37500J6583j38283l8122J08661K3305P8847
15822A00707J6888r7705n3636j10727J08203n1858j5390o5759J01206J5978Q5003
15811C2910J16546q2701o7113m0173L8368j4740q4359J38233j74665N0209J32180
15800D4695o4398l7411O4448J25471J40110q5571j54469r8361m1292o94l0372
15789a37844p839K9494O6061L2632K6735J4223r6315L5995M5523l3119l8104K3391
15777c9167k6687J14956l8497O7542Q1629j00432j24191k3237K3485R8238l6156
$$ plain form
15854 -131368 -257325 -108074 -5141 -5980 -61328 -139609 -81151 -55380 -60132 -166837 -115605
15843 -115605 -881 -4873 -71057 -67283 15277 -89522 -129880 -101640 38585 152156 165499
15832 165499 -14962 -161551 -187784 49716 66299 -71984 -110106 -1445 21860 100707
15822 100707 117595 19890 -33746 -144473 -36270 -88128 -103518 -169277 -68071 -52093 32910
15811 32910 149456 66755 -358 -40531 -2163 -16903 -101262 36971 -137694 -87485 44695
15800 44695 -19703 -57114 7334 132805 272915 187344 32875 -65486 -106778 -107472 -137844
15789 -137844 -145683 -116189 -50128 -17496 9239 23462 -72853 -36858 8665 -24454 -62558 -39167
15777 -39167 -65854 49102 10605 78147 159776 59344 -64847 -88084 -64599 33639 -2517
15766b517J09832p680p1114M9901o2351j83641K0722O5658r0057K1335J56855
15755F943m6000j36032R467l5101O3608m4375k4013J20591J55506m1886j13549
15744h4841M6496R1684q7832j66239K891l5057O2035J05195P5713P481K3851K6326
15732F7703p817q6005J19027L0277r7346j0100J86599j23955j51667p4906p3635
15721b21825o350J9330J11032J03891L6177O8863L7798N952k4803m9024m0388
15710D0653M9952j27959K3870k3815Q2986J53530J35494r1461j27802j20302j10180
15699a15034m9413M5576m3836N5341J3233Q8564m801L6739J52636r2701k08964
15688a22660r6947J36722L4140R080M9813M8119p979r0260p728j03546J15674
$$ plain form
15766 -2517 107315 99635 28521 78422 16071 -167570 -146848 -81190 -171247 -149912 6943
15755 6943 -39057 -175089 -165622 -200723 -137115 -181490 -205503 -84912 70594 28708 -84841
15744 -84841 -38345 53339 -34493 -200732 -197841 -232898 -170863 -65668 10045 17526 41377 67703
15732 67703 59886 -26119 92908 123185 25839 15739 202338 78383 -73284 -148190 -221825
15721 -221825 -228175 -208845 -97813 6078 42255 111118 148916 154868 130065 81041 40653
15710 40653 90605 -37354 -13484 -37299 45687 199217 334711 243250 115448 -4854 -115034
15699 -115034 -164447 -118871 -162707 -107366 -94133 -5569 -10370 26369 179005 86304 -122660
15688 -122660 -219607 -82885 -48745 -39665 10148 58267 50288 -39972 -47700 -151246 -35572
15677c5572J09260j0704p0771R4567P6948o4028J6811P8376j8116m4398q6060
15666D6313k5899R351N5710j5560q7729k8953r45R817K6111L5647K0595o9259
15654b4801j02559j12740m6952J29008J52270j10742j0835j341m2927j3607J6698
15643a68528k0322O7265M2533n2497j9871J6725R7356M9491J15745j63497l9254
15632g4854J8177O3982l3277J0583M026Q114n78n2155k3529J4543l1848n2005
15620a48821n7058m0583J49972J34298M9122p6573N6999K8254p7549p2060P9177
15609B5178M2485L1236r1006O6112n8038r0592N1552O7602O4116j39551l6167
15598f7073k0002r797M0560R8983n5025p2610o2031L2664J72216J54268n0988
$$ plain form
15677 -35572 73688 62984 -7787 86780 163728 99700 116511 194887 176771 132373 46313
15666 46313 20414 29765 85475 69915 -17814 -46767 -47712 -37895 -11784 23863 44458 -24801
15654 -24801 -127360 -240100 -287052 -158044 -5774 -116516 -127351 -128692 -171619 -185226 -168528
15643 -168528 -188850 -121585 -79052 -131549 -151420 -134695 -37339 12152 127897 -35600 -74854
15632 -74854 -56677 7305 -25972 -15389 -11363 -3249 -3827 -55982 -79511 -64968 -96816 -148821
15620 -148821 -205879 -246462 -96490 37808 86930 10357 67356 95610 18061 -53999 25178
15609 25178 67663 98899 7893 74005 15967 -74625 -23073 44529 108645 -30906 -67073
15598 -67073 -87075 -96872 -56312 42671 -12354 -84964 -146995 -114331 57885 212153 161165
15587A61165q5148J0445k7805n2142p1270p9193n2629K7962m4422k5816l774K56583
15575A3956L6074j54581L1868j2878J02215K5138O3479K9201P308o5389r0526
15564a4135n7785R7351M1084j6721q0968p7158j35840M923N3900K46211J25975
15553A86837j11148j34324R6529R8139o4886q9083O0021K5546j8398J910j1813
15542C9330o8119j39366k9533M2493M996l0823J69399J30366P1474j4555q0365
15531I5297j00661K012J00739j5213m9887j09670J4071J04328O4922J06850L872
15520B16660r7737J8575j25428r423M5670K31742q2043k18967R5713o9919J8696
15509B3539J59476p0771p7751k8425k0357J23778J26536j23056j32104r53l1582
$$ plain form
15587 161165 76017 86462 58657 6515 -64755 -143948 -196577 -168615 -213037 -238853 -242627 13956
15575 13956 50030 -104551 -72683 -85561 16654 41792 105271 134472 141780 76391 -14135
15564 -14135 -71920 25431 66515 49794 -31174 -108332 -244172 -239249 -185349 60862 186837
15553 186837 75689 -58635 37894 136033 71147 -17936 42085 67631 49233 51143 39330
15542 39330 -28789 -168155 -197688 -155195 -150199 -181022 -11623 118743 190217 175662 95297
15531 95297 -5364 -3352 97387 82174 32287 -77383 -63312 41016 105938 212788 216660
15520 216660 118923 137498 12070 2647 48317 280059 198016 -20951 74762 4843 23539
15509 23539 183015 112244 34493 6068 -14289 109489 236025 112969 -19135 -20088 -51670
15498e1670q6J0440O1590o5994q6002m7042J1251J73476K32755Q648j51423r0857
15486E086O973j66878j00290L4507q2030K855L3142M3112Q51R309M2678J14093
15474e6592R021p769Q6285n8459K1796N6723m2452M1282J376o4759R3474J0412
15462I0338J18428M3570k9593k6742R9220Q7545k05387m8101n5720j00117o1098
15451h7657J23905M2837j0209O972j04469J5619R3411k3068k76222J1959J12913
15440i4009N1489l8981O8148Q5299J4949J06741j17216l8006m3698j59725Q162
15429a56847l7040J93575J77617K1950m8322O477K0761K9364P1893q3389j49018
15418D7021n8588j16625o8643N3159J81925J08316j13537j09078j21639j15325
$$ plain form
15498 -51670 -51756 -41316 20274 -45720 -131722 -178764 -167513 5963 238718 247366 95943 5086
15486 5086 12059 -154819 -255109 -220602 -302632 -299777 -266635 -223523 -222672 -213363 -170685 -56592
15474 -56592 -47571 -55340 30945 -27514 -5718 51005 8553 49835 51211 -13548 79926 90338
15462 90338 208766 252336 222743 196001 295221 382766 177379 129278 73558 -26559 -87657
15451 -87657 36248 79085 68876 75848 -28621 -13002 80409 57341 -218881 -206922 -94009
15440 -94009 -42520 -81501 -13353 71946 86895 193636 76420 38414 -5284 -165009 -156847
15429 -156847 -193887 -312 177305 199255 150933 157410 178171 207535 279428 196039 47021
15418 47021 -11567 -128192 -196835 -143676 38249 146565 33028 -76050 -197689 -313014
15408c13014J23608N3771N2303k3835N8542p4045J29394P418q0911n9745K4007
15397a02507l5999j03612P6456J84921J14029m0748j0425O5069o7733k6930O0912
15386A13433j19053p9784k1613o0307J5105Q5366q0543n8633L9474J26999J02996
15375F3440k4301K2248J9572j06290K8135o2235K1870P5309j07007j03995O7639
15364a05615L8563j03714M603J62431O9234J00753o986q8704n1477j6715M0335
15353D2708J16989j40708O8419O7239J5889j19851j38532o7784n6151J03153J50218
15342D1589l055r3030K8358O2206n6812O7305r54j6211j07304Q7442N7552p2759
15330e673r9935N7185p1137j78264Q79M4935j4111r2273O666J94385P7994m3643
$$ plain form
15408 -313014 -189406 -135635 -83332 -107167 -48625 -122670 6724 14142 -66769 -126514 -102507
15397 -102507 -138506 -242118 -165662 19259 133288 92540 82115 147184 79451 52521 113433
15386 113433 -5620 -85404 -107017 -167324 -152219 -66853 -147396 -206029 -166555 -39556 63440
15375 63440 39139 61387 80959 -25331 2804 -59431 -37561 37748 -69259 -173254 -105615
15364 -105615 -67052 -170766 -166163 -3732 65502 166255 159269 70565 19088 2373 42708
15353 42708 159697 18989 87408 154647 170536 50685 -87847 -155631 -211782 -108629 41589
15342 41589 38534 -54496 -26138 36068 -20744 46561 45607 29396 -77908 9534 67086 -5673
15330 -5673 -105608 -48423 -119560 -297824 -296945 -252010 -266121 -358394 -351728 -157343 -79349 -122992
15318a22992Q7598J59629J02607j5257j24959j07164J2541J14816P8412l9355
15308A45876p1005J18807j26038j44147L4193N4066n4282j1382l2610Q6014Q2165
15297H1657J4980j14984q214Q2350j5307o0792P3141J65086o6379j82966j33982
15286a65410M4567Q3187j2349l8260n6600R9741N0578N1907m6574r9977q0451
15275a69641J03640M3079k899L4944o275O5224l6521q7505K8061J50854o1873
15264F1088p9110j11207j5757P5731O9442L8144j01272M6520j6547q1635m2339
15253a56942J24941o9919K22800L8068k07731j41673n1198m8056k1005j6757J20946
15242b06526k008P0348q1515q6661K99100N4351j01314p3890M1625R2374p6913
$$ plain form
15318 -122992 -35394 124235 226842 211585 86626 -20538 -7997 106819 185231 145876
15308 145876 74871 193678 67640 -76507 -42314 11752 -42530 -53912 -86522 -508 81657
15297 81657 96637 -18347 -26561 55789 40482 -20310 52831 217917 151538 -31428 -165410
15286 -165410 -120843 -37656 -50005 -88265 -144865 -45124 5454 57361 10787 -89190 -169641
15275 -169641 -66001 -22922 -25821 9123 2848 68072 31551 -55954 -27893 122961 61088
15264 61088 -18022 -129229 -144986 -69255 187 38331 -62941 -16421 -32968 -114603 -156942
15253 -156942 -32001 -101920 120880 158948 -48783 -190456 -241654 -289710 -310715 -327472 -206526
15242 -206526 -208534 -138186 -219701 -306362 -7262 47089 -54225 -128115 -86490 5884 -71029
15231g1029K984M1774j6612j00647J00333P018l6700p5170M4683J33358M4937
15220G4929p5233q2747N3340l2410j11093O2228M3608j4902M741N5307j0358m2980
15208g5570k5683K24367p6207J7184J3772m4173n8555m9667p0155M2694j27967
15197b29960l6177J83602J12235J0616n86j0368J5852j23076M3905N897k2192
15186e0252j83289o0731j4455M6684K2J76323P8801k4684m4861l725O8953m4171
15174e5385m1904J07578Q0953R7379k00976k6656n0426q7853J48016k7088L5146
15163b1216p8725R6758P9729n1972K3273O5776J11436o7538j62741J167j9560
15152b3613J3269M6700o1601j39661L4885J03556J9067R9310o9450j76717k531
$$ plain form
15231 -71029 -68045 -26271 -42883 -143530 -43197 -36179 -72879 -148049 -103366 29992 74929
15220 74929 -304 -83051 -29711 -62121 -173214 -110986 -67378 -82280 -77539 -22232 -32590 -75570
15208 -75570 -101253 123114 46907 64091 77863 33690 -24865 -74532 -144687 -101993 -229960
15197 -229960 -266137 -82535 29700 40316 39730 29362 45214 -77862 -33957 -28060 -50252
15186 -50252 -233541 -294272 -308727 -262043 -262021 -85698 -6897 -31581 -76442 -80167 -11214 -55385
15174 -55385 -97289 10289 91242 188621 -12355 -39011 -89437 -177290 -29274 -56362 -21216
15163 -21216 -99941 -3183 76546 24574 47847 113623 225059 157521 -5220 -4053 -23613
15152 -23613 -10344 36356 -25245 -164906 -130021 -26465 -7398 91912 22462 -154255 -156786
15141a56786L7199k2835K39279l9622r9462p9205Q1007o722L3269L6917P3070
15130I6109k364p7182j13005N5451P5174j200r3979K4177J28670j06418K5199
15119A0632l8509r9757p963J58057J47759j81835k1893K5228K4866l0499j1919
15108b5833j21286j1476J24886m0047k1445R0015p0716j74001J47377J52195M8689
15097I8358j80910j42440M2334M4434l8783l387M4655Q4896J75967L2419N38M9940
15085B08021r4915j13845J03471J32148j33449n8648J9488m166n7073q2614O364
15074g5218L9386n6299M7411Q6578P707K5437J5479j1910R559Q2590q3072M7111
15062A34759m3126p5738m3460Q3072o4216j32416J9699P0375p997J11151J73658
$$ plain form
15141 -156786 -119587 -142422 96857 57235 -42227 -121432 -40425 -47147 -13878 23039 96109
15130 96109 93745 16563 -96442 -40991 34183 32983 -60996 -36819 91851 -14567 10632
15119 10632 -27877 -127634 -135597 22460 170219 -11616 -33509 -8281 16585 -13914 -25833
15108 -25833 -147119 -158595 -33709 -73756 -95201 -5186 -75902 -249903 -102526 49669 98358
15097 98358 -82552 -224992 -182658 -138224 -177007 -180394 -135739 -50843 125124 157543 158081 208021
15085 208021 113106 -739 102732 234880 101431 42783 62271 58105 1032 -81582 -75218
15074 -75218 -35832 -92131 -44720 41858 49565 75002 90481 78571 88130 170720 87648 134759
15062 134759 91633 15895 -27565 55507 -8709 -141125 -121426 -51051 -59048 52103 225761
15051B25761P0487r3247j57007l8960o0543n5230k2333p3717K1105J78794J01313
15040I6423j34702n1926j2240L9930o9486j5114O5188M1264r6385q1306K98646
15029H0292j640r5283j32400l7273L2387N9255N1987m1194q9621R7253N9899p6972
15017i3310J58934J49637L6836j17829q4634l4358K7387m8210J15162J0250j64719
15006d4854q0751Q2117J51487N665P2501q2093j77796P6161R2654l7074r3191
14995c5174J0391J3053J5625j21242N6092P4752O3507K9728j03411j13031j55282
14984b64992L4729N1080J43533J11608k0547K9356J20588k6884k8327j39418j557
14973I169K1114R4857r3356r0632n9674o1788L7071N4230K5829j59527k0807Q9973
$$ plain form
15051 225761 296248 203001 45994 7034 -53509 -108739 -131072 -204789 -183684 -4890 96423
15040 96423 -38279 -90205 -102445 -62515 -132001 -147115 -81927 -40663 -137048 -218354 80292
15029 80292 78652 -16631 -149031 -186304 -153917 -94662 -42675 -83869 -173490 -76237 -16338 -93310
15017 -93310 65624 215261 252097 134268 49634 15276 42663 -5547 109615 119865 -44854
15006 -44854 -125605 -43488 107999 113664 186165 104072 -73724 2437 95091 58017 -35174
14995 -35174 -24783 -11730 3895 -117347 -61255 13497 77004 106732 3321 -109710 -264992
14984 -264992 -230263 -179183 -35650 75958 55411 84767 205355 178471 150144 10726 9169
14973 9169 30283 125140 31784 -58848 -118522 -180310 -143239 -89009 -63180 -222707 -243514 -153541
14961a53541J01609L7882R994k36587j18066O3123J23585J35835n7213K0028J5804
14950e7547q4858N3388R2982r4006j37733o0648J05186k696P7643J33119j2573
14939A2257O791J37335L6547Q6002j15649q1360O9564l211N9047m1856m6780k20310
14927a01623l7908J95274R4551j41489j2981J31992o2982j89836j4748J10223
14917b9527M2486k5825J11928Q4288M450k42574p7301q1856P654J00967J63884
14906E8574j19008n1388o404j43977N886J43042J81648J22504N8523k6516j80930
14895D1954Q5874J0556L8444q8095m3365J448q9446m6525O6167p5807k3029j3322
14883a35146N0762o5097R5263J70069k9388j93772Q167k9163K5047J22837n6079
$$ plain form
14961 -153541 -51932 -14050 -4056 -240643 -358709 -295586 -172001 -36166 -93379 -73351 -57547
14950 -57547 -142405 -89017 3965 -90041 -227774 -288422 -183236 -185932 -108289 24830 12257
14939 12257 19048 156383 192930 278932 163283 81923 151487 148276 207323 165467 118687 -101623
14927 -101623 -139531 55743 150294 8805 -4176 127816 64834 -125002 -139750 -29527
14917 -29527 12959 -12866 99062 183350 187800 -54774 -132075 -213931 -206277 -105310 58574
14906 58574 -60434 -111822 -118226 -262203 -256317 -113275 68373 190877 249400 222884 41954
14895 41954 127828 138384 176828 88733 45368 46816 -42630 -89155 -22988 -98795 -121824 -135146
14883 -135146 -84384 -149481 -54218 115851 86463 -107309 -99142 -128305 -103258 19579 -36500
14872c6500k8697M4263J42643K09659O3187j60144k46314j68101N3618p5430l1210
14861b33026P0462Q2402N9157k1445k04072N5609J22996o2228J51115L6156j76975
14850a19849m2204J45213J18714l2066j26654J3414J09723K2238n1844O4360Q4982
14839A86027Q9423j43942r2608q9620J7983Q588L3886m3320j40520K1052M621
14828a48430J1751n3522j39737N687K09592J84568M0451p8619j82921m6870J37008
14817f1042J06617j19613j26358O126O5383J81622R6084l3622J6585k4598j14935
14806g751j13101r0935l7122j24974j03344Q2634J74035J49625J63443J92580
14796B85090L1727j82333n9372l6273J9951J41695P7086K9748j55360j99571J22820
$$ plain form
14872 -36500 -65197 -20934 121709 331368 394555 234411 -11903 -180004 -126386 -201816 -233026
14861 -233026 -162564 -80162 -21005 -42450 -246522 -190913 -67917 -130145 20970 57126 -119849
14850 -119849 -162053 -16840 101874 69808 -56846 -43432 66291 88529 36685 101045 186027
14839 186027 275450 131508 38900 -50720 -32737 -24149 9737 -33583 -174103 -153051 -148430
14828 -148430 -136679 -190201 -329938 -324251 -114659 69909 110360 31741 -151180 -198050 -61042
14817 -61042 45575 -74038 -200396 -194270 -128887 52735 148819 115197 131782 107184 -7751
14806 -7751 -120852 -211787 -248909 -373883 -477227 -394593 -220558 -70933 92510 285090
14796 285090 316817 134484 75112 38839 58790 200485 277571 307319 151959 -47612 75208
14785G5208m3263l1570j49238l4950R6774N1744m5213r746Q7089P1137m2985n0621
14773b5634l1610J8923L9107k1956K6214l7707m4774P7020K5644j06222j07219
14762a88214L6773P7657p8360J8907J40070O1177K2451r1537j17185n1869k3481
14751a93611K50235j53689r8188N0817k8219J09908R7882J40624J03006n3772
14741B24993K3182l8700j00241m2100K2904O2201M5861Q941K4887o5892r9036
14730F7000r871k1386j79274L7620J49093N4675j288j27395q9843J6317J80181
14719G5829k3556m1487m4337K4051m1865m4433j414l1167L3301J57515Q4626j03763
14707D3300l3781j8554j66110R3968J74980r7047l1182j27637j03736p3241k8461
$$ plain form
14785 75208 31945 375 -148863 -183813 -87039 -35295 -80508 -90254 -3165 67972 24987 -25634
14773 -25634 -57244 -38321 786 -21170 5044 -32663 -77437 -417 25227 -80995 -188214
14762 -188214 -151441 -73784 -152144 -133237 6833 68010 90461 -1076 -118261 -170130 -193611
14751 -193611 56624 -97065 -195253 -144436 -172655 -62747 35135 175759 278765 224993
14741 224993 248175 209475 109234 67134 90038 152239 198100 207041 231928 166036 67000
14730 67000 57129 35743 -143531 -105911 43182 97857 96569 -30826 -120669 -104352 75829
14719 75829 52273 10786 -33551 -9500 -51365 -95798 -97212 -128379 -95078 62437 147063 43300
14707 43300 9519 -9035 -175145 -81177 93803 -3244 -34426 -162063 -265799 -339040 -367501
14696c67501J74961R3868l0804M9499k323j0241J65002P1233k39318j66729J518
14685b60835O6244K4127O3043N8993n1531l6166J41797L4001Q9724N4051m4955
14674A38493K599J45586K0436n5937k31537r3386O4651N5682J68491L5455p9061
14663A71472j63523l5978j26222K3044j3316R9623M6306l564K623l781m7236k0298
14651g0850j1958K1847J0845l4161k50q330j8149n0355J8100k4299j31165Q6433
14639b12292J16347L3683J12521q6017J8067P5895N8390k6119J91302j7516j12290
14628A51971j2559N0495R4335J1048o8656l7055o9076O5180q7957J1734K2972
14617A32432J05403K3702q5023r3472q3100m129K9200N0898J07637O4543j54286
$$ plain form
14696 -367501 -192540 -98672 -129476 -79977 -82300 -92541 72461 143694 -95624 -262353 -260835
14685 -260835 -194591 -170464 -107421 -48428 -99959 -136125 5672 39673 129397 183448 138493
14674 138493 141092 286678 307114 251177 19640 -73746 -9095 46587 215078 250533 171472
14663 171472 7949 -28029 -154251 -131207 -144523 -44900 1406 -2158 465 -3316 -50552 -70850
14651 -70850 -82808 -60961 -50116 -84277 -84527 -92857 -111006 -161361 -143261 -167560 -298725 -212292
14639 -212292 -95945 -62262 50259 -35758 -17691 58204 116594 90475 281777 264261 151971
14628 151971 139412 189907 284242 295290 226634 189579 120503 185683 97726 109460 132432
14617 132432 237835 261537 176514 83042 -58 -4187 25013 75911 183548 248091 93805
14606I3805j04855Q1128n9186J1662M8050o8645P8547J47703m3934m7179n2896
14595H4200q0175j19923J1756P4087k1715k266m3912J33886p3828j73950n2999
14584b64839O7544K3089m24R7564P6369k6637j72014L9600J7182K7741P003J07301
14572e21l0640J5534n7928l1978q5965L1101J30234M3292o0895p8198k5121K9408
14560a21677K31990Q6810p710q2344q4922o7847r1021O011J34212M7893J0236
14549F1631J3750j38193n5464K07018J8358o1036K8763L2315q899l4184q5387
14538b1328m0809q166L2339R4781l3207j626k0601M81M7020L9498j4966M9080
14526A22496l0523j57034p6524l1221Q6512K23607P6723j73361j88864J5552J00934
$$ plain form
14606 93805 -11050 70078 10892 22554 70604 1959 80506 228209 184275 137096 84200
14595 84200 4025 -115898 -104142 -30055 -51770 -54036 -97948 35938 -37890 -211840 -264839
14584 -264839 -197295 -174206 -174630 -77066 -697 -27334 -199348 -159748 -142566 -114825 -107822 -521
14572 -521 -31161 -15627 -73555 -105533 -191498 -160397 -30163 13129 -47766 -125964 -151085 -121677
14560 -121677 110313 197123 189413 107069 22147 -45700 -136721 -130710 3502 51395 61631
14549 61631 75381 -62812 -118276 88742 107100 46064 74827 107142 98243 64059 -21328
14538 -21328 -62137 -70303 -37964 56817 23610 21984 1383 1864 48884 88382 73416 122496
14526 122496 91973 -65061 -141585 -172806 -86294 137313 214036 40675 -148189 -132637 -31703
14515c1703L1817n3790k509Q7069K4319r5727j64292n2408N6861J38700K22712
14504A61049J83816P338J0756R3022p9720j47417m3727q2951M7079m0987j47368
14493c9110Q33J9523J16139L3080Q2254j9134j55161j1497J3817m176J8053L4694
14481H9315q0911n4587j7355O2369O3446l3525o2193l7717N5459j6240j67841
14470a99780J01559P5531l9300R661M8555m0361J3897N2703Q4655J55852N9502
14459C22474j44590m8936O0568M9614m8177j54861L3562M562q2588j8325J1411
14448a5286P2455Q8433J9693r6584l3560K6660L7975L3483j56176K4207j17787
14437a16487J1217Q8805O7383J62652m6190r7189r30j9859m059K5716O7550K1528
$$ plain form
14515 -31703 114 -53676 -56185 30884 55203 -40524 -204816 -257224 -200363 -61663 161049
14504 161049 344865 352203 362959 455981 376261 228844 185117 102166 149245 108258 -39110
14493 -39110 -38277 -18754 97385 130465 212719 193585 38424 26927 40744 36568 54621 89315
14481 89315 8404 -46183 -63538 -1169 62277 28752 -33441 -71158 -15699 -31939 -199780
14470 -199780 -98221 -22690 -61990 -52329 -3774 -44135 -30238 22465 107120 262972 322474
14459 322474 177884 128948 189516 239130 190953 36092 69654 74216 -8372 -26697 -15286
14448 -15286 57169 145602 165295 68711 35151 61811 99786 133269 -22907 1300 -116487
14437 -116487 -105270 -16465 50918 213570 167380 70191 69261 49402 45343 71059 138609 160137
14425A60137m5589O4411L0535k3520O6723o7439j04060m8570M2343Q9908j1039
14414A53840r5774q406k753K2042Q1117k8348q4427R436P2614M0442P8657K5544
14402B63984q4953J0057p7780J8143J53656N1452j71978o2610r3530o6612M6126
14391a4045K5888m6031o7028K8537n8593O7481N7558k8025l3844J5814O2077M3459
14379E3248o0155n4151q0466r0215j10154M9175Q1862O912m1389J17478K04737
14368G6882R2203k23801n1682N7881J23762P7777R3713j08821o5627r2333n2368
14357g2414l8375L7040P6845K04025o4338k4571K4837n8628J3739m9628r5688
14346d7156j07368m8253J20649R3090K3210o1998p9360L3932l8593J23299N5534
$$ plain form
14425 160137 114548 178959 209494 185974 252697 185258 81198 32628 74971 164879 153840
14414 153840 58066 49660 46907 68949 150066 121718 37291 46727 119341 159783 238440 263984
14402 263984 179031 189088 111308 129451 283107 334559 162581 99971 6441 -60171 -14045
14391 -14045 11843 -34188 -101216 -72679 -131272 -63791 -6233 -34258 -68102 -52288 9789 53248
14379 53248 -6907 -61058 -141524 -231739 -341893 -292718 -210856 -203944 -245333 -127855 76882
14368 76882 169085 -54716 -106398 -48517 75245 153022 246735 137914 72287 -20046 -72414
14357 -72414 -110789 -73749 3096 207121 142783 118212 143049 84421 98160 48532 -47156
14346 -47156 -154524 -202777 -82128 10962 34172 -27826 -107186 -73254 -111847 11452 66986
14335F6986j69057j12746P3014N2346N1393P3324m1570j04484N1719m4154M0995
14324f2234l4587k2360j5894J09191P0361m7324O9822M7562Q6937l5772j36215
14313B9487m8967k0841L9561J74189R6259N614n3013k08623r0084l1275K6654
14302h1039L8785J33984r9200q7559J8573L530m7974n2598J47269J53507J0727
14291A38005n7655k26564j24053Q4693N0408O3926J0250J42029L3379L0031l0330
14280A14119r7439l8060M0513Q9253R7041j96660K5683o571N5638p9748J8155
14269B1924M3943K0017M5694M7357p6886r5756m1381N8292k3100M2207J13388
14258A55699j28308j38882J10250J16662j12009J4295M5230P3330r3851j47551
$$ plain form
14335 66986 -102071 -214817 -141803 -89457 -38064 35260 -6310 -110794 -59075 -103229 -62234
14324 -62234 -96821 -119181 -135075 -25884 44477 -2847 66975 114537 201474 165702 29487
14313 29487 -19480 -40321 -760 173429 269688 275302 222289 13666 -76418 -107693 -81039
14302 -81039 -42254 91730 -7470 -95029 -76456 -72926 -120900 -173498 -26229 127278 138005
14291 138005 80350 -146214 -270267 -185574 -135166 -71240 -60990 81039 114418 144449 114119
14280 114119 16680 -21380 19133 108386 205427 8767 34450 27879 83517 3769 21924
14269 21924 65867 85884 131578 178935 102049 6293 -35088 23204 104 42311 155699
14258 155699 27391 -111491 -1241 115421 3412 17707 62937 136267 42416 -105135
14248a05135j4845J13853O7941p2301r0977J23220N2161L9496k4110R8015J871
14237A89189N1765o431j59629o7868J81380J06979k26412j96515J6742J73168
14227F2368J21111n3825o8506j7268q8886Q0331J95433j55676n8064J36951k2486
14216A31483j28400j0325Q5262n1766p3913J04839L8280j03420p1363l0463J27344
14205A7558P5936o0872L2556J857j2570p1553j00239P4244m798J70041k0949j53577
14193e2366J05339R8405P9913p4082o3267N3397L6878M4646R012j59226K3156
14182A01805K9944l5492k3096p6698n5303l8468P2523J34238m1264j43919K3177
14171e2553l9183m1732m0633l6204Q0349R7449j06694K2495q8042P5416J79761
$$ plain form
14248 -105135 -119980 -6127 61814 -10487 -101464 21756 73917 113413 89303 187318 189189
14237 189189 240954 234523 74894 7026 188406 295385 68973 -127542 -110800 62368
14227 62368 183479 129654 61148 43880 -45006 35325 230758 75082 17018 153969 131483
14216 131483 3083 -7242 78020 26254 -47659 57180 95460 -7960 -79323 -109786 17558
14205 17558 93494 32622 65178 67035 54465 -17088 -117327 -43083 -47881 122160 101211 -52366
14193 -52366 52973 151378 231291 157209 93942 147339 184217 228863 237875 78649 101805
14182 101805 131749 96257 73161 -3537 -58840 -97308 -24785 109453 68189 -75730 -52553
14171 -52553 -91736 -133468 -174101 -210305 -129956 -32507 -139201 -116706 -204748 -129332 50429
14160E0429j5991N5711k2500r226Q5354n4740m7671m5674M7780m322J0942J5517
14148F5609L6383j28070m5583r0570n6856O239J83510P8968Q2411j42597j04765
14137a15321J32791k0165k6462P8525m708p0751j01613n2695O7358J00570M2544
14126C0073J6031M7835m1617q9202L0939K2477M6676k3448n0724J18253K7041
14115A34334Q1166l3044l3600k2236l9144n3111k4309l349n4738p9246N5091K9742
14103d2444Q355N8776j5689p4634J13103J25352k2495K0211M5539l9248M0729
14092B17555o4846k7143L8350l0522m4048j07466q2240J17856N1886o207q2510
14081a9335o3092J3391J04855p8900o1426L8200n8086m1509J66986J61966R6255
$$ plain form
14160 50429 34438 90149 67649 58423 143777 89037 41366 -4308 43472 39150 50092 65609
14148 65609 101992 -26078 -71661 -162231 -219087 -212848 -29338 49630 132041 -10556 -115321
14137 -115321 17470 -2695 -29157 49368 44660 -26091 -127704 -180399 -113041 -12471 30073
14126 30073 46104 93939 52322 -36880 -5941 16536 63212 39764 -10960 107293 134334
14115 134334 215500 182456 148856 126620 87476 34365 10056 6707 -48031 -127277 -72186 -42444
14103 -42444 -34089 24687 8998 -65636 47467 172819 150324 170535 216074 176826 217555
14092 217555 152709 125566 163916 133394 89346 -18120 -100360 17496 69382 63175 -19335
14081 -19335 -82427 -69036 35819 -43081 -104507 -66307 -124393 -165902 1084 163050 259305
14070B59305k9358j0820j27224j34595j26509R7282J28034j6823q5770k1564J21224
14059E3182l9105J5581L8661k955J12405n7226m8621J15654P4509q1361p4457
14048A06267p9417q6784o3159J368m0181M9367L5112l1346k2050K1631j04580
14037b13772Q313L0740Q7495O9468O4877m7426j05979N2414P5624m057Q167j15359
14025h9495R6993l9875j42237J04071R1732k0387n9531o1927Q3190M0893N7296
14014F0723o8147N0476j4345q2115j70810N3453J49387J6757Q5322o9907j70265
14003a59471j62035R1569J24751M9542R584m89j6430p2177L1697m6467l7172Q2116
13991a04982p9472l5446J11025j04777N7033P5119J04361K5316J36690P155j09769
$$ plain form
14070 259305 229947 219127 91903 -42692 -169201 -71919 56115 39292 -46478 -68042 53182
14059 53182 14077 29658 68319 65364 177769 120543 71922 187576 262085 180724 106267
14048 106267 26850 -59934 -123093 -121725 -161906 -112539 -77427 -108773 -130823 -109192 -213772
14037 -213772 -205459 -174719 -87224 -17756 47121 -305 -106284 -53870 21754 17697 25864 -89495
14025 -89495 7498 -32377 -174614 -70543 21189 802 -58729 -120656 -37466 3427 60723
14014 60723 -7424 43052 28707 -53408 -224218 -170765 -21378 -4621 80701 10794 -159471
14003 -159471 -321506 -229937 -105186 -55644 -46060 -46549 -62979 -135156 -103459 -149926 -187098 -104982
13991 -104982 -184454 -219900 -108875 -213652 -156619 -81500 22861 48177 184867 192022 82253
13980H2253q5398R9695j35143n5406M0971R9730N7644l1341j51365j12304n6625
13969b47289o1079R6389k4548P9467J30229m8328q4570p7806J06402q8450J01285
13958a18298M3263J4163K06118N7131k02492j04622K07N7678l2325L7360L490
13947c8327j46605o2524P7036J64578R8104q0645l6880K6051r8482j60883Q2919
13936a75658K1286J3599k5687p0185J41830O8813O4341p2068j01933Q6332p480
13925e6810n4071J12900O7324J400K5425q9632J6227n0154Q4987P9319K6507O4271
13913B27693p1876j02082M0184l346j2838J35239p1050j56556n1515k0750J20836
13902C3939N586L9677J09440j37064k0734j44969o0531j192K7931r0203J03391
$$ plain form
13980 82253 -3145 96550 -38593 -93999 -53028 46702 104346 73005 -78360 -190664 -247289
13969 -247289 -308368 -211979 -236527 -157060 -26831 -75159 -159729 -237535 -131133 -219583 -118298
13958 -118298 -75035 -60872 145246 202377 -115 -104737 -104530 -46852 -79177 -41817 -38327
13947 -38327 -184932 -247456 -170420 -5842 92262 11617 -25263 788 -97694 -258577 -175658
13936 -175658 -154372 -140773 -166460 -236645 -94815 -26002 38339 -33729 -135662 -49330 -56810
13925 -56810 -110881 2019 69343 70743 96168 6536 22763 -27391 57596 136915 163422 227693
13913 227693 155817 53735 93919 90573 77735 212974 141924 -14632 -66147 -86897 33939
13902 33939 39525 79202 188642 51578 30844 -114125 -174656 -175848 -147917 -238120 -134729
13891a34729m1937n7248m8745J02230L7648Q7674M2929l3296j27694R4725R3891
13880A5448J02335J42273o7676j77252q8632j2108O8197O8245K6793J0682j12558
13869b4253o0481J46236m0024K2511N6547j42849r5905J03827k9487j30606L8095
13858a56389J1106j1716J28183J45959M2081L7097j8357l4274j47433k36133n4482
13847b94358o3814Q4994J13251p8273J08355L2613n2299M8855j1795N2612J43791
13836H3932J42168j16403p3790m5517j5989R4078l3202l3085l7126q4318M0476
13825g8776k2447O9777J75664j458k0799j68694j67288L5190J11909O7915k4013
13814b3020n3854j1477L9559N7813j30742M3586j1779j30569O072L063R8726K7063
$$ plain form
13891 -134729 -176666 -233914 -282659 -180429 -142781 -55107 -12178 -45474 -173168 -78443 15448
13880 15448 117783 260056 192380 15128 -73504 -85612 -17415 50830 77623 88305 -24253
13869 -24253 -84734 61502 21478 43989 100536 -42313 -138218 -34391 -63878 -194484 -156389
13858 -156389 -145283 -156999 -28816 117143 159224 196321 177964 143690 -3743 -239876 -294358
13847 -294358 -358172 -273178 -159927 -238200 -129845 -97232 -149531 -100676 -112471 -59859 83932
13836 83932 226100 109697 35907 -9610 -25599 68479 35277 2192 -34934 -119252 -78776
13825 -78776 -101223 -31446 144218 142760 121961 -46733 -214021 -178831 -66922 993 -23020
13814 -23020 -76874 -88351 -48792 9021 -121721 -78135 -89914 -220483 -214411 -211348 -112622 -85559
13802h5559L7699R41Q8227J6202o1888l5026K424L4216J7107l477n4519L1070
13790a2583L8664J4066m1032l1048j2341m0997J00475k9658r6467r5922p551Q5836
13778a28558Q7900J32015j66221j87117P5462j09507j6118j2909J5033j3938K06830
13767a17128K84885O1031J0710j07917j45630j17027R9165K0911j14839n2143
13757a77982P2936J2707M9343R2340j20960p1430o530l6862L449M2253J2653N2804
13745g5279J62876m0628l6087o8802j18766j25071K01858J8507J9231r74o0203
13734a23338n8482J5219L0736J5894m4523N3630K9849j3308L5580j3309q8672
13723a60724l4999Q5776J52347j09618k08166N6058J24610p2812K9234k1741k3853
$$ plain form
13802 -85559 -47860 -46919 41308 57510 -4378 -39404 -36980 -2764 14343 10866 -43653 -12583
13790 -12583 26081 40147 -885 -31933 -44274 -85271 15204 -14454 -110921 -206843 -214394 -128558
13778 -128558 -40658 91357 -74864 -261981 -186519 -296026 -312144 -325053 -310020 -323958 -117128
13767 -117128 167757 228788 239498 131581 -14049 -131076 -31911 -11000 -125839 -177982
13757 -177982 -105046 -92339 -42996 49344 -71616 -143046 -149576 -186438 -182989 -140736 -128083 -75279
13745 -75279 87597 46969 10882 -57920 -176686 -301757 -99899 -81392 -62161 -63135 -123338
13734 -123338 -181820 -166601 -135865 -119971 -164494 -110864 -81015 -94323 -58743 -72052 -160724
13723 -160724 -195723 -109947 42400 -67218 -275384 -219326 -94716 -167528 -138294 -160035 -183888
13712a83888N9189J33820K2892l7713j46701K11714J55069Q5957j18351k8788
13702A53200q3680J4405M5057k3043j52358p7571M7263R7460j16537L873l1993
13691a23924o7835j30473J07590k2513J19135k4962O7588O5356L5130R7866o879
13680A16079j951j56525q3514J13954O4572m6742q0564m8313P6027P7340Q033
13669C8396j30982n2073O907m6490Q4769M7276Q4311J56688o1803q6414j62904
13658a22319L3590J41172J6426J5979l8865k3833J24614k078j45645l6422N0199
13647A2818Q0824j15802j9035K8337P474k6628j47361k05764q2108K4353J43192
13636b99700R9246J86555K17455K5135o4616p7326L7713N0879j3606j27717j06021
$$ plain form
13712 -183888 -124699 9121 32013 -5700 -152401 59313 214382 300339 181988 153200
13702 153200 69520 83925 128982 105939 -46419 -123990 -76727 20733 -95804 -91931 -123924
13691 -123924 -191759 -322232 -214642 -237155 -118020 -142982 -75394 -10038 25092 122958 116079
13680 116079 114128 -42397 -125911 -11957 52615 5873 -74691 -123004 -46977 30363 38396
13669 38396 -92586 -144659 -137752 -184242 -99473 -52197 32114 188802 126999 40585 -122319
13658 -122319 -88729 52443 68869 84848 45983 22150 146764 144686 -959 -37381 12818
13647 12818 93642 -22160 -41195 -12858 -5384 -32012 -179373 -385137 -467245 -442892 -299700
13636 -299700 -200454 -13899 203556 228691 164075 86749 124462 175341 161735 34018 -72003
13625g2003P409o1892J50765k6468K8144l9239j47555j11193J65372J25524J47875
13614A66739P7313m9345l1131j66882k2510J04827J0583m8993p2596j39109N2344
13603a18760R7541p4893Q4604Q7926P1258j28229k0778K6815J0399j017J36277
13592A71143O3084n5631L7737p486j86544r7258l9246O7889J34257o0719j88210
13581a60984J9232k7508P0370k6815j1323k2820l7914O8181J55032N2161K8048
13570A05660q5547k369M9496l7900p4582P313j7618J2884j12982J6790O1639L018
13558g4198m941J1185O179O5629p530q2698j58481r2762J82511K0188O357J09841
13546a8720m8884j10624J12499Q3170k6659p425P5176Q4854j25841j46544J13531
$$ plain form
13625 -72003 -64594 -126486 24279 -2189 25955 -13284 -160839 -272032 -106660 18864 166739
13614 166739 244052 194707 163576 -3306 -25816 79011 89594 40601 -31995 -171104 -118760
13603 -118760 -21219 -96112 -11508 76418 147676 19447 -1331 25484 35883 34866 171143
13592 171143 234227 178596 216333 208847 22303 -74955 -114201 -46312 87945 27226 -160984
13581 -160984 -141752 -169260 -98890 -125705 -137028 -159848 -197762 -129581 25451 77612 105660
13570 105660 20113 17744 67240 29340 -45242 -37929 -55547 -42663 -155645 -138855 -77216 -74198
13558 -74198 -79139 -67954 -61775 3854 -3676 -86374 -244855 -337617 -155106 -134918 -128561 -18720
13546 -18720 -67604 -178228 -65729 17441 -9218 -16643 58533 143387 17546 -128998 -15467
13535a5467j756n5018J20893o875P0996Q5231K5173k3670j11425l7087n7158L930
13523b233N5088q3907R374k3745j28730j18121K1842J99247L9225M469m3887j01127
13511a72505J35819Q3515r5731k4303j75272r6093L6611N5594N1838m1580M385
13500b37722J32994k6689j19201L024l2911J41236J28970m0060O571q4976K2341
13489a06423k7034R233k4832Q0876J35315N6561n8451R6519J08205j57856k0511
13478I1602j45239j40172j2352P6508N840j14777m0104O7063O6993k0921L0238
13467a35321N5049O2562P4198m9832p8909j00341J60061K06575r4078n0305m2259
13456G400J7722J4129L4423J11133r4127p1039p7539q9580k8350r5958O257J28240
$$ plain form
13535 -15467 -17223 -72241 48652 41777 112773 198004 223177 199507 88082 50995 -6163 -2233
13523 -2233 52855 -31052 -21678 -45423 -174153 -292274 -270432 -71185 -31960 -27491 -71378 -172505
13511 -172505 -36686 46829 -48902 -73205 -248477 -344570 -307959 -252365 -200527 -242107 -237722
13500 -237722 -104728 -131417 -250618 -247594 -280505 -139269 -10299 -50359 -43788 -128764 -106423
13489 -106423 -133457 -124224 -149056 -68180 67135 123696 65245 161764 269969 112113 91602
13478 91602 -53637 -193809 -206161 -129653 -123813 -238590 -278694 -211631 -144638 -165559 -135321
13467 -135321 -80272 -17710 56488 6656 -72253 -172594 -12533 194042 99964 49659 7400
13456 7400 25122 39251 73674 184807 90680 19641 -57898 -147478 -175828 -271786 -265529 -137289
13444a37289K15830J23713j40187N5031O4745N541k2418k8184m2323l1962Q2390
13433A44887j9273j38010j07365K6347N9457k7008j34526j06217j11341O4838
13423c48211K41626J17186J5879J78295j6486n7168L2558j10136k20750R4149
13413g3058L7668L707J999J25320j35768m1595j9329j7401R4535J07615J8482
13402A02175m1887J5042N3401L5250j83732q5814Q8898K287j0890N4738l4425
13391d957P3313N492j16190r6689j08115l1755J16499N9991L8097j5678Q3634
13380C642j20777O768n755j5117K1887P1080L865j6654J39376m1497q3222j18863
13368a55267L727J2475O2797p5990M5856N627J23643K00010j3404n0809l8332
$$ plain form
13444 -137289 78541 202254 62067 117098 181843 187384 164966 136782 94459 62497 144887
13433 144887 125614 -12396 -119761 -93414 -33957 -60965 -195491 -301708 -413049 -348211
13423 -348211 -106585 10601 26480 204775 188289 131121 163679 53543 -167207 -73058
13413 -73058 -35390 -31683 -29684 95636 -40132 -81727 -101056 -118457 -23922 83693 102175
13402 102175 60288 75330 128731 163981 -19751 -105565 -16667 -14380 -25270 29468 -4957
13391 -4957 68356 73848 -42342 -139031 -247146 -278901 -162402 -102411 -64314 -79992 3642
13380 3642 -117135 -110367 -116122 -131239 -109352 -38272 -34407 -51061 88315 46818 -36404 -155267
13368 -155267 -151540 -139065 -76268 -152258 -106402 -100775 22868 222878 209474 158665 120333
13357A20333j64361p1833M3156p5152o2842J10179j21388j08996J89234J22388
13347a9282P04r3433M462J28733R0346p309l7370o2590r7092J6866N9737J11337
13335I5109Q8020N5922m766k4055j07778j52744n8934J33414l8070J29396L0708
13324A46222o831k2470L3988J2861j03749j03061r1889J64541J33425j69344q156
13313a4463N0086L2769J0750q317n019j5734K7057j50237j45319P3745J44614
13302f8j7493j46917Q2861k7832Q195P1687j1796j10776L2029P3098m698k7028
13290g8738K5537K899K7752N8431k1761L4702J5877p3188p246O8184l0215p3322
13278e1088K6056j0024p563j45646N1774N0010p6584J38177R6979r3046J5722
$$ plain form
13357 120333 -44028 -115861 -72705 -147857 -210699 -100520 -221908 -330904 -141670 -19282
13347 -19282 -18578 -112011 -107549 21184 111530 104221 66851 4261 -92831 -75965 -16228 95109
13335 95109 183129 239051 234285 210230 102452 -50292 -109226 24188 -13882 115514 146222
13324 146222 139391 116921 150909 163770 60021 -43040 -134929 29612 163037 -6307 -14463
13313 -14463 35623 68392 79142 70825 65806 50072 77129 -73108 -218427 -144682 -68
13302 -68 -17561 -164478 -81617 -109449 -101254 -29567 -41363 -152139 -120110 -47012 -51710 -78738
13290 -78738 -53201 -50302 -22550 35881 14120 48822 64699 -8489 -15735 52449 22234 -51088
13278 -51088 -25032 -35056 -42619 -188265 -136491 -86481 -163065 -24888 72091 -20955 -5233
13267e233m2690J02682J81031p713j00438p1428j60792L3303K03345M263j04209
13256C2121M7095p0903j3986K3805J18571q3500j11030O6293J08525p3567O6551
13245A09975Q4398q0118j19765p6858k1084Q7228l0499n4407o885K6800N566j5700
13233i1349P455J1851n2204n4388j0629l879l6919Q7285R4365M621J0908N7452
13221B4569j9223p9271n1164J6552J10063J8042j9991J36189l4463j39670j5656
13210e4023K9918J51510O4488j76967j43385j44250k2513R4799J20963P4300m4262
13199d9422j16869k54R3968Q9908k5309j5021p3550q254K7391O0160o2916o1374
13187a41542M6087J20929j292J02907J42879j14287j61318j06772Q7952J33183
$$ plain form
13267 -5233 -47923 54759 235790 228077 127639 56211 -104581 -71278 132067 136330 32121
13256 32121 79216 8313 -5673 18132 136703 53203 -57827 8466 116991 43424 109975
13245 109975 194373 114255 -5510 -82368 -103452 -16224 -46723 -101130 -108015 -81215 -75649 -91349
13233 -91349 -83894 -72043 -124247 -178635 -189264 -193143 -230062 -142777 -48412 -43791 -32883 24569
13221 24569 5346 -73925 -125089 -108537 1526 19568 -423 135766 101303 -38367 -54023
13210 -54023 -24105 127405 191893 14926 -128459 -272709 -295222 -200423 -79460 -5160 -49422
13199 -49422 -166291 -166545 -72577 17331 -7978 -22999 -96549 -104803 -77412 -17252 -80168 -141542
13187 -141542 -95455 25474 24182 127089 269968 155681 -5637 -112409 -24457 108726
13177A08726k730j00841n9529J57020J00499q0106j25148p4726J05949O6888j3465
13166H2537M9619K1353j3903r4681m3645K0478l1646O5424L5861K5850L6786K0545
13154A74578l0132L3564q7399q1228N3631m6172n9237J42639N6564p168j30196
13143A9444j48323j774Q818K0028N8147M9962k7280p3731J6315l6477p3221j1997
13131b00089j1288Q2243p1536m2020o1008k9087Q1462j9989l4495O7510r7541
13120c35838l0284J59514L8273n2960P2700J22827l8308l962J35934M8283p0480
13109D5699J2362N091r554O4270j8268o5698j55134r4532j4921j94223k3149J83227
13097b64830N6528J33608J23347N9538q1282N6080J23338j17471p1054K9917o6261
$$ plain form
13177 108726 105996 5155 -54374 102646 203145 123039 -2109 -76835 29114 96002 82537
13166 82537 132156 153509 139606 44925 1280 21758 -9888 55536 91397 117247 154033 174578
13154 174578 144446 178010 90611 9383 63014 16842 -42395 100244 156808 149640 19444
13143 19444 -128879 -130653 -121835 -101807 -43660 6302 -20978 -94709 -78394 -114871 -188092 -200089
13131 -200089 -211377 -129134 -200670 -242690 -303698 -332785 -251323 -271312 -305807 -238297 -335838
13120 -335838 -366122 -206608 -168335 -221295 -148595 -25768 -64076 -68038 67896 116179 45699
13109 45699 58061 63152 53598 117868 99600 33902 -121232 -215764 -230685 -424908 -448057 -264830
13097 -264830 -208302 -74694 48653 108191 26909 82989 206327 88856 17802 47719 -18542
13086a8542R7464J57687l2580j72192j18137j7154P5650J5808J50737P9830k2364
13075A96207j54219j07147N497J63848j17458l3379o00l2732Q217P1225K9903
13064B9362j5558k7553Q9399l9484n6209p470j4588q2577l5840N3109K6294r3071
13052a74186L4932J5803M4058K2093O3325j29273j1854r036Q8290J36621l519
13041G7254j0091k4813L4253J03945N2886o9821n5249K1906M1394r4636N344M5520
13029A27892j3938R098J20975l4097j52361k8413k9787R4595R3506m0454m2075
13018A04941j59470k1489N9618J5277q9532k8802L0001J27642Q7155j1007n9257
13007E5077k7687j31967J4631K0096M2430R1272j8852p9312j5253L2890P4436
$$ plain form
13086 -18542 78922 236609 204029 31837 -86300 -103454 -27804 -11996 138741 218571 196207
13075 196207 41988 -65159 -59662 104186 -13272 -46651 -47251 -79983 -71766 -541 29362
13064 29362 13804 -13749 75650 36166 -20043 -27513 -42101 -124678 -160518 -107409 -81115 -174186
13052 -174186 -139254 -123451 -79393 -57300 6025 -123248 -135102 -144138 -55848 80773 77254
13041 77254 67163 42350 76603 180548 233434 163613 108364 130270 171664 77028 82372 127892
13029 127892 113954 123052 244027 209930 57569 29156 -631 93964 187470 147016 104941
13018 104941 -54529 -76018 -16400 -1123 -90655 -119457 -89456 38186 125341 114334 55077
13007 55077 27390 -104577 -89946 -69850 -27420 63852 45000 -34312 -49565 -16675 57761
12996E7761l3262M3845l4237J07173K4689J4180p952p6232k14857j5698J80224
12985D5634O666n3491r275K1813j9201q0675J7971J28597N975p5569J6270j701
12973C014j24224p0559J53635J61267l5687r2984J32536J335j7127n8637r833
12962D2736k150n891K5506m499j14607p87q9672K2146J05621l0191p344M9286
12950i846O4505k2559K1778k3743o2825N5008O1940j48933j34458q1158J01207
12939a79084P9907M4561J08660N9714Q4366P7455M5476j09690q5939j20258J6161
12928B1329K7910J10671K1502k8131n9463j38085J6185J53834P9606P3628j00579
12917A78407j40658Q797O8799J27235L1866j70818Q0744M3226n3523j07231j2737
$$ plain form
12996 57761 24499 68344 34107 141280 165969 180149 172197 95965 -118892 -134590 45634
12985 45634 52300 -1191 -10466 11347 -7854 -88529 -70558 58039 64014 -11555 4715 3014
12973 3014 -121210 -191769 -38134 123133 87446 -5538 126998 128333 111206 52569 42736
12962 42736 40586 34695 60201 55702 -58905 -59692 -149364 -127218 -21597 -51788 -59132 -9846
12950 -9846 54659 32100 53878 30135 -32690 22318 84258 -64675 -199133 -280291 -179084
12939 -179084 -99177 -54616 54044 113758 198124 275579 321055 211365 125426 5168 21329
12928 21329 49239 159910 181412 153281 93818 -44267 -28082 125752 205358 278986 178407
12917 178407 37749 46546 115345 242580 274446 103628 184372 227598 174075 66844 54107
12906E4107L2352k5910q5648P6245l5675m666n6581M0800L3425K6782Q8161l3463
12894A09929k8678m5615L6481R7063O0183N4068n9615r6352j41997q8592o8948
12883a72073N4615k367L1782L1560K04743R8292p5719m2430j10113P5846M2219
12872A36355M0921M9696L427r023j53180j53305p965p0036o3263J24695K1011
12861h0667J01635l3328K8303P0642Q735J6123l7366N9208J3522j48185o1522
12850f2900J7167J47970L4567K1171l1286j64839j0168q3108J63082J75515J0916
12839B18087n8185J8152m8580j5670k5604Q1036j79643o9276J3697J9161O002
12828d0823m460M293j9288P9347p84M2249m4540j0309j5270n4810P0607J22134
$$ plain form
12906 54107 86459 60549 -25099 51146 15471 10805 -45776 -4976 28449 55231 143392 109929
12894 109929 81251 35636 72117 169180 229363 283431 223816 127464 -14533 -103125 -172073
12883 -172073 -117458 -119825 -88043 -56483 148260 246552 170833 128403 18290 94136 136355
12872 136355 177276 226972 230399 221376 68196 -85109 -93074 -163110 -226373 -101678 -80667
12861 -80667 20968 -12360 15943 86585 95320 111443 74077 133285 146807 -1378 -62900
12850 -62900 -45733 102237 136804 157975 126689 -38150 -48318 -131426 31656 207171 218087
12839 218087 159902 178054 129474 113804 88200 169236 -10407 -79683 -65986 -46825 -40823
12828 -40823 -45283 -40990 -60278 19069 18285 60534 15994 5685 -9585 -64395 6212 128346
12816A28346L6959j37172k05082k8236O0533L49n5342K379L766J92809J14455
12805A13764j8441p9955j61293L7914N7418N7646L8156o56m993j07487J6167o272
12793e8032l3900P0911J31683K1124O0317q9909k2532r4501O5352L2398j9530
12782F3381r7293R4575j9608O075P681j10390q0202r887j0245k9064P323J02734
12770g4920M9321j56261p696m9697n4487J96304J0140q0464r9150J1011J05619
12759a50280m1934J21698J4082m956L3886O5666J18700N6392l7435r1391r615
12748G4813m9877J41949J18583j74682p9757j34825j00900j2568k3300M2608K65704
12737F7748K15894j11125k2320J59638J01783J56327j26355k52495n8238r0196
$$ plain form
12816 128346 165305 28133 -176949 -205185 -144652 -144303 -199645 -197266 -193500 -691 113764
12805 113764 95323 15368 -145925 -108011 -50593 7053 45209 44553 39560 -67927 -51760 -58032
12793 -58032 -91932 -21021 110662 131786 192103 102194 79662 -14839 50513 82911 63381
12782 63381 -33912 60663 41055 47130 54811 -55579 -135781 -145668 -155913 -184977 -177654 -74920
12770 -74920 -25599 -181860 -189556 -239253 -293740 -97436 -87296 -167760 -266910 -255899 -150280
12759 -150280 -192214 -70516 -56434 -61390 -27504 38162 156862 213254 175819 84428 74813
12748 74813 24936 166885 285468 110786 31029 -103796 -204696 -217264 -240564 -197956 67748
12737 67748 283642 172517 150197 309835 411618 567945 441590 189095 130857 40661
12727D0661n0957P3242R9182r5357m3433O306k0685j38451O6974Q2755l3461k4141
12715c7365P232j18522J6713R3418p8210J12863J2223o1503j01974k8823R3348
12704i0600K2441m6219J479K96855J22701o7673j15011p6314j48751j42952Q6796
12693a57248K01570m6473q5057J3052k3780j30319J9841J04212O8499J3000P8108
12682E5405n8814j6683N4713r4008M0478R3837n2693k0458J48360N5235j00560
12671A04812j63727O8390K937q9975j1788Q7962K4553j17303L7101j21591l4591
12660b13220J8253J8338J68301M1435L1479J2516O6964J11030j87616q3460L5917
12649A9937K9516j02165L258J04935l0548M483r1402j30471j24274M0439N2723
$$ plain form
12727 40661 -10296 62946 162128 66771 23338 29644 8959 -129492 -62518 20237 -13224 -37365
12715 -37365 -30133 -148655 -131942 -38524 -116734 -3871 8352 -53151 -155125 -183948 -90600
12704 -90600 -68159 -114378 -112899 183956 306657 238984 123973 47659 -101092 -244044 -157248
12693 -157248 44322 -2151 -87208 -74156 -97936 -228255 -208414 -104202 -35703 -22703 55405
12682 55405 -3409 -20092 34621 -59387 -18909 74928 22235 1777 150137 205372 104812
12671 104812 -58915 9475 12412 -77563 -89351 -1389 23164 -94139 -57038 -178629 -213220
12660 -213220 -194967 -176629 -8328 33107 64586 77102 144066 255096 67480 -15980 19937
12649 19937 49453 -52712 -49454 55481 24933 29416 -61986 -192457 -316731 -276292 -223569
12638b23569J52627L5014r143r384l8104L9082j49120J5629j03359P4684R4038
12627a21605K02860J56144k9838j806j4134k6711j76558P4645P2462j5612k4349
12616I5498j12604o4408l2368l12j0545J21889p6023j03514R537J04285l1228
12605i9793k4423M3886O8131J8264k8217L7800N9045k8825j15553j3948K6787
12594e6846j07242n2372J43103M345j750M6117q0738R0725K9873P7773j8275q8490
12582a3777p9886P872M1368q4117n3797R9561P9971J50742p4540M8793M1647k8165
12570A35672K4039j2687j59897j74639J49780J51334k3912q6483p0392j02721
12560a69906J13534j31348J04969m6085K336K9873M7003m3534q2524J75634n5987
$$ plain form
12638 -223569 -70942 -35928 -45071 -54455 -92559 -53477 -202597 -186968 -290327 -215643 -121605
12627 -121605 81255 237399 207561 205755 191621 164910 -11648 62997 135459 119847 95498
12616 95498 -17106 -81514 -113882 -114194 -124739 -2850 -78873 -182387 -172850 -68565 -99793
12605 -99793 -124216 -80330 -12199 6065 -22152 15648 74693 45868 -69685 -83633 -56846
12594 -56846 -164088 -216460 -73357 -69012 -70762 -24645 -105383 -14658 15215 92988 74713 -13777
12582 -13777 -93663 -85791 -44423 -128540 -182337 -82776 -2805 147937 73397 122190 163837 135672
12570 135672 159711 147024 -12873 -187512 -37732 113602 89690 3207 -67185 -169906
12560 -169906 -56372 -187720 -82751 -128836 -126500 -96627 -49624 -93158 -175682 -48 -56035
12549e6035n1789M5284J74351J47732j45250l9798j59670j29575O1138Q1421r3102
12538a65293j11940j5753l208J04558J19710k246J9687j4761k9226n866l1006
12527a35344M7070j1723J9857K8480J06943J02321n4196k06708j13568K6522l2492
12516b22838L3350o380P6414j7643J21603J4495k3688N5241L5916J3081L9785
12505A19336k0244n1126j02873j38377q5792J35275J36101O676L5352j02621o1938
12494a30231R3632N087k4937N8500N7725J7583N3033n4757k05662j26161N9715
12483a96473J08899P7205o1412j14461k8833J92750J25425j7374k0099l4849Q308
12472C9086N2810r0960n0517j06583r4815K2221J51790J12939Q2264M7170N1326
$$ plain form
12549 -56035 -107824 -62540 111811 259543 114293 74495 -85175 -214750 -153612 -72191 -165293
12538 -165293 -277233 -292986 -296194 -191636 -71926 -74172 -54485 -69246 -98472 -104338 -135344
12527 -135344 -88274 -99997 -80140 -51660 55283 157604 103408 -103300 -216868 -190346 -222838
12516 -222838 -189488 -195868 -119454 -137097 -15494 -999 -24687 30554 66470 79551 119336
12505 119336 99092 47966 -54907 -193284 -279076 -143801 -7700 -1024 34328 -68293 -130231
12494 -130231 -36599 -31512 -56449 2051 59776 77359 130392 75635 -130027 -256188 -196473
12483 -196473 -87574 -10369 -71781 -186242 -215075 -22325 103100 85726 65627 30778 39086
12472 39086 91896 936 -49581 -156164 -250979 -228758 -76968 35971 118235 165405 216731
12461B16731L6945k17761j35094O0412O8039J03415Q1546j13542o8016O5042M1647
12450A39364k17041j41367O7294Q1396J06182j7132r6766k9567P4919J23005R4845
12439A85132m0575k3692m6388n5940l6826R0671o251O8945o9083r1008J67852
12428A42837o3360k7732k2921p8999j00239K3053J35813R8351l5606M6181Q8199
12417B05577r3748j23628j2589J23270P8968j01709j44111J19225Q5154k842j63071
12406b9504L9170J54900M6853j2961j4489J0170j21235m8578q2223P7263Q141
12395B7507j7074J31523M0426j07527O917n5415K5730J8737k0981m7979j4262
12384a2398q0182k0840m3565J55545M4194P005r8366L2275O1134j70119j08992
$$ plain form
12461 216731 253676 35915 -99179 -38767 29272 132687 214233 100691 32675 97717 139364
12450 139364 -77677 -219044 -151750 -70354 35828 18696 -78070 -107637 -32718 90287 185132
12439 185132 144557 120865 74477 18537 -18289 72382 66131 135076 65993 -25015 142837
12428 142837 79477 51745 28824 -50175 -150414 -127361 8452 106803 71197 117378 205577
12417 205577 111829 -11799 -24388 98882 177850 76141 -67970 51255 136409 133567 -29504
12406 -29504 9666 164566 211419 198458 183969 194139 72904 24326 -57897 19366 27507
12395 27507 10433 141956 182382 74855 81772 26357 52087 70824 49843 1864 -12398
12384 -12398 -92580 -113420 -156985 -1440 42754 49759 -48607 -16332 44802 -125317 -234309
12373b34309R4446N6523N1861Q4134L8131j8673n1869n3511J20608M0622r2487
12362C5476o436L6663Q747O0046J21193j7427r0921j32575j91756L8005N7807
12351h1178N5286q693r7369k8956m2619N4363R5750j16959n230L3060N9663J54019
12339G1137Q7039n272j44111r3739M0136j34805M2385M9304J9029q154M8932j38448
12327a66567j81652L6758Q9381M3005J18081J8060K1923k7843N1741O7430k2347
12316D7970n1239j00090M825o0255M1151J50938l1285q5808Q8221Q0088R2057
12305A76573j2104L642p951r5026J3667j10965l7635K2489K5608K7710J09441
12294A15449l1207l5351Q904l414l4044O4545j0430o4005r1310m8916L8541m6524
$$ plain form
12373 -234309 -139863 -83340 -31479 52655 90786 72113 20244 -33267 87341 127963 35476
12362 35476 29040 65703 74450 134496 255689 238262 147341 14766 -176990 -138985 -81178
12351 -81178 -25892 -34585 -131954 -160910 -203529 -149166 -53416 -170375 -175605 -142545 -82882 71137
12339 71137 158176 152904 8793 -84946 -44810 -179615 -137230 -87926 -68897 -77051 -28119 -166567
12327 -166567 -348219 -311461 -222080 -179075 -60994 -42934 -21011 -48854 2887 70317 47970
12316 47970 -3269 -103359 -98534 -158789 -117638 33300 2015 -83793 4428 84516 176573
12305 176573 164469 168111 160160 65134 78801 -32164 -69799 -47310 -21702 6008 115449
12294 115449 84242 48891 57795 54381 20337 84882 74452 10447 -80863 -129779 -91238 -137762
12282a37762k4205K05273J77042j6220n5542N7241l7782l3388j11225m4215P3296
12271E2513j15641L9030m8416j89590k0872L4088M2208N7670N7361R4147J48144
12260A50642M9600j7395K6341m0384j09774o0161l1338r4828j7328K9316P0571
12249d4738J5194j40p1579J24024J18349R228J0522l325k40829j14362J72577
12238b5079Q6480r1163j74472j818O3371l1158J00558J15986K7079q260R0018
12227A51542R760L986o77P735J0663p1368l9037k2410M6469p3887j5323J7865
12215B5318j14053l7486J01327l9844O4516L9725R316Q8878j40650j03617Q4562
12204b2008P7531K6419Q025K8380p0957q2235Q739L4203Q0725Q0034n0138k2221
$$ plain form
12282 -137762 -161967 43306 220348 204128 148586 205827 168045 134657 23432 -20783 52513
12271 52513 -63128 -24098 -72514 -262104 -282976 -248888 -206680 -149010 -91649 2498 150642
12260 150642 200242 182847 209188 168804 59030 -1131 -32469 -127297 -144625 -115309 -44738
12249 -44738 -29544 -29684 -101263 22761 141110 150338 160860 157535 -83294 -197656 -25079
12238 -25079 61401 -29762 -204234 -206052 -142681 -173839 -73281 42705 69784 61524 151542
12227 151542 161302 165288 164611 172346 183009 111641 72604 50194 96663 22776 7453 25318
12215 25318 -88735 -126221 -24894 -64738 -222 39503 48819 137697 -2953 -106570 -22008
12204 -22008 55523 81942 89967 118347 47390 -34845 -26106 8097 88822 168856 118718 96497
12192I6497J5388O9416N2500o1344m9665K3744j1490k9885o7401Q1747n8499r2620
12180c1612m5473J54040O7173j45379N0863J35691l4363o8356l606k489N8713
12169A35202m2811L2859M4751l0275j14553m1757J7785P938J14333O4193K7395
12158B15060n8571q1605O612M304k3814q3976K8866m4962P54l8020J1881Q1400
12146A7929M670l1934j496L9025K9869K5453r3115k5600j4984J01509J74227r8270
12134A27283j62945n0400r4053P359N9903M6780K4192Q9785J3944j5146l7577
12123I125j39499O6764N1710J13729Q9037L1097j07132j01279m237R0307L1436
12112A31058q2908j52883r771r8799m0455J9822O1836j05527R9200O0149K402
$$ plain form
12192 96497 111885 181301 233801 172457 122792 146536 135046 105161 37760 119507 61008 -31612
12180 -31612 -77085 76955 144128 -1251 49612 185303 150940 82584 78978 76489 135202
12169 135202 92391 125250 170001 139726 25173 -16584 1201 9139 123472 187665 215060
12158 215060 156489 74884 81496 85800 61986 -21990 6876 -38086 -37332 -75352 -63471 17929
12146 17929 22599 -9335 -10831 28194 58063 83516 -9599 -35199 -50183 51326 225553 127283
12134 127283 -35662 -86062 -180115 -172756 -112853 -66073 -41881 47904 61848 46702 9125
12123 9125 -130374 -63610 -11900 101829 190866 221963 114831 13552 9315 99622 131058
12112 131058 48150 -104733 -114504 -213303 -253758 -233936 -172100 -277627 -178427 -118278 -115876
12101a15876R2056M9215j90814j49848J26443J66045r115J26087L3181m7377P2782
12090A52779n0708j12841J4992q8419j1861J3851N8305L0733J71803K3639j01337
12079A00936m9790K4629j27978p5791m5922J89187P1030m1955k3620q477J4393
12068B6642l7845j01872l4772R3711O8776l7531l5043l6944L0401J28850l0532
12057C3841m708J4452q3807K0062R8223j4695p4529j7464m0034j3102J11258L9560
12045F9057j32729M8107j9030L832M0153M7506N4939J85013m3664k08448q3683
12034c8947J4681J2148n4515l9032M5043r363M0313L2826K5718j14675j411K2702
12022f4512P5959Q0053r045N8366j9932p6936r2694r4316J3885l6978Q5710R522
$$ plain form
12101 -115876 -23820 25395 -165419 -315267 -188824 -22779 -31894 94193 127374 79997 152779
12090 152779 102071 -10770 4222 -84197 -96058 -82207 -23902 6831 178634 202273 100936
12079 100936 51146 75775 -52203 -127994 -173916 15271 86301 44346 20726 12249 26642
12068 26642 -11203 -113075 -147847 -54136 14640 -22891 -57934 -94878 -64477 64373 33841
12057 33841 29133 43585 -40222 -20160 78063 63368 -11161 -28625 -68659 -81761 29497 69057
12045 69057 -63672 -15565 -34595 -30763 9390 56896 111835 296848 253184 44736 -38947
12034 -38947 -24266 -12118 -66633 -105665 -60622 -69985 -29672 3154 28872 -85803 -87214 -64512
12022 -64512 11447 91500 82455 140821 120889 43953 -48741 -143057 -129172 -166150 -80440 -70918
12010g0918P2147M1716J0222K882l4969K6932p305j33493p6406N7787L0614N3240
11998b7551L6487n801j23150K5940J14079P3611N472K7112J8513L0372L8708o0406
11986A53386Q776R282l8106j16584L4595j3211J3527K3911j19508j39984J07043
11975g6873j7152N2973j80508r1122J33611K9055P6578L3616J19586k4080M5228
11964A00912m5340j69282R6368J7671K9593J02067J4776L2892J3997k23692J0390
11953a9648M6382n7363r9447M4168K05028m9052j47237n6176J6352o944p023J17599
11941a3361J35733r6871q8058k3555R274l9265o5210J54672J13448K3208O582
11930A16597J51922p3894r6467m1535J8784j9863k0383O966p791p8973p1897o0954
$$ plain form
12010 -70918 1229 42945 53167 56049 21080 48012 40707 -92786 -169192 -111405 -80791 -27551
11998 -27551 8936 3135 -120015 -94075 20004 93615 99087 126199 144712 175084 213792 153386
11986 153386 162162 171444 133338 16754 51349 38138 51665 75576 -43932 -183916 -76873
11975 -76873 -94025 -41052 -221560 -312682 -179071 -150016 -73438 -39822 79764 55684 100912
11964 100912 55572 -113710 -17342 329 29922 131989 146765 179657 193654 -30038 -19648
11953 -19648 26734 -30629 -130076 -85908 119120 70068 -77169 -133345 -116993 -123937 -130960 -13361
11941 -13361 122372 25501 -62557 -86112 -76838 -116103 -181313 -26641 86807 110015 116597
11930 116597 268519 194625 98158 56623 75407 55544 35161 42127 34336 -44637 -116534 -177488
11918a77488O2111J65443M7935j28855k3408k5786k0796J4935m7262O0932Q4267
11907A2028j1369j0288K7099J0577K13342k6956r8456m2412q5804P285L8053r79
11895C2120o0907o9519R8199R5035j09483M0253J54141k3956o7295m8182R3279
11884A33685r5769j42329o9049j12592L5305Q2792O1532o046k16098l3176J74575
11873a87170J33054L4276N0870M0422k056j19401j48690o3456r9415L8199O9279
$$ plain form
11918 -177488 -115377 50066 98001 -30854 -54262 -80048 -100844 -85909 -133171 -72239 12028
11907 12028 659 -9629 17470 28047 241389 214433 115977 73565 -12239 -4954 33099 32120
11895 32120 -28787 -98306 -107 94928 -14555 25698 179839 155883 88588 40406 133685
11884 133685 37916 -104413 -173462 -286054 -250749 -167957 -106425 -112471 -328569 -361745 -187170
11873 -187170 -54116 -19840 31030 71452 69396 -50005 -198695 -262151 -361566 -323367 -254088
$$ [...]
##END NTUPLES=NMR SPECTRUM
##END=
