##TITLE=Analysis number 320779
Compound Code cc 18411
Project Code adrs
Chemist Name fudan
##JCAMPDX= 6.0         $$ Bruker NMR JCAMP-DX V2.0
##DATA TYPE= NMR SPECTRUM
##DATA CLASS= NTUPLES
##ORIGIN= Bruker BioSpin GmbH
##OWNER= nmr
$$ XWIN-NMR		Version 3.5
$$ Mon Jul 10 14:27:13 2006 GMT Daylight Time (UT+1h)  MAYBRIDGE\nmr@NMR_250MHZ
##.OBSERVE FREQUENCY= 250.131544655141
##.OBSERVE NUCLEUS= ^1H
##.ACQUISITION MODE= SIMULTANEOUS (DQD)
##.ACQUISITION SCHEME= undefined
##.AVERAGES= 16
##.DIGITISER RES= 18
##SPECTROMETER/DATA SYSTEM= dpx250
##.PULSE SEQUENCE= zg30
##.SOLVENT NAME= CDCl3
##.SHIFT REFERENCE= (INTERNAL, CDCl3, 0, 16.522)
##AUDIT TRAIL= $$ (NUMBER, WHEN, WHO, WHERE, WHAT)
$$ ##TITLE= Audit trail, XWIN-NMR		Version 3.5
$$ ##JCAMPDX= 5.01
$$ ##ORIGIN= Bruker BioSpin GmbH
$$ ##OWNER= nmr
$$ C:\u/data/dgb/nmr/ADRS/2540/pdata/1/auditp.txt
$$ ##AUDIT TRAIL=  $$ (NUMBER, WHEN, WHO, WHERE, WHAT)
(   1,<2006-07-10 14:26:53.40 +100>,<MAYBRIDGE\nmr>,<NMR_250MHZ>,
      <created by zg, POWCHK disabled, PULCHK disabled
       configuration hash MD5:
       E2 DF 36 D8 04 B2 41 60 5A D7 A3 38 5A 4B D0 FE
       data hash MD5: 64K
       32 BC 94 96 3E 3B BC 24 05 C8 CF DE D8 DD F6 1E>)
(   2,<2006-07-10 14:27:04.46 +100>,<MAYBRIDGE\nmr>,<NMR_250MHZ>,
      <Start of raw data processing
       ef LB = 0.3 FT_mod = 6 PKNL = 1 SI = 32K 
       data hash MD5: 32K
       D3 38 28 3B FD 17 CB DA 0A 2F C5 DB C6 0C CE 77>)
(   3,<2006-07-10 14:27:06.06 +100>,<MAYBRIDGE\nmr>,<NMR_250MHZ>,
      <apk 
       data hash MD5: 32K
       06 F2 0D C3 91 17 6C 5F 34 22 3F B8 8A 4F 52 99>)
(   4,<2006-07-10 14:27:06.76 +100>,<MAYBRIDGE\nmr>,<NMR_250MHZ>,
      <abs ABSG = 5 
       data hash MD5: 32K
       C7 D3 B3 C8 10 4B AD 3C 93 C6 75 26 EC CF 8C 5E>)
$$ ##END=
$$ 
$$ hash MD5
$$ 8B 23 E5 47 C7 4D 5A 07 C3 5F 42 64 14 B5 91 A3
##$RELAX= 
##$RELAX= 
##$RELAX= 
##$RELAX= 
##$RELAX= 
##$RELAX= 
##$RELAX= 
$$ Bruker specific parameters
$$ --------------------------
##$DU= <C:\u>
##$EXPNO= 2540
##$NAME= <ADRS>
##$PROCNO= 1
##$TYPE= <nmr>
##$USER= <dgb>
##$AMP= (0..31)
100 100 100 100 100 100 100 100 100 100 100 100 100 100 100 100 100 100 
100 100 100 100 100 100 100 100 100 100 100 100 100 100 
##$AQSEQ= 0
##$AQ_mod= 3
##$AUNM= <au_zg>
##$AUTOPOS= <27 >
##$BF1= 250.13
##$BF2= 250.13
##$BF3= 250.13
##$BF4= 250.13
##$BF5= 500.13
##$BF6= 500.13
##$BF7= 500.13
##$BF8= 500.13
##$BYTORDA= 1
##$CFDGTYP= 0
##$CFRGTYP= 5
##$CHEMSTR= <none>
##$CNST= (0..31)
1 1 145 1 1 1 1 1 1 1 1 1 1 1 1 1 1 1 1 1 1 1 1 1 1 1 1 1 1 1 1 1 
##$CPDPRG= <>
##$CPDPRG1= <>
##$CPDPRG2= <>
##$CPDPRG3= <>
##$CPDPRG4= <mlev>
##$CPDPRG5= <mlev>
##$CPDPRG6= <mlev>
##$CPDPRG7= <mlev>
##$CPDPRG8= <mlev>
##$CPDPRGB= <>
##$CPDPRGT= <>
##$D= (0..31)
0 1 0 0 0 0 0 0 0 0.06 0 0 0 0 0 0 0.0002 0 0 0 0 0 0 0 0 0 0 0 0 0 0 
0 
##$DATE= 1152538012
##$DBL= (0..7)
120 120 120 120 120 120 120 120 
##$DBP= (0..7)
150 150 150 150 150 150 150 150 
##$DBP07= 0
##$DBPNAM0= <>
##$DBPNAM1= <>
##$DBPNAM2= <>
$$ [...]
##$SUBNAM7= <"">
##$SUBNAM8= <"">
##$SUBNAM9= <"">
##$SW= 20.6930455092707
##$SWIBOX= (0..15)
0 0 3 0 0 0 0 0 0 0 0 0 0 0 0 0 
##$SW_h= 5175.983436853
##$TD= 65536
##$TD0= 1
##$TE= 296.16
##$TE2= 300
##$TE3= 300
##$TEG= 300
##$TL= (0..7)
0 120 120 120 120 120 120 120 
##$TP= (0..7)
150 150 150 150 150 150 150 150 
##$TP07= 0
##$TPNAME0= <>
##$TPNAME1= <>
##$TPNAME2= <>
##$TPNAME3= <>
##$TPNAME4= <>
##$TPNAME5= <>
##$TPNAME6= <>
##$TPNAME7= <>
##$TPOAL= (0..7)
0.5 0.5 0.5 0.5 0.5 0.5 0.5 0.5 
##$TPOFFS= (0..7)
0 0 0 0 0 0 0 0 
##$TUNHIN= 0
##$TUNHOUT= 0
##$TUNXOUT= 0
##$USERA1= <user>
##$USERA2= <user>
##$USERA3= <user>
##$USERA4= <user>
##$USERA5= <user>
##$V9= 5
##$VALIST= <valist>
##$VCLIST= <CCCCCCCCCCCCCCC>
##$VD= 0
##$VDLIST= <DDDDDDDDDDDDDDD>
##$VPLIST= <PPPPPPPPPPPPPPP>
##$VTLIST= <TTTTTTTTTTTTTTT>
##$WBST= 1024
##$WBSW= 4
##$XGAIN= (0..3)
0 0 0 0 
##$XL= 0
##$YL= 0
##$YMAX_a= 361358
##$YMIN_a= -464760
##$ZGOPTNS= <>
##$ZL1= 120
##$ZL2= 120
##$ZL3= 120
##$ZL4= 120
##$ABSF1= 16.522
##$ABSF2= -4.171173
##$ABSG= 5
##$ABSL= 3
##$ALPHA= 0
##$AQORDER= 0
##$ASSFAC= 0
##$ASSFACI= 0
##$ASSFACX= 0
##$ASSWID= 0
##$AUNMP= <proc_1d>
##$AZFE= 0.1
##$AZFW= 0.1
##$BCFW= 0
##$BC_mod= 0
##$BYTORDP= 0
##$COROFFS= 0
##$CY= 12.5
##$DATMOD= 1
##$DC= 0
##$DFILT= <>
##$DTYPP= 0
##$F1P= 14.0000005364418
##$F2P= -0.99999901652339
##$FCOR= 0.5
##$FTSIZE= 32768
##$FT_mod= 6
##$GAMMA= 0
##$GB= 0
##$INTBC= 1
##$INTSCL= 1
##$ISEN= 128
##$LB= 0.3
##$LEV0= 0
##$LPBIN= 0
##$MAXI= 10000
##$MC2= 0
##$MEAN= 0
##$ME_mod= 0
##$MI= 0
##$NCOEF= 0
##$NC_proc= -5
##$NLEV= 6
##$NOISF1= 0
##$NOISF2= 0
##$NSP= 0
##$NTH_PI= 0
##$NZP= 0
##$OFFSET= 16.522
##$PC= 1
##$PHC0= 165.7961
##$PHC1= 9.223521
##$PH_mod= 1
##$PKNL= yes
##$PPARMOD= 0
##$PSCAL= 4
##$PSIGN= 0
##$REVERSE= no
##$SF= 250.13
##$SI= 32768
##$SIGF1= 0
##$SIGF2= 0
##$SINO= 400
##$SIOLD= 32768
##$SREGLST= <1H.CDCl3>
##$SSB= 0
##$STSI= 32768
##$STSR= 0
##$SW_p= 5175.98343685301
##$SYMM= 0
##$S_DEV= 0
##$TDeff= 65536
##$TDoff= 0
##$TI= <Analysis number 999999
Compound Code 99
Book Reference 9
Project Code 9>
##$TILT= no
##$TM1= 0
##$TM2= 0
##$TOPLEV= 0
##$USERP1= <user>
##$USERP2= <user>
##$USERP3= <user>
##$USERP4= <user>
##$USERP5= <user>
##$WDW= 1
##$XDIM= 32768
##$YMAX_p= 534414418
##$YMIN_p= -924316
$$ End of Bruker specific parameters
$$ ---------------------------------
##NTUPLES= NMR SPECTRUM
##VAR_NAME=  FREQUENCY,     SPECTRUM/REAL,   SPECTRUM/IMAG
##SYMBOL=    X,             R,               I
##VAR_TYPE=  INDEPENDENT,   DEPENDENT,       DEPENDENT
##VAR_FORM=  AFFN,          ASDF,            ASDF
##VAR_DIM=   32768,         32768,           32768
##UNITS=     HZ,            ARBITRARY UNITS, ARBITRARY UNITS
##FACTOR=    0.157963299565203, 1,           1
##FIRST=     4132.6476996994, 0,             0
##LAST=      -1043.33573715361, 0,           0
##MIN=       -1043.33573715361, -924316,     0
##MAX=       4132.6476996994, 534414418,     0
$$ Real data points
##PAGE= N=1
##DATA TABLE= (X++(R..R)), XYDATA
$$ [...]
23921f66872J26094K68324J07506J16567P8701j44776j5508k10070K8358L53449
$$ -666872 -540778 -272454 -164948 -48381 30320 -114456 -129964 -340034 -311676 41773
23911D1773K19448J41992R418n3989J710r3915p0800L7398K49559j63798l1522
$$ 41773 261221 403213 412631 358642 360352 266437 195637 233035 482594 318796 287274
23900B87274j46382j37545K1769l9768J27804J0341j11850J93608j31359o8598
$$ 287274 140892 3347 25116 -14652 113152 123493 11643 205251 73892 5294
23890E294J23918M2862k48986J2603J34350P5145R2866O0737l2049j74036p0043
$$ 5294 129212 172074 -76912 -64309 70041 145186 238052 298789 266740 92704 22661
23879B2661r3969j23607k13346Q7979K30370R6359Q3541J0038j71661q6391m5367
$$ 22661 -71308 -194915 -408261 -320282 -89912 6447 89988 100026 -71635 -158026 -203393
23868b03393K34629Q2076m9625N7873J69646K5893N0837k1883l7723j34808k32319
$$ -203393 31236 113312 63687 121560 291206 317099 367936 346053 308330 173522 -58797
23857e8797j0670Q9116p8808q1349r8844K78513J04362m8261Q7948N2929k71693
$$ -58797 -69467 19649 -59159 -140508 -239352 39161 143523 95262 183210 236139 -35554
23846c5554M1912K3681M9592J37124J5843M8983J38106p6419k76418k44994k01397
$$ -35554 6358 30039 79631 216755 232598 281581 419687 343268 66850 -178144 -379541
23835c79541K1405K89973r7241r8327J68426L8925K5499J71288Q5738j18001o811
$$ -379541 -358136 -68163 -165404 -263731 -95305 -56380 -30881 140407 226145 108144 101333
23824A01333L4032j04134j48913q9853J17639O7272J64149J09348O6478l70059
$$ 101333 135365 31231 -117682 -207535 -89896 -22624 141525 250873 317351 -52708
23814e2708k30015J05784L31771R9291K919j24782j36861p8017j79459j58197
$$ -52708 -282723 -176939 154832 254123 257042 132260 -4601 -82618 -262077 -420274
23804d20274N5224J03243J70752J54951k19308m06523J74965L43603N5239r8843
$$ -420274 -365050 -261807 -91055 63896 -155412 -561935 -386970 -43367 11872 -86971
23794h6971O8789K8167k9337K4698j57294K01266j1381j02035j61320k32770J92940
$$ -86971 -18182 9985 -19352 5346 -151948 49318 37937 -64098 -225418 -458188 -265248
23783b65248J93419N312L4236j08888n5228k52874k27373k1144J65989J60863
$$ -265248 -71829 -66517 -32281 -141169 -196397 -449271 -676644 -697788 -531799 -370936
23773c70936K33132K50m8771J98640J14244K37996m17274k54692N077J45217L66020
$$ -370936 -137804 -137554 -186325 12315 126559 364555 -52719 -307411 -302334 -157117 208903
23762B08903q1477j08614J24696j01474j79295M5032l325K48562K04496l10731
$$ 208903 127426 18812 143508 42034 -137261 -92229 -95554 153008 357504 46773
23752D6773k48524J10539j44548J8721l0680q8858N4549K65025l550j33140j9820
$$ 46773 -201751 -91212 -235760 -217039 -247719 -336577 -282028 -17003 -20553 -153693 -173513
23741a73513L76986J99068p7957k37309j16164n684j15488K32167K33362L9868
$$ -173513 203473 402541 324584 87275 -28889 -34573 -150061 82106 315468 355336
23731C55336l4230N7085j17148k79656j663N9240j15032p2069J200o8058j03489
$$ 355336 321106 378191 261043 -18613 -20276 38964 -76068 -148137 -146937 -214995 -318484
23720c18484L79011K79191m34584j21809J43401J51810K34178j81901k72928k48113
$$ -318484 60527 339718 -94866 -216675 -73274 78536 312714 130813 -142115 -390228
23710c90228j16950O2467J89297Q089J18965R7259J54248q4643j18748j95368
$$ -390228 -507178 -444711 -255414 -247325 -128360 -31101 123147 38504 -80244 -275612
23700b75612q4102j49627j77260J29502j0545L0546R6370Q0607L72631Q2083j44849
$$ -275612 -359714 -509341 -686601 -557099 -567644 -537098 -440728 -360121 12510 94593 -50256
23689e0256j04222O7008K00198n7943j04931j62864k2710j0521J2267K27404J38659
$$ -50256 -154478 -87470 112728 54785 -50146 -213010 -235720 -246241 -233974 -6570 132089
23678A32089J05870n5969K4487j94087l45119J0404J8099j37728L3370J02548
$$ 132089 237959 181990 206477 12390 -332729 -322325 -304226 -441954 -408584 -306036
23668c06036J69217P7429M7545m994J007j03838J36274M109j76783j2104K39984
$$ -306036 -136819 -59390 -11845 -16839 -15832 -119670 16604 20713 -156070 -168174 71810
23657G1810j00273l00402o8934J78977M1285J10133K6002q1135P6546M9631n5149
$$ 71810 -28463 -328865 -397799 -218822 -177537 -67404 -41402 -122537 -45991 3640 -51509
23646e1509k17955j2472P4898K7019k6458J67107J43493J09336k40373k88746
$$ -51509 -269464 -281936 -207038 -180019 -206477 -39370 104123 213459 -26914 -315660
23636c15660n9931k20740n1050J82384K19202N7563j66916l3734K47778R9305
$$ -315660 -375591 -596331 -647381 -464997 -245795 -188232 -355148 -388882 -141104 -41799
23626d1799l4470N7081J54954L9846L0160J29519j16140j24844J52670l8479j86935
$$ -41799 -76269 -19188 135766 175612 205772 335291 219151 94307 246977 208498 21563
23615B1563k7753J2539q4472J1022M9294J33130l8970J5452j47800r0712l3220
$$ 21563 -6190 6349 -78123 -67101 -17807 115323 76353 91805 -55995 -146707 -179927
23604a79927J42662L09490j11221l17946k39061p4885L10392L21040j83873k21906
$$ -179927 -37265 272225 161004 -156942 -396003 -470888 -160496 160544 -23329 -245235
23594b45235n9076N3340J88227j85138o7744n5469K17675J10468M5467K2102j61978
$$ -245235 -304311 -250971 -62744 -247882 -315626 -371095 -153420 -42952 2515 24617 -137361
23583a37361L0529Q4093L9107J73032J36071Q1110j1363k64663j14758l0483j24606
$$ -137361 -106832 -22739 16368 189400 325471 406581 395218 130555 15797 -14686 -139292
23572a39292j08156j29223q2588K05928J74066k2722K00304p5538j619j88241
$$ -139292 -247448 -376671 -459259 -253331 -79265 -101987 98317 22779 21160 -167081
23562a67081j18872K5288l17064q475K79679R0778o3650J30328J57495K25285
$$ -167081 -285953 -260665 -577729 -586204 -306525 -215747 -279397 -149069 8426 233711
23552B33711J3004o6347k4003k9406n5980J7299M3240Q7734R5460k89331k10257
$$ 233711 246715 180368 156365 126959 70979 88278 131518 219252 314712 25381 -184876
23541a84876j23442m8032J23313Q9195Q9235K45254P0573Q3143k61097q2380K38560
$$ -184876 -308318 -356350 -233037 -143842 -54607 190647 261220 344363 83266 886 239446
23530B39446J0922k67023J4484j7306j39472L13552J04005L0949n3478j22023
$$ 239446 250368 -16655 -2171 -19477 -158949 154603 258608 289557 236079 114056
23520A14056j522j86114k76687q4151N1421J52525J77628j89955r1827J87810
$$ 114056 112534 -73580 -350267 -434418 -382997 -230472 -52844 -242799 -334626 -146816
23510a46816p3021j23378J27301n6748J0420N294Q5481o9169K374P9342L32003
$$ -146816 -219837 -343215 -215914 -272662 -262242 -256948 -171467 -240636 -238262 -158920 173083
23499A73083M0083q8187L7654k63782j56484P3566J85227J11819j05723K69159
$$ 173083 213166 124979 162633 -101149 -257633 -184067 1160 112979 7256 276415
23489B76415k8053l22088j9099p9807k05078O7063J89999O8647p5244j6305J51232
$$ 276415 248362 -73726 -92825 -172632 -377710 -310647 -120648 -52001 -127245 -143550 7682
23478G682Q8465j52016j31697q8187J57192K60204Q5466r2096k98104j3547j13438
$$ 7682 96147 -55869 -187566 -275753 -118561 141643 227109 135013 -163091 -176638 -290076
23467b90076o646J88867J19360P1474r563j03557k02074n0502R5144J26603k22572
$$ -290076 -296722 -107855 11505 82979 73416 -30141 -232215 -282717 -187573 -60970 -283542
23456b83542j35413k3812L30642J72934j44087r0591J36175K23601m7658l6084
$$ -283542 -418955 -442767 -112125 60809 -83278 -173869 -37694 185907 138249 102165
23446A02165j18050o3902R8137j652J60867R6037p8728K59530Q4026k55776l54570
$$ 102165 -15885 -79787 18350 16698 177565 273602 194874 454404 538430 282654 -71916
23435g1916k50041N8153J61557J32842L9275k5789q5417Q9233N7407M0157M9860
$$ -71916 -321957 -263804 -102247 30595 69870 44081 -41336 47897 105304 145461 195321
23424A95321j55775p111J4793P3142l3056p1199j21227K5103L0483J496n8125
$$ 195321 39546 32435 47228 120370 87314 16115 -105112 -80009 -49526 -48030 -106155
23413a06155K7971J57338K43918o7210l32718J97029J65553j43511k2328Q3734
$$ -106155 -78184 79154 323072 255862 -76856 120173 285726 142215 119887 203621
23403B03621k06337j22963J88146L1146k59362o3622P036L41582J04149j55042
$$ 203621 -2716 -125679 62467 93613 -165749 -229371 -222335 119247 223396 68354
23393F8354p3999o8500J21658l1427o7361k0294M3382O5664J55055j32600q0133
$$ 68354 -5645 -74145 47513 16086 -51275 -71569 -28187 37477 192532 59932 -20201
23382b0201J20912k24526k09021J7763J95944J25975J78540j47510j85641Q3779
$$ -20201 100711 -123815 -332836 -315073 -119129 6846 185386 37876 -147765 -63986
23372f3986M1559k27062R3343j06444k6665J34158J94847j30520J42514j05875
$$ -63986 -22427 -249489 -156146 -262590 -289255 -155097 39750 -90770 51744 -54131
23362e4131o5616j8998P4620j09821J7908j15040K36273R8944j59574j97739j61518
$$ -54131 -119747 -138745 -64125 -173946 -156038 -271078 -34805 64139 -95435 -293174 -454692
23351d54692N0134J0611R0273M4794L26354J46186L53898r0707J20k2334l13202
$$ -454692 -404558 -393947 -303674 -258880 67474 213660 567558 476851 476971 454637 141435
23340A41435j77305R7109j91420l52271K00333K80530J51838P9547K8332k04242
$$ 141435 -35870 61239 -130181 -482452 -282119 -1589 150249 229796 258128 53886
23330E3886n7829k2508J63961M8285k39977l8944K24694n690j0862k4979M006
$$ 53886 -3943 -26451 137510 185795 -54182 -93126 131568 125878 115016 90037 94043
23319I4043m0791k48990k21253J1909P9282Q0238j53140j17603J02153K35471
$$ 94043 53252 -195738 -416991 -405082 -325800 -245562 -398702 -516305 -414152 -178681
23309a78681l6778K06691J45233l25793o9200r818J49179m106j06346j50930K70958
$$ -178681 -215459 -8768 136465 -189328 -258528 -268346 -119167 -123273 -229619 -380549 -109591
23298a09591J48711j18290j22813O1932J46604L9208q8657m7259M0378R3585j05774
$$ -109591 39120 -79170 -201983 -140051 6553 45761 -42896 -90155 -49777 43808 -61966
23287f1966K1634q762m4427J15775J23614J88886q1310k34230j40651k38858K2972
$$ -61966 -40332 -49094 -93521 22254 145868 334754 253444 19214 -121437 -360295 -337323
23276c37323L41299J27858q6979j11821m5559L35480Q2603j66424o9472J17943
$$ -337323 3976 131834 44855 -66966 -112525 222955 305558 139134 69662 187605
23266A87605K1419r581J39630p9604J08037j07953j01441j33550r1494J13867
$$ 187605 209024 199443 339073 259469 367506 259553 158112 24562 -66932 46935
23256D6935j56653k77669k17411K28176L20072M7898J85139L2578m525r4660k67001
$$ 46935 -109718 -387387 -604798 -376622 -56550 -8652 176487 209065 204540 109880 -157121
23245a57121M685n85J84443J63348j17613l18098p9249J50404O4550j32275k2444
$$ -157121 -152436 -153021 31422 194770 77157 -240941 -320190 -169786 -105236 -237511 -259955
23234b59955j2883m5620Q4708J70786J51482J06248Q1252p4556m135J25744q3568
$$ -259955 -272838 -318458 -233750 -62964 88518 194766 276018 201462 197327 323071 239503
23223B39503k59293k50433J0708o9137m3229o9313J86856K98379J64388q1209
$$ 239503 -19790 -270223 -259515 -328652 -371881 -441194 -254338 44041 208429 127220
23213A27220J06310l9249N6000J96791k60970j66338k70593J7031K9049p8816
$$ 127220 233530 194281 250281 447072 186102 19764 -250829 -233798 -204749 -283565
23203b83565J89545J26957q5514m4769J45945J84026j93627j50083r5761J25248
$$ -283565 -94020 32937 -52577 -97346 48599 232625 38998 -111085 -206846 -81598
23193h1598K35184j18977j37762j10732J09284n9489j79216J17871J58586L32400
$$ -81598 153586 34609 -103153 -213885 -104601 -164090 -343306 -225435 -66849 265551
23183B65551K09327j18595O970J94658j89221l93343j23262o4796j37474K26632
$$ 265551 474878 356283 363253 557911 368690 -24653 -147915 -212711 -350185 -123553
23173a23553K33260j16270p7784j64747q5927k16404O7589K12695J20856k15689
$$ -123553 109707 -6563 -84347 -249094 -335021 -551425 -483836 -271141 -150285 -365974
23163c65974q6583L38979J34704k2630j77479j75783j77223J76737K56302J84884
$$ -365974 -452557 -113578 21126 -1504 -178983 -354766 -531989 -355252 -98950 85934
23153H5934K7456K332M7077K45657J73672k38912m51243M5617P0483J95392K36309
$$ 85934 113390 115722 162799 408456 582128 343216 -108027 -62410 8073 203465 439774
23142D39774j16912k54739k0877J47342j10011k64081j6313R9019N7090K20202
$$ 439774 322862 68123 47246 194588 84577 -179504 -195817 -96798 -39708 180494
23132A80494J22477n6887K63207j06796K4868l1595j39299l49743j83069N8336
$$ 180494 302971 246084 509291 402495 427363 395768 256469 -93274 -276343 -218007
23122b18007o8839M5622J9797K48940J17235J20948p1211m2282p8397J44661L6633
$$ -218007 -286846 -241224 -221427 27513 144748 265696 194485 152203 73806 218467 255100
23111B55100o5337o1699N1260j8168l1425L9518k23872q3892J28778O8232J04510
$$ 255100 189763 128064 179324 161156 129731 169249 -54623 -138515 -9737 58495 163005
23100A63005O1256J2755j67672j43075J48965l082k5284j38246o2729Q5183J68746
$$ 163005 224261 237016 69344 -73731 75234 72152 46868 -91378 -154107 -68924 99822
23089I9822J74188l29484l84841N768J99546R4430l03532l7891r333m0503p9438
$$ 99822 274010 -55474 -440315 -434547 -235001 -140571 -444103 -481994 -491327 -531830 -611268
23078f11268Q4544j1318J66360J47471q552K02005M09162j66759p0771J30716
$$ -611268 -526724 -538042 -371682 -224211 -232763 -30758 378404 211645 140874 271590
23068B71590q3809k39831k35031J30469m4365j56736J97256K83636q4722j61621
$$ 271590 187781 -52050 -287081 -156612 -200977 -357713 -160457 123179 38457 -123164
23058a23164j79025m7880q7876J32787O7410o0837L6534J55267P2979J09961J93359
$$ -123164 -302189 -350069 -437945 -305158 -237748 -298585 -262051 -106784 -33805 76156 269515
23047B69515j90605m70302m7735K99431L51459N6994j09412j9948P3687m5279
$$ 269515 78910 -391392 -439127 -139696 211763 268757 159345 139397 213084 167805
23037A67805k27973p5471K74908Q3044r4621J44314k25221r9070J75317k05941
$$ 167805 -60168 -135639 139269 222313 127692 272006 46785 -52285 123032 -82909
23027h2909j10155Q347R5297K765j205l556R0547K04696L9242o6942k36135j48634
$$ -82909 -193064 -184717 -89420 -86655 -87860 -91416 -869 203827 243069 176127 -60008 -208642
23015b08642K37718J18610j63937l1804K14738Q12j20988l0386J3487k8997j76807
$$ -208642 29076 147686 -16251 -48055 166683 167495 46507 16121 29608 611 -176196
23004a76196r6147L30804M3143l24891l327j05018j8221J40617K484k30886l980
$$ -176196 -272343 58461 101604 -223287 -226614 -331632 -349853 -209236 -206752 -437638 -441618
22993d41618j07223j9373L43718L34968N5403L7378r7168l3408J6647j09110j92307
$$ -441618 -548841 -568214 -224496 110472 165875 203253 106085 72677 89324 -19786 -212093
22982b12093j4699J9287P6376J92482K4126J76312k52353j44784J33133N8353
$$ -212093 -226792 -207505 -131129 61353 85479 261791 9438 -135346 -2213 56140
22972E6140M1611J00448j50993j08572K6909o1086j82191J20410L15344O999k8738
$$ 56140 97751 198199 47206 -61366 -34457 -95543 -277734 -157324 158020 165019 136281
22961A36281j60805M439K87751O6780j06739j22732j70369r691K9053J38812K40647
$$ 136281 -24524 -20085 267666 334446 227707 104975 -65394 -75085 -46032 92780 333427
22950C33427q6906r6514l8917j51925R5091J41849O3139j61728r1600J617p7866
$$ 333427 246521 150007 111090 -40835 54256 196105 259244 97516 5916 7533 -70333
22939g0333j79923K7636K00932N748N0257J56093o8441o7678L0521j32973j37783
$$ -70333 -250256 -222620 -21688 -15940 34317 190410 121969 54291 84812 -48161 -185944
22928a85944R0134r209J02627R7208J1912n2985j84651J7632K41337L1443k54321
$$ -185944 -95810 -105019 -2392 94816 106728 53743 -130908 -113276 128061 159504 -94817
22917i4817j20643O1157k4233J11531q861o1277j48389O0222L7872J69188K64182
$$ -94817 -215460 -154303 -178536 -67005 -75866 -137143 -285532 -225310 -187438 -18250 245932
22906B45932P5657k31386k87596J31690P2003m5389j27867k42511k72399L65060
$$ 245932 321589 90203 -197393 -65703 6300 -39089 -166956 -409467 -681866 -316806
22896c16806K82348q9753j59287q0902J35443J7472J87184L09507k5657K1871
$$ -316806 -34458 -124211 -283498 -364400 -228957 -211485 -24301 285206 259549 281420
22886B81420j2342p1613j57879j55853N0590k7229J28649N4055N672R8563j29152
$$ 281420 269078 197465 39586 -116267 -65677 -92906 35743 89798 95470 194033 64881
22875F4881j49287J34532J82181J51172N5016N0594k38396k10562n642J92213
$$ 64881 -84406 50126 232307 383479 438495 489089 250693 40131 34489 226702
22865B26702R1086j80209k10067m7705N8313K15859j56789J4310K02816k11774
$$ 226702 317788 137579 -72488 -120193 -61880 153979 -2810 11500 214316 2542
22855B542K935o9465j92350L6423J21113O6333R749J57949r0924o8285N0471J08339
$$ 2542 5477 -63988 -256338 -219915 -98802 -32469 -22720 135229 44305 -23980 26491 134830
22843A34830M9274P4045j83032p724m4230j60980K81089j07628O0085Q3105n4033
$$ 134830 184104 258149 75117 67393 23163 -137817 143272 35644 95729 178834 124801
22832A24801M3552k7339l0416j03983L1939j49952j18298K10325J04696k32018
$$ 124801 168353 141014 110598 6615 38554 -111398 -229696 -19371 85325 -146693
22822a46693m8102K6856K89948p650Q7298J64639q6363l05158o7590J34886j34576
$$ -146693 -194795 -167939 122009 114359 201657 366296 279933 -25225 -92815 42071 -92505
22811i2505j34428K49494L13844R777j49111j4132L5129Q3622L4197j65216r8156
$$ -92505 -226933 22561 336405 346182 197071 182939 218068 301690 335887 170671 72515
22800G2515j01818K5218J08859q6967J36014O7771J63218k56572m24372M8939
$$ 72515 -29303 -4085 104774 17807 153821 221592 384810 128238 -296134 -247195
22790b47195m7395J43520K39547j49264M702M301L1123J63048k36591j61317K03981
$$ -247195 -294590 -151070 88477 -60787 -56085 -51784 -20661 142387 -94204 -255521 -51540
22779e1540R6807M9960j05985j43162O248K37058K58357o0746k13273j05329p6719
$$ -51540 45267 95227 -10758 -153920 -147672 89386 347743 286997 73724 -31605 -108324
22768a08324j34768r2326J38694m1489l2267J27460P7952R5423n668j09473j29
$$ -108324 -243092 -335418 -196724 -238213 -270480 -143020 -65068 30355 24687 -84786 -84915
22757h4915p3101K8284N2492J29010N3782R9505j13093j83946k24581P8858R3992
$$ -84915 -158016 -129732 -77240 51770 105552 205057 91964 -91982 -316563 -237705 -143713
22746a43713J17837l4875k86551p2919J95479O8526J43558J04150N7282r3903
$$ -143713 -25876 -60751 -347302 -420221 -224742 -156216 -12658 91492 148774 54871
22736E4871j45886K0579R9905J96181J00339k11734m7756j11008o2943j8178K35935
$$ 54871 -91015 -70436 29469 225650 325989 114255 66499 -44509 -107452 -125630 110305
22725A10305J1717Q3258M4970j28707l911j07685J49255n5130j16533Q9999K5680
$$ 110305 122022 205280 250250 121543 117632 9947 159202 104072 -12461 77538 103218
22714A03218j22041J31869Q8233l3984n7522J17437m373J59217J9601k32017j22972
$$ 103218 -18823 113046 201279 167295 109773 227210 222837 382054 401655 169638 46666
22703D6666K0800j76215J2864J142K8461K03837O6572l1708r9483k63383J06540
$$ 46666 67466 -108749 -95885 -94743 -66282 137555 204127 172419 72936 -190447 -83907
22692h3907J21294R5129Q0627l02222m4708j63061j38867J49479q544J3957Q5152
$$ -83907 37387 132516 213143 -89079 -133787 -296848 -435715 -286236 -294780 -280823 -195671
22681a95671r9389N234j26491K6072L63653n6483k81219Q2030L2631k0724R7484
$$ -195671 -295060 -289826 -416317 -390245 -26592 -83075 -364294 -282264 -249633 -270357 -172873
22670a72873Q7205R9389L8455n0655k31241j22607K56035n2958J01549K68483
$$ -172873 -85668 13721 52176 1521 -229720 -352327 -96292 -149250 -47701 220782
22660B20782q613k69155n21626K52624K41413Q2049p1903p8034J27009N8287j60591
$$ 220782 212169 -56986 -578612 -325988 -84575 -2526 -74429 -152463 -25454 32833 -127758
22649a27758r2866J64247J03302j80640k21747K18378J41547k9839p5406J16366
$$ -127758 -220624 -56377 46925 -133715 -355462 -137084 4463 -25376 -100782 15584
22639A5584j50181K13502o00k4794K0650l5198j69777L1509L17499L4113j65754
$$ 15584 -134597 78905 78305 53511 74161 38963 -130814 -99305 218194 252307 86553
22628H6553j39642q0147j16929j09586K43882K45626J31039N8622r0806r1836
$$ 86553 -53089 -133236 -250165 -359751 -115869 129757 260796 319418 228612 136776
22618A36776R8513j87965k70513K8633K74244j2431j8836M0957l31535j05809
$$ 136776 235289 47324 -223189 -194556 79688 67257 48421 89378 -242157 -347966
22608c47966K7505j62467Q8061O5632K14318l9287J01431l9245q4024J2043J13750
$$ -347966 -320461 -482928 -394867 -329235 -114917 -154204 -52773 -92018 -176042 -163999 -50249
22597e0249J50560j08679l60557n5177K62724J31597L2318J48958j55833j65861
$$ -50249 100311 -8368 -368925 -424102 -161378 -29781 2537 151495 -4338 -170199
22587a70199j38367K3058N460j0546k8752j47316p2415J99873L2252J80600n9379
$$ -170199 -308566 -285508 -280048 -290594 -319346 -466662 -539077 -339204 -306952 -126352 -185731
22576a85731k4843o5242J76366L04815j0152R5577K15468p2601k01484K68978
$$ -185731 -210574 -275816 -99450 205365 195213 290790 506258 433657 232173 501151
22566E01151J46936k30866m48152j87135O1867J29213p0345P8787M7033j88856
$$ 501151 648087 417221 -30931 -218066 -156199 -26986 -97331 -18544 28489 -160367
22556a60367J44133L3882J75673K4948j82983j22954l01441J07142K69600j19674
$$ -160367 -16234 17648 193321 218269 35286 -87668 -389109 -281967 -12367 -132041
22546a32041Q0616q9242J48633k8973j59854J05924L15865r8668o5609M1093M47716
$$ -132041 -51425 -140667 7966 -21007 -180861 -74937 240928 142260 76651 117744 565460
22535E65460N1761l06917k19460j39196j19676j94062j11964j4659n7858L05135
$$ 565460 617221 310304 90844 -48352 -168028 -362090 -474054 -488713 -546571 -241436
22525b41436K04125k80783k25234M3213J93213L24365K28584J77816j29093j43735
$$ -241436 -37311 -318094 -543328 -500115 -306902 17463 246047 423863 294770 151035
22515A51035l05785k4466K71955Q484k9483P9475m1315k75819j10834L49424J21386
$$ 151035 -154750 -179216 92739 101223 71740 151215 109900 -165919 -276753 72671 194057
22504A94057k7734P6086L8411p028r8824j14926j90242j43365K16327K29580M5100
$$ 194057 166323 242409 280820 273792 174968 60042 -130200 -273565 -57238 172342 217442
22493B17442J55919m3254r3108l24580j53311N621M43935J53107j66236n0872
$$ 217442 373361 330107 236999 -87581 -240892 -235271 208664 361771 195535 144663
22483A44663k56994k55696J15178K19046j17724j39320J11238P2500q9274J21806
$$ 144663 -112331 -368027 -252849 -33803 -151527 -290847 -179609 -107109 -196383 -74577
22473g4577R9280k4694j7736M9873J22082p1766r4907J33193k5571N9190J18843
$$ -74577 24703 9 -17727 32146 154228 82462 -12445 120748 95177 154367 273210
22462B73210j43498K8669k12271M8186Q9616O9904k79852k98166o889m7626J64833
$$ 273210 129712 158381 -53890 -5704 83912 153816 -126036 -424202 -431091 -478717 -313884
22451c13884J65203K490o9725J33934J20108Q6996j9704K3718k01233J96308n6556
$$ -313884 -148681 -146191 -215916 -81982 38126 125122 105418 129136 -72097 124211 67655
22440F7655j3767l6877M60k51878j29888M5258K00296K99768j46205l66963J3025
$$ 67655 53888 17011 17471 -234407 -364295 -319037 -118741 181027 34822 -332141 -319116
22429c19116K68035J43688p3896M5852n7176j08147q7002j42181J23686J3936
$$ -319116 -51081 92607 18711 64563 7387 -100760 -187762 -329943 -206257 -192321
22419a92321j37769k8461P3768j10917k18152J39892K46243O4011K1251J98603
$$ -192321 -330090 -358551 -284783 -395700 -613852 -473960 -227717 -163706 -142455 56148
22409E6148j00293q4611J38256O1158M4858M8847r2024Q2978K7778j89702J18239
$$ 56148 -44145 -128756 9500 70658 115516 164363 72339 155317 183095 -6607 111632
22398A11632J99466Q6475O9465j66987k6522k03873o0317l8345k57077k7811J81329
$$ 111632 311098 397573 467038 300051 273529 69656 9339 -29006 -286083 -313894 -132565
22387a32565p0155M596j94410J3232J41261J07525J57948K8672O6155L3777j37322
$$ -132565 -202720 -198124 -392534 -379302 -238041 -130516 27432 56104 122259 156036 18714
22376A8714l51774N0484K80636j56129j78506L7559L26948L07706n55431p5221
$$ 18714 -333060 -282576 -1940 -158069 -336575 -299016 27932 335638 -219793 -295014
22366b95014K64100L11288O8480k40238r2585R7599K8645o2806j15676k2636j2881
$$ -295014 -30914 280374 348854 108616 16031 113630 142275 79469 -36207 -58843 -71724
22355g1724M9919l6743j33143M0405L42584J29253j50678j56119P8797J26381
$$ -71724 -21805 -58548 -191691 -151286 191298 320551 169873 13754 92551 218932
22345B18932k35464r6430K789q2134m3967Q4026K02265q3165j1960J52230K52941
$$ 218932 -16532 -112962 -110173 -192307 -236274 -152248 50017 -33148 -45108 107122 360063
22334C60063M9110J68246k32731l44468j17352m8349O699J44428l1195m4491o0227
$$ 360063 409173 577419 344688 220 -117132 -165481 -158782 -14354 -45549 -90040 -150267
22323a50267L2804j69341P635O7717Q3160j14429J74480J10752j44112m287Q4909
$$ -150267 -117463 -286804 -279169 -211452 -128292 -242721 -68241 42511 -101601 -105888 -20979
22312b0979q8352k22801j23271j3651J5621K02310L11406K15039p9020j26515
$$ -20979 -109331 -332132 -455403 -469054 -453433 -251123 60283 275322 196302 69787
22302F9787j29023k38477p6203j93549q5598K01761L40487J13767j0415L1585
$$ 69787 -59236 -297713 -373916 -567465 -653063 -451302 -110815 2952 -7463 24122
22292B4122j56315r6602M8780K3225j41864j79786L3634K56056J45003J03803
$$ 24122 -132193 -228795 -180015 -156790 -298654 -478440 -444806 -188750 -43747 60056
22282F0056k0643k48402o6238J09011K30559j7536p8406P3301N3604j08161j84727
$$ 60056 39413 -208989 -275227 -166216 64343 46807 -31599 41702 95306 -12855 -197582
22271a97582J47998Q5463l4866j7322j1370k0225j32471l754M426j3932K77674
$$ -197582 -49584 35879 1013 -16309 -27679 -47904 -180375 -184129 -179703 -193635 84039
22260H4039J0496J79759L1791k33367q8581P7705J99435l21785j7092K85222j10524
$$ 84039 94535 274294 306085 72718 -15863 61842 261277 -60508 -77600 207622 97098
22249I7098P863N3628k59901q0594j3307J66623Q1296J57128J74475J02720j19956
$$ 97098 104961 158589 -101312 -181906 -195213 -28590 52706 209834 384309 487029 367073
22238C67073j25125j0961M8258j16673k1120N558Q8632r2654m3241r5600P366
$$ 367073 241948 230987 279245 162572 141452 147010 235642 142988 99747 4147 11513
22227A1513L1038J14042n8912j10361J90620J96906q1139j14029R8713l18501
$$ 11513 42551 156593 97681 -12680 177940 374846 293707 179678 278391 -40110
22217d0110j19309k27308p2954P8696J0709n4711j7413J40642P5357J76821K61360
$$ -40110 -159419 -386727 -459681 -380985 -370276 -424987 -442400 -301758 -226401 -49580 211780
22206B11780J41579J53089L6370j82547q5726l55539j76487K4016m7759J6443
$$ 211780 353359 506448 542818 360271 274545 -80994 -257481 -233465 -281224 -264781
22196b64781J18762K84358R1384o9429k38914j63137N0237J95119m412k8536m0831
$$ -264781 -146019 138339 229723 160294 -78620 -241757 -191520 3599 -813 -29349 -70180
22185g0180j57006j92820K17606L22352K801p4620n5848k10093k94861K35978
$$ -70180 -227186 -420006 -202400 119952 122753 48133 -7715 -217808 -512669 -276691
22175b76691M02262K30157k78485j52654J84102k20926J06080L89810Q7236k07465
$$ -276691 125571 355728 77243 -75411 108691 -112235 -6155 383655 470891 263426
22165B63426j55021r4582O163K30613K39958q1586j53447N4881J05684j1787J3154
$$ 263426 108405 13823 19986 250599 490557 408971 255524 310405 416089 404302 417456
22154D17456j32378K3808P5045Q8143l9285n2519k84733p6741j2959j27145j23470
$$ 417456 285078 308886 383931 472074 432789 380270 95537 18796 5837 -121308 -244778
22143b44778k5331m1513J46566J37167J46432J1154r86p1718j32961k1657K10318
$$ -244778 -270109 -311622 -165056 -27889 118543 129697 128711 56993 -75968 -97625 112693
22132A12693R5657j47478n3535k8735j13322j16886J08118J96388j24962j97041
$$ 112693 208350 60872 7337 -21398 -134720 -251606 -143488 52900 -72062 -269103
22122b69103j16778p7479n4232K19278P7599J5974j06716r7494Q4267J59264k7601
$$ -269103 -385881 -463360 -517592 -298314 -220715 -204741 -311457 -408951 -324684 -165420 -193021
22111a93021j0704l686O9726j35612Q2915N5857j75954j39517J436J6935J21362
$$ -193021 -203725 -207411 -137685 -273297 -190382 -134525 -310479 -449996 -448560 -431625 -310263
22100c10263Q6657r7802J70210K14679k999n4368j84672m2974R395N0689L0066
$$ -310263 -223606 -321408 -151198 63481 60482 6114 -178558 -221532 -212137 -161448 -131382
22089a31382K36410j14395k85059J1339R8899j3744J59225J51502M7140M082j27003
$$ -131382 105028 -9367 -294426 -283087 -184188 -197932 -38707 112795 159935 164017 37014
22078C7014J17294M9139P110J73996J4163k00393k03846J7438L6564j13848j0062
$$ 37014 154308 203447 210557 384553 398716 198323 -5523 11915 48479 -65369 -75431
22067g5431J75675J83571n8161j41498j72328k6662L1599j07052J30017J51624
$$ -75431 100244 283815 225654 84156 -88172 -114834 -83235 -190287 -60270 91354
22057I1354J04205o4341j47286k3449O35l7167Q0396k81401q8375k8631J11139
$$ 91354 195559 131218 -16068 -39517 -38882 -76049 4347 -277054 -365429 -394060 -282921
22046b82921J61089J25675o0779M0747n2929J03719p8482j80804N6648P299J24503
$$ -282921 -121832 3843 -56936 -16189 -69118 34601 -43881 -224685 -168037 -160738 -36235
22035c6235N9602J21740p8598j37315k3362k7114n4344L2595j19520r8250J87767
$$ -36235 23367 145107 66509 -70806 -94168 -121282 -175626 -143031 -262551 -360801 -173034
22024a73034J0908Q7564P9879K95607J48934o0073k61423j62875J30280j45654
$$ -173034 -162126 -74562 5317 300924 449858 389785 128362 -34513 95767 -49887
22014d9887j26115j20191o2611J30761k3222K89212J53958j90598O5482J59970
$$ -49887 -176002 -296193 -358804 -228043 -251265 37947 191905 1307 66789 226759
22004B26759j46711j27884j1810j37845J13395j16274R6051L61931o8892j90894
$$ 226759 80048 -47836 -59646 -197491 -84096 -200370 -104319 257612 188720 -2174
21994b174O5162J29997j30438j95312q546K9375P5086J56004m8724j92443l3990
$$ -2174 62988 192985 62547 -132765 -141311 -111936 -36850 119154 70430 -122013 -156003
21983a56003j98744o9148N9347R2049P5354J4647n8110J8031J78970K5174q1296
$$ -156003 -354747 -423895 -364548 -272499 -197145 -182498 -240608 -222577 -43607 -18433 -99729
21972i9729l06L69175K9798j15271k27066q9046J61323J09296k8774q4389p3942
$$ -99729 -100035 269140 298938 183667 -43399 -132445 28878 138174 109400 25011 -48931
21961d8931m9977j499j18433j26680j774M9837J68589m5555J86116J40864k11432
$$ -48931 -98908 -100407 -218840 -345520 -347294 -297457 -128868 -174423 11693 152557 -58875
21950e8875j8084J84344L937j01159j70226j22247K25082r7436n3493J01940J31946
$$ -58875 -76959 107385 111322 10163 -160063 -282310 -57228 -154664 -208157 -106217 25729
21939B5729J1543l21873J32313J3243n786L35047k6893L186J02731o0702P751
$$ 25729 37272 -284601 -152288 -139045 -144831 190216 163323 166509 269240 208538 216289
21928B16289j84888J07958k382j48337M4706M9331j24147J58915J9246r3068l48567
$$ 216289 31401 139359 136977 -11360 33346 82677 -41470 117445 136691 43623 -304944
21917c04944j5844K73772J24718j17404k17632m6093K2106L21286P8995r2397
$$ -304944 -320788 -47016 77702 -39702 -257334 -303427 -281321 39965 118960 26563
21907B6563k26103j40139j08023K47227J00920q5886j19575N0845L63775J67091
$$ 26563 -199540 -339679 -447702 -200475 -99555 -185441 -305016 -254171 109604 276695
21897B76695r085J48650j65825r9558l7959j98379j39453Q2761J66089J76499
$$ 276695 267610 416260 250435 150877 112918 -85461 -224914 -142153 23936 200435
21887B00435j29348q6816l88329l31181J83791J54483M1757K27192J14043r9056
$$ 200435 71087 -15729 -404058 -735239 -551448 -396965 -355208 -128016 -13973 -113029
21877a13029r1552j08003j13832R2902L18997R1418N387J8615j32278J7696j43562
$$ -113029 -204581 -312584 -426416 -333514 -14517 76901 82288 100903 -31375 -13679 -157241
21866a57241O7604P1170j66302n2827J03981j4749j27883O2919K32325N4773j00790
$$ -157241 -89637 -18467 -184769 -237596 -133615 -148364 -276247 -213328 18997 73770 -27020
21855b7020k6524J95143L87994j05150l07926n8146O6472R2260r1437l02216k36820
$$ -27020 -53544 141599 529593 424443 116517 58371 124843 217103 125666 -176550 -413370
21844d13370o3009J22539k4356Q1451J65798o8755j17703j9274K86539k3475j44885
$$ -413370 -476379 -353840 -378196 -296745 -130947 -199702 -317405 -336679 -50140 -73615 -218500
21833b18500j41940j7522O3661O1491J06080M9799j66245j43912K7039j37044
$$ -218500 -360440 -377962 -314301 -252810 -146730 -96931 -263176 -407088 -380049 -517093
21823e17093L902J49397J79140K78418R5667j82268O1660p2592r4878r4427q7898
$$ -517093 -513191 -363794 -184654 93764 189431 7163 68823 -3769 -98647 -193074 -280972
21812b80972Q9422p5231L63R6977N079j09573J8928J19556l23064K3558J1548
$$ -280972 -191550 -266781 -266418 -169441 -164362 -273935 -255007 -135451 -458515 -434957 -423409
21801d23409k108Q670K16676O9479J25917O7740l85153j40591J52958Q6160K73680
$$ -423409 -425517 -416847 -200171 -130692 -4775 62965 -322188 -462779 -309821 -223661 50019
21790E0019J24308j90390J0301p7553Q6745J32801r503R2966k25960l12077j98429
$$ 50019 174327 -16063 -5762 -83315 3430 136231 126728 219694 -6266 -318343 -516772
21779e16772J4358K00237J41901K79152J17327o7877m7928k8334m0907J12974
$$ -516772 -502414 -302177 -160276 118876 236203 168326 120398 92064 51157 164131
21769A64131L4719k7279J93797M6338r6776j11254L943J8096Q4134L7248J87405
$$ 164131 198850 171571 365368 411706 314930 203676 207619 225715 309849 347097 534502
21758E34502k95220l00180Q6409Q6053J33968K7161k4308o1758o2962j9307o8454
$$ 534502 239282 -60898 25511 111564 245532 272693 248385 186627 123665 104358 35904
21747C5904J7522j77854K2792J1978J77774M789j55543J71174K66319j11173P794
$$ 35904 53426 -124428 -101636 -89658 88116 92905 -62638 108536 374855 263682 271476
21736B71476K3598l85812l21441l0272K1037J34929j20631K70773k61770p7246
$$ 271476 295074 -90738 -412179 -442451 -421414 -286485 -407116 -136343 -398113 -475359
21726d75359K43148K06746n1907P498j1848K5375J98867M7924J29404j16679j17101
$$ -475359 -232211 -25465 -77372 -69874 -81722 -56347 142520 190444 319848 203169 86068
21715H6068K05904M4298K11077N91k70625j73338j44546k41648J26240J62866
$$ 86068 291972 336270 547347 547938 277313 103975 -40571 -282219 -155979 6887
21705F887J96117k005k46802j12710J13628K18835M6676j43548L491M5638Q4563
$$ 6887 203004 200999 -45803 -158513 -44885 173950 220626 77078 80569 126207 210770
21694B10770L3793P4852j67663J68926k4925k51806k23277J52273m4869J42012
$$ 210770 244563 319415 151752 320678 295753 43947 -179330 -27057 -71926 70086
21684G0086J6530r1771j2338J0790l56196j08298J80459J52950N5708n8202M3807
$$ 70086 86616 -5155 -17493 -6703 -362899 -471197 -290738 -137788 -82080 -140282 -96475
21673i6475j39980n49977o0436L67163J62800M0186P068j40457K819j54053J75976
$$ -96475 -236455 -786432 -846868 -479705 -316905 -276719 -269651 -410108 -407289 -561342 -385366
21662c85366R2639J9914J22461J29442J93476q3960l91255j09959K02525n527
$$ -385366 -292727 -272813 -150352 -20910 172566 88606 -302649 -412608 -210083 -215610
21652b15610r6408J38166L9575L8049K906j83131j70108K80226M42829J18208
$$ -215610 -312018 -173852 -134277 -96228 -93322 -276453 -446561 -166335 276494 394702
21642C94702j41123j08739k61928N8724K72275J33918m8554m0442N2583j08213
$$ 394702 253579 144840 -117088 -58364 213911 347829 299275 258833 311416 203203
21632B03203j12611O2053k50031n5168L63904O6929j57053k39466M9553J22562
$$ 203203 90592 152645 -97386 -152554 211350 278279 121226 -118240 -68687 53875
21622E3875q9826P9979K55382j27011k14951q7999L9493K4789Q278N8460n7104
$$ 53875 -35951 44028 299410 172399 -42552 -130551 -91058 -66269 -57991 469 -56635
21611e6635k9657r015M7833r9554J0766M5661P8078Q4424J52166j50094k42684
$$ -56635 -86292 -95307 -47474 -147028 -136262 -90601 -12523 71901 224067 73973 -168711
21600a68711j53430l9271j24568K87932K26868n4514p5270n7800j15034j60679
$$ -168711 -322141 -361412 -485980 -198048 28820 -25694 -100964 -158764 -273798 -434477
21590d34477J62583L17506K75966k51784j97702L3609K15506J43791J35734M8350
$$ -434477 -271894 45612 321578 69794 -127908 -94299 121207 264998 400732 449082
21580D49082k06538l06040n8777j04772J72551K0756q0087j77695n14574K88327
$$ 449082 242544 -63496 -122273 -227045 -54494 -33738 -113825 -291520 -806094 -517767
21570e17767L92555M5356P8249R5063l8167k87879j43068q7448J11730J91515
$$ -517767 -125212 -79856 -1607 93456 55289 -232590 -375658 -463106 -351376 -159861
21560a59861Q1256l8223P2568N452j65745k7463N7850N2176N3527J61977J41551
$$ -159861 -78605 -116828 -44260 -38808 -204553 -232016 -174166 -121990 -68463 93514 235065
21549B35065N7581l06577K2509m0810j56757N618J13054j28336k05242q7517K40800
$$ 235065 292646 -13931 8578 -32232 -188989 -183371 -70317 -198653 -403895 -491412 -250612
21538b50612m540L9996o2450J13422m8238O7653L2680L0537P4592K0463N0252
$$ -250612 -255152 -215156 -277606 -164184 -212422 -144769 -112089 -81552 -6960 13503 63755
21527F3755K9146J0489l59736r8711J74358N9940J23149O9914k03147j15150Q2762
$$ 63755 92901 103390 -256346 -355057 -180699 -120759 2390 72304 -130843 -245993 -163231
21516a63231R2237J59532L23488k51573j34552P3003j30246p1639L11151J01488
$$ -163231 -70994 88538 412026 160453 25901 98904 -31342 -102981 208170 309658
21506C09658j96489j13658o1167P2746r8085j23937j61018O4241K58042K6373
$$ 309658 113169 -489 -61656 11090 -86995 -210932 -371950 -307709 -49667 -23294
21496b3294k5148N2452j53390J38853L2295j2749j38869R473K23629Q6685M1462
$$ -23294 -48442 4010 -149380 -10527 21768 9019 -129850 -120377 103252 189937 231399
21485B31399l03473l08334J98406K47166J72020J75484k5864k30304k03201j80113
$$ 231399 -72074 -380408 -182002 65164 237184 412668 386804 156500 -46701 -226814
21475b26814J680M2622m694p4847M4642K64946K60626q7375j16622K76866Q9005
$$ -226814 -225134 -182512 -187206 -262053 -217411 47535 308161 220786 104164 381030 470035
21464D70035k36202k29118N8123J39807L04841N3071l41765k39306K92884j10183
$$ 470035 233833 4715 62838 202645 507486 560557 218792 -20514 272370 162187
21454A62187o5247l56952j26148J64559K31253O5106L2287K25720m8851j02248
$$ 162187 96940 -260012 -386160 -221601 9652 74758 107045 332765 283914 181666
21444A81666j79686n8776J16308L362k73679J01769Q071L1995P4507k44963o559
$$ 181666 1980 -56796 59512 62874 -210805 -109036 -100965 -68970 5537 -239426 -245985
21433b45985L44021J74249k54212j65810n7426k73038j4875O5121j15369K09201
$$ -245985 98036 272285 18073 -147737 -205163 -478201 -493076 -427955 -543324 -334123
21423c34123L03375J29201K3868j64575j55031j05407J17897O5527J06600j77741
$$ -334123 -30748 98453 122321 -42254 -197285 -302692 -184795 -119268 -12668 -190409
21413a90409k50323n5320J36365J0450J53378p222l7483K61876M2172j2227k08141
$$ -190409 -440732 -496052 -359687 -349237 -195859 -203081 -240564 21312 63484 51257 -156884
21402a56884l6630J80637j36918J141J60195J80805j60838m35367k12229o160
$$ -156884 -193514 -12877 -149795 -148654 11541 192346 31508 -403859 -616088 -622248
21392f22248Q2978O9753j4875J72450R3721n6607J10013q2487o986k18036J02960
$$ -622248 -539270 -469517 -484392 -311942 -218221 -274828 -164815 -247302 -254288 -472324 -369364
21381c69364Q3731J56994M8057r5104j55944J91213R5049m0943l8972M5282L1042
$$ -369364 -285633 -128639 -80582 -175686 -331630 -140417 -45368 -86311 -125283 -80001 -48959
21370d8959P7150J3051L18998P1436j51505l6522J11558J43583k0629j28956j453
$$ -48959 28191 41242 360240 431676 280171 243649 355207 498790 478161 349205 347752
21359C47752j36284Q0279p5011k38682n9778P2218M7948r9761J33229k03205j01645
$$ 347752 211468 291747 216736 -21946 -81724 -9506 38442 -61319 71910 -131295 -232940
21348b32940J12691J32024J15584o4292J78583m0537J0733n2135j87493j26113
$$ -232940 -120249 11775 127359 63067 241650 201113 211846 159711 -27782 -153895
21338a53895J02093l0772q3111K07504O5517K0339J94749o6052o750R9446M1765
$$ -153895 -51802 -82574 -165685 41819 107336 127675 322424 256372 249622 349068 390833
21327C90833o6591k1829O5256P8700j98121j23317P2843R4292Q0694L0675p7551
$$ 390833 324242 302413 367669 446369 248248 124931 197774 292066 372760 403435 325884
21316C25884l08479R6956J41945J432l6516O8160k90681j57675J6465o3046P0069
$$ 325884 17405 114361 256306 257738 221222 289382 -1299 -158974 -142509 -205555 -135486
21305a35486P4175K50918k1515k29361J9413m6083m2339j22278K22710K65609
$$ -135486 -61311 189607 168092 -61269 -41856 -87939 -130278 -252556 -29846 235763
21295B35763O4719j02674j37337j88735o7454p9477J29056M4812p0127J19140
$$ 235763 300482 197808 60471 -128264 -195718 -275195 -146139 -101327 -171454 -52314
21285e2314j86969M3323N8147J65256M9109k07482N316J73077j52176r8563Q763
$$ -52314 -239283 -195960 -137813 27443 76552 -130930 -125614 47463 -104713 -203276 -194513
21274a94513k0073J20128j29536j89126o5449J06572J20459j00109k78942L26549
$$ -194513 -214586 -94458 -223994 -413120 -478569 -371997 -251538 -351647 -630589 -304040
21264c04040J51635O0427K31323J48637O8487k62544l1380J14379m0427j28450
$$ -304040 -152405 -91978 139345 287982 356469 93925 62545 176924 136497 8047
21254H047k74468j10850j7808L78706L48277j76614M2667J14225p9831Q577r7278
$$ 8047 -266421 -377271 -395079 -16373 331904 155290 197957 312182 232351 240928 143650
21243A43650k00264O2126M6481M8067o4825K2258K2190j31523J5783K82721P6584
$$ 143650 -56614 5512 51993 100060 35235 57493 79683 -51840 -36057 246664 323248
21232C23248k19070m2842J01670r0002j62660j69713q1417R3577K09546j8795
$$ 323248 104178 61336 163006 73004 -89656 -259369 -340786 -247209 -37663 -56458
21222e6458k64665M4628J75031K08351J00080k34985l14181K4105R2400K52563
$$ -56458 -321123 -276495 -101464 106887 206967 -28018 -342199 -318094 -225694 26869
21212B6869P4638N3144j06223J136p6650M3398K33409K34001o2573k80811r1027
$$ 26869 101507 154651 48428 49564 -27086 16312 249721 483722 421149 140338 49311
21201D9311j61801J01308j05848j00876p6788p9998J74874L0042P3458k39266
$$ 49311 -112490 -11182 -117030 -217906 -294694 -374692 -199818 -169776 -96318 -335584
21191c35584J92869L51973K47754j29073j68449M4672j35090J17624r5184j72859
$$ -335584 -142715 209258 457012 327939 159490 204162 69072 186696 91512 -81347
21181h1347K50626K19479J44612J2646j41964N2802k7822l33377l0943q3009k49729
$$ -81347 169279 388758 533370 546016 404052 456854 429032 95655 64712 -18297 -268026
21170b68026j12903M2025K15840Q150J06854J49015j14350m1948J26450J45747
$$ -268026 -380929 -338904 -123064 -114914 -8060 140955 26605 -15343 111107 256854
21160B56854J48167j42304M2457Q6352m7904p0873K4360p552k03341q7629k09358
$$ 256854 405021 262717 305174 391526 343622 272749 297109 289557 86216 -1413 -210771
21149b10771J39329K03212j41576O0039P6275r2113n681L5732j2964l0447O3949
$$ -210771 -71442 131770 -9806 50233 126508 34395 28714 64446 51482 21035 84984
21138H4984R1667K50856j17683l5227L1340J01381n5441j10556o4390n2319J4078
$$ 84984 176651 427507 309824 274597 305937 407318 351877 241321 176931 124612 138690
21127A38690K96510J96730o6945J40062k06499k12634l84336j75637K58012J43921
$$ 138690 435200 631930 564985 705047 498548 285914 -98422 -274059 -16047 127874
21117A27874P9590J05716k95139J05558J84339j09643p9942j46582Q9900l2179
$$ 127874 207464 313180 18041 123599 307938 198295 118353 -28229 61671 29492
21107B9492L33866j95128K4518J60209m0790j03119P20j83751j81489j30710r9673
$$ 29492 363358 168230 192748 352957 312167 209048 209768 26017 -155472 -286182 -385855
21096c85855J68640o7095j17073j37853J68874K99488K93194o0113j69015l7367
$$ -385855 -217215 -284310 -401383 -539236 -370362 -70874 222320 162207 -6808 -44175
21086d4175M3011n3866K6193q2989K09281o4765j21123J95607M3685j3461p1830
$$ -44175 -1164 -55030 -28837 -111826 97455 32690 -88433 107174 150859 137398 65568
21075F5568k8935J0723J85092o1284K77993l7287j13699j12842K393M301o0652
$$ 65568 36633 47356 232448 171164 449157 411870 298171 185329 187722 192023 131371
21064A31371J07074j10803j48913Q5391K31234J86377r7796l11985L3979l5476
$$ 131371 238445 127642 -21271 64120 295354 481731 383935 71950 105929 70453
21054G0453L2192j0202J24467L5237k4031m0488k6819k1281j25862l7310j19664
$$ 70453 102645 92443 216910 252147 228116 187628 160809 139528 13666 -23644 -143308
21043a43308J1360J51141k02246j33897J4322N4671Q3259J44915M884O1671L6017
$$ -143308 -131948 19193 -183053 -316950 -302628 -247957 -164698 -19783 -14899 46772 82789
21032H2789j74436l2098k04504j05480J94456J06241J5019p0212K2489l6512K91350
$$ 82789 -91647 -123745 -328249 -433729 -239273 -133032 -118013 -188225 -165736 -202248 89102
21021H9102N8618j1896j11363O030j932j11388j17597r18J79251J75805r9813
$$ 89102 147720 135824 24461 30491 28559 -82829 -200426 -201344 -22093 153712 53899
21010E3899p4169j67692J12906j50827j30467J73445J57334K1633Q5697P4626
$$ 53899 -20270 -187962 -75056 -225883 -356350 -182905 -25571 -3938 81759 156385
21000A56385m2167J27067O4161m8927M5742N4040j29296k56880k97097j10265
$$ 156385 114218 241285 305446 256519 302261 356301 227005 -29875 -326972 -437237
20990d37237P2161p3071J38162K65034J18166L29763k76491m14310N3604M1074
$$ -437237 -365076 -438147 -299985 -34951 83215 412978 136487 -277823 -224219 -183145
20980a83145j06446j74267j46877k2592K84199K44512J57207j6412l791q7572
$$ -183145 -289591 -463858 -610735 -633327 -349128 -104616 52591 36179 32388 -55184
20970e5184n6011J21230q9146O1603Q3905m6003m2353j50466p9097k0439j76069
$$ -55184 -111195 10035 -79111 -17508 66397 20394 -21959 -172425 -251522 -271961 -448030
20959d48030K29286K15021m3538J57106q5522J03120j898r7397r6832N3117M0113
$$ -448030 -218744 -3723 -47261 109845 24323 127443 125545 28148 -68684 -15567 24546
20948B4546K871J45336K56694J56212l94586j79462N0970R3442j26287n9327O6083
$$ 24546 27417 172753 429447 585659 191073 11611 62581 156023 29736 -29591 36492
20937C6492J41451J09063j4508l84274k53329K50582K17710J87415j77290J44960
$$ 36492 177943 287006 272498 -111776 -365105 -114523 103187 290602 113312 258272
20927B58272K125k4273k12338L7715J21357k95065j48312j34694J07934K08748
$$ 258272 260397 236124 23786 61501 182858 -112207 -260519 -395213 -287279 -78531
20917g8531P6978N0195J12620k3836k33213k39761J92726N35604J2037Q744k9244
$$ -78531 -1553 48642 161262 137426 -95787 -335548 -142822 392782 404819 413563 384319
20906C84319l14O2896J03815n2581q8047j2738J631J28763l17657j21596l218
$$ 384319 384005 446901 550716 498135 410088 397350 398981 527744 210087 88491 85273
20895H5273K312l8498J46383k04408j44254j14307j70102K09953J48338J79577
$$ 85273 87585 49087 195470 -8938 -153192 -267499 -437601 -227648 -79310 100267
20885A00267q8006l1015j75500l1174J95997J05005O6932P3540J20828o5284m03324
$$ 100267 12261 -18754 -194254 -225428 -29431 75574 142506 216046 336874 271590 -131734
20874a31734j28267O3446O2159J39638J75663k4901j28562j86845J51915O4197
$$ -131734 -260001 -196555 -134396 5242 180905 156004 27442 -159403 -7488 56709
20864E6709M1549l26317q4617O25193J64125k90753l10230n9481M5163M9508r2737
$$ 56709 98258 -228059 -312676 312517 476642 185889 -124341 -183822 -138659 -89151 -181888
20853a81888J390L4355m8562M6886Q8776Q5465o7220j95590K0750J47042P123
$$ -181888 -180498 -146143 -194705 -147819 -59043 26422 -40798 -236388 -215638 -68596 -61473
20842f1473j39797j57693J43048L13517N0775k9040M9411N6265j42866J03991
$$ -61473 -201270 -358963 -215915 97602 148377 119337 168748 225013 82147 186138
20832A86138O1955L3059j26472k30333n9174J74733M738j52867k28672J56600
$$ 186138 248093 281152 154680 -75653 -134827 39906 44644 -108223 -336895 -180295
20822a80295K01121K4895Q0145k67984k39816O9105N9151J51141L30243R2664
$$ -180295 20826 45721 125866 -142118 -381934 -312829 -253678 -102537 227706 320370
20812C20370l90805P9930l514n615J07413j39365J06902J47029k85824k06498
$$ 320370 -70435 9495 5981 366 107779 -31586 75316 222345 -63479 -269977
20802b69977o7906R733K62172Q0495k08400j6604O2103R8438O5541p1290m3471
$$ -269977 -337883 -328150 -65978 14517 -193883 -210487 -148384 -49946 15595 -55695 -99166
20791i9166J01993J25205J25012J51548j20556j36003l1163o8967j87418j08196
$$ -99166 2827 128032 253044 404592 284036 148033 116870 47903 -139515 -247711
20781b47711J13742K34081J91920j21441k15143J71242k3254j25825L506K9213
$$ -247711 -133969 100112 292032 170591 -44552 126690 103436 -22389 -18883 10330
20771A0330J3819n2847P3544K27855P4350j055k12207r3600j4055o7109k1850
$$ 10330 24149 -28698 44846 272701 347051 345996 133789 40189 26134 -40975 -62825
20760f2825J86755P8199P1318J18899M6223j45511l96435q9093J38581P8509N7787
$$ -62825 123930 202129 273447 392346 438569 293058 -103377 -192470 -53889 24620 82407
20749H2407j03010j49380N3909J32521J21177J44938j05110J55900l3177n3504
$$ 82407 -20603 -169983 -116074 16447 137624 282562 177452 333352 300175 246671
20739B46671k72586j62178N8334J44324k82214j29187K81264J32271K73641J3890
$$ 246671 -25915 -188093 -129759 14565 -267649 -396836 -115572 16699 290340 304230
20729C04230j38361L151J05070j7015J31444l7452J65608j10664M4471m3868n7896
$$ 304230 165869 169020 274090 257075 388519 351067 516675 406011 450482 406614 348718
20718C48718n2473o1482l56918j15553j6349J48222J73642K67982J98200J945
$$ 348718 296245 234763 -122155 -237708 -254057 -105835 67807 335789 533989 535934
20708E35934Q660j23400R0237j63061P484j1784k3996k61434j14416l934r3114
$$ 535934 544594 421194 511431 348370 355854 344070 320074 58640 -55776 -59710 -152824
20697a52824J43643k7209N4625K12370j3441N0772P8542q3320k0495k54309K33077
$$ -152824 -9181 -36390 18235 230605 217164 267936 346478 263158 242663 -11646 221431
20686B21431J5740j51800j0646k82768j78095K452M10120K28781j22633p1609
$$ 221431 237171 85371 74725 -208043 -386138 -383686 26434 255215 132582 60973
20676F0973k379j79782Q1047j26391J9142J25528N0626J25234k61826k19888N6519
$$ 60973 58594 -121188 -40141 -166532 -147390 -21862 28764 153998 -107828 -327716 -271197
20665b71197R1071K18643K31176J09291j96653k71200j55241J48495K95462J9881
$$ -271197 -180126 38517 269693 378984 182331 -88869 -244110 -95615 199847 219728
20655B19728J32385l634l11460j56880K5815K30767J07375N7225o5886m4152r6723
$$ 219728 352113 348479 37019 -119861 -94046 136721 244096 301321 235435 191283 94560
20644I4560j31266J60476K95910J55907J03610j00639k73460j37059J90863l56984
$$ 94560 -36706 123770 419680 575587 679197 578558 305098 168039 358902 1918
20634A918l29622k41411K13664M46545n5938L3761m5793k02863J18617K6185J73883
$$ 1918 -327704 -569115 -355451 91094 35156 68917 23124 -179739 -61122 -34937 138946
20623A38946M4500J24005m5832l06852k13664K72023K69189j07488j37560J7136
$$ 138946 183446 307451 261619 -45233 -258897 13126 282315 174827 37267 54403
20613E4403o1735j23737O6084m6933j00678J82030L9694k8854j52884L4268M0995
$$ 54403 -7332 -131069 -64985 -111918 -212596 -30566 9128 -19726 -172610 -138342 -97347
20602i7347q8598k2359O9333P993k24070k03885J88317L63465Q2086j71093j58439
$$ -97347 -185945 -208304 -138971 -130978 -355048 -558933 -370616 -7151 74935 -96158 -254597
20591b54597P9549K1256L21954J29418O3484j3133n6121j13560l41990J20331
$$ -254597 -175048 -153792 168162 297580 361064 347931 291810 178250 -163740 -43409
20581d3409j65773j54830J43875J16176M49603R0450r9189q6789P2121J19980
$$ -43409 -209182 -364012 -220137 -103961 345642 436092 336903 250114 322235 442215
20571D42215K756n742j89580J13797j73833j18669K16651m8799j01082j03474
$$ 442215 444971 439229 249649 363446 189613 70944 287595 238796 137714 34240
20561C4240j41882J38345L53050k4060m02302K4072r1925n5015J14435J15924
$$ 34240 -107642 30703 383753 359693 -42609 -18537 -110462 -165477 -51042 64882
20551F4882j27682j11724o3668j06454j35449j93745j39221K64643J05224j44406
$$ 64882 -62800 -174524 -238192 -344646 -480095 -673840 -813061 -548418 -443194 -587600
20541e87600K19851M01072J63811P8274n0043j62581j61042l21094J45338J24602
$$ -587600 -367749 33323 197134 275408 225365 62784 -98258 -419352 -274014 -149412
20531a49412J32736l3595J7897O7131j36148m1402J00088P6168n0879K76914R4315
$$ -149412 -16676 -50271 -32374 34757 -101391 -142793 -42705 33463 -17416 259498 353813
20520C53813N1696M8864J5099l54634j4409P1327r7171l0700q9651J38965K0612
$$ 353813 405509 454373 469472 114838 100429 171756 74585 43885 -45766 93199 113811
20509A13811j85595l27727j53802K87473m7394K11848K06014j20054K8320q3630
$$ 113811 -71784 -399511 -553313 -265840 -313234 -101386 104628 -15426 12894 -70736
20499g0736p4987J42616M708o6382K0654o8489K13934M6384L5269O9498O793l15400
$$ -70736 -145723 -3107 1601 -64781 -44127 -112616 101318 147702 182971 252469 259262 -56138
20487e6138j34898J81649N5578O592o6776K36122P0109p5922o509k75829J40340
$$ -56138 -191036 -9387 46191 52783 -13993 222129 292238 216316 209807 -66022 74318
20476G4318L40630L4517p8811O5409j91801j56340j65650q5807r3148J52100J74890
$$ 74318 414948 449465 370654 436063 244262 87922 -77728 -163535 -256683 -104583 70307
20465G0307j57333J06582J73171J81116K0714j06810q3509j4902N5465J60472
$$ 70307 -87026 19556 192727 373843 394557 287747 204238 189336 244801 405273
20455D05273j58886l6591j37279J41608J25717j92122n21780m13756n4305K25983
$$ 405273 246387 209796 72517 214125 339842 147720 -374060 -787816 -842121 -616138
20445f16138J94090J8241m839J54433K8396j08482J79973K14142J76875k7712
$$ -616138 -422048 -403807 -408646 -254213 -225817 -334299 -154326 59816 236691 208979
20435B08979q5309L0286k07723j39265p8487R9619L02926R9501k67975k19852
$$ 208979 123670 153956 -53767 -193032 -271519 -171900 131026 230527 -37448 -257300
20425b57300O0587K01820L02285j40143p5961l3671J20618J38518j96119L1539
$$ -257300 -196713 5107 307392 167249 91288 57617 178235 316753 120634 152173
20415A52173k5735q5248P558R6666L9342K421k7633n1034J4016N2568M1801R9908
$$ 152173 126438 41190 48748 145414 184756 187177 159544 108510 122526 175094 216895 316803
20403C16803J29736r2676l48191l99355J01387L79050J13541q3746M4878J29127
$$ 316803 446539 353863 5672 -393683 -292296 86754 200295 116549 161427 290554
20393B90554k26673k23623J45466P7797p348O2314n943M528l4082m2569m6089
$$ 290554 63881 -159742 -14276 63521 56173 118487 112544 117072 82990 40421 -5668
20382e668L3287J13938J80651Q5444j22171j76642k22223l4233L888K43772J13524
$$ -5668 27619 141557 322208 407652 285481 108839 -113384 -147617 -143729 100043 213567
20371B13567O3150R4998j41181J20075K7381k83337j61937J81516J0511L7819
$$ 213567 276717 371715 230534 350609 377990 94653 -67284 114232 124743 162562
20361A62562k2509K2523N4809l8311j08519R6510L5151L08993J66972n5384j25070
$$ 162562 140053 162576 217385 179074 70555 167065 202216 511209 678181 622797 497727
20350D97727j42193k94063m6249J9842K36098l6453k04167j24900J00952p3062
$$ 497727 355534 61471 15222 35064 271162 234709 30542 -94358 6594 -66468
20340f6468J78898J69510j39005j85384P4111k47357o6734N2007m4977L1585r745
$$ -66468 112430 281940 142935 -42449 31662 -215695 -282429 -230422 -275399 -243814 -253559
20329b53559J23277K38434J74792o3426j35693q0002M7590J47865n7415j65349
$$ -253559 -130282 108152 282944 219518 83825 3823 51413 199278 141863 -23486
20319b3486R5610j96556j38836P2333J11402J4527j46458L7849P8598J2497l5529
$$ -23486 72124 -124432 -263268 -190935 -79533 -65006 -211464 -173615 -95017 -82520 -118049
20308a18049j30225K62713N3151j24050j12435J24927Q7651r1919r3879N3511
$$ -118049 -248274 14439 67590 -56460 -168895 -43968 43683 -48236 -142115 -88604
20298h8604K2786K4112O1803n7648J859N9426n0777q6392q532J53528m1676J53275
$$ -88604 -65818 -41706 20097 -37551 -35692 23734 -27043 -113435 -121967 31561 -10115 143160
20286A43160K35065j43630j87184j16290j11671O3867K2165m645j17944o5617
$$ 143160 378225 234595 47411 -68879 -180550 -116683 -94518 -99163 -217107 -282724
20276b82724N6449j05343J33765K17627j0993J02008Q1974J20838j17588K1676
$$ -282724 -226275 -331618 -197853 19774 8781 110789 192763 313601 196013 217689
20266B17689m8774K00409J65098l60359Q3444O5441l17208N8952J42704j35512
$$ 217689 168915 369324 534422 174063 257507 322948 5740 64692 207396 71884
20256G1884k6786L26890Q2982k48858j23257K9080j29282q5428j51826R1450J35937
$$ 71884 45098 371988 454970 206112 82855 111935 -17347 -102775 -254601 -163151 -27214
20245b7214O0370K08889K41384q5665j44239n7849q2010J02889K9705l05812j67348
$$ -27214 33156 242045 483429 397764 253525 195676 113666 216555 246260 -59552 -226900
20234b26900J20911L3399J5521K14192P1022q75J45417j02826j26711q6719o7845
$$ -226900 -105989 -72590 -57069 157123 228145 227270 372687 269861 143150 56431 -11414
20223a1414o132K54455J28764k384q714J76277M2488r2321k39197k45951k142
$$ -11414 -17546 236909 365673 363289 354575 530852 573340 481019 241822 -4129 -6271
20212f271J28780n8725K73862K43222k68682j09064o7080M1884K05238J12828
$$ -6271 122509 63784 337646 580868 312186 203122 136042 177926 383164 495992
20202D95992j73953o1087k08409k90322P3262K28669K0984J0531n2887k55888
$$ 495992 322039 260952 52543 -237779 -164517 64152 85136 95667 42780 -213108
20192b13108m9753K128j06411j25257j45061K05143L96789K15515Q8103m4285
$$ -213108 -262861 -260733 -367144 -492401 -637462 -432319 -35530 179985 268088 223803
20182B23803m4139m7094j1660o6022K19025K6577R0883p5022j2542K00564j68444
$$ 223803 179664 132570 120910 54888 273913 300490 391373 316351 303809 504373 335929
20171C35929k24580j2167J9535J16146Q890j24411m9008J66155j10195k10270
$$ 335929 111349 99182 118717 234863 243753 119342 70334 236489 126294 -83976
20161h3976J13573Q7478J07463M5434Q1019j55197j71473P9467p0313R8412O6494
$$ -83976 29597 117075 224538 269972 350991 195794 24321 103788 33475 131887 198381
20150A98381j37272J97471n5310k83563O7245K19802K51364J01896j14060j19366
$$ 198381 61109 258580 203270 -80293 -13048 206754 458118 560014 445954 326588
20140C26588j28504M365j50145j82451N8581J89357q1715J77988J90727j0538
$$ 326588 198084 202449 52304 -130147 -71566 117791 36076 214064 404791 394253
20130C94253j85531j11273K67641L3909j04194J3298P5714j01590l6389j33186
$$ 394253 208722 97449 365090 398999 294805 308103 383817 282227 245838 112652
20120A12652R2409o4033j69205K2354K3628J63359J70211p9048j538k18231K436
$$ 112652 205061 141028 -28177 -5823 17805 181164 351375 272327 270789 52558 54994
20109E4994j16930l3164L550m5076j28522J9965J85501J55226j32997K3508J26511
$$ 54994 -61936 -95100 -91550 -136626 -265148 -245183 -59682 95544 -37453 -13945 112566
20098A12566j32987L126O076N4734Q8524J59680N3431k78426o6676M9720k9791
$$ 112566 -20421 -17295 -11219 43515 132039 291719 345150 66724 48 49768 19977
20087A9977n0118j55676j17675L52L9920j42990r1787N8733K75150K24394K5023
$$ 19977 -30141 -185817 -303492 -303140 -263220 -406210 -497997 -439264 -164114 60280 85303
20076H5303q4699J31665l856O0610K33483k01905j74936j0781m5835p5973m6282
$$ 85303 604 132269 128413 189023 422506 220601 45665 34884 -10951 -86924 -133206
20065a33206j29350Q8854q645j69414j3626O7778J74150K25496j47955P0846k6734
$$ -133206 -262556 -173702 -182347 -351761 -365387 -297609 -123459 102037 -45918 24928 -1806
20054a806M4616k5690p011k7023J02223K5348k71205j65903K67344K03750l2794
$$ -1806 42810 17120 10109 -16914 85309 110657 -160548 -326451 -59107 144643 111849
20043A11849q6153j02935Q450K1634j50631K36926K53216j60976k11235l4707
$$ 111849 25696 -77239 -68789 -47155 -197786 39140 292356 131380 -79855 -114562
20033a14562J95310J34668J61392j06054j31629k912N7499j7204J12622r998j10273
$$ -114562 80748 215416 376808 270754 139125 136213 193712 176508 289130 279132 168859
20022A68859l04547j27979M6877K32902j54151N8054J17230j79576J65693J72254
$$ 168859 -135688 -263667 -216790 16112 -138039 -79985 37245 -142331 23362 195616
20012A95616k6845j86945n6745R3927J20877K89153J90329j80335k30036j0012
$$ 195616 168771 -18174 -74919 19008 139885 429038 619367 439032 208996 198984
20002A98984j40040K21752p3664j66797L0218k24128k02855J42152J42548O7890
$$ 198984 58944 280696 207032 40235 70453 -153675 -356530 -214378 -71830 -3940
19992c940J26546j26908q5386k2862N8216K2891N2492L6351J9475r6429O0862
$$ -3940 122606 -4302 -89688 -112550 -54334 -31443 21049 57400 76875 -19554 41308
19981D1308K54948O5333r5209j32555J6862k18489p2277O8980r9010J12388Q9826
$$ 41308 296256 361589 266380 133825 150687 -67802 -140079 -71099 -170109 -57721 32105
19970C2105J59885J58730k69519k91962o1898M8886K35273o2063k10031j61392
$$ 32105 191990 350720 81201 -210761 -272659 -223773 11500 -50563 -260594 -421986
19960d21986K45767N11131r7474j57413K23396K05741j43381j9459j51738k53084
$$ -421986 -176219 334912 237438 80025 303421 509162 365781 346322 194584 -58500
19950e8500N6797K06368J65122O001N1474j88607k22050J16027O6593j97071L3788
$$ -58500 -1703 204665 369787 375788 427262 238655 16605 132632 199225 2154 35942
19939C5942J01971J8530j82977k30696K6934J337p2711J59849J58402r2127K66842
$$ 35942 137913 156443 -26534 -257230 -230296 -228959 -301670 -141821 16581 -75546 191296
19928A91296O7834m0512L24516J8269o3680r6260j43121p1040K86493K3609Q1444
$$ 191296 259130 218618 543134 561403 497723 401463 258342 187302 473795 497404 578848
19917E78848R0945P3967k07676k05341j98933j92641k9911K11757J83849Q5224
$$ 578848 669793 743760 536084 330743 131810 -60831 -90742 121015 304864 390088
19907C90088P3562j0888J03656k48088j70087n5033k39500n913J70176j79K109
$$ 390088 463650 452762 556418 308330 138243 83210 -156290 -162203 7973 7794 9903
19896I903J75957K34738J65075J01524l30901k66608p4500K08566Q5476k07762
$$ 9903 185860 420598 585673 687197 356296 89688 15188 223754 309230 101468
19886A01468j8635J18355j82485J11598L39735J72455k36455k02311M9190J00569
$$ 101468 82833 201188 18703 130301 470036 642491 406036 203725 252915 353484
19876C53484L505j40188K8041J48504J01600J52475J32833l64655j27881q1887
$$ 353484 356989 216801 244842 393346 494946 647421 780254 415599 287718 205831
19866B05831j47343n1989J6824K7343K08170J72834M3983j89030m1914J48307
$$ 205831 58488 6499 23323 50666 258836 431670 475653 286623 244709 393016
19856C93016k8035J35589K49985o9789k6719l09549J9512o6358J52559J7420p5088
$$ 393016 364981 500570 750555 680766 654047 344498 364010 297652 450211 467631 392543
19845C92543J83027k05150k73064L49283J36337J99060Q8963o3898J00339k07677
$$ 392543 575570 370420 97356 446639 582976 782036 870999 807101 907440 699763
19835F99763k41037k6144l7513r2485k56621j56879r5409L1230R1572j3950J96325
$$ 699763 458726 432582 395069 302584 45963 -110916 -206325 -175095 -83523 -97473 98852
19824I8852Q5010l8583q3881R537M1135K98283K36600j6793j06355j61693K5837
$$ 98852 183862 145279 61398 70935 112070 410353 646953 630160 523805 362112 387949
19813C87949J92485J08340m7840l70465n4534p4308K67275K52977m9681k6883
$$ 387949 580434 688774 640934 270469 215935 141627 408902 661879 612198 585315
19803E85315j64172m9848L1994Q9560k25584P8862O1625J53343L6260j80096Q0119
$$ 585315 421143 371295 403289 492849 267265 346127 407752 561095 597355 417259 497378
19792D97378m0809n0566L5835j37264j17670J34312J76198n0700j34077p2310
$$ 497378 456569 406003 441838 304574 186904 321216 497414 446714 312637 240327
19782B40327j27738J48963J27891q2578o1083K42129J31506k94455l225J99670
$$ 240327 112589 261552 389443 306865 245782 487911 619417 324962 321737 521407
19772E21407m3383j08716m2935J55969K00743k50446j67219J44322Q9779J7207
$$ 521407 478024 369308 326373 482342 683085 432639 265420 409742 499521 516728
19762E16728N7891n8923P3766m9609k71354N3319J22140q8533j64772m8767l7286
$$ 516728 574619 515696 589462 539853 268499 321818 443958 355425 190653 141886 104600
19751A04600J9798Q0374j1300J30051L11248J13360q7961j15928k53912k10259
$$ 104600 124398 204772 193472 323523 634771 748131 660170 544242 290330 80071
19741H0071j85759Q8381k9332n5809J52337J99338J08668O4403N053k8116l0142
$$ 80071 -105688 -17307 -46639 -102448 49889 249227 357895 422298 427351 399235 369093
19730C69093K83146q4002j37814r4023L31946J44288M3767K13747M19289K17157
$$ 369093 652239 568237 430423 336400 668346 812634 856401 1070148 1489437 1706594
19720A706594L0624K6691j69584o4931k52713j56795p8900j04824m30543L5220
$$ 1706594 1737218 1763909 1594325 1529394 1276681 1119886 1040986 936162 505619 540839
19710E40839L28069J45421P743J66300K87557L81679K8164J65878N9092j66582
$$ 540839 868908 1014329 1022072 1188372 1475929 1857608 1885772 2051650 2110742 1944160
19700A944160j71308j35172j79046j57119l30690j23690j14854J1813J36269k83223
$$ 1944160 1772852 1637680 1458634 1301515 970825 847135 732281 744094 880363 597140
19690E97140j11912J20574l4489k00010J8175J79618O3845k94854k16643J43736
$$ 597140 485228 605802 571313 371303 389478 569096 632941 338087 121444 265180
19680B65180K11765J21267N0262j03624k7584j44450K2845l4529j68545j25784
$$ 265180 476945 598212 648474 544850 517266 372816 395661 361132 192587 66803
19670F6803N7505N4638J78531N7705K5710r4511J88629p7227k09521j27370p2721
$$ 66803 124308 178946 357477 415182 440892 346381 535010 457783 248262 120892 48171
19659D8171K59153P7656J49369J16388J3696J03119l4654j27585j85424N1272
$$ 48171 307324 384980 534349 650737 664433 767552 732898 605313 419889 471161
19649D71161L7886M6616r0751J91490K01657p6689k63913j31050J4267r1697J3481
$$ 471161 509047 555663 464912 656402 858059 781370 517457 386407 400674 308977 322458
19638C22458k02075p7941n01o7577R2236K69291L6319o8426J72530N3989m4766
$$ 322458 120383 42442 41941 -25636 66600 335891 372210 303784 476314 530303 485537
19627D85537J98542R3838j32354j60922j7918j87236j68957r8290k7492r6918
$$ 485537 684079 777917 645563 484641 466723 279487 110530 12240 -15252 -112170
19617a12170Q3487J15951j1459P264R6629K8974P41j11698Q3744L03906J59285
$$ -112170 -28683 87268 75809 83073 179702 208676 209417 97719 181463 485369 644654
19606F44654m1438K56760R4198j41153k67045k12725J25684q5888k41719J26861
$$ 644654 603216 859976 954174 813021 545976 333251 458935 373047 131328 258189
19596B58189J05738j32297j43936J09888J68733J27714j09191n5904O717k58744
$$ 258189 363927 231630 87694 197582 366315 494029 384838 328934 335651 76907
19586G6907J0975j9963M4566L01239K42225j21508j85418O9100j1675m7112n9482
$$ 76907 87882 67919 112485 413724 655949 534441 349023 418123 406448 359336 299854
19575B99854J49768J26388N4163J10336j26333J812k4949l3049j39292Q737J4669
$$ 299854 449622 576010 630173 740509 614176 615988 591039 557990 418698 427435 442104
19564D42104r0090O7049j2413J28629q3447r9827k3650K75648K41927J31371J2816
$$ 442104 352014 419063 406650 535279 451832 352005 328355 604003 845930 977301 990117
19553I90117k52156L5642j80964j60154J89434N5321o5467k06267k02719p6123
$$ 990117 737961 773603 592639 432485 621919 677240 611773 405506 202787 126664
19543A26664M8586J03326n6497j67842m4005J94174L53746j37023k21279J50523
$$ 126664 175250 278576 222079 54237 10232 204406 558152 421129 199850 350373
19533C50373J62124J55043N3403P6397J29079j62288j64648k5406j84669k01211
$$ 350373 512497 667540 720943 797340 926419 764131 599483 574077 389408 188197
19523A88197j341J09605j61379N1924J00593O8423Q5074k87989O4144R2630p3211
$$ 188197 186856 296461 135082 187006 287599 356022 441096 153107 217251 309881 236670
19512B36670K0086K37306R2934k0419j38940j79111J37626k69060R3822M52881
$$ 236670 256756 494062 586996 566577 427637 248526 386152 117092 210914 663795
19502F63795K17504j39784r7275j19160j19887j5191K9947l1985j62086J17818
$$ 663795 881299 741515 644240 525080 405193 390002 419949 387964 225878 343696
19492C43696N200k422J36972P5095j20503J67841J51663o4906r7289k34965j477
$$ 343696 348896 346474 483446 558541 438038 605879 757542 692636 595347 360382 358905
19481C58905q6759J29516L41820J51483r2497r3400k27105J9715L91078K08703
$$ 358905 272146 401662 743482 894965 802468 709068 481963 501678 892756 1101459
19471A101459j3453K24108Q9888L4577R2010M4078l2332J77653k28681k20671
$$ 1101459 1088006 1312114 1402002 1436579 1528589 1572667 1540335 1717988 1489307 1268636
19461A268636n672J59385Q813L23369L22848M0226M466M9112l95012l24150K09010
$$ 1268636 1262964 1422349 1431162 1754531 2077379 2117605 2122071 2171183 1776171 1452021 1661031
19450A661031M4322p3028P550J40859J43431k2562n5901q8750R0090J99732l8470
$$ 1661031 1705353 1632325 1639875 1780734 1924165 1901603 1845702 1756952 1847042 2046774 2008304
19439B008304J20422K65111J68496j50782k2046r0163o4742j40635O7873K41166
$$ 2008304 2128726 2393837 2562333 2411551 2389505 2299342 2234600 2093965 2161838 2403004
19429B403004J61917N9065L3896K78858n7962p7258j36410k88061M6373l7358
$$ 2403004 2564921 2623986 2657882 2936740 2878778 2801520 2665110 2377049 2423422 2386064
19419B386064j6731j01288k46340j00810J70760O14840K71554L5712L01598K67424
$$ 2386064 2369333 2268045 2021705 1920895 2091655 2706495 2978049 3013761 3315359 3582783
19409C582783n2781j02322J98588K57518K98717O94147L85663K16093K89898M61910
$$ 3582783 3530002 3427680 3626268 3883786 4182503 4876650 5262313 5478406 5768304 6230214
19399F230214K60741l96692p40749n84242o15940n42583m11561j24756p2520j36386
$$ 6230214 6490955 6094263 5353514 4769272 4153332 3610749 3199188 3074432 3001912 2865526
19389B865526J08209K86369l1577q7757k57843l09940K10816j17447k90442k95130
$$ 2865526 2973735 3260104 3228527 3140770 2882927 2572987 2783803 2666356 2375914 2080784
19379B080784j96907m5993r9186Q437K17550K01877J44814M706j42992k7762j22111
$$ 2080784 1883877 1837884 1738698 1747135 1964685 2166562 2311376 2316082 2173090 2145328 2023217
19368B023217N3066L8514o4797N4314J62148M4176J63058J971J31329L49931K41581
$$ 2023217 2076283 2114797 2050000 2104314 2266462 2310638 2473696 2475667 2606996 2956927 3198508
19357C198508O7440o5129M1716N4876k05514R2571O3383M25947O28455R62927
$$ 3198508 3265948 3200819 3242535 3297411 3091897 3184468 3247851 3673798 4302253 5265180
19347E265180J387067J121834J025101J118959O68864M18685k72154o20422r11530
$$ 5265180 6652247 7774081 8799182 9918141 10587005 11005690 10733536 10113114 9201584
19338I201584j063926j038401j102580p81420m36830l21650j66630r1605j3011
$$ 9201584 8137658 7099257 5996677 5215257 4778427 4456777 4290147 4198542 4185531
19329D185531K23531L84865O33282P10720L71642j64792l76303l28956m92054
$$ 4185531 4409062 4793927 5427209 6137929 6509571 6344779 5968476 5639520 5147466
19320E147466l32948k69851m58780m03858j42598l16763m25431M1664j19208l833
$$ 5147466 4814518 4544667 4085887 3682029 3539431 3222668 2797237 2838901 2719693 2715860
19310B715860K00357k56842l83613j0472Q8889N4876J88257J76741O8158R9457
$$ 2715860 2916217 2659375 2275762 2265290 2354179 2409055 2597312 2774053 2842211 2941668
19300B941668K07416J4944J21460J43883L32127m5624j37349k50742m6052n9898
$$ 2941668 3149084 3164028 3285488 3429371 3761498 3715874 3578525 3327783 3281731 3221833
19290C221833l03456k53643J64947R7231J84620M95786J54834q2203j49763j97185
$$ 3221833 2918377 2664734 2829681 2926912 3111532 3607318 3762152 3679949 3530186 3333001
19280C333001k5119j20989k35217k32260P7254J4348n2931j09892j97260J65473
$$ 3333001 3307882 3186893 2951676 2719416 2796670 2811018 2758087 2648195 2450935 2616408
19270B616408J62667j32321j43093j09095L5049N070k22019k70421j9049K12115
$$ 2616408 2779075 2646754 2503661 2394566 2429615 2434685 2212666 1942245 1923196 2135311
19260B135311K38633O5059J62248K69051J88514j21238n27426k33192k10627P95
$$ 2135311 2373944 2439003 2601251 2870302 3058816 2937578 2410152 2176960 1966333 1967128
19250A967128J39545J29292n4940j52087J04892J12323J41746k3565m5806j45901
$$ 1967128 2106673 2235965 2181025 2028938 2133830 2246153 2387899 2364334 2318528 2172627
19240B172627Q3166M3833k55525J57213J61556k31768l16310L9842J27267P8844
$$ 2172627 2255793 2299626 2044101 2201314 2362870 2131102 1814792 1854634 1981901 2060745
19230B060745j04778q8647K98946K80082M6136j81189K4367q3755m7196n4165
$$ 2060745 1955967 1867320 2166266 2446348 2492484 2311295 2335662 2251907 2204711 2150546
19220B150546K66459J38649j2804j46736k56622k5633J84196k5841j26424L12079
$$ 2150546 2417005 2555654 2542850 2396114 2139492 2113859 2298055 2272214 2145790 2457869
19210B457869K89789n6753J29661K03055r1668m3924m54141j70333K68517K49162
$$ 2457869 2747658 2690905 2820566 3023621 2931953 2888029 2433888 2263555 2532072 2781234
19200B781234K93434K44746k1508m0344J63871M47650N2560l537j06817n9730
$$ 2781234 3074668 3319414 3297906 3257562 3421433 3869083 3921643 3918106 3811289 3751559
19190C751559J0905J85783o723j01201k7798j47464j89426J94291L22513R4269
$$ 3751559 3762464 3948247 3941524 3840323 3812525 3665061 3475635 3669926 3992439 4086708
19180D086708J40406O3861j30483N6965L1933Q8786K05746j87131j11645Q0301
$$ 4086708 4227114 4290975 4160492 4217457 4249390 4338176 4543922 4356791 4245146 4325447
19170D325447O6469J68579K89936L3251J05494K03477L73968K27252J57045M54987
$$ 4325447 4391916 4560495 4850431 4883682 4989176 5192653 5566621 5793873 5950918 6405905
19160F405905P50858N41967L65643N45535M46733L97556K27364M27309M57945
$$ 6405905 7156763 7698730 8064373 8609908 9056641 9454197 9681561 10108870 10566815
19151A0566815K73349M06467N54704N12685Q81299J158326J642283J960139K298195
$$ 10566815 10840164 11246631 11801335 12314020 13195319 14353645 15995928 17956067 20254262
19142B0254262K759880L358440M080384N352250P558859J0847165J6307676K5901091
$$ 20254262 23014142 26372582 30452966 35805216 43364075 54211240 70518916 96420007
19134I6420007L4182743L5809719L5051558L8480764L5087504J6095388j0180725
$$ 96420007 130602750 166412469 201464027 239944791 275032295 291127683 280946958
19127B80946958j8527416j7602621k4587268l7817343l6181120k0170228n705917
$$ 280946958 262419542 244816921 220229653 182412310 146231190 126060962 120355045
19120A20355045N920228J7983114K8600225L1227125L0489646L4476976L1196055
$$ 120355045 126275273 144258387 172858612 204085737 234575383 269052359 300248414
19113C00248414J1964664j5325361k3859918k2626782l0006456m4147672m3045558
$$ 300248414 312213078 296887717 273027799 250401017 220394561 176246889 133201331
19106A33201331k8412948j7278171j0818479p758632o059882m858056m018218
$$ 133201331 104788383 87510212 76691733 68933101 62873219 58015163 53996945
19099E3996945l517230l178056k965559k671978k072112j776989j349732r43028
$$ 53996945 50479715 47301659 44336100 41664122 39592010 37815021 36465289 35522261
19091C5522261p75923m52172n04566n04709q02167j035479j131087j322695j333516
$$ 35522261 34746338 34294166 33789600 33284891 32482724 31447245 30316158 28993463 27659947
19082B7659947r70655j262469j187593p62823o77332o13851n69053j045732q51076
$$ 27659947 26689292 25426823 24239230 23476407 22799075 22185224 21616171 20570439 19719363
19073A9719363l53686n30683m74651o4868J06316K54077J03107R4094l45160o81463
$$ 19719363 19365677 18834994 18360343 18295475 18401791 18655868 18758975 18853069 18507909 17826446
19063A7826446q27642r54193q54771o68029o31354o26072l35806o32422m50896
$$ 17826446 16998804 16044611 15189840 14521811 13890457 13264385 12928579 12296157 11845261
19054A1845261m51152m53107l63590k19944j97974O9856j63624l82294l47962
$$ 11845261 11394109 10941002 10577412 10357468 10159494 10229350 10065726 9683432 9335470
19045I335470j96097k15566j406k62267N4279j18313n09345q4918l2435k15122
$$ 9335470 9139373 8923807 8922401 8660134 8714413 8596100 8086755 8001837 7969402 7754280
19035G754280l05764j50158K11635J30492r6048k16482j07549K89174p0454k19842
$$ 7754280 7448516 7298358 7509993 7640485 7544437 7327955 7220406 7509580 7439126 7219284
19025G219284k37754l47887j84690j68721j46292P2748q4055j57680n4723j95097
$$ 7219284 6981530 6633643 6448953 6280232 6133940 6206688 6122633 5964953 5910230 5715133
19015E715133m00822L5555N946l7355K9877R0073J63003J69823N8239m0275r4351
$$ 5715133 5314311 5349866 5355812 5318457 5348334 5438407 5601410 5771233 5829472 5789197 5694846
19004E694846j83876r2836J88937J13779J3820L09838J09089j54982m3784J8480
$$ 5694846 5510970 5418134 5607071 5720850 5734670 6044508 6153597 5998615 5954831 5973311
18994E973311j42987k57658J92843N14645l5063Q9801K16236K759j24960P8428
$$ 5973311 5830324 5572666 5765509 6280154 6245091 6334892 6551128 6553887 6428927 6507355
18984F507355R2718K53598L23287K62196o2702M29086L63818k0689k04199p008
$$ 6507355 6600073 6853671 7176958 7439154 7376452 7805538 8169356 8148667 7944468 7937460
18974G937460K28230p4813J26177M38215M48212O19537O14843P03345Q22611N10845
$$ 7937460 8165690 8090877 8217054 8655269 9103481 9723018 10337861 11041206 11863817 12374662
18964A2374662P29936Q62763Q79312M17225P04697J625391K354451L849451N861849
$$ 12374662 13104598 13967361 14846673 15263898 15968595 17593986 19948437 23797888 29659737
18955B9659737O981367O180671N099845M210126J538987k073909n163646l075436
$$ 29659737 36641104 42821775 47921620 52131746 53670733 51596824 46433178 43357742
18947D3357742M52978K393006M050516N927797Q666478J2993687K1239978L6481112
$$ 43357742 43810720 46203726 50254242 56182039 64848517 77842204 99082182 135563294
18939A35563294N8774234P1907415N8998162M7362193M2158939J5793128k9758900
$$ 135563294 194337528 266244943 325243105 372605298 414764237 430557365 400798465
18932D00798465p9124455o3897184l5498095k4683857k4975103k0728639n760561
$$ 400798465 321674010 257776826 222278731 197594874 172619771 151891132 146130571
18925A46130571N710766Q223622N658747L643132k304171j2633729k4916626k6081192
$$ 146130571 151841337 160064959 165723706 169366838 167062667 154428938 129512312 103431120
18917A03431120j7160212j0185422o351877l617314k327077k457227j922462j203571
$$ 103431120 86270908 76085486 69733609 66116295 63789218 61331991 59409529 58205958
18909E8205958r97005j045681o45975m87116l87311q79546k77894O30148J732023
$$ 58205958 57208953 56163272 55517297 55030181 54642870 53763324 53485430 54115578 55847601
18900E5847601L481370N682217Q805767J4141062K0570094K3363266J9920401
$$ 55847601 59328971 65011188 73816955 87958017 108528111 131891377 151811778
18893A51811778J6100834J2717487L888942q694616j7722543q932394P941512
$$ 151811778 167912612 180630099 184519041 175824425 158101882 149169488 157111000
18886A57111000K2889970L1589228M1260846O2075798Q1792543P3369439L4642034
$$ 157111000 180000970 211590198 252851044 314926842 396719385 470088824 504730858
18879E04730858K0854273Q829287l0812570r0687216j20223943p9120204m2901544
$$ 504730858 525585131 534414418 503601848 412914632 292690689 213570485 170668941
18872A70668941k4829132j5087494r498818n938668l237718k98732L352232O555847
$$ 170668941 145839809 130752315 121253497 115314829 112077111 111778379 115130611 121686458
18864A21686458P036539O095882O562158N163540K185269n92127K736766J1656593
$$ 121686458 128722997 134818879 141381037 146544577 148729846 148137719 150874485 162531078
18856A62531078J8887132K3327962K5224359K4844149K1169018J3377757L831289
$$ 162531078 181418210 204746172 229970531 254814680 275983698 289361455 293192744
18849B93192744m068391q049317r299692q753460m891782J272177O788280J0310416
$$ 293192744 289124353 281075036 271775344 263021884 258130102 259402279 266190559 276500975
18841B76500975J0418565N499560l307901j2486717j8636694k3028697k6868626
$$ 276500975 286919540 292419100 289111199 276624482 257987788 234959091 208090465
18834B08090465k8579784k6390907k1431283j6369257j2250383r285148p371404
$$ 208090465 179510681 153119774 131688491 115319234 103068851 93783703 86412299
18827H6412299o074754m927064m159147l706345l306473k962553k458073k173912
$$ 86412299 80337545 75410481 71251334 67544989 64238516 61275963 58817890 56643978
18819E6643978k225616j978851j646752j753534j750535j671080j262966j383791
$$ 56643978 54418362 52439511 50792759 49039225 47288690 45617610 44354644 42970853
18811D2970853j196317j355433j480291j211019j589000j586495j298301q79058
$$ 42970853 41774536 40419103 38938812 37727793 36138793 34552298 33253997 32374939
18803C2374939p66067q94389j024769j244503r58149r88501p91621q85689r72922
$$ 32374939 31608872 30714483 29689714 28445211 27487062 26498561 25706940 24821251 23848329
18794B3848329r09818r37206p45531n04937p38924p93292p22896n82398j69056
$$ 23848329 22938511 22001305 21255774 20750837 20011913 19218621 18495725 17913327 17744271
18785A7744271l83485k89332k78210n64710n28945l54869k87808m63224m74850
$$ 17744271 17360786 17071454 16793244 16228534 15699589 15344720 15056912 14593688 14118838
18776A4118838k92323j61619m2680l09808m98433j51268j94605R2582j45809k14535
$$ 14118838 13826515 13664896 13622216 13312408 12813975 12662707 12468102 12560684 12414875 12200340
18766A2200340j56110m15318m06320o75062m70233l1412k70602l29507R194J11650
$$ 12200340 12044230 11628912 11222592 10547530 10077297 10045885 9775283 9445776 9454970 9566620
18756I566620J72165k30068l05126l48650j76728k48290m46282l32436l56815
$$ 9566620 9738785 9508717 9203591 8854941 8678213 8429923 7983641 7651205 7294390
18747G294390k07906N0478R720k25023m45738l07100k13312l13441k20805J03783
$$ 7294390 7086484 7136962 7146682 6921659 6475921 6168821 5955509 5642068 5421263 5525046
18737E525046j11607L8935j48768l1452J49311J04774k38432r250j58333K06559
$$ 5525046 5413439 5452374 5303606 5272154 5421465 5526239 5287807 5278557 5120224 5326783
18727E326783J30768k14448m22622k77657j69892j37614r5860n8218j34094Q9836
$$ 5326783 5457551 5243103 4820481 4542824 4372932 4235318 4139458 4081240 3947146 4036982
18717D036982P3660k8540Q6666J96823j45116k14939k16489l06346k38502k39694
$$ 4036982 4110642 4082102 4168768 4365591 4220475 4005536 3789047 3482701 3244199 3004505
18707C004505k05006j89932j97784j32508J2621j89479J12863j37911j31399p9717
$$ 3004505 2799499 2609567 2411783 2279275 2291896 2102417 2215280 2077369 1945970 1866253
18697A866253m3884J43744L3728r0071j7713j2105M909J6176j31100J06940n1449
$$ 1866253 1822369 1966113 1999841 1909770 1892057 1879952 1884861 1901037 1769937 1876877 1825428
18686A825428k75287r80P7739J18522K32065J60653k08246j61053J58562J05667
$$ 1825428 1550141 1549161 1626900 1745422 1977487 2138140 1929894 1768841 1927403 2033070
18676B033070n9937k23033L8454O886k29861O8254j48072J4939j2883q1483J08377
$$ 2033070 1973133 1750100 1788554 1795440 1565579 1633833 1485761 1500700 1487817 1406334 1514711
18665A514711n7569N2177J28728J23225k55092k57465j4563q9767M3392O2191
$$ 1514711 1457142 1509319 1638047 1761272 1506180 1248715 1234152 1144385 1187777 1249968
18655A249968P147J33449L8793J95474K04641m7728k73082k21058J85288J67342
$$ 1249968 1257115 1390564 1429357 1624831 1829472 1781744 1508662 1287604 1472892 1640234
18645A640234Q5506J49780J46669j86438j73807j29171k29279l7776L16663K4243
$$ 1640234 1725740 1875520 2022189 1835751 1661944 1532773 1303494 1265718 1582381 1606624
18635A606624k52181o9027R4216j00407n00125J65011J24661p9705J71184R4448
$$ 1606624 1354443 1285416 1379632 1279225 779100 944111 1068772 989067 1160251 1254699
18625A254699j21371l73950j68275J13845J15837K34639j848o7026J37256P4115
$$ 1254699 1133328 759378 591103 704948 820785 1055424 1053576 986550 1123806 1197921
18615A197921N4360Q344J49409K03577k07906k81269j76116J51159P923n4415
$$ 1197921 1252281 1260625 1410034 1613611 1405705 1124436 948320 1099479 1107402 1052987
18605A052987J9230J49251J66094R5599J27890J01893j6957j79080r3344m361
$$ 1052987 1072217 1221468 1387562 1483161 1611051 1712944 1695987 1516907 1423563 1419202
18595A419202j20322O4377l8790k67775j1101K70057K57682j31160k6261q3700
$$ 1419202 1298880 1363257 1324467 1056692 1045591 1315648 1573330 1442170 1415909 1332209
18585A332209o5934N63197J95268j81301m13853j31090J37326r360o1764R7031
$$ 1332209 1266275 1829472 2024740 1843439 1429586 1298496 1435822 1426462 1364698 1461729
18575A461729k1084J03200O6623K08909p941L9505l5255j96040L3794M0934j70954
$$ 1461729 1440645 1543845 1610468 1819377 1811436 1850941 1815686 1619646 1653440 1694374 1523420
18564A523420J97698J82972J64847k86274k68552q2478M885K36380L33323L16986
$$ 1523420 1721118 1904090 2068937 1782663 1514111 1431633 1436518 1672898 2006221 2323207
18554B323207k36909j93611m7816J12492J05646k25093Q1257Q6819J30425m3257
$$ 2323207 2086298 1892687 1844871 1957363 2063009 1837916 1919173 2005992 2136417 2093160
18544B093160p6314J76770J42847M5967R0982P5766K95637J27675k06445q335
$$ 2093160 2016846 2193616 2336463 2382430 2473412 2549178 2844815 2972490 2766045 2757710
18534B757710K34399L01264K82546R5137K35674p8089n10181k56394O4019o4528
$$ 2757710 2992109 3293373 3575919 3671056 3906730 3828641 3318460 3062066 3126085 3061557
18524C061557O3839K11107L71648J29798Q0068O6336K14640K69468J83644r0128
$$ 3061557 3125396 3336503 3708151 3837949 3918017 3984353 4198993 4468461 4652105 4561977
18514D561977J55087M5133j136j18086k34163j28492k99227j15011N66521M54666
$$ 4561977 4717064 4762197 4761061 4642975 4408812 4280320 3981093 3866082 4432603 4887269
18504D887269K57440K66505O47753M90681M84477O80209Q91700R03606O89638
$$ 4887269 5144709 5411214 6058967 6549648 7034125 7714334 8606034 9509640 10199278
18495A0199278N63905O56723L77792J37125O91839Q45956J223174J733101J672460
$$ 10199278 10763183 11419906 11797698 11934823 12626662 13472618 14695792 16428893 18101353
18486A8101353K363134L689568N771981Q058847Q980033P692288O477846M526635
$$ 18101353 20464487 24154055 29926036 37984883 46964916 54657204 61135050 65661685
18478F5661685P24132m157204p073301m557057k50691L419101O200513R382529
$$ 65661685 66385817 62228613 55155312 50598255 50347564 53766665 59967178 69349707
18470F9349707J4269440K2026028L6014178N7739279P9266161Q0780080O5377433
$$ 69349707 83619147 105645175 141659353 199398632 278664793 359444873 424822306
18463D24822306N5579680L8017005n028131o4281181r1875178o8480422m3023232
$$ 424822306 480401986 518418991 513390860 449109679 357234501 288754079 245730847
18456B45730847l3984884k9456278j7488727k855315O167733P802074N546635
$$ 245730847 211745963 182289685 164800958 161945643 168113376 175915450 181462085
18449A81462085K579676m192772j5460988k6251278k7224503j9422469j1755965
$$ 181462085 184041761 179848989 164388001 138136723 110912220 91489751 79733786
18442G9733786p180543m968386l705672k591064k175282k047313j685676j511301
$$ 79733786 72553243 67584857 63879185 61288121 59112839 57065526 55379850 53868549
18434E3868549j038754l43613j52242J58177N72027J364514J856732K711132M390294
$$ 53868549 52829795 52486182 52333940 52492117 53064144 54428658 56285390 58996522 63386816
18425F3386816P732470J2053370J6962850J8764209J6233192J3558510J0075874
$$ 63386816 71119286 83172656 100135506 118899715 135132907 148691417 158767291
18418A58767291K864291o707854j1267035l779839R044121J8281210K5347586
$$ 158767291 161631582 154923728 143656693 139876854 148920975 167202185 192549771
18411A92549771L6973850N1975721N6599504L9870499K0969606J3564295n306348
$$ 192549771 229523621 281499342 338098846 377969345 398938951 412503246 407196898
18404D07196898m2085152q0471766q0837476n2021486k9188902j7375780j1399638
$$ 407196898 365111746 284639980 203802504 151781018 122592116 105216336 93816698
18397I3816698q079773n922523m317870k367410j89997J491944J706937J058559
$$ 93816698 85736925 79814402 75496532 73129122 72939125 74431069 76138006 77196565
18389G7196565Q41804r94208m162034p226894p466354n697427l860259l224543
$$ 77196565 78038369 77044161 72882127 65655233 58188879 52491452 48631193 45406650
18381D5406650k660590j906157k201001k000610j453843j252480j307483j551933
$$ 45406650 42746060 40839903 38638902 36638292 35184449 33931969 32624486 31072553
18373C1072553j303696j120140j220458j164876j083757j102337p96455n89800
$$ 31072553 29768857 28648717 27428259 26263383 25179626 24077289 23280834 22691034
18365B2691034q89604j002139p46933q04152p33298n09673n94618n90096n42832
$$ 22691034 21801430 20799291 20052358 19248206 18514908 18005235 17410617 16820521 16277689
18356A6277689k13488k18920o00586o03221l72893o09594n18317n79653l28408
$$ 16277689 16064201 15845281 15244695 14641474 14268581 13658987 13140670 12561017 12232609
18347A2232609j71826p8070l22955l49388j93477n48212k75473j27567m1076p6357
$$ 12232609 12060783 11982713 11659758 11310370 11116893 10568681 10293208 10165641 10124565 10048208
18337A0048208j73904k69214j24131J36161m65405p79621p9935k7731k70638o3403
$$ 10048208 9874304 9605090 9480959 9617120 9151715 8372094 8292159 8264428 7993790 7930387
18327G930387l50441j71627j12284m28305m57536j29960j65096l22572k01505
$$ 7930387 7579946 7408319 7296035 6867730 6410194 6280234 6115138 5792566 5591061
18318E591061k24610k82910j63651R2194q9894j19682n9133k89535k62313L6464
$$ 5591061 5366451 5083541 4919890 5012084 4922190 4802508 4743375 4453840 4191527 4227991
18308D227991J75146l10125o7999n9458n1988P1447n4020j78197j83688P817r0843
$$ 4227991 4403137 4093012 4025013 3965555 3913567 3985014 3930994 3752797 3569109 3576926 3486083
18297C486083l6031q8124k65566j22160k68853k08455j00150j90107L04292K92073
$$ 3486083 3450052 3361928 3096362 2974202 2705349 2496894 2396744 2206637 2510929 2803002
18287B803002o0498k42967k39342o4678O3254N0300j80216J34509P8787k66675
$$ 2803002 2742504 2499537 2260195 2195517 2258771 2309071 2128855 2263364 2342151 2075476
18277B075476j92190j80200j80387P9851Q3272k751l2736o1447O4420Q5045p3041
$$ 2075476 1883286 1703086 1522699 1602550 1685822 1683071 1650335 1588888 1653308 1738353 1665312
18266A665312O4797P1891Q3451R2904P10P6728j03029L3889K32867L09420l8877
$$ 1665312 1730109 1802000 1885451 1978355 1979065 2055793 1952764 1986653 2219520 2528940 2490063
18255B490063j36137l7578j62848j98983N0272j21896P3378K68677j9276j55312
$$ 2490063 2353926 2316348 2153500 1954517 2004789 1882893 1956271 2224948 2205672 2050360
18245B050360P235j48198m3303m9074L7887j13576n6469j79232j35198k619m4203
$$ 2050360 2057595 1909397 1866094 1817020 1854907 1741331 1684862 1505630 1370432 1367813 1323610
18234A323610r8715o2742j05450j0628O6654Q5328Q4128k60731p3529P2623L63396
$$ 1323610 1224895 1162153 1056703 1046075 1112729 1198057 1282185 1021454 947925 1020548 1383944
18223A383944j52819k15160j63960l24750K21283K35623J95156p6885p6739l7219
$$ 1383944 1231125 1015965 852005 527255 748538 984161 1179317 1102432 1025693 988474
18213I88474j84032J45060O0167P3643K09434K15714j84232j83574M8156j22112
$$ 988474 804442 949502 1009669 1083312 1292746 1508460 1324228 1140654 1188810 1066698
18203A066698o84N769j4993Q2298l7070j31618O9691J22463n1104O5781N7124
$$ 1066698 1066014 1071783 1056790 1139088 1102018 970400 1040091 1162554 1111450 1177231 1234355
18192A234355n1188m1377j4163K4412j9638j02854j18785J15139j9846P0387j30648
$$ 1234355 1183167 1141790 1127627 1152039 1132401 1029547 910762 1025901 1006055 1076442 945794
18181I45794N5373k32700k57988M104N7794M6358k5834l2031J45419J62286j20537
$$ 945794 1001167 768467 510479 514583 572377 618735 592901 560870 706289 868575 748038
18170G48038j56074J27188K32878M09416o9110j20125j8330J2400p8291j9936
$$ 748038 591964 719152 952030 1361446 1292336 1172211 1153881 1166281 1087990 1068054
18160A068054L6114Q7240J12773j45297l0360j43542j62410J60767K86201J45476
$$ 1068054 1104168 1191408 1304181 1158884 1128524 984982 822572 983339 1269540 1415016
18150A415016q3104n6852K7416O7247J75581J90089j16096o5851J16592J15730
$$ 1415016 1331912 1275060 1302476 1369723 1545304 1735393 1619297 1553446 1670038 1785768
18140A785768Q978m2344J37446J63578K00958L31798R7706j04238K0588K65401
$$ 1785768 1794746 1752402 1889848 2053426 2254384 2586182 2683888 2579650 2600238 2865639
18130B865639M17553N65980M15946L53891K32171O35202P63000N81074J042893
$$ 2865639 3283192 3849172 4265118 4619009 4851180 5486382 6249382 6830456 7873349
18121G873349J432417J990095K463292L229232M257017O290413J0520778J7942523
$$ 7873349 9305766 11295861 13759153 16988385 21245402 27535815 38056593 55999116
18113E5999116L0953543M6328553M3970262K8270666K5740930J3347111j3393852
$$ 55999116 86952659 133281212 177251474 205522140 231263070 244610181 231216329
18106B31216329n3544506o5967984l7906846j9640511j1683270p364826m922350
$$ 231216329 177671823 111703839 73796993 54156482 42473212 35108386 30186036
18099C0186036l322225k667101k296794j631533j456792j236998j196669r17918
$$ 30186036 26863811 24196710 21899916 20268383 18811591 17574593 16377924 15460006
18091A5460006r18896p33149l72375o7418j51681l91127n21784l83058l93733
$$ 15460006 14541110 13807961 13435586 13368168 13216487 12825360 12303576 11920518 11526785
18082A1526785l76312o15346o70430o24511l00420o14147k13872j38964k73864
$$ 11526785 11150473 10535127 9864697 9240186 8939766 8325619 8111747 7972783 7698919
18073G698919k04234j53734n31805l57719k4425l35800m38536K65943N8582l61511
$$ 7698919 7494685 7340951 6809146 6451427 6427002 6091202 5652666 5918609 5977191 5615680
18063E615680k64370k12566j60192j56376l8770q9347l18323l88374k17065k47144
$$ 5615680 5351310 5138744 4978552 4822176 4783406 4694059 4375736 3987362 3770297 3523153
18053C523153j37309Q5497J51852j47547j81673N3263J22766k94680O5621j51654
$$ 3523153 3385844 3471341 3623193 3475646 3293973 3347236 3470002 3175322 3240943 3089289
18043C089289j17628o9074k99237p6179j76342k3250O6556o3854M7625j89456
$$ 3089289 2971661 2902587 2603350 2527171 2350829 2327579 2394135 2330281 2377906 2188450
18033B188450P194n8003j14314O7744N5223j66728j32327k14586j14361J55720
$$ 2188450 2195644 2137641 2023327 2091071 2146294 1979566 1847239 1632653 1518292 1674012
18023A674012k964j37566P8266l05150k02045j24883j6355N1999m8126J62874
$$ 1674012 1671048 1533482 1611748 1306598 1104553 979670 963315 1015314 967188 1130062
18013A130062J16376q8248r6502O3182j16600j34950l2546N7256n9794n0174j87769
$$ 1130062 1246438 1158190 1061688 1124870 1008270 873320 840774 898030 838236 788062 600293
18002F00293k80105M256L23022O3674k2582Q0541j2390L1933J56575n5192l4297
$$ 600293 320188 324444 647466 711140 688558 769099 756709 788642 945217 890025 855728
17991H55728O2951J34393l5856j7748k54384P0456J41659M3416J42365J00324
$$ 855728 918679 1053072 1017216 999468 745084 815540 957199 1000615 1142980 1243304
17981A243304m6725r1841j71080j25991k19098P709O582Q6851j12292k07351j90165
$$ 1243304 1196579 1104738 933658 807667 588569 596278 602860 689711 577419 370068 179903
17970A79903r4787p6525m6931J06254K03832J4957J26991K20262j07126k11057
$$ 179903 85116 8591 -38340 67914 271746 286703 413694 633956 526830 315773
17960C15773l12074J78743J85894r252J87409J88363k49598R635K65137J15429
$$ 315773 3699 182442 368336 359084 546493 734856 485258 494893 760030 875459
17950H75459K68123K06491j6830K59141K73400j28642l40140l18299j83424n9464
$$ 875459 1143582 1350073 1333243 1592384 1865784 1737142 1397002 1078703 895279 835815
17940H35815L1204L4322J68357J44664J06639L1116P9142M7669o5297j78525k79933
$$ 835815 867019 901341 1069698 1214362 1321001 1352117 1431259 1478928 1413631 1235106 955173
17929I55173k18267p9518J05252j73101q6719M468j49524J70080L19226j31655
$$ 955173 736906 657388 762640 589539 502820 507288 357764 527844 847070 715415
17919G15415k16077j52171q6205J09379J40915k84197j4972O5690P0035Q5547
$$ 715415 499338 347167 260962 370341 511256 227059 212087 277777 347812 433359
17909D33359k45459j38162j0385Q3781J43450J86014n8122K41191L61367J78429
$$ 433359 187900 49738 39353 123134 266584 452598 394476 635667 997034 1175463
17899A175463N41852K54329j9255J33025Q7077J68821q0805p5164j72407m23979
$$ 1175463 1717315 1971644 1952389 2085414 2172491 2341312 2260507 2185343 2012936 1588957
17889A588957j85533k36801k46461k62994K8652J64995j24910j79503K14086L48830
$$ 1588957 1403424 1166623 920162 657168 685820 850815 725905 546402 760488 1109318
17879A109318K10981Q3111j8748L7605K1009Q5560l28517l88583j88675j10948
$$ 1109318 1320299 1403410 1384662 1422267 1443276 1528836 1200319 811736 623061 512113
17869E12113O6488J80143K13309J00277k78033k98147M2118O5655P4180k0268
$$ 512113 578601 758744 972053 1072330 794297 496150 538268 603923 678103 657835
17859F57835K607j05365n0661k7823k22432r0611R8755j079J71805K05741k807
$$ 657835 660442 555077 504416 476593 254161 163550 262305 261226 433031 638772 635965
17848F35965j40587n7238K41641K20331l5964j23326m2295K07643K38349J79083
$$ 635965 495378 438140 679781 900112 864148 740822 698527 906170 1144519 1323602
17838A323602R5252L7237k1707j68676m17198k79141n6849k2959R115o221M7445
$$ 1323602 1418854 1456091 1434384 1265708 848510 569369 512520 489561 498676 492455 539900
17827E39900n3938l896k02892p1575j38379Q2487j01107K94921K902k34192j67218
$$ 539900 485962 482066 279174 207599 69220 151707 50600 345521 348423 114231 -52987
17816e2987J17801K14755k4959P4872J23389J0387j26137J08846O6907l27447
$$ -52987 64814 279569 254610 329482 452871 463258 337121 445967 512874 185427
17806A85427m25598M0669J86543J62749r4852j15118N9250k08752J62757J29136
$$ 185427 -240171 -199502 -12959 149790 54938 -60180 -930 -209682 -46925 82211
17796H2211q230K2305K31257J69323j92352l94901l841J17479M2461L4714q0939
$$ 82211 73981 96286 327543 496866 304514 -90387 -94228 23251 65712 100426 19487
17785A9487Q4845K9368J00795Q7649R8115L47275p6414j14091r4748k67297j93958
$$ 19487 104332 133700 234495 322144 420259 767534 691120 577029 482281 214984 21026
17774B1026j6555r3688M1941J11230q0234k93883l36634N3584L07802J32473J38868
$$ 21026 4471 -89217 -47276 63954 -16280 -310163 -646797 -593213 -285411 -152938 -14070
17763a4070K49804M7641J9773l84333l31479K80479Q5597j76154J11703Q1153
$$ -14070 235734 283375 303148 -81185 -412664 -132185 -46588 -222742 -111039 -29886
17753b9886K48315j5085k69854J16993L1645k08319j54800r5346J37594J20049
$$ -29886 218429 203344 -66510 50483 82128 -126191 -280991 -376337 -238743 -118694
17743a18694K57307J57903q9025k16214r8762j59807l3736r7287K92669K30085
$$ -118694 138613 296516 207491 -8723 -107485 -267292 -301028 -398315 -105646 124439
17733A24439J51475L3958k25014l8862j20057j02385l2836J55253J38930O6258
$$ 124439 275914 309872 84858 45996 -74061 -176446 -209282 -54029 84901 151159
17723A51159j54796j25791j19172J48012O4986N5774j71569n6104K22921J48686
$$ 151159 -3637 -129428 -248600 -100588 -35602 20172 -151397 -207501 15420 164106
17713A64106Q1990J907j51612Q9677R9964j25812j70342j13691R6564J32677q071
$$ 164106 246096 248003 96391 186068 286032 160220 -10122 -123813 -27249 105428 97357
17702I7357K5323J73391j40426k09313P0611r7257j76661q4123K36167J74784
$$ 97357 122680 296071 155645 -53668 16943 -80314 -256975 -341098 -104931 69853
17692F9853L93178O455j29433j82417R6844J36631k88622l55095J85160O2432
$$ 69853 463031 469486 340053 157636 254480 391111 102489 -252606 -67446 -5014
17682e014l7132m0398j19966J12665K72084Q487l56968P6366L43743M8532j5398
$$ -5014 -42146 -82544 -202510 -89845 182239 190726 -166242 -89876 253867 302399 287001
17671B87001n6190r8680Q1277m0542k41937M4442L29095K25848j95004j83255
$$ 287001 230811 132131 213408 172866 -69071 -24629 304466 530314 335310 152055
17661A52055p320k14755l97223j00153M8249K68303K33912M5610J5628l0023j18949
$$ 152055 144735 -70020 -467243 -567396 -519147 -250844 -16932 28678 44306 14283 -104666
17650a04666j96553k03252j19361q206K14909J26453J0512O2902R9241R3371j50470
$$ -104666 -301219 -504471 -623832 -632038 -417129 -290676 -280164 -217262 -118021 -24650 -175120
17639a75120K4163j04835J37502k7686j40564P6559j8910O3266J46410J60269
$$ -175120 -150957 -255792 -118290 -145976 -286540 -209981 -228891 -165625 -19215 141054
17629A41054J56806p387k20924n8850r484Q9053J19378m2249j79656q9331k26591
$$ 141054 297860 290473 69549 10699 1215 90268 209646 167397 -12259 -101590 -328181
17618c28181K83212P3620L10515L3710l02778j23578K6982R6730k24448n8132
$$ -328181 -44969 28651 339166 372876 70098 -53480 -26498 70232 -154216 -212348
17608b12348J24803M4918l7654j00614p3508K01779J00085o3171p4002Q405q0595
$$ -212348 -87545 -42627 -80281 -180895 -254403 -52624 47461 -15710 -89712 -81307 -161902
17597a61902J60874J18697j07354j63968p1235m6323q0819k798O7157j9941J64935
$$ -161902 -1028 117669 10315 -153653 -224888 -271211 -352030 -354828 -287671 -307612 -142677
17586a42677L5262l1860j96297J8475K4436J02139K24371m9304o7024P8076k90553
$$ -142677 -107415 -139275 -335572 -317097 -292661 -190522 33849 -15455 -82479 -4403 -294956
17575b94956O634j39099L19216R5819J38206K33306o9932k38194R6246N9397o3814
$$ -294956 -288322 -427421 -108205 -12386 125820 359126 289194 51000 147246 206643 142829
17564A42829j07207K26894j47285k17917L3151k9863r9853J09230q1116K60399
$$ 142829 35622 262516 115231 -102686 -69535 -99398 -199251 -90021 -171137 89262
17554H9262j51072k96242O7945J45176K53208K921J82293n6755q9619P8755r1545
$$ 89262 -61810 -358052 -290107 -144931 108277 111198 293491 236736 147117 225872 134327
17543A34327r796k6796m8528L6220j32369p7419J1683N8425L8954l35225j16521
$$ 134327 124531 97735 49207 85427 -46942 -124361 -112678 -54253 -15299 -350524 -467045
17532d67045O4765K94422J25564k76463M8420q7993l84611J8515L80374K23692
$$ -467045 -402280 -107858 17706 -258757 -210337 -298330 -682941 -664426 -284052 -60360
17522f0360q0254j78466K21422P6168K26804j37256p4060O7180m0486k08756j59119
$$ -60360 -140614 -319080 -97658 -21490 205314 68058 -6002 61178 20692 -188064 -347183
17511c47183l7932K83035K28417J11186j07214O1971m930k03362J00445N7042
$$ -347183 -385115 -102080 126337 237523 130309 192280 187350 -16012 84433 141475
17501A41475j88913q331J6088l272r0356J29822j38789j35891K5263K0395j7358
$$ 141475 -47438 -55769 -39681 -42953 -133309 -3487 -142276 -278167 -252904 -232509 -249867
17490b49867j18293J30785P9968m324j88447K6418J2121K39146J52321J15618
$$ -249867 -368160 -237375 -157407 -161731 -350178 -323760 -311639 -72493 79828 195446
17480A95446J90088k59353j25301k4352J20298L11782j34958m9270n0661j12068
$$ 195446 385534 126181 880 -23472 96826 408608 273650 224380 173719 61651
17470F1651k11779L0588J28709Q9512L2251j6684j84504l5572P8594q0423Q6961
$$ 61651 -150128 -119540 9169 98681 130932 114248 -70256 -105828 -27234 -107657 -20696
17459b0696J83998M319K12470J96693j63320q1981P2718J12080p5855J58934J22667
$$ -20696 163302 167621 380091 576784 413464 331483 404201 516281 440426 599360 722027
17448G22027J86309K94856L80417K73836K09440J0184j35579j37308j49452j17065
$$ 722027 908336 1203192 1583609 1857445 2066885 2077069 1941490 1804182 1654730 1537665
17438A537665j67199k43604M3132j20100K04409J42687J07802P1982P6743j48012
$$ 1537665 1370466 1126862 1169994 1049894 1254303 1396990 1504792 1576774 1653517 1505505
17428A505505j07957L1817l66784k99225j77116O4433K99267n6191J30129K88481
$$ 1505505 1397548 1429365 1062581 763356 586240 650673 949940 893749 1023878 1312359
17418A312359P6655j37426m91100k34377l2470j72475J5323j9285j0441J29429
$$ 1312359 1389014 1251588 760488 526111 493641 321166 336489 317204 306763 436192
17408D36192j3754j11687K0147P4412j8827M5032o1783j93610n9382j806O2213
$$ 436192 422438 310751 330898 405310 386483 431515 369732 176122 116740 114934 177147
17397A77147N775O3478M0032k1687P094j92801O2862j5775J41247K57779R0035
$$ 177147 182922 246400 286432 264745 271839 79038 141900 126125 267372 525151 615186
17386F15186j22558L623J77233K4987l0680k02684k35130l30302k15261J49106
$$ 615186 492628 496251 673484 698471 667791 465107 229977 -100325 -315586 -166480
17376a66480N9267Q4829j45303O6738J56024O2889P7381q0660m13315o8496q6987
$$ -166480 -107213 -22384 -167687 -100949 55075 117964 195345 114685 -298630 -367126 -454113
17365d54113P8198L11514J15829o5549n3240J09758J83570n2850p893Q8820j8374
$$ -454113 -375915 -64401 51428 -14121 -67361 42397 225967 173117 165224 254044 235670
17354B35670M5578R4606R8134Q24j2678J12786J710k37003k78612m737Q8180K45287
$$ 235670 281248 375854 473988 474812 462134 574920 576630 339627 61015 56278 144458 389745
17342C89745N2548m048r1027N3454R7075J02335J6739l06446k10142P1450K9730
$$ 389745 442293 438245 347218 400672 497747 600082 616821 310375 100233 171683 201413
17331B01413o7040j42963j32487n0811K3863l6986J24503J07251J55345J38447
$$ 201413 134373 -8590 -141077 -191888 -168025 -205011 -80508 26743 182088 320535
17321C20535J34119r1142k45533O9027O8460j3846j18251N4556J0560n1016J50535
$$ 320535 454654 363512 117979 187006 255466 241620 123369 177925 188485 137469 288004
17310B88004k424j61907j90655P7327L34213R7313M8388j21845j25981j763k7589
$$ 288004 285580 123673 -66982 10345 344558 441871 490259 368414 242433 240670 213081
17299B13081j88284p4192j89504p3873J7333J72431o142j18449J3986L62473R3144
$$ 213081 24797 -49395 -238899 -312772 -295439 -123008 -129150 -247599 -233613 128860 222004
17288B22004k82077j93843O6435K6412Q746J8040M7498J68763O1127m6738l7363
$$ 222004 -60073 -253916 -187481 -161069 -152323 -134283 -86785 81978 143105 96367 59004
17277E9004L8731J02044O8015K15281k3117m6233j71622j60343j09715n9137r7191
$$ 59004 97735 199779 267794 483075 459958 413725 242103 81760 -27955 -87092 -184283
17266a84283J13480J05260k35798M0202O1986K08814J26807Q0105M8343K76947
$$ -184283 -70803 34457 -201341 -161139 -99153 109661 236468 316573 364916 641863
17256F41863N439k56489k66061k82971N1902j76863M3795M05312J09261J1830
$$ 641863 647302 390813 124752 -158219 -106317 -283180 -239385 165927 275188 287018
17246B87018l9639l0322j53679R4112N3296M1985j6788j00476N8257j59281j06036
$$ 287018 247379 217057 63378 157490 210786 252771 235983 135507 193764 34483 -71553
17235g1553Q3156L04307M8237o7110k05376P9128K40913o4386j84219Q6928R194
$$ -71553 11603 315910 364147 297037 91661 170789 411702 347316 163097 250025 259219
17224B59219j3157p2959o2630j60280O4578P4483k48399R1294K07825N4486M8244
$$ 259219 246062 173103 110473 -49807 14771 89254 -159145 -67851 139974 194460 242704
17213B42704J12298P4005k09569m24685o9460J17703Q6084k51178J14768J37778
$$ 242704 355002 429007 219438 -205247 -274707 -157004 -70920 -322098 -207330 -69552
17203f9552j40615R823R004q7364L31288J2978k2484P6313o4488o4773q3121r4989
$$ -69552 -210167 -200344 -191340 -278704 52584 65562 43078 119391 54903 -9870 -92991 -187980
17191a87980K09647J10839j86026j40286J88072L6915j61642J81266Q7062O70
$$ -187980 21667 132506 -53520 -193806 -5734 31181 -130461 50805 137867 138537
17181A38537N9281m2528N9685j12442m2519Q9995J31559m6823k02089R6705J02480
$$ 138537 197818 155290 214975 102533 60014 150009 281568 234745 32656 129361 231841
17170B31841j14448J57911J33701o1052j02739j21206J9383k636m4571o4378m4149
$$ 231841 117393 275304 409005 347953 245214 124008 143391 140755 96184 31806 -12343
17159a2343R7339j2821k576K8006R8968j43779r181Q1337J09560J0319j20734
$$ -12343 84996 72175 69599 97605 196573 52794 43613 124950 234510 244829 124095
17148A24095J39101n9546k8996P3844R096n2586j5515R9065p0090r2476J51725
$$ 124095 263196 203650 174654 248498 257594 205008 189493 288558 218468 125992 277717
17137B77717r0560j11768L9506J70964j90409J4638j21384n3206K58327j07146
$$ 277717 187157 75389 114895 285859 95450 110088 -11296 -64502 193825 86679
17127H6679n1063K2703n1361K1038J27601j18156q7486r004L7459J04548r5958
$$ 86679 35616 58319 6958 27996 155597 37441 -50045 -59049 -21590 82958 -13000
17116a3000J14585J06900J9340q171J4757K87525O6694N9451j60900j16255j47639
$$ -13000 101585 208485 227825 219654 234411 521936 588630 648081 487181 370926 223287
17105B23287j5106j7871j92896o7957L2432j13200j03756q7363J94425K23895
$$ 223287 208181 190310 -2586 -70543 -38111 -151311 -255067 -342430 -148005 75890
17095G5890P8007J07437p029o5224q3061j14620n9038J03348J41937J61809J21180
$$ 75890 153897 261334 254305 189081 106020 -8600 -67638 35710 177647 339456 460636
17084D60636L5645j39519p2024j05509m0473k7992O1977J61469k8348J43682J72571
$$ 460636 496281 356762 284738 179229 138756 110764 172741 334210 305862 449544 622115
17073F22115j10363j03409P0588J33677j16408l6535k26887j38906O0864M7880
$$ 622115 511752 408343 478931 612608 496200 459665 232778 93872 154736 202616
17063B02616J81765J45429K0887o953J49523J28242j14373M530j59602j69463
$$ 202616 384381 529810 550697 543744 693267 821509 707136 711666 552064 382601
17053C82601J58282J69510j38977k83056J03472J37366J67905k6774l6916k0963
$$ 382601 540883 710393 571416 288360 391832 529198 697103 670329 633413 612450
17043F12450J33268o0734J1741j23341k20363m5002P6048j31252J66746P6856
$$ 612450 745718 684984 696725 573384 353021 308019 384067 252815 419561 496417
17033D96417k06972J0784J81243j9264J54454j18625j22778q4157q6324N0941
$$ 496417 289445 300229 481472 462208 616662 498037 375259 291102 204778 255719
17023B55719l8094j79904N071q8073J40056K84228n2191j36150J13100R9752J75865
$$ 255719 217625 37721 42792 -45281 94775 379003 326812 190662 303762 403514 579379
17012E79379L3250r1893L2592O201Q3727K43249j14646k33580o8484K91804R3478
$$ 579379 612629 520736 553328 559529 643256 886505 771859 538279 469795 761599 855077
17001H55077j34625M7689J90367L78407j43867j61873R3267K25111p4099k21567
$$ 855077 720452 768141 958508 1336915 1193048 1031175 1124442 1349553 1275454 1053887
16991A053887r506k13661N0908K01661m7186O8117N2137K052j57171O9646K72926
$$ 1053887 1044381 830720 881628 1083289 1036103 1104220 1156357 1158409 1001238 1070884 1343810
16980A343810L04198m4423J43803p8836J00158j19601k58411N7007q0527J97938
$$ 1343810 1648008 1603585 1747388 1668552 1768710 1649109 1390698 1447705 1367178 1565116
16970A565116O76521L90372K64742L38294N37979J62129l35808n92378n22237
$$ 1565116 2241637 2632009 2896751 3235045 3773024 3935153 3599345 3006967 2484730
16961B484730j84307L26733K63318J16211M04304L78429K39615J05660L679k446
$$ 2484730 2300423 2627156 2890474 3006685 3410989 3789418 4029033 4134693 4138372 4135926
16951D135926j25882k0837M4180k26953m02087m26518k85165M116M99367P64086
$$ 4135926 4010044 3989207 4033387 3806434 3404347 2977829 2692664 2696780 3196147 3960233
16941C960233K37200P5470k2673p9356q8629k78899k01369k58359j47738K57030
$$ 3960233 4197433 4272903 4250230 4170874 4082245 3803346 3601977 3343618 3195880 3452910
16931C452910q2062j85527J746o8081J22681j11902r8047J59400J66138K99249
$$ 3452910 3370848 3185321 3187067 3118986 3241667 3129765 3031718 3191118 3357256 3656505
16921C656505J31817K54442L27153N08362K59154p2595L17021L04120J86264K32684
$$ 3656505 3788322 4042764 4369917 4878279 5137433 5064838 5381859 5685979 5872243 6104927
16911F104927J40159J43972J04547M93326Q29630O38406O31854Q24792P94879
$$ 6104927 6245086 6389058 6493605 6986931 7816561 8454967 9086821 9911613 10706492
16902A0706492O91607Q93740P07270Q02105J117546J505992J688772K009832K871703
$$ 10706492 11398099 12291839 12999109 13801214 14918760 16424752 18113524 20123356 22995059
16893B2995059L649693N285520P883429J1479729J7198390K4288155K7826045
$$ 22995059 26644752 31930272 39813701 51293430 68491820 92779975 120606020
16886A20606020K4420293J9186182J2907680J579315j3926124k5766492k2007962
$$ 120606020 145026313 164212495 177120175 178699490 164773366 139006874 116998912
16879A16998912q431766M635675J6169946K5215221K7498642K6209898K6968344
$$ 116998912 108567146 113202821 129372767 154587988 182086630 208296528 235264872
16872B35264872K4251616J2581581n907683j4474577j2238113j5133600k5180552
$$ 235264872 259516488 272098069 266190386 251715809 239477696 224344096 199163544
16865A99163544l2853796k7055344j3471369o69228J0636360J7931632J7897078
$$ 199163544 166309748 139254404 125783035 125113807 135750167 153681799 171578877
16858A71578877J3222768Q422832o73230j5752258l0267144l2673397k3652844
$$ 171578877 184801645 193224477 192551247 176798989 146531845 113858448 90205604
16851I0205604j5397285j0286240o865800n067087m238530l364274k598565k128657
$$ 90205604 74808319 64522079 57656279 52589192 48350662 44986388 42387823 40259166
16843D0259166k045101j596582j333949j726216j810149j147703j085351j053175
$$ 40259166 38214065 36617483 35283534 33557318 31747169 30599466 29514115 28460940
16835B8460940r01433j159457j312698j259415j008479p20983p85828q14858n88145
$$ 28460940 27559507 26400050 25087352 23827937 22819458 22098475 21312647 20497789 19909644
16826A9909644p17543o76647o59271p84922q22716n24799n05745o55753l29062
$$ 19909644 19192101 18515454 17856183 17071261 16248545 15723746 15218001 14562248 14233186
16817A4233186l50026n27047n33128m69769k37844j61474l77677p50090m34123
$$ 14233186 13883160 13356113 12822985 12353216 12115372 11953898 11576221 10826131 10392008
16808A0392008q9952l60495m18303l44494k29482j82158j31150j70726m39749
$$ 10392008 10302056 9941561 9523258 9178764 8949282 8767124 8635974 8465248 8025499
16799H025499k11956j68071j45116j64788m02159l64226l38072n5947j42746j09926
$$ 8025499 7813543 7645472 7500356 7335568 6933409 6569183 6231111 6175164 6032418 5922492
16789E922492p1382k34811l58337k79142k78087j68008k11197l9786J47318j14582
$$ 5922492 5851110 5616299 5257962 4978820 4700733 4532725 4321528 4281742 4429060 4314478
16779D314478J5308M0847j00869k08972r0105k82031k84623N9045j59953j75336
$$ 4314478 4329786 4370633 4269764 4060792 3970687 3688656 3404033 3463078 3303125 3127789
16769C127789j05729p6906j73334l4694k65429r3099K11860p2352R1186P3270
$$ 3127789 3022060 2945154 2771820 2737126 2471697 2378598 2590458 2518106 2609292 2682562
16759B682562J99741j32359j16193r7539l3459j98646l5983J24386O0967k74981
$$ 2682562 2882303 2749944 2633751 2536212 2502753 2304107 2268124 2392510 2453477 2178496
16749B178496j15443j75716M6608K75998N239j51838k47756k08357K5575p7848
$$ 2178496 2063053 1887337 1933945 2209943 2215182 2063344 1815588 1607231 1632806 1554958
16739A554958j83670k83606n5695j10601J67237L3538P1905J6061j92776J3390
$$ 1554958 1371288 1087682 1031987 921386 1088623 1122161 1194066 1210127 1017351 1030741
16729A030741j75753K8612R7866O2717l35227l5717R6384k96036j25187m5355
$$ 1030741 854988 883600 981466 1044183 708956 673239 769623 473587 348400 303045
16719C03045R8109J25067J35496q9194j82687j42593r9490J4520p7201J61022
$$ 303045 401154 526221 661717 572523 389836 247243 147753 162273 85072 246094
16709B46094O8495q9285M3934R6133k5320k11712J10436K85215j61629k63769
$$ 246094 314589 225304 269238 365371 340051 128339 238775 523990 362361 98592
16699I8592j20737M5564J07577J74722K01699k27287k08113J7038J17187K2582
$$ 98592 -22145 23419 130996 305718 507417 280130 72017 89055 206242 228824
16689B28824j86541m2228k5162J04154k9284k4598O6107k6574j14045j32499R8017
$$ 228824 42283 55 -25107 79047 49763 25165 91272 64698 -49347 -181846 -83829
16678h3829K13977Q9114j32562j44036j62310K15662K8959r9652p9348K59180
$$ -83829 130148 219262 86700 -57336 -219646 -3984 24975 -74677 -154025 105155
16668A05155K93403K02005k5124m58905L7656L58153M1192J18170p3821l22900
$$ 105155 398558 600563 575439 116534 154190 512343 553535 671705 597884 274984
16658B74984p3606j61514O4175j2623J22621Q4286J83093P6960k87742k5726J47962
$$ 274984 201378 39864 104039 91416 214037 298323 481416 558376 270634 244908 392870
16647C92870l6816l10847j22501j12754N8872k12714j04733J50608L38645L930
$$ 392870 356054 45207 -77294 -190048 -131176 -343890 -448623 -298015 40630 44560
16637D4560j41923r2015J80438K70417J43230K47250l26029k39359j30725O1727
$$ 44560 -97363 -189378 -8940 261477 404707 651957 325928 86569 -44156 17571
16627A7571p0996k10783N3218L28994j21685j22522J84853L25286K0758j77936
$$ 17571 -53425 -264208 -210990 118004 -3681 -126203 58650 383936 404694 226758
16617B26758q0717M5397n6346L886J5586l36605k77571j16329J58701L48339J25934
$$ 226758 146041 191438 135092 138978 154564 -182041 -459612 -575941 -417240 -68901 57033
16606E7033J37460J23833L7674Q658L9854k16548n3863N4720J74120j57775k19114
$$ 57033 194493 318326 356000 364658 404512 187964 134101 188821 362941 205166 -13948
16595a3948j43974N3448J87557o9074r7573J32691K69476j4382k22615j89895
$$ -13948 -157922 -104474 83083 14009 -83564 49127 318603 304221 81606 -108289
16585a08289M196J38753J65350M5444L07626K4077j88149l28559l25625j14333
$$ -108289 -104093 34660 200010 245454 553080 577157 389008 60449 -265176 -379509
16575c79509L09858K34793j84849k21294N576J82992q3386J42753j59675j15668
$$ -379509 -69651 165142 -19707 -241001 -235425 -52433 -135819 6934 -152741 -268409
16565b68409K46576R7180r7093N6178J53511N4274O4193J23734j53650j85323
$$ -268409 -21833 75347 -21746 34432 187943 242217 306410 430144 276494 91171
16555I1171j58531j54053j55684j53743J92099L00416p5712q2353j02722j92301
$$ 91171 -67360 -221413 -377097 -530840 -338741 -38325 -114037 -196390 -299112 -491413
16545d91413M0304J35756M7641m6459q0638J07950K04895K59853J54395l5907
$$ -491413 -451109 -315353 -267712 -314171 -394809 -286859 -81964 177889 332284 296377
16535B96377j91847j52546J1969R2383J04131j85007P3871j36802J3265n3799
$$ 296377 104530 -48016 -36047 56336 160467 -24540 49331 -87471 -74206 -128005
16525a28005j7919p6997Q2632j46244J44317N6665j14452L0034o3895J74193K43335
$$ -128005 -145924 -222921 -140289 -286533 -142216 -85551 -200003 -169969 -233864 -59671 183664
16514A83664j51120n9924p2865k53113l7464q0208j70234J15285J95172K18624
$$ 183664 32544 -27380 -100245 -353358 -390822 -471030 -641264 -525979 -330807 -112183
16504a12183O3226j42439j17370L1630l2262j6310O9806N6638K66860o7107l17368
$$ -112183 -48957 -191396 -308766 -277136 -309398 -325708 -255902 -199264 67596 489 -316879
16493c16879m8795p3241K52419J19143M7192m6602l2943n2956K8624J63837r1060
$$ -316879 -365674 -438915 -186496 -67353 -20161 -66763 -99706 -152662 -124038 39799 -51261
16482e1261o2713J06532R2685q7299q8074j39304j46380r7023K6629K20544R5361
$$ -51261 -113974 -7442 85243 -2056 -90130 -229434 -375814 -472837 -446208 -225664 -130303
16471a30303k23132J37013K23732K53128R2778j48562J15613K32184J44425k59737
$$ -130303 -353435 -216422 7310 260438 353216 204654 320267 552451 696876 437139
16461D37139j20935k58027M4566k17458k0443J66872k0743R9293Q2522K16523
$$ 437139 316204 58177 102743 -114715 -135158 31714 10971 110264 192786 409309
16451D09309j3166l26199P664n7293J51872K38101M928j02550j70726j87654k42495
$$ 409309 396143 69944 77608 20315 172187 410288 415216 312666 141940 -45714 -288209
16440b88209K8451J24870j45125j55668O9257J72054K3285J35386J6953k6578
$$ -288209 -259758 -134888 -280013 -435681 -366424 -194370 -171085 -35699 -18746 -45324
16430d5324j24005m1933J79386L14626m2253j66065j10943j8058J96917k16183
$$ -45324 -169329 -211262 -31876 282750 240497 74432 -36511 -54569 142348 -73835
16420g3835k30920P0773K50319J7413j37735j08785J70330J19492m0841j20593
$$ -73835 -304755 -233982 16337 33750 -103985 -212770 -42440 77052 36211 -84382
16410h4382k526j00292j03101k5907J10581M8542J08512J69262O3596j18858N3702
$$ -84382 -86908 -187200 -290301 -316208 -205627 -157085 -48573 120689 184285 65427 119129
16399A19129k9996J16477j68554J65153R6294k15474k74503m4355K63637J14599
$$ 119129 89133 205610 37056 202209 298503 83029 -191474 -235829 27808 142407
16389A42407J04848j53609P7966K8864J00016m7250m48211n4849J4155K59931
$$ 142407 247255 93646 171612 200476 300492 253242 -194969 -249818 -235663 24268
16379B4268k879k32048Q992P1161J8535o6854J55339j7345K23469J78405j72880
$$ 24268 21389 -210659 -201667 -130506 -111971 -178825 -23486 -40831 182638 361043 188163
16368A88163n3742J14213k22472p4527l6030L7438J22800l5645j84155p0097J38714
$$ 188163 134421 248634 26162 -48365 -84395 -46957 75843 40198 -143957 -214054 -75340
16357g5340L8858J83773L2167J4235k07767j23549O2656K2715j26571j9397j03287
$$ -75340 -36482 147291 179458 193693 -14074 -137623 -74967 -52252 -178823 -198220 -301507
16346c01507l9985L74426K58053P2014l05406k6846q7029j02331n7804o8034n5876
$$ -301507 -341492 32934 290987 363001 57595 30749 -56280 -158611 -216415 -284449 -340325
16335c40325Q9769J93034J98435j44058J0608J01219q2693K29915Q3117l59227
$$ -340325 -250556 -57522 140913 -3145 7463 108682 25989 255904 339021 -20206
16325b0206j97575J21366K00702J82871K73152J21275o9093K55375J49113k59433
$$ -20206 -217781 -96415 104287 287158 560310 681585 612492 867867 1016980 757547
16315G57547j16728k85734k72271J22412J73610J41708K26259J03242J99201J87271
$$ 757547 640819 355085 82814 205226 378836 520544 746803 850045 1049246 1236517
16305A236517J49921j33008k16351J75028J09106j46061l76528O0944k9724k09921
$$ 1236517 1386438 1253430 1037079 1212107 1321213 1175152 798624 859568 829844 619923
16295F19923j91183J59946J52198J22382K0846M4278l2821j46053K20865j96629
$$ 619923 428740 588686 740884 863266 884112 928390 895569 749516 970381 773752
16285G73752j31490j36926m3195j502k85132m4037J74254L3204l9507L6566o4729
$$ 773752 642262 505336 462141 460639 175507 131470 305724 338928 299421 335987 271258
16274B71258k16184l36225j0454K08255J88335M3815l5289l07294j42583M43740
$$ 271258 55074 -281151 -291605 -83350 104985 148800 113511 -193783 -336366 107374
16264A07374j22482j53261J00387L81973o5013q3530j13799q3885K66141K28896
$$ 107374 -15108 -168369 -67982 313991 248978 165448 51649 -32236 233905 462801
16254D62801n968j98731j56201k30512j05528N1897Q5621k11563P8037J42488
$$ 462801 456833 258102 101901 -128611 -234139 -182242 -96621 -308184 -230147 -87659
16244h7659n5904q6506J65829Q2035m7953k2235m715q3379l7818p6501K07618
$$ -87659 -143563 -230069 -64240 17795 -30158 -52393 -57108 -140487 -178305 -254806 -47188
16233d7188M12580J21753k35889k83205j61579J19169J62658p4089J54124K93984
$$ -47188 365392 487145 251256 -31949 -193528 -74359 88299 14210 168334 462318
16223D62318K3905k33233j63737n2089J68619j0283J9296J42035O359k17559j84847
$$ 462318 486223 252990 89253 37164 205783 195500 214796 356831 363190 145631 -39216
16212c9216k3658r9144J32604K12532r5116L0028q4585l5837j5975j64350k45955
$$ -39216 -62874 -162018 -29414 183118 88002 118030 33445 -2392 -18367 -182717 -428672
16201d28672J56195q2068j7824L12663L06490o3405J30111N1348k80538j59683
$$ -428672 -272477 -354545 -372369 -59706 246784 183379 313490 364838 84300 -75383
16191g5383L3932J01841J00709N1062j78529l9061J1554j19079k28143O7998K98616
$$ -75383 -41451 60390 161099 212161 33632 -5429 6125 -112954 -341097 -273099 25517
16180B5517J09279q9093j38470J31613K5630J00863j19082q0573K19090K0870
$$ 25517 134796 45703 -92767 38846 64476 165339 46257 -34316 184774 205644
16170B05644m3652L8839l76316J4380Q9530J67598r446j97607N6190K2498O9896
$$ 205644 161992 200831 -175485 -161105 -71575 96023 86577 -111030 -54840 -32342 37554
16159C7554r2463l8157l66481j04238K45238J66064J20695K8192R9105R8796q5209
$$ 37554 -54909 -93066 -459547 -563785 -318547 -152483 -31788 -3596 95509 194305 109096
16148A09096K42558J87320j93949n00121j55334Q6179j01185K15372O3466j22904
$$ 109096 351654 538974 345025 -155096 -310430 -224251 -325436 -110064 -46598 -169502
16138a69502o934O5267o4700p0999M7859K02006k16381r5791K02206J89946J89523
$$ -169502 -176436 -111169 -175869 -246868 -199009 2997 -213384 -309175 -106969 82977 272500
16127B72500j21525k40209j02704Q7181M3996j2787j05239q6375R8829K14575
$$ 272500 150975 -89234 -191938 -104757 -60761 -73548 -178787 -265162 -166333 48242
16117D8242J68199J5156n2134o5471N2736j89549K766J9173j13725Q4290k8385
$$ 48242 216441 231597 179463 113992 166728 -22821 -20055 -882 -114607 -30317 -58702
16106e8702J23831l24922j99492J95302K01600L73930R400k74215m04330k00819
$$ -58702 65129 -259793 -459285 -263983 -62383 311547 320947 46732 -357598 -558417
16096e58417J37757K51846L05704j29709J4101K9766k96101m5615L9932O154L12588
$$ -558417 -420660 -168814 136890 7181 21282 51048 -245053 -290668 -250736 -244582 68006
16085F8006Q1364P782k282o1574j51148k06565j72890J49850R0450o3604l6018
$$ 68006 149370 157152 154870 93296 -57852 -264417 -437307 -287457 -197007 -260611 -296629
16074b96629J48501K28670l945P7027J07244r5660j86855N2320J0389J6424J20234
$$ -296629 -148128 80542 76597 153624 260868 165208 -21647 30673 41062 57486 177720
16063A77720o0562o7241n8755l4824j87145O226L12475j59650k34937J30862o4270
$$ 177720 117158 49917 -8838 -43662 -230807 -224581 87894 -71756 -306693 -175831 -240101
16052b40101j18870m7272n2055O9116K6347J79026J98978K032j7026J54704K86960
$$ -240101 -358971 -406243 -458298 -389182 -362835 -183809 15169 17201 175 154879 441839
16041D41839O507k36009k25265J61311J13405j85499k41951J62238J87331Q1048
$$ 441839 448346 212337 -12928 148383 261788 76289 -165662 -3424 183907 264955
16031B64955j39625k30020l3771j64208j6897R93K06016k7232o0869J99424j27986
$$ 264955 125330 -104690 -138461 -302669 -319566 -318573 -112557 -139789 -200658 -1234 -129220
16020a29220n5986r9365j02848j8177o714J82435K48835j25459j66116J76194
$$ -129220 -185206 -284571 -387419 -405596 -412310 -229875 18960 -106499 -272615 -96421
16010i6421o9504N5846J60321J715j62592L1511J11865j10830O1557O712j70556
$$ -96421 -165925 -110079 50242 51957 -110635 -79124 32741 -78089 -16532 -9820 -180376
15999a80376J4157O3337N972O2732j76722j67351Q5738M3356L13696J22358j94379
$$ -180376 -166219 -102882 -96910 -34178 -210900 -378251 -292513 -249157 64539 186897 -7482
15988g482R7422j7810j29529K4713P3581M3165R570j17988J00548J58758K5539
$$ -7482 89940 72130 -57399 -32686 40895 84060 93630 -24358 76190 234948 260487
15977B60487q6369k55765k83629m1139J50165Q3050K26289J33306J08094j4057
$$ 260487 174118 -81647 -365276 -406415 -256250 -173200 53089 186395 294489 280432
15967B80432m3362J44723k25532j36388j04269k34565j53671K42325N3741J49996
$$ 280432 237070 381793 156261 19873 -84396 -318961 -472632 -230307 -176566 -26570
15957b6570k5288k58301j44625P927j5535L30616O2037J1111J50470P3579J26823
$$ -26570 -51858 -310159 -454784 -446857 -462392 -131776 -69739 -58628 91842 165421 292244
15946B92244M1472P3973k32486j07285j0351L1279j66463k23852m0761J94886
$$ 292244 333716 407689 175203 67918 57567 88846 -77617 -301469 -342230 -147344
15936a47344K38258r653J92360k04096k26009j10631m4500K7474j08587J16273
$$ -147344 90914 81261 273621 69525 -156484 -267115 -311615 -284141 -392728 -276455
15926b76455L09717k47246N6266J80249j27692q678J49964m5293k426M5154P5857
$$ -276455 33262 -213984 -157718 22531 -105161 -113839 36125 -9168 -11594 33560 109417
15915A09417r9290k05026J0666J42497j44216m4190J36341N4136m1062k92700
$$ 109417 10127 -194899 -184233 -41736 -185952 -230142 -93801 -39665 -80727 -373427
15905c73427l13190P7159L03325K12341L61080K9179j33665M332j14542j1312
$$ -373427 -686617 -609458 -306133 -93792 267288 296467 162802 167134 52592 41280
15895D1280O0903O9707R0552O2942j01373j76599j07243J92349P4025J55694j35508
$$ 41280 102183 171890 262442 325384 224011 47412 -59831 132518 206543 362237 226729
15884B26729j87057O4600L777J36299J25449r5390l66310r6748J88310r622k35575
$$ 226729 39672 104272 108049 244348 369797 274407 -91903 -188651 -341 -9963 -245538
15873b45538L2898j16714K1957n4342O0700J08671K18421q4478p4577J04367j32684
$$ -245538 -212640 -329354 -307397 -361739 -301039 -192368 26053 -58425 -133002 -28635 -161319
15862a61319k15586k2881l7426m6578J21851Q7418K09480K08107o8749j28079
$$ -161319 -376905 -399786 -437212 -483790 -361939 -274521 -65041 143066 74317 -53762
15852e3762K2151k09500n7342Q5359o4183J37663n952Q5281k2541Q3960o037M5888
$$ -53762 -31611 -241111 -298453 -213094 -277277 -139614 -145566 -60285 -82826 1134 -4903 40985
15840D0985m416J29563J03803m6129j12345o7778J69871J85737m2755k42843j6338
$$ 40985 36569 166132 269935 223806 111461 43683 213554 399291 356536 113693 97355
15829I7355k42387k69870P9126K80905J4284J30517K08621p4109o3655L114O9895
$$ 97355 -145032 -414902 -335776 -54871 -40587 89930 298551 224442 160787 163901 233796
15818B33796o6934j05457k05761j50551O966K17943J0515j59657r3012O7630K87613
$$ 233796 166862 61405 -144356 -294907 -287941 -69998 -59483 -219140 -312152 -244522 43091
15807D3091K5457l7061j61826k4701J75944m580l5628j74903N1648o411L9263
$$ 43091 68548 31487 -130339 -155040 20904 16324 -19304 -194207 -142559 -148970 -109707
15796a09707j77935J07407J20837L151j72709k15396L0391K27904J50074n3550
$$ -109707 -287642 -180235 -59398 -56247 -228956 -444352 -413961 -186057 -35983 -89533
15786h9533q5168R1272M38J01968m1005j48748j48545K49317J3083j56472q7413
$$ -89533 -174701 -83429 -82991 18977 -22028 -170776 -319321 -70004 -56921 -213393 -300806
15775c00806o8912N4064J61205Q4401J2756L8762K8508J37443L34904k4838k04267
$$ -300806 -369718 -315654 -154449 -70048 -57292 -18530 9978 147421 482325 457487 253220
15764B53220j87468l9838m2554o5415n0424P7583J60056p5044m7399p4297j02006
$$ 253220 65752 25914 -16640 -82055 -132479 -54896 105160 30116 -17283 -91580 -193586
15753a93586j34824L5201M5353l7210M1364k82761k9772L43685Q5990k0975n7329
$$ -193586 -328410 -293209 -247856 -285066 -243702 -526463 -556235 -212550 -126560 -147535 -204864
15742b04864j57434J88512L58978J10009j22542K3509n6068p1298k22604J46870
$$ -204864 -362298 -173786 185192 295201 172659 196168 140100 68802 -153802 -6932
15732f932O7307j09807P629n0092j31439k6639J23148Q802l6388k1297j46240
$$ -6932 60375 -49432 -41803 -91895 -223334 -249973 -126825 -118023 -154411 -175708 -321948
15721c21948j65505R4533J89244J87017m287J62212l07032q9353K1701k00416
$$ -321948 -487453 -392920 -203676 -16659 -20946 141266 -165766 -255119 -233418 -433834
15711d33834L9324Q7346J33386J42106j5819j21115J08669R4292j1267Q313K5860
$$ -433834 -394510 -307164 -173778 -31672 -47491 -168606 -59937 34355 23088 31401 57261
15700E7261L3878j03288j28889q5851k7504k15635q8932K0028p86J72677K29099
$$ 57261 91139 -12149 -141038 -226889 -254393 -470028 -558960 -538932 -539718 -367041 -137942
15689a37942R9203M3586J85929p7522j35500j3454k0920J20186J00543j7230j82720
$$ -137942 -38739 4847 190776 113254 -22246 -35700 -56620 63566 164109 146879 -35841
15678c5841k36933j2015J65999K25284r467r2002j91355j15527j46590L063R5155
$$ -35841 -272774 -284789 -118790 106494 97027 5025 -186330 -301857 -448447 -445384 -350229
15667c50229l0009M9939R1922N7032J42127J32529j98104l27549l0103L85686
$$ -350229 -380238 -330299 -238377 -181345 -39218 93311 -104793 -432342 -462445 -76759
15657g6759Q6846k10962M9727J81635j44221J20949J16390J40510j35989J30086
$$ -76759 10087 -200875 -151148 30487 -113734 7215 123605 264115 128126 258212
15647B58212J38240j59055J49075J3930j65477O0468J09207j3041k32491K2632
$$ 258212 396452 237397 386472 400402 234925 295393 404600 391559 159068 181700
15637A81700n4685k69749m8246M3766q5103L47338J88082r7025k26289J22541
$$ 181700 127015 -142734 -190980 -147214 -232317 115021 303103 206078 -20211 102330
15627A02330J14676J38986n2905k61431L2579k71495J76393j52460N394L05657
$$ 102330 217006 355992 303087 41656 74235 -197260 -20867 -173327 -167933 137724
15617A37724J1525j27583K358j65591l0527K01197Q2000J06875n4789M5158r9762
$$ 137724 149249 21666 24024 -141567 -172094 29103 111103 217978 163189 208347 108585
15606A08585J9207M9035j61255l26904P0359K43035J27865j54849J47425r1208
$$ 108585 127792 176827 15572 -311332 -240973 2062 129927 -24922 122503 31295
15596C1295J32379k4868k5974J2750L9063J89994K11733j41258l98016O3540j09188
$$ 31295 163674 138806 112832 125582 164645 354639 566372 425114 27098 90638 -18550
15585a8550o6456j03740j15966k926J00170m3284J17699j34370j84811L59069
$$ -18550 -85006 -188746 -304712 -307638 -207468 -250752 -133053 -267423 -452234 -93165
15575i3165J16838l3619j23619M6686J20839N0438j4844P4780K9920k5510r7563
$$ -93165 23673 -9946 -133565 -86879 33960 84398 69554 144334 174254 148744 51181
15564E1181R716M2228k2734J12812K42790k0214k9098k13475n38696j36027J64334
$$ 51181 60897 103125 80391 193203 435993 415779 386681 173206 -365490 -501517 -337183
15553c37183l6494n5194K71966J54941r3941k71156k74986m3142j32493M74084
$$ -337183 -373677 -428871 -156905 -1964 -95905 -367061 -642047 -685189 -817682 -343598
15543c43598L84919M1452J14940J22106q1337k07018R2674j60044q5714r6616
$$ -343598 41321 82773 197713 319819 238482 31464 124138 -35906 -121620 -218236
15533b18236J13761L3517k20394K5559J39674K3927N0759J63995j72533k7063
$$ -218236 -104475 -70958 -291352 -265793 -126119 -102192 -51433 112562 -59971 -87034
15523h7034L340n5996k3231N1237r8021q6538L32304j20259q9696k53712l189
$$ -87034 -83694 -139690 -162921 -111684 -209705 -296243 36061 -84198 -173894 -427606 -430795
15512d30795n250o3036j55659J73720J06374J13325K24827R1653P5110R8877M5542
$$ -430795 -436045 -499081 -654740 -481020 -374646 -261321 -36494 55159 130269 229146 274688
15501B74688n6466M0526l01349n9724Q1201O3037J43692m3734J29468L4634j2815
$$ 274688 218222 258748 -42601 -102325 -21124 41913 185605 141871 271339 305973 293158
15490B93158k98273j85413O1428R435L2032N9143q4543p8108q629k17300K5037
$$ 293158 -5115 -190528 -129100 -119665 -87633 -28490 -113033 -191141 -199770 -417070 -392033
15479c92033m9714J79287L09662J7624j47590Q6810O0341j26371J17981p9680
$$ -392033 -441747 -262460 47202 64826 -82764 4046 64387 -61984 55997 -23683
15469b3683k0447J05408m7294n0146l9576Q3689j19502O1222n5909m7761P5211
$$ -23683 -44130 61278 13984 -36162 -75738 7951 -111551 -50329 -106238 -153999 -78788
15458g8788J03183L01679L3164j26575K6668j01510j9368j49486n9065Q689J19117
$$ -78788 24395 326074 359238 232663 259331 157821 138453 -11033 -70098 -61409 57708
15447E7708J82934M5989L6955j06503k78135R6612K12532j78576m0059J3235K29617
$$ 57708 240642 286631 323586 217083 -61052 35560 248092 69516 29457 42692 272309
15436B72309J7908o0248J6537j19097j28914k92k9762k6088J47831k64982J9230
$$ 272309 290217 229969 246506 127409 -1505 -1797 -31559 -57647 90184 -174798 -155568
15425a55568K20000K7861k60957R31Q9030R115q5987N4845J27478p3688j01847
$$ -155568 64432 92293 -168664 -167733 -78703 -69588 -155575 -100730 26748 -46940 -148787
15414a48787K5420K17384K14343j4412k7353J5842J37751k82994k06109j52511
$$ -148787 -123367 94017 308360 293948 266595 282437 420188 137194 -68915 -221426
15404b21426N599k12315P2695M69968j890k13321p7019L06036R3853j94803J07509
$$ -221426 -215827 -428142 -355447 114521 112631 -100690 -177709 128327 222180 27377 134886
15393A34886J05171j46053r7203j22623J7904K52691K68187j12750m8025q7760
$$ 134886 240057 94004 -3199 -125822 -107918 144773 412960 300210 252185 164425
15383A64425j34339k12299K3056O3899O9295k3740K22076K69070l37160m87083
$$ 164425 30086 -182213 -159157 -95258 -25963 -49703 172373 441443 104283 -382800
15373c82800j58290R3089L40170J58498k84541Q7248J92150j78813j1395J178
$$ -382800 -541090 -448001 -107831 50667 -233874 -146626 45524 -133289 -144684 -143506
15363a43506J5433K2994J75146N7082K3616P2424P1461l25232j66788P5098J07534
$$ -143506 -128073 -105079 70067 127149 150765 223189 294650 -30582 -197370 -122272 -14738
15352a4738J29399p9653P483j44527Q766J46251J44428j39668l2624K5322j85954
$$ -14738 114661 35008 42491 -102036 -93270 52981 197409 57741 25117 50439 -135515
15341a35515l5146l78007R8069J91877J15827R3974j01611k54366K7107L18146
$$ -135515 -170661 -548668 -450599 -258722 -142895 -48921 -150532 -404898 -377791 -59645
15331e9645q4735R0419M0945J22251r7799K0190J28564p0698k43443j20495L9270
$$ -59645 -144380 -53961 -13016 109235 11436 31626 160190 89492 -153951 -274446 -235176
15320b35176J41513j55955J43306k9422r2741N3650K1411K57253j4508j8184k76955
$$ -235176 -93663 -249618 -106312 -135734 -228475 -174825 -153414 103839 89331 71147 -205808
15309b05808r1467J47040M0706j16783J2262l3123K64830K15693J34143k44549
$$ -205808 -297275 -150235 -109529 -226312 -214050 -247173 17657 233350 367493 122944
15299A22944k38872m9772R3861m5080J0908l8874j92094R5428J56547N3661j65795
$$ 122944 -115928 -165700 -71839 -116919 -106011 -144885 -336979 -241551 -85004 -31343 -197138
15288a97138m14541J51110K80336m7882l374M0423M9476J04187N5100J99613j64363
$$ -197138 -611679 -460569 -180233 -228115 -231489 -191066 -141590 -37403 17697 217310 52947
15277E2947j5287M4793J55601j2432j70625m5779J17090m913J17472j15894l03227
$$ 52947 37660 82453 238054 225622 54997 9218 126308 121395 238867 122973 -180254
15266a80254O1574K15492r9848k83917N9690P5637j50462R694l4303O7740J84276
$$ -180254 -118680 96812 -3036 -286953 -227263 -151626 -302088 -292394 -326697 -258957 -74681
15255g4681P030J24056J7944J08362k4323q8586m8932k0072j1710J25558J31859
$$ -74681 -67651 56405 74349 182711 158388 69802 20870 798 -10912 114646 246505
15244B46505M1106k78219m46002j00157M8788j11523K29963M09567K12891j38851
$$ 246505 287611 9392 -436610 -536767 -487979 -599502 -369539 40028 252919 114068
15234A14068n74m4033q2960N1283l05685L8950J36950L6134L8973J31072j1815
$$ 114068 113494 69461 -13499 37784 -267901 -228951 -92001 -55867 -16894 114178 102363
15223A02363K19698N0876n2050j45749k70511r9726K33063J10639j67731p0854
$$ 102363 322061 372937 320887 175138 -95373 -195099 37964 148603 -19128 -89982
15213h9982o5176J25049k4435P1454j24198k55656k10414K24885N7567J87594
$$ -89982 -155158 -30109 -54544 16910 -107288 -362944 -573358 -348473 -290906 -103312
15203a03312J34561j32443j29807J12158j6598J37925q5586j06940J50930J90264
$$ -103312 31249 -101194 -231001 -118843 -135441 2484 -83102 -190042 -39112 151152
15193A51152P5111j50786k25562q9776J69152j65968j67389j13812J71567J13571
$$ 151152 226263 75477 -150085 -239861 -70709 -236677 -404066 -517878 -346311 -232740
15183b32740R9837P2448j24914l8677K53452M5991j21838n0795j9808n0034j56466
$$ -232740 -132903 -60455 -185369 -224046 29406 75397 -46441 -97236 -117044 -167078 -323544
15172c23544J73394J40744j03043j39447o483K40732N1908j61918j9286j57208
$$ -323544 -150150 -9406 -112449 -251896 -258379 -17647 34261 -127657 -146943 -304151
15162c04151j5784k27531m9380J10115K24052j46584K6873Q6086M0021M9897L67180
$$ -304151 -319935 -547466 -596846 -486731 -262679 -409263 -382390 -296304 -256283 -206386 160794
15151A60794K35545j1592k47238j30866k61011l80494K86127K78131L17799n3636
$$ 160794 396339 384747 137509 6643 -254368 -634862 -348735 -70604 247195 193559
15141A93559k97775q5928R0197j21289j49174Q2391O3986K18101J07108N5882
$$ 193559 -104216 -190144 -99947 -221236 -370410 -288019 -224033 -5932 101176 157058
15131A57058p4414K9062O9460J28970J29859k78828k75399R7669J05060K82204
$$ 157058 82644 111706 181166 310136 439995 161167 -114232 -16563 88497 370701
15121C70701n7099L7166q2401k23841R7705m6524M7438M546k1526j32865R0802
$$ 370701 313602 350768 268367 44526 142231 95707 143145 147691 126165 -6700 84102
15110H4102J99581P6549j32596j55023j38180q883K23040j20448j80938O0124
$$ 84102 283683 360232 227636 72613 -65567 -74450 148590 28142 -152796 -92672
15100i2672j5955P5495J47513J1379K93292J13016k032j95133m22794k92730J37310
$$ -92672 -108627 -33132 114381 125760 419052 532068 530036 334903 -87891 -380621 -243311
15089b43311J11940j35260n1024L14018J31050J24209j9220m4150r0085q2871
$$ -243311 -131371 -266631 -317655 -3637 127413 251622 232402 188252 98167 15296
15079A5296j17266O0848J16906J75448o2369j46397j75871j40219j86655J43572
$$ 15296 -101970 -41122 75784 251232 188863 42466 -133405 -273624 -460279 -316707
15069c16707K82520R3688j99171L7643n5463n2646k0271N2212J40854n4890K3743
$$ -316707 -34187 59501 -139670 -102027 -157490 -210136 -230407 -178195 -37341 -92231 -68488
15058f8488O1337L0264P0969j42694j49622P1127o0958p0756l0857N5338J81467
$$ -68488 -7151 23113 94082 -48612 -198234 -127107 -188065 -258821 -289678 -234340 -52873
15047e2873J52028r9622N6807J06786J933J41256j26010p0411j49617K3169n5565
$$ -52873 99155 -467 56340 163126 165059 306315 180305 109894 -39723 -16554 -72119
15036g2119J05326Q7687J04091j4315j86877k3902m2193j05064N7923n2669o5177
$$ -72119 33207 120894 224985 210670 23793 -109 -42302 -147366 -89443 -142112 -207289
15025b07289m06728N0079K38896O1108m4932L5609K49214J05711p2355j75358
$$ -207289 -614017 -563938 -325042 -263934 -308866 -273257 -24043 81668 9313 -166045
15015a66045J70255P6355j36421N0853o6562j7814K89543k50873j98323k6383
$$ -166045 4210 80565 -55856 -5003 -71565 -89379 200164 -50709 -249032 -275415
15005b75415l8284j50686q387K09170M2889n3390L33840n6315o4454R4815j1179
$$ -275415 -313699 -464385 -472772 -263602 -220713 -274103 59737 3422 -61032 33783 22604
14994B2604j33019n5116K03860J75052j09775j33780Q317M0635j07210q9544l6314
$$ 22604 -110415 -165531 38329 213381 103606 -30174 -21857 18778 -88432 -177976 -214290
14983b14290L18517K11694m9372k57163j59519O3313J59107K65902Q8409Q4172
$$ -214290 104227 315921 266549 9386 -150133 -86820 72287 338189 426598 510770
14973E10770J69897j75265J9264k29189k67485O408n8786l09452K2024K3657O6823
$$ 510770 680667 505402 524666 295477 27992 34400 -24386 -333838 -311814 -288157 -221334
14962b21334L5194j00782M4394K30666N9037p4111l85905k2327K09811P6496q7932
$$ -221334 -186140 -286922 -242528 -11862 47175 -26936 -412841 -435168 -225357 -148861 -236793
14951b36793K0139J6643J24619K86568L27218j52006j80189J61679L2287j51617
$$ -236793 -216654 -200011 -75392 211176 538394 386388 206199 367878 400165 248548
14941B48548j0060j7453j47824l15796k92219J95887N3658r1509M5077L06636
$$ 248548 238488 221035 73211 -242585 -534804 -338917 -285259 -376768 -331691 -25055
14931b5055J99210O5516j77050k75903O891J36667K03437n6945J412J01701n4298
$$ -25055 174155 239671 62621 -213282 -206391 -69724 133713 76768 78180 179881 125583
14920A25583k86158j12501J59569K43754k2045r2308r0723J0546R7706L23360
$$ 125583 -160575 -273076 -113507 130247 108202 15894 -74829 -64283 33423 356783
14910C56783L00857l227j27693k29396j87779n3436J08912J2355Q6155j430q4264
$$ 356783 657640 654413 526720 297324 109545 56109 165021 177376 263531 262101 177837
14899A77837l01412J29854R4008L1273O2646L4525l36830j47486J84127J35271
$$ 177837 -123575 6279 100287 131560 194206 228731 -108099 -255585 -71458 63813
14889F3813Q9095J54411j90858j73006J15206J67496n2301j80985J62537P5087
$$ 63813 152908 307319 116461 -56545 58661 226157 173856 -7129 155408 230495
14879B30495j10203m7496Q0087k959j83930r161j58747l68274J29866K56601l3132
$$ 230495 120292 72796 152883 149924 -34006 -43167 -201914 -570188 -440322 -183721 -216853
14868b16853j43621J87647J74213L7692q2183J53113j83357j23153K04471R3627
$$ -216853 -360474 -172827 1386 39078 -43105 110008 -73349 -196502 7969 101596
14858A01596p4397p0907J06338m0406K26218R5181k16275Q4706K01877J01765
$$ 101596 27199 -43708 62630 22224 248442 343623 127348 212054 413931 515696
14848E15696Q4744r3308j65884j66477P8222N1111l24336j87349q8119K34636
$$ 515696 600440 507132 341248 174771 252993 304104 -20232 -207581 -295700 -61064
14838f1064o2449k0604o2682J87683R7622J35886J6598j67832j69919l22957k10253
$$ -61064 -123513 -144117 -206799 -19116 78506 214392 230990 63158 -106761 -429718 -639971
14827f39971K40785J90993j58099j81681J28508J56034j47458J10304K71532R1203
$$ -639971 -399186 -208193 -366292 -547973 -419465 -263431 -410889 -300585 -29053 62150
14817F2150o8388o8387M909m54979j3984R6420Q0582J12639J32560r345J34241
$$ 62150 -6238 -74625 -69716 -524695 -538679 -442259 -361677 -249038 -116478 -125823 8418
14806H418P0528m0220n2837J70176K3364j14262n7990j45477o234r1770J30177
$$ 8418 78946 38726 -14111 156065 179429 65167 7177 -138300 -144534 -236304 -106127
14795a06127O7583q9503m510R0523J55688j77408j98941k07900J60198J55658
$$ -106127 -38544 -128047 -132557 -42034 113654 -63754 -262695 -470595 -310397 -154739
14785a54739O319r826J11250J61565k06717o8815R46p8790J00632j2855K0784
$$ -154739 -148420 -158246 -46996 114569 -92148 -160963 -160017 -238807 -138175 -151030 -130246
14774a30246K8563n731j1399J20443P9281o7790J03945K34975j49976k18577N5953
$$ -130246 -101683 -107414 -118813 1630 80911 13121 117066 352041 202065 -16512 39441
14763C9441J05937r2997k02376j37861n0670K25907K39406N4851r759o2513l22865
$$ 39441 145378 52381 -149995 -287856 -338526 -112619 126787 181638 171879 109366 -213499
14752b13499n2689K11750M9583O6252k07312O201J66023J63823j62605q0216J14864
$$ -213499 -266188 -54438 -4855 61397 -145915 -139714 26309 190132 27527 -52689 62175
14741F2175K09526j2400l9047j67689r3964O3330R027M0091J91367J91004o0427
$$ 62175 271701 259301 220254 52565 -41399 21931 30958 71049 262416 453420 392993
14730C92993k07865J10507J3289p0163K5880j8082K8886r9106k80507j74407p3186
$$ 392993 185128 295635 308924 238761 264641 246559 275445 176339 -104168 -278575 -351761
14719c51761k0156O2893J65994J80903k05682k5861L49120R3636j73642j50546
$$ -351761 -371917 -309024 -143030 37873 -167809 -193670 155450 249086 75444 -75102
14709g5102K64547J81712j49226j78442p5512k8256J8127j72668n889L0857P0278
$$ -75102 189445 371157 221931 43489 -32023 -60279 -42152 -214820 -220709 -189852 -119574
14698a19574k00011j44548P717J72539L47987J55012Q2492R3892p1808k33991
$$ -119574 -319585 -464133 -456416 -283877 64110 219122 301614 395506 323698 89707
14688H9707J43860J07940k22126m47448j05026O1510J77514J52203j13787O1525
$$ 89707 233567 341507 119381 -328067 -433093 -371583 -194069 -41866 -155653 -94128
14678i4128J25906K1748j51453n5033k5856K02323j68231l25581J53264K54798
$$ -94128 31778 53526 -97927 -152960 -178816 23507 -144724 -470305 -317041 -62243
14668f2243j74672r7137M4879N4877J34303M5989J24367J81184K78775L17048
$$ -62243 -236915 -334052 -289173 -234296 -99993 -54004 70363 251547 530322 847370
14658H47370k92387j57083k49418j64785o9612k84431l1025k2117L62900M16108
$$ 847370 554983 397900 148482 -16303 -85915 -370346 -401371 -423488 -60588 355520
14648C55520J82233j45835l82184j80351J493J86595j57493j29305m1742K0366
$$ 355520 537753 391918 9734 -170617 -169124 17471 -140022 -269327 -311069 -290703
14638b90703J19192j70694q9222j28208J19481K88793L6442j11533l276J35746
$$ -290703 -171511 -342205 -431427 -559635 -440154 -151361 -114919 -226452 -229728 -93982
14628i3982J79926R4875l6343j84315M682J9689r1722R0337J16869Q5030l3204
$$ -93982 85944 180819 144476 -39839 -35157 -15468 -107190 -16853 100016 185046 151842
14617A51842p0433k40494J482M7838J54659q3849Q3041J101m1603L8958k16498
$$ 151842 81409 -159085 -157603 -109765 44894 -38955 44086 45187 3584 42542 -173956
14606a73956k53082J8421J76281J38924P5446k37361o4982K13658j62776K58423
$$ -173956 -427038 -408617 -232336 -93412 -17966 -255327 -320309 -106651 -269427 -11004
14596a1004J91701J48147K029k04858L1476R8728N4709j98820k20117n3481J107
$$ -11004 180697 328844 330873 126015 157491 256219 310928 112108 -108009 -161490 -160383
14585a60383L7800p052N209m9287j63058j27754j7075K3090o721K61292L96054
$$ -160383 -122583 -129635 -124426 -173713 -336771 -464525 -481600 -458510 -465231 -203939 192115
14574A92115j53493n4594j10080m6657P3252K80696J11134j546J88084K4465j98258
$$ 192115 38622 -15972 -126052 -172709 -99457 181239 292373 290827 478911 503376 305118
14563C05118j48292j40727j6753L1585J0695R310n3863J2219j32059k35681M6672
$$ 305118 156826 16099 -654 30931 41626 50936 -2927 9292 -122767 -358448 -311776
14552c11776j6892K4683m3730K33265j60997j37947J7609R0030K251J92140L3768
$$ -311776 -328668 -303985 -347715 -114450 -275447 -413394 -395785 -305755 -303504 -111364 -77596
14541g7596P9031K29102r3602l27518J2425p7182j06474Q4336Q6579J57438J21948
$$ -77596 1435 230537 136935 -190583 -178158 -255340 -361814 -277478 -190899 -33461 88487
14530H8487j9033j40655R477K9867r1924n0798J92072L19918q0708L3752O5694
$$ 88487 69454 -71201 -61724 -31857 -123781 -174579 17493 337411 256703 290455 356149
14519C56149O8431j31930j12114J8792j68262p9743k59227N1823j40726J79644
$$ 356149 424580 292650 180536 199328 31066 -48677 -307904 -256081 -396807 -217163
14509b17163K34494Q6279m7814j79717J04340J91353M8779l10089O9047j41556
$$ -217163 17331 103610 55796 -123921 -19581 171772 220551 -89538 -20491 -162047
14499a62047K0935N8387j11917Q0252K33296J40901p7062j12760O0150P2058J49168
$$ -162047 -141112 -82725 -194642 -114390 118906 259807 182745 69985 130135 202193 351361
14488C51361j32360m6193L6365j9560j49036K0387L8081m2473j01964j65678J69915
$$ 351361 219001 172808 209173 189613 40577 60964 99045 56572 -45392 -211070 -41155
14477d1155K98432J7214l43997o3632k5495j41289l6653K34916K21275K22688
$$ -41155 257277 274491 -69506 -133138 -158633 -299922 -336575 -101659 119616 342304
14467C42304p8570j7900j60116j95143P6192J01635J455R0834o0157J9508J27787
$$ 342304 263734 245834 85718 -109425 -33233 68402 69857 160691 100534 120042 247829
14456B47829O7904J93195m40378m30857j42549q2528j03051M03684K75031K42429
$$ 247829 315733 508928 68550 -362307 -504856 -587384 -690435 -286751 -11720 230709
14446B30709j01114j9092J52363k32659k50345J04459K01954J29447m12066J3297
$$ 230709 129595 110503 262866 30207 -220138 -115679 86275 215722 -196344 -183047
14436a83047L53200K39426j15674k25960n5710j28146J8003k3978j67970J56384
$$ -183047 170153 409579 293905 67945 12235 -115911 -97908 -121886 -289856 -133472
14426a33472K10770J3052k64845j16227j58265q4616N8591J55762J40781J41554
$$ -133472 77298 90350 -174495 -290722 -448987 -533603 -475012 -319250 -178469 -36915
14416c6915j06995j55471N585R3811N5652j8854J48429Q1336q6533q240j8995
$$ -36915 -143910 -299381 -293796 -199985 -144333 -163187 -14758 66578 -19955 -28195 -47190
14405d7190j18088M07154J40865o8007n7886q6326p2373j01065j13988o0670N0514
$$ -47190 -165278 241876 382741 314734 256848 170522 98149 -2916 -116904 -177574 -127060
14394a27060j37014q644K56621O0173j24196m0031O8621J24536J55444Q4129k6688
$$ -127060 -264074 -272718 -16097 44076 -80120 -120151 -51530 73006 228450 312579 285891
14383B85891k20849K2774r8873J23864J90065l0345j22451Q4649K15542m9939
$$ 285891 65042 87816 -11057 112807 302872 272527 150076 234725 450267 400328
14373D00328j65423k1491l99650j94767Q3924j9128N8667j3954k0778J3808Q7787
$$ 400328 234905 213414 -186236 -381003 -297079 -316207 -257540 -271494 -292272 -278464 -190677
14362a90677J12734j39488P9660J26719n5879j79342q7776J68211K36542R9651
$$ -190677 -77943 -217431 -137771 -11052 -66931 -246273 -334049 -165838 70704 170355
14352A70355m7534o6167J68826K3239l39230j57778L26669J01843J6372k00403
$$ 170355 122821 56654 225480 248719 -90511 -248289 78380 180223 196595 -3808
14342c808j93729J1621J30935J92940K173R886k78612O7394N4036J53757J92450
$$ -3808 -197537 -185916 -54981 137959 140132 150018 -128594 -61200 -7164 146593 339043
14331C39043P9027q6593j59347q7854O3895j56974j80552l5032K14215P640j67817
$$ 339043 418070 331477 172130 84276 148171 -8803 -189355 -224387 -10172 -2532 -170349
14320a70349o1484L15954J68370J39826r0298L0489L9412k46650r9196o5752J40766
$$ -170349 -231833 84121 252491 392317 302019 332508 371920 125270 26074 -39678 101088
14309A01088n3066l4338Q378Q2450M6334P2462n8390o5058k26955o1040L52387
$$ 101088 48022 13684 22062 104512 150846 223308 164918 99860 -127095 -188135 164252
14298A64252J1471k25451m1735P5457p0906p9834J6204P7132m7221o4526l2101
$$ 164252 175723 -49728 -91463 -16006 -86912 -166746 -150542 -73410 -120631 -185157 -217258
14287b17258K87049j08860N9508j69681k20128k0379J44525K41505J26198K70014
$$ -217258 69791 -39069 20439 -149242 -369370 -389749 -245224 -3719 122479 392493
14277C92493J29007M8575r4008k58932j49656j54974j14641J79361J633l12538
$$ 392493 521500 570075 476067 217135 67479 -87495 -202136 -22775 -21142 -333680
14267c33680j27427K63909J03373r4855J1074N8266J42297O4123Q3021N9451L1452
$$ -333680 -461107 -197198 -93825 -188680 -177606 -119340 22957 87080 170101 229552 261004
14256B61004k37360J0806j9491k57598l1766k4672P1593K31021q1944j21208k4379
$$ 261004 23644 34450 14959 -242639 -274405 -299077 -227484 3537 -78407 -199615 -223994
14245b23994q1839J15507P3481j84926J03797K29446j06364j1966l6989M0715
$$ -223994 -305833 -190326 -116845 -301771 -197974 31472 -74892 -86858 -123847 -83132
14235h3132K207k9479P9640J93377J68017L6101j93463j4330k80021o7284L41
$$ -83132 -80925 -110404 -30764 162613 330630 366731 173268 158938 -121083 -188367 -188026
14224a88026o4517l2518P5146K19743k7980J3532m0347K6410r3345k8295J20592
$$ -188026 -252543 -285061 -209915 9828 -18152 -4620 -44967 -18557 -111902 -140197 -19605
14213a9605j14833k76413R190J24896R032K00944J04462n3399r4353N3631K10418
$$ -19605 -134438 -410851 -401661 -276765 -267733 -66789 37673 -15726 -110079 -56448 153970
14202A53970k37304J24962j51904j37984J20369J73521O9326j9127j5537k64094
$$ 153970 -83334 41628 -110276 -248260 -127891 45630 114956 95829 80292 -183802
14192a83802k3944O7934l808L5874Q5109r054m3280N1128J83977n7881l3499J41889
$$ -183802 -207746 -139812 -143620 -107746 -22637 -31691 -74971 -23843 160134 102253 68754 210643
14180B10643l02580l53736O913J72034K24217J03609j38112l26926j77867K01984
$$ 210643 -91937 -445673 -438760 -266726 -42509 61100 -77012 -403938 -581805 -379821
14170c79821J35468P9523J06359j6315O2045J66418N4988P7653J40285j20540
$$ -379821 -244353 -164830 -58471 -74786 -12741 153677 208665 286318 426603 306063
14160C06063m0937p1520l49483o7878J09718j43075j15950J46272O2659j39158
$$ 306063 265126 193606 -155877 -223755 -114037 -257112 -373062 -226790 -164131 -303289
14150c03289K912J18072P1226M7212j85973k00630O5245o5416J1911R6498J45847
$$ -303289 -300377 -182305 -111079 -63867 -249840 -450470 -385225 -450641 -438730 -342232 -196385
14139a96385m7251P8733n8985J65384L44530j53819m36379Q0536o6614R4600M15905
$$ -196385 -243636 -164903 -223888 -58504 286026 132207 -304172 -223636 -290250 -195650 220255
14128B20255r8059j86387j44445J02918j36227K0861K15262M8847j8126m3839
$$ 220255 122196 -64191 -208636 -105718 -241945 -221084 -5822 43025 24899 -18940
14118a8940R0439k8423r9217j01540j88647K1443J71199J91873k9413L6189K39052
$$ -18940 71499 43076 -56141 -157681 -346328 -324885 -153686 38187 8774 44963 284015
14107B84015J1817k27790q4669J09536K2565J39346k41439P1806O3704j92288
$$ 284015 295832 68042 -16627 92909 115474 254820 13381 85187 148891 -43397
14097d3397M5497j02779k60213m892K00655J06402j18445l7856J06046J34411
$$ -43397 2100 -100679 -360892 -365784 -165129 -58727 -177172 -215028 -108982 25429
14087B5429M8281q3460P5201J9849k33375k27622L20794K4519K71450J13149k40138
$$ 25429 73710 -9750 65451 85300 -148075 -375697 -54903 -30384 241066 354215 114077
14076A14077j52270K80675L0048k49415o7286j11998n5898q841J14765R7421J68145
$$ 114077 -38193 242482 272530 23115 -44171 -156169 -212067 -220908 -106143 -8722 159423
14065A59423j43020M2543j47101J13177j02718O3522Q8078Q1501J77648o6552
$$ 159423 16403 58946 -88155 25022 -77696 -14174 73904 155405 333053 266501
14055B66501j48590p2016j19902j64013j01428R3720R0749j03456o9580k4822
$$ 266501 117911 45895 -74007 -238020 -339448 -245728 -154979 -258435 -328015 -352837
14045c52837j08100K02095L91916J08265j59225j18808P408m7310n4981J59869
$$ -352837 -460937 -258842 133074 241339 82114 -36694 -29286 -76596 -131577 28292
14035B8292J9197J04896N827j3786q3183j62981j08481Q7645J73511J6802k57682
$$ 28292 47489 152385 158212 144426 61243 -101738 -210219 -122574 50937 67739 -189943
14024a89943j95194J83275R407n0038j3172J0029M154Q0759j3564J57884K62569
$$ -189943 -385137 -201862 -192455 -242493 -255665 -245636 -241482 -160723 -174287 -16403 246166
14013B46166k2526j80082l6045o3540q5056q9500J7447J71993K66799N0280k03473
$$ 246166 223640 43558 7513 -56027 -141083 -230583 -213136 -41143 225656 275936 72463
14002G2463P020J1585k3483L4927r2548l52626Q5874O1195o0378J4086j36087
$$ 72463 79483 91068 67585 102512 9964 -342662 -256788 -195593 -255971 -241885 -377972
13991c77972L1339K34790J72060M8981r8664J41253O9165J6512j41062l19598
$$ -377972 -346633 -111843 60217 109198 10534 151787 220952 237464 96402 -223196
13981b23196j39569M4179O1809o3465J73310J00097K10298N0321M4370j34915
$$ -223196 -362765 -318586 -256777 -320242 -146932 -46835 163463 213784 258154 123239
13971A23239j95006l568J48158J18534j59903N0587Q3078K65809O1801l0967J8982
$$ 123239 -71767 -75335 72823 191357 31454 82041 165119 430928 492729 461762 480744
13960D80744K10047n0862j44587j88397j50400m3640j88843j77507J0042J96513
$$ 480744 690791 639929 495342 306945 156545 112905 -75938 -253445 -243403 -46890
13950d6890K06265J12370k09319o1278j08323o8092q9099o6990j1699J65044P2894
$$ -46890 159375 271745 62426 1148 -107175 -175267 -264366 -331356 -343055 -178011 -105117
13939a05117K43194L47008j39678k66171N4093K87674j20316j07210k10646m5789
$$ -105117 138077 485085 345407 79236 133329 421003 300687 193477 -17169 -62958
13929f2958M1098Q5136J14258j70336j19569k5867j51397j31008k8669R990K77662
$$ -62958 -21860 63276 177534 7198 -112371 -138238 -289635 -420643 -449312 -439322 -161660
$$ [...]
##END NTUPLES=NMR SPECTRUM
##END=
