##TITLE=Analysis number 320161
Compound Code cc 19906
Book Reference 464/38/3
Project Code adrs
Chemist Name chrisr
##JCAMPDX= 6.0         $$ Bruker NMR JCAMP-DX V2.0
##DATA TYPE= NMR SPECTRUM
##DATA CLASS= NTUPLES
##ORIGIN= Bruker BioSpin GmbH
##OWNER= nmr
$$ XWIN-NMR		Version 3.5
$$ Thu Jun 15 08:34:42 2006 GMT Daylight Time (UT+1h)  MAYBRIDGE\nmr@NMR_250MHZ
##.OBSERVE FREQUENCY= 250.131544655141
##.OBSERVE NUCLEUS= ^1H
##.ACQUISITION MODE= SIMULTANEOUS (DQD)
##.ACQUISITION SCHEME= undefined
##.AVERAGES= 16
##.DIGITISER RES= 18
##SPECTROMETER/DATA SYSTEM= dpx250
##.PULSE SEQUENCE= zg30
##.SOLVENT NAME= CDCl3
##.SHIFT REFERENCE= (INTERNAL, CDCl3, 0, 16.522)
##AUDIT TRAIL= $$ (NUMBER, WHEN, WHO, WHERE, WHAT)
$$ ##TITLE= Audit trail, XWIN-NMR		Version 3.5
$$ ##JCAMPDX= 5.01
$$ ##ORIGIN= Bruker BioSpin GmbH
$$ ##OWNER= nmr
$$ C:\u/data/dgb/nmr/ADRS/810/pdata/1/auditp.txt
$$ ##AUDIT TRAIL=  $$ (NUMBER, WHEN, WHO, WHERE, WHAT)
(   1,<2006-06-15 08:34:19.93 +100>,<MAYBRIDGE\nmr>,<NMR_250MHZ>,
      <created by zg, POWCHK disabled, PULCHK disabled
       configuration hash MD5:
       E2 DF 36 D8 04 B2 41 60 5A D7 A3 38 5A 4B D0 FE
       data hash MD5: 64K
       1F 73 30 F1 C1 30 4A 17 96 EE 68 65 9C B2 1F 56>)
(   2,<2006-06-15 08:34:31.65 +100>,<MAYBRIDGE\nmr>,<NMR_250MHZ>,
      <Start of raw data processing
       ef LB = 0.3 FT_mod = 6 PKNL = 1 SI = 32K 
       data hash MD5: 32K
       1B 8F 93 FD D3 71 20 C4 4A 6B 56 C1 86 19 A3 AC>)
(   3,<2006-06-15 08:34:33.17 +100>,<MAYBRIDGE\nmr>,<NMR_250MHZ>,
      <apk 
       data hash MD5: 32K
       28 50 86 BB 54 47 90 A1 91 95 92 0A 3A 6F C7 26>)
(   4,<2006-06-15 08:34:33.97 +100>,<MAYBRIDGE\nmr>,<NMR_250MHZ>,
      <abs ABSG = 5 
       data hash MD5: 32K
       D8 9C CC A3 4E D1 09 D6 3F 81 E2 F7 3B 49 E2 47>)
$$ ##END=
$$ 
$$ hash MD5
$$ 07 89 63 B4 1B 62 67 BC E5 00 36 AF 33 28 68 5A
##$RELAX= 
##$RELAX= 
##$RELAX= 
##$RELAX= 
##$RELAX= 
##$RELAX= 
##$RELAX= 
$$ Bruker specific parameters
$$ --------------------------
##$DU= <C:\u>
##$EXPNO= 810
##$NAME= <ADRS>
##$PROCNO= 1
##$TYPE= <nmr>
##$USER= <dgb>
##$AMP= (0..31)
100 100 100 100 100 100 100 100 100 100 100 100 100 100 100 100 100 100 
100 100 100 100 100 100 100 100 100 100 100 100 100 100 
##$AQSEQ= 0
##$AQ_mod= 3
##$AUNM= <au_zg>
##$AUTOPOS= <24 >
##$BF1= 250.13
##$BF2= 250.13
##$BF3= 250.13
##$BF4= 250.13
##$BF5= 500.13
##$BF6= 500.13
##$BF7= 500.13
##$BF8= 500.13
##$BYTORDA= 1
##$CFDGTYP= 0
##$CFRGTYP= 5
##$CHEMSTR= <none>
##$CNST= (0..31)
1 1 145 1 1 1 1 1 1 1 1 1 1 1 1 1 1 1 1 1 1 1 1 1 1 1 1 1 1 1 1 1 
##$CPDPRG= <>
##$CPDPRG1= <>
##$CPDPRG2= <>
##$CPDPRG3= <>
##$CPDPRG4= <mlev>
##$CPDPRG5= <mlev>
##$CPDPRG6= <mlev>
##$CPDPRG7= <mlev>
##$CPDPRG8= <mlev>
##$CPDPRGB= <>
##$CPDPRGT= <>
##$D= (0..31)
0 1 0 0 0 0 0 0 0 0.06 0 0 0 0 0 0 0.0002 0 0 0 0 0 0 0 0 0 0 0 0 0 0 
0 
##$DATE= 1150356858
##$DBL= (0..7)
120 120 120 120 120 120 120 120 
##$DBP= (0..7)
150 150 150 150 150 150 150 150 
##$DBP07= 0
##$DBPNAM0= <>
##$DBPNAM1= <>
$$ [...]
##$SUBNAM7= <"">
##$SUBNAM8= <"">
##$SUBNAM9= <"">
##$SW= 20.6930455092707
##$SWIBOX= (0..15)
0 0 3 0 0 0 0 0 0 0 0 0 0 0 0 0 
##$SW_h= 5175.983436853
##$TD= 65536
##$TD0= 1
##$TE= 294.16
##$TE2= 300
##$TE3= 300
##$TEG= 300
##$TL= (0..7)
0 120 120 120 120 120 120 120 
##$TP= (0..7)
150 150 150 150 150 150 150 150 
##$TP07= 0
##$TPNAME0= <>
##$TPNAME1= <>
##$TPNAME2= <>
##$TPNAME3= <>
##$TPNAME4= <>
##$TPNAME5= <>
##$TPNAME6= <>
##$TPNAME7= <>
##$TPOAL= (0..7)
0.5 0.5 0.5 0.5 0.5 0.5 0.5 0.5 
##$TPOFFS= (0..7)
0 0 0 0 0 0 0 0 
##$TUNHIN= 0
##$TUNHOUT= 0
##$TUNXOUT= 0
##$USERA1= <user>
##$USERA2= <user>
##$USERA3= <user>
##$USERA4= <user>
##$USERA5= <user>
##$V9= 5
##$VALIST= <valist>
##$VCLIST= <CCCCCCCCCCCCCCC>
##$VD= 0
##$VDLIST= <DDDDDDDDDDDDDDD>
##$VPLIST= <PPPPPPPPPPPPPPP>
##$VTLIST= <TTTTTTTTTTTTTTT>
##$WBST= 1024
##$WBSW= 4
##$XGAIN= (0..3)
0 0 0 0 
##$XL= 0
##$YL= 0
##$YMAX_a= 541896
##$YMIN_a= -633648
##$ZGOPTNS= <>
##$ZL1= 120
##$ZL2= 120
##$ZL3= 120
##$ZL4= 120
##$ABSF1= 16.522
##$ABSF2= -4.171173
##$ABSG= 5
##$ABSL= 3
##$ALPHA= 0
##$AQORDER= 0
##$ASSFAC= 0
##$ASSFACI= 0
##$ASSFACX= 0
##$ASSWID= 0
##$AUNMP= <proc_1d>
##$AZFE= 0.1
##$AZFW= 0.1
##$BCFW= 0
##$BC_mod= 0
##$BYTORDP= 0
##$COROFFS= 0
##$CY= 12.5
##$DATMOD= 1
##$DC= 0
##$DFILT= <>
##$DTYPP= 0
##$F1P= 14.0000005364418
##$F2P= -0.99999901652339
##$FCOR= 0.5
##$FTSIZE= 32768
##$FT_mod= 6
##$GAMMA= 0
##$GB= 0
##$INTBC= 1
##$INTSCL= 1
##$ISEN= 128
##$LB= 0.3
##$LEV0= 0
##$LPBIN= 0
##$MAXI= 10000
##$MC2= 0
##$MEAN= 0
##$ME_mod= 0
##$MI= 0
##$NCOEF= 0
##$NC_proc= -5
##$NLEV= 6
##$NOISF1= 0
##$NOISF2= 0
##$NSP= 0
##$NTH_PI= 0
##$NZP= 0
##$OFFSET= 16.522
##$PC= 1
##$PHC0= 172.3652
##$PHC1= 5.405283
##$PH_mod= 1
##$PKNL= yes
##$PPARMOD= 0
##$PSCAL= 4
##$PSIGN= 0
##$REVERSE= no
##$SF= 250.13
##$SI= 32768
##$SIGF1= 0
##$SIGF2= 0
##$SINO= 400
##$SIOLD= 32768
##$SREGLST= <1H.CDCl3>
##$SSB= 0
##$STSI= 32768
##$STSR= 0
##$SW_p= 5175.98343685301
##$SYMM= 0
##$S_DEV= 0
##$TDeff= 65536
##$TDoff= 0
##$TI= <Analysis number 999999
Compound Code 99
Book Reference 9
Project Code 9>
##$TILT= no
##$TM1= 0
##$TM2= 0
##$TOPLEV= 0
##$USERP1= <user>
##$USERP2= <user>
##$USERP3= <user>
##$USERP4= <user>
##$USERP5= <user>
##$WDW= 1
##$XDIM= 32768
##$YMAX_p= 402940486
##$YMIN_p= -264890
$$ End of Bruker specific parameters
$$ ---------------------------------
##NTUPLES= NMR SPECTRUM
##VAR_NAME=  FREQUENCY,     SPECTRUM/REAL,   SPECTRUM/IMAG
##SYMBOL=    X,             R,               I
##VAR_TYPE=  INDEPENDENT,   DEPENDENT,       DEPENDENT
##VAR_FORM=  AFFN,          ASDF,            ASDF
##VAR_DIM=   32768,         32768,           32768
##UNITS=     HZ,            ARBITRARY UNITS, ARBITRARY UNITS
##FACTOR=    0.157963299565203, 1,           1
##FIRST=     4132.6476996994, 0,             0
##LAST=      -1043.33573715361, 0,           0
##MIN=       -1043.33573715361, -264890,     0
##MAX=       4132.6476996994, 402940486,     0
$$ Real data points
##PAGE= N=1
##DATA TABLE= (X++(R..R)), XYDATA
$$ [...]
16853D9352k2495O6012j5617j6655L4869R009m8357k3545k4021j1956N8655j4356
16841D0895m771J2378P757J0208K3247J4116m8579m9020R826N1980m292l5699
16829B8046K6603k4878M3648n538k6844k1123K5500l0487k3197p216P113L3921
16817B5548N3886K7089l4616n4606Q512K4335k366K0694J6085j8514l3457K4398
16805E6988j236J3395o091k0984j7288k7795L533O3816R92j0272J5518n982N587
16792G0181k0579q078l9558k0258m062j4773J0275K1213L6413q054j0528O12L0332
16779D3136R108m312l9103l8785Q4626j928k7725O0318J1215L5287m0719o3529
16767B7589l6841K2185N6822q770l5600J2238m059m2609l3415k5050k0813R265
$$ plain form
16853 49352 26857 92869 77252 60597 95466 104475 56118 32573 8552 -3404 55251 40895
16841 40895 36124 48502 56259 66467 89714 103830 55251 6231 16057 68037 63745 28046
16829 28046 54649 29771 73419 67881 41037 19914 45414 14927 -8270 -15486 -8373 25548
16817 25548 79434 106523 71907 17301 25813 50148 47782 68476 84561 66047 32590 56988
16805 56988 55752 69147 63056 42072 24784 -3011 522 64338 65330 55058 70576 64594 70181
16792 70181 49602 41524 1966 -18292 -22354 -37127 -26852 -5639 30774 22720 12192 12804 43136
16779 43136 52244 47932 8829 -29956 54670 52742 25017 85335 96550 131837 91118 27589
16767 27589 -9252 12933 69755 60985 25385 37623 33564 -9045 -42460 -67510 -88323 -79058
16755g9058Q7243K6226m3910N692J4663l1545j4283M3377l454k4899K864J6427
16743f57l329K502M4853K1771O007Q19l7443k7399J6687L8447M7811P957n9390
16730E8636m8406j1227p8511k4297N6295N4244p112m44j9924j1662K6430N6559
16718E0581j6279n009O016L1850k8636k2839j0179L6318p216l5038J1308L9218
16706E0095o895k4425J5205p246L3108n4631k2058J7866J6556l7626k3102N7520
16694A4367K7347L0696P203j5548j7335K6256L3434j7490q576k3663j0521k7811
16682A8359k0569Q0382O6280j7142o9287q4422k9305J7742j6798L529r739K0085
16670d0885K3844J8322L1943j5252L6235j5683j6628j6527o7264j2778N5644l382
$$ plain form
16755 -79058 8185 34411 -9499 -3807 10856 -20689 -34972 8405 4951 -19948 -17084 -657
16743 -657 -3986 -1484 43369 65140 71147 71966 34523 7124 23811 62258 110069 118026 58636
16730 58636 10230 -997 -79508 -103805 -47510 6734 -378 -822 -20746 -32408 -5978 50581
16718 50581 34302 29293 35309 67159 38523 15684 5505 41823 34607 -431 10877 50095
16706 50095 43200 18775 33980 26734 59842 5211 -16847 1019 17575 -20051 -43153 14367
16694 14367 41714 72410 79613 64065 46730 72986 106420 88930 80354 56691 46170 18359
16682 18359 -2210 78172 144452 127310 58023 -26399 -55704 -37962 -54760 -51231 -60970 -40885
16670 -40885 -17041 1281 33224 17972 54207 38524 21896 5369 -61895 -74673 -19029 -22411
16658b2411N63N8073J27q7933k5131K7780o829P603N0766n948j1385k950o1517
16645g9192K2564k230P669L2331O0282P202m0434k8568l6408k0941M9492L5326
16633G093q059m7932K5471K7878K8473n9235j7100m4780l2892J4416K1804M4549
16621d0314P4964K2098l231k2001N3144M5383j893j7258p6037m7883N398j5447
16609b3077n6956m3076L4056L3460M1497J140k893L7978L4761Q3531o4906j3914
16597F1601L0181n7435l3511K1437N3540l580p353j5358k3342j396K7887M20j4205
16584C8886j4582K5511K9142R399J8368j5797n3221l1415J52r733m9218J8052
16572c4456J2529L5911N7350m4355j1176J7244m3915M1023K3677L5111O272p212
$$ plain form
16658 -22411 -21848 36225 36352 -51581 -76712 -48932 -55761 -48158 2608 -3340 -14725 -17675 -79192
16645 -79192 -56628 -58858 -51189 -18858 41424 48626 8192 -20376 -56784 -77725 -28233 7093
16633 7093 -966 -48898 -23427 4451 32924 -26311 -43411 -88191 -121083 -106667 -84863 -40314
16621 -40314 34650 56748 53517 31516 84660 130043 128150 110892 34855 -13028 -7630 -23077
16609 -23077 -80033 -123109 -89053 -55593 -14096 -12956 -15849 22129 56890 140421 75515 61601
16597 61601 91782 34347 836 22273 75813 72233 64880 49522 26180 24784 52671 53091 38886
16584 38886 24304 49815 78957 88356 106724 90927 37706 6291 6443 -3290 -52508 -34456
16572 -34456 -21927 13984 71334 26979 15803 33047 -10868 30155 53832 88943 95215 88003
16560H8003m868k959K5657k0980l8848J3404j2734J953m8527k4031M6297L1825
16548E4192L1950l3870n4890K2537j6738k3954j6358P46J6551m3923L2984L096
16536b7677J8389M5807L6526M5711n12m0209k5298L5778j9872m913M0177m6218
16524E7689m5331M2077L1409k5405M698k7533J2943M1899O2873m3133o0172R661
16512F1675R932k8768l9087K8381J7334l3338N511J9656j089p7940p405N8028
16500A2890m914k8535n2229J1678L0083k8721K4975J2219l5939j9157M4044M7498
16488A3892J1446K3800k3627n0452L7142K694o563K2370K0099m2110J6362J9603
16476D4656j4123P172J413K1705m2300o1690K2465M1429k400n455j0243p4905
$$ plain form
16560 88003 83135 80176 105833 84853 46005 59409 46675 48628 101 -23930 22367 54192
16548 54192 86142 52272 -2618 19919 3181 -20773 -37131 -36385 -19834 -63757 -30773 -27677
16536 -27677 -9288 36519 73045 118756 118244 78035 52737 88515 68643 63730 103907 57689
16524 57689 12358 54435 85844 60439 65137 37604 50547 92446 155319 112186 52014 61675
16512 61675 71607 42839 3752 32133 49467 16129 21640 41296 40207 -37733 -45138 12890
16500 12890 7976 -20559 -72788 -61110 -31027 -59748 -34773 -22554 -58493 -77650 -33606 13892
16488 13892 25338 49138 25511 -24941 12201 14895 8332 30702 50801 8691 25053 44656
16476 44656 30533 37705 39118 60823 18523 -43167 -20702 20727 18327 12872 2629 -72276
16464g2276k4091O4282k182k1467K8266K1305M6210J1126l3988n5287M651K7064
16452f387l6625n0345j2594J5623N3438M0607M084L0897Q01l1614m4512q184J2693
16439c2118N487q196J177M6988J3342l8505r624L0775O2894l1997n3583M655k3310
16426c2015K0955M7478K7683K4558p440k6142l314q74P569J3992n137M911J1204
16413H3428Q491j2719o023k4377n0495p5751k7278M2932N0265J2908l827M3825
16401D1379J8362K187J710J8763j7807n5742L3590N0959R271l6544j5071R589
16389F0646J1474n1246m8458J3150N8640K03m760j1024j8428j5610k8905n269
16377c9587J5562L2114K9338N1743J1838o656O154m7266k3113m2576n104J7177
$$ plain form
16464 -72276 -96367 -32085 -34267 -55734 -27468 -6163 40047 51173 17185 -38102 -33451 -6387
16452 -6387 -43012 -93357 -105951 -90328 -36890 3717 7801 38698 39499 7885 -36627 -44811 -32118
16439 -32118 -26631 -34827 -33650 13338 26680 -11825 -21449 9326 72220 40223 -13360 -8705 -32015
16426 -32015 -11060 36418 64101 88659 81219 55077 51763 50889 58458 72450 67313 72224 83428
16413 83428 91919 79200 73177 48800 -1695 -77446 -104724 -61792 -11527 1381 -2446 41379
16401 41379 59741 61928 63638 82401 64594 8852 42442 93401 102672 66128 51057 60646
16389 60646 72120 20874 -27584 -14434 44206 44409 39649 28625 10197 -5413 -34318 -39587
16377 -39587 -24025 8089 37427 89170 101008 94352 100506 53240 30127 -12449 -17553 -376
16365c76J1615Q152P228L970K0576k1732m3788J2312R1904K0764N791K843m9798
16352F9461n8693K1818L5983j1980k4942k3729j7658j4043O754J4144Q241p455
16340b099O4790R2111l1767o5088q3857P660Q665M4166J0534m1325l7736K5450
16328h496M8845L9769m070J5915o198L5338P239l3496q1640L5972j6634n1119
16316a8575N621N714Q77M784j1675p590m0417J5381j5005K7205K560p4280Q886
16303i6514P3662J3278l7016J6515P6720j4610O792k1638j4531j1424J4097m196
16291A135n6582L9049M2907k9145J1137j0057P332l326l622l358K6017J5062n066
16278C1483J4722K8947m0045l7584l0457l120J7842K2908n0213O0845j297o456
$$ plain form
16365 -376 11239 19391 26619 30589 51165 29433 -14355 -2043 89861 110625 116416 119259 69461
16352 69461 10768 32586 68569 56589 31647 7918 -9740 -23783 -17029 -2885 5356 -2099
16340 -2099 62691 154802 123035 57947 -25910 -18250 -9585 34581 45115 3790 -33946 -8496
16328 -8496 40349 80118 76048 91963 85765 121103 128342 94846 13206 49178 32544 -18575
16316 -18575 -12954 -7240 -6363 -1579 -13254 -20844 -61261 -45880 -60885 -33680 -31120 -105400 -96514
16303 -96514 -22852 -9574 -46590 -30075 46645 32035 38827 17189 2658 -8766 5331 1135
16291 1135 -55447 -16398 26509 -2636 8501 -1556 5776 2450 -1172 -4530 21487 36549 31483
16278 31483 46205 75152 35107 -2477 -32934 -36054 -18212 4696 -45517 15328 14031 7575
16266G575j9180p6598l4469O2325M4848k7908J3267L5969r197J8207L0953m5827
16254c5j1963j73K8912N2801k1964l551L0407k3603l2989M9083R866m4162K9349
16241F1978P965n4173l4301j6340l0034J4420M9506m1929J7402k1887j2234l3949
16229i3576j4502J6392J0986L6060L5752L4033k7526l4021j4872M3770k037k1334
16217c0875k6975j6003k3994m719l0070k370P3061K7613M899j5837L8309K4300
16205A7339R463l8206j5032k4581l393P6569k8945l8354k3097M8160K3788K9159
16193C2870j2632m1868J8576L4288L8689K863p2644p9913J2183L5768L1325O381
16181E886J8538K7171l1598p9910j602K6085l0720Q6517O0642m2364l2532o781
$$ plain form
16266 7575 -11605 -88203 -122672 -60347 -15499 -43407 -30140 5829 -3368 14839 45792 -35
16254 -35 -11998 -12171 16741 69542 47578 44027 74434 50831 17842 66925 76791 32629 61978
16241 61978 69943 15770 -18531 -34871 -64905 -50485 -979 -42908 -25506 -47393 -59627 -93576
16229 -93576 -108078 -91686 -80700 -44640 -8888 25145 -2381 -36402 -51274 -7504 -9541 -30875
16217 -30875 -57850 -73853 -97847 -102566 -132636 -135006 -61945 -34332 -29433 -45270 -6961 17339
16205 17339 26802 -11404 -26436 -51017 -54410 22159 -6786 -45140 -68237 -20077 3711 32870
16193 32870 20238 -21630 -3054 31234 69923 72786 142 -79771 -67588 -31820 -495 5886
16181 5886 24424 51595 19997 -59913 -61515 -35430 -66150 20367 81009 38645 6113 -668
16169f68n303J8058L114K3640l3683p3722O1621N6989p125k16M4329l5685p2207
16156b0858m66K1548m4510K2868k776K3873J3491k9839L2275k7312m1950j291
16144e4947k4454n7567N8028l3604O9J0677J5582j2753l6393K4080L8771K3562
16132d8949p140M2816K7121O338k7649O2272j3704J0172k8268m6153O0868J8856
16120E6580j1838k7227m957l8277m934K5877n6499k3068K3618K4317K5313J3220
16108B125k2912J843K547K4778j8444K5722J3247P682m5830l5313J0860Q3034
16096D9339l8831l5540r331k5662J1460N4202K3704J3635k1117k1347J5407K0554
16084C6473l359k6569K6686q253j9546j9697k1839m6240L844o394q545k2921N3273
$$ plain form
16169 -668 -5971 12087 15201 38841 5158 -68564 -6943 50046 42921 42705 87034 51349 -20858
16156 -20858 -21324 224 -44286 -21418 -24194 -321 13170 -16669 15606 -11706 -53656 -54947
16144 -54947 -79401 -136968 -78940 -112544 -112475 -101798 -86216 -98969 -135362 -111282 -72511 -48949
16132 -48949 -56089 -13273 13848 20186 -7463 54809 41105 51277 23009 -23144 37724 56580
16120 56580 44742 17515 12558 -25719 -30653 -4776 -61275 -84343 -60725 -36408 -11095 2125
16108 2125 -20787 -18944 -16397 8381 -10063 15659 28906 36588 -9242 -44555 -33695 49339
16096 49339 10508 -25032 -34363 -60025 -48565 5637 29341 42976 21859 512 15919 36473
16084 36473 33114 6545 33231 24978 5432 -14265 -36104 -82344 -78500 -84894 -93439 -116360 -63087
16071f3087M9642l966K949J1643j0618L9502L2592m2280p905k2562p4036K6655
16059f1471O5776P636L0612k724O710K8883J9962L4195m6438K5268O316j3801
16047A00924m570k8342k0873k1125k4049k8403j5443N466L7710L3387M5295M974
16035H4951o478n0895J2248R5139L0999k4469n9133o3802k8832L0049L5097J6227
16023G1101m2683o2121n505M4665N458Q215K4020k430R565m1218R011o765M9385
16010F0698K8742q1637o9449k6025k0831O1227M9879j552K1138l4Q996M230k0794
15997A4588J5567k0782k1929n7578k3646L3027K5886O4316Q860l6690k1633J8776
15985a238K2314P565L294k8344p485j0708m27J8097j9313l806m5556j3620K3841
$$ plain form
16071 -63087 -13445 -17411 -14462 -2819 -13437 26065 58657 16377 8472 -14090 -88126 -61471
16059 -61471 4305 11941 42553 39829 46539 75422 95384 129579 83141 108409 114725 100924
16047 100924 96354 68012 47139 26014 1965 -26438 -41881 -36415 1295 34682 79977 84951
16035 84951 78473 27578 39826 134965 165964 141495 82362 18560 -10272 19777 54874 71101
16023 71101 28418 -33703 -39208 5457 10915 19130 43150 40720 50285 9067 18078 11313 60698
16010 60698 89440 7803 -61646 -87671 -108502 -47275 2604 1052 22190 22156 31152 35382 14588
15997 14588 30155 9373 -12556 -70134 -93780 -60753 -34867 29449 38309 1619 -20014 -1238
15985 -1238 21076 28641 31935 3591 -3894 -14602 -15029 3068 -16245 -20051 -65607 -79227 -55386
15972e5386L0131l0597o856K5733k0424j7833N772j6161M3833N9496r832J9349
15960B7225M6797l8441j4616l4023k8260L7551m8908n3454R1958M9807r2777j4229
15948g1370P2814K0385Q424M4803l9421q225K0298L9667K9290j3357m4424M8691
15936A07575O574n0523l52K169n8401O375n002j0300p1242j1560N5051R482l1384
15923e1538j1176K5803J0534J3296l1592p0048l8865M9227N7403J6789l9592O8149
15911a610O133n5807j8205M9528n302M7615j2351l5294l09l594l3878n0855O587
15898a07342M4465r045p5773q023N0147N5542K3680o8121L2204P6925k1937l6337
15886d3615Q298j6300K879M1750j993m2322L5089K8079o1162l5968k374P5505
$$ plain form
15972 -55386 -25255 -55852 -62708 -36975 -57399 -75232 -69460 -85621 -41788 17708 7876 27225
15960 27225 74022 35581 20965 -13058 -41318 -3767 -52675 -106129 -14171 35636 -57141 -71370
15948 -71370 1444 21829 30253 75056 35635 27410 47708 87375 116665 103308 58884 107575
15936 107575 114149 63626 63274 65443 7042 13417 8415 -1885 -73127 -84687 -29636 -20154 -51538
15923 -51538 -62714 -36911 -26377 -13081 -44673 -114721 -153586 -104359 -46956 -30167 -69759 -1610
15911 -1610 4523 -51284 -69489 -19961 -25263 22352 10001 -25293 -25602 -29196 -63074 -113929 -107342
15898 -107342 -62877 -71922 -147695 -155718 -105571 -50029 -26349 -94470 -62266 14659 -7278 -43615
15886 -43615 -35317 -51617 -48738 -6988 -8981 -51303 -16214 11865 -49297 -85265 -87639 -12134
15874a2134P3899P267k2709j4311J2097K706O1379j8330o5413l8474l0690l8114
15862h2827P163l1838K1570K4456J3096M2j2752M529k3980j3197M9530L6061m76
15849h623M9490J8347k1858j8817m6865m4040j3442K1480M6572j361k1764l8822
15837g9703J9870K1476N0716N6385n1608k215k5494l9949R178O194L3742k7841
15825b9249q821j647M4094M2787p8977n8389l1732Q1429J1679K3799L5073J0444
15813D0490J2752m210j3897j7898O691m090q2600k9680O2211L5742K1424k9013
15801b078n9953K1772m9926M0993N3209l167j3587K2084L1605m0800l5769k2384
15789e8001J5050L8374k0451r106l1556R770K2897K5026J4626r328J9609N5530
$$ plain form
15874 -12134 61765 69032 46323 32012 44109 46815 108194 89864 24451 -14023 -44713 -82827
15862 -82827 -75664 -107502 -85932 -61476 -48380 -48338 -61090 -56561 -80541 -93738 -44208 -8147 -8623
15849 -8623 40867 59214 37356 18539 -28326 -72366 -85808 -64328 -17756 -19117 -40881 -79703
15837 -79703 -59833 -38357 12359 68744 17136 14921 -10573 -50522 -41344 -35150 -1408 -29249
15825 -29249 -38070 -39717 4377 47164 -31813 -90202 -121934 -40505 -28826 -5027 30046 40490
15813 40490 53242 49032 35135 17237 23928 19838 -62762 -92442 -30231 5511 26935 -2078
15801 -2078 -62031 -40259 -90185 -49192 4017 850 -12737 9347 40952 152 -35617 -58001
15789 -58001 -42951 -4577 -25028 -34134 -65690 -55920 -33023 -7997 6629 -2699 16910 72440
15777G2440k0701o1667o7509K0930O1469m448q6218J0539L062q245l4923K1797
15765i3474L0924L3013o178r25K0729j0276r603P03K6268m9830M9504K6369J2823
15752C0047J6074o5616l8721k3045R435M3924J4349J6689M5206K078m9700j4973
15740a4253J2820k8761nJ9755M3693K0259Q3204J5152k1238r7222l3075J6161
15728A6490j4891J525M6618L8326k3131m5466j3621r361L4325k1469p9730Q493
15716f1892J1392K6415P3459k1109l6108N2694l288p150j2613q2148k783N4595
15704h536L1098J2644J7870l6462l7462j0999P701K2346J1564m1903j2382K6644
15692a7877q089o6181m8986L5444j0371P176N2988O2524J2149k1065L1073N5315
$$ plain form
15777 72440 51739 -9928 -77437 -56507 4962 514 -85704 -75165 -72103 -80348 -115271 -93474
15765 -93474 -62550 -29537 -35715 -36640 -15911 -26187 -35790 -35087 -8819 -58649 -9145 17224 30047
15752 30047 46121 -19495 -58216 -81261 -71826 -27902 -13553 3136 48342 50420 720 -14253
15740 -14253 -1433 -30194 -30199 -10444 33249 53508 136712 151864 130626 33404 329 16490
15728 16490 1599 3124 49742 88068 64937 19471 5850 -3511 30814 9345 -70385 -61892
15716 -61892 -50500 -24085 49374 28265 -7843 44851 41563 34413 21800 -60348 -63131 -8536
15704 -8536 22562 35206 53076 16614 -20848 -31847 -24146 -1800 9764 -32139 -44521 -17877
15692 -17877 -25966 -92147 -141133 -105689 -116060 -108884 -55896 6628 18777 -2288 28785 84100
15680H4100J9045k7679l3771j2015k17j406Q222J2149M7144k8832o1381n6951
15668e1592K0458J3420L0930p592j3678L1961j6058l2085k7871M1635M7415j9635
15656A7308k6707k8784k5344K7192K4099K0855m8562p869n925l2471N2599L2626
15644i83L1600j6980J6353L1601l3114p7842n2938M3502K4329M4074r176L0568
15632C0994L511l5717n4090k8070K454J7603O7413L0279j0406j1631o466m9778
15620d3904M3919N2024l292o3998m0521P871L4341o7598k5648M7300N5539n65
15608d532K0449j5762k831K1810n1924l7980m58L2502K203K3882L1124J9772q8509
15595e0254q265M9045O7046J9018l8977l2575n3799o637J2677l4079N3563K3041
$$ plain form
15680 84100 103145 75466 41695 29680 29463 28057 36279 48428 95572 66740 5359 -51592
15668 -51592 -31134 -17714 13216 5624 -8054 23907 7849 -24236 -52107 -10472 36943 17308
15656 17308 -9399 -38183 -63527 -36335 -12236 8619 -39943 -47812 -53737 -86208 -33609 -983
15644 -983 30617 13637 29990 61591 28477 -49365 -102303 -58801 -34472 9602 426 30994
15632 30994 34505 -1212 -55302 -83372 -80918 -63315 4098 34377 23971 12340 5874 -43904
15620 -43904 15 52039 48747 -15251 -55772 -47901 -13560 -81158 -106806 -59506 -3967 -4532
15608 -4532 15917 155 -2676 19134 -32790 -70770 -71228 -38726 -36523 -12641 18483 38255 -50254
15595 -50254 -58519 -9474 57572 76590 37613 5038 -48761 -55398 -42721 -76800 -23237 -196
15583a96k5569N1115N8033l7438J188M4209l745l1240O543P042j2095k9142K1423
15570E0128k5870m546N0917L1715m5240l6902l8403l8702k6409N0598J7823n574
15558b0465M0052J076m0347j9318l3922O275L675j8544M207K5532J5932j8576
15546e4423J643L3576J7338k9466k0398K8678N7940l24o021l4178k626K4996K437
15533A9172k3497J2030M6164J502j9481m3224L3417l9044J1425K6444L3857J536
15521F0301k4826j0877m1607m715J6947M0617n0093k5454k8161k9452M3493P0033
15509A6206N0775n1558m6570k343J5287J921K1759M2524k1938m6461K4518o2277
15497e8157n5004J5447N7136M9062j4062l9272N835j2739q714n7168N2225L1086
$$ plain form
15583 -196 -25765 25350 83383 45945 47133 91342 87597 56357 62900 69942 57847 28705 50128
15570 50128 24258 19712 70629 102344 57104 20202 -18201 -56903 -83312 -32714 -14891 -20465
15558 -20465 19587 20663 -19684 -39002 -72924 -66649 -62974 -81518 -77311 -51779 -35847 -54423
15546 -54423 -52780 -19204 -1866 -31332 -51730 -23052 34888 34564 28543 -5635 -8261 16735 19172
15533 19172 -4325 7705 53869 55371 35890 -7334 26083 -12961 -1536 24908 58765 60301
15521 60301 35475 24598 -17009 -21724 -4777 35840 -14253 -39707 -67868 -97320 -53827 16206
15509 16206 66981 15423 -31147 -33490 -18203 -16282 5477 48001 26063 -20398 4120 -58157
15497 -58157 -113161 -97714 -40578 8484 -5578 -44850 -39015 -51754 -60468 -117636 -65411 -34325
15485c4325K1219J1266m127j519K357j2590J9136o671o6914L977Q818J8751N865
15472c4757J9103K4619M2137k4098J136k3727k0167L8784n2464o9379M0068K4897
15460c3848j3336J9331K3855j6271l4543J0000K1474M113j1539L5207M6476n655
15448D5264m1433j129o2044k4500O008N4488O167o2468j6239L5360K55k5346L661
15435h1956J782J1372M9230J902o0405k7968J6234J9215J7746O2694L6752N4259
15423A00857K1177J9640j2984l6432l7909n9608J205J6320Q406l0069l8079K0781
15411b6695Q941J1947j4209J5754K8911J592N0094j3459m4016k8738O624K2648
15399A9394n2312k1982k4403O4791J8160q7273l5652J3963Q300k98P3326J7611
$$ plain form
15485 -34325 -13106 -1840 -5967 -7486 -5129 -17719 1417 -5254 -72168 -68191 -59373 -40622 -34757
15472 -34757 -15654 8965 51102 27004 28140 4413 -15754 23030 -29434 -98813 -58745 -33848
15460 -33848 -47184 -27853 -3998 -20269 -54812 -44812 -23338 -19225 -30764 4443 50919 45264
15448 45264 3831 2702 -59342 -83842 -77834 -23346 -17179 -79647 -95886 -60526 -60271 -85617 -81956
15435 -81956 -80174 -68802 -19572 -17670 -78075 -106043 -89809 -70594 -52848 9846 46598 100857
15423 100857 122034 141674 128690 92258 54349 -5259 -4054 12266 20672 -9397 -47476 -26695
15411 -26695 -17754 -5807 -20016 -4262 24649 26241 76335 62876 18860 -9878 -3254 19394
15399 19394 -32918 -54900 -79303 -14512 3648 -83625 -119277 -105314 -97014 -97312 -23986 -6375
15387f375o8140N8864O2820l4598L4849p140p3759k9172R693j6821K1943P6782
15375B8946L6237n0006j0605J1633J3362N190l1107L0306j622j6869J016K5007
15363D1488Q304j3954L3176j1567m5124m9122o844j4760j036L9450J179m451l1502
15350e4763k8645k7125K8508P4595K0383n366r952k0545o654m651k4502o5561
15338a24278N866N2566K7238L7107M3298O61O232Q307p3689k5670q482p092k259
15325f0195o7767n9727P602J17952P6691l712k7504m91J072k3682K188j239L3704
15312e108l7797Q629k515j1160l7466m006M8092K4453j627J1139K0029M2206J2198
15299F7067k7407m3362m9114J5868Q0488O4075l9897k6266p2210r911P1349K2246
$$ plain form
15387 -6375 -74515 -15651 47169 12571 47420 40280 -33479 -62651 -52958 -69779 -47836 28946
15375 28946 65183 15177 4572 16205 29567 34757 3650 33956 32334 15465 16481 41488
15363 41488 49792 35838 69014 57447 12323 -36799 -43643 -58403 -59439 -19989 -18810 -23261 -54763
15350 -54763 -83408 -110533 -82025 -7430 12953 7587 -2365 -22910 -29564 -34215 -58717 -124278
15338 -124278 -118412 -65846 -38608 -1501 41797 42458 48690 56997 -16692 -42362 -50844 -57936 -60195
15325 -60195 -127962 -187689 -180087 -62135 14556 10844 -16660 -17151 -16079 -39761 -37573 -38812 -5108
15312 -5108 -42905 -34276 -36791 -47951 -85417 -89423 -41331 -16878 -18505 -7366 12663 54869 67067
15299 67067 39660 -3702 -52816 -36948 43540 107615 67718 41452 -30758 -40669 30680 52926
15287E2926l4900m4783j8032k3084N0878J5353m7889k9828N2500O256J8284p537
15275i856n67m4211k7772M1453M4315J5777R622k6957n8706l5487r829j6830l2168
15262a51216K255l1663J7938J6902K2258L6365L485N910m3976J375L9451J8687
15250f2229L5551J4613Q158l7049P3237P328p5902m1101K8211N5916j5892m2966
15238e2125M9626r352L3491J889k5349K1082l1637p9386M8446K9733J83J0700
15226b699R985j5151M9019m4759q3187Q824K7715k4731j7416n266K9468l7098
15214a05296k647M1115o43J896p490m3330J7108n534p14Q2334K888L4483l186
15201A0984l4942J4672K0247l1244m944k3262L5953k9377l2756K9828P7731K9159
$$ plain form
15287 52926 18026 -26757 -44789 -67873 -16995 -1642 -49531 -79359 -26859 -20603 -2319 -9856
15275 -9856 -10423 -54634 -82406 -40953 3362 19139 28761 1804 -56902 -92389 -102218 -119048 -151216
15262 -151216 -148961 -180624 -162686 -145784 -123526 -87161 -83676 -77766 -121742 -120367 -80916 -62229
15250 -62229 -26678 -12065 -3907 -40956 32281 39609 -36293 -77394 -49183 6733 -9159 -52125
15238 -52125 -2499 -11851 21640 23529 -1820 19262 -12375 -91761 -43315 -13582 -13399 -2699
15226 -2699 7286 -7865 41154 -3605 -86792 -77968 -50253 -74984 -92400 -97666 -68198 -105296
15214 -105296 -107943 -66828 -67471 -65575 -73065 -116395 -99287 -104821 -105535 -23201 -20313 14170 10984
15201 10984 -23958 -9286 10961 -20283 -25227 -48489 -12536 -41913 -74669 -44841 32890 62049
15189F2049q1050k2120K4097K0311J6705j54K507J974l3133N2503j3436n3689
15177b3436L8353K4068j977J9878j9081l6698n196K3907J3741m1918J0114K0392
15165B2147j1340J2768M5150k3061k3833L8264q791m7350k0307k8083K657j447
15153d3226j2209K7022M2893l2823k023L9711j9512M7835N7834m4364j7697K3817
15141F7258j2189m5018j6271L6054Q440m0559p681k8577k3943m6622N391M0207
15129f3510K5152k073K6735M8422L2034J3793m574l5033l2051n85M5437J8305
15117G2052o0785j1666k7181K5116M1117K5879N7315j2378q9531P84L1008J8690
15105G0420o1509j0027L2398m3784k4933m4373m8583L0429O2010M454k1789K2913
$$ plain form
15189 62049 -19001 -41121 -17024 3287 19992 19838 22345 24319 -8814 43689 30253 -23436
15177 -23436 14917 38985 37008 56886 37805 1107 -4089 19818 33559 -8359 1755 22147
15165 22147 10807 23575 68725 45664 21831 60095 51304 3954 -16353 -44436 -41779 -43226
15153 -43226 -55435 -28413 14480 -18343 -20366 19345 -167 47668 105502 61138 43441 67258
15141 67258 55069 10051 -6220 29834 38274 -2285 -9966 -38543 -62486 -109108 -103717 -63510
15129 -63510 -38358 -40431 -13696 34726 66760 80553 75979 40946 8895 8310 53747 72052
15117 72052 11267 -399 -27580 -2464 38653 64532 121847 109469 19938 20722 51730 70420
15105 70420 8911 -1116 31282 -12502 -37435 -81808 -130391 -99962 -37952 -33498 -55287 -32374
15093c2374Q3627J4876j6117r2163j9788J2125p346J2508j0886O595L3394M263
15081a1286l8393m3120R39J9015J025P63L1980M4359r725L3758M5283n482p3186
15068d070k762L4078K3849J4836K3602k1165p7291n2496l0814O430J8771P574
15056e9458J5053K0388K3915l6694j7270K5715O72m0658L0311J4257L4424j5122
15044d467o8046r686K4976J2020L2241m7853m8365k9448R416K0096Q1382J184
15032b6550l584M792K592N825J0851K7382k7450k738M8740N1517m9704n3987q876
15019b1190k5836K5981K5557K0734K207P982L5443R968J6221m0910l4902k5995
15007d740k6656N6708M7536l3576j8630l468R776j0071m4334J564K3593R784J5231
$$ plain form
15093 -32374 51253 66129 50012 -42151 -61939 -49814 -57160 -44652 -55538 -48943 -15549 -11286
15081 -11286 -49679 -92799 -91860 -72845 -71820 -71057 -39077 5282 -4443 29315 74598 69116 -4070
15068 -4070 -6832 27246 51095 65931 89533 68368 -8923 -61419 -92233 -85803 -67032 -59458
15056 -59458 -44405 -24017 -102 -36796 -54066 -28351 -27679 -68337 -38026 -23769 10655 -4467
15044 -4467 -72513 -82199 -57223 -45203 -12962 -60815 -109180 -138628 -129212 -109116 -27734 -26550
15032 -26550 -30134 -25342 -22750 -16925 -6074 21308 -6142 -8880 39860 91377 41673 -12314 -21190
15019 -21190 -47026 -21045 4512 25246 27453 35435 70878 80846 97067 56157 21255 -4740
15007 -4740 -31396 25312 72848 39272 20642 17174 26950 16879 -27455 -25891 -2298 7486 22717
14994B2717l681k2308k0198L5562J4349r6308k9167n621p670K7898O1424j3206
14982c6209P061l7892k1794J9971L2481k5423J4467O094n2683N2326P4408r7L2890
14969F5600n151l9863p8089l2702k5628M6290K2386J6879L1151j5792k4654j5270
14957e4843L4516K3237k9446o6493K0479O3052J1205j6494n9313l2840L314N1880
14945e1746l9119Q997Q8836K3462k4770j0701n2045O0208M9336k940o5614n3104
14933f9200r665N7897M7340j0098o9029j5769K2226K9672k8239J6020j1509k8846
14921f9200O2828J9671J0794l0443m6643K8964n73n9008N115M155m1705j6693
14909a32738M4867Q4858N4842Q587n1149k0818n790o6458J5716M5110L826P331
$$ plain form
14994 22717 19036 -3272 -23470 12092 26441 -69867 -99034 -104655 -112325 -84427 -23003 -36209
14982 -36209 -29148 -67040 -88834 -68863 -36382 -61805 -47338 -41244 -93927 -41601 32807 32710 65600
14969 65600 60449 20586 -57503 -90205 -115833 -69543 -47157 -30278 873 -14919 -39573 -54843
14957 -54843 -20327 2910 -26536 -93029 -72550 -9498 1707 -14787 -74100 -106940 -103626 -51746
14945 -51746 -90865 -81868 6968 30430 5660 -5041 -57086 3122 52458 49518 -16096 -69200
14933 -69200 -78865 -20968 26372 16274 -52755 -68524 -46298 -16626 -44865 -28845 -40354 -69200
14921 -69200 -6372 13299 24093 -6350 -52993 -24029 -24602 -83610 -78495 -74340 -116045 -132738
14909 -132738 -87871 -3013 51829 60416 9267 -11551 -17341 -83799 -68083 -22973 -19147 -11816
14897a1816j7748L6166P3806L6807k1434j9161l5974j6914j6496l591J5548K4700
14885D3893j0966n2852l9045k7026m0665Q818P3096j4052J5340k0827J4002M6817
14873c467P004L8326q117J585m7253k3783k902m7604L656j4548p837M3483M5041
14860a6416K902K205j8941l7660J9283O3736J6284q655M8856N0663o0536k4864
14848C6857o8675n1532m4431k6182L0248r8322m2853Q2247Q3015M7323L4014k012
14836b0303K5686j1552J5272J3567l3678L3567l5598k7121k8192q637J7137K1937
14824c7915K3396M0917n0281n0120p060j5644K0787K7372O487L4031J8793j4121
14812c358j8458K0377M7790J2077k1926n3035j2200p891N923l0916K5944L1010
$$ plain form
14897 -11816 -29564 6602 80408 117215 95781 76620 40646 23732 7236 3645 19193 43893
14885 43893 32927 -19925 -58970 -85996 -126661 -117843 -44747 -58799 -43459 -64286 -50284 -3467
14873 -3467 3537 41863 33746 35331 -11922 -35705 -38607 -86211 -82555 -97103 -104940 -61457 -16416
14860 -16416 -13514 -11309 -30250 -67910 -48627 15109 31393 22738 71594 122257 61721 36857
14848 36857 -31818 -83350 -127781 -153963 -123715 -222037 -264890 -182643 -99628 -52305 -18291 -20303
14836 -20303 5383 -6169 9103 22670 -11008 22559 -13039 -40160 -68352 -76989 -59852 -37915
14824 -37915 -14519 26398 -23883 -74003 -81063 -96707 -75920 -48548 -42061 -8030 10763 -3358
14812 -3358 -21816 -1439 46351 58428 36502 -16533 -28733 -36624 -30701 -61617 -35673 -4663
14800d663j1642p2922l7925O2732J3560n7475r305M5635P2473K3833j5905j3873
14788e477O28J9849L7743J2393l1586p6245J7933L9531p4397j6329o205N2J4471
14775f7639K2963K1564N7452L3845k1027l9751k8754L1705M9445m0157n0144N81
14763b9917L9400K079J9487N5694j2370o1509k3823K7893m94o2231n2008l955
14751a01754K0218l9405K5168M3578j4713l7608j0581P6269O6130N3693k2306
14740E8689j1444m2712l1524j9970j5117J5972J717L1464N4618J7492J1972j8873
14728E2284l0143J8498L8204k1052m9498J3413K4902M8436j8612L3998m0591q033
14716F1806NJ0604N1225J701r3992N743J1620L8246p7978q046J9675L6518K6546
$$ plain form
14800 -4663 -16305 -89227 -127152 -64420 -50860 -108335 -117640 -72005 468 24301 8396 -5477
14788 -5477 -4849 15000 52743 65136 33550 -42695 -24762 14769 -59628 -75957 -82162 -82110 -67639
14775 -67639 -44676 -23112 34340 68185 47158 7407 -21347 10358 59803 19646 -30498 -29917
14763 -29917 9483 11562 31049 86743 74373 12864 -10959 16934 16440 -45791 -97799 -101754
14751 -101754 -81536 -120941 -95773 -52195 -66908 -104516 -115097 -38828 27302 80995 58689
14740 58689 47245 4533 -26991 -46961 -62078 -46106 -44389 -12925 41693 59185 71157 52284
14728 52284 22141 40639 78843 57791 8293 21706 46608 95044 76432 110430 69839 61806
14716 61806 61811 72415 123640 125341 31349 37092 48712 86958 8980 934 20609 57127 83673
14703H3673m9796m6564l7133k9035k4522k0658P3145L7036L1261m5272Q411l5491
14691e4945L827l9292m3378m7643j8969J5161J8802O4230P5776m2068k8939Q2988
14679a4450m993k4487q306K7104k410M7541L6709n3426n755J6868K3330R123J6106
14666F2954k1724k0644K8287k8889Q315l9736K2483J7711j7622k4501l0426m2923
14654h6715P882N7938k9531m6507K5992R794m5559j4027N9900L4711K732j9511
14642d2901k8315K9350M2011k1589m9135m1626k0664n2802J8350M8692K9159N5957
14630c3513j0604K204K3112L0418J752m6689k0586J1037m1599r805M0362o139
14618f0050j6407M4570O655O4623L0744N466k599r3794o8737j1806N6718k935
$$ plain form
14703 83673 33877 -12687 -49820 -78855 -103377 -124035 -50890 -13854 17407 -27865 -19454 -54945
14691 -54945 -51118 -90410 -133788 -181431 -200400 -185239 -166437 -102207 -26431 -68499 -97438 -14450
14679 -14450 -19443 -43930 -52236 -25132 -27542 19999 56708 3282 -2473 14395 37725 46848 62954
14666 62954 41230 20586 48873 19984 28299 -11437 11046 28757 11135 -13366 -43792 -86715
14654 -86715 -78833 -20895 -50426 -96933 -70941 -61147 -106706 -120733 -60833 -26122 -23390 -42901
14642 -42901 -71216 -41866 145 -21444 -70579 -112205 -132869 -185671 -167321 -118629 -89470 -33513
14630 -33513 -44117 -41913 -18801 11617 13369 -33320 -53906 -42869 -84468 -94273 -53911 -60050
14618 -60050 -76457 -31887 -25232 39391 70135 75601 73002 -20792 -89529 -101335 -44617 -47552
14606d7552N290L29p942K93J3388M9131M4128m3300m2556O3694J8296m157r884
14593C9158n4594j3699P7741M3270K163j3815k1463o6967m0182l5905M4492J2788
14581b7013k4522M1480K4860k4286l7417L395R071k8429L57R191P469l0308R95
14568g5157M1621j1791j5544q645J6865N1164k5673P67K6859p503n375J268p6145
14555h7289o6932Q5873J11544L2727j9197r339m4080J3862N0198j775k8191m4426
14543g025k5417N764M2008J2249J1651k1488l4483l819l7889k7241R703M344M2315
14530b9328J6399m1741j5125L9824M2155L0532n588J2003j7082M307K7412K1225
14518H4993m4423l9328J5139K3056L6243L0429L0243m6717m1279m5703r288o55
$$ plain form
14606 -47552 -42262 -41933 -49875 -49582 -36194 12937 57065 13765 -28791 34903 53199 49042 39158
14593 39158 -15436 -29135 48606 91876 94039 80224 58761 -8206 -48388 -84293 -39801 -27013
14581 -27013 -51535 -10055 14805 -9481 -46898 -43503 -34432 -62861 -62504 -53313 -45844 -76152 -75157
14568 -75157 -33536 -45327 -60871 -69516 -52651 -1487 -27160 -26393 466 -7037 -12412 -11144 -87289
14555 -87289 -154221 -68348 43196 75923 56726 47387 3307 17169 67367 65592 37401 -7025
14543 -7025 -32442 -26678 15330 27579 39230 17742 -16741 -20560 -58449 -85690 -75987 -71643 -29328
14530 -29328 -12929 -54670 -69795 -29971 12184 42716 37128 49131 32049 36356 63768 84993
14518 84993 40570 1242 16381 39437 75680 106109 136352 89635 48356 2653 -6635 -7290
14506g290K3508M4830j4141l606n4261k5681k1887m9982P270M2799N8496j1542
14494a1487K1901M4359j0279K4557N838j0918Q070J2115j6122l6714l1380N086
14482E026J7013N0037K2426l6839m388K9837l3017m9344m4329l5327m483N406
14470g7982P261j4141J359K3768M8827M4251M551k2743K769m486L7644K7395K3624
14457A02097n4743n9883k53N214j1844r733j4l9047l7871J4955M4417K9831K4619
14444G745O667J5246k9123J435l4756J839j756K7263o333r108K2058Q637J9682
14431B9496K6233k8998P900m5354J9506R508k1702m6464J3248L1059j6369J9160
14419b777O505j0755q391K2723J7023l2870n2975J1333M6514J393m6276o4320
$$ plain form
14506 -7290 16218 61048 46907 43301 -10960 -36641 -58528 -108510 -101240 -58441 55 -11487
14494 -11487 10414 54773 44494 69051 74889 63971 72041 84156 68034 31320 -60 5026
14482 5026 22039 72076 94502 57663 53275 83112 50095 751 -43578 -78905 -83388 -77982
14470 -77982 -70721 -84862 -83503 -59735 -10908 33343 37894 15151 17920 13434 51078 78473 102097
14457 102097 47354 -12529 -12782 -7568 -19412 -29145 -29159 -68206 -106077 -91122 -46705 -16874 7745
14444 7745 14412 29658 535 1970 -32786 -30947 -32703 -5440 -11773 -20881 1177 9814 29496
14431 29496 55729 26731 34631 -10723 8783 18291 -3411 -49875 -36627 -5568 -21937 -2777
14419 -2777 3728 -7027 -15418 7305 24328 -8542 -61517 -50184 -3670 -2277 -48553 -112873
14407a12873L0610K009n5138J4270K6319L3642N7892L0144m8987l3904j5382M403
14395f6995J7568p138l0148k7695q505L0291N7638l8387m886Q728M4775N0726
14383B5972l1602p067J3539k4824J7899l425l9985m8535L0890K4366L8622N8855
14371E4705L992l7899p1212n1711J0773R0458J8164k2695k1628J0775j3884M0616
14359A0454l032j4680L2950k6720J346j2038K020j2080j4904K202O5612j5487
14347A5643p5977m5360r368K3412Q9932L3712l3230k963l1328j1056L1991l4346
14335d8938m252J5486K0738P2834O734k9797n0067j0163m7525O224L4921M0192
14323F387M8244O117K2356j9516j1541k4827O202k0437l3066q962L5481j3727
$$ plain form
14407 -112873 -82263 -80254 -135392 -121122 -94803 -61161 -3269 26875 -22112 -56016 -71398 -66995
14395 -66995 -49427 -56565 -86713 -114408 -122913 -92622 -34984 -73371 -78257 -69529 -24754 25972
14383 25972 -5630 -12697 842 -23982 -6083 -9508 -49493 -98028 -67138 -42772 -4150 54705
14371 54705 58697 20798 -50414 -102125 -91352 -894 17270 -5425 -27053 -16278 -30162 10454
14359 10454 7422 -7258 25692 -1028 318 -11720 -9700 -21780 -36684 -34482 31130 15643
14347 15643 -60334 -105694 -115062 -91650 -1718 31994 -1236 -4199 -35527 -46583 -14592 -48938
14335 -48938 -53190 -37704 -16966 55868 62602 32805 -17262 -27425 -74950 -68726 -33805 6387
14323 6387 54631 60748 83104 63588 52047 27220 33422 12985 -20081 -29043 6438 -7289
14311g289J2694Q013m8849k8115R586K2998M5514L621k9733k5854Q426M965n360
14298b9383L2920K2630l3177m4715o343R821m545M721J5243M932k6743M3297J2864
14285A522j2603O449J2405k7239M1424P6425K154q9925l408M7799k784k0282k4943
14272F994J2278M1934J5249m5519p1199n2258m630O2423K8775L549l251K6641
14260B0986l2927l3978J9284K1981j1719J1387j715J7895j5516k8157j0167J9665
14248b2981N3065K600m9695K047K1850k24l9905k4193n039Q842M2399k8832r018
14235d9084K135p044k167q065N309k8670J487O8095P5200k1580k9940P346k0749
14222g727j831j43j3600J4098q9204J4712P5596N6658j5426K3772l6023m6805
$$ plain form
14311 -7289 5405 13418 -35431 -63546 -53960 -30962 14552 18173 -11560 -37414 -28988 -24023 -29383
14298 -29383 3537 26167 -7010 -51725 -58068 -48247 -52792 -48071 -32828 -27896 -54639 -11342 1522
14285 1522 -11081 -4632 7773 -19466 21958 98383 100537 10612 7204 55003 52219 31937 6994
14272 6994 19272 61206 76455 30936 -40263 -92521 -97151 -34728 -5953 -2404 -5655 20986
14260 20986 -11941 -45919 -26635 -4654 -16373 -4986 -6701 11194 -4322 -32479 -42646 -22981
14248 -22981 30084 32684 -17011 -14964 6886 6662 -33243 -57436 -62475 -53633 -11234 -40066 -49084
14235 -49084 -46949 -53993 -56160 -64225 -58916 -87586 -86099 -18004 57196 35616 5676 13022 -7727
14222 -7727 -9558 -9701 -23301 -9203 -98407 -83695 -8099 48559 33133 56905 20882 -25923
14210b5923L1216j6326k5299M4668O7682J264l3251n0494m57n414j9938j8171
14198e0443l8916K4359q261m8439N0570O226j247N1802N7397K2856n1331l6817
14186b2244n5252j1845J6616k3630P872K3862P259N6448L7109n1942P903O8577
14174F0733l8812k6298K1467l3598q171l43M620M438r151k004k7870K6920M3920
14161A5851k0066l6912l890j9072O200J1360M5932J3922n1775L8006K7875n4612
14149b7181k8885K9664M6445O046p405K4234k1220K2559K4872j7755l9247m7358
14137c5231j9617K8464L753J8828j1736n0976o0428L2244L5628M0425R993m3882
14125e2535m239o46P2705L4030l0586l7949k4877k4646J8137J3217J8348N884
$$ plain form
14210 -25923 5293 -11033 -36332 8336 76018 77282 44031 -6463 -6920 -12334 -32272 -50443
14198 -50443 -89359 -65000 -73261 -121700 -71130 -64904 -66151 -14349 43048 65904 14573 -22244
14186 -22244 -77496 -89341 -72725 -96355 -88483 -64621 -57362 -914 36195 -15747 -7844 60733
14174 60733 21921 -4377 17090 -16508 -24679 -25022 -20402 -15964 -25115 -27119 -54989 -28069 15851
14161 15851 -4215 -41127 -45017 -64089 -57889 -46529 -597 13325 -38450 -444 27431 -27181
14149 -27181 -56066 -26402 20043 26089 18684 42918 21698 44257 69129 51374 12127 -35231
14137 -35231 -54848 -26384 -22631 -3803 -15539 -66515 -126943 -94699 -59071 -18646 -8653 -52535
14125 -52535 -56774 -57420 15285 49315 18729 -19220 -44097 -68743 -50606 -37389 -19041 -13157
14113a3157q638J456K2382l534j298l9942q0461N474M2254O4205J3116K999J0081
14100A4937p7693j0544N9999k7895j4176L7286M9383j1544l3184j5154M0460K6417
14088C8292P265q743o6691m4926k1758M6144K0046L2971k6251m5273L2032M6013
14076I121o237o0752k2317n4015k449Q4316M1960n3176J355n1782k2442J7066
14064a19352L937j2548K8567M2779O5583r87R50m5783J7621p654m061K5495k3060
14051b8513l1077j3152j32n0184j8663P9728O4767O3928p7328l0679k7260M4096
14039b4469O1328n5280o8314o2024O3581L8146K0946M621p700K245p8482J3516
14027i1886M8885L3012L1006M6558J0032n6040l3702j5458n6473k5368k343l3830
$$ plain form
14113 -13157 -21795 -20339 2043 -1491 -2789 -42731 -123192 -117718 -75464 -11259 1857 4856 14937
14100 14937 -62756 -73300 -13301 -41196 -55372 -18086 31297 19753 -13431 -28585 11875 38292
14088 38292 45557 36814 -29877 -74803 -96561 -50417 -30371 2600 -23651 -68924 -36892 9121
14076 9121 2884 -57868 -80185 -134200 -136649 -52333 -10373 -63549 -62194 -113976 -136418 -119352
14064 -119352 -115415 -127963 -99396 -56617 8966 7979 8929 -36854 -19233 -26887 -30948 -5453 -28513
14051 -28513 -59590 -72742 -72874 -123058 -141721 -61993 2774 66702 -10626 -41305 -68565 -24469
14039 -24469 36859 -18421 -86735 -148759 -85178 -47032 -26086 -21465 -29165 -26920 -105402 -91886
14027 -91886 -43001 -9989 21017 67575 77607 21567 -12135 -27593 -84066 -109434 -111777 -145607
14015a45607n7687p808k3240N9856N6192o1502M0970M0438J8586J2259J5431M2366
14003i746L6266k7847L8530J3610l8165k3086K4887L4095j8683m1235k0151J9186
13991a2339K8620k8443k0795K1025k705k8213l7511o418L9408k0275K3511J32603
13979H8468L5431o8194m3894K8517k3808m5914l3334M9972N987m0518p296k6356
13967h0939j8969k5201N117J4915J8531K7854n2432M18J9932M2623p884j9043
13955g5078k034q68k3673M4585L0972k1337M0996J2817M6065j1320o7685j6662
13943d3222p424L4663L6858K1304l7554o457j0645n40N234n4107K5822J1931K4936
13930G99m0601P604J7568M7969n598n961j4870j7801K4551l7829m7200m1417J9219
$$ plain form
14015 -145607 -203294 -211102 -234342 -174486 -118294 -179796 -138826 -98388 -79802 -67543 -52112 -9746
14003 -9746 26520 -1327 37203 50813 12648 -10438 14449 48544 29861 -11374 -31525 -12339
13991 -12339 16281 -12162 -32957 -11932 -14637 -42850 -80361 -86779 -47371 -67646 -44135 88468
13979 88468 123899 55705 11811 40328 16520 -29394 -62728 -12756 -6769 -47287 -54583 -80939
13967 -80939 -99908 -125109 -119992 -105077 -86546 -58692 -111124 -110706 -90774 -48151 -56035 -75078
13955 -75078 -77112 -77980 -101653 -57068 -26096 -47433 -6437 6380 52445 41125 -26560 -43222
13943 -43222 -50646 -15983 20875 42179 4625 -1832 -12477 -13017 -7783 -61890 -36068 -24137 799
13930 799 -39802 -32198 -14630 33339 27741 21780 6910 -10891 13660 -24169 -71369 -112786 -93567
13917i3567K2923L076j0930o905N418M4725k266m060Q973o1704K6044Q5852J5071
13904C2650j4369j9437k0214M5974N112k4710N316k6826J3825q399o0129L5145
13892c6062J3222l7072k0535L9076O236j4144J9282j5569l0107J4790O3732M3552
13880D6401J9619k1154j9562L370m9452m5295N999n4878J5354K5304N8335O1025
13868D5066K1296L851J3225k7639n8832q373J66k3491J367R508k7370k1324L3696
13855c8854L4819m0374k7564J0541N8089K5212L5724O24k1677l3208n0692N487
13843d1873K5975j6639J30Q7424N7993J0529M8185p1010l0373l511r9948p2729
13831a05847L3065L3133k4238l4192L2182K8636j9962K5049M9125J5909M634l1724
$$ plain form
13917 -93567 -70644 -67568 -78498 -85403 -79985 -35260 -37526 -41586 -32613 -94317 -68273 17579 32650
13904 32650 18281 -1156 -21370 24604 29716 5006 10322 -16504 -2679 -11078 -71207 -36062
13892 -36062 -22840 -59912 -80447 -41371 -35135 -49279 -29997 -45566 -75673 -60883 2849 46401
13880 46401 66020 44866 25304 28674 -20778 -66073 -60074 -114952 -99598 -74294 -15959 45066
13868 45066 66362 70213 83438 55799 -3033 -11406 -11240 -34731 -33364 -23856 -51226 -72550 -38854
13855 -38854 -4035 -44409 -71973 -61432 -3343 21869 57593 58217 36540 3332 -47360 -41873
13843 -41873 -15898 -32537 -32407 55017 113010 123539 171724 100714 70341 66830 -33118 -105847
13831 -105847 -72782 -39649 -63887 -98079 -65897 -37261 -57223 -32174 16951 32860 37494 5770
13819E770o325o295k7296M7619Q1318j6110o7748l7597J8861N5356J3241r421
13807E1373k4438j7378L8370k5089m7850j3630L4707m3731k1158P4079L3808o3662
13795b4599n3713k1777K4845K3104j7766j2919L2442j4949N7495O1750j1479k0967
13783B1467p075J5259l4200j2655k115M5297j2988m8986K9853N0592n9934l1242
13771d6727j1985l7503j0339o333l939L5923K6042k1339P423M2383N2517J1548
13759C7671l7k2797l6596N673l1737K1334L0671L0217M843J6781k90K4181q436
13746G1478n4687k5243L2397q377n6048o900J4518j809l7624L1969Q841m975L9215
13733B755K3963j059m7312k1600l3320K0596k702L375o155K7253J1021k8856l7647
$$ plain form
13819 5770 -555 -6850 -34146 13473 94791 78681 10933 -26664 -7803 47553 60794 51373
13807 51373 26935 9557 47927 22838 -25012 -38642 -3935 -47666 -68824 5255 39063 -24599
13795 -24599 -78312 -100089 -75244 -52140 -69906 -82825 -50383 -65332 -7837 53913 42434 21467
13783 21467 14392 29651 -4549 -17204 -19319 25978 12990 -35996 -6143 44449 -15485 -46727
13771 -46727 -58712 -96215 -106554 -112887 -116826 -80903 -54861 -76200 -68777 -26394 26123 37671
13759 37671 37634 14837 -21759 -16086 -47823 -26489 4182 34399 39242 56023 55733 79914 71478
13746 71478 16791 -8452 23945 15568 -40480 -47380 -32862 -34671 -72295 -40326 -31485 -36460 2755
13733 2755 26718 25659 -21653 -43253 -76573 -55977 -58679 -55304 -61459 -34206 -23185 -52041 -89688
13720h9688N42L9014J2252L3628N3611J8521P916M3297O274o1476q0443k8065
13708d4617j718J1587J1427K0760J3320m0563J4208j8003J9712k7636J4608R086
13696a7829l5246r133P4918k687l6123p056o87n9045k5391J6255K2669O1283K3408
13683E336j8868m5137n2600N243J5808J4248l9037m9386J0146R9824m565q774
13671f7762M8749L4801J442m3753n9782J3053M7829J5404K8256k4443m5447k1886
13659g3539o2863L726L8802j3463L350k5103N0655J3991o3382O131Q3731P1693
13647C3729L048l0753J4638O166m1245q284k6641M6365M5810M3722l22l5172j7988
13634C3073j0513m4136k2814k4812K537l991k0444k7146j5667L15n5264K9148
$$ plain form
13720 -89688 -89146 -50132 -37880 -4252 49359 67880 75796 119093 125367 63891 -16552 -44617
13708 -44617 -46335 -34748 -23321 -2561 10759 -29804 -15596 -33599 -13887 -41523 -26915 -17829
13696 -17829 -53075 -62208 12710 10023 -26100 -33156 -33843 -92888 -118279 -102024 -79355 -18072 5336
13683 5336 -13532 -58669 -111269 -106026 -90218 -75970 -115007 -164393 -154247 -54423 -58988 -67762
13671 -67762 -19013 15788 17230 -26523 -86305 -73252 -25423 -10019 18237 -6206 -51653 -73539
13659 -73539 -136402 -132676 -93874 -107337 -103987 -129090 -78435 -64444 -127826 -121695 -37964 33729
13647 33729 36777 6024 20662 26828 -14417 -22701 -49342 -2977 42833 86555 86233 51061 33073
13634 33073 22560 -21576 -44390 -69202 -66665 -70656 -91100 -118246 -133913 -133598 -188862 -159714
13622a59714O8061M1679j3060M5717N1174L199k7275o767j7586l7333k712j5853
13610g0470J6235p81J2424J4118m1441m3989l4342N6297M9509k946j6656R88Q143
13597e2911M8392K4299k814j7330M131k4272j3037J1453M5362J4890o7220j3986
13585d3043q71M646p4353q2136M5958M9920K1044J5189J9750r263j4886q33L2638
13572c6240O6041O139r102l6725J170p1406k6875M9467K7383m134J8592L4667
13560A8977k2377k2110n2077k8065J3589m4724P0635L6867k175j8195N158K0364
13548b4133J6427j5492k0981K4838L2091K430K6981O497J3782l5532K1317J0326
13536E8551O205m7844O760L9445j1678K8515k3717j03343j3727j0330l507O080
$$ plain form
13622 -159714 -91653 -49974 -63034 -17317 33857 37056 9781 3014 -14572 -51905 -54617 -70470
13610 -70470 -54235 -55016 -42592 -28474 -69915 -113904 -148246 -91949 -42440 -45386 -62042 -61054 -52911
13597 -52911 -4519 19780 16966 -364 3767 -20505 -33542 -22089 23273 38163 -29057 -43043
13585 -43043 -43914 -39268 -113621 -195757 -149799 -99879 -78835 -63646 -43896 -53159 -68045 -68878 -36240
13572 -36240 29801 35940 26838 -9887 -8717 -80123 -106998 -57531 -30148 -34282 -15690 18977
13560 18977 -3400 -25510 -77587 -105652 -92063 -136787 -66152 -29285 -31460 -49655 -44497 -24133
13548 -24133 -7706 -23198 -44179 -19341 12750 15180 42161 48658 62440 26908 48225 58551
13536 58551 64756 16912 23672 63117 51439 79954 56237 -47106 -60833 -71163 -74670 -68590
13524f8590k2494J1478L7316k8175O491J9892j5359l7105l5270K9435L4462J0768
13512e7151p897m3281l1166o291j7757k806L5463P3780N3374k3946m7315n5573
13500a30566k5189L0938P1157P1604k6415j46N9891o980k9541l6843K0563J4323
13488A2796R821j9197l5757L7954L5036j0657j0759j2802L3858L7890k9130p9815
13476c0762o2791j4692M7987J4490j2515q954m7648N4476N5662J3621L2300M7599
13464H8773J6834m6356p3889k4800J6722J6782K6904J5709k6502J7684N695l5238
13452a682J2868L2124o3100j5328Q388K7988P206L3840k0856l9921J5239q634
13440a1868j8320K6737r4j1956k3013J3833L7128J2421L3168n7476n983r690o4538
$$ plain form
13524 -68590 -91084 -79606 -42290 -70465 -63974 -44082 -59441 -96546 -131816 -102381 -67919 -57151
13512 -57151 -65048 -108329 -139495 -145786 -163543 -166349 -130886 -57106 -3732 -27678 -74993 -130566
13500 -130566 -155755 -124817 -53660 17944 -8471 -8617 51274 44294 14753 -22090 -1527 12796
13488 12796 22617 3420 -32337 5617 40653 29996 19237 6435 40293 78183 49053 -30762
13476 -30762 -93553 -108245 -60258 -45768 -58283 -67237 -114885 -60409 -4747 8874 41174 88773
13464 88773 105607 59251 -14638 -39438 -22716 -5934 20970 36679 10177 27861 33556 -1682
13452 -1682 11186 43310 -19790 -35118 -26730 1258 8464 42304 21448 -18473 -3234 -11868
13440 -11868 -30188 -3451 -3545 -15501 -38514 -24681 12447 24868 58036 560 -5423 -15113 -79651
13427g9651N1993j5092L2453r266l7751K3747L1102M793L3722k7049l168L3716
13415C9549p6898n1741K3759K2560Q29J7820k2277j7324k6142O4001k1206J8144
13403b8926j8833j4489L6045O3796q692p5459k0031p349l0750m2869j547O1654
13391h7450P064l393J6266L3510K3262J6836L4182n3708j6313K8181M4771M2432
13379H5640l8685j25482l5989L5806M0341J1473K0946J6184k3196k447o9575j6163
13367a01147L6646O0262O9o0226j1742K0164O7418L1211J657j7916m8558m0177
13355f2339K4832P074R007K2511L4314k3104L8204M0140L5711J3835n8457m4348
13343C7380R01k0700l768L5807M6854Q389k2461m0821q0001m6525J715M6496l1023
$$ plain form
13427 -79651 -27658 -42750 -10297 -19563 -57314 -33567 -2465 2328 36050 9001 5833 39549
13415 39549 -37349 -89090 -65331 -42771 -41942 -24122 -46399 -63723 -89865 -25864 -47070 -28926
13403 -28926 -47759 -62248 -26203 37593 28901 -46558 -66589 -73938 -104688 -147557 -149104 -87450
13391 -87450 -80386 -83779 -67513 -34003 -10741 6095 40277 -13431 -29744 -1563 43208 85640
13379 85640 46955 -78527 -114516 -78710 -38369 -26896 -5950 10234 -12962 -15409 -84984 -101147
13367 -101147 -64501 -4239 -4170 -64396 -76138 -55974 11444 42655 44312 26396 -22162 -62339
13355 -62339 -37507 -30433 -21426 1085 35399 12295 50499 90639 126350 140185 81728 37380
13343 37380 38281 17581 13813 49620 96474 104863 82402 41581 -38420 -84945 -83230 -36734 -67757
13330f7757q2987m6634L5582P2130J0200M026P842J5844l7247M4211P668o272
13318d3394K4396l8862m553j0319j5044K3351J8681K6778J2904M4629J6809k96
13306E5080m980n7334o3683k405K6883K6365j1676L0773k783K1374M7057j1023
13294E3648o3524M7876N3858k1108J918k2920n086N0275j8951j5436k5186n7222
13282b1858l4666K7752O2128K6030q062O783p510J6958k4569l1809l421n839K0723
13269B2640j8098m2856n9561L2708j1673j075k1961J7322j9682m8529J0319O283
13257a34163M2688K6490k5865R539J7114O6012J9655m9874K4881L4131J9352r309
13245D0651n1694o0881l2349O1884m0267L7018J4539O892P458n8861j6137m4452
$$ plain form
13330 -67757 -150744 -197378 -161796 -89666 -79466 -75440 -67598 -51754 -89001 -44790 -37122 -43394
13318 -43394 -18998 -57860 -62413 -72732 -87776 -64425 -45744 -18966 -6062 38567 55376 55080
13306 55080 50100 -7234 -70917 -73322 -46439 -20074 -31750 -977 -3760 17614 64671 53648
13294 53648 -9876 38000 91858 70750 72668 49748 44662 94937 75986 60550 35364 -21858
13282 -21858 -56524 -28772 33356 59386 51324 58107 50597 67555 42986 11177 7756 1917 22640
13269 22640 4542 -38314 -97875 -65167 -76840 -77915 -99876 -82554 -102236 -150765 -140446 -134163
13257 -134163 -91475 -64985 -90850 -81311 -64197 1815 21470 -28404 -3523 30608 49960 40651
13245 40651 -11043 -71924 -104273 -42389 -82656 -45638 -31099 -24207 -16749 -75610 -91747 -136199
13233a36199N236k6089j0244L9608K299j5843N0302J00690J2371l9935l0532l0870
13221g9206L1765j3592M0502l8614P050N0153J6035L4947j1677m8971k2595j1017
13209d5220J3541P034o623j2656K9029j8116M099J5751L6250L3697N831J406k3562
13196D0461j5089l004k0521m4092j654N826j3672q583l8285P2125J8820j3712
13184b1380n3916n8183j5297N8493N7856j4774j0147K4338K5950J9862o985k7219
13172b1402K311K039L0063m875L4604n0594o1086l9789P446J4784o1K5945l3785
13159i4400j6689N7053R573l2886J6978m607k0477M2474L7531L1470M748l7026
13147f258l4706K0351J2630k1874J5754L4606N633n92K455m6472J4132n7737l2673
$$ plain form
13233 -136199 -130963 -157052 -167296 -127688 -125389 -141232 -90930 9760 22131 -17804 -48336 -79206
13221 -79206 -47441 -61033 -20531 -59145 -52095 -1942 14093 49040 37363 -11608 -34203 -45220
13209 -45220 -31679 -24645 -31268 -43924 -14895 -33011 -28912 -13161 23089 56786 62617 64023 40461
13196 40461 25372 22368 1847 -42245 -43899 -38073 -51745 -60328 -98613 -26488 -7668 -21380
13184 -21380 -75296 -133479 -148776 -90283 -32427 -47201 -57348 -33010 -7060 12802 5817 -21402
13172 -21402 -19091 -17052 13011 8136 42740 -7854 -68940 -108729 -101283 -86499 -86560 -60615 -94400
13159 -94400 -111089 -54036 -44463 -77349 -60371 -64978 -85455 -42981 -5450 26020 30768 -6258
13147 -6258 -40964 -20613 -7983 -29857 -14103 20503 26136 25544 27999 -18473 -4341 -62078 -94751
13134i4751l9890j3843M0273L7562M9327J8965K0804q697k2274K556K9601J0074
13122B9707k1362L3050O1955k5639n0978n7586O528L2536j6916N8006J9802l8637
13110C0466o0090l2013n806J7692L1455k720o8869L7467P518J800K1482j319m4038
13097f6975l0884j395j5498K0639K6693J7905J7309K219k7678k7318j6933j0129
13085a12045J1125M1369L1461j8023K5157N0522L5789l0839j1793m7693q149M6897
13073A3778k4536j2644p143K9785l5934O9480M3552m5538j4939j7514n0176k9668
13061h1497m691J3703j6802J5375k920J4367k6147k3796N3159L1235N3892M7076
13049G2954k4566n3183O523Q5122l2868m0692k0721J4173N9M3049l664k6360k3526
$$ plain form
13134 -94751 -134641 -148484 -108211 -70649 -21322 -2357 18447 9750 -12524 -9968 19633 29707
13122 29707 8345 41395 103350 77711 26733 -30853 -24325 8211 -8705 49301 69103 30466
13110 30466 -29624 -61637 -67443 -49751 -18296 -21016 -89885 -52418 -44900 -43100 -21618 -22937 -66975
13097 -66975 -97859 -99254 -114752 -94113 -67420 -49515 -32206 -29987 -57665 -84983 -101916 -112045
13085 -112045 -100920 -59551 -28090 -46113 -20956 29566 65355 34516 22723 -24970 -33119 13778
13073 13778 -10758 -23402 -30545 -760 -36694 32786 76338 30800 15861 -1653 -51829 -81497
13061 -81497 -86188 -72485 -89287 -73912 -76832 -62465 -88612 -112408 -59249 -28014 25878 72954
13049 72954 48388 -4795 1728 86850 53982 13290 -7431 6742 6801 49850 46186 19826 -3700
13036c700K1652l1997n822k9036n1724j8859M3490j753q3941j573M0286N4391
13024f8586M7333o075L2669k6027j9081J0055N288M3095K7238o192p5261k1166
13012e6710J5092O389K3692J1942L5860R686j8321j1493m3704r141O383k2301
13000e2626N1044J4906K1699N65p967j1767j404K6483j6951l476k8119L822l7511
12987d1302p0853m0766L5062N9776J0282J9542K8612j6216j4490j5635j4716N8430
12975b274N81m4884o337K8519N8612M8945k7782o9733l9847M2169Q1086k57m066
12962F4732K0578K1212q3389m5659N1543p668l3635j1091k8468Q964K4093J07700
12950H8912J240l367n4838M664l3983l4408m8892k7623L0871k288j6213j8868
$$ plain form
13036 -3700 17952 -14045 -19867 -48903 -100627 -119486 -75996 -77749 -161690 -163263 -122977 -68586
13024 -68586 -21253 -27328 5341 -20686 -39767 -29712 -24424 18671 45909 39717 -35544 -56710
13012 -56710 -41618 -35229 -11537 405 36265 45951 27630 16137 -27567 -36708 -30325 -52626
13000 -52626 -1582 13324 35023 35588 27621 15854 14450 40933 23982 20506 -7613 -3791 -41302
12987 -41302 -112155 -152921 -117859 -58083 -47801 -28259 353 -15863 -30353 -45988 -60704 -2274
12975 -2274 -1693 -46577 -52914 -24395 34217 83162 55380 -14353 -54200 -12031 69055 68798 64732
12962 64732 85310 106522 23133 -22526 29017 21349 -12286 -23377 -51845 -42881 -18788 88912
12950 88912 90152 86785 31947 36611 2628 -31780 -80672 -108295 -77424 -79712 -95925 -114793
12938a14793J4482P540j535O7181k2581J9040P8403K6112j0754o0653n0175M1498
12926f235p530j0687N1369L5445n2371m8102j0693n3312j7398K1636N6019P4510
12914C2651N3703J41r368L0861k9584n11K8238R438l1559J1532j3817l1260Q4145
12901A34610O0566l6520j5062M2008l3877O334q7780l2375n1038l1234R401J6390
12889a8577l183J6653K4826J2243j7832k7958K5779q973R868n142m5038K925k6967
12876f1376k9830R850L5233L3350K6858m9265k339o054J6847j3204l7064n3255
12864a30249M611K9518K8498O3386R3445j1937n9137K0383o0953o78K7311L3948
12852C8146k3727K524l079J6162j1039L3725o1529O115K3822j051j4976o3428
$$ plain form
12938 -114793 -100311 -92771 -94306 -27125 -49706 -30666 47737 73849 63095 2442 -47733 -6235
12926 -6235 -13765 -24452 26917 62362 9991 -38111 -48804 -102116 -119514 -97878 -41859 32651
12914 32651 86354 86495 77127 107988 78404 77893 106131 115569 84010 95542 81725 50465 134610
12901 134610 195176 158656 143594 185602 151725 158059 70279 37904 -13134 -44368 -34967 -18577
12889 -18577 -21760 -5107 19719 31962 14130 -13828 11951 2978 12846 7704 -37334 -34409 -61376
12876 -61376 -91206 -81356 -46123 -12773 14085 -35180 -37519 -43573 -26726 -39930 -76994 -130249
12864 -130249 -125638 -96120 -67622 -4236 89209 77272 18135 38518 -22435 -23113 4198 38146
12852 38146 14419 16943 13864 30026 18987 52712 -8817 -2702 21120 20069 5093 -58335
12840e8335j9174L2282K9897J7057M586J0441K21N5235K0497o5343l8458l6566
12828d7660K2131O5572k1311n7406K7434M2032J9271k0947n1624O470J1252L0897
12816B6111l268J2488O363J5846j9314r3703j6401J02489R31kL280j2919k5041
12803c140r437P0917O771j05247K9318K2296k1561q9324p4041K7732J15060L1901
12791A245m8761k361k5204j4362K2674Q6834j5688J8465j7382r517J0913r4978
12779h8122l315K7290j6509J3455N828K3724m5575L1747L192k5638O9506p509
12767a1926p5509l2301J4101K7044N1597j1434l0418j0253L6747M736J2871J4487
12755a0258N121r0966m5898P950J8999P5072J0269o5628J8336j5646m0300P1059
$$ plain form
12840 -58335 -77509 -45227 -15330 1727 6313 16754 16975 72210 92707 27364 -11094 -47660
12828 -47660 -25529 40043 18732 -38674 -11240 30792 50063 29116 -22508 -16038 -4786 26111
12816 26111 22843 35331 41694 57540 38226 -55477 -71878 30611 31542 31540 34820 21901 -3140
12803 -3140 -12577 58340 65111 -40136 -10818 11478 -10083 -99407 -173448 -145716 -30656 1245
12791 1245 -47516 -49877 -75081 -89443 -66769 20065 4377 22842 5460 -4057 6856 -88122
12779 -88122 -91437 -64147 -80656 -67201 -61373 -37649 -83224 -51477 -48285 -73923 -4417 -11926
12767 -11926 -87435 -119736 -105635 -78591 -26994 -38428 -68846 -79099 -42352 -37616 -24745 -10258
12755 -10258 -5137 -96103 -142001 -134051 -115052 -39980 -29711 -95339 -77003 -92649 -132949 -61890
12743f1890L9415N134n9194n5848L9078J7423Q493M106K3364N7737m2682o9379
12731i4243K3862J422k9610p391p972L8018n559J8170P0813J7351K2860k0768
12719B6953j6854J4780L8451J5739j4914m4599r0179p0725J2297L1410J3102K9243
12707e5296L8964q221k0499K1675j2316J9416k8075p3780K4933N2139q455n2855
12695a02370j5707J11492K7055k8004l7253m1522L2482L1308L5126J9926m0533
12684h000l3588k5223r324L5951P9J922M2328k7194r30K4149l7163m7978L273
12671h1698R997l9666m10P0227J6042K1054n401m431R520J1728K6467k1786l3691
12658b2048l3211J8235p68k2292k5854N0351L3322k66j4641L3373J979p73j603
$$ plain form
12743 -61890 -22475 -17341 -76535 -132383 -93305 -75882 -67389 -63283 -39919 17818 -24864 -94243
12731 -94243 -70381 -68959 -98569 -105960 -113932 -75914 -81473 -63303 7510 24861 47721 26953
12719 26953 10099 24879 63330 79069 64155 19556 -70623 -141348 -129051 -97641 -84539 -55296
12707 -55296 -16332 -24553 -45052 -23377 -35693 -16277 -44352 -118132 -93199 -41060 -49515 -102370
12695 -102370 -118077 -6585 20470 -7534 -44787 -86309 -53827 -22519 12607 32533 -8000
12684 -8000 -41588 -66811 -76135 -40184 -40105 -38183 4145 -23049 -23979 170 -36993 -84971 -81698
12671 -81698 -71701 -111367 -111777 -41550 -25508 -4454 -9855 -14286 -4766 6962 33429 11643 -22048
12658 -22048 -55259 -37024 -37792 -60084 -85938 -35587 -2265 -2531 -17172 16201 18180 17407 15804
12645A5804k2010J0811j4018m4110O7192L9611n3813k6164j169j0466m077L9969
12633b440L2189N2947M2718m2707l8548R295l5447l5309L878K9926L6309j0708
12621D2103J2061p3162p7593M7321K6978j261J9800r601J0248L135K2178l2760
12609a0553l5758N139M479K0533k7425m447k3612j1095L4880j1229l1187l2305
12597a22580J8716J5085q100L1544L5452k9403R932q299P013M0560k254j9223
12585c1557l8238j316J5957K093L6465m178N0554l48m5709j8648K866J0353n873
12572b7579n381M1017K135J3760j7349q3400m6178n013K6694J6690K8140L9399
12560a7065m532k3590r692J2786K7280J4468L6739K3299j1669k9121p724l1117
$$ plain form
12645 15804 -6206 4605 -9413 -53523 13669 53280 -533 -26697 -27866 -38332 -42409 -2440
12633 -2440 29749 82696 125414 82707 44159 53454 18007 -17302 -13424 16502 52811 42103
12621 42103 54164 -18998 -96591 -49270 -22292 -23553 -3753 -13354 -3106 29 22207 -10553
12609 -10553 -46311 -41172 -36693 -16160 -43585 -48032 -71644 -82739 -47859 -59088 -90275 -122580
12597 -122580 -103864 -88779 -96879 -65335 -29883 -59286 -49354 -57653 -50640 -10080 -12334 -31557
12585 -31557 -69795 -71111 -55154 -53061 -16596 -20774 29780 29432 -16277 -34925 -32059 -21706 -27579
12572 -27579 -32960 8057 10192 23952 6603 -76797 -122975 -127988 -101294 -84604 -56464 -17065
12560 -17065 -21597 -45187 -54879 -42093 -14813 -345 36394 59693 48024 18903 11179 -19938
12548a9938k4605k4970j923K7704J4150J3415J4340m2260n3100J7296j5045l8612
12536a33548m1633P4921N7540l5276K1072M4301L9655k0283P916k0289R724k4846
12524b0746J3393L4891m8028n4956K2677j218l0579K2536P9099O179m4496j7325
12512c8573m679j2390j9133j4644M8132J6021m767K4152M0216j9173n2109j3826
12500e0773j2866J8974m433l2944N9908j3961j9121L3214l1162O586J9286l1853
12488e9145j6703o0619p304L6917O1911J1302K6492j682M7580k8659r0139j2037
12476i2086M0212L9252L9614m0440q1528m384Q2284K7792K8292q1140k9203K9308
12464d2027K5755k4194k2122P853M3012N57j1681j5085K514M1813l7335K0277
$$ plain form
12548 -19938 -44543 -69513 -71436 -43732 -29582 -16167 -1827 -44087 -97187 -79891 -94936 -133548
12536 -133548 -175181 -100260 -42720 -77996 -56924 -12623 27032 6749 14665 -5624 4100 -20746
12524 -20746 -7353 27538 -20490 -75446 -52769 -53987 -84566 -62030 17069 23248 -21248 -38573
12512 -38573 -43252 -55642 -74775 -89419 -41287 -25266 -30033 -5881 34335 15162 -36947 -50773
12500 -50773 -63639 -44665 -49098 -82042 -22134 -36095 -55216 -22002 -53164 -46578 -27292 -59145
12488 -59145 -75848 -136467 -143771 -106854 -44943 -33641 -7149 -8831 38749 10090 -80049 -92086
12476 -92086 -51874 -12622 26992 -13448 -94976 -99360 -17076 10716 39008 -42132 -71335 -42027
12464 -42027 -16272 -40466 -62588 -54735 -11723 -11166 -22847 -37932 -35418 6395 -30940 -10663
12452a0663l6413L6434K0747l4592k0314M4978K9734L1849j9636l4422k0454J9910
12440G158o4207K494K3641K771j3873P8364j7215m9098J6105j0007Q966m8675
12428f3576K9991N3360j6600l161L6844k743L3782M0044l6621j09609l2617J1458
12416e9448J0864J8112l877K2863K7386K5145O262j6083l9474k695J092K6943
12404A7090p548n5191k539m7933j3878N2345L1079M1567l0368l6174o0864N5505
12392e6909L0507l5857K0271L2993J6602M0673l201l5624j7541K829J4417J9054
12380B8214O533J695o7905l84K2242L1502j4190J304o477K2634K768n0780L5263
12367A2419L2954n7629J6992O628K7335n514k2492J9822K9417k8999P6065n0832
$$ plain form
12452 -10663 -47076 -10642 10105 -24487 -44801 177 29911 61760 42124 7702 -12752 7158
12440 7158 -57049 -54555 -30914 -28143 -42016 36348 19133 -29965 -13860 -23867 -14901 -63576
12428 -63576 -33585 19775 3175 14 36858 34115 67897 107941 71320 -38289 -70906 -59448
12416 -59448 -48584 -30472 -34349 -11486 15900 41045 47307 31224 -8250 -10945 -9853 17090
12404 17090 9542 -45649 -48188 -96121 -109999 -57654 -26575 14992 -15376 -51550 -112414 -56909
12392 -56909 -26402 -62259 -41988 -8995 7607 48280 45079 9455 -8086 -5257 9160 28214
12380 28214 34747 36442 -31463 -31847 -9605 21897 7707 9011 2534 25168 27936 -22844 12419
12367 12419 45373 -12256 4736 11364 38699 33185 10693 30515 59932 30933 106998 56166
12355E6166o2003L7689K1912k5007p6885k3519N0407L6636j1830j9347l5999l2800
12343h4580M4529Q817J1834J7216M6166k4249m9506k2700j4377K9446M0187n6030
12331e3247m1261P6183M757n5140l7633q157P584M8781L3441j0957n1115J9746
12319f7018P761j3378M4236j8462J9597p2395m7243P7227o007j9441j9377L0389
12307h4111J6848M0154N0694k8880j3225j2238k2225M1954L3283j4130L7527P137
12295E2788q152m1890l8341J2672o915l2831M4818o439J9841j0260K5164R213
12283A9668k034j1685K3605L6563L361P664l6005Q01j8890j6258K5431K7069j4911
12270D4379k5349n8193L9941P634p350P362L2628N6398m8637m4652R858k0298
$$ plain form
12355 56166 -5837 31852 53764 28757 -48128 -71647 -21240 15396 3566 -15781 -51780 -84580
12343 -84580 -40051 -31234 -19400 -2184 43982 19733 -29773 -52473 -66850 -37404 2783 -53247
12331 -53247 -94508 -18325 -13568 -68708 -106341 -114498 -106914 -58133 -24692 -35649 -86764 -67018
12319 -67018 -59257 -72635 -28399 -46861 -27264 -99659 -146902 -69675 -75682 -95123 -114500 -84111
12307 -84111 -67263 -27109 23585 -5295 -18520 -30758 -52983 -11029 22254 8124 45651 52788
12295 52788 44636 2746 -35595 -22923 -29838 -62669 -17851 -24290 -4449 -14709 10455 19668
12283 19668 17634 5949 29554 66117 69478 77142 41137 41938 23048 6790 32221 59290 44379
12270 44379 19030 -39163 778 8412 1062 8424 41052 97450 48813 4161 14019 -6279
12258f279L5525o380N748P528k1000n7554J0843k7412n730K1432L4777n9307m0180
12245a07989L8747M9207O6955J8139j009P2635L1041p1158n9245j5407m0901l1929
12233e0914K3990M4228L7614M207k6075n099k2400K5695K667K9637r06n2567j4151
12220d074J0230M2689P4491L2959k8276P356L1725o8903k0327M541L1476j6560
12208I7327q068k373J4217N2436J01646R253q1322n6849J724N7800J0678P296
12196B03765l0555r5465P306P2196n0182M568o473p602j8595M692L2235N6769
12184A72659l2285j5752k2335k3656k5590k0463p709Q548L4472N82k9562N5193
12172I4102k543N5947l338k9650M4044O2895N7945k483O080J52J7564P5922P9052
$$ plain form
12258 -6279 29246 22866 28614 36142 15142 -42412 -31569 -58981 -64711 -43279 -8502 -67809 -107989
12245 -107989 -69242 -20035 46920 65059 64050 136685 167726 96568 37323 21916 -18985 -50914
12233 -50914 -26924 17304 54918 59125 33050 27951 5551 31246 33913 63550 62644 10077 -4074
12220 -4074 6156 48845 123336 156295 128019 135375 167100 98197 77870 82411 113887 97327
12208 97327 89259 86886 101103 153539 255185 264438 183116 126267 127991 185791 196469 203765
12196 203765 173210 77745 85051 157247 107065 111633 105160 97558 78963 83655 115890 172659
12184 172659 140374 124622 102287 78631 53041 32578 24869 33417 67889 68471 38909 94102
12172 94102 91559 147506 144168 114518 158562 221457 279402 276919 282999 283151 300715 376637 455689
12159D55689O7507k1736r9902j5205J7271M7712j6010o2192j11136r4564q57j4853
12147A51724P9003P804n3893q2897j6752J3318J3905j4086N7800M1501Q290L5127
12135B40844k8696o2524n6864J777J1245J774l4200M7331N0585J3819M9590L482
12123B38163K7487K3464N2492P8291K4392J2591L3626L7227L2314P2173J4907
12112F47127J5906j7666q930j3126p9028n1894m3554j9533l4864j0332l8219j4099
12100C31788L329M7358J0808m1191j8632p2441l5747m0121J7674k4871m2998L8421
12088A73377j951m151j1714L419L651n031J0136N4050l283r3688l1678L2385O7212
12075A92734L6209J084l7602q508N138m790K0240P542j7172N6531O4278M3326
$$ plain form
12159 455689 523196 501460 401558 386353 403624 451336 435326 373134 261998 167434 166577 151724
12147 151724 230727 238531 184638 101741 84989 98307 112212 98126 155926 197427 205717 240844
12135 240844 212148 149624 92760 94537 105782 107556 73356 120687 171272 185091 234681 238163
12123 238163 265650 289114 341606 419897 444289 456880 490506 527733 560047 632220 647127
12112 647127 663033 645367 636437 623311 544283 492389 448835 429302 394438 384106 345887 331788
12100 331788 335117 382475 393283 352092 333460 261019 225272 185151 202825 177954 134956 173377
12088 173377 171426 167275 155561 158980 162631 157600 167736 221786 218503 124815 93137 125522 192734
12075 192734 228943 230027 192425 183917 189055 184265 204505 212047 194875 251406 315684 359010
12063C59010l623N853k0373p641k6705K9729P0174N7116P3880L8963j60l163j7499
12050E55561O1021M0930J736m0210k0754k1340q3282r2893k3696m4115n261N558
12038C33255o7548p572N902r70j2669k4512K2094J5422n2378l0920l2409k567
12026A45128M8775J7121L280L4899J5264M2364M2486J0550j823J6739M6468R701
12014D30952m2476l2130K9678J8195M1689J7952J6628M441P4255L7679K1940k5022
12002E93781J3139n6775n1824n1169n9120k1291J5470k7379r573l0955k0135J5263
11990C09432m786j8300o8421o5536m764P571K230L6446m4882M0296J13840J8370
11978C21496q043r08l5783k2788N90J1561L469l1971J4423L0521K3038J8940N0177
$$ plain form
12063 359010 355387 361240 340867 333226 306521 336250 406424 463540 537420 576383 576223 573060 555561
12050 555561 616582 657512 659248 619038 598284 576944 493662 400769 377073 332958 327697 333255
12038 333255 265707 258135 264037 263067 250398 225886 247980 263402 211024 180104 147695 145128
12026 145128 193903 211024 214304 249203 264467 306831 349317 359867 358044 374783 421251 430952
12014 430952 388476 356346 386024 404219 445908 463860 480488 484929 559184 596863 618803 593781
12002 593781 606920 550145 498321 447152 388032 366741 382211 354832 345259 314304 294169 309432
11990 309432 304646 286346 217925 152389 147625 155196 157426 193872 148990 189286 303126 321496
11978 321496 313453 312545 276762 253974 254564 266125 269594 237623 252046 282567 305605 324545 374722
11965C74722J1607L5014j4357q8960k8439L6174K6503k3825L8958N090l550J5678
11953C84615r9803j57878m2568L0035K4675M2330M0778m702Q572n3934k8650q160
11941A35310M8715K052M9701L319m8526L499m9567K0630J4603L8504R691k8851
11929A99080j3656r768K2116k562m0359N1016N7910N500n4529o3609q9678N0349
11917A11810M1471Q306L6759k5478J9078K1940q359p5878q993J8022L1681J3912
11905A84271j7800J7224K8744K8738k2471M992J7186j1325L1820m3158l4083n2847
11893A31291k7907m7546o8647N1082M9509j5197K6589N1332L5535J4339N271m0489
11881A65162k4305k1445K8380J9067j3603N583K0418q919l4029j2349m2078J9613
$$ plain form
11965 374722 386329 421343 406986 318026 289587 325761 352264 328439 367397 372487 368937 384615
11953 384615 284812 126934 84366 114401 139076 181406 222184 217482 226054 172120 143470 135310
11941 135310 184025 186077 235778 239097 190571 194070 144503 165133 179736 218240 227931 199080
11929 199080 185424 175656 197772 195210 154851 205867 263777 269277 214748 151139 61461 111810
11917 111810 153281 161587 198346 172868 191946 213886 205527 129649 120656 138678 170359 184271
11905 184271 166471 183695 212439 241177 218706 223698 240884 229559 261379 218221 184138 131291
11893 131291 103384 55838 -12809 38273 87782 72585 99174 150506 186041 200380 205651 165162
11881 165162 140857 119412 147792 166859 153256 158839 179257 170338 136309 123960 81882 101495
11869A01495J7529M1906j2934O503K2420k0790j7112K693L5505k253m5902q1021
11857D8039L445K0890K7379L0815k9589l146N9522M7669J0016M246J2424r149
11845B22561m4657l1032m6656J0245J7612L8094l5216n1430k4622K4365J5975
11834I5239J6271j1631J0484K9201L2111N050M994O7055L8705J702r721m2662
11822B36798l0659J6854P3889j8268k4986Q126j5134n930k7287k2200l579q628
11810A78996j9662p564Q871j9509n8642M5976L5355q603L7530P0885J9971l8622
11798B44982n0056Q658k3222l3768n850n5668q487p732M7187l950J2574L8153
11786A62821M986l038m5577j03106M1510L8111J4156J730L9954J5149j390k6211
$$ plain form
11869 101495 119024 160930 147996 154499 176919 156129 139017 141710 177215 174962 129060 48039
11857 48039 51484 72374 99753 130568 100979 97833 157355 205024 215040 219286 231710 222561
11845 222561 177904 146872 100216 110461 128073 166167 130951 79521 54899 79264 95239
11834 95239 111510 99879 110363 139564 171675 176725 181719 248774 287479 289181 279460 236798
11822 236798 206139 222993 296882 278614 253628 261754 246620 240690 213403 191203 187624 178996
11810 178996 159334 151770 160641 141132 82490 128466 163821 155218 192748 263633 283604 244982
11798 244982 194926 203584 180362 146594 140744 85076 76589 68857 116044 112094 124668 162821
11786 162821 167807 164769 119192 16086 57596 95707 109863 111593 151547 166696 165306 139095
11774A39095j6055M5174j5097q4089J5121L6999o134J80K2934j5257l4879k8941
11762E9051L9915K6758K3582j3125J5654K0168J8869j8305o3807n7382O1928J3588
11750A26894k633n4045r728K441Q761L51r934r402M3194N159P34J8370l5988N891
11736I0065J8003m333R0685K5922k2304m0997k6737M0571k8569k9833K4938J0917
11724A48328J8913j8027J1218K3730K58j5488Q742j1941m0309j2201J9431L5398
11712A68052K2473l7540m5779m2965J3652O1996J3232k4286J4035j1352P337k2037
11700A16818k6708j2743L5032K1390k0266J8212rJ2713m143J9466J8642J8556
11688A96960k6718o884m1034k2957L2178k8253M3890K8435O0662j1533k0776o0958
$$ plain form
11774 139095 123040 168214 153117 69028 84149 121148 115014 115194 138128 122871 87992 59051
11762 59051 98966 125724 149306 136181 151835 172003 190872 172567 108760 51378 113306 126894
11750 126894 124261 70216 60488 62929 71690 72041 62107 52705 95899 101058 101792 120162 84174 90065
11736 90065 108068 103735 194420 220342 198038 157041 130304 170875 142306 112473 137411 148328
11724 148328 167241 149214 160432 184162 184420 168932 177674 165733 125424 113223 132654 168052
11712 168052 190525 152985 107206 64241 77893 139889 153121 128835 142870 131518 138855 116818
11700 116818 90110 77367 112399 133789 113523 131735 131726 144439 140296 159762 178404 196960
11688 196960 170242 163358 122324 99367 131545 103292 147182 175617 236279 224746 203970 143012
11676A43012l2366L6134o031l5182o0601K0100L6190l5723l0817J8250M9384Q0593
11664A82943J3124n168j3191K097K8036J3057J254M5865K4672p1195n3470O7206
11652B35230K3970k7547N844Q97K8521j6310m1563J6542q073O7319K929l0335
11640B57424K370J9547K0088L0040K24M6750j7107J63n873K4162K131J8763K5118
11627D23800J774M565K0757J5292j10P2627N2263J3060J22315J26462R0923J68971
11615A112699J33835J82578J88434J56424J26540J08140K3881l4713q3675j21517
11605A792626j41983j30563j21579j19900n6772n2472k0398j6796k7294k1271
11595A083598M3732J2828J740L0088K9884M2007K1800M7391J21948J55688P3569
$$ plain form
11676 143012 110646 146780 140749 105567 44966 65066 101256 65533 34716 52966 102350 182943
11664 182943 196067 190899 177708 179805 207841 220898 222152 268017 292689 221494 168024 235230
11652 235230 259200 231653 237497 238394 266915 250605 209042 225584 217511 284830 287759 257424
11640 257424 259794 279341 299429 329469 329693 376443 359336 359499 353626 377788 379919 398682 423800
11627 423800 425574 430139 450896 466188 466078 538705 590968 604028 726343 852805 943728 1112699
11615 1112699 1246534 1429112 1617546 1773970 1900510 2008650 2032531 1997818 1914143 1792626
11605 1792626 1650643 1520080 1398501 1278601 1221829 1169357 1148959 1132163 1104869 1083598
11595 1083598 1127330 1140158 1141898 1171986 1201870 1243877 1265677 1313068 1435016 1590704 1664273
11584A664273J57957J23179N0937O4087J13340J26859P6669O1484R1250j6337
11574B513698o3609m7365q4540j18479j74372M908L5989j37615j36089n0372n1794
11563A690360j38265p6201l8872m9103o2556m7401l2216K4511j9629j9376Q17
11552A232069k3915J3024O7594R9171N3567Q9770J41799J79487J02541N3130J19774
11541B128011J2585r0485j09884j45950j02964j29872j19039j51515j28073j59980
11531A002834j03586n6879n1412p9949l9500Q864o8977n6977k5428N8865l1676
11520E56179k3165o481k937R197K1688m4016m6554M073m9638l9465M739M3388
11508D27008J2616J1865l4450n4848l5905j6693M4509o135M0068K4544k925P999
$$ plain form
11584 1664273 1822230 1945409 1996346 2060433 2173773 2300632 2377301 2438785 2530035 2513698
11574 2513698 2450089 2402724 2318184 2199705 2025333 2030241 2066230 1928615 1792526 1742154 1690360
11563 1690360 1552095 1475894 1437022 1387919 1325363 1277962 1245746 1270257 1250628 1231252 1232069
11552 1232069 1208154 1221178 1288772 1387943 1441510 1531280 1673079 1852566 1955107 2008237 2128011
11541 2128011 2140596 2050111 1940227 1794277 1691313 1561441 1442402 1290887 1162814 1002834
11531 1002834 899248 842369 790957 711008 671508 680372 611395 554418 528990 587855 556179
11520 556179 533014 526533 523596 532793 554481 510465 463911 467984 418346 378881 383620 427008
11508 427008 439624 451489 417039 362191 326286 309593 354102 347967 388035 412579 409654 417653
11496D17653o187n9214k0210R69k9379J8943N7866M3604o003o5959n9055k4654
11484B68374J001l2335J0126M880j168J083k2868M7045L9674L9974O5186O59J3409
11471D35040l0754m9407j0000J1173k6511l3459K1012M3537N8415L6940M848l5559
11459D25275K2798J2818K3599n4160k5100k5320J4513M4243L0868l4068K0176
11448D55642l377k5634m2885J5149O5077O1694J4094J86l5187J7335M045o090
11436E20049r5505l1187L0007m2443j9979j846Q50K8637K8541N05L5193k1899
11424D30923J6377K0104L8970j1299l4645J444n505n6559N322N3745N3617K8167
11412E40661K9446L4715j4792n225M6001L8880k0514j3137J2340j7203n7814j5234
$$ plain form
11496 417653 411466 352252 332042 333011 303632 322575 380441 424045 418042 352083 293028 268374
11484 268374 269375 237040 247166 252046 250878 251961 229093 276138 315812 355786 420972 421631 435040
11471 435040 404286 354879 344879 356052 329541 296082 317094 360631 419046 455986 460834 425275
11459 425275 448073 460891 484490 430330 405230 379910 394423 438666 469534 435466 455642
11448 455642 452265 426631 383746 398895 463972 525666 539760 539946 504759 522094 526139 520049
11436 520049 424544 393357 423364 380921 360942 359096 359946 388583 417124 417629 452822 430923
11424 430923 447300 467404 506374 495075 460430 461874 456369 399810 405132 458877 512494 540661
11412 540661 570107 604822 590030 584805 630806 669686 649172 636035 648375 631172 573358 558124
11400E58124k424N3382J2367j6033j3659J1396J5453q6909p3834j2063K5844l5628
11388D36016N4531P7267m2749o3950M14L091J04383M6107k620L8409M2363P9433
11376G72695M2261J845K3692N7400K7473n2855q7103k7408n9148j3572n1320J0341
11364F44301p1855n3833K3854N9151Q679j1787k5334l5077K4427m8059m568M6301
11352E56200J2998K0689N4917O5277K6881L6072p3993q64O7454N9444N5658K0217
11340I00950m7099m4808L2262k5212k6835j9874m3762J5367P6497L0175P201M0688
11328H95550K8835j3835K1784m0795J5809J7796M3191K2293N1003N9209J17597
11317A218437J45590J10787O8026R6898Q0888P4686O9683J9066K1549J8644n8203
$$ plain form
11400 558124 555700 609082 621449 605416 591757 603153 618606 531697 457863 445800 471644 436016
11388 436016 490547 567814 525065 461115 461529 464620 569003 615110 612490 650899 693262 772695
11376 772695 814956 816801 840493 897893 925366 872511 785408 758000 698852 685280 633960 644301
11364 644301 572446 518613 542467 601618 610297 598510 573176 538099 562526 514467 509899 556200
11352 556200 569198 589887 644804 710081 736962 773034 699041 698177 765631 825075 880733 900950
11340 900950 853851 809043 841305 816093 789258 769384 725622 740989 817486 847661 854862 895550
11328 895550 924385 910550 932334 891539 907348 925144 968335 990628 1041631 1100840 1218437
11317 1218437 1364027 1474814 1542840 1639738 1720626 1795312 1864995 1884061 1905610 1924254 1866051
11306A866051m501L3234j0558j4187n733r771n6232p698J4940k0095l9383k9212
11294A716855J0328K4352J0849j2603O200k0597N1308M8478J4050P1182N3280
11283A973682L4299L7222P8248J02679R7560J1388N3852M0613K8801j8217p0654
11272B369473J5768P3240M5710J7261L9022O7368M0814n9501J4792R1849J05230
11261B821026R4714O3265k968K9223k4888l834L403K544O5579M5734N5433N7213
11249C206444Q9157Q7095J33128R5785J00090Q7349P8274P4983P1852N8975M5646
11238D128778P3605N6397J23947J57000J24476J61696J97387J75306K10224J71563
11228E580379J49977J97178K06441K60940K57607L21296K89111K98072L26701
$$ plain form
11306 1866051 1861550 1894784 1884226 1870039 1864306 1854535 1798303 1790605 1805545 1785450 1746067 1716855
11294 1716855 1727183 1751535 1762384 1749781 1755981 1735384 1786692 1835170 1849220 1920402 1973682
11283 1973682 2007981 2045203 2123451 2226130 2323690 2335078 2388930 2429543 2458344 2440127 2369473
11272 2369473 2385241 2458481 2504191 2521452 2560474 2627842 2668656 2609155 2623947 2715796 2821026
11261 2821026 2915740 2979005 2976037 3005260 2980372 2976538 2979941 2982485 3048064 3093798 3149231 3206444
11249 3206444 3295601 3382696 3515824 3611609 3711699 3799048 3877322 3952305 4024157 4083132 4128778
11238 4128778 4202383 4258780 4382727 4539727 4664203 4825899 5023286 5198592 5408816 5580379
11228 5580379 5730356 5927534 6133975 6394915 6652522 6973818 7262929 7561001 7887702
11219G887702L35467L57721M05057N46215N46557N76987O93746P74903Q89700
11210A3014055J039161J227114J422984J675772J939801K251547K643621L086638
11202B8300693L647415M384748N362501O676819Q395539J0601804J3507773J7308918
11194I8186210K2015062K7523015L3033199L6935013L7091125L2637442K4237225
11187C11658291J3486057J384130j0520509k0187463k5820705k7367564k5915237
11180B16717000k2449553j8069139j3582877r596300o221981l632323j432694
11173A41732133L76719K068448L693897N462567P310482R391114J1657784J4099688
11165A95792832J6615227J8812749K0246146K0886404K0946968K0669771K0236310
$$ plain form
11219 7887702 8223169 8580890 8985947 9532162 10078719 10655706 11349452 12124355 13014055
11210 13014055 14053216 15280330 16703314 18379086 20318887 22570434 25214055 28300693
11202 28300693 31948108 36332856 41695357 48372176 56767715 67369519 80877292 98186210
11194 98186210 120201272 147724287 180757486 217692499 254783624 287421066 311658291
11187 311658291 325144348 326528478 316007969 295820506 269999801 242632237 216717000
11180 216717000 194267447 176198308 162615431 153019131 146797150 143164827 141732133
11173 141732133 142108852 144177300 147871197 153333764 160644246 170035360 181693144 195792832
11165 195792832 212408059 231220808 251466954 272353358 293300326 313970097 334206407
11158C34206407J9157788J7122110J4189567J0576162O250282J438170l323468
11151C99617018p490648j0548795j2479290j3507868j4102438j4492600j4924935
11144C12070444j5253271j5538966j5693559j5397909j4578598j3379742j1887861
11137B10340538j0283269q772650p346569n844036m380124k898470j062472J116976
11129A70869924L853283P406712J1996996J7375050K3206230K8448844L2162620
11122B95319659L3427448L0522566K2176354R594032m221790j6788617k7071829
11115C42957823l4354870l7343235l5816318l1263976k5787683k0688039j6488207
11108A41215495j3260024j0864529r062679p705266o657390n938751n428103m872493
$$ plain form
11158 334206407 353364195 370486305 384675872 395252034 401502316 402940486 399617018
11151 399617018 392126370 381577575 369098285 355590417 341487979 326995379 312070444
11144 312070444 296817173 281278207 265584648 250186739 235608141 222228399 210340538
11137 210340538 200057269 191284619 183938050 178094014 173713890 170815420 169752948 170869924
11129 170869924 174723207 182129919 194126915 211501965 234708195 263157039 295319659
11122 295319659 328747107 359269673 381446027 391040059 386818269 370029652 342957823
11115 342957823 308602953 271259718 235443400 204179424 178391741 157703702 141215495
11108 141215495 127955471 117090942 108028263 100322997 93665607 87726856 82298753 77426260
11100G7426260m438025m105903l791391l448744l151450k825812k573189k361648
11092E0730098k205491k022270j875297j705452j681653j502025j442647j356443
11084C6938820j257779j264836j135914j083763j102733j005084q79699q78763
11076B8330249q20026q19711p44358p29940o75905o13528o27840o61062o79879
11067B1958000o25742o42186o91384n94959n88920n31061m91238n24130m84537
11058A6783843m42232m37025m44020m68234m32611l91643l46018l38723l36905
11049A3146432l14107l35895l35229l16811k86295k95325k97581k68993k58342
11040A0437854k65018k28422k20394k03013k03957j93673j71166k06289j81978
$$ plain form
11100 77426260 72988235 68882332 65090941 61642197 58490747 55664935 53091746 50730098
11092 50730098 48524607 46502337 44627040 42921588 41239935 39737910 38295263 36938820
11084 36938820 35681041 34416205 33280291 32196528 31093795 30088711 29209012 28330249
11076 28330249 27510223 26690512 25946154 25216214 24540309 23926781 23298941 22637879 21958000
11067 21958000 21332258 20690072 19998688 19403729 18814809 18283748 17792510 17268380 16783843
11058 16783843 16341611 15904586 15460566 14992332 14559721 14168078 13822060 13483337 13146432
11049 13146432 12832325 12496430 12161201 11844390 11558095 11262770 10965189 10696196 10437854
11040 10437854 10172836 9944414 9724020 9521007 9317050 9123377 8952211 8745922 8563944
11031H563944j86241k50490k53064j83017k04544j58777j69601k05505j39723
11022F812982j24732j84203j94959j16412j16918j36354j45877j03002j53287
11013E537238j92032n1552m2687p9839q5814m6687q9541o8525j02468o7209k7756
11002D683128q3116p5012n7933o6731n2333p4465o2303o7513j20561j30254j05415
10991C787492j09822r6113n1262r936q6433j04672j00083j16098q2883q3855p7179
10980B869156p8409r0333o6241q4116k0381n6792j38591j01976o0019p4476m7830
10969B049992k8180l6187o2696n6259l9066m5504m7065L7602k4811m1244m1085
10958A665497j8579K506Q2783l1976j13330j2372M4604M0917l9384m3342j0426
$$ plain form
11031 8563944 8377703 8127213 7874149 7691132 7486588 7327811 7158210 6952705 6812982
11022 6812982 6688250 6504047 6309088 6192676 6075758 5939404 5793527 5690525 5537238
11013 5537238 5345206 5293654 5250967 5171128 5085314 5038627 4949086 4880561 4778093 4710884 4683128
11002 4683128 4600012 4525000 4467067 4400336 4348003 4273538 4211235 4143722 4023161 3892907 3787492
10991 3787492 3677670 3581557 3530295 3520359 3433926 3329254 3229171 3113073 3030190 2946335 2869156
10980 2869156 2790747 2700414 2634173 2550057 2529676 2472884 2334293 2232317 2172298 2097822 2049992
10969 2049992 2021812 1985625 1922929 1866670 1827604 1782100 1735035 1772637 1747826 1706582 1665497
10958 1665497 1646918 1649424 1732207 1700231 1586901 1574529 1619133 1660050 1620666 1577324 1566898
10947A566898N724j6065o0067m1123l1088k7109J8289M488k4094J9435Q785j3465
10935A410608m6762k8959P200q584m0716r2642q2600N0071L0601K7387k7023O435
10923A205016J0020J0053q13J4121m1342n9366l3672N4924K2221k0561n7841m2505
10911A060255J8440o080R554K2184O7224j4610p4252q0814l9385N9431J3335m9580
10899I85702p057L6419j2332k749o0227k7217L7009L3661J4362k748q0568o5721
10887H48534J5961j915m7975l8964o015O061n177n0663p4927k7204m1513L0205
10875F06408J3081J1392l8142j6007N918K0267j2173j2069J0646m1651K2056N0008
10863F19734k1765k5547Q906M8581j143o0508l8228l8750m5608l7264j2356K6214
$$ plain form
10947 1566898 1572622 1556557 1496490 1455367 1424279 1397170 1415459 1419947 1395853 1415288 1424073 1410608
10935 1410608 1363846 1334887 1342087 1333503 1292787 1200145 1117545 1167616 1198217 1225604 1198581 1205016
10923 1205016 1215036 1225089 1224276 1238397 1197055 1137689 1104017 1158941 1181162 1160601 1102760 1060255
10911 1060255 1078695 1072615 1082169 1104353 1171577 1156967 1082715 1001901 962516 1021947 1035282 985702
10899 985702 978645 1015064 1002732 999983 939756 912539 949548 983209 997571 994823 914255 848534
10887 848534 864495 862580 814605 775641 769626 775687 770510 719847 644920 617716 576203 606408
10875 606408 619489 630881 592739 576732 582650 602917 590744 578675 589321 547670 569726 619734
10863 619734 597969 572422 581328 629909 628766 568258 530030 491280 445672 408408 396052 422266
10851D22266K1994K6o434M109m7769J0139R861l8351k928k5575o432L1467l1698
10838C40675k989P793L062l1161p3435K8623N1235L0006j7020n7076m288O370
10826B81795M4304M3432m1961L413l3052n07K1610K2933n8240j8485m0243j2748
10814B12251m5664m697L2506J4200l7153J6022K5397O6006N5160j9205l1841l8768
10802B44214K2704K7426m6451j456n306K6369l2342j6939J1133L4277k3724J212
10790B41117J766K6623l0608n3685k6989J4045P5728j3981l521P622J8253N3705
10778C10075m7595n2025m4J0496N463O1315Q5351L8486J8054K774N7983J00686
10766E91019P1270J13023J53782K30573K13471J46863J31642J22682R8966J1832
$$ plain form
10851 422266 444260 444286 437852 441961 394192 404331 414192 375841 372913 347338 340906 372373 340675
10838 340675 337686 345479 348541 317380 243945 272568 323803 353809 336789 279713 275425 281795
10826 281795 326099 369531 327570 330983 297931 297424 319034 341967 283727 265242 224999 212251
10814 212251 166587 161890 194396 208596 171443 187465 212862 278868 334028 314823 282982 244214
10802 244214 266918 294344 247893 246437 241131 267500 235158 218219 229352 263629 239905 241117
10790 241117 242883 269506 238898 185213 158224 172269 247997 234016 230495 238117 256370 310075
10778 310075 262480 210455 210411 220907 226370 287685 373036 411522 429576 432350 490333 591019
10766 591019 662289 775312 929094 1159667 1373138 1520001 1651643 1774325 1873291 1885123
10756A885123p739n4547j32744q9914j34155k23688j33803j16513j9231l0439
10746I42350n2781m1944j2138J8140Q0255R1381M0593K4710k0061L8167J40710
10735A249382J29197J77654J06461N1360O9781J07439J02176J46657N0516q141
10725B182482K6001K7010P8643l991o5719j09692j14701q8980n6166q9097m5377
10714A740413q5103j10133l9675p0648m7330j13143j10983p1979L519l0213l8376
10703A026349l4429J2568l6063L1960J16323Q0781O9358J30268J55622J63823
10693A716560K19110K02964J50220K9563K080j57746k35944j45542j58733k14882
10683A407650j45619j08093j37456j49340r9317n9088j12847l9978J6699o12R021
$$ plain form
10756 1885123 1877384 1822837 1690093 1600179 1466024 1242336 1108533 992020 972789 942350
10746 942350 889569 847625 835487 853627 933882 1025263 1065856 1090566 1070505 1108672 1249382
10735 1249382 1378579 1556233 1662694 1714054 1783835 1891274 1993450 2140107 2190623 2182482
10725 2182482 2208483 2235493 2314136 2310145 2244426 2134734 2020033 1931053 1874887 1785790 1740413
10714 1740413 1655310 1545177 1505502 1434854 1387524 1274381 1163398 1091419 1094938 1064725 1026349
10703 1026349 991920 1004488 968425 1000385 1116708 1197489 1266847 1397115 1552737 1716560
10693 1716560 1935670 2138634 2288854 2318417 2320497 2162751 1926807 1781265 1622532 1407650
10683 1407650 1262031 1153938 1016482 867142 767825 708737 595890 555912 572611 571999 581020
10672E81020o7851k6878k3653J658M2205L1203M3442p0300o9840o3895J882l1489
10660C47504p766K0965k9677o6886O0635M3363n494N4880p94M247j2237L0929
10648D39669M5056K3965K73k9069n0393j7622k9827K5119k563l8228o2568J2114
10636C15926k5820J2301M208j9045j8289j6447j2019L4710L833l1391r7224q1595
10624F9148J175N4928M2163O503N526J8687k1118K8521l5199l9839P740L268k2291
10611A19212M4229L1509M5853J3342N0793J7895M0608J9055Q336K1264M2667L662
10599D58425J2579n5826m1224K9035k0716o6001m2832p1601l7429L7422O095o950
10587B00977J7687k408O347K4920q6989k2291k8190n5499J2811J3032N447k1011
$$ plain form
10672 581020 513169 486291 462638 464296 506501 537704 581146 510846 441006 377111 378993 347504
10660 347504 339738 360703 331026 264140 324775 368138 362644 417524 416730 420977 408740 439669
10648 439669 484725 508690 508963 479894 429501 411879 382052 407171 404608 366380 303812 315926
10636 315926 290106 302407 306615 287570 269281 252834 240815 275525 279358 247967 150743 69148
10624 69148 70323 125251 167414 173917 179443 198130 177012 205533 170334 130495 138235 141503 119212
10611 119212 163441 194950 240803 254145 304938 322833 363441 382496 390832 412096 454763 458425
10599 458425 471004 415178 373954 402989 382273 316272 273440 201839 164410 201832 207927 200977
10587 200977 218664 216256 222603 247523 160534 138243 110053 54554 67365 80397 85844 64833
10575F4833J787K2078K6906L2035J0625k6490L700j9645l8069N3360k2672k4842
10563H3606J0847m4084K7544M5815K7123J3388O092L1465J3574q600J8522J1261
10551B36553k9759k1578O3174k0835j9447m9848k9771p508M5886K4391m2073k6850
10539A22335l101K928j9829n045M2923o1587n1482k1983M376K2933j8917L4087
10527D7638q739p031j2466J7306M3820P359j7871k2822J4956P0596P4976j1819
10515A95903o4231o3418r219M2089q8R770m7829j10142K4287O6273L6039j5312
10503F4122k3015l4271J7393M5613K8615m1868k9711J3420k2771J924r183n074
10491E194m4686j9346O9626P9287k0796N2141J715m9222n2082j7176l225N0758
$$ plain form
10575 64833 66620 88698 115604 147639 158264 131774 135474 115829 77760 131120 108448 83606
10563 83606 94453 50369 77913 123728 150851 164239 170331 201796 215370 206770 225292 236553
10551 236553 206794 185216 248390 227555 208108 158260 128489 120981 166867 191258 149185 122335
10539 122335 119234 122162 102333 97288 140211 78624 27142 5159 9535 32468 13551 47638
10527 47638 38899 31868 19402 36708 80528 87887 70016 47194 62150 132746 207722 195903
10515 195903 131672 68254 59035 101124 101036 110806 62977 -47165 -22878 43395 79434 64122
10503 64122 41107 6836 24229 69842 98457 56589 26878 40298 17527 19451 10268 5194
10491 5194 -39492 -58838 10788 90075 69279 121420 123135 73913 21831 4655 1430 52188
10479E2188J1754J1592l0717l3697j120L0020j5844l9167J5067m4450j5115O3235
10467C746J9841J731N639L6575M0264j1587m3379J365L4633l4021J2919P251K1766
10454I6743K2690m6787K0710L336l301M57J7869r061m4337K3412M5289L7650k5846
10441A38824n1695l2839m966j7397m3669l914M2146M9662n1219m0070L3749K5822
10429D4434M1629N2734p8384q2110M3720K8550k5973O452M237j8253o090K2028
10417C2974j9934j8539J2345l370L6812M7528l7264R46j4015k120L4956K7426
10405I7745J8882l558j8470L7898j1988r5575m5953k6202Q843M4983N1650P3989
10393A32244m1855l0414m0699m46n225k119N5518K831J4449K2241J2480k2474
$$ plain form
10479 52188 63942 75534 44817 11120 10000 40020 24176 -14991 76 -44374 -59489 3746
10467 3746 23587 25318 30957 67532 107796 96209 52830 54195 88828 54807 67726 74977 96743
10454 96743 119433 72646 93356 96692 93391 93848 111717 102656 58319 81731 127020 164670 138824
10441 138824 87129 54290 49324 31927 -11742 -15656 26490 76152 24933 -15137 18612 44434
10429 44434 86063 138797 60413 -21697 22023 50573 24600 31052 35289 17036 10946 32974
10417 32974 13040 -5499 6846 3476 40288 87816 50552 51498 37483 35363 70319 97745
10405 97745 116627 113069 94599 132497 120509 24934 -21019 -47221 -38378 6605 58255 132244
10393 132244 90389 59975 19276 18830 13605 11486 67004 69835 84284 106525 119005 96531
10381I6531n5614N52l81j8996l3745j2687J9755M1584L6651j0378K7837k4536
10369F6573j6424j1371r170N0923R0p8806m8313k1203k5782J05108N7575L3135
10357A02335K4489l4893m5373N5702J4869k6126o2428R243L7804r698K528M8940
10345A17392P62j0505k3118J855J6973m3559k4225M0091j2120k5294o1574L2926
10333I604O669N632N2540j6929N1009J2481j8155J024O984O184o438j3442l0598
10320F6565q384P5310m598k8992L76K1250j3325j1166l5390J049l0599J9865J0082
10307F2043J0249N99Q611j5483K5784K5964n8072j3713l9857N2409K8547M254
10295I1335k335n079M2433K3850m8362M6740P139Q59n656o961j5006p6398k7704
$$ plain form
10381 96531 40917 41469 41088 22092 -11653 -24340 -4585 36999 73650 63272 91109 66573
10369 66573 50149 38778 29608 80531 80621 1815 -46498 -67701 -93483 11625 69200 102335
10357 102335 126824 91931 46558 102260 117129 91003 28575 37818 75622 65924 68452 117392
10345 117392 118154 107649 84531 86386 103359 59800 35575 75666 63546 38252 -23322 9604
10333 9604 16273 21905 74445 57516 108525 121006 102851 103875 110859 117043 110605 97163 66565
10320 66565 58181 133491 128893 99901 100277 121527 108202 97036 61646 62695 32096 51961 62043
10307 62043 72292 72891 81502 66019 91803 117767 59695 45982 6125 58534 87081 91335
10295 91335 89000 83921 126354 150204 101842 148582 155721 156580 150924 143963 128957 52559 24855
10282B4855K8439J2140m439m2515j4323l7577M3367J6761K2299l245J2977K1990
10270H0729L8646j2800j6266L530N4085p028l3006J1474J2175j6854K5762N232
10258A45679m5938K1897k3216K3605m221k7687k3939n1854l6462J4496k1702n1415
10246h0757K3482P4846M3445j22Q559k3329l011k2507R726k0178M4517M079o0993
10233b243o70j9115L3389O0012R1371k2882m3034J4323O09o3219k6922L406k470
10220B2555j8142l6524q959M6136L253l3791L8956J07598M4593p0221l5082j032
10208E9340J7692M8279j2754j8567K3513P6554L123n9926N8870L6772m679m5838
10196A82379k3660Q795j5427j6014M3639P030K563n2311r896k289n4Q90K3798
$$ plain form
10282 24855 53294 65434 60995 18480 4157 -33420 9947 26708 49007 45762 58739 80729
10270 80729 119375 106575 90309 93839 147924 140896 107890 119364 131539 114685 140447 145679
10258 145679 99741 121638 98422 122027 117806 90119 66180 14326 -22136 -7640 -29342 -80757
10246 -80757 -57275 17571 61016 60894 69453 46124 43113 20606 30332 10154 54671 58750 -2243
10233 -2243 -2913 -22028 11361 71373 162744 139862 96828 111151 111760 48541 21619 25025 22555
10220 22555 4413 -32111 -41070 5066 8319 -25472 13484 121082 165675 95454 60372 59340
10208 59340 77032 125311 112557 93990 117503 194057 197180 137254 196124 232896 228217 182379
10196 182379 158719 167514 152087 136073 179712 186742 189305 136994 127098 124809 124755 125645 149443
10183A49443k1624n2813K5157O2428J2455p160m314m449q454O066n492o396M9377
10170A94224k0805k7623J5883j0464m6613q945k2072k5253j5266J8470O1340O1009
10158A73885J34l4921k2454K6368L000m7249M7651l0188o5262m049O7154P1126
10146A85195j7788k0320l4862k1469L8241j412Q971J4751K1334k4928l5354M831
10134A17190K1881Q280n4591r336K8056j4129M15K4990m608M9347j1766J718P2989
10121B30436K4964J0362k8368l7169j407m2559l5549J2655L412M25L4563N232
10109A76997q0951J487M4079L749K5508K5961M1421J0786n5578J8241M6037M5529
10097C03266n0912j7210K0690k6304k8583j2524K6529l0230l9503n1163n1153
$$ plain form
10183 149443 127819 75006 100163 162591 175046 167886 163572 159123 150669 156735 151243 144847 194224
10170 194224 173419 145796 161679 151215 104602 95657 73585 48332 33066 51536 112876 173885
10158 173885 174019 139098 116644 143012 146012 98763 146414 116226 50964 46915 114069 185195
10146 185195 167407 147087 112225 90756 128997 127585 136556 151307 172641 147713 112359 117190
10134 117190 139071 147351 92760 83424 111480 97351 97766 122756 118148 167495 155729 157447 230436
10121 230436 255400 265762 237394 200225 198818 156259 120710 133365 136777 137202 171765 176997
10109 176997 96046 97533 141612 145361 170869 196830 238251 249037 193459 211700 257737 303266
10097 303266 252354 235144 255834 229530 200947 188423 214952 184722 145219 94056 42903
10086D2903o266j0329k135J4711L7344K9396k6535m3366J9568N8015N5860K4296
10074A93462k4410j694q499k2990J4198M5868R82M1214J4473m976k8958k4109
10062A94561q674j0986k0546J3014k9378M91J6369K1919K0669O798k2527l2527
10050A49183R267O1201q613n4909N4167N603n6196j0527j4580k1611k7870n75
10038H4540N2053K7194J1131K5769k4078q706k9351k0291J2503n7376L632K8673
10026A05693P2235K8072Q700l919J617o2047l4524L7209J2040K7766j0912K8370
10014B10300m5873m3749K0238J02860j9745l0631p927m2260j767L8397l3291m8714
10002I7838j7452l4375M5379M3442P785m4289k082l749j1968J6552M9522k465
$$ plain form
10086 42903 36637 26308 24173 38884 76228 105624 79089 35723 55291 113306 169166 193462
10074 193462 169052 167358 158859 135869 150067 195935 196917 238131 252604 247628 218670 194561
10062 194561 185887 174901 154355 167369 137991 138482 154851 176770 197439 204237 181710 149183
10050 149183 158450 219651 211038 156129 210296 215899 159703 149176 134596 112985 85115 84540
10038 84540 136593 163787 174918 200687 176609 167903 138552 118261 130764 73388 77020 105693
10026 105693 177928 206000 214700 210781 212398 150351 115827 153036 165076 192842 181930 210300
10014 210300 164427 120678 140916 243776 224031 193400 185473 143213 141446 179843 146552 97838
10002 97838 80386 46011 91390 134832 142617 98328 96246 92497 80529 97081 146603 144138
9990A44138l3730j9851k5216o4630N6243J10323O8967J801O291j9416j9788m8849
9978A56283J6728O5721M0478K0826k8876m610j4147j0206m1052K7490J06898k0561
9966C14972J1021M2432K2582l2635l1775P212K0029J2344J10399P0037M6821J8514
9954F11953O5149P4825K1068k1503j2725p3982j35957o9298J5862J869o997l8135
9942D32129m0532k7783k0834J0587L9308Q3099K5999O635M1177L3652N0249L768
9930F37454l2715N9081J24358J00553J16082Q3985M8356L3852N7206P4524l4098
9919A268638k0780L4909K9952L4903J6891l8287K1020l7033n4100r513l2382m713
9907A209505j3674j7592O4768J8943o5925k3986p8145j0411j8314j2549k9101
$$ plain form
9990 144138 110408 90557 65341 711 56954 167277 236244 238045 244336 224920 205132 156283
9978 156283 173011 238732 279210 300036 271160 266550 252403 242197 201145 228635 335533 314972
9966 314972 325993 368425 391007 358372 326597 333809 353838 366182 476581 546618 593439 611953
9954 611953 677102 751927 772995 751492 738767 664785 528828 459530 475392 477261 470264 432129
9942 432129 391597 363814 342980 353567 392875 475974 501973 508608 549785 583437 633686 637454
9930 637454 604739 663820 788178 888731 1004813 1088798 1137154 1171006 1228212 1302736 1268638
9919 1268638 1247858 1282767 1312719 1347622 1364513 1326226 1347246 1310213 1256113 1246600 1214218 1209505
9907 1209505 1195831 1178239 1243007 1261950 1196025 1172039 1093894 1083483 1065169 1052620 1023519
9896A023519N3454O0255N5575M3395M0243N6290R2930Q7739N4297L4893P9375
9885A681965Q8034N8217N9617L3022k8917j0363J3478k0953n1128n4791n5109
9874A713072p6159m8876n8025k4139j2775r6572m7990j1091k4932o9577j5302
9863A227634J9137k0715m9516J1289L2800P877k1980K0819M6202R1445J3814l43
9851A378463M1714P8179L45n0986J7813J1383j2071M554L1285J0851L4183k6811
9839A518902j28261j02479m9313n2174n5595m5036n1024q4430k3792l5571r992
9828H81235J158j3248p1536q2249k3065J6090J8762L3685J3841k6708r862P6151
9816H14254Q3282M9992j6826J5706k9697M3442N7178J5542j0004k5518l7974o3241
$$ plain form
9896 1023519 1076973 1137228 1192803 1236198 1276441 1332731 1425661 1513400 1567697 1602590 1681965
9885 1681965 1769999 1828216 1887833 1920855 1891938 1881575 1895053 1874100 1822972 1768181 1713072
9874 1713072 1636913 1588037 1530012 1505873 1493098 1396526 1348536 1337445 1312513 1242936 1227634
9863 1227634 1246771 1226056 1176540 1187829 1220629 1228506 1206526 1227345 1273547 1364992 1378806 1378463
9851 1378463 1420177 1498356 1498701 1447715 1465528 1476911 1464840 1469394 1500679 1511530 1545713 1518902
9839 1518902 1390641 1288162 1238849 1186675 1131080 1086044 1035020 950590 926798 891227 881235
9828 881235 882393 869145 797609 715360 692295 708385 727147 760832 774673 747965 738103 814254
9816 814254 897536 947528 930702 946408 916711 960153 1017331 1032873 1022869 997351 959377 896136
9804H96136k0491j4265o2975n4495q1829r8673m8870m0759k1062l93N5504K9362
9792E37190j6677l0658L2491Q1849N6818k1141m4319K4221K7678k6866L039l0079
9780E93546p4092n10M2032N218j1933j3360J0431j513j4379n7560L906l816O843
9767D84813j3469p1n0169J8706L2795M508J3401N457K3502q41J4791M4583k2419
9754E55587l4381K9787M9886k9002r111R518J3720N2232K5240M127L182k6230
9742F44555l3587J1016K4780M2617L9776n580m1625l4913m798L0019J7914o9775
9730F20399l264M0360k0006O66j191m1696P242P1479N4976l6878k2246m1019k8458
9717F00364k064o269L7141K0041K7815J6859o2744K7144M3478J7113K2760K1294
$$ plain form
9804 896136 875645 861380 798405 743910 662081 563408 514538 473779 452717 452324 507828 537190
9792 537190 520513 489855 522346 604195 661013 639872 595553 619774 647452 620586 623625 593546
9780 593546 519454 518944 560976 566194 554261 540901 551332 549819 535440 477880 481786 477970 484813
9767 484813 471344 471273 421104 439810 472605 477113 490514 495971 519473 518632 533423 578006 555587
9754 555587 521206 550993 600879 571877 562766 572284 586004 638236 663476 667603 670785 644555
9742 644555 610968 621984 646764 689381 729157 723577 681952 647039 642241 672260 690174 620399
9730 620399 617135 657495 637489 638155 636964 595268 602510 673989 728965 692087 669841 628822 600364
9717 600364 598300 592031 629172 649213 677028 693887 631143 658287 701765 718878 741638 762932
9705G62932k1352M2235J1255K6083l0763m5546L2127K0185j3303K667m2458K1482
9693G65544K8304J7517R339P579K4792L0205k9204Q314L9834O5618J5015L6214
9681A019071k2006o402J1039O0076P6632o101L7213R8694K3102m8982j466J3142
9669A254012k709l9312O2464K3075P311k8500j2693m482m2709j7544K2487O4505
9657A285905j1859m6615N102R266L1781J5414J3099k7456j1024O553L9322J27211
9645A436699O0417L2152J9026M4744P916O7396J56647O6402N0476K2810L6416
9634B001101N0613j6090o7956R209L6447K8641p147j7114J1025N009J5472N1219
9622B100429q907O873j3808J1725R1971L5906J5656M2370O4455K4017O4203M4791
$$ plain form
9705 762932 741580 783815 795070 821153 790390 744844 776971 797156 783853 786520 744062 765544
9693 765544 793848 811365 820704 828283 853075 883280 854076 862390 902224 967842 982857 1019071
9681 1019071 997065 990663 1001702 1061778 1138410 1132309 1169522 1268216 1291318 1242336 1240870 1254012
9669 1254012 1251303 1211991 1274455 1297530 1304841 1276341 1263648 1259166 1216457 1198913 1221400 1285905
9657 1285905 1274046 1227431 1232533 1241799 1273580 1288994 1302093 1274637 1263613 1270166 1309488 1436699
9645 1436699 1497116 1529268 1548294 1593038 1600954 1668350 1824997 1891399 1941875 1964685 2001101
9634 2001101 2051714 2035624 1967668 1976877 2013324 2041965 2034818 2017704 2028729 2033738 2049210 2100429
9622 2100429 2091522 2098395 2084587 2096312 2188283 2224189 2239845 2282215 2346670 2370687 2434890 2479681
9610B479681o783K4651J00409N0540J0614Q2414O7925Q5412Q2967J12681R1569
9599C182080M1219L00L0392Q4769Q1881J3032M9283K70J6588N6509Q7421N8114
9587C701858Q6522R6073J29273R3634J24703J70012J69564J54538J89673K02314
9577E118164K47237K47083L56641M33989N12426O14224O36598P24135P75131J009166
9567A0674794J203517J450463J814123K279861K858170L469284M143207M953102
9559C2846521N979133O925668P501018P491093O632148M783233K412808J5282
9551G4586904k168277l971299n207633n364071m763440l733143k693119j808757
9543D4877165j055290m25478P8804O26393J085104J546855K215582K987531L847923
$$ plain form
9610 2479681 2472898 2497549 2597958 2648498 2659112 2741526 2809451 2894863 2977830 3090511 3182080
9599 3182080 3223299 3223599 3253991 3338760 3420641 3433673 3482956 3483226 3499814 3556323 3643744 3701858
9587 3701858 3788380 3884453 4013726 4107360 4232063 4402075 4571639 4726177 4915850 5118164
9577 5118164 5365401 5612484 5969125 6403114 6915540 7529764 8166362 8890497 9665628 10674794
9567 10674794 11878311 13328774 15142897 17422758 20280928 23750212 27893419 32846521
9559 32846521 38825654 45751322 53252340 60743433 67375581 72158814 74571622 74586904
9551 74586904 72418627 68447328 63239695 57875624 53112184 49379041 46685922 44877165
9543 44877165 43821875 43396397 43475201 44101594 45186698 46733553 48949135 51936666 55784589
9534E5784589M725145N500733O241324O957215P671152Q334632Q882375R337918
9526A13435083R587495R453174R040442Q315350P449642O489187N507373M680833
9518A73958579L904007L053473K028586P71192n03907j779880k943612l978620
9510A74509818m647110m855477m641930m231127l655485k943267j991922j055166
9502A46488334j11699Q25301J727343K602733L405530M097735M727868N394782
9494A69157927O049471O798562P663416Q711021R765711J0799614J1535258J1901598
9486B42382578J1891326J1441158J0417606Q862858O859715M451394J742440j377475
9478B96671600m654948p699208j0292073j2015737j2865939j2864302j1992881
$$ plain form
9534 55784589 60509734 66010467 72251791 79209006 86880158 95214790 104097165 113435083
9526 113435083 123022578 132475752 141516194 149831544 157281186 163770373 169277746 173958579
9518 173958579 177862586 180916059 182944645 183715837 183211930 181432050 178488438 174509818
9510 174509818 169862708 165007231 160365301 156134174 152478689 149535422 147543500 146488334
9502 146488334 146376635 147201936 148929279 151532012 154937542 159035277 163763145 169157927
9494 169157927 175207398 182005960 189669376 198380397 208146108 218945722 230480980 242382578
9486 242382578 254273904 265715062 276132668 284995526 291855241 296306635 298049075 296671600
9478 296671600 292016652 284317444 274025371 262009634 249143695 236279393 224286512
9471B24286512j0600798q908721p174771n696718m434332l468698k732343k051904
9463A79218227j383133o73330L04095J462431K565393L633443M609989N415151
9455A95152266N807482O008446N986128N905427N784469N765793N496424M894932
9447B40801367L780516K048791k38372k972009n592613p963002r853502j1038292
9439B08972884j1401803j1151745j0643328j0011293r306503q674392q100963
9432A39682857p442459o684222n973222n271644m687753m187085l965263l788050
9424I7683159l603231l230106k704398j791739n52361J258715L315613N440052
9416I5815704P295407Q396011Q404180P344117N068858J798125j791203n197689
$$ plain form
9471 224286512 213685714 204776993 197602222 191905504 187471172 184002474 181270131 179218227
9463 179218227 177835094 177161764 177465859 178928290 181493683 185127126 189737115 195152266
9455 195152266 200959748 206968194 212954322 218859749 224644218 230410011 235906435 240801367
9447 240801367 244581883 246630674 246392302 243420293 237827680 229864678 220011176 208972884
9439 208972884 197571081 186419336 175776008 165764715 156458212 147783820 139682857
9432 139682857 132240398 125556176 119582954 114311310 109623557 105436472 101471209 97683159
9424 97683159 94079928 90849822 88145424 86353685 85801324 87060039 90375652 95815704
9416 95815704 103111111 111507122 119911302 127255419 132324277 134122402 132331199 127133510
9408A27133510q019425r853004j0637757j0502702r802544q554546p173086n929944
9400E6660502m821885l927758l306969k804934k476863k175771j910065j775368
9392C3460889j600980j390017j295384j227674j100807j048975r90618q97635
9384B3908799q49921p87509p64077p22152o94352o70730o05195n80566n30499
9375A7703798n09735m37678m65298m97679m25615l70016l56548l22935l14205
9366A4004089l26968k97576k74563k82631k81170k75929k65429k87279k32043
9357A1480501k47193k17138k11562j87575j77161k21338k28679j85663j61112
9348I643080j44852j30297j98803k21751j69223j17672j18704j52437j79169p3244
$$ plain form
9408 127133510 119114085 109261081 98623324 88120622 78318078 69763532 62590446 56660502
9400 56660502 51838617 47910859 44603890 41798956 39322093 37146322 35236257 33460889
9392 33460889 31859909 30469892 29174508 27946834 26846027 25797052 24806434 23908799
9384 23908799 23058878 22271369 21507292 20785140 20090788 19420058 18814863 18234297 17703798
9375 17703798 17194063 16756385 16291087 15793408 15367793 14997777 14641229 14318294 14004089
9366 14004089 13677121 13379545 13104982 12822351 12541181 12265252 11999823 11712544 11480501
9357 11480501 11233308 11016170 10804608 10617033 10439872 10218534 9989855 9804192 9643080
9348 9643080 9498228 9367931 9169128 8947377 8778154 8660482 8541778 8389341 8210172 8136928
9338H136928l6311j6962p499n4307n0662o5191o3360o2845j14427r5656j09214
9327G460494o4379n9850j24278j22895j00385n6844j03109j01727j09540j15699
9317F501788q6146j6600l5132l1271j35059p1492j09468q5952o1775l6836l8217
9306E793840p1944n4735n0789p7074l715M6737o475j2139m2758j7654l2733k0929
9294E449632L5776L7172m2453l2629n2322j7124L0390l2622k6058n3818q6856
9283E209088j23006q0736q5470q4537j7669p0244r7153n2755o9047j44485l4765
9272D349221m8659l3922n9685o0948l5566j457k416l6849k3717k1385L4804J8495
9260D077916o9741m3679n25j4336P114J4241M6270K4614j3481K0162l639P9283
$$ plain form
9338 8136928 8100617 8083655 8076156 8021849 7971187 7905996 7842636 7779791 7665364 7569708 7460494
9327 7460494 7396115 7336265 7211987 7089092 6988707 6931863 6828754 6727027 6617487 6501788
9317 6501788 6415642 6399042 6363910 6332639 6197580 6126088 6016620 5930668 5868893 5832057 5793840
9306 5793840 5721896 5667161 5616372 5539298 5535583 5582320 5575845 5563706 5520948 5503294 5470561 5449632
9294 5449632 5485408 5522580 5480127 5447498 5395176 5378052 5408442 5375820 5349762 5295944 5209088
9283 5209088 5086082 5005346 4919876 4835339 4817670 4747426 4650273 4597518 4528471 4383986 4349221
9272 4349221 4300562 4266640 4206955 4146007 4110441 4108984 4106568 4069719 4046002 4024617 4059421 4077916
9260 4077916 4008175 3964496 3963971 3949635 3956749 3970990 4017260 4041874 4028393 4048555 4044916 4124199
9248D124199O2708L5612l063M5402R5662J15444N5832O9666J14627R1647J28922
9237D936658J43179J46575J48675K16662K14612K39151K40741K77094K72487L98537
9227G234371M73034N24890N54038O59773P85983Q85269J123560J374131J690951
9218A5306000K086370K579610L167791L794838M407316M887928N068036M952208
9210D6250097M559385L942450K934245J662482L29672r60514k022899k735443
9202E3959475l207884l292904l092075k661343k085409j439294o68465k3047N85556
9193C8074610J237304J950055K605726L198646L559855L672444L364036K773415
9185F0436091K107715J342149P67652N51020O91299J211650J934766L008979M264577
$$ plain form
9248 4124199 4186907 4222519 4219456 4264858 4360520 4475964 4531796 4601462 4716089 4807736 4936658
9237 4936658 5079837 5226412 5375087 5591749 5806361 6045512 6286253 6563347 6835834 7234371
9227 7234371 7707405 8232295 8786333 9446106 10232089 11117358 12240918 13615049 15306000
9218 15306000 17392370 19971980 23139771 26934609 31341925 36229853 41297889 46250097
9210 46250097 50809482 54751932 57686177 59348659 59678331 58717817 56694918 53959475
9202 53959475 50751591 47458687 44366612 41705269 39619860 38180566 37512101 37489054 38074610
9193 38074610 39311914 41261969 43867695 47066341 50626196 54298640 57662676 60436091
9185 60436091 62543806 63885955 64653607 65204627 65895926 67107576 69042342 72051321 76315898
9176G6315898N484457O331788O807614O856715O280029N128851L662542J996828
9168A18864722M51949r26803j824502k224116k101274j902732j777959j817888
9160A06741397j840542j913810k158899k281629k453414k545092k503470k317169
9152H8727372k140107j875791j702284j372385j023113m56141K64207J164529
9144H1586287K149617L252860M455144N795531P120135Q320174R138186R124772
9136A30942706Q149529O291818L636063P09782k056280m518967o176325o866238
9128A30112088o799054o198772n363009m505991l679610l045057k582734k325920
9120I5611941k084164j956296j735172j536040j239738r49765o44622m64354l89667
$$ plain form
9176 76315898 81800355 88132143 94939757 101796472 108076501 113205352 116867894 118864722
9168 118864722 119316671 118389868 116565366 114341250 112239976 110337244 108559285 106741397
9160 106741397 104900855 102987045 100828146 98546517 96093103 93548011 91044541 88727372
9152 88727372 86587265 84711474 83009190 81636805 80613692 80157551 80421758 81586287
9144 81586287 83735904 86988764 91443908 97239439 104359574 112679748 121817934 130942706
9136 130942706 139092235 145384053 149020116 149729898 147673618 143154651 136978326 130112088
9128 130112088 123313034 117114262 111751253 107245262 103565652 100520595 97937861 95611941
9120 95611941 93527777 91571481 89836309 88300269 87060531 86110766 85466144 85001790 84612123
9111H4612123k00191K00736Q79221K171400L171505K271644O42840K80937J13258
9102I4143473m96221j981687k681517k003631j342711j099210j049044r26914
9094H2562538o27040n48964n41475o22513q29545j174757j631722k174264k737265
9085G1674993l210799l570449l766142l953201m007925l763423l444787l082325
9077D2875942k595326k230453j889927j572819j256188r61534o95029l42096q5843
9068C1246727L15289O79727Q76385Q99186O53174L53683J5098k03553l72916n25017
9058C3937783n45388n42118o65741q81001j197600j554142j766966j964325j936283
9049B2884219j765405j481105j302218j086517r64676q22257p61357o85992n80419
$$ plain form
9111 84612123 84411932 84612668 85491889 87663289 90834794 93106438 93749278 94030215 94143473
9102 94143473 93647252 91665565 88984048 86980417 85637706 84538496 83489452 82562538
9094 82562538 81935498 81386534 80845059 80222546 79393001 78218244 76586522 74412258 71674993
9085 71674993 68464194 64893745 61127603 57174402 53166477 49403054 45958267 42875942
9077 42875942 40280616 38050163 36160236 34587417 33331229 32369695 31674666 31332570 31246727
9068 31246727 31562016 32241743 33118128 34017314 34670488 35024171 35039269 34835716 34462800 33937783
9058 33937783 33392395 32850277 32184536 31303535 30105935 28551793 26784827 24820502 22884219
9049 22884219 21118814 19637709 18335491 17248974 16284298 15462041 14700684 14014692 13434273
9040A3434273n13154n10147m64464l97471m47510m57865l75117l99831l16459
9031I552255k94479k40899k48936k94555l02284k66058k57682k25233j02780j70771
9021G148578k65491k39640j49632j73313j37533j80301k27324j69357j04205p1773
9011E430009j23142j66434j01830p4453j45519j19069l3035n0046n5294j62688
9001D398499j88423j81390j16521j04478j0379p9955j07978n9743l7401m4854
8991C467377j15393o6902o9118j16825j60233p1364m5365m0679o8926p1907o5465
8980B575200j7508l5740p0589m8664o42l4626p5317k4322m0439j0863J2673n9274
8968B169889o2287o631o9765o9046j8518k3457q4502k2943L835n9629q0588k0880
$$ plain form
9040 13434273 12921119 12410972 11946508 11549037 11101527 10643662 10268545 9868714 9552255
9031 9552255 9257776 9016877 8767941 8473386 8171102 7905044 7647362 7422129 7319349 7148578
9021 7148578 6883087 6643447 6493815 6320502 6182969 6002668 5775344 5605987 5501782 5430009
9011 5430009 5306867 5140433 5038603 4964150 4818631 4699562 4666527 4616481 4561187 4398499
9001 4398499 4210076 4028686 3912165 3807687 3797308 3717353 3609375 3549632 3512231 3467377
8991 3467377 3351984 3285082 3215964 3099139 2938906 2867542 2822177 2781498 2712572 2640665 2575200
8980 2575200 2557692 2521952 2451363 2402699 2402057 2367431 2292114 2267792 2227353 2216490 2229163 2169889
8968 2169889 2107602 2100971 2031206 1962160 1943642 1920185 1835683 1812740 1816575 1756946 1676358 1655478
8956A655478K6687N381m1479o9558n7285l7747n9922j2453K24Q384L1008l5686
8944A413032j6460m1490n2795r677L910J7620K1621j4897l8557j6871j1381k4410
8932A229645k8025J1511j5917l3312k6483m5780k382j4326R098k7929L5667J6542
8920A108309l7028m8479j2381l2509k8359l1751j3392P1575l5842m9117j9005
8909H72021J2029k9310l565O0919l1940j3151m1263k5932r95L1595m9029K5964
8897H07343J6477J2657j3642j7815m4052n5752k6540M806l5574K4011N5484N985
8885G33388j8006m9371j19321l6532K0426L6306l51K861R15J3973m8857l3757
8873E01674N632j7879L8682K987K6555N984k2111k5094l8665L8849M8285k0636
$$ plain form
8956 1655478 1682165 1687546 1646067 1576509 1519224 1481477 1421555 1409102 1409326 1417710 1448718 1413032
8944 1413032 1396572 1355082 1302287 1292610 1296520 1314140 1335761 1320864 1282307 1265436 1254055 1229645
8932 1229645 1201620 1213131 1197214 1163902 1137419 1091639 1089257 1074931 1084029 1056100 1091767 1108309
8920 1108309 1071281 1022802 1010421 977912 949553 917802 904410 975985 940143 891026 872021
8909 872021 884050 854740 851175 912094 880154 867003 825740 799808 798813 830408 781379 807343
8897 807343 823820 836477 822835 805020 760968 705216 678676 683482 647908 671919 727403 733388
8885 733388 715382 666011 546690 510158 530584 566890 566539 569400 570315 584288 535431 501674
8873 501674 507306 489427 528109 531096 557651 563635 541524 516430 477765 516614 564899 544263
8861E44263j2472J0151N6896n6881n8635L46k5455L712K7568j8729o5557o2538
8849C42669L1708N1423L4337n0693j0725L3637r954j6939L3695k6467l639R18
8837D09970k676l6493l5444O7676M7811J5788j4176l6556j2220m0038k4106L9705
8825C79241p799l7626k683K1861P661k7599L5201J5788l5201k2180K4736M3802
8813C95202N0956O2436K8761N127q736L7242O113K2980j1472k1281l554j505l5599
8800E26670l9407m6766J1j0564J6331k4372O5923l6052l3547p537N7452P3981
8788E42123L6476l5901l7417K2215O645K1237o799P3436P004o403J0335L5780
8776F68731o773n1982L6824N8780J10253L2971P1576O288o6833o4394N0727M22
$$ plain form
8861 544263 531791 541942 598838 541957 483322 483668 458213 461925 489493 470764 405207 342669
8849 342669 374377 425800 460137 409444 398719 432356 422402 405463 439158 412691 409052 409970
8837 409970 407294 370801 335357 403033 450844 466632 452456 415900 403680 363642 339536 379241
8825 379241 371442 333816 331133 352994 360655 333056 368257 384045 348844 326664 351400 395202
8813 395202 446158 508594 537355 542482 533746 570988 577101 600081 588609 567328 563774 562269 526670
8800 526670 487263 440497 440508 429944 446275 421903 487826 451774 418227 410690 468142 542123
8788 542123 578599 542698 505281 527496 534141 555378 548579 622015 629019 622616 632951 668731
8776 668731 661958 609976 646800 705580 815833 848804 920380 926668 859835 795441 846168 846590
8764H46590k7872o7984m6830k9207L7876N728K8279L8772k4426k8399l7470l7095
8752F57962N2467q03o5250J0749N9531p01j6835m4146l405K2436K5495L2387N0904
8739G80791J3696k679P7366L9549J3153Q2163L4080O8368O5229M839k2713q0934
8727A072908o6242n2861J3152q375q9170J0617l285k7777J7064m4665m4134m7388
8715G29844K7456N0140l9047l7640m784n9291M3874J03324j2332m6732j7455K701
8703G40058K8825M2386P6249J4705K2943L9174n85N7366J3021K6329J6133l0427
8691A046177k155k914p2412n8316l4274M5877J6662l9105L3938q305k5476L779
8679I03476J371J2253P800O3986k356o0392o0397m3716j7188k3871j6198k8160
$$ plain form
8764 846590 818718 750734 703904 674697 712573 718301 746580 785352 760926 732527 695057 657962
8752 657962 710429 709626 644376 655125 714656 713955 697120 652974 649569 672005 697500 729887 780791
8739 780791 794487 791808 869174 908723 921876 1004039 1038119 1106487 1171716 1176555 1153842 1072908
8727 1072908 1006666 953805 966957 958582 869412 880029 876744 848967 866031 821366 777232 729844
8715 729844 757300 807440 768393 730753 725969 666678 710552 813876 801544 754812 737357 740058
8703 740058 768883 811269 887518 902223 925166 964340 963755 1021121 1034142 1060471 1076604 1046177
8691 1046177 1044022 1041108 968696 910380 876106 921983 938645 899540 933478 925173 899697 903476
8679 903476 904847 917100 924900 988886 986530 926138 865741 822025 804837 780966 764768 736608
8667G36608L2867j4631J8629O1424M4760Q3836P7908J1119J8850k0610K5311j1855
8655A064216M7953P5129J7743L7760k126L9528O0530R9931O6754M9299L8101O1327
8643A656145O4057K1911N9708Q1525J27872J74668J37459R2076R4227O3042Q6912
8632B659602Q5117L3999l2137l8906o6967n5036k2479n3303q5319m2138m8889
8621B333544j4630J9589j0545o2195q0385r6498p0649o1098k0644j11874j24668
8610A699947q2725m6628k2741m2000j3725q0706j18695o930K2453l8790O8742
8599A338202o911l4124J4529N9742O6427O7020J41429R3860J64918J24796J91804
8588B221692J95278J05661O4188N3731K2495K8490j623j00523j81972j54667q4017
$$ plain form
8667 736608 769475 754844 773473 834897 879657 963493 1041401 1052520 1071370 1050760 1076071 1064216
8655 1064216 1112169 1187298 1205041 1242801 1240675 1280203 1340733 1440664 1507418 1556717 1594818 1656145
8643 1656145 1720202 1742113 1801821 1883346 2011218 2185886 2323345 2415421 2509648 2572690 2659602
8632 2659602 2744719 2778718 2746581 2707675 2640708 2585672 2563193 2509890 2424571 2382433 2333544
8621 2333544 2318914 2338503 2327958 2265763 2185378 2088880 2018231 1957133 1936489 1824615 1699947
8610 1699947 1617222 1570594 1547853 1505853 1492128 1411422 1292727 1285797 1308250 1269460 1338202
8599 1338202 1331291 1297167 1311696 1371438 1437865 1504885 1646314 1740174 1905092 2029888 2221692
8588 2221692 2416970 2522631 2586819 2640550 2663045 2691535 2689912 2589389 2407417 2252750 2168733
8577B168733k8714j32820j39177p9386j05391p7989n8303m3448l7429m1270m6982
8566A377824q9705l7509k6831m6555K8206n7141l7038R2106k1341j4515j1370
8555A156131k6786n788J8578M2918n1360J4565P5210P7662R3397P7966J26800
8544A599293R9497R9579J08144R6770J00978O6287J8055q0780n3184j14561j01624
8533A838454j03704j32248j15790j00903j54282j34314L562p9201j3637n9118
8523I48819j23326k9687K3582J1166k4434P55n970n6981l1219n2347k1942L8323
8511F76739l3304N0711K9051p5867k5512k0687j6561J0705O484P7115O2724j8711
8499G22887j8654l2693M7173O6342N0535L203k172M1779J7338n0269k6605M1107
$$ plain form
8577 2168733 2140019 2007199 1868022 1788636 1683245 1605256 1546953 1503505 1466076 1424806 1377824
8566 1377824 1288119 1250610 1223779 1177224 1205430 1148289 1111251 1203357 1182016 1167501 1156131
8555 1156131 1129345 1123557 1142135 1185053 1133693 1148258 1223468 1301130 1394527 1472493 1599293
8544 1599293 1698790 1798369 1906513 2003283 2104261 2170548 2188603 2107823 2054639 1940078 1838454
8533 1838454 1734750 1602502 1486712 1385809 1231527 1097213 1100775 1021574 1007937 948819
8523 948819 825493 795806 819388 830554 806120 806875 800905 743924 712705 660358 638416 676739
8511 676739 643435 694146 723197 647330 621818 601131 584570 595275 601759 678874 741598 722887
8499 722887 704233 671540 718713 785055 835590 838793 836621 878400 895738 845469 818864 859971
8487H59971l8403j55668m9667K9563k9500n9298j2215Q949k1473p9454P802j6776
8475D43831m5259l8548k2919o332m2856n0559M8272L8268K216l4778K2161M568
8463C18065M486L274M8631l6498q6857j7248J1900n4337l2814K6028J9739P6799
8451B81168K4801O860j3898l6682L7584j2682M654M203r176R063k5825n0280m4509
8438A75281N741N8984O702L3038j5715j7532J9212p205n732l7583N122n7414n4816
8425A08083N1443N8687J5022k760m232k7256l1991J0965j8704j5303O9760K0563
8413B34277L3512k6977n6056j5442k5368J3729R5517J7279q9555j2787N8764M747
8401B31640k0195J2131N2280J0744m3827k0779K5471L9588L3935J434n2620n6989
$$ plain form
8487 859971 821568 665900 616233 645796 616296 556998 544783 553732 532259 452805 460607 443831
8475 443831 398572 360024 337105 330773 287917 237358 285630 323898 326114 291336 313497 318065
8463 318065 322551 325825 374456 337958 251101 233853 245753 191416 158602 184630 204369 281168
8451 281168 305969 312829 298931 262249 299833 287151 291805 296008 286832 295895 270070 219790 175281
8438 175281 181022 240006 246708 279746 264031 246499 265711 258506 252774 215191 220313 162899 108083
8425 108083 159526 218213 233235 230475 226243 198987 166996 177961 159257 143954 213714 234277
8413 234277 267789 240812 184756 169314 143946 157675 253192 270471 180916 168129 226893 231640
8401 231640 211445 223576 275856 286600 242773 221994 247465 287053 320988 322422 269802 212813
8389B12813l2236Q860k1986M7292P0223m2045q41p879k7649m8039K4765N2619
8377B35897M4254L4572m9197l2172l4478o9356n8795j5514K6930J642q011M5348
8365A21120K373o0174J5144k3002P352R055j111K8452J3360R783J2856m5605l1812
8352E7791M0849o95J2951k2078n763j6316m5386O48K8405n3423N8616L1802j3754
8339G3647M560q239j4142k2212L0159N470l2550J6990l5086J6010R29j167k834
8326C1535J7886j2841N5146j708j9054l1005K604K0940J3356j7642l6383O83M218
8313B7735K297K4545L470O0983n069j5794j4645Q227M1614J9545J2196J03358
8301B68462Q0433Q1103n17L1922j9109P261m7557o4696l1727l9053o1633K8918
$$ plain form
8389 212813 180577 189437 167451 214743 284966 242921 242080 234201 206552 158513 183278 235897
8377 235897 280151 314723 265526 233354 198876 129520 70725 55211 82141 83783 75772 121120
8365 121120 123493 63319 78463 55461 62813 71868 70757 99209 112569 122352 135208 89603 57791
8352 57791 98640 97945 110896 88818 83055 66739 21353 22001 50406 -3017 55599 87401 73647
8339 73647 78207 69968 55826 33614 63773 69243 36693 53683 18597 34607 35536 34369 31535
8326 31535 49421 36580 91726 90018 70964 39959 42563 63503 76859 59217 22834 23517 27735
8313 27735 30032 54577 58047 119030 113961 98167 83522 91749 133363 152908 165104 268462
8301 268462 348895 429998 429481 461403 442294 449555 401998 337302 305575 266522 204889 233807
8289B33807l9175o7566j8661M8863M1970k9762r971j5141k1105P029K4840K7816
8277A82944l3502k8409J880l509J475K404K5905J6700N846j3928K3265j658n926
8264A73487J3060J194m32K9234R5087M5524M8541R5450M9091N9501L4810L3512
8252F78059j5995n9997q0165m0575k5947n2586q4722l5971l2543o2400r886L652
8240A80924L8992m8197j8012m3761J7153J9212k3123J4869j7895n4772n4832M5560
8228E6118O3572J5230j6660o8575L171P3059N015K8965l962J8728K2873n8359
8216A39175n3135J3526P3218J6656l5851Q1483P9182Q6348O3930j82m2148l2028
8204C90174m7031o7782n5938m235K4338j2294n1008j1267J129J1137P438m9210
$$ plain form
8289 233807 194632 127066 108405 157268 199238 169476 159505 144364 123259 130288 155128 182944
8277 182944 149442 121033 122913 119404 120879 123283 149188 165888 171734 157806 181071 179413 173487
8264 173487 186547 187741 187309 216543 311630 357154 405695 501145 550236 609737 644547 678059
8252 678059 662064 602067 521902 481327 455380 402794 318072 282101 249558 187158 177272 180924
8240 180924 219916 171719 153707 109946 127099 146311 123188 138057 120162 65390 10558 56118
8228 56118 119690 134920 118260 49685 52856 125915 130930 159895 155933 174661 197534 139175
8216 139175 86040 99566 172784 189440 153589 235072 314254 400602 464532 464350 422202 390174
8204 390174 343143 275361 219423 215188 239526 227232 176224 164957 166086 177223 184661 135451
8192A35451J2098m0265p0484L1572k1931J2579O2310L3307m9138M4280P1277o5341
8180A55715n4027K219m225j601m5241l382M6819P677K4691K6065l7916l4089l5457
8167D7248K648O6298J3488J7226j3645l4304Q7755j3974N475k1482k8989o0387
8155F7357K8025R4136L1344n3378j1532j0747L457k2122k3529k8925m8634O180
8143C1632P2016P8985N0852K9946M5391K998k2659k7073O802m7647l4969j6363
8131A69911n5581r557L1660L4002J9909L1138j2302J0373L6441J3877j2452j6365
8119B41054O7999r269J825j9469k3193L9459l657l6740J4550M097J8123l4564
8107B60215l457K1454J5818n0996p0043n5916J867k6107Q0108L8274N7393L9891
$$ plain form
8192 135451 147549 107284 36800 68372 46441 59020 121330 154637 105499 149779 221056 155715
8180 155715 101688 103907 99682 98081 52840 49458 96277 103954 128645 154710 116794 82705 47248
8167 47248 49896 116194 129682 146908 133263 98959 186714 172740 178215 156733 127744 67357
8155 67357 95382 189518 220862 167484 155952 145205 148662 126540 103011 74086 25452 31632
8143 31632 103648 182633 233485 263431 308822 311820 289161 262088 268890 221243 186274 169911
8131 169911 114330 104773 136433 170435 190344 221482 209180 219553 255994 269871 257419 241054
8119 241054 309053 299784 301609 282140 258947 298406 294749 258009 272559 276656 294779 260215
8107 260215 256758 278212 294030 243034 172991 117075 118942 92835 172943 211217 268610 308501
8095C08501K9397P884l9880K3307K4363M3697m6641n3171K0302M1664K9386j106
8083C87703J0992O0360k2645J9662j6013l3509L6542J2436n4005m4578P6396J19933
8071E53274N7724Q0313N6885p496J01676K5906j2160m6682n8801L0990J06j6089
8059G65646n9703p309p857J947K1195l1489j9886m3858q1102O0534J568K8219
8047F27905K9940J2325J087L0213l3119l574L0235M0544J4462L3378L870L1155
8035H18421O9612k6549l9729J7917J40653J96548K34432K22080J30519K584q951
8024A757537o5493k10646k07083j39752j00093m2746m9314m5033n9597r729m0948
8013G87103l9554k6246k8574l4284j4108j7765q1628l0727L4582k4131l8824o960
$$ plain form
8095 308501 337898 345782 305902 329209 353572 397269 350628 297457 317759 359423 388809 387703
8083 387703 398695 459055 436410 456072 440059 406550 443092 455528 401523 356945 433341 553274
8071 553274 610998 691311 748196 740700 842376 868282 856122 809440 750639 781629 781735 765646
8059 765646 705943 698634 690777 692724 713919 682430 662544 618686 537584 598118 599686 627905
8047 627905 657845 670170 671257 701470 668351 664777 695012 735556 750018 783396 787266 818421
8035 818421 888033 861484 821755 839672 980325 1176873 1411305 1633385 1763904 1766488 1757537
8024 1757537 1692044 1481398 1274315 1134563 1034470 991724 942410 897377 837780 828051 787103
8013 787103 747549 721303 692729 658445 644337 626572 544944 514217 548799 524668 485844 478884
8001D78884L49O668K0851J6238l3557J9988M7997m989J9929m0234j3677P3962
7989E92409L127K4091l378P3369O7675M1926M68k9159r1929k5786l7736m9390
7977E65687k69j0405n9309j85m7469l8318p9502m8753M5391M2809n9549J2946
7965C23074M4527k380l1107p6589j8939L0221j6535l4960K2625K8704j036q418
7953B59187m8926k2054j7192m0138M6602O9138j3089o2380k2198J7678l2626n802
7941A28200J7216j1326l5076K0407l8579M1898j1375L1835j3691l6799n8428N6002
7929I0284j312l015J2273M6634M2089m4293n4630n4038N5004M3556K7364K087
7917A62003q575l7904r064K6414r553j8763L1862M3573j9352M523J2469R288j660
$$ plain form
8001 478884 479233 485901 506752 522990 489433 509421 557418 552429 572358 532124 518447 592409
7989 592409 595536 619627 616249 689618 757293 799219 799687 770528 678599 652813 615077 565687
7977 565687 565418 555013 495704 495519 448050 409732 330230 281477 326868 369677 310128 323074
7965 323074 367601 365221 334114 257525 238586 268807 252272 217312 239937 268641 267605 259187
7953 259187 210261 188207 171015 130877 177479 246617 233528 171148 148950 166628 134002 128200
7941 128200 145416 134090 99014 119421 80842 122740 111365 143200 129509 92710 34282 90284
7929 90284 88972 85957 98230 144864 186953 142660 88030 33992 88996 132552 159916 162003
7917 162003 153428 115524 106460 132874 123321 104558 136420 179993 160641 165164 177633 186921 185261
7904A85261p5507j02008K4804N5001l3024m200J7416K7962j9208M4344k9594O590
7892I7837n587m0470L1978L8254L998j9469k5989M1025M2700M3487j0445m5562
7880A51757m6842k8917K2767K6973j948p4912k5849J0484L486R557j9300J3066
7868D0322j9901m2235L9884L6802m824o849L4410L5772p8825n1017Q077J8201
7856I817P1757N3268l6463l2509J7033r145m9151j5867O4679k2254l7498L4975
7844D8642N8879M3458j6325j0623n6998o4379j2913K3262L0450n2314R361L2371
7832C2871j7168j0705P4308P379n3995m9018n1473K9615M7596j1545L8513j5352
7820B1026k0812L6187K263m6733m2069j1093J6422R971J1882K1952m61R2504P470
$$ plain form
7904 185261 109754 7746 32550 87551 54527 50327 67743 95705 76497 120841 91247 97837
7892 97837 92250 51780 83758 122012 126010 106541 80552 121577 164277 207764 197319 151757
7880 151757 104915 75998 98765 125738 123790 48878 23029 33513 36999 46556 27256 40322
7868 40322 20421 -21814 18070 54872 50048 43199 77609 113381 34556 -16461 -8384 9817
7856 9817 81574 134842 98379 65870 82903 73758 24607 8740 73419 51165 13667 48642
7844 48642 107521 150979 134654 124031 67033 2654 -10259 13003 43453 -8861 500 32871
7832 32871 15703 4998 79306 86685 32690 -16328 -67801 -38186 9410 -2135 36378 21026
7820 21026 214 36401 38664 -8069 -50138 -61231 -44809 -34838 -22956 -1004 -1465 91039 98509
7807I8509k9439P796j7489l1259k8019M7077k5931j3412k490j0758j511k7756
7795c4682N391K1467J726M740J5102N679k7075l7624r537M0829L7151L0199L5628
7782H8994o712P666m488M785l740k0215m1066J9626J6208p0278J1100M9502J0936
7769F2318L18R5935j2576n6560n6706k0838L157J4062m2212l956L2679k517l0144
7756a7040j9138N163l3558J988K9720L2527L0614J8505J3998L9403R142n3098
7744E8226n032L0423l018j5449m0192m7482m397K4365p712k3719K4426L2641N219
7731B8299k265K8616m1712m5411P16P6388R397J3045K9425O831m0850l5168P43
7718B8054k0851o6439j0245K1360K0407J231m0915J7576K0890r505L4276j4265
$$ plain form
7807 98509 69070 76866 59377 28118 99 47176 21245 7833 5343 -5415 -6926 -34682
7795 -34682 -29291 -7824 -6098 -1358 13744 19423 -7652 -45276 -54813 -13984 23167 53366 88994
7782 88994 82282 89948 85460 90245 86505 66290 25224 44850 61058 -9220 1880 51382 62318
7769 62318 62636 158571 145995 89435 32729 11891 15048 29110 -13102 -17058 15621 13104 -17040
7756 -17040 -36178 -31015 -64573 -62585 -32865 -338 30276 48781 62779 102182 111324 58226
7744 58226 53194 83617 80599 65150 24958 -22524 -26921 -2556 -10268 -33987 -9561 23080 28299
7731 28299 26034 54650 12938 -32473 -31757 44631 54028 67073 96498 103329 62479 27311 28054
7718 28054 7203 -59236 -69481 -48121 -27714 -26483 -67398 -49822 -28932 -38437 -4161 -18426
7706a8426j1826m2140l7441J5583N8480O8867J2594m6778k3962K7452j1266O7794
7694E8931R4704j4636m4394q2093k2527n2094k915L7998O7862O096n9166j0762
7682b2996M7781J1240J7196j8768L8909M5922r3434m0417O595K0909J8748L6122
7670F7807M2276k3105r2612n7780K4163L3499K8040p796p334K3263J8542m6974
7658A989q3385P5716O4455m3673n7419L5637L1110o7304o3441k4188Q4706M1466
7646d331n4646j8481N2308L1226j2140k0412J4039j9436N8412M0132P896p327
7634F7240m9807K243Q183N0661J6148J5689N731m2568j8245k172j9825o6963o642
7621d0327M935K2768L3040o274j4412k3180m8185p244Q691J2586K0734n558l4522
$$ plain form
7706 -18426 -30252 -72392 -109833 -94250 -35770 33097 45691 -1087 -25049 2403 -8863 58931
7694 58931 153635 138999 94605 12512 -10015 -62109 -65024 -27026 40836 46932 -12234 -22996
7682 -22996 24785 36025 53221 34453 73362 119284 25850 -14567 -7972 12937 31685 67807
7670 67807 110083 86978 -5634 -63414 -39251 -5752 22288 14492 7158 30421 48963 1989
7658 1989 -81396 -5680 58775 15102 -42317 -6680 24430 -42874 -106315 -130503 -45797 -4331
7646 -4331 -58977 -77458 -25150 6076 -6064 -26476 -12437 -31873 26539 66671 74567 67240
7634 67240 17433 19676 27859 78520 94668 110357 116088 73520 55275 53103 33278 -33685 -40327
7621 -40327 -35392 -12624 20416 14142 -270 -23450 -71635 -78879 -70188 -57602 -36868 -42426 -76948
7608g6948n0562L9323N0512k0764j2053k2941K119N6135R970k108l7506M654L9984
7595b0185P2209m5202m5365Q515L845J4273L5058m7979j3599M8207J4817J606
7583B6200J596K5081o719m1105j6892l7187l1420N6541L3934j3393j2821K0656
7571D471O65o0077p121K951J7266N7477J8773K0025L241k1983K8950m786m7524
7558A2328o9326N026M2279J9154n555L4445N4201p6227r186K8686P006K8618l2526
7545C8923k0246j2470p649n5863l1778L4337O9444J3990L696K251l950j7502N886
7532A9069n3263j9122k945J5634L6348J5193m73p304k4536M4255k8422l8679J7619
7519b6626n6775K5105N0792m2796j2964L2269K1608Q252J9435M6213j0222o6157
$$ plain form
7608 -76948 -127510 -88187 -37675 -58439 -70492 -93433 -91314 -35179 -25209 -27317 -64823 -60169 -20185
7595 -20185 52024 6822 -38543 -30028 -26183 -11910 23148 -24831 -38430 9777 24594 26200
7583 26200 27796 52877 46158 5053 -11839 -49026 -80446 -23905 10029 -3364 -16185 4471
7571 4471 5136 -54941 -62062 -59111 -41845 15632 34405 54430 57671 35688 64638 59852 12328
7558 12328 -56998 -51972 -9693 9461 3906 38351 92552 16325 7139 35825 42831 71449 38923
7545 38923 18677 6207 -1442 -57305 -89083 -54746 14698 28688 32384 34635 30685 13183 19069
7532 19069 -34194 -53316 -56261 -40627 -4279 10914 10441 3137 -21399 22856 -5566 -44245 -26626
7519 -26626 -83401 -58296 -7504 -50300 -63264 -30995 -9387 -1135 18300 64513 54291 -11866
7507a1866k9463L5980N9469N25o2568J0686O5448J4789p873n0389l4154o170J0358
7494e228K0821L7775p241l9649J719o4533k4137O5802J9066k6540k8603K3549
7482b7199o029L2472n642J8730O3953p299L3799j7548K8480K9464r251l1099k9420
7469G3411j7718k3119m129l6206L2108l5932M7715L3641m1197j4848k1515l7532
7457d5321j2686L3051Q378M4957K5043k1668j3836K0827m1420j908L9741k7356
7445G802j5627r509P916j4069p202k4828K3458J5019j3709n6253N2965K9308m249
7432h978L582K6995k0664j687k7862r241J6138K8777J8533M3014K6378n6853q891
7419B9241j023o640J029M9079l0747n2551l8190R275L3612R375l5350q462P216
$$ plain form
7507 -11866 -41329 -5349 54120 54645 -7923 2763 68211 83000 75127 24738 -9416 -15586 -5228
7494 -5228 15593 53368 46127 6478 8197 -56336 -80473 -14671 4395 -22145 -50748 -27199
7482 -27199 -33228 -756 -6398 12332 76285 68986 102785 85237 113717 143181 133930 102831 73411
7469 73411 55693 32574 28445 -7761 24347 -11585 36130 69771 28574 13726 -7789 -45321
7457 -45321 -58007 -24956 -16578 28379 53422 31754 17918 38745 -2675 -4583 35158 7802
7445 7802 -7825 -17334 -9418 -23487 -30689 -55517 -32059 -17040 -30749 -87002 -34037 -4729 -8978
7432 -8978 -5396 21599 935 -752 -28614 -37855 -21717 7060 25593 68607 94985 38132 29241
7419 29241 28218 21578 22607 71686 40939 -11612 -49802 -40527 -6915 2460 -32890 -41352 -34136
7406c4136J4401J4713j278O6451L3032l122m3981l593n1046K710j0741K5593l4699
7393b5696m1765j5809M0276K1561J5897n415L218L2544P9276J4718m4324k4146
7381E0335k2361o0349K7496j6351M243K5743j0769K6950J2240K9034K3152n7086
7369C2277k4758k8535L1803O8964l262o755m1003j1218k4704j571l2744P315L255
7356c0936L983k1311k5376P3754M1933J4393m5685J5530p030R784O29n5834L5791
7343I625N1075J4107j1802m0528N4907l0122j8884J5628l307j6531j5316q5930
7331g7078k2439l6633N4849K8343l3811l6389k2407M421k3476N1553M9629P3231
7319I793N2860M2882K9607o8992O47j60K0166j6209q2793p118N9838K6052k2257
$$ plain form
7406 -34136 -19735 -5022 -6300 60151 93183 90061 46080 42487 -8559 -5849 -16590 9003 -25696
7393 -25696 -67461 -83270 -42994 -21433 -5536 -10951 -7733 24811 104087 118805 74481 50335
7381 50335 27974 -32375 -4879 -21230 -16987 8756 -2013 24937 37177 66211 89363 32277
7369 32277 7519 -21016 10787 79751 76489 69734 28731 17513 -7191 -8762 -41506 -34191 -30936
7356 -30936 -26953 -48264 -73640 114 42047 56440 10755 26285 19255 29039 29668 -26166 9625
7343 9625 60700 74807 63005 22477 77384 47262 28378 44006 40699 24168 8852 -77078
7331 -77078 -99517 -136150 -81301 -52958 -86769 -123158 -145565 -141144 -164620 -113067 -63438 9793
7319 9793 62653 105535 135142 66150 66797 66637 86803 70594 -12199 -19317 40521 66573 44316
7306D4316J5648K7312L0118R695m8293K3686M498o3976n2189J1958K2041K3136
7294D7950r077k5876p432l1487j9150L2149K6573R616k3250k222J9974N6666O19
7281G5053n593o3914k8613j3150J4013O5149m6672p1444k3161R8510M5659l0570
7269A5267j1367m8069m4021K3651K2521l3141l2321L9271K6123J4177J37772L2809
7257A42672n8576l1862n0466j00495L8434L3120l7113J7077L856l790L0419k3706
7245d0430l3746K539k1025k7952M57j6371N1100P7156M2258j02433j5325O9287
7233a4485K5096n5735m6765K9471L4659j0967J0457l814m5766j7881K1854q585
7221h2461P3349M683r385J6681l0145k2773N5432k7178l9479K3519O3380l0857
$$ plain form
7306 44316 59964 87276 117394 127089 78796 102482 106980 43004 -9185 2773 24814 47950
7294 47950 38873 12997 5565 -25922 -45072 -12923 13650 23266 16 -2206 17768 74434 75053
7281 75053 69460 5546 -23067 -36217 -22204 42945 -3727 -75171 -98332 178 45837 15267
7269 15267 3900 -44169 -88190 -64539 -42018 -75159 -107480 -68209 -42086 -27909 109863 142672
7257 142672 84096 52234 1768 -98727 -60293 -27173 -64286 -47209 -43353 -47143 -16724 -40430
7245 -40430 -74176 -71637 -92662 -120614 -120157 -136528 -85428 -8272 33986 -68447 -83772 -14485
7233 -14485 10611 -45124 -91889 -62418 -27759 -38726 -28269 -32083 -77849 -95730 -73876 -82461
7221 -82461 -9112 -4429 -13814 2867 -27278 -50051 5381 -21797 -61276 -37757 25623 -5234
7209e234m5435K3365m9814m3011K3014M3839p642r139j8313j1856K4566n651q326
7196h9637M4014j4056l2162J6722K1846L8320L6194J5422J1012j9354J7084j5548
7184B9857l4065o878m7358L1386j936j3702J7653K5773K9418L9962l399J3339
7172H0050J3735J9575m7646l6215K46r709r194J6845q655Q193J491m9217Q564
7159a1937p331l3720L7167l6786j8606J1715J4740M0670M9248j9039j7448m7291
7147c8618m5332m929K3889P5868M1243J4811n0667M434o4446k4976J15710l436
7135D3551l4130l0875q7628l237L9858O6173N3028r167l9082K7122Q550j5727
7123A8436m4358n2304K0063m4527k2075K0288K4869L4861O2603k384m8025K0238
$$ plain form
7209 -5234 -50669 -27304 -77118 -120129 -97115 -53276 -60918 -70057 -88370 -100226 -75660 -81311 -89637
7196 -89637 -45623 -59679 -91841 -75119 -53273 -14953 21241 36663 47675 28321 45405 29857
7184 29857 -4208 -11086 -58444 -27058 -28994 -42696 -25043 730 30148 70110 66711 80050
7172 80050 93785 113360 65714 29499 29745 20036 10842 27687 19032 27225 28716 -20501 -11937
7159 -11937 -19268 -52988 -15821 -52607 -71213 -59498 -44758 -4088 45160 26121 8673 -38618
7147 -38618 -83950 -88879 -64990 10878 52121 66932 16265 20699 -43747 -68723 46987 43551
7135 43551 9421 -21454 -109082 -112319 -72461 -6288 46740 37573 -1509 25613 34163 18436
7123 18436 -25922 -78226 -58163 -102690 -124765 -104477 -79608 -44747 17856 15472 -32553 -12315
7111a2315J5090q080r255J4659J4917R060l9127n1577k0039K4653Q0242k1460
7099c232m3344N0694N4439j7191l8549K1661P9075L7228l372O219o8701r0718
7087a5791l3592L2596K0058J9832k3264N6464l0939p4464k7346p606q536J0500
7075h2088N8674L6149L7475q224p4777o250L2213j1624K2686l52L0819q215m2371
7062a5885J1767j0439l1671o2936J4395K846l103j9671J2686K9891L4396K6628
7050a1096j5998l2026j0232k6184M6583L0240J158k1780j2428N8983M0584N1701
7038I9505k9880j0413l1686m9072j2125N1462J1490M307J1981J0200n3041q0151
7026g7423K4195p618O3763M7100j5298K145j9197n1554k5480k5641k7115L6938
$$ plain form
7111 -12315 2775 -5305 -14560 99 15016 24076 -15051 -66628 -86667 -62014 18228 -3232
7099 -3232 -46576 4118 58557 41366 2817 24478 103553 140781 137409 143628 74927 -15791
7087 -15791 -49383 -16787 3271 23103 -161 56303 25364 -49100 -76446 -84052 -92588 -82088
7075 -82088 -23414 12735 50210 41986 -32791 -39041 -6828 -18452 4234 3882 34701 26486 -15885
7062 -15885 -4118 -14557 -46228 -109164 -94769 -91923 -95026 -114697 -102011 -72120 -37724 -11096
7050 -11096 -27094 -59120 -69352 -95536 -48953 -18713 -17555 -39335 -51763 7220 47804 99505
7038 99505 69625 59212 27526 -21546 -33671 17791 29281 33588 45569 55769 2728 -77423
7026 -77423 -53228 -60846 2917 50017 34719 36864 17667 -33887 -59367 -85008 -112123 -75185
7014g5185J7506J4327J1790l9399m0666N91M5399N082K6292M6569k4797L4179
7002B1688L2943j9637j1796n1059l0608m6964O380N7596J4236N359j2661n059
6990c9582J7499n067K0402J3071K8836M510n2093m2766M380L7119K856m9966k0301
6977h1102N3465M1059K329K742N0769l3420l9509n355j7475J0096K1424O264l6023
6964b4736j5427O8427j7090l2688n8434K0853P9659O603N451j0388k2270n912
6952e952n4123k5325J3404N26K2419m8331j94K8755M7378k7808j9790P509N1127
6939a0405l9217j4595K3766m848j8539m8564M785L6819L0770m6981n3957L919
6927a37047N0376N6814P0941l763r5j8347m2262k6567M3532K6448O3592n5161
$$ plain form
7014 -75185 -57679 -43352 -31562 -70961 -111627 -111036 -65637 -60555 -34263 12306 -12491 21688
7002 21688 54631 34994 23198 -27861 -58469 -105433 -99053 -41457 -27221 -21862 -34523 -39582
6990 -39582 -22083 -27150 -6748 6323 35159 39669 -12424 -55190 -50810 -13691 -10835 -60801 -81102
6977 -81102 -27637 13422 15751 18493 69262 35842 -3667 -9022 -26497 -16401 5023 11287 -24736
6964 -24736 -40163 28264 11174 -21514 -79948 -59095 20564 27167 32618 22230 -40 -5952
6952 -5952 -60075 -85400 -71996 -71470 -49051 -97382 -97576 -68821 -21443 -49251 -69041 -61532 -10405
6939 -10405 -49622 -64217 -40451 -45299 -63838 -112402 -107617 -70798 -40028 -87009 -140966 -137047
6927 -137047 -86671 -29857 41084 37321 37226 18879 -23383 -49950 -6418 20030 83622 28461
6915B8461k9578k1422l9079L5415O7061j0774j1856p5607o699l0222J5696J5279
6903f3325m4816k205M352k4545M4365j8354R3947J8506K7510k6146n9834k506
6891e3051J3514L3426k3962k4893J9581N265n1913O1759K2851m8984J650J1341
6879c3416m1610R061J2446N683J1431N5448K7010n358k7968p299N9098j554l4370
6866B8602O941j5603j4892L994k9924j0334J9219J7713m0975j4687l4574n6110
6854a40630j1876J2307J2610J17553P7163o779K0369M578k5010m3474o3342r842
6842e6373k6253l254O4164o627l0138k5139L1567N8421Q5676J3391l9860m0981
6830B4594O915m744j5230L923j4604M8692l8126r2039j2260L444K7818J2970L4156
$$ plain form
6915 28461 -1117 -22539 -61618 -26203 40858 30084 18228 -57379 -64078 -94300 -78604 -63325
6903 -63325 -108141 -110346 -105994 -130539 -86174 -104528 -10581 7925 35435 9289 -50545 -53051
6891 -53051 -39537 -6111 -30073 -54966 -35385 -30120 -82033 -20274 2577 -46407 -44757 -33416
6879 -33416 -75026 -65965 -53519 -47836 -36405 19043 46053 40695 12727 5428 64526 62972 28602
6866 28602 35543 19940 5048 9042 -20882 -31216 -11997 5716 -35259 -49946 -84520 -140630
6854 -140630 -152506 -140199 -127589 -10036 67127 60348 80717 85295 60285 16811 -46531 -56373
6842 -56373 -82626 -85880 -21716 -28343 -58481 -83620 -52053 6368 92044 105435 65575 24594
6830 24594 31509 26765 11535 15458 854 49546 11420 -80619 -92879 -89435 -61617 -48647 -14491
6817a4491P042o7993n8223M7199K2804m0808k2640J8342M4348K2740L0635N9128
6805D8083R401n3721j3707K4795K5831L8318n5277o9644m7667K2122M9412R2323
6793G0269K6533o4475p1629N2872K7492J1104p7206J5648N1629L8497O527j8738
6781F8523o899k5763J613O293K7031j1691m2379o581L8757Q24l2394k67J0172
6768B7239j5330j7150N7093N1029j9409J637O7079j5561N5244L7549l3298k4590
6756A71532J8132J07967J6261o8438j02055J180k0369k0546J463R893l4543J8959
6744I9436k5246o2009k4543L3644M3927K595k1990l9163J191J0794k7992j1424
6732b0780O3517j262q1492K8782K8539k4505m6684N9300J21971K0196n0334l8558
$$ plain form
6817 -14491 -7449 -75442 -133665 -86466 -63662 -104470 -127110 -108768 -64420 -41680 -11045 48083
6805 48083 57484 3763 -9944 14851 40682 79000 23723 -45921 -93588 -71466 -22054 70269
6793 70269 96802 32327 -39302 13570 41062 52166 -25040 -9392 42237 80734 87261 68523
6781 68523 61624 35861 37474 43767 70798 59107 16728 10147 48904 49728 17334 17067 27239
6768 27239 11909 -5241 51852 102881 83472 85109 152188 136627 191871 229420 196122 171532
6756 171532 189664 297631 313892 245454 143399 144579 124210 103664 105127 115020 80477 99436
6744 99436 74190 12181 -12362 21282 65209 67804 45814 6651 7842 18636 -9356 -20780
6732 -20780 42737 41475 -40017 -11235 17304 -7201 -53885 5415 127386 147582 97248 58690
6720E8690L5040n1431l7921l1544O317R6318k790n0427k0611J6902m9425l1744
6708f2626r001J7427L8776P5925N4230m8310k1529j9039J7240K1204k706k0169
6696D1422K0092l2195o4867K6210M0336k0293L0742q082r602L8670k1035j5723
6684B5675k5276j9797l6044L7684j0721L0552K323n9525J0270M9919O612J4513
6672B6185M038p5184k2230n5730K6029n472J5516Q2064M0935m5399K9618O63l1826
6659a0793M999J3179K3549Q3667l92m6643k9258l433l8032R446M785L8389L1522
6646H0985m9547k3089K8502J5618O168J4899K1275m6515n249n5144l1438R202
6634c4333K714K238K4243P3077k9133l9274m1567m5568J04501N4414m2206l0198
$$ plain form
6720 58690 93730 42299 4378 -27166 -20849 75469 72679 22252 1641 18543 -30882 -62626
6708 -62626 -71627 -54200 -15424 60501 114731 66421 44892 25853 43093 64297 61591 41422
6696 41422 61514 29319 -35548 -9338 30998 10705 41447 33365 23763 62433 41398 25675
6684 25675 399 -19398 -55442 -17758 -28479 2073 4396 -55129 -44859 5060 11672 26185
6672 26185 30223 -44961 -67191 -122921 -96892 -102364 -86848 -4784 36151 -9248 20370 21033 -10793
6659 -10793 -5794 7385 30934 114601 114209 67566 38308 34875 -3157 6289 11074 49463 80985
6646 80985 31438 8349 36851 52469 58637 73536 94811 48296 43047 -12097 -43535 -34333
6634 -34333 -31619 -29381 -5138 67939 38806 -468 -42035 -87603 16898 71312 29106 -1092
6622a092K6580O073n6967o495N2069L1788J4733m8624o6772O0166k4171J1967
6610g45P872O400J8749L6335p295n6376m6933n3605L1643N5577l2165R281P554
6597b3708J780M619k3014J5934J3629k5458l796J0772q102K2785N6040j1180L3884
6584F4185n8105k358L9441n0203j1972N164l6144J0098L0019k2225M0600K4287
6572C2787r085L630J1111O1863l7734m2174j05139q097M0100N3450L7612O7032
6560A05356L0402k8134p7916m1928k7883J9140J4045J0393M1806L8197L472J210
6548H8160n9703j04651j8376J5497K1868k9201K9653L6408P679L9025j8385l7749
6536b9775J3264K9339J9229J8286N092p559J2428r647R446k5085k4069J9751l7447
$$ plain form
6622 -1092 25488 31561 -25406 -31901 20168 51956 66689 18065 -48707 11459 -12712 -745
6610 -745 7127 13527 32276 68611 61316 4940 -41993 -95598 -63955 -8378 -40543 -31262 -23708
6597 -23708 -21928 -17309 -40323 -24389 -10760 -36218 -40014 -29242 -37344 -14559 41481 30301 64185
6584 64185 6080 3722 43163 -7040 -19012 -13848 -49992 -39894 -9875 -32100 8500 32787
6572 32787 23702 27332 38443 100306 62572 20398 -84741 -92838 -52738 712 38324 105356
6560 105356 135758 107624 29708 -12220 -40103 -20963 -6918 3475 45281 83478 86950 88160
6548 88160 28457 -76194 -94570 -79073 -57205 -86406 -56753 -20345 -12666 26359 7974 -29775
6536 -29775 -16511 12828 32057 50343 55435 47876 60304 50657 60103 35018 10949 30700 -6747
6523f747k6561J5670J3517l935K03J1480j982K1314l9782q32J9690m4719O279
6510c6405L572n2435n070J3951J4091l2860j7804J9869K3839j9123M3066j3963
6498e9272k8085m998O5579J17915J3362k5326o4153l1779J3882K1146l1208j344
6486a4281j1483k1736k8916J6543L1372L7546k756k1639o331l2360j0280j5149
6474g9470K0481L7350J7069K4134r870k1846k9932J732K6902n92k2825k5493L0533
6461c1827M3412l5638j7162n008k7345m0128k1571J7966j7418L2225R4165m2831
6449e1160l268J4000k2277L5759Q1027O9207m5105o0492l9533o835j6567m3554
6437h8798K1431J09451j1063L1395l6737K2910r247k2836L3941l4036n6933j9396
$$ plain form
6523 -6747 -33308 -17638 -4121 -8056 -7853 3627 1645 22959 -16823 -17655 2035 -42684 -36405
6510 -36405 -32833 -85268 -90338 -76387 -62296 -95156 -112960 -93091 -69252 -88375 -45309 -59272
6498 -59272 -87357 -92355 -26776 91139 104501 79175 15022 -16757 -2875 18271 -12937 -14281
6486 -14281 -25764 -47500 -76416 -59873 -28501 9045 6289 -15350 -21681 -54041 -64321 -79470
6474 -79470 -58989 -21639 -4570 19564 9694 -12152 -42084 -40352 -13450 -14042 -36867 -62360 -31827
6461 -31827 11585 -24053 -41215 -46223 -73568 -113696 -135267 -117301 -134719 -102494 -8329 -51160
6449 -51160 -54428 -40428 -62705 -26946 54081 123288 78183 17691 -21842 -28677 -45244 -88798
6437 -88798 -67367 42084 31021 62416 25679 48589 39342 16506 50447 16411 -40522 -59918
6425e9918Q445l6306j6336L8770j1970p9208l2391J2749M1994J6392l549J2488
6413a08840P0555k999k5029O8845N5716p9373q4177M632J2261R9706L3868n2351
6401g186J2766M4170K3873l6848l9822K3305m92j5985k0933o538M735L4748k070
6388A3723m573q529K9651K2522l0417k5902M983O241l343K5352m8702o809K1944
6375c859m3066L4372k731p693J0594j3976Q574k9655M006L2629r671m1679N5447
6362f708P324k0012l4308l1289M6093J3866k9389j7563M3528k9798l0789J4173
6350g4872j0677K4337L4633j7215l5467k0630K4181O4303J3533n3653k5717J5324
6338f1920N1638M5861J8036j2476l1066j0814q390n1171L0784M7973j5577J1786
$$ plain form
6425 -59918 -51473 -87779 -104115 -65345 -77315 -156523 -188914 -176165 -134171 -117779 -121328 -108840
6413 -108840 -38285 -41284 -66313 2532 58248 -21125 -105302 -100670 -88409 11297 45165 -7186
6401 -7186 5580 49750 73623 36775 -3047 20258 19766 3781 -17152 -23690 -18955 15793 13723
6388 13723 9150 621 30272 52794 22377 -3525 1458 7699 4356 29708 -18994 -25803 -3859
6375 -3859 -46925 -12553 -15284 -22977 -12383 -26359 -17785 -47440 -43434 -10805 -20476 -62155 -6708
6362 -6708 616 -19396 -53704 -84993 -38900 -25034 -54423 -71986 -28458 -58256 -89045 -74872
6350 -74872 -85549 -61212 -26579 -43794 -79261 -99891 -75710 -11407 2126 -51527 -77244 -61920
6338 -61920 -10282 35579 53615 41139 10073 -741 -9131 -60302 -29518 18455 2878 14664
6326A4664j3314j11823M9031Q8254j0645j3667M0574L9286J6045N151m6755J6252
6314G3053j0102j4273L1160L1600l1162p8539K635J3875n6225j817p3824N2552
6302f1067R1460N8821p208j6451k1158J7539j2297o1182o7039n1L3253O1225P9394
6289I5239l911r3428j4341j8421l1187L4184M9838K6234K2702k2128m822R490
6277D9449k9252K205P218j0666j9570l2116Q816l0538m3946L863J7809M3245J6729
6264a6754k7280j3511r203J6720K4802N2349L0886k9796l094l7855l4512L1725
6252a5523j7859l9597j0516P208M2031L351P678J1849J0126k8775m0022o4427
6240a34476k9543J0128O8486M9927P46J0318L2734l1117l8199k1693J9475N0246
$$ plain form
6326 14664 1350 -110473 -61442 26812 16167 2500 43074 82360 98405 103556 56801 73053
6314 73053 62951 48678 79838 111438 80276 1737 4372 18247 -37978 -39795 -113619 -61067
6302 -61067 30393 89214 82006 65555 44397 61936 49639 -11543 -78582 -78633 -45380 15845 95239
6289 95239 91328 -2100 -16441 -34862 -66049 -31865 17973 44207 66909 44781 39959 49449
6277 49449 20197 22402 29620 18954 -616 -32732 -23916 -54454 -98400 -94537 -76728 -33483 -16754
6264 -16754 -44034 -57545 -66748 -50028 -25226 27123 58009 28213 25119 -12736 -47248 -15523
6252 -15523 -33382 -72979 -83495 -76287 -34256 -30905 -23227 -11378 -1252 -30027 -70049 -134476
6240 -134476 -164019 -153891 -85405 -35478 -34732 -24414 8320 -22797 -60996 -82689 -63214 -12968
6228a2968M5745J2747l998O577J770L1612J8334n1261K6497Q994n882p5579q1259
6215g8671o4195L9924J2429N8642N8449j5778p103O0944j3470j09357m0807j4997
6203a13990k9747K4532N3733M2627J10297J3808l4452l8012m3421r538L9384k9470
6191a4249O9493N2584k7096n5905j4838n896J412j8406M0919L349J104k8166k2491
6178a8186K2094k2741n5055P834l6119P79r141K0771j7984k6011O5883O275N895
6165e5706L2589K8878p0082l4687J5805k0914N2672J9442K0174L206Q106k3108
6153b3625J0017M4004J0983m0190j01957l1087J1094K4291M7793N492J816N6103
6141A4734J9715n5475p015o49K0294k1819J5171J4923J8237N38j8805p0685l2738
$$ plain form
6228 -12968 32777 45524 41526 48103 49873 81485 99819 48558 75055 84049 78167 2588 -78671
6215 -78671 -142866 -102942 -90513 -31871 26578 10800 3697 64641 51171 -58186 -98993 -113990
6203 -113990 -143737 -119205 -65472 -22845 87452 101260 66808 28796 -14625 -24163 15221 -14249
6191 -14249 55244 107828 80732 24827 9989 4093 5505 -12901 28018 31367 32471 4305 -18186
6178 -18186 3908 -18833 -73888 -66054 -102173 -101394 -110535 -89764 -107748 -133759 -67876 -61601 -55706
6165 -55706 -23117 5761 -64321 -99008 -83203 -104117 -51445 -32003 -11829 -8623 -517 -23625
6153 -23625 -13608 30396 41379 1189 -100768 -131855 -120761 -96470 -48677 -43185 -41369 14734
6141 14734 34449 -21026 -28041 -28690 -8396 -30215 -15044 -121 18116 18654 -151 -70836 -103574
6128a03574J8431L6922m363J0386m1670J178k5427n6434K9826P9802j4750J1043
6116e8630M7991L8542K7866k7027j1370R045l9779j6991K7483L8501j2122n0915
6104b7406j1824L0369j3550K3344k3609j9501K8466O841n9047J5608L1584O6297
6092D7572M5264M2098j03703m5608K7062j0817K709n7894j9407N0929J0870j1161
6080b2086O1776j3362o5503K0181L3151o93j2962j5975m996P073m0418j3117M2688
6067b4243N7945K2940J2132n0655n3068M4863L5915Q367L2912l1823p7968m5083
6055f7766k687J5382O5484k555p486l8990l6631j5528J5890Q0737O2706j3009
6043E5547k3606o0180j3877O911p572r704J723K2260M2336j6508l7306J1160K4417
$$ plain form
6128 -103574 -85143 -48221 -52584 -42198 -83868 -82690 -108117 -164551 -134725 -54923 -69673 -58630
6116 -58630 -10639 27903 55769 28742 17372 26417 -13362 -30353 -2870 35631 23509 -27406
6104 -27406 -39230 -8861 -22411 933 -22676 -42177 -13711 -6870 -65917 -50309 -18725 47572
6092 47572 92836 134934 31231 -14377 12685 1868 4577 -53317 -72724 -21795 -10925 -22086
6080 -22086 39690 26328 -39175 -18994 14157 13464 502 -15473 -20469 -13396 -53814 -66931 -24243
6067 -24243 33702 56642 68774 18119 -34949 9914 45829 54196 87108 55285 -22683 -67766
6055 -67766 -70453 -55071 10413 7858 372 -38618 -75249 -90777 -74887 5850 68556 55547
6043 55547 31941 -28239 -42116 -35205 -42777 -52481 -50758 -28498 13838 -2670 -39976 -28816 -4399
6030d399l6748m9078L6319K2302j9559k199O0550M246j849K0473J4652j6427K6755
6017E5038l6622m3128J1704J0508m571o930P82K5958K4791j6793J5657m1415n6161
6004f1182l4054K5297M0160O6811J0301j929k7086J606r947m7151N3564Q0770
5992I7160m7576m1314j9254n6269n2742j2055O8383N4051R240K0483l8l8696j2691
5979c1318j1239M2944k6364K8926k1047J3967M1157K5012l8185k4474M9616M5932
5967I4927m1235n9683n234Q657M778k5211N5367j8719m2174J528L4013N9699J0273
5954G6986r663j0701k8857K4894M563o2842n5388K6563J3585J9734K1865J4394
5942C5133k0346J7884q384l5658L4342k238o5938m0062K1316M394N0850N964N874
$$ plain form
6030 -4399 -41147 -90225 -53906 -31604 -51163 -53362 7188 11434 9585 30058 44710 28283 55038
6017 55038 18416 -24712 -13008 -2500 -7071 -14001 -13219 12739 37530 20737 36394 -5021 -61182
6004 -61182 -95236 -69939 -29779 37032 47333 45404 18318 19924 9977 -37174 16390 97160
5992 97160 49584 8270 -10984 -67253 -119995 -132050 -63667 -9616 -376 20107 20069 -18627 -31318
5979 -31318 -42557 387 -25977 2949 -18098 -4131 37026 62038 23853 -621 48995 94927
5967 94927 53692 -5991 -11225 -2568 2210 -23001 32366 13647 -28527 -26999 7014 66713 76986
5954 76986 67323 56622 27765 52659 57222 -5620 -61008 -34445 -20860 -1126 20739 35133
5942 35133 14787 32671 24287 -11371 22971 20733 -45205 -85267 -63951 -59557 -8707 -2743 3131
5929C131l6567n9867L4771N1219J9301l4327L4785j8489l293J177N2708K8103
5917G2652O364K1117l7670k2526l0314m4559J5698K7393J2844l1623J5424K5834
5905C0634r6425n0206O7741o170m8215J6269k5783k5609R5531N3925K798l6531
5893b2041r3542n7942O4647J22380p0k292j3182m7413k7758k9353J3088N5447
5881c8031K4186L5089J2202l8730J714J1982m1900j8515j2078j2628k348K6961
5869e2096j397r628R986p999N3982M3168j7295J8570l444K7984j6378l9907m3177
5856c7631l895n2128l1222N6117N8856M0851L0826m3146n0532q230K0979N6721
5844C7566m288R193n2752m1207j4679M9981L7079l8459n5213k1484M4211K4657
$$ plain form
5929 3131 -33436 -93303 -58532 -7313 11988 -22339 12446 -6043 -9336 -8159 44549 72652
5917 72652 79016 100133 62463 39937 9623 -34936 -19238 8155 20999 -10624 4800 30634
5905 30634 -65791 -115997 -48256 -54426 -102641 -86372 -112155 -137764 -42233 11692 14490 -22041
5893 -22041 -115583 -173525 -108878 13502 13432 11140 -2042 -49455 -77213 -106566 -93478 -38031
5881 -38031 -13845 21244 33446 -5284 -3570 8412 -33488 -52003 -64081 -76709 -79057 -52096
5869 -52096 -53493 -63121 -53135 -61134 -7152 36016 18721 37291 33847 61831 45453 5546 -37631
5856 -37631 -41526 -93654 -124876 -68759 -9903 30948 61774 18628 -31904 -40134 -19155 37566
5844 37566 33278 42471 -10281 -51488 -66167 -16186 20893 -17566 -72779 -94263 -50052 -25395
5832b5395L3907k099j2496k7968K9979N2155m50k4527r111p0481O9511q107k7944
5819b3026J408j8528M310J9994j2984J2553J7072J7244j4326l688J259K5209N801
5806C2298j2967Q129l2854p619k6152k125k3072L9383K6571k067k8067j2330j0713
5793e1585p064L6841M5337l3281p7729k0207N5517K5302K2004K7128M5521P107
5781G4891n508j9878j9597j8315l1165K2356J1719j9347J8022Q619j1300l6996
5769b6499J1173k1879k5541m1624l0291L2033K7294K9230n4840R166K3022K0837
5757d7919j0713l5705P4558K030Q506l5416m694j3883M8938N4462J9504o894N995
5744E8769q000o66o4349Q210K2484k9147K3535m4032m4967K3817K5050Q6504N0371
$$ plain form
5832 -25395 8512 6413 -6083 -34051 -4072 48083 47633 23106 13995 -56486 13025 4918 -23026
5819 -23026 -21618 -40146 -35836 -15842 -28826 -16273 799 18043 3717 29 1288 26497 32298
5806 32298 19331 27460 -5394 -13013 -39165 -41290 -64362 -24979 1592 -475 -28542 -40872 -51585
5793 -51585 -58649 -21808 23529 -9752 -87481 -107688 -52171 -26869 -4865 22263 67784 74891
5781 74891 69383 49505 29908 11593 -19572 2784 14503 -4844 13178 21797 10497 -26499
5769 -26499 -15326 -37205 -62746 -104370 -134661 -102628 -75334 -46104 -100944 -91778 -68756 -47919
5757 -47919 -58632 -94337 -19779 -17749 -9243 -44659 -49353 -63236 -14298 40164 59668 52774 58769
5744 58769 50769 50103 -14246 -6036 16448 -12699 10836 -33196 -78163 -54346 -29296 57208 107579
5731A07579j5718l8485k8705p6314K2007L1914J1601L2385k844m8860m5043L7304
5719a3179J2317Q312M5848k15l2592k6262J8994J9504L527l6250m7329o0750M0976
5706f7099K7564k3846R425k1850J1899O6859m4979k5294M3351P805L717l0561
5694d3009k573N6295L9001n037l7207k6504J7121K7135m0730l5367J557J7854
$$ plain form
5731 107579 91861 53376 24671 -51643 -29636 2278 13879 46264 43420 -5440 -50483 -13179
5719 -13179 -862 7450 53298 53083 20491 -5771 13223 32727 36254 4 -47325 -108075 -67099
5706 -67099 -39535 -63381 -53956 -75806 -63907 2952 -42027 -67321 -23970 -16165 -12448 -43009
5694 -43009 -45582 10713 49714 44677 7470 -19034 -1913 25222 -15508 -50875 -49318 -31464
$$ [...]
##END NTUPLES=NMR SPECTRUM
##END=
