##TITLE=Analysis number 321617
Compound Code cc 21116
Book Reference 483/54/2
Project Code adrs
Chemist Name mattw
##JCAMPDX= 6.0         $$ Bruker NMR JCAMP-DX V2.0
##DATA TYPE= NMR SPECTRUM
##DATA CLASS= NTUPLES
##ORIGIN= Bruker BioSpin GmbH
##OWNER= nmr
$$ XWIN-NMR		Version 3.5
$$ Fri Aug 18 09:30:56 2006 GMT Daylight Time (UT+1h)  MAYBRIDGE\nmr@NMR_250MHZ
##.OBSERVE FREQUENCY= 250.131544655141
##.OBSERVE NUCLEUS= ^1H
##.ACQUISITION MODE= SIMULTANEOUS (DQD)
##.ACQUISITION SCHEME= undefined
##.AVERAGES= 16
##.DIGITISER RES= 18
##SPECTROMETER/DATA SYSTEM= dpx250
##.PULSE SEQUENCE= zg30
##.SOLVENT NAME= CDCl3
##.SHIFT REFERENCE= (INTERNAL, CDCl3, 0, 16.4471)
##AUDIT TRAIL= $$ (NUMBER, WHEN, WHO, WHERE, WHAT)
$$ ##TITLE= Audit trail, XWIN-NMR		Version 3.5
$$ ##JCAMPDX= 5.01
$$ ##ORIGIN= Bruker BioSpin GmbH
$$ ##OWNER= nmr
$$ C:\u/data/dgb/nmr/ADRS/1170/pdata/1/auditp.txt
$$ ##AUDIT TRAIL=  $$ (NUMBER, WHEN, WHO, WHERE, WHAT)
(   1,<2006-08-18 09:30:36.62 +100>,<MAYBRIDGE\nmr>,<NMR_250MHZ>,
      <created by zg, POWCHK disabled, PULCHK disabled
       configuration hash MD5:
       E2 DF 36 D8 04 B2 41 60 5A D7 A3 38 5A 4B D0 FE
       data hash MD5: 64K
       F3 B9 D7 67 6F C9 F3 5B 3A C9 6F 35 71 61 A2 76>)
(   2,<2006-08-18 09:30:48.28 +100>,<MAYBRIDGE\nmr>,<NMR_250MHZ>,
      <Start of raw data processing
       ef LB = 0.3 FT_mod = 6 PKNL = 1 SI = 32K 
       data hash MD5: 32K
       07 D6 D2 85 58 E9 C6 1F 51 31 03 27 3A 9C A2 23>)
(   3,<2006-08-18 09:30:50.09 +100>,<MAYBRIDGE\nmr>,<NMR_250MHZ>,
      <apk 
       data hash MD5: 32K
       09 8F B0 2F BA FA 4D 3B B9 B0 69 8B 4C E4 0F E3>)
(   4,<2006-08-18 09:30:50.81 +100>,<MAYBRIDGE\nmr>,<NMR_250MHZ>,
      <abs ABSG = 5 
       data hash MD5: 32K
       3A 85 FF 86 80 55 0A E9 25 91 B6 63 43 3A B4 38>)
$$ ##END=
$$ 
$$ hash MD5
$$ 34 56 60 B3 64 E1 41 09 62 51 90 A7 31 5F 65 D3
##$RELAX= 
##$RELAX= 
##$RELAX= 
##$RELAX= 
##$RELAX= 
##$RELAX= 
##$RELAX= 
$$ Bruker specific parameters
$$ --------------------------
##$DU= <C:\u>
##$EXPNO= 1170
##$NAME= <ADRS>
##$PROCNO= 1
##$TYPE= <nmr>
##$USER= <dgb>
##$AMP= (0..31)
100 100 100 100 100 100 100 100 100 100 100 100 100 100 100 100 100 100 
100 100 100 100 100 100 100 100 100 100 100 100 100 100 
##$AQSEQ= 0
##$AQ_mod= 3
##$AUNM= <au_zg>
##$AUTOPOS= <6 >
##$BF1= 250.13
##$BF2= 250.13
##$BF3= 250.13
##$BF4= 250.13
##$BF5= 500.13
##$BF6= 500.13
##$BF7= 500.13
##$BF8= 500.13
##$BYTORDA= 1
##$CFDGTYP= 0
##$CFRGTYP= 5
##$CHEMSTR= <none>
##$CNST= (0..31)
1 1 145 1 1 1 1 1 1 1 1 1 1 1 1 1 1 1 1 1 1 1 1 1 1 1 1 1 1 1 1 1 
##$CPDPRG= <>
##$CPDPRG1= <>
##$CPDPRG2= <>
##$CPDPRG3= <>
##$CPDPRG4= <mlev>
##$CPDPRG5= <mlev>
##$CPDPRG6= <mlev>
##$CPDPRG7= <mlev>
##$CPDPRG8= <mlev>
##$CPDPRGB= <>
##$CPDPRGT= <>
##$D= (0..31)
0 1 0 0 0 0 0 0 0 0.06 0 0 0 0 0 0 0.0002 0 0 0 0 0 0 0 0 0 0 0 0 0 0 
0 
##$DATE= 1155889835
##$DBL= (0..7)
120 120 120 120 120 120 120 120 
##$DBP= (0..7)
150 150 150 150 150 150 150 150 
##$DBP07= 0
##$DBPNAM0= <>
##$DBPNAM1= <>
$$ [...]
##$SUBNAM7= <"">
##$SUBNAM8= <"">
##$SUBNAM9= <"">
##$SW= 20.6930455092707
##$SWIBOX= (0..15)
0 0 3 0 0 0 0 0 0 0 0 0 0 0 0 0 
##$SW_h= 5175.983436853
##$TD= 65536
##$TD0= 1
##$TE= 295.16
##$TE2= 300
##$TE3= 300
##$TEG= 300
##$TL= (0..7)
0 120 120 120 120 120 120 120 
##$TP= (0..7)
150 150 150 150 150 150 150 150 
##$TP07= 0
##$TPNAME0= <>
##$TPNAME1= <>
##$TPNAME2= <>
##$TPNAME3= <>
##$TPNAME4= <>
##$TPNAME5= <>
##$TPNAME6= <>
##$TPNAME7= <>
##$TPOAL= (0..7)
0.5 0.5 0.5 0.5 0.5 0.5 0.5 0.5 
##$TPOFFS= (0..7)
0 0 0 0 0 0 0 0 
##$TUNHIN= 0
##$TUNHOUT= 0
##$TUNXOUT= 0
##$USERA1= <user>
##$USERA2= <user>
##$USERA3= <user>
##$USERA4= <user>
##$USERA5= <user>
##$V9= 5
##$VALIST= <valist>
##$VCLIST= <CCCCCCCCCCCCCCC>
##$VD= 0
##$VDLIST= <DDDDDDDDDDDDDDD>
##$VPLIST= <PPPPPPPPPPPPPPP>
##$VTLIST= <TTTTTTTTTTTTTTT>
##$WBST= 1024
##$WBSW= 4
##$XGAIN= (0..3)
0 0 0 0 
##$XL= 0
##$YL= 0
##$YMAX_a= 435927
##$YMIN_a= -563313
##$ZGOPTNS= <>
##$ZL1= 120
##$ZL2= 120
##$ZL3= 120
##$ZL4= 120
##$ABSF1= 16.4471
##$ABSF2= -4.246073
##$ABSG= 5
##$ABSL= 3
##$ALPHA= 0
##$AQORDER= 0
##$ASSFAC= 0
##$ASSFACI= 0
##$ASSFACX= 0
##$ASSWID= 0
##$AUNMP= <proc_1d>
##$AZFE= 0.1
##$AZFW= 0.1
##$BCFW= 0
##$BC_mod= 0
##$BYTORDP= 0
##$COROFFS= 0
##$CY= 12.5
##$DATMOD= 1
##$DC= 0
##$DFILT= <>
##$DTYPP= 0
##$F1P= 14.0000005364418
##$F2P= -0.99999901652339
##$FCOR= 0.5
##$FTSIZE= 32768
##$FT_mod= 6
##$GAMMA= 0
##$GB= 0
##$INTBC= 1
##$INTSCL= 1
##$ISEN= 128
##$LB= 0.3
##$LEV0= 0
##$LPBIN= 0
##$MAXI= 10000
##$MC2= 0
##$MEAN= 0
##$ME_mod= 0
##$MI= 0
##$NCOEF= 0
##$NC_proc= -4
##$NLEV= 6
##$NOISF1= 0
##$NOISF2= 0
##$NSP= 0
##$NTH_PI= 0
##$NZP= 0
##$OFFSET= 16.4471
##$PC= 1
##$PHC0= 153.1609
##$PHC1= 4.993997
##$PH_mod= 1
##$PKNL= yes
##$PPARMOD= 0
##$PSCAL= 4
##$PSIGN= 0
##$REVERSE= no
##$SF= 250.130018734472
##$SI= 32768
##$SIGF1= 0
##$SIGF2= 0
##$SINO= 400
##$SIOLD= 32768
##$SREGLST= <1H.CDCl3>
##$SSB= 0
##$STSI= 32768
##$STSR= 0
##$SW_p= 5175.98343685301
##$SYMM= 0
##$S_DEV= 0
##$TDeff= 65536
##$TDoff= 0
##$TI= <Analysis number 999999
Compound Code 99
Book Reference 9
Project Code 9>
##$TILT= no
##$TM1= 0
##$TM2= 0
##$TOPLEV= 0
##$USERP1= <user>
##$USERP2= <user>
##$USERP3= <user>
##$USERP4= <user>
##$USERP5= <user>
##$WDW= 1
##$XDIM= 32768
##$YMAX_p= 293150920
##$YMIN_p= -324313
$$ End of Bruker specific parameters
$$ ---------------------------------
##NTUPLES= NMR SPECTRUM
##VAR_NAME=  FREQUENCY,     SPECTRUM/REAL,   SPECTRUM/IMAG
##SYMBOL=    X,             R,               I
##VAR_TYPE=  INDEPENDENT,   DEPENDENT,       DEPENDENT
##VAR_FORM=  AFFN,          ASDF,            ASDF
##VAR_DIM=   32768,         32768,           32768
##UNITS=     HZ,            ARBITRARY UNITS, ARBITRARY UNITS
##FACTOR=    0.157963299565203, 1,           1
##FIRST=     4113.9133525041, 0,             0
##LAST=      -1062.07008434891, 0,           0
##MIN=       -1062.07008434891, -324313,     0
##MAX=       4113.9133525041, 293150920,     0
$$ Real data points
##PAGE= N=1
##DATA TABLE= (X++(R..R)), XYDATA
$$ [...]
23822B08055j6175j19896K1703O4579m9335o575K2927j5385R8053J3601o1721
23811A59831m5602k897J3001M8967r2442q7980L5359k2473j2900L2246n9090j31193
23799a65173R727N6057J2116k6706O353O4743Q6556P6477K4163n3226j0347q645
23787G2095o9986l18K4241q1122L2590J271m2321J0108L8070r581j4436J7967
23775b1422j1499k2950O9941j3268r5466m1429Q756K7015L4103M4224P6137J0479
23763F4621q4014k8734L975j8079o965M7692O753l082K7343r872q1927m9907J25860
23750f336J17872p866j11013l0576k3300j23O4335N5581L3800N972k3208j02806
23738b7668q0031J0076l2085q1561P7624J48112R1625p024Q125L6389R356k9020
$$ plain form
23822 208055 191880 71984 93687 158266 108931 102356 125283 109898 207951 221552 159831
23811 159831 114229 111332 124333 173300 80858 -7122 28237 5764 -7136 25110 -33980 -165173
23799 -165173 -155446 -99389 -87273 -113979 -107626 -42883 43673 120150 144313 91087 80740 72095
23787 72095 2109 1791 26032 -55090 -22500 -21229 -63550 -53442 -15372 -24953 -39389 -21422
23775 -21422 -32921 -55871 14070 802 -94664 -136093 -127337 -100322 -66219 -21995 54142 64621
23763 64621 -19393 -48127 -44152 -62231 -69196 -21504 -14751 -17833 9510 -362 -82289 -132196 -6336
23750 -6336 111536 103670 -7343 -37919 -61219 -61342 2993 58574 92374 98346 75138 -27668
23738 -27668 -107699 -97623 -129708 -211269 -133645 14467 106092 99068 107193 143582 152938 123918
23726A23918r9333j8938O5676p2623Q337O5405l0912k275K5444J27k1846N1297
23714I4277l7426K4034K2598r0565k3025L6463P236m8093j8553M3296j0815M5746
23702D5173K2532q6052M670L445l483N5919Q9039k5208j21348n5463Q1908K1840
23690C2972K7021m5840l3564L3952m680o1341j3406J00243j9021R1077O084l8682
23678G4815k1740L6927K3781p1281j7037m271K8791m4450M4323Q970k2076O3714
23666A00466o6062n0096O3845n1505L8680k8711p4283r905L6004K8792L7179O1389
23654H5793N5397K5549j12841j00042J0879J2371J9660O0531Q017j05983K8525
23643a2144L0644k4588k7050J3999K3921n8131j4467P2383M5516j2860k5555l6037
$$ plain form
23726 123918 24585 5647 71323 -1300 7037 72442 41530 39255 64699 64826 42980 94277
23714 94277 56851 80885 103483 12918 -10107 26356 33592 -14501 -33054 10242 -573 45173
23702 45173 67705 -18347 -13677 -10232 -13715 42204 131243 106035 -15313 -70776 11132 32972
23690 32972 59993 14153 -19411 14541 9861 -51480 -64886 35357 16336 107413 113497 74815
23678 74815 53075 90002 113783 42502 25465 21194 49985 5535 49858 58828 36752 100466
23666 100466 34404 -15692 48153 -3352 35328 6617 -67666 -77571 -41567 -12775 24404 85793
23654 85793 141190 166739 53898 -46144 -35265 -22894 -3234 57297 65314 -40669 -12144
23643 -12144 18500 -6088 -33138 -19139 4782 -53349 -67816 4567 50083 37223 11668 -24369
23631b4369K2384o446J1335K0284l3051K5826p0689n7138K499J5828K568K8308
23619f2661J2922j6166K2525P9284M0988K3348J2184J9073k2315l7728j54792
23608h3338q0102M3983m5106M2631l0825J408N6657O6829n0634O8218L9445l6918
23596g752j24485p1087j5650J1924P3664J3847O9666R481P4704l6201j176k3374
23584b6439o7053J03711M5539m8938j615J17730K4062r6433k6398J073j444P1056
23572I4851J36j01277Q4237O7374m1651o1058k0746P2271k8300n1289L9266o2576
23560h762L9519J861K4879L2871k1915o2371j09226L8743J3888L1790M3885J3331
23548C8493J4645j943k1679q8632n9608O0041O4126O0854o78j01862K9603N6874
$$ plain form
23631 -24369 -1985 -8431 2904 23188 -9863 15963 -54726 -111864 -109365 -93537 -90969 -62661
23619 -62661 -49739 -65905 -43380 35904 76892 100240 112424 131497 109182 71454 -83338
23608 -83338 -163440 -119457 -164563 -121932 -152757 -151349 -94692 -27863 -78497 -10279 29166 -7752
23596 -7752 -132237 -203324 -218974 -207050 -133386 -119539 -49873 -40392 34312 -1889 -3065 -26439
23584 -26439 -93492 10219 55758 6820 5205 122935 146997 50564 24166 25239 23795 94851
23572 94851 94987 -6290 77947 145321 103670 42612 21866 94137 65837 14548 53814 -8762
23560 -8762 30757 32618 57497 90368 68453 6082 -103144 -64401 -50513 -18723 25162 38493
23548 38493 53138 51195 29516 -59116 -118724 -58683 5443 66297 65619 -36243 -6640 50234
23536E0234J8555j20998q3047n9150N0381J0990L8947N6855Q1582K4333j9890
23525D8792j2846J9367J2333l5476l7213m716l2832l266R0380J1828n1272n8251
23513e3172M8717L292K2531K2242J8373L7459N796j2117p4280o1181Q511O483
23501b7346p9620L9483P1934j076n5232n9901r584R190M2864K0288j312n5292
23489a05604n3625J4472L1911k9186N3918J33423P9600l2959q5155L1520k9486
23478H829j2103K9916J9405K8986M4532l3101r3583K2835O2243k1953m2034m3848
23466b9876J32110M2868o9508j11701p0982k998L5728P3953J3841L1995J7960
23455F3390m1076j95949j05835N0456J21647L1342N2765n40p6106Q3374q96l0813
$$ plain form
23536 50234 68789 -52209 -135256 -194406 -144025 -133035 -94088 -37233 44349 68682 48792
23525 48792 35946 55313 67646 32170 -5043 -9759 -42591 -45857 44523 56351 5079 -53172
23513 -53172 -4455 -1163 21368 43610 61983 99442 105238 93121 18841 -42340 -33829 -27346
23501 -27346 -106966 -67483 4451 3375 -51857 -111758 -121342 -112152 -69288 -49000 -50312 -105604
23489 -105604 -159229 -144757 -112846 -142032 -88114 45309 124909 91950 6795 38315 8829
23478 8829 -3274 26642 46047 75033 119565 86464 -7119 15716 77959 56006 13972 -29876
23466 -29876 102234 145102 75594 -36107 -107089 -110087 -74359 -406 13435 45430 63390
23455 63390 22314 -173635 -279470 -229014 -107367 -76025 -23260 -23800 -99906 -16532 -17428 -48241
23443d8241R674J2438O3307L7441K2593M1732O2474l8198j46998m8164M8144L1125
23431D7327N4270L0628r49n8323p158L6992J5555K6789J5194m1115m3731k0569
23419E4910k47k3498m7358m6940M8426M9483j556M4797K000m5589N1037k3036
23407F2429P0082r760n7666J0363j2467K1434M4669n9723n058J8196O4473n659
23395A41313j23778r3792R5404L1831K3490P7657K6489p6955r9846M3572O4436
23384A09821k9207j12266J107j1084J8695o4619m3143k5901N5049L7748N3145
23373a0655K2947L6062j6741m0747N2334M9869j859j9645l1238q3150o4251n4418
23361a61492L0964Q3982L0613r9169j0963j2978K1307N1210J6529O2842m043m5272
$$ plain form
23443 -48241 -38567 -26129 37178 74619 97212 138944 201418 163220 16222 -31942 16202 47327
23431 47327 101597 132225 131276 72953 65795 102787 118342 145131 160325 119210 75479 54910
23419 54910 54663 31165 -16193 -63133 -14707 34776 33220 78017 80017 34428 85465 62429
23407 62429 132511 122751 65085 75448 62981 84415 129084 69361 64303 82499 146972 141313
23395 141313 17535 -76257 19147 50978 74468 152125 178614 101659 1813 45385 109821
23384 109821 80614 -31652 -30545 -41629 -22934 -87553 -130696 -156597 -101548 -63800 -10655
23373 -10655 12292 48354 31613 -9134 43200 93069 91210 71565 40327 -42823 -107074 -161492
23361 -161492 -130528 -46546 -15933 -115102 -126065 -139043 -117736 -66526 -49997 12845 8802 -36470
23349c6470n1478K6461O2236j3398j17182p1553Q140J25037R9975J6105Q3827
23338A31700j5324m4011n8692j2048L316q751l198L5893K514l6562m6474J3164
23326c8473l6581R576l4040l595q6737l7770O8614M736o6947j2155M0342m567
23314a97597J1517P4156P864L7725m2777m0489R051j3421L3014K5894R1819O2370
23302E9126k6175k8786j5363k4250k3467k3881L2675m7134k8514N5976K0344O6541
23290A7092R9559P3194L7319K6198q7694m3497m3557j2659n1908q0092N4770R3652
23278H2377l1139j5748N1255J7340o9029o4561j12340n1527N0083J33818N0642
23267D1171l1489l3790m2713p084m6388j3315l1314M9001M0225m7961R5644K9290
$$ plain form
23349 -36470 -87948 -61487 749 -12649 -129831 -201384 -193244 -68207 31768 47873 131700
23338 131700 116376 72365 13673 1625 4941 -3810 -7008 28885 31399 -5163 -51637 -38473
23326 -38473 -75054 -65478 -99518 -103113 -189850 -227620 -159006 -154270 -221217 -233372 -193030 -197597
23314 -197597 -186080 -111924 -104060 -66335 -109112 -149601 -140550 -153971 -120957 -95063 -3244 59126
23302 59126 32951 4165 -11198 -35448 -58915 -82796 -50121 -97255 -125769 -69793 -49449 17092
23290 17092 116651 189845 227164 253362 165668 122171 78614 65955 14047 -66045 -11275 82377
23278 82377 51238 35490 86745 104085 35056 -29505 -141845 -193372 -143289 -9471 41171
23267 41171 9682 -24108 -66821 -73905 -120293 -133608 -164922 -115921 -75696 -123657 -28013 1277
23255A277k1519q387j8242Q435l849Q9418J034m2105N941L02l7291J7664J4298
23242F976J2002L8478K9281l5328N3940K6705r9079q6018m7560P8638P5486m4826
23230H695m3289m5746m4601j2911N4495J9052j1909K5028p8968l1695M8299O9702
23218d3848J5283n496o0093k3110J22177q7747m1533o217N768O8005L2469j07595
23206a31937j1082J01389L1111j55346Q438m3125m8059L5841P8779j800L6863
23195i8928L7270P7784P1503k8224l7192o6854n6367k4664L268L7173J6280N6253
23183a2698J2730n6345k2634N9837n3751j4980R1474J4561o6115j6051J22123
23172E8151P5411q3686j36234j5117M6025P4736J3265p2763j7479l476j3866J2369
$$ plain form
23255 1277 -20242 -28629 -46871 -38436 -42285 47133 48167 6062 12003 12305 -24986 -7322 6976
23242 6976 18978 57456 86737 51409 105349 132054 32975 -53043 -100603 -21965 53521 8695
23230 8695 -34594 -80340 -124941 -137852 -83357 -64305 -76214 -51186 -130154 -161849 -113550 -43848
23218 -43848 -28565 -34061 -94154 -117264 4913 -82834 -124367 -130584 -124816 -56811 -24342 -131937
23206 -131937 -143019 -41630 -10519 -165865 -157427 -200552 -248611 -212770 -133991 -135791 -98928
23195 -98928 -61658 16126 87629 59405 22213 -44641 -101008 -125672 -122404 -85231 -68951 -12698
23183 -12698 32 -56313 -78947 -19110 -72861 -87841 3633 18194 -47921 -63972 58151
23172 58151 133562 49876 -86358 -101475 -55450 19286 32551 -40212 -57691 -61167 -75033 -62664
23160f2664K0354N7245j1989j676K6913k1269o2783K7563R955m0891l902l067
23148f6211K2626R3762Q3243M1333j6304K1651r4511j43645J2488O2537M4057
23137F1026J9836O681J9497k2097l3269o4429J27o1228m5889P7938K3247O2845
23125D4285l6489J40175K9463j35828j27566L1159N3761K2424m0683k9042M9638
23114A297P1189M6277o8206o1639K2205M3338l450p6998n6938n20M6503N2865
23102A5923k9521K8250r5940o2823j2380P3847M6404l9275j6141K7258J7702l8171
23090h4867o6180k8342J21804J16152Q04o9560q1589O5084P1310l4792K9901l9504
23078B21l2345m3400J4080J473R0276J5410M8500o2415j28298o7500M7617L1793
$$ plain form
23160 -62664 -42310 14935 2946 1270 28183 6914 -55869 -28306 -18351 -59242 -63144 -66211
23148 -66211 -43585 50177 133420 174753 158449 180100 85589 -58056 -45568 16969 61026
23137 61026 80862 87543 107040 84943 51674 -12755 -12628 -73856 -119745 -41807 -18560 44285
23125 44285 7796 147971 177434 41606 -85960 -54801 -1040 21384 -19299 -48341 1297
23114 1297 72486 118763 50557 -11082 11123 54461 51011 -25987 -82925 -83445 -36942 15923
23102 15923 -13598 14652 -81288 -144111 -156491 -82644 -36240 -75515 -91656 -64398 -46696 -84867
23090 -84867 -151047 -179389 -57585 58567 59371 -10189 -91778 -26694 44616 9824 39725 221
23078 221 -32124 -75524 -61444 -59971 30305 45715 94215 31800 -96498 -163998 -116381 -84588
23066h4588q6328l7968M0412L9780N9491J2787P03L187o387N0290K4130k4144
23054h635l3234K2803N9044K1455m0720k4290K8396R8644P6797j4122o0909p1747
23042E3482J2021q687N972K4642Q8294l821j21565n6253J2000M0111l7117k0844
23030a1765k693J1588M8916L103O4705L7107j4893k6665J3935p1060p1437Q047
23018a1112j5080l8932K3405J2172j4123M5922K8068m5447o6987K6080Q10n645
23006f0869r4314j5361r570J03911K6220j4120m5209L8573N6117k802k2144K361
22994c7207k0992o0815j0368K1061m46L9785K5772M5556K3349j8374k0977j00135
22982a13791n3254N237O0409J1195M094M8283J5229l344m7380M6355M5534K3757
$$ plain form
23066 -84588 -170916 -208884 -168472 -128692 -69201 -56414 -55711 -52524 -58911 -8621 15509 -8635
23054 -8635 -41869 -19066 39978 61433 20713 -3577 24819 123463 200260 186138 125229 53482
23042 53482 65503 56816 62788 87430 175724 171903 50338 -5915 6085 46196 9079 -11765
23030 -11765 -14458 -2870 46046 49149 113854 150961 136068 109403 123338 52278 -19159 -11112
23018 -11112 -26192 -65124 -41719 -29547 -43670 2252 30320 -15127 -82114 -56034 -55224 -60869
23006 -60869 -155183 -170544 -180114 -76203 -49983 -64103 -109312 -70739 -14622 -17424 -39568 -37207
22994 -37207 -58199 -119014 -129382 -108321 -108767 -68982 -43210 2346 25695 7321 -13656 -113791
22982 -113791 -167045 -161808 -101399 -90204 -86110 -37827 -22598 -25942 -73322 -26967 18567 42324
22970D2324L5276m9416l9011L0066m0097K0746j9961j17636R392M5692n2102Q908
22958a25819J2050L8945k8630j0251L2488L9893N1260Q568K1797K7910l9953k4695
22946C563P9219Q1601L1835j32011j37161n4161J8281L8876N4630p959l1499k2578
22934g7364N7008k1057n5675k4663O5275m2652N203k8386m3739O5581M4776P5791
22922B0098Q56K8109L889j09953q8803k586P0088J4123J8507q887n4330M306J1613
22909i2970J2106J7589K2156l6890J1284n3097l8626N7956l0943K6024O7201o9814
22897a08024n323L3776M4497K8530P6802n376j7189m9210J841n9216P348L2189
22885a9355L7991K5003O6744M150k8731m253j9492r347n9932o0863L1284L6258
$$ plain form
22970 42324 77600 28184 -10827 19239 -20858 -112 -20073 -137709 -128317 -82625 -134727 -125819
22958 -125819 -113769 -74824 -103454 -113705 -81217 -41324 9936 18504 40301 68211 28258 3563
22946 3563 82782 164383 196218 64207 -72954 -127115 -108834 -69958 -15328 -23287 -54786 -77364
22934 -77364 -20356 -41413 -97088 -121751 -56476 -99128 -93925 -122311 -166050 -100469 -55693 20098
22922 20098 20954 49063 52952 -57001 -145804 -148390 -78302 -64179 -45672 -54559 -108889 -104583 -92970
22909 -92970 -80864 -63275 -41119 -78009 -66725 -119822 -158448 -100492 -131435 -105411 -38210 -108024
22897 -108024 -113347 -79571 -35074 -6544 70258 64882 47693 -1517 324 -58892 -51544 -19355
22885 -19355 18636 43639 110383 114533 85802 81549 62057 52710 -7222 -68085 -36801 -543
22873e43l3206N5924l0663o0048J017J2887m2793o9348N0579m8473j4297j4746
22861a93710N4067J87302N5466m3859K225k2629l2419n362L4033n6397K1864J5517
22849A6098k9148p2257P512J14759m2734q4748J6718p4759k7953M4978M7805k0063
22837a03792L1907N4062P9383q9980m8189J07671m9393n9462k3988M1073l4855
22826i5563P098J02548O5059k7975J5304j4334q718J199K0855j1287n7024j315
22814d153L9226k1192J8599N052p1290Q9195M0004j0148r555o4998l5897K0529
22802d628m84R652M7776N1996n1311m7012l7459j3787j4326J01885L0547j141
22790G1708J12634N543m8165M5074L2172r0403r1054o0591k0449O000m4865n080
$$ plain form
22873 -543 -33749 22175 -8488 -68536 -67519 -54632 -97425 -166773 -116194 -164667 -178964 -193710
22861 -193710 -139643 47659 103125 59266 61491 38862 6443 1081 35114 -21283 581 16098
22849 16098 -13050 -85307 -77795 36964 -5770 -90518 -73800 -148559 -176512 -131534 -83729 -103792
22837 -103792 -71885 -17823 61560 -28420 -76609 31062 -18331 -77793 -101781 -60708 -95563
22826 -95563 -88465 14083 79142 51167 66471 52137 43419 44618 65473 54186 -2838 -4153
22814 -4153 35073 13881 32480 37532 -33758 55437 95441 85293 75738 10740 -25157 -4628
22802 -4628 -5112 4540 52316 104312 53001 5989 -31470 -45257 -59583 42302 72849 71708
22790 71708 184342 189885 141720 186794 218966 128563 37509 -23082 -43531 -37531 -82396 -87476
22778h7476J9010l933M9176J08317M1949J2149p9645o1742R5462J4717j26393
22767a8409l0760j03820n6726J3865J13674Q3933M439p917n8235k0501L884L6585
22755c9988P886Q392N3070J7295p0635k7831N4371Q135M5808L1174p8376o1073
22743e1772O486P6711n5777M5172R935j15170k2291L1271L340N3492J2199N8323
22731E1919j082K0867k1723k3837q0509L4423K0764j8945K5401K7030j5360m301
22719A4647n0159m2734p307O9476Q9314O6544l6936q7261m5309m9408m7038m5813
22707a71984P5968J28098O8940P7044k3727o7424j2292o9951O109L5656M4792
22696I1229o939p6469m6484l7205k1128P5948M0076P07p2080p6538O7761J05641
$$ plain form
22778 -87476 -68466 -72399 -23223 85094 127043 139192 59547 -2195 93267 107984 -18409
22767 -18409 -49169 -152989 -209715 -195850 -82176 1757 6196 -1721 -59956 -80457 -76573 -39988
22755 -39988 -32102 -23710 29360 46655 -23980 -51811 2560 10695 56503 87677 9301 -51772
22743 -51772 -45286 31425 -24352 20820 30755 -84415 -106706 -75435 -72095 -18603 -6404 51919
22731 51919 50837 71704 49981 26144 -54365 -19942 822 -18123 7278 34308 18948 14647
22719 14647 -35512 -78246 -85553 -16077 73237 139781 102845 15584 -29725 -79133 -126171 -171984
22707 -171984 -96016 32082 101022 178066 154339 86915 74623 4672 10781 46437 91229
22696 91229 84290 7821 -38663 -75868 -96996 -21048 19028 19735 -52345 -128883 -61122 44519
22684D4519q988n2920l119l964n06l6162j9209j5606L4178R6543m6851N179m1510
22671d8416P1716q8233n0673N5990J4877n433m0394N7665O013N883l9841j1536
22659g2382k7196K1910P499J6108M1204m2673l6456n4833O604n254N8306O8004
22647a9159k398l7986O7045n533p7073j5669l0863k9634P7421M6641r2437j10624
22635b30269n521R395M7302P0490N8851K44N114P8891K2961k1179r0202K3301
22623c0622K8291N6427j5473K4916m0469j68621J0839Q6879o1302k5782K9213
22612a05704Q8367j0589L820R098l6891M916J26187M8405n9970k9440k1105l9486
22600b2392m8318j975M4537J04631m5325l9015J4335m2642k7724m6189L3521L6700
$$ plain form
22684 44519 35531 -17389 -20508 -24472 -24978 -61140 -80349 -95955 -61777 34766 -12085 -6906 -48416
22671 -48416 23300 -64933 -115606 -59616 -44739 -50172 -90566 -32901 -26888 -21005 -60846 -72382
22659 -72382 -99578 -77668 -70169 -54061 -12857 -55530 -91986 -146819 -140215 -145469 -87163 -19159
22647 -19159 -21557 -59543 7502 1969 -75104 -90773 -121636 -151270 -73849 -27208 -119645 -230269
22635 -230269 -235790 -226395 -179093 -108603 -49752 -49508 -44394 34497 57458 36279 -53923 -30622
22623 -30622 -2331 54096 38623 63539 23070 -145551 -134712 -47833 -109135 -134917 -105704
22612 -105704 -17337 -27926 -24106 -15008 -51899 -46983 79204 127609 67639 38199 17094 -22392
22600 -22392 -70710 -72685 -28148 76483 31158 -7857 6478 -36164 -63888 -110077 -76556 -39856
22588c9856K084M5649Q0166j6646L1252p2824K0464J735N0057q533m6963L0942
22576G7527n720j7007n7741J7409N862L1193j25406n2135J9731J9677J3849P6306
22564C545N2542l0500N8401k1545m8130L960j3909L1820k2349k3666k6294J1106
22552b5019O4927L9468m9060o337N4189j2588o8799N3285L9372O013j4976m6268
22540C4207K8779K0628K4034Q404p5744l5272m7810L0180N7511K6917n4083p0923
22528e3172l5308k2908K9414P8976P0194n410n5267l356J4859N4116M3511Q400
22516A24049n2536l0900M233n5490j22109O7241R8584k8550r9409k0790J4993
22505a00684P5415j5311j3744m462J4570K8100J9356L5648j63m2512o4391q608
$$ plain form
22588 -39856 -37772 7877 88043 71397 102649 29825 50289 52024 102081 93548 46585 77527
22576 77527 71807 54800 -2941 14468 20330 51523 -73883 -126018 -106287 -86610 -72761 3545
22564 3545 56087 25587 83988 62443 14313 18273 4364 36184 13835 -9831 -36125 -25019
22552 -25019 39908 79376 30316 23979 78168 65580 -3219 50066 89438 95451 80475 34207
22540 34207 62986 83614 107648 116052 40308 5036 -42774 -12594 44917 71834 17751 -53172
22528 -53172 -88480 -111388 -81974 -2998 67196 61786 6519 3163 18022 72138 115649 124049
22516 124049 71513 40613 44846 -10644 -132753 -65512 33072 4522 -94887 -115677 -100684
22505 -100684 -25269 -40580 -54324 -58786 -44216 -16116 3240 38888 38725 -3787 -68178 -76786
22493g6786J9487K9979P1044N6360r8025o2321M6223j87k9546J0782l2520l28
22481f5838l642P0811k8930p0208J08903N3814J3901l6977j1229K6976L8717p8005
22469A8293j06886J8355M4448n1684K5041K7287o2460L0962M4208M7668q295k5741
22457A196o4298l3660J30295j3588j2686P712J3733K6982j4948J3832j576o2992
22445i998k0559K42p6836q992j0271m034O9288Q0725p18R374J079q316k8012o851
22431a3879K6223O2725p6803j8416N2551M2384k574m1111k6789N9285O9948N4636
22419A88180j15819j23250j07425j4045m1599M7978J05647k2794n7570P0310J11732
22408D1345l4072o4158J627k066q2878m2331Q3039M7944J4582l9583R3332N2547
$$ plain form
22493 -76786 -57299 -27320 43724 100084 2059 -60262 -14039 -14226 -43772 -32990 -65510 -65838
22481 -65838 -69480 1331 -27599 -97807 11096 64910 78811 41834 30605 57581 96298 18293
22469 18293 -88593 -70238 -25790 -77474 -52433 -25146 -87606 -56644 -12436 35232 26937 1196
22457 1196 -63102 -96762 33533 19945 7259 14971 28704 55686 40738 54570 52994 -9998
22445 -9998 -30557 -30315 -107151 -116143 -126414 -130448 -61160 19565 18847 28221 29300 20984 -7028 -13879
22431 -13879 12344 75069 -1734 -20150 32401 74785 72211 31100 4311 63596 133544 188180
22419 188180 72361 -50889 -158314 -172359 -213958 -165980 -60333 -83127 -140697 -70387 41345
22408 41345 7273 -56885 -55258 -57324 -140202 -182533 -99494 -51550 -36968 -76551 16781 69328
22396F9328l5961q0486k0168P3457K4018Q857K5359p7310q1989O1111K4231l3663
22384d3216l5433n9532N2873N6367k8911M8930J5096q587Q181o7846l4435P3113
22372b3400L2107J818M3632m8167p8458M1272K6537j5462N1216P7648K5433J0733
22360A44909o585j28983l3862K5509n7156q8068n8913L2755L7929N4549N562j9196
22348i1550m4278N8140K2496k0992k9807O348m516O0376R4249M231j32787L0566
22336d7524j8899L165K3092j9344k3223J9417o8597m3612M8388L6608K8822N2530
22324i177O4477O1977j14146j04320j9879P5678l220J2089n5032l3299J04492
22313b0360J6997p7114J9836L438m094J01204K9772p2500K9695K4628p2324M6181
$$ plain form
22396 69328 33367 -47119 -67287 6170 30188 39045 64404 -12906 -94895 -33784 -9553 -43216
22384 -43216 -78649 -138181 -85308 -28941 -57852 -8922 6174 -2413 5768 -62078 -96513 -23400
22372 -23400 8707 10525 54157 5990 -72468 -31196 -4659 -20121 31095 108743 134176 144909
22360 144909 138324 9341 -24521 988 -56168 -144236 -203149 -170394 -132465 -77916 -72354 -91550
22348 -91550 -135828 -77688 -55192 -76184 -105991 -99643 -104159 -43783 50466 54697 -78090 -47524
22336 -47524 -66423 -63258 -40166 -59510 -82733 -63316 -131913 -175525 -127137 -90529 -61707 -9177
22324 -9177 55300 117277 3131 -101189 -121068 -45390 -48610 -36521 -91553 -124852 -20360
22313 -20360 -3363 -80477 -60641 -57203 -61297 39907 69679 -2821 26874 51502 -20822 25359
22301B5359l9043m9639R815K3368M5509J07594K478k4788n5296j3582l1398J8443
22289A8820k6111p9802k8388Q3351L8413q983p253l355P5295L6586m842k8054
22277F5677p5432k1438M0583j07810q6803L3328M0622m970K5625M1979l7243J1074
22265g4808M1972J3955n0317o6816m1929k4111J25103M3922N2587M089n4043n582
22253c5978j6582o8367M2636Q3701N4628m8143j13264m447N8512J14321N6712
22242A23729p6270j02337j8658L852Q1694p0237p5792j2336J2783L9780N611N9561
22230b8620k7624o1622Q631J9711Q1242K2716Q677J3653L7430j05228j4658O920
22218c8772p05K456k6463m263J8067k3411O485P1935M6910n394l5515m5835K2858
$$ plain form
22301 25359 -13684 -63323 -53508 -30140 15369 122963 125441 100653 45357 31775 377 18820
22289 18820 -7291 -87093 -115481 -32130 6283 -2700 -9953 -13308 61987 98573 93731 65677
22277 65677 -9755 -31193 9390 -98420 -185223 -151895 -111273 -116243 -90618 -48639 -85882 -74808
22265 -74808 -32836 -18881 -69198 -136014 -177943 -202054 -76951 -33029 19558 23647 -30396 -35978
22253 -35978 -52560 -120927 -78291 5410 60038 11895 -101369 -105816 -47304 67017 123729
22242 123729 47459 -54878 -73536 -69684 12010 -58227 -134019 -146355 -133572 -93792 -88181 -28620
22230 -28620 -56244 -117866 -109235 -89524 -8282 14434 23111 36764 74194 -31034 -45692 -38772
22218 -38772 -39477 -37021 -63484 -67747 -49680 -73091 -66606 5329 52239 46845 11330 -34505 -11647
22205a1647P0806r2595P952k247k6985j3092j1816O1730m0728J2391k4785m203
22193g5219O0244j4205K3009M2944m2818n3158P91L3026m5625m3837R2104J43089
22181A20345M8203m894q1526q7199j01361j849q817j7711P5757Q5540N235o8292
22169c6569M0086L5635p345r2854l8683J6014M4204j1004O3828K7008J0908l4658
22157A6570k4835Q597O128m4246j2302L7996M2510p1466o0429j6831K0420L9275
22145e8613l2166J18080k3590l5729O0075L3853K9687j0114j6799r8358q9058
22134a22732M4392j1251P0848M1836o6704p074L130o6484M6433P9864O119k076
22122A6301P6754J16340l3302j04897m0941k9659q9880n3936M5286j548n1483
$$ plain form
22205 -11647 59159 -33436 -25484 -27731 -54716 -67808 -79624 -17894 -58622 -46231 -71016 -75219
22193 -75219 -14975 -29180 -6171 36773 -6045 -59203 -58412 -25386 -71011 -114848 -22744 120345
22181 120345 168548 163654 82128 -5071 -106432 -108281 -117098 -134809 -59052 26488 31723 -36569
22169 -36569 3517 39152 31807 -61047 -99730 -83716 -39512 -50516 13312 40320 51228 16570
22157 16570 -8265 332 6460 -37786 -50088 -12092 30418 -41048 -101477 -118308 -97888 -58613
22145 -58613 -90779 27301 3711 -32018 28057 61910 91597 81483 64684 -33674 -122732
22134 -122732 -78340 -89591 -18743 23093 -43611 -50685 -47555 -114039 -67606 12258 18377 16301
22122 16301 93055 209395 176093 71196 30255 596 -89284 -143220 -97934 -99482 -150965
22111a50965j2091K8414j63J23m7032p177P5616O1010N0140l6443m7591k502N0138
22098c8523O9973j1073J836m9225o3180M2325q6113L746P0508O8022j7343M2827
22086C3780l8579k1651o750n8525K6293J00067Q3081M8269o9156l6738m5894j1122
22074C075o1166k5971J7559R362M8339J4020m4356Q556L5421l8201k546P6469
22062D0561K4610l7921q2306m1348M0102p895L0119M8960M1240P2969k5475k8572
22050G5044K1840k6102j38815j30504j2323R0805M327N7479j355N8675J5657M4605
22038E9333n7549n4320k9459O5119j5655L3881M7572J043M7670l219k4177p5505
22026e266l5118O7247p3558l9575O6633p237n999L6891K4656O7119J2313q5795
$$ plain form
22111 -150965 -163056 -134642 -134805 -134682 -181714 -188891 -113275 -52265 -2125 -38568 -86159 -88661 -38523
22098 -38523 31450 20377 22213 -27012 -90192 -47867 -133980 -130234 -59726 8296 -9047 33780
22086 33780 -4799 -26450 -33200 -91725 -65432 34635 117716 165985 96829 60091 14197 3075
22074 3075 -58091 -84062 -66503 -57141 -8802 5218 -39138 -30582 4839 -33362 -35908 40561
22062 40561 65171 27250 -55056 -96404 -56302 -64197 -34078 14882 56122 129091 103616 75044
22050 75044 96884 70782 -68033 -198537 -210860 -120055 -115728 -58249 -59604 -929 14728 59333
22038 59333 1784 -52536 -81995 -16876 -32531 1350 48922 49965 97635 94416 70239 -5266
22026 -5266 -40384 26863 -46695 -86270 -19637 -26874 -32873 4018 28674 95793 108106 22311
22014B2311k4657j1245m2030l3261k2183O4253N3178O5909k0382K3100r163p8255
22002a2425o8925l2924J8724L5962L6868j1201r368j4228n905j3840J3290L4307
21990b9665M5473L5129r295n1650j0836m3339N8052M6214k9047L9587p9315m2788
21978g1480O3205J4488j8899R8636m7600p2499k0187l265K7112k426q2284P794
21966a07405M2307l8541j0250j9062l0833N0308J19938j1914n0520m4990j9534
21955a20496N4173O9362M9073j0928K1030j659J3033o9511q3682N0041O1852m8375
21943a6087L4479M6032m4311k023j5000O0948m7658k5346J7264J976r3777l5020
21931a18523N0896j3902R098P0711R1197L6081k6788r766p6106n7483m0053Q8574
$$ plain form
22014 22311 -2346 -13591 -55621 -88882 -111065 -46812 6366 72275 51893 74993 65830 -12425
22002 -12425 -81350 -114274 -95550 -59588 -22720 -33921 -43289 -57517 -63422 -77262 -63972 -29665
21990 -29665 15808 50937 41642 -10008 -20844 -64183 -6131 40083 11036 50623 -28692 -71480
21978 -71480 -8275 6213 -12686 85950 38350 -34149 -54336 -57601 -30489 -32915 -115199 -107405
21966 -107405 -65098 -103639 -113889 -132951 -163784 -113476 6462 -5452 -55972 -100962 -120496
21955 -120496 -66323 3039 52112 41184 62214 60555 73588 4077 -79605 -29564 32288 -16087
21943 -16087 18392 64424 20113 18090 3090 64038 16380 -8966 8298 10274 -83503 -118523
21931 -118523 -67627 -81529 -72431 -1720 89477 125558 98770 89004 12898 -44585 -84638 3936
21919C936O8415K0396J8370l2169Q054K1513r0581q9398P3657J06865J1610q5230
21907C5438o6437o6813j2799k4085M6597J9666K3016K5920j1301O0478k2232l4024
21895b6576K8327j0309l1767J08995m7028j5469N8080M1273o281r4246k7968J9898
21883c071k3051j2834M290L086J0316o9068k7055N3420O3562N2589l4171o1055
21871d3042K3769K0183q656m1704j04910j3956L6408N779P5215M1862L0159J9025
21859D0132N1811l9581o9557q8897j3225K9028R0125L5167l8754m6603q8365o1301
21847b00020O6380O4374j9710j17654J1289N8991N6472J5454M0189O6724O2259
21836A04748n9444o4223o259M9998N8935p6712l9535L6533N1154j3487J7195J3914
$$ plain form
21919 3936 72351 92747 111117 78948 87002 108515 17934 -71464 2193 109058 120668 35438
21907 35438 -30999 -97812 -110611 -134696 -88099 -68433 -45417 -19497 -30798 29680 7448 -26576
21895 -26576 1751 -8558 -40325 68670 21642 6173 64253 105526 99245 4999 -22969 -3071
21883 -3071 -26122 -38956 -34666 -31580 -21264 -90332 -117387 -63967 -405 52184 18013 -43042
21871 -43042 -19273 910 -7746 -49450 -154360 -168316 -131908 -126129 -50914 -9052 21107 40132
21859 40132 91943 52362 -17195 -106092 -119317 -90289 -164 35003 -3751 -50354 -138719 -200020
21847 -200020 -133640 -69266 -88976 -206630 -195341 -136350 -79878 -64424 -24235 42489 104748
21836 104748 45304 -18919 -25178 24820 83755 7043 -32492 4041 55195 41708 58903 72817
21824G2817r730K412N186k4355o6658k5510N0510p101m0951K9854O1449k6800
21812B1123q8343q2067N9497R1603k2667o2138J211J29755P4830p8621n9688m4412
21800e9917n0743R242p98J4256R1638q672M8367M7317l8293p9215K369K3558q7762
21787h8653J7260R6169M4906o6332q2722o7514M5107m314m4909l3151K9872J19514
21775c4767p352m3784Q3446Q9306j8559m7607n1593P931k4639n599j686J9444
21763c5459J1448m3352M0950M445L12k4252K5391O9560L4302J1728q535m0685
21751D5853k0320K5857Q6191p3210o4172p7760j6840j3162J2383N0385P2371l2821
21739e245j412n2711j15560j5496K21732Q4411k4814q2767m2869L1171o972k6266
$$ plain form
21824 72817 63087 65499 70685 46330 -20328 -45838 4672 -2429 -43380 -13526 47923 21123
21812 21123 -67220 -149287 -89790 1813 -20854 -82992 -81781 47974 122804 44183 -15505 -59917
21800 -59917 -110660 -101418 -102216 -87960 3678 -4994 43373 90690 52397 -26818 -24449 -891 -88653
21787 -88653 -71393 24776 69682 3350 -79372 -146886 -101779 -106093 -151002 -184153 -154281 -34767
21775 -34767 -42119 -85903 -2457 86849 68290 20683 -30910 -22979 -47618 -53217 -54903 -35459
21763 -35459 -24011 -67363 -26413 -21968 -21656 -45908 -20517 49043 83345 95073 86538 45853
21751 45853 25533 51390 137581 64371 199 -77561 -94401 -107563 -95180 -44795 27576 -5245
21739 -5245 -6657 -59368 -174928 -190424 31308 115719 90905 8138 -34731 -3560 -10532 -36798
21727c6798J1574r0480L4232O9826o3882m9924k3211J27960K7733o5094l9328
21716i7392m0303J1369J9834K0682R5181N0324k2343n6462N4731M4427L94l5277
21704D5165j38611L572r222J25665J17599m6072j58438k7218K5376O3162j010
21693c2m1330L3480L989j9111L7742L2211q5915k788O3688l3887K6400j074L79
21680A3752o4940k7607Q5336K5850k8100p1662K6148J23893o143l8612J7326J948
21668E7189j9922l4655M2607k6955j4289l1927K9252J1343p2747l2690N4569R850
21656b8375M5089k4232K8565P458r5333j3315o155N3592R9722l9734o0268R743
21644b3243O4184P831k4018m5158o604N0504J4089q6533P937J7349l0010N7716
$$ plain form
21727 -36798 -25224 -115704 -81472 -11646 -75528 -125452 -148663 -20703 7030 -58064 -97392
21716 -97392 -137695 -126326 -106492 -85810 9371 59695 37352 -19110 35621 80048 80442 45165
21704 45165 -93446 -89874 -99096 26569 144168 98096 -60342 -87560 -62184 978 -32
21693 -32 -41362 -7882 -3893 -23004 14738 46949 -38966 -41754 21934 -11953 14447 13373 13752
21680 13752 -51188 -78795 6541 32391 4291 -67371 -41223 82670 76527 37915 55241 57189
21668 57189 37267 2612 45219 18264 3975 -27952 1300 12643 -60104 -92794 -38225 -28375
21656 -28375 16714 -7518 21047 28505 -66828 -80143 -86298 -32706 67016 27282 -32986 -23243
21644 -23243 40941 48772 24754 -20404 -27008 23496 37585 -48948 -41011 -23662 -53672 4044
21632D044J7881j3392l3650K9287n6399n0976O4437J3579M3163J0733k4129o4853
21620f0275q912j4064l0094j325P764p3089j0003m1318K2938N8663N2570J3465
21608h3680l6963M5383J13419N1473L6300p9834o5566P5298N997m2431J9343K4415
21596F3154n3978M0074K9789j2288R317o3649m6576k1352q380M9737O2935K0102
21584F8885p7171j49546K9716O0650J8892M4041L7650P7351n7579L4882L2862
21573A20633n8714j33309O98J29846J3292n279p1652n9520J9889P763o3468R0552
21561i269j9439j5799n4553J6517M9062Q1648K4924p0887l0848M7576m934J7839
21549C1837L4736L5613J2883q6785m9294M4858K0932n4161o3278M5748K6120j7987
$$ plain form
21632 4044 21925 8533 -25117 4170 -52229 -103205 -38768 -25189 17974 28707 4578 -60275
21620 -60275 -69187 -83251 -113345 -114670 -106906 -179995 -189998 -231316 -208378 -149715 -97145 -83680
21608 -83680 -120643 -75260 38159 89632 125932 46098 -19468 55830 61827 19396 38739 63154
21596 63154 9176 49250 79039 66751 76068 12419 -34157 -55509 -63889 -14152 48783 68885
21584 68885 -8286 -157832 -128116 -67466 -48574 -4533 33117 110468 52889 87771 120633
21573 120633 61919 -71390 -70692 59154 72446 67167 -4485 -64005 -44116 -36353 -99821 -9269
21561 -9269 -28708 -44507 -99060 -82543 -33481 48167 73091 2204 -28644 18932 13998 31837
21549 31837 66573 102186 115069 28284 -21010 23848 44780 -9381 -72659 -26911 -791 -18778
21537a8778m695K2009l1907l7562o6727j0964M9952N0946j9450P886K2986m0987
21525g7291O2713k2454L0380k249J6003M1661k4985j7223J7929L9712l5388k2743
21513F065o905J703j5489K1944m8961p2847l0657J577M5481j8385J269J11052
21501d153L2779Q2712M3424q3034j00801m1035J32122q739N2796p9511m0373K8629
21489A4816Q1350L6642M1778L0854J1499n7701l0394K0646K0296o6331j35418
21478c1963m5087J7654l9901p917K648P062j6539k6139k3355M6054k150k0641
21466a40274Q4399N4202N2959L4377L2492n9611K3184L9541l9815j5140j1518
21455E4796r912k3712q4066L635Q2304J46532M3445q7754J820o8822q1839j6059
$$ plain form
21537 -18778 -23473 -1464 -33371 -70933 -137660 -148624 -98672 -47726 -67176 -59290 -36304 -77291
21525 -77291 -14578 -37032 -6652 -8901 7102 48763 23778 6555 24484 64196 28808 6065
21513 6065 -840 863 -14626 7318 -41643 -114490 -145147 -143570 -98089 -116474 -115205 -4153
21501 -4153 28626 111338 154762 71728 -29073 -70108 62014 53275 106071 26560 -13813 14816
21489 14816 96166 132808 174586 205440 216939 159238 128844 149490 169786 103455 -31963
21478 -31963 -77050 -59396 -99297 -107214 -104566 -97504 -114043 -140182 -163537 -117483 -119633 -140274
21466 -140274 -55875 -1673 51286 85663 118155 58544 81728 121269 81454 66314 54796
21455 54796 44884 21172 -62894 -59259 23045 169577 213022 125268 127088 58266 -23573 -39632
21443c9632N2996M5488N8888M4930j7892r285l4820R0583r026l7971p4905N085
21431G4439M1486Q759K0470M5188k5791r3364l6917k0052J482m3996K6380j6851
21419a8767p8696M1025L0732o2157o469L5638L7725L1187O8991q3475p202J05702
21407I4234L2029o1969k7677J1919m0380o0700N6575J8808l1164j3218K1017o228
21395f754L5145M3749L351o9921q5433L5474K1329N7230J6058J479N5348k4120
21383H2935k3016r3537N3959M8741j25852k448J04473Q0218P0588L2361L6167
21372B64589K8156J33254M0554M1541J2396N2056L0061J835l934m2266o1034p7677
21360D19531K1645J24258J4349Q8223R3600R30J2293r5444m5234m9455j7297k1619
$$ plain form
21443 -39632 13364 58852 117740 162670 144778 135493 100673 191256 182230 144259 69354 74439
21431 74439 115925 124684 145154 190342 164551 71187 34270 14218 15700 -28296 -1916 -18767
21419 -18767 -97463 -56438 -25706 -87863 -94332 -58694 -20969 10218 79209 -4266 -11468 94234
21407 94234 126263 64294 36617 48536 8156 -52544 4031 22839 -8325 -21543 -526 -6754
21395 -6754 28391 72140 75491 5570 -79863 -44389 -23060 34170 50228 51707 107055 82935
21383 82935 59919 -33618 20341 69082 -56770 -59218 45255 125473 196061 228422 264589
21372 264589 292745 425999 466553 508094 520490 572546 602607 604442 600508 558242 497208 419531
21360 419531 441176 565434 579783 668006 761606 762536 774829 679385 634151 584696 567399 545780
21348E45780q7078k18356j07847n095L8311N9610K841p8728M681R6524j3890m5174
21336A91579p4294j0829l6249J6073r006k1259O0577M0776j8371m6740N7483M3416
21324A93156o5622n1663n5297L7284P7000n834j6065R0013N7854k7041q6481L2399
21312A79703l5669o4825P906K4132q573k3566O2174K2255j9611j15408l2539J0090
21300F069J07288M0617j11465j63687L0905K6428O8380N0037O5966l3036l9695
21289D7807o1442K4787K0434L7050L1744M8615j1257O086k1136m0283j7702J6126
21277H0829l465r1218P921K1773m5910L91L205P3507L5361k3960L2721Q322q3431
21264A6046m5340J38605N9375K5788n7679n4245q0480l5712N1069k2280j1225
$$ plain form
21348 545780 458702 240346 132499 127404 165715 225325 228166 149438 154119 250643 236753 191579
21336 191579 117285 106456 70207 86280 77274 56015 116592 157368 138997 92257 149740 193156
21324 193156 127534 75871 20574 57858 134858 129024 112959 202972 260826 233785 147304 179703
21312 179703 144034 79209 87115 111247 102674 79108 141282 163537 143926 28518 -4021 6069
21300 6069 113357 153974 42509 -121178 -90273 -63845 4535 54572 120538 87502 47807
21289 47807 -13635 11152 31586 68636 100380 148995 137738 143824 122688 82405 64703 80829
21277 80829 77364 -13854 -5933 15840 -30070 -29679 -26474 47033 82394 58434 91155 99477 16046
21264 16046 -29294 109311 168686 194474 136795 82550 2070 -33642 17427 -4853 -16078
21253a6078J3315l596L0411K0428k5386o5199j5973N6341m92k4165m3375N074
21241f8695M1111l7591n6572J8127K9042L9534L852j8362Q6283l4872J2981N6595
21229G1433J04504J089q8035p2975j8063M2017o416j20910N15L7297O2666l3722
21217b0600n2043J2789N06M6664P4452P64m926m7091k2973l3724n4021q9798J7159
21204a72842M6667R4212J3869P432L2309l6114J1774k35M3487K0834q2599n580
21192b6786k468p5577K1622P1554P7948J29120l4752r4513l9483K8991n7207j7714
21180a9265r126L5163N1289J6271p4389J6150n6985j7382l9863m6215K1331J34487
21168A1466O4556j6052l0832J8591J3493n435Q7514j05178l2167R1505L1817m1479
$$ plain form
21253 -16078 -2763 -6359 24052 44480 19094 -46105 -62078 -5737 -6229 -30394 -73769 -68695
21241 -68695 -27584 -65175 -121747 -103620 -74578 -35044 -31192 -49554 36729 1857 14838 71433
21229 71433 175937 177026 88991 16016 -2047 39970 33554 -87356 -86841 -49544 13122 -20600
21217 -20600 -72643 -59854 -59348 -12684 61768 62532 57606 10515 -12458 -46182 -100203 -190001 -172842
21204 -172842 -126175 -31963 -18094 -10662 21647 -14467 -2693 -2928 40559 61393 -21206 -26786
21192 -26786 -29254 -104831 -83209 -11655 66293 195413 160661 66148 26665 55656 -1551 -19265
21180 -19265 -28391 6772 58061 74332 -57 16093 -40892 -58274 -98137 -144352 -123021 11466
21168 11466 76022 59970 29138 47729 61222 55787 143301 38123 5956 97461 129278 87799
21156H7799m3387j11179m1960O4822M2575L3522n843O3126q825j50919m4742J30799
21144A5788Q9001O8991j13751j12231m1832L9556J15756N84j0512L1360R3685
21133A76395K6345r762o2824l8170m0930l3707J5328M5436o7219j12269l254J17623
21121A2992m722M228o5008L6549l761L2830k627m6384o993O5159j6895m7312L3710
21108h234p878k2585R088j845N2080L2885q286j6474o6040o8515L5624J756n248
21095g3672L405R5901K4114j13311p1051L8308N1773R4107R2888o9271j5238J3605
21083G1558k6468n6378M3432j8561l3847M1874L8896r9063p065Q2411K3575L4610
21071I4974M4741j5607q1001n6955l9704m7537k3348L9907L0599k6451k5632O0943
$$ plain form
21156 87799 44412 -66767 -108727 -43905 -1330 32192 26349 89475 80650 -70269 -115011 15788
21144 15788 104789 173780 60029 -52202 -94034 -54478 61278 61862 51350 82710 176395
21133 176395 202740 192978 130154 91984 51054 17347 32675 78111 10892 -101377 -104631 12992
21121 12992 8270 12498 -52510 -15961 -19722 13108 10481 -35903 -42896 22263 5368 -41944 -8234
21108 -8234 -16112 -38697 -29609 -31454 20626 53511 45225 28751 -37289 -105804 -70180 -68424 -73672
21095 -73672 -70267 25634 49748 -63563 -134614 -96306 -44533 49574 142462 73191 57953 71558
21083 71558 45090 -11288 32144 13583 -20264 21610 60506 -38557 -45622 36789 60364 94974
21071 94974 139715 124108 43107 -13848 -53552 -101089 -124437 -84530 -53931 -80382 -106014 -45071
21059d5071P7033O6911L860m4529K3742K3496k235L8258p0226k6556l3238k1100
21047i655j7531K0489j221J7201j7457R06L8882N9313o1249l3747P7785Q4879
21035A58595Q0910O900n1569o3016N176n0785P0608Q5808k0766l2809J5966O0660
21023B65678j0764k1984q2582o9381k6778M0621m172j7820k1108Q1968J2335M3626
21011A89639p1372j01898k2363K1470K9620j3647J6104N4674L6240n0952O5098
21000A52613M7362l9822n9226P9117L0040l1375l5270L8419o4622q6467n6835
20989b6066K0326j1422K5654r379L3950K5955m1963k5313j0684M9691j8299L8799
20977E1249J05600j2143k321n3704j4748M5886J1513r0656M63P3990M6101l5801
$$ plain form
21059 -45071 31962 98873 102733 58204 81946 105442 103207 141465 71239 44683 11445 -9655
21047 -9655 -27186 -6697 -7918 9283 -8174 -7268 31614 90927 29678 -4069 73716 158595
21035 158595 239505 246405 194836 131820 136996 86211 156819 242627 221861 189052 205018 265678
21023 265678 254914 232930 150348 80967 54189 94810 90638 72818 51710 133678 146013 189639
21011 189639 118267 16369 -5994 15476 45096 31449 47553 102227 138467 87515 152613
21000 152613 199975 160153 100927 180044 210084 178709 143439 181858 117236 30769 -26066
20989 -26066 -5740 -17162 8492 -887 33063 59018 17055 -8258 -18942 30749 12450 51249
20977 51249 156849 144706 142385 88681 73933 119819 131332 40676 41139 115129 161230 125429
20965A25429O0834k6082k3793J0659k2874n6311P2218K353p5763j09908L8067
20954e171N066O627L8242J3740o384k1254P729Q6625M9819J5221j15571l3718
20942D0971L6138n9247K1974Q1887K5578N8087k0669J3347N189K8504j6075j8671
20930A97013r7380o4944K3007L1780l4878P6096J02217l3138l1689l717J3404
20919A77771q8156l0968J3825J099J7938L3493k7045k2095J34273L3576m1638
20908B02073K0695m7593k9528P4613Q2337n2187K8858N3582O5871n8310N6368
20897C96779k3124m3065n331l5583Q45J0517k2394N5628P3518j289N657m9563
20885C62595l3358P1086k5670K5823M6255j1494j2322P5023K6794K6582L4397
$$ plain form
20965 125429 186263 160181 136388 147047 124173 67862 140080 142433 66670 -43238 -5171
20954 -5171 -105 6522 44764 58504 52120 30866 38595 125220 175039 190260 74689 40971
20942 40971 77109 17862 39836 121723 147301 205388 184719 198066 203255 231759 215684 197013
20930 197013 99633 34689 57696 89476 54598 130694 232911 199773 168084 164367 177771
20919 177771 89615 58647 72472 73571 91509 125002 97957 75862 210135 243711 202073
20908 202073 222768 175175 145647 220260 302597 250410 279268 332850 398721 340411 396779
20897 396779 373655 330590 325259 289676 290521 301038 278644 334272 407790 406501 412158 362595
20885 362595 329237 400323 374653 400476 446731 435237 422915 497938 524732 551314 585711
20874E85711L1197M8062n8127n8694L2611n6977p230J9498N780L6716p8770J0256
20862E10033J3398k7860q365l6370J4979l772O905N7831P2450N7560j253O1336
20850G16872R2291m8539J2144j07541O3411J3858L6539N3042L8628l5364K6487
20839H61828M3073j4273P832M1815j7274m5489o4679K3408M4810J08234O6295
20828A055580M2034L8222O8069J01056R8764J02160J68713J66803K27368J45489
20818B214258l598M2895J21384J05734K14872J36822J55648J89736J84852K69195
20808C631798K90750L18664M12893L67066L77492L38473M32931O38592O13019
20799G421678O30037O57956Q12485J218097J576490J972206K543494L488820N161739
$$ plain form
20874 585711 616908 664970 606843 548149 580760 523783 516553 536051 541831 578547 499777 510033
20862 510033 523431 495571 487206 450836 465815 462043 468948 526779 599229 656789 655536 716872
20850 716872 809163 760624 772768 665227 728638 742496 779035 832077 870705 835341 861828
20839 861828 904901 890628 898460 940275 923001 877512 812833 836241 881051 989285 1055580
20828 1055580 1097614 1135836 1203905 1304961 1403725 1505885 1674598 1841401 2068769 2214258
20818 2214258 2210660 2253555 2374939 2480673 2695545 2832367 2988015 3177751 3362603 3631798
20808 3631798 3922548 4241212 4654105 5021171 5398663 5737136 6170067 6808659 7421678
20799 7421678 8051715 8709671 9522156 10740253 12316743 14288949 16832443 20321263 25483002
20790B5483002P807347J1488175J4678425J5352522J4360509J2824776P389888
20783A09384644m72309j662262J776620L917194L483572k604394j0816565r634098
20775I3372402q71437O608979R260026R684700Q672874K347728n411767n002934
20767A18660571j315423M92738j156648r372624j8716123j8599122j3094815q742820
20759D8155734o109877m435492l321666k572652k133156j993946j848218j568802
20751B4171925j289730j242123r93008q80272q51170q77819p54567o28122o26833
20742A6028281o76165o27174m73969m76143m95098n06822l55049l28770m17251
20733A1671840l89927m02052k67735k58520m50237l94875l21879l62736l43066
$$ plain form
20790 25483002 33290349 44778524 59456949 74809471 89169980 101994756 109384644
20783 109384644 108912335 107250073 109026693 112943887 116427459 113823065 103006500 93372402
20775 93372402 92500965 99109944 108369970 118054670 126727544 129075272 123663505 118660571
20767 118660571 117345148 117837886 116681238 107308614 88592491 69993369 56898554 48155734
20759 48155734 42045857 37610365 34288699 31716047 29582891 27588945 25740727 24171925
20751 24171925 22882195 21640072 20647064 19766792 18915622 18037803 17283236 16655114 16028281
20742 16028281 15352116 14724942 14250973 13774830 13279732 12772910 12417861 12089091 11671840
20733 11671840 11281913 10879861 10612126 10353606 9903369 9508494 9186615 8823879 8480813
20724H480813m03653l52981l18874k54907k38067k59249k11103k75437j76112
20715E990430j54731k12730j61345q5557j29125j28211j74623k06350k59278j54136
20705D324344j12000r698j72546k00980o2456r0002r8660q0652n2006j21203o7171
20694C256970n6034j31409j08115q6256p9679p345J4977q4050j92923j11935l5047
20683B379154j42424J057j2108n0329j31723k8872P7939J8091k5918k0841k9958
20672B034068j32294n1579j19840r1674k6898k5279j12974l4614q937k1336J4130
20661A422773k5141O0928p7293r1438N6485L6864j5996L9426r2208r9242j00261
20650A114897o5260j8150J0126k2784p771k7202l9496j28413p6829J6904L0792
$$ plain form
20724 8480813 8077160 7724179 7405305 7150398 6912331 6653082 6441979 6166542 5990430
20715 5990430 5835699 5622969 5461624 5376067 5246942 5118731 4944108 4737758 4478480 4324344
20705 4324344 4212344 4202646 4030100 3829120 3766664 3676662 3578002 3497350 3445344 3324141 3256970
20694 3256970 3200936 3069527 2961412 2875156 2795477 2788132 2803109 2719059 2526136 2414201 2379154
20683 2379154 2236730 2237787 2225679 2175350 2043627 2014755 2092694 2110785 2084867 2064026 2034068
20672 2034068 1901774 1850195 1730355 1638681 1611783 1586504 1473530 1438916 1429979 1408643 1422773
20661 1422773 1397632 1458560 1381267 1289829 1346314 1383178 1367182 1406608 1314400 1215158 1114897
20650 1114897 1049637 1031487 1041613 1018829 1011058 983856 944360 815947 739118 756022 786814
20639G86814J5923J4314m8929j16083o0674q2061o3361j4549K2691k0839k5529
20628D07717p5129P6131N8392l9427o6638K0969Q5848o9109r6499n1064k5378
20617B25813O7935N5189L5011K092m5435l3415p9442l0860K8627R8236J9556N262
20605C48569l1861p448L9582K0486q3168N8269O0205m0017K0540n1646m9979l2981
20593B50551n5022l078l474O1433N9758l2225j05151Q539K1289l0208l320k6642
20581A42450L7959N2897o2297P0660N0053o5378o7651q8471o4561O6408J02879
20570A74948N4040J0959l6030L4331K1135O7413J0375K161r8248K1250O575L3255
20558C02164k0738n7227p1054M602n299J3836J3738k4081k6236l2331O2271L9612
$$ plain form
20639 786814 802737 817051 768122 652039 591365 509304 445943 431394 454085 433246 407717
20628 407717 332588 408719 467111 427684 361046 382015 467863 398754 302255 251191 225813
20617 225813 293748 348937 383948 386040 340605 307190 227748 196888 225515 323751 343307 348569
20605 348569 316708 309260 348842 369328 286160 344429 404634 364617 385157 333511 283532 250551
20593 250551 195529 192451 188977 250410 310168 277943 172792 181331 202620 172412 169092 142450
20581 142450 180409 233306 171009 241669 291722 226344 158693 70222 5661 72069 174948
20570 174948 228988 239947 203917 238248 259383 326796 337171 339332 241084 262334 268909 302164
20558 302164 281426 224199 153145 157747 152448 166284 180022 155941 129705 97374 159645 199257
20546A99257q6471K1770l3551j6253O5106j5044n8199L1392l0150l8552O2299
20535A01604R6877o929l6609l1875K5408N0495j4169j0714p1922k6137j1015k2601
20523D2413R3525K6489j2569O0222J8454k3290O214o8024k3539J18O1109K2018
20511B03140q446m2155o6672j4994m0391O6365p640k3318N132J7818l2133O7673
20499A24379M6449L2514o6857j0445o6911m3728k7288M2627q706k4334k3963N717
20487b0546l6502k5022l7301J5758M1383q37M2482L3590N0842J9400l5011L2161
20475H0397M7999L0069K8409j56162j27079N584P7563N7175k0557R1126j7048
20464I7476j33826k5152J477O5979K9094j4348n1316k4482M7443Q969L8053l6902
$$ plain form
20546 199257 112786 134556 101005 84752 149858 134814 76615 108007 77857 39305 101604
20535 101604 198481 191552 154943 123068 148476 198971 184802 174088 102166 76029 65014 42413
20523 42413 135938 162427 149858 210080 228534 205244 211458 143434 119895 120013 181122 203140
20511 203140 194694 152539 85867 70873 30482 96847 89207 65889 71021 88839 56706 124379
20499 124379 170828 203342 136485 126040 59129 15401 -11887 30740 22034 -2300 -26263 -20546
20487 -20546 -57048 -82070 -119371 -103613 -62230 -63067 -20585 13005 63847 83247 48236 80397
20475 80397 128396 158465 186874 30712 -96367 -90783 -13220 43955 23398 114524 97476
20464 97476 -36350 -61502 -60025 5954 35048 20700 -30616 -55098 -7655 1314 39367 2465
20452B465j11347L1761J09378l5457q9588p3359K0369K058L9261P3555o992n977
20440d3873k9340K6639J4398j9975j01688m4578J58311N0430k8012P0176n0140
20429B348j32430q1772O7946L2158M7772R2571N005p0159k3553M7436M3620j05174
20417g4232l5953J6421O3088P6379k3970k6259R2848R7237K7086n7168l2456P443
20405A30464l7191l173M1137P136m1699L6346N1426q1026l098Q0952m5985m1030
20393I4259k2570L8270j2862m4548m681r3093m9785k3129N8117O8806Q736p4285
20381e6765K3388P6116j1910J9741l161l4463L6121n3773n3552K3901P7206L8123
20369H0972o8960l2148k9807Q1830L0710m7773m7817J2457J02015p8247k5729
$$ plain form
20452 2465 -108882 -77121 32257 -3200 -92788 -166147 -145778 -143720 -104459 -30904 -37896 -43873
20440 -43873 -73213 -46574 -32176 -52151 -153839 -198417 -40106 10324 -17688 52488 2348
20429 2348 -130082 -211854 -143908 -111750 -63978 28593 33598 -36561 -60114 -12678 30942 -74232
20417 -74232 -110185 -93764 -30676 45703 21733 -4526 88322 185559 212645 155477 123021 130464
20405 130464 93273 90100 131237 138373 96674 133020 184446 103420 100322 181274 135289 94259
20393 94259 71689 109959 97097 52549 47868 -45225 -95010 -118139 -60022 8784 17520 -56765
20381 -56765 -33377 42739 30829 50570 47409 12946 49067 -4706 -58258 -34357 42849 80972
20369 80972 12012 -20136 -49943 31887 62597 14824 -32993 -20536 81479 3232 -22497
20358b2497n609K7769o318L202N6374N5512M7011p0028m3661Q024Q0514j4092
20346A16201j722m1794m9849P007R798N4989j6617p8859o2799M1543R1950l4060
20334C5788q2643p6886R5590J10515o449N3004J2165k5032m1774P3701m0865q461
20322I8653l377o6235K587q2309j7780J4439l6009R8941J23418m485l1518k9661
20310F6664k0865N0599o9186q3671p4552N9599J81086p108j02663L9856j2676
20299B7083m9362l4328N6002O7520m0157j16232m5722L4711Q5378N2318O3543
20288A00754R1479L7249m1022p1819k5297O1165j6119J6254L7410k4696r5437
20277F9921k7514P4184k611j09949N2537j6525l2757Q1694J9167k1914n5876k7398
$$ plain form
20358 -22497 -28106 -337 -6655 -3453 52921 108433 155444 85416 41755 49779 130293 116201
20346 116201 114479 72685 22836 29843 39641 94630 78013 -846 -63645 -22102 69848 35788
20334 35788 -46855 -123741 -28151 82364 75915 128919 141084 116052 74278 147979 107114 98653
20322 98653 95276 29041 31628 -50681 -68461 -54022 -90031 8910 132328 127843 96325 66664
20310 66664 45799 96398 27212 -56459 -131011 -71412 109674 102566 -97 39759 27083
20299 27083 -22279 -56607 -605 66915 26758 -89474 -135196 -100485 -15107 37211 100754
20288 100754 192233 229482 188460 116641 91344 152509 136390 152644 190054 165358 69921
20277 69921 42407 116591 113980 4031 56568 40043 7286 88980 108147 86233 30357 2959
20265B959K6983M5646j5907M2633O0089O7488p9419j17292k5025L0360O8510J0708
20253A17733m256J29411M3049n4618p8474M5624m4815j04128k7279P394l8702
20242i061r739L9578L0579M1150l8820k4941q5057o2865P2870O2499Q2519j4815
20230H3897l278M7668K9320k4917j41783k2675N2134N5518K3683N259k4351N115
20218H5590P486p3056M1693J5975L6076M1321l566m2187o2041n9694J0382Q1368
20206G9347J11014Q0534p2925m335L5245O4538k2830l9845O272M7260M7176N3369
20194C84820L02J10361J31434J03778l7206p9687n3060R1223Q3614n9303j24145
20183E52131J3589O9072O822j482O475L3463J40059K2276q6025q4903k9558k0888
$$ plain form
20265 2959 29942 75588 59681 102314 162403 229891 150472 33180 8155 38515 107025 117733
20253 117733 113477 242888 285937 231319 152845 198469 153654 49526 22247 29641 -9061
20242 -9061 -18800 20778 51357 92507 53687 28746 -56311 -119176 -46306 16193 98712 83897
20230 83897 80619 128287 157607 132690 -9093 -31768 20366 75884 99567 104826 80475 85590
20218 85590 93076 20020 61713 77688 113764 155085 151519 109332 47291 -12403 -2021 79347
20206 79347 190361 270895 197970 193635 228880 293418 270588 230743 237015 284275 331451 384820
20194 384820 385122 495483 626917 730695 693489 613802 560742 651965 735579 676276 552131
20183 552131 565720 634792 641614 640132 646607 680070 820129 842405 756380 671477 641919 621031
20171F21031K0437p7836j51279j69040m4369j0167L3394l332J4830l595l1404
20160A98670q3950j322J7780k9516l1858J22159q196p2013P420K8600M5963N2369
20148B46106j1700o7050k9699l0964J7068j4055o1297K7131N222K6546K3943m2033
20136H9218L8689J3035m3791k6536j04743L7099k5607O1674m83J0482j8884L5399
20124F5552O1316O6464j1513m9577K1853j7745q1359N3585M244R7175K0649L1469
20112B62113K4021p9891k8239l8993l2842M1134L7647q3087j6960O1605n3842
20101I2666n6958l9995q375O3062L2856R0062M2119j15351n3723j1619r985L6361
20089F1120j332k8551m3070L5714J03889N2172m2883q024l7971l7401K8389j3396
$$ plain form
20171 621031 641468 563632 412353 243313 198944 188777 222171 218839 233669 230074 198670
20160 198670 114720 113398 131178 101662 69804 191963 183767 111754 119174 147774 193737 246106
20148 246106 234406 167356 137657 106693 123761 109706 48409 75540 80762 107308 131251 89218
20136 89218 127907 140942 97151 70615 -34128 2971 -22636 39038 38555 49037 30153 65552
20124 65552 126868 193332 181819 132242 154095 136350 54991 108576 112820 209995 230644 262113
20112 262113 286134 206243 178004 139011 106169 147303 184950 101863 84903 146508 92666
20101 92666 35708 -4287 -12662 50400 83256 173318 215437 100086 46363 34744 24759 61120
20089 61120 59788 31237 -11833 23881 127770 179942 137059 129035 91064 53663 82052 68656
20077F8656j1900n2459j5877J5276N8813R5846K5482l3197l0866o0014P1398N9572
20065A90730l2362j01514l1753l459J20992M6704J5991r8318l4390M242k076n3865
20053B0922M0908K6093L2436L5254M9477k9266q0444J3319R063K7666P1230p9536
20041A37122p9134M5241K6131k4079P377n1303l4295K5268q19l4436J00429J08349
20029B25851L4790n1355j52034l7478M9174N9539M1367l731o9158n3090L3886
20018G7761n1963K8931l87P7883K0728k556n6319m6590P7094P4887J3495r6716
20006A16248p2908k0128J7354L3980j3915o485R202P5943M7539k1635J5137L262
19994A83594l7951r3479l2592j0547L0751L5113L0333K2726M0521Q0956Q5324
$$ plain form
20077 68656 56756 4297 -11580 3696 62509 158355 183837 150640 119774 59760 131158 190730
20065 190730 158368 56854 25101 21642 142634 189338 205329 107011 72621 76863 74787 20922
20053 20922 61830 87923 120359 155613 205090 175824 95380 108699 117762 145428 216658 137122
20041 137122 57988 103229 129360 105281 112658 61355 27060 52328 51509 17073 117502 225851
20029 225851 260641 209286 57252 19774 68948 128487 169854 166123 96965 43875 77761
20018 77761 25798 54729 54342 132225 152953 150397 94078 47488 124582 199469 212964 116248
20006 116248 43340 23212 40566 74546 60631 54146 63348 139291 186830 165195 180332 183594
19994 183594 145643 52164 19572 9025 39776 74889 105222 127948 168469 249425 334749
19983C34749j3708J2913q8226n8555m5022K684M6644o1636n6172j9529j2454l634
19971C8054L3620m2034l934k4436J5965Q1405M6418p5262n0195L3338J40463L0741
19959B24143j5773j5315k0230k4050N0042M8916k0825j19786n5975J5742P798
19948G4687o8315l3374M9959q478L691J7955O901K3724q1278L2426m9055m0799
19936g1956J9969J33830J28182k4808l1525O395J4515P2713k5500o7966L6236
19925A90085J6358l283j7363m1836m5576q322m5598k6595k6248q123P2553R1503
19913A47555Q500m7136n3912J5126l9425l1308O167Q7403L3963J5360n0031r120
19901H3142L5287Q843l2070J14675M8166L7580m4801L4625P0129L0612K5313M9763
$$ plain form
19983 334749 321041 333954 245728 187173 142151 144835 191479 129843 73671 54142 41688 38054
19971 38054 71674 29640 25706 1270 17235 98640 145058 69796 19601 52939 193402 224143
19959 224143 208370 193055 172825 148775 198817 247733 226908 107122 51147 66889 74687
19948 74687 6372 -27002 22957 14479 18170 36125 43026 66750 -14528 17898 -31157 -71956
19936 -71956 -51987 81843 210025 185217 153692 160087 174602 247315 221815 153849 190085
19925 190085 206443 203160 185797 143961 98385 90063 44465 17870 -8378 -16501 56052 147555
19913 147555 156055 108919 55007 70133 30708 -600 5567 92970 126933 142293 92262 83142
19901 83142 118429 127272 95202 209877 258043 295623 250822 285447 355576 386188 411501 461264
19889D61264O9724J0251r5865o7198k4404K1153o5762n8926J19375J11074K3601
19878E04287J20121Q5266q3766j59135j41703k3100M642m0184J26531O8022M9263
19867E10244R4218M4613J19893m854j88955j46879m2310P1819N6067Q9796J13354
19856G17006j3703K2487K5721K7070N3889J87751O8241l4948j2066M2047M5350
19845A128845K8653Q6457j6517j05413r8622q5050k667J63796J04635o9229j86921
19834I47967j58254j15825J8101n0108q4453K2805Q2936J34817M9441n6058o2916
19823G28453j01418o3206J926J23742k6379l7894l9578n2359N844M1522o7352
19812E13301k8629o5218l2211m2394L002O3796k968q951K4986j344L9961Q8235
$$ plain form
19889 461264 530988 541239 445374 378176 353772 374925 309163 250237 369612 480686 504287
19878 504287 624408 709674 625908 466773 325070 301970 306612 266428 392959 460981 510244
19867 510244 604462 649075 768968 764114 575159 428280 385970 457789 513856 603652 717006
19856 717006 703303 725790 751511 778581 832470 1020221 1088462 1053514 1041448 1083495 1128845
19845 1128845 1157498 1243955 1227438 1122025 1023403 938353 935686 1099482 1204117 1134888 947967
19834 947967 789713 673888 691989 641881 557428 580233 663169 797986 847427 791369 728453
19823 728453 627035 563829 565755 689497 663118 625224 585646 533287 539131 580653 513301
19812 513301 484672 419454 387243 344849 347851 411647 408679 399728 424714 423370 463331 551566
19800E51566J36705R4399k5876j04662j30563m9112L2781n686M7629p0538m1038
19789D35605N508P160J1258K0776P7478J5897j4141n5931r1991j02614P7M8973
19777C58055m3468m8974k4933l7600n9205L390m5772K5946J61203k3920p1774
19766A92948K3085L5413P440K1464o279K0388L849j955k0761p9599P869m4317
19754A59545r0572J8996M1285Q1682J39657j157j11126o4343N1875P046N779K6725
19742B65392j49134j71668K1932J55492O2221L6810j5726j8775j2575m8756j740
19731A23473J06403J17973J131k5978L4005m9262m7048k0697M9996J0934j6866
19720B84064l8027J1544j4642j261J2869l2829M7993J05370J57495P6359L1014
$$ plain form
19800 551566 688271 782670 756794 652132 521569 472457 505238 499552 547181 476643 435605
19789 435605 441113 448273 459531 480307 557785 573682 559541 503610 411619 309005 309082 358055
19777 358055 314587 265613 240680 203080 143875 147265 101493 127439 288642 264722 192948
19766 192948 216033 251446 258886 280350 274071 294459 298308 296353 275592 195993 203862 159545
19754 159545 68973 87969 129254 210936 350593 349436 238310 173967 225842 232888 238667 265392
19742 265392 116258 -55410 -33478 122014 184235 221045 205319 186544 173969 125213 123473
19731 123473 229876 347849 348980 323002 357007 307745 260697 240000 289996 300930 284064
19720 284064 246037 257581 242939 241678 254547 221718 269711 375081 532576 608935 639949
19709F39949K3759P8263k5134j8075Q0752J93627J82628J35940J47075J35871
19699A574655K00270P3016j38451j23959J43804K23546J82096K88535J13707l8378
19689B498841k0377j12437k14513j72133j35801j20889j34923o7595n6004m831
19679A459338n6371o2741j65697j13384k756j198r3790j05093m6374K6210R7774
19668I35918m7532j9104J41478J42788N3065P1187J9719k527n5149M1937J52388
19657A434168L6850k3987M8967J58620J99129J61545K32529K58353J52107K5174
19647B683455n0371k37927j60047j04952q758Q8410J73449J11257P4867n1518
19637B517865j26701l44327k73699k35783j85561j31629j62545j38353o2247n7386
$$ plain form
19709 639949 663708 741971 716837 698762 779514 973141 1155769 1291709 1438784 1574655
19699 1574655 1774925 1847941 1709490 1585531 1729335 1952881 2134977 2423512 2537219 2498841
19689 2498841 2478464 2366027 2151514 1979381 1843580 1722691 1587768 1520173 1464169 1459338
19679 1459338 1402967 1340226 1174529 1061145 1058389 1057191 963401 858308 811934 838144 935918
19668 935918 888386 869282 1010760 1153548 1206613 1277800 1297519 1294992 1239843 1281780 1434168
19657 1434168 1471018 1447031 1495998 1654618 1853747 2015292 2247821 2506174 2658281 2683455
19647 2683455 2633084 2395157 2235110 2130158 2121400 2209810 2383259 2494516 2569383 2517865
19637 2517865 2391164 2046837 1773138 1537355 1351794 1220165 1057620 919267 857020 799634
19627G99634L8607Q9992k1402l8053P216o8122k9368n219m0387j04728m329K3481
19615F47322P9661l4255j14987p1748J19026n7706l9304P3294J05168J21n538
19604G01054k4638N7508J1042j4936N7112J15184n601p0438j2025J0173j6433
19593H08002N987P618k4789j14346j87243m8799r4731J13169Q4761J5676j10363
19582D54942k6443P8146K7705J06138P1390m5854p6182r2703m3536J5097J3489
19571D82189q956j7580L7805N7490P327K0865q3266m4898m1009J055J10607k9914
19559D91715k1077n793n0347n6598N3596J7683L5784J46721l1723J1696N5862
19548F47519J15664P0489R0662J68058J01442j2909j03486k9401R2546p6240p0761
$$ plain form
19627 799634 838241 928233 906831 868778 875994 807872 778504 773285 732898 628170 623841 647322
19615 647322 726983 692728 577741 505993 625019 567313 528009 601303 706471 706592 701054
19604 701054 676416 733924 744966 730030 787142 902326 896725 826287 814262 824435 808002
19593 808002 813989 821607 796818 682472 495229 446430 351699 464868 549629 565305 454942
19582 454942 428499 506645 534350 640488 711878 666024 589842 497139 453603 468700 482189
19571 482189 473233 455653 493458 550948 558275 579140 495874 450976 409967 411022 521629 491715
19559 491715 470638 464845 414498 357900 411496 429179 464963 611684 579961 591657 647519
19548 647519 763183 833672 924334 1092392 1193834 1180925 1077439 1048038 1140584 1064344 993583
19537I93583j17760j05869j40720l9828J6672l9251m8030q559n1395l9299M2991
19526D62535Q2185L3561p509M0588M3738k9593l9213n1540j0424L8310l1045L4675
19514E66268j2209n3949O3588L6885L7744L0733J5124L3474r749k2014K5369O9816
19502G81080o9704L0079o8832j30103j8906J0096J8466P277P4502O0562l5990
19491F58527m7932R723P5759M9201m0013k3604K4620p113L6709l8935k3610N3951
19479G27283J3076K5579R8830n5258j44108K384K1380Q1027N9440N1718J7339
19468H98690O2122J3483l9751n755o596j26193L8827O4763M9163M3214R876P8824
19456A080667Q0470m4769L5061n183n3841n331Q1318R3713k5082J8775n6082n3139
$$ plain form
19537 993583 875823 769954 629234 589406 606078 566827 518797 510238 458843 419544 462535
19526 462535 544720 578281 570772 611360 655098 625505 586292 534752 524328 562638 531593 566268
19514 566268 554059 500110 563698 600583 638327 669060 684184 717658 707909 685895 711264 781080
19502 781080 711376 741455 672623 542520 523614 533710 552176 559453 633955 694517 658527
19491 658527 610595 620318 696077 745278 705265 681661 706281 699168 735877 696942 673332 727283
19479 727283 740359 765938 864768 809510 665402 667786 689166 770193 829633 881351 898690
19468 898690 960812 974295 934544 928789 922193 796000 834827 899590 948753 991967 1001843 1080667
19456 1080667 1161137 1116368 1151429 1146246 1092405 1087074 1168392 1262105 1237023 1255798 1199716 1146577
19444A146577O3176J01302P0495J0649M3749J70345J00552M545J02547P2868M3214
19433A930019N3985P6452R4106J02591Q4915J56185K09909J36014M5865J55869
19423C045910P6168M3211J26899J52995K83130K62742M50306M24022N71733O24916
19413F062032M67896L61287J85718k73274o51589m38220j26037L2142J45654K23625
19403E989234L48764O20009R08802J352006J606245J601218J623291J634109J113677
19394A6797355O63324J009664J592553K158262K335603K167858L002541M891933
19386C4619093O829167R074711J3145410J6443899J4073989R525486P203986l13849
19378A10601892j2026411j2453182o087829j463767K6269k666199o553767n617762
$$ plain form
19444 1146577 1209753 1311055 1381550 1392199 1435948 1606293 1706845 1711390 1813937 1886805 1930019
19433 1930019 1984004 2060456 2154562 2257153 2342068 2498253 2708162 2844176 2890041 3045910
19423 3045910 3122078 3165289 3292188 3445183 3728313 3991055 4441361 4865383 5437116 6062032
19413 6062032 6529928 6891215 7076933 6803659 6152070 5713850 5587813 5619955 5765609 5989234
19403 5989234 6337998 6958007 7866809 9218815 10825060 12426278 14049569 15683678 16797355
19394 16797355 17460679 18470343 20062896 22221158 24556761 26724619 29727160 34619093
19386 34619093 41448260 50522971 63668381 80112280 94186269 103711755 110915741 110601892
19378 110601892 98575481 86122299 80034470 78570703 78596972 75930773 69377006 63759244
19370F3759244q43438K807812M064510M399995L765570J348552j22653K334559
19362H1514151N410725O579036O199885L275820j941193l425596J591648P348047
19354A06552523J1241164J1970370N430499m504724r205698j2498798j6858669
19347I2126667j5128733r175164m139643j086994J30124O44203R59595o291o41410
19338F3682354J943655O725599J2187118J7188053J9688688J9224704J6914845
19331A57555016J0024890k323585q775982l171684N92950k704474q77471M371111
19323A54690771Q08377o518851l35554P326296J0223348Q326799l979897j8782226
19315A51759063j8323561q364352n05063J723521K913960J869485r740825k2582963
$$ plain form
19370 63759244 62915806 65723618 69788128 74188123 77953693 79302245 79179592 81514151
19362 81514151 86924876 93503912 99703797 102979617 101038424 97612828 99204476 106552523
19354 106552523 117793687 129764057 135194556 130689832 121484134 108985336 92126667
19347 92126667 76997934 67822770 63683127 62596133 62726257 63370460 64330055 64323764 63682354
19338 63682354 65626009 72351608 84538726 101726779 121415467 140640171 157555016
19331 157555016 167579906 165256321 156480339 153308655 153901605 151197131 150319660 154690771
19323 154690771 155499148 148980297 148644743 155971039 166194387 174521186 170541289 151759063
19315 151759063 133435502 125071150 124566087 126289608 129203568 131073053 121332228 98749265
19307I8749265j9784187j2292258p564703n333514m066483l110833k254055j489213
19299D2854019p25804r6989J39406J53365K85j006180j727754j606556j238607
19290C6745185j460980j744894j770872j603177j151327o05761Q5423M33259O47918
19281B9574774R41206J157287J771654L316732O049546J0783483J7315900K0778454
19273I1689036J7558439J4385764R332657j0207468k8649043k3306950j2771736
19266E8030699o353629k637127L14658M097894R797176J6595359J9118362J5294268
19258A14257660J2884327O191436j5706073l0423896k2785698j3121920p906544
19251D3389292n451384l968326l002176k452711j936588j654687j397833j070225
$$ plain form
19307 98749265 78965078 66672820 59108117 53774603 49708120 46597287 44343232 42854019
19299 42854019 42128215 42031226 42170632 42323997 42324282 41318102 39590348 37983792 36745185
19290 36745185 35284205 33539311 31768439 30165262 29013935 28408174 28493597 28926856 29574774
19281 29574774 30515980 31673267 33444921 36761653 42811199 53594682 70910582 91689036
19273 91689036 109247475 123633239 132965896 122758428 94109385 70802435 58030699
19266 58030699 51677070 49039943 49354601 53452495 63249671 79845030 98963392 114257660
19258 114257660 127141987 133333423 117627350 87203454 64417756 51295836 43389292
19251 43389292 37937908 33969582 30967406 28514695 26578107 24923420 23525587 22455362
19243B2455362r48749q78760q96811r89858r14036p87707o57123p16322o62006
19234A5003990o52550o63384n34346l55205m90137m84158m05001l42726l48873
19225A0727610l28919k04174l01849l03993k73006k41060k21569l78323l18273
19216H156444l22459k32186k37490l01624k23589j42162j72994j81192j78314
19207F164434j72558j66625j12053p1077j54584j46983r4078r7814j04523j40550
19197D903589j13201j26252j54503j45974r1878j11997j35707r2242p4657r6565
19187C760613J2988l3885j57769j55197q8955m2327r4579k9962o9104o3599o9525
19176B968699R526j57580j52715o7282r1321q8709n4754j9020Q077n6578m9051
$$ plain form
19243 22455362 21506613 20627853 19731042 18741184 17827148 17039441 16382318 15665996 15003990
19234 15003990 14351440 13688056 13153710 12798505 12308368 11824210 11419209 11076483 10727610
19225 10727610 10398691 10194517 9892668 9588675 9315669 9074609 8853040 8474717 8156444
19216 8156444 7833985 7601799 7364309 7062685 6839096 6696934 6523940 6342748 6164434
19207 6164434 5991876 5825251 5713198 5642121 5487537 5340554 5246476 5148662 5044139 4903589
19197 4903589 4790388 4664136 4509633 4363659 4271781 4159784 4024077 3931835 3857178 3760613
19187 3760613 3773601 3739716 3581947 3426750 3337795 3295468 3200889 3170927 3101823 3038224 2968699
19176 2968699 2978225 2820645 2667930 2600648 2509327 2420618 2365864 2346844 2354921 2298343 2249292
19165B249292Q919q6744p469k8633j20621l5385O7265n7505m8245n3210m8188
19154A839476k9867M5423L7518K8933k2295N515K0981r3o217p7035j8094k6600
19142A797645J0838n1153m1392N285L1309m7311n4572k4467R0612L8615J1216
19131A766625L0689J5146n5554m2140m0397j6647K1025j1256p6047n7544r5929
19120A437971m9758J7868L7747L8270n8598K1351L8621m3429k9005R2964R2869
19109A596871P1454L1497K6125l5645L0587R0801J15930J04554J06296K06098
19099B344568J96067L31576K69696K35850J42894J72687K29347L00193K47341
19090D470219K74433L66277K69017L52566M90351P08453R45802J278010J768762
$$ plain form
19165 2249292 2258211 2171467 2163998 2135365 2014744 1979359 2046624 1989119 1940874 1887664 1839476
19154 1839476 1809609 1855032 1892550 1921483 1899188 1904703 1925684 1925591 1919374 1842339 1824245 1797645
19142 1797645 1808483 1757330 1715938 1721223 1752532 1705221 1650649 1626182 1716794 1755409 1766625
19131 1766625 1797314 1812460 1756906 1714766 1674369 1657722 1678747 1667491 1591444 1533900 1437971
19120 1437971 1388213 1406081 1443828 1482098 1423500 1444851 1483472 1440043 1411038 1504002 1596871
19109 1596871 1668325 1699822 1725947 1690302 1720889 1811690 1927620 2032174 2138470 2344568
19099 2344568 2540635 2872211 3141907 3377757 3520651 3693338 3922685 4222878 4470219
19090 4470219 4744652 5110929 5379946 5732512 6222863 6931316 7877118 9155128 10923890
19081A0923890K314994L199456M515623O849393J0807226J6669957K1816112K1903743
19073I9000394J9687095J8003359P971022o822388o196739J122432M652921M011756
19065A41429852q837611k7164616k8070975j8310574j1019669p271457n212222
19058C5542728l986374l090811k424777k134806j859416j534415j216116r99511
19050A8296502q79535p71230p02272n45409m96585l32816l24137k67403k35293
19041A3741822m01996m29292l27844j94028j16761q2422K4056N5430J14632J79251
19031A2562848L80549N84543Q53677J355108K036724L001278M750006P503428
19023C3028161J1749883J4815214J4098067J2810473J1108315L009032o080983
$$ plain form
19081 10923890 13238884 16438340 20953963 27803356 38610582 55280539 77096651 99000394
19073 99000394 118687489 136690848 144661870 137839482 131642743 132765175 137418096 141429852
19065 141429852 132592241 105427625 77356650 59046076 48026407 40754950 35542728
19058 35542728 31556354 28465543 26040766 23905960 22046544 20512129 19296013 18296502
19050 18296502 17416967 16645737 15943465 15398056 14901471 14568655 14244518 13977115 13741822
19041 13741822 13339826 12910534 12582690 12388662 12271901 12189479 12213535 12268965 12383597 12562848
19031 12562848 12943397 13527940 14381617 15736725 17773449 20774727 25524733 33028161
19023 33028161 44778044 59593258 73691325 86501798 97610113 100619145 94538162
19016I4538162l815601J041725L088745J687328q503347j9635185j7870771j0954253
19008C9576803o476745m256525l128356k404785j923015j632902j488657j339309
19000A6926509j137904r65291o84273o13864n86596n53672o73867n46271m25465
18991A0739306k68817l26278l92049l23885m32524l87117l09305k66409l60490
18982G672432k43747j76735o0126j25764j98600j93607l13089j49807j54353j94502
18972E862102j78840k21126j21440j47676k14886k25823r8657j12456j78043j92273
18962D170882j07847r0435p4768j00521q6028j09117r4774m0042k4118l7656r6065
18951C309511j38936J9568r8605k13224o4628r4584p6259J2026k3881j18126o7103
$$ plain form
19016 94538162 90722561 91764286 94853031 96540359 88037012 68401827 50531056 39576803
19008 39576803 33100058 28843533 25715177 23310392 21387377 19754475 18265818 16926509
19000 16926509 15788605 14823314 14139041 13525177 12938581 12384909 11711042 11164771 10739306
18991 10739306 10470489 10144211 9752162 9428277 8995753 8608636 8299331 8032922 7672432
18982 7672432 7428685 7251950 7191824 7066060 6867460 6673853 6360764 6210957 6056604 5862102
18972 5862102 5683262 5462136 5340696 5193020 4978134 4752311 4653654 4541198 4363155 4170882
18962 4170882 4063035 3972600 3897832 3797311 3711283 3602166 3507392 3467350 3443232 3405576 3309511
18951 3309511 3170575 3190143 3091538 2878314 2813686 2719102 2642843 2654869 2630988 2512862 2445759
18940B445759m4521K7282j20966j41964n715n1007r6689m8642l7443j07339p3520
18929A745235m8932M5415J1191L0952p6223o6423q6484m3147j9607K9973L9700
18918A561650L3549P1411m5254l1076J0319Q2161O8952l3385l7759r587K6147
18907A697128O3812K899m30O810K9106K7816o2225m2465l9960p1625j7582p120
18895A586164l9622k6451q6066O647j8580j12421n1884j221m6133n7974M7848
18884A200307O0029k0564J4843J8885l7655K0768O5820l3065L1804M1144k5232
18873A337084K3915K3489J662J39632Q4823J3261M8831J45318J26369J03342J31763
18862B179489K0356K2382l5811j08291j56471n6565p4811m5679Q511K9234Q0196
$$ plain form
18940 2445759 2401238 2428520 2307554 2165590 2159875 2108868 2012179 1963537 1926094 1818755 1745235
18929 1745235 1696303 1741718 1752909 1783861 1707638 1641215 1554731 1511584 1491977 1521950 1561650
18918 1561650 1595199 1666610 1621356 1590280 1600599 1682760 1751712 1718327 1680568 1670981 1697128
18907 1697128 1760940 1763839 1763409 1770219 1799325 1827141 1764916 1722451 1682491 1610866 1593284 1586164
18895 1586164 1546542 1520091 1434025 1440672 1422092 1309671 1257787 1256566 1210433 1152459 1200307
18884 1200307 1260336 1239772 1254615 1273500 1235845 1256613 1322433 1289368 1321172 1362316 1337084
18873 1337084 1360999 1384488 1386150 1525782 1610605 1623866 1672697 1818015 1944384 2047726 2179489
18862 2179489 2199845 2222227 2186416 2078125 1921654 1865089 1790278 1744599 1753110 1782344 1862540
18851A862540l6382r6232j9937j3262j10723j10061m1843p319o426K4457K277
18840A447089K4206k188l2519n3108j32773j05924j9509P0440J13997K08320K05238
18829A723269K83563J82957J31471N3551p2254q3976L922O545N005K21249L15516
18818B770818J53959J5858o2641k39296l05370j94914j08532r4782j01970q7094
18808A746036L1426P0815J6502l4374j10857p2100l6118j13345j08193r4712o3176
18797A231904o3021m1104K0954O0475R4460M6535M0494K8425k9234J4279P0887
18786A475054J41504P7632J52062J41424P5848K0673J19564K09193J56362K51675
18776B820991K13646m3927k15086j62333j22121M325R3235J93769J60348L8924
$$ plain form
18851 1862540 1826158 1729926 1709989 1696727 1586004 1475943 1434100 1426781 1420355 1444812 1447089
18840 1447089 1471295 1469107 1436588 1383480 1250707 1144783 1125274 1195714 1309711 1518031 1723269
18829 1723269 2006832 2189789 2321260 2374811 2302557 2218581 2222503 2229048 2234053 2455302 2770818
18818 2770818 2924777 2940635 2877994 2638698 2333328 2138414 2029882 1935100 1833130 1746036
18808 1746036 1777462 1848277 1864779 1830405 1719548 1647448 1611330 1497985 1389792 1295080 1231904
18797 1231904 1168883 1127779 1148733 1209208 1303668 1350203 1390697 1419122 1389888 1404167 1475054
18786 1475054 1616558 1694190 1846252 1987676 2063524 2084197 2203761 2412954 2569316 2820991
18776 2820991 3034637 2990710 2775624 2613291 2491170 2495495 2588730 2782499 2942847 2981771
18766B981771N2507M1514j11328l03975k57958l58255k59902j40880j4611L0695
18756A659578j8527j997J21763J15116Q6108J06716J5584j71821n7344J4794J24148
18745A994118J51082J41236Q9889R5322n7038j27721j51352j29732j14247q0609
18735A810948k6119m7326R7333l344r9814j19305j37203j05351j60711j33610
18725A075498k0097M8792L8457j3951P7664M8324R0023P2351R8756Q2720l767
18714A594770m6969r4255m7912Q093m765o277O0305J08741J42128J45413K31472
18703B090744J69067J78404J97407J38651L7426k01791l70282j93948j15140O1900
18693A992438J64100K57884K43756J02689m1727k64671m14689l88102p5657l6503
$$ plain form
18766 2981771 3034278 3075792 2964464 2660489 2402531 2044276 1784374 1643494 1628883 1659578
18756 1659578 1641051 1639054 1760817 1875933 1962041 2068757 2084341 1912520 1855176 1869970 1994118
18745 1994118 2145200 2286436 2376325 2471647 2414609 2286888 2135536 2005804 1891557 1810948
18735 1810948 1784829 1737503 1834836 1831492 1731678 1612373 1475170 1369819 1209108 1075498
18725 1075498 1055401 1104193 1142650 1128699 1206363 1254687 1344710 1417061 1515817 1598537 1594770
18714 1594770 1547801 1453546 1405634 1413727 1408962 1402685 1462990 1571731 1713859 1859272 2090744
18703 2090744 2259811 2438215 2635622 2774273 2811699 2609908 2239626 2045678 1930538 1992438
18693 1992438 2156538 2414422 2658178 2760867 2719140 2454469 2039780 1651678 1576021 1539518
18683A539518j08017r1814M538m9058N3574L2668n2884p5364p1349o7859r1664
18672A022289j74j1700j923Q5895J05020J11625j6063J06283J85911O7998J79391
18661A834552J77378J40537J56825k610n8952q6262j30708j20548r0203j12546
18651A707463k0958r8043m5526k639p5995l3017M5713L2481j07473q037P9522
18640A473491P3462k4695n2318o8954l8538K8780L8738M324N35J16918J86813
18629A738556J03116K07984K79638K44523J02245j07N7071L7773J591M4483k93
18618B816580L8564Q5018P9510J00335K38236K07261J4538j05653o1847N67k6731
18607C386378m2323L5291O4400K50131K76572K52328K67547J53529J17006J12022
$$ plain form
18683 1539518 1431501 1339687 1344225 1295167 1348741 1381409 1328525 1253161 1181812 1113953 1022289
18672 1022289 1022115 1010415 1008492 1094387 1199407 1311032 1294969 1401252 1587163 1655161 1834552
18661 1834552 2011930 2152467 2309292 2306682 2247730 2161468 2030760 1910212 1820009 1707463
18651 1707463 1686505 1588462 1542936 1540297 1464302 1431285 1476998 1509479 1402006 1393969 1473491
18640 1473491 1546953 1522258 1469940 1400986 1362448 1391228 1429966 1434290 1434825 1551743 1738556
18629 1738556 1841672 2049656 2329294 2573817 2676062 2675955 2733026 2770799 2772390 2816873 2816580
18618 2816580 2855144 2940162 3019672 3120007 3358243 3565504 3580042 3474389 3412542 3413109 3386378
18607 3386378 3344055 3379346 3443746 3693877 3970449 4222777 4490324 4643853 4760859 4872881
18597D872881J91309M61806Q65620J329711J353826J281306J205363N19879m96038
18588A1585663p26516k53555K02545L26998M3857n62793n71829r1181K00450L18301
18578A0471940K5988p66006j027433o15904k90773j94283l8257O4110K06635L74507
18568H210524O41157R85811J428012J888642K235774K366170K855709L625234
18560B4237033M090935M614443N335620M821493L496274J011673l618704o582042
18552C7406725m716340j972526j3272J534743K365239K767767L274225K517180
18544D3163741L21922k75905Q88024J231049J105496K980519O567236J1263049
18536F7245131J6233917J8665136J9668017K0623430J5235465L277926l074934
$$ plain form
18597 4872881 5064190 5525996 6391616 7721327 9075153 10356459 11561822 12081701 11585663
18588 11585663 10859147 10605592 10808137 11135135 11178992 10616199 10044370 9953189 10153639 10471940
18578 10471940 10497928 9731922 8704489 8088585 7797812 7603529 7565272 7629382 7836017 8210524
18568 8210524 8851681 9837492 11265504 13154146 15389920 17756090 20611799 24237033
18560 24237033 28327968 32942411 38278031 43099524 46595798 47607471 43988767 37406725
18552 37406725 32690385 30717859 30704587 32239330 34604569 37372336 40646561 43163741
18544 43163741 43485663 43209758 44097782 45328831 46434327 49414846 55982082 67245131
18536 67245131 83479048 102144184 121812201 142435631 157671096 160949022 157874088
18529A57874088o391309j1840908j0740483l578089L990653Q063779P037830O967937
18521A51383498R707251P872075r89017j0227419j6334537j9876130j6491729
18514A05043992j0433547n874554l502647k058482P03314N250402J0622113J6562876
18506A16313467K2536030K6612026K9343475L0251349K4125817J3036194M869124
18499B67087482m704059j7711563k6610511l0565387k6442538j4099326k868186
18492A44085912O648197J8295744K9992175L1815808K5538778K3552381J3221925
18485B93150920k4293231n0684419l8371791k2337043j8384696k0139957j6849863
18478A02089920j1154517o517393l587731k121587j787492j619764k255448m556508
$$ plain form
18529 157874088 151482779 139641871 128901388 125323299 129313952 137377731 144415561 151383498
18521 151383498 161090749 168962824 167973807 157746388 141411851 121535721 105043992
18514 105043992 94610445 88735891 85233244 83174762 83878076 89128478 99750591 116313467
18506 116313467 138849497 165461523 194804998 225056347 249182164 262218358 267087482
18499 267087482 262383423 244671860 218061349 187495962 161053424 146954098 144085912
18492 144085912 150734109 169029853 199022028 230837836 256376614 279928995 293150920
18485 293150920 268857689 218173270 179801479 157464436 139079740 118939783 102089920
18478 102089920 90935403 84418010 80830279 78708692 76921200 75301436 73045988 68489480
18470F8489480o039880m600403k217051m31478O17671J089769J567478R71887
18462E9447473j074373k507397k885327m182829m879661m199422l153905k296655
18454C4267904j859574j456288j293020j278113j226241j084956r02377q11599
18446B4355736p30696o44017o43863n48868m62020k75261J20495K03101Q2693
18437B1457300o0883l35875j008675j242268r78211p95017n86115n20781l05335
18428A5624140k72846j10359P2415j28379k31653n26713p70063p26648m77777
18419A2452117j88948j28987k1248j50761j51854k03510m24658n79863o19901
18410I982387n83865n04955k88132j66811j36229k54697q0592o3268k10349l12912
$$ plain form
18470 68489480 62449600 57849197 55632146 55200668 55818339 56908108 58475586 59447473
18462 59447473 58373100 55865703 52980376 48797547 43917886 39718464 36564559 34267904
18454 34267904 32408330 30952042 29659022 28380909 27154668 26069712 25167335 24355736
18446 24355736 23625040 22981023 22337160 21788292 21326272 21051011 21171506 21374607 21457300
18437 21457300 21396417 21060542 20051867 18809599 17831388 17036371 16450256 15929475 15624140
18428 15624140 15351294 15240935 15313350 15184971 14953318 14426605 13656542 12929894 12452117
18419 12452117 12263169 12134182 12112934 11962173 11810319 11606809 11182151 10602288 9982387
18410 9982387 9398522 8893567 8605435 8438624 8302395 8047698 7967106 7903838 7693489 7380577
18400G380577k52122k44566l02373k21025j60151p9953q9150j3169q0121j57064
18390E780883j52257m9304k48088k44615q8396m8413K7292j32519l4981n0946
18380D758656n6959J4767j2512r65J714O6664M4669m2089n0233r9465j07600j99478
18368D317169k57454j76221k7149n2465j17190r6386q5624n8882j46475j72663
18358C126660j81207j74291j82220j36850q0665m0015j12854j08067m5631P6048
18348B140908m3097o5387k9587j1388r178j28316m6403J1379o4246j7996N6716
18337A793405R5592O0030J02833O5058L2222j9693j7637r8459R2181Q2808Q6167
18326B274507J11121N8597O276j38750m0727j39918j87403m4335j11602j34740
$$ plain form
18400 7380577 7128455 6883889 6581516 6360491 6200340 6120387 6031237 6018068 5937947 5780883
18390 5780883 5628626 5579322 5331234 5086619 4998223 4949810 4977102 4844583 4809602 4758656
18380 4758656 4701697 4716464 4703952 4702987 4704701 4771365 4816034 4773945 4723712 4624247 4516647 4317169
18368 4317169 4059715 3883494 3856345 3803880 3686690 3590304 3504680 3445798 3299323 3126660
18358 3126660 2945453 2771162 2588942 2452092 2371427 2331412 2218558 2110491 2064860 2140908
18348 2140908 2097811 2032424 2002837 1991449 1982271 1853955 1807552 1818931 1754685 1736689 1793405
18337 1793405 1888997 1949027 2051860 2116918 2149140 2129447 2111810 2013351 2105532 2188340 2274507
18326 2274507 2385628 2444225 2450501 2311751 2271024 2131106 1943703 1899368 1787766 1653026
18316A653026o1353p5294j30142l0755l8562p8658n0405j09616n4415R5107M9620
18305A168553l1312n4415r7733K1707M4750M6657K1927M9819M4616N2602M1089
18294A308260q5328o5398K1843p409q8232K291k8233J46424J39975O3060K1581
18283A428834M5290J26615q1930k44878j89960p764l9838m8923P5985L0222k256
18272A091397o0481p729m4651Q084R5051o0549o7911m0183p0149o1460q0133k1111
18260F80175j22071k1713M2808n82j3913J1535j8382P6232R1843m5023m4818j0900
18248F25191k5255l781K592m3582L8678K082J12082Q9527n8311r6467o2318k7143
18236E53295O768Q033R3249J9807R599o1079n1273j73298j8611p077l795P2271
$$ plain form
18316 1653026 1591673 1516379 1386237 1355482 1316920 1238262 1187857 1078241 1023826 1118933 1168553
18305 1168553 1137241 1082826 985093 1006800 1051550 1098207 1120134 1169953 1214569 1267171 1308260
18294 1308260 1222932 1157534 1179377 1171968 1083736 1086027 1057794 1204218 1344193 1407253 1428834
18283 1428834 1474124 1600739 1518809 1273931 1083971 1076207 1036369 987446 1063431 1093653 1091397
18272 1091397 1030916 1023187 978536 986620 1081671 1021122 953211 913028 842879 781419 701286 680175
18260 680175 558104 536391 579199 578617 564704 576239 557857 634089 725932 680909 636091 625191
18248 625191 599936 596155 598747 555165 593843 595925 708007 797534 739223 642756 580438 553295
18236 553295 560063 568096 661345 681152 690751 629672 578399 405101 386490 379413 375618 447889
18224D47889Q2591J6775R280j5834j1686L2503j0967n2396l9534j04304K2375
18213C76692P984m932P859L2508O5150n8357q149L1996m7649r2661l6302J7655
18201B91794n0343k6904M3589Q9657k5342n1404j9966N6805P0708m1614k8802
18190C08178k2622N2914M9897K847p637M052r0375N4225Q8467L4220k7426N667
18178D52407j38830l3224j8928R5776J2052J8401j9282L0333N7798M2653r960
18167D89196m9682n659K2161j44863p8139R007L4722R8227J34702N728m2530l6443
18155D36427j01840J3353J22132N7625r0309n6o651Q722N5519n8927m1109K155
18143C97041P693K1183J7985K0711l2911J2536J27400J9361L6818k3997k882J4802
$$ plain form
18224 447889 530480 547255 556535 540701 529015 561518 550551 498155 458621 354317 376692
18213 376692 384676 379744 387603 420111 485261 426904 418755 450751 403102 310441 274139 291794
18201 291794 241451 214547 258136 347793 322451 271047 251081 307886 378594 336980 308178
18190 308178 285556 338470 388367 391214 383577 387629 297254 351479 439946 474166 446740 452407
18178 452407 313577 280353 261425 357201 369253 387654 368372 398705 456503 499156 489196
18167 489196 439514 433855 456016 311153 233014 242021 276743 374970 509672 515400 472870 436427
18155 436427 334587 347940 470072 527697 437388 437332 430681 439403 494922 435995 394886 397041
18143 397041 404734 425917 443902 464613 431702 444238 571638 590999 627817 603820 600938 615740
18131F15740J32333M0433J3951J47188J40478J30182J02461L1531J13517K16895
18121A684709K53147K97589K62798M19508M40594N26839P42198R83995J306535
18112F917912J941569K986322M918077Q844709J4890897J8543718J5257325J3046696
18104H7347225J0056679q881620k8036590k1431703j1048490n996852l814798
18097A8193851k627928j856815j279625j050166r53082r01222q63920p75996o11915
18088G273182n87865m78907l70726k99102k11944k67613l02850j78714j86014
18079D389447j24795k0875j16852m0701J0568p5762p0884j0467m1845k9538j18255
18068C750041r7490o5556p3494j18320k2991K7804q0590j27309r5474q8192o6059
$$ plain form
18131 615740 748073 788506 802457 949645 1090123 1220305 1322766 1354297 1467814 1684709
18121 1684709 1937856 2235445 2498243 2917751 3358345 3885184 4627382 5611377 6917912
18112 6917912 8859481 11845803 16763880 25608589 40499486 59043204 74300529 87347225
18104 87347225 97403904 88522284 60485694 39053991 28005501 22008649 18193851
18097 18193851 15565923 13709108 12429483 11379317 10426235 9525013 8661093 7885097 7273182
18088 7273182 6685317 6206410 5835684 5536582 5324638 5057025 4754175 4575461 4389447
18079 4389447 4264652 4243777 4126925 4086224 4096792 4021030 3950146 3939679 3897834 3868296 3750041
18068 3750041 3652551 3586995 3513501 3395181 3372190 3399994 3319404 3192095 3096621 3008429 2942370
18057B942370M1132q7666j86583j66144o4730r5645j23365r9608p2659q1090m9817
18046A956195J1437n5503j22586o0763J313m5384m3557M2833j4272L1629M8725
18035A750067j22198o2694P0312K1509n0923P163k3743P8286l357j1790j3925
18024A638707k1378L1085j4891r6815K6804k8549n544K6188m3420J0358K8126
18013A550671j7450k0115l2491p8825q4399k2999K5224j4218N3556k9335K9109
18002A358728M7125N210j11247j12447j71188j09993r540l5030j9072p2640N6313
17991H26219k2117n5077M0625J10697P6372R8677N1011n4997q0716R1158P4330
17980A156182N2128M6364L5825q3203p1930k2014k3051l703j9884K8134O7901
$$ plain form
18057 2942370 2983502 2895836 2709253 2543109 2478379 2382734 2259369 2159761 2087102 2006012 1956195
18046 1956195 1967632 1912129 1789543 1728780 1730093 1684709 1641152 1683985 1669713 1701342 1750067
18035 1750067 1627869 1565175 1635487 1656996 1606073 1613236 1589493 1667779 1664422 1652632 1638707
18024 1638707 1617329 1648414 1633523 1536708 1563512 1534963 1529419 1555607 1512187 1522545 1550671
18013 1550671 1533221 1513106 1480615 1401790 1317391 1294392 1319616 1305398 1358954 1329619 1358728
18002 1358728 1405853 1411063 1299816 1187369 1016181 906188 896648 861618 842546 769906 826219
17991 826219 804102 749025 789650 900347 976719 1075396 1126407 1071410 990694 1081852 1156182
17980 1156182 1208310 1254674 1290499 1207296 1135366 1113352 1090301 1086598 1066714 1094848 1162749
17969A162749m0943j27033r6215j18956j14637K64N2036l7000j00422n2182m2833
17958D84828l1533N6787J936L3496R532j1441M9615j2201k5310P0721J6403k4887
17946F17946l5752r1200q0422k4608j7723J16073l1399n1733J3684J4129j9776
17935D09219l6134k9913m8778K8621L3631M7850L2895L4341j8396m6387M2950
17924D49899J7297p4612k5014L351J7467j7451l452M0538j0374q8938m8720m1047
17912B18944j14030r0318J03349P6141L1410l528L8804J9030r6983j06057K5050
17901A01812K8825J3283O4750k2702L943o4211k6885m071M6322n9689p5164J19932
17889A26145P0657N145r129J5442k7481j08672k7567J32387k6724n9705o1631
$$ plain form
17969 1162749 1121806 994773 898558 779602 664965 665229 717265 680265 579843 527661 484828
17958 484828 453295 510082 512018 545514 555046 543605 593220 581019 555709 626430 642833 617946
17946 617946 582194 490994 410572 385964 368241 484314 452915 401182 414866 428995 409219
17935 409219 373085 343172 294394 323015 356646 404496 437391 471732 453336 406949 449899
17924 449899 467196 392584 367570 370921 388388 370937 367485 408023 397649 308711 259991 218944
17912 218944 104914 14596 117945 194086 225496 221968 260772 279802 182819 76762 101812
17901 101812 130637 143920 208670 185968 189911 125700 98815 94744 141066 81377 6213 126145
17889 126145 196802 201947 192818 208260 180779 72107 44540 176927 150203 90498 28867
17878B8867p769P4072J03200q448n6309l7603k7467J5400N2706L0626l5752o5411
17866F6112o808J1831k1120J118J1744k6509l5015K2385L8972p301J3070J2238
17854H0717k6733L2405L4988J107j15691o3974M2479J00964N2457o4014k1414
17843E3291M0869P779M2089J452j8629l2230j3939M2409J6453o5325o1614r0394
17831g7789l5587o002M5890O2939M0131N5888k7949k0789l927J2473j4286j24338
17819i3346L0711J05827J7351k3297N173M4982O896j24275j2208J8727L9813M4237
17807F0591M2821l1110o0674k2072K1840P761J7481l751k9461L1032j6943J6792
17795C4307m0160m9960p3165N319r074o514L8295M9614o8254m1334l2057N3809
$$ plain form
17878 28867 21098 95170 198370 189922 133613 96010 68543 83943 136649 167275 131523 66112
17866 66112 59304 71135 50015 51133 62877 36368 1353 23738 62710 55409 68479 80717
17854 80717 53984 86389 121377 122484 6793 -57181 -14702 86262 138719 74705 53291
17843 53291 94160 101939 144028 145480 126851 94621 80682 123091 139544 74219 12605 -77789
17831 -77789 -113376 -119378 -73488 -10549 29582 85470 57521 36732 32805 45278 30992 -93346
17819 -93346 -62635 43192 60543 37246 42419 87401 94297 -29978 -42186 -23459 16354 60591
17807 60591 103412 72302 11628 -10444 11396 19157 36638 32887 3426 34458 17515 34307
17795 34307 -5853 -55813 -128978 -123659 -132733 -139247 -100952 -51338 -119592 -160926 -192983 -139174
17783a39174O2274j760J0187R8203J00434R86k6886j7780p4330K3126j3323j9846
17771B111L4525m942n7338J15257N3830k1630l7643o3428L1169k2347k111n7066
17759b9613J1001R6550M1482p1883j8444j1957m4444J10768K4454l3641p3557
17748G16K3432L4693J4176m5676m3104M1597k5626k9694l772m4526r1297R399
17736a59682R8687L07N9874O0734O4143O068r5217l4877J1130K7559m3897l3930
17724c9101N9227P363K3197M8443l167j74179p6263O9113N8725m377O582R4286
17712F9849r154l1661M5322j06332k3953J18670l721k8956j7971k7869j3596J5477
17700a3895K1288L7832k8933Q482M1373J0129m7484j04083m1262O1045K2360O557
$$ plain form
17783 -139174 -76900 -78660 -68473 29730 130164 131150 104264 86484 12154 35280 21957 2111
17771 2111 36636 31694 -25644 89613 143443 121813 84170 20742 51911 29564 27453 -29613
17759 -29613 -18612 77938 119420 47537 29093 17136 -27308 83460 107914 74273 716
17748 716 24148 58841 73017 27341 -15763 25834 208 -29486 -33258 -77784 -169081 -159682
17736 -159682 -60995 -60688 -814 59920 124063 130131 34914 37 11167 38726 -5171 -39101
17724 -39101 20126 27489 50686 99129 95962 -78217 -154480 -85367 -26642 -31019 -24437 69849
17712 69849 60695 29034 74356 -31976 -55929 62741 59020 30064 12093 -15776 -29372 -13895
17700 -13895 7393 45225 16292 24774 66147 76276 28792 -75291 -116553 -55508 -33148 -26591
17688b6591n9230j6769J698j1659P8331R8654m1012j16210M5250L6862K2611Q111
17676B0046J9294j9038k8659l4748o7481M2047J7123m6978k4211J13041K5803
17665A6239o5323K9678K531N3773N8856M2685n8044m6399j0120l6325L1643L3713
17653E2907p6906k4531K6310K5647O4787o9142j40443m6630J3898P2248N7051
17642d4804O1777K8388q3717J6904P162p6555P0892Q6199n1787o3219M9971L2497
17630C3708J5519p65p4425n9842l5405k7128P3356L9751Q8260l2066K9495J4529
17618F4987k7207Q7214N7980Q7261J1706k1380k1266o9977k8273J6528p2317j35782
17606e0526K8249J45121J09620j4609q6026p6878l1460l1985J0675M2889j6264
$$ plain form
17688 -26591 -85821 -102590 -100892 -112551 -34220 64434 23422 -92788 -47538 -10676 11935 20046
17676 20046 39340 20302 -8357 -43105 -110586 -68539 -51416 -98394 -122605 -9564 16239
17665 16239 -49084 -19406 -16875 36898 95754 138439 80395 33996 23876 -12449 19194 52907
17653 52907 -23999 -48530 -22220 3427 68214 -928 -141371 -188001 -174103 -101855 -44804
17642 -44804 16973 45361 -38356 -21452 -14290 -90845 -19953 66246 14459 -48760 1211 33708
17630 33708 49227 48462 -25963 -85805 -121210 -148338 -74982 -35231 53029 20963 50458 64987
17618 64987 37780 124994 182974 270235 281941 260561 239295 169318 141045 157573 85256 -50526
17606 -50526 -22277 122844 232464 217855 131829 54951 23491 -8494 2181 45070 28806
17595B8806j5547R6135n9799o1325K1759K1794K6889L0676L136o674k0291O2519
17583A28078J2010j9098j7793P47o565m1761m9164P123M5310L1197P2042Q0930
17571B43056J5771k1222r445o2846L8797J39730L6237K4369M7678n9944n0488
17560C41693m8762j9263j8830j286k373m9224m7151P5964L1883k0198o0143p0091
17548A12219J1605q8008n0006N5107P9556m0826j6663j9718R5246m0986k745R377
17536A04158m0085L0417p7576q3326K636R5624J14227K724o3518k8423N3529K5009
17524A35396R9233l118q7172m3265l8218m347l8799n1424Q3803L9473j1291M4359
17512A24630Q981M0016k360k0117L9761m1174J9319L9031k6097j04408j18131
$$ plain form
17595 28806 13259 109394 49595 -11730 10029 31823 58712 89388 92524 85850 65559 128078
17583 128078 140088 120990 103197 103944 97379 55618 6454 13577 58887 90084 162126 243056
17571 243056 258827 237605 228160 165314 204111 343841 380078 404447 452125 392181 341693
17560 341693 292931 273668 254838 253552 251179 201955 154804 230768 262651 242453 182310 112219
17548 112219 123824 35816 -14190 40917 120473 79647 62984 43266 138512 97526 94781 104158
17536 104158 64073 94490 16914 -66412 -63776 31848 146075 148799 85281 56858 110387 135396
17524 135396 234629 231511 144339 101074 62856 58509 19710 -31714 52089 91562 80271 124630
17512 124630 133611 173627 171267 151150 190911 149737 169056 208087 181990 77582 -40549
17501d0549L3184N926K6168l259k0082p1279J2538L6970l3235j6729N7664L0461
17489A7778N0042K535j3566j15764l8510k2537r6174N7867Q7157j0114j835m1763
17477a24884m2834j3357L6240R2468J08985N0847n5470j16754n8723L8581J6771
17466f8130R7688M2204P863m6701j7857J4381j4014Q9151L9068K2170L9036M0305
17454B45164N2656J17631J40579J7686l8336k8216l1682q415J12809M623R9428
17443F83927J45921P7538k1494q1476P6297M2870k6066r9080j61409j32947j55897
17432C48184n1959j2591M6762j0514N025o7362l4188N3189m8460o8894m6993k036
17420A10163m3848J2406k6013N304M5068j4001J8894K6685J6300L794L0336P4113
$$ plain form
17501 -40549 -7365 -1439 24729 21470 1388 -69891 -57353 -20383 -53618 -70347 -12683 17778
17489 17778 67820 70355 56789 -58975 -97485 -120022 -216196 -158329 -71172 -81286 -83121 -124884
17477 -124884 -167718 -181075 -144835 -52367 56618 107465 51995 -64759 -123482 -84901 -68130
17466 -68130 29558 71762 79625 32924 15067 29448 15434 104585 143653 165823 204859 245164
17454 245164 297820 415451 556030 573716 535380 507164 475482 467067 579876 584499 683927
17443 683927 829848 907386 885892 804416 880713 923583 897517 798437 637028 504081 348184
17432 348184 296225 283634 330396 319882 324907 257545 223357 276546 228086 159192 112199 110163
17420 110163 66315 78721 52708 58012 103080 89079 107973 134658 150958 154752 185088 259201
17408B59201n372k125J8925j0302R6302J13963J6270m671m9441m1719J0891J33314
17396E35236J08100j8609m4834m3737q2931q4490L1094R0897J0301p7831j43166
17385B80030r5045l247n5543j17291j5137K7616q5195r267K1532J7512n2671M4702
17373d2004J5310O6951Q724J2714o21K98l2235J3285K476N6815j0056m0955q5469
17360c4767j01978M4768N9434n55m679N8801n230N3916p0195m3329N0552L8364
17348D5102j6703O5496K2676o2257O243k2087Q4022N3471j07595j8858n321k5218
17336A8971n2820n6771k4937N9308P7246N6324r0725M5214J1270n3166m7013M7101
17324i998O9011r6690k0047N4855k1440J0926k7083p4132n5368l4271P2062N7186
$$ plain form
17408 259201 253829 251704 270629 260327 356629 470592 486862 482191 432750 391031 401922 535236
17396 535236 643336 624727 579893 536156 453225 368735 399829 490726 501027 423196 280030
17385 280030 184985 181738 126195 8904 -6233 21383 -63812 -73079 -51547 -34035 -86706 -42004
17373 -42004 -26694 40257 48981 61695 61074 61372 29137 42422 44898 101713 91657 50702 -34767
17360 -34767 -136745 -91977 -32543 -33098 -37777 21024 15794 69710 -485 -43814 6738 45102
17348 45102 28399 93895 116571 54314 60557 38470 122492 175963 68368 49510 44189 18971
17336 18971 -33849 -90620 -115557 -56249 20997 77321 -13404 31810 43080 -10086 -57099 -9998
17324 -9998 59013 -37677 -57724 -2869 -24309 -13383 -40466 -114598 -169966 -204237 -132175 -74989
17312g4989N3301j2480l4621m7876k8579K0389J35N8078L2965k7684Q697m1405
17300i4069j4509J0663M2619M5527k6835r9671l6575J19353P0449M027m8724Q639
17288a9106o427m0705l3872J5093P6300n0920P0298P76n074q777K1182J16126
17276A34894N6245p7963r0962J3585O3596j16313q6145Q8710J06724m9477k0943
17265B1951k7313O8281k210M1481j1686r3773o1201l4353K172L8513L4707m5566
17253f8997K1073N7613L511j3615J3519L9434k8367j02888K1574J16075K6921
17242H5853L2571k8877j11686n636J706J1066P6465J06666L450j4332N885k4531
17230A38600N1340k8394n9623r6044M6560m8090p7462P2168M0398m378N1308J9231
$$ plain form
17312 -74989 -21688 -34168 -68789 -116665 -145244 -124855 -124720 -66642 -33677 -61361 -52664 -94069
17300 -94069 -108578 -97915 -55296 -9769 -36604 -136275 -172850 -53497 16952 20979 -27745 -19106
17288 -19106 -25533 -66238 -100110 -85017 -8717 -59637 10661 11437 6363 -2414 18768 134894
17276 134894 191139 113176 22214 35799 99395 -16918 -103063 -14353 92371 42894 21951
17265 21951 -5362 62919 60709 102190 90504 -3269 -64470 -98823 -96651 -58138 -23431 -68997
17253 -68997 -47924 9689 13200 -415 13104 52538 24171 -78717 -57143 58932 85853
17242 85853 118424 89547 -22139 -27775 -26069 -15003 61462 168128 171578 157246 163131 138600
17230 138600 189940 161546 101923 5879 52439 4349 -73113 -945 39453 35075 86383 105614
17218A05614m4440M1132j1079l0764k9412q958K6552q051J2245l7606k7446n8361
17206g0574k7704L2731J3560r6430N6536Q9844N5154J3506j1129J8643j1011m1576
17194B1550m6312m56J2962K8616l6225J1989K9232L1889K598k4927k4076l4284
17182b7444L8417l3228M578M8612Q0947r245r9850m3174k6619M3252K1242J408
17170a104n9827K7608k1513k2893L8293K3299P260q198O1250j5582q5087r3125
17158a49619K3838M5041j0574J5640L9068j3128L4705k1991l6669m3273J5862
17147a01100k7853m2993o535O4666m4000O3908O5524P8391K4937p794q7925r0184
17135a10958R658l6299R927M5145R3378k071o850m7525k4364m391O2591n5793
$$ plain form
17218 105614 61174 102306 91227 60463 31051 22093 48645 40594 52839 15233 -12213 -70574
17206 -70574 -98278 -65547 -51987 -148417 -91881 -2037 53117 66623 55494 74137 63126 21550
17194 21550 -24762 -25218 -12256 16360 -19865 -7876 21356 53245 55843 30916 6840 -27444
17182 -27444 10973 -22255 -17677 30935 111882 102637 2787 -40387 -67006 -23754 -2512 -1104
17170 -1104 -60931 -33323 -54836 -77729 -39436 -16137 -8877 -17075 44175 28593 -56494 -149619
17158 -149619 -125781 -80740 -91314 -75674 -36606 -49734 -15029 -37020 -73689 -116962 -101100
17147 -101100 -128953 -171946 -178481 -113815 -157815 -93907 -28383 50008 74945 67151 -20774 -110958
17135 -110958 -101300 -137599 -127672 -82527 10851 8780 1930 -45595 -69959 -74350 -11759 -67552
17123f7552m5982J4338P4822J0454l9623L6081L4022M7485k7814k3439l0939m4258
17111f2405l3315n683R9887P8907j4171q4918k1181J1820L9374K0677m6437l0141
17099d7586o9260m6919Q780J7778O4855M2965M9424k0501m5135l6171L0145J29684
17087G8059k3822n8233R775n2498M3867P3475k0234o0420m4414n3629J6688J02361
17075A0975N6443O8615l2392o1303k660K5376n9270l8240O6238J03885O7086N3307
17063B58060l5918o3188j1047R0j11000L0605K2k8604l1492K1272L8907r979p9107
17050b1379m3088k568N6977M2735k099j3083Q3988m1435k6549K2154L9480j32603
17038c7470p4684M411P5846O02L9756K3016p795Q5806P9489k1256P5083K4108
$$ plain form
17123 -67552 -113534 -99196 -24374 -13920 -53543 -17462 16560 64045 36231 12792 -18147 -62405
17111 -62405 -95720 -101403 -1516 77391 63220 -21698 -42879 -31059 8315 28992 -17445 -47586
17099 -47586 -116846 -163765 -154985 -137207 -72352 -29387 20037 -464 -45599 -81770 -51625 78059
17087 78059 54237 -3996 5779 -46719 -2852 70623 50389 -10031 -54445 -108074 -91386 10975
17075 10975 67418 136033 103641 42338 39678 65054 5784 -32456 33782 137667 204753 258060
17063 258060 222142 158954 147907 147997 36997 67602 67624 39020 7528 28800 67707 57728 -21379
17050 -21379 -64467 -67035 -10058 32677 30578 17495 101483 60048 33499 55653 95133 -37470
17038 -37470 -112154 -107743 -31897 -31295 8461 31477 23682 109488 188977 167721 242804 266912
17026B66912j35148k4366K9962r0884j5490n50M2666m6008l0225N5118k8037j00772
17014g6822L5857N7000p1415n9152O6179m296j8043J801L2481J570K9423N7352
17002E1935l4371k5377J7369j37596J7118M7462R7373N5151m5640j37522l8390
16991a32488L7520O7807O0521n6857j3169k1165l9758O5825K0233n4387p0337
16980a36255N6582O842m032k3887j5354M6854M0077L9224K4073j4773k1816p0607
16968g3072p1252O5720J55j4340N1606J5448q1181k0395N8891J09258M1270n0388
16956C1720m1164L5691M29K2041M9267j1020L2863K9799l0540K1681p8881o0905
16944I81K5365L912l0323j7487N36P0605n0784n5158p8118N6369j9196J9646K3921
$$ plain form
17026 266912 131764 107398 137360 46476 30986 30436 73102 27094 -3131 51987 23950 -76822
17014 -76822 -40965 16035 -55380 -114532 -48353 -52649 -70692 -68891 -36410 -34840 -5417 51935
17002 51935 17564 -7813 9556 -128040 -110922 -63460 33913 89064 43424 -94098 -132488
16991 -132488 -94968 -27161 33360 -23497 -36666 -57831 -97589 -31764 -11531 -65918 -136255
16980 -136255 -79673 -72831 -76863 -100750 -116104 -69250 -29173 10051 34124 19351 -2465 -73072
16968 -73072 -144324 -78604 -78449 -92789 -41183 -25735 -106916 -127311 -68420 40838 82108 31720
16956 31720 -9444 26247 26676 48717 97984 86964 119827 149626 119086 140767 61886 981
16944 981 26346 30258 -65 -17552 -17016 53589 2805 -52353 -130471 -74102 -93298 -73652 -49731
16931d9731o8935J6806r587m2346J260Q1327M5881l5037O0533j568j2175L6076
16919B2504j9626o6292P1073l8421n8994m4666p508j1419j6670N2304L9038l7990
16907a16667M9203j9640N9683o405N378n1687q6924l4027M5442N589K8906J1576
16895a09573L156l3787j803Q7309L2278o8381q8793k0215M1477O1025R7233k0608
16883b0682p7515J851o0553r369Q9839O7711M1579L5284R125K1385m7140j0682
16871D0833J8863l9984p7835m3699j7489M982K9555J14910K6198p950J28447L0887
16859B07718o5498O5238r9897j24893o6853O9796m4341k7710M2579M9061q8235
16848h3035o0275J1288Q93N3511J1436L269o4026K6064P683j1883K9558m8929
$$ plain form
16931 -49731 -118666 -101860 -111447 -153793 -152533 -71206 -25325 -60362 171 -1397 -13572 22504
16919 22504 2878 -63414 7659 -30762 -89756 -134422 -141930 -153349 -170019 -117715 -78677 -116667
16907 -116667 -67464 -87104 -27421 -33826 -28448 -80135 -167059 -201086 -155644 -150055 -121149 -109573
16895 -109573 -106417 -140204 -142007 -54698 -22420 -90801 -179594 -199809 -158332 -97307 -74 -20682
16883 -20682 -98197 -96346 -156899 -166268 -76429 -8718 32861 68145 77270 98655 51515 40833
16871 40833 59696 19712 -58123 -101822 -119311 -114329 -84774 30136 56334 48384 176831 207718
16859 207718 142220 207458 107561 -17332 -84185 -14389 -58730 -86440 -43861 5200 -83035
16848 -83035 -143310 -132022 -131129 -77618 -66182 -62913 -126939 -100875 -93192 -105075 -75517 -124446
16836a24446M166L0096O5851K9584r5188k6489l9692k1313L2557P5087O1752m3978
16824e2013M7961M2205l8929L2579L0486L1740l0694j42293O3627j6466q0630
16813a12427K9815K2709L1261L0522l3391R573Q3022K9859m1604j33253Q9510
16802E596O3771o4475j4570l5480J165n4684k3216j8739K034L9764L8877M232
16790e5725m627k2856L3774L3532L3100k8993K3150K5632l2380m2129K0114N4567
16778C7159p455N3964L5377K8911L9646k9702p6324n0804l1683o6744l6653Q7329
16766a6979N5143M348O1701q0480l847O9337l2723j05664n2551K3063m5572J205
16754a23019m262k5141L0478J00197J33620N937o1564j04812o8493N4261O5571
$$ plain form
16836 -124446 -120280 -90184 -24333 5251 -89937 -116426 -156118 -177431 -144874 -69787 -8035 -52013
16824 -52013 -4052 38153 -776 31803 62289 94029 63335 -78958 -15331 -31797 -112427
16813 -112427 -82612 -59903 -28642 1880 -31511 -21938 61084 90943 49339 -83914 5596
16802 5596 69367 4892 -9678 -45158 -43993 -98677 -121893 -140632 -138598 -98834 -59957 -55725
16790 -55725 -60352 -83208 -49434 -15902 17198 -11795 11355 36987 4607 -37522 -17408 37159
16778 37159 29704 83668 119045 147956 187602 157900 81576 30772 -911 -67655 -104308 -16979
16766 -16979 38164 42512 104213 23733 19886 89223 56500 -49164 -101715 -78652 -124224 -123019
16754 -123019 -127281 -152422 -121944 -21747 111873 117810 56246 -48566 -117059 -62798 2773
16743B773N7332o9949k7843R5953P7229j24852l6162J46542Q6763k0738n7252
16732A29796r8656J0565J24586J1936j27115l1652L0715j6741m6529m7350N6795
16721c650N2106m6051m0577J7838L2782r1143j39798j3598P5022K1129P802J9030
16709a09108J2399R2401O4855K029j6995k7056o1997O7012M5519J9046P2488K831
16697A63424l3630k3287q3908o3237p84k5600p3082k7639m6268R989O7825N2760
16685h3437K5122m4000l023k599M1443O4606K0566p147J6432K3858j8452L2410
16673F5779K7718m2709o6059n602O3042M6968K3147m1431N732L1399m1505k3214
16661D3265l5907N1212k5766n0580N4396K0124o3730k4457m9601k989j3606m4137
$$ plain form
16743 2773 60105 -9844 -37687 58266 135495 10643 -25519 121023 207786 187048 129796
16732 129796 31140 41705 166291 178227 51112 19460 50175 33434 -13095 -60445 -3650
16721 -3650 48456 2405 -38172 -20334 12448 -78695 -218493 -232091 -157069 -135940 -128138 -109108
16709 -109108 -96709 -4308 60547 62576 45581 18525 -43472 23540 69059 88105 160593 163424
16697 163424 129794 106507 22599 -40638 -41422 -67022 -140104 -167743 -214011 -204022 -136197 -83437
16685 -83437 -58315 -102315 -105338 -107937 -66494 -1888 18678 11531 27963 51821 33369 65779
16673 65779 93497 50788 -15271 -20873 42169 89137 112284 70853 76585 107984 66479 43265
16661 43265 7358 58570 32804 -17776 36620 56744 -6986 -31443 -81044 -84033 -97639 -141776
16649a41776N9281r857k0198L3387L6064r224L0575K3132j2578q1805j3756N5741
16637e1014J5174R0155K4887q672l8241m0082j070P4541n162l3518q121j28657
16625a09780k0124j8243o4576M2932J32994J3878n0596M797K995r2022O59l6465
16613a93551N4857N4048L7975M7225j4801R28m048J3945N5927n824j8547n6555
16601b8421n9435K45l5007N7054N810k7487O2591l4256q770P0069o9129Q9J9632
16588d7015K043j1926N201j3439l2482o0281O2361R6959K1515j4205k0629l7186
16576d9084J2812O856n3177O730P1595l2573Q9246R6280O500j3696l3566p0342
16564C7581j6675j3251m0861k7199K8832M7681L1493L1533m4215m3970Q2040k0246
$$ plain form
16649 -141776 -82495 -92352 -112550 -79163 -43099 -52323 -21748 1384 -11194 -92999 -106755 -51014
16637 -51014 -35840 54315 79202 70530 32289 -7793 -8863 65678 60516 26998 18877 -109780
16625 -109780 -129904 -148147 -212723 -169791 -36797 -22919 -73515 -68718 -65723 -157745 -157086 -193551
16613 -193551 -138694 -84646 -46671 554 -14247 -13319 -17367 -3422 52505 46681 28134 -28421
16601 -28421 -87856 -87611 -122618 -65564 -59754 -87241 -24650 -58906 -67676 2393 -66736 -66647 -47015
16588 -47015 -44972 -56898 -51697 -65136 -97618 -157899 -95538 1421 22936 8731 -11898 -49084
16576 -49084 -36272 -29416 -82593 -75863 -4268 -36841 52405 148685 155185 141489 107923 37581
16564 37581 20906 7655 -33206 -60405 -31573 16108 47601 79134 34919 -9051 72989 52743
16552E2743O6076N4950q8584n7816J6782o6845j12799o8411M3598R6224P425k9791
16540h6448r6345Q2501Q5843K834j9195o5220j9832L1167k4424J7124K7948R7415
16528C3368l7261l0896M5853j9651Q525P0335l1405o3714j7568J03517K4197q472
16516G6828M4331l1547q140o7964m4595o259k1179q9921k9460P4700M8268L0849
16504b4089J1019L595j7664q389L9820j26355m1326J09805N6567N9593l9146p0683
16492d7253Q0338O3852r3888M7854M7049p8213j22826j5965M0447J0117o281j1989
16480h6758O2825k071m9999k2273Q9519N4604q8835o4251k1083O2536O1180K1185
16468A6579m9104P287P8222k5416N1218N3537q1013q0588J4688L4695j6046l3867
$$ plain form
16552 52743 118819 173769 85185 27369 44151 -22694 -135493 -203904 -160306 -64082 -56657 -86448
16540 -86448 -182793 -100292 -14449 -11615 -30810 -96030 -115862 -84695 -109119 -91995 -64047 33368
16528 33368 -3893 -34789 11064 -8587 -62 70273 38868 -24846 -42414 61103 85300 76828
16516 76828 121159 89612 81472 13508 -31087 -37346 -58525 -148446 -177906 -103206 -54938 -24089
16504 -24089 -13070 -9475 -27139 -35528 4292 -122063 -163389 -53584 2983 62576 23430 -47253
16492 -47253 33085 96937 3049 50903 97952 19739 -103087 -119052 -78605 -68488 -74769 -86758
16480 -86758 -23933 -26004 -76003 -98276 -8757 45847 -42988 -107239 -128322 -65786 -4606 16579
16468 16579 -32525 -25238 52984 27568 78786 132323 51310 -29278 -14590 20105 4059 -29808
16456b9808j0752l9968L7819o3952K3142P5522m3132q8135J12434J80139J2367
16445A65676n2683o8259p1529j4554K0598j3655m0630j01013n1036Q9353R9981
16434c7751j6958j2533M1532Q459R033j1830K2655j2827n5701M8406J634N7752
16422D1871J2099k1891K1820r7873O2924J35986p4228q512M0957l8544j11990
16411c7381j0834m823k8144q3100p4116Q0644J13960N9972N2622m7372K4804r6560
16399e0328m6520P338o030L0136L8732p5392m5697J10551R5037m3777q2295J5668
16387e2577L3723L6430k2568l2654l983j0666l134o7611m8090O1136M3689j3124
16375g9429o08L2204l5029m9975R1430Q3242j2873p0033n0436K4219Q3935l3484
$$ plain form
16456 -29808 -40560 -80528 -42709 -106661 -83519 -7997 -51129 -139264 -26830 153309 165676
16445 165676 112993 44734 -26795 -41349 -20751 -34406 -75036 -176049 -227085 -137732 -37751
16434 -37751 -54709 -67242 -25710 -17251 -8218 -20048 2607 -10220 -65921 -17515 -15881 41871
16422 41871 53970 32079 53899 -43974 18950 154936 80708 72196 113153 74609 -37381
16411 -37381 -48215 -53038 -81182 -164282 -238398 -157754 -43794 16178 68800 21428 46232 -50328
16399 -50328 -96848 -89510 -95540 -65404 -26672 -102064 -147761 -37210 57827 14050 -68245 -52577
16387 -52577 -18854 17576 -4992 -37646 -41629 -52295 -55429 -123040 -171130 -109994 -66305 -79429
16375 -79429 -80037 -47833 -82862 -132837 -41407 41835 28962 -41071 -91507 -67288 16647 -16837
16363a6837k9952L0000m6350Q107j9703j10309k3211L9542N9867O0643L4719L3389
16351A9905k752J2571m4705l874m6963K6611l1915Q8796M7119N1599L3215o5047
16339H4560l7970K217n661J09116Q1007k8135j20746n7519j4654p1597O0750Q4746
16327H6114l72k0413N2976N7530p2512l0540q881p6929r953N88N4102j8001j3898
16314a89J26210k1302o3768L4509n2585p6525n2677m0771Q1690Q2182K5643J1048
16302E3465j8965j0364M9519j5093n5948k5650L6746m6818r8752J8361l3647k1287
16290a68433J12006O1245L3143R628o0159N7930j869j6030l970m5573L2006m4755
16278c4831j6251l5527l7098j1335O8295N5546l6096L3837Q8056N4327Q34m4528
$$ plain form
16363 -16837 -46789 -16789 -63139 -55032 -74735 -185044 -208255 -168713 -108846 -48203 -13484 19905
16351 19905 17153 29724 -14981 -18855 -65818 -39207 -71122 17674 64793 116392 149607 84560
16339 84560 46590 48807 43146 152262 233269 205134 84388 26869 12215 -59382 1368 86114
16327 86114 85742 65329 118305 175835 103323 72783 63902 -13027 -22980 -22392 31710 13709 -189
16314 -189 126021 104719 40951 75460 22875 -53650 -106327 -147098 -65408 16774 42417 53465
16302 53465 34500 24136 73655 58562 2614 -23036 13710 -33108 -131860 -113499 -147146 -168433
16290 -168433 -56427 4818 37961 47589 -12570 45360 43491 27461 23491 -22082 9924 -34831
16278 -34831 -51082 -86609 -123707 -135042 -66747 -11201 -47297 -13460 74596 128923 129757 85229
16266H5229L0714m1635o5049J1747k3125l2895k0101l4445k4533k8028n2153K4208
16254a70066N1353L8976Q2160L7739l3997M280L1193N3979o485m3860n5072m6344
16242e6144M0451N1389k5335l8000P265J00407K8401L631m7517p0732P2097N3322
16230A19235p7364p7553l6021N7810N5739L691j6328p0791L5836J1997m9357o7774
16218a10880K6330P6703K1934J9363M1992L1635l4707N1970k6011k0174q118o2528
16206G509n491k6148n385N7321j6824k1293N6017j6593k3966k8714j1143J824
16194c2886K8642R349j5140j1633o72n1757m4967L1986O685M3619J6252m6113
16182f6635n5442P6199Q8071J9368p5874q164J35350P3488o4294m1965J7652J0135
$$ plain form
16266 85229 115943 74308 9259 21006 -2119 -35014 -55115 -89560 -114093 -142121 -194274 -170066
16254 -170066 -118713 -79737 2423 40162 6165 10445 41638 95617 89132 45272 -9800 -56144
16242 -56144 -15693 35696 10361 -27639 -20374 80033 108434 112065 64548 -6184 65913 119235
16230 119235 41871 -35682 -71703 -13893 41846 45537 29209 -41582 -5746 6251 -43106 -110880
16218 -110880 -84550 -7847 14087 33450 75442 107077 72370 124340 98329 78155 70037 7509
16206 7509 2018 -24130 -29515 27806 10982 -10311 45706 29113 5147 -23567 -34710 -32886
16194 -32886 -4244 5105 -10035 -21668 -22340 -74097 -119064 -87078 -80393 -36774 -20522 -66635
16182 -66635 -122077 -45878 42193 61561 -14313 -22477 112873 186361 122067 80102 97754 107889
16170A07889j4278k0052L9263J4598n8877k2305p15j28649o4906R249M0397M4516
16158e3870M0754r519J5783n2675k2673O0915n8740J7031o735M360m7447M0716
16146g2100P4022L7689m2831m1279k6658l8450n4867N6403J3556L2396M4360J9272
16134A513J8339m0466k5896k3823J2598O9547Q287p8654K4830Q2704M7249m037
16122I2191m7160m7788j066O710O2609L141j7944q2588l5294Q0008k0872J2158
16110D105r312r0485q8378j5916K3844K1050L500K2026m4878K7087K4318m1957
16098a64996J7216n350Q1085Q0414Q879r394K357m6524M8332k0891Q012o6073
16086f6933M9346Q5061k8518r5848l3230L2866L7403L6319N1581P1524l9424l602
$$ plain form
16170 107889 93611 73559 112822 127420 68543 46238 45523 -83126 -148032 -138783 -98386 -53870
16158 -53870 -13116 -22635 -6852 -59527 -82200 -21285 -80025 -62994 -69729 -65369 -112816 -72100
16146 -72100 1922 39611 -3220 -44499 -71157 -109607 -164474 -108071 -94515 -62119 -17759 1513
16134 1513 19852 -20614 -46510 -70333 -57735 11812 20099 -58555 -33725 48979 96228 92191
16122 92191 45031 -2757 -3823 2887 65496 68637 50693 -31895 -67189 12819 -8053 4105
16110 4105 -5207 -95692 -184070 -199986 -176142 -155092 -151592 -129566 -174444 -147357 -123039 -164996
16098 -164996 -147780 -153130 -72045 8369 17248 7854 10211 -36313 12019 -8872 -860 -66933
16086 -66933 -17587 67474 38956 -56892 -90122 -57256 -19853 16466 68047 139571 100147 96545
16074I6545k6501k8010L8232l8903m8378p4680K4835L5165K80j4372o86J1043
16062b5430N8949K9443m6o2001J111M5046K3013j8742m3170L134p7J5464L0035
16049E6729M2103k8575q9660m7353O9579N8584j5227J7694m4990Q704k1510n2200
16037d6122R746m473l5304L5381Q553J655R010l3510P9310M2624N9832n0355m9839
16024B6508J0703m1175j8495P2637j9523j5826p2897o358J3996L1515J15637J7614
16012A14336k3369l7970P459K2889o057N522l8498N5307m8479p0882Q1405Q4018
16000A45681l7035j22316J7233N1126j0848J572j05848L1879P4714j968p6434
15989c2244m8854N3858N2978k3875K704R4072m158j01865o3457K8169k3620K6466
$$ plain form
16074 96545 70044 42034 80266 41363 -7015 -81695 -56860 -21695 -21415 -35787 -36473 -25430
16062 -25430 33519 62962 62916 915 2026 47072 70085 51343 8173 11307 11230 26694 56729
16049 56729 98832 70257 -19403 -66756 2823 61407 46180 63874 18884 27588 6078 -46122
16037 -46122 -36376 -40849 -76153 -40772 -32219 -30564 -21554 -55064 24246 66870 126702 76347 26508
16024 26508 37211 -3964 -22459 50178 30655 14829 -58068 -64426 -50430 -18915 96722 114336
16012 114336 90967 52997 60456 83345 77288 82810 44312 99619 51140 -19742 61663 145681
16000 145681 108646 -13670 3563 54689 43841 45413 -60435 -28556 46158 44190 -32244
15989 -32244 -81098 -27240 25738 1863 4567 98639 94481 -7384 -70841 -42672 -66292 -39826
15977c9826m9897N0919L4395o8319n5208L1077L262M2202P4591m5314L6L0030
15965G948Q4171L4487Q363n2001q5109j03834k321K5041O5063K7819k4183J184
15953a3372k0410J9526n9873m3813K8173M988M0198J20514K956o5289k0121j2842
15941a9365K274K146L1189p3960m038N4736N7686m25o1368L3509R284N4290J5219
15928A01177l0583J1498l0488j4187M4828j8155l3434l3180o3379j18007J056
15917a82854M0762Q4068Q433J104N9413l4344J4257j071k448K6721m811p4353
15905f5123l9278P1687Q0967J094M7374o4106l1723Q5652k4155J0775m6317k0463
15893F384O8022L3577m3415N0967J9932P957K3693j5173l2582j3785K9031O0021
$$ plain form
15977 -39826 -89723 -38804 -4409 -72728 -127936 -96859 -93597 -51395 23196 -22118 -22082 7948
15965 7948 92119 126606 134969 82968 -2141 -105975 -108296 -83255 -18192 9627 -14556 -13372
15953 -13372 -33782 -14256 -74129 -117942 -89769 -84781 -44583 75931 78887 13598 -6523 -19365
15941 -19365 -17091 -14945 16244 -57716 -61754 -7018 50668 50243 -11125 22384 31668 85958 101177
15928 101177 70594 82092 51604 37417 82245 64090 30656 -2524 -65903 -183910 -182854
15917 -182854 -142092 -58024 -49591 -48487 10926 -23418 -9161 -10232 -12680 14041 9230 -65123
15905 -65123 -104401 -32714 48253 49347 96721 32615 892 86544 62389 73164 26847 6384
15893 6384 74406 107983 64568 115535 135467 143424 167117 151944 119362 105577 134608 194629
15881A94629k0484q8418l3608R135P623O194r648l5347J249J32104J3191j08621
15869F7999l1500o603j0576K7782o0780M1362J567j1617L1891R464j402O3845
15857A21432j9279J5859j5511L743J9550l0641p8569m2869M9120N9926J4173J6359
15845A13293J7671k2401o1748k8454Q3790J07055o0011k9018m4705l165r9377
15834b7070L8397O3600J967o2914m1786j834L1448n666k4901M1233o5346J5922
15822c6950L4058M1217k3975k2724Q1683K5166q191j0952q6875p6012J7706n363
15810g1212p2854J6770k5944O1306P6690K4758L8393N0954j3396m9967K5286N2094
15798A12878l1251J1877j5700n6490o5358m8150j8654K6823l0101L8959O2433
$$ plain form
15881 194629 174145 85727 52119 61254 68877 75071 65423 30076 31325 163429 176620 67999
15869 67999 36499 29896 19320 47102 -13678 27684 29251 17634 49525 58989 57587 121432
15857 121432 102153 118012 102501 106244 125794 95153 16584 -26285 22835 82761 96934 113293
15845 113293 130964 108563 46815 18361 102151 209206 149195 120177 75472 72307 -27070
15834 -27070 11327 74927 76894 13980 -27806 -29640 1808 -3858 -28759 12474 -52872 -36950
15822 -36950 -2892 38325 14350 -8374 73309 98475 90284 79332 -7543 -83555 -65849 -71212
15810 -71212 -144066 -127296 -153240 -91934 -15244 9514 47907 98861 85465 35498 60784 112878
15798 112878 81627 93504 77804 21314 -44044 -92194 -110848 -84025 -114126 -75167 -12734
15787a2734K2238L4335J1185L7187p667q0659q3939J5948K200q6469k6830R6859
15775g8346J888l8908Q7995L3365Q1493m568o778J5631R517j9513j3536j2896
15763E5344m0413O7630p0783j2181N4562q728p9500Q356K078o1232J2184R6595
15751B3912R0695N739q9587j1017j6207m3201N7181L1898J0390j17264l520m6936
15739a07917L8295M5606M7483k4530o579K3621O449m392J9775J3168K4694k2046
15727E3627q3724K799N0993j4991J4230L2936P35K403p0857m4440N6867O9699
15715G0277L1459k813J5646l1925j02314k0436m6312N0846k3594K7575N2747k8165
15703g009R2358j0926j27386k550M0922J8083K4301n8909M477k7999O7825J44837
$$ plain form
15787 -12734 9504 43839 55024 92211 84544 3885 -80054 -64106 -61906 -148375 -175205 -78346
15775 -78346 -76458 -115366 -27371 5994 87487 82919 76141 91772 101289 81776 68240 55344
15763 55344 14931 82561 11778 -403 54159 45431 -34069 -25713 -23635 -84867 -72683 23912
15751 23912 114607 120346 30759 19742 3535 -39666 17515 49413 59803 -57461 -60981 -107917
15739 -107917 -69622 -24016 23467 -1063 -7642 15979 22428 18036 37811 50979 75673 53627
15727 53627 -30097 -27298 23695 8704 22934 55870 56605 59008 -11849 -56289 578 70277
15715 70277 101736 98923 114569 82644 -19670 -40106 -86418 -35572 -59166 -31591 21156 -7009
15703 -7009 85349 74423 -52963 -55513 -14591 3492 27793 -31116 -26639 -54638 13187 158024
15691A58024M228r7506o3126R492m3358j09196J7783J36255P6598J599O368O5558
15679A62719q3144j55370k9158j01809J5305P4786R172P9355K9454J2010l1972
15668a8652L4751J8008k8518K3914L3927j1942K4976j5012m4863o372j2584m742
15656g109L6802k9246l2486J4614k621q119j0679N04K062N5232K6070J03890J5452
15643A64366l6503K6822j921o5391j00964j02832O392P2362j5641n1707q0137
15632a85154P2914J8397K3551L1443n8323K7863m5627j4862N5594P5631l726N0788
15620D8489j5697O3824K6901p034j05420m0867J03p83j9609k3181l9345J09117
15608c502J01254p590k7067J3860r887N1158O6472l7921o5040M068j9327o1435
$$ plain form
15691 158024 162252 64746 1620 11112 -32246 -141442 -123659 12596 89194 90793 97161 162719
15679 162719 79575 -75795 -104953 -206762 -191457 -116671 -107499 -28144 1310 13320 -18652
15668 -18652 16099 34107 5589 29503 63430 51488 76464 61452 16589 10217 -2367 -7109
15656 -7109 29693 447 -32039 -17425 -20046 -28165 -38844 -38340 -36278 18954 45024 148914 164366
15643 164366 127863 154685 152764 87373 -13591 -116423 -110031 -37669 -53310 -105017 -185154
15632 -185154 -112240 -93843 -70292 -38849 -97172 -69309 -114936 -129798 -74204 1427 -2299 48489
15620 48489 32792 96616 123517 116483 11063 -29804 -29701 -30484 -50093 -73274 -112619 -3502
15608 -3502 97752 90162 63095 76955 67068 118226 184698 146777 81737 85805 66478 5043
15596E043l6628n2680M0065K5599K9090n4103m5741k5829K717R442j9083j4280
15584a36388J8021J8255n738L764J8902L6182N658l6845P3031L9345K8027p4746
15572a2532p0520m5681J9902K8175M0880m4241L381L5994K8615L2137n852j8206
15560g948L6913j2087N77N4909K3465M3n6009m2037o2939j1909P7510N7656j6684
15547D1460n7255l3809m0975J1743m3035J8594K1095J1756K3483J04221K0300
15536G7578r8376n3593j0354J44817L9994J4099K4943j988N2066O6782j19910
15525A36058j21443p1762r931M7070L961m2768L2973n1507p7472r876P5410R4415
15513E128K5269K5975J4110j6990J421j4285m2361r4922L2317N5971k1853j8054
$$ plain form
15596 5043 -31585 -84265 -44200 -18601 10489 -43614 -89355 -115184 -112467 -103025 -122108 -136388
15584 -136388 -118367 -100112 -105850 -102086 -83184 -47002 -41344 -78189 -5158 34187 62214 -12532
15572 -12532 -83052 -128733 -108831 -80656 -39776 -84017 -80636 -44642 -16027 16110 10258 -7948
15560 -7948 28965 16878 17455 72364 95829 95872 39863 -2174 -65113 -77022 488 58144 41460
15547 41460 -15795 -49604 -90579 -78836 -121871 -103277 -82182 -70426 -46943 57278 77578
15536 77578 -20798 -74391 -84745 60072 100066 114165 139108 137120 189186 255968 136058
15525 136058 14615 -57147 -67078 -20008 -16047 -58815 -25842 -77349 -154821 -164697 -89287 5128
15513 5128 30397 56372 70482 53492 54913 40628 -1733 -96655 -64338 -8367 -30220 -48274
15501d8274L3259P8515k6728K1285k0025J4280l1226L7958K1718l7977r9918l7242
15489i4375o5532l197J6422K8417L9500L5080P744K1753J1052r650J1347O3027
15477F1588n5684o5697J0397P0011K5781J877j5100l9082P295l1040q366j0621
15465d8641R508k2387K9701R4204J0396l5647K221K4626n9911o9122L4525j7115
15453d7642N733O4231N3125j35733N539j5133L0137M7536J03634M9170o4731N915
15441A01781N5406q3623j86782n1543O1471l9605k1163Q0407k8484l4237K1087
15430a25285O2639m8959L4532J8069J5106o9213O6937P4677J0127j9072M2071
15419F1629n9890j04326L7162J8071K4475K9403N0229l6763m2998l2257L2686
$$ plain form
15501 -48274 -15015 63500 36772 58057 38032 52312 21086 59044 80762 42785 -57133 -94375
15489 -94375 -159907 -163104 -146682 -118265 -78765 -43685 -35941 -14188 -3136 -12786 -1439 61588
15477 61588 5904 -59793 -49396 20615 46396 48273 33173 -5909 1386 -29654 -38020 -48641
15465 -48641 -39133 -61520 -31819 62385 72781 37134 39355 63981 4070 -65052 -30527 -47642
15453 -47642 -41909 22322 75447 -60286 -54747 -69880 -39743 7793 111427 160597 95866 101781
15441 101781 157187 73564 -113218 -164761 -103290 -142895 -164058 -83651 -112135 -146372 -125285
15430 -125285 -62646 -111605 -77073 -59004 -43898 -113111 -46174 28503 38630 19558 61629
15419 61629 1739 -102587 -65425 -47354 -22879 6524 56753 19990 -23008 -55265 -22579
15408b2579R1154J3046k1948m1897k5557l0066O8603P5354J0192j83k8992n4671
15396C2456m3841l2736K6927m9170m4621M2461P1647L6761l3334m1201l9734m7134
15384a21519N0606J73099m2159q2198j1698j6294n7370K2229Q2914J1141J3006
15373B1757P9034J2801k7666j6616k1388K6817j2200M8468l399q5734p3888P839
15361d4175R4779N6086k7928j4960j13200l6967Q4511J55791q3356k7846L3982
15350G6717l7440r7261L9645L7542j9683J4362l3014J221K0102L8944j0354O0670
15338I1451J523r3k8806r172m949o537M6919l3650p4187k5377J59456O9848k7513
15325A58913n0058q6399K2257K5675n5569p5524J8671O6352q486k8962O9056Q047
$$ plain form
15408 -22579 68575 81621 59673 17776 -7781 -37847 30756 106110 116302 116119 87127 32456
15396 32456 -11385 -44121 -17194 -66364 -110985 -68524 3123 39884 6550 -34651 -74385 -121519
15384 -121519 -70913 102186 60027 -22171 -33869 -50163 -107533 -85304 -2390 8751 21757
15373 21757 100791 113592 85926 69310 47922 74739 62539 111007 107608 21874 -52014 -44175
15361 -44175 50604 106690 78762 63802 -49398 -86365 -1854 153937 70581 42735 76717
15350 76717 39277 -57984 -18339 19203 -480 13882 -19132 -17911 2191 41135 30781 91451
15338 91451 92974 92881 64075 54903 49954 43417 90336 56686 -17501 -42878 116578 186426 158913
15325 158913 108855 22456 44713 70388 14819 -60705 -42034 24318 15832 -13130 55926 63973
15313F3973N9995j4294o8646r7222j20412K6377K2667J8000M531l0517l7109l4592
15301b07249k7450P7649P7854L3503J09597M2008p5941K1225k5900o9503n3479
15290i7686K4642j5120K6496J07529K2969j47004j45229K5814R1897L1335j5029
15279h9386O4459J4047j7296r2357j3800M4827K3172l6972l2281o435J06493J6840
15267a8689L9198k8993L3334L0084k0645n8608M9754k8290r560J7260Q16J9679
15255B5340n630o2386K1617k6848J2191O892L2948l019j8189L7562K8301l0195
15243A8584K3937L998J2826n0451o7769p348N0819k3446n5126K8759o5988L9938
15231i1267K0256O7363m7536L4136O5268L2707L8004K3349j5160N7682k3771r0091
$$ plain form
15313 63973 123968 109674 41028 -56194 -176606 -150229 -127562 -109562 -105031 -135548 -172657 -207249
15301 -207249 -234699 -157050 -79196 -45693 63904 105912 29971 51196 25296 -44207 -97686
15290 -97686 -73044 -88164 -61668 45861 68830 -78174 -223403 -197589 -105692 -74357 -89386
15279 -89386 -24927 -10880 -28176 -120533 -134333 -89506 -66334 -103306 -135587 -142022 -35529 -18689
15267 -18689 20509 -8484 24850 54934 34289 -24319 25435 -2855 -12415 4845 5661 25340
15255 25340 19710 -42676 -21059 -47907 -35716 -28824 4124 1105 -17084 20478 48779 18584
15243 18584 42521 46519 59345 8894 -58875 -66223 -15404 -38850 -93976 -65217 -131205 -91267
15231 -91267 -71011 -3648 -51184 -17048 48220 80927 118931 142280 127120 184802 161031 70940
15219G0940o5552n9667j7087K4324M5785K6573Q043J5786Q042k1277l8937p429
15207a0456n589J4578m7619l1921k5279N1505J8473K1468M2971J6060L3179L2122
15195A09492p3307p2391k5518k2559l267m2235L6851J20014O6713p0633q3518
15184f0358O1640m8130O1987Q3360K0228l8461p8136o4555o1104O0892K3150N77
15172c8910o7614J4554N6011O827n8708q863J5637k2513o0545L668P3709N078
15160h1669P0414q554N9363O0399m6273q7665k9781j1891l7166l0869J13380K6201
15148d111N2383j3831j14545q0002l647P1626N2122R2442M6398k8035P4345p2210
15136G2935j12988K0535K2335Q6114K7882o9160j6167M8334m9007l4725j2752
$$ plain form
15219 70940 5388 -54279 -71366 -47042 -1257 25316 33359 49145 57187 35910 -3027 -10456
15207 -10456 -16045 -1467 -49086 -81007 -106286 -54781 -36308 -14840 28131 44191 77370 109492
15195 109492 36185 -36206 -61724 -84283 -87550 -129785 -92934 27080 93793 23160 -60358
15184 -60358 1282 -46848 15139 98499 118727 80266 2130 -62425 -123529 -62637 -39487 -38910
15172 -38910 -106524 -91970 -35959 -29132 -87840 -96703 -81066 -103579 -164124 -160456 -86747 -81669
15160 -81669 -11255 -19809 39554 99953 53680 -33985 -63766 -75657 -112823 -143692 -30312 -4111
15148 -4111 48272 34441 -80104 -160106 -163753 -92127 -40005 52437 98835 70800 145145 72935
15136 72935 -40053 -19518 2817 88931 116813 47653 31486 79820 30813 -3912 -16664
15125a6664j883L8616l1728J0848O3228K929j104K9580L6878K697n5628J93N8172
15112A36134k6696o4741l8078L5648m2795m9567j02934j3881J7608J4565l0972
15101a65709j9163Q9435J0634K667N8545J01661n077n9452l0687k9059q343l3709
15089h8257L5838L466N5304L2200p3303J1795Q9786l9511l0413N1219N3128l8934
15077F2318o9380n7772N1388N2240L0012O9135k8669q6688k4130O3183j6369l3242
15065A2026p262Q9257K1989l3724p5733j32715L3372J28252M4492m2355n4452
15054a6853K7396K156L2542n539O0244M1380n8079K9945L9233j2635p2253n9172
15042H365Q4893m874j02821l0611O246n7450K0150j1067O0518q872l948L206k494
$$ plain form
15125 -16664 -18547 20069 -11659 -811 62417 65346 64242 93822 130700 133397 77769 77962 136134
15112 136134 109438 44697 6619 42267 -528 -50095 -153029 -166910 -149302 -134737 -165709
15101 -165709 -184872 -95437 -84803 -82136 -23591 78070 72993 13541 -17146 -46205 -54548 -88257
15089 -88257 -52419 -48953 6351 38551 -34752 -22957 66829 27318 -3095 48124 101252 62318
15077 62318 -7062 -64834 -13446 38794 68806 137941 109272 22584 -1546 61637 45268 12026
15065 12026 4764 94021 116010 82286 6553 -126162 -92790 35462 79954 37599 -16853
15054 -16853 10543 12699 45241 39702 99946 141326 83247 113192 152425 139790 67537 8365
15042 8365 93258 88384 -14437 -45048 -38802 -96252 -76102 -87169 -26651 -35523 -39471 -36265 -38759
15029c8759L562j00068n5269l1652Q1111N94L1998k962j16719N7126J06758Q6696
15017B2416O854j1711q1210M3862R5976m2251n6734n0551k4563O4895r602l5215
15005g7834n2981R4606J36834m2443J7516j8315n7847p0716J4176M0055l242l6958
14993e7149p320Q1690j8008J9447k0319L6030r703l585J2298L0209M42n2730n0935
14980c9633N8670L2556o0240K0323P0628K3716J5324k0906n9072l4310L505O3582
14968G4143j8390p7893l7658j6153J0105k2124p8963L5352R4623O8663J60L5976
14956F7841L0877l9475r3942j7500K8041n3151j4533M5560N7948O7040j0493o0808
14944G405l3324R7790P2334m4384l7819k6060J981J0137j16560k8057J13131K2051
$$ plain form
15029 -38759 -35197 -135265 -190534 -222186 -141075 -140481 -108483 -111445 -228164 -171038 -64280 22416
15017 22416 29270 17559 -63651 -19789 76187 33936 -22798 -73349 -97912 -33017 -42619 -77834
15005 -77834 -130815 -36209 100625 58182 75698 57383 -464 -71180 -57004 -16949 -20191 -57149
14993 -57149 -64469 17221 -787 18660 -1659 34371 24668 21083 33381 63590 64032 11302 -39633
14980 -39633 19037 51593 -8647 11676 82304 106020 121344 100438 41366 7056 10561 74143
14968 74143 55753 -22140 -59798 -75951 -65846 -87970 -166933 -131581 -36958 31705 31865 67841
14956 67841 98718 59243 -34699 -52199 -24158 -77309 -91842 -46282 11666 78706 68213 7405
14944 7405 -25919 71871 144205 99821 62002 35942 37923 48060 -68500 -96557 16574 38625
14932C8625n235j27341q8924k9005L0214M2625Q9201l5513k6136j4758L6274M3257
14920d6716P3564J6668K2028l005q6770r45j1910o407m0240m2298M1719l331j7968
14907a05611L5946j6859M1579P6587J12991Q7074J5993j10328m7076p096q6604
14896c404j38573O6877Q8988L5598p3p9435J5391l9491O2133N496J6267K2816
14884E2590J0341p7727k9886m5067K6270O907Q3758Q177l0493L6412O8313m9345
14872F0250N0831k0078j21715m189j8921M3203L6653M8321q661j1982K6017n6307
14860B3422n9930O2807L6495J08436J08692o5044M0702J20674J32936J53693J13001
14849G75884N3459J56763j11196j71566r2364L2769m7200q7835k4706o1858j7382
$$ plain form
14932 38625 33390 -93951 -182875 -211880 -181666 -139041 -49840 -85353 -111489 -126247 -89973 -46716
14920 -46716 26848 43516 65544 62539 -24231 -25176 -37086 -43493 -83733 -126031 -84312 -87643 -105611
14907 -105611 -69665 -86524 -44945 31642 144633 231707 247700 137372 90296 83200 -3404
14896 -3404 -141977 -75100 13888 49486 49413 -30022 -14631 -54122 8011 13507 29774 52590
14884 52590 62931 -14796 -44682 -89749 -63479 -56572 27186 35363 4870 41282 109595 60250
14872 60250 111081 91003 -30712 -34901 -53822 -10619 26034 74355 65694 53712 79729 23422
14860 23422 -36508 26299 62794 171230 279922 214878 255580 376254 509190 662883 775884
14849 775884 829343 986106 874910 703344 610980 643749 596549 508714 484008 422150 404768
14838D04768o4920j32776q0785p5196L4233k7506n723r216n6335m4888N1008Q9394
14826H2058o271J7972K4511l1809q2480K7958P6327M0141N848J5037o5242p7801
14814B6249M2465R12j0519P260m1471m4465m9244l8229N8035J05314P8142O2585
14802A97034l7039k3366j01210p3582m4149L1648L7880M6793k6044m3292N9692
14791B4365K6826P1430N8837l9580J1505r4586j00471r62J02312J12535P1k2753
14779A49529N3830k6791k0378l3489j0480j7272n6182l3532M0765m4043l6907
14768c4950R7326q621o7021P910O074m6407o3279O4212N3335K6627k3022r770
14756B414J1445Q4824m0404K2027j5344n0618N5113K5394l4617j8109K5540O4463
$$ plain form
14838 404768 339848 207072 126287 51091 85324 57818 52095 42879 -13456 -58344 -7336 82058
14826 82058 75787 93759 118270 86461 3981 31939 108266 148407 154255 169292 104050 26249
14814 26249 68714 69626 59107 66367 24896 -19569 -68813 -107042 -49007 56307 134449 197034
14802 197034 159995 136629 35419 -38163 -82312 -50664 -12784 34009 7965 -35327 24365
14791 24365 51191 122621 181458 141878 153383 58797 -41674 -42636 59676 172211 172282 149529
14779 149529 203359 176568 156190 122701 112221 94949 38767 5235 46000 1957 -34950
14768 -34950 62376 53755 -13266 -5356 718 -45689 -108968 -44756 8579 35206 12184 2414
14756 2414 13859 98683 58279 80306 64962 14344 69457 94851 60234 42125 67665 132128
14744A32128K2721n0580O6992l6354j25292k5499K4285q0236o047k2304Q6065
14733a4121N3628L0872L4338O3964l6373p9656o7077Q6901P8936l0847r2889n6156
14721b8480q194r1M7179Q2333J9238o1070k8040P1284r850p8106M0348r984q1308
14708d4741J2693M8020m5733l6483o7989L657L4653R4013O1293q9242n089O2162
14696B7214j0345j2268J9733M4773j5870p2640M7792O8542k443j9371n6838l2288
14684a4009k45K1917K017p4341k5110p6043N2462P2621M2662n3006l3559J7157
14672f7477L9247J5982L3643Q1727l2685L754k7806l4906j6619M9661L2425j9272
14660E7674K4081m1499j3019L139l0850k4331J5825M9990Q1870j3474j8013m6292
$$ plain form
14744 132128 154849 104269 171261 134907 9615 -15884 8401 -71835 -77882 -100186 -14121
14733 -14121 39507 70379 104717 168681 132308 52652 -14425 72476 151412 120565 27676 -28480
14721 -28480 -36674 -36765 10414 92747 111985 50915 22875 94159 84309 6203 46551 36567 -44741
14708 -44741 -32048 15972 -29761 -66244 -134233 -130576 -95923 -1910 59383 -29859 -34948 27214
14696 27214 16869 4601 24334 69107 53237 -19403 28389 96931 94488 75117 18279 -14009
14684 -14009 -14254 7663 9680 -64661 -89771 -165814 -113352 -40731 1931 -51075 -84634 -67477
14672 -67477 -28230 -12248 21395 103122 70437 74191 46385 11479 -5140 44521 76946 57674
14660 57674 81755 40256 27237 30376 -474 -24805 -8980 41010 122880 109406 91393 45101
14648D5101J2970M3862l0969J3009m2915K460n5035k1815L9769Q617k9427j1066
14636b5439O482O3321o1641k3788J01976M4286p9136k6478J2409Q889J7706l5366
14624C221l497j8469M3814m6883n7422N4859L4428P1079L6430o3012m6092l0037
14612b1581O8431O667n1149k4742M2414O0790j31017p6217J02168J231l0981L2930
14600b1056L2532j18256r709M0887l6662L4002J5835m5081P1479L6250l9529m4653
14588h3961P1883K533p7616j2985N4628P4748m4118K3760r381O538l5664J1476
14576a8159M888M1219N4235R7646j9786n7754J7740j7180j3763J7309o7598l9472
14564f75L3081K3749K9745M7501m0576O3345r188r5426J0158k4400j9631k697
$$ plain form
14648 45101 58071 101933 70964 83973 41058 43518 -11517 -33332 6437 15054 -14373 -25439
14636 -25439 -18957 44364 -17277 -41065 60911 105197 26061 -417 11992 20881 38587 3221
14624 3221 -276 -18745 25069 -21814 -79236 -24377 10051 81130 117560 54548 8456 -21581
14612 -21581 46850 53517 2368 -22374 20040 80830 -50187 -126404 -24236 -23005 -53986 -21056
14600 -21056 11476 -106780 -116489 -75602 -112264 -78262 -62427 -107508 -36029 221 -39308 -83961
14588 -83961 -12078 -9545 -87161 -100146 -45518 29230 -14888 8872 -509 6029 -29635 -18159
14576 -18159 -13271 27948 82183 179829 160043 102289 120029 102849 89086 106395 38797 -675
14564 -675 32406 56155 85900 133401 92825 156170 146982 51556 61714 37314 17683 14986
14552A4986n7862L7012P2347L9380o4865O100m4779o6405j2881L4552k0627M5737
14540a7305J45394j0491p2856o1547k3270q793Q857M473j7940l0458P954P7248
14528A266R2948P0988j8243q7596j8504j7464K5387j239n892J12079J9076j04262
14516F8544j17224P4501N9531M198p7625p1910N7947O9888J1034p1287m420P5389
14504G8566l3199j3385p7764P9185M1717p9723k1318J13716m16j04836R8675R6587
14492A77805m4668m0428n1007L667N985L4825L1786M3074j9300n2936k9373j5520
14480D3910o8373n8413P9238P5245O2465l491p0197r4489l4052K6560R5014k2128
14468C1289l4989l3006l1495K6006R9683l3112l2670l0279j3807L9669J03582
$$ plain form
14552 14986 -42876 -5864 66483 105863 40998 47098 2319 -64086 -76967 -42415 -63042 -17305
14540 -17305 128089 117598 44742 -16805 -40075 -48868 -40011 -35538 -53478 -83936 -75982 1266
14528 1266 94214 165202 146959 59363 40859 23395 48782 47543 41651 153730 172806 68544
14516 68544 -48680 25821 85352 89550 11925 -59985 -2038 67850 78884 7597 3177 78566
14504 78566 45367 31982 -45782 33403 75120 -4603 -25921 87795 87379 -17457 81218 177805
14492 177805 133137 92709 41702 45369 51354 86179 117965 161039 141739 88803 59430 43910
14480 43910 -24463 -82876 -3638 71607 134072 130581 60384 -34105 -68157 -41597 53417 31289
14468 31289 -3700 -36706 -68201 -42195 57488 24376 -8294 -38573 -52380 -12711 90871
14457I0871k2699o4559L393J987j7860L3760J4725L0729L8158m0984n2073O8220
14445H3668l1579j00243j8907R7252M6778r211n4347K4899q304k3236k8294q0367
14433a01891m1773J3406N4882L7259M6024L7274N8404J3530l9453m4662J7473
14422E0473n1207J5329j00539j9864J01952M2835K0879l6993j3455J0964M1252
14411F1626K6683J721n4802R854k951m2879N2834j3464K3366O099N3165L59k2231
14398I9380P6139k7216J3248k8411l2816n223k7012p837m6670r7929j30056J0460
14386b03943Q6222N4615L6835n436O2537k4532m5967q98J7097L5561O4015N0949
14374A27055k4365q0492J7278J3742o308K4743K513r8817J1763L9968N9055N7071
$$ plain form
14457 90871 68172 3613 7006 8993 -8867 24893 39618 70347 108505 67521 15448 83668
14445 83668 52089 -48154 -67061 30191 76969 67758 13411 38310 30006 6770 -21524 -101891
14433 -101891 -143664 -130258 -75376 -38117 7907 45181 103585 117115 77662 33000 50473
14422 50473 -734 14595 -85944 -105808 -3856 38979 59858 22865 9410 20374 61626
14411 61626 88309 90030 35228 45082 42131 -748 52086 38622 61988 68087 121252 121611 99380
14398 99380 175519 148303 161551 133140 100324 95101 68089 60252 13582 -84347 -214403 -203943
14386 -203943 -117721 -63106 -26271 -31707 30830 6298 -39669 -40567 -23470 12091 76106 127055
14374 127055 102690 22198 39476 53218 46910 71653 74166 -24651 -12888 27080 86135 143206
14362A43206O772n0811l6294M0681K7271J8770K7758o2605J7096k7661O525K9030
14350A39738n708k2570J10059P1545j279J02167l8059n1277j6896R5965J35373
14339E19058M4366O2156J21347J25911K04617K02361L48492M50033M02933L19862
14329B801136L93598K96356L2028j99113l59379l37607l67109l16508l41544k40458
14319A361400n6377j18445k42987j26338l209o9271j27619j26732N8698N4190
14309F03310j2950k3358k0997j30317j20266m7038P978O2959o419n7002O3681
14298C19581j7460m2383m0771L6053r1136m7728n4020J7264J8929Q4823L3699
14287B16851n3178N841j5487l5904J454K9807O008o2815n051L963M1925L3650
$$ plain form
14362 143206 149978 99167 62873 103554 130825 149595 177353 114748 131844 104183 110708 139738
14350 139738 134030 111460 221519 293064 291785 393952 355893 304616 287720 383685 519058
14339 519058 563424 625580 746927 872838 1077455 1279816 1628308 2078341 2481274 2801136
14329 2801136 3194734 3491090 3523118 3324005 2964626 2627019 2259910 1943402 1601858 1361400
14319 1361400 1305023 1186578 943591 817253 814044 744773 617154 490422 549120 603310
14309 603310 590360 567002 546005 415688 295422 248384 256362 319321 312902 255900 319581
14298 319581 302121 259738 218967 255020 163884 116156 62136 79400 98329 183152 216851
14287 216851 163673 169514 154027 118123 119577 149384 155392 92577 87526 91489 133414 167064
14275A67064M0856p307o2204R4219j3217k8826l9167K8619Q6233m0364n8707o7156
14263A00043M6017k1388r2997K4320O705n1424k6680Q556K8580K5299n3145Q986
14251B872M620L6043L612L9041l9453l4804J7951n514Q7968n1053k5802J1175
14239D6656l6951l1494J4932O9747N0760j6026m0152q0888j0272m9644j2255K5334
14227g0253N2018L5054M4417J0310k9883k3968l6590q999m3389M1844k5202J0049
14215d4592j2782j3072M5495L2762N2268k7571q6489l9182Q1852l1599M4131J1660
14203A2881L5809K3451P7247q3314q6668k3935L1257J32176o3021l4952O367k5126
14191B172J2331K9767m1707j1520k7804N5349l9678o0495J6599P5972R6157o9082
$$ plain form
14275 167064 207920 200613 138409 232628 219411 190585 151418 180037 266270 225906 167199 100043
14263 100043 146060 124672 31675 55995 62700 11276 -15404 -6848 21732 47031 -6114 2872
14251 2872 7492 43535 47147 86188 46735 11931 29882 24368 112336 61283 35481 46656
14239 46656 9705 -21789 -6857 62890 113650 97624 57472 -23416 -33688 -83332 -95587 -70253
14227 -70253 -18235 16819 61236 71546 41663 17695 -18895 -27894 -71283 -29439 -54641 -44592
14215 -44592 -57374 -70446 -24951 7811 60079 32508 -53981 -93163 -11311 -42910 1221 12881
14203 12881 48690 72141 149388 66074 -20594 -44529 -13272 118904 55883 20931 27298 2172
14191 2172 14503 44270 2563 -8957 -36761 18588 -21090 -81585 -64986 10986 107143 38061
14179C8061J7377P7802K9625q5011r6401l8994J2748P1271l2812N303j0702q7620
14167i9353k0676J26460P4170N082n9595M3126K9026M9729o7042m3926j1886M961
14155C0076l8068m4989J15P2986J9348J8923K3854L7688K7231o2643p4245l192
14143G084R722M113P6841p7915m0587N1329n187k4068l5757R678N6645N7137j1862
14130G7173l9428n1186J4370J189m8184P24L5295L1045M3264l0652K8222l5362
14118B6470k5174N4474n6626l3537n3452j13999M3538P0200L7940J6867O9196
14107C5897m4903q5200K2913N3728N7626P7918J9073J2614J3923o3986j42976
14096d3373n5333J12487J6718J8359j5091k8722P894l2415j1873M0965J3223n2672
$$ plain form
14179 38061 55438 133240 162865 77854 -18547 -57541 -44793 26478 -6334 -1031 -11733 -99353
14167 -99353 -120029 6431 80601 85683 26088 69214 98240 147969 80927 37001 25115 30076
14155 30076 -7992 -52981 -52866 20120 39468 58391 82245 119933 147164 84521 10276 7084
14143 7084 16806 20919 97760 19845 -20742 30587 25400 1332 -34425 -24747 31898 89035 77173
14130 77173 37745 -13441 929 2118 -46066 -45342 -10047 20998 64262 33610 61832 26470
14118 26470 1296 55770 -856 -34393 -87845 -201844 -158306 -88106 -50166 -33299 35897
14107 35897 -9006 -94206 -71293 -17565 40061 117979 137052 149666 163589 99603 -43373
14096 -43373 -98706 13781 30499 48858 33767 5045 12939 -19476 -31349 9616 22839 -29833
14084b9833J3513O7623P5539l2671l0788K1829k9002m1949O5768k1633r1330J1554
14072b1380l1327m1669N2897R8465l3597k0839N463j9556m6030p1176j068P8785
14060e1032k439L312O9929J0377l1193q0707L046J3303N0849q453J1361J1464
14048a83m1669M0659K198L9926j8076k427K5800l9700r4193l2945O7326l6361
14036h9645l1301j7568L8189J59309O7532p9116q6473n5502n8789J25801P690
14025a9873m294O6890K5923k6261j36758k2715L6645n7062J7323J32471j21093
14014a08804M8377P8562l7056m2750J2593N9742l0966J9487O5023j0862m6180
14003G166L6359J8801n926M1555L6322n7524m2338o9284j6050n2381k4749M432
$$ plain form
14084 -29833 -16320 51303 126842 94171 63383 85212 56210 14261 80029 58396 -32934 -21380
14072 -21380 -52707 -94376 -41479 56986 23389 2550 8013 -11543 -57573 -128749 -129817 -51032
14060 -51032 -53471 -50159 19770 30147 -1046 -81753 -78707 -65404 -14555 -23008 -11647 -183
14048 -183 -41852 -1193 1005 40931 22855 20428 46228 6528 -87665 -120610 -53284 -89645
14036 -89645 -120946 -138514 -100325 58984 126516 47400 -39073 -94575 -153364 -27563 -19873
14025 -19873 -24167 42723 68646 42385 -94373 -117088 -80443 -137505 -120182 12289 -108804
14014 -108804 -60427 18135 -18921 -61671 -49078 10664 -20302 -815 64208 53346 7166
14003 7166 43525 62326 56400 97955 134277 76753 34415 -34869 -50919 -103300 -128049 -123617
13991a23617L5007l6254J00762M0569k1587o7928l0132P5088N5137M0085O3614
13980A30744k8898j50424o7322J09880k750n8236o653k9991m604J10898K935L9509
13968D5088k2436l8465k708j3726L6183k8958L1470L0686k2337l2362p2059K1365
13956f8259O1015J0112O7540j5316r095l1355k1599K9600J6466M9024l4540n4406
13944h13J1085j8176K7148o6039j8102J08363o6359q2817j1091j7936m9784O1186
13932a23335N6920J35365O8566p8241p6164L0413J8563R8923P623l3367m4575
13921F0691l3328K4848O5670O073o7866j7832l6257o7887Q0251K7624o948j0432
13909B4607L5956n924j0804j0642L1271k321o2101j09326J8784L5943J11971M6492
$$ plain form
13991 -123617 -88610 -124864 -24102 16467 -5120 -73048 -103180 -28092 27045 67130 130744
13980 130744 101846 -48578 -115900 -6020 -8770 -67006 -73659 -103650 -108254 2644 5579 45088
13968 45088 22652 -15813 -18521 -32247 3936 -25022 6448 37134 14797 -17565 -89624 -68259
13956 -68259 -7244 2868 70408 55092 45997 14642 -6957 22643 39109 88133 53593 -813
13944 -813 10272 -7904 19244 -46795 -64897 43466 -22893 -105710 -116801 -134737 -184521 -123335
13932 -123335 -66415 68950 137516 59275 -16889 13524 32087 131010 138633 105266 60691
13921 60691 27363 52211 117881 123954 56088 38256 1999 -65888 14363 41987 35039 24607
13909 24607 60563 54639 43835 33193 64464 62143 42 -109284 -90500 -54557 57414 103906
13897A03906p3099k4350O8579K736N72j5452m2281m3483m6726k2791O2882M2441
13885A2934J9236j6255n0528m6151K6569J17393m2920M5257K1680m8061j01787
13874f2633m1977n6896L4157R4636J44661R720n054m0889m0264N2744m890n8645
13862B4670J7241L2119p3219j11464K7019k5127l1136R1371O4678p0672o2997
13851a17517N3918K7160l5007R0871N5084m8463l6255J2054J8172J7969J4419
13840E2405n6708o6400N7655N8033j2547q8198n6227K9175M1399P9799L0373J9855
13828H8614J6302j3520m9231O075J5115J07808M3562m9943o374j08020k4239k1418
13816D731m3249m3778m3422p6120m3693r990J31594P1298J6322l3583O5707j1261
$$ plain form
13897 103906 30807 6457 75036 77772 78344 62892 20611 -22872 -69598 -92389 -29507 12934
13885 12934 32170 15915 -34613 -80764 -54195 63198 20278 65535 87215 39154 -62633
13874 -62633 -104610 -161506 -127349 -32713 111948 121668 116614 75725 35461 88205 83315 24670
13862 24670 41911 74030 811 -110653 -83634 -108761 -139897 -48526 16152 -54520 -117517
13851 -117517 -63599 -36439 -71446 19425 74509 26046 -10209 1845 20017 37986 52405
13840 52405 -4303 -70703 -13048 44985 32438 -55760 -111987 -82812 -41413 38386 68759 88614
13828 88614 104916 91396 42165 48240 63355 171163 214725 164782 158408 50388 26149 4731
13816 4731 -38518 -82296 -125718 -201838 -245531 -255521 -123927 -52629 -36307 -69890 -4183 -15444
13804a5444r910n2015n743k947r361K0751N9232P1308J3464P1744m9947j06343
13792a5211Q1601O8902p5291j7653k4236K9507J3703m9202J4329J3997l2530q0073
13780g2157q9037L5511J8809O1743P2084j580j3667N5087J8470O2246K2116p4026
13768I5599o3530N065L5302l6687l504Q6045J2128j26794r5496l6338R6972K1573
13756i665L3055k283L4341k5624M0241N2389J6291o6427K8656K8774m2505j00184
13744a2941L6650K7084j941j8884J7409M7925K8615N062r0137o2150j8930l7644
13732g9882k6473M421j371k4066P4235N9469J15421M5723q453o4480o0563K037
13720C6018n7114L403K356l2286m9061k129P0576k776k4985L0687Q8985K445o7778
$$ plain form
13804 -15444 -25354 -77369 -83112 -86059 -95420 -74669 -15437 55871 69335 141079 91132 -15211
13792 -15211 66390 135292 60001 42348 18112 47619 61322 12120 26449 40446 7916 -72157
13780 -72157 -161194 -125683 -106874 -45131 26953 25373 11706 66793 85263 147509 169625 95599
13768 95599 32069 37134 72436 35749 32245 118290 130418 3624 -91872 -128210 -31238 -9665
13756 -9665 23390 21107 55448 29824 70065 122454 138745 72318 100974 129748 87243 -12941
13744 -12941 23709 50793 48852 29968 47377 95302 123917 128979 38842 -23308 -42238 -79882
13732 -79882 -106355 -101934 -103305 -127371 -53136 6333 121754 167477 159024 94544 33981 36018
13720 36018 -21096 -17693 -15337 -47623 -96684 -98813 -28237 -31013 -55998 -25311 63674 66119 -1659
13707a659j292l1653k7523P572P2169M3651M050p0058j11992l1244P2736J14477
13695C9234K9783l8901O423M1092M3468n2614k6993K8484J5857j21493K8450J9974
13683A2764k7328l3907m6094j8827p928l5447k0648R5603N7497j7405k5412K6511
13671d0621J26139r392k3404n7346K1840N869M912M0455n0950m0205L0436N9920
13659F7653k6807n0429k9099M4948O6340N6561m8769p7189J9806J8187r046m1529
13647i373Q743J5080j1724k2958Q5686q731j25858K867R4767m4342o5773j9610
13635a01226L3910J6860K3166L9520P7804k8120m7130j8437K0640k045N7509L1651
13623A04102j02731r103K5835K9133J1786K9189K0571K0965o5936l4444k8894
$$ plain form
13707 -1659 -2951 -34604 -62127 -54555 17614 61265 65315 -4743 -116735 -147979 -75243 39234
13695 39234 69017 30116 36539 77631 121099 68485 41492 69976 85833 -35660 -7210 12764
13683 12764 -14564 -48471 -94565 -113392 -121320 -156767 -177415 -81812 -24315 -41720 -67132 -40621
13671 -40621 85518 76126 52722 -4624 17216 23085 27997 68452 17502 -22703 7733 67653
13659 67653 40846 -9583 -38682 6266 72606 129167 80398 3209 23015 41202 32156 -9373
13647 -9373 -630 14450 2726 -20232 65454 56723 -69135 -66268 28499 -15843 -81616 -101226
13635 -101226 -67316 -50456 -27290 12230 90034 61914 14784 -3653 16987 14942 72451 104102
13623 104102 1371 -7732 18103 47236 59022 88211 108782 129747 63811 29367 473
13612D73k0751m2512j1829k9933Q8546K0831K0263O8814J9962q8032l1358m6655
13600e2181m679R6042k9268n2793O885j2902p30J198M5146K055J7059K6547m1606
13587G73m9705N4740J0730J2459K8622j21097L2809R8906O6035L4022n8042P103
13575A17355m471P514N8864K0195m3645O4009O015q3423j0397K0758o7131p460
13563G8183J3466p1470m3790J9031K1241o7908n1319m8448J1900l6037j6876L7602
13551a54425M3786Q5624O6461p3085M6566J6775l3373J3895M3955m389M0802j5165
13539G7427q7606k6031O755m4272o1675k4525N8311N6388R0277J2542k2306q0558
13527d5273m542Q1289L8382n9081q8481p4498j8759j051P3315J02782P8951L9094
$$ plain form
13612 473 -20278 -62790 -74619 -104552 -16006 4825 25088 93902 113864 25832 -5526 -52181
13600 -52181 -56860 39182 9914 -42879 -35994 -48896 -49626 -48428 -3282 -1227 15832 42379 773
13587 773 -48932 5808 16538 28997 57619 -63478 -30669 68237 134272 168294 110252 117355
13575 117355 112884 120398 179262 199457 155812 219821 225836 142413 132016 152774 85643 78183
13563 78183 91649 20179 -23611 -4580 16661 -51247 -102566 -151014 -139114 -175151 -192027 -154425
13551 -154425 -110639 -25015 41446 -31639 14927 31702 -1671 12224 56179 51790 92592 77427
13539 77427 -10179 -36210 -29455 -73727 -135402 -159927 -101616 -45228 45049 57591 35285 -45273
13527 -45273 -49815 31474 69856 10775 -77706 -152204 -170963 -172014 -98699 4083 83034 122128
13515A22128K5013p2097m9623k1617J0620k9553m4958j7458K1200K73J1554n2397
13503i6915o6569N2892n642N6447Q1738K2628l9316o0592k8555J3764n7097r0507
13491b17724Q081J42454M2454N9604K2195j2253M0613k7952k2455L9148K0104
13480I4269n5155N5288j3215l9058o6533j05533K8354O7803j8511K3596m3263
13469g1958K8554M9459L8329n2582K4642L2059L0174m5606l4114m6775M5137O0459
13457E7778K8111p6525M1822n029k0976J289M7359j4282o3252J3073M5487N8010
13445A12865j2466r2555k5530k7373M1639P8110M0581N690j25819l3083R550p5398
13433a03789p9472O1023J21709P326J1056j6866j1664L6950l6089R2386M382m9103
$$ plain form
13515 122128 147141 75044 25421 3804 14424 -15129 -60087 -77545 -56345 -56072 -44518 -96915
13503 -96915 -163484 -110592 -116234 -59787 21951 44579 5263 -55329 -83884 -70120 -127217 -217724
13491 -217724 -209643 -67189 -24735 34869 57064 44811 85424 57472 35017 74165 94269
13480 94269 39114 94402 81187 42129 -24404 -129937 -101583 -33780 -52291 -28695 -71958
13469 -71958 -43404 6055 44384 -8198 16444 48503 78677 33071 -1043 -47818 -2681 57778
13457 57778 85889 9364 51186 46157 25181 26470 73829 59547 -3705 9368 54855 112865
13445 112865 100399 7844 -17686 -45059 -3420 74690 115271 120961 -4858 -37941 -28391 -103789
13433 -103789 -183261 -122238 -529 6797 17853 987 -10677 26273 -9816 82570 86952 37849
13421C7849M4851j292l1562r7360j2424O2432M1556k0335Q1289K5641K9260j0415
13409A49490q409l1413o8254K5204j9070j5175L594l6921m1534r6916n6750N0511
13397a45643J7591l891R3907K6945k7463l4512m2417J27982J01005n9096J8713
13386G3121P3083L5485o1848r449m4293p5784K7358j06768j9464L4329l6025l0619
13374a40874N8157m477J5608M4244k100m0933J0770J7553R3038l7106r6986M333
13362g8773k3396j481k7046k6724l0400J03061K842K2226J9995L2420L0978p33
13350B2969n3049j2279K9303N1j4317M445P31M1502m3922r7438r4367m0217N5743
13337b00845L8847P814M9321N8171N235J7916m8447P1109M3439n46j6442k8687
$$ plain form
13421 37849 82700 81408 49846 -47514 -59938 2494 44050 23715 105004 130645 159905 149490
13409 149490 141081 109668 41414 66618 47548 32373 35967 -954 -42488 -139404 -196154 -145643
13397 -145643 -128052 -131943 -38036 -11091 -38554 -73066 -115483 12499 113504 54408 73121
13386 73121 146204 181689 119841 110392 66099 -9685 17673 -89095 -108559 -74230 -110255 -140874
13374 -140874 -82717 -87194 -71586 -27342 -29442 -70375 -59605 -42052 50986 13880 -83106 -78773
13362 -78773 -102169 -103650 -130696 -157420 -187820 -84759 -81917 -59691 -39696 -7276 23702 22969
13350 22969 -30080 -42359 -13056 -13005 -27322 -22877 -22146 19356 -24566 -122004 -216371 -256588 -200845
13337 -200845 -161998 -154184 -104863 -46692 -41457 -23541 -71988 -879 42560 42014 25572 -3115
13325c115Q7088M349l9536l6692L1880L2472k028p106l7306k9915O583n870q1980
13312h1176j3457L3189O4284r0346n0606M877J16901Q8761K7468O908N05m5832
13300F1476o8959Q3472M3467o6672n6454l5420O2486J1809m4085q9029P4862O2950
13288C9903O5772m2947l9514O1358M8324L4242j3189r7038O1996j3669J2808K147
13276A20193L3431j64029q7154M9340j5439J9420r659J7062R7065Q9416m7167
13265A02479q563k2503l544j0635n0116N148q811N1789p2534r191J7542j8537
13253b7476n6334m7877P7256K2700R9322O1369l7547R152m4996k3084j03803J0687
13241f0631R991l5080R4122O2462n3843k4812K792J342J8660L6035k7444j17188
$$ plain form
13325 -3115 83973 88322 48786 12094 43974 76446 74418 67312 30006 91 6674 804 -81176
13312 -81176 -94633 -61444 2840 -87506 -138112 -133235 -16334 72427 99895 106803 107308 61476
13300 61476 -7483 75989 119456 52784 -3670 -39090 23396 35205 -8880 -97909 -23047 39903
13288 39903 105675 62728 23214 84572 132896 167138 153949 56911 118907 105238 118046 120193
13276 120193 153624 -10405 -97559 -48219 -63658 -44238 -53897 -36835 60230 149646 102479
13265 102479 93916 71413 67869 57234 7118 12266 3455 55244 -17290 -26481 -8939 -27476
13253 -27476 -83810 -131687 -54431 -31731 67591 128960 91413 100565 55569 32485 -71318 -60631
13241 -60631 -50640 -85720 8402 70864 17021 -7791 -4999 -3657 15003 51038 23594 -93594
13229i3594Q147R5770N8674L7895p1780p504Q4848L8742n5539M317o9327j3930
13217A6719m163L7762P1795k4658l4339n9742M1463M8294m6205k1019r2137n0538
13205a16768M3846J1877J0607j3993k666J7896L9548r5689K9175O0644q709P074
13193a7158L2261O152R98l556j10040m8584P1233N8640R6770J7938k6519j3640
13181F4495j5337k7477l3591M55K0939o6848O483O4175j1522M4897M3380n3811
13169C6238l2768k720R4862J9831o1769j23778n8476o4708M5118R2454O6262J09399
13157A19945n0587j29131j0062Q0647L6276O3582K0996P125j5839o6835p0079
13146a3962l9019m346l4762j162o2709k8292K7122R8692M5377l306J7259m0142
$$ plain form
13229 -93594 -85447 10323 68997 106892 35112 27608 112456 151198 95659 99976 30649 16719
13217 16719 12556 50318 122113 97455 63116 3374 44837 93131 46926 25907 -66230 -116768
13205 -116768 -72922 -61045 -50438 -64431 -67097 -49201 -9653 -105342 -76167 -15523 -24232 -17158
13193 -17158 15103 21255 22253 18697 -91343 -139927 -68694 -10054 86716 104654 78135 64495
13181 64495 49158 21681 -11910 -11455 9484 -57364 -50881 13294 1772 46669 90049 36238
13169 36238 3470 750 95612 115443 53674 -70104 -128580 -193288 -148170 -55716 10546 119945
13157 119945 69358 -59773 -69835 10812 47088 110670 131666 138791 122952 56117 -13962
13146 -13962 -52981 -57327 -92089 -93251 -155960 -184252 -157130 -58438 -13061 -16367 892 -39250
13134c9250Q608R998m081K874k8993l8868k993J15159N5602n8773k3069Q611o6939
13121f2114n6598M8972M8914O3226l3495j10048q8447p7311O11J13452M9716N4907
13109d8215J9058L2160K0128l6682K7974j4526k6362P6150j380j2273l2765N0434
13097E3701J30848j182n0025o8659R51k3444P084K383o7780o7245r0988P9291
13085i5065R4155l2865k6182l3829k1419O7126j1704j8957K8892L2863J1846m1957
13073d7096K873P0487J9817o0146O7705p010L933K4257j7165k5013L1994l4227
13061C0409o6997j6173R967j5953M7595K4097L9282l7529k2434P6785N7496k7236
13049I9309q6375o9738J0369M4089r434l0390J32827n1973M403p1154M789M5608
$$ plain form
13134 -39250 -30642 -20644 -24725 -21851 -50844 -89712 -92705 22454 78056 19283 -3786 4825 -62114
13121 -62114 -118712 -69740 -20826 42400 8905 -101143 -189590 -266901 -266290 -152838 -103122 -48215
13109 -48215 -29157 3003 23131 -13551 14423 -103 -26465 49685 48305 36032 3267 53701
13097 53701 184549 183367 133342 64683 65634 42190 49274 51657 -16123 -83368 -174356 -95065
13085 -95065 -910 -33775 -59957 -93786 -115205 -48079 -59783 -78740 -49848 -16985 -5139 -47096
13073 -47096 -44223 26264 46081 -14065 53640 46630 50563 74820 57655 32642 64636 30409
13061 30409 -36588 -52761 -42794 -58747 -11152 12945 52227 14698 -7736 69049 126545 99309
13049 99309 12934 -56804 -46435 -2346 -11780 -42170 90657 38684 43087 -28067 -23278 22330
13037B2330L5617P5222N2717n9192o7558k0858K0641q6362L6953K8575Q2048k1291
13025I8842q3280j23303q8145M4948O5536o8168l3416O1946J8938q377Q3895m367
13013c4951J2035n6054L0368M1170K8795K4335N2770j3538J1204k8626r2571j17924
13001a42987p6645N4798J3809P5635l959J087J216P3606J48703j8468o9985L149
12989E9959J0938j3409j9036k738j005k0435q3935j35771J01658P8502R402O9803
12977E3933L6316n5498P7833Q4687q9121j35078o2128l4821k4127O9634K1494
12966e6876j2746O9617Q297n2939k5057M3579Q675l0381O0791J4719q5115L1456
12954b5980n4273J8799N7103l7359m1853J4608L9695J42994m1630n9880n262j7021
$$ plain form
13037 22330 57947 133169 185886 126694 59136 38278 58919 -27443 9510 38085 120133 98842
13025 98842 15562 -107741 -195886 -150938 -85402 -153570 -186986 -125040 -106102 -114479 -30584 -34951
13013 -34951 -22916 -78970 -48602 -7432 21363 45698 98468 84930 96134 67508 -25063 -142987
13001 -142987 -219632 -164834 -151025 -75390 -79349 -78262 -77046 -3440 145263 126795 56810 59959
12989 59959 70897 57488 38452 35714 34709 14274 -69661 -205432 -103774 -25272 -15870 53933
12977 53933 90249 34751 112584 197271 108150 -26928 -89056 -123877 -148004 -78370 -56876
12966 -56876 -69622 -5 8292 -44647 -69704 -26125 -17450 -47831 12960 27679 -57436 -25980
12954 -25980 -80253 -61454 -4351 -41710 -83563 -68955 -29260 113734 72104 12224 6962 -10059
12942a0059m6366L6330N9690m3866l5404P627J02007J06415j9727j60636p087
12931a1076j02799p1243m5642J9433R2238L9679O4987K5318M8352o73k5987J13995
12919A46582N487j112J900j0955K5463J0781j69393p0219M484r3229L0493K0639
12907i9079m0116Q7155J26076M333J0198L2392o0762r2395l33L5131R9584K5197
12895A27381j5257r1270j08128j4902P3615N3286M1738N804J441o0333m9343K3028
$$ plain form
12942 -10059 -56425 -20095 39595 -4271 -39675 -32048 69959 176374 156647 -3989 -11076
12931 -11076 -113875 -185118 -230760 -211327 -119089 -79410 -14423 10895 59247 58574 32587 146582
12919 146582 152069 150957 152857 141902 167365 178146 8753 -61466 -56982 -150211 -119718 -99079
12907 -99079 -139195 -52040 74036 78369 88567 120959 60197 -32198 -32531 2600 102184 127381
12895 127381 112124 20854 -87274 -102176 -28561 24725 66463 72267 73708 13375 -35968 -12940
$$ [...]
##END NTUPLES=NMR SPECTRUM
##END=
