##TITLE=Analysis number 320916
Compound Code cc 21509
Project Code adrs
Chemist Name fudan
##JCAMPDX= 6.0         $$ Bruker NMR JCAMP-DX V2.0
##DATA TYPE= NMR SPECTRUM
##DATA CLASS= NTUPLES
##ORIGIN= Bruker BioSpin GmbH
##OWNER= nmr
$$ XWIN-NMR		Version 3.5
$$ Tue Jul 18 09:01:43 2006 GMT Daylight Time (UT+1h)  MAYBRIDGE\nmr@NMR_250MHZ
##.OBSERVE FREQUENCY= 250.131544655141
##.OBSERVE NUCLEUS= ^1H
##.ACQUISITION MODE= SIMULTANEOUS (DQD)
##.ACQUISITION SCHEME= undefined
##.AVERAGES= 16
##.DIGITISER RES= 18
##SPECTROMETER/DATA SYSTEM= dpx250
##.PULSE SEQUENCE= zg30
##.SOLVENT NAME= CDCl3
##.SHIFT REFERENCE= (INTERNAL, CDCl3, 0, 16.522)
##AUDIT TRAIL= $$ (NUMBER, WHEN, WHO, WHERE, WHAT)
$$ ##TITLE= Audit trail, XWIN-NMR		Version 3.5
$$ ##JCAMPDX= 5.01
$$ ##ORIGIN= Bruker BioSpin GmbH
$$ ##OWNER= nmr
$$ C:\u/data/dgb/nmr/ADRS/2890/pdata/1/auditp.txt
$$ ##AUDIT TRAIL=  $$ (NUMBER, WHEN, WHO, WHERE, WHAT)
(   1,<2006-07-18 09:01:22.56 +100>,<MAYBRIDGE\nmr>,<NMR_250MHZ>,
      <created by zg, POWCHK disabled, PULCHK disabled
       configuration hash MD5:
       E2 DF 36 D8 04 B2 41 60 5A D7 A3 38 5A 4B D0 FE
       data hash MD5: 64K
       ED 42 42 34 EA FB 01 9A BF 21 63 A9 6B 26 80 AB>)
(   2,<2006-07-18 09:01:34.28 +100>,<MAYBRIDGE\nmr>,<NMR_250MHZ>,
      <Start of raw data processing
       ef LB = 0.3 FT_mod = 6 PKNL = 1 SI = 32K 
       data hash MD5: 32K
       0D 6A FF 7D 3F 8A ED 15 7B 16 8D E5 EB C5 CC CA>)
(   3,<2006-07-18 09:01:35.87 +100>,<MAYBRIDGE\nmr>,<NMR_250MHZ>,
      <apk 
       data hash MD5: 32K
       06 EF 4E 51 AD 01 36 1E 3D 01 67 2B 71 66 0A 49>)
(   4,<2006-07-18 09:01:36.62 +100>,<MAYBRIDGE\nmr>,<NMR_250MHZ>,
      <abs ABSG = 5 
       data hash MD5: 32K
       EC AA C9 F9 17 D9 12 55 6B 23 4D 9C 3F 8B 2C 87>)
$$ ##END=
$$ 
$$ hash MD5
$$ 5C 14 F6 D0 C4 C8 61 91 94 8A F0 3C 22 39 60 DF
##$RELAX= 
##$RELAX= 
##$RELAX= 
##$RELAX= 
##$RELAX= 
##$RELAX= 
##$RELAX= 
$$ Bruker specific parameters
$$ --------------------------
##$DU= <C:\u>
##$EXPNO= 2890
##$NAME= <ADRS>
##$PROCNO= 1
##$TYPE= <nmr>
##$USER= <dgb>
##$AMP= (0..31)
100 100 100 100 100 100 100 100 100 100 100 100 100 100 100 100 100 100 
100 100 100 100 100 100 100 100 100 100 100 100 100 100 
##$AQSEQ= 0
##$AQ_mod= 3
##$AUNM= <au_zg>
##$AUTOPOS= <3 >
##$BF1= 250.13
##$BF2= 250.13
##$BF3= 250.13
##$BF4= 250.13
##$BF5= 500.13
##$BF6= 500.13
##$BF7= 500.13
##$BF8= 500.13
##$BYTORDA= 1
##$CFDGTYP= 0
##$CFRGTYP= 5
##$CHEMSTR= <none>
##$CNST= (0..31)
1 1 145 1 1 1 1 1 1 1 1 1 1 1 1 1 1 1 1 1 1 1 1 1 1 1 1 1 1 1 1 1 
##$CPDPRG= <>
##$CPDPRG1= <>
##$CPDPRG2= <>
##$CPDPRG3= <>
##$CPDPRG4= <mlev>
##$CPDPRG5= <mlev>
##$CPDPRG6= <mlev>
##$CPDPRG7= <mlev>
##$CPDPRG8= <mlev>
##$CPDPRGB= <>
##$CPDPRGT= <>
##$D= (0..31)
0 1 0 0 0 0 0 0 0 0.06 0 0 0 0 0 0 0.0002 0 0 0 0 0 0 0 0 0 0 0 0 0 0 
0 
##$DATE= 1153209681
##$DBL= (0..7)
120 120 120 120 120 120 120 120 
##$DBP= (0..7)
150 150 150 150 150 150 150 150 
##$DBP07= 0
##$DBPNAM0= <>
##$DBPNAM1= <>
##$DBPNAM2= <>
##$DBPNAM3= <>
$$ [...]
##$SUBNAM7= <"">
##$SUBNAM8= <"">
##$SUBNAM9= <"">
##$SW= 20.6930455092707
##$SWIBOX= (0..15)
0 0 3 0 0 0 0 0 0 0 0 0 0 0 0 0 
##$SW_h= 5175.983436853
##$TD= 65536
##$TD0= 1
##$TE= 295.16
##$TE2= 300
##$TE3= 300
##$TEG= 300
##$TL= (0..7)
0 120 120 120 120 120 120 120 
##$TP= (0..7)
150 150 150 150 150 150 150 150 
##$TP07= 0
##$TPNAME0= <>
##$TPNAME1= <>
##$TPNAME2= <>
##$TPNAME3= <>
##$TPNAME4= <>
##$TPNAME5= <>
##$TPNAME6= <>
##$TPNAME7= <>
##$TPOAL= (0..7)
0.5 0.5 0.5 0.5 0.5 0.5 0.5 0.5 
##$TPOFFS= (0..7)
0 0 0 0 0 0 0 0 
##$TUNHIN= 0
##$TUNHOUT= 0
##$TUNXOUT= 0
##$USERA1= <user>
##$USERA2= <user>
##$USERA3= <user>
##$USERA4= <user>
##$USERA5= <user>
##$V9= 5
##$VALIST= <valist>
##$VCLIST= <CCCCCCCCCCCCCCC>
##$VD= 0
##$VDLIST= <DDDDDDDDDDDDDDD>
##$VPLIST= <PPPPPPPPPPPPPPP>
##$VTLIST= <TTTTTTTTTTTTTTT>
##$WBST= 1024
##$WBSW= 4
##$XGAIN= (0..3)
0 0 0 0 
##$XL= 0
##$YL= 0
##$YMAX_a= 288012
##$YMIN_a= -396655
##$ZGOPTNS= <>
##$ZL1= 120
##$ZL2= 120
##$ZL3= 120
##$ZL4= 120
##$ABSF1= 16.522
##$ABSF2= -4.171173
##$ABSG= 5
##$ABSL= 3
##$ALPHA= 0
##$AQORDER= 0
##$ASSFAC= 0
##$ASSFACI= 0
##$ASSFACX= 0
##$ASSWID= 0
##$AUNMP= <proc_1d>
##$AZFE= 0.1
##$AZFW= 0.1
##$BCFW= 0
##$BC_mod= 0
##$BYTORDP= 0
##$COROFFS= 0
##$CY= 12.5
##$DATMOD= 1
##$DC= 0
##$DFILT= <>
##$DTYPP= 0
##$F1P= 14.0000005364418
##$F2P= -0.99999901652339
##$FCOR= 0.5
##$FTSIZE= 32768
##$FT_mod= 6
##$GAMMA= 0
##$GB= 0
##$INTBC= 1
##$INTSCL= 1
##$ISEN= 128
##$LB= 0.3
##$LEV0= 0
##$LPBIN= 0
##$MAXI= 10000
##$MC2= 0
##$MEAN= 0
##$ME_mod= 0
##$MI= 0
##$NCOEF= 0
##$NC_proc= -4
##$NLEV= 6
##$NOISF1= 0
##$NOISF2= 0
##$NSP= 0
##$NTH_PI= 0
##$NZP= 0
##$OFFSET= 16.522
##$PC= 1
##$PHC0= 175.6707
##$PHC1= -0.1283247
##$PH_mod= 1
##$PKNL= yes
##$PPARMOD= 0
##$PSCAL= 4
##$PSIGN= 0
##$REVERSE= no
##$SF= 250.13
##$SI= 32768
##$SIGF1= 0
##$SIGF2= 0
##$SINO= 400
##$SIOLD= 32768
##$SREGLST= <1H.CDCl3>
##$SSB= 0
##$STSI= 32768
##$STSR= 0
##$SW_p= 5175.98343685301
##$SYMM= 0
##$S_DEV= 0
##$TDeff= 65536
##$TDoff= 0
##$TI= <Analysis number 999999
Compound Code 99
Book Reference 9
Project Code 9>
##$TILT= no
##$TM1= 0
##$TM2= 0
##$TOPLEV= 0
##$USERP1= <user>
##$USERP2= <user>
##$USERP3= <user>
##$USERP4= <user>
##$USERP5= <user>
##$WDW= 1
##$XDIM= 32768
##$YMAX_p= 303673637
##$YMIN_p= -554948
$$ End of Bruker specific parameters
$$ ---------------------------------
##NTUPLES= NMR SPECTRUM
##VAR_NAME=  FREQUENCY,     SPECTRUM/REAL,   SPECTRUM/IMAG
##SYMBOL=    X,             R,               I
##VAR_TYPE=  INDEPENDENT,   DEPENDENT,       DEPENDENT
##VAR_FORM=  AFFN,          ASDF,            ASDF
##VAR_DIM=   32768,         32768,           32768
##UNITS=     HZ,            ARBITRARY UNITS, ARBITRARY UNITS
##FACTOR=    0.157963299565203, 1,           1
##FIRST=     4132.6476996994, 0,             0
##LAST=      -1043.33573715361, 0,           0
##MIN=       -1043.33573715361, -554948,     0
##MAX=       4132.6476996994, 303673637,     0
$$ Real data points
##PAGE= N=1
##DATA TABLE= (X++(R..R)), XYDATA
$$ [...]
$$ plain form
20065 -36089 -34286 20368 -82878 -151356 -156978 -66807 -96016 -200897 -173780 -185506 -199117 -177862
20053 -177862 -79393 -78441 -117488 -119149 -119451 -105799 -52231 77785 141716 174928 154340 239288
20041 239288 276642 253106 258616 374694 350911 208987 226877 52010 -24247 -68523 20750
20030 20750 -31122 27134 103357 188002 193555 279431 387530 422520 401122 415692 277293
20019 277293 47570 14856 65727 52052 16438 -68349 -70834 -14127 -55113 -22815 39737
20008 39737 92684 98182 72853 93449 -70572 -125146 -59655 -21785 51417 143436 152829 91832
19996 91832 2997 -110649 -27020 -27384 -90980 -68991 -20512 -61959 -133730 -132358 -65527 7676
19984 7676 31866 51783 -117237 -210472 -49473 -43240 -34355 -11016 -86551 -128057 -196978 -270553
$$ packed form
20065c6089J803N4654j03246o8478n622R0171k9209j04881K7117j1726j3611K1255
20053a77862R8469R52l9047j661l02J3652N3568J30016O3931L3212k0588Q4948
20041B39288L7354k3536N510J16078k3783j41924J7890j74867p6257m4276Q9273
20030B0750n1872N8256P6223Q4645N553Q5876J08099L4990k1398J4570j38399
20019B77293k29723l2714N0871j3675l5614q4787k485N6707m0986L2298O2552
20008C9737N2947N498k5329K0596j64021n4574O5491L7870P3202R2019R393o0997
19996I1832q8835j13646Q3629l64o3596K1989M8479m1447p1771J372O6831P3203
19984G676K4190J9917j69020r3235J60999O233Q885K3339p5535m1506o8921p3575
$$ plain form
19972 -270553 -298561 -421339 -319887 -195325 -38934 -10886 18831 22281 -64618 -110748 -193808
19961 -193808 -173057 -193206 -198387 -117031 -91987 -160526 -195850 -64444 16890 89359 -28819
19950 -28819 -107603 -133317 -196104 -234398 -206469 -192905 -166542 -214745 -219864 -217565 -141669 -210501
19938 -210501 -182728 -159053 -67144 -30100 -78150 -32750 -116512 -148272 -115021 -175524 -150435
19927 -150435 -122798 -97344 -117142 -88786 -69084 -36590 -144411 -207046 -217295 -216911 -253909 -178536
19915 -178536 -156984 -120411 -104102 -84206 -68749 19561 -5318 -63012 -76429 -33279 -25425 -189799
19903 -189799 -281551 -165413 -22980 81386 83572 158281 163438 49400 85922 1397 -193875
19892 -193875 -167282 -116255 -61724 -31734 -86680 -184854 -187139 -210882 -183018 -171222 -179352 -260797
$$ packed form
19972b70553k8008j22778J01452J24562J56391K8048K9717L450q6899m6130q3060
19961a93808K0751k0149n181Q1356K5044o8539l5324J31406Q1334P2469j18178
19950b8819p8784k5714o2787l8294K7929J3564K6363m8203n119K299P5896o8832
19938b10501K7773K3675R1909L7044m8050M5400q3762l1760L3251o0503K5089
19927a50435K7637K5454j9798K8356J9702L2494j07821o2635j0249L84l6998P5373
19915a78536K1552L6573J6309J9896J5457Q8310k4879n7694j3417M3150P854j64374
19903a89799r1752J16138J42433J04366K186P4709N157j14038L6522q4525j95272
19892a93875K6593N1027N4531K9990n4946r8174k285k3743K7864J1796q130q1445
$$ plain form
19880 -260797 -306884 -84405 -37131 -140617 -191224 -83139 -122797 -206904 -220204 -208479 -121033
19869 -121033 -121235 -220025 -126545 -167216 -69019 -40509 16765 17554 99449 132733 40909 -5503
19857 -5503 101708 103932 43425 97493 81852 69153 10616 36608 -32116 -3754 62882 60366
19845 60366 -28514 61553 70210 145851 137132 126241 110927 52376 29787 26064 28265 155320
19833 155320 239413 281567 182574 84914 82270 58698 -74626 -147498 -133561 -225936 -298795
19822 -298795 -201697 -48784 -79399 -20466 42211 44396 67696 56891 -15435 -115206 -86720
19811 -86720 -84658 -81823 -103374 -64348 -23258 -17769 181196 151381 -35744 -64594 -53689 -51882
19799 -51882 -71056 -40633 -29267 -134099 -210616 -104096 -7543 12493 65468 26936 -27992
$$ packed form
19880b60797m6087K22479M7274j03486n0607J08085l9658q4107j3300J1725Q7446
19869a21033k02r8790R3480m0671R8197K8510N7274P89Q1895L3284r1824m6412
19857e503J07211K224o0507N4068j5641j2699n8537K5992o8724K8362O6636k516
19845F0366q8880R0067Q657P5641q719j0891j5314n8551k2589l723K201J27055
19833A55320Q4093M2154r8993r7660k644k3572j33324p2872J3937r2375p2859
19822b98795R7098J52913l0615N8933O2677K185K3300j0805p2326r9771K8486
19811h6720K062K835k1551L9026M1090N489J98965k9815j87125k8850J0905J807
19799e1882j9174L0423J1366j04832p6517J06520R6553K0036N2975l8532n4928
$$ plain form
19788 -27992 -128770 -179123 -173326 -240723 -181819 -99646 -117705 -164296 -124246 -79150 -80176 -91337
19776 -91337 -245948 -216440 -94692 -88372 23290 32570 19376 133477 127910 85614 81253 739
19764 739 17867 -45433 -101801 -223519 -332800 -347191 -177433 3798 56153 -70057 -69500
19753 -69500 -28565 -15596 -26668 42680 119832 141621 69678 2288 19046 -4783 -65049 -95483
19741 -95483 -12480 47852 -81861 -128030 -24799 50170 23602 -39891 -70244 -167345 -202804
19730 -202804 -191913 -129037 -88165 67741 73799 -13800 27585 -64857 -86761 -53190 15118
19719 15118 15110 -149455 -215414 -167109 -21859 -45825 -123328 -80867 -66060 -6806 49092 -21637
19707 -21637 10777 138336 74941 -89658 -62926 19761 964 -87732 -76145 -178841 -151181
$$ packed form
19788b7992j00778n0353N797o7397N8904Q2173j8059m6591M0050M5096j026j1161
19776i1337j54611K9508J21748O320J11662R280j3194J14101n567m2296m361q0514
19764G39J7128o3300n6368j21718j09281j4391J69758J81231N2355j26210N57
19753f9500M0935J2969j1072O9348P7152K1789p1943o7390J6758k3829o0266l0434
19741i5483Q3003O0332j29713m6169J03231P4969k6568o3493l0353r7101l5459
19730b02804J0891O2876M0872J55906O058q7599M1385r2442k1904L3571O8308
19719A5118qj64565o5959M8305J45250k3966p7503M2461J4807N9254N5898p0729
19707b1637L2414J27559o3395j64599K6732Q2687j8797q8696J1587j02696K7660
$$ plain form
19696 -151181 -92041 -25608 -100758 -219829 -217383 -176481 -241536 -278667 -219632 -167081 -88037
19685 -88037 -139733 -89185 -30386 -123631 -125859 -143203 -88639 -173956 -199410 -121033 -69169 -149658
19673 -149658 -142376 -173779 -209068 -309443 -267899 -214544 -116746 -119710 -180611 -172500 -181242 -185370
19661 -185370 -230280 -147324 -892 73715 6247 -71571 -90768 -87646 -71117 -50987 -218959
19650 -218959 -360013 -270488 -226945 -127498 -110876 -133813 -134895 -113722 -87256 -5640 -35852
19639 -35852 -144944 -176954 -180635 -42159 -84342 -39983 29613 -68014 -89566 -178389 -270761
19628 -270761 -210696 -193408 -180765 -226180 -294668 -343297 -228449 -219333 -191757 -190119 -196305 -311081
19616 -311081 -261300 -149772 -161489 -117858 -177743 -232764 -208940 -134144 -98237 -111135 -87513
$$ packed form
19696a51181N9140O6433p5150j19071K446M0902o5055l7131N9035N2551P9044
19685h8037n1696N0548N8799r3245k228j7344N4564q5317k5454P8377N1864q0489
19673a49658P282l1403l5289j00375M1544N3355R7798k964o0901Q111q742m128
19661a85370m4910Q2956J46432P4607o7468p7818j9197L122J6529K0130j67972
19650b18959j41054Q9525M3543R9447J6622k2937j082K1173K6466Q1616l0212
19639c5852j09092l2010l681J38476m2183M4359O9596r7627k1552q8823r2372
19628b70761O0065J7288J2643m5415o8488m8629J14848R116K7576J638o186j14776
19616c11081M9781J11528j1717M3631n9885n5021K3824P4796L5907j2898K3622
$$ plain form
19605 -87513 -81051 -88411 -108438 -243815 -321595 -222724 -84765 4274 -1623 -17281 -46103 -64925
19593 -64925 -124780 -150132 -137119 -147780 -69319 21653 30932 -110850 -270972 -215543 -186070
19582 -186070 -189361 -157370 -260343 -282835 -429926 -477872 -390153 -339707 -230488 -156306 -65366
19571 -65366 -69075 -87518 -197523 -127303 -86564 -7950 34699 -193552 -252785 -229343 -191998
19560 -191998 -125165 -122263 -149541 -111528 29670 50680 8977 -26733 6319 -37578 -146619
19549 -146619 -188628 -220611 -194897 -95805 -34752 -166410 -68740 -54421 -91046 -88625 -105477
19538 -105477 -10783 5241 35913 119655 103445 59476 -147164 -154877 -112527 -150876 -152547 -130117
19526 -130117 -200939 -235245 -370553 -417006 -313087 -237422 -168595 -62968 20307 9726 -107674
$$ packed form
19605h7513O462p360k0027j35377p7780R8871J37959Q9039n897j5658k8822j8822
19593f4925n9855k5352J3013j0661P8461R0972R279j41782j60122N5429K9473
19582a86070l291L1991j02973k2492j47091m7946Q7719N0446J09219P4182R0940
19571f5366l709j8443j10005P0220M0739P8614M2649k28251n9233K3442L7345
19560a91998O6833K902k7278L8013J41198K1010m1703l5710L3052m3897j09041
19549a46619m2009l1983K5714R9092O1053j31658R7670J4319l6625K421j6852
19538a05477R4694J6024L0672Q3742j6210m3969k06640p713M2350l8349j671K2430
19526a30117p0822l4306j35308m6453J03919P5665O8827J05627Q3275j0581j17400
$$ plain form
19515 -107674 -22789 131119 48243 45076 40776 88059 57516 34704 38075 91517 60242 -80288
19503 -80288 -111160 -159455 -138554 -90298 -24442 -50572 -125879 -134872 -198415 -52008 31162 182104
19491 182104 208673 97970 127981 170294 143748 145985 148169 62114 -18533 -112951 -158213 -97446
19479 -97446 -60130 -35496 66321 59309 81293 21872 -52414 -60041 -76574 -18738 126498 131527
19467 131527 -11703 -16609 -26952 13955 -41901 -92114 -19334 -28045 -11331 -65957 -268050
19456 -268050 -195516 -117835 -212015 -358823 -342579 -282008 -242908 -151328 10035 -20467 -112836
19445 -112836 -149494 -158169 -134127 -179240 -184712 -194122 -18241 76252 71588 55223 93889 74932
19433 74932 55167 48579 32111 -84648 -174281 -168979 -84556 23258 -89410 -90115 -91970 29373
$$ packed form
19515a07674Q4885J53908q2876l167m300M7283l0543k2812L371N3442l1275j40530
19503h0288l0872m8295K0901M8256O5856k6130p5307q993o3543J46407Q3170J50942
19491A82104K6569j10703L0011M2313k6546K237K184q6055q0647r4418m5262O0767
19479i7446L7316K4634J01817p012K1984n9421p4286p627j6533N7836J45236N029
19467A31527j43230m906j0343M0907n5856n0213P2780q711J6714n4626k02093
19456b68050P2534P7681r4180j46808J6244O0571L9100R1580J61363l0502r2369
19445a12836l6658q675K4042m5113n472r410J75881R4493m664j6365L8666j8957
19433G4932j9765o588j6468j16759q9633N302Q4423J07814j12668p05j855J21343
$$ plain form
19421 29373 55091 52793 127476 179847 170850 135442 -59919 -102292 -63339 -129805 -150461 -25591
19409 -25591 -36843 -67958 -41324 -28683 91867 155625 97083 72364 95986 75594 101882
19398 101882 151074 53190 23864 121004 139635 154396 167260 230144 180529 111184 124845
19387 124845 87494 142402 193637 14029 -45378 51634 137018 241307 252138 267722 119388
19376 119388 70812 143222 161649 134105 141116 203607 185018 229209 292950 285506 277294 347494
19364 347494 456375 422679 287810 241678 221290 164578 108646 100919 76099 30944 101117
19353 101117 198494 258686 405921 410337 277486 370969 379447 321168 426252 429918 454337
19342 454337 381626 295492 226754 311563 251092 255306 324884 334900 404224 366737 374205 416786
$$ packed form
19421B9373K5718k298P4683N2371q997l5408j95361m2373L8953o6466k0656J24870
19409b5591j1252l1115K6634J2641J20550O3758n8542k4719K3622k0392K6288
19398A01882M9192r7884k9326R7140J8631J4761J2864O2884m9615o9345J3661
19387A24845l7351N4908N1235j79608n9407R7012Q5384J04289J0831J5584j48334
19376A19388m8576P2410J8427k7544P011O2491j8589M4191O3741p444q212P0200
19364C47494J08881l3696j34869m6132k0388n6712n5932p727k4820m5155P0173
19353A01117R7377O0192J47235M416j32851R3483Q478n8279J05084L666K4419
19342D54337p2711q6134o8738Q4809o0471M214O9578J0016O9324l7487P468M2581
$$ plain form
19330 416786 469683 432056 360080 322846 343349 386064 453236 418425 412804 450160 415025 405059
19318 405059 467383 553413 602615 537777 403387 394464 456848 375784 275623 189140 108710
19307 108710 131254 229334 375437 501533 522049 492382 457905 523791 597850 582620 435926
19296 435926 375637 598722 668275 424859 311036 220140 222952 208877 273594 285457 236073
19285 236073 169880 107379 70801 21209 15500 102965 223920 374332 338013 267099 244930
19274 244930 282343 277296 175490 44966 113105 198910 79233 81813 141167 33571 -25847
19263 -25847 71 -13623 43143 170654 218520 290601 218313 18838 -31255 14351 99779
19252 99779 130950 147427 12819 -36519 22028 43971 104347 145559 129658 176063 172638 152342
$$ packed form
19330D16786N2897l7627p1976l7234K0503M2715O7172l4811n621L7356l5135r966
19318D05059O2324Q6030M9202o4838j34390q923O2384q1064j00161q6483q0430
19307A08710K2544R8080J46103J26096K0516k9667l4477O5886P4059j5230j46694
19296D35926o0289K23085O9553k43416j13823r0896K812j4075O4717J1863m9384
19285B36073o6193o2501l6578m9592n709Q7465J20955J50412l6319p0914k2169
19274B44930L7413n047j01806j30524O8139Q5805j19677K580N9354j07596n9418
19263b5847K5918j3694N6766J27511M7866P2081p2288j99475n0093M5606Q5428
19252I9779L1171J6477j34608m9338N8547K1943O0376M1212j5901M6405l425k0296
$$ plain form
19240 152342 119137 124263 96504 60819 87138 137116 110499 77507 -35132 -16806 -18812 10782
19228 10782 158328 122646 203415 170731 72904 67346 -2814 121698 172208 210068 217512 188436
19216 188436 190666 138452 26337 12401 135956 113063 44388 -30486 100798 189683 244125
19205 244125 264489 166348 81003 101673 66168 -81206 -7323 13711 149941 95374 127133
19194 127133 157433 153513 170654 169680 171521 44165 -77593 -103466 -52039 38544 93052 129203
19182 129203 156694 10593 -136174 -47975 138915 135995 37705 42547 80501 178614 211589
19171 211589 201591 200938 213089 218504 231518 305347 314756 311786 296508 231483 217107 159730 120893
19158 120893 281825 389172 342918 321581 170764 102312 131713 156338 190068 84507 14026
$$ packed form
19240A52342l3205N126k7759l5685K6319M9978k6617l2992j12639J8326k006K9594
19228A0782J47546l5682Q0769l2684r7827n558p0160J24512N0510L7860P444k9076
19216A88436K230n2214j12115j3936J23555k2893o8675p4874J31284Q8885N4442
19205B44125K0364r8141q5345K0670l5505j47374P3883K1034J36230n4567L1759
19194A27133L0300l920J7141r74J841j27356j21758k5873N1427R0583N4508L6151
19182A29203K7491j46101j46767Q8199J86890k920r8290M842L7954R8113L2975
19171B11589r998o53J2151N415J3014P3829R409k970j5278o5025j4376n7377l8837
19158A20893J60932J07347m6254k1337j50817o8452K9401K4625L3730j05561p0481
$$ plain form
19147 14026 -23307 50507 80706 21203 30358 47184 75794 99117 178770 109502 111223 211131
19135 211131 253941 301280 357783 305923 218631 159130 135393 129314 116168 22569 101282 140490
19123 140490 171542 267821 157940 -19854 66992 51390 246035 330892 207387 117625 89576
19112 89576 114784 162615 126906 253405 342882 403656 406217 332520 266572 273254 306057 213888
19100 213888 171134 234383 157092 154099 172619 231482 158894 19542 68070 165607 169732 275244
19088 275244 335950 407164 473244 493699 474759 407027 443212 491288 464679 440953 499366
19077 499366 542601 587308 578814 574775 712382 732810 656396 544681 402694 423999 441459
19066 441459 254706 207288 219998 154245 304439 373250 430343 290747 216450 319869 399422
$$ packed form
19147A4026l7333P3814L0199n9503R155J6826K8610K3323P9653o9268J721R9908
19135B11131M2810M7339N6503n1860q7292n9501k3737o079j3146r3599P8713L9208
19123A40490L1052R6279j09881j77794Q6846j5602J94645Q4857j23505q9762k8049
19112H9576K5208M7831l5709J26499Q9477O0774K561p3697o5948O682L2803r2169
19100B13888m2754O3249p7291k993J8520N8863p2588j39352M8528R7537M125J05512
19088B75244O0706P1214O6080K0455j8940o7732L6185M8076k6609k3726N8413
19077D99366M3235M4707q494m039J37607K0428p6414j11715j41987K1305J7460
19066D41459j86753m7418J2710o5753J50194O8811N7093j39596p4297J03419P9553
$$ plain form
19055 399422 524245 573665 530443 516690 561319 559200 530538 444364 414279 372298 514707
19044 514707 647676 774416 783954 719177 755808 865302 797454 683559 767526 776086 782734
19033 782734 766993 819739 819597 791359 789359 800421 828528 827363 781428 858204 767810 689622
19021 689622 720335 800855 767096 746245 846420 818058 754666 769780 767657 720515 778210
19010 778210 779118 691242 654229 654544 715502 807415 906610 1007073 975105 817140 665808 688041
18998 688041 717199 755670 834227 870916 1040116 1092587 1028938 1007076 972512 969626 938063
18987 938063 991844 1024956 1233432 1300692 1238030 1228415 1184570 1048519 1175228 1263688 1198550
18976 1198550 1228380 1358931 1295161 1204537 1255487 1204615 1237459 1268065 1293242 1478664 1605793
$$ packed form
19055C99422J24823M9420m3222j3753M4629k119k8662q6174l0085m1981J42409
19044E14707J32969J26740R538o4777L6631J09494o7848j13895Q3967Q560O648
19033G82734j5741N2746j42k8238k000J1062K8107j165m5935P6776r0394p8188
19021F89622L0713Q0520l3759k0851J00175k8362o3392J5114k123m7142N7695
19010G78210R08q7876l7013L15O0958R1913R9195J00463l1968j57965j51332K2233
18998F88041K9158L8471P8557L6689J69200N2471o3649k1862l4564k886l1563
18987I38063N3781L3112K08476O7260o2662r615m3845j36051J26709Q8460o5138
18976A198550K9830J30551o3770r0624N0950n0872L2844L0606K5177J85422J27129
$$ plain form
18965 1605793 1549085 1549741 1593944 1603081 1624523 1632906 1731243 1536818 1469965 1564129 1599455 1646050
18953 1646050 1683573 1708030 1728751 1720223 1752405 1674288 1541618 1464183 1445187 1350367 1284493
18942 1284493 1243982 1396453 1531629 1587888 1495854 1339969 1372626 1334604 1324748 1474032 1588062
18931 1588062 1542679 1629493 1637878 1547606 1482304 1372227 1345059 1424827 1437547 1599626 1835384
18920 1835384 1958352 2034340 2038140 2038044 2093758 2211268 2201191 2155311 2113290 2157042 2273140
18909 2273140 2237876 1983239 1801400 1716115 1815780 1910478 2027098 2220931 2258841 2203326
18899 2203326 2200927 2205815 2210602 2224505 2130506 2150213 2053461 1949663 1956842 1946157 2045377 2036295
18887 2036295 1987251 2117951 2230307 2371858 2522884 2665738 2891993 2988866 3244533 3531974
$$ packed form
18965A605793n6708O56M4203R137K1442Q383R8337j94425o6853R4164L5326M6595
18953A646050L7523K4457K0721q528L2182p8117j32670p7435j8996r4820o5874
18942A284493m0511J52471J35176N6259r2034j55885L2657l8022r856J49284J14030
18931A588062m5383Q6814Q385r0272o5302j10077k7168P9768J2720J62079K35758
18920A835384J22968P5988L800r6N5714J17510j0077m5880m2021M3752J16098
18909B273140l5264k54637j81839q5285R9665R4698J16620J93833L7910n5515
18899B203326k399M888M787J3903r3999J9707r6752j03798P179j0685R9220r082
18887B036295m9044J30700J12356J41551J51026J42854K26255R6873K55667K87441
$$ plain form
18877 3531974 3750989 3986524 4274749 4746504 5211876 5840102 6711560 7905443 9499097
18868 9499097 11476256 13822250 16343613 19126520 22743677 27985105 35124733 42925577
18860 42925577 49185941 53092197 56259914 59970401 64355141 66877356 64534267 59508829
18852 59508829 56630375 57541538 60684849 63930342 66550606 69162207 72415124 75949385
18844 75949385 77762575 75448920 69224803 62474855 57726869 54047600 49887997 45510211
18836 45510211 42155835 40075012 38432064 37105717 36352834 35849878 34910717 32741487
18828 32741487 29898015 27678696 26772503 27052913 28740378 31568131 35028344 38414058
18820 38414058 41816534 45574319 49579957 53667445 57285761 60139795 62737394 64927184
$$ packed form
18877C531974K19015K35535K88225M71755M65372O28226Q71458J193883J593654
18868I499097J977159K345994K521363K782907L617157N241428P139628P800844
18860D2925577O260364L906256L167717L710487M384740K522215k343089n025438
18852E9508829k878454R11163L143311L245493K620264K611601L252917L534261
18844G5949385J813190k313655o224117o749948m747986l679269m159603m377786
18836D5510211l354376k080823j642948j326347p52883n02956r39161k169230
18828C2741487k843472k219319r06193K80410J687465K827753L460213L385714
18820C8414058L402476L757785M005638M087488L618316K854034K597599K189790
$$ plain form
18812 64927184 67228204 71769857 79483098 88393568 94647387 96677464 96448793 97033163
18804 97033163 99802860 102096492 100283693 96679744 95802292 96961843 97331612 96648385
18796 96648385 96089249 96232160 94183398 85608615 70895844 56528421 46156750 39193950
18788 39193950 34541811 31146796 28533388 26719855 25687138 25157709 24794909 24257995
18780 24257995 23572387 22994614 22440506 21696597 20554512 18845550 17100507 15852847 14994661
18771 14994661 14209084 13625225 13122856 12666299 12256834 11801390 11439115 11039615 10458618
18762 10458618 9929248 9463705 9002730 8490675 8181917 7919926 7716995 7466088 7284459
18753 7284459 7169118 6978078 6713784 6659924 6652441 6429833 6064921 5802676 5630012 5560465
$$ packed form
18812F4927184K301020M541653P713241Q910470O253819K030077k28671N84370
18804I7033163K769697K293632j812799l603949q77452J159551L69769o83227
18796I6648385n59136J42911k048762q574783j4712771j4367423j0371671o962800
18788C9193950m652139l395015k613408j813533j032717n29429l62800n36914
18780B4257995o85608n77773n54108p43909j142085j708962j745043j247660q58186
18771A4994661p85577n83859n02369m56557m09465m55444l62275l99500n80997
18762A0458618n29370m65543m60975n12055l08758k61991k02931k50907j81629
18753G284459j15341j91040k64294n3860p483k22608l64912k62245j72664o9547
$$ plain form
18743 5560465 5530383 5703189 5651812 5640082 5467013 5364016 5326912 5168996 4809645 4575591
18733 4575591 4488586 4335899 4221669 4160330 4042242 3906288 3858448 3723307 3638790 3681423
18723 3681423 3610258 3377139 3234861 3095076 3173151 3208407 2969609 2769963 2909290 3000190
18713 3000190 2967722 3009516 2977805 3106242 3206344 3198037 3172532 3183061 3167058 3107180 3038549
18702 3038549 2812434 2667213 2583661 2601798 2574493 2493266 2482484 2426465 2508764 2467459 2266039
18691 2266039 2150673 2039950 2021425 1941031 1873706 1936370 1942860 1954960 1877706 1884840 1918147
18680 1918147 1949119 1959514 1882646 1794043 1753060 1900165 1998235 2098353 2169188 2194464 2106360
18669 2106360 2050438 1935538 1956799 2002625 2007627 2059948 2265557 2379769 2407772 2377462 2348530
$$ packed form
18743E560465l0082J72806n1377j1730j73069j02997l7104j57916l59351k34054
18733D575591q7005j52687j14230o1339j18088j35954m7840j35141q4517M2633
18723C681423p1165k33119j42278j39785P8075L5256k38798j99646J39327R0900
18713C000190l2468M1794l1711J28437J00102q307k5505J0529j6003n9878o8631
18702C038549k26115j45221q3552J8137k7305q1227j0782n6019Q2299m1305k01420
18691B266039j15366j10723j8525q0394o7325O2664O490J2100p7254P134L3307
18680A918147L0972J0395p6868q8603m0983J47105R8070J00118P0835K5276q8104
18669B106360n5922j14900K1261M5826N002N2321K05609J14212K8003l0310k8932
$$ plain form
18658 2348530 2331948 2364281 2366205 2237716 2153996 2113815 2321642 2349616 2257405 2336806 2322267
18647 2322267 2322571 2373142 2378481 2424977 2430764 2486994 2661462 2754693 2787243 2712719 2709745 2661372
18635 2661372 2629352 2637988 2734409 2882524 3047142 3230193 3329662 3289082 3330419 3420386 3578495
18624 3578495 3719711 3775081 3777423 3666592 3605650 3505028 3305339 3282789 3220930 3204420 3224702
18613 3224702 3277382 3278727 3371593 3384502 3368507 3336888 3305705 3353134 3436582 3439523 3432895 3594822
18601 3594822 3777056 4030242 4068864 4141627 4394625 4650045 4866410 5251240 5557114 5981017
18591 5981017 6662369 7689294 9122477 11354928 14348846 17476394 19754917 21093016
18583 21093016 21963606 23081287 24269681 23808090 21342410 18973818 18163255 18370722 18672320
$$ packed form
18658B348530j6582L2333J924j28489q3720m0181K07827K7974r2211P9401j4539
18647B322267L04N0571N339M6496N787N6230J74468R3231L2550p4524k974m8373
18635B661372l2020Q636R6421J48115J64618J83051R9469m0580M1337Q9967J58109
18624C578495J41216N5370K342j10831o0942j00622j99689k2550o1859j6510K0282
18613C224702N2680J345R2866J2909j5995l1619l1183M7429Q3448K941o628J61927
18601C594822J82234K53186L8622P2763K52998K55420K16365L84830L05874M23903
18591E981017O81352J026925J433183K232451K993918L127548K278523J338099
18583B1093016Q70590J117681J188394m61591k465680k368592q10563K07467L01598
$$ plain form
18574 18672320 19297076 20563728 22487983 24851565 26959481 28545621 30359126 31798606
18566 31798606 32224087 31818250 31393793 31263261 29839157 26504778 23327974 21651301 21316044
18557 21316044 21392709 21397414 21316142 21418463 21850204 22125695 21507708 20289322 19632042 19875982
18547 19875982 20408418 20924808 21618347 22488968 23496373 24266753 24665455 25393510 26880914
18538 26880914 29316306 33289140 39587356 47820980 56185405 64175354 72883212 83220531
18530 83220531 94853744 104614027 108665660 108138631 105556269 102228970 98047630 91453401
18522 91453401 82988041 74379790 67300484 62438139 58923079 56675218 55483183 54584697
18514 54584697 52946052 49320981 45166853 42303987 40320189 38382834 36616896 35419939
$$ packed form
18574A8672320O24756J266652J924255K363582K107916J586140J813505J439480
18566C1798606M25481m05837m24457j30532j424104l334379l176804j676673l35257
18557B1316044P6665M705q1272J02321M31741K75491o17987j218386o57280K43940
18547A9875982N32436N16390O93539Q70621J007405P70380L98702P28055J487404
18538B6880914K435392L972834O298216Q233624Q364425P989949Q707858J0337319
18530H3220531J1633213R760283M051633n27029k582362l327299m181340o594229
18522I1453401q465360q608251p079306m862345l515060k247861j192035q98486
18514E4584697j638645l625071m154128k862866j983798j937355j765938j196957
$$ plain form
18506 35419939 34767728 34275418 33005444 30664378 28513238 27315611 27191930 27957369 29811144
18497 29811144 32936739 37534226 43117131 48827284 54377927 60691983 68570202 77631625
18489 77631625 85446200 89788984 92195411 95971067 102492161 109993453 115913808 120098540
18481 120098540 123658676 128080838 134926397 141570385 141981077 136825774 129411999 120417247
18473 120417247 112021416 102773252 89584851 76595200 68469486 65114361 64347465 63812127
18465 63812127 62507881 61047765 60168695 59844971 57518279 51816049 45673872 41731691
18457 41731691 39716415 38370348 37053685 35746963 34884795 34223736 32901346 30411106
18449 30411106 27385080 25064504 23828518 23132049 22877548 23314090 24747266 27105113
$$ packed form
18506C5419939o52211m92310j269974k341066k151140j197627j23681P65439J853775
18497B9811144L125595M597487N582905N710153N550643O314056P878219R061423
18489G7631625P814575M342784K406427L775656O521094P501292N920355M184732
18481A20098540L560136M422162O845559O643988M10692n155303p413775q994752
18473A20417247q395831r248164j3188401j2989651q125714l355125p66896n35338
18465F3812127j304246j460116q79070l23724k326692n702230o142177l942181
18457D1731691k015276j346067j316663j306722q62168o61059j322390k490240
18449C0411106l026026k320576j235986o96469k54501M36542J433176K357847
$$ plain form
18441 27105113 30118910 32765219 34693973 36200886 37760569 40049911 42556688 42986705
18433 42986705 40927378 38246618 36349602 35424683 35027557 33966207 31088693 27061644
18425 27061644 23666101 21301522 19690151 18399665 16957122 15520840 14356515 13362437
18417 13362437 12654235 12073911 11756380 11539722 11282613 10994141 10963803 11086820 11240890
18408 11240890 11409528 11563313 11567952 11582848 11597662 11795623 12120053 12359024 12234887 12097430
18398 12097430 11913836 11801968 11963063 12269828 12427799 12091280 11782831 11993005 12446365
18389 12446365 12694566 12824645 12913290 13020376 13040378 12539483 11523468 10587966 10069137
18380 10069137 9679700 9289283 9046080 8840718 8698180 8309366 7649818 7066022 6673243
$$ packed form
18441B7105113L013797K646309J928754J506913J559683K289342K506777M30017
18433D2986705k059327k680760j897016r24919l97126j061350k877514m027049
18425B7061644l395543k364579j611371j290486j442543j436282j164325r94078
18417A3362437p08202n80324l17531k16658k57109k88472l0338J23017J54070
18408A1240890J68638J53785M639J4896J4814J97961L24430K38971j24137j37457
18398A2097430j83594j11868J61095L06765J57971l36519l08449K10174M53360
18389A2446365K48201J30079Q8645J07086K0002n00895j016015r35502n18829
18380A0069137l89437l90417k43203k05362j42538l88814o59548n83796l92779
$$ plain form
18371 6673243 6377487 6249644 6092490 5962529 5919627 5701961 5398696 5336136 5299370 5194243
18361 5194243 5052978 4923931 4798322 4614886 4510480 4414891 4343180 4265122 4253785 4159092
18351 4159092 4045964 4080281 4015204 4046714 4114416 3970901 3958507 3892019 3776326 3805190 3744665
18340 3744665 3630858 3634984 3670939 3682072 3644526 3762525 3766161 3708344 3604121 3667696 3718911
18329 3718911 3770211 3753753 3623750 3633475 3665489 3609472 3530737 3479332 3427467 3431739 3461787
18318 3461787 3508572 3363046 3318940 3304786 3329100 3234490 3088564 3149040 3205355 3176600 3237887
18307 3237887 3216671 3148381 3146624 3059701 2971156 2972204 3004094 3010503 2972038 2856349 2831685 2816184
18295 2816184 2828733 2932561 2979333 2989238 3023898 2986300 2901056 2961235 2953674 2949949 2822173
$$ packed form
18371F673243k95756j27843j57154j29961m2902k17666l03265o2560l6766j05127
18361E194243j41265j29047j25609j83436j04406r5589p1711p8058j1337r4693
18351D159092j13128L4317o5077L1510O7702j43515j2394o6488j15693K8864o0525
18340C744665j13807M126L5955J1133l7546J17999L636n7817j04223O3575N1215
18329C718911N1300j6458j30003R725L2014n6017p8735n1405n1865M272L0048
18318C461787M6785j45526m4106j4154K4314r4610j45926O0476N6315k8755O1287
18307C237887k1216o8290j757q6923q8545J048L1890O409l8465j15689k4664j5501
18295B816184J2549J03828M6772R905L4660l7598q5244O0179p561l725j27776
$$ plain form
18284 2822173 2827723 2821616 2804621 2764563 2602123 2477130 2461033 2485225 2461026 2399188 2467758
18273 2467758 2632018 2553482 2463909 2534160 2424208 2298429 2205962 2093828 2062936 2090380
18263 2090380 2229676 2188361 2115504 2233640 2266207 2163197 2113246 2075214 2176419 2241871
18253 2241871 2224093 2074453 2070651 2023431 1959052 2085172 2144530 2083902 2128474 2170749 2167096
18242 2167096 2180618 2295779 2195406 2102397 1976962 1825328 1815869 1821912 1844721 2012019 1983522
18231 1983522 1769302 1729641 1787159 1756374 1714388 1739637 1789983 1835019 1782840 1723417 1711328
18220 1711328 1778059 1727884 1860543 1907663 1808051 1757154 1775385 1728330 1644895 1756568 1799581
18209 1799581 1758760 1757012 1742424 1793475 1824713 1762491 1798675 1840055 1900582 1757674 1650325
$$ packed form
18284B822173N550o107j6995m0058j62440j24993j6097K4192k4199o1838O8570
18273B467758J64260p8536q9573P0251j09952j25779r2467j12134l0892K7444
18263B090380J39296m1315p2857J18136L2567j03010m9951l8032J01205O5452
18253B241871j7778j49640l802m7220o4379J26120N9358o0628M4572M2275l653
18242B167096J3522J15161j00373r3009j25435j51634r459O043K2809J67298k8497
18231A983522k14220l9661N7518l0785m1986K5249N0346M5036n2179n9423j2089
18220A711328O6731n0175J32659M7120r9612n0897J8231m7055q3435J11673M3013
18209A799581m0821j748j4588N1051L1238o2222L6184M1380O0527j42908j07349
$$ plain form
18198 1650325 1662452 1770126 1743075 1691348 1752810 1778434 1682777 1598500 1708894 1815670 1824780
18187 1824780 1729574 1528332 1489044 1629234 1748395 1656678 1495682 1425163 1491906 1623446
18177 1623446 1620792 1607498 1580927 1498430 1605259 1621318 1601978 1516635 1485909 1442781 1442187 1521307
18165 1521307 1443893 1347175 1351564 1451286 1531245 1620949 1573266 1447522 1328076 1147823 1245523
18154 1245523 1307438 1466367 1604291 1471120 1332461 1308790 1357207 1430823 1519202 1710424
18144 1710424 1706570 1638337 1628916 1557245 1571686 1587033 1647861 1884298 2009616 1995474 2002389
18133 2002389 2166698 2250881 2269476 2593635 2960135 3194728 3374353 3672827 4216078 4747279
18123 4747279 5339880 6252758 7492629 8942034 10831547 13778854 18379351 26031673
$$ packed form
18198A650325J2127J07674k7051n1727O1462K5624r5657q4277J10394J06776R110
18187A824780r5206k01242l9288J40190J19161r1717j60996p0519O6743J31540
18177A623446k654j3294k6571q2497J06829J6059j9340q5343l0726m3128n94P9120
18165A521307p7414r6718M389R9722P9959Q9704m7683j25744j19446j80253R7700
18154A245523O1915J58929J37924j33171j38659k3671M8417P3616Q8379J91222
18144A710424l854o8233r421p1671J4441J5347O0828K36437J25318j4142O915
18133B002389J64309Q4183J8595L24159L66500K34593J79625K98474N43251N31201
18123D747279N92601R12878J239871J449405J889513K947307M600497P652322
$$ plain form
18115 26031673 38213616 55536634 74529038 86629936 91366148 93963539 98653117
18108 98653117 106110160 102116396 78821141 54525313 39824486 31366269 25800800 21848386
18100 21848386 18857776 16450909 14645332 13179444 11995760 11043849 10378926 9716353
18092 9716353 9247815 8931962 8661860 8222497 7830065 7397290 6893389 6655087 6585376 6350955
18082 6350955 6181462 5925303 5605403 5432858 5273191 5004401 4717606 4564820 4450576
18073 4450576 4204068 4007845 4039903 4070390 3938880 3807362 3708132 3607771 3468429 3373509
18063 3373509 3210691 3146194 3130342 3091617 2966627 2879481 2850398 2835854 2834266 2786379 2728398
18052 2728398 2598654 2490810 2399584 2323481 2432038 2445029 2412760 2372085 2368686 2267786 2174340
$$ packed form
18115B6031673J2181943J7323018J8992404J2100898M736212K597391M689578
18108I8653117P457043l993764k3295255k4295828j4700827q458217n565469l952414
18100B1848386k990610k406867j805577j465888j183684r51911o64923o62573
18092I716353m68538l15853k70102m39363l92432m32775n03901k38302o9711k34421
18082F350955j69493k56159l19900j72545j59667k68790k86795j52786j14244
18073D450576k46508j96223L2058L0487j31510j31518r9230j00361j39342r4920
18063C373509j62818o4497j5852l8725j24990q7146k9083j4544j588m7887n7981
18052B728398j29744j07844r1226p6103J08557J2991l2269m0675l399j00900r3446
$$ plain form
18041 2174340 2021723 2017471 2104534 2046448 1911999 1733638 1802164 1862982 1705870 1665821 1536144
18030 1536144 1418056 1540349 1617216 1696252 1840533 1781557 1523664 1457233 1474771 1436852
18020 1436852 1446958 1454729 1528244 1636150 1763170 1684281 1611408 1553001 1580150 1598845 1560839
18009 1560839 1709461 1585967 1414924 1355182 1283459 1217057 1199716 1228978 1228653 1265785 1266356
17998 1266356 1261924 1271238 1267556 1261386 1146071 1187000 1145134 1125765 1254517 1262314 1238137 1222216
17986 1222216 1158899 1119658 1060920 1085601 1138861 1186936 1235685 1122359 1099285 1093590 1134977
17975 1134977 1174859 1184481 949535 881724 916564 1034110 1004812 1027608 965456 937194 1014422
17964 1014422 974197 895036 819015 849410 823027 883564 937041 990000 998563 1035490 972726
$$ packed form
18041B174340j52617m252Q7063n8086j34449j78361O8526O0818j57112m0049j29677
18030A536144j18088J22293P6867P9036J44281n8976k57893o6431J7538l7919
18020A436852J0106P771P3515J07906J27020p8889p2873n8407K7149J8695l8006
18009A560839J48622j23494j71043n9742p1723o6402j7341K9262l25L7132N71
17998A266356m432R314l682o170j15315M0929m1866j9369J28752P797k4177j5921
17986A222216o3317l9241n8738K4681N3260M8075M8749j13326k3074n695M1387
17975A134977L9882R622k34946o7811L4840J17546k9298K2796o2152k8262P7228
17964A014422m0225p9161p6021L0395k6383O0537N3477N2959Q563L6927o2764
$$ plain form
17953 972726 923922 959794 974920 936884 833603 800115 901633 684531 585867 556307 562263
17942 562263 577874 657876 766223 891225 858617 726338 772857 831644 622550 612929 720801
17931 720801 691619 645492 616635 689774 687225 766241 831143 839918 778076 733635 647035 579451
17919 579451 620502 665508 594706 564752 585242 526606 534776 523160 439090 364951 373102 336694
17907 336694 335007 458246 460851 425599 435604 399537 315409 237472 299496 370760 403416 575646
17895 575646 643633 634989 615977 629316 584061 548567 647549 651922 603825 448273 496052 444224
17883 444224 421913 468544 630002 652270 599727 580351 531085 631549 751282 705123 658578
17872 658578 716802 589867 438798 416432 356407 300959 327175 336730 328981 306339 310293 298653
$$ packed form
17953I72726m8804L5872J5126l8036j03281l3488J01518k17102r8664k9560N956
17942E62263J5611Q0002J08347J25002l2608j32279M6519N8787k09094r621J07872
17931G20801k9182m6127k8857P3139k549P9016O4902Q775o1842m4441q6600o7584
17919E79451M1051M5006p0802k9954K0490n8636Q170j1616q4070p4139Q151l6408
17907C36694j687J23239K605l5252J0005l6067q4128p7937O2024P1264L2656J72230
17895E75646O7987q644j9012J3339m5255l5494R8982M373m8097j55552M7779n1828
17883D44224k2311M6631J61458K2268n2543j9376m9266J00464J19733m6159m6545
17872F58578N8224j26935j51069k2366o0025n5448K6216R555p749k2642L954j1640
$$ plain form
17860 298653 299963 244019 293774 394699 367592 359190 384134 398498 382967 335383 277238 238968
17848 238968 232831 265015 100013 37122 71241 126442 259441 291691 321281 279845 320309
17837 320309 352285 393522 457142 443491 363163 313801 321071 155162 110158 146093 203610
17826 203610 253547 284795 258831 178433 125792 114436 225547 218340 135068 193066 288284
17815 288284 327462 337925 342774 393508 451184 335907 340004 304107 315238 300664 241254 264703
17803 264703 239553 207191 209193 300518 424375 274238 188122 256865 289555 179137 287807
17792 287807 360197 346909 368778 294778 197711 300283 340242 274774 271935 314646 316140 276244
17780 276244 291784 342185 371615 364480 312558 336982 352395 223181 261652 293111 248360
$$ packed form
17860B98653J310n5944M9755J00925k7107q402K4944J4364j5531m7584n8145l8270
17848B38968o137L2184j65002o2891L4119N5201J32999L2250K9590m1436M0464
17837C20309L1976M1237O3620j3651q0328m9362P270j65909m5004L5935N7517
17826B03610M9937L1248k5964q0398n2641j1356J11111p207q3272N7998R5218
17815B88284L9178J0463M849N0734N7676j15277M097l5897J1131j4574n9410K3449
17803B64703k5150l2362K002R1325J23857j50137q6116O8743L2690j10418J08670
17792B87807P2390j3288K1869p4000r7067J02572L9959o5468k839M2711J494l9896
17780B76244J5540N0401K9430p135n1922K4424J5413j29214L8471L1459m4751
$$ plain form
17769 248360 282359 273853 218120 104442 81609 167525 213569 255132 176251 -3494 46775
17758 46775 167679 201781 132013 52874 152902 179952 294498 435553 496351 372770 257892
17747 257892 174329 215058 404538 374513 294091 193092 153099 213103 299163 221811 128768
17736 128768 202934 198465 187976 162944 148869 203753 288880 246979 111717 62936 69758 3933
17724 3933 16269 107602 38788 -76985 -24996 -18699 106898 209290 115059 151552 245834
17713 245834 262131 260024 199710 218783 254243 242018 151838 98560 89718 161077 171311 267956
17701 267956 268358 331030 322200 227953 231621 222209 264997 226275 139698 144497 82624 5523 40270
17688 40270 -14663 558 -34961 -1848 76485 151986 156754 147406 170942 202385 90419 52479
$$ packed form
17769B48360L3999q506n5733j13678k2833Q5916M6044M1563p8881j79745N0269
17758D6775J20904L4102o9768p9139J00028K7050J14546J41055O0798j23581j14878
17747B57892q3563M0729J89480l0025q0422j00999l9993O0004Q6060p7352r3043
17736A28768P4166m469j0489k5032j4075N4884Q5127m1901j35262m8781O822o5825
17724C933J2336R1333o8814j15773N1989O297J25597J02392r4231L6493R4282
17713B45834J6297k107o0314J9073L5460j2225r0180n3278q842P1359J0234R6645
17701B67956M02O2672q830r4247L668r412M2788l8722q6577M799o1873p7101L4747
17688D0270n4933J5221l5519L3113P8333P5501M768r348K3536L1443j11966l7940
$$ plain form
17676 52479 182967 295248 188521 205936 203106 160710 59963 -36681 42127 87550 197642
17665 197642 390011 397055 350638 280265 215801 200013 173011 187197 259844 262983 347421 340753
17653 340753 297171 330080 270571 173587 74913 82128 134621 110944 73021 78634 62335 -26257
17641 -26257 79998 149067 60575 34664 121530 243705 222663 88665 37194 118871 204286
17630 204286 230190 287072 350892 373110 448659 261434 148344 179467 147999 116013 102251
17619 102251 74985 85117 147846 149728 27208 147566 235456 172740 3518 -98613 -2075
17608 -2075 55454 35262 14391 -33165 131242 37265 56669 106333 103372 69315 87470 13815
17596 13815 24348 85273 69248 -2441 21606 16830 -153590 -269874 -166757 -143903 -106878
$$ packed form
17676E2479J30488J12281j06727J7415k830m2396j00747r6644P8808M5423J10092
17665A97642J92369P044m6417p0373o4464j5788k7002J4186P2647L139Q4438o668
17653C40753m3582L2909n9509r6984r8674P215N2493k3677l7923N613j6299q8592
17641b6257J06255O9069q8492k5911Q6866J22175k1042j33998n1471Q1677Q5415
17630B04286K5904N6882O3820K2218P5549j87225j13090L1123l1468l1986j3762
17619A02251k7266J0132O2729J882j22520J20358Q7890o2716j69222j02131R6538
17608b075N7529k0192k0871m7556J64407r3977J9404M9664k961l4057J8155p3655
17596A3815J0533O0925j6025p1689K4047m776j70420j16284J03117K2854L7025
$$ plain form
17585 -106878 -62832 -48687 -51806 -32239 11996 -120358 -190938 -181663 -72091 76767 236875
17574 236875 392014 402400 167342 92796 87563 149688 184327 89148 28518 59222 138680
17563 138680 111187 106056 72560 -21650 -9033 98472 50382 8647 29878 36575 2239 -73398
17551 -73398 -95554 -163111 -166740 -119129 -161440 -191707 -75404 29128 13080 -54831 25723
17540 25723 62878 -10457 -60133 -88236 -121646 -22111 -56912 -88147 -4329 39469 85791 114707
17528 114707 14263 62851 76579 123838 233764 287543 315115 352234 202721 88510 107117
17517 107117 50167 -25985 21410 36946 -9378 35918 119777 61125 -41065 -91965 8874
17506 8874 81821 -20956 -23035 -5923 59697 118713 103302 65810 94340 194052 320466 291778
$$ packed form
17585a06878M4046J4145l119J9567M4235j32354p0580R275J09572J48858J60108
17574B36875J55139J0386k35058p4546n233O2125L4639r5179o0630L0704P9458
17563A38680k7493n131l3496r4210J2617J07505m8090m1735K1231O697l4336p5637
17551g3398k2156o7557l629M7611m2311l0267J16303J04532j6048o7911Q0554
17540B5723L7155p3335m9676k8103l3410R9535l4801l1235Q3818M3798M6322K8916
17528A14707j00444M8588J3728M7259J09926N3779K7572L7119j49513j14211J8607
17517A07117n6950p6152M7395J5536m6324M5296Q3859n8652j02190n0900J00839
17506H874P2947j02777k079J7112O5620N9016j5411l7492K8530R9712J26414k8688
$$ plain form
17494 291778 197706 98295 3324 77535 149688 195667 255284 83636 -39943 -14644 170983
17483 170983 234199 160452 187939 86753 36367 64417 -2461 -119292 -74611 60273 104946
17472 104946 126252 158278 57348 38023 110491 166277 67023 15352 33752 -9304 -28496
17461 -28496 -27252 -15146 1914 -3893 -61598 -144724 -160623 -147296 -14801 41201 101135 91478
17449 91478 114504 179648 271362 427586 455996 479649 542680 618503 583946 557920 411401
17438 411401 251939 265969 332900 244324 91672 53610 -32828 -28664 -90220 -69705 -91315
17427 -91315 19697 87042 149611 107619 18442 -19570 -37105 -18042 -58623 24819 62791
17416 62791 161281 116907 80872 9235 -21269 102942 118966 53023 47701 5344 56682 71163
$$ packed form
17494B91778r4072r9411r4971P4211P2153M5979N9617j71648j23579K5299J85627
17483A70983O3216p3747K7487j01186n0386K8050o6878j16831M4681J34884M4673
17472A04946K1306L2026j00930j9325P2468N5786r9254n1671J8400m3056j9192
17461b8496J244J2106J7060n807n7705q3126j5899J3327J32495N6002N9934r657
17449I1478K3026O5144R1714J56224K8410K3653O3031P5823l4557k6026j46519
17438D11401j59462J4030O6931q8576j52652l8062q6438M164o1556K0515k1610
17427i1315J11012O7345O2569m1992q9177l8012j7535J9063m0581Q3442L7972
17416F2791R8490m4374l6035p1637l0504J24211J6024o5943n322m2357N1338J4481
$$ plain form
17404 71163 52902 -89043 -90450 2360 38702 -49455 38552 105398 53238 39681 14857 -17444
17392 -17444 -30808 117597 89127 99288 133191 40361 13463 69113 4410 -42679 -72166
17381 -72166 -46713 -18823 62089 198105 230509 145116 96324 20335 -14458 -45719 -36686 -18456
17369 -18456 -156136 -249254 -192665 -165481 -115730 -98100 -118648 -107988 -107306 -28481 103067 106220
17357 106220 -27646 -81454 -145822 -184246 -131229 -114512 -92616 -30087 34286 65735 24238
17346 24238 -3986 98014 192525 106617 110673 23690 -7842 124073 60858 -41349 -74538
17335 -74538 -54502 -52233 -16504 1814 -39398 -37666 -67396 -121583 -147482 -103458 -77067 -75244
17323 -75244 57040 110404 -29640 -52249 27975 85292 36213 -20313 45267 -45034 -72590
$$ packed form
17404G1163j8261j41945j407R2810L6342q8157Q8007O6846n2160j3557k4824l2301
17392a7444j3364J48405k8470J0161L3903r2830k6898N5650o4703m7089k9487
17381g2166K5453K7890Q0912J36016L2404q5393m8792p5989l4793l1261R033J8230
17369a8456j37680r3118N6589K7184M9751J7630k0548J0660O82P8825J31548L153
17357A06220j33866n3808o4368l8424N3017J6717K1896O2529O4373L1449m1497
17346B4238k8224J02000R4511q5908M056q6983l1532J31915o3215j02207l3189
17335g4538K0036K269L5729J8318m1212J732k9730n4187k5899M4024K6391J823
17323g5244J32284N3364j40044k2609Q0224N7317m9079n6526O5580r0301k7556
$$ plain form
17312 -72590 50115 52475 70805 -38787 -89939 -19584 47206 118084 109306 74174 -25180 -8517
17300 -8517 81301 100033 50363 18692 5587 -90662 -146806 -187253 -104582 -118970 -175389 -161067
17288 -161067 -54188 19709 66715 11427 -54899 -80592 -99103 19352 -3518 41711 -85602
17277 -85602 -49038 -54 -20498 -45246 -84999 -101287 -76082 84032 143350 236206 175414
17266 175414 150668 100518 75556 1292 19911 -88942 -184180 -202140 -158274 -109751 -75136
17255 -75136 44652 68277 -6050 -105836 -53875 -32804 -62846 -72809 81735 158273 149472 47754
17243 47754 22159 66967 64637 32803 104741 150217 160984 136159 19793 843 139070
17232 139070 219929 242894 8657 -96862 -116133 -61658 42511 208725 189831 108440 47705
$$ packed form
17312g2590J22705K360J8330j09592n1152P0355O6790P0878q778l5132r9354J6663
17300h517Q9818J8732m9670l1671j3105r6249n6144m0447Q2671j4388n6419J4322
17288a61067J06879P3897M7006n5288o6326k5693j8511J18455k2870M5229j27313
17277h5602L6564M8984k0444k4748l9753j6288K5205J60114N9318R2856o0792
17266A75414k4746n0150k4962p4264J8619j08853r5238j7960M3866M8523L4615
17255g5136J19788K3625p4327r9786N1961K1071l0042r963J54544P6538q801j01718
17243D7754k5595M4808k330l1834P1938M5476J0767k4825j16366j8950J38227
17232A39070Q0859K2965k34237j05519j9271N4475J04169J66214j8894q1391o0735
$$ plain form
17221 47705 111031 163112 172689 117939 -21007 -47380 -68913 -138404 -174403 -158256 -88239 19302
17209 19302 -37059 -23745 55063 135794 136213 24916 19856 32863 109044 5093 -16581 -96537
17197 -96537 -116313 -118014 -105733 -72667 -155917 -30800 10542 -114167 -101204 -33741 104570
17186 104570 -39900 -221693 -283317 -128022 27905 41534 109958 183750 108875 32191 2837
17175 2837 -31413 -28244 -134231 -209329 -99524 68024 80674 -47655 -7948 85545 25048
17164 25048 -30712 -93919 -108993 -106942 -115052 -1144 -88831 -130245 -31395 -11773 64696 87386
17152 87386 99551 154955 230012 155275 172283 33944 -172883 -221276 -177711 -133232 -174540
17141 -174540 -167185 -102158 -2658 130591 24579 -99746 -233269 -288148 -158633 -79066 46461
$$ packed form
17221D7705O3326N2081R577n4750j38946k6373k1533o9491l5999J6147P0017J07541
17209A9302n6361J3314P8808Q0731M19j11297n060J3007P6181j03951k1674p9956
17197i6537j9776j701J2281L3066q3250J25117M1342j24709J2963O7463J38311
17186A04570j44470j81793o1624J55295J55927J3629O8424P3792p4875p6684k9354
17175B837l4250L169j05987p5098J09805J67548J2650j28329L9707R3493o0497
17164B5048n5760o3207j5074K051q110J13908q7687m1414R8850J9622P6469K2690
17152H7386J2165N5404P5057p4737J7008j38339k06827m8393M3565M4479m1308
17141a74540P355O5027R9500J33249j06012j24325j33523n4879J29515P9567J25527
$$ plain form
17130 46461 29225 38619 66366 -64051 -88585 -64940 -62050 54226 201151 245151 144317
17119 144317 230522 105969 26237 72974 69925 25785 37296 50736 -6051 -121689 -122266 -109256
17107 -109256 6948 20260 -26608 83705 203731 226062 202676 216885 199688 170340 249663
17096 249663 282841 273138 313289 199962 115646 58615 -33928 69754 149026 343775 387038
17085 387038 270321 172911 28282 -106364 -208936 -138118 -116257 -103431 35256 158423
17075 158423 141153 30056 16498 -145253 -152989 -66937 40093 74186 48402 85722 101311
17064 101311 6995 -5697 -43577 -28890 116286 132592 83890 73271 72158 64024 74713 46805
17052 46805 168996 212475 215918 265790 104388 -53698 -89005 21761 233 -13206 50884
$$ packed form
17130D6461j7236R394K7747j30417k4534K3645K890J16276J46925M4000j00834
17119A44317Q6205j24553p9732M6737l049m4140J1511J3440n6787j15638n77J3010
17107a09256J16204J3312m6868J10313J20026K2331k3386J4209j7197k9348P9323
17096B49663L3178r703M0151j13327q4316n7031r2543J03682P9272J94749M3263
17085C87038j16717r7410j44629j34646j02572P0818K1861J2826J38687J23167
17075A58423j7270j11097j3558j61751p736Q6052J07030L4093k5784L7320J5589
17064A01311r4316j2692l7880J4687J45176J6306m8702j0619j113q134J0689k7908
17052D6805J22191M3479L443M9872j61402j58086l5307J10766k1528j3439O4090
$$ plain form
17041 50884 1221 126883 98987 32424 -34911 61184 32564 39189 53492 -29340 -87410 -121496
17029 -121496 -42130 44921 160732 235467 139239 287 -76931 -73922 137548 47889 -68901
17018 -68901 109692 146457 38756 -105457 -153547 -165523 -99640 -69980 -8210 -69635 -43117
17007 -43117 -60589 -52732 -91317 43151 79782 142242 151687 95964 -10214 81621 162340 153732
16995 153732 68921 -78993 -82841 -14139 82170 14810 40993 -22389 -177820 -212246 -112381
16984 -112381 53209 38703 -78574 -91363 -72087 14928 56113 15408 7508 89546 167999
16973 167999 55659 35396 61171 127771 162783 44900 89291 62980 -75239 -98467 -50699
16962 -50699 18140 -33659 47950 -77296 -226479 -181481 -176581 -79637 -128973 -114029 -123668 43638
$$ packed form
17041E0884m9663J25662k7896o6563o7335R6095k8620O625J4303q2832n8070l4086
17029a21496P9366Q7051J15811P4735r6228j38952p7218L009K11470q9659j16790
17018f8901J78593L6765j07701j44213m8090j1976O5883K9660O1770o1425K6518
17007d3117j7472P857l8585J34468L6631O2460R445n5723j06178R1835Q0719q608
16995A53732q4811j47914l848O8702R6309o7360K6183o3382j55431l4426R9865
16984a12381J65590j4506j17277j2789J9276Q7015M1185m0705p900Q2038P8453
16973A67999j12340k0263K5775O6600L5012j17883M4391k6311j38219k3228M7768
16962e0699O8839n1799Q1609j25246j49183M4998M900R6944m9336J4944r639J67306
$$ plain form
16950 43638 150989 195821 50738 -36115 18266 78212 100406 85777 156601 243240 287719
16939 287719 298780 132348 45895 15795 -3263 -11154 -124799 -118907 -105597 -194520 -157627
16928 -157627 -100223 8107 -46284 -146098 -205394 -182112 -3760 -3385 -54908 -61632 145991
16917 145991 240877 167169 173720 187146 133312 36198 -130760 -100562 -19392 61676 -27885
16906 -27885 -131487 -98008 -50831 -75937 -109154 -55446 37892 -49994 -126606 -151314 -106141
16895 -106141 -70683 -136357 -46096 12922 -103430 -142636 -91897 6447 179120 134514 63785
16884 63785 67277 120043 79694 -87365 -194804 -169915 -84481 30226 71727 39095 -65785
16873 -65785 -26922 -72414 -160412 -202191 -181575 -187260 -210599 -161621 -196044 -186342 -52358 -111173
$$ packed form
16950D3638J07351M4832j45083q6853N4381N9946K2194j4629P0824Q6639M4479
16939B87719J1061j66432q6453l0100j9058p891j13645N892J3310q8923L6893
16928a57627N7404J08330n4391r9814n9296K3282J78352L75n1523o724K07623
16917A45991R4886p3708O551J3426n3834r7114j66958L0198Q1170Q1068q9561
16906b7885j03602L3479M7177k5106l3217N3708R3338q7886p6612k4708M5173
16895a06141L5458o5674R0261N9018j16352l9206N0739R8344J72673m4606p0729
16884F3785L492N2766m0349j67059j07439K4889Q5434J14707M1501l2632j04880
16873f5785L8863m5492q7998m1779K0616n685k3339M8978l4423R702J33984n8815
$$ plain form
16861 -111173 21056 115124 -36041 -179122 -175001 -73388 9015 4880 -88147 -98797 30724
16850 30724 105050 118124 88900 -34035 -16681 -86262 -59095 80654 27443 -84786 -35403
16839 -35403 18012 -45337 -65483 -61992 -120315 -60913 -24128 -65311 -74765 90742 85146 61216
16827 61216 35193 56852 46009 36373 91695 53314 20078 104672 -12959 -10044 29271 58841
16815 58841 98588 -9707 -30047 -48301 -59876 -57692 -84258 9649 126704 72022 105930
16804 105930 -18887 -95362 68774 273778 196430 -1819 -95404 -167868 -97308 -103562 -14007
16793 -14007 -73339 -137254 -85125 -38018 -60001 -56580 16650 -69345 -218671 -247541 -158251 -200679
16781 -200679 -101789 -138217 -126984 -145511 -228819 -133885 -145662 -155012 -168604 -175674 -91070 -80267
$$ packed form
16861a11173J32229R4068j51165j43081M121J01613Q2403m135r3027j0650J29521
16850C0724P4326J3074k9224j22935J7354o9581K7167J39749n3211j12229M9383
16839c5403N3415o3349k0146L491n8323N9402L6785m1183r454J65507n596k3930
16827F1216k6023K1659j0843r636N5322l8381l3236Q4594j17631K915L9315K9570
16815E8841L9747j08295k0340j8254j1575K184k6566R3907J17055n4682L3908
16804A05930j24817p6475J64136K05004p7348j98249r3585p2464P0560o254Q9555
16793a4007n9332o3915N2129M7107k1983L421P3230q5995j49326k8870Q9290m2428
16781b00679R8890l6428J1233j8527q3308R4934j1777r350j3592p070Q4604J0803
$$ plain form
16769 -80267 -109858 -118023 -137394 -107880 -250754 -313344 -257895 -187302 -104875 -4270 7843
16758 7843 -126559 -47443 -67137 -132606 -21464 59139 -54859 -208937 -189965 -85930 41822
16747 41822 79835 -45584 -106389 -26927 93390 161785 214519 338856 241415 31455 -55364
16736 -55364 5103 81011 83887 77556 136074 137287 147571 76851 -59541 -99212 -65375 -13311
16724 -13311 -24751 -81727 -93652 -83794 -93263 -101474 -102218 -137709 -150232 -149132 -73276 -122529 -217088
16711 -217088 -281205 -349325 -301044 -98323 -79895 -112097 37757 30792 -29235 -88173 -160198
16700 -160198 -160069 -105276 -61385 50711 33670 21770 -54595 -60921 -14469 -50908 -9842 85808
16688 85808 31777 14453 36296 -4770 14540 -56945 58530 64260 7264 -97372 -138734
$$ packed form
16769h0267k9591q165j9371K9514j42874o2590N5449P0593Q2427J00605J2113
16758G843j34402P9116j9694o5469J11142Q0603j13998j54078J8972J04035J27752
16747D1822L8013j25419o0805P9462J20317O8395N2734J24337r7441k09960q6819
16736e5364O0467P5908K876o331N8518J213J0284p0720j36392l9671L3837N2064
16724a3311j1440n6976j1925R858r469q211p44l5491j2523J100P5856m9253r4559
16711b17088o4117o8120M8281K02721J8428l2202J49854o965o0027n8938p2025
16700a60198J29N4793M3891J12096j7041j1900p6365o326M6452l6439M1066R5650
16688H5808n4031j7324K1843m1066J9310p1485J15475N730n6996j04636m1362
$$ plain form
16677 -138734 -45759 67129 27705 -36039 -93065 -69522 53293 191609 107364 63128 -13335
16666 -13335 -33096 -63783 -23915 -30788 2811 73889 77972 55105 -15036 -171600 -284126 -159465
16654 -159465 -95029 -128079 35678 1297 -2900 45800 22771 -37804 -120988 -61535 -53309 745
16642 745 -14830 -41239 30920 -6552 -82423 -8162 89070 59344 12568 36379 -55982 -105711
16630 -105711 -123925 -148075 -177021 -216092 -139117 -79772 -69933 -11544 28500 -4877 -142397
16619 -142397 -135503 -95022 -131767 -24301 206975 134681 65411 24382 -85245 -182911 -254139
16608 -254139 -156726 -3666 105590 116789 86448 163296 168389 113513 54817 -10910 -92327
16597 -92327 63464 222552 264918 188134 203439 147251 36141 -31162 -50753 -39274 -134626
$$ packed form
16677a38734R2975J12888l9424o3744n7026K3543J22815J38316q4245m4236p6463
16666a3335j9761l0687L9868o873L3599P1078M083k2867p0141j56564j12526J24661
16654a59465O4436l3050J63757l4381m197M8700k3029o0575q3184N9453Q226N4054
16642G45j5575k6409P2159l7472p5871P4261R7232k9726m6776K3811r2361m9729
16630a05711j8214k4150k8946l9071P6975N9345R839N8389M0044l3377j37520
16619a42397O894M0481l6745J07466K31276p2294o9270m1029j09627r7666p1228
16608b54139R7413J53060J09256J1199l0341P6848N093n4876n8696o5727q1417
16597i2327J55791J59088M2366p6784J5305n6188j11110o7303j9591J1479r5352
$$ plain form
16586 -134626 -152970 -92233 -146313 -98782 35640 92783 8856 -53541 -117423 -176143 -118808
16575 -118808 -87542 -111350 -59561 -46915 -53875 -100638 -128379 8917 123309 160814 -9788
16564 -9788 -157929 -193352 -86104 97187 48631 -173755 -122077 -4777 80583 67401 80704
16553 80704 -104266 -150236 -148265 -159428 -128075 -11488 -62971 -175794 -285003 -147922 -127833
16542 -127833 -72551 -29604 -55566 81479 129205 75801 -42634 -14645 -144125 -223553 -163287
16531 -163287 31774 128124 19702 -43626 8499 63087 45138 99791 79916 76346 76380 -15010
16519 -15010 -14295 78001 5503 -35642 21912 42346 -5707 15624 -47209 -38809 -28208 35597
16507 35597 23783 107765 133642 74651 73888 111969 202976 90317 -55589 -117869 -206568 -195482
$$ packed form
16586a34626j8344O0737n4080M7531J34422N7143q3927o2397o3882n8720N7335
16575a18808L1266k3808N1789J2646o960m6763k7741J37296J14392L7505j70602
16564i788j48141l5423J07248J83291m8556k22386N1678J17300Q5360j3182J3303
16553H0704j84970m5970J971j1163L1353J16587n1483j12823j09209J37081K0089
16542a27833N5282M2947k5962J37045M7726n3404j18435K7989j29480p9428O0266
16531a63287J95061R6350j08422o3328N2125N4588j7949N4653j9875l570L4r1390
16519a5010P15R2296p2498m1145N7554K0434m8053K1331o2833Q400J0601O3805
16507C5597j1814Q3982K5877n8991p63L8081R1007j12659j45906o2280q8699J1086
$$ plain form
16495 -195482 -236754 -139981 -30082 84759 124679 139 -78100 -86765 -49109 -6175 41160
16484 41160 14542 -12569 -52081 -69129 -133416 -190902 -133065 -45508 -55318 -109674 -131961 -132001
16472 -132001 -91583 -12079 25164 55347 20872 -49172 -168882 -160551 -118156 -15402 -31282
16461 -31282 -98139 -162995 -95391 -56830 38698 7468 1941 -134713 -93530 -157633 -184431 -133135
16449 -133135 -112098 -146446 -137156 -161457 -69465 -4491 47962 77179 85703 -54733 -237165
16438 -237165 -241700 -177671 -18417 4479 -43095 46553 -34386 -180572 -136775 -60859 -51419
16427 -51419 54982 150192 235823 225258 132461 87349 -108562 -109144 -8097 -115171 -101252
16416 -101252 -31672 -129607 -241176 -252707 -191823 -39108 76455 -7637 -168557 -148490 -70843
$$ packed form
16495a95482m1272R6773J09899J14841L9920j24540p8239q665L7656M2934M7335
16484D1160k6618k7111l9512j7048o4287n7486N7837Q7557r810n4356k2287m0
16472a32001M0418P9504L7243L0183l4475p0044j19710Q331M2395J02754j5880
16461c1282o6857o4856O7604L8561R5528l1230n527j36654M1183o4103k6798N1296
16449a33135K1037l4348R290k4301R1992O4974N2453K9217Q524j40436j82432
16438b37165m535O4029J59254K2896m7574Q9648q0939j46186M3797P5916R440
16427e1419J06401R5210Q5631j0565r2797m5112j95911n82J01047j07074J3919
16416a01252O9580r7935j11569j1531O0884J52715J15563q4092j60920K0067P7647
$$ plain form
16405 -70843 -87135 -181861 -149250 -152202 -95528 -46748 -92764 -110768 -76576 -61934 -28538 -72996
16393 -72996 64522 241828 216889 78913 -130410 -174008 -168744 -69745 46692 131895 276266
16382 276266 314496 259148 168936 73396 -15324 -59646 -99324 -192208 -122847 -65421 -27972
16371 -27972 44531 -66119 -43980 35974 42109 21890 89961 7003 -165382 -179930 -142397
16360 -142397 -112045 -82593 -88925 -253271 -328362 -325343 -205384 -189186 -152605 -147838 -161761 -5011
16348 -5011 170351 139624 39380 53268 129673 177685 99702 -28177 105538 205870 19941
16337 19941 -183330 -181992 -50269 -37094 -90011 -45312 -107257 -50773 -135482 -148419 -232590
16326 -232590 -290535 -112475 84394 130456 104850 162670 104382 -80320 -232437 -236862 -249875
$$ packed form
16405g0843j6292r4726L2611k952N6674M8780m6016j8004L4192J4642L3396m4458
16393g2996J37518J77306k4939j37976k09323m3598N264R8999J16437Q5203J44371
16382B76266L8230n5348r0212r5540q8720m4322l9678r2884O9361N7426L7449
16371b7972P2503j10650K2139P9954O135k0219O8071q2958j72385j4548L7533
16360a42397L0352K9452o332j64346p5091L019J19959J6198L6581M767j3923J56750
16348e011J75362l0727j00244J3888P6405M8012p7983j27879J33715J00332j85929
16337A9941k03271J338J31723J3175n2917M4699o1945N6484q4709j2937q4171
16326b32590n7945J78060J96869M6062k5606N7820n8288j84702j52117m425j3013
$$ plain form
16315 -249875 -189066 -208465 -193481 -189675 -189187 -20084 33577 13541 -180998 -198086 -102945 -63594
16303 -63594 45655 172106 253628 242343 68762 -26897 -178 39872 177427 207431 67602
16292 67602 63903 49736 -97940 -202185 -137541 18521 142064 175635 83248 3792 26846
16281 26846 131196 70598 -37073 -135191 -104930 -107890 -217438 -187772 -133372 -200824 -179609
16270 -179609 -25103 20449 -74367 -189944 -96476 -72820 -19117 61707 57281 -52416 -73478
16259 -73478 -11322 -56955 -68714 -52260 47844 62942 52648 63971 85519 40206 73099
16248 73099 137845 123270 40984 -343 -12031 44182 -54625 -173132 -134090 6164 4608
16237 4608 77178 104082 79682 37354 149009 119438 27133 3298 -3385 -45094 -109364 -186485
$$ packed form
16315b49875O0809j9399J4984L806M88J69103N3661k0036j94539j7088R5141L9351
16303f3594J09249J26451Q1522j1285j73581r5659K6719M0050J37555L0004j39829
16292F7602l699j4167j47676j04245O4644J56062J23543L3571r2387p9456K3054
16281B6846J04350o0598j07671r8118L0261k960j09548K9666N4400o7452K1215
16270a79609J54506M5552r4816j15577R3468K3656N3703Q0824m426j09697k1062
16259g3478O2156m5633j1759J6454J00104J5098j0294J1323K1548m5313L2893
16248G3099O4746j4575q2286m1327j1688N6213r8807j18507L9042J40254j556
16237D608P2570K6904k4400m2328J11655k9571r2305k3835o683m1709o4270p7121
$$ plain form
16225 -186485 -113795 30628 11193 -44490 -32729 -47274 -78114 -90776 -52930 -72486 -198477
16214 -198477 -120046 575 -44657 -16544 50303 56928 -24851 -43760 -74301 -113811 -82188
16203 -82188 -111317 -146887 -106120 -132743 -190829 -219476 -144909 -25902 -54769 -21508 12708
16192 12708 99216 155540 60322 -24439 -77369 -226087 -263503 -122418 -10769 -47382 -118184
16181 -118184 -99032 -134796 -207096 -102416 -11495 -7267 -21205 -909 -88203 -129266 -33886
16170 -33886 -144698 -85017 -100479 -95172 -43943 -115711 -114626 -94135 106791 163278 7743
16159 7743 -33346 29772 -59373 -67660 -75572 -163109 -73306 -127065 -165760 -121335 -42511 2307
16147 2307 50656 71509 132275 62097 -13209 17868 63663 -65616 -105523 -36121 28360 -68917
$$ packed form
16225a86485P2690J44423j9435n5683J1761j4545l0840j2662L7846j9556j25991
16214a98477P8431J20621m5232K8113O6847O625q1779j8909l0541l9510L1623
16203h2188k9129l5570M0767k6623n8086k8647P4567J19007k8867L3261L4216
16192A2708Q6508N6324r5218q4761n2930j48718l7416J41085J11649l6613p0802
16181a18184J9152l5764p2300J04680R0921M228j3938K0296q7294m1063R5380
16170c3886j10812N9681j5462N307N1229p1768J085K0491K00926N6487j55535
16159G743m1089O3118q9145q287p912q7537Q9803n3759l8695M4425P8824M4818
16147B307M8349K0853O0766p0178p5306L1077M5795j29279l9907O9402O4481r7277
$$ plain form
16135 -68917 -211218 -66096 -33680 -6851 -6250 -17147 16640 -1852 -52792 -70131 -64804 -21230
16123 -21230 -43425 79025 12857 -150311 -54881 -42997 -106828 -121696 -136693 -210627 -154013
16112 -154013 -139918 -127405 17067 115357 98350 31079 -49987 -38391 -42260 45804 64647
16101 64647 -25671 -184444 -312200 -326951 -217195 -114974 -70707 858 -14661 -93840 -217818
16090 -217818 -189586 -204005 -90085 -55364 -32100 -105969 -152840 -39205 13382 17260 -23421
16079 -23421 -43368 -84985 -12374 125042 236918 62251 -80925 -139580 -190435 -202498 -56626
16068 -56626 -65302 -89558 -49242 -97565 -146450 -139363 20799 141848 111028 52345 27999 -66351
16056 -66351 40395 94384 68460 180374 297769 295666 444092 551325 728350 847892
$$ packed form
16135f8917j42301J45122L2416K6829O01j0897L3787j8492n0940j7339N327M3574
16123b1230k2195J22450o6168j63168R5430J1884o3831j4868j4997p3934N6614
16112a54013J4095J2513J44472R8290j7007o7271q1066J1596l869Q8064J8843
16101F4647r0318j58773j27756j4751J09756J02221M4267P1565j5519p9179j23978
16090b17818K8232j4419J13920L4721K3264p3869m6871J13635N2587L878m0681
16079b3421j9947m1617P2611J37416J11876j74667j43176n8655n0855j2063J45872
16068e6626q676k4256M0316m8323m8885P087J60162J21049l0820n8683k4346r4350
16056f6351J06746N3989k5924J11914J17395k103J48426J07233J77025J19542
$$ plain form
16046 847892 801750 752679 686385 661909 564785 377666 272848 175476 74282 26318 56231
16035 56231 46195 28568 38674 -78406 -18030 62455 112689 115917 30868 -31777 69660
16024 69660 63299 39247 -7565 -11171 65269 23144 36286 56183 31828 -17482 -28635 70883
16012 70883 118437 120042 114257 79492 29309 -4118 14925 -9441 -131373 -110390 10741 23073
16000 23073 -50768 -1874 74992 69701 75806 -36709 -8680 38530 23466 -65074 -42029 -28378
15988 -28378 18486 65923 41368 12678 -167099 -57805 3337 -87573 -129222 -143591 -171133
15977 -171133 -135029 -115272 -38943 7230 76070 153867 154121 212998 199257 116814 96277 43777
15965 43777 -12787 -88980 -178964 -165866 -174272 -158000 -147328 -152654 -191162 -141593 -117359 -96052
$$ packed form
16046H47892m6142m9071o6294k4476r7124j87119j04818r7372j01194m7964K9913
16035E6231j0036j7627J0106j17080O0376Q0485N0234L228q5049o2645J01437
16024F9660o361k4052m6812l606P6440m2125J3142J9897k4355m9310j1153R9518
16012G0883M7554J605n785l4765n0183l3427J9043k4366j21932K0983J21131J2332
16000B3073p3841M8894P6866n291O105j12515K8029M7210j5064q8540K3045J3651
15988b8378M6864M7437k4555k8690j79777J09294O1142r0910m1649j4369k7542
15977a71133L6104J9757P6329M6173O8840P7797K54N8877j3741q2443k0537n2500
15965D3777n6564p6193q9984J3098q406J6272J0672n326l8508M9569K4234K1307
$$ plain form
15953 -96052 -113532 -151544 -165883 -136929 43164 39241 460 -45 -130493 -169943 -101120 -52674
15941 -52674 -42391 -136101 -121010 -84699 -47681 17437 72914 99803 45434 46764 41282 23061
15929 23061 124670 195361 141554 32525 88014 126651 -8396 -114745 -156111 -159542 -213795
15918 -213795 -225952 -180603 -132759 -91355 -138832 -175993 -178965 -95840 -90067 -90181 -144197 -54429
15906 -54429 49974 81474 119215 154803 201978 32229 13956 -9881 -41569 -64251 -121017
15895 -121017 -54340 43245 24171 22737 -54187 -67438 -182314 -273886 -206565 -86071 -131284
15884 -131284 -106904 -129832 -97553 -60922 -93774 -101651 -17944 34289 -887 -64150 -45833 -75851
15872 -75851 14596 -29242 -131293 -81431 -52979 -42010 -34002 95786 143688 14690 -70418
$$ packed form
15953i6052j7480l8012j4339K8954J80093l923l8781n05j30448l9450O8823M8446
15941e2674J0283r3710J5091L6311L7018O5118N5477K6889n4369J330n482j8221
15929B3061J01609P0691n3807j09029N5489L8637j35047j06349m1366l431n4253
15918b13795j2157M5349M7844M1404m7477l7161k972Q3125N773j14n4016Q9768
15906e4429J04403L1500L7741L5588M7175j69749j8273k3837l1688k2682n6766
15895a21017O6677R7585j9074j434p6924j3251j14876r1572O7321J20494m5213
15884a31284K4380k2928L2279L6631l2852p877Q3707N2233l5176o3263J8317l0018
15872g5851R0447m3838j02051M9862K8452J0969Q008J29788M7902j28998q5108
$$ plain form
15861 -70418 -18622 58649 10531 -42797 71683 119436 188644 176351 19427 -168992 -171335
15850 -171335 -150742 -88087 -12736 -13564 -25713 -171940 -210436 -169603 -24844 -12339 -136336
15839 -136336 -198346 -125443 -120800 37990 126785 59991 110561 118710 171901 64777 -101319
15828 -101319 -54894 -8207 -51520 -89318 -145324 -171024 -227036 -93182 80015 27483 34942
15817 34942 190859 216012 192790 48867 -54249 -53195 -7239 15787 -23764 -64348 40879
15806 40879 12223 -2779 -24516 -134396 38803 98518 61152 72786 94972 98358 148715
15795 148715 52959 -128046 -55636 -14020 -98065 -221335 -132618 -43764 -102087 -50460 -53906
15784 -53906 72413 75938 34033 -77099 -147484 -135682 -187933 -64416 82607 35351 78943
$$ packed form
15861g0418N1796P7271m8118n3328J14480M7753O9208j2293j56924j88419k343
15850a71335K0593O2655P5351q28j2149j46227l8496M0833J44759J2505j23997
15839a36336o2010P2903M643J58790Q8795o6794N0570Q149N3191j07124j66096
15828a01319M6425M6687m3313l7798n6006k5700n6012J33854J73197n2532P459
15817C4942J55917K5153k3222j43923j03116J054M5956K3026l9551m0584J05227
15806D0879k8656j5002k1737j09880J73199N9715l7366J1634K2186L386N0357
15795A48715r5756j81005P2410M1616q4045j23270Q8717Q8854n8323N1627l446
15784e3906J26319L525m1905j11132p0385J1802n2251J23517J47023m7256M3592
$$ plain form
15773 78943 29275 23294 58257 502 -72756 -137231 -122818 -69983 29629 37190 -127935 -192205
15761 -192205 -112432 -54779 -96628 -84380 -21113 53246 28300 -130836 -154959 -27101 45251
15750 45251 -16466 -71142 -65570 -6781 18487 -2448 -20819 -24612 -51284 -31949 -57339 -15884
15738 -15884 16613 -1986 121035 160695 60205 -31800 -35203 -69834 -128573 -157755 -243488
15727 -243488 -278793 -149261 -138567 -125525 -81519 -142931 -203573 -254803 -215651 -103216 20811
15716 20811 22471 -131716 -202248 -77260 -96894 -35128 -82258 -47650 110371 176380 93996
15705 93996 25519 -11549 -66343 -64777 -44065 -106798 -117799 -115640 -181996 -172146 -208932 -251340
15693 -251340 -306552 -282870 -210019 -188090 -250849 -306466 -264436 -112132 -15294 52835 173338
$$ packed form
15773G8943m9668n981L4963n7755p3258o4475J4413N2835R9612P561j65125o4270
15761a92205P9773N7653m1849J2248O3267P4359k4946j59136k4123J27858P2352
15750D5251o1717n4676N572N8789K5268k0935j8371l793k6672J9335k5390M1455
15738a5884L2497j8599J23021L9660j00490r2005l403l4631n8739k9182q5733
15727b43488l5305J29532J0694J3042M4006o1412o0642n1230L9152J12435J24027
15716B0811J660j54187p0532J24988j9634O1766m7130L4608J58021O6009q2384
15705I3996o8477l7068n4794J566K0712o2733j1001K159o6356R850l6786m2408
15693b51340n5212K3682P2851K1929o2759n5617M2030J52304R6838O8129J20503
$$ plain form
15682 173338 221437 132665 185139 94330 -48605 -5063 171341 237910 203180 122143 108475
15671 108475 163451 244363 246241 214409 115263 102920 121630 32928 -71812 -93674 -46565
15660 -46565 109391 42296 -65617 -177727 -163412 -91209 -35996 -85459 -71335 -19542 -64962
15649 -64962 -22643 95230 4484 -78681 -18839 87697 135406 137136 57873 77902 158951
15638 158951 187479 117346 55642 -10523 -161177 -215539 -154116 -56191 742 -54305 -126221
15627 -126221 -217267 -174847 -197534 -257291 -188190 -88375 -89329 -87262 -64535 -6893 -101912 -152897
15615 -152897 -32221 39655 118086 55384 -24703 36608 -5635 -51809 -37785 -67162 -89204
15604 -89204 -129437 228 46461 -7501 69669 23681 -59031 -91740 -31355 -51799 6531
$$ packed form
15682A73338M8099q8772N2474r0809j42935M3542J76404O6569l4730q1037j3668
15671A08475N4976Q0912J878l1832r9146j2343J8710q8702j04740k1862M7109
15660d6565J55956o7095j07913j12110J4315P2203N5213m9463J4124N1793m5420
15649f4962M2319J17873r0746q3165N9842J06536M7709J730p9263K0029Q1049
15638A58951K8528p0133o1704o6165j50654n4362O1423R7925N6933n5047p1916
15627a26221r1046M2420k2687n9757O9101R9815r54K067K2727N7642r5019n0985
15615a52897J20676P1876P8431o2702q0087O1311m2243m6174J4024k9377k2042
15604h9204m0233J29665M6233n3962P7170m5988q2712l2709O0385k0444N8330
$$ plain form
15593 6531 43121 9692 1871 -26201 -24147 -19688 4968 -6981 -149449 -186460 -128295 30831
15581 30831 91006 75048 -15290 -23392 14368 -60998 -104697 -40424 27084 11379 -30088 -71357
15569 -71357 -181397 -190788 -131976 -137289 -45666 4401 -31145 -57236 -140078 -167569 -150623 -178451
15557 -178451 -234924 -287335 -211440 -212112 -261958 -145611 -42794 -99111 -140963 -31347 -9129
15546 -9129 -96467 -45234 -78518 -174402 -229329 -249745 -210137 -36146 -24705 -3573 -10261 -61554
15534 -61554 37365 84996 46441 -46595 -39408 46155 36687 109205 163379 141034 66548 74982
15522 74982 92588 -3370 -6048 -18554 -22240 1856 14373 -52331 -42094 63371 129128 128636
15510 128636 85594 53510 98298 131082 82153 64295 132946 209329 173947 172386 247696 308868
$$ packed form
15593F531L6590l3429p821k8072K054M459K4656j1949j42468l7011N8165J59126
15581C0831O0175j5958r0338q102L7760p5366m3699O4273O7508j5705m1467m1269
15569g1357j10040r391N8812n313R1623N0067l5546k6091q2842k7491J6946k7828
15557a78451n6473n2411P5895o72m9846J16347J02817n6317m1852J09616K2218
15546i129q7338N1233l3284r5884n4927k0416L9608J73991J1441K1132o688n1293
15534f1554R8919M7631l8555r3036P187Q5563r468P2518N4174k2345p4486Q434
15522G4982J7606r5958k678j2506l686K4096J2517o6704J0237J05465O5757m92
15510A28636m3042l2084M4788L2784m8929j7858O8651P6383l5382j561P5310O1172
$$ plain form
15498 308868 305173 358677 303113 137477 -104500 -247561 -201419 -26811 92043 224129
15488 224129 189164 146902 62627 32154 -58886 -44446 27186 94226 92065 41971 -89160
15477 -89160 -65939 -102023 -147621 -150561 -121034 -172077 -171604 -83627 -21487 -39770 28339 62553
15465 62553 37484 20681 49886 24560 92407 72068 72287 62769 -37743 -37251 -84739 -84139 -35669
15452 -35669 -95055 -153236 -166600 -140811 -84131 -82013 -22715 93974 76483 54050 75976 -32441
15440 -32441 -85389 1064 74795 9009 -107075 -90499 -165417 -205396 -39063 -99081 -124920
15429 -124920 -113402 -135482 -82909 -136054 -89620 -112506 -104640 6868 23717 29733 6703 54083
15417 54083 77322 88143 8288 -48344 -10977 13933 131190 203146 124394 24777 24872 -39814
$$ packed form
15498C08868l695N3504n5564j65636k41977j43061M6142J74608J18854J32086
15488B24129l4965m2262q4275l0473r1040J4440P1632O7040k161n0094j31131
15477h9160K3221l6084m5598k940K9527n1043M73Q7977O2140j8283O8109L4214
15465F2553k5069j6803K9205k5326O7847k0339K19r518j00512M92m7488O00M8470
15452c5669n9386n8181j3364K5789N6680K118N9298J16689j7491k2433K1926j08417
15440c2441n2948Q6453P3731o5786j16084J6576p4918l9979J66333o0018k5839
15429a24920J1518k2080N2573n3145M6434k2886P866J11508J6849O016k3030M7380
15417E4083K3239J0821p9855n6632L7367K4910J17257P1956p8752r9617R5o4686
$$ plain form
15405 -39814 63094 91623 93086 153676 95766 13595 44273 31156 33109 -358 -117969 -76152
15393 -76152 66424 58580 -28620 -22211 -34015 -4548 40155 92132 196019 136098 63553 4963
15381 4963 -92501 -176695 -196109 -206727 -121250 -81420 -147198 -179412 80820 231305 99230
15370 99230 -41257 -44580 -16 14746 -56366 32982 11181 -80324 -60475 -112835 -116345 -37605
15358 -37605 179462 197463 46246 -120587 -169317 -163445 -194929 -202041 -90965 -113401 -65392
15347 -65392 -13361 -102635 29909 66554 2374 -44632 -89155 -119869 -16846 33737 -4033
15336 -4033 31429 26590 76558 91102 58328 -2446 40093 65056 -12676 -53576 1615 -27589
15324 -27589 -72448 -68932 -1950 -43574 -15087 26411 755 38381 233706 315447 342598 243939
$$ packed form
15405c9814J02908K8529J463O0590n7910q2171L0678j3117J953l3467j17611M1817
15393g6152J42576p844q7200O409j1804K9467M4703N1977J03887n9921p2545n8590
15381D963r7464q4194j9414j0618Q5477L9830o5778l2214K60232J50485j32075
15370I9230j40487l323M4564J4762p1112Q9348k1801r1505J9849n2360l510P8740
15358c7605K17067J8001j51217j66833m8730N872l1484p112J11076k2436M8009
15347f5392N2031q9274J32544L6645o4180m7006m4523l0714J03023N0583l7770
15336d033L5462m839M9968J4544l2774o0774M2539K4963p7732m0900N5191k9204
15324b7589m4859L516O6982m1624K8487M1498k5656L7626J95325Q1741K7151r8659
$$ plain form
15312 243939 185235 251355 277907 309374 219931 113176 -14195 -86844 -74801 98417 237413
15301 237413 180659 114939 77084 122005 160739 132612 115558 177461 162851 56880 66936
15290 66936 91978 151091 120549 180419 312335 524640 810273 1099049 1227556 1266371 1308465
15279 1308465 1275981 1264645 1249508 1333192 1335763 1127588 854357 738464 678504 567768 558215
15268 558215 536098 376515 290672 317704 239510 83335 72087 105922 100868 70529 3172
15257 3172 19861 60428 128200 133762 194198 202411 238258 223641 100989 66829 54922 49035
15245 49035 -58958 -22734 -56071 -12126 72608 208396 121291 148682 271051 161377 -6450
15234 -6450 -37189 81337 115046 206335 160060 13686 22393 -119488 -114988 -139551 -130310 -147729
$$ packed form
15312B43939n8704O6120K6552L1467q9443j06755j27371p2649J2043J73218J38996
15301B37413n6754o5720l7855M4921L8734k8127j7054O1903j4610j05971J0056
15290F6936K5042N9113l0542N9870J31916K12305K85633K88776J28507L8815M2094
15279A308465l2484j1336j5137Q3684K571k08175k73231j15893n9960j10736r553
15268E58215k2117j59583q5843K7032p8194j56175j1248L3835n054l0339o7357
15257C172J6689M0567O7772N562O0436Q213L5847j4617j22652l4160j1907n887
15245D9035j07993L6224l3337M3945Q4734J35788q7105K7391J22369j09674j67827
15234f450l0739J18526L3709R1289m6275j46374Q707j41881M500k4563R241j7419
$$ plain form
15222 -147729 -119604 -85787 124680 83683 37114 -102893 30197 105315 71046 87331 16574
15211 16574 -206062 -222341 -189332 -101415 -23777 47132 11432 128690 92314 -50592 -146025
15200 -146025 -176634 -188630 -101171 47634 -80389 -151470 -117958 -132004 -15017 -9581 20496
15189 20496 21974 -24342 -120824 -115660 -106882 -64457 157979 295520 235958 19955 -30772 55395
15177 55395 -11562 -36676 -30956 -68539 -45121 -107704 -193633 -97008 24319 79548 68704 -73119
15165 -73119 -114765 -65744 127871 96679 10419 -69229 -3477 62819 -91863 -87384 -156813
15154 -156813 -143538 -115276 -86125 45813 -1384 -171567 -174332 -137901 -69696 -258402 -236236
15143 -236236 -100334 -18725 42461 -115963 -104688 33949 -8988 -83876 -18861 -81499 -155999
$$ packed form
15222a47729K8125L3817K10467m0997m6569j40007J33090P5118l4269J6285p0757
15211A6574k22636j6279L3009Q7917P7638P0909l5700J17258l6376j42906r5433
15200a46025l0609j1996Q7459J48805j28023p1081L3512j4046J16987N436L0077
15189B0496J478m6316r6482N164Q778M2425K22436J37541n9562k16003n0727Q6167
15177E5395o6957k5114N720l7583K3418o2583q5929R6625J21327N5229j0844j41823
15165g3119m1646M9021J93615l1192q6260p9648O5752O6296j54682M479o9429
15154a56813J3275K8262K9151J31938m7197j70183k765L6431O8205j88706K2166
15143b36236J35902Q1609O1186j58424J1275J38637m2937p4888O5015o2638p4500
$$ plain form
15132 -155999 -79344 -39521 -68730 -26015 -55976 -79068 -96900 -88751 -74766 -4106 -37234 -78096
15120 -78096 -56959 -53236 -122423 -195763 -157934 -255744 -287508 -206062 -228744 -190382 -137002 -122858
15108 -122858 -101092 -239717 -208928 -169458 -72277 -65041 -35508 -51995 -21410 30436 -84226
15097 -84226 -97971 -168494 -240894 -190736 -141984 -15703 -37254 -88197 -14682 70699 52556
15086 52556 150889 107292 17717 -12443 758 17978 7960 120118 177105 64097 -51984
15075 -51984 -117606 50473 109279 87808 193225 277430 202543 188070 199687 277505 319388
15064 319388 374923 402171 352030 287496 290676 269580 190364 152248 175012 243500 280044 262682
15052 262682 201969 124483 95082 -37833 42880 188715 273960 166782 -3890 -15261 18405
$$ packed form
15132a55999P6655L9823k9209M2715k9961k3092j7832Q149J3985P0660l3128m0862
15120g8096K1137L723o9187p3340L7829r7810l1764Q1446k2682L8362N3380J4144
15108a22858K1766j38625L0789L9470R7181P236K9533j6487L0585N1846j14662
15097h4226j3745p0523p2400N0158M8752J26281k1551n0943P3515Q5381j8143
15086E2556R8333m3597q9575l0160J3201J7220j0018J12158N6987j13008j16081
15075e1984o5622J68079N8806k1471J05417Q4205p4887j4473J1617P7818M1883
15064C19388N5535K7248n0141o4534L180k1096p9216l8116K2764O8488L6544j7362
15052B62682o0713p7486k9401j32915Q0713J45835Q5245j07178j70672j1371L3666
$$ plain form
15041 18405 93769 77865 56860 123223 171088 33196 -135492 -93782 -28840 9042 44510
15030 44510 62405 4358 61514 62541 11663 50443 31461 -21096 -37137 -93014 72800 113394
15018 113394 60694 90182 138244 161906 212992 285484 234482 46574 7174 110283 110234 192561
15006 192561 168281 234675 357309 386691 286756 289172 283802 292110 262222 308401 315804 197940
14994 197940 181882 193365 238343 108758 118644 131839 -27961 4171 15454 -57561 41291
14983 41291 113521 69683 -88596 -120186 -79742 -21265 -28044 10488 89628 159785 240399 206334
14971 206334 123342 173242 245585 318485 427068 405496 256569 161964 136092 91026 39643
14960 39643 122216 274404 265816 320073 298527 192401 196338 219074 318591 429410 432229 488118
$$ packed form
15041A8405P5364j5904k1005O6363M7865j37892j68688M1710O4942L7882L5468
15030D4510J7895n8047N7156J027n0878L8780j8982n2557j6041n5877J65814M0594
15018A13394n2700K9488M8062K3662N1086P2492n1002j87908l9400J03109m9Q2327
15006A92561k4280O6394J22634K9382r9935K416n370Q308k9888M6179P403j17864
14994A97940j6058J1483M4978j29585R886J3195j59800L2132J1283p3015R8852
14983D1291P2230m3838j58279l1590M0444N8477o779L8532P9140P0157Q0614l4065
14971B06334q2992M9900P2343P2900J08583k1572j48927r4605k5872m5066n1383
14960C9643Q2573J52188q588N4257k1546j06126L937K2736R9517J10819K819N5889
$$ plain form
14948 488118 517786 461812 432772 457190 459529 433993 462678 598845 710986 669818 534737
14937 534737 565273 674734 604098 562913 435111 435768 469988 565053 642232 521767 435962
14926 435962 488730 577674 624083 678829 630625 573729 488101 446992 460185 541730 577715
14915 577715 601912 715106 798460 725228 699040 679605 726635 723969 568315 449633 444958
14904 444958 485537 647921 728850 742513 773788 810315 818947 799353 797553 790058 929258 1022423
14892 1022423 1000580 965761 963891 935845 932900 965176 979355 1142210 1369843 1590364 1710087
14881 1710087 1654064 1548319 1584119 1536996 1493850 1508701 1540236 1542479 1584068 1728597 1744168
14870 1744168 1721750 1697141 1805397 1890509 2064632 2225991 2300895 2384569 2565524 2725166
$$ packed form
14948D88118K9668n5974k9040K4418K339k5536K8685J36167J12141m1168j35081
14937E34737L0536J09461p0636m1185j27802O57L4220R5065P7179j20465q5805
14926D35962N2768Q8944M6409N4746m8204n6896q5628m1109J3193Q1545L5985
14915E77715K4197J13194Q3354p3232k6188j9435M7030k666j55654j18682m675
14904D44958M0579J62384Q0929J3663L1275L6527Q632j9594j800p495J39200R3165
14892A022423k1843l4819j870k8046k945L2276J4179J62855K27633K20521J19723
14881A710087n6023j05745L5800m7123m3146J4851L1535K243M1589J44529J5571
14870A744168k2418k4609J08256Q5112J74123J61359P4904Q3674J80955J59642
$$ plain form
14860 2725166 2812360 2911120 3091639 3167760 3273597 3425773 3698882 3944209 4246981 4403294
14850 4403294 4617114 4947523 5132677 5433008 5815998 6252735 6669910 7143015 7927724
14841 7927724 8839886 9827821 10761763 11810851 13022839 14420320 16085114 18202352 20734185
14832 20734185 23647125 27026171 31089110 36073225 42276630 50084970 60396435 74040899
14824 74040899 92167073 116046367 146638136 182797750 220108433 252570009 276775842
14817 276775842 292974286 302466730 303673637 291255076 262297104 223121563 183933171
14810 183933171 151238517 126141521 107067114 92323547 80801618 71326427 63484674
14803 63484674 56914827 51492284 47093658 43416728 40164551 37409429 35081268 32986252
$$ packed form
14860B725166Q7194R8760J80519P6121J05837J52176K73109K45327L02772J56313
14850D403294K13820L30409J85154L00331L82990M36737M17175M73105P84709
14841G927724R12162R87935R33942J049088J211988J397481J664794K117238K531833
14832B0734185K912940L379046M062939M984115O203405P808340J0311465J3644464
14824G4040899J8126174K3879294L0591769L6159614L7310683L2461576K4205833
14817B76775842J6198444R492444J206907j2418561k8957972l9175541l9188392
14810A83933171l2694654k5096996j9074407j4743567j1521929r475191p841753
14803F3484674o569847n422543m398626l676930l252177k755122k328161k095016
$$ plain form
14795 32986252 31061171 29196831 27479470 25844532 24443421 23136602 21981622 20838303
14787 20838303 19851069 19028472 18107592 17310098 16623803 15974995 15251012 14631269 14127298
14778 14127298 13472370 12866405 12419339 11993993 11588715 11090370 10668825 10444252 10124304
14769 10124304 9780662 9375406 8920890 8570573 8234176 7974700 7662553 7444316 7227299
14760 7227299 7112276 7056105 6766734 6417992 6129878 5831302 5572899 5389367 5288444 5150654
14750 5150654 4977475 4977412 4855138 4606643 4408518 4233119 3997843 3854894 3824369 3824272 3783937
14739 3783937 3618687 3530774 3421427 3201337 3070334 2950639 3007698 3020767 2988096 3002369
14729 3002369 2922639 2746596 2595292 2461886 2399574 2367885 2286183 2207420 2273940 2185418 2214088
$$ packed form
14795C2986252j925081j864340j717361j634938j401111j306819j154980j143319
14787B0838303r87234q22597r20880p97494o86295o48808p23983o19743n03971
14778A4127298o54928o05965m47066m25346m05278m98345m21545k24573l19948
14769A0124304l43642m05256m54516l50317l36397k59476l12147k18237k17017
14760G227299j15023n6171k89371l48742k88114k98576k58403j83532j00923j37790
14750E150654j73179o3j22274k48495j98125j75399k35276j42949l0525r7m0335
14739C783937j65250q7913j09347k20090j31003j19695N7059J3069l2671J4273
14729C002369p9730j76043j51304j33406o2312l1689q1702p8763O6520q8522K8670
$$ plain form
14718 2214088 2254537 2166873 2073636 1985501 2028334 2030187 1960486 1833586 1630539 1550629 1561504
14707 1561504 1453152 1471222 1406546 1321158 1282072 1210623 1190647 1032516 820282 791059 914784
14696 914784 876712 850132 940798 1101914 973432 884219 811272 777355 787083 802392 685799
14685 685799 572655 565332 681091 655444 624953 671413 699824 620525 677251 592732 541120
14674 541120 507283 545857 570430 530213 546838 578270 537273 554642 601351 578680 504797
14663 504797 463132 500267 467404 485510 593196 626220 652888 607814 404203 232713 143119
14652 143119 256856 333892 290129 312584 293995 431376 582508 608825 643686 553484 386782
14641 386782 393960 251908 266896 413841 454957 346265 291948 227051 388321 487972 511177
$$ packed form
14718B214088M0449q7664r3237q8135M2833J853o9701j26900k03047p9910J0875
14707A561504j08352J8070o4676q5388l9086p1449j9976j58131k12234k9223J23725
14696I14784l8072k6580R0666J61116j28482q9213p2947l3917R728J5309j16593
14685F85799j13144p323J15759k5647l0491M6460K8411p9299N6726q4519n1612
14674E41120l3837L8574K4573m0217J6625L1432m0997J7369M6709k2671p3883
14663E04797m1665L7135l2863J8106J07686L3024K6668m5074k03611j71490q9594
14652A43119J13737P7036m3763K2455j8589J37381J51132K6317L4861r0202j66702
14641C86782P178j42052J4988J46945M1116j08692n4317o4897J61270R9651K3205
$$ plain form
14630 511177 388262 345610 272435 315268 253825 113330 167045 245444 238538 219210 193326
14619 193326 293016 293222 343106 414846 325942 285111 319789 286882 302396 298516 214448 97586
14607 97586 118922 208814 162246 32788 -4577 -30830 107632 82536 74143 179991 338397
14596 338397 409364 343495 280936 282138 307230 318312 339397 312903 230273 289908 320336 178006
14584 178006 130619 67522 26738 129406 20084 -16734 79951 185069 324440 323877 314280
14573 314280 245888 259308 266490 248465 196582 192781 267139 302380 214142 59532 27022 -62104
14561 -62104 33416 88780 83484 -10127 -7088 65471 172065 203500 175610 284347 244177 195849
14549 195849 131850 29074 -8704 -87280 -153612 -176265 -189125 -152822 -44398 23654 43770
$$ packed form
14630E11177j22915m2652p3175M2833o1443j40495N3715P8399o906j9328k5884
14619A93326R9690K06M9884P1740q8904m0831L4678l2907J5514l880q4068j16862
14607I7586K1336Q9892m6568j29458l7365k6253J38462k5096q393J05848J58406
14596C38397P0967o5869o2559J202K5092J1082K1085k6494q2630N9635L0428j42330
14584A78006m7387o3097m0784J02668j09322l6818R6685J05118J39371n63r597
14573C14280o8392J3420P182j8025n1883l801P4358L5241q8238j54610l2510q9126
14561f2104R5520N5364n296r3611L039P2559J06594L1435k7890J08737m0170m8328
14549A95849o3999j02776l7778p8576o6332k2653j2860L6303J08424O8052K0116
$$ plain form
14538 43770 117127 209207 315358 182072 101762 141013 258145 292994 252847 262546 135278
14527 135278 145714 171907 124908 73258 6473 21278 15874 18726 -44458 -49090 92178 173031
14515 173031 201007 210803 207849 245283 248097 151876 180975 114638 35768 68165 47736 -66296
14503 -66296 32293 34364 88702 190000 140841 131309 200735 163367 161447 64622 -18048 -28400
14491 -28400 16946 77445 45513 80663 86583 55995 39177 45597 118009 129169 103234 149844
14479 149844 184085 141158 73775 126830 157404 143239 43907 -85648 -43397 10215 -79674
14468 -79674 -30438 -47712 -24662 60334 79853 -8610 100623 143119 25094 52901 41963
14457 41963 31547 -38599 -57232 -114764 -37457 87290 194452 132384 15794 6210 82008
$$ packed form
14538D3770P3357R2080J06151j33286q0310L9251J17132L4849m0147R699j27268
14527A35278J0436K6193m6999n1650o6785J4805n404K852o3184m632J41268Q0853
14515A73031K7976R796k954L7434K814r6221K9099o6337p8870L2397k0429j14032
14503f6296R8589K071N4338J01298m9159r532O9426l7368j920r6825q2670j0352
14491b8400M5346O0499l1932L5150N920l0588j6818O420P2412J1160k5935M6610
14479A49844L4241m2927o7383N3055L0574j4165r9332j29555M2251N3612q9889
14468g9674M9236j7274K3050Q4996J9519q8463J09233M2496j18025K7807j0938
14457D1963j0416p0146j8633n7532P7307J24747J07162o2068j16590r584P5798
$$ plain form
14446 82008 130110 82144 -15739 5062 -39780 -99296 -119233 -121891 -119963 -169990 -46773 -108687
14434 -108687 -106676 -148367 -131800 -56168 22593 2054 -31046 -113084 -134759 -153815 -120006 -142287
14422 -142287 -231498 -117036 -8308 -104293 -206394 -186930 -109284 -81688 -37144 33122 -7384
14411 -7384 46616 34509 34516 22949 17901 187445 200244 82440 -57303 -57489 91402 139353
14399 139353 34700 -20354 35128 170246 245720 262247 129612 14071 39615 37658 2957
14388 2957 39150 71580 48699 145940 154222 84507 133104 170858 225406 257992 132713 112622
14376 112622 155680 126042 229762 316582 258052 209986 196858 25521 -24388 145178 40080
14365 40080 -31276 -52064 -69262 34990 59519 121035 205413 313698 336257 411098 486886
$$ packed form
14446H2008M8102m7966r7883K0801m4842n9516j9937k658J928n0027J23217o1914
14434a08687K011m1691J6567P5632P8761k0539l3100q2038k1675j9056L3809k2281
14422a42287q9211J14462J08728r5985j02101J9464P7646K7596M4544P0266m0506
14411g384N4000j2107Pj1567n048J69544J2799j17804j39743j86J48891M7951
14399A39353j04653n5054N5482J35118P5474J6527j32635j15541K5544j957l4701
14388B957L6193L2430k2881R7241Q282o9715M8597L7754N4548L2586j25279k0091
14376A12622M3058k9638J03720Q6820n8530m8066j3128j71337m9909J69566j05098
14365D0080p1356k0788j7198J04252K4529O1516Q4378J08285K2559P4841P5788
$$ plain form
14354 486886 602541 845196 1149338 1370353 1478568 1662381 1745401 1756813 1680660 1438074
14344 1438074 1314500 1140194 927259 735851 687674 667090 595172 593959 503830 371866
14334 371866 281329 286797 390429 410503 274724 254379 265374 224023 231286 208711 116812
14323 116812 177955 337201 234221 73484 -55800 -86422 -12429 6215 -5649 -77853 -53784
14312 -53784 32217 127023 110530 119501 81487 161154 104380 36512 95871 123727 165799 213988
14300 213988 233476 105535 48809 73079 72994 39638 -96536 -30630 78538 141445 134183 15775
14288 15775 33005 16732 36492 149959 148611 157255 95211 -19122 -49050 -90126 -34671 21520
14276 21520 -85265 -191586 -65170 39788 159998 298917 187652 87741 123239 203241
$$ packed form
14354D86886J15655K42655L04142K21015J08215J83813Q3020J1412p6153k42586
14344A438074j23574j74306k12935j91408m8177k0584p1918j213r0129j31964
14334C71866r0537N468J03632K0074j35779k0345J0995m1351P263k2575r1899
14323A16812O1143J59246j02980j60737j29284l0622P3993J8644j1864p2204K4069
14312e3784Q6001R4806j6493Q971l8014P9667n6774o7868N9359K7856M2072M8189
14300B13988J9488j27941n6726K4270q5l3356j36174O5906J09168O2907p262j18408
14288A5775J7230j6273J9760J13467j348Q644o2044j14333k9928m1076N5455N6191
14276B1520j06785j06321J26416J04958J20210J38919j11265r9911L5498Q0002
$$ plain form
14266 203241 256687 251354 130975 139882 260228 255181 222885 150643 175942 165819 134037 142037
14254 142037 83792 95948 68145 104592 108343 -20576 -58197 -117159 -58211 103000 89598
14243 89598 37760 38849 -1517 10878 111061 21337 -71179 -4217 35714 61658 114183 93670
14231 93670 16557 94203 140104 79272 52776 26563 -21311 -59415 -120343 -181722 -199423 -206719
14219 -206719 -177301 -156554 -126545 3110 78286 75115 106381 115112 39848 47677 -8583 31717
14207 31717 54614 -8156 -63917 -171400 -182490 -115787 -112529 -148050 -142253 -22481 -11773 -43902
14195 -43902 -16026 35837 94693 152019 106860 25734 86084 124082 19776 -31861 -192196
14184 -192196 -276217 -251556 -344053 -292988 -113100 -101219 -131218 -128315 -168219 -167410 -164428 -102406
$$ packed form
14266B03241N3446n333j20379Q907J20346n047l2296p2242K5299j0123l1782Q000
14254A42037n8245J2156k7803L6447L751j28919l7621n8962N8948J61211j3402
14243H9598n1838J089m0366J2395J00183q9724r2516O6962L9931K5944N2525k0513
14231I3670p7113P7646M5901o0832k6496k6213m7874l8104o0928o1379j7701p296
14219b06719K9418K0747L0009J29655P5176l171L1266Q731p5264P829n6260M0300
14207C1717K2897o2770n5761j07483j1090O6703L258l5521N797J19772J0708l2129
14195d3902K7876N1863N8856N7326m5159q1126O0350L7998j04306n1637j60335
14184a92196q4021K4661r2497N1065J79888J1881k9999K903l9904Q09K982O2022
$$ plain form
14172 -102406 -31000 2900 -71009 2372 -1855 16966 -45195 -143694 -59443 55207 179337
14161 179337 149905 52352 27167 47766 139469 121899 86469 105807 -6865 -137591 -144454
14150 -144454 -112951 -159011 -95045 -49018 -134233 -242652 -136351 122395 138397 92102 2600
14139 2600 6212 -59906 -43891 76614 173970 123186 30616 111175 175418 89866 -63846 -103621
14127 -103621 -32722 71193 35657 109560 211732 220633 163906 105170 84125 98253 82081
14116 82081 46783 7100 -64231 -47953 99393 295527 279460 193903 95539 66202 36119
14105 36119 23904 42677 44396 24895 34886 600 -10839 65923 109553 90921 104885 183523
14093 183523 45672 -118056 -115020 -88718 -106401 -119627 -115698 -184443 -298771 -69828 119551
$$ packed form
14172a02406P1406L3900p3909P3381m227J8821o2161r8499Q4251J14650J24130
14161A79337k9432r7553k5185K0599R1703j7570l5430J9338j12672j30726o863
14150a44454L1503m6060O3966M6027q5215j08419J06301K58746J6002m6295q9502
14139B600L612o6118J6015J20505R7356n0784r2570Q0559O4243q5552j53712l9775
14127a03621P0899J03915l5536P3903J02172Q901n6727n8736k1045J4128j6172
14116H2081l5298l9683p1331J6278J47346J96134j6067q5557r8364k9337l0083
14105C6119j2215J8773J719j9501R991l4286j1439P6762M3630j8632J3964P8638
14093A83523j37851j63728L036K6302j7683j3226L929o8745j14328K28943J89379
$$ plain form
14082 119551 70664 64994 142114 181666 204868 63671 -113452 -208022 -194782 -75080 -5834
14071 -5834 44475 26353 90615 -17657 -30127 -59852 12990 31504 4319 -33342 -33097 -58371
14059 -58371 -50754 -104762 -59228 -91923 -285513 -292173 -246636 -175304 -117330 -87379 -151253 -219539
14047 -219539 -204667 -247344 -192736 -57356 16801 46887 94240 136187 136215 -24771 -128181
14036 -128181 -166010 -143743 -98871 21167 -25897 -87809 -23995 -23966 48876 20064 -108444 -181119
14024 -181119 -230635 -215640 -102642 -22912 -56798 -198341 -265285 -248586 -209170 -257598 -346952
14013 -346952 -326461 -265206 -269548 -283505 -338233 -243356 -80577 -15760 -62975 44590 162465
14002 162465 52997 -2844 -6884 -3133 -77574 -76154 -110947 -174274 -73151 -39958 -130615 -240070
$$ packed form
14082A19551m8887n670P7120L9552K3202j41197j77123r4570J3240J19702O9246
14071e834N0309j8122O4262j08272j2470k9725P2842J8514k7185l7661K45k5274
14059e8371P617n4008M5534l2695j93590o660M5537P1332N7974K9951o3874o8286
14047b19539J4872m2677N4608J35380P4157L0086M7353M1947K8j60986j03410
14036a28181l7829K2267M4872J20038m7064o1912O3814K9P2842k8812j28508p2675
14024a81119m9516J4995J12998P9730l3886j41543o6944J6699L9416m8428q9354
14013c46952K0491O1255m342j3957n4728R4877J62779O4817m7215J07565J17875
14002A62465j09468n5841m040L751p4441J420l4793o3327J01123L3193r0657j09455
$$ plain form
13990 -240070 -306216 -203378 -116415 -93008 -160463 -167525 -157681 -55105 -113564 -278806 -262411
13979 -262411 -114709 13945 58562 32261 20035 68891 -63417 -110132 -104962 -131597 -83150
13968 -83150 -109791 -81548 -80605 -104728 -111119 -126782 -169575 -159322 -79882 -117089 -122822 -205093
13956 -205093 -340764 -326381 -168870 47245 32041 11906 2075 44409 2084 88296 18452
13945 18452 -44953 -149991 -181223 -42289 17302 37076 87617 85189 16041 -55264 -68956
13934 -68956 -87595 34018 24003 -58151 13342 96611 22061 34298 105398 136021 99538
13923 99538 36924 41395 68833 73670 -147903 -180510 -182209 -70701 -1924 108439 40854 -124465
13911 -124465 -53758 -59629 -72682 -80930 -18232 16628 143206 20602 -72462 -96692 -124223
$$ packed form
13990b40070o6146J02838Q6963K3407o7455p062R844J02576n8459j65242J6395
13979b62411J47702J28654M4617k6301j2226M8856j32308m6715N170k6635M8447
13968h3150k6641K8243R43k4123o391j5663m2793J0253P9440l7207n733q2271
13956b05093j35671J4383J57511K16115j5204k0135r831M2334m2325Q6212o9844
13945A8452o3405j05038l1232J38934N9591J9774N0541k428o9148p1305j3692
13934f8956j8639J21613j0015q2154P1493Q3269p4550J2237P1100L0623l6483
13923I9538o2614M471K7438M837k21573l2607j699J11508O8777J10363o7585j65319
13911a24465P0707n871j3053q248O2698L4860J26578j22604r3064k4230k7531
$$ plain form
13900 -124223 -156176 -114593 -3139 118243 166787 156000 162314 173933 -30750 -62878 -53880
13889 -53880 36048 53335 65239 -56256 -49464 -80281 -146435 -84530 42712 34971 -38202 -125455
13877 -125455 -64288 39528 70076 37830 54223 -1425 -77352 44628 131504 176774 168143
13866 168143 -17889 -193677 -177417 -54141 463 -131996 -206373 -90375 -96021 -179919 -264588
13855 -264588 -261465 -147115 -167502 -147819 -121199 -188340 -160414 -63089 68898 112895 70300
13844 70300 36800 -119383 -92415 112779 59067 -72897 -83846 -136006 -185930 -62890 -84289
13833 -84289 -59128 -2948 -17982 -62971 -93055 -130126 -30158 38827 71792 117121 55697 -84172
13821 -84172 42532 157073 125039 116073 -61159 -137083 -143537 -199369 -48048 103906 116128
$$ packed form
13900a24223l1953M1583J11454J21382M8544j0787O314J1619k04683l2128Q998
13889e3880Q9928J7287J1904j21495O792l0817o6154O1905J27242p741p3173q7253
13877a25455O1167J03816L0548l2246J6393n5648p5927J21980Q6876M5270q631
13866A68143j86032j75788J6260J23276N4604j32459p4377J15998n646q3898q4669
13855b64588L123J14350k0387J9683K6620o7141K7926R7325J31987M3997m2595
13844G0300l3500j56183K6968K05194n3712j31964j0949n2160m9924J23040k1399
13833h4289K5161N6180j5034m4989l0084l7071R9968O8985L2965M5329o1424j39869
13821h4172J26704J14541l2034q966j77232p5924o454n5832J51321J51954J2222
$$ plain form
13810 116128 45267 -37763 -95771 -130533 -219731 -246191 -239383 -300714 -272682 -313012 -171496
13799 -171496 -171689 -169575 -140364 -204347 -228394 -51317 91127 113116 44906 19210 -2258 98215
13787 98215 7504 -43720 -20047 -32259 -20034 59083 107267 146134 70759 -29950 -19112
13776 -19112 79534 129603 78317 88304 50479 11350 86671 65621 16854 100729 46371 67252
13764 67252 93154 35609 100043 119272 94277 74749 38191 50818 22966 15693 87490 63217
13752 63217 -12034 -23399 -99100 -192415 -143431 -130087 -216451 -213302 -70360 -130498 -250721
13741 -250721 -255018 -77257 -78158 -135219 -242960 -297767 -314022 -371907 -248053 -57278 -59746
13730 -59746 -33558 -97850 -93612 -89078 22705 123 -73626 -168483 -175788 -313611 -297729 -225431
$$ packed form
13810A16128p0861q3030n8008l4762q9198k6460O808o1331K8032m0330J41516
13799a71496j93K114K9211o3983k4047J77077J42444K1989o8210k5696k1468J00473
13787I8215r0711n1224K3673j2212J2225P9117M8184L8867p5375j00709J0838
13776a9112R8646N0069n1286R987l7825l9129P5321k1050m8767Q3875n4358K0881
13764F7252K5902n7545O4434J9229k4995j9528l6558J2627k7852p273P1797k4273
13752F3217p5251j1365p5701r3315M8984J3344q6364L149J42942o0138j20223
13741b50721m297J77761r01n7061j07741n4807j6255n7885J23854J90775k468
13730e9746K6188o4292M238M534J11783k2582p3749r4857p305j37823J5882P2298
$$ plain form
13718 -225431 -173235 -175622 -142050 -30525 -82517 -129434 -92257 -161899 -281162 -355227 -334318
13707 -334318 -231820 -198370 -186208 -177541 -96472 -62841 -93995 -108424 -109310 -61014 -55961 -10808
13695 -10808 -23214 -52510 44920 78415 30530 -17552 -89117 -190494 -126854 -21875 28527
13684 28527 -110641 -248973 -186937 -37077 -17545 -85489 -127428 -57496 -4596 -113901 -77735
13673 -77735 -157393 -142349 -74456 -33139 -100723 -76492 13645 126819 141714 139440 67622 3751
13661 3751 -129942 -114024 -137243 -98569 -108717 -130576 -109897 -63672 -98939 -28087 86440
13650 86440 75996 82427 46618 68246 67374 1843 -143360 -228441 -253736 -154010 -214079 -212956
13638 -212956 -190128 -78773 52861 88376 88459 2085 -84828 -125530 -161851 -178770 -129602 -48262
$$ packed form
13718b25431N2196k387L3572J11525n1992m6917L7177o9642j19263p4065K0909
13707c34318J02498L3450J2162Q667Q1069L3631l1154j4429q86M8296N053M5153
13695a0808j2406k9296R7430L3495m7885m8082p1565j01377O3640J04979N0402
13684B8527j39168j38332O2036J49860J9532o7944m1939O9932N2900j09305L6166
13673g7735p9658J5044O7893M1317o7584K4231R0137J13174J4895k274p1818o3871
13661C751j33693J5918k3219L8674j0148k1859K0679M6225l5267P0852J14527
13650H6440j0444O431l5809K1628q72o5531j45203q5081k5295R9726o0069J123
13638b12956K2828J11355J31634L5515Q3q6374q6913m0702l6321j6919M9168Q1340
$$ plain form
13626 -48262 4092 4840 41430 80077 170275 203861 179210 53476 -56013 -5568 -36970 -63951
13614 -63951 -69098 -83346 -21975 -28662 102420 163079 122969 87772 122197 193359 149856 117900
13602 117900 115318 -12686 -66038 -35065 -13001 -23117 -102758 -62926 -67592 -137525 -120441 -70720
13590 -70720 30242 -10478 -76127 -182166 -230450 -200694 -103331 4353 46769 40428 105194
13579 105194 -4428 7863 21575 8433 -142923 -86660 16300 13489 14777 -26456 -75860
13568 -75860 -152964 -255488 -163236 -125463 -70870 -86608 -34900 -103302 -179443 -125927 -158746
13557 -158746 -145982 -5519 -37283 -64582 31728 139687 208669 59444 27257 30111 27110
13546 27110 17516 -2014 -76404 -25444 -40312 51135 9558 -47689 27138 20516 -21995 -138691
$$ packed form
13626d8262N2354P48L6590L8647R0198L3586k4651j25734j09489N0445l1402k6981
13614f3951n147j4248O1371o687J31082O0659m0110l5197L4425P1162m3503l1956
13602A17900k582j28004n3352L0973K2064j0116p9641L9832m666o9933J7084M9721
13590g0720J00962m0720o5649j06039m8284K9756R7363J07684M2416o341O4766
13579A05194j09622J2291J3712j3142j51356N6263J02960k811J288m1233m9404
13568g5860p7104j02524R2252L7773N4593j5738N1708o8402p6141N3516l2819
13557a58746J2764J40463l1764k7299R6310J07959O8982j49225l2187K854l001
13546B7110r594j9530p4390N0960j4868R1447m1577n7247P4827o622m2511j16696
$$ plain form
13534 -138691 -81407 73156 221565 248750 66208 30756 -40877 -52906 -121909 -173376 -118615
13523 -118615 60609 28685 -46077 10614 129156 101803 53382 35702 175810 230041 95373
13512 95373 21551 -153565 -56651 -24870 -15166 25829 -61914 8277 -22623 -58687 -32385 25474
13500 25474 122642 157020 124251 16283 12497 79688 22608 -78048 -120100 -83939 12544
13489 12544 -11297 63133 45365 12889 -68678 18051 -58292 29211 76858 134096 44826 -75553
13477 -75553 2998 -20143 -28023 -51521 -80210 -117390 -84696 21161 33653 -19495 -47871 -20089
13465 -20089 5847 -87189 -163366 -156584 -221326 -73721 26795 -27054 -81233 -94948 -84227
13454 -84227 -7167 18958 -84054 -173077 -153732 -188079 -236389 -207163 -203896 -135255 -142664 -24057
$$ packed form
13534a38691N7284J54563J48409K7185j82542l5452p1633j2029o9003n1467N4761
13523a18615J79224l1924p4762N6691J18542k7353m8421j7680J40108N4231j34668
13512I5373p3822j75116R6914L1781R704M0995q7743P0191l0900l6064K6302N7859
13500B5474R7168L4378l2769j07968l786O7191n7080j00656m2052L6161R6483
13489A2544k3841P4430j7768l2476q1567Q6729p6343Q7503M7647N7238q9270j20379
13477g5553P8551k3141p880k3498k8689l7180L2694J05857J2492n3148k8376K7782
13465b0089K5936r3036p6177O782o4742J47605J00516n3849n4179j3715J0721
13454h4227P7060K6125j03012q9023J9345l4347m8310K9226L267O8641p409J18607
$$ plain form
13442 -24057 -13477 22000 -44475 -104892 -86293 -91623 -124126 -53370 -180748 -164337 -128894 -87489
13430 -87489 -98407 -77702 -137770 -146578 -112687 -20923 -19961 10113 -30325 -80412 -79318 -119833
13418 -119833 -167046 -80813 17730 -25717 -87742 -98135 -7928 128292 119193 5360 -119307
13407 -119307 -171871 -90338 -120332 5916 59105 -45094 -42297 23498 6729 -74575 -65153
13396 -65153 -81187 -14770 13460 7803 -49061 -61661 -25432 59895 1941 -86363 -66979 46848
13384 46848 -1732 -49018 8321 79949 6335 -81985 -61409 -165500 -108174 -116096 75633
13373 75633 77902 -43818 -28414 -6927 104178 168971 58773 75373 134650 84436 -26532
13362 -26532 -93785 -62560 32446 84740 208249 140821 80018 101665 123655 -14876 71638
$$ packed form
13442b4057J0580L5477o6475o0417J8599n330l2503P0756j27378J6411L5443M1405
13430h7489j0918K0705o0068q808L3891R1764R62L0074m0438n0087J094m0515
13418a19833m7213Q6233R8543m3447o2025j0393R0207J36220r099j13833j24667
13407a19307n2564Q1533k9994J26248N3189j04199K797O5795j6769q1304R422
13396f5153j6034O6417K8230n657n6864j2600L6229Q5327n7954q8304J9384J13827
13384D6848m8580m7286N7339P1628p3614q8320K0576j04091N7326p922J91729
13373G5633K269j21720J5404K1487J11105O4793j10198J6600N9277n0214j10968
13362b6532o7253L1225R5006N2294J23509o7428o0803K1647K1990j38531Q6514
$$ plain form
13351 71638 152969 225574 280995 212871 192361 98513 153657 270598 167573 55460 157454
13340 157454 177486 132407 100066 155242 157386 68502 148167 190292 86784 23665 51325
13329 51325 49297 83651 29253 108825 128738 154730 106579 141041 223953 224011 182494 251441
13317 251441 280670 293451 281645 342764 314276 354789 323375 300550 251497 220852 193669
13306 193669 106099 169008 175497 150268 224766 112849 25457 -55258 -204777 -244506 -148044
13295 -148044 -46269 35424 146351 146469 81710 173761 171918 98411 -33042 75147 92927
13284 92927 141344 167113 114142 115269 142514 159863 167062 136223 48711 200211 290489 359964
13272 359964 330939 352674 453792 424921 442185 454733 541181 503649 372695 120460 -24281
$$ packed form
13351G1638Q1331P2605N5421o8124k0510r3848N5144J16941j03025j12113J01994
13340A57454K0032m5079l2341N5176K144q8884P9665M2125j03508o3119K7660
13329E1325k028L4354n4398P9572J9913K5992m8151L4462Q2912N8m1517O8947
13317B51441K9229J2781j1806O1119k8488M0513l1414k2825m9053l0645k7183
13306A93669q7570O2909O489k5229P4498j11917q7392q0715j49519l9729R6462
13295a48044J01775Q1693J10927J18o4759R2051j843p3507j31453J08189J7780
13284I2927M8417K5769n2971J127K7245J7349P199l0839q7512J51500R0278O9475
13272C59964k9025K1735J01118k8871J7264J2548Q6448l7532j30954k52235j44741
$$ plain form
13261 -24281 44568 127539 139235 85808 91510 107934 195551 205726 244851 147607 11324 46642
13249 46642 -26713 -94902 9855 -46457 -75822 -26765 -2463 -23852 73438 119859 91338
13238 91338 90148 69685 67290 136775 149065 244173 174476 175173 183677 102209 -17017 26174
13226 26174 90018 -42141 -116398 -68913 26502 156028 220469 191710 96849 71632 114046
13215 114046 157219 85548 97764 54051 19375 59751 40969 34915 131347 280566 342096
13204 342096 247944 278465 323651 251242 216463 271081 383918 435056 375716 339412 342387
13193 342387 260199 127059 16936 91141 128968 261548 332023 192862 99921 106550 113835
13182 113835 197374 149221 113789 165119 153338 59594 -113240 -145291 37844 158270 254091
$$ packed form
13261b4281O8849Q2971J1696n3427N702J6424Q7617J0175L9125r7244j36283L5318
13249D6642p3355o8189J04757n6312k9365M9057K4302k1389R7290M6421k8521
13238I1338j190k0463k395O9485J2290R5108o9697O97Q504q1468j19226M3191
13226B6174O3844j32159p4257M7485R5415J29526O4441k8759r4861k5217M2414
13215A14046M3173p1671J2216m3713l4676M0376j8782o054R6432J49219O1530
13204C42096r4152L0521M5186p2409l4779N4618J12837N1138n9340l6304K975
13193C42387q2188j33140j10123P4205L7827J32580P0475j39161r2941O629P285
13182A13835Q3539m8153l5432N1330j1781r3744j72834l2051J83135J20426R5821
$$ plain form
13171 254091 305972 317565 268581 221568 121675 119838 166766 292811 335119 318273 216225
13160 216225 212992 221135 220268 219649 295007 456231 547450 657304 799275 856158 823630 839128
13148 839128 693918 611682 485643 416993 363490 296977 231855 195034 205703 178031 156405
13137 156405 133790 102424 155511 153197 124596 81386 85102 40548 58346 15031 84338 134675
13125 134675 103415 100195 79948 102363 112284 68683 52655 141146 233795 232864 209389 299078
13113 299078 446101 466672 432886 528425 711845 844546 913704 934043 955927 984247 916639
13102 916639 753135 626737 540860 313135 225529 382653 392797 332972 300462 178521
13092 178521 154067 147872 115221 105827 205075 147953 148844 154427 122842 72378 -62811 -17355
$$ packed form
13171B54091N1881J1593m8984m7013r9893j837M6928J26045M2308j6846j02048
13160B16225l233Q143q67o19P5358J61224R1219J09854J41971N6883l2528J5498
13148H39128j45210q2236j26039o8650n3503o6513o5122l6821J0669k7672k1626
13137A56405k2615l1366N3087k314k8601m3210L716m4554J7798m3315O9307N0337
13125A34675l1260l220k0247K2415R921m3601j6028Q8491R2649r31k3475Q9689
13113B99078J47023K0571l3786R5539J83420J32701O9158K0339K1884K8320o7608
13102I16639j63504j26398q5877k27725q7606J57124J0144n9825l2510j21941
13092A78521k4454o195l2651r394R9248n7122Q91N583l1585n0464j35189M5456
$$ plain form
13080 -17355 -7312 31715 28040 40927 65467 20619 37918 139456 115190 138563 133743 155255
13068 155255 119383 192254 306587 335862 195170 184116 285910 427065 477359 458815 512416
13057 512416 608000 508056 406705 342172 294306 266255 227829 192935 238085 207252 227430
13046 227430 246596 109826 -13503 -41870 15344 70043 127991 254178 218220 25045 -26474
13035 -26474 113930 88096 146019 142760 146979 173820 107778 49126 -89494 -114499 -131227 -219335
13023 -219335 -201755 -54778 81174 152045 -6060 -87735 15578 90015 47083 41665 58048
13012 58048 4802 -68049 -58046 6928 124937 120637 123471 76900 126091 205521 260217 316177
13000 316177 294912 246534 140991 44156 4732 86163 45419 -10905 -22708 204733 342062
$$ packed form
13080a7355J0043L9027l675J2887K4540m4848J7299J01538k4266K3373m820K1512
13068A55255l5872P2871J14333K9275j40692j1054J01794J41155N0294j8544N3601
13057E12416R5584r9944j01351o4533m7866k8051l8426l4894M5150l0833K0178
13046B27430J9166j36770j23329k8367N7214N4699N7948J26187l5958j93175n1519
13035b6474J40404k5834N7923l259M219K6841o6042n8652j38620k5005j6728q8108
13023b19335J7580J46977J35952P0871j58105q1675J03313P4437m2932n418J6383
13012E8048n3246p2851J0003O4974J18009m300K834m6571M9191P9430N4696N5960
13000C16177k1265m8378j05543r6835l9424Q1431m0744n6324j1803K27441J37329
$$ plain form
12989 342062 238240 232802 163452 110734 79465 12523 84035 60045 -4966 111392 121440
12978 121440 61945 196376 228820 265168 190621 130015 141855 199040 153308 124771 95819
12967 95819 142222 76234 54172 92788 175320 190418 112064 135791 30614 21379 68149 101581
12955 101581 182952 94337 47155 172817 208817 289202 332859 247832 149381 162590 288356
12944 288356 361906 333414 211188 221633 280146 328357 318388 306361 292546 251699 238839
12933 238839 164123 139873 97493 177594 180234 80217 -84681 -61183 8750 123073 198459
12922 198459 114493 9960 71584 225393 276367 326385 309097 128616 173735 194195 330971
12911 330971 342679 187912 139678 157396 150196 133039 173408 150818 -59008 -251428 -171716
$$ packed form
12989C42062j03822n438o9350n2718l1269o6942P1512k3990o5011J16358J0048
12978A21440n9495J34431L2444L6348p4547o0606J1840N7185m5732k8537k8952
12967I5819M6403o5988k2062L8616Q2532J5098p8354K3727j05177r235M6770L3432
12955A01581Q1371q8615m7182J25662L6000Q0385M3657q5027r8451J3209J25766
12944B88356P3550k8492j22226J0445N8513M8211r969j2027j3815m0847j2860
12933B38839p4716k4250m2380Q0101K640j00017j64898K3498O9933J14323P5386
12922A98459q3966j04533O1624J53809N0974N0018j7288j80481M5119K0460J36776
12911C30971J1708j54767m8234J7718p200j7157M0369k2590k09826j92420P9712
$$ plain form
12900 -171716 -54819 144004 184118 128903 18504 27666 22796 71919 183267 140584 96932
12889 96932 163813 196112 208327 107931 28461 39076 54289 63332 91056 67174 23116 46747
12877 46747 -51688 -3563 58470 134957 155994 203740 311754 334124 248983 288541 333328
12866 333328 297772 335574 308940 316144 354441 346358 278904 192278 194403 245515 117038 31350
12854 31350 99449 220081 163533 255274 254985 209197 172319 172919 253153 213623 164755 167695
12842 167695 191079 133032 129657 143163 72959 63365 24735 80969 179792 242369 79956 24442
12830 24442 64346 167159 77104 119254 294965 317825 304914 230242 201030 262607 245701
12819 245701 235325 285929 421834 368187 196585 105427 163014 233146 154238 -4708 -69107
$$ packed form
12900a71716J16897J98823M0114n5215j10399R162m870M9123J11348m2683m3652
12889I6932O6881L2299J2215j00396p9470J0615J5213R043K7724k3882m4058K3631
12877D6747r8435M8125O2033P6487K1037M7746J08014K2370q5141L9558M4787
12866C33328l5556L7802k6634P204L8297q083o7454q6626K125N1112j28477q5688
12854C1350O8099J20632n6548R1741k89m5788l6878O00Q0234l9530m8868K940
12842A67695K3384n8047l375J3506p0204r594l8630N6234R8823O2577j62413n5514
12830B4442L9904J02813r0055M2150J75711K2860j2911p4672k9212O1577j6906
12819B45701j0376N0604J35905n3647j71602r1158N7587P0132p8908j58946o4399
$$ plain form
12808 -69107 49799 100169 1824 -112888 -56203 1737 -94232 -206251 -168330 -21267 126309
12797 126309 57896 -36602 -113701 -85505 35083 173000 155561 147733 184168 162650 120360
12786 120360 13780 -37874 41287 168903 250222 225835 99975 176881 158771 224049 241904
12775 241904 212568 171150 163521 261320 160854 53482 66170 92174 24083 43019 74921
12764 74921 -9736 -28214 76046 56013 -23671 -68061 10413 53367 94825 113103 240256
12753 240256 265437 238421 190452 83497 -51544 -23188 122608 157121 80533 145721 172754
12742 172754 77958 -15582 47870 143969 162891 140642 41381 -26064 -26436 118583 207088 152900
12730 152900 147105 268014 201536 108138 233053 359461 287910 92555 -63091 26229 68806
$$ packed form
12808f9107J18906N0370r8345j14712N6685N7940r5969j12019L7921J47063J47576
12797A26309o8413r4498p7099K8196J20588J37917j7439p828L6435k1518m2290
12786A20360j06580n1654P9161J27616Q1319k4387j25860P6906j8110O5278J7855
12775B41904k9336m1418p629R7799j00466j07372J2688K6004o8091J8936L1902
12764G4921q4657j8478J04260k0033p9684m4390P8474M2954M1458J8278J27153
12753B40256K5181k7016m7969j06955j35041K8356J45796L4513p6588O5188K7033
12742A72754r4796r3540O3452R6099J8922k2249r9261o7445l72J45019Q8505n4188
12730A52900n795J20909o6478r3398J24915J26408p1551j95355j55646Q9320M2577
$$ plain form
12719 68806 71142 -55047 -24577 62409 31947 9904 -37749 -31376 -12274 80020 40503 30112
12707 30112 23151 27966 94865 1669 -18375 -38101 10474 49921 60029 173975 207539 208249
12695 208249 185543 71551 30720 29891 41851 117272 101089 114381 100595 128714 122930 99205
12683 99205 149848 94813 85644 11043 6659 -35539 -78199 -27905 79198 50639 -37114 -18212
12671 -18212 -7404 10287 -247 3160 50960 136436 226378 148413 126899 217429 210018 99582
12659 99582 26676 59678 68992 26355 -14630 37949 110235 115881 41513 147736 85234 -72145
12647 -72145 -116250 -59645 -49138 -33316 -101530 -197127 -148441 -168665 -119539 -88667 -130730 -155068
12635 -155068 -115924 14917 67521 159351 98538 8685 118358 141976 139027 95770 -62945
$$ packed form
12719F8806K336j26189L0470Q6986l0462k2043m7653O373J9102R2294l9517j0391
12707C0112o961M815O6899r3196k0044j9726M8575L9447J0108J13946L3564P10
12695B08249k2706j13992m0831q29J1960P5421j6183J3292j3786K8119n784k3725
12683I9205N0643n5035r169p4601m384m2198m2660N0294J07103k8559q7753J8902
12671a8212J0808J7691j0534L407M7800Q5476Q9942p7965k1514R0530p411j10436
12659I9582p2906L3002R314m2637m0985N2579P2286N646p4368J06223o2502j57379
12647g2145m4105N6605J0507J5822o8214r5597M8686k0224M9126L0872m2063k4338
12635a55068L9144J30841N2604R1830o0813q9853J09673K3618k949m3257j58715
$$ plain form
12624 -62945 -138924 -107495 -3877 -29332 -23885 67053 114046 -2337 -31207 -115710 -236691
12613 -236691 -127621 -24803 63840 -18376 -16134 20391 -66225 -35339 -88298 -237659 -168774
12602 -168774 -72389 3161 -104986 -167447 54926 31720 -33361 -87715 -81360 54278 15427
12591 15427 -86150 -114747 60401 72144 -28873 -20948 125292 136342 123222 120694 164313
12580 164313 94591 -18211 -94559 -157167 -145175 -27136 36207 5680 -14575 14376 -40483
12569 -40483 -116634 -106048 -98653 -124829 -245626 -251805 -203067 -143046 -111437 -110526 -65385 -135796
12557 -135796 -193993 -135637 -66175 -32721 42951 119906 116232 17617 -25734 -63259 -42915 -8986
12545 -8986 -80028 -60959 -36316 -4384 34018 -14172 19464 -36894 -91915 -198385 -208359 -137082
$$ packed form
12624f2945p5979L1429J03618k5455N447R0938M6993j16383k8870q4503j20981
12613b36691J09070J02818Q8643q2216K242L6525q6616L0886n2959j49361O8885
12602a68774R6385P5550j08147o2461K22373k3206o5081n4354O355J35638l8851
12591A5427j01577k8597J75148J1743j01017P925J46240J1050j3120k528M3619
12580A64313o9722j12802p6348o2608J1992J18039O3343l0527k0255K8951n4859
12569d0483p6151J0586P395k6176j20797o179M8738O0021L1609R11M5141p0411
12557a35796n8197N8356O9462L3454P5672P6955l674r8615m3351l7525K0344L3929
12545h986p1042J9069K4643L1932L8402m8190L3636n6358n5021j06470r974P1277
$$ plain form
12533 -137082 -44316 16843 -21524 -81577 15550 10660 -166891 -271571 -203340 -103804 -124564
12522 -124564 -38121 115362 -5636 -5580 26458 -22609 -110350 -81753 -13799 -72640 -143443 -14570
12510 -14570 2148 -59132 -96921 -18348 52004 78110 53812 32274 5869 48072 66932 8283
12498 8283 -45569 -2440 131087 256100 212786 196534 181739 177790 69991 -108864 -125774
12487 -125774 15099 47179 39696 -13374 1601 20398 51710 61158 44767 41521 109601 98827
12475 98827 54754 -55528 -109597 -49529 59320 149209 153359 246737 342628 275311 107162
12464 107162 113969 146690 161018 139977 -63077 -41726 114727 275210 248842 190615 189208
12453 189208 293974 324694 188926 12067 24312 -9223 -1719 65772 159898 204074 67079
$$ packed form
12533a37082R2766O1159l8367o0053R7127m890j77551j04680O8231R9536k0760
12522a24564Q6443J53483j20998N6L2038m9067q7741K8597O7954n8841p0803J28873
12510a4570J6718o1280l7789P8573P0352K6106k4298k1538k6405M2203J8860n8649
12498H283n3852M3129J33527J25013m3314j6252j4795l949j07799j78855j6910
12487a25774J40873L2080p483n3070J4975J8797L1312R448j6391l246O8080j0774
12475I8827m4073j10282n4069O0068J08849Q9889M150R3378R5891o7317j68149
12464A07162O807L2721J4328k1041k03054K1351J56453J60483k6368n8227j407
12453A89208J04766L0720j35768j76859J2245l3535P504O7491R4126M4176j36995
$$ plain form
12442 67079 80972 150730 129392 39257 -33145 -143160 -124557 -91439 32145 100037 170487
12431 170487 194332 189739 270624 240405 115801 -44835 -156667 -169291 -22889 56151 59057
12420 59057 74239 24563 -17646 -36223 -17975 82233 170429 190483 39730 91442 191910
12409 191910 218904 154925 138468 164464 76953 43382 16348 76627 92796 9244 38449
12398 38449 113527 83039 -64682 -93130 -52363 -192154 -228626 -88370 -136794 -159240 -168576
12387 -168576 -119229 -47861 -108476 -218990 -269155 -153460 -40689 -18086 -74015 -48396 -88711
12376 -88711 -76427 -123763 -146251 -81022 -30336 -123844 -97478 -11068 58456 -3107 -174877
12365 -174877 -243955 -218189 -69658 -69686 -167921 -162184 -209400 -186120 -111763 -68084 4647 62737
$$ packed form
12442F7079J3893O9758k1338r0135p2402j10015J8603L3118J23584O7892P0450
12431A70487K3845m593Q0885l0219j24604j60636j11832j2624J46402P9040K906
12420E9057J5182m9676m2209j8577J8248J00208Q8196K0054j50753N1712J00468
12409A91910K6994o3979j6457K5996q7511l3571k7034O0279J6169q3552K9205
12398C8449P5078l0488j47721k8448M0767j39791l6472J40256m8424k2446r336
12387a68576M9347P1368o0615j10514n0165J15695J12771K2603n5929K5619m0315
12376h8711J2284m7336k2488O5229N0686r3508K6366Q6410O9524o1563j71770
12365a74877o9078K5766J48531k8r8235N737m7216K3280P4357M3679P2731N8090
$$ plain form
12353 62737 -10037 8572 32904 9985 -15320 8283 46510 12405 47437 44854 18700 -11797
12341 -11797 -8176 -137888 -144195 -48500 -49356 -161786 -102841 -5068 33086 19666 -20144 42925
12329 42925 103911 77445 39865 -7790 33933 120431 173580 51160 46288 64165 -42448
12318 -42448 -26964 -9905 -108212 -24086 135226 126699 121165 164490 89433 164765 129959 36055
12306 36055 64769 124798 105971 121523 156391 110927 70818 19031 -32687 -97886 -44409 6271
12294 6271 -14558 -161230 -174106 -15234 56575 76889 -1739 -24128 -38903 277 26989
12283 26989 -64643 -33542 85812 141592 62014 9352 -47100 -62215 -12382 -136447 -185463
12272 -185463 -90537 -3604 60595 82760 145299 128694 58209 49684 36469 5953 84509 -20373
$$ packed form
12353F2737p2774J8609K4332k2919k5305K3603L8227l4105L5032k583k6154l0497
12341a1797L621j29712o307R5695q56j12430N8945R7773L8154j3420l9810O3069
12329D2925O0986k6466l7580m7655M1723Q6498N3149j22420m872J7877j06613
12318d2448J5484J7059r8307Q4126J59312q527n534M3325p5057P5332l4806r3904
12306C6055K8714O0029j8827J5552L4868m5464m0109n1787n1718o5199N3477N0680
12294F271k0829j46672j2876J58872P1809K0314p8628k2389j4775L9180K6712
12283B6989r1632L1101J19354N5780p9578n2662n6452j5115M9833j24065m9016
12272a85463R4926Q6933O4199K2165O2539j6605p0485q525j3215l0516P8556j04882
$$ plain form
12260 -20373 -42333 -6041 11709 134976 213037 288106 237204 159965 204398 178186 71671
12249 71671 -30961 -74974 3032 23555 -5589 -86491 -172707 -195844 -90992 -47491 -74228
12238 -74228 -78534 -122044 -128924 -71651 -55956 -52632 -119347 -158293 -19029 76027 85191 98149
12226 98149 -11223 -150521 -233680 -364704 -391936 -300637 -147150 -41434 -32041 -33114 24038
12215 24038 38842 -55028 -17147 -11350 -98276 -56174 -17365 3474 8317 -110482 -165790 -150141
12203 -150141 -100608 -56353 -74652 -144203 -60580 -46245 -122561 -281835 -234067 -61473 62462
12192 62462 236608 167239 -51969 13699 147176 103256 -30986 -118526 -201078 -149619 -166976
12181 -166976 -128719 -71488 -56986 -165085 -257095 -122263 -12482 -1907 -104570 -132582 -164326
$$ packed form
12260b0373k1960L6292J7750J23267P8061P5069n0902p7239M4433k6212j06515
12249G1671j02632m4013P8006K0523k9144q0902q6216k3137J04852M3501k6737
12238g4228m306m3510o880N7273J5695L324o6715l8946J39264R5056R164J2958
12226I8149j09372j39298q3159j31024k7232R1299J53487J05716R393j073N7152
12215B4038J4804r3870L7881N797q6926M2102L8809K0839M843j18799n5308J5649
12203a50141M9533M4255j8299o9551Q3623J4335p6316j59274M7768J72594J23935
12192F2462J74146o9369k19208O5668J33477m3920j34242q7540q2552N1459j7357
12181a66976L8257N7231J4502j08099r2010J34832J09781J0575j02663k8012l1744
$$ plain form
12170 -164326 -144546 24656 -26746 -130008 -15486 60427 33129 -6974 48442 4604 3829
12159 3829 -67078 -140598 -63781 -73210 -105279 -63548 -73507 -40835 -43554 -17106 -93562 37744
12147 37744 197845 148343 174215 56340 167742 239438 117491 73553 35658 -17994 -22466
12136 -22466 42270 121779 174708 121179 43531 45076 -13221 -27428 78765 77724 -8210 -105781
12124 -105781 -91425 -167495 -65590 -174045 -224173 -212086 -118165 -12287 -74068 -119135 -126318
12113 -126318 -118875 -22826 66947 33352 -22512 51949 -39060 -101004 -96979 -51685 99561 94302
12101 94302 60854 -41862 -100962 -151468 -106440 6575 -82988 -69605 -209019 -303079 -215347
12090 -215347 -163537 -109985 -200730 -271074 -154038 -124968 -177730 -100570 -89697 -74764 -57894
$$ packed form
12170a64326J9780J69202n1402j03262J14522P5913k7298m0103N5416m3838p75
12159C829p0907p3520P6817r429l2069M1731r959L2672k719K6448p6456J31306
12147C7744J60101m9502K5872j17875J11402P1696j21947m3938l7895n3652m472
12136b2466O4736P9509N2929n3529p7648J545n8297j4207J06193j041q5934r7571
12124a05781J4356p6070J01905j08455n0128J2087R3921J05878o1781m5067p183
12113a26318P443R6049Q9773l3595n5864P4461r1009o1944M025M5294J51246n259
12101I4302l3448j02716n9100n0506M5028J13015q9563J3383j39414r4060Q7732
12090b15347N1810N3552r0745p0344J17036K9070n2762P7160J0873J4933J6870
$$ plain form
12079 -57894 -107826 -134566 -59157 -136084 -157800 -198827 -150376 -53502 -49921 -6517 128586 254966
12067 254966 203639 108468 146496 84946 68284 -117761 -209472 -71303 61088 106370 179425
12056 179425 192419 96742 38432 94857 163475 208672 189553 118131 168794 174954 166685 182866
12044 182866 99171 100513 -280 -9352 -15972 -32362 14024 -41737 6428 80294 24744 -21524
12032 -21524 79879 187857 208608 127262 11140 2087 68938 107091 168840 121546 172944
12021 172944 200367 166893 201779 205698 167845 185974 148366 30833 61569 150536 58687
12010 58687 18893 69669 145754 122842 105472 113757 96834 70166 183647 165883 134060 124855
11998 124855 74775 57368 34274 165147 239761 226918 205886 142796 26296 676 -22519
$$ packed form
12079e7894m9932k6740P5409p6927k1716m1027M8451R6874L581M3404J35103J26380
12067B54966n1327r5171L8028o1550j6662j86045r1711J38169J32391M5282P3055
12056A79425J2994r5677n8310N6425O8618M5197j9119p1422N0663O160q269J6181
12044A82866q3695J342j00793r072o620j6390M6386n5761M8165P3866n5550m6268
12032b1524J01403J07978K0751q1346j16122r053O6851L8153O1749m7294N1398
12021A72944K7423l3474L4886L919l7853J8129l7608j17533L0736Q8967r1849
12010E8687l9794N0776P6085k2912j7370Q285j6923k6668J13481j7764l1823r205
11998A24855n0080j7407k3094J30873P4614j2843k1032o3090j16500k5620k3195
$$ plain form
11987 -22519 -32320 -25997 -8331 94201 190624 248666 216039 152520 63591 44580 73285 169507
11975 169507 155023 37149 13555 -59165 -107463 -204358 -168110 -56649 -49917 -47992 -56132 -31007
11963 -31007 -59126 -20525 -14254 -69879 -112701 -76918 -31872 -27384 87921 115370 124347 120919
11951 120919 38994 -48045 -21778 85812 118991 243158 194848 140020 151221 259305 261945
11940 261945 246395 211665 184477 17918 -18461 -95685 -109267 14705 -80263 -226846 -197469
11929 -197469 -99117 -51819 -111102 -85058 14993 -3319 -67239 -8926 -577 -58062 -88182
11918 -88182 -20699 -94576 -18286 48244 93675 -42986 -48812 -25529 -16116 -104279 -182866 -170158
11906 -170158 -80641 31673 12093 42697 -10059 -84282 -111808 -57909 -99647 -86489 104400
$$ packed form
11987b2519r801O323J7666J02532R6423N8042l2627o3519q8929j9011K8705R6222
11975A69507j4484j17874k3594p2720m8298r6895L6248J11461O732J925q140K5125
11963c1007k8119L8601O271n5625m2822L5783M5046M488J15305K7449Q977l428
11951A20919q1925q7039K6267J07590L3179J24167m8310n4828J1201J08084K640
11940B61945j5550l4730k7188j66559l6379p7224j3582J23972r4968j46583K9377
11929a97469R8352M7298n9283K6044J00051j8312o3920N8313Q349n7485l0120
11918h8182O7483p3877P6290O6530M5431j36661n826K3283R413q8163p8587J2708
11906a70158Q9517J12314j9580L0604n2756p4223k7526N3899m1738J3158J90889
$$ plain form
11895 104400 181423 80179 129480 166224 259323 181823 97117 -39724 20843 10609 -68969
11884 -68969 -53717 -65085 -55779 -17475 67380 68458 15867 -104232 -142696 -50847 -8737 -8691
11872 -8691 -45362 -124488 -70814 37689 67389 25419 -33289 -97204 -126952 -106681 -100786 -115330
11860 -115330 -66072 -88350 -120964 -14463 100165 197750 175376 114746 93187 66938 22286
11849 22286 4118 22016 -38991 -46380 -35709 -10282 -62097 -47144 -13343 -238134 -264135 -78375
11837 -78375 -67750 -111189 -73179 -4484 63818 144386 -15757 -118064 24572 97889 44428
11826 44428 224444 145551 10967 -65752 -25816 -30340 85875 144127 161761 125677 17191
11815 17191 -44202 40227 70864 63989 62090 97556 93460 78018 55047 -133897 -117052 -59048
$$ packed form
11895A04400P7023j01244M9301L6744R3099p7500q4706j36841O0567j0234p9578
11884f8969J5252j1368R306L8304Q4855J078n2591j20099l8464R1849M2110M6
11872h691l6671p9126N3674J08503K9700m1970n8708o3915k9748K0271N895j4544
11860a15330M9258k2278l2614J06501J14628R7585k2374o0630k1559k6249m4652
11849B2286j8168J7898o1007p389J0671K5427n1815J4953L3801k24791k6001J85760
11837g8375J0625m3439L8010O8695O8302Q0568j60143j02307J42636P3317n3461
11826D4428J80016p8893j34584p6719L9936m524J16215N8252J7634l6084j08486
11815A7191o1393Q4429L0637o875j899L5466m096j5442k2971j88944J6845N8004
$$ plain form
11803 -59048 -117885 -36278 83787 161822 200586 102118 57421 102933 120093 58123 33234
11792 33234 103625 84554 47846 23973 -2575 47995 -103353 -183584 -185328 -116908 -103400 -85112
11780 -85112 -97199 -53564 -39948 -142553 -119843 18928 -49921 -84824 41462 103595 112553
11769 112553 137017 165249 171997 78771 -10255 -170818 -284264 -220200 -65793 -65128 -72621 -64651
11757 -64651 -100808 -39231 -3575 36117 53626 6178 -71968 30739 20291 -11968 12328
11746 12328 60508 24075 -57518 -55376 101795 120317 6723 -76397 -18438 82545 162835
11735 162835 165780 120217 165792 184549 132652 19760 -65333 -100730 -84904 17284 19458
11724 19458 32753 -42793 -41241 -99456 -115038 -132861 -205140 -194816 -204499 -139457 -38566 1155
$$ packed form
11803e9048n8837Q1607J20065P8035L8764r8468m4697M5512J7160o1970k4889
11792C3234P0391j9071l6708k3873k6548N0570j51348q0231j744O8420J3508J8288
11780h5112j2087M3635J3616j02605K2710J38771o8849l4903J26286O2133Q958
11769A12553K4464K8232O748r3226q9026j60563j13446O4064J54407O65p493P970
11757f4651l6157O1577L5656L9692J7509m7448p8146J02707j0448l2259K4296
11746A2328M8180l6433q1593K142J57171J8522j13594q3120N7959J00983Q0290
11735A62835K945m5563M5575J8757n1897j12892q5093l5397J5826J02188K174
11724A9458J3295p5546J552n8215j5582j7823p2279J0324r683O5042J00891L9721
$$ plain form
11712 1155 -90341 -154090 -197073 -266877 -289307 -126555 -126562 -150407 -118958 -87359 -14901 -8389 27528
11699 27528 42398 23175 29306 -155539 -116310 6856 39919 -36601 43909 157171 299145
11688 299145 317981 342733 234776 254199 222886 184047 169204 267480 151074 135470 124575
11677 124575 123134 126164 151794 188087 46696 41987 -15219 99211 182843 199073 195798 174585
11665 174585 134251 125609 106244 14457 -58848 -751 67050 61581 105848 213552 153150 90066
11653 90066 -14358 -81067 -74818 11125 80854 35205 -49230 -165449 -61663 48518 -37548
11642 -37548 -17970 -105531 -170827 -220168 -245811 -191422 -95438 -118076 -105816 -29249 -3985 -42913
11630 -42913 -72434 -116486 -173430 -85241 -1974 -5448 -2499 -42494 -148455 -154814 -120936 -132529
$$ packed form
11712A155r1496o3749m2983o9804k2430J62752pk3845L1449L1599P2458O512L5917
11699B7528J4870j9223O131j84845L9229J23166L3063p6520Q0510J13262J41974
11688B99145J8836K4752j07957J9423l1313l8839j4843R8276j16406j5604j0895
11677A24575j441L030K5630L6293j41391m709n7206J14430Q3632J6230l275k1213
11665A74585m0334q642j9365r1787p3305N8097O7801n469M4267J07704o0402o3084
11653I0066j04424o6709O249Q5943O9729m5649q4435j16219J03786J10181q6066
11642c7548J9578q7561o5296m9341k5643N4389R5984k2638J2260P6567K5264l8928
11630d2913k9521m4052n6944Q8189Q3267l474K949l9995j05961o359L3878j1593
$$ plain form
11618 -132529 -102421 -84489 -50058 -3049 47555 110055 169349 87469 40351 29065 -14903
11607 -14903 -77048 -126293 -196903 -189659 65048 258588 302456 56951 -51851 18015 4727
11596 4727 -18907 43542 47185 -3479 -92931 -91091 -85384 -130368 -118825 -108308 -66460 118124
11584 118124 136261 120820 33544 -21284 40361 73040 113407 121635 101575 41602 -1881 -102157
11572 -102157 -91244 -8470 -45195 46883 103727 133021 236147 255092 212625 246456 222020
11561 222020 9 -32599 -19923 -43915 -111111 -187934 -202400 -130569 -111745 -158234 -154192
11550 -154192 -112125 -119743 -161982 -165376 -72038 -154441 -160942 -104808 -154260 -148580 -147792 -78364 -60445
11537 -60445 36015 -51658 -145227 -70976 -73274 -19890 -64792 -41927 -86266 -82536 62625 160306
$$ packed form
11618a32529L0108J7932L4431M7009N0604O2500N9294q1880m7118j1286m3968
11607a4903o2145m9245p0610P244K54707J93540M3868k45505j08802O9866j3288
11596D727k3634O2449L643n0664q9452J840N707m4984J1543J0517M1848J84584
11584A18124J8137j5441q7276n4828O1645L2679M0367Q228k0060n9973m3483j00276
11572a02157J0913Q2774l6725R2078N6844K9294J03126J8945m2467L3831k4436
11561B22020k22011l2608J2676k3992o7196p6823j4466P1831J8824m6489M042
11550a54192M2067p618m2239l394R3338q2403o501N6134m9452N680P88O9428J7919
11537f0445R6460q7673r3569P4251k298N3384m4902K2865m4339L730J45161R7681
$$ plain form
11525 160306 64498 -12276 99616 88449 3540 133589 102121 153844 151152 20538 22519
11514 22519 79137 -24946 -123992 -3451 81784 144660 179691 90625 80487 -31462 -55587
11503 -55587 -50524 66566 79093 159105 91151 23329 113254 197611 31851 -115386 -85153
11492 -85153 -52604 -18331 8579 5441 -20866 106706 203931 147315 -95367 -125819 8050
11481 8050 -8039 -8034 80456 146517 120189 73879 74203 82050 113503 126398 138307 91572 37840
11468 37840 25075 59234 58164 -12601 49165 97603 -8285 -43240 45054 76854 -11251 100560
11456 100560 179244 39471 -54802 -16722 66043 58025 138189 272916 255453 152697 51921
11445 51921 7 77744 252444 373329 333159 227053 190377 191732 99506 131621 184161
$$ packed form
11525A60306r5808p6774J11892j1167q4909J30049l1468N1723k692j30614J981
11514B2519N6618j04083r9046J20541Q5235O2876L5031q9066j0138j11949k4125
11503e5587N063J17090J2527Q0012o7954o7822Q9925Q4357j65760j47237L0233
11492h5153L2549L4273K6910l138k6307J27572R7225n6616k42682l0452J33869
11481H050j6089NQ8490O6061k6328m6310L24P847L1453J2895J1909m6735n3732
11468C7840j2765L4159j070p0765O1766M8438j05888l4955Q8294L1800q8105J11811
11456A00560P8684j39773r4273L8080Q2765q018Q0164J34727j7463j02756j00776
11445E1921n1914P7737J74700J20885m0170j06106l6676J355r2226L2115N2540
$$ plain form
11434 184161 202954 106613 60433 38421 83030 183583 128200 234732 214461 128514 78455
11423 78455 79898 8118 109973 198400 74522 4260 -41847 -74949 -52868 175694 196876
11412 196876 -42012 27534 40390 12931 18113 18112 106191 10965 100034 77453 6122 8712
11400 8712 130296 222335 158877 117438 147060 190657 242284 315860 389649 403348 435669 342562
11388 342562 106616 87886 54498 48700 113408 103369 89228 235636 246016 181140 267074
11377 267074 319524 250767 180972 230725 313843 301575 148598 98539 89390 95000 150357 54974
11365 54974 164034 339116 315862 285896 206186 167977 201422 172014 139910 27903 -13507
11354 -13507 43045 89739 186654 153865 144551 258322 248682 153029 4023 -53406 10258 165781
$$ packed form
11434A84161J8793r6341m6180k2012M4609J00553n5383J06532k0271q5947n0059
11423G8455J443p1780J01855Q8427j23878p0262m6107l3102K2081K28562K1182
11412A96876k38888O9546J2856k7459N182jQ8079r5226Q9069k2581p1331K590
11400H712J21584R2039o3458m1439K9622M3597N1627P3576P3789J3699L2321r3107
11388C42562k35946j8730l3388n798O4708j0039j4141J46408J0380o4876Q5934
11377B67074N2450o8757o9795M9753Q3118j2268j52977n0059r149N610N5357r5383
11365E4974J09060J75082k3254k9966p9710l8209L3445k9408l2104j12007m1410
11354a3507N6552M6694R6915l2789r314J13771r640r5653j49006n7429O3664J55523
$$ plain form
11342 165781 272684 351038 398202 328671 240054 141117 166819 242074 191699 133843 90307
11331 90307 144562 237791 275855 334060 296036 169635 54110 37383 84729 230045 251501
11320 251501 318336 295406 357055 416618 326218 273969 292738 322283 196714 22738 25832
11309 25832 87520 78767 28414 -143299 -194109 -57555 100863 89002 166829 264982 180803
11298 180803 176364 261752 285322 397529 463480 408369 329271 409815 393282 340201 336148 193530
11286 193530 173060 371423 430652 292105 240917 268887 394497 417383 332921 249309 220924
11275 220924 232026 221385 303770 316932 311828 307276 292813 177257 97174 118777 130944 139496
11263 139496 206726 261880 362166 428730 414109 465661 473058 416667 421914 428029 480497 466543
$$ packed form
11342A65781J06903P8354M7164o9531q8617r8937K5702P5255n0375n7856m3536
11331I0307N4255R3229L8064N8205l8024j26401j15525j6727M7346J45316K1456
11320B51501O6835k2930O1649N9563r0400n2249J8769K9545j25569j73976L094
11309B5832O1688q753n0353j71713n0810J36554J58418j1861P7827R8153q4179
11298A80803m439Q5388K3570J12207O5951n5111p9098Q0544j6533n3081m053j42618
11286A93530k0470J98363N9229j38547n1188K7970J25610K2886q4462q3612k8385
11275B20924J1102j0641Q2385J3162n104m552j4463j15556q0083K1603J2167Q552
11263A39496O7230N5154J00286O6564j4621N1552P397n6391N247O115N2468j3954
$$ plain form
11251 466543 381535 281355 234562 300582 289520 328354 373030 405317 377237 436739 416501
11240 416501 462905 353068 149083 194311 357744 345979 433168 429865 396003 488450 546193
11229 546193 513028 468800 479674 422027 456701 647740 703788 606815 489829 433796 431203
11218 431203 384726 596154 580881 548237 436141 356082 430182 470498 526401 501540 480840
11207 480840 493333 503201 573259 544553 337819 247378 176282 180631 255085 440190 467769
11196 467769 550386 602019 483622 517803 546959 525765 547999 518145 430403 410232 492145
11185 492145 535320 549140 560579 624801 721041 756996 719913 642010 524781 479794 517486
11174 517486 656611 630845 610846 710105 668343 641895 631443 646432 616365 487170 579883
$$ packed form
11251D66543q5008j00180m6793O6020j1062L8834M4676L2287k8080N9502k0238
11240D16501M6404j09837k03985M5228J63433j1765Q7189l303l3862R2447N7743
11229E46193l3165m4228J0874n7647L4674J91039N6048r6973j16986n6033k593
11218D31203m6477K11428j5273l2644j12096q0059P4100M0316N5903k4861k0700
11207D80840J2493R868P0058k8706k06734r0441p1096M349P4454J85105K7579
11196D67769Q2617N1633j18397L4181K9156k1194K2234k9854q7742k0171Q1913
11185D92145M3175J3820J1439O4222R6240L5955l7083p7903j17229m4987L7692
11174E17486J39125k5766j9999R9259m1762k6448j0452J4989l0067j29195R2713
$$ plain form
11163 579883 782553 823865 753920 645317 683176 736939 706602 565919 582863 754758 798482
11152 798482 826533 826417 870287 855703 827343 775433 896369 886456 955686 1001916 835965 724185
11140 724185 697230 680232 736601 814060 879864 845223 798825 827594 883799 971730 1035124
11129 1035124 1037282 1064604 990778 963609 1005919 968443 866507 823924 790081 873751 995776
11118 995776 1070878 1074609 922620 962983 1157341 1285771 1244204 1114342 1065921 1146551 1175209
11107 1175209 1200174 1228354 1251583 1303130 1327192 1375688 1345222 1319587 1316610 1303491 1213228
11096 1213228 1175304 1290296 1328328 1282012 1305412 1408849 1535418 1432303 1420148 1596739
11086 1596739 1608569 1579837 1556725 1514697 1567415 1715724 1650313 1682411 1670839 1680141 1717450
$$ packed form
11163E79883K02670M1312o9945j08603L7859N3763l0337j40683J6944J71895M3724
11152G98482K8051j16M3870j4584k8360n1910J20936r913O9230M6230j65951j11780
11140G24185k6955j6998N6369P7459O5804l4641m6398K8769N6205Q7931O3394
11129A035124K158K7322p3826k7169M2310l7476j01936m2583l3843Q3670J22025
11118I95776P5102L731j51989M0363J94358J28430m1567j29862m8421Q0630K8658
11107A175209K4965K8180K3229N1547K4062M8496l0466k5635k977j3119r0263
11096A213228l7924J14992L8032m6316K3400J03437J26569j03115j2155J76591
11086A596739J1830k8732k3112m2028N2718J48309o5411L2098j1572R302L7309
$$ plain form
11075 1717450 1750253 1862908 1842075 1758955 1721222 1690286 1771250 1779600 1637989 1631145 1781604
11064 1781604 1998458 2055020 2012258 1996067 1955028 2022113 2018816 2079191 2185002 2291357 2319293
11053 2319293 2307280 2331022 2316057 2415695 2511396 2639030 2667422 2680713 2602233 2558369 2580548
11042 2580548 2667053 2741366 3012412 3062378 2981681 2867885 2815779 2860530 2998738 3190266
11032 3190266 3254909 3338488 3408493 3362568 3306767 3376412 3615805 3814602 3852042 3918680 3988515
11021 3988515 3983224 3924112 3940249 4035366 4197874 4319055 4332883 4342941 4286543 4334615 4456179
11010 4456179 4560132 4531806 4655749 4822526 4801058 4848347 4908952 4996143 5120249 5387375
11000 5387375 5637222 5791908 5783161 5953906 6120956 6136740 6214937 6239968 6440498 6500859
$$ packed form
11075A717450L2803J12655k0833q3120l7733l0936Q0964Q350j41611o844J50459
11064A781604K16854N6562m2762j6191m1039O7085l297O0375J05811J06355K7936
11053B319293j2013K3742j4965R9638R5701J27634K8392J3291p8480m3864K2179
11042B580548Q6505P4313K71046M9966q0697j13796n2106M4751J38208J91528
11032C190266O4643Q3579P0005m5925n5801O9645K39393J98797L7440O6638O9835
11021C988515n291n9112J6137R5117J62508J21181J3828J0058n6398M8072J21564
11010D456179J03953k8326J23943J66777k1468M7289O0605Q7191J24106K67126
11000E387375K49847J54686q747J70745J67050J5784P8197K5031K00530O0361
$$ plain form
10990 6500859 6620321 6765486 6795738 6921463 7117157 7350421 7443428 7537651 7709723 7875514
10980 7875514 7902799 8137028 8515371 8769336 8831464 8907101 9045192 9177324 9351432 9512824
10970 9512824 9699484 9852926 9982313 10137821 10288355 10550661 10768751 11009820 11132478
10961 11132478 11364463 11560689 11715515 11922399 12160416 12337798 12507180 12703455 12810043
10952 12810043 12954551 13134408 13277288 13494389 13668460 13883879 14114332 14345628 14575860
10943 14575860 14766792 14855958 14946356 15008605 15227795 15302197 15408027 15452764 15708036 16016057
10933 16016057 16151977 16096355 16132581 16236140 16236446 16266529 16309627 16398744 16444556 16519578 16421782
10922 16421782 16286253 16306250 16274426 16194267 16240902 16146475 16072548 16075024 16030913 15846433 15700226
$$ packed form
10990F500859J19462J45165L0252J25725J95694K33264R3007R4223J72072J65791
10980G875514K7285K34229L78343K53965O2128P5637J38091J32132J74108J61392
10970I512824J86660J53442J29387J55508J50534K62306K18090K41069J22658
10961A1132478K31985J96226J54826K06884K38017J77382J69382J96275J06588
10952A2810043J44508J79857J42880K17101J74071K15419K30453K31296K30232
10943A4575860J90932Q9166R0398O2249K19190P4402J05830M4737K55272L08021
10933A6016057J35920n5622L6226J03559L06L0083M3098Q9117M5812P5022r7796
10922A6421782j35529J9997l1824q0159M6635r4427p3927K476m4111j84480j46207
$$ plain form
10911 15700226 15566945 15436525 15394689 15253953 15109967 14948878 14722507 14401803 14327608 14237599
10901 14237599 13958507 13803691 13706697 13527345 13383856 13214888 13058589 12902000 12763494
10892 12763494 12589395 12458739 12369671 12177126 11800754 11610657 11479599 11348398 11167898
10883 11167898 10997006 10762584 10523083 10306714 10134541 9953751 9827817 9779604 9602599
10874 9602599 9450655 9273675 9159737 9027900 8839876 8655281 8445384 8337686 8214092
10865 8214092 8117854 8027513 7828481 7646038 7495939 7363428 7186183 7010688 6931173 6921148
10855 6921148 6821009 6705659 6588867 6556013 6449177 6388913 6263632 6097219 6016790 6187755
10845 6187755 6128708 5883064 5729217 5615516 5567911 5447216 5414915 5242920 5151817 5171042
$$ packed form
10911A5700226j33281j30420m1836j40736j43986j61089k26371l20704p4195r0009
10901A4237599k79092j54816r6994j79352j43489j68968j56299j56589j38506
10892A2763494j74099j30656q9068j92545l76372j90097j31058j31201j80500
10883A1167898j70892k34422k39501k16369j72173j80790j25934m8213j77005
10874I602599j51944j76980j13938j31837j88024j84595k09897j07698j23594
10865H214092r6238r0341j99032j82443j50099j32511j77245j75495p9515j0025
10855F921148j00139j15350j16792l2854j06836o0264j25281j66413q0429J70965
10845F187755n9047k45644j53847j13701m7605j20695l2301j71995r1103J9225
$$ plain form
10835 5171042 5059208 4823482 4677283 4673494 4690452 4626678 4474726 4364542 4342420 4399424
10825 4399424 4360055 4236091 4115321 4027499 4060824 4008402 3983667 4003023 3942429 3938653 3876684
10814 3876684 3748266 3595479 3335022 3318058 3427607 3423363 3371158 3353008 3425429 3350737 3250460
10803 3250460 3269679 3138424 3075732 3114101 3067881 2951663 2872884 2838477 2849924 2812286 2691727
10792 2691727 2602899 2560923 2674559 2703093 2622170 2582137 2648449 2552917 2572593 2506291 2334918
10781 2334918 2241092 2261550 2210486 2237132 2356479 2289820 2163572 2085904 2075875 2080665 2094687
10770 2094687 2172358 2156342 2053037 1840860 1818006 1762037 1769416 1828107 1865128 1897172 1907000
10759 1907000 1885080 1913680 1888166 1765822 1731145 1667359 1702566 1767836 1830622 1767044 1641324
$$ packed form
10835E171042j11834k35726j46199l789J6958o3774j51952j10184k2122N7004
10825D399424l9369j23964j20770q7822L3325n2422k4735J9356o0594l776o1969
10814C876684j28418j52787k60457j6964J09549m244n2205j8150P2421p4692j00277
10803C250460J9219j31255o2692L8369m6220j16218p8779l4407J1447l7638j20559
10792B691727q8828m1976J13636K8534q0923m0033O6312r5532J9676o6302j71373
10781B334918r3826K0458n1064K6646J19347o6659j26248p7668j0029M790J4022
10770B094687P7671j6016j03305k12177k2854n5969P379N8691L7021L2044R828
10759A907000k1920K8600k5514j22344l4677o3786L5207O5270O2786o3578j25720
$$ plain form
10748 1641324 1715717 1770580 1694000 1511757 1510491 1601257 1576324 1508663 1562469 1525554 1517154
10737 1517154 1603109 1596158 1540370 1484545 1345991 1337882 1138121 1169868 1252021 1123042 1178568
10726 1178568 1218506 1298647 1179868 1107225 1004107 1094809 1089428 1186628 1281501 1232607 1194652
10715 1194652 1082401 1033903 1096232 1124371 1003802 864524 1016158 1027143 980857 1036974
10705 1036974 1179568 1209593 1163063 1022075 984695 1013378 893274 796899 844872 766110 798487
10694 798487 740417 652966 731441 894497 968566 927731 914954 978446 1046676 1003147 942978
10683 942978 847515 834907 891672 977298 1086616 1115636 1158125 1037485 927636 828722 815919
10672 815919 813508 817296 803990 734276 774074 904832 819139 785192 724482 666583 691638 679527
$$ packed form
10748A641324P4393N4863p6580j82243j266R0766k4933o7661N3806l6915q400
10737A517154Q5955o951n5788n5825j38554q109j99761L1747Q2153j28979N5526
10726A178568L9938Q0141j18779p2643j03118R0702n381R7200R4873m8894l7955
10715A194652j12251m8498O2329K8139j20569j39278J51634J0985m6286N6117
10705A036974J42594L0025m6530j40988l7380K8683j20104r6375M7973p8762L2377
10694G98487n8070q7451P8475J63056P4069m0835j2777O3492O8230m3529o0169
10683I42978r5463j2608N6765Q5626J09318K9020M2489j20640j09849r8914j2803
10672H15919k411L788j3306o9714L9798J30758q5693l3947o0710n7899K5055j2111
$$ plain form
10660 679527 686059 741774 636876 599787 658854 770942 781264 755554 774275 787900 747383
10649 747383 648952 702056 795881 718464 611779 494960 592026 825344 1003912 896040
10639 896040 769605 756230 755285 757427 732710 713594 643521 615399 551037 420972 429188 398336
10627 398336 527512 614657 664473 578000 484614 511171 607128 592688 484411 499439 456662
10616 456662 372696 412376 472328 465079 457126 506067 448718 496300 572094 547419 512033 449428
10604 449428 389302 431837 469637 458258 521257 604150 663907 712491 644212 487610 495111
10593 495111 487866 524953 507853 499256 540403 572238 641639 585648 577540 562539 561483 578474
10581 578474 674361 627265 684613 710524 721856 701058 542953 508374 529986 457136 559356
$$ packed form
10660F79527O532N5715j04898l7089N9067J12088J0322k5710J8721J3625m0517
10649G47383r8431N3104R3825p7417j06685j16819R7066K33318J78568j07872
10639H96040j26435j3375r45K142k4717j9116p0073k8122o4362j30065Q216l0852
10627C98336J29176Q7145M9816q6473r3386K6557R5957j4440j08277J5028m2777
10616D56662q3966L9680N9952p249p953M8941n7349M7582P5794k4675l5386o2605
10604D49428o0126M2535L7800j1379O2999Q2893N9757M8584o8279j56602P501
10593D95111p245L7087j7100q597M1147L1835O9401n5991q108j5001j056J6991
10581E78474R5887m7096N7348K5911J1332k0798j58105l4579K1612p2850J02220
$$ plain form
10570 559356 582548 531553 398184 389989 458631 421518 366229 354504 364445 377401 445942 362796
10558 362796 358097 457543 496681 405531 498328 531680 466957 406981 426080 495461 459542 432398
10546 432398 522647 709178 651601 570226 550830 475437 436381 521545 538323 563184 638229
10535 638229 562327 601858 657993 564641 592128 682361 514681 444729 440599 433888 485255 382078
10523 382078 425751 474685 525136 536598 447935 515969 439420 430285 444240 491995 503191 426312
10511 426312 456266 657427 626060 469301 423263 343647 388273 420527 370619 365944 277649
10500 277649 340883 344430 371657 338120 314110 328441 331400 432997 502953 440368 445236 487774
10488 487774 388500 345814 394758 423516 410135 290135 298214 271141 246422 239607 313911 425194
$$ packed form
10570E59356K3192n0995j33369q195O8642l7113n5289j1725R941J2956O8541q3146
10558C62796m699R9446L9138r1150R2797L3352o4723n9976J9099O9381l5919k7144
10546D32398R0249J86531n7577q1375j9396p5393l9056Q5164J6778K4861P5045
10535F38229p5902L9531N6135r3352K7487R0233j67680o9952m130o711N1367j03177
10523C82078M3673M8934N0451J1462q8663O8034p6549r135J3955M7755J1196p6879
10511D26312K9954K01161l1367j56759m6038p9616M4626L2254m9908m675q8295
10500B77649O3234L547K7227l3537k4010J4331K959J01597O9956o2585M868M2538
10488D87774r9274m2686M8944K8758j3381j20000Q079k7073k4719o815P4304J11283
$$ plain form
10476 425194 443250 465929 267701 204778 283901 363062 399104 364751 332178 323365 241856
10465 241856 191499 227977 291958 259226 305553 367796 402014 496534 537895 513817 520124 486271
10453 486271 455920 489663 428267 309598 260078 214677 202963 240474 185116 132519 77042
10442 77042 4945 23169 122684 224362 248157 313899 363519 396239 361818 339878 400572
10431 400572 426352 384669 434319 433103 356107 186227 67030 192463 389311 505136 474041
10420 474041 466007 429408 350182 298044 269153 186434 213178 173523 118037 69938 162388 196235
10408 196235 249028 298607 294489 319135 352828 340114 327479 366427 406149 361555 338339 232676
10396 232676 296418 333491 428185 444354 392152 337878 196636 242923 308175 368503 309327
$$ packed form
10476D25194J8056K2679j98228o2923P9123P9161L6042l4353l2573q813q1509
10465B41856n0357L6478O3981l2732M6327O2243L4218R4520M1361k4078O307l3853
10453D86271l0351L3743o1396j18669m9520m5401j1714L7511n5358n2597n5477
10442G7042p2097J8224R9515J01678K3795O5742M9620L2720l4421k1940O0694
10431D00572K5780m1683M9650j216p6996j69880j19197J25433J96848J15825l1095
10420D74041q034l6599p9226n2138k8891q2719K6744l9655n5486m8099R2450L3847
10408A96235N2793M9579m118K4646L3693j2714j2635L8948L9722m4594k3216j05663
10396B32676O3742L7073R4694J6169n2202n4274j41242M6287O5252O0328n9176
$$ plain form
10385 309327 262162 215421 150017 107292 -6744 34660 100413 220849 284209 280137 292272
10374 292272 243549 240727 234094 126284 56283 180936 167173 119547 218349 263345 306332
10363 306332 299761 229449 295293 329732 278339 221923 234946 310778 267004 246488 271211 271259
10351 271259 177856 117902 138209 92171 136779 58751 56458 38610 84768 114518 241008
10340 241008 314916 233287 173053 292835 375671 454064 476620 275066 152538 198964 202358
10329 202358 320702 473540 519160 437284 387599 239594 179035 196685 271420 381351 285997
10318 285997 127928 90924 53513 247915 355037 333345 332261 247321 173154 269257 281987
10307 281987 302906 285300 257931 279570 342981 152245 20921 56991 131734 143313 107470
$$ packed form
10385C09327m7165m6741o5404m2725j14036M1404O5753J20436O3360m072J2135
10374B92272m8723k822o633j07810p0001J24653j3763m7626R8802M4996M2987
10363C06332o571p0312O5844L4439n1393n6416J3023P5832m3774k0516K4723M8
10351B71259r3403n9954K0307m6038M4608p8028k293j7848M6158K9750J26490
10340B41008P3908q1629o0234J19782Q2836P8393K2556k01554j22528M6426L394
10329B02358J18344J52838M5620q1876m9685j48005o0559J7650P4735J09931r5354
10318B85997j58069l7004l7411J94402J07122k1692j084q4940p4167R6103J2730
10307B81987K0919j7606k7369K1639O3411j90736j31324L6070P4743J1579l5843
$$ plain form
10296 107470 8242 -78586 -58313 -105503 -14808 113749 124496 29446 -129049 -137542 -10047
10285 -10047 39616 -14203 -97020 -45835 -80967 -39987 28786 25520 -33399 34413 215444 120524
10273 120524 107485 86330 63301 61860 129219 122134 152677 112771 56569 -170115 -118454 50379
10261 50379 201758 162128 75942 193630 285865 342555 363139 318601 271311 283258 256335
10250 256335 214000 107214 101858 122584 95335 27360 65324 192360 262120 170968 189261
10239 189261 135531 157572 332675 385711 321166 191489 112481 181460 224731 185924 79772
10228 79772 3516 -76635 -15856 -58138 -79149 -25655 7919 -17873 70832 153451 227675 211754
10216 211754 211878 215573 178506 201004 219305 317340 353896 343795 234162 150564 217154 176292
$$ packed form
10296A07470r9228q6828K0273m7190R0695J28557J0747r5050j58495q493J27495
10285a0047M9663n3819q2817N1185l5132M0980O8773l266n8919O7812J81031r4920
10273A20524j3039k1155k3029j441O7359p085L0543l9906n6202k26684N1661J68833
10261E0379J51379l9630q6186J17688R2235N6690K0584m4538m7290J1947k6923
10250B56335m2335j06786n356K0726k7249o7975L7964J27036O9760r1152J8293
10239A89261n3730K2041J75103N3036o4545j29677p9008O8979M3271l8807j06152
10228G9772p6256q0151O0779m2282k1011N3494L3574k5792Q8705Q2619P4224j5921
10216B11754J24L695l7067K2498J8301R8035L6556j0101j09633q3598O6590m0862
$$ plain form
10204 176292 15879 -36956 1234 51144 120854 135315 138891 200848 104270 52538 128417
10193 128417 119753 40377 32091 13340 43985 34908 132959 179113 122282 180968 298209 305845
10181 305845 262299 292990 154873 55010 -27480 -66291 -59522 78657 99851 79140 96773
10170 96773 147067 187623 249898 133678 32733 8362 40131 82036 14278 78997 212851
10159 212851 279485 259773 299861 251115 197620 235668 312359 427231 417623 388881 360945
10148 360945 235119 56895 37536 79113 176035 177566 94773 -16239 -19309 -57887 -119334
10137 -119334 -169352 -50401 75694 108022 83032 157486 226699 237052 284568 207966 187515
10126 187515 260244 232243 202113 47487 -59333 7637 132917 131373 17872 -63039 26615
$$ packed form
10204A76292j60413n2835L8190M9910O9710J4461L576O1957r6578n1732P5879
10193A28417q664p9376q286j8751L0645r077R8051M6154n6831N8686J17241P636
10181C05845m3546L0691j38117r9863q2490l8811O769J38179K1194k0711J7633
10170I6773N0294M0556O2275j16220j00945k4371L1769M1905o7758O4719J33854
10159B12851O6634j9712M0088m8746n3495L8048P6691J14872r608k8742k7936
10148C60945j25826j78224j9359M1577R6922J531q2793j11012l070l8578o1447
10137a19334n0018J18951J26095L2328k4990P4454O9213J0353M7516p6602k0451
10126A87515P2729k8001l0130j54626j06820O6970J25280j544j13501q0911Q9654
$$ plain form
10115 26615 91008 143959 86696 51134 20874 43479 146222 133123 113972 113711 125366 181976
10103 181976 119840 107243 -46748 -146209 -16027 245 103598 72870 -13774 10588 36599
10092 36599 -28506 8067 87846 112236 3578 64290 164889 154213 186759 138534 66698
10081 66698 19607 93361 139831 265026 284453 187717 114892 78543 56423 13828 7669 37586
10069 37586 -48130 -118462 46388 104891 158047 109991 68784 99973 74138 114898 130586
10058 130586 151634 110608 199735 214522 159558 96643 54062 41642 59794 111240 165036
10047 165036 219558 202033 180370 174840 227573 167584 103214 130957 241679 268145 75655
10036 75655 -15602 45787 -12920 -76866 -120762 -92572 -67097 26588 49541 30118 -19626 9661
$$ packed form
10115B6615O4393N2951n7263l5562l0260K2605J02743j3099j9151k61J1655N6610
10103A81976o2136j2597j53991r9461J30182J6272J03353l0728q6644K4362K6011
10092C6599o5105L6573P9779K4390j08658O0712J00599j0676L2546m8225p1836
10081F6698m7091P3754M6470J25195J9427r6736p2825l6349k2120m2595o159K9917
10069C7586q5716p0332J64850N8503N3156m8056m1207L1189k5835M0760J5688
10058A30586K1048m1026Q9127J4787n4964o2915m2581j2420J8152N1446N3796
10047A65036N4522j7525k1663n530N2733n9989o4370K7743J10722K6466j92490
10036G5655r1257O1389n8707o3946m3896K8190K5475R3685K2953j9423m9744K9287
$$ plain form
10024 9661 83775 118107 15233 -120325 -185387 -84999 110430 186610 265093 309894 206823
10013 206823 85852 49758 186474 162125 28646 61329 96237 73853 83751 -15330 -37786
10002 -37786 -50783 -8409 19251 -61531 -166233 -102088 22949 85215 105850 93178 27049
9991 27049 -11534 -530 49926 117513 103538 58518 17188 23598 -78717 -76601 70841 113543
9979 113543 179281 258257 167162 161416 190952 158588 53571 20663 74912 84005 95263 183368
9967 183368 147778 97399 117561 143585 170370 102760 59391 28119 39191 102276 255433
9956 255433 269374 136803 106373 43324 51329 151139 48238 17013 210275 253220 266147
9945 266147 206130 101029 151362 136333 127967 140378 95641 78517 98105 39435 -50091 -75048
$$ packed form
10024I661P4114L4332j02874j35558o5062J00388J95429P6180P8483M4801j03071
10013B06823j20971l6094J36716k4349j33479L2683L4908k2384R898r9081k2456
10002c7786j2997M2374K7660q0782j04702O4145J25037O2266K0635j2672o6129
9991B7049l8583J1004N0456O7587j3975m5020m1330O410j02315K116J47442M2702
9979A13543O5738P8976r1095n746K9536l2364j05017l2908N4249R093J1258Q8105
9967A83368l5590n0379K0162K6024K6785o7610m3369l1272J1072O3085J53157
9956B55433J3941j32571l0430o3049Q005R9810j02901l1225J93262M2945J2927
9945B66147o0017j05101N0333j5029q366J2411m4737j7124J9588n8670q9526k4957
$$ plain form
9933 -75048 17991 157507 69214 20183 108370 181207 155744 4574 10800 68764 93202 163296
9921 163296 218643 166933 158268 250789 240616 187457 129881 19225 50472 167198 174082 105750
9909 105750 1284 -47950 -75085 -142704 -110761 -46347 49416 170792 203050 173304 80263
9898 80263 -4588 7068 14988 177107 325364 311288 227327 115155 177570 220415 262709
9887 262709 221620 187463 112130 122815 132684 140849 212893 126640 36941 109015 141254 99373
9875 99373 143608 207209 164893 132412 82130 131419 152262 249493 268615 270583 287654 130650
9863 130650 190277 266039 248503 205364 345414 418046 469329 610741 758671 672545 840248
9852 840248 1213630 1713916 2203838 2699560 3075259 3383007 3528194 3668691 3660532 3343145
$$ packed form
9933g5048R3039J39516q8293m9031Q8187P2837k5463j51170O226N7964K4438P0094
9921A63296N5347n1710q665R2521j0173n3159n7576j10656L1247J16726O884o8332
9909A05750j04466m9234k7135o7619L1943O4414R5763J21376L2258k9746r3041
9898H0263q4851J1656P920J62119J48257j4076q3961j12172O2415M2845M2294
9887B62709m1089l4157p5333J0685R869Q165P2044q6253q9699P2074L2239m1881
9875I9373M4235O3601m2316l2481n0282M9289K0843R7231J9122J968J7071j57004
9863A30650N9627P5762j7536m3139J40050P2632N1283J41412J47930q6126J67703
9852H40248L73382N00286M89922M95722L75699L07748J45187J40497q159l17387
$$ plain form
9842 3343145 2640578 1834703 1235134 987903 885838 733937 481915 364101 286470 317461
9832 317461 456372 506158 327288 241629 257541 430406 425623 326130 229654 184093 219430
9821 219430 226097 223847 267470 209248 89697 152525 305566 352654 446472 468363 333947
9810 333947 340388 319583 247257 186622 166284 239936 138653 46862 146575 152502 102207 101725
9798 101725 139552 109796 152873 259481 242540 315970 212577 173154 85988 -44244 -9611
9787 -9611 137928 142626 19813 -6315 -43023 -42082 -112046 -97063 -157563 -123374 21197 142591
9775 142591 178670 89663 38729 149376 112043 -28409 -112190 -52290 -1279 84466 99171
9764 99171 72820 -1714 -57042 65192 134329 92853 108055 146554 110643 113005 119782 4133
$$ packed form
9842C343145p02567q05875n99569k47231j02065j51901k52022j17814p7631L0991
9832C17461J38911M9786j78870q5659J5912J72865m783r9493r6476m5561L5337
9821B19430O667k250M3623n8222j19551O2828J53041M7088R3818K1891j34416
9810C33947O441k0805p2326o0635k0338P3652j01283r1791R9713N927n0295m82
9798A01725L7827k9756M3077J06608j6941P3430j03393l9423q7166j30232L4633
9787i611J47539M698j22813k6128l6708R41o9964J4983o0500L4189J44571J21394
9775A42591L6079q9007n0934J10647l7333j40452q3781N9900N1011Q5745J4705
9764I9171k6351p4534n5328J22234O9137m1476J5202L8499l5911K362O777j15649
$$ plain form
9752 4133 35662 -28962 -78054 30285 -33593 -32195 22602 74210 218887 190906 24824 -29406
9740 -29406 47432 242812 277869 145522 -1918 37174 56782 68630 154380 197600 163898
9729 163898 226856 256727 283196 253586 176531 135311 27562 -46549 1232 -7310 77651 1083
9717 1083 -11395 52315 62930 51651 63108 -20775 -18085 141697 266913 192594 147920 110350
9705 110350 74608 71382 27610 34926 99728 278744 277550 285457 280906 334354 228776 -13087
9693 -13087 -72845 -12506 -70880 -71920 -8243 50924 1419 -55279 -133137 -69335 -62582 8794
9681 8794 74780 137624 185832 261891 331091 153747 58828 77823 95023 133765 76636 90257
9669 90257 83957 44760 60599 46223 53825 145991 156771 183965 271340 182584 39219 87348
$$ packed form
9752D133L1529o4624m9092J08339o3878J398N4797N1608J44677k7981j66082n4230
9740b9406P6838J95380L5057j32347j47440L9092J9608J1848Q5750M3220l3702
9729A63898O2958K9871K6469k9610p7055m1220j07749p4111M7781q542Q4961p6568
9717A083j2478O3710J0615j1279J1457q3883K690J59782J25216p4319m4674l7570
9705A10350l5742l226m3772P316O4802J79016j194P907m551N3448j05578k41863
9693a3087n9758O0339n8374j040O3677N9167m9505n6698p7858O3802O753P1376
9681H794O5986O2844M8208P6059O9200j77344r4919J8995J7200L8742n7129J3621
9669I0257o300l9197J5839j4376P602R2166J0780K7194Q7375q8756j43365M8129
$$ plain form
9657 87348 149394 259540 275166 206774 212494 94673 -57925 -40518 21389 123604 91746
9646 91746 119866 168971 129244 72754 -9766 -18114 94092 208639 316765 271947 176198
9635 176198 145381 151499 212309 15369 -37782 -27164 -37646 45766 38919 -182 -9742 81713
9623 81713 231021 377064 352805 281982 295171 341162 350227 320662 224256 269447 287728 143966
9611 143966 -70620 -15660 92298 264108 276646 284183 181502 113806 109216 -2491 16512
9600 16512 19734 18012 89441 178354 152441 179794 98930 114679 139313 80604 95123 186357
9588 186357 278267 252086 299549 283207 180611 92925 3602 -4278 97564 144133 226547
9577 226547 193968 -5190 -57148 -32465 48353 78843 23582 53524 -82765 -85440 53420
$$ packed form
9657H7348O2046J10146J5626o8392N720j17821j52598J7407O1907J02215l1858
9646I1746K8120M9105l9727n6490q2520q348J12206J14547J08126m4818r5749
9635A76198l0817O118O0810j96940n3151J0618j0482Q3412o847l9101r560R1455
9623H1713J49308J46043k4259p0823J3189M5991R065k9565r6406M5191J8281j43762
9611A43966k14586N4960J07958J71810J2538P537j02681o7696m590j11707J9003
9600A6512L222j722P1429Q8913k5913K7353q0864J5749K4634n8709J4519R1234
9588A86357R1910k6181M7463j6342j02596q7686q9323p880J01842M6569Q2414
9577B26547l2579j99158n1958K4683Q0818L0490n5261K9942j36289k675J38860
$$ plain form
9566 53420 141089 157682 113236 27673 153396 177168 147462 94490 185543 235303 164114 167500
9554 167500 177013 111006 94240 103703 235348 300992 247707 217820 153104 26236 -93380
9543 -93380 -34306 3536 -102209 -85870 15192 53611 61442 108719 205626 249202 70486
9532 70486 -41824 10531 57995 -7023 9797 96495 142032 234066 257001 223656 164997 246250
9520 246250 208596 55987 3295 -14785 -122679 -13129 10325 88692 49794 17850 83916
9509 83916 76814 13016 15743 13055 200430 293467 247598 270668 198630 79811 138270 183787
9497 183787 195561 233926 192623 135517 211907 261586 182304 79256 45086 -53180 -38506
9486 -38506 74471 243199 318516 330087 292347 219724 280177 314511 238355 219521 197592
$$ packed form
9566E3420Q7669J6593m4446q5563J25723K3772k9706n2972R1053M9760p1189L386
9554A67500R513o6007j6766R463J31645O5644n3285k9887o4716j26868j19616
9543i3380N9074L7842j05745J6339J01062L8419P831M7277R6907M3576j78716
9532G0486j12310N2355M7464o5018J6820Q6698M5537R2034K2935l3345n8659Q1253
9520B46250l7654j52609n2692j8080j07894J09550K3454P8367l8898l1944O6066
9509H3916p102o3798K727k688J87375R3037m5869K3070p2038j18819N8459M5517
9497A83787J1774L8365m1303n7106P6390M9679p9282j03048l4170r8266J4674
9486c8506J12977J68728P5317J1571l7740p2623O0453L4334p6156j8834k1929
$$ plain form
9475 197592 100442 77905 108731 146467 214296 197605 213454 280303 242390 223135 271483 292629
9463 292629 199697 81901 50790 137153 205754 269252 154914 -12827 53257 142234 151872
9452 151872 97019 85799 120131 190333 154289 131464 165201 125537 192949 294017 179159
9441 179159 51607 40303 37505 105190 157724 247804 423072 405731 480165 402090 360364
$$ packed form
9475A97592r7150k2537L0826L7736O7829j6691J5849O6849l7913j9255M8348K1146
9463B92629r2932j17796l1111Q6363O8601O3498j14338j67741O6084Q8977R638
9452A51872n4853j1220L4332P0202l6044k2825L3737l9664O7412J01068j14858
9441A79159j27552j1304k798O7685N2534R0080J75268j7341P4434p8075m1726
$$ [...]
##END NTUPLES=NMR SPECTRUM
##END=
