##TITLE=317116
cc 23616
438/86
adrs
anton
##JCAMPDX= 6.0         $$ Bruker NMR JCAMP-DX V2.0
##DATA TYPE= NMR SPECTRUM
##DATA CLASS= NTUPLES
##ORIGIN= Bruker BioSpin GmbH
##OWNER= nmr
$$ XWIN-NMR		Version 3.5
$$ Wed Jul 12 09:05:00 2006 GMT Daylight Time (UT+1h)  MAYBRIDGE\nmr@NMR_250MHZ
##.OBSERVE FREQUENCY= 250.131544655141
##.OBSERVE NUCLEUS= ^1H
##.ACQUISITION MODE= SIMULTANEOUS (DQD)
##.ACQUISITION SCHEME= undefined
##.AVERAGES= 1
##.DIGITISER RES= 18
##SPECTROMETER/DATA SYSTEM= dpx250
##.PULSE SEQUENCE= zg30
##.SOLVENT NAME= CDCl3
##.SHIFT REFERENCE= (INTERNAL, CDCl3, 0, 16.522)
##AUDIT TRAIL= $$ (NUMBER, WHEN, WHO, WHERE, WHAT)
$$ ##TITLE= Audit trail, XWIN-NMR		Version 3.5
$$ ##JCAMPDX= 5.01
$$ ##ORIGIN= Bruker BioSpin GmbH
$$ ##OWNER= nmr
$$ C:/u/data/dgb/nmr/ADRS/15771/pdata/1/auditp.txt
$$ ##AUDIT TRAIL=  $$ (NUMBER, WHEN, WHO, WHERE, WHAT)
(   1,<2006-02-08 15:15:20.26 +000>,<MAYBRIDGE\nmr>,<NMR_250MHZ>,
      <created by zg, POWCHK disabled, PULCHK disabled
       terminated by command 'halt'
       configuration hash MD5:
       84 BC 41 DB A1 6E 1D 46 DA 25 12 A5 C1 ED C5 3A
       data hash MD5: 64K
       07 BB BC FA B2 DC 60 87 6E 87 C4 82 CE D1 4B B0>)
(   2,<2006-02-08 15:15:28.37 +000>,<MAYBRIDGE\nmr>,<NMR_250MHZ>,
      <Start of raw data processing
       ef LB = 0.3 FT_mod = 6 PKNL = 1 SI = 32K 
       data hash MD5: 32K
       D6 E8 64 5E 27 EF 67 AE B4 68 89 19 1B 1B D2 06>)
(   3,<2006-02-08 15:15:30.23 +000>,<MAYBRIDGE\nmr>,<NMR_250MHZ>,
      <apk 
       data hash MD5: 32K
       2B B0 88 F5 F4 DD B2 C2 BA 6C 6B 06 F7 D1 DE FC>)
(   4,<2006-02-08 15:15:31.09 +000>,<MAYBRIDGE\nmr>,<NMR_250MHZ>,
      <abs ABSG = 5 
       data hash MD5: 32K
       6B 45 FE 6A 3C 5C 4E D9 9D B2 97 80 9A CC 4D 33>)
$$ ##END=
$$ 
$$ hash MD5
$$ 2F 2F F4 DA E1 67 BC EE CD 42 82 32 50 77 D8 6E
##$RELAX= 
##$RELAX= 
##$RELAX= 
##$RELAX= 
##$RELAX= 
##$RELAX= 
##$RELAX= 
$$ Bruker specific parameters
$$ --------------------------
##$DU= <C:\Restored>
##$EXPNO= 15771
##$NAME= <ADRS>
##$PROCNO= 1
##$TYPE= <nmr>
##$USER= <dgb>
##$AMP= (0..31)
100 100 100 100 100 100 100 100 100 100 100 100 100 100 100 100 100 100 
100 100 100 100 100 100 100 100 100 100 100 100 100 100 
##$AQSEQ= 0
##$AQ_mod= 3
##$AUNM= <au_zg>
##$AUTOPOS= <9 >
##$BF1= 250.13
##$BF2= 250.13
##$BF3= 250.13
##$BF4= 250.13
##$BF5= 500.13
##$BF6= 500.13
##$BF7= 500.13
##$BF8= 500.13
##$BYTORDA= 1
##$CFDGTYP= 0
##$CFRGTYP= 5
##$CHEMSTR= <none>
##$CNST= (0..31)
1 1 145 1 1 1 1 1 1 1 1 1 1 1 1 1 1 1 1 1 1 1 1 1 1 1 1 1 1 1 1 1 
##$CPDPRG= <>
##$CPDPRG1= <>
##$CPDPRG2= <>
##$CPDPRG3= <>
##$CPDPRG4= <mlev>
##$CPDPRG5= <mlev>
##$CPDPRG6= <mlev>
##$CPDPRG7= <mlev>
##$CPDPRG8= <mlev>
##$CPDPRGB= <>
##$CPDPRGT= <>
##$D= (0..31)
0 1 0 0 0 0 0 0 0 0.06 0 0 0 0 0 0 0.0002 0 0 0 0 0 0 0 0 0 0 0 0 0 0 
0 
##$DATE= 1139411718
##$DBL= (0..7)
120 120 120 120 120 120 120 120 
##$DBP= (0..7)
150 150 150 150 150 150 150 150 
##$DBP07= 0
##$DBPNAM0= <>
##$DBPNAM1= <>
##$DBPNAM2= <>
##$DBPNAM3= <>
$$ [...]
##$SUBNAM7= <"">
##$SUBNAM8= <"">
##$SUBNAM9= <"">
##$SW= 20.6930455092707
##$SWIBOX= (0..15)
0 0 3 0 0 0 0 0 0 0 0 0 0 0 0 0 
##$SW_h= 5175.983436853
##$TD= 65536
##$TD0= 1
##$TE= 294.16
##$TE2= 300
##$TE3= 300
##$TEG= 300
##$TL= (0..7)
0 120 120 120 120 120 120 120 
##$TP= (0..7)
150 150 150 150 150 150 150 150 
##$TP07= 0
##$TPNAME0= <>
##$TPNAME1= <>
##$TPNAME2= <>
##$TPNAME3= <>
##$TPNAME4= <>
##$TPNAME5= <>
##$TPNAME6= <>
##$TPNAME7= <>
##$TPOAL= (0..7)
0.5 0.5 0.5 0.5 0.5 0.5 0.5 0.5 
##$TPOFFS= (0..7)
0 0 0 0 0 0 0 0 
##$TUNHIN= 0
##$TUNHOUT= 0
##$TUNXOUT= 0
##$USERA1= <user>
##$USERA2= <user>
##$USERA3= <user>
##$USERA4= <user>
##$USERA5= <user>
##$V9= 5
##$VALIST= <valist>
##$VCLIST= <CCCCCCCCCCCCCCC>
##$VD= 0
##$VDLIST= <DDDDDDDDDDDDDDD>
##$VPLIST= <PPPPPPPPPPPPPPP>
##$VTLIST= <TTTTTTTTTTTTTTT>
##$WBST= 1024
##$WBSW= 4
##$XGAIN= (0..3)
0 0 0 0 
##$XL= 0
##$YL= 0
##$YMAX_a= 25945
##$YMIN_a= -26931
##$ZGOPTNS= <>
##$ZL1= 120
##$ZL2= 120
##$ZL3= 120
##$ZL4= 120
##$ABSF1= 16.522
##$ABSF2= -4.171173
##$ABSG= 5
##$ABSL= 3
##$ALPHA= 0
##$AQORDER= 0
##$ASSFAC= 0
##$ASSFACI= 0
##$ASSFACX= 0
##$ASSWID= 0
##$AUNMP= <proc_1d>
##$AZFE= 0.1
##$AZFW= 0.1
##$BCFW= 0
##$BC_mod= 0
##$BYTORDP= 0
##$COROFFS= 0
##$CY= 12.5
##$DATMOD= 1
##$DC= 0
##$DFILT= <>
##$DTYPP= 0
##$F1P= 14.0000005364418
##$F2P= -0.99999901652339
##$FCOR= 0.5
##$FTSIZE= 32768
##$FT_mod= 6
##$GAMMA= 0
##$GB= 0
##$INTBC= 1
##$INTSCL= 1
##$ISEN= 128
##$LB= 0.3
##$LEV0= 0
##$LPBIN= 0
##$MAXI= 10000
##$MC2= 0
##$MEAN= 0
##$ME_mod= 0
##$MI= 0
##$NCOEF= 0
##$NC_proc= -6
##$NLEV= 6
##$NOISF1= 0
##$NOISF2= 0
##$NSP= 0
##$NTH_PI= 0
##$NZP= 0
##$OFFSET= 16.522
##$PC= 1
##$PHC0= 97.63738
##$PHC1= 6.630319
##$PH_mod= 1
##$PKNL= yes
##$PPARMOD= 0
##$PSCAL= 4
##$PSIGN= 0
##$REVERSE= no
##$SF= 250.13
##$SI= 32768
##$SIGF1= 0
##$SIGF2= 0
##$SINO= 400
##$SIOLD= 32768
##$SREGLST= <1H.CDCl3>
##$SSB= 0
##$STSI= 32768
##$STSR= 0
##$SW_p= 5175.98343685301
##$SYMM= 0
##$S_DEV= 0
##$TDeff= 65536
##$TDoff= 0
##$TI= <Analysis number 999999
Compound Code 99
Book Reference 9
Project Code 9>
##$TILT= no
##$TM1= 0
##$TM2= 0
##$TOPLEV= 0
##$USERP1= <user>
##$USERP2= <user>
##$USERP3= <user>
##$USERP4= <user>
##$USERP5= <user>
##$WDW= 1
##$XDIM= 32768
##$YMAX_p= 293541374
##$YMIN_p= -1036617
$$ End of Bruker specific parameters
$$ ---------------------------------
##NTUPLES= NMR SPECTRUM
##VAR_NAME=  FREQUENCY,     SPECTRUM/REAL,   SPECTRUM/IMAG
##SYMBOL=    X,             R,               I
##VAR_TYPE=  INDEPENDENT,   DEPENDENT,       DEPENDENT
##VAR_FORM=  AFFN,          ASDF,            ASDF
##VAR_DIM=   32768,         32768,           32768
##UNITS=     HZ,            ARBITRARY UNITS, ARBITRARY UNITS
##FACTOR=    0.157963299565203, 1,           1
##FIRST=     4132.6476996994, 0,             0
##LAST=      -1043.33573715361, 0,           0
##MIN=       -1043.33573715361, -1036617,    0
##MAX=       4132.6476996994, 293541374,     0
$$ Real data points
##PAGE= N=1
##DATA TABLE= (X++(R..R)), XYDATA
$$ [...]
18647F150515k04997j68653j04242k6452r1359j01686r7955o8008j8439m6446
18637E222278k8440k0520J0929P7429J41849J77349J97391K16589K95658L91168
18627F681680M82115O31881P09115Q09623J016421J310092J669488K110085K606280
18618A8026780L077256L585308L980897M204540M242006M040690L682322L124828
18610D7964627K446703J591550O75789j90606j005696j740854k386271k831171
18602D4524071l097728l270500l297360l160879k941135k707285k458390k205921
18594B1384873j999613j780428j565845j400270j258107j170515j026461r11276
18586A0272358p85632p35131o65132n78293n04437m66001m52707l62406l25228
$$ y = [6150515, 5945518, 5776865, 5672623, 5646171, 5554812, 5453126, 5355171, 5287163, 5268724, 5222278, 5193838, 5173318, 5184247, 5261676, 5403525, 5580874, 5778265, 5994854, 6290512, 6681680, 7163795, 7795676, 8504791, 9314414, 10330835, 11640927, 13310415, 15420500, 18026780, 21104036, 24689344, 28670241, 32874781, 37116787, 41157477, 44839799, 47964627, 50411330, 52002880, 52678669, 52488063, 51482367, 49741513, 47355242, 44524071, 41426343, 38155843, 34858483, 31697604, 28756469, 26049184, 23590794, 21384873, 19385260, 17604832, 16038987, 14638717, 13380610, 12210095, 11183634, 10272358, 9486726, 8751595, 8086463, 7508170, 7003733, 6537732, 6085025, 5722619, 5397391]
18577E397391l47368l36217l00603k47458k45925k57516k16067k18431k00046
18568C027760k19483k04135j52128j55658j71222j50491j23480j47153j27129
18559A576881j17794j16175j00232q4563o5821m6628k0678o8963n7219m088K571
18548H97291K3175j7255j3029j334J2308o798o1340l0977q354l5206l8057l3091
18536F87333k0671k1367n2202m7286j8109m2661k8427l7891n3405m6517l7656
18525B81141m1230k4459J3240K6248j8083k5693l2660j6385k6372m99Q195N805
18513A49248k1406j9242r179K2171j5011k1217p842M990n200m968j6387m7366
18501H591J8166L559j2163o563j5130m3647q0781o5994l0550l6405k6437m642
$$ y = [5397391, 5050023, 4713806, 4413203, 4165745, 3919820, 3662304, 3446237, 3227806, 3027760, 2808277, 2604142, 2452014, 2296356, 2125134, 1974643, 1851163, 1704010, 1576881, 1459087, 1342912, 1242680, 1158117, 1092296, 1045668, 1024990, 956027, 898808, 894720, 897291, 920466, 903211, 890182, 888848, 901156, 894358, 833018, 802041, 793687, 758481, 720424, 687333, 666662, 645295, 593093, 545807, 527698, 485037, 456610, 418719, 365314, 318797, 281141, 239911, 215452, 228692, 254940, 236857, 211164, 178504, 162119, 135747, 135248, 143443, 149248, 127842, 108600, 99421, 121592, 106581, 85364, 77522, 82512, 77312, 72344, 55957, 8591, 26757, 30316, 18153, 11590, -3540, -47187, -127968, -193962, -224512, -260917, -287354, -291996]
18489b91996j7925P251K2150L4229J2172K9432N8948M6139K3093M1202K4017J6961
18477E673M8041K5150M1721K4857r152m1983O241J6201K117J6109Q729P643j3984
18464A37363k5291O538J2406l8612j8588o741n228j7383q252k888j4533J056K5453
18451D5300J0915J1836k0246j9810k1484j110n342K1855J6764J8454j7763M186
18439D3555K4428J4171j2177k8013k7247M508j8887r426l119K31p834K870j525
18426a8465k3112P689K1060p574q182N484r669j3969K1431L0473J8436J3517j996
18413C5123K580j741N08l688J3510K6249K7144J0611p012p95j346K0928K2174
18400A44245j8341l9119j0382j6520k7401k3795K0546J4037K3701M4521K062k3701
$$ y = [-291996, -309921, -302670, -280520, -246291, -234119, -204687, -145739, -99600, -76507, -35305, -11288, 5673, 53714, 78864, 120585, 145442, 136290, 94307, 100548, 116749, 118866, 134975, 143704, 151347, 137363, 112072, 118610, 131016, 92404, 73816, 67075, 61847, 44464, 36212, 33324, 18791, 19847, 45300, 56215, 68051, 47805, 27995, 6511, 5401, 59, 21914, 38678, 57132, 39369, 43555, 67983, 82154, 69977, 41964, 14717, 19225, 338, -9088, -12207, -11976, -19810, -16940, -18465, -41577, -33888, -12828, -20402, -28584, -23100, -32769, -46738, -25307, 5166, 23602, 37119, 35123, 37703, 35962, 36470, 32782, 46292, 72541, 99685, 110296, 103284, 102489, 101143, 122071, 144245, 125904, 86785, 76403, 59883, 32482, 8687, 29233, 43270, 66971, 111492, 113554, 89853]
18388H9853k2703J5339K6142Q647J1024L1929K9118q107l1287m0042j5084q261
18376H6568K3674J2218j9389n394k0474k5885n718K8747L2125J7200k1055j0403
18364I2214k2801k6912j0500J6402j787k3952L1537J0490k4349j0446J4742o832
18352C7806k5402l4528M2873M2348J014n3364j5472L551J1906J1961k8252J5705
18340A0146K6165n283J6261j4356j0969N0238K7356j6960k8247j6056j8487L285
18328B3093N826J0928j0618M8458L188j5975l0470K771L0082k0617j0149J6565
18316E3082o81R172K524q23O361q016j1026J4959o938P099J0403q049p48j6793
18302E0526k4108Q162N489k866j3509J229J2273J5546j2187N245j0963Q152q443
$$ y = [89853, 67150, 82489, 108631, 117278, 128302, 160231, 189349, 181242, 149955, 109913, 94829, 86568, 110242, 122460, 103071, 97677, 77203, 51318, 45600, 74347, 106472, 123672, 102617, 92214, 69413, 42501, 32001, 48403, 46616, 22664, 54201, 64691, 40342, 29896, 44638, 37806, 12404, -22124, 20749, 63097, 64111, 10747, -4725, -1174, 10732, 22693, -5559, 10146, 36311, 31028, 47289, 32933, 21964, 72202, 99558, 82598, 54351, 38295, 19808, 23093, 28919, 39847, 29229, 77687, 80875, 64900, 34430, 37201, 67283, 46666, 36517, 53082, 52401, 61573, 64097, 63274, 69635, 61619, 50593, 65552, 58614, 65713, 76116, 68067, 67319, 50526, 26418, 34580, 40069, 37203, 23694, 24923, 37196, 52742, 40555, 45800, 34837, 42989, 34546]
18289C4546k2136P198K5897N074M469j3721J6608K7714N62j7952K5509j2561j6176
18276F5031k3347j0651j2580P887J2271J081l1161k983N089K7563K2835k286j4498
18263D4251k2420p354M8742N5007o474k0716k1707k6480J6403K4098J463O843
18251I1656m765j7985J959p862r278j7992j4486L82m518j6961K6425J0937P256
18238D4768j5046P672Q138k6418k3970k4890L0873M0112L3826j7069j7880Q055
18226D8171o546J8246J3700j0421j3175k2467p460J9661K6732L898l166q239M459
18213F3393L418k3395n406n161Q549l488K005l5266k5745L454J9942M546j6684
18200i838J4778K4485m728L3702J185l5198j9137K3005K4963J7985L417q972n54
$$ y = [34546, 12410, 19608, 45505, 50579, 55048, 41327, 57935, 85649, 86211, 68259, 93768, 81207, 65031, 41684, 31033, 18453, 26340, 38611, 39692, 8531, 5548, 10637, 38200, 61035, 58749, 44251, 21831, 14477, 63219, 118226, 111752, 91036, 69329, 42849, 59252, 83350, 84813, 91656, 86891, 68906, 70865, 63003, 53725, 35733, 21247, 21629, 17111, 150, 26575, 37512, 44768, 29722, 37394, 45532, 19114, -4856, -29746, 1127, 41239, 75065, 57996, 40116, 48171, 41625, 59871, 73571, 63150, 49975, 27508, 20048, 39709, 66441, 70339, 67173, 58934, 63393, 66811, 43416, 38010, 32849, 41398, 37910, 39915, 4649, -21096, -17642, 2300, 6846, -9838, 4940, 29425, 24697, 58399, 59584, 24386, 5249, 28254, 53217, 71202, 74619, 65647, 65093]
18187F5093J188J0226j0640j1582k996J5629J76k5831k4097J867L561n209p752
18174I633j9170L640K8674J0338k8489j1438M335L0026R874K0268J1067k0230
18162D8528j4357j4117j1390K0687J8935Q583m865k5671j0071J7978K1709J9722
18150G5671k5035k6003J8378J3644J2958J412o461J4272P40p019l075L011o117
18137F6376m048j4544o476K372P023J3628L6798M1307j5860j8394j7211J2901
18125A03872L2595K1825n351O305K7316L1494N2080N6286K4335N533M2666N2367
18113D51323Q9008J46574K43440L90235O92418J417698K532201K270320R0495
18104H323712j017250j432158j316068q98725n63806l26703j87985o1791j64639
$$ y = [65093, 66281, 76507, 65867, 54285, 51289, 66918, 67094, 41263, 17166, 19033, 22594, 17385, 9633, -9537, -5897, 22777, 33115, 4626, -6812, -2477, 27549, 37423, 57691, 68758, 48528, 34171, 20054, 8664, 29351, 48286, 56869, 52004, 26333, 16262, 34240, 55949, 75671, 50636, 24633, 43011, 56655, 69613, 71025, 64564, 78836, 79576, 72557, 69482, 72493, 66376, 62328, 47784, 41308, 43680, 50703, 64331, 101129, 142436, 126576, 108182, 90971, 103872, 136467, 158292, 152941, 159246, 186562, 218056, 270136, 326422, 350757, 356290, 398956, 451323, 540331, 686905, 930345, 1320580, 2012998, 3430696, 5962897, 8233217, 8323712, 7306462, 5874304, 4558236, 3659511, 3095705, 2769002, 2581017, 2519226, 2354587]
18095B354587m32175l80291k27509j41946j31233q8821p3091p7986q1972r3497
18085F26066n2469m2656l9812m0240n1853l1762l9711j5669r607m8060m8825p562
18073A97840L3215k7323k4327O936J3600j6432k2021J6457K563j9449p936j0518
18061A42605j7273k2470K0290J2545K4943M8525L9509M1619L3855L327K6598K8714
18049C82787J3614L7332P991m0171o7395m1751m0778l0213l4688k3328k0756k5044
18037A17600k0905O895J571L7867K3347j0199k7579k0881n651R248j3419k5150
18025G2744l7948O310J3533J9238n269j4118J976O698n953J5338j6859j6103l328
18012C6259o351l5027M185N379n255K1188k832j8432K3447N9543O976j1304k7218
$$ y = [2354587, 1922412, 1542121, 1314612, 1172666, 1041433, 952612, 879521, 801535, 719563, 626066, 573597, 530941, 491129, 450889, 399036, 367274, 327563, 311894, 302287, 254227, 205402, 197840, 231055, 203732, 179405, 186341, 199941, 183509, 161488, 177945, 180508, 161059, 153123, 142605, 125332, 102862, 123152, 135697, 160640, 209165, 248674, 290293, 324148, 327475, 354073, 382787, 396401, 433733, 441724, 401553, 334158, 292407, 251629, 221416, 186728, 163400, 142644, 117600, 96695, 103590, 105161, 143028, 166375, 156176, 128597, 107716, 102065, 111313, 97894, 72744, 34796, 41106, 54639, 73877, 68608, 54490, 56466, 63164, 57211, 72549, 55690, 39587, 36259, 29908, -5119, -934, 4445, -810, 20378, 17546, -886, 22561, 82104, 89080, 77776, 50558]
17999E0558l5208l3873K3019M620J7857j881k6081J957K5306K8045J5299l248
17987F6370k6407p194N197k7817j4438p146O9q540k119K9945L5535J633l7944
17974G144J6354Q105j4315k3147Q469N441J4508J5997P895k7848K7621K8157K009
17961G6390j3816k0920j2683J7658J3080j3368j3868r153M596J4216J0170j2951
17949C9351K7048M3535J3138j5304J9255N8265L9722j9413K0806M7617L628j7323
17937B60325N392j2905J117j2991j7804J7345m772r705n5856l3710j7649K3257
17925A42044o002l2303j4058j1547l0304m2719n059L314j0476K5756J5094j6678
17913A7062j3179P313N364J3752j2393j0455K4802L3868K4145m947k5195k8151
$$ y = [50558, 15350, -18523, 4496, 9116, 26973, 25092, -989, 968, 26274, 54319, 69618, 66370, 39963, 32769, 37966, 10149, -4289, -11435, -11366, -19906, -22025, 7920, 43455, 45088, 7144, 23498, 31603, 17288, -5859, 2610, 8051, 22559, 38556, 46451, 18603, 46224, 74381, 76390, 62574, 41654, 28971, 46629, 59709, 46341, 32473, 23320, 27916, 42132, 52302, 39351, 66399, 109934, 123072, 107768, 127023, 185288, 225010, 205597, 226403, 274020, 277648, 260325, 265717, 252812, 253929, 240938, 223134, 240479, 235707, 226002, 170146, 136436, 118787, 142044, 136042, 103739, 89681, 78134, 47830, 5111, 52, 3366, -7110, 18646, 33740, 17062, 3883, 11196, 16560, 30312, 17919, 7464, 32266, 66134, 90279, 85332, 60137, 31986]
17901C1986j2801q63m721n762L5328P452q447k8634J3786K1171J3454q454j9718
17888C3777j3317r366j9213o236K2507n120Q3K1681K796k382L671j3594o725j7100
17874h538j3126j2456j7420n896j3438L3773K4304m3025j155K8263J1159q768
17862b6323J8229M692j6146J3978P506Q290m191j6401N968J5745N101r971J3970
17849B0447J430j2991j0805o160o833r600j523J6091k733N307P957n605j4878
17836a9896j3097K6865K4805j5689l0574J6085J1998O901j4244J6267K7766r641
17824B7546l1251j4349l888L2850j3329j0835k795J5853K2992k4728J3528R097
17812B0691j4946L782j001q157r181J7040j1829l0013j1543J0540L307m770N205
$$ y = [31986, 19185, 18322, 13601, 7839, 43167, 50619, 42172, 13538, 27324, 48495, 61949, 53495, 33777, 20460, 11094, -8119, -14355, 8152, 3032, 3115, 24796, 27592, 25210, 28881, 15287, 8562, -8538, -21664, -34120, -51540, -57436, -70874, -37101, -12797, -55822, -56977, -28714, -17555, -26323, -8094, -3402, -19548, -5570, 1936, 10226, 6035, -10366, -4398, 11347, 16448, 6477, 20447, 21877, 8886, -1919, -8079, -14912, -24512, -26035, -9944, -12677, -7370, 587, -5018, -19896, -32993, -6128, 18677, 2988, -27586, -11501, 497, 7398, -6846, 9421, 37187, 27546, -3705, -18054, -21942, 10908, -2421, -13256, -16051, -198, 22794, -1934, 11594, 20691, 5745, 9527, 8526, 369, -8812, 8228, -3601, -33614, -45157, -34617, -31310, -36080, -30875]
17799c0875K8723R089L236q172Q939k2085J1471K1245j3450j4441M221n66J2561
17786I896m147k053j2257n498J1745J8340j2483j0395O573N666n4899k7244M681
17773g2075K000K4645P041j3377p439r031J913M4588N260o860k155j214l0364
17760e7068J8126K4176N936J2984K918K8245K7088n1529l3360j7829M652J8613
17748a7048K6694m615N340J0083n160J9527K7430p958k2480K027j8765l857j5409
17735d191K8955m073j8381k824r464K7633r131k8592R048P807J9330O714l698
17722A9133j2186J494K3213j1413k354Q511K274P817k248j341O852K042J3914
17709E5708k0319l168K8275O300j8101l628r336o405K3830r776m1716k7026J5080
$$ y = [-30875, -2152, 6937, 10173, 2001, 10940, -11145, 326, 21571, 8121, -6320, -2099, -2665, 9896, 5749, 3696, -8561, -14059, -2314, 16026, 3543, -6852, -279, 5387, -49512, -76756, -72075, -70075, -45430, -38389, -51766, -59205, -68236, -66323, -21735, -16475, -23335, -25490, -26704, -57068, -38942, -14766, -8830, 4154, 7072, 35317, 62405, 10876, -22484, -40313, -35661, -17048, 9646, 5031, 10371, 20454, 15294, 34821, 62251, 54293, 31813, 33840, 15075, 11218, -4191, 24764, 20691, 2310, -514, -9978, 17655, 8524, -20068, -11020, -3213, 16117, 22831, 19133, 6947, 8441, 31654, 20241, 17887, 26398, 28672, 36489, 34241, 32900, 39752, 41794, 55708, 35389, 32221, 60496, 66796, 48695, 45067, 35731, 29326, 53156, 43380, 1664, -25362, -10282]
17696a0282M965q433j1658k550l12K6688N327r619K758J7509j514m560J3864k57
17682B1926j2505l1993p935l650J19O52K1166K1668K361L075J2971M65k9009j4016
17668a4705K3433J5606L787j367k1957M0458n359l4523j9460m58K643J0118J7885
17655A6101M45r877K5258Q751n2177k7676K5726L8450R602j1780N559k0192j6891
17642h701L4005J1925M995j3337j0545j3512J466J6317o606k5045j0924P512L0917
17629A8467J2586J605K2561k6663k6767O430r685l942q176Q407L398k4627p825
17616c4231L9990M19j6604N808k13j1621m995j5955K144n249j3005K1107J4409
17603a7996j5132J904K4774L2801l1613j998R829j006J458p451K3013K3076k6617
$$ y = [-10282, -5317, -13750, -25408, -27958, -28270, -1582, 3745, -5874, -3116, 14393, 12879, 8319, 22183, 21926, 9421, -22572, -30507, -34157, -34038, -33386, -12220, 9448, 11809, 14884, 27855, 28320, -689, -14705, 8728, 24334, 28121, 26754, 4797, 45255, 39896, 5373, -14087, -14545, -11902, -1784, 16101, 16546, 6669, 31927, 40678, -11499, -39175, -13449, 25001, 34603, 22823, 28382, 8190, -8701, 25304, 37229, 42224, 28887, 18342, 4830, 6296, 22613, 16007, -9038, -19962, -12450, 18467, 31053, 32658, 55219, 28556, 1789, 8219, -1466, -5408, -13584, -5177, -1779, -26406, -34231, 5759, 6178, -10426, -4618, -4831, -16452, -21447, -37402, -35258, -40507, -53512, -32405, -17996, -33128, -31224, -6450, 26351, -5262, -7260, 2569, 1563, 3021, -4430, 18583, 41659, 15042]
17590A5042k578J2089P012j8084N958n461k6859O293n455j7288K3101q90j6057
17577b3177K3996Q643O447l5730m879M10J944O93J5572Q051j0623J9969n609j8747
17563a3040r547r699j4230M891L2919K3586n19n764K6267k8710l660J2102j2846
17550A750J7115L152j1686N209Q179j59j5194p551r58j2044j0435N389J9890j1514
17536h857l4525L2656L0825J1984l4358j2982L731n895k985n929R954J8475K4405
17523B6499m048j3214r767n0k8217l5225J3754K9501J2096L1250N535l2691n580
17510a0157j298K3528N701k9490o665J5390K0772k17J4615L27l1079j1335J2978
17497C070K421j0218J128K480j7845J5114J7571P360r51j9151p336J0275M83j1545
$$ y = [15042, 12464, 24553, 31565, 13481, 19439, 13978, -12881, -6588, -12043, -29331, -6230, -7120, -23177, 819, 9462, 15909, -19821, -24700, -24290, -22346, -21653, -6081, 1970, -8653, 11316, 5707, -13040, -22587, -32286, -46516, -41625, -8706, 14880, 14361, 8597, 34864, 6154, 2494, 14596, 1750, 18865, 22017, 10331, 15540, 23719, 23560, 8366, 815, -143, -12187, -22622, -17233, 2657, -8857, -43382, -10726, 20099, 32083, -2275, -15257, -11526, -17421, -20406, -26335, -16381, 2094, 26499, 22451, 9237, -530, -580, -28797, -64022, -50268, -20767, -8671, 22579, 28114, -4577, -10157, -11455, 12073, 17774, -11716, -18381, -2991, 17781, 17564, 32179, 32506, 1427, -9908, 3070, 5491, -4727, -3599, -1119, -18964, -3850, 13721, 21081, 20130, 979, -6357, 3918, 4401, -7144]
17483g144k0569k3455R979m12K0534K6768K321J85k33k101r320j6621M649J4736
17469f83j781J1650j471P539K0691O589j278o621K4k2226j434J5795k0017k9361
17455b2584J0871K7139J422j2723j7921J5093J5530K164N0730n384l0268m189
17443B9880j0453o837J3153J9497N076r142r60N385q611J0126k7907l2885L847
17430i831K0134J3140L051O325j44r003j3816j984j8113O293K2329K05j1949r752
17416c115m899J5674o6J730N902p970K5822J9435j8385k2738J2069r502q139M012
17402I830j0750o480K230K5215N261j4462j2478j0241J1447p594N695K86O886
17389D845J8986k0854k7413J0170M2583J3181r376j1720j8228j4006N525J5090
$$ y = [-7144, -27713, -51168, -41189, -41601, -21067, 5701, 8022, 8207, 7974, 5873, -3447, -20068, -15419, -683, -2464, 9186, 7715, 15254, 35945, 42534, 41256, 34635, 34659, 12433, 10999, 26794, 6777, -22584, -11713, 15426, 16848, 4125, -13796, 1297, 16827, 18991, 69721, 64337, 34069, 29880, 19427, 12590, 25743, 45240, 50316, 41174, 40214, 45599, 36988, 47114, 19207, -13678, -9831, 10303, 23443, 26494, 32819, 32675, 23672, 9856, 7872, -10241, -3948, 18381, 18586, 6637, -3115, -8014, 7660, 7594, 9324, 15226, 7256, 33078, 52513, 34128, 11390, 23459, 13957, 5818, 9830, -920, -7400, -5170, 20045, 25306, 10844, -1634, -11875, -428, -8022, -2327, -2041, 4845, 23831, 2977, -24436, -14266, 28317, 41498, 32122, 20402, 2174, -11832, -6307, 8783]
17377H783J2226K179M052k9211Q511q48o832j1217M379J0984q181r00M782J3890
17363A2597O424q552K1111L599k3612O208j8617j9700J5271j452J806q330J0452
17350b795j3536l3206j3299P063M844K7999R001q852o305L6692K0133k4398j0739
17337g398R19q616j3762j1368j5981n430J7284K4492J2635l896J920o788k4717
17324d0706p50R919J2098l035K1990k912J3964L0039j1550j1354l1616P418K8944
17311B2449J7221j9226j1519j2423j3088p995l354m426M117j8107P160P410K5583
17298f198J330J9031k431J2434K782j7899J3267n100k3244l25J0760J3601J1887
17285B9895k3151n582K023j1436L885M783r337n255J0190J7300m165j6800k7678
$$ y = [8783, 21009, 23188, 27240, -1971, 6540, 5692, -1140, -12357, -7978, 3006, -5175, -6075, -1293, 12597, 19021, 10469, 31580, 35179, 11567, 17775, -842, -20542, -5271, -6723, -4917, -13247, -2795, -16331, -49537, -62836, -55773, -50929, -22930, -13929, -22781, -29086, 7606, 27739, 3341, -7398, -6479, -15095, -28857, -40225, -56206, -61636, -44352, -19860, -7225, -11121, -9201, -15989, -40706, -41456, -31537, -19439, -22474, -484, -3396, 10568, 40607, 29057, 17703, -13913, -6495, 22449, 39670, 20444, 8925, -3498, -16586, -24581, -27935, -32361, -28244, -46351, -39191, -31781, -6198, -4868, 14163, 11732, 24166, 26948, 9049, 22316, 17216, -6028, -6353, 4407, 18008, 29895, 6744, 1162, 3185, -8251, -4366, 417, -8920, -14175, -3985, 13315, 9150, -7650, -35328]
17272c5328n01K6256j4636R535K4749J4439j120j1766j6545j1405j848M251K7033
17259A3114J7478J0415q443k6195M053N419J7552j5983k6822P420J3827L4661
17247D6496j0543M098O60K451q127M446j3849n895J5712j5445j2031R140p832
17234I281k5959R885K2049K470k4221k93j6175J3602J6942k345n234m397l152
17221g547o134l576K3299K2372q578k4435o20R958R471j1336R2J7944j3326l3011
17207b5427k3034J3346M359K988M4144p67M961j3294n5929Q392L8102j4130k6638
17194d2927R758J7914K3306K6902P394l2016j9144J8658n903J8188l956j6151
17182B023m2057L151J9507K0796O737J9096q659k1154j6249j8321J4836n797j5637
$$ y = [-35328, -35829, -9573, -24209, -14674, 10075, 24514, 23394, 11628, -4917, -16322, -18170, -13919, 13114, 30592, 41007, 32564, 6369, 10422, 15841, 33393, 17410, -9412, -1992, 11835, 46496, 35953, 40051, 40711, 43162, 35035, 39481, 25632, 19737, 35449, 20004, 7973, 17113, 9281, -16678, -6793, 15256, 17726, -6495, -6788, -22963, -9361, 7581, 5236, 2, -4395, -7547, -13681, -17257, 6042, 28414, 19836, -4599, -5219, 4739, 14210, 2874, 2966, 20910, 7584, -25427, -48461, -35115, -30756, -27768, 16376, 15609, 20570, 7276, -48653, -40261, -2159, -16289, -42927, -33169, -15255, 8051, 34953, 42347, 10331, -8813, 9845, 3942, 22130, 18174, 2023, -40034, -36883, -17376, 3420, 10157, 29253, 20594, -560, -16809, -35130, -20294, -26091, -41728]
17169d1728J8339J4803j0323k0939K9795M801J583R408L7894k546k5212j3881
17157A994j0236k9093K3017J0848j9604J4578k209k146J251Q063k6645n265q342
17144d3789j0264j2262J3424K5891J4611J538N692J7824j2712Q415K0184k5307
17132C245k4158J9898K398j0591J3100o064q789K0738J6353l434k7019j5119J5108
17119d334n345j2919P308k1712P413L0997M7595j2765k404k9395N56M927j0608
17106f86J467o026j1042n811J1121K250J1206K2935L016k1311J3543M833N519
17093C1014J5039j5316k9398J1158j449j0274k816j3334j5141Q554K7090k2279
17081a7152m227P554J2955M621J5427m967k0514j4522o001m467m41o103J7153
$$ y = [-41728, -23389, -8586, -18909, -39848, -10053, -5252, -3669, 5739, 43633, 41087, 15875, 1994, -8242, -37335, -14318, -3470, -23074, -8496, -10705, -12851, -11600, -3537, -30182, -35447, -43789, -54053, -66315, -52891, -27000, -12389, -10851, -5159, 12665, -47, 8368, 28552, 3245, -20913, -1015, 1383, -9208, 3892, -2172, -10961, 9777, 26130, 22696, -4323, -19442, -4334, -9679, -22598, -15290, -37002, -29589, 1408, 49003, 36238, 33834, 4439, 4995, 9922, -686, 781, -5245, -16287, -22098, -10977, -8727, 2479, 25414, 28430, 7119, 20662, 25495, 31014, 46053, 30737, 1339, 12497, 11048, 774, -2042, -15376, -30517, -21963, 5127, -17152, -21379, -13825, -870, 3751, 19178, 14211, -6303, -20825, -26826, -31293, -31734, -37837, -20684]
17068b0684J6108L7836K6283l7365k2279k260K0683j6490k9688J9233k3725k8495
17056f0843R439J9141k3913N780L5369M3145J232j7162J1543k62K79j6838k2646
17043a5736R153O949J3004o138J0671J5661k915l3699k5204K5542J2297j6359
17031f774j4895J7292P284j0185R194Q162J999M317j3528k7675O805m79J1672
17018f811L140k5328J1728q288j9247J4570K6865M430J4852J5704l982k233j7302
17005H098j0774m687j6394k0018L1103J2414m3596k94K8499K3809J861J2026k127
16992A9920k2177l6052j6692N920J9183J2917J1666k486p992j431m599k91L9134
16979A7020Q244R65j9749N727o106k3953j9019m599K629j6236K7657L4608j9624
$$ y = [-20684, -4576, 33260, 59543, 22178, -101, -2361, 18322, 1832, -27856, -8623, -32348, -60843, -51404, -32263, -56176, -50396, -15027, 28118, 29350, 12188, 23731, 23469, 23748, 6910, -15736, -6583, 366, 13370, 7232, 17903, 33564, 30649, -3050, -28254, -2712, 9585, -6774, -21669, -4377, 2907, -7278, 1916, 10078, 12077, 16394, 2866, -24809, -18004, -18483, -6811, -3671, -28999, -17271, -25559, -44806, -30236, -3371, 1059, 15911, 31615, 27633, 25400, 8098, -2676, -7363, -23757, -43775, -12672, -258, -43854, -44148, -15649, 8160, 10021, 22047, 19920, -2257, -38309, -55001, -49081, -29898, -16981, -5315, -7801, -15793, -17224, -21823, -22114, 17020, 25264, 26229, 6480, 12207, 6101, -17852, -36871, -41470, -38841, -55077, -27420, 7188, -12436]
16966a2436k925j1978l874K916J0526J1776K0376K7565l4038j2912p42p754R305
16953d195j3309j5890j488K5235L4646K7161k3278Q722J3781l027j5242r435p285
16940A6396l039J0535l487j7160k8154l2395k819K270M057K0431J7573J7947K0353
16927B2508J0804l4718k1909O301L0048J6990j4125j3313m749r289J582q711o248
16914b4829J1751J4048J6826j36J270j0005J7850J5195j5061j8596K548P410J3386
16901C1657j883j454j7906K4522R612l6355j8421l841P703R64k0397j2290j234
16888c9323j739K4641J0832L758k4137Q516j0329J1499K8438m237l089j6025l0331
16875d1526M761j2549J6391K7751j154N852J1157N933O102p62m496m2659r093
$$ y = [-12436, -15361, -27339, -31213, -28297, -17771, -5995, 14381, 41946, 7908, -5004, -5746, -13500, -4195, -17504, -33394, -34882, -9647, 24999, 52160, 28882, 37604, 51385, 48358, 33116, 23681, 16396, 13357, 23892, 20405, 3245, -24909, -57304, -60123, -57853, -53796, -33365, -15792, 2155, 22508, 33312, -1406, -23315, -17014, 13034, 30024, 15899, 2586, -2163, -11452, -9870, -18581, -24829, -13078, 970, 17796, 17660, 18930, 8925, 26775, 41970, 26909, 8313, 10861, 18271, 31657, 29774, 28320, 10414, 34936, 44548, 8193, -10228, -14069, -6366, -5402, -25799, -38089, -39323, -41062, -16421, -5589, -1831, -25968, -17452, -27781, -16282, 12156, 7919, 4830, -11195, -41526, -36765, -49314, -32923, -5172, -6326, -474, 10683, 16616, 22718, 21956, 17460, -25199, -34292]
16862c4292m074m641N713J7784m911o172j2832J5292L8057R054j3994P238J0232
16849B2454m138k8568j3029q660k688m619Q721k987j3467J4472J3420K0196N390
16836F497j1444j0905k0792R823J6696L0510N722j5586k8839J4586K6934J0556
16824C3758l692L246k5760l052J904J5523p300l82j0388j3691J4009m407m574
16811d806j7945p536j3270j248K080K1218L3399K401q00l0627J39J6519J2428
16798A1952K6506m8119k8916J5583k0795o864K2011k120M711n619O76M446L141
16785b3407j7266J9273J9667J0442j1719k94J0699L2620L42k9043j037O208Q807
16772B5292J2391M596j8495k634j3489p835j1669o302k927j2366J9539K7532j257
$$ y = [-34292, -38366, -43007, -37294, -19510, -24421, -30593, -43425, -28133, 9924, 18978, 4984, 12222, 22454, 18316, -10252, -23281, -31941, -34629, -39248, -30527, -33514, -46981, -32509, -19089, 1107, 6497, -4947, -15852, -36644, -26821, -10125, 20385, 26107, 10521, -18318, -3732, 23202, 33758, 30066, 33312, 7552, 4500, 6404, 21927, 14627, 14245, 3857, -9834, 4175, -232, -4806, -22751, -30287, -43557, -44805, -42725, -21507, 11892, 14293, 13493, -17134, -16995, -476, 11952, 38458, -9661, -38577, -22994, -43789, -50653, -28642, -30762, -26051, -31670, -30994, -26548, -23407, -40673, -21400, -1733, 8709, -3010, -3304, 7395, 40015, 40357, 11314, 10277, 16485, 25292, 37683, 42279, 23784, 21150, 7661, -174, -11843, -18145, -21072, -33438, -13899, 13633, 12376]
16759A2376j7706p354k1782M350p953j0943j6743k3591K7766P436L3436K0265
16747d43k3262j6670K3679K8209M693K1672l0749l5702J4016K7269J9279n602
16735B6389n436k7893k9630J2432K5811N111m782K4475L8717l2119l2621K4891
16723B5345M060m781j2524k5686R396n103J020j291O909n284P468Q768r246j0149
16709a1098J6155K979P793J1355o885k7359l0988j2578Q458j2414Q248J7015J8953
16696a0366k342m995k004M407P766J5852J0565j2248k1225k74P770P843j7476
16683a6727R277j527j6350q949J3168K9582J5830J0983l7197l1721J1600J7566
16671d465j0473J1832P193J3990p175j0370l3829q099p7q224q626L4374L6833
$$ y = [12376, -5330, -12684, -34466, -30116, -38069, -49012, -65755, -89346, -61580, -54144, -20708, -443, -23705, -40375, -16696, 11513, 16206, 37878, 7129, -28573, -14557, 12712, 31991, 26389, 20953, -6940, -36570, -24138, 1673, 6784, 2002, 26477, 65194, 33075, 454, 25345, 29405, 24624, 12100, -13586, -4190, -9293, -8273, -9564, -2655, -7939, -471, 8297, -949, -11098, 5057, 8036, 15829, 27184, 20299, -7060, -38048, -50626, -42168, -54582, -46334, -29319, -10366, -12708, -17703, -19707, -15300, -7534, 8318, 18883, 6635, -14590, -14864, -7094, 749, -16727, -7450, -8977, -25327, -34276, -21108, 8474, 24304, 35287, -1910, -33631, -22031, -4465, -14938, -3106, 4087, 18077, 10902, 532, -33297, -41396, -41473, -49697, -58323, -23949, 12884]
16658A2884o061j4537O378j6260k4131M830q113k0411K5890J3658k7181J1833
16646d1221L089J7991K7403K359J1062r061k019K5556N61j0134k5255j8712M763
16633a3618K2996K4202j7479L977j8655j0002j6890J7190J9807P05j4935l8090
16621d0792l3477J5098J7319J1347L144j0218J3945K4654M205k1556K722l451
16609a7060o712M082j6666J0920J7277J1575J6222m12K001J8699J596m0942j8041
16596a7461Q565O473k1662j2278J2890Q862J7339l739j5481K6833J2366j0176
16584A2531J612j1774q798J3406J8769p412j4629j530p947J845o381R522K552
16571A766k3530N520J5975q885R234M994q508j8787j1240J8800M834l4171P24
$$ y = [12884, 6823, -7714, -1336, -17596, -41727, -36897, -45010, -65421, -39531, -25873, -53054, -41221, -38132, -20141, 7262, 9621, 20683, 11622, 9603, 35159, 35720, 25586, 331, -18381, -13618, 9378, 33580, 16101, 20078, 1423, -8579, -25469, -8279, 11528, 12233, -2702, -40792, -74269, -59171, -41852, -30505, -27361, -37579, -23634, 1020, 5225, -16331, -13609, -17060, -23772, -19690, -36356, -25436, -8159, 3416, 19638, 19226, 21227, 39926, 41522, 580, -17461, -8896, -2423, -24085, -36363, -23473, -14611, 2728, -1011, -16492, 10341, 22707, 12531, 14143, 2369, -6429, 6977, 25746, 18334, 3705, 2175, -5772, -3927, -10308, -786, 1766, -21764, -16244, -269, -9154, 80, 5074, -3434, -22221, -33461, -14661, -9827, -43998, -43274]
16558d3274K7031K1935O130j1462o143L206j3326L522Q029K5816K7599P79k1472
16545B8370k0110k025L7406J6203k1583k942L3082K762k8840j8750k3130j7084
16533a6641M700K2219k0022l3846P24K0285O036K800q752J0092j7550j5506K1350
16520b4111o197J678K8051j4366l3352j5458O989K7438K2589M023K24L8598R574
16507D5680l0886r790J3686Q973q375j0926o533q958O906J0867q072j1545P918
16494a055J3632L126l1357j5728O679J5201l6710r225K6506J1612m144J1905K1548
16481A1990M085j4512Q503P027j4595K028L928N637k964K059N55K2624J1677k8801
16467A9241l0348m137p775j5256K3422J4561j0433j8544J0858K6910K1957J5850
$$ y = [-43274, -16243, 5692, 11822, 360, -5783, -2577, -15903, -12381, -4352, 21464, 49063, 49842, 28370, 8260, 6235, 43641, 59844, 38261, 35319, 68401, 71163, 42323, 23573, 443, -16641, -11941, 10278, -9744, -43590, -42866, -22581, -16545, -13745, -22497, -12405, -29955, -45461, -24111, -30308, -28630, -579, -14945, -48297, -63755, -56766, -29328, -6739, -2716, -2492, 36106, 45680, 14794, 5004, 18690, 27663, 19288, 8362, 1829, -7129, -223, 10644, 2572, -8973, -1055, 12577, 15703, -15654, -31382, -24703, -9502, -46212, -55437, -28931, -17319, -21463, -9558, 11990, 16075, 1563, 10066, 17093, 2498, 4526, 8454, 14091, 11127, 13186, 13741, 36365, 48042, 19241, -11107, -15244, -23019, -38275, -14853, -292, -10725, -29269, -18411, 8499, 30456, 46306]
16455D6306o193J202N041j9236L265n147k5273p645J5673J9119j5572k0871J2547
16442C216n723l0590l560j5557J4994L6860K6599j5986k6579r54J611J3853K3734
16429B1918J3095J3398p122l9965k6707M865L6914J5163j8955J598J6519j6078
16417A4643q13K5317N941k5685l3902l130Q842r233j0522R546K9715J5076o780
16404A9015k4545m421K958J0137q88Q531j5426j1264q182j3520R351K8990J4808
16391A5544K1093p548k1805P512K7921k8963n081j2066l3208J0758K2348O572
16379C077Q431r496k0883P167N278K127R977k479p323j7328j8224n969J8699K8953
16365B007J3887q378j1834r995m660L512o784k6408J8685J4074K0351j348K174
$$ y = [46306, 40113, 41315, 46356, 27120, 30385, 25238, -35, -7680, 7993, 27112, 11540, -9331, 3216, -2507, -33097, -36657, -52214, -37220, -360, 26239, 10253, -16326, -17280, -15669, -1816, 21918, 35013, 48411, 41289, 1324, -25383, -20518, 16396, 31559, 12604, 14202, 30721, 14643, 13830, 39147, 45088, 19403, -14499, -17629, -8787, -18020, -28542, -18996, 10719, 25795, 19015, -5530, -9951, -6993, 3144, 2256, 10787, -4639, -15903, -24085, -37605, -28254, 736, 15544, 36637, 29089, 7284, 14796, 42717, 13754, 8673, -3393, -36601, -25843, -3495, 3077, 11508, 2012, -18871, -11704, -6426, -4299, 5678, 3199, -4124, -21452, -39676, -45645, -26946, 2007, 15894, 7516, -4318, -14313, -18973, -15461, -22245, -48653, -29968, -15894, 4457, 3109, 5283]
16352E283K560l2428j9511R991j529J3594K2727J1555j1550k7250J6808J1163
16340A413k1148R25k303J4903J0940q531q230k0795q826K4507K3585P700q457
16327E683N46j4702k5860k1932j305j470n121J1326J9506K0283M1095n720J0923
16314C3252j9291j4294K4334j0542k5592l651K1685k27j5438j2546N856j538j679
16301a9671l4618j371K1761M3492R543r024l047r628j2493J4626L72J393J9787
16288B1122j6201l7480j5199Q932K7267J209l3508J262R33K0649K0771J0231k5409
16275a5421L344q191K524J7765j5162J3894J3524j772p561j7572J165l038j73
16262a6674N395Q850J2667J6708j397k7863l628r978N851J5834K0427L1070m121
$$ y = [5283, 7843, -24585, -44096, -34105, -35634, -22040, 687, 12242, 692, -26558, -9750, 1413, -19735, -18810, -21113, -6210, 4730, -3801, -12031, -32826, -41652, -17145, 6440, 14140, 5683, 6229, -8473, -34333, -56265, -57570, -59040, -64161, -52835, -33329, -13046, 28049, 22329, 33252, 13961, -333, 24001, 13459, -12133, -15784, 5901, 5674, -9764, -22310, -16454, -17992, -19671, -54289, -55660, -33899, 9593, 19136, 10112, 7065, -2563, -15056, -430, -58, 1335, 21122, 4921, -32559, -47758, -38826, -11559, -10350, -43858, -42596, -41663, -21014, -243, 9988, -15421, -12077, -20268, -17744, 21, -15141, -1247, 12277, 10505, 2944, -14628, -13463, -16501, -16674, -11279, -2429, 10238, 26946, 25549, -2314, -5942, -15920, -10069, 5765, 26192, 57262, 53141]
16249E3141Q45r913k0792o183J1695L0759J0340k9930k4978j1000k0340o618j2124
16236c5098J2953K060j0531O297J1297K564J0915J7456l0440k5534J8727k569
16224b1903N86j1372J4678J0317l4443k0004J3369K9344P601M227K7990J4982
16212C5372p550J2461J1042j0580k2444O914m0204m4843L4280J1039N23K1219
16200G229K0171J4794k539J384o826j033j052k391K0215k2087j5339l353m520
16187D653L2656k4590j9540k184q766R962J711j0063M176K1914L8356j74j9593
16174B8518j6258k4369j465k509l2149Q665j6462j071j3574j1026P118J2376J3804
16161d8402O691J1472j1314j3537R928K110l35N778p665m781o825q756J4057M1057
$$ y = [53141, 53986, 44073, 23281, 17098, 28793, 59552, 69892, 39962, 14984, 3984, -16356, -22974, -35098, -22145, -20085, -30616, -24319, -13022, -10458, 457, 17913, -12527, -38061, -19334, -21903, -21317, -32689, -18011, -7694, -42137, -62141, -48772, -19428, -11827, -7600, 20390, 35372, 27822, 40283, 51325, 40745, 18301, 25215, -14989, -59832, -25552, -14513, -13990, 7229, 27400, 42194, 39655, 41039, 34213, 33180, 32128, 29737, 49952, 27865, 12526, 9173, 4653, 37309, 12719, -6821, -9005, -17771, -7809, -6098, -16161, -11985, 9929, 48285, 48111, 28518, 12260, -12109, -13574, -16083, -48232, -39567, -56029, -57100, -70674, -81700, -74582, -62206, -48402, -41711, -30239, -41553, -55090, -45162, -43052, -43387, -37609, -45274, -50055, -56880, -65636, -51579, -10522]
16147a0522k440o79m235k0937Q228L5298K9777j6513k3481l7738L7798L9261j8257
16134A5560m9036j6615L4975J4138q478L642J6643l2321l4139K201L2492R284
16122a1654J318K4347j5527j1907M000K3501l119j2574m490L694Q099J0373K780
16109A8841l14O540k0090k8679Q107R17K456j285L1536Q657M494j2175j8867j9021
16095a8883p18m893j8825J5034M966J5741O713k9774k852K1927K0157j6179P392
16082a94k7377l2206q56K7713M688j2277J7364J8301Q820J5747J815l0223j0201
16069a8886J3251Q104j7835J1063N76r346N772j766j8902K1928j18o577M273L2909
16055B4446j3621k4456m100J4348l4676J6376K7257J2955J7364j9910j2749j338
$$ y = [-10522, -12962, -13641, -17876, -38813, -30585, 4713, 34490, 17977, -5504, -43242, -5444, 33817, 15560, -33476, -50091, -15116, -978, -9456, -5814, 10829, -21492, -55631, -53430, -20938, -11654, -10336, 14011, -1516, -13423, -9423, 14078, 10959, -1615, -6105, -2411, 5688, 16061, 18841, 18527, 25067, 4977, -23702, -15595, -14678, -12222, -13507, 18029, 26686, 31180, 19005, 138, -18883, -19601, -24494, -43319, -28285, -23319, -7578, -865, -30639, -33491, -11564, 8593, -7586, -194, -27571, -59777, -60633, -32920, -28232, -40509, -23145, -4844, 3976, 19723, 21538, -8685, -18886, -5635, 2469, -15366, -4303, -3727, -13073, -7301, -9067, -27969, -6041, -6159, -12736, -8463, 24446, 10825, -13631, -17731, -3383, -38059, -21683, 5574, 18529, 35893, 15983, 3234, 1896]
16043A896k511P085m0926l735L3562J1210M845L529k7916m6291L834K8270n624
16030c2772j7388K2848N269j471j5506J5457n050j5757j9200j555L1994L4938
16018A807K5511j3994m7150p186K7395n211P55Q329J0929l709O473j3664j8309
16005b8024j9091J2285K9853M054j4220M632J0252j79L04k4047j5901L0951J6713
15992G582n749q474k2198L29q511J3850J9465J9402M46j5167k6149o003K4591
15979f586L8882r28j1658l844j1155k1737m236K0639j345k3433J7635p682n342
15966b0790J2612J2818Oj4723Q206K786K3324k1186k6052N463n762j4124J1090
15953b6332J2216J8566M140o408j1545j5174n478O772J6605K4135M788o690k5188
$$ y = [1896, -615, 6470, -34456, -38191, -4629, 6581, 11426, 14955, -12961, -59252, -55418, -27148, -32772, -50160, -27312, -22043, -23514, -39020, -23563, -28613, -44370, -63570, -65125, -33131, 1807, 27318, 13324, -33826, -41012, -13617, -18828, -18073, -9744, 1185, -2524, 3949, -9715, -28024, -47115, -34830, -4977, -923, -15143, -10511, -259, -438, -134, -24181, -40082, -9131, 7582, 1833, -6641, -28839, -28510, -37021, -23171, -3706, 15696, 16142, 975, -25174, -31177, -6586, 32296, 31368, 19710, 15866, 4711, -17026, -21262, -623, -1968, -25401, -7766, -15448, -20790, -8178, 4640, 4646, -10077, -1871, 915, 24239, 3053, -22999, -17536, -23298, -37422, -26332, -14116, 4450, 8590, 2182, -9363, -24537, -30015, -23243, -6638, 17497, 22285, 15595, -9593]
15940i593j4368K536J9230J340J0113J6081J2517j1424l1193l822l2644j8163
15928e9390P698r735J7126K124k0283L5198P988Q095K401R552P31N517J5004J5320
15914C7346l2535j2390J1390j3278L4097n784o194j7890j0032k5579k528J4564
15902b8813K0709l945K2619r666L269P659l6734j7925O114O562N337K6418K4227
15889B5831k2088L35j0150J7748J4013k2975k3676L0069j5452n874M233k3254
15877c1240o374m222Q621K8875K0079r449j754j7831k844m618J075K7641j62j8141
15863a0344j1642p641K546j1333K52K6402J6844J741j2538o453k6807j4581j160
15850e4714J7952n54n505N154J388j353R511K1610Q908K2254J1669l3822m0556
$$ y = [-9593, -23961, -21425, -2195, -855, 9258, 25339, 37856, 26432, -4761, -8583, -41227, -59390, -51692, -61427, -44301, -42177, -62460, -27262, -19274, -11179, -8778, 774, 1505, 7022, 22026, 37346, 4811, -7579, 3811, -9467, 24630, 18846, 12652, -5238, -15270, -40849, -43377, -28813, -8104, -12049, 10570, 904, 4173, 11832, -24902, -42827, -36713, -30151, -24814, 1604, 25831, 3743, 4078, -6072, 11676, 25689, 2714, -20962, 9107, -6345, -12219, -7986, -31240, -37614, -41836, -33215, -4340, 15739, 6290, 4536, -13295, -16139, -20757, -19682, 7959, 7797, -10344, -21986, -29627, -27081, -38414, -38162, -11760, 5084, 6825, -5713, -12166, -38973, -53554, -54714, -36762, -37316, -42821, -37667, -36279, -37632, -28121, -6511, 2397, 24651, 36320, 2498, -38058]
15837c8058O843m655J7624J6594J7308L7218k4693j1905K2678j028K808o456o990
15824B7288j2977P743j501Q161k0713j069K1311K142Q014o725J229q332l3944
15811i373j155P286q816N591L2507m733k6459J9062j2005j7186J0930L8200J3403
15798D7252k9852l1615m809K458J2310M26P193K212R003m586j6800k2646k932
15785c2386j2782L0268L0197j1444k7847K5784R169J7846j1005j2154L4155K813
15773D2614j4604l3213k5057j6413j7747J4071k852k80J555J913N8O200J1005
15760c2750K0409n134M993J263K2463Q368o149L2758Q980j163P178p535j5457
15747C8224l5799n980j5435p737L6815j1721q736J3713k586q866p220m905N046
$$ y = [-38058, -31215, -35870, -18246, -1652, 15656, 52874, 28181, 16276, 38954, 37926, 40734, 34278, 27288, 14311, 22054, 20553, 28714, 8001, 6932, 28243, 30385, 38399, 31674, 32903, 24571, -9373, -10528, -3242, -12058, -6467, 26040, 21307, -5152, 13910, 1905, -15281, -4351, 33849, 47252, 17400, -14215, -19024, -16566, -4256, -3830, 3363, 5575, 14578, 9992, -6808, -29454, -32386, -45168, -14900, 15297, 3853, -23994, 1790, 10959, 28805, 17800, 5646, 39801, 42614, 28010, -5203, -30260, -46673, -64420, -50349, -53201, -53481, -51926, -50013, -49955, -43755, -32750, -12341, -17475, -12482, -11219, 11244, 19612, 13463, 46221, 55201, 54038, 61216, 53681, 38224, 2425, -3555, -18990, -26727, 10088, -1633, -10369, 3344, 758, -8108, -15328, -20233, -15187]
15734a5187J1109j9546J0095P374l181K0355j8706j792P587K8646K0889k381k5251
15721B0011J0197K5568j6190k8217j993o353Q284K2051k7011j047K9133O210j5237
15708B5406J5065J1502R50k3494k3859j129j2293R483k6113J5288L5247J7794
15696D3847k1827j8325j6485o359J0259L236J4130J1658Q995J134k4888k7951
15684b2576j1633K1940O641k7141q308K8137j9798o38J9260l379j5496K0772J6252
15671D033k70J6926K983j5462j6791K3238Q602j55j4065j0023M682j5955j3094
15658b5351j0893J1325J6865K1729m949P41m688r796q457K2571J9451J01m852
15645B3797k7895k8947j1262J8792j0754N660L3o254K4979Q488J184N32j1749
$$ y = [-15187, -4078, -23624, -13529, -6155, -9336, 11019, -7687, -9479, -1892, 26754, 47643, 45262, 20011, 30208, 55776, 39586, 11369, 9376, 3023, 11307, 33358, 6347, 5300, 34433, 40643, 25406, 40471, 51973, 52923, 29429, 5570, 4441, -7852, 1631, -24482, -9194, 26053, 43847, 22020, 3695, -12790, -19149, -8890, -5654, 8476, 20134, 29129, 30263, 5375, -22576, -34209, -12269, -5628, -32769, -41077, -12940, -32738, -33376, -14116, -17495, -32991, -12219, 4033, 3763, 20689, 23672, 8210, -8581, 14657, 23259, 23104, 9039, -984, 3698, -12257, -25351, -36244, -24919, -8054, 13675, 8726, 9467, 4779, -5017, -13474, 9097, 28548, 28649, 23797, -4098, -33045, -44307, -25515, -36269, -30609, -30576, -36830, -11851, -3363, -2179, -1647, -13396]
15632a3396l546J596m300k5767J2350K1069j5707k1559o472L4398L9012P493j2471
15619A2700r43j7476N565p93k3361O235j8916j1499K9823J6298P482r020k0790
15606b4695N763j44K4826J5610P683j3192k0444l376j0613k2331m882J9388J0275
15593a6132l244l892Q707j3740r401j4837M44L207O388r236p916L390N472J2035
15579c8755M2145M858M73J1288Q156j6628q980l0633L2383L5663j2217k5903q413
15566f563k181J3886j8753k9564J651J724K8894K3766J0416j4584j6655P907j3052
15553a3108l3197J0363k179K0620r46J5784P773k5084l611L383J3196n790J050
15540a1746N524K2580p323Q49J3766k0929m202L23J9380L2631j0365k8318k634
$$ y = [-13396, -16942, -15346, -19646, -45413, -33063, -11994, -27701, -49260, -55732, -21334, 17678, 25171, 12700, 11757, -5719, -154, -947, -24308, -18073, -36989, -48488, -18665, -2367, 5115, -3905, -24695, -18932, -19076, 5750, 21360, 29043, 15851, -4593, -7969, -18582, -40913, -45795, -26407, -16132, -19376, -23268, -14561, -28301, -37702, -52539, -52095, -48888, -42500, -51736, -59652, -56262, -50790, -38755, 3390, 8248, 8721, 20009, 28165, 11537, 2557, -28076, 4307, 39970, 27753, 1850, -6563, -8744, 5142, -13611, -43175, -41524, -39800, -10906, 12860, 23276, 8692, -7963, -56, -13108, -46305, -35942, -38121, -17501, -18447, -2663, 5110, -19974, -23585, -20202, -7006, -12796, -11746, -6222, 16358, 9035, 9884, 23650, 2721, -1481, -1158, 18222, 50853, 40488, 12170, 9536]
15527I536J4284l453j3360k7555O833k1788q926o663J9697J9417J5326jj4229
15514a0882k3070R31j452K098J8439n308j275K0623l136J769K0184N1k3789K861
15500a956j5687j4524K2532K8512r711J7725j8987j5981r843l4849l5364J1738
15488g6395J5156L778L5691n752J9215j213m582m828k2011J107K3316K4509j7897
15475i906J8996O768M361J1462k3697k3174j4669k290o067k329j7252l187M266
15462e6718J0637K8356l469P347M2213J8684j1631O24n046l409k9722J949K9580
15449B9395j2961k4612J7232j1853j4112j5937J0186J805K671l63J1786k7123
15437c3886l1647N245K4748K6130j0855J7825J2168q50O716k3262k4875k521K523
$$ y = [9536, 23820, 20367, 7007, -20548, -13715, -35503, -44429, -51092, -31395, -11978, 3348, 3347, -10882, -33952, -33021, -34473, -32375, -13936, -19244, -20519, 104, -3032, -1263, 18921, 18972, -4817, -1956, -17643, -32167, -9635, 18877, 9166, 26891, 7904, -8077, -17920, -52769, -88133, -76395, -61239, -57461, -21770, -27522, -8307, -9520, -14102, -18930, -40941, -39834, -16518, 7991, -9906, 9090, 15858, 20219, 31681, 7984, -15190, -29859, -32149, -38216, -40545, -57797, -60984, -56718, -46081, -17725, -21194, -13847, 28366, 47050, 35419, 36043, 30997, 27588, -2134, -185, 29395, 16434, -8178, 9054, -2799, -16911, -32848, -22662, -20857, -18186, -18549, -6763, -33886, -65533, -60288, -35540, -9410, -20265, -2440, 9728, 8878, 15594, -7668, -32543, -35064, -32541]
15424c2541k675J924j4370L1600L7179J5496M392j614l664j3018j8445j3209J7611
15411H666K0659Q867M792j6676k8488L1860M086q748j1735j754J1601N005j6632
15398A1503j9436j2325J6320q271j1561L0826l46J333k3405k9213L9040p654n898
15385a9087J7935P662L5590k615n9845l1677M737n52k466R948J0789L3764J544
15372E727k6395k7489K2371L1043Q313l8207r162m901j692N918J3400J7647K8576
15359B5149k8310k4299l23p498k830L8072jj7801j0089N312J2455K0737J2096
15346B2670L423k1825k1042j6506J193L0510L492q184l3805q133J1024M1796O000
15333A0613j3506q030R759n67J5405L0124M37j2636O743J0487k729J576j9361
$$ y = [-32541, -35216, -33292, -47662, -16062, 21117, 36613, 41005, 39391, 35727, 22709, 4264, -8945, 8666, 29325, 38192, 42984, 26308, -2180, 29680, 33766, 25018, 13283, 11529, 23130, 28135, 11503, -7933, -20258, -3938, -12209, -23770, 7056, 6710, 8043, -15362, -44575, -5535, -13189, -19087, -1152, 6510, 42100, 39485, -20360, -52037, -47300, -47852, -50318, -40370, -29581, 4183, 5727, -20668, -48157, -25786, 5257, 13570, -24637, -33799, -38700, -40392, -34474, -21074, -3427, 25149, -3161, -27460, -27783, -35281, -38111, -39, -40, -17841, -27930, -22618, -10163, 10574, 22670, 26093, 4268, -16774, -33280, -32087, -1577, 1915, -6269, -40074, -48207, -37183, 4613, 10613, -2893, -10923, -1164, -1731, 13674, 43798, 44235, 31599, 38342, 48829, 46100, 47676, 28315]
15320B8315N43J6230K9533j6124k7327k943j0219j2193q094q590n338n41j8029
15307c4777Q674J0183m387m606j880j0844N827P875k0216m030M836M997R897O486
15293b1965m243k1203P594r239j7187o02j0899J0233K5213j5979j118K4935K1282
15280a3178L309J987k6231J4509N482k3460N563K3598J4734n997J5201l074k351
15267A0092N500J1463J5961j5353M12o3n786r674j7530j2887K4616J179m938O634
15253I626J4392J286l0201k4490N51Q198r661J4329j5039l1330j884M83K2746
15240d0994M1276j971m267j5307M647P246Q852J7858O128j0221m0877m0611K1327
15227d6914K4283k329L7201M0466J3880J7504k2760l7521j6192o434p946k1905
$$ y = [28315, 28858, 45088, 74621, 58497, 31170, 28227, 18008, 5815, -2279, -10869, -16207, -16748, -34777, -26103, -15920, -20307, -24913, -26793, -37637, -31810, -23935, -44151, -48181, -43345, -38348, -28451, -21965, -26208, -47411, -39817, -49056, -66243, -66845, -77744, -67511, -42298, -58277, -59395, -34460, -13178, -9869, -7882, -34113, -19604, -14122, -37582, -32019, -8421, 6313, 316, 15517, 12443, 10092, 15592, 27055, 43016, 27663, 28075, 28012, 22226, 12552, -4978, -17865, 6751, 7930, 2992, 9626, 24018, 25304, -4897, -29387, -28836, -20638, -30299, -15970, -31009, -62339, -64223, -63740, -40994, 282, -1689, -5956, -21263, -16616, -9370, -518, 17340, 23468, 13247, -27630, -68241, -46914, -22631, -24960, 12241, 52707, 66587, 84091, 61331, 23810, 7618, 1184, -6762, -28667]
15215b8667P435J0580J0251p205J5875J2417l1593j8529J7485p529k4713j1020
15203e5213O962L89R931J5699J3782k5293k4097L3871L2226O908J1220q78j8782
15190F725k3634o303n372j1495J1434p664j763L5532o23k4418j879N545J3639
15177a0276L0742R898n763j3357K849k3225p489k3768J0859M8839k3906M472R27
15164H02j218L0179j0183O483k1399k2066l8747K2984L5161J7265M907j8987o54
15151D527J2462K8165j8433k3179l2212r19K1267J1094K8078P041k6648k2433
15139a1190K728K262k7885k6061o348J3666K9658Q003J3595j417K866R207j3460
15126d376J0330Q869J3512j8358K3603k611k0957R354K1693K8184j3237k0939
$$ y = [-28667, -21232, -10652, -401, -7606, 8269, 20686, -10907, -29436, -11951, -19480, -44193, -55213, -48251, -47862, -37931, -22232, -8450, -33743, -57840, -23969, 8257, 15165, 26385, 25507, 6725, -16909, -23212, -28584, -40079, -28645, -36309, -38072, -2540, -3163, -27581, -29460, -23915, -10276, 20466, 30364, 24601, 11244, 14093, -9132, -16621, -40389, -29530, 19309, -4597, -125, 802, -416, 29763, 19580, 26063, 4664, -17402, -56149, -33165, 1996, 19261, 24168, 5181, 4527, 16989, 45154, 26721, 3542, -28670, -29589, -8322, 2772, 30850, 37891, 11243, -11190, -8462, -6200, -34085, -60146, -66494, -52828, -23170, -15167, -1572, -2989, -123, 9084, -4376, 5954, 14823, 28335, 9977, 33580, 30969, 10012, 19366, 41059, 69243, 56006, 35067]
15114C5067m870k645r254q653p124P357L880l4679j4986L602K5385N895J2015
15101A0990j3492O713L9184j0467k0099J531J0489J4939J7576r366k4592j2095
15089A1311j0242l5994L857J6461K5854K5293o320N337j2492j3411K0101j0146
15077A9609j9695J0674r030Q190J0421K0636O469k4412J3225J7712k6966k9568
15065b735r572k614K9999K509j1299j956RJ0145J1541J8598M325l5756q078K8022
15051C3138m74r554k9157k1226k453P701N990K132P636o44K1198L7264N243k9573
15037B7221l3188k0941K1583K0154J9783O003k7656j8942j5278j8248J0879J4795
15025a3835k698O592K9656l147m5061k3548m678K3807K4688K0550j748r439J5811
$$ y = [35067, 30197, 27552, 18298, 9645, 2521, 9878, 13758, -20921, -35907, -32305, -6920, -1025, 10990, -2502, 4211, 43395, 32928, 12829, 14360, 24849, 39788, 57364, 47998, 23406, 11311, 1069, -34925, -31068, -14607, 11247, 36540, 30220, 35557, 23065, 9654, 29755, 19609, -86, 10588, 1558, 9748, 20169, 40805, 47274, 22862, 36087, 53799, 26833, -2735, -12307, -14921, 15078, 17587, 6288, 4332, 4341, 14486, 26027, 44625, 48950, 13194, 5116, 33138, 32664, 23110, -6047, -27273, -29726, -22025, -16035, -13903, -6267, -6911, 14287, 51551, 56794, 27221, -5967, -26908, -5325, 14829, 34612, 40615, 12959, -5983, -21261, -39509, -28630, -13835, -16533, -9941, 19715, 16568, -28493, -52041, -56719, -32912, -8224, 12326, 10578, 1139, 16950]
15012A6950R169q286j2134K8038M567q051l430m021l574k3607l2231L447J0456
14999b2707K1703N372M390K6919l300o984M75j3753k507k4013q635N694O518p96
14985a1624n094l0929J8350K8291m568k6084j0048l446O254J0821J0149J503K3475
14972G050p128O385J8164j3130q276J9075N129J5838q710m691L835K923o694l6624
14958f854O974R262M994r073j9641M2658j519n287K2777j8281k3415R317j0735
14945A177O222j0148O6L3535k545k3407o812l610l866J2178J3438J3532k3852
14932E908j1975M2250J0172l802k301m1232l7002j6451J2441K4003J5616J6533
14920A4160j0262k4395M120o344m166J3920J0659q439M468j0074m5813m6319O540
$$ y = [16950, 26119, 17833, 5699, 33737, 38304, 30253, 26823, 22802, 19228, -4379, -36610, -33163, -22707, -1004, 4368, 8758, 35677, 32377, 25393, 25868, 12115, 9608, -14405, -23040, -17346, -10828, -11624, -16718, -47647, -29297, -1006, -5574, -31658, -41706, -45152, -38898, -28077, -17928, -16425, 7050, -78, 6307, 24471, 11341, 3065, 22140, 27269, 43107, 34397, 29706, 33541, 36464, 29770, -6854, 120, 9382, 14376, 5303, -14338, 28320, 26801, 21514, 44291, 26010, 2595, 11912, 1177, 7399, -2749, -2683, 30852, 28307, 4900, -1912, -5522, -9388, 2790, 16228, 29760, 5908, -6067, 36183, 46355, 42553, 40252, -980, -37982, -54433, -41992, -17989, -2373, 14160, 3898, -20497, -16377, -22721, -26887, -12967, -2308, -10747, -6279, -16353, -62166, -108485, -101945]
14907a01945L4202K4981J1599J3047R642j725k3617q009j9981K977L4047N823
14895a8959M0748m93O870J4362N758j7841l3337k1340K9816J5552k0803L610J716
14882E659O846j3932j4120K1617m97Q01K2983N420j8618N616j310j3351J58Q43
14868H115k8911j784r90n570Q640j6681n152J2293j2021N954N0389K5405l7256
14855B431r519R935k953r797J4210Q415m454k1851O230L7938r695m666j7564k8179
14841b9519k720J6342L8062J9931l0014J567l311p807j6266p894J7050J4345p365
14828B401j3300j3896K321J8740L572j5089K808n03K2947N349O436J468m618M942
14814B3578k023k2462k0205N034R004l5573Q770K521M080L212Q677M529j4089
$$ y = [-101945, -67743, -42762, -31163, -18116, -8474, -10199, -33816, -41825, -61806, -58829, -24782, -18959, 21789, 21296, 28166, 42528, 48286, 30445, -2892, -24232, 5584, 21136, 333, 3943, 5659, 12505, -1427, -15547, 6070, 5573, 6374, 29357, 34777, 16159, 21775, 20465, 7114, 7272, 8115, -20796, -22580, -23570, -29140, -20500, -37181, -42333, -30040, -42061, -36107, 14282, 39687, 2431, -7088, 2847, -106, -9903, 4307, 12722, 8268, -13583, -7353, 30585, 20890, 16224, -1340, -29519, -32239, -15897, 22165, 42096, 12082, 13649, 10338, 2531, -13735, -21629, -4579, 9766, 2401, -10899, -24795, -22474, -3734, -162, -15251, -12443, -12946, 10001, 15350, 21786, 23254, 18636, 23578, 21555, -907, -21112, -16078, -7074, -42647, -33877, -31356, -27276, -24064, -15387, -10858, -24947]
14801b4947K471J3432R112J6818L6894J5415k4183o174Q572k070l1573j010J6173
14788B8930m353l4615M62o082n611j1986L3240K6826N01j3380j1713j6359k7841
14775d1981J2249L964l0858j2769o399K7735K2077L3749J6964J6789j5541k4323
14763A656j0817O863l851p793K318N138l430j7694O954l1884k3941L2130N995
14750c8356k6233l451L7260K2531k9398j4341L6349K6655K873J757J3184M226
14738C3056J4545O016k7912k02Q433l434j2871m3865j6086K8874K3560K0097o059
14725B4152j6123R057j3136K641r262R64J2430Q832J9970K585M965j114j6706
14712B9255j8627j0468J9479j1609j5026j9531L2360l3n460K5300K1807j4470
$$ y = [-24947, -22476, -9044, 68, 16886, 53780, 69195, 45012, 38838, 47410, 45340, 13767, 12757, 28930, 24577, -10038, -9576, -15658, -21269, -33255, -15, 26811, 27312, 13932, 2219, -14140, -41981, -29732, -25768, -56626, -69395, -75794, -48059, -25982, 7767, 24731, 41520, 25979, 1656, -9161, -2298, -6149, -13942, -11624, -6486, -9916, -27610, -20656, -52540, -76481, -44351, -38356, -64589, -68040, -30780, -8249, -37647, -51988, -15639, 11016, 13889, 15646, 28830, 33056, 47601, 53617, 25705, 25503, 33936, 30502, 17631, -26234, -42320, -13446, 10114, 30211, 24152, 8029, 17086, 3950, 6591, -2671, -1707, 10723, 19555, 39525, 42110, 47075, 45961, 29255, 10628, 160, 19639, 8030, -6996, -26527, 5833, 5800, 340, 25640, 47447, 32977]
14700C2977j8220P2j7215p575O910k5216k8905K300K2138J8393L5200M59J5117
14687C6435k409m197j4114L367J6119J9543l3799k038J5472J0151q444k4598k8893
14674a7405k710n990j004M126K6888J0490M812J390k4371j3977N684K4396o880
14661E449J6989N516M694J6832K54k2734l3910O320k996Q971k747j3929J5835
14648D544q855k817O3p684l020q896N624O554J1415K875Q759r827j497O285k3710
14633b0187k6011o993m205J7516O229K2308L1435k5338k5482M6544J1950p698
14621B0068n600k4872j4522J489P047k685j8435J5043j1352J619K704J6404R191
14608c901k3569R578K3151M036K9512o516j7629k6705k817j1471J6889K9257k5150
$$ y = [32977, 14757, 14829, -2386, -9961, -3051, -28267, -57172, -54872, -32734, -14341, 20859, 21318, 36435, 34026, 29829, 15715, 19082, 35201, 54744, 20945, 18907, 34379, 44530, 36086, 11488, -17405, -20115, -26105, -27109, -22983, 3905, 14395, 19207, 20597, -3774, -17751, -12067, 12329, 5449, 22438, 27954, 32648, 49480, 49734, 27000, -6910, -590, -3586, 5385, 2638, -11291, 4544, -4311, -7128, -7065, -14749, -17769, -26665, -21041, -14487, -3072, -197, 8562, -1265, -2762, 3523, -20187, -46198, -53191, -57396, -39880, -33651, -11343, 20092, -5246, -30728, 15816, 27766, 20068, 14468, -10404, -24926, -23437, -16390, -19075, -37510, -22467, -33819, -32200, -29496, -13092, -3901, -27470, -17892, 5259, 9295, 38807, 32291, 14662, -12043, -14860, -26331, -9442, 19815, -5335]
14595e335j2476J2793K0440K0399Q4m7802m888L4986j2801j7415Q409J7290J0696
14582B4380J4225k7163j2283j4926j768L3827Q958k1068k6929M5307J046k1334
14570B272k3094J9519N740j5616j5112M05L7201J3779O415k3091M537l848L55
14557I462P175k6995j4649N998J4479J2349j374k5130j6813p49J3681K0873J6525
14544A4832j021n247l58l956j6395l973P666J1634o884l1066j6282K9238J4650
14531g162K1174M4036J299O258j8576j6161j0451M918k571O388N421j1708l6633
14518a3768J8410P466l7263j1684M3179j9038k4232J4617J2758N029Q081R61l853
14505F63J3514n775l1480j4228R214J4173J4294j926r537L858K1586K0104K3319
$$ y = [-5335, -17811, -5018, 15422, 35821, 35905, -11897, -16785, 18201, 5400, -12015, -3606, 13684, 24380, 38605, 11442, -841, -15767, -17535, 16292, 25250, 4182, -22747, 22560, 23606, 2272, -20822, -1303, 4437, -11179, -26291, -25886, 11315, 25094, 31509, 8418, 12955, 9107, 9462, 16637, -10358, -25007, -19009, -4530, 7819, 6445, -18685, -35498, -36247, -22566, -1693, 14832, 13811, 8564, 8206, 4250, -12145, -16118, -8452, 3182, -3702, -34768, -51050, -21812, -7162, 14012, 58048, 59347, 65605, 47029, 30868, 20417, 25335, 22764, 29152, 34573, 22865, -13768, 4642, 12108, -25155, -36839, 6340, -12698, -36930, -22313, -9555, -4526, 3555, 4516, 663, 14177, 8402, -23078, -37306, -28092, -13919, 375, -1551, -11088, -7230, 14356, 34460, 57779]
14492E7779q416l0764j1418l3576j5688J6525K1121Q644k4512l2956l0829J5805
14480f8285L8737o964j2334K8113j4666o901J3684J9570o948k3144Q782k835M073
14467b9118J2511K4786j6101L3654K8811J990j9541k6893p875j6523M62o3j3484
14454b7384L733J7940M758J7116K8313j1732j167n004q45n223l5225k2654R985
14441b7389m897j2885J5704O795k096J9104L5853j6883J1142J6953k1909l4940
14429a5448j2148L664l594j7728K5899L0935n009J39K631P881k230l1491k3548
14416d0047j6524J6207K5730J7921j0028j6580k3539N931J7616j630J9278J34
14404e531k452j1703O375R771L637j570K152q934n738J6821o068J5036l352k1793
$$ y = [57779, 49363, 18599, 7181, -26395, -42083, -25558, -4437, 4207, -20305, -53261, -84090, -68285, -29548, -36512, -48846, -20733, -35399, -42300, -28616, -9046, -15994, -39138, -30356, -33191, -29118, -16607, 8179, -7922, 25732, 54543, 56533, 36992, 10099, 2224, -14299, -13837, -13900, -27384, -23651, -5711, -953, 16163, 44476, 32744, 31577, 26573, 25728, 20505, -14720, -37374, -27389, -32286, -45171, -29467, -22672, -24768, -5664, 30189, 13306, 24448, 41401, 19492, -15448, -27596, -23932, -27526, -45254, -19355, 11580, 6571, 6710, 9341, 17222, 14992, -16499, -40047, -56571, -40364, -14634, 3287, -6741, -23321, -46860, -40929, -23313, -24943, -5665, -5531, -7983, -19686, -13311, -3540, 97, -1473, 679, -8255, -13993, 2828, -3240, 11796, 8444, -13349]
14390a3349N508R690L0680L6741K559k6109k2682j2859k3904k0007k139K270q181
14377d1782J0676j6041M631Q663J5559J3748l874L5582p624j4921j5968J5815
14365D464j398q215N902R867O006k0581k507J4452l2829l973l672J8741L263r245
14351a9725J2940o839j0306r948j5492N261K3442J9560k937k592J0696k0688k8719
14338d5347j1225M249L8127K2873j415O08o84k8977j2198p421J4985O770O175
14325a3480K8804K108l7371J2853r172j7323k2342J9418K450R255J0793j5880
14313b9887n332L4901K3532j8306l4258k6670K6007K2981M4781J7445Q891j7392
14301D6693m8638k9440O840P569J2117m1820m686M4573L4201m122l2356N61j5064
$$ y = [-13349, -7841, 1849, 32529, 69270, 71829, 45720, 23038, 10179, -13725, -33732, -35871, -33601, -41782, -31106, -47147, -42516, -33853, -18294, -4546, -8420, 27162, 19538, 4617, -11351, 4464, 3066, -5149, 753, 10620, 16626, -3955, -6462, 7990, -24839, -28812, -32484, -13743, -10480, -19725, -6785, -13624, -23930, -33878, -49370, -44109, -20667, -1107, -4044, -6636, 4060, -16628, -45347, -56572, -52323, -14196, 8677, 7262, 7870, 7186, -21791, -33989, -41410, -26425, -19655, -13480, 15324, 17432, -19939, -7086, -16258, -33581, -55923, -36505, -34055, -24800, -14007, -29887, -35219, -318, 23214, 4908, -29350, -56020, -30013, -7032, 37749, 55194, 64085, 46693, -1945, -31385, -24545, -16976, -4859, -46679, -51365, -6792, 27409, 23287, -9069, -8508, -23572]
14288b3572J6453m29j1549j0738R022k049o777K0910K4393l4825k9039J5827J6503
14275a5870K0793j451J4712O885j0049j5816j2183K8276K9439l3114k3036l387
14263a4801q623K3677j2069k3366K149O054K2525R197J9131L950j5873l0631l2967
14250e1647n028K8408K9343J8550k7933J1810J7412j0141J62J5341k8910k1822
14238b4455J1103k1865m594J7245J5570k936j2042j1769k7916K0914J7200J405
14226b2140L0753J1733Q660j0854k5282N176O180j3666k4647j4634j3283o03K2860
14213c9747O770N922J4840Q196r175J0399J5322J0370Q625J2138j5831j0516R091
14200B6404O838q089L373k5865m8159l0413L6607K7069k153L102j097j5465n909
$$ y = [-23572, -7119, -7548, -19097, -29835, -20813, -22862, -29639, -8729, 15664, -19161, -48200, -32373, -15870, 4923, 3472, 18184, 25069, 15020, -796, -12979, 15297, 44736, 11622, -11414, -14801, -23424, 253, -11816, -35182, -33033, -26979, -4454, 4743, 23874, 27824, 11951, -18680, -51647, -56675, -28267, 1076, 19626, -8307, 3503, 20915, 10774, 10936, 26277, -2633, -24455, -13352, -35217, -39811, -22566, -6996, -9932, -21974, -33743, -61659, -40745, -23545, -22140, 8613, 20346, 29006, 18152, -7130, -1954, 4226, -9440, -34087, -48721, -62004, -62607, -39747, -32977, -27055, -12215, -4019, -13194, -2795, 12527, 22897, 31522, 43660, 27829, 17313, 26404, 33242, 25153, 28526, 2661, -45498, -75911, -39304, -12235, -14388, -11286, -12383, -27848, -33757]
14187c3757J2510J5996L150J0811J6244l025k046K3644O732j9176J9560j9725
14175C0918j5696j686J4614L988R589P883n6241k7364J5144K1472q00O496j3188
14162d871K1563J9014j2093j8684J6602l060k7967j5118j6471k27J5356K747J8271
14149d938J734J1854K4977J9008K367J5991j0735N505j4134k6192k2525j5680
14137a2768J3639j59L560j7625J9290L6408j8965j1891J4054L045k01j8422o447
14124C518K0870J1619j7356j3469j5065p291L546j6225J868m467K033J6088K1447
14111G116k279r612k0427N945J8142l473j426K4107Q603Q097k1076p647q116q941
14097a0987n917K5853J4623m2369j5833Q835K3978k206m796K3249L0364m968k3318
$$ y = [-33757, -21247, -5251, -2101, 8710, 24954, 21929, 19883, 43527, 50259, 31083, 50643, 30918, 15222, 13536, 28150, 32138, 41727, 49610, -6631, -33995, -18851, 2621, 1821, 8317, -4871, 16692, 35706, 23613, 4929, 21531, 18471, -9496, -24614, -41085, -41312, -25956, -23209, -4938, -3204, 8650, 33627, 52635, 55002, 70993, 60258, 65763, 51629, 25437, 2912, -12768, 871, 712, 4272, -13353, 5937, 42345, 23380, 11489, 25543, 28588, 28387, 9965, 3518, 24388, 36007, 18651, 5182, -9883, -17174, -13628, -29853, -27985, -32452, -30419, -14331, 7116, 4837, -4775, -25202, -19257, -1115, -4588, -6014, 18093, 26696, 34793, 13717, 6070, -2046, -10987, -16904, 8949, 23572, -18797, -34630, -25795, -1817, -4023, -8819, 14430, 44794, 39826, 16508]
14084A6508j2344l1882j1457J0758J0559l0499j0495K7466Q831J2627M703Q55
14072d370L0126J6883k072M668l0212o706J2005o156j6316k0467J5022K9729l1017
14059h883q021J522Q337J4685J964n91j0132K5961q713l8369l1464j442K2610
14046c2536q716M940R925J5348L9835J7765j8542j2014p583J5271J444j1572j0110
14033C455p987j1492k8377q545K5195J1471j2064J3327K4254o980k9959J5932
14021a1770Q683K7825O677n971k7040N46K282j7808K8485K3392N53j3477j945
14008B0432O70j2276k4837K216J090J0689N216K2574O501N751j2223j8564k9313
13995b2074P704l1418K5436J0022m145Q267n033M404J4119K1318P253o3505m670
$$ y = [16508, 4164, -27718, -39175, -28417, -17858, -48357, -58852, -31386, -22555, -9928, -5225, -4370, 25756, 42639, 40567, 45235, 15023, 8317, 20322, 14166, -2150, -22617, -7595, 22134, -8883, -16904, -15382, -7045, 7640, 9604, 9013, -1119, 24842, 16129, -22240, -53704, -55146, -32536, -41252, -36312, -26387, -11039, 28796, 46561, 28019, 16005, 8422, 23693, 25137, 13565, 3455, -4532, -16024, -44401, -52946, -27751, -16280, -28344, -15017, 9237, 2257, -27702, -11770, -3087, 24738, 31415, 25444, -1596, -1050, 1232, -16576, 11909, 35301, 35854, 22377, 20432, 21102, 8826, -16011, -13795, -12705, -2016, 3200, 25774, 32275, 38026, 25803, 7239, -22074, -14370, -45788, -20352, -10330, -14475, -6208, -11241, -6837, 7282, 28600, 35853, -27652, -32322]
13982c2322J5854j874N316K22L4685Q511l4200l9550J4863K0703j3866l4827J6754
13969c9731N3345j843l7864j0677K5383K1567q916J7363J7548m6183k8791P105
13957c1694k042M574k9525J2520J8982J5796k0539K993R178o320P458J8596q600
13944h623j4008J3297j2968j1593J6485J0311l2606j0551K4228L2286J9088l559
13932B1787J534J5435L3707j3158k7014l0799k46k444j9593M0851J4412l4879
13920d07L951O666j3403K993m569J2477J6964L859Q830J5488j6770k8670j865
13907E544J906l3050J0230J1398K7615j1412M795J0800K5072j967r372n134k7511
13894H914j6585N364L994J3412K3076n496o78j8263k6054k192J0699K0510J1040
$$ y = [-32322, -16468, -18342, -13026, -12804, 21881, 30392, -3808, -43358, -28495, -7792, -21658, -56485, -39731, 13614, 11771, -26093, -36770, -11387, 10180, 1264, 18627, 36175, -10008, -38799, -31694, -33736, -29162, -58687, -46167, -27185, -11389, -31928, -28935, -19757, -26077, -18619, -23, -8623, -22631, -9334, -22302, -33895, -17410, -7099, -39705, -50256, -26028, 6258, 25346, 21787, 23321, 38756, 72463, 59305, 32291, 1492, 1246, -1198, -20791, 20060, 34472, -407, 3544, 10210, -3193, -200, -4769, 7708, 24672, 28531, 37361, 52849, 36079, 7409, 5544, 7450, -25600, -15370, -3972, 23643, 12231, 17026, 27826, 52898, 50931, 41559, 36425, 8914, -7671, -2307, 1687, 15099, 38175, 32679, 32001, 13738, -12316, -14508, -3809, 16701, 27741]
13881B7741J2376j775K198l793l5425q613K2755J605j4865o431o602j2503k3972
13868d7304R122K6380k78m232l3599k500r657p152M1789N7808J5272m7739j2068
13855a4158J6548L553K0506Q527M414Q48K577R675j5281k8709k9131o046J7748
13842h929K7046j3389j8355j3271j466p301J4190m982n04p668j9581O517Q693
13829c9000k1258R979M027R739k141K2817K6454n488J2200L4036K0742j0429m3684
13816A7994k6922N689j8076L696j965K0583n725L240j436M133O286k6439j595
13803b0537K2973j1305k6963n071L4922j2421n353L906J0018j77L076J7797q990
13790A875J3390k3387m214K002l674j9576R777M39J6954J0103o773O111l111l779
$$ y = [27741, 40117, 38342, 40540, 36747, 1322, -7291, 15464, 17069, 2204, -4227, -10829, -23332, -47304, -38182, -11802, -12080, -16312, -49911, -52411, -62068, -69220, -27431, 30377, 45649, -2090, -14158, 2390, 5943, 26449, 34976, 39390, 40238, 42815, 52490, 37209, 8500, -20631, -26677, -8929, 18117, 4728, -13627, -26898, -28364, -35665, -21475, -26457, -26961, -34629, -54210, -47693, -39000, -60258, -50279, -46252, -36513, -38654, -15837, 10617, 5129, 17329, 51365, 72107, 61678, 17994, -8928, -3239, -21315, -17619, -19584, 999, -4726, -1486, -2922, 1211, 7497, -18942, -20537, 2436, -8869, -35832, -40903, -5981, -18402, -23755, -19849, -9831, -10008, -6932, 10865, 1875, 15265, -8122, -12336, -10334, -14008, -33584, -23807, -23368, -6414, 3689, -3084, 3027, -84, -3863]
13776c863j7308k2870K2163O234K8656N797k127M772K7442j1317k8853J8736J0145
13763C7607j2333o093n575k4180Q187o117k7625J470m498R219O593Q669K907o516
13749a8285j7210P333M246j6330J81L3942J2910n316L718j826q707q557J4069
13736A68J9431J3764M435p593o577j0341O088J9108N91K733J1661n673k1649k2841
13722C305j4769J1230J3111j2530p003m246P488J3005P898K3997M03j3779j7177
13709A0933r671J6291L850j7785J1545P959j7286Q080J655l4188m959R844n003
13696a8735m265K9862l530k1278m218q672k7727K4380J1041J1027K1082L6699
13684D5666p273l4855J327k344k2117q909K0486K2205K285K0601m374j0100j8487
$$ y = [-3863, -21171, -44041, -21878, -15644, 13012, 18809, 16682, 21454, 48896, 37579, 8726, 27462, 37607, 25274, 19181, 13606, -10574, -2387, -8504, -36129, -34659, -39157, -29938, -23345, -14676, -11769, -18285, -35495, -28162, -23916, -40246, -40065, -6123, 6787, 1471, 5189, 3363, -5344, -13901, 168, 19599, 33363, 37798, 30205, 23628, 13287, 19375, 38483, 39074, 41807, 53468, 47795, 26146, 3305, -11464, -234, 12877, 347, -6656, -10902, -3414, 9591, 17489, 41486, 41889, 28110, 10933, 1262, 17553, 21403, 3618, 15163, 23122, 5836, 13916, 15571, -18617, -23576, -13732, -18735, -23000, 6862, 3332, -17946, -22164, -30836, -58563, -34183, -23142, -12115, 8967, 45666, 38393, 3538, 4865, 2521, -19596, -28505, -8019, 14186, 16471, 37072, 32698, 22598, 4111]
13671D111P882p521p246J5912k0720r876K2235R225J0895J8791J2268l2761l3463
13658a0268k089K1268q797M586J253o400K6858K403R694K048N35L713k8176o889
13644I739j2186p253N10K3891k6244k9123Q27P439N1510K7681j6098J3724m918
13631C9499k1656N643j343K4885Q691k2514m3089J554J1965N763j1226j5701j3019
13618c0548K7604M5032j746l631j3918j6204Q722J5857k7657l4942m823L3713
13606b541K9558K638j8094j6707L3642K8500n171j4833o269j0060J7935N002o132
13593C7468n431J9j9374j5769r607K3165L837l0227j8144O469J9450J2813J02
13580D771q003k7552Q48L429J9052K1966r153j1727k0965q824K5252J603j3829
$$ y = [4111, 11993, 4472, -2774, 13138, -7582, -17458, 4777, 14002, 24897, 43688, 55956, 23195, -10268, -12357, 8911, 114, 4700, 5953, -447, 26411, 28814, 38508, 40556, 41091, 44804, 16628, 9739, -2447, -9700, -9190, 14701, -11543, -40666, -39839, -32400, 19110, 46791, 30693, 44417, 39499, 17843, 23486, 22143, 47028, 55719, 33205, -9884, -8330, 3635, 9398, -1828, -17529, -30548, -2944, 42088, 40342, 36711, 22793, 6589, 15311, 31168, 3511, -31431, -36254, -2541, 27017, 29655, 11561, -5146, 28496, 56996, 51825, 36992, 30723, 20663, 38598, 43600, 37468, 32037, 32056, 12682, -3087, -12694, 10471, 14308, -15919, -34063, -27594, -8144, 4669, 4771, -3232, -30784, -29936, -26507, -7455, 14511, 5358, -6369, -27334, -36158, -10906, -9303, -23132]
13567b3132l373j5599K3877J5599j1617P432k3108J5180K969k0331L1525K2114
13555B1536Q579j8481k777k6211l1169J5436K4821m737J1299k176p472J0575K5767
13542B4990K2218M873j10k0905k2140j6163J6350j0166k1402j2284j4249L8328
13530a0660J6523J4752J206j8291j124k547J6428K5181j6454j6463L03K981j1147
13517F88k665j2543J358k4955p882L2610L9203J1951k2720j5823k1791J0840J6736
13504E007m31q066K175o802m93R080l529O427K0780K179J8472J596j1182n0521
13490a5308K930Q787J7886J6959r999j0508j0693j169N770n952J2655K8719k5042
13477A5035j7616j4026J3944q59m155j438R422N447j0449k464J6182j5400j0590
$$ y = [-23132, -26505, -42104, -18227, -2628, -14245, -6813, -29921, -14741, -11772, -32103, -578, 21536, 30115, 11634, 8857, -17354, -48523, -33087, -8266, -13003, -1704, -3880, -11352, -777, 24990, 47208, 52081, 51971, 31066, 8926, -7237, 9113, -1053, -22455, -34739, -48988, -10660, 5863, 20615, 21821, 3530, 2406, -141, 16287, 41468, 25014, 8551, 8854, 11835, 688, -1977, -14520, -13162, -38117, -45999, -13389, 25814, 37765, 15045, -778, -22569, -11729, 5007, 4576, -3490, -1315, -8117, -8610, 470, -3059, 3368, 24148, 26327, 44799, 46395, 35213, -15308, -12378, -3591, 14295, 31254, 21255, 10747, 54, -1115, 4655, -1297, 11358, 40077, 15035, -2581, -16607, -2663, -3522, -7677, -9115, 307, 5754, -4695, -7159, 9023, -6377, -16967]
13464a6967j083l303P320L452j7407j6414M595Q704r16K9644P238l2353J632K7276
13450A418J1494L0855K7756j4646j3114J3861j5157k1257M926J3434k3842P514
13438B3242K641k4838L380j3560j0680j7881J3896L2010J9357k7656l1748l2610
13426f4447k5929K5570K6985K706m262Q600K3483M836P337R108O196k5212j47
13413e176R892M201J2335N601P035k1837L492k625l8621l167J2320N259L654L5162
13399B7525P925l1360q575L910K1331J0039j840k0754P354K9018K3051j9094n1793
13386c263J4803k764k3757k9290R209J4312q29L473k2444J1693J3820L4305L2276
13373E1544l352l8250k2007J440Q755q388j5778J5611J4117O759k3273k0073L318
$$ y = [-16967, -18050, -21353, -14033, -10581, -27988, -44402, -39807, -31103, -32019, -2375, 4863, -27490, -25858, 1418, 12912, 43767, 71523, 56877, 43763, 57624, 42467, 21210, 26136, 39570, 15728, 23242, 25883, 1045, 4425, -9135, -19815, -37696, -23800, 8210, 27567, -89, -31837, -64447, -90376, -64806, -37821, -35115, -39377, -30777, -7294, -2458, 4879, 13987, 20183, -5029, -5176, 4716, 8917, 21252, 26853, 33888, 12051, 15543, 12918, -25703, -28870, -16550, -11291, -7637, 27525, 35450, 4090, -4485, -575, 20756, 30795, 28955, 8201, 15555, 44573, 67624, 48530, -3263, 11540, 8776, -14981, -44271, -35062, -20750, -21579, -18106, -40550, -28857, -15037, 19268, 51544, 48192, 9942, -12065, -10625, -1870, -10258, -26036, -10425, 3692, 10451, -12822, -32895, -29577]
13360b9577K9162L8003o094l0142j9926j8737q135J8312M4560J7716J0153k590
13348D2705L593o570k4902q603J9894n269j1561J1037L040L015J2603n211j6350
13335A7421r199K9835k5004m3383j9670L8140N927k2695j1634L3374K6173O958
13323B6243J0260l3528K0701R434k3620j5356K1125q559q852k847J3167O95k5748
13310a6885m590o672Q645O9p795m699Q854J5610J8269j5519P935L33J9257J3697
13296C6509m450r318R65J4210j1048j0749j0118l3546J647K0976J5638L4072K468
13283D7256K3740L20k1459m4765J985m946n794K730K2149Q491k8001j4980J5355
13270B081J6219m636J7124J1913j2488P927q948j1023K5774R408q302q858j8122
$$ y = [-29577, -415, 37588, 31494, 1352, -18574, -37311, -45446, -27134, 17426, 35142, 45295, 42705, 46298, 39728, 14826, 6223, 26117, 20848, 9287, 20324, 23364, 26379, 38982, 33771, 17421, 8222, 38057, 13053, -30330, -50000, -11860, -5933, -28628, -40262, -6888, 19285, 26243, 36503, 2975, 23676, 33110, 9490, -5866, 15259, 6700, -2152, -4999, 8168, 8863, -16885, -21475, -28147, -19502, -19433, -27228, -31927, -23073, -7463, 10806, -4713, 3222, 3555, 22812, 36509, 32059, 22741, 23706, 37916, 26868, 16119, 6001, -27545, -25898, -4922, 10716, 44788, 47256, 70996, 71316, 49857, 5092, 7077, 2131, -3663, -933, 21216, 29707, 1706, -13274, 2081, 18300, 13664, 30788, 42701, 30213, 38140, 29192, 18169, 43943, 53351, 45049, 36191, 18069]
13257A8069l6806m472O553J1797K0291J8508K7903p078m0588P505J3538n97J0502
13244D5125J201J2921j2858J8j0383k284P721K12q243l347j3921q617k615n310
13230c80L2556L6239r439l6325k7214k4011j40r694j2580j1100M7102L9959q948
13217A6025j0290j351K6787Q144O632O54J1687P635M721j0708l1163o903J7136
13204C9006R593J2129K5410r725m3314j6926K4059M273J981p727N494r995l563
13191C0695K994n703j5137o054j649j1421J3546R759M0930j1420k0925r056L962
13178B0521R222J2186j5662m074p391l8591j716N111J2666J8937L5327j3356J3844
13165D7024j0983o931M407J2610k2492p289j6373l466J3021L137K068J4343m419
$$ y = [18069, -18737, -23209, -16656, -4859, 15432, 33940, 61843, 54765, 14177, 21682, 35220, 34623, 45125, 46326, 59247, 46389, 46407, 36024, 33740, 41461, 41673, 33430, 30083, 16162, 7545, 4930, -380, 32176, 68415, 58976, 22651, -4563, -28574, -28714, -38408, -50988, -62088, -14986, 24973, 16025, 5735, 4384, 31171, 39315, 45947, 46601, 58288, 65923, 70644, 59936, 28773, 21870, 39006, 48599, 60728, 86138, 76413, 33099, 16173, 40232, 44505, 46486, 38759, 44253, 34258, 30695, 33689, 27986, 12849, 6795, 5146, -6275, 7271, 17030, 57960, 46540, 25615, 16559, 20521, 29743, 41929, 26267, 22193, 14802, -23789, -25505, -20394, -7728, 11209, 46536, 33180, 47024, 36041, 29110, 33517, 46127, 23635, 16346, -27, -3493, 9528, 12665, 14733, 29076, 24657]
13152B4657j2491l658J1715k7068k198K6620N2811K2742M794l3080R135N613k1743
13139E7849J7718J0625Q195m138P10j4744j3874j5849P051M942j0773p37j6520
13126C0455J1783n10N213j0971R061K4143J8484J6196j0009j7176J6459o152K517
13113H9493p689j5996l5286k5790N14Q695L6937p263j2390K688L955l8349j6353
13100a6834J653O459M0722K2417J1778Q171o346k873k9208k4281L4918J6764N561
13087F8901L483Q457o144k5452K5674N7231L3556J7455L030l6083p488l3640n8533
13074E0447k2019j1606J1843M1528K3498j7136J8740M1661J4646J2163K1772M7273
13062B32810Q2592J31673K43348L24057K49672J51153J06073L9488j13598j82914
$$ y = [24657, 12166, 8508, 20223, -6845, -9043, 17577, 70388, 93130, 97924, 64844, 73979, 79592, 57849, 75567, 86192, 94387, 90249, 90959, 76215, 62341, 46492, 53543, 58485, 47712, 46975, 30455, 42238, 41728, 46941, 35970, 45031, 69174, 87658, 103854, 93845, 76669, 93128, 86976, 89493, 81804, 65808, 30522, 4732, 5246, 13941, 50878, 43615, 31225, 33913, 37868, -481, -16834, -15181, -8722, 32000, 54417, 66195, 74366, 68020, 65147, 35939, 11658, 46576, 63340, 68901, 72384, 80841, 74697, 49245, 74919, 132150, 165706, 183161, 186191, 150108, 142620, 108980, 50447, 28428, 16822, 28665, 70193, 93691, 76555, 95295, 136956, 151602, 163765, 185537, 232810, 315402, 447075, 690423, 1014480, 1264152, 1415305, 1521378, 1560866, 1447268, 1264354]
13052A264354k03364j77985j32042o2304l6209l4409o6149r0136o3717o6485m0441
13041B91113l0977m8665k4813k2713k5136K602l1617N903o976k1454l1355j7672
13029C8240o59Q178K912N402o897O715j7690j4281J0344N85l2907k5859k3518
13016d9435j0175R702K925L2123K3101j2041l019P206j8768k0890k2187j1330
13004g2788Q540O173J192M408J4881j4530l2969j0474j3597M5850L1602r895O043
12991c5564L7619N844q864m061J8819J851j5778k5699j6386J6160J0022J4469
12979a568J3064r203j51L3439R871j6456k6923k6930j0199K6702M8770J2149J6343
12966F8908k4983k8430J9270K3766j1838j3801Q031K0050K0424Q379m132k5566
$$ y = [1264354, 1060990, 883005, 750963, 688659, 652450, 618041, 551892, 461756, 398039, 331554, 291113, 260136, 211471, 186658, 163945, 138809, 141411, 109794, 115697, 108721, 87267, 55912, 38240, 37581, 45759, 48671, 54073, 47176, 53891, 36201, 21920, 32264, 32849, -58, -25917, -49435, -59610, -49908, -46983, -14860, 8241, -3800, -6819, 387, -18381, -39271, -61458, -72788, -64248, -58075, -56883, -52475, -37594, -52124, -85093, -95567, -109164, -63314, -31712, -41607, -35564, 2055, 7899, -965, -5026, 13793, 15644, -134, -25833, -42219, -26059, -16037, -1568, 11496, 2293, 2142, 35581, 45452, 28996, 2073, -24857, -35056, -8354, 40416, 52565, 68908, 43925, 15495, 34765, 58531, 46693, 32892, 40923, 60973, 81397, 89776, 85644, 60078]
12954F0078j8948l3863K782J9337K9312J5714p133j6159J100J1704L193j2847
12942E4270J2300J5986r311l08m869j169l318J8568L4860k0242m4170J5025J7581
12929H5203L6126J978o212N7414L3252p878m1497k8644r632K600l5245k8085j4026
12916D5354k473j3232j099L7557M294j7242J514o493j5914k2139J3307P464l5961
12903e063n959p903R6N566O145l263l125m832M684K0140p527J6919j4320o919
12889e361L1126k0614J1779K6658J2667r907k5902J8290K7175j8422J8964K5943
12877I2396k4735k6058P972K9313k2589J0866M7345J0433L4645J5252l9213R1985
12865B27612Q3653k6466L2292N2221o9798o7972k948k1888o1610k8750k9458j709
$$ y = [60078, 41130, 7267, 10049, 29386, 58698, 74412, 67279, 51120, 52220, 63924, 67117, 54270, 66570, 82556, 73245, 72937, 68068, 66899, 63581, 82149, 117009, 96767, 52597, 67622, 85203, 121329, 123307, 117095, 174509, 207761, 199883, 158386, 129742, 120110, 122710, 87465, 59380, 45354, 42881, 29649, 28550, 66107, 70401, 53159, 54673, 48180, 32266, 10127, 23434, 30898, -5063, -11022, -18925, -18829, -13263, -7118, -10381, -13506, -18338, -13654, 6486, -1041, 15878, 1558, -5361, 25765, 5151, 16930, 43588, 56255, 46348, 20446, 38736, 65911, 47489, 66453, 92396, 67661, 41603, 49575, 78888, 56299, 67165, 114510, 124943, 159588, 174840, 135627, 227612, 311265, 284799, 317091, 369312, 299514, 231542, 228594, 206706, 145096, 116346, 86888, 85179]
12853H5179j5835l5947k1830k2281l8357j9971J7722k127J7638J240j2964m893
12841e2426p808r581k0707M561m585J0760J4331R098r454k601J2374O695L6352
12828a2991r800K9668J7416k3725k3714J9415J6368J2861k3042L0742K4639j4025
12816D3812j6619N437O151k3174k5195n4548j4234J173k3713j8144O301L2027
12804h0726R9579J50578J72549J40757J89275J69943N7106l545l6003o6989r9023
12793F93501j09372p2925m3799m9635l723m2613m0532J574J1082O876M848K0640
12781C75922j8788k8835N50O597M5661m097j2062n712L3322J1498L8281J28500
12769E70837J35301K4129M5844P9944J6962n4192p2507j10976r7492m7462j9646
$$ y = [85179, 69344, 33397, 11567, -10714, -49071, -69042, -51320, -53447, -35809, -34569, -47533, -52426, -60234, -69815, -90522, -85961, -90546, -79786, -65455, -56357, -65811, -68412, -56038, -49343, -12991, -22791, 6877, 24293, 568, -23146, -3731, 12637, 25498, 2456, 33198, 57837, 43812, 27193, 32630, 38781, 15607, -9588, -64136, -78370, -77197, -100910, -119054, -112753, -80726, 18853, 169431, 341980, 482737, 672012, 841955, 899061, 895516, 859513, 792524, 693501, 584129, 511204, 467405, 417770, 414047, 371434, 330902, 332476, 343558, 350434, 355282, 375922, 357134, 328299, 328849, 335446, 381107, 377010, 364948, 359236, 392558, 404056, 442337, 570837, 706138, 730267, 776111, 856055, 873017, 818825, 746318, 635342, 537850, 490388, 470742]
12758D70742j5457j7635k5698m8353m5236n4447o3899k2815k1919m8308j4444
12747I2531k8295l9010k118j93O1224J9129K4501M4354J01922K06349J71727J71065
12735H23186J99218K03935J07307J9900l5683n1839m1248p1534o1602o1625j8821
12724A011194j7915j5369l1279k7071m3027l1851m7615k0670l821l1506j7836
12713G23234L1677K9929K3511Q221J7364J5443J5387P27j052Q413R193k0799j7717
12700H43531o3004n8298l7886K0659j3725l821P4421N9134Q859J500M073r931
12688H25512J8992K0548p880N944Q399k1265l5399q467l6302k3500j7051l1652
12676F97879n2237j5440L2565M974p72N6806K3455K8363N5151N0225J27523J28505
$$ y = [470742, 455285, 437650, 411952, 363599, 318363, 263916, 200017, 177202, 155283, 106975, 92531, 64236, 25226, 23108, 22915, 84139, 103268, 127769, 172123, 274045, 480394, 652121, 823186, 1022404, 1226339, 1333646, 1353546, 1317863, 1266024, 1224776, 1153242, 1091640, 1030015, 1011194, 993279, 977910, 946631, 919560, 876533, 844682, 797067, 776397, 772576, 741070, 723234, 754911, 784840, 808351, 816572, 833936, 849379, 864766, 865493, 864441, 872854, 882047, 861248, 843531, 780527, 722229, 684343, 705002, 691277, 687456, 761877, 821011, 829870, 831370, 835443, 825512, 844504, 865052, 857172, 863116, 871515, 850250, 814851, 806384, 770082, 746582, 729531, 697879, 645642, 630202, 662767, 667741, 666969, 723775, 747230, 775593, 830744, 880969, 1008492, 1136997]
12664A136997J28607J27889R9106P9100Q0909Q0200P0603O4456L9642K3401Q2488
12653B013398R5100M9234N4461R9844J31119J23625R0118P9947J07981J02050
12643B946877J21947J96542K03736J46570K18574K74868J08536M9817K19306L09265
12633D796038K52054K49480L92968N70377P57488R76512J174839J598244K019676
12624A2787676K168999K269148K369978K676969L583112M927683P178611J1634210
12616D9596386K0311009L6636407N8757391N6134949K8035627K2829732K1239873
12609B93541374q463752l0962029l7757446l6216496k7055316j7262656j2924277
12602A22899402j3300290j1004030q492347j0666589j1595199r166919o814592
$$ y = [1136997, 1265604, 1393493, 1492599, 1571699, 1652608, 1732808, 1803411, 1867867, 1907509, 1930910, 2013398, 2108498, 2157732, 2212193, 2312037, 2443156, 2566781, 2656899, 2736846, 2844827, 2946877, 3068824, 3265366, 3469102, 3615672, 3834246, 4109114, 4217650, 4267467, 4486773, 4796038, 5048092, 5297572, 5690540, 6260917, 7018405, 7994917, 9169756, 10768000, 12787676, 14956675, 17225823, 19595801, 22272770, 25855882, 30783565, 37962176, 49596386, 69907395, 106543802, 165301193, 221436142, 249471769, 272301501, 293541374, 285077622, 254115593, 216358147, 180141651, 153086335, 135823679, 122899402, 109599112, 98595082, 90102735, 79436146, 67840947, 58674028, 51859436]
12595E1859436n386390m540208l976504l368265k902781k791734k671990k215402
12587B4006162j968991k056193j945782j576397j310034j207663j070274r60896
12579A1909932r36840q23257p49809p34494p10618n94798n17071m59133m09699
12570E974213m18935l87645l18522k95076l13008k39625k01090k43528k18797
12561C337987j72200j14183j01098j26226p2126l0806m6385l9148k4198m8540
12551B563077p0197j07542j10776r0060p6029n6898l8615o8268o3297r8114j15488
12540A667793j38493j14289j04273p5128j30109j12535j05961r9025r9889o3703
12530F24388n9383n4534O89K5364L9165J4033M0360K3323j06801j23465p9242
$$ y = [51859436, 46473046, 41932838, 37956334, 34588069, 31685288, 28893554, 26221564, 24006162, 22037171, 19980978, 18035196, 16458799, 15148765, 13941102, 12870828, 11909932, 10973092, 10149835, 9400026, 8665532, 7954914, 7360116, 6843045, 6383912, 5974213, 5555278, 5167633, 4849111, 4554035, 4241027, 4001402, 3800312, 3556784, 3337987, 3165787, 3051604, 2950506, 2824280, 2752154, 2721348, 2674963, 2635815, 2611617, 2563077, 2492880, 2385338, 2274562, 2184502, 2108473, 2051575, 2012960, 1944692, 1881395, 1783281, 1667793, 1529300, 1415011, 1310738, 1235610, 1105501, 992966, 887005, 787980, 688091, 624388, 565005, 510471, 511160, 536524, 575689, 589722, 630082, 653405, 546604, 423139, 343897]
12519C43897m5673k2424n4062m0217j6206k2778m7041m4020J4433N960l0655j4221
12507B6993j3902J105k479l3148k7279p934k6085j12O852J2390R198j369n1776
12494a07546p4741q6568j29499j36374j69164j70116j35532k7077J03360J03887
12484h29370Q4948J76613K37526J60000R9534N0496K7602P5560L0148N2199N8764
12473B24020M2694L9029L0940K0526K172j9259k3892l8150l9286l6582j0839R115
12461B00488k1726o0389r4813j76845j62416m5984l9425m5431N4544O5615N1056
12450b75326N8631L0062L4504j4551j0298K4446K4119J4685P302K359M544J6279
12438h3244K2609K4980j5369J3391K6792q51l4531m7413m5128k8540q4084j03236
$$ y = [343897, 298224, 275800, 221738, 181521, 165315, 142537, 95496, 51476, 65909, 71869, 41214, 26993, 13091, 14196, 11717, -21431, -48710, -56644, -82729, -82841, -75989, -63599, -54401, -55770, -107546, -182287, -268855, -398354, -534728, -703892, -874008, -1009540, -1036617, -933257, -829370, -744422, -567809, -330283, -170283, -70749, -20253, 7349, 82909, 113057, 165256, 224020, 266714, 305743, 336683, 357209, 359381, 340122, 316230, 278080, 238794, 202212, 191373, 200488, 178762, 118373, 23560, -153285, -315701, -361685, -401110, -446541, -391997, -326382, -275326, -216695, -186633, -152129, -166680, -176978, -152532, -128413, -113728, -106426, -104067, -99523, -83244, -60635, -35655, -51024, -37633, -10841, -11692, -46223, -93636, -138764, -167304, -251388, -354624]
12426c54624j52878j34580j07660j7671K8937M6693J15609J81867J62328J62051
12416f9928J64554J65160J30427P0236K3612P600j7931l9065p8052n1671l707
12405C01235j4861l3523j9836k3452m153j3118j5793J6924K4899K236j6577j5477
12393A88504j5108J8648P877Q490j4357N38K9041J2544o737N1710M3864k6707
12381B98307l2909k3984k4961r504p557M810K2188L2037K2993J9210K2360L9724
12369C62714J4928J8549Q693j1497j340k4698j5159m2912m2967k4313l7591l0296
12357A74111o498k6159K3009J3761m7047n656K3960K0414k7355o0754P674K7570
12345A17030j9694l139j0880L0071M4178J4797L2250L6673l560K4296J1091L1125
$$ y = [-354624, -507502, -642082, -749742, -767413, -738476, -691783, -576174, -394307, -231979, -69928, 94626, 259786, 390213, 460449, 484061, 491661, 473730, 434665, 356613, 304942, 301235, 286374, 252851, 233015, 209563, 205410, 192292, 176499, 193423, 218322, 220558, 203981, 188504, 173396, 192044, 199921, 208411, 194054, 194592, 223633, 236177, 229440, 281150, 325014, 298307, 265398, 241414, 216453, 206949, 199392, 204202, 226390, 258427, 281420, 300630, 322990, 362714, 377642, 396191, 404884, 393387, 392047, 367349, 352190, 309278, 266311, 241998, 204407, 174111, 167613, 141454, 164463, 178224, 131177, 125521, 149481, 169895, 142540, 81786, 89460, 117030, 97336, 94197, 83317, 113388, 157566, 172363, 204613, 241286, 237726, 262022, 273113, 304238]
12333C04238K9202M0143J8644K7658j4872j7800k1341P823J1649m1180l6086j4744
12321B93334j598k677J76l1885K4928K7316k3168k0057j0524q67M83j9987m2229
12308A93245m509m521J3406R91l408j0108n9908k7107j677j821l2070j5843k390
12295D4280K3943J7901J735J9906k146P024l748j4641k255m652k0759k4562j137
12282D0889K7703J5826n728M683j6499k2577j7184K0690o300j1702n556K1414
12270D5659K0443K120J5780j1200k7538k7306N924J846N719L030J3565R76l1159
12257A7859k3033L829K2853M767L8119R706j0557k3058J4068K1262q879l1639
12245C5297J775L8716R752l799K0324Q727k318k1760q357P323J6956n126n3472
$$ y = [304238, 333440, 373583, 392227, 419885, 405013, 387213, 365872, 373695, 385344, 344164, 308078, 293334, 291736, 289059, 289235, 257350, 282278, 309594, 286426, 266369, 255845, 254978, 255461, 235474, 193245, 188736, 184215, 197621, 198612, 195204, 185096, 125188, 98081, 96404, 94583, 62513, 46670, 44280, 68223, 86124, 87859, 107765, 105619, 112643, 108895, 94254, 91999, 87347, 66588, 42026, 40889, 68592, 84418, 78690, 83373, 66874, 44297, 27113, 47803, 41503, 29801, 24245, 45659, 66102, 68222, 84002, 72802, 45264, 17958, 23882, 25728, 31447, 34477, 48042, 49018, 17859, -5174, -1345, 21508, 26275, 64394, 74100, 63543, 40485, 54553, 75815, 66936, 35297, 37072, 75788, 85540, 81741, 102065, 110792, 108474, 86714, 78357, 85680, 102636, 97510, 44038]
12232D4038k9337J7632p68J0607L3231L0828j360k6521o456o66l6397n105L7239
12219F6965J3694K8818P258O529j2437m705o381J671J0197l4988j463J3797L797
12206I2752p899M787L556K3134J251l0955j7468l1722o722M3744K0520L3809n301
12193A23486k5472l1901j8084J2585J4955K3716N913l2669p642J6746J0400m310
12181H7723l855o625q411l701k1886k3166K8634L4053J320L7821R87J6200l515
12168A35579n698K3792m981O4855J03641J31141K46325L11075K00008J54739J36086
12157A496562M4501j17937j82234k30991j76791q4750l1519n5186l8161m4625
12147E78869k5629r1669j05544q4543o8035n1833k8115K151O623p86j8896m0522
$$ y = [44038, 14701, 32333, 31565, 42172, 75403, 106231, 104871, 78350, 71894, 71228, 34831, 29726, 66965, 80659, 109477, 116735, 123264, 110827, 106122, 99741, 101412, 111609, 76621, 75158, 88955, 92752, 84853, 89640, 93196, 116330, 117581, 86626, 69158, 37436, 30714, 74458, 94978, 128787, 123486, 98014, 66113, 48029, 60614, 75569, 99285, 105198, 72529, 64887, 81633, 92033, 87723, 83868, 77243, 68832, 65131, 43245, 20079, 48713, 82766, 84086, 121907, 122894, 139094, 135579, 129881, 153673, 148692, 213547, 317188, 448329, 694654, 1005729, 1205737, 1360476, 1496562, 1541063, 1423126, 1240892, 1009901, 833110, 748360, 716841, 661655, 623494, 578869, 553240, 461571, 356027, 271484, 203449, 151616, 123501, 125652, 132275, 131489, 112593, 72071]
12135G2071J2203j2295j658p007O654Q403m880n518m670K591R402J982n164J068
12121G3182L1507J1549l3717j3845n565m2535k7706M500J452K680j201R273j8129
12108h555k4644j1180L3289L4541N067j5573j1509J1305J6335j6059m293j1453
12096b729j7480m197K6387l274O241K2175L70k8286J1391r786k3687j7398q605
12083d8878l0448J423j303R982M231K1670J2410p955L1509j996K7536j0283K718
12070A0616J2814k2409r708p149L923k4396J3500L7130P703j4165O952J3101J2634
12057D0546K0150R251m327j4516p224O568P975k9921k6516R00J9790r924k2069
12044i317P522M066q66j928m2332J1713J2947K795K8817L287M719k050K6805l807
$$ y = [72071, 84274, 71979, 70321, 63314, 69968, 78371, 73491, 67973, 63303, 65894, 75296, 77278, 72114, 73182, 104689, 116238, 82521, 68676, 63111, 20576, -7130, -2630, -1178, 1502, 301, 9574, -8555, -33199, -44379, -11090, 23451, 28518, 12945, 1436, 12741, 29076, 13017, 8724, -2729, -20209, -24406, 1981, -1293, 4948, 27123, 27493, -793, 10598, 812, -22875, -40273, -48878, -79326, -77903, -79206, -69224, -64993, -43323, -30913, -38868, -7359, -9355, 18181, 7898, 10616, 23430, 1021, -8687, -15836, -11913, -36309, -22809, 14321, 22024, 7859, 14811, 27912, 40546, 60696, 69947, 65620, 51104, 43880, 50448, 58423, 28502, 1986, 2886, 22676, 12752, -9317, -1795, 2271, 1405, -523, -42855, -31142, -18195, -15400, 13417, 16704, 21423, 19373, 46178, 42371]
12030D2371k3327N084p129K0851j639j1757l273R451p098N43K724l825j1887j083
12016A0006J8838j2641k0890j4554m95j630j6637j2932K1660O073L5802k3476
12004a0876M831J4234p050k4657j8594J3029L733j6561j4286J0730K6013K875
11992a6579o483K4928J994j3888J1692j6873R163k7252K5154J1438k1783K694
11980a5795J4285P56j5789j8428J1517J0037k3223K924j081k1681J6306L1012
11968i160J199j9339n185J7725O5098M425l1788j3907p69O633J1521K30j7848
11955H835j1426r425j2275k3568R938j620j7719J0643M24p502j0717K4817J8678
11942b0917L027r766Q198J9562r023q038K934P331j4689k797J3297j2804J5j4239
$$ y = [42371, 19044, 24128, 16999, 37850, 36211, 24454, 21181, 30632, 23534, 24077, 26801, 22976, 11089, 10006, 28844, 16203, -4687, -19241, -19736, -21366, -38003, -50935, -29275, -23202, 12600, -10876, -6045, 8189, 1139, -23518, -42112, -29083, -25350, -41911, -56197, -45467, -19454, -16579, -23062, 1866, 3860, -10028, 1664, -15209, -6046, -33298, -8144, 3294, -18489, -15795, -1510, -754, -16543, -34971, -23454, -13417, -36640, -33716, -34797, -56478, -40172, -9160, -7961, -27300, -32485, -14760, 50338, 54763, 22975, 9068, 8299, 14932, 26453, 26683, 8835, -2591, -12016, -24291, -47859, -37921, -39541, -57260, -46617, -46193, -53695, -64412, -39595, -20917, -17890, -27656, -19458, 104, -8919, -16957, -14023, -6692, -21381, -24178, -10881, -23685, -23670, -37909]
11928c7909j2903J4044O786j651K7146r862j7157N770j287j0552J3064M6251J2773
11915C4513k671j6353j3037k521L824O427M729K123j0752k0567j6735Q834M31
11902b1755K384r911K0259Q573J6681J2324n1913j6090O334K1976K5478O171L998
11889B4509J2605K084k7181K3323Q05l6929m3583J9580Q028m254l108J7296J903
11876d922j8523j7774J343J5096j8016J8816K7429r567j4526k9639o415K5323
11864c1375K3129j0306j0404r04r008j569m108p319K1840J6207J1162k686J5051
11851I710Q706J591j7280k9773j8601J7145J8753O049j6723m173p060J797M584
11838b5275L468j3129o645l779j8668j860J2541r753Q513J6780J3772K5257j3735
$$ y = [-37909, -50812, -36768, -29982, -31633, -4487, -14349, -31506, -25736, -27023, -37575, -24511, 21740, 34513, 31842, 15489, 2452, -69, 3755, 10182, 14911, 17034, 6282, -14285, -31020, -22186, -21755, -19371, -29282, -9023, -450, 16231, 28555, -23358, -39448, -33114, -11138, 14340, 20511, 24509, 37114, 39198, 12017, 35340, 36145, -784, -44367, -24787, -16759, -21013, -24121, -6825, -4922, -23445, -41219, -39876, -24780, -42796, -23980, 3449, -6118, -20644, -50283, -56698, -31375, -8246, -18552, -28956, -29860, -38868, -40437, -44545, -51864, -30024, -13817, -2655, -5341, 9710, 18416, 20007, 2727, -27046, -45647, -28502, -9749, -3700, -20423, -24596, -31656, -29859, -25275, -21807, -34936, -41581, -45360, -64028, -65888, -53347, -63100, -54587, -37807, -24035, 1222, -12513]
11825a2513p707K5474K5089L905j3016j5762J8682j0095j4071N156J0863j0611
11813E394n183O819L3821K8617k0108k8249M332l4386J4752m439n519O637j340
11800A148R930j4686L854K0412J8195l017j9563p629j6128p380R25L529L530L3494
11786B6614J0311l1890p25j981Q338k0970K806Q995m066o250m792L363l885r289
11772b3421k3843K1245P807l4859K0278J9071j155l874m1018k0774P396J9898
11760e3249n341J9036Q246N055M238K8197P584K517j5306L681k48j4453j7893
11747b7936O577K3134J6373l3319j410J5419J6340J2869L356j1470l2628N070
11735g625k0772l2552K4978M690j9707J4977K4792Q91o652k462M979K4187K3498
$$ y = [-12513, -20220, 5254, 30343, 34248, 21232, 5470, 24152, 14057, -14, 5142, 16005, 5394, 211, 7030, 40851, 69468, 49360, 21111, 25443, -8943, 5809, 1370, -4149, 2488, 1148, 11078, -3608, 246, 20658, 38853, 35836, 16273, 8644, -7484, -14864, -13939, -10410, -6880, 26614, 36925, 5035, 4310, 2329, 10667, -10303, -7497, 1498, -2568, -8818, -13610, -10247, -14132, -23421, -47264, -26019, -18212, -53071, -32793, -13722, -14877, -18751, -59769, -80543, -73147, -53249, -58590, -39554, -31308, -26253, -22015, 6182, 13766, 16283, 977, 4658, 4410, -10043, -27936, -21359, 1775, 18148, -15171, -16581, -1162, 15178, 28047, 31403, 19933, -12695, -7625, -28397, -60949, -35971, -31281, -50988, -36011, -11219, -10328, -16980, -19442, -14463, 9724, 33222]
11722C3222r830j5221J604j0752J5363j0823J5771J1836k1803k4793K3369K1221
11710B9164j2718J4079K0209N974l5159j6331k7956j3427J5161J197l71J2988
11698g190j1011p457K8743P631j4440k975n608O308L373K2171J6150J4382Q482
11685E8559j6636N664o894r871o202m395r763k9426j1268J723k6471O944J996
11672d6040J1503J6192q569K5566o040J1769R715K404K119p634J5393j3195j108
11659A2075J5489n344N959K679k688j6329P27j6727o131K5578K3228k5814j7681
11646d979J067p260L3251L0022K824K2536m731L44j6200l1145l5417j3950J8199
11633e439J0689r487k0976j6452J4418J5043m832J8756R55k6512r352K9070J3377
$$ y = [33222, 23392, 8171, 9775, -977, 14386, 3563, 19334, 31170, 9367, -15426, 7943, 29164, 16446, 30525, 50734, 56708, 21549, 5218, -22738, -36165, -21004, -19807, -20178, -7190, -18201, -25658, 3085, 10716, -3724, -6699, -12307, -5999, -2626, 19545, 35695, 50077, 58559, 41923, 47587, 40693, 30822, 24620, 20225, 10462, -18964, -30232, -28509, -54980, -48036, -46040, -34537, -18345, -26914, -1348, -7388, 4381, 14096, 16500, 18619, 10985, 26378, 13183, 12075, 27564, 22220, 28179, 30858, 28170, 11841, 12568, -4159, -10290, 15288, 38516, 12702, -4979, -3912, -11172, 22079, 52101, 54925, 77461, 72730, 73074, 56874, 25729, -9688, -23638, -5439, 5250, -4237, -25213, -41665, -27247, -12204, -17036, 1720, 2675, -23837, -33189, -4119, 9258]
11620I258j30j3967n170K996N110r282L469J8196K470m355K1117J2531m21k602
11606C9220R858j4540m8970J954n100l6923k0633J6548L6406P450J2583L1756
11594B9609K1939m1334p047R885J8478J380k2586j6579l1144K7649O764k7903
11582c0889J5356K32j8204K304k9734j2843L5212P370l904q939J0504o81K0176
11569a4040K8831k057l189j7080P959J934k0615J4484J7084Q159N428j6624j1920
11556a646K4011N752m661k0126j7169J192m286j4754J5416J5846k908k7304k6666
11543e7303k0207J2783l719n289J4506K9462R004m519N084Q204K7243J8043r146
11530B4146k0586j533J017m455R178L2267j3664l7306j1890j8823J0428K8778
$$ y = [9258, 9128, -4839, -10009, -7013, -1903, -11185, -7716, 10480, 12950, 8595, 29712, 42243, 41822, 39220, 49078, 34538, -14432, -12478, -17578, -54501, -75134, -58586, -22180, -14730, -2147, 29609, 51548, 10214, 3167, 13052, 31530, 32910, 10324, -6255, -37399, -9750, -2986, -30889, -15533, -15301, -33505, -31201, -60935, -73778, -38566, -31196, -35100, -44039, -33535, -34216, -14040, 14791, 12734, 9545, -7535, 424, 2358, -18257, -3773, 13311, 21470, 26898, 10274, -1646, 22365, 28117, 23456, 3330, -13839, -12647, -16933, -31687, -16271, -425, -3333, -30637, -57303, -77510, -64727, -68446, -73735, -59229, -29767, -20763, -25282, -20198, -11994, 15249, 33292, 24146, 3560, 2027, 3044, -1411, 7767, 40034, 26370, -10936, -22826, -41649, -31221, -2443]
11518b443L2367j49k1760m410R033J5257K0266k3324j2061j2210k8449j4078K4237
11505a7724J9445j6820j5424n955k437R808L4716k6308j6525r233J862J6005j6374
11492d4964m604L0877K2111j928J8520J5369N590k6186Q068q991j0777m170J2018
11479A0933J2239J2215k3635K464K1153j2508j5615q134j7084R307J3950K1829
11467B7114o44L280q950O629j3405n333J1952J2608K3210L0054n8590m3012l01
11454a5388J5860j6800j2186J0972k5220P780M4923P828L310p946P475J0131k2084
11441H655k8493l5223J792J7872J4845K121n401j3510j5928J0103J0600j1289
11429d3856R472L1029j683k515L752K058J977L5446P390k0303k16L090j9484o456
$$ y = [-2443, 29924, 29775, 8015, 3605, 12638, 27895, 48161, 24837, 12776, 566, -27883, -41961, -17724, 1721, -15099, -30523, -36478, -38915, -29107, 5609, -20699, -37224, -46457, -44595, -28590, -44964, -49568, -18691, 3420, 1492, 20012, 35381, 40971, 14785, 22853, 13862, 3085, -1085, 10933, 23172, 35387, 11752, 14216, 35369, 22861, 7246, -888, -17972, -8665, 5285, 27114, 26470, 29750, 20800, 27429, 14024, 8691, 20643, 33251, 56461, 86515, 27925, -15087, -15388, 472, -16328, -28514, -17542, -42762, -34982, 9941, 17769, 21079, 13133, 20608, 30739, 8655, -19838, -55061, -53269, -35397, -20552, -18431, -23832, -37342, -53270, -43167, -32567, -43856, -34384, -3355, -5038, -7553, -3801, -1743, 234, 35680, 43070, 22767, 22551, 25641, 6157, -299]
11415b99j1984Q67k92Q355j3767K952j5012p372K6129K239J9582j908k5449j2073
11401b8032n58j2271K1867j663j494J1962J1942m921L3112J1889k1485l6224k589
11388a8465K9837J5522L9221J6815j0995j1093l630j5995L867j2350n675k8055
11376i96k0181N584K3979J3754j7640K5941J5631l1203l2685N921L845l0140L2779
11363e411M423nJ1045q428k1302K7743J3206k5128k3108M205K6116j0804p321
11350a4769n79N455l035j0348m0748J4791K5388j6941j5653J8427J7691K7445
11338G124O338k8388K066J9447R8q727J0763j0654m60j1280k6757q183K5707L300
11324a9606l5958J0060P430R189N643J0112K0507K2249k4633l5098k659O804j7151
$$ y = [-299, -12283, -11416, -11708, -3353, -17120, -14168, -29180, -36552, -10423, -8184, 11398, 9490, -15959, -28032, -28590, -40861, -18994, -20657, -22151, -10189, 1753, -3168, 29944, 41833, 20348, -15876, -18465, 11372, 26894, 66115, 82930, 71935, 60842, 57212, 41217, 45084, 32734, 27059, -996, -21177, -15593, 8386, 22140, 4500, 30441, 46072, 14869, -17816, -11895, -8050, -38190, -5411, -988, -993, 10052, 1624, -19678, 8065, 21271, -3857, -26965, -22760, 3356, -7448, -14769, -15348, -9893, -12928, -23276, -64024, -49233, -23845, -40786, -56439, -38012, -20321, 7124, 13462, -14926, -12860, 6587, 6685, -2042, 8721, -1933, -2393, -13673, -40430, -48613, -22906, -19606, -55564, -45504, -38074, -28885, -23242, -13130, 7377, 29626, 4993, -30105, -32764, -25960, -43111]
11311d3111m934j4031J7571K1468N978K9201J2374M867J4736J4051J9579m1583
11299C6166k4106l9992n4157p092J9026J8602M553o56J0367n821J5502j4225l0048
11286g1881M8087J3790J6351j2018P194N380K846o056J812J8010P44o826K611
11273B0044m625O506j1778n739J2489l311j2903n199N765n526j6819k27K3412
11260B089j1578l0976J0130K5402J1276j4822L772O749j5489J5399k732l5033
11248c5813j2752Q858j3097N775J0534R067r332J1528M1478K5496j8233o250j8963
11235a704j4300R439J2836j7066N538R773k2278R71r448j6889R307r491j584J5354
11221b9542J1715J7638N27k7667k5348M749J1680J9075J5023J2773J0393L004
$$ y = [-43111, -48045, -62076, -44505, -23037, -17059, 12142, 24516, 29383, 44119, 58170, 77749, 36166, 12060, -27932, -82089, -89181, -70155, -51553, -47000, -47656, -37289, -43110, -27608, -41833, -71881, -23794, -10004, 6347, -5671, 1523, 6903, 9749, 3693, 5505, 23515, 24259, 17433, 20044, 15419, 21925, 10147, 4408, 16897, 13586, 683, -4516, 1249, -4277, -21096, -21323, 2089, -9489, -40465, -30335, -4933, 6343, -8479, -4707, 2042, -13447, 1952, -780, -35813, -48565, -39707, -52804, -47029, -36495, -27428, -36760, -25232, 16246, 41742, 23509, 17259, -1704, -16004, -6565, 6271, -10795, -5257, 4516, -17762, -16791, -26239, -43128, -33821, -43312, -44896, -29542, -17827, -189, 338, -27329, -52677, -47928, -36248, -17173, -2150, 10623, 21016, 24020]
11209B4020J4284K3166j3459M000k8151k2266J4431j538q396K5928K0783k2199
11197C0603j5899l4906j6903O771n011L989L4795k994r480J3730j1620Q227R62
11184B264M306J0834k299l0459j85P106j416N025K6427J1987k6923k8500j2060
11171c3893R293J1093J5152Q27J0455k1880j1014M680o135J6005L7915N990j6350
11158B2138k1024r021k9527j7394K0435j1854k160J1098K72K425p411L329p626
11145d6320N301K1848K7379n3k4635j856%M346q839K858K2972K946l1790K118
11131b3725J510K5009L1904m1034k7794J0175o165K2647j65k9058M808P794J5100
11118h994K0162J1303m294k9715J8176L989j5520q75J6292k563k3481l0873J6478
$$ y = [24020, 38304, 61470, 48011, 52011, 23860, 1594, 16025, 14487, 6091, 32019, 52802, 30603, 14704, -20202, -37105, -30334, -35345, -31356, 3439, 445, -9035, 4695, -6925, 1302, 2264, 6570, 17404, 15105, -15354, -15539, -8433, -9849, -4824, 21603, 33590, 6667, -21833, -33893, -24600, -13507, 1645, 2472, 12927, -8953, -19967, -15287, -21422, -5417, 32498, 38488, 22138, 1114, -7907, -37434, -54828, -34393, -46247, -48407, -37309, -37037, -34612, -42023, -38694, -46320, -41019, -19171, 8208, 8155, -16480, -18336, -18336, -13990, -22829, -19971, 3001, 5947, -25843, -23725, -22215, 2794, 34698, -6336, -34130, -23955, -30120, -7473, -7638, -36696, -31888, -24094, -8994, 11168, 22471, 18177, -11538, 6638, 10627, -4893, -5768, 10524, 7961, -15520, -46393, -29915]
11105b9915o299J808q581L337J1867J4132J7912K0266p665r296Q210j506L586
11092A7856k3470j2616J7863J5088k802k6400l535K0760J8150l851j4650K0381
11080B2774J7460o832j6795l1296k4061j4553J7176J3736N882K8700J1660R98
11068B4849k540j3825k0693j6020J3113L6990J0119j3599k3777l2468K3145p371
11056b2077J088P156K2201J6541L44j1275l1990q720K362q062j298M854P608K3165
11042A897J4107l1626k4337M698J5164k215j9560K2712N119j6383Q629J9640N72
11029a583k2161n853J2754R951J9159L7699k8097r442j0830l074M826l4692j7443
11016d8786N183K843J130j2470j233K2202k633J0491P729Q355j1228l264P385
$$ y = [-29915, -36214, -34406, -42987, -39650, -27783, -13651, 4261, 24527, 16862, 7566, 15776, 14270, 17856, -5614, -18230, -367, 14721, 11919, -14481, -18016, 2744, 20894, 17043, 2393, 22774, 40234, 33402, 16607, -14689, -38750, -53303, -36127, -22391, -16509, 12191, 23851, 24849, 22309, 8484, -12209, -28229, -15116, 21874, 31993, 18394, -5383, -37851, -14706, -22077, -20989, -13833, 8368, 24909, 25253, 13978, -18012, -26732, -24370, -32432, -33730, -28876, -21268, 1897, 16004, -15622, -39959, -35261, -20097, -22312, -41872, -19160, -14041, -30424, -21795, -2155, -1583, -23744, -29597, -16843, -6892, 12267, 49966, 21869, 12427, 1597, -1477, 3349, -31343, -48786, -43603, -40760, -39630, -52100, -53333, -31131, -33764, -23273, -15544, -7189, -18417, -21681, -14296]
11003a4296K7714P522K143O748L143j1800j3617k3367m240K0273J4035j256K5601
10990C8603k0180j4736l077n807J0467j2037M4321r745m453j704j5007j6213L279
10977f289L552K0348L0927P173l0189k1737j4199r155n263K114J7393K2155K7479
10964D4309j0131l269k075k0381O489L1235j2285j4873r130J2449m71k8491q263
10951a4887M824J5832r338k0592k846J3584j184L0382p80j4537r549N279K8523
10938B4711J5312j7043q636l4958l233J9076K6195K3915o262k5127j7767J4343
10926A0526J05j0567r118p465j7139J2151J7043j618m474j6735l334P108J2173
10913a1344J735n339k939j2510N736N850J4634K891m641J3712m115m58R044N392
$$ y = [-14296, 13418, 20940, 23083, 29831, 32974, 21174, 7557, -15810, -20050, 223, 14258, 13002, 38603, 18423, 3687, 610, -5197, 5270, -6767, 37554, 27809, 23356, 21652, 6645, -9568, -6289, -2737, 17611, 48538, 55711, 25522, 3785, -10414, -19569, -24832, -22718, -5325, 16830, 44309, 34178, 30909, 28834, 8453, 14942, 46177, 33892, 19019, 9889, 22338, 21867, -6624, -14887, -10063, 5769, -3569, -24161, -27007, -13423, -14607, 15775, 14995, 458, -9091, -3812, 24711, 40023, 22980, 14344, -20614, -23847, -4771, 21424, 45339, 39077, 13950, -3817, 10526, 10631, 64, -9054, -16519, -33658, -21507, -4464, -6082, -10556, -27291, -30625, -23517, -11344, -9609, -14948, -17887, -30397, -24661, -18811, -4177, -1286, -5927, 7785, 3670, 3212, 12256, 17648]
10899A7648r005p25O412N051P322j222p7K0009k3155k5256j4229M644M507j7777
10885b5853K3775o965K23q985Q907K2637j9875r331J0500n803j8534M641j467
10872b6130j485N716J103O26M8105J9273m228P74J231Q354k497k1377Q865n434
10858C2896j0454m836j247K664n398J2321J5753k2615k6888j6532j189R37J2758
10845a1830K414J7158J5735M221m894Q130j6360k5911R581O840l053L428J8738
10832B4197J9696j5688m9201J3067J8777k400j796K5012j5288J1804N0542n921
10820G2801j8467j9541j2182o177j4725N550P7r576K3743m551O076n533k2567
10807e072q509K1835J1759j8123k4057P663L471J560K750j7690N166n777J0364
$$ y = [17648, 8643, 7918, 14330, 19381, 26703, 25481, 25404, 45413, 22258, -2998, -17227, -12583, -8076, -25853, -2078, -9043, -8820, -17805, -8898, 13739, -6136, -15467, -4967, -10770, -29304, -24663, -26130, -27615, -21899, -20796, -20170, 27935, 47208, 42980, 43754, 44985, 53339, 50842, 29465, 38330, 32896, 22442, 17606, 16359, 19023, 13625, 25946, 41699, 19084, -7804, -24336, -25525, -24588, -11830, -9416, 7742, 23477, 27698, 22804, 30934, 14574, -11337, -1756, 5084, 2031, 5459, 24197, 43893, 28205, -20996, -7929, 10848, 8448, 6652, 31664, 16376, 28180, 78722, 72801, 54334, 34793, 22611, 16434, 1709, 7259, 7336, -2240, 21503, 16952, 23028, 17495, -5072, -13581, 8254, 20013, 1890, -22167, -14504, -11033, -9473, -6723, -24413, -19247, -25024, -14660]
10794a4660j261J0783J3810k7464k0983M760k3577k0377K9821R304K3223L7454
10782B0833J326l1073O87J4659q28m026J5884Q435j0895j4858P524K369J2174
10769B2211k097k2806N23L566k4399O888K2184P151R452j1178J242m69j6067n510
10755i309L7310K675N503p619r532q495O092n97O482k3267k2983M59n078n569
10741c3928O418j0782n65j2810J6801N4018J3365k4252j7399l180K2638O296k1759
10728e139k3296j8876j960M1709j0642j9857Q993M5825j7965j5653j828k2413
10716d1102r723j0431J3230J0362L2155l562J2453j2725j7529M583L4437P748
10704A9896j172J3004l4269N337J0559j6490N794n273p722j0998J3401p991p01
$$ y = [-14660, -15921, -5138, 8672, -18792, -39775, -35015, -58592, -78969, -49148, -39844, -16621, 20833, 22159, -8914, -8227, 6432, 5604, 1578, 17462, 25897, 15002, 144, 7668, 10037, 22211, 20114, -2692, -2169, 1397, -23002, -16114, 6070, 13221, 22673, 11495, 12737, 12268, -3799, -9309, 28001, 30676, 36179, 28560, 19028, 10533, 16625, 16028, 22510, -757, -23740, -23281, -28359, -33928, -27510, -38292, -38857, -51667, -34866, 19152, 32517, 8265, -9134, -12314, 10324, 16620, -5139, -28435, -47311, -49271, -7562, -18204, -38061, -29068, 16757, -1208, -16861, -18689, -41102, -50825, -61256, -48026, -37664, -5509, -9071, 3382, -9343, -26872, -22289, 12148, 19896, 18724, 31728, -2541, 2796, 13355, -3135, 2659, -2614, -10336, -21334, -7933, -15924, -16625]
10691a6625k1145n795K9140j1922R646j6710R208J8472j1085J0269K1409K064
10679A6926l2800j4030J786Q170j2682m2834M520O588M609L5660M0765K6066j2067
10666C0677j6431r888N017n619j6944O901J4734l3477L253J2026n059j0686Q596
10653a6900p974J4282J2640J2916j5540r106J0007L029k3268J1870J8345j8751
10641h450N355K3819k0333J5056N253p585j7615J477J3768j0940O160N127J001
10628A2093p575j937n743k5606j3673j150L3834Q435l2042q531M296J0441J4113
10615a3045K6223K459k105j5440J6655K379j685L066J426l28J4817n689j9614
10602I119j201Q430q025P238k7838o616k2396R334J2471J7217J1504P768q352
$$ y = [-16625, -37770, -43565, -14425, -26347, -16701, -33411, -24203, -5731, -16816, -6547, 14862, 16926, -15874, -29904, -28118, -19948, -32630, -75464, -70944, -64356, -59747, -24087, 16678, 42744, 30677, 14246, 4358, 9375, 3756, -13188, -6287, 8447, -25030, -21777, -9751, -14810, -25496, -16900, -24874, -10592, 2048, 14964, -576, -9682, 325, 3354, -19914, -8044, 10301, -8450, -3095, 20724, 391, 15447, 20700, 13115, -4500, -3023, 10745, -195, 5965, 11092, 12093, 4518, 2581, -3162, -28768, -42441, -43591, -9757, -1322, -33364, -41895, -37599, -27158, -13045, 13178, 15637, 13532, -1908, 14747, 17126, 15441, 18507, 19933, 19605, 34422, 28733, 9119, 7918, 16348, 8323, 15561, -12277, -18893, -41289, -31955, -19484, -2267, 9237, 17005, 8653]
10589H653K008O930j1522p816j380J6200J0196k6848j7739j1225Q042J8272J5149
10576H920k8680j1432L6425K9775j6541k4632l5365N251K7441k208j4717K8638
10564B875J5076q520j3786J5328o587J529J6104q676J2418J6287k33m625l3477
10551C713j4799J9690J1063p877l269l085r049J5434J6688j2460q663P549L485
10538A8420J6566J1040p825l5686k3307J1426n232P500j5963j5505j3260K2346
10526b9480J7481J4242J7607R769j8866p577l611j1814R731J0404J3748J916o473
10513A7077J1854k0909k8479O32j9015J4488J9186J2082Q317J6597l6766J0335
10501E399K0767J1373o28K26L935k1500k1922K0988J2069j1539n005k2446l131
$$ y = [8653, 10661, 17591, 6069, -1747, -3127, 13073, 23269, -3579, -21318, -32543, -24501, -6229, 8920, -19760, -31192, 5233, 35008, 18467, -6165, -41530, -36279, -8838, -11046, -25763, 2875, 17951, 9431, -4355, 10973, 4386, 5915, 22019, 13343, 25761, 42048, 41815, 37190, 3713, -11086, 8604, 19667, 11790, 8521, 5436, -3613, 11821, 28509, 16049, 7386, 14935, 18420, 34986, 46026, 38201, 2515, -20792, -9366, -14598, -7098, -23061, -38566, -51826, -29480, -11999, 2243, 19850, 29619, 10753, 3176, -435, -12249, -2518, 7886, 21634, 23550, 17077, 28931, 8022, -20457, -19825, -38840, -24352, -5166, 6916, 15233, 31830, -4936, 5399, 26166, 37539, 36911, 37137, 41072, 19572, -2350, 18638, 30707, 19168, 14163, -8283, -11414]
10488a1414R311N518o749j4338J876P756J8899o724j1589j4408J4665L2753J531
10475B7087j6586k500K4785N0935L4752L3551k9463l8475K772K1160l497m195
10463A00326j0878K032M876k4127k1362j3699j6621k7236M595j0080N898M830
10451a446K2060O823l910m2k5317r41J1724k76J8144j7310l1592Q827K2709K4078
10437C3531M3316K434m5068k0651j0405J146O992k456J8981j3782k3369K0809
10425A1478J5978J2959k7014j8952j0518J2454n370j4199L1023J1128M714l3312
10413i631k1976J4700Kj8646m650j046o619K9238K5458N466l993p380N639L040
10399I602k834N516l269K515j3173j8187j1475O005J1800K143L0977J6710l0993
$$ y = [-11414, -2103, 3415, -3334, -17672, -15796, -8040, 10859, 4135, -7454, -21862, -7197, 25556, 27087, 10501, 8001, 32786, 83721, 118473, 152024, 122561, 84086, 86858, 108018, 104521, 100326, 89448, 91480, 96356, 72229, 50867, 37168, 20547, -6689, -2094, -12174, -6276, -1446, 20614, 27437, 23527, 23485, -1832, -2773, 8951, 8675, 26819, 9509, -22083, -13256, 9453, 33531, 76847, 79281, 34213, 13562, 3157, 4303, 11295, 8839, 27820, 14038, -9331, 11478, 27456, 40415, 13401, -5551, -16069, -3615, -8985, -23184, 7839, 18967, 23681, -9631, -31607, -16907, -16905, -35551, -40201, -41247, -47866, -18628, 6830, 12296, 8303, 923, 6562, 9602, 6768, 12284, 9015, 11530, -1643, -19830, -31305, -25300, -13500, -11357, 19620, 36330, 5337]
10386E337k8269j817K0876J6479k3128k9173L596p623K0188Q570L762n28R303
10373b427R010j0065K821K434J5187j7522j8143j4051J2051R496J323Q525O418
10360E057j2161k6685K9069M1462Q073o393l19j8319O205Q426k2700j4833l439
10347f557k7306l283N1463M4987K4556j6132k4171m0990l0235J3284O050K8548
10335B0214M964q826M922k2177q480k617J2059l088k4506J9584J509j684P857
10322b69Q859R225m4684k4802R819J7614J319l624M154J167J3745N318P880J0663
10308A6384J4637R363n859j1237q052L746j6348r879l977j838k833J4621K6833
10295B5561R855Q115N181j5579K3425J3387k0330r415r329k4646k6255J2605Q025
$$ y = [5337, -22932, -24749, -3873, 12606, -10522, -39695, -36099, -43722, -23534, -14964, -11202, -11730, -2427, 6583, -3482, -661, 1773, 16960, -562, -18705, -32756, -20705, -11209, -9886, -1361, 5057, -7104, -33789, -4720, 36742, 44815, 38422, 38103, 19784, 25989, 34415, 11715, -3118, -6557, -33863, -37146, 14317, 59304, 83860, 67728, 43557, 2567, -27668, -14384, -8334, 20214, 25178, 16352, 21274, -903, -9383, -12000, 59, -3029, -27535, -7951, -6442, -8126, -269, 8590, 17815, -26869, -51671, -41852, -24238, -22919, -26543, -22389, -21222, -7477, -2159, 5721, 16384, 31021, 40384, 34525, 23288, 15236, 18982, 2634, -7245, -11222, -13060, -15893, -1272, 25561, 35416, 43531, 48712, 33133, 56558, 69945, 49615, 40200, 30871, 6225, -20030, -7425, 600]
10282F00J9461J5306O822k2845L30P989q692o810q472j4882q209M145r435k7855
10268e2547J6720M006K3996J8847L0209L3886j7883k7221k6268k2221K610R626
10256f240M773p332k7835j6787r86P286N2417L840l1411k645J6674J5473J9091
10243B6318j0845j9806k2129K4515J5685L581J9872k6614m5504j1199K7353N7026
10231C8253Q440k1040k9793J7849m155j2757o674J2131k072Q761O418j8431j5698
10218a8768K6040j9929J70l737j5446j2874M136L6022p6o037M0729j8459j6314
10205d543N707J37J0878m2919j4252j4111L1816K6975j0974o90M364k1379O53
10192b8338p621K308j132L9820J4807m2360m0114J5159j560K864N54L6652L4338
$$ y = [600, 20061, 35367, 42189, 19344, 19674, 27663, 18971, 12161, 3689, -11193, -19402, -15257, -24692, -52547, -35827, -31821, -7825, 11022, 41231, 75117, 57234, 30013, 3745, -18476, -15866, -6240, -1467, -8799, -36634, -53421, -54407, -47121, 5296, 9136, -22275, -24920, -8246, 7227, 26318, 15473, -4333, -26462, -1947, 13738, 17319, 37191, 10577, -34927, -46126, -18773, 38253, 46693, 25653, -4140, 13709, 9554, -3203, -9877, 2254, 182, 8943, 15361, -3070, -18768, 7272, -12657, -12487, -16224, -31670, -44544, -40408, -4386, -4462, -10499, 30230, 11771, -4543, 1164, 1301, 12179, -30740, -44992, -59103, -27287, -312, -11286, -11976, -7612, -28991, -28338, -35959, -33651, -34783, 5037, 19844, -22516, -62630, -47471, -49031, -46167, -45613, -8961, 25377]
10179B5377j1522k0420M167j501p447J9425Q883J0097j6167k0438k2715N720J6415
10166a0126P460K243r622K3377J2116o155j7575p049j4314j8199J505J0944M87
10153b4908p77O206J1302m6745q706K0054K0402J6083o435J9448L1942j151k5670
10140A1045n152L779L404j1280k3334n562J1637J1553j0403j2486k203P840N638
10127a5524l731J0243R403o941l694K419K1561J8211R003Q948j0643J242n2957
10114a2460k3121Q011J4268j0256k0785k18j5302l7608l210J7728J8628O226R669
10101d8430K7580k366J8800J7323j578j5399K550k8567M682K9181J9818r062n396
10088I136K6691r359k3036J2809j1936k6660j0527n835O799K7166J0245P505n243
$$ y = [25377, 13855, -6565, -2398, -3899, -11346, 8079, 16962, 27059, 10892, -9546, -32261, -26541, -10126, -2666, -423, -10045, 13332, 25448, 19293, 1718, -5331, -19645, -37844, -36339, -25395, -24908, -25685, -19479, -8177, -54922, -63628, -43574, -23172, -7089, -13524, 5924, 37866, 36715, 11045, 5893, 9672, 13076, 1796, -21538, -27100, -15463, -3910, -14313, -26799, -29002, -21162, -15524, -19255, -9012, 391, -6550, -10244, -7825, 13736, 31947, 40950, 49898, 39255, 40497, -12460, -35581, -27570, -13302, -23558, -44343, -44561, -59863, -97471, -100681, -82953, -64325, -58099, -48430, -20850, -23216, -4416, 12907, 11329, -4070, -1520, -30087, -25405, 3776, 23594, 14532, 9136, 35827, 26468, 3432, 16241, 4305, -22355, -32882, -38717, -31918, -4752, 5493, 12998, 7755]
10075G755k3871K3853J1447p41O64k4627l785q443Q907j3909J1386J9186J6584
10062B4406k279p585l2502J6757J6326j7036J379J4231j9716l902J5322r39j7408
10049a2946k3735o019J5612j3940L3179M1755J0724k3513o159o096J5242M0904
10037F5008J4050j9086n7172k1734J9337R293J0977r469k6023L3715K2574j7415
10025B4055k8209k8717K779K6964q936k750p509J0315j3507R267J1634j4604J3169
10012f049P772K614j6490l896m828r357N308p663K0414M5934K5950M04p792j3370
9998C8951K2053L6563O6508R1689J49186L04294L09063L7345j17419j66123j89541
9987E82569j51668r5799k8785J0226N214j1337m7882l1619l6133k3483k2220k1472
$$ y = [7755, -16116, 7737, 19184, 18443, 19107, -5520, -9305, -17748, -8841, -22750, -11364, 7822, 24406, 22127, 14542, -17960, -1203, 15123, -1913, -534, 13697, -6019, -9921, 5401, 4462, -12946, -36681, -42700, -27088, -41028, -7849, 33906, 44630, 21117, 14958, 8862, 24104, 65008, 79058, 59972, 2800, -18934, 403, 9696, 20673, 11204, -14819, 18896, 41470, 24055, -4154, -32871, -30092, -3128, -12064, -14814, -22323, -12008, -25515, -16248, -4614, -19218, -6049, 1723, 4337, -12153, -16049, -20877, -30234, -24926, -32589, -12175, 33759, 59709, 60113, 52321, 38951, 61004, 97567, 164075, 255764, 404950, 709244, 1018307, 1055652, 938233, 772110, 582569, 430901, 335102, 306317, 316543, 321757, 310420, 262538, 230919, 194786, 171303, 149083, 127611]
9975A27611k3276k8724j0975J1427j436J3346j2859k967n011j4820K5958R982
9963H8256k7241j9828k391q566r115P566J8012J093o539J9962M347J559P65p996
9949E9884J3962n063q789l8658j1200L9665K8354n555j3715O490Q568Q51k1123
9936E3671k8669k0943k298L4591K2445j5740j6980N187M0655K1723j6178j9727
9924E7737j986L088K16j6755l630o408q218L3642J5682J685K753M900j758k7117
9910E3831p54L4676J0499j2288J7967K6689j9920l349M4663N1117J041J0666M123
9897B18961J4514K9616J4766L0596O1083N0913M2437K6917P9985O9541M4674R1132
9885G75135J28497J73383J41264J31614J40980J00688J03532M6520k474k8491
$$ y = [127611, 104335, 75611, 64636, 76063, 74627, 87973, 75114, 72147, 67136, 52316, 78274, 88256, 61015, 41187, 38796, 30230, 21115, 28681, 46693, 47786, 41247, 61209, 65556, 67115, 67880, 59884, 73846, 68783, 59994, 21336, 10136, 49801, 78155, 72600, 58885, 65375, 73943, 74794, 53671, 25002, 4059, 1761, 36352, 58797, 43057, 26077, 31264, 71919, 93642, 77464, 57737, 55751, 58839, 59055, 42300, 38670, 32262, 24044, 57686, 73368, 75053, 77806, 82706, 80948, 53831, 53077, 87753, 98252, 85964, 103931, 130620, 110700, 107351, 152014, 203131, 204172, 214838, 218961, 233475, 263091, 277857, 308453, 369536, 420449, 462886, 489803, 569788, 639329, 684003, 775135, 903632, 1077015, 1218279, 1349893, 1490873, 1591561, 1695093, 1741613, 1739139, 1710648]
9875A710648o2808j27091j02003p9212q2799p8057r0460p7396q4245r0925p8687
9864G56965o7965l7808n4722k8196l3551l9013k9615n8433l1777k4737l1704k38
9852C19206j3404k2927P666K2654l3799l0135k3702k3206k4178j5056J5195j7504
9840A60810l593j3575j6909N153l397R006M316j2681J8636l4197k9213J1701M3310
9827A39367j7691m4789k7032K401l101J9823N210m859j1780m445k1873k9862L0590
9814C1959j4737j8897O685O550K1271q882j1830j8057J450l823J5012n957k407
9801a663l442K5403o348m254K0874L566Q083K3212j4093j8862j2275j316J5504
9788C4389K0022J0436j2689k0496l5661K0329L6678J360k9271j4814J3223J4077
$$ y = [1710648, 1647840, 1520749, 1418746, 1339534, 1256735, 1178678, 1088218, 1010822, 926577, 835652, 756965, 689000, 651192, 596470, 568274, 534723, 495710, 466095, 407662, 375885, 351148, 319444, 319206, 305802, 282875, 290541, 313195, 279396, 249261, 225559, 202353, 178175, 163119, 178314, 160810, 157217, 143642, 126733, 131886, 128489, 137495, 141811, 129130, 147766, 113569, 84356, 96057, 139367, 121676, 76887, 49855, 52256, 49155, 68978, 74188, 69329, 57549, 53104, 31231, 1369, 31959, 17222, -1675, 5010, 11560, 32831, 23949, 12119, -5938, -4488, -8311, 6701, 744, -1663, -5105, 20298, 13950, 9696, 30570, 34136, 42219, 65431, 51338, 32476, 20201, 18885, 34389, 54411, 64847, 52158, 31662, -3999, 16330, 53008, 54368, 25097, 10283, 23506, 37583]
9776C7583J2378k594j7444j5370j0322J3980j983k4055J3334K7173j8216j6827
9764b363l123J0005J162m629m505M716j7497K175j8476J871Q735L211K1192L5778
9750C8252J0521j633j078R493k9392j8855N732o892k9444k3732L5645J6708j0749
9737e424j271K3016K4050l4708m1694N448L896J1058q55j7674K3469k938j8911
9724c2538p774N681m201R0J1154J2840J4914o726R919J0237M169k2498J725j6501
9710a9509k848m095O74L404k6516k953L9910J9859Q839j271K0913k3836J9722
9697C2293L186j9880l6274J0789K2317L2483l55q287k260J317Q163K0132j0584
9684E3040k3279j637P327J162p614K617j3549k1785j2115l351K1567K879k796
$$ y = [37583, 49961, 47367, 29923, 14553, 4231, 18211, 16228, -7827, 5507, 32680, 14464, -2363, -5486, 4519, 5681, 1052, -3453, 1263, -16234, -14059, -32535, -30664, -21929, -18718, 2474, 38252, 48773, 47140, 46062, 55555, 26163, 7308, 13040, 6148, -23296, -47028, -11383, 5325, -5424, -6695, 16321, 40371, 5663, -36031, -30583, -26687, -15629, -16484, -34158, -10689, -13627, -32538, -40312, -34631, -38832, -38742, -27588, -14748, 166, -6560, 3359, 13596, 17765, -4733, -3008, -19509, -22357, -26452, -25778, -22374, -48890, -51843, -11933, 7926, 16765, 15494, 36407, 12571, 32293, 35479, 15599, -20675, -9886, 12431, 44914, 44559, 36272, 34012, 35329, 43492, 63624, 53040, 29761, 28124, 35451, 36613, 28999, 31616, 18067, -3718, -15833, -19184, 2383, 5262, 2466]
9671B466m780J058j6898J8751J8033j1067Q524P075J7647o640o136j6654l4409
9658b3030j1772q734j0274J25J5178L39K073M554j7700J6391K3077J5958j5483
9645i298j061N391p776J7036r726k3432N426n803K956K8754L3220o965k3784n6711
9631e1773L055R358J477j7013l523L0073K6543K820k2540J7848L1203J0548J5709
9618E3785k5751l6619k1949j4131K6658J8853k039L6665n482k9571p811M108J8544
9605A5260P019j1080R559L1554J4721k2659j8672k5376n644q519n556j8796J3847
9592b4342J4638j9663o951j4112N3604J4337q310m201j0784j5370j909K2373J9911
9579A9221p801k9488j6332j4243K201J3123L17L3165Q318j7113j2618j5759N464
$$ y = [2466, -2314, -1256, -18154, 597, 18630, 7563, 16087, 23162, 40809, 34169, 28033, 11379, -23030, -34802, -43536, -53810, -53685, -38507, -38168, -36095, -31541, -49241, -32850, -9773, 6185, -9298, -10359, -4968, -12744, 4292, -5434, -28866, -23440, -29243, -26287, 2467, 35687, 28722, 4938, -51773, -48718, -39360, -37883, -54896, -58419, -28346, -1803, 1017, -21523, -3675, 27528, 38076, 53785, 28034, -8585, -30534, -44665, -18007, 846, -1193, 35472, 29990, 419, -7392, -3284, 15260, 22279, 11199, 20758, 52312, 67033, 44374, 25702, 326, -5318, -13837, -19393, -38189, -24342, -9704, -29367, -36318, -50430, 3174, 17511, 9201, 5000, -5784, -21154, -23063, -690, 19221, 11420, -18068, -34400, -48643, -46442, -33319, -33002, 163, 8481, -8632, -21250, -37009, -31545]
9566c1545J1105K7442P487J7668j3618O526L5202L360m5425k4394k28P517j4425
9553a3328J5252J3890l3161l9130P194J424J797J0181j3315J3830L3169m616p679
9540a4492Q249J4648M349m617k067o80J5878N208l9889k9350N128K8245O387n092
9526h095J6724N374o342j7553o947J9524K1517r213o30j6786l4226j8573j5397
9513g0623J7420J1003J4596P38K997k0755J9799J773N31k948k792o804K4098o24
9499a1591j4217J2296j819P470j8865J8931J8582K8343K3623j2553k884j8841
9487B8475k3344n2J2342k845j7946N26p379R049J783J098O884j06M620Q909J2839
9472C4853k0078j6573n30j525q756L0944m214J2309j6249m0005M005J2393K1348
$$ y = [-31545, -20440, 7002, 14489, 32157, 18539, 25065, 60267, 63627, 18202, -6192, -6420, 1097, -13328, 1924, 15814, -17347, -56477, -49283, -47859, -46062, -35881, -49196, -35366, -2197, -6813, -14492, -6243, 8405, 12754, 8137, 6070, 5390, 21268, 26476, -13413, -42763, -37635, -9390, -3003, -8095, 8629, 14003, 7661, -9892, -16839, 2685, 24202, 14989, 14359, -2427, -36653, -55226, -70623, -53203, -42200, -27604, -26866, -23869, -44624, -24825, -23052, -22521, -25469, -28261, -35065, -10967, -11591, -25808, -13512, -15331, -7861, -26726, -7795, 10787, 39130, 62753, 50200, 47316, 28475, 5131, 5079, 17421, 14576, -3370, -2844, -10223, -1174, 609, 1707, 8591, 8485, 13105, 22014, 34853, 14775, -1798, -2328, -3853, -12609, 18335, 14121, 26430, 10181, -29824, -25819, -13426, 7922]
9459G922L413P84K2851M769l1006j6615J4795o36k7574j6824j3028K5311N5254
9446B9416k7064j6001N586j3102Q199K2244m178r497N422j2547j6497N053k7208
9433e0174j2981J6804J3274K2120m425J4061J128n792j050J7545q41k8292m9111
9420f7734J4237K1461m592j3788n946L470k812q183l951J7055J7866J5144l462
9407b1235j6411j9444k2450J3106L529L7583K4016k329k0168r674J1578k3756
9395d5655k0717K216j6108M153L6520K4035J6295L529O180l1013l676k979o668
9382c3888l595M6071L0197k025o454k6242M3J5200O550J2117j6857k9640K3486
9369A4963J2649j5213l5932l428J5174J6037n297n722K0894J384k668J8728K3187
$$ y = [7922, 11335, 12119, 34970, 39739, 8733, -7882, 6913, 6277, -21297, -38121, -51149, -25838, 29416, 2352, -13649, -8063, -21165, -12966, 9278, 5100, -4397, 1025, -11522, -28019, -22966, -50174, -63155, -46351, -33077, -10957, -15382, -1321, -193, -5985, -7035, 10510, 9669, -18623, -67734, -53497, -32036, -36628, -50416, -56362, -52892, -55704, -63887, -67838, -50783, -32917, -17773, -21235, -37646, -57090, -79540, -66434, -62905, -25322, -1306, -3635, -23803, -33477, -21899, -45655, -66372, -64156, -80264, -76111, -39591, -15556, 739, 4268, 10448, -20565, -24241, -27220, -33888, -37483, 8588, 38785, 36760, 30306, 4064, 4107, 19307, 25857, 37974, 21117, -8523, 14963, 27612, 12399, -23533, -26961, -11787, 4250, -1047, -6769, 14125, 15509, 12841, 31569, 54756]
9356E4756N998k4502L576k0051l971j2888n937k0729J7772r103J4767j091j4506
9343a5909K207J4361J3988k3149J1165P910r774k9269k5588O725K0382L0168Q764
9330A1981k022K1818j0852o739K204J7371j8706k2229N700N667j0769k552J4092
9317D964J585p872L2154k9149j9971J277p495K1398L5375L731j58N481j1223l755
9303B6342O288K338j9855P179J6642J9317j3307j2731O857N406J259l579N575
9290D7731j0512l64r079n86k3960k0139K4560R908n305j1608j8255j079J1297
9277g391J0203j6954M4828J0022k3243r093k0896m2j7605j6739J6221L6039p57
9264D593k4134j3584J187J3803Q392K18j4116o752k228L6622L0930j3550k1467
$$ y = [54756, 60754, 36252, 39828, 19777, 15806, 2918, -3019, -23748, -5976, -15079, -312, -1403, -15909, -13702, 659, 14647, -8502, 2663, 10573, 799, -28470, -54058, -47333, -26951, 3217, 11981, 9959, 31777, 20925, 14186, 16390, 33761, 15055, -7174, -1474, 4193, -6576, -9128, 4964, 6549, -1323, 30831, 1682, -18289, -17012, -24507, -3109, 32266, 35997, 35839, 41320, 30097, 26342, 32630, 34968, 15113, 22292, 38934, 58251, 44944, 32213, 39070, 44476, 45735, 42156, 47731, 37219, 36855, 27776, 27190, 3230, -16909, 7651, 17559, 12254, 646, -17609, -18688, -7391, 2812, -14142, 30686, 40708, 17465, 8372, -12524, -12566, -30171, -46910, -30689, 5350, 4593, -19541, -33125, -31938, -18135, -9743, -9525, -23641, -30393, -32621, 4001, 34931, 21381, -86]
9251h6l97j474j4105O600L5229L734j2355k1836P848K7047M061l0714k7134M535
9237a9047J2695N433J2700K0268K0568J8827r126k9673k0327j0637Q593q575J5802
9224A7501R026M72K721j9318j4049o541K033l6761l860J6737K2654M8209K5428
9211F4252j4817k7585J6553o576J3304q722k2543K4208P645n550j268K9916k6622
9198D2195p686J2539L209r400r411k2820m502j926L347l7376L535J064K0151K821
9184d260M7325K2182P589l5386J068J0054j0104j9538n258K5230j2401j9876j9600
9171a2975J3516k0786k0510J2267K9735L8533L5124j7272l1137O914q002o250
9159A9157j3400P966K7957J6212j3209k3367M65J2503J302q62l6319q086M70J4766
$$ y = [-86, -483, -1957, -16062, -9462, 25767, 29501, 17146, -4690, 3158, 30205, 34266, 3552, -23582, -19047, -6352, -919, 11781, 32049, 52617, 71444, 62318, 32645, 12318, 1681, 10274, 1699, 17501, 26527, 26999, 29720, 10402, -3647, -10188, -8155, -44916, -48776, -32039, -9385, 38824, 64252, 49435, 21850, 38403, 31827, 45131, 36409, 13866, 38074, 45719, 40169, 38901, 68817, 42195, 34509, 47048, 50257, 40857, 31446, 8626, 4124, 2198, 5545, -31831, -28296, -27232, -7081, -4260, 43065, 65247, 72836, 37450, 38518, 48572, 38468, 18930, 13672, 38902, 26501, 6625, -12975, 541, -20245, -40755, -28488, 1247, 39780, 74904, 57632, 26495, 33409, 25407, 19157, 5757, 13723, 41680, 57892, 44683, 21316, 21781, 34284, 35586, 34724, -1595, -9681, -9211, 5555]
9145E555L0322J3833J7440j0326l1666J734o415k4495r86l296J6699P684P054
9132B3137K2485J3810j2951k1165M797N142r44j6330k0601J0639o56L397j4014
9119c254K0664K906o180j3039L8178J2425J6838j3134L059l9123K3481r234k9840
9106C747J5437j1977k2999J1776N550M2545J6559l6172n097K5631M1429R321k8706
9093F7044j5676N055j5735J7510K3702l1014p322j7346O507J0831K4639K467j2935
9080E7727k9937m700M193p271j1795j1641K7744L971r599o990K529j5426j2684
9067a3879k773K0855j1417k3235L0555J2293J577o567M833M2166J1458r465O72
9054E7073r173J0984J3621j1966k2576J2159M2733J4940r470l2469m856J0249
$$ y = [5555, 35877, 49710, 67150, 56824, 25158, 26892, 20477, -4018, -5004, -8300, 8399, 16083, 23137, 45622, 59432, 46481, 25316, 30113, 35255, 34311, 17981, -2620, 8019, 7363, 10760, -3254, 17410, 20316, 14136, 1097, 39275, 51700, 68538, 55404, 58463, 19340, 42821, 33587, 3747, 19184, 7207, -15792, -4016, 1534, 44079, 60638, 24466, 19369, 45000, 86429, 95750, 67044, 51368, 56423, 40688, 58198, 81900, 50886, 43564, 26218, 32725, 43556, 68195, 70662, 57727, 27790, 23090, 27283, 20012, 8217, -3424, 24320, 28291, 18692, 11702, 14231, -1195, -13879, -16652, 4203, -7214, -30449, 106, 12399, 13976, 7409, 12242, 54408, 65866, 56401, 57073, 47900, 58884, 72505, 60539, 37963, 50122, 92855, 107795, 98325, 65856, 61000, 71249]
9042G1249j3609o918j6580k6973r032m316K1117R580Q699l865q830k1217j7060
9029a7755m138L643Q162k559J1493j7452j4613l846J1698J6781L0377J9595k2911
9016A8475J2360n912k6021J0650j1621J3497N17l3637j1328P590M8387K7943P905
9003E8805O674J5053K479r453J4573l393l4666k7852K1913o15M287j6406j5590
8990A5809o315n001k8465K997L6396K6447L291O514j7826j9095Q282L0628K9882
8977H3544k1890m8403l0602R203L7216J8239k8298j2133K5544N232J6602l648
8965E0606p687Q471j0749k4969j6883r875J2280K2663l4113m723L3308L2758l8933
8952A2154o599K1112q179n150n924J1478k659j5575O004n301L689J1085P532j4462
$$ y = [71249, 57640, 50722, 34142, 7169, -1863, -6179, 14938, 24518, 33217, 29352, 20522, -695, -17755, -21893, -18250, -10088, -12647, -1154, -18606, -33219, -37065, -25367, -8586, 21791, 41386, 18475, 30835, 24923, -1098, 9552, -2069, 11428, 11945, -21692, -33020, -25430, 22957, 50900, 58805, 65479, 80532, 83011, 73558, 88131, 84738, 50072, 22220, 44133, 43518, 47805, 31399, 15809, 9494, 4493, -23972, -20975, 15421, 41868, 45159, 51673, 33847, 14752, 23034, 53662, 83544, 61654, 13251, -17351, -8148, 29068, 47307, 19009, 6876, 32420, 37652, 54254, 50606, 42919, 51390, 40641, 15672, -1211, -11086, 1194, 23857, -10256, -14979, 18329, 51087, 12154, 5555, 26667, 18488, 13338, 7414, 18892, 16233, 658, 6662, 1361, 5050, 16135, 23667, 9205]
8938I205K138l804l480j1974j2694K6289K2225l1678m624J1009j9775k918J8697
8925a384J4657q623r176J2362j1694R538J6948r578m067k130k4156K489R166J2213
8911F565m187m639l965M247Q646j1498k4226m226J4617K3025k311K3881j0905
8898A5024J5430O140q257N761J486o119q772j2960J1816L0806P530N86K635j5524
8884D5582j0375N70N543M706k2717k3106l1835o153K2621k247k4531Q551J6724
8871a6667J3500j8377j2752J5775J8321K255Q799Q362O964k1749j2971K0447k563
8858I344N735q47k5848K2151m793k2225k643k628L2112J5295J2758J3652K200
8845E4263l2056n302j745J1096J0015j5194K0507J62k2477j3842J2172K3751j849
$$ y = [9205, 11343, 7539, 4059, -7915, -20609, 5680, 27905, -3773, -8397, 2612, -17163, -20081, -1384, 13273, 4650, -4526, 7836, -3858, 5680, 22628, 13050, 8983, 6853, -17303, -14814, -5648, 6565, 2378, -2261, -6226, -1979, 6667, -4831, -29057, -33283, -18666, 4359, 2048, 25929, 15024, 30454, 36594, 28337, 34098, 35584, 29465, 20693, 7733, 19549, 50355, 57885, 58471, 61106, 45582, 35207, 35777, 41320, 46026, 23309, 203, -31632, -37785, -15164, -17411, -41942, -33391, -16667, -3167, -21544, -34296, -18521, -200, 2055, 10854, 19216, 26180, 4431, -8540, 11907, 9344, 15079, 14232, -11616, 10535, 5742, -16483, -19126, -21754, 10358, 25653, 38411, 52063, 54263, 22207, 16905, 15160, 26256, 36271, 21077, 41584, 41746, 19269, 5427, 17599, 41350, 39501]
8832C9501k014Q289m888Q765j7185k8806K6716p076k484j2512k2284o267J6528
8819c717J574J3467J427N0054O562q267k2946j3236q972j7912l212n98M661j5257
8805a6372O434K2239j2659J4186J1604k8936j0271J4506J8009p39J7242o127l2124
8792c008r656N170N603J2304k1811J3768K6412J1801K5115j5179k878j0440l325
8779C3876J0213J3402j0784j7544k9462J5469J7144L486r34J0954J7388J647l212
8766F1643m655M930k4305j1164J723j1056J600M627J617J8416L2126o756j0002
8753E8744k616l7083l6421P319K374J3057j0410N483M290J8446r92R514L4770
8740F6475M33l4676j8857J18J4754j438K1017k0442l0463q111L4591M1159k354
$$ y = [39501, 37487, 45776, 40888, 49653, 32468, 3662, 30378, 23302, 20818, 8306, -13978, -20245, -3717, -2143, 11324, 12751, 62805, 69367, 61100, 38154, 24918, 15946, -1966, -5178, -5776, -1115, -16372, -9938, 12301, -358, 13828, 25432, -3504, -13775, 731, 18740, 18001, 35243, 29116, -3008, -12664, -7494, -1891, 10413, -11398, 2370, 28782, 40583, 65698, 50519, 47641, 37201, 33876, 44089, 57491, 46707, 29163, -299, 15170, 32314, 35800, 34866, 45820, 63208, 64855, 61643, 56988, 61918, 37613, 26449, 28172, 17116, 18716, 23343, 24960, 43376, 75502, 68746, 58744, 56128, 19045, -17376, -10057, -7683, 5374, -5036, 447, 4737, 23183, 22191, 31705, 66475, 66908, 32232, 13375, 13493, 28247, 26809, 47826, 27384, -3079, -11190, 23401, 64560, 62206]
8727F2206P269Q53j1444j9862O625J3513R730j9959n41M987r17l2365j5264J8040
8713B2871o418K354J7835M720j9418j3041j1448N683K700m958R097J6162J6660
8700D2799J4890L452O360J116l5090k9209p093l3973j935K4127O570J4918J3095
8687B0027Q040p60P298J4269l692L1724p925j9480K1927n890L3365J0915J4516
8674A24334m123m119k3531r427k1979q418j1004j7572n688P235J35k3897L3610
8661C5556J4668o420K3581j9279M463L2650M303O391j3168J4729j1334k1549K3244
8648H7835k2238k8868J8216L716Q121O407p36q262J4569j2714n304L5888j6130
8635H0500M97J44k6847l1043m645J8845L8160K2142M842k8128R277R91j7946j0571
$$ y = [62206, 69475, 70328, 58884, 39022, 45647, 59160, 68890, 48931, 48390, 53377, 52460, 20095, 4831, 22871, 16453, 18807, 36642, 41362, 21944, 8903, -2545, 3138, 5838, 880, 9977, 26139, 42799, 57689, 61141, 67501, 68617, 33527, 4318, -2775, -36748, -38683, -14556, -7986, 6932, 20027, 28067, 27307, 34605, 48874, 45182, 76906, 68981, 49501, 71428, 65538, 98903, 109818, 124334, 120211, 116092, 92561, 83134, 61155, 52737, 41733, 24161, 18473, 25708, 25843, 1946, 35556, 50224, 43804, 67385, 48106, 52569, 85219, 89522, 95913, 82745, 97474, 86140, 64591, 87835, 65597, 36729, 54945, 58661, 66782, 73189, 72453, 64191, 78760, 66046, 60742, 96630, 80500, 80997, 81141, 54294, 23251, 18606, 37451, 75611, 97753, 102595, 74467, 83744, 84735, 66789, 56218]
8621E6218J2356O555J4932R926p717l9748J0211j2305J811q708O076k927m000
8608D2680R86K1100J243O696j5098j040K0394L342O363K2863j8810r401p785m0786
8594C2747k958J3086J7159o007o628k592R971J0479o330N02J9374q73M873j0203
8580G2600n371J1225K3393j7502l5024m816k856r664k663J6070O481L276l0854
8567B4295q724O3707j1186o223J0646k1441j8814j6504O836K3232M2981J4484
8555A03289o91Q131L169j0937j5825k0781q279J7212J0757L7836R795j2379j3785
8542A07512K141J34K2562J9409J1877j7744K6067L6266j4515k1834m3475j5483
8530A12917J8763K0753o9311r027K0678J2898l0146l7563q289M552M2270l606
$$ y = [56218, 68574, 75129, 90061, 99987, 92270, 52522, 62733, 50428, 52239, 43531, 49607, 46680, 42680, 43666, 64766, 66009, 72705, 57607, 56567, 76961, 80303, 86666, 109529, 90719, 81318, 73533, 32747, 29789, 42875, 60034, 54027, 47399, 44807, 54778, 65257, 58927, 59429, 78803, 77930, 82803, 72600, 67229, 78454, 101847, 84345, 49321, 44505, 41649, 31985, 29322, 45392, 51873, 55149, 24295, 15571, 79278, 68092, 61869, 72515, 51074, 32260, 15756, 22592, 45824, 88805, 103289, 102598, 110729, 113898, 102961, 87136, 66355, 58076, 75288, 86045, 123881, 133676, 121297, 107512, 109653, 109787, 132349, 151758, 163635, 145891, 171958, 208224, 193709, 171875, 128400, 112917, 131680, 152433, 83122, 74095, 94773, 107671, 77525, 39962, 31673, 36225, 78495, 74889]
8518G4889K3599J3727k6894k8638q421M449r654j4905O611j1403L2525K0512j0646
8505F5751p484k2700j0475j3514J939J2687L2517J0503o550k6087o469j1898J306
8492A9526K2623J6468j4625j3260k2732k2244M633J4786K6667J1418j475q53J2763
8479E3695j6585j3248K104K6924k5747j4251L3233R732j1797l7759j5020j2621
8467b1340L1468R680K7930J7512k849j6288n742L881j6539j6725J1019J1976J5762
8454D9745j4139K378p736j5411k3492j9489L906J7015p249j0375K1731K5615K2821
8441D5320j210k0057n782J4474K63j8672o721J3965J5408K1890k1928r373J7543
8428D5120j3422l7707j5312P563k1351O348K9022J549J003J086k5106q996l948
$$ y = [74889, 98488, 112215, 85321, 56683, 48262, 52711, 43057, 28152, 34763, 23360, 55885, 76397, 65751, 58267, 35567, 25092, 11578, 13517, 26204, 58721, 69224, 62674, 36587, 30118, 18220, 19526, 42149, 58617, 43992, 30732, 8000, -14244, -9611, 5175, 31842, 43260, 41785, 40932, 53695, 37110, 23862, 25966, 52890, 27143, 12892, 46125, 55857, 44060, 6301, -8719, -21340, 10128, 19808, 47738, 65250, 62401, 46113, 40371, 44252, 27713, 10988, 22007, 33983, 49745, 35606, 37984, 30248, 14837, -8655, -28144, -24238, -7223, -14472, -24847, -3116, 22499, 45320, 44110, 24053, 18271, 32745, 33008, 14336, 7615, 21580, 36988, 58878, 36950, 27577, 45120, 31698, -6009, -21321, -13758, -35109, -28761, 261, 1810, 2813, 3899, -21207, -30203, -34151]
8415c4151J1371j1590j076J5349J9833R767j2461L457J2910n964l5589j7498M3723
8402a919M268n995k2313k0418K1704L8144m396j4390K1481J2572j269k1109k587
8389C773J3609O530l1518j7635k6131J6143j492K1688j0440K1338K6632j2124
8377A0373j870J5724j4555K319j1105k017p659j6719L292O16n491p861J2837J5991
8363f125J1578k121Q129l35j7251K0807L7828Q164k2176j5417o963L17J6054l83
8349C2106n344k5318l3220p40o395K7334J3955J8483l242R24l638L1052q929j6855
8335B0173n069k0461k4399l660J9109K2473K3865J98j9444j2720J7926P43r368
8322I366J1174O066K0538m652n8856m076J6615R948K5325j5697o918J4892N018
$$ y = [-34151, -22780, -34370, -35446, -20097, -264, 9503, -2958, 499, 13409, 7445, -28144, -45642, -1919, 2349, -3646, -25959, -46377, -24673, 13471, 9075, -5315, 16166, 28738, 27469, 6360, 3773, 17382, 23912, -7606, -25241, -51372, -35229, -36721, -15033, -25473, -4135, 22497, 10373, 8503, 24227, 9672, 11991, 886, -1131, -8790, -25509, -22217, -21601, -27092, -34953, -22116, -6125, 5453, 3332, 11461, 11126, -6125, 14682, 52510, 60674, 38498, 23081, 16118, 16435, 32489, 32106, 26762, 1444, -31776, -32516, -38911, -11577, 2378, 20861, 17619, 18543, 14905, 45957, 37028, 20173, 15104, -5357, -29756, -33416, -14307, 8166, 32031, 32229, 12785, 65, 17991, 18734, 9366, 20540, 26606, 47144, 42492, -16364, -20440, -3825, 6123, 31448, 15751, 8833, 23725, 28743]
8309B8743N396j5972r678n378J1828P347k8738p807R214M6232k6279m778j0046
8296H4k1745k1249J0028L0091J4143r960M854j6766k178K655J3742K0431q335
8283A5795l8059L523o866J0640m862j6646J3277K2061L8299J8788j8722K4141
8271F1369l262j2870l7038L509J957N978k6256k7833L104K0668J4547J3388N837
8258B3098J3129k5252j9602J9823K7485J2044j0496k3951l9359O374N926k4478
8246c5259k1815K6957J2062J3328J8501l649J25J8289l73k483j5858l177j52J1775
8232A8271p59n58K3765n238l6978j2677J1158O917j1741J5502j6984j096J6579
8219F161J6325r157M833k71j2975q855n570K131k056m20m688L056j8552q983j5902
$$ y = [28743, 34139, 18167, 8489, 3111, 14939, 22286, -6452, -14259, -5045, 41187, 14908, 10130, 84, -21661, -42910, -32882, -2791, 11352, 1392, 6246, -10520, -12698, -10043, 3699, 24130, 15795, -22264, -18741, -25607, -14967, -19829, -36475, -23198, -1137, 37162, 55950, 37228, 61369, 58107, 45237, 8199, 11708, 13665, 19643, -6613, -34446, -31342, -10674, 3873, 17261, 23098, 36227, 10975, -8627, 11196, 38681, 50725, 40229, 16278, -23081, -16707, -10781, -35259, -57074, -30117, -18055, -4727, 13774, 10125, 10250, 28539, 28166, 25683, 9825, 6648, 6496, 18271, 17512, 16954, 40719, 35481, -1497, -14174, -3016, 3901, -7840, 7662, -9322, -10418, 6161, 22486, 13329, 18162, 17891, 4916, -3939, -9509, -7378, -9434, -9854, -14542, -11486, -30038, -39021, -54923]
8204e4923R727L3170j397J1285k587M698n868m345k04J4940K7000N736p895Q077
8190C7414j3459j8847O337K5457M168j1821J1536l538N68J2493o49k0113K0604
8177E0150R581m991L013k6769k8790k1709J5490J8249o51j6070k4476J6192K9255
8164A8474q623j1802M744k5971j3937J9506K7853k271l0836q428J2984K7500j8980
8151i787j1670K2451j705j1428O045K1123L0291k2653q403j5870p331L3142J9817
8138D4022k7270k1936j941j0519m1004K364J229P822K4696J490J6609K2452J042
8125A9056k372J4559J5570j6408p144Q300q646J1401J3460L0881J4335p225k3228
8112F2539m1331j8014J1141k52j8607J8351K0586q55k342Q242j4707k6950J8382
$$ y = [-54923, -45196, -12026, -13423, -2138, -4725, -27, -5895, -10240, -10444, 4496, 31496, 37232, 29337, 37414, 23955, 5108, 11445, 36902, 41070, 29249, 40785, 37247, 37815, 50308, 49659, 29546, 50150, 59731, 54740, 57753, 30984, 2194, -19515, -4025, 14224, 13573, -2497, -26973, -10781, 18474, 9851, -1951, 2793, -23178, -37115, -17609, 10244, 7973, -22863, -31291, -18307, 9193, -9787, -21457, 994, -711, -12139, -6094, 15029, 45320, 22667, 14264, -1606, -8937, 24205, 44022, 16752, -5184, -7125, -17644, -58648, -56284, -55055, -47233, -22537, -21047, -4438, 18014, 19056, 16684, 31243, 46813, 30405, 23261, 31561, 22915, 34316, 47776, 78657, 92992, 85767, 62539, 21208, 3194, 14335, 14083, -4524, 13827, 34413, 33558, 31216, 39458, 24751, -2199, 16183]
8099A6183J7611J4405k5891j9811J0177n769o920k4168M045L7984K8734k2110
8087B4470j7527P406K3341k9569J0007K5191M681k6048n160P716q002J1482J130
8074B9118q356J8667l881K1243J9689k0592l554m649m656J1760j6403r594M043
8061C2835J3773k1654o647J1602J4139J4151J1104K2218j1192k791J7911J294
8049I6743J2397j1299k9242j2942J2843J8843k9578k9204l286o216j7997k52j2371
8036a1561o804M695l419K6777K0361J21j4784q233L2158P722J0744l31n557L565
8022E5454R503m556n840k1217J1775L060l5059M342K4285J152J235J063K8596
8009G3793L6543K5059o73K2696M8122Q86m1515k2280r297P685J1717K1488R015
$$ y = [16183, 33794, 48199, 22308, 2497, 12674, 6905, -15, -24183, -20138, 17846, 46580, 24470, 6943, 14349, 37690, 8121, 18128, 43319, 48000, 21952, 16792, 24508, 16506, 27988, 29118, 20762, 39429, 35548, 56791, 76480, 55888, 52334, 47685, 43029, 54789, 38386, 28792, 32835, 46608, 24954, 18307, 29909, 44048, 58199, 69303, 91521, 80329, 77538, 95449, 96743, 109140, 97841, 68599, 55657, 68500, 87343, 57765, 28561, 25275, 19059, 1062, 810, -11561, -18365, -13670, -17089, 9688, 30049, 30170, 15386, 7153, 39311, 47033, 57777, 57446, 51889, 55454, 64957, 60401, 54561, 33344, 45119, 48179, 13120, 17462, 41747, 42899, 44134, 45197, 73793, 110336, 135395, 134722, 157418, 205540, 206426, 164911, 142631, 133334, 141019, 152736, 174224, 183239]
7996A83239k9734n0627j2422j323k3995k5689k3226k098j30K2634K170K34r607
7983B9426O045q91k837j2915J093J0168j8616k133r762J3376J0649K4260j6047
7970C1816j1441j106k032J2795Q430O265K550K0326J6605o693k780j0877K2165
7957H6023J0468J4374n916m913k577m915k3928k0894m980j9765J5500L2098K4364
7944I4939j1159N841j1868l5805j009k7268L386K1992N173J5655P546l3758k8173
7931E492J5787l027o626J7904j0914K1343M6956L8178k5691k7387qM471k4201
7918E2277p593J0108J4455j1674j4159K054J8935K6825J9301o61j1401r117q544
7905H0806m1522j1903K0661P186J2734O613j3088j3578k10K4919K5212l307k8883
$$ y = [183239, 153505, 102878, 90456, 89133, 65138, 39449, 16223, 14125, 13995, 36629, 38799, 39033, 29426, 35471, 34580, 31743, 18828, 19921, 30089, 11473, 9340, -422, 12954, 23603, 47863, 31816, 20375, 19269, 17237, 30032, 38462, 44727, 47277, 67603, 84208, 77515, 74735, 63858, 86023, 96491, 110865, 104949, 100036, 97459, 92544, 68616, 47722, 42742, 22977, 38477, 70575, 94939, 83780, 89621, 77753, 41948, 40939, 13671, 17057, 39049, 44222, 59877, 67423, 33665, 5492, 21279, 18252, 11626, 29530, 18616, 39959, 86915, 125093, 99402, 72015, 72007, 76478, 52277, 44684, 54792, 69247, 57573, 43414, 45468, 64403, 91228, 110529, 109868, 98467, 89350, 80806, 39284, 27381, 48042, 55228, 67962, 74575, 61487, 47909, 47699, 72618, 97830, 94523, 65640]
7892F5640k1571L081q961J3398K4248J1057j891j7214L0034J238J0315j2760k3658
7879G2956j3671L402K6326j4846j4542k2007K1937K3731n429j8096r0J5021J1700
7866H6392j7384j8323Q870j5950k235L0461r246j8060j4406K3111J5439L565k4092
7853D8142m462K6718p613k4639R853J9604J235j1804j5746l581N270k036m893
7840C6048k133M13J8514K6274M39k1337k0254j804m290j5435J836R695j5952l4973
7826b2959M7570K7361j4304q792L7945m230k3789k740L316J0292p779j1050r431
7813B1410j4326j1695J8862p036j3654R026K4318J3314l7056M35M859l35N553
7800A3675n731q686J0549R366P285J404N724n728j4722j9074J0210o39k5234J5301
$$ y = [65640, 44069, 47150, 38189, 51587, 75835, 86892, 85001, 67787, 97821, 99059, 109374, 96614, 72956, 59285, 62687, 89013, 74167, 59625, 37618, 59555, 83286, 77857, 59761, 59671, 74692, 86392, 69008, 50685, 59555, 43605, 41370, 71831, 62585, 44525, 30119, 53230, 68669, 72234, 48142, 43680, 70398, 62785, 38146, 47999, 67603, 68838, 57034, 41288, 37707, 42977, 40941, 36048, 33915, 34328, 52842, 79116, 79555, 58218, 37964, 36160, 31870, 16435, 18271, 27966, 12014, -22959, 24611, 51972, 37668, 28876, 66821, 62591, 38802, 36062, 39378, 49670, 41891, 30841, 21410, 7084, -4611, 14251, 7215, -6439, 2587, 26905, 40219, 3163, 3598, 8457, 8122, 13675, 7944, -742, 9807, 19173, 26458, 27862, 33586, 27858, 13136, -5938, 4272, 3633, -21601, -6300]
7786f300J7804l096p945J0690K6618K6174O875k1979j4812j3617l0493j2135K0949
7773a267j31N771K5063J2756K835J221r353j5468N514j3259j8970k5235m722J8542
7759a6703o71j2209J4357j5012P055O314R260M730n907K4383K0510J6138N628
7746E7873k315k5547j618j3548j8284J858J6204J2905k1052k0407m90L4831K375
7733B2785l8628k5565j0593L886L6738M0248K1151l0865j5421j5680K1717n442
7721D331o2q70j631k4010j4392j239L4631L0427M062K6348j995k8531l431m382
7707A9256N21P989J2458K067m2917k3593J6926J0749j0669N21P381k6647J9057
7694f901m92j6732J5985L0975M323l2960k2123K1679M881K451J8044k028k4869
$$ y = [-6300, 11504, 8408, 463, 11153, 37771, 63945, 70820, 48841, 34029, 20412, -10081, -22216, -1267, -1398, 4373, 29436, 42192, 45027, 46248, 36895, 21427, 26941, 13682, -5288, -30523, -35245, -16703, -17374, -29583, -15226, -30238, -23183, -16869, -7609, -2879, -8786, 15597, 36107, 52245, 57873, 55558, 30011, 28393, 14845, -3439, -1581, 14623, 27528, 6476, -13931, -14421, 20410, 22785, -15843, -41408, -52001, -48115, -11377, 28871, 50022, 19157, 3736, -11944, 9773, 4331, 4269, 3399, 1768, -22242, -36634, -37873, -3242, 27185, 31247, 57595, 55600, 27069, 23638, 19256, 19777, 27766, 40224, 42291, -626, -24219, -7293, 3456, -7213, -6692, 689, -25958, -6901, -7393, -24125, -8140, 22835, 27158, -5802, -27925, -6246, -1365, 1086, 19130, 17102, -7767]
7681g767L200p384J8121J8570L5084J0942l9195k4469k3348j359M1671q081j7844
7668a859J669J2737r283K456j8668p713J5974L313j9399J4370N242J2306k0877
7655i732k1167Q482K1101M752L792k7841j6805k2572M212L907K7739O909R752
7642g471j4122Q622j1799q362k8976O904L1941L279m356L2046L4217O820j2047
7629C6696p103k6213l1286k2618J7521l112L0556J2704j494J4270J5878j2887
7617B2912l1508n320m028j0934l315J7514M1620K1065j3964m750J3739k3498k6682
7604g149k0463l772L0188M215k0448N082r679j068M1375P454o400k334M618j3744
7590G875L1154L8197k1868m3720k0474J668K1181p590k3753M636M7212M731l08
$$ y = [-7767, -4567, -11951, 6170, 24740, 59824, 70766, 31571, 7102, -16246, -17605, 24066, 15985, -1859, -190, 12547, 3264, 5720, -12948, -20661, -4687, -1374, -20773, -6403, -1161, 11145, -9732, -30899, -22417, -1316, 3436, 7228, -20613, -37418, -59990, -55778, -51871, -24132, -17223, -7471, -21593, -12971, -24770, -33132, -62108, -55204, -23263, -19984, -24340, 7706, 41923, 48743, 36696, 29593, 3380, -27906, -50524, -33003, -36115, -5559, 7145, 5651, 19921, 35799, 22912, -8596, -13916, -17944, -28878, -32193, -14679, 26941, 48006, 34042, 29292, 43031, 19533, -7149, -27612, -31384, -1196, 3019, -17429, -12347, -22026, -23094, 18281, 25735, 19335, 17001, 21619, 7875, 39029, 77226, 55358, 11638, -8836, -7168, 14013, 6423, -17330, -12694, 34518, 39249, 38941]
7577C8941k0817n6730m197J4601j857K0154K8928j3449j8261k5361j6077J5474
7565c8651K4275O120J8578J4568R75J748l939M773m616j531j0462k8644m388j1550
7551c2744j0968L6248L3150k358L803J8967J1443l0718l0425M353R008o260L950
7538G449P50j6262j2949k0301l556K0905J6609k3399J4324L2628j1924K7316J7043
7525D8633j8688L75J9169j1139o950r405j4955J4815j0991k3212k4714m259q66
7512d2187J4702M4147J6445j0592M002j7353j4206J0423J5272J348r315k6988
7500a4302j7748k535K0680J7568K7603M734K1271M508l2194j7750O153J0570p58
7487B7800l060K152j9032j7932P804k335j1465l749o70Q121J4751j0314j4492
$$ y = [38941, 18124, -38606, -42803, -28202, -30059, -9905, 19023, 5574, -12687, -38048, -54125, -38651, -14376, -8256, 10322, 24890, 25865, 27613, 23674, 28447, 23831, 22300, 11838, -16806, -21194, -32744, -43712, -7464, 25686, 23328, 27131, 46098, 57541, 26823, -3602, 751, 9759, 3499, 7449, 8199, -8063, -21012, -41313, -44869, -23964, -7355, -30754, -16430, 16198, 4274, 31590, 48633, 29945, 30320, 49489, 38350, 31400, 21995, 7040, 21855, 10864, -12348, -37062, -41321, -42187, -27485, 16662, 33107, 22515, 26517, 9164, -5042, 5381, 20653, 22001, 12686, -14302, -32050, -34585, -13905, 3663, 31266, 36000, 57271, 61779, 29585, 11835, 17988, 28558, 27800, 24740, 26892, 7860, -10072, -2268, -4603, -16068, -19817, -20487, -12366, 2385, -7929, -22421]
7474b2421q264j997K5308K9968L5002J1210j5197j9742J8002P230o432j2341J1130
7461E1456k4832N236r824k1408K409n743j612J2874K2033l832j6537k4346Q801
7448e325J9128Q935k8271k77L3621o812k2232k6494r718L7582L8438j7462k2862
7435a749l812J6690M811j7284k4420J3279N584l5882r272Q780K7509J580j0199
7422b4385k2602J6783K7816q354l864j5565K7725J2697J7626Q926R796j0128l0793
7409E678j3809j4272l304J78J6376L377J5703J0158j1540o981K2304J5148J221
7396D0237j8915q026l569k0733j3142J9829p606L964K5108J8023o504o498J1299
7383C3467l0376k5128j0330n571J5360m300K632L120M842q512L1373J7768l4733
$$ y = [-22421, -30685, -32682, -7374, 22594, 57596, 68806, 53609, 33867, 51869, 59099, 52667, 40326, 51456, 26624, 31860, 22036, 628, 3037, -2706, -4318, 8556, 30589, 26757, 10220, -14126, -5325, 13803, 22738, -5533, -5810, 27811, 20999, -1233, -27727, -37445, 137, 38575, 21113, -1749, -5561, 11129, 15940, -1344, -25764, -12485, -6901, -42783, -52055, -43275, -15766, -14186, -24385, -46987, -30204, -2388, -10742, -14606, -30171, -2446, 10251, 27877, 36803, 46599, 36471, 5678, -8131, -22403, -25707, -25529, -9153, -5776, 9927, 20085, 8545, 1564, 23868, 39016, 40237, 21322, 13296, 9727, -11006, -24148, -4319, -11925, -7961, 17147, 35170, 28666, 22168, 33467, 3091, -22037, -32367, -37938, -22578, -26878, -24246, -21126, -16284, -24796, 6577, 24345, -10388]
7370a0388j8590K923j9163n484J4448J9191J1260J2322O275m199K8149j9897l3185
7357a6338j4658N870m786k6142L0288L4901q227j0201m4982J4681L6732K243j5441
7344a6060j6701J5103K5735n818j1395n649Q317J0408o049k2064P817O528m186
7331a4014J4399O942j0056Q974J1380k90j7371k0720Q864o748M16J1828Q874k3813
7317b1335Q861K8903R038J713j3755m499J24n658k4438l4719K8649L0736J2520
7304A6140l443r796j5446k8j5518r23J4658N823k5585n433J1408N269K2501p505
7290g878j2749N841P945k9596j1474K5643L3109k7290j8163R05N502J2909j1647
7277b6943l066Q505M0666J5572L259j7394p7j8327k7187P458J3884n751m872J7485
$$ y = [-10388, -28978, -26055, -45218, -50702, -36254, -17063, -5803, 6519, 12794, 8595, 36744, 16847, -16338, -30996, -25126, -29912, -56054, -25766, 9135, 908, -9293, -54275, -39594, -2862, -619, -16060, -32761, -17658, 8077, 2259, -9136, -14785, -6468, 3940, -2109, -24173, -16356, -9828, -14014, 385, 7327, -2729, 6245, 17625, 17335, -36, -20756, -11892, -18640, -18224, -6396, 2478, -21335, -12474, 16429, 25467, 27180, 13425, 8926, 9050, 3392, -21046, -55765, -27116, 3620, 16140, 12697, 2901, -12545, -12573, -28091, -29014, -14356, -8533, -34118, -39551, -28143, -22874, -373, -7878, -20627, -14786, -6841, -36437, -47911, -22268, 10841, -16449, -34612, -33707, -28205, -15296, -26943, -30009, -21504, 19162, 34734, 37993, 20599, 20522, 2195, -24992, -17534, -3650, -9401, -14273, 3212]
7263C212R601J8541Q901j1535n2744o098J9383j1146J3456O853K4022J2152l321
7250C1277R030j0688j1272l8995K853L5325l005q709q921J0006j9714N258J1106
7237C551l5065k9471P078J2584K1142q269K537J9790N134j645j6914J1911K489
7224e148j8060k0137pL828J3378m967R909O950J4710Q982j0161j4969j6331l2922
7210f4945P231J4830J5253J6321J2578j1645J1318j719j7385j9411J700Q23j1953
7197d7004Q530J7943K9730j3056q984L263j1449K6379M028L4584K172m8920J131
7184a653K2641q063l3368o97J2925J2983Q326J7386k3801o632L3416l3915p763
7171h215n965J902j6568K664J4713j478j7263k6048L2510K3242N376m553k4648
$$ y = [3212, 12813, 31354, 40255, 28720, -24024, -30122, -10739, -21885, -8429, -1576, 22446, 34598, 31277, 40307, 29619, 18347, -20648, -17795, 17530, 14525, 5816, -3105, 6901, -12813, -7555, 3551, -31514, -60985, -53907, -41323, -20181, -28450, -25913, -6123, -989, -2634, -19548, -7637, -5148, -23208, -43345, -43352, -39524, -26146, -31113, -21204, -14254, 456, 9438, -723, -15692, -32023, -64945, -57714, -42884, -27631, -11310, 1268, -10377, 941, -778, -18163, -37574, -35874, -35051, -47004, -38474, -20531, 9199, -3857, -12841, -9578, -21027, 5352, 9380, 43964, 46136, -2784, -1653, 20988, 12925, -20443, -21140, -8215, 4768, 13094, 30480, 6679, 47, 33463, -452, -8215, -14180, -12278, -28846, -26182, -11469, -12947, -30210, -56258, -23748, -506, 4870, 317, -24331]
7158b4331R703K4031K2835m563j5559j4092J0792l878m11k97j1117O975j6086
7145a5998q238q090L7841J9132n800k0766m401J753r916m6907P630L6952J1469
7132e339k8601j6226M1663K3260J0884j2036K3154k0846q556P737K1167k4878
7120A1383k0880K3930k3869j3601L6857Q679k2262P673J4412k0705m513p709L1427
7107B0822K6054k1220Q87m3816k2915J4363R397P025K3241j1790k2156%J0052
7094a0056j1478k3494o182Q537Q8M75J2104j0998J279R894Q358J0242l124k4951
7080c9306L699L8281j0478J91K483K4469k1322j1893K1206J890k9160R239K8308
7067A7607j375O103k6105O091p691J7244o05J139j2443p118Q647K899L919n540
$$ y = [-24331, -14628, 9403, 32238, 27675, 12116, -1976, 8816, 4938, 4527, 4230, -6887, 88, -15998, -24236, -32326, 5515, 24647, 18847, -1919, -6320, -4567, -14483, -61390, -53760, -16808, -5339, -33940, -50166, -8503, 14757, 25641, 13605, 36759, 15913, 7357, 15094, 36261, 11383, -9497, 14433, -9436, -23037, 13820, 22499, 237, 7910, 22322, 1617, -2896, -10605, 20822, 46876, 25656, 26543, -17273, -40188, -25825, -16428, -9403, 13838, 2048, -20108, -20108, -10056, -21534, -45028, -51210, -42673, -42585, -42110, -30006, -41004, -39725, -29831, -21473, -11231, -14355, -39306, -35607, 2674, -7804, -7613, -5130, 19339, -1983, -13876, 7330, 9220, -19940, -10701, 17607, 16232, 22335, -3770, 2321, -5370, 11874, 11269, 12408, -35, -7153, 1494, 4393, 8312, 2772]
7053B772l7215m1146q690K5269L2326K4065l899q336N66k679j3909P734K270J8354
7039b518j0586p555P549l12M068N979K393N420k81j0632Q774m154k886J8037m266
7024I030j4778O337n347j1500k783O008j829k3060j3737J5745K7936R963K8636
7011C0621j4782j596j8616j6405j5796J9931j4681r440j4293M2191K8710k8198
6999a2354q778P777K083j8732q254J6257q084o644K4172J2228j928J4604K6198
6986C8545J6461k4896l7230p357K6355J275k5055m741J455K0847J8828k1033k663
6973G91J3255L414j0023j5052j9707L2189K1910n367j9600k7122R283J0776L286
6960a967O074k8302k1772J2344J030K2075q559j1537m895m33M4205J4829j853
$$ y = [2772, -34443, -75589, -84279, -59010, -26684, -2619, -6518, -14854, -14288, -16967, -30876, -23142, -20872, -2518, -13104, -20659, -13110, -13422, -9354, -3375, -982, 4438, 4157, -6475, 2299, -1855, -4741, 13296, 9030, -5748, 589, -4758, -16258, -19041, -13033, -14862, -37922, -51659, -35914, -7978, 1985, 30621, 15839, 14243, -4373, -20778, -36574, -16643, -31324, -40764, -55057, -12866, 15844, -12354, -21132, -13355, -11272, -30004, -38258, -22001, -30085, -36729, -12557, -329, -2257, 12347, 38545, 55006, 30110, -7120, -14477, 11878, 13153, -11902, -16643, -15188, 5659, 24487, 3454, 791, 14046, 17460, 7437, -7615, -27322, 4867, 26777, 21410, 1810, -25312, -16029, -5253, -1967, 4107, -24195, -45967, -33623, -32593, -10518, -19077, -30614, -35509, -35942, 8263, 23092, 21239]
6947B1239k0102k7298l557k694R659j2891J9668J1763k5Q961k7537q489k1129
6934e2432k192K8136L3085l259j5007O919O434n436k2074k6480J9643J207n405
6921c6861K9456J6269o81k9026J7871L689k1257j8896K2162N291j0661O503j0336
6908b6477k4023K7416J3959J1291k3399n037J3352O231j3858n392J2975J886j3908
6895b4984o107M75J9905k36k5783J0856M1113R242K50k0984K0478k057k6545j4003
6881a8380p928q195M324J8884n405N09K2062j9783o809M43M118j1028n698R697
6867b3189O788J2012J9019j7590k6806J8741J6292o408m449K0494O628k4218K263
6854d23K1826M041j4585j8477J8787K8373p576j8546j5784j3692j147j550J455
$$ y = [21239, 1137, -26161, -29718, -32412, -22753, -35644, -15976, -4213, -4238, 4723, -22814, -31303, -52432, -54624, -26488, 6597, 3338, -11669, -4750, 1684, -3752, -25826, -52306, -32663, -31456, -36861, -7405, 8864, 8183, -20843, -2972, 717, -20540, -39436, -17274, -11983, -22644, -16141, -26477, -50500, -23084, -9125, 2166, -21233, -26270, -12918, -6687, -20545, -25937, -12962, -11076, -24984, -31091, -30616, -10711, -10947, -36730, -25874, 15239, 24481, 24731, 3747, 24225, 22168, -4377, -18380, -26308, -34503, -30179, -11295, -16700, -16191, 5871, -13912, -20721, -20278, -16160, -27188, -32886, -23189, -16401, -4389, 14630, -2960, -29766, -11025, 5267, -1141, -5590, 14904, 21532, -2686, -423, 21403, 25444, 10859, -7618, 11169, 39542, 31966, 13420, -2364, -16056, -17203, -18753, -17298]
6841a7298O083L2207p612j5762k4901J025L1281l431O148N188m2200o70L30p185
6827c6797m559L911J4278K2354M3195k1573k2969k257J8984J3143j0143M268N66
6814B2401J3811J477K061k0213j8281j3323O983m268r204j6842O400P068J4573
6801g357K3501j9902k6974k2343m808P455J6673J7750J2047L449J879Q62K854
6788E086j893j3576k257O187L4072j5057l7674J336J675j402K3066k0749j2968
6775c4154l2J161J2040K3054J3585k3622j4391N113J6959l246k0114Q851n401
6762b0197P791n080n24L616K0089M724j0382J9677J6561k5299j2396O552K568
6749G700j9250K2971J2758m2431k334K2315n650j1554p627k0651k5533J4699K822
$$ y = [-17298, -11215, 20992, 13380, -2382, -27283, -26258, 5023, 1592, 7740, 12928, -29272, -29942, -29612, -36797, -41356, -37445, -23167, -813, 42382, 20809, -2160, -4417, 14567, 27710, 17567, 21835, 22401, 36212, 37689, 39750, 19537, 1256, -12067, -5084, -9352, -18556, -35398, -28998, -21930, -7357, 16144, -3758, -30732, -53075, -57883, -50428, -33755, -16005, -3958, -509, 1370, 2232, 5086, 3193, -10383, -12640, -6453, 27619, 12562, -25112, -23776, -22101, -23503, -437, -21186, -34154, -34186, -33025, -20985, 2069, 15654, -7968, -22359, -17246, -287, -3533, -23647, -14796, -20197, -12406, -17486, -18010, -14394, 5695, 10419, 37, 19714, 36275, 10976, -1420, 5132, 7700, -11550, 11421, 24179, -18252, -20586, 1729, -3921, -15475, -23102, -43753, -69286, -54587, -51765]
6736e1765J952m227j12J4600J2879K1949M5255K4269k3864j0672j15l9439l3047
6723d2337K3155j3988M868q701k677K0660K7066M371l5265j3403J0187K6006M31
6710C73J5522L780j0177m742L375n722o874n865K607K7508q087j5011p039m954
6696a5306J533K2174K1087J4539k9233k8152K6901L81j3057n678M546K946q095
6683e414q751J2341m081p398n76Q600P827j6946j9829K0065L2725Q639r435Q074
6669B5841K6319K5407n681j1748K323K338j4105r821k2778k0283J3745M4400K4645
6656H0602p353j8460jm217o773K0185K369l6095m3965j7297K5943M4020j520j0983
6642B6455k9883l994j2861J3647J8650J0232M145O104k6840P851J9064M96j897
$$ y = [-51765, -49813, -54040, -54152, -39552, -26673, -4724, 40531, 64800, 40936, 30264, 30149, -9290, -42337, -19182, -33170, -28302, -37003, -39680, -19020, 8046, 12417, -22848, -36251, -26064, -58, 373, 15895, 19675, 9498, 4756, 8131, 2409, -4465, -10330, -7723, 19785, 11698, -3313, -10352, -15306, -13773, 8401, 29488, 44027, 14794, -13358, 13543, 13924, 867, -4811, -265, 2681, -5414, -14165, -1824, -5905, -13303, -13879, -5279, 2548, -14398, -34227, -14162, 18563, 27202, 17767, 25841, 52160, 77567, 71886, 60138, 62461, 64799, 50694, 40873, 18095, -2188, 11557, 55957, 80602, 73249, 54789, 54788, 50571, 43798, 63983, 66352, 30257, -13708, -31005, -5062, 38958, 37438, 26455, -3428, -7422, -20283, -6636, 12014, 22246, 26391, 32495, 5655, 13506, 32570, 33066, 31169]
6629C1169K1542q255j9162k1067P697M116k0071J3562K1437J357j5618Q892O222
6616C1821L4333L3915L073l3773J414m846n131j9781j5549P656R78r770k7532
6603c192m8359q858O526j1854L5642K2259J4401p675l1218k7066J8449J8862P363
6590a4720K523q784j1582j452J7631k3548J0630J1028j1610M496j5163j985J1263
6577c1273L4236k012q393k4559K97J0720m549K1000O029J1336l322L377n84j4832
6563b529L279k8015Q221j799r97J2889L752k5154k0371k84N484K4878K1353j3912
6549a3205J0209n901P774J3125P884J1890k9437j0105N672L0114q246j4032m69
6536E273Q08J4468m964p736r91M365j1549J6324j616o104j1747N855P85n053j3250
$$ y = [31169, 52711, 44456, 25294, 4227, 11924, 16040, -4031, 9531, 30968, 32325, 16707, 25599, 31821, 66154, 100069, 103142, 69369, 70783, 65937, 60806, 41025, 25476, 33132, 34110, 24340, -3192, -51551, -60409, -53883, -65737, -30095, -7836, 6565, -1110, -32328, -59394, -40945, -22083, -14720, -12197, -20981, -32563, -34015, -16384, -39932, -29302, -18274, -29884, -25388, -40551, -42536, -31273, 2963, 951, -7442, -32001, -31704, -20984, -25533, -4533, 1496, 12832, 9510, 12887, 12303, -2529, 750, -27265, -19044, -20843, -21840, -8951, -5199, -30353, -50724, -51008, -45524, -20646, 707, -13205, -2996, -8897, -1123, 12002, 19886, 31776, 2339, -7766, -2094, 28020, 19774, 5742, 5273, 6081, 20549, 15585, 7849, 6858, 11223, -326, 15998, 14382, 8278, -3469, 2386, 3171, -1882, -15132]
6521a5132J641Q142J7360j467R50n650j8040j041k606k1046N689O369o994o678
6507c8503k0895j5645J9311J0619j1257o405J3150K982k5825K1750J5505N0090
6495A4877J0381l3218j6544k7669M515K5307J2400n537k604o480M1753K3846r870
6482C1157m0528q525r200j4512O961J2107K659J340p892m520K0728k3266m1865
6469g5356M021L4411K6147K3505o559l3888j9795P753M7028K4459J827k639m2657
$$ y = [-15132, -13491, -5349, 12011, 10544, 11494, 5844, -12196, -13237, -15843, -36889, -31200, -24831, -31825, -38503, -59398, -75043, -55732, -45113, -56370, -62775, -49625, -46643, -72468, -50718, -35213, 14877, 25258, -7960, -24504, -52173, -47658, -22351, -9951, -15488, -18092, -24572, 17181, 41027, 31157, -9371, -17896, -27096, -41608, -34647, -22540, -19881, -18541, -26433, -30953, -10225, -33491, -75356, -71335, -36924, -10777, 12728, 6169, -27719, -47514, -39761, 7267, 31726, 33553, 30914, -11743]
$$ [...]
##END NTUPLES=NMR SPECTRUM
##END=
