##TITLE=Analysis number 288852
Compound Code cc 24504
Project Code adrs
Chemist Name ugmt
##JCAMPDX= 6.0         $$ Bruker NMR JCAMP-DX V2.0
##DATA TYPE= NMR SPECTRUM
##DATA CLASS= NTUPLES
##ORIGIN= Bruker BioSpin GmbH
##OWNER= NMR
$$ XWIN-NMR		Version 3.5
$$ Mon Nov 28 09:09:08 2005 GMT Standard Time (UT+0h)  MAYBRIDGE\NMR@NMR_250MHZ
##.OBSERVE FREQUENCY= 250.131544655141
##.OBSERVE NUCLEUS= ^1H
##.ACQUISITION MODE= SIMULTANEOUS (DQD)
##.ACQUISITION SCHEME= undefined
##.AVERAGES= 16
##.DIGITISER RES= 18
##SPECTROMETER/DATA SYSTEM= av250
##.PULSE SEQUENCE= zg30
##.SOLVENT NAME= CDCl3
##.SHIFT REFERENCE= (INTERNAL, CDCl3, 0, 16.522)
##AUDIT TRAIL= $$ (NUMBER, WHEN, WHO, WHERE, WHAT)
$$ ##TITLE= Audit trail, XWIN-NMR		Version 3.5
$$ ##JCAMPDX= 5.01
$$ ##ORIGIN= Bruker BioSpin GmbH
$$ ##OWNER= NMR
$$ C:\u/data/dgb/nmr/ADRS/1220/pdata/1/auditp.txt
$$ ##AUDIT TRAIL=  $$ (NUMBER, WHEN, WHO, WHERE, WHAT)
(   1,<2004-03-10 11:53:32.09 +000>,<MAYBRIDGE\NMR>,<NMR_250MHZ>,
      <created by zg, POWCHK disabled, PULCHK disabled
       configuration hash MD5:
       F7 82 56 CA 20 C3 44 8E CC 2A 7C B7 F4 90 93 D2
       data hash MD5: 64K
       1E 51 4E 68 BB 61 72 64 23 84 1E C3 67 02 C4 E8>)
(   2,<2004-03-10 11:53:46.44 +000>,<MAYBRIDGE\NMR>,<NMR_250MHZ>,
      <Start of raw data processing
       ef LB = 0.3 FT_mod = 6 PKNL = 1 SI = 32K 
       data hash MD5: 32K
       BF 26 40 8C 07 3B 8B D8 79 DA 63 4D C9 4B 8B D7>)
(   3,<2004-03-10 11:53:48.50 +000>,<MAYBRIDGE\NMR>,<NMR_250MHZ>,
      <apk 
       data hash MD5: 32K
       78 7E 50 3B C1 BA F3 5C 19 94 F0 EC 34 A3 95 8B>)
(   4,<2004-03-10 11:53:49.44 +000>,<MAYBRIDGE\NMR>,<NMR_250MHZ>,
      <abs ABSG = 5 
       data hash MD5: 32K
       86 79 58 F8 3B 86 D0 1E 40 43 C4 25 44 B6 B6 8C>)
$$ ##END=
$$ 
$$ hash MD5
$$ 6F 3C BF 30 21 99 68 C9 AE B0 39 50 D8 B4 4B 4F
##$RELAX= 
##$RELAX= 
##$RELAX= 
##$RELAX= 
##$RELAX= 
##$RELAX= 
##$RELAX= 
$$ Bruker specific parameters
$$ --------------------------
##$DU= <C:\Restored>
##$EXPNO= 1220
##$NAME= <ADRS>
##$PROCNO= 1
##$TYPE= <nmr>
##$USER= <dgb>
##$AMP= (0..31)
100 100 100 100 100 100 100 100 100 100 100 100 100 100 100 100 100 100 
100 100 100 100 100 100 100 100 100 100 100 100 100 100 
##$AQSEQ= 0
##$AQ_mod= 3
##$AUNM= <au_zg>
##$AUTOPOS= <34 >
##$BF1= 250.13
##$BF2= 250.13
##$BF3= 250.13
##$BF4= 250.13
##$BF5= 500.13
##$BF6= 500.13
##$BF7= 500.13
##$BF8= 500.13
##$BYTORDA= 1
##$CFDGTYP= 0
##$CFRGTYP= 5
##$CHEMSTR= <none>
##$CNST= (0..31)
1 1 145 1 1 1 1 1 1 1 1 1 1 1 1 1 1 1 1 1 1 1 1 1 1 1 1 1 1 1 1 1 
##$CPDPRG= <>
##$CPDPRG1= <>
##$CPDPRG2= <>
##$CPDPRG3= <>
##$CPDPRG4= <mlev>
##$CPDPRG5= <mlev>
##$CPDPRG6= <mlev>
##$CPDPRG7= <mlev>
##$CPDPRG8= <mlev>
##$CPDPRGB= <>
##$CPDPRGT= <>
##$D= (0..31)
0 2 0 0 0 0 0 0 0 0.06 0 0 0 0 0 0 0 0 0 0 0 0 0 0 0 0 0 0 0 0 0 0 
##$DATE= 1078919611
##$DBL= (0..7)
120 120 120 120 120 120 120 120 
##$DBP= (0..7)
150 150 150 150 150 150 150 150 
##$DBP07= 0
##$DBPNAM0= <>
##$DBPNAM1= <>
##$DBPNAM2= <>
##$DBPNAM3= <>
$$ [...]
##$SUBNAM7= <"">
##$SUBNAM8= <"">
##$SUBNAM9= <"">
##$SW= 20.6930455092707
##$SWIBOX= (0..15)
0 0 3 0 0 0 0 0 0 0 0 0 0 0 0 0 
##$SW_h= 5175.983436853
##$TD= 65536
##$TD0= 1
##$TE= 293.16
##$TE2= 300
##$TE3= 300
##$TEG= 300
##$TL= (0..7)
0 120 120 120 120 120 120 120 
##$TP= (0..7)
150 150 150 150 150 150 150 150 
##$TP07= 0
##$TPNAME0= <>
##$TPNAME1= <>
##$TPNAME2= <>
##$TPNAME3= <>
##$TPNAME4= <>
##$TPNAME5= <>
##$TPNAME6= <>
##$TPNAME7= <>
##$TPOAL= (0..7)
0.5 0.5 0.5 0.5 0.5 0.5 0.5 0.5 
##$TPOFFS= (0..7)
0 0 0 0 0 0 0 0 
##$TUNHIN= 0
##$TUNHOUT= 0
##$TUNXOUT= 0
##$USERA1= <user>
##$USERA2= <user>
##$USERA3= <user>
##$USERA4= <user>
##$USERA5= <user>
##$V9= 5
##$VALIST= <valist>
##$VCLIST= <CCCCCCCCCCCCCCC>
##$VD= 0
##$VDLIST= <DDDDDDDDDDDDDDD>
##$VPLIST= <PPPPPPPPPPPPPPP>
##$VTLIST= <TTTTTTTTTTTTTTT>
##$WBST= 1024
##$WBSW= 4
##$XGAIN= (0..3)
0 0 0 0 
##$XL= 0
##$YL= 0
##$YMAX_a= 705313
##$YMIN_a= -606794
##$ZGOPTNS= <>
##$ZL1= 120
##$ZL2= 120
##$ZL3= 120
##$ZL4= 120
##$ABSF1= 16.522
##$ABSF2= -4.171173
##$ABSG= 5
##$ABSL= 3
##$ALPHA= 0
##$AQORDER= 0
##$ASSFAC= 0
##$ASSFACI= 0
##$ASSFACX= 0
##$ASSWID= 0
##$AUNMP= <proc_1d>
##$AZFE= 0.1
##$AZFW= 0.1
##$BCFW= 0
##$BC_mod= 0
##$BYTORDP= 0
##$COROFFS= 0
##$CY= 12.5
##$DATMOD= 1
##$DC= 0
##$DFILT= <>
##$DTYPP= 0
##$F1P= 14.000002074242
##$F2P= -0.500000172853497
##$FCOR= 0.5
##$FTSIZE= 32768
##$FT_mod= 6
##$GAMMA= 0
##$GB= 0
##$INTBC= 1
##$INTSCL= 1
##$ISEN= 128
##$LB= 0.3
##$LEV0= 0
##$LPBIN= 0
##$MAXI= 10000
##$MC2= 0
##$MEAN= 0
##$ME_mod= 0
##$MI= 0
##$NCOEF= 0
##$NC_proc= -3
##$NLEV= 6
##$NOISF1= 0
##$NOISF2= 0
##$NSP= 0
##$NTH_PI= 0
##$NZP= 0
##$OFFSET= 16.522
##$PC= 1
##$PHC0= -61.92175
##$PHC1= 5.361416
##$PH_mod= 1
##$PKNL= yes
##$PPARMOD= 0
##$PSCAL= 4
##$PSIGN= 0
##$REVERSE= no
##$SF= 250.13
##$SI= 32768
##$SIGF1= 0
##$SIGF2= 0
##$SINO= 400
##$SIOLD= 32768
##$SREGLST= <1H.CDCl3>
##$SSB= 0
##$STSI= 32768
##$STSR= 0
##$SW_p= 5175.98343685301
##$SYMM= 0
##$S_DEV= 0
##$TDeff= 65536
##$TDoff= 0
##$TI= <Compound Code MO 07188
Book Reference 345/58
Chemist Name Wendy
Crude

>
##$TILT= no
##$TM1= 0
##$TM2= 0
##$TOPLEV= 0
##$USERP1= <user>
##$USERP2= <user>
##$USERP3= <user>
##$USERP4= <user>
##$USERP5= <user>
##$WDW= 1
##$XDIM= 32768
##$YMAX_p= 443930322
##$YMIN_p= -254099
$$ End of Bruker specific parameters
$$ ---------------------------------
##NTUPLES= NMR SPECTRUM
##VAR_NAME=  FREQUENCY,     SPECTRUM/REAL,   SPECTRUM/IMAG
##SYMBOL=    X,             R,               I
##VAR_TYPE=  INDEPENDENT,   DEPENDENT,       DEPENDENT
##VAR_FORM=  AFFN,          ASDF,            ASDF
##VAR_DIM=   32768,         32768,           32768
##UNITS=     HZ,            ARBITRARY UNITS, ARBITRARY UNITS
##FACTOR=    0.157963299565203, 1,           1
##FIRST=     4132.6476996994, 0,             0
##LAST=      -1043.33573715361, 0,           0
##MIN=       -1043.33573715361, -254099,     0
##MAX=       4132.6476996994, 443930322,     0
$$ Real data points
##PAGE= N=1
##DATA TABLE= (X++(R..R)), XYDATA
$$ [...]
24774a3207J2566l449j541k769M995P152J226j4031K307J4508J4403j107m467
24761A6586K66m127j7556o646J0085J312P294j323j2878J2065r67J436p293M466
24747B720o95o445m915l436J1020n921j9777o088J7933J3631P475K974k940q311
24733b775j349L124q459j0177m421p67J703N759Q201N70J719Q037o782o789K495
24718i911k657m2j0091J695M864K554J037m990J1654l631L896j449J109J616J386
24703b960M714M821J649J1982l610p736n951M615l849l426p481k839j0066P0R748
24688a0319J0967k121J2719M771q098l012j08k070J082L854o848j5709P92p9l212
24673a7391n799J4293K781o138m89l214P547J0059n341p748K647O480J5580m20
$$ y = [-13207, -641, -4090, -5631, -8400, -3405, 3747, 4973, -9058, -6751, 7757, 22160, 21053, 16586, 16852, 12725, -4831, -11477, -1392, -80, 7214, 5891, -6987, 5078, 4111, 5547, -1746, 2720, 2025, -4420, -9335, -12771, -1751, -7672, -27449, -33537, -15604, -1973, 5502, 8476, 5536, -2775, -4124, -1000, -9459, -19636, -24057, -24824, -23121, -17362, -9161, -8591, -6872, 1165, -5617, -12406, -9911, -12568, -12610, -22701, -21006, -16142, -13588, -12551, -17541, -5887, -9518, -5622, -7071, -5962, -4346, -2960, 1754, 6575, 8224, 20206, 16596, 8860, 2909, 7524, 3675, 249, -7232, -10071, -20137, -20067, -10319, 648, -1473, 11246, 16017, 7919, 4907, 4799, 2729, 3811, 7665, 817, -14892, -14100, -14179, -17391, -23190, -8897, -6116, -12254, -12743, -15957, -8410, 1649, -3692, -11440, -8793, -2313, 13267, 12847]
24659A2847m579L501m775j9000j9735l35J6385J948k847K147J0827j130j708l064
24645i518M983J484j354J429J1391k296j2803J494j2692o009J1368J0083N422
24632B982j313j0206n477J3634J6486l162k0465k1407J599L551n47R489J0521
24619d315P16p670P69l866J0491J0738n355n482K305J9465K088j6999j5143J352
24605a0906J5394k391k5993k026J1293N437K853r129l990O648l183L218N947J209
24591e619l933J8272M780r009j5460l355p088M829M242j996M348Q432J1754l238
24577F959q045l153K258n920l229l333R179L939j502l524l964N096K406l471j806
24562h110Q72r167j6161r825J4640J0743O87L407J882R965N296j8207j0401j009
$$ y = [12847, 8268, 11769, 6994, -12006, -31741, -32076, -15691, -13743, -16590, -14443, -3616, -4746, -6454, -9518, -4535, -3051, -4405, -2976, 8415, 6119, -6684, -5190, -17882, -23891, -12523, -2440, 2982, 1669, -8537, -14014, -380, 16106, 12944, -7521, -28928, -27329, -23778, -24325, -14836, -4315, -3599, -11269, -10500, -14366, -3875, 6863, 1508, -3974, -1669, 17796, 19884, 2885, -12258, -10906, 4488, 2097, -23896, -25922, -14629, -9192, -6339, -15468, -19458, -12810, -15993, -12775, -6828, -5619, -9552, 8720, 13500, 4491, -10969, -14324, -21412, -16583, -12341, -14337, -9989, -1557, 10197, 6959, -1086, -4239, -1981, -7901, -11130, -14463, -5284, -1345, -2847, -6371, -10335, -5239, -2833, -6304, -8110, -7238, -16405, -32566, -42391, -27751, -17008, -16321, -12914, -11032, -1067, 4229, -13978, -24379, -25388]
24548b5388n277J6326M201N719L170J520L903j316r715J2611J0645o986o725r709
24534g021j3143L074L24R943J8297k913K787P239J083j0562n979j0104P28J0183
24520C936j2621o86n795n320Q548J2171Q476k456J178K629m867k716M318m112
24506B683o312l476M734J718O328M091o457l821o957p811K247P027o40q095M726
24491a0015J3350o46j659K272J054O21k111j5502k808L849J3727o369p137R392
24477a982q397n099J1839R102Q763n281j898j935n248M385p789Q40K852o144j0034
24462a6026J0178N955k294M033l071r333r856j813M319L436L110M497J0832l94
24448C573J726J206m266j1353M449J4451J74p803K052O279n597p738j2859K134
$$ y = [-25388, -30665, -14339, -10138, -4419, -1249, 271, 4174, 2858, -6857, 5754, 16399, 9413, 2688, -7021, -20164, -17090, -16766, -6823, 11474, 8561, 11348, 18587, 19670, 9108, 3129, -6975, -6247, 3936, -8685, -9371, -15166, -20486, -11938, 233, 8709, 6253, 7431, 10060, 5193, 2477, 6795, 2683, -3629, -7105, -2371, -653, 5675, 9766, 3309, -512, -7469, -15280, -13033, -6006, -6646, -14741, -10015, 3335, 2689, 1030, 3302, 4356, 4977, 2866, -12636, -15444, -11595, 2132, -4237, -11374, -1982, -10379, -15478, -3639, 5463, 14226, 8945, 7047, 5112, -136, 4249, -3540, -2700, 152, -5992, -16026, -5848, 107, -2187, 1846, -1225, -10558, -20414, -22227, -17908, -14472, -11362, -6865, 3967, 3573, 5299, 6505, 2239, -9114, -4665, 9786, 9960, 2157, 4209, 10488, 4891, -2847, -15706, -13572]
24434a3572J6607K959J631O152l237M680q182j8016j0494M480l034n565j150J4313
24420a2428K241r84m50J383n264o151N999M16L113J2627K86N995O17J038k287
24405F151m777K981J037m062j276r816L636R016L454n143o089N829K219j339q681
24390f860j1247L804J8901P316q830j3426j0121P434K36k813J2695o91p463J344
24376i721J614N997J6937J887N161o145k208o647p484n986j551p27n26q925m040
24361b2364P954K353p04q99j213M937o13k78R485l149Q30L831O616J18j628J26
24345E402L424J0368L880j0820n588k397l115j811R754j557q037j6289j2935J2612
24331a7109K6746J0102N133l671j8129l902j510O60m835o598n659q66J5153J0399
$$ y = [-13572, 3035, 5994, 7625, 13777, 10540, 15220, 7038, -10978, -21472, -16992, -20026, -25591, -26741, -12428, -10187, -11171, -11621, -10238, -15502, -21653, -15654, -15238, -12125, 502, 788, 6783, 7400, 8438, 6151, 1374, 4355, 5392, 1330, 54, -9762, -6126, 2890, 6344, 1201, -4888, 941, 3160, 1821, -6860, -18107, -14303, 4598, 11914, 3084, -10342, -20463, -13029, -12793, -15606, -2911, -3602, -11065, -9721, -8107, -2110, 14827, 16714, 21875, 15730, 13522, 6875, -609, -6595, -8146, -8873, -9399, -18324, -22364, -14410, -12057, -12761, -13660, -14873, -9936, -10549, -10827, -1342, -4491, -3661, 170, 6786, 6904, 5276, 5402, 8826, 19194, 23074, 12254, 6666, 4269, 1154, -657, 9097, 7540, -497, -16786, -29721, -17109, 9637, 19739, 24872, 21201, 3072, -830, -2340, -1680, -6515, -13113, -18772, -19638, -4485, 5914]
24317E914j0424p647K933r813r570O34R368J8325l697L520P081O407N87m271k0588
24302a1241L158K14o66n302q527M571R425M791L878K17K045L890J256k045n482
24287A82j0134J0906k22J69R999K183l079N52L099J189m832o319m501Q327j279
24272F240p146k259P14M573J0406j09j0097J67m549p975p327m739M243O521N920
24257e417K033k917Q88j0262r570P366R170p613J680P981P012O785K260j984K937
24242A0349j0718o028j589P695L850J463M642n090j073M982L663J1925N61o633
24228A7999k506o422j9K404k294q834o111J457R200J628n062l181j2576Q192J8975
24213A2850j661k194M29L497l325n383l198o686j631p07n23l466o53Q133M653
$$ y = [5914, -4510, -12157, -9224, -19037, -28607, -27973, -18605, -280, -3977, -457, 6624, 13031, 13618, 9347, -11241, -8083, -7869, -8535, -13837, -22364, -17793, -8368, -3577, 301, 518, 2563, 6453, 7709, 5664, 182, -9952, 954, 732, 901, 10900, 13083, 10004, 10556, 13655, 14844, 10012, 3693, -808, 7519, 6240, -906, -3165, -2451, 2122, 12528, 12419, 2322, 2489, -2060, -10035, -17362, -22101, -17858, -11337, -5417, -3384, -6301, -5413, -15675, -25245, -17879, -8709, -16322, -14642, -6661, 351, 7136, 9396, 7412, 10349, -369, -6397, -7986, -291, 3559, 5022, 9664, 4574, 3501, 8483, 12146, 24071, 24632, 17999, 15493, 9071, 9052, 11456, 9162, 328, -5783, -4326, 4874, 6502, 1440, -1741, -14317, -6125, 12850, 11189, 8995, 9424, 12921, 9596, 4213, 1015, -5671, -7302, -8009, -8532, -11998, -12651, -4518, 135]
24198A35L870P53o207J374j0109J2957K3179K921q757j2843j4368k97N612O755
24184D975l67K879q238n983J0507l208K124o944j2241l370k112J1304J6703P238
24170A3267J459k441m213N251q253q57k954r538J496n099J2477R751J582M365
24156A6293J066o514l171n404l805o429m852J9273M925N327N160j1385K513m670
24142H327j0095n336P52P462K899K725j153p035n22J0474O672m982M198Q861m973
24127A8274p235k353l20m392M065K720J886K337l902j620K91n002j1818j678p78
24112i525P408J8770R913l555q234J301j2825o00O180j1488p191P963J1273n317
24098D073Q166m276j0690n107k932M21P91p33j1302o069M160N689K426j947k42
$$ y = [135, 4005, 4758, -1449, -75, -10184, 2773, 25952, 28873, 20116, 7273, -7095, -7392, -1780, 4975, 4608, 7487, -751, -6734, 3773, 565, 2689, -4255, -16496, -19866, -21978, -10674, 6029, 13267, 14726, 12285, 8072, 13323, 5070, 4213, 1259, -8279, -6783, -11882, 595, 10346, 11928, 16293, 17359, 10845, 7674, 2270, -1535, -7964, -12816, 6457, 11382, 16709, 21869, 10484, 12997, 8327, -1768, -7104, -6352, 1110, 4009, 6734, 5581, -1454, -1976, 8498, 15170, 10188, 14386, 23247, 18274, 11039, 8686, 8366, 3974, 8039, 10759, 12645, 14982, 11080, 9460, 9751, 4749, -7069, -8747, -9525, -2117, 16653, 26566, 23011, 14777, 16078, 3253, 2653, 8833, -2655, -9846, -1883, 9390, 4073, 12239, 7963, -2727, -7834, -10766, -10345, -9554, -10287, -21589, -27658, -23498, -17809, -15383, -17330, -17572]
24083a7572L734K628Q374L27N80p116j0745P533K697o98q15n042k755J1901N676
24068a293o403n211q506O49n553P014J7642K301Q32l256J594o527n548m676N79
24053a6362O338Q500j77n130p970l692P332M311j20P01J96n51J4371J6726k572
24038B1901j3391j4681K371k844j089L951M714J912j198k290k241J9744N466j013
24024B1312j1156j2711L971n199m755m374p84M413O264n492k374J386r761J0007
24010i253m762m482j7678J3615M482o566p977N715J7532M825L474r275q593J2433
23996f510R368q245n964o601K45J7689N56n672l436P822j8391l035k347j0415
23982c4936j2059O852J8022K091j2046J099q240J1937J6480P618K903N602o554
$$ y = [-17572, -13838, -11210, -2836, -2509, -1929, -9045, -19790, -12257, -9560, -10258, -11073, -16115, -18870, -6969, -1293, -7696, -12907, -21413, -20764, -26317, -19303, -1661, 640, 1472, -1784, -190, -6717, -12265, -16941, -16362, -10024, -1524, -1701, -6831, -14801, -18493, -11161, -6850, -6970, -6269, -6073, -6624, 7747, 24473, 21901, 8510, -6171, -3800, -6644, -7733, -3782, 932, 2844, 1646, -644, -2885, 16859, 22325, 21312, 10156, -2555, 1416, -3783, -8538, -12912, -13696, -9283, -3019, -8511, -10885, -9499, -19260, -9253, -14015, -18497, -36175, -22560, -18078, -24644, -32621, -26906, -9374, -4549, -1075, -10350, -18943, -6510, 2858, -5387, -11351, -17952, -17707, -18, 538, -5134, -8570, -748, -19139, -22174, -24521, -34936, -46995, -40143, -22121, -20030, -32076, -30977, -39217, -27280, -10800, -3182, -279, 5323, -1231]
23969a231j0798l003M300R88R696L314q847j2164M582j897M446J246K115J847
23955e406M875l925L993M605p605k8M36J3288j003j4497p861Q247R677l867o036
23940e107J2967L979l633M073P69m674j839J509P441j216j863j2743k144j07j4379
23925a6967K937P915r002R555J0359N431q129j2073j0507Q694J720m079Q659J7409
23911A1922L842q317r079L061L036j3896M814K041k595l859Q273Q671J803o120
23897C597O504o345l754j0006k082m069L038P474N764n34K345l181o77j0742j477
23882a4145N078P914k08j2077k624r21l657O740R533n645p095M484J031m894R913
23867f573o23N769n110K757N632K770n772n978j567J3487N126n553p526m402O531
$$ y = [-1231, -12029, -15032, -10732, -9744, -48, 3266, -5581, -17745, -13163, -15060, -10614, -9368, -7253, -5406, -531, -4456, -463, 4142, -3463, -3491, -3055, 10233, 9230, -5267, -13128, -4881, 4796, 929, -5107, 7860, 11839, 8206, 12279, 13048, 8374, 6535, 8044, 15485, 14269, 12406, -337, -2481, -2588, -16967, -14030, -6115, -15117, -5562, 4797, 10228, 2099, -9974, -20481, -11787, -10067, -14146, -5487, 11922, 15764, 7447, -1632, 1429, 4465, -9431, -4617, -2576, -5171, -9030, -757, 7914, 9717, 3597, 10101, 3756, 2, -10004, -12086, -16155, -13117, -5643, 121, -413, 1932, -1249, -1926, -12668, -14145, -9067, -1153, -1361, -13438, -16062, -16983, -20640, -13900, -4367, -10012, -17107, -12623, -11592, -16486, -6573, -7196, -1427, -6537, -3780, 1852, 4622, -1150, -7128, -8695, 4792, 9918, 4365, -3161, -7563, -1032]
23852a032J549l854j6510l856K0368J0606Q093M684p611j1386k996K806j3288
23839a2427l599o715M039k114J921L17K188N520J3530j222q272j1485P336M840
23825f143Q765L06j1089q574O837p7k16L235l757J1100m599K122q86m601n471
23810a3048L154k283r806J2822J8683n596q240k93r790m28k739r517O027j913
23796b2967p856K657j468R234J2944P683p610j308J3915k074p56N334j374K185
23782H539J456j452n279m104p881N96K919L690K961N312q110j0197P919L947M894
23767E210L25j67P487m804j4908q302j939J7803M957q845K735L60K536j0136m869
23752a2557j089N618J2330j109j327J320K272j4199j0671P365J8781N050R060
$$ y = [-1032, 517, -3337, -19847, -23703, -3335, 7271, 15364, 20048, 12437, 1051, -1945, 861, -12427, -16026, -22741, -18702, -20816, -18895, -18578, -16390, -10870, 2660, 1438, -6834, -18319, -10983, -6143, 2622, 2928, -8161, -16735, -9898, -9975, -10191, -6956, -10713, 387, -4212, -2090, -2976, -7577, -13048, -9894, -12177, -21983, -9161, 9522, 3926, -4314, -4607, -14397, -14825, -17564, -27081, -21054, -22967, -30823, -28166, -29634, -20400, -7456, 227, -7383, -8691, 5224, 3150, 2394, 7728, 6354, 8539, 9995, 8543, 3264, -840, -8721, -8125, -5206, -1516, 1445, 6757, -1353, -11550, -3631, 316, 5210, 5535, 5368, 12855, 8051, -6857, -15159, -17098, 705, 5662, -3183, -448, -88, 2448, -7688, -12557, -13646, -8028, 4302, 3193, 1866, 3186, 5458, -8741, -19412, -12047, 6734, 11784, 20844]
23739B0844j377O869j2787j0483l849N199M075K813n15j406o419L733m734L270
23725E233N027L148q005j0172k913o70M17Q301P52k1901n833J1697J6343P547
23711H971j988m351N15m540P932j0070N218J291j4042j335j657n951Q690J616
23697i701K005J3445J8038L747j0470k1652j1062q950P793J0171Q92M093l821
23684e472J952M975r631k804P254J458q812N36J3983R4n892n031Q411L914k424
23669B511l133j3569o241L309p453Q415Q050p672L743R991K833q764r797j693
23655a9470K541J778P34l242j0078q347r31M536P781J1282O053k782o564N481
23641a1228M931q195j0290N978J4500M889j186P873J847n909K651O4k816j837
$$ y = [20844, 19467, 26336, 13549, 3066, -783, 4416, 8491, 11304, 10789, 9383, 2964, 6697, 1963, 5233, 10260, 13408, 5403, -4769, -7682, -8352, -7935, 366, 1118, -20783, -26616, -14919, 1424, 8971, 6983, 2632, 3147, -1393, 6539, -3531, 1687, 2978, -11064, -12399, -14056, -20007, -11317, -9701, -7696, 5749, 23787, 27534, 17064, -4588, -15650, -24600, -16807, -6636, -5744, -1651, -5472, -3520, 1455, -8176, -10980, -3726, -2268, -11080, -10544, 3439, 3533, -2359, -7390, 1021, 4935, 2511, -622, -14191, -20432, -17123, -24576, -16161, -8111, -15783, -12040, -2049, 784, -7980, -17777, -19470, -16929, -15151, -14417, -17659, -27737, -36084, -37015, -32479, -24698, -13416, -7363, -10145, -16709, -11228, -6297, -14492, -24782, -18804, -4304, 585, -601, 7272, 9119, 3210, 5861, 5925, 3109, 1272]
23627A272k1767m067O707O153O151j348l173j613m181Q808P464j742n539m420
23613a1295K221L599P276M609P204O195r266j0484J1805L509p81l299q220m693
23599a620j5795j875R148L060J044Q495j1806N925N343O227n706l350j058P11
23585a257j1884N237J794J1949J8763P110j2111j6550q083k347R495J0020j799
23572A0337r649n820m231n430L162j635j982O467j1112j059J7672J6050j6502
23559c732n733L074q677o407J0853J5678Q869j998k0458K853L87J857P845l896
23545E15j3152M801K255p274J0594J803j695l77M261m026k340k307N88L23R999
23530C968J4448j0235p902k097L007P147o18L152Q087K456k376k455o671r372
$$ y = [1272, -20495, -24562, -17855, -11702, -5551, -6899, -10072, -11685, -15866, -7058, 406, -1336, -6875, -11295, -9074, -5475, 1801, 6410, 13614, 19809, 10543, 59, 11864, 15373, 14592, 11293, 3073, -1620, -17415, -19290, -10142, -7082, -6038, 2457, -9349, -3424, 1919, 8146, 2440, -910, -1968, -1257, -13141, -7904, -6110, 5839, 24602, 31712, 19601, 3051, -5032, -7379, 2116, 12136, 10337, 688, -5132, -9363, -14793, -11631, -13266, -15248, -8781, -19893, -20952, -3280, 12770, -3732, -9465, -6391, -15068, -21475, -10622, 5056, 13925, 11927, -8531, -5678, -5291, -3434, 4411, 515, -12637, -7836, -5581, -12855, -2261, -458, -2153, -2530, 1731, -2295, -4635, -6942, -6354, -6031, 3968, 18416, 8181, 279, -1818, 1189, 8336, 7718, 10870, 18957, 21413, 19037, 16582, 9911, 539]
23516E39N338P710k157K704l444l40j352L521J220j1182j5003P985N269O782j05
23501G485K824j1027J1282P907P566j3477j4580l112K677j7113O07J4747J1925
23488G711n807r484p009K2J26N535Q482N521Q342k944j2623j4618O082L290J0225
23473B851J5836j862j6554Q307R068j0681j5936k930N58R293M773j9133j805J5506
23459b709K697L218N006n861j356l124o062J0442J930p152o94k761j246j3474
23445b1146Q054O826m816K138L699J933J820O904N078o048r259j797o468j852
23431a4934o300k275R642K948Q512J4763l267k605m672k734j1377r609k413R730
23417a4591Q380n282j2973J86O336M127n018j746K794N239P316J943l551P767
$$ y = [539, 5877, 13587, 11430, 14134, 10690, 10350, 8998, 12519, 13739, 2557, -12446, -4461, 808, 7590, 7485, 10309, -718, 10564, 18471, 26037, 12560, -2020, -5132, -2455, -19568, -18961, -4214, 7711, 1904, -7580, -14589, -14567, -14441, -8906, -424, 5097, 13439, 10495, -2128, -16746, -10664, -7374, 2851, 18687, 16825, 271, 8578, 17646, 6965, -8971, -11901, -11343, -2050, 2723, -16410, -18215, -2709, -12, 3206, 8212, 2351, 995, -2129, -8191, 2251, 4181, -2971, -3665, -6426, -7672, -21146, -13092, -6266, -11082, -8944, -5245, -3312, -1492, 5412, 10490, 4442, -4817, -6614, -13082, -14934, -21234, -23509, -13867, -10919, -2407, 12356, 9089, 6484, 1812, -922, -12299, -21908, -24321, -14591, -6211, -11493, -24466, -24280, -17944, -13817, -18835, -20581, -17787, -12548, -5232, -3289, -6840, 927]
23403I27J4542p549Q15M402o471m735J2407j0081k9462j4887J2277J8368M627
23390d820P042j746o602k986J0491j395k329j0634j503J2799J888J693j284l180
23376b566M264j1791j1484M380K42k754j0964J3495q18k350L686L379P156j187
23362g312k330J0440N912m191O308n040j0183J6539m996j1586M361K610J5012
23349A5544p3m902M688R367m845l281k833q535O377p147q348k941J08J2252Q645
23334A4076J660j713o157o172L775l546R22n148o391J269P160K6305J3099n654
23320C3485j7026j0186p355j2903m496j000M175K268N294J3392J5338l52p236
23307A3398K176j4091O643q768j0557J0447K283k315J6848M744L565n23o366j476
$$ y = [927, 15469, 7920, 8735, 13137, 6666, 1931, 14338, 4257, -25205, -40092, -27815, -9447, -4820, 2222, 476, -6126, -9112, 1379, -16, -2345, -12979, -14482, -1683, 205, 1898, 614, -2566, 1698, -10093, -21577, -17197, -16955, -19709, -30673, -17178, -17996, -20346, -16660, -13281, -6125, -7312, -9642, 798, 6710, 2519, 8827, 3787, -6396, 10143, 5147, -6439, -2078, 532, 15544, 15471, 10569, 15257, 24624, 19779, 16498, 13665, 5130, 11507, 4360, -3988, -6929, -6821, 5431, 14076, 15736, 14023, 7866, 1694, 5469, 1923, 2845, -2303, -8694, -7425, -265, 26040, 39139, 33485, 16459, 6273, -1082, -13985, -18481, -19481, -15306, -13038, -7744, 5648, 20986, 20634, 13398, 15574, 1483, 8126, -642, -11199, -752, 1531, -784, 16064, 20808, 24373, 23850, 17484, 16008]
23293A6008q345j3707r121J0362K353p958M190J525J87J065K649o660N454J439
23279e59K886o364k424n4o996J0737J1625O429j0832J888J2196m714j1955j6918
23265a5055L515J2078j947n257r384l983N214J1520R554l941r18J2066J603j682
23251A3383P48m093O213n286j1502L24k138J04j80q91P95J3442Q859p72j6888
23236B118j1649M546J2988K257Q374r819J99j2742L822J384L764p093R65J0939
23222A0053J2936N6o134J90o921j6903l880N982L836m626q856N129O598J0577
23208H037k49o74q664q268j0090l219M520k199K407N244J1448O034l860O972L517
23193A0956o539l262k640p187l46J3957K437j198K286o526n422k338Q338J0662
$$ y = [16008, 7663, -6044, -15165, -4803, -2450, -10408, -6218, -4693, -4506, -3441, -792, -7452, -1998, -559, 2327, -4037, -6461, -6515, -13511, -2774, 8851, 15280, 4448, 6336, 18532, 13818, 1863, -15055, -11540, 538, -1409, -6666, -16050, -20033, -14819, -3299, 6255, 2314, 1396, 13462, 15065, 13383, 14131, 10038, 16251, 10965, -537, -213, -2351, -2247, -2427, -3318, -2523, 10919, 19778, 19006, 2118, -9531, -4985, 8003, 10260, 18634, 8815, 9014, -3728, 94, 1478, 5242, -1851, -886, 10053, 22989, 23045, 16911, 17101, 10180, -6723, -10603, -4621, -785, -5411, -14267, -9138, -2540, 8037, 7788, 7114, -1550, -9818, -19908, -23127, -18607, -20806, -18399, -13155, -1707, 4327, 467, 7439, 10956, 4417, 1155, -1485, -8672, -9018, 4939, 7376, 6178, 8464, 1938, -3484, -5822, 2516, 13178]
23179A3178j0147q055O014N962j1045r606M764J6632k695p167K069j2298p239
23166a9633K661O642K901N9K267L616k516m090n557p020O714P64L550J3634n306
23151a314k597N954l230J012J472l8n139O800L925p934L043Q560l88j5066L239
23136a701O767Q338J1269k611q259j0696K645n274k441L821N302P8O445m784L900
23121A2799j4808L396k354r825P103k922n326N93Q811J0133n94K504J469L298
23107A4277M788o157K747l677m900r435K73j477N188J596J015N81m5j562j6047
23092a2835L462L066j474K478j2166n660o250J0301J390J8428Q044j2053n105
23079h374J3465l234k03J4093P919r876N49o892r683m826M108L320q71O553p592
$$ y = [13178, 3031, -5024, 990, 6952, -4093, -13699, -8935, 7697, 5002, -2165, -96, -12394, -19633, -16972, -10330, -7429, -7370, -5103, -1487, -4003, -8093, -13650, -20670, -13956, -13192, -9642, 3992, -1314, -3911, 2043, -1187, -175, 1297, 1259, -3880, 2920, 6845, -1089, 1954, 10514, 10126, -4940, -1701, 5066, 13404, 24673, 22062, 13803, 3107, 5752, 478, -1963, 1858, 7160, 7238, 13683, 8899, 12799, -2009, 1387, -967, -10792, -3689, -6611, -11937, -11344, -2533, 7600, 7006, 9510, 10979, 14277, 19065, 12908, 15655, 11978, 7078, -2357, -2084, -3561, 1627, 3223, 4238, 4819, 4774, 3212, -12835, -9373, -6307, -7781, -5303, -17469, -23129, -29379, -19078, -17688, 740, 8784, -3269, -8374, 5091, 1857, 1654, 15747, 23666, 13790, 14339, 7447, -2236, -7062, -2954, 366, -505, 6048, -1544]
23064a544j979J0869P671J0070j0965j096n754r770L841P222J2978j972r764r650
23050A57k499j5945k328o132Q232N005j369k295j370N883R962j736m248j963k859
23035a3505K374m539N178k857j997n549J1628L731m004n647j2282K316M879J1329
23021h945L391p46m141j0698j362J2514J4181J612j3138p305Q805P468L126M674
23007I436j3733j5909K151Q573M786J3137n691j2682R925J3939P828K4j2340m461
22993D983O054m764j0015Q403K978R299P77j6954j0241q86J1693J0535L886r968
22979E780o182r323q219M328j1512L175J5856J2847Q97j660l170n320o07n109
22965h219M207J2202K603R82J0057k977K120j545m785j80N91j9487n385J1233
$$ y = [-1544, -3523, 7346, 15017, 25087, 14122, 13026, 7272, -2498, 1343, 8565, 21543, 19571, 9807, 157, -2342, -18287, -20615, -26747, -18515, -13510, -14879, -17174, -18544, -12661, -2699, -4435, -8683, -10646, -13505, -11131, -15670, -10492, -13349, -15346, -20895, -9267, -5536, -9540, -15187, -27469, -25153, -20274, -8945, -5554, -6300, -10441, -21139, -22501, -9987, 4194, 5806, -7332, -14637, -5832, 1636, 4762, 9436, -4297, -20206, -18055, -9482, -4696, 8441, 2750, -9932, -7, 13932, 21760, 21784, 9444, 4983, 11037, 6273, -3742, 4661, 7639, 16938, 17715, 761, -9480, -10366, 1327, 11862, 15748, 5780, -402, -9725, -17944, -13616, -25128, -21953, -6097, 6750, 7647, 5987, 2817, -2503, -3110, -8219, -4012, 8190, 10793, 11775, 21832, 18855, 20975, 19430, 14645, 14465, 15056, -4431, -9816, 1417]
22951A417Q358l340k135l53o176k431j418l470Q637P0k564P002P787P488J2649
22936C1521o374j2302j1726o813q44J3562L069K100k935M818n846K389L721q139
22922F201k634N722J3859Q702P15o726R869p351j5609k708O279p224m449k953
22908A693J2110n351j401l580J468N279J644k436J3184k159j551l833N276j02
22894B0241j0184O665Q921j1675M57K067r65p732J07n497j8993r284J1516J1308
22880c048N697L666J9599Q372K883p559q797p61j3755L189L609K0230Q708P207
22866D9240K383J2095J5957J0614J237K4388N7724Q5206J08190J82234K36612
22855G85880J93999R6082K2900l5524q7358j82578k17033j65413j08435n8301
$$ y = [1417, 9775, 6435, 4300, 3947, -2229, -4660, -6078, -9548, -911, -841, -3405, 3597, 11384, 18872, 31521, 25147, 12845, 1119, -5694, -6538, 7024, 10093, 12193, 9258, 14076, 8230, 10619, 14340, 6201, 3567, 9289, 23148, 31850, 32565, 25839, 35708, 28357, 12748, 10040, 16319, 9095, 4646, 1693, 13803, 8452, 7051, 3471, 4939, 10218, 11862, 9426, 22610, 20451, 18900, 15067, 20343, 20241, 10057, 16722, 25643, 13968, 14425, 16492, 15527, 7795, 7902, 2405, -16588, -25872, -14356, -3048, 2649, 6315, 25914, 34286, 37169, 29610, 20813, 20052, 6297, 9486, 13095, 33325, 42033, 49240, 51623, 63718, 79675, 90289, 91526, 115914, 173638, 258844, 367034, 549268, 785880, 979879, 1075961, 1098861, 1063337, 975979, 793401, 576368, 410955, 302520, 244219]
22845B44219l1085l6140l6294j3938M25n771j6556m162j00n614q814p196m081
22832G4893L993Q847l535j4224Q074J0433q440j1310k0426j0133Q062J0324j3759
22819D2799o834P418R88j502l664p938N310O673K078O09L083j3376m685k585L81
22804B8755r875r192N105N142l76o666N112N946r48j33P911K475p023K35k110
22789B4358q823j540L34k806m36j625p646m627L920l664N159N646j0445P119N030
22774I954P937O992J6550p172j1518N703K128j1955l041P984o3o270n449q410
22760C370q258l650M195J3312o653j0032k241L888q081M908L499j1426m431P830
22746a3770J7023K314p149L761J2468M302j0520p378Q857N781R764j287L254J2476
$$ y = [244219, 213134, 176994, 140700, 126762, 127187, 121416, 104860, 100698, 100598, 94984, 86170, 78974, 74893, 78886, 87733, 84198, 69974, 78048, 88481, 80041, 68731, 48305, 38172, 46234, 56558, 42799, 35965, 43383, 44371, 42869, 39205, 31267, 36577, 43250, 45328, 45937, 49020, 35644, 30959, 28374, 28755, 18880, 9688, 14793, 19935, 19559, 12893, 18005, 23951, 23003, 22870, 30781, 33256, 26233, 26468, 24358, 15535, 13995, 14329, 11523, 11087, 9462, 1816, -2811, 1109, -2555, 2604, 8250, -2195, 4924, 9954, 17891, 24883, 41433, 34261, 22743, 28446, 30574, 18619, 15578, 23562, 23499, 17229, 11780, 3370, -4888, -8538, -4343, 8969, 2316, -7716, -9957, -6069, -14150, -9242, -5743, -17169, -21600, -13770, 3253, 5567, -1582, 2179, 14647, 18949, 8429, 1051, 9908, 15689, 25453, 24166, 27420, 39896]
22732C9896o537O590J0396r380m426k076j6116j0942j187l546J5961j265k282
22719A5086l900P70K206j7160j4172o077J3503Q86n8Q983J0963P045M470M254
22705B6799m270K056Q703q55K65j625P768k673j0442P272J899j2813k837m945
22691A4302M109O872n490J345m905j3810n419q471n810K668Q60N006L08O149L423
22676A137R720M581L773J1359p828q227J870K2n162o830l937J076K970P818K564
22661A4906L611O532N856l180J1591M846j303n966j1214j3961o29l478r754r593
22647a1736L106J5494K0027L843N099M022Q010p956j204q154n321J1684k465K046
22633C6495j3849K337Q662Q02p498j028O983P63R33J0367P219k006K16P0q758
$$ y = [39896, 33359, 39949, 50345, 40965, 36539, 34463, 18347, 7405, 6218, 2672, 18633, 17368, 15086, 11186, 11956, 14162, -2998, -17170, -23247, -9744, -8858, -8916, 67, 11030, 18075, 22545, 26799, 22529, 24585, 33288, 32433, 32698, 31073, 38841, 36168, 25726, 32998, 34897, 22084, 19247, 14302, 18411, 25283, 19793, 21138, 16233, 2423, -2996, -11467, -17277, -14609, -13749, -8743, -8435, -2286, 1137, 10857, 15438, 19211, 30570, 22742, 14515, 16385, 16407, 11245, 4415, 478, 1554, 4524, 12342, 14906, 18517, 25049, 30905, 27725, 39316, 44162, 42859, 36893, 25679, 11718, 11089, 7611, -2143, -11736, -8630, 6864, 26891, 30734, 35833, 39855, 47865, 39909, 38705, 30551, 25230, 36914, 34449, 36495, 22646, 24983, 33645, 34447, 26949, 25921, 32904, 33667, 34600, 44967, 52186, 50180, 50396, 50466, 41708]
22618D1708j4537r492l204m015L787J0216P096L124Q19o179N493k350j1182o888
22604A4396q024k648J515Q13Q658N534j679J2744P153j0012O418M901N952n642
22590D0079J0290J287j500r79j9760n437o429M71r9r533j666O942L305R322P007
22575C3300l638j4686K100k051O292l168m938K405K086k070K66J1719J664P024
22561C6305M776J830j2302p606m230m542p754J090L148k72J1898O952M280N290
22547C8863J3248J0554J3930k872k111j498o826J0802K2956J2491J1107K0228
22535A40872J8418J1660O330K849J8293M1027O1553R3052J59506K73743L05825
22524A133128J14771q3531o9949N6177Q0233p3158k42856k60498j89955j17023
$$ y = [41708, 27171, 17679, 14475, 10460, 14247, 24463, 31559, 34683, 35502, 29323, 34816, 32466, 21284, 14396, 6372, 3724, 5239, 6052, 14710, 20244, 18565, 31309, 38462, 28450, 34868, 39769, 45721, 40079, 50369, 51656, 50156, 49177, 29417, 23980, 17551, 18022, 17923, 8390, 6724, 13666, 16971, 26293, 33300, 29662, 14976, 17076, 15025, 21317, 18149, 13211, 15616, 17702, 15632, 15898, 27617, 29281, 36305, 41081, 42911, 30609, 23003, 18773, 14231, 6477, 7567, 10715, 10443, 22341, 29293, 33573, 38863, 52111, 62665, 76595, 73723, 71612, 70114, 63288, 74090, 97046, 109537, 120644, 140872, 159290, 170950, 177280, 180129, 198422, 239449, 301002, 394054, 553560, 827303, 1133128, 1247899, 1164368, 1094419, 1150596, 1230829, 1157671, 914815, 654317, 464362, 347339]
22514C47339o1705l8328k3072j6882k0060k5225j8500j4152j1094J135j548o693
22502A11215r203L742O480P841L630m381j0348j6067P7N692M336J2965k935o764
22488A06280n41M821n644j3395p001o56j2474m120O854K164L114p66L818J745
22474H4199J0206J2409J4248J3828J2424q229n143N013N239L346p453o069n959
22461A28059k6864j8045j2439r607n358O008Q793K0349r25n624P347m046J286
22448H8934P32m127m566j8698j2612j976q676j3534P43J824N627L780o915R898
22434D0434n07P237J7233K041M395N785M406l048l637k850J1349J1460R722J4593
22420A18613L1162K4723K1012P358k492k3353k6289r070K2732M3748P1153P3523
$$ y = [347339, 285634, 247306, 224234, 207352, 187292, 162067, 143567, 129415, 118321, 119456, 117908, 111215, 102012, 105754, 112234, 120075, 123705, 119324, 108976, 92909, 92986, 98678, 103014, 115979, 113044, 106280, 105739, 110560, 104916, 91521, 84520, 83864, 71390, 67270, 74124, 76288, 79402, 78636, 82454, 84199, 94405, 106814, 121062, 134890, 147314, 139085, 133942, 138955, 144194, 147540, 140087, 134018, 128059, 101195, 83150, 70711, 61104, 55746, 61754, 70547, 90896, 89971, 84347, 91694, 87648, 88934, 89666, 85539, 80973, 62275, 49663, 47687, 39011, 25477, 26220, 28044, 33671, 37451, 30536, 40434, 39927, 47164, 64397, 66438, 70833, 76618, 81024, 77976, 74339, 71489, 82838, 94298, 104020, 118613, 149775, 174498, 195510, 202868, 200376, 177023, 150734, 141664, 164396, 208144, 279297, 352820]
22408C52820N5300N3492K1825k7244q5949o8228n4373m9091m2439k3756m523R246
22396A37080R121P54J6632K4484J1001k321O452J2q697J748L983J1466l993j0141
22382A97581n309m062R653J6723K4854J8017L4009L1550K7117J5719K0861M3828
22370D30541Q4923J49251K27656K49066J96875J13389M6081l2379j32680k25093
22360A107630j92349j37425q4727m6752k0184k0510l0804j6129j7068l2418j9396
22349D89868j262m782P403J0969P838O824L334Q275L130l863n197j5346j1464
22336D95727k3032k5048j9398p266M656P386L1224M9585Q7383J09860J07095J25767
22324I43939J40313J33334R5953O0102L1098K1041J3499P730J5780L9532M2021
$$ y = [352820, 408120, 461612, 483437, 456193, 370244, 302016, 247643, 198552, 156113, 132357, 127834, 137080, 146201, 146955, 163587, 188071, 199072, 196751, 203203, 203215, 194518, 196266, 200249, 211715, 207722, 197581, 192272, 188210, 197863, 214586, 239440, 257457, 291466, 323016, 350133, 365852, 386713, 430541, 515464, 664715, 892371, 1141437, 1338312, 1451701, 1497782, 1465403, 1332723, 1107630, 915281, 777856, 693129, 646377, 626193, 605683, 574879, 558750, 541682, 509264, 489868, 488606, 483824, 491227, 502196, 510034, 516858, 520192, 528467, 531597, 527734, 522537, 507191, 495727, 472695, 447647, 428249, 420983, 425639, 433025, 464249, 513834, 601217, 711077, 818172, 943939, 1084252, 1217586, 1313539, 1373641, 1404739, 1425780, 1439279, 1447009, 1462789, 1502321, 1544342]
22313A544342K8038K7387M4784R9494J55113J65746K10791K58406L15898L47858
22303C197857L57166L71581L72998L95754M61413N63282P44610R46601J270335
22294H681597J774831K425829L197510M352371O199358R334876J4940732K5247453
22286G6154557M1234388M5511061L2895534J5330976M575621p493405k2915799
22279A85292933m1282899m1370419k9690011j8040303j1230598p470823n258767
22272C0949113l939663l125309k514370k012416j582024j257643j023133q31508
22264A4663047o59178m50149k55639r1684O970J8075q0207k35908l96959n61002
22254A1957366p28174q33907q29430p66025o97100o44288n89930n51990m98609
$$ y = [1544342, 1572380, 1599767, 1644551, 1744045, 1899158, 2064904, 2275695, 2534101, 2849999, 3197857, 3555023, 3926604, 4299602, 4695356, 5156769, 5720051, 6464661, 7411262, 8681597, 10456428, 12882257, 16079767, 20432138, 26631496, 35966372, 50907104, 76154557, 117388945, 162900006, 195795540, 211126516, 215702137, 208208732, 185292933, 144010034, 102639615, 72949604, 54909301, 43678703, 36207880, 30949113, 27009450, 23884141, 21369771, 19357355, 17775331, 16517688, 15494555, 14663047, 14003869, 13553720, 13298081, 13206397, 13213367, 13231442, 13151235, 12915327, 12518368, 11957366, 11229192, 10395285, 9565855, 8799830, 8102730, 7458442, 6868512, 6316522, 5817913]
22245E817913m50897m02965l29913k73222k20786j72980j51713j45534j31288
22236C538615j22408j27978j45372j55750j39501j41875j53956j48743j53319
22227B249713j29357j23177j08423j07084r2587p9833q4931p7301o6662o7792
22217A312566m9960o1992o2660o8987n5447m9247m0055m9213m1746k5845q744
22206G98670J6443N1062Q7419J54623K26938K00034J25234L1776l3919r9003k11640
22195A347637k52615k21122j52793r3719n9970m4349l0734l3319l7355k1762j5201
22184C84698j3310k7833k7232l7857k0401j1219r356j0985j7730k6339r910N179
22172A77705J678R000Q94J3722K1270J4332K9030K4412J6159O226L767K0041J3148
$$ y = [5817913, 5367016, 4964051, 4634138, 4360916, 4140130, 3967150, 3815437, 3669903, 3538615, 3416207, 3288229, 3142857, 2987107, 2847606, 2705731, 2551775, 2403032, 2249713, 2120356, 1997179, 1888756, 1781672, 1689085, 1609252, 1524321, 1447020, 1380358, 1312566, 1262606, 1200614, 1137954, 1068967, 1013520, 964273, 924218, 875005, 833259, 807414, 798670, 815113, 866175, 953594, 1108217, 1335155, 1535189, 1660423, 1692199, 1658280, 1559277, 1347637, 1095022, 873900, 721107, 627388, 567418, 523069, 492335, 459016, 421661, 399899, 384698, 371388, 343555, 316323, 278466, 258065, 246846, 237490, 226505, 208775, 182436, 172526, 177705, 179383, 188383, 189277, 202999, 224269, 238601, 267631, 292043, 308202, 314428, 318195, 338236, 351384]
22159C51384j3851l1439R149J4619n964j7352j6287P907o899m1984m2830m5862
22147A60591m0534j4477j1166J15l721l799J0960J4025k985l631o061m364K482
22134I7435K137M03q74r12R506J4193Q667K829J7864J2898N361L393p923K514
22120A67491M779q155o682j3906l1544j1486O389J6447J9887R030J185N969N090
22107A64494j2890k1216k4469j7660j0406j6185k1104m212j0724k154J1514Q515
22095D3503L191J572J8309K1037l296n543N030P666k987j1260r812j541J8678
22082H4547Q237q668m697l664m362M001q776j9801J4808K1343m492o406K324R768
22068H4162n805M708R214J307j948q718r556j274K413q660j239k862j0518O430
$$ y = [351384, 337533, 306094, 315243, 329862, 323898, 306546, 290259, 298166, 291267, 249283, 206453, 160591, 120057, 105580, 94414, 94529, 90808, 87009, 97969, 111994, 109009, 105378, 99317, 94953, 97435, 99572, 99975, 99101, 98189, 107695, 121888, 130555, 133384, 151248, 164146, 169507, 172900, 164977, 167491, 172270, 164115, 157433, 143527, 111983, 100497, 106886, 123333, 143220, 152250, 153435, 159404, 164494, 151604, 130388, 105919, 88259, 77853, 61668, 40564, 36352, 25628, 23474, 34988, 43503, 46694, 48266, 66575, 87612, 84316, 78773, 83803, 91469, 88482, 77222, 67410, 65869, 84547, 92784, 84116, 79419, 75755, 71393, 75394, 66618, 46817, 61625, 82968, 78476, 72070, 74394, 84162, 78357, 83065, 92279, 93586, 91638, 82920, 73364, 72090, 74503, 65843, 64604, 61742, 51224, 57654]
22054E7654j141j1818n596O133J1174r6o736J535j500N272n661j5314j1916j1103
22040A0887n841J1536J7954L453N444P030P212j525j0876n698N744M957Q86l02
22026E0861q788j039r44R195k851n042j4483j4227k227L476l415j3273n274J5575
22012G544Q254M162k97p134M134P752o604n764L171K780N631o46J835J855J2510
21997C9183J249q708k151j2181j598l14j0362n917j1538O797N226J0256J2740
21984B2682R211l460n717l977k85o485K695J418o694Q327R322j743j1602r208
21970D484N739R077n485j1724p975k399M838K83O453K2359L902k695j2727n47
21956A3583p198J0741J3454o468j2277k438n89J596Q413K65o563j2491K718j655
$$ y = [57654, 56513, 44695, 39099, 45232, 56406, 56310, 49574, 51109, 49609, 54881, 49220, 33906, 21990, 10887, 5046, 16582, 34536, 37989, 43433, 50463, 57675, 56150, 45274, 39576, 45320, 50277, 51163, 50861, 42073, 41034, 40090, 49285, 46434, 41392, 26909, 12682, 10455, 13931, 10516, -2757, -8031, 7544, 15798, 19960, 19663, 12529, 16663, 24415, 17811, 12047, 15218, 17998, 23629, 22983, 24818, 26673, 39183, 40432, 31724, 29573, 17392, 15794, 15480, 5118, -799, -12337, -5540, -314, 9942, 22682, 31893, 28433, 22716, 18739, 18454, 11969, 14664, 16082, 9388, 17715, 27037, 25294, 13692, 4484, 10223, 19300, 13815, 2091, -5884, -8283, -3445, -3162, 3291, 25650, 29552, 26857, 14130, 13583, 6385, 17126, 30580, 24112, 11835, 9397, 8808, 10404, 18817, 19082, 12519, 28, 2746, 1091]
21942A091r133R186k529j6688m711Q728J1682j406k68k991j553Q451J2139J826
21928A3824k768j807j0484q03N084q573j9140M422J5199O330j1651p172p644L118
21914b2065Q556j4627j5018J2421J2281J7597J057O813m865q375j337Q31R988
21901C257r555q940N61q034j677r406r10K987P168K0840L590j3707K774j679J349
21886a1382o970Q921P887l400K763j655k145J209q710j229Q259r91J921P305j8347
21871a6564j1823R786M556P408P561M608j4221l363K354m094R233K182m770n974
21857a3121J0454O714r793O225J7578J4440K946j369l377j4669p804j0452j3783
21844a6011n396M768J2256O943J52j0379l42N473o805O01k15M430m053R013N797
$$ y = [1091, -8042, 1144, -1385, -18073, -22784, -14056, -2374, -3780, -4048, -7039, -8592, -141, 11998, 13824, 11056, 9249, -1235, -2038, 3046, -5527, -24667, -20245, -5046, 1284, -10367, -17539, -25183, -22065, -13509, -28136, -43154, -30733, -18452, -855, 202, 7015, 2150, -6225, -7562, -6731, 3257, -6298, -15238, -14677, -22711, -24388, -33794, -34704, -31717, -24549, -3709, -119, -13826, -11052, -12731, -11382, -18352, -9431, -1544, -4944, -2181, -3836, -5981, -4772, -13482, -14711, -6452, -7443, -5522, 1783, -16564, -28387, -18601, -14045, -6637, 924, 5532, -8689, -12052, -9698, -13792, -4559, -2377, -7147, -13121, -2667, 4047, -5746, 479, 18057, 32497, 35443, 34074, 30697, 16028, 8224, -2228, -16011, -21407, -16639, -4383, 2560, 2712, -7667, -8009, -2536, -9341, -8740, -8955, -4525, -8578, 435, 6232]
21829F232P476q432j418l140m951J969P673n158K397r82J7468Q748j3342n206
21815I334O286J820M733m910j4370r348o873Q537R0l277m358j229Q608l001O639
21800a319l843K193J310p549R984O710k022p687q10J97O46l868k928J221J2218
21785D453J0915J0130N701M032P25j6332j3489j3418M819K057o735J818K120P181
21771C977R581l84m930J189m384q189r481o843O062j189O192O979l854r651K63
21756a4662O506j856P585j546J813Q04l621j6868N092R204p621J0755K1889J6547
21742C4021o374o407N139k949k79j5286m000L558k813J1072P842J531N946k49
21728C0752n113m679N458N891L11n935o575l428O620j925n20J1677N355n60q99
$$ y = [6232, 13708, 5276, 3858, 718, -4233, -2264, 5409, 251, 2648, 1666, 19134, 27882, 14540, 9334, 15620, 17440, 22173, 17263, 2893, -6455, -13328, -4791, -4701, -7978, -12336, -13565, -4957, -7958, -1319, -5162, -2969, -1659, -9208, 776, 7486, 5464, -2223, -3033, -2836, -2190, -6058, -8986, -7765, 4453, 15368, 25498, 31199, 35231, 35956, 19624, 6135, -7283, -2464, -407, -7142, -5324, -3204, 3977, 13558, 13174, 8244, 9433, 5049, -3140, -12621, -19464, -13402, -14591, -8399, -1420, -5274, -14925, -14662, -8156, -10012, -2427, -3973, -2160, -1356, -4977, -21845, -16753, -7549, -15170, -4415, 17474, 34021, 27647, 21240, 26379, 23430, 23151, 7865, 3865, 7423, 4610, 15682, 23524, 25055, 31001, 30752, 25639, 20960, 26418, 32309, 32620, 26685, 20110, 16682, 23302, 21377, 20857, 32534, 37889, 37329, 36430]
21713C6430K6240M3043L7135L2082M2310P8265J38703K13726K05090J58751Q5045
21702A096820K7955n2050j37669j96927j96121j46228j04236p2102l4744k1138
21692A63560j0421q735j392j4579j2931m271k9653j5474k717m801m479n006M137
21679E3238J6657j001j5724K628J1765q702o452l262n462l538r0N306l271L097
21665D5189p542J0023K641o879j5608m314J0628Q06K38o799p481j175p773o568
21651E386J6065M613L781K060m509n137J574n160j5025j1789N12M02l18J1775
21637D230j807j675k726N33M897J1106R320k616o266m703j2157r814p210o27R253
21622a0262O007M346L358Q32R758r37q693M01L690M670l662m949J119q613o664
$$ y = [36430, 62670, 105713, 142848, 174930, 217240, 295505, 434208, 647934, 853024, 1011775, 1096820, 1124775, 1072725, 935056, 738129, 542008, 395780, 291544, 219442, 184698, 163560, 153139, 144404, 143012, 128433, 115502, 111231, 81578, 66104, 63387, 58586, 54107, 49101, 53238, 69895, 68894, 53170, 55798, 67563, 58861, 52409, 49147, 43685, 40147, 40057, 45363, 42092, 45189, 37647, 47670, 50311, 43432, 27824, 23510, 34138, 34944, 35182, 28383, 20902, 19727, 11954, 5386, 21451, 26064, 29845, 31905, 27396, 22259, 23833, 18673, 3648, -8141, -7629, -7227, -7545, 4230, 2423, 748, -1978, -1445, 3452, 14558, 23878, 21262, 14996, 10293, -1864, -11678, -18888, -19515, -10262, -4255, 91, 3449, 4281, 14039, 13102, 4409, 4810, 8500, 13170, 9508, 4559, 5678, -2935, -9599]
21607i599M983P011Q660o283M159j1142R156m077p968l146k936L35k653j329J3069
21592a760l636Q969P961j0438n198P10M529N583P133j064N47J475J498m185j2784
21577f60o950j4834M289o12M429l68J1394J0153l395j1104o227O581L918L11O73
21562b402L582K166M264m397j7r270o145n538L870J1039K713P283p68J1628J5390
21547C3398p642m716o048j7986o8l065k569p167k223M226K3647J1813k77n750
21533A5573r552m342k73j2911k650P655l01L902J0303r402O321J6408R706J1723
21519D2160K73m316J0744M649J3204J4198R220l901j3488n592j204j1743k0171
21506C4033j7988m379p313o006O720o777J2794R395Q56j7011j5205L316R608J9921
$$ y = [-9599, -4616, 2395, 11055, 4772, 8931, -2211, 6945, 2868, -5100, -8246, -11182, -10847, -13500, -14829, -1760, -5396, 3573, 11534, 1096, -4102, -3392, 1137, 6720, 13853, 12789, 13336, 14811, 16309, 12124, -660, -7610, -22444, -18155, -18767, -14338, -14706, -3312, 6841, 3446, -7658, -13885, -7304, -3386, -3075, -2402, 1180, 3346, 7610, 3213, 3196, -6074, -12219, -17757, -13887, -2848, -135, 7148, 6380, 18008, 33398, 25756, 21040, 14992, -2994, -3062, -6127, -8696, -15863, -18086, -13860, 9787, 21600, 21323, 15573, 6021, 1679, 1406, -11505, -14155, -6500, -6801, -2899, 7404, -1998, 4323, 20731, 30437, 42160, 42433, 38117, 48861, 53510, 66714, 80912, 90132, 86231, 72743, 67151, 65947, 54204, 34033, 16045, 11666, 4353, -1653, 5067, -1710, 11084, 20479, 21335, 4324, -10881, -7565, 2043, 21964]
21492B1964m274k1071m477R54J2556O032J2079k697j1104o348n704q719P728P705
21478D624J37n858m442n096J4441M871j1098k485M069q329n279k70M640J2359
21464B284k035L871K834R424R224Q56K236n746j1448j779p021j3264J0813J3768
21450A4017M190n703p572m352p911K010j760r194M688N170J908l352L81o850m993
21435a9323n499J5861J7886J2457q740k5023L1R767P112N966P037k244j0179l970
21421A139r882j0205P764M717m859r42K632J6178P917q703k0489p984K324L055
21407a7338M454l551l30O948J4366n328J03M905p683l523J086K120J745p109K62
21392h873n364n923p854J3159K0902j175j0402R35p785p832O460J2884m813m054
$$ y = [21964, 17690, -3381, -7858, -6904, 5652, 11684, 23763, 21066, 9962, 3614, -2090, -10809, -3081, 4624, 4761, -1097, -5539, -10635, 3806, 8677, -2421, -4906, -837, -9166, -14445, -14715, -10075, 2284, 249, 4120, 6954, 16378, 25602, 26458, 28694, 22948, 11500, 9721, 2700, -10564, 249, 14017, 18207, 12504, 4932, 580, -7331, -5321, -7081, -16275, -11587, -6417, -4509, -7861, -7480, -14330, -19323, -24822, -8961, 8925, 21382, 12642, -12381, -12350, -2583, 4529, 10495, 17532, 15288, 5109, 1139, -8743, -18948, -11184, -6467, -11326, -12268, -9636, 6542, 14459, 5756, -14733, -22717, -20393, -17338, -12884, -16435, -16765, -9817, 4549, -779, -676, 4229, -3454, -6977, -5891, -3771, -2026, -9135, -8873, -14237, -20160, -28014, -14855, 6047, 4872, -5530, -4595, -12380, -20212, -13752, -868, -5681, -9735]
21378i735j641p82N314Q828N506J813n766Q18j0522k62L105M446j1179j842K215
21363i684l986k469J548O425L757J613l419n12M910R388m679p519j609q973n65
21348a5774J9358q13Q46r200j877L42p506Q407J0099k400J0243R27m007j2723
21334d078J304k723K077m900k526o361N227J1361k56R233J796j3848m660J1458
21320C104L738l912M011p424j6888j410J004J6156O228q357M643Q11q993k732
21306a0021N042J067k806J3275Q96j2090j9867J675J3815r538j274J104P360l466
21292a4828O227L551o39l217q493Q698O978M629O754N543o262r951n496o699j878
21277a5083j18p484M917O0nJ1893J1154j397j64O771L393p334j3864l90n658p310
$$ y = [-9735, -11376, -12158, -6844, 1984, 7490, 9303, 3537, 4355, -6167, -6429, -3324, 1122, -10057, -11899, -9684, -13670, -16139, -14591, -8166, -4409, -2796, -6215, -6727, -1817, 7571, 2892, -4627, -6236, -15209, -15774, 3584, 2771, 3617, -5583, -7460, -7118, -14624, -6217, 3882, 1482, 11725, 12652, 8645, -4078, -2774, -5497, -3420, -8320, -10846, -17207, -11980, -619, -875, 8358, 10154, -3694, -8354, 3104, 6842, 2930, 6941, -483, -17371, -18781, -17777, -1621, 4607, -3750, 893, 1704, -7289, -10021, -4979, -3912, -6718, 6557, 7453, -4637, -24504, -22829, -9014, -18552, -19826, -18722, -11362, -14828, -8601, -5050, -5689, -8906, -17399, -8701, -1723, 2906, 9660, 15203, 8941, -1010, -6506, -13205, -15083, -15201, -22685, -17768, -17708, -17713, -5820, 5334, 3937, 3773, 10544, 13937, 6603, -7261, -7651, -13309, -20619]
21261b0619r87J2776L159k356J1905l395K962K728m431j1316r167k0155K787Q675
21247b7434N592J7019L127j580j000k406L099L594n492m978J20k846p70L433K807
21232g715L101J222Q447j900j0236l761J447K454N178K801k449o060l280o444
21218a7195J0854K0706l314j818O960j178K832l283j2651J264K014j737q158n764
21204a0468K378K231N552l918N157J576N627Q226J148r608M89l089j4604R28L198
21189e177K981M366L231m873n814k914k168l678J0065P378r715o211J72K505J351
21174h501N63j309k546j985J2689N211K49J875k038L344L182o629l954N08n335
21159d676J339M878m508N466Q01m227k098L509j363l440r282K295O960L501L488
$$ y = [-20619, -21606, -8830, -5671, -8027, 3878, 483, 3445, 6173, 1742, -9574, -18741, -38896, -36109, -27434, -21842, -4823, -1696, -3276, -4276, -6682, -3583, 11, -5481, -10459, -10339, -13185, -13955, -10522, -7715, -4614, -3392, 5055, 3155, -7081, -10842, -9395, -6941, -1763, 1038, -1411, -7471, -10751, -17195, -6341, 14365, 11051, 9233, 16193, 15015, 17847, 14564, 1913, 3177, 5191, 3454, -4704, -10468, -8090, -5859, -307, -4225, 932, 2508, 8135, 16361, 17509, 7901, 8390, 5301, -9303, -8375, -5177, -2196, 2170, 5401, 528, -5286, -8200, -10368, -14046, -3981, 3397, -6318, -12529, -12357, -9852, -8501, -7938, -9247, -11793, -13778, -1089, 4122, 4371, 6246, 4208, 7552, 10734, 4105, 151, 659, -4676, -3337, 1541, -2967, 2499, 3300, -927, -3025, 484, -879, -4319, -13601, -11306, -4346, -845, 2643]
21144B643m049n406n934m115N934k135N432O910j495p625N284L070o293j2024
21130a9803o17L299o551n633K729Q289N649K933J161k138P123q180p717j989j408
21115b2853J0447K520j0948M644L784K105P548P098J127k391q586r836L567n063
21101a6837PM831m366k223j780M258r877m695J936M917J2105J2185K883N314P094
21086A5752o131j5809o872J6915O9m105k843N210O189N154j759k1152p692L404
21072a3670R039j978j469J2433J240K338n545o09r215o857N452K855l49O071l588
21057c852j1410o019k456J3049n22j9l658M739O988L99k112l520j0118J1301J2714
21042E504r5n75m352k940j51Q563O395L02J899j0085j0521J186Q556J3081j2363
$$ y = [2643, -1406, -6812, -12746, -16861, -10927, -13062, -7630, -720, -2215, -9840, -4556, -1486, -7779, -19803, -20420, -17121, -23672, -29305, -26576, -18287, -12638, -9705, -8544, -10682, -3559, -11739, -19456, -21445, -22853, -12406, -9886, -20834, -16190, -12406, -10301, -2753, 4345, 5472, 3081, -5505, -15341, -11774, -16837, -16830, -11999, -16365, -18588, -20368, -16110, -25987, -30682, -28746, -23829, -11724, 461, 3344, 8658, 15752, 9621, -6188, -13060, 3855, 3924, -181, -3024, 2186, 8375, 13529, 11770, -9382, -17074, -13670, -4631, -6609, -8078, 4355, 5595, 7933, 2388, 1779, -7436, -14293, -8841, -5986, -6335, -264, -3852, -15262, -21281, -23737, -10688, -11210, -11229, -14887, -10148, -3160, -2761, -4873, -8393, -18511, -7210, 5504, 5409, 4834, 482, -2458, -2609, 5954, 12349, 12651, 14550, 4465, -6056, -4870, 3686, 16767, 4404]
21027D404m2n801j7125r25M373Q50J6869M428K95p106j029N223q459m817L328
21012e534Q300N909p732o535R449j312J124Q568k601o924l470o371m233M637J286
20997e439m881l601M167o03J3067Q223J6920M587j2918r948n585n338j09n386
20983f844o198J445R729o042N334j1407p25J1011j787l550p83R794J298k318m764
20968e807K176O09K918P988j1758j0794J2489p085l521o587J0355J2296m665o57
20954b043P989J2413N486k288m616j5975j0880L034L982L55L329q09m929j540
20940f492m192J9349J0338n618m489k721j4779k718J819K057J498Q720r025m769
20926a1022P634K907q563O166K982l178O409J4445q37L33N753j1284k3292l213
$$ y = [4404, 4362, -1439, -18564, -19489, -15116, -14266, 2603, 7031, 7326, 220, -809, 4414, -4045, -8862, -5534, 2766, 8675, 943, -5592, 3857, 2545, 3669, 12237, 9636, 2712, -758, -7129, -11362, -6725, -5439, -10320, -13921, -9754, -10357, 2710, 10933, 27853, 32440, 19522, 9574, 3989, -1349, -1458, -6844, -13042, -11597, -1868, -7910, -2576, -13983, -14708, -3697, -5484, -9034, -9817, -23, 1275, -1043, -5807, -3631, -3022, -104, 7884, -3874, -14668, -2179, -9264, -12785, -19372, -9017, 3279, -1386, -2043, 5946, 18359, 23845, 21557, 16941, 966, -9914, -6880, -2898, -2543, 786, -23, -4952, -6492, -10684, 8665, 19003, 13385, 8896, 6175, -8604, -11322, -9503, -7446, -5948, 2772, -6253, -11022, -3388, -481, -9044, -2878, 104, -3074, 3335, 17780, 16943, 17276, 23029, 11745, -11547, -14760]
20912a4760J0002J3071J2635p972O302M418j6432j1611K315J009O980l478m464
20899a985J06m367o822o515m89J5699Q680o5N317M846p450R619o858J766R199
20884B0681p110j380j0279m622J612M144L825M330L088r806K885Q287m252j1735
20870c32j4322L35L612N157K682R66Q484M571J021m403K256n377M804Q808P099
20855B5361P111n137j1966k1780r314J2084M853Q722o001o755O292N599n849M383
20841G603j158l674o823k938L773l013J122P316P62j973j2714P956Q566J313r068
20826b950O905l978k291n440O129P739R846r81p273n335M609M142J3p453k402
20811A280p267P721R72j36q128r183J3909J2149Q87N31m759o390r586N517J2J989
$$ y = [-14760, -4758, 8313, 20948, 12976, 19278, 23696, 7264, -4347, -2032, -1023, 5957, 2479, -1985, -1879, -6246, -13068, -19583, -20072, -4373, 4307, 4242, 9559, 14405, 6955, 16574, 9716, 11482, 20681, 13571, 12191, 1912, -2710, -1098, 3046, 6871, 11201, 14289, 4483, 7368, 15655, 11403, -332, -14654, -14319, -10707, -5550, -2868, -1902, 6582, 11153, 12174, 7771, 10027, 4650, 9454, 18262, 25361, 32472, 27335, 15369, -6411, -15725, -3641, 1212, 9934, 3933, -2822, 3470, 9069, 3220, 7603, 6445, 2771, -4052, -6990, -3217, -6230, -5108, 2208, 2970, 997, -11717, -3761, 4805, 6118, -2950, 3955, -23, -2314, -7754, -1625, 6114, 15960, 14979, 7706, 2371, 6980, 11122, 11135, 3682, 1280, -5987, 1734, 2706, 2570, -5558, -14741, -832, 11317, 12204, 12735, 7976, 1586, -8000, -2483, -2471, -482]
20795d82J4460p93r077j5859n249K645M764l140o539J5512J063l531J325m482
20781i383j723k919Q731M118N16p159k701Q935j302P904R568K343j29r73n044
20766A0782p193n98Q463l918j0001N70o808q417L841p904K605K034R777P035J335
20751A603k159O618j622N277N88P95m816P24l050P193N14N54P645q556j25J619
20735A2802M660R552m941j6025j0814N437P869k796k146K394m640j792k175Q670
20721F055J0079n012p970k066P586m681K256m044O014l793m456N153j051O16N049
20706I735J220L562r028R906n782j2558M153o523o272N681J3667P27j0772K856
20692E72O546J1924l395j1655Q997M390J166l668j0646j527Q123J898M44N510
$$ y = [-482, 13978, 13185, 4108, -11751, -17000, -14355, -9591, -12731, -19270, -3758, -2695, -6226, -4901, -9383, -11106, -14025, -5294, -1176, -660, -7819, -10520, -1585, -2887, 5017, 14585, 16928, 16799, 15826, 10782, 3589, 2991, 11454, 7536, -2465, -1895, -8703, -17120, -13279, -21183, -18578, -16544, -6767, 268, 1603, -556, 6062, 4440, 9717, 10305, 11100, 6284, 7008, 3958, 11151, 11665, 12219, 19864, 11308, 11183, 12802, 17462, 27014, 22073, 6048, -4766, 671, 8540, 5744, 3598, 5992, 1352, -440, -2615, 6055, 16134, 11122, 3152, 1086, 8672, 3991, 6247, 2203, 8217, 4424, -32, 5121, 4070, 4686, 9735, 10955, 14517, 5489, 15395, 9613, -2945, 1208, -5315, -11587, -5906, 7761, 8488, -2284, 572, 7118, 19042, 15647, 3992, 12989, 17379, 18545, 14877, 4231, 2704, 10827, 12725, 13169, 18679]
20678A8679l442k454P882o206j7457K463J2666M846o763r1m447p855J258J292
20664C71l288N090M996Q214q808r498n2k358J32M478J2494N006j649L171K659
20649B0958k4m378r736n722Q369l815M814K129n690R515l870p048k564o593k880
20634f535Q985N998J4848O018o212o248J296k430k797j097Q41j177K863J1325
20620B5678L666r443j1617o278L672R552j268j0243M801j286L170o152K68j905
20606B615N262n656K710Q533q36j0222K114O549K375n970p860q274N037O660P813
20591A0850p629r448k421N795k128N075J4680J1842n627K909K689j1638r523p422
20577a996j0090j685p008Q502J794P195P42L119M245L56p72Q919p412j1837o472
$$ y = [18679, 15237, 12783, 20665, 14459, -2998, -535, 12131, 16977, 10214, 10123, 5676, -2179, -921, 371, -2917, 2173, 7169, 15383, 6575, -2923, -2975, -5333, -5201, -723, 11771, 16777, 15128, 18299, 20958, 20934, 16556, 6820, 1098, 9467, 5652, 10466, 12595, 6905, 16420, 12550, 5502, 2938, -3655, -6535, 2450, 8448, 23296, 29314, 23102, 16854, 18150, 15720, 12923, 11826, 12667, 11490, 14353, 25678, 29344, 19901, 8284, 2006, 5678, 15230, 13962, 3719, 8520, 7234, 10404, 4252, 4520, 2615, 7877, 2221, 4931, 13464, 12628, 2406, 4520, 11069, 13444, 7474, -386, -8660, -3623, 3037, 10850, 3221, -6227, -8648, -2853, -4981, 94, 14774, 26616, 20989, 23898, 26587, 14949, 5426, -1996, -12086, -13771, -20779, -12277, -10483, -3288, -2546, 573, 4818, 5174, 4402, 13321, 5909, -5928, -12400]
20562a2400J0254J0943J76q799K402n380j822O652n817n13j157J174K884N239
20548C836J6370L130j1847n308J72r036J1959J3475O658P058n931j0970p762l045
20534H759k819r845j030j018J85K101L164Q076M818k411n216L342N150J5222R016
20519C7494p027k3n137m448P956n709j3818Q530p222j0311n344m609N556K798
20505a314L51K899j621Q68J905L581L548j6939M388J4763M197j2815o303R499
20491G007K618R247J2434r386j5134J480k289P486K062n748R159R346J1472o644
20477C3110j7775j0554L649M134N202r250N700j803K427o510j3377o493Q643O293
20463C396m302j0563J3053K0079M760q721l349r330o542n090R309J2146l794P29
$$ y = [-12400, -2146, 8797, 8973, 174, 2576, -2804, -4626, 2026, -3791, -4304, -5461, -4287, -1403, 3836, 20206, 23336, 11489, 6181, 6353, -2683, 9276, 22751, 29409, 36467, 30536, 19566, 11804, 8759, 5940, -3905, -4935, -5953, -5768, -3667, -503, 7573, 12391, 9980, 4764, 8106, 13256, 28478, 37494, 30467, 30444, 25307, 20859, 28815, 23106, 9288, 17818, 10596, 285, -5059, -9668, -4112, -1314, -963, 1936, 315, 1183, 3088, 6669, 10217, -6722, -2334, 12429, 16626, 3811, -2492, 7007, 9625, 18872, 31306, 21920, 6786, 8266, 5977, 13463, 15525, 9777, 18936, 28282, 39754, 33110, 15335, 4781, 8430, 12564, 17766, 8516, 14216, 12413, 14840, 8330, -5047, -11540, -2897, 3396, -906, -11469, 1584, 21663, 26423, 17702, 14353, 5023, -1519, -6609, 2700, 14846, 11052, 11781]
20449A1781J102j838k949J547n071M559n752p888j1333m000Q374J5167M867j2150
20435c584j8757o657J2293Q491J7028P221j0129r655P466J5616R824K022n976
20422B5203j076k789n743k092k138o179l422N30M015k197K372M137K30O882O25
20407A8358K870j6341J193O930L773J6061P379o141p90j3900j1982j244Q329l389
20393A1106n693j2909J496K483P128N262n190m674K779p44K624p725J758k715
20379e014Q685M553o530j78L619P567J2796O749m691p018m270r367j1163k254
20365f516J658K932K721O841Q805K770r813l627M590K760K0761K907n061L107
20351C4835r099j435p432j0784l446l761K531j14m658N856J7987N774j0127j621
$$ y = [11781, 12883, 11045, 8096, 9643, 4572, 9131, 3379, -4509, -15842, -19842, -11468, 3699, 8566, -3584, -22341, -28998, -16705, -8214, 8814, 16035, 5906, -3749, 3717, 19333, 29157, 31179, 25203, 24127, 21338, 15595, 13503, 11365, 5186, 1764, 2294, 6309, 4112, 6484, 10621, 10851, 17733, 18358, 21228, 4887, 6080, 13010, 16783, 32844, 40223, 34082, 33292, 19392, 7410, 6166, 14495, 11106, 5413, -7496, -6000, -3517, 3611, 8873, 3683, -991, 1788, 1044, 3668, -4057, -2299, -5014, 3671, 8224, 1694, 1516, 5135, 12702, 25498, 32247, 27556, 20538, 16268, 6901, -4262, -6516, -4858, -1926, 795, 7636, 16441, 19211, 9398, 5771, 10361, 13121, 33882, 36789, 31728, 34835, 25736, 24301, 16869, 6085, 2639, -1122, 1409, 1295, -3363, 2493, 20480, 26254, 16127, 14506]
20337A4506j278k104k464l890L917P968r35r015K409O214j7408J676L789O296
20323I681k952O574m35n635j979R747J7611J95j1208j280k855n124M494K784q49
20308A8769p473j3301M389l297n546N786J0661j710p945J6367k201j2796k427
20295g24J5582O676j2752j7187M624k30j5024p664L397J0901l224J1790R801k822
20281C144m379O04O644L563j560n02j3166O738O442m137l768L882Q341K023j5742
20266a873o166J969L302Q449K340j0960J680N12o634P181J722O148R426O68j10
20251A7654N058J251o362n131n173J450j282O11L744P07j1433q089n658O640k079
20236h092K468M009J1031L76o011J576l808k40Q96K020K156J066k056Q055M603
$$ y = [14506, 13228, 11124, 8660, 4770, 8687, 16655, 15720, 6705, 9114, 15328, -2080, -404, 3385, 9681, 6729, 13303, 12868, 7233, 5254, 15001, 32612, 32807, 21599, 20319, 17464, 12340, 16834, 19618, 18769, 11296, -2005, 2384, -913, -6459, -673, 9988, 8278, 333, 16700, 14499, 1703, -724, 14858, 21534, 8782, -8405, -3781, -4011, -19035, -26699, -23302, -12401, -15625, -3835, 5966, 3144, -1235, -631, 6013, 9576, 8016, 7514, -5652, 1086, 7528, 3391, -377, 3505, 11846, 13869, -1873, -8039, -6070, -2768, 5681, 8021, -2939, -1259, -747, -7381, -200, 1522, 7670, 17096, 17764, 17654, 22712, 23963, 17601, 12470, 7297, 8747, 7465, 8076, 11820, 12527, 1094, -6995, -12653, -6013, -8092, -5624, -1615, 9416, 9792, 3781, 5357, 1549, 1309, 2205, 4225, 6381, 7447, 5391, 13446, 18049]
20221A8049N45m455m664n521M816k538l145K099J244k092m180J2576j295l667
20207G772N989J3982n677j8898q03N230j428n480o904J004N259J0286M303l350
20193A1285o883j537m585J0831N924RO22j551K988m277j1521L707Q076L214o084
20178A0218K7411J079j1166k353j1300q178R600N680j033k138m937q066L479k844
20164E452O478J4374j09j5587j207R423O774j330J104j830L048J379j2713O357
20150B1613N115p836q121P181P901Q010j9996j35P412q81j2951j0255R784Q628
20136A5469M96j0646p093L208J745O23o350p724K284J3467q011j320J396J8644
20122A6188P045j0945j0801R057Q245M226j7241r087R249J3351n312j1186R474
$$ y = [18049, 18594, 14139, 9475, 3954, 8770, 6232, 3087, 5186, 6430, 4338, 158, 12734, 11439, 7772, 13761, 27743, 22066, 3168, 2365, 7595, 6167, 687, -6217, -5213, 46, 10332, 14635, 11285, 4402, 2865, -1720, 9111, 15035, 15044, 15666, 14115, 17103, 12826, 1305, 5012, 13088, 16302, 10218, 37629, 38708, 27542, 25189, 13889, 5711, 15311, 20991, 19958, 17820, 12883, 4817, 8296, 5452, 11930, 26304, 26195, 10608, 9401, 18824, 25598, 24268, 25372, 23542, 26590, 27969, 15256, 21613, 26728, 18892, 10771, 17952, 25853, 33863, 13867, 13732, 21144, 20263, 7312, -2943, 6841, 15469, 15965, 5319, -1774, 1434, 3179, 3802, -2548, -10272, -7988, 5479, -2532, -3852, -2456, 16188, 23233, 12288, 1487, 10544, 18789, 23015, 5774, -3313, 5936, 19287, 13975, 2789, 12263]
20109A2263K613k113O091J2603O037N11j4808p473J4550J0855r840j4935k107
20096A4247L457J318l504p025J752O069j874M096K544m575j0491k567J453M267
20082I167R730l730o580m471J833P911Q412m158n323M334J0890K048j095n264
20068B3704l2n800k153j254j925J073n705J1235P944j3324j0113j301j3n126J397
20053a393j881n463J0058J7508N778Q265r860j3063J025J7280K302o50M269j589
20039C2586m802m895n945l720M433k204o257J1580N854j3686j1668m794m257o65
20025h440R774K023j323m055n754R681J6776O184m038k0603K131J1040m44k367
20011A0585M523Q462r648p866N819K115n562n510Q184N420M258Q481K323j0195
$$ y = [12263, 14876, 12763, 18854, 31457, 37494, 38005, 23197, 15724, 30274, 41129, 31289, 16354, 14247, 17704, 19022, 15518, 8493, 10245, 16314, 14440, 18536, 21080, 16505, 6014, 3447, 4900, 9167, 18897, 15167, 8587, 4116, 5949, 13860, 22272, 18114, 12791, 17125, 28015, 30063, 28968, 23704, 23672, 17872, 15719, 14465, 12540, 13613, 7908, 19143, 27087, 13763, 3650, 2349, 2336, -2790, -1393, -3274, -8737, 1321, 18829, 24607, 32872, 23012, 9949, 10974, 28254, 30556, 29906, 34175, 32586, 27784, 22889, 16944, 13224, 17657, 15453, 9196, 20776, 26630, 12944, 1276, -3518, -7775, -8440, 1334, 3357, 2034, -2021, -7775, 1906, 18682, 24866, 20828, 225, 2356, 13396, 12952, 10585, 15108, 23570, 13922, 6056, 11875, 13990, 8428, 2918, 11102, 16522, 20780, 29261, 31584, 21389]
19997B1389K917o220K250Q355m807J7505J28j962p095o286m275o41M884M11n588
19982B0965j590Q61Q910J2473M752k552j2948j826O658N515N083k597j1217r964
19968B2523q398j2511K956O113p990o087P520j89N543J4662o473J0299J2801p840
19954C2929k080r59O620k752K407M27o046r537p922Q768J615M629P69R827N622
19939D4317l059j1105k296M646K605k758n752r03l218m920M271K359R982J3082
19925D7251j096K56j1131o081j8881l551J1370J0329N341p749j914K361n687l057
19911A7761J2086q86m384R825L432M622J3432k32k817r157j2604q540J553M224
19897B8315n206N533M868J0021j008P254L573p409N786J3032L651L978P810J7614
$$ y = [21389, 24306, 18086, 20336, 28691, 23884, 41389, 41517, 39555, 32460, 26174, 21899, 21258, 26142, 26553, 20965, 19375, 20236, 29146, 41619, 46371, 43819, 30871, 29045, 35703, 41218, 46301, 43704, 32487, 22523, 14125, 1614, 4570, 10683, 2693, -3394, 4126, 3937, 9480, 24142, 17669, 27968, 40769, 32929, 30849, 29890, 36510, 33758, 36165, 36592, 30546, 21009, 13087, 21855, 23470, 28099, 28868, 38695, 44317, 41258, 30153, 27857, 32503, 35108, 32350, 26598, 25695, 22477, 17557, 21828, 24187, 34169, 47251, 46155, 46411, 35280, 29199, 10318, 6767, 18137, 28466, 33807, 26058, 24144, 26505, 20818, 17761, 29847, 28961, 24577, 34402, 37834, 42456, 55888, 55656, 52839, 43682, 31078, 22538, 24091, 28315, 23109, 28642, 33510, 43531, 42523, 49777, 53350, 45941, 51727, 64759, 68410, 72388, 80198, 97812]
19883I7812M2229N0374O8440O6916L6113K6155N1860J8355l4396m0015k9800m0824
19871C13219o0120n3151m6951k3617l322r747j1906k3167J7J3962j381j3762j8376
19858F1698p64Q350j194j1773K117O400l53o938J25L903O273P848l663m677n228
19843F2124m115n208n654j2886m912J200m858N047P191J0028J656o134K141N424
19829E1044m354j7860r182J776J1656K444K06k433p12q75j1035l255K956J6956
19815C7332J8981K313n467M262m873q064j1090o096J390N313m294P555k307j706
19801C3249K07N19o062j8203K283J1414m212r423p387l496N274K2986m299K335
19787B5185M623n384M359L636k113m548J0301J2928O489j2627j7335L955R569
$$ y = [97812, 140041, 190415, 258855, 325771, 361884, 388039, 439899, 458254, 423858, 383843, 354043, 313219, 253099, 199948, 152997, 129380, 126058, 116311, 104405, 81238, 81255, 95217, 93836, 80074, 61698, 60934, 69284, 68090, 56317, 58434, 64834, 64481, 57543, 57668, 61571, 67844, 75692, 72029, 67352, 62124, 58009, 52801, 47147, 34261, 29349, 30549, 25691, 30738, 37929, 47957, 49613, 43479, 45620, 51044, 46690, 28830, 19648, 21424, 33080, 35524, 35730, 33297, 32585, 31710, 20675, 17420, 20376, 37332, 56313, 58626, 53159, 57421, 52548, 44484, 33394, 27298, 28688, 34001, 29707, 37262, 34955, 33249, 33456, 33975, 27913, 9710, 11993, 23407, 19195, 9772, 2385, -1111, 4163, 27149, 22850, 25185, 29808, 24424, 28783, 32419, 30306, 25758, 36059, 48987, 55476, 42849, 25514, 29469, 39038]
19774C9038p20J463k098l461Q812M739K036j638n244l657K937k489M433k397r710
19759C2044K10N741J141Q227k808q268l559M249R116J363j446M014k099J699m504
19744D5120l872J1175m19o444Q382l958j9363p765O011o09n889L621M680J2203
19730D2873Q939p58j750n983q552m094j2210p305k387l267R341J2703L898K003
19716C3451k361l047L020j956J0804M996p455n013K428m227o565o044j974j742
19702A4315L855k843R244O541P53m354q106L198J2653l703O195nM426m972l159
19687C4038J893l435n499m430n823N848k788Q850K732j1589O908J3157m403K259
19673C7718K605j438k02n493l106J842r435j969L260J0121M196m129O620J0360
$$ y = [39038, 38318, 39781, 37683, 34222, 43034, 47773, 49809, 48171, 42927, 39270, 42207, 39718, 44151, 41754, 32044, 32254, 37995, 39136, 47363, 44555, 36287, 32728, 36977, 46093, 47456, 46010, 50024, 47925, 49624, 45120, 41248, 52423, 52004, 45560, 53942, 49984, 30621, 22856, 28867, 28258, 22369, 25990, 30670, 42873, 51812, 51054, 49304, 43321, 34769, 30675, 18465, 11160, 8773, 5506, 14847, 27550, 31448, 33451, 31090, 28043, 31063, 29107, 39911, 44907, 37452, 32439, 34867, 30640, 24075, 18031, 16057, 14315, 18170, 15327, 24571, 31112, 31865, 27511, 19405, 22603, 35256, 31553, 37748, 37743, 42169, 37197, 34038, 35931, 32496, 26997, 22567, 16744, 22592, 19804, 28654, 31386, 19797, 26705, 39862, 35459, 37718, 40323, 38885, 38683, 33190, 30084, 31926, 22491, 20522, 23782, 33903, 38099, 33970, 40590, 50950]
19659E0950j0912p337J2069J200P175L348j5567J380l978l252O011q98L346q17
19645D2718P006j477r3J3414o827j4243J673K005j4344n897J6917O139Q3o794
19631D0280l592O791n468j2098m688R67K026J3163J4923J2349l318n950M231l285
19617E6331J724j3200O3o381j434J572J1344k515j0354m514J4273K700n87j237
19603D7785o351N234J3284j3682M013J3375K147l624l956n314k0986J239R745
19590D2909O814m568o445m132K454L526P510o890P156R26o105j687Q726R784J2624
19575G2602M660n972l89M011J717j3779p234J198P036O038M97k672N810R690j996
19560H1217p599m895m51q096P282J0843o598m126Q868R640J0657L797R729O172
$$ y = [50950, 40038, 32701, 44770, 45970, 53145, 56493, 40926, 42306, 38328, 35076, 41087, 40189, 43535, 42718, 49724, 48247, 48154, 61568, 54741, 40498, 42171, 44176, 29832, 23935, 40852, 46991, 47074, 40280, 36688, 43479, 38011, 25913, 21225, 22192, 24218, 37381, 52304, 64653, 61335, 55385, 59616, 56331, 58055, 44855, 44918, 38537, 37103, 38675, 50019, 47504, 37150, 32636, 46909, 49609, 49022, 47785, 41434, 46668, 59952, 46270, 50283, 63658, 65805, 62181, 58225, 52911, 31925, 33164, 42909, 49723, 45155, 38710, 34578, 37032, 40558, 48068, 41178, 48334, 49260, 43155, 41468, 50194, 59978, 72602, 77262, 71290, 70901, 74912, 76629, 62850, 55616, 56814, 63850, 69888, 70385, 67713, 73523, 83213, 81217, 73618, 68723, 68272, 60176, 67458, 78301, 71703, 67577, 76445, 86085, 96742, 100539, 110268, 116440]
19546A16440J0909K6211L3252L0941L9952M4380O2364O7178P0035L5125J5501
19535E52288j5173l7557o7114n1933l0716j5914J419K0556M5376O9579N8190K8626
19523E57627R440j8324m6689p5179o7292n8662l5355l5999k9218j0963j3066j5034
19511A61286j3306P54L997l215j0812j389j0512n277J2431N583N834j0366j1769
19498A23239n549r357j024j3450J841l896j048n956M899J458q600j008J948l00
19484H3197L367j417p709J738O053m606r268M65J1271J17r043l772r034j710M572
19469F4221n553m587Q228L738M119J0209L543l016L638k612k254N718k328o208
19455G6856J0065N22o521r780Q509O624L099r003M449m840m548J2274P475n203
$$ y = [116440, 127349, 153560, 186812, 217753, 257705, 302085, 364449, 431627, 501662, 536787, 552288, 537115, 499558, 432444, 380511, 349795, 333881, 335300, 355856, 401232, 470811, 529001, 557627, 567067, 548743, 502054, 426875, 359583, 300921, 265566, 229567, 200349, 189386, 176320, 161286, 147980, 148734, 152731, 149516, 138704, 137315, 126803, 121526, 133957, 139540, 145374, 135008, 123239, 117690, 108333, 107309, 93859, 95700, 91804, 90756, 84800, 89699, 91157, 82557, 81549, 83497, 83197, 86564, 85147, 77438, 79176, 85229, 80623, 71355, 71820, 83091, 83208, 74165, 70393, 61359, 59649, 64221, 58668, 54081, 62309, 66047, 70166, 80375, 83918, 80902, 84540, 81928, 79674, 85392, 83064, 76856, 86921, 87443, 80922, 71142, 79651, 86275, 89374, 80371, 84820, 79980, 75432, 87706, 95181, 89978]
19441H9978r279r663o096K238m024l449m019j208Q793r879n53O806R76l557m548
19426E2516K0947L689q465o739P233P756L244k0023k341R329P775q682r203m798
19412E2238J30J339j851Q151P923J9454M86j5020j0143K57n652j458K958l531
19398E5281l841j4037J91J1923K89R005K1530R797K770L976o129J07J7725O114
19384A14701J1651J2405K4394M2014O1256J16674P8009l7506o9740p2554m6444
19373B34860j8204j014J6071L4373N8652Q0715O2419J6481m136l7447p5645p9453
19361B87672m7054k3185j4881j6149j4053j5272r344l89J924m249l389k70q63
19348A40498L431J738o702l452K930J9848L445r33m129R344J7118N699k69j6455
$$ y = [89978, 80699, 71036, 64940, 67178, 63154, 59705, 55686, 54478, 63271, 53392, 52839, 59645, 60621, 57064, 52516, 73463, 77152, 68687, 61948, 69181, 76937, 80181, 60158, 57817, 67146, 74921, 66239, 57036, 52238, 52368, 53707, 51856, 60007, 67930, 87384, 87870, 72850, 62707, 62964, 57312, 55854, 58812, 55281, 51440, 37403, 37594, 49517, 49806, 58811, 80341, 90138, 92908, 96884, 90755, 90862, 108587, 114701, 126352, 138757, 163151, 205165, 266421, 383095, 461104, 423598, 353858, 281304, 234860, 216656, 215642, 231713, 266086, 324738, 405453, 467872, 484353, 480217, 442770, 367125, 287672, 240618, 217433, 202552, 186403, 172350, 157078, 147734, 147345, 149269, 145020, 141631, 141361, 140498, 143929, 145667, 138965, 135513, 138443, 158291, 161736, 160803, 156674, 166018, 183136, 188835, 188566, 172111]
19334A72111q858L612O195P956J5441M0322O6790J07884R5759K3326m0829o6363
19322D23346m6467j3249K8798O2483N4109L1548J4882l4739o8674r1139p4282
19311B86616n1421l7892j2743r003q433j1257o376m923p762M279J0390j839m209
19298A45427o324j1817k562k680j658n43J0739J1207J158j825N66O829l890k8172
19284A16455l544N568j775j4862o062J9m061j5694J3215J0932l877L046L55L952
19270A03667R506K837o189J789J1125o630K650n042j7238J1378P870r299k991
19257A03433n609M830R771M291J65J2478m276o184J951j238R649L694p916P42
19243A25781p785n84K78l541K067J1533N912r242k912J581M474k455j0973o438
$$ y = [172111, 163253, 166865, 173060, 181016, 196457, 236779, 303569, 411453, 507212, 530538, 489709, 423346, 376879, 363630, 392428, 454911, 509020, 540568, 555450, 520711, 452037, 360898, 286616, 235195, 197303, 184560, 175557, 167124, 155867, 149491, 144568, 136806, 141085, 151475, 149636, 145427, 139103, 127286, 124724, 122044, 120386, 119843, 130582, 141789, 142947, 141122, 141688, 148517, 144627, 116455, 112911, 118479, 116704, 101842, 95780, 95799, 91738, 76044, 89259, 100191, 96314, 99360, 99715, 103667, 113173, 116010, 109821, 111610, 122735, 116105, 118755, 113713, 96475, 107853, 115723, 106424, 103433, 97824, 102654, 112425, 116716, 116881, 129359, 125083, 118899, 120850, 119612, 129261, 132955, 125039, 125781, 117996, 117412, 117690, 114149, 116216, 127749, 133661, 124419, 121507, 123088, 127562, 125107, 114134, 107696]
19229A07696l242k097o285k179J3505L582J0318n926Q078P431J0058m376J3585
19216A50148J2674K14k681J1139K2482K2406m166Q344K0293J4272j2072j2491
19204B30562k1506k2930r836r421J13J6625Q355R746K7731K5302q55N294J9953
19191B79133R165k4846l5907m0762p017P639j0657n56M256l169k876j1594o914
19178A55895J838m374j3310j4147j1662q30K0814J9141n294l444n549r808P386
19165A36656M902R038k941j0981m408O955J4962N248j2534l824L463J7077J6954
19152A80567J1049n313j76j1210p433M633N160L744P478k883l195Q079J433M793
19138A96726j2609m373J2253N642J1335J6872K4726L2973M4176N5912R157l1886
$$ y = [107696, 104454, 102357, 96072, 93893, 107398, 110980, 121298, 115372, 123450, 130881, 140939, 136563, 150148, 162822, 163036, 160355, 171494, 193976, 216382, 212216, 220560, 240853, 255125, 243053, 230562, 209056, 186126, 176290, 166869, 166982, 183607, 191962, 201708, 229439, 254741, 253886, 259180, 279133, 288298, 263452, 227545, 186783, 179766, 187405, 176748, 176192, 180448, 177279, 174403, 162809, 155895, 157733, 153359, 140049, 125902, 114240, 113410, 134224, 153365, 148071, 144627, 139078, 129270, 136656, 141558, 150596, 147655, 136674, 132266, 139221, 154183, 159431, 146897, 143073, 146536, 163613, 180567, 191616, 186303, 186127, 174917, 167484, 172117, 177277, 181021, 188499, 185616, 182421, 190500, 191933, 196726, 184117, 179744, 191997, 197639, 208974, 225846, 250572, 283545, 327721, 383633, 392790, 360904]
19126C60904k2034j1649J167L077K3944K7251L3190M7393K9578K0881j7772m1503
19114D54427k8121k0950k6220k5409r270j1181j9893k1573j7283J2187J8456J1639
19102C16809P428k1008j7074j6971k271J3912K1862J6456J6713L1987L7435M1445
19090D46723J8246r690k6643k0747j2791j8595n987K2825N2899N4265R0192Q7989
19078F78686M4839L2662M0246L3068K1296Q416J4423J8689K6205O8772Q5765J05004
19066A178071J20604O0660j7943o0410m5341K236K9610N8095J05252J15065O5562
19055A611461L0497M4612J8585p8642j57383j61628j30468q7593k7064N765Q273
19044A076415N1757J07566J47185P3488K2902N4280J06383K5610r2930j25057
$$ y = [360904, 338870, 327221, 328388, 331465, 355409, 382660, 415850, 463243, 492821, 513702, 495930, 454427, 426306, 405356, 379136, 353727, 344457, 333276, 313383, 291810, 274527, 286714, 305170, 316809, 324237, 303229, 286155, 269184, 266913, 280825, 302687, 319143, 335856, 367843, 405278, 446723, 464969, 455279, 428636, 407889, 395098, 376503, 370516, 393341, 446240, 500505, 590697, 678686, 723525, 756187, 796433, 829501, 850797, 859213, 873636, 892325, 918530, 987302, 1073067, 1178071, 1298675, 1359335, 1341392, 1280982, 1235641, 1237877, 1267487, 1325582, 1430834, 1545899, 1611461, 1641958, 1686570, 1705155, 1626513, 1469130, 1307502, 1177034, 1089441, 1062377, 1068142, 1076415, 1128172, 1235738, 1382923, 1456411, 1479313, 1533593, 1639976, 1665586, 1572656, 1447599]
19034A447599j06814o1300J1346M7371M8583J606m5759p9962o9858j3818O4878
19023A243872R4759N9074K4040p157j9476j6833l4029l7461k8133j4888o180N1649
19011A309237Q6286Q7147P3725M6426J9472l5014o4719n8585l4879J2042N2410
19000A493548R2104J34960J52172P3260j4965n3863o4045p1578p3211m3107M33
18989A625708M9402J06688J38890J18429P7941P2669Q2147N8460K1229K071J6118
18978B369752K1744M5059Q1578J12761J18589J07306J12290J10559J08188J09950
18968C297776J20413J22692J62792K01103K25872K61720K95283L16673L49889
18959E354213M06958M52064M91247N70079P15720Q83873J087452J362837J758861
$$ y = [1447599, 1340785, 1279485, 1290831, 1338202, 1386785, 1388391, 1342632, 1262670, 1192812, 1178994, 1243872, 1338631, 1397705, 1421745, 1414588, 1395112, 1378279, 1344250, 1306789, 1278656, 1263768, 1257588, 1309237, 1395523, 1482670, 1556395, 1602821, 1622293, 1587279, 1522560, 1463975, 1429096, 1441138, 1493548, 1585652, 1720612, 1872784, 1946044, 1931079, 1877216, 1813171, 1741593, 1668382, 1625275, 1625708, 1675110, 1781798, 1920688, 2039117, 2117058, 2189727, 2271874, 2330334, 2351563, 2353634, 2369752, 2391496, 2436555, 2518133, 2630894, 2749483, 2856789, 2969079, 3079638, 3187826, 3297776, 3418189, 3540881, 3703673, 3904776, 4130648, 4392368, 4687651, 5004324, 5354213, 5761171, 6213235, 6704482, 7274561, 7990281, 8874154, 9961606, 11324443, 13083304]
18950A3083304K381071L261551M506747O356467R134685J2800044J5943425J4753742
18942H2221036Q632998L671455R08250m451682j0560204j2146250r307694m855203
18934E4112706l66359M189486R055686J3165996J2807566O937633J689412j123118
18926A00469008o383313j2947141j5410197j3436686r979817p041510m981882
18919C0288462l591065k644769k017571j630381j379907j205942j108280j029377
18911A5681170r39949q42814p30958o15387m97035m11969l77847l82497l98946
18902A0483768m24650m25514m44627m75350m57391m32145m25712m09972m14103
18893F574304l88941l71204l59996l46821l18028k65675k40510k09281j84282
$$ y = [13083304, 15464375, 18725926, 23232673, 29589140, 38723825, 51523869, 67467294, 82221036, 90854034, 94525489, 95433739, 90982057, 80421853, 68275603, 58967909, 54112706, 53746347, 57935833, 66991519, 80157515, 92965081, 99902714, 101592126, 100469008, 94085695, 81138554, 65728357, 52291671, 42311854, 35270344, 30288462, 26697397, 24052628, 22035057, 20404676, 19024769, 17818827, 16710547, 15681170, 14741221, 13898407, 13167449, 12552062, 12055027, 11643058, 11265211, 10882714, 10483768, 10059118, 9633604, 9188977, 8713627, 8256236, 7824091, 7398379, 6988407, 6574304, 6185363, 5814159, 5454163, 5107342, 4789314, 4523639, 4283129, 4073848, 3889566]
18884C889566j56978j54332j50168j60239j40156j22605j29957j11659j09440
18875B654032j14834j36895j09481j01365r9976j03878q2633n8681n3436n6856
18865A735997q0376o3484m2558l4669m1033o0208o5215o4914n3629m1613k8252
18854A160046j6060Q711L391l376P320N018n7806q6299n7241l7817k7124k8211
18842H70552j6516l616J9813K5242l8639p9977p1738m2308k9839o737j7402k9445
18830E79390q871j4817k3948m12K6578J1789j711L358k086o324J509J4429J9052
18817E97936M136P603N1662N5317J2191l154j2552m510j1343O781K7343M8331
18805G79741N4370N5686O8384R4802O3602J072l9196m2520n7192l8069j5671m4725
$$ y = [3889566, 3732588, 3578256, 3428088, 3267849, 3127693, 3005088, 2875131, 2763472, 2654032, 2539198, 2402303, 2292822, 2191457, 2091481, 1987603, 1904970, 1846289, 1792853, 1735997, 1655621, 1592137, 1549579, 1514910, 1473877, 1413669, 1348454, 1283540, 1229911, 1188298, 1160046, 1143986, 1152697, 1156088, 1152712, 1160032, 1165050, 1107244, 1020945, 963704, 925887, 898763, 870552, 854036, 850420, 870233, 895475, 856836, 776859, 705121, 662813, 632974, 626237, 608835, 579390, 570519, 555702, 531754, 531342, 557920, 569709, 567998, 571356, 569270, 562946, 564455, 578884, 597936, 602072, 609675, 661337, 716654, 728845, 725691, 713139, 708629, 697286, 704067, 731410, 779741, 834111, 889797, 958181, 1052983, 1116585, 1117657, 1078461, 1035941, 978749, 940680, 925009, 880284]
18793H80284n5722l6038j9824L791n577J5980L8445J9138j3021m6384n9070l2356
18781F89646k6756j4902j1502j2246p236j2355k2054j0164j5265k3743j8689N165
18769E19899J3623j4161j6832j4308l271M851l9j0457k1596j1997j294J2245K2421
18756D79084K6119N7310Q2679J05358M2973n0508q2775n9681l6156j2006J4578
18745E66975L6355N6158J00055Q7857N73o6701p1454n1503l4039j571n753o996
18733F09956j9118k3886j1579j1328J9699K5940L6026L8016K0128J0020K7212
18722G21086M1260O1007N6121N5975K7448Q295l665j2613l3120l0176l0619K635
18710H63634M4830M0593j640j4441j8974j6090k6838k6358j5941J5939M698k2739
$$ y = [880284, 824562, 788524, 768700, 772491, 766914, 782894, 821339, 840477, 827456, 781072, 722002, 689646, 662890, 647988, 636486, 624240, 617004, 604649, 582595, 572431, 557166, 533423, 514734, 519899, 533522, 519361, 502529, 488221, 484950, 489801, 489762, 479305, 457709, 445712, 444418, 456663, 479084, 505203, 562513, 645192, 750550, 793523, 743015, 660240, 600559, 564403, 552397, 566975, 603330, 659488, 759543, 847400, 847973, 781272, 709818, 658315, 624276, 622705, 616952, 609956, 590838, 566952, 555373, 544045, 563744, 589684, 625710, 663726, 683854, 693874, 721086, 762346, 823353, 879474, 935449, 962897, 971192, 967527, 954914, 921794, 891618, 860999, 863634, 908464, 949057, 947417, 932976, 914002, 897912, 871074, 844716, 828775, 844714, 849412, 826673]
18698H26673l8558j7862j095J1382n280k3286l1173k3039j5439j009O845K0439
18686G08598J3608j9022k7303n347M6207O4957K8728K2275J8201K0022K5791L5889
18674I32604J6732J2841Q208O747K7814N3964M7815L1511M7257Q3377J03408J21709
18662A493987J71930J22134J9930K5949P5999R8365R0614P0155L3788P0186J12075
18651B385112O6927l1973o9656j5203l403q3887r5554n5740l9459o939N8555J07503
18639B216283J93878K88100M47382P34800J169306J599007J008104l12845p72822
18630F571193l42629L82343J020761Q74300J19949l04986m13730l30615m083O25878
18620H198381J524307K337065J654996m31587j666123j864899j472811r98522
$$ y = [826673, 788115, 770253, 769158, 780540, 775260, 751974, 720801, 697762, 682323, 681314, 688159, 708598, 722206, 703184, 675881, 670534, 716741, 781698, 810426, 832701, 850902, 870924, 896715, 932604, 949336, 962177, 970385, 977132, 1004946, 1058910, 1106725, 1138236, 1185493, 1268870, 1372278, 1493987, 1665917, 1788051, 1807981, 1833930, 1909929, 2008294, 2098908, 2169063, 2202851, 2273037, 2385112, 2452039, 2420066, 2350410, 2335207, 2331804, 2247917, 2152363, 2096623, 2057164, 2050225, 2108780, 2216283, 2410161, 2698261, 3145643, 3880443, 5049749, 6648756, 7656860, 7344015, 6571193, 6228564, 6610907, 7631668, 8505968, 8625917, 8320931, 7907201, 7576586, 7572503, 8198381, 9722688, 12059753, 13714749, 13283162, 11617039, 9752140, 8279329, 7280807]
18612G280807n92390l29698j47620M1407L36342P57942J208132Q60074l27891
18603I087105r29865p76434l87313n3899J72992L20303N39858R58080J529148
18594A0459975J713204N47774p73350j022136m81457K15607Q25130J473367K564534
18585A5522648M277236M946826J809134k020568l404455l025379k023990r39669
18577A5141783L5691Q95888J773581K869518M504292O846824Q889952Q559691
18569D9517220L656636l683586o170973l988176M2706M112844N967365L276034
18561E2730070p62963j309940J768620O844081J3171801J6766061P242889q598915
18553H7851704j5369957j2626199p376098l215532l10649J735072L485899N805638
$$ y = [7280807, 6688417, 6358719, 6211099, 6252506, 6588848, 7346790, 8554922, 9414996, 9087105, 8157240, 7380806, 6993493, 6939594, 7112586, 7432889, 7972747, 8930827, 10459975, 12173179, 12720953, 11947603, 10925467, 10444010, 10659617, 11484747, 12958114, 15522648, 19799884, 24746710, 26555844, 24535276, 21130821, 18105442, 16081452, 15141783, 15177474, 16073362, 17846943, 20716461, 25220753, 32067577, 40957529, 49517220, 53173856, 49490270, 43319297, 39331121, 39373827, 43486671, 49454036, 52730070, 51967107, 50657167, 52425787, 59269868, 72441669, 89207730, 96450619, 87851704, 72481747, 59855548, 52479450, 49263918, 48953269, 50688341, 54174240, 59979878]
18545E9979878R460635J4591947J9199956K1552828K8731112M5684073O4299978
18538B63500407O6502625O0260848M3328772N153350j9717226p691055J6459687
18531D27797408J6132914l768867k3366108l4032794l4751621l1352418k9826881
18524B86831633l4057305l1734958k2711530j9473533k2147948k3126683j9329091
18517A14250585j3671381q751799n016334j766215J787929O321153J1572103J1484002
18509A16210043L206185m271619j0700955j3245499j1318924p310649l444296
18502F9124286m88568m64165k873272m011901l213376j121418J744893K459643
18494F1156122k707373o707101o393277m073216j960767q8169K094108L515173
$$ y = [59979878, 69440513, 84032460, 103232416, 124785244, 153516356, 199200429, 263500407, 330003032, 390263880, 433592652, 438746002, 419028776, 411337721, 427797408, 443930322, 440161455, 416795347, 382762553, 348010932, 316658514, 286831633, 252774328, 221039370, 198327840, 178854307, 156706359, 133579676, 114250585, 100579204, 91827405, 86811071, 85044856, 86832785, 93153938, 104726041, 116210043, 119416228, 115144609, 104443654, 91198155, 79879231, 72568582, 69124286, 68635718, 68171553, 65298281, 61286380, 58073004, 56951586, 58696479, 61156122, 58448749, 51741648, 45348371, 41275155, 39314388, 39226219, 41320327, 44835500]
18486D4835500J022856k283377k602140n20339J010390J095952J008966L63769
18478D3931577j105712k498196k084536j736841k826607l779822l828204l285560
18470B2786099k554531j861350j370497j103950r45095p91132n76758k22876J95975
18461A3555885J45663o50929j103222j060380p99895n84884m21352k96107j95523
18452H589256j16391l3796P1446J99178L90721P87279J523410J982956Q64345
18443A4258404r78355j841887j476182o47375J69109K66699o66038j258545j146394
18434F679436p58989m35076j86216J6739K13216M38610Q61758Q93713j56342j047612
18424F519237j128092q20035n07567l03391j99312j51903j22461j08529q3210
$$ y = [44835500, 45858356, 43574979, 40972839, 40452500, 41462890, 42558842, 43567808, 43931577, 42825865, 40327669, 38243133, 36506292, 33679685, 29899863, 26071659, 22786099, 20231568, 18370218, 16999721, 15895771, 14950676, 14159544, 13582786, 13359910, 13555885, 13701548, 13050619, 11947397, 10887017, 10087122, 9502238, 9080886, 8784779, 8589256, 8472865, 8439069, 8510515, 8709693, 9100414, 9887693, 11411103, 13394059, 14258404, 13280049, 11438162, 9961980, 9314605, 9483714, 9750413, 9084375, 7825830, 6679436, 5920447, 5485371, 5299155, 5315894, 5529110, 5967720, 6829478, 7723191, 7566849, 6519237, 5391145, 4571110, 4063543, 3760152, 3560840, 3408937, 3286476, 3177947, 3094737]
18415C094737j8642j030n1627p4482o634n341l6642j7868n135o5315j04051q0083
18403B627887o2895p4444p5948q6834q9248o1784p3763j15070j44726j13762o3397
18392A666016k4932n0471q8506j11076j01591o5635k2078L143J114L545J1694
18381A221223n673j3626j6262k0554q290J3157N64j426k0214m4253k4386j4006
18369A066254j7913k1406j936K8354L6242r487k8588k2661l4726l8555k4230m064
18357I27284J026J687j4852l0406m3066m2883l6511j7862L475r50O70L258R621
18344G60491J3595K1223L1891N7753P7985Q0084M9616L3693L1029j2187o9277
18333A075896q9488n4986m2766k0738R204L4493O7791M8378K5960J4311N517k2003
$$ y = [3094737, 3076095, 3075065, 3023438, 2948956, 2942322, 2936981, 2900339, 2882471, 2877336, 2812021, 2707970, 2627887, 2564992, 2490548, 2414600, 2327766, 2238518, 2176734, 2102971, 1987901, 1843175, 1729413, 1666016, 1641084, 1590613, 1502107, 1391031, 1289440, 1223805, 1201727, 1204870, 1205984, 1209529, 1221223, 1215550, 1201924, 1185662, 1165108, 1156818, 1169975, 1170539, 1169113, 1148899, 1104646, 1080260, 1066254, 1048341, 1026935, 1024999, 1053353, 1089595, 1080108, 1051520, 1028859, 994133, 955578, 931348, 927284, 928310, 929997, 915145, 884739, 841673, 798790, 762279, 744417, 747892, 746942, 747612, 750870, 760491, 774086, 795309, 827200, 884953, 962938, 1043022, 1092638, 1126331, 1157360, 1145173, 1075896, 986408, 931422, 888656, 867918, 877122, 911615, 979406, 1027784, 1053744, 1068055, 1073572, 1051569]
18321A051569m5521m7357n1306o1087m7267l6553l0868k1909j1953k6621k8557
18310F42570k4257l999P545J152K401K9127L4990L1436J6801p164m0160m1956
18298F48486l0590l0862k3100k4606r257K707Q385l1009l2917k1385j6514K505
18286D41843Q616J504j4950j1788q687m423n171r986j519J1773q691j3810K66
18273C84977K100j5921j7379k5296j7961R505L162k567K3701J7346M736j6124
18261C50279j945j2735j3715K147J1831L8225M5852L9168K6902J1834k7287j2806
18249D57750n925j7479l1850l4239l2991j8055j9368j1152n665J1118J4875J5709
18237C22728J0353j0711p832L146q268j1377N4N101j0458j3002j551L772K334
$$ y = [1051569, 1006048, 958691, 907385, 846298, 799031, 762478, 731610, 709701, 697748, 671127, 642570, 618313, 614314, 621859, 623011, 625412, 654539, 689529, 720965, 737766, 730602, 690442, 648486, 617896, 587034, 563934, 539328, 530071, 532778, 541163, 510154, 477237, 455852, 439338, 441843, 450459, 451963, 437013, 425225, 416538, 412115, 406944, 396958, 395439, 407212, 398521, 384711, 384977, 387077, 371156, 353777, 328481, 310520, 320025, 323187, 320620, 344321, 361667, 366403, 350279, 348334, 335599, 321884, 324031, 335862, 374087, 419939, 459107, 486009, 497843, 470556, 457750, 451825, 434346, 402496, 368257, 335266, 317211, 297843, 286691, 281026, 292144, 307019, 322728, 333081, 322370, 314538, 317684, 309416, 298039, 298093, 303194, 292736, 279734, 278183, 281955, 284289]
18224B84289m860r326l40J1615J2004j0955m761j434K944K882n719R298m345j4339
18210B66953j4095j0061j3695L777r706q867o630r087j7998j7208n661J0126J0318
18197A78166J2577L789K283k368l595o667l952j6566n333P85K410j767L200Q250
18183A71212K5252k08m31K107L6573K5731j932P676K3056O865j867K6316L3758
18170C54108K3242K7472N0211O0567O3335P7516J01932J42850J85596K78377M29749
18159A794955O84357J142297K065042L796071M764528L14645l616091l851898
18151G093906k398671j332279p91587n27015l49775k26610j69417j33122r0915
18142A074515n8588o1733o9404o6937n3386l0228j3860N277K2329K5468R022o502
$$ y = [284289, 279429, 270103, 269763, 281378, 293382, 282427, 277666, 276232, 279176, 282058, 276339, 285637, 281292, 266953, 252858, 242797, 229102, 232879, 223173, 214306, 207676, 198589, 180591, 163383, 157722, 167848, 178166, 190743, 194532, 196815, 194447, 190852, 184185, 180233, 163667, 158334, 159119, 161529, 159762, 162962, 171212, 196464, 196256, 195825, 197932, 234505, 260236, 258304, 265980, 289036, 295901, 294034, 320350, 354108, 377350, 404822, 455033, 515600, 578935, 656451, 758383, 901233, 1086829, 1365206, 1794955, 2479312, 3621609, 5686651, 9482722, 14247250, 14561895, 10945804, 7093906, 4695235, 3362956, 2571369, 2044354, 1694579, 1467969, 1298552, 1165430, 1074515, 1015927, 954194, 884790, 817853, 764467, 734239, 720379, 725656, 747985, 773453, 782475, 775973]
18130G75973J4531P666l3314m9086k1987l3201m9487n7692m9629m2921k6848k7433
18118D06572k7154o62r100k5779k2391j3288j1379N568Q043k862P883L766n791
18105C13426J6873K3422J5148K5403K5846M0188M5412N3756K1758l0375m9980
18094E00877l4154j1844J2705L0234L6608M3411N3182N4790J9447l8129o1450
18083F05677n2417k9534j9441l9145o2036n9989k3435p903K277P677N758N635
18071C33124o009j1222k753j0553p089Q92J4640K3420J9753N0524N0434L6396
18059D91557O2101O1953J193l8493m4231k1683K7877N0220K4451j2150m3742l6920
18047E22133j1217M10J6505L3576P8995J35693J82919J23133L5048m2270n0066
$$ y = [775973, 790504, 798170, 764856, 715770, 693783, 660582, 611095, 553403, 503774, 460853, 434005, 406572, 379418, 378756, 369656, 343877, 321486, 308198, 296819, 302387, 310430, 307568, 315451, 319217, 313426, 330299, 353721, 368869, 394272, 420118, 460306, 505718, 559474, 581232, 550857, 500877, 466723, 454879, 467584, 497818, 534426, 577837, 631019, 685809, 705256, 667127, 605677, 553260, 523726, 504285, 465140, 403104, 343115, 319680, 311777, 314054, 321731, 327489, 333124, 327115, 315893, 313140, 302587, 295498, 296390, 311030, 334450, 354203, 404727, 455161, 491557, 553658, 615611, 616804, 578311, 534080, 512397, 540274, 590494, 614945, 602795, 559053, 522133, 510916, 511326, 527831, 561407, 640402, 776095, 959014, 1082147, 1117195, 1074925, 1024859]
18036A024859k0662J4981Q22n6688r4209q2930O323R5052J63072K00260J35684
18025A386564L2041n7441r7269q9276q4795p9158p4855n5195l5127j9612j6057
18014H09820j4264k1318k5336k3375j3448M070J2407J0237J0279N55p158l2051
18002G10418n1819m2780j4111J5965K9530M9689P2392Q0715J10802J04010O9171
17991A133982L4065o564j3329Q855N9191P8514L8938p544j2554P384L3950K9897
17979A384785r004k5886M582K3336L6046n317k4774K4386J9478m0171p2296j00948
17967A214217r2617o3497q429K6070K9330K4626k915K955K5586M6835M9405L2551
17955A284117K4058K5953K9477K0530K1505K0893K2473N2257Q3623J36537J86576
$$ y = [1024859, 1004197, 1019178, 1020000, 963312, 869103, 786173, 792496, 887548, 1050620, 1250880, 1386564, 1418605, 1361164, 1263895, 1174619, 1089824, 1010666, 935811, 880616, 845489, 825877, 809820, 795556, 774238, 748902, 725527, 712079, 716149, 728556, 738793, 749072, 749627, 742469, 710418, 658599, 615819, 601708, 617673, 647203, 696892, 769284, 849999, 960801, 1064811, 1133982, 1168047, 1161483, 1148154, 1157009, 1216200, 1294714, 1333652, 1326108, 1313554, 1320938, 1354888, 1384785, 1375781, 1349895, 1354477, 1377813, 1413859, 1408542, 1383768, 1408154, 1427632, 1387461, 1315165, 1214217, 1121600, 1058103, 1049674, 1075744, 1105074, 1129700, 1126785, 1129740, 1155326, 1202161, 1251566, 1284117, 1308175, 1334128, 1363605, 1384135, 1405640, 1426533, 1449006, 1501263, 1584886, 1721423, 1907999]
17944A907999J90873J73929J82026K62702K93713K53783J77325J12612J08061
17935C663023J56094K41566L72144M79821M70701M35360M83173O00024P89455
17926G691361R59163J175280J555687K246223L278001M769397P037565J0754832
17918C9467509J7150471K6732533L1686845K0255720j456734k2261304k7300112
17911H4274928k0878993j2373685o177529j697712K275256O860050J3524189K3206396
17903H9012900K9160312J9115740j523287k2377103k8347278k2731670j4903560
17896D7406054r576316o401652m401191l089243k190301j554952j130574r54374
17888A8107451r99273j085664j064663r44417q31076p68747p16735o03354m47653
$$ y = [1907999, 2098872, 2272801, 2454827, 2717529, 3011242, 3265025, 3442350, 3554962, 3663023, 3819117, 4060683, 4432827, 4912648, 5383349, 5818709, 6301882, 6901906, 7691361, 8650524, 9825804, 11381491, 13627714, 16905715, 21675112, 28712677, 39467509, 56617980, 83350513, 115037358, 135293078, 133836344, 111575040, 84274928, 63395935, 51022250, 44844721, 43147009, 45422265, 52282315, 65806504, 89012900, 118173212, 137288952, 135765665, 113388562, 85041284, 62309614, 47406054, 37829738, 31428086, 27026895, 23937652, 21747351, 20192399, 19061825, 18107451, 17108178, 16022514, 14957851, 14013434, 13182358, 12413611, 11696876, 11093522, 10645869]
17879A0645869k87266j45329r5222j98585m16406o34640p11666o42562n39465
17870F974728m79724m32451m02972l86155l53104l26959l15850k81203k37304
17861C759006k13115j95841j59199j31838j21274j25707j24398j21693j07994
17852B457947j01283j12656j23939j32550j17194j05529r9159r5319q6694q5315
17842A398309q3277o2263n6336m5467m7863n3085o4896m3995m1037k4822k8470
17831H46798k7777l6662m2544l8630m3975m2690k3101l9309k5800j1466L31j1430
17819E03745j2396j4115k1299k3948k0401k4202l3284l1151l5190j8682n24K421
17807B70974J0696L176k0621j212p075j2641N258L525n873L036R439q837j397
$$ y = [10645869, 10358603, 10213274, 10118052, 9919467, 9503061, 8868421, 8156755, 7514193, 6974728, 6495004, 6062553, 5659581, 5273426, 4920322, 4593363, 4277513, 3996310, 3759006, 3545891, 3350050, 3190851, 3059013, 2937739, 2812032, 2687634, 2565941, 2457947, 2356664, 2244008, 2120069, 1987519, 1870325, 1764796, 1665637, 1570318, 1483624, 1398309, 1315032, 1252769, 1196433, 1150966, 1103103, 1050018, 985122, 941127, 900090, 875268, 846798, 819021, 782359, 739815, 701185, 657210, 614520, 591419, 552110, 526310, 514844, 515175, 503745, 491349, 477234, 455935, 431987, 411586, 387384, 354100, 322949, 287759, 269077, 268553, 270974, 281670, 284846, 264225, 263013, 255938, 243297, 248555, 252080, 246207, 249243, 258682, 249845, 248448]
17794B48448P131R707J818L706j0418k1045o28K9928M4262K2347j0768k8599q579
17781B87310j4365j6863r833R30l645k4964k2413J2100L2978O536O71q585k9432
17768B10425k4180k0916k980k2j1421L032J6785K2062M671O609O063O198j1954
17755B04372p254j5282r852J3493r175j1K064N001J3142J5187K480O475K378O747
17741B29765m213j6907l3659j6117k0273j8189j0837l03j3915j0862J0070J0910
17729A05470J4158P593J0360N434k998M128n390O00N310J038r889j4654n592q880
17715A06688n992Q478J5625J218o214n410j5593j4990n288q908J8829J7990P376
17702A13809l060L643J0678j52p84j6241j1487n947n32k41K527R472k026r907
$$ y = [248448, 255579, 265286, 267104, 270810, 260392, 239347, 238719, 268647, 312909, 335256, 324488, 295889, 287310, 272945, 256082, 246249, 247179, 243534, 218570, 196157, 208257, 241235, 247771, 248442, 239857, 210425, 186245, 165329, 162349, 162327, 150906, 153938, 170723, 192785, 197456, 204065, 210128, 216326, 204372, 197118, 181836, 171984, 185477, 176302, 176291, 178355, 183356, 196498, 211685, 214165, 220640, 223018, 229765, 225552, 208645, 174986, 158869, 138596, 120407, 109570, 109267, 95352, 84490, 94560, 105470, 119628, 127221, 137581, 143015, 140017, 144145, 138755, 139355, 144665, 145703, 135814, 121160, 115568, 106688, 100696, 109174, 124799, 126017, 119803, 114393, 98800, 83810, 78522, 69614, 88443, 106433, 113809, 110749, 114392, 125070, 124918, 124134, 107893, 96406, 90459, 89927, 89686, 92213, 101685, 99659, 89752]
17688H9752j3301j2110M367J1023L016o875L745q344J610L89r511J0056k692j4685
17674E6440p760n816m566N885k460M937J7765m28j9443o497M566K036j739k027
17660D0893j1633j4487P459J1182k819L522k192L304M83Q417o191j1662N864j0698
17646B1442q617J5558Q998N441J330j3953n494m267p333m080o915j3085l047J1092
17632b930J9689j49L064L329r120p868M854N741k577L646m996p151M302L306J127
17617A4267N36J4274r40n464o600j1300R222K779M511o255m965K483Q757J0660
17603C1965J584R48P441j0870p140J0192K000k2041l526k381j99j490O373M205
17589A7061j378o826o061K456l097K306j807k965n25o089j2916M342R652K745
$$ y = [89752, 76451, 64341, 68708, 79731, 82747, 75872, 79617, 71273, 72883, 73272, 63761, 73817, 71125, 56440, 48680, 42864, 38298, 44183, 41723, 46660, 64425, 63997, 44554, 38057, 42623, 44659, 42920, 40893, 29260, 14773, 22232, 33414, 30595, 34117, 31925, 35229, 35712, 44129, 37938, 26276, 32140, 21442, 12825, 28383, 37381, 42822, 44152, 30199, 24705, 20438, 13105, 9025, 2110, -10975, -14022, -2930, 16759, 16610, 19674, 23003, 13883, 6015, 10869, 16610, 14033, 17679, 12683, 5532, 9834, 13140, 14267, 14803, 29077, 28137, 22673, 16073, 4773, 13995, 16774, 21285, 15030, 10065, 12548, 21305, 31965, 33549, 34497, 41938, 31068, 23928, 34120, 36120, 14079, 10553, 8172, 7973, 6483, 12856, 17061, 15683, 8857, 2796, 5252, 2155, 4461, 2654, -311, -836, -6925, -19841, -15499, -5847, -3102]
17575c102Q471p715q058J1207k55j4006k371J2938M613m371l265N102l073p22
17561d607M579q265o151K05m134K937J3398J1585J301l694m589n466p311M639
17547e573K957j1730N076R195K542j4716j272J0533l072n353m956J3089L275l959
17533c964r848m537L036P753J1200R509p552j7629P334O961k105r324p81L045
17519f902k68N083M339q65L09j4947p246N16Q425J0341N430j8406j2131r520K0875
17504a4967R460L49o690k517L850N650P433p488o802j283N309J285k921J4723
17490E391J4766J3547K8906K0600k1291j7146j3143m260j0063q168j3848j072
17478e781J952j56j6330m464K2201O331j989J3256J0907j7070L825K868p054J50
$$ y = [-3102, 5369, -2346, -10404, 803, 548, -13458, -15829, -2891, 1722, -2649, -5914, -812, -3885, -4607, -28, -8293, -14444, -14239, -18373, -15436, -2038, 9547, 10848, 7154, 2565, -2901, -10212, -5573, -2616, -14346, -9270, -75, 2467, -12249, -13521, -2988, -6060, -11413, -16369, -3280, -5, -3964, -13812, -18349, -15313, -7560, 3640, 13149, 5597, -12032, -4698, 2263, 158, -9166, -9947, -6902, -7170, -2087, 2252, 1387, 1696, -13251, -20497, -19981, -11556, -1215, 4215, -14191, -26322, -35842, -14967, -5507, -5158, -11848, -14365, -10515, -4865, 2568, -4920, -11722, -13005, -7696, -6411, -9332, 5391, 20157, 33704, 62610, 83210, 61919, 44773, 31630, 27370, 17307, 9139, -4709, -5781, -3829, -3985, -20315, -24779, -2578, 3753, 1764, 15020, 25927, 8857, 12682, 15550, 8496, 8646]
17464H646j709M731L709p605l443o50J1188k911j6410m880N783J230R971m799
17450B851r793J481M160M165O906l446Q21k673l369M746P667N791J324N867P881
17435C4379j1791j819n575J227K3411Q597L393j5904r053j658l713j9271l16Q183
17421A0090n833J1682n904j342N533P407L867L387R21L789r128P0Q30j0585o861
17406G923M035N696l183j0526n208m348J0643M745K561j2504r428m688j994k377
17392a8653N229n67j985j668L24R058J4646J5409l662j0739N340j71o844K27k369
17377C575j065N249J173J0319Q107q026N826J8562N769K048k856J699l823p328
17363C9229q685o579J1102J5595k538l25O29L105J0582J2116J0072j3265O636
$$ y = [8646, 6937, 11668, 15377, 7772, 4329, 3679, 14867, 11956, -4454, -9334, -3551, -2321, 7650, 2851, -6942, -5461, -1301, 2864, 9770, 6324, 7145, 4472, 1103, 5849, 13516, 19307, 20631, 26498, 34379, 22588, 20769, 15194, 16421, 39832, 48429, 51822, 35918, 26865, 25207, 21494, 2223, 1907, 10090, 4257, 15939, 10035, 8693, 14226, 21633, 25500, 28887, 29808, 33597, 24469, 24539, 25369, 14784, 7923, 11958, 17654, 14471, 3945, -1263, -5611, 5032, 9777, 12338, -166, -9594, -14282, -16276, -18653, -13424, -13991, -15976, -17644, -17320, -8262, 6384, 21793, 18131, 7392, 12732, 12561, 5717, 5944, 3575, 2510, 7759, 8932, 19251, 27358, 19332, 25158, 43720, 49489, 51537, 48681, 50380, 46557, 39229, 30544, 23965, 35067, 50662, 48124, 47799, 48428, 51533, 62115, 74231, 84303, 71038, 77674]
17350G7674K4662J1138K2582L5686N9835P3070J16760J51801J06148Q626p8565
17339F09417j29388j07724n5501l1452j3859J0905L5197O8281J06360J33343R3876
17328G19455r632j03907j38568j13335p6707n3558l8551l6419j9754r440n155
17317A14429j2758j5048n036N282J059j2068j7313q882K741N922p545k309q781
17304C9693J353R654p076r012N855n904j585p258j909M451P427q969j7935r024
17290b39k356P788J0755O04j1362q228o256m320J0450J6862N258m606o277n691
17276B382j530j3724q580J851J0636P190J1020l597O396m388l909j2107K976J8230
17262A2846R08n532l531o47n49p188N160M577j3605j8597q451N499j1361K3866
$$ y = [77674, 102336, 113474, 136056, 171742, 231577, 304647, 421407, 573208, 679356, 687982, 609417, 480029, 372305, 316804, 285352, 271493, 282398, 317595, 385876, 492236, 625579, 719455, 709823, 605916, 467348, 354013, 277306, 223748, 185197, 148778, 129024, 119584, 114429, 101671, 86623, 81587, 86869, 87928, 75860, 58547, 49665, 52406, 58328, 50783, 48474, 39693, 41046, 50700, 43624, 34612, 40467, 34563, 32978, 25720, 23811, 28262, 35689, 26720, 8785, -239, -2595, 5193, 15948, 16552, 5190, -3038, -9294, -13614, -3164, 13698, 18956, 14350, 8073, 2382, 852, -12872, -21452, -19601, -8965, -1775, 9245, 5648, 12044, 7656, 3747, -8360, -5384, 12846, 13754, 8222, 4691, 4044, 3495, -3693, 1467, 6044, -7561, -26158, -34609, -29110, -40471, -16605]
17248a6605L4184k828J455j4384j0975m522K059n481j426J938j09L815J0947j949
17234c881j995J662m033M051L352n997k989l190j304k223r648L417R957J135l059
17219a4745o60R220q691j1780J84m241J9648J2673L467o69r519j0015N747R713
17205C32j679j190R09m799K735o194q248N929j827q32l129J905Q375O647J410
17190C44j1482j1345M40J4347J27p092k47j406N198m574m673M216O182p375q781
17175b6121M743J6511q31o176j2078j0390J1995Q149J918l745J1909K1355p88
17162A6451j2313l727K477q8j3020r862n992N183M437P886J1541j776o346j4423
17148a9572k174K273N318K370k770k497k853N606J1803l157r691o448j251O857
$$ y = [-16605, 17579, 14751, 16206, 1822, -9153, -13675, -11616, -17097, -18523, -16585, -16694, -12879, -1932, -3881, -5876, -4214, -8247, -4196, -844, -6841, -9830, -13020, -14324, -16547, -26195, -22778, -12821, -11686, -14745, -15405, -6185, -14876, -26656, -26472, -30713, -11065, 1608, 5075, 4406, -5113, -15128, -9381, 332, -1347, -2537, -1628, -6427, -3692, -9886, -18134, -12205, -14032, -14864, -17993, -16088, -7713, -1066, 344, -11138, -22483, -22043, -7696, -7569, -14661, -14908, -16314, -11116, -15690, -20363, -16147, -9965, -17340, -26121, -21378, -4867, -5698, -11874, -23952, -34342, -22347, -14198, -12280, -16025, -4116, 17239, 16451, 4138, 411, 2888, 2800, -10220, -20082, -26074, -20891, -16454, -8568, 2973, 1197, -5149, -19572, -21746, -19473, -14155, -11785, -14555, -17052, -19905, -14299, -2496, -5653, -15344, -21792, -23043, -16186]
17134a6186Q53L582Q884Q647p715l515p729j3187L522M139l681J1383R153m651
17120f501k726K83M161J3876l017r029M653m833m240o924j0413J1598J9836J718
17106H442R847j917j3808q999j1269K073J5891J26K230N158n77J0886J931k0678
17092f64j1058L327J1388L349j0856k962R860j0191o838p232P993J0118J7857
17079A4091L695j4711j6323m800Q983k840L556Q625M497K560l582n486M033N556
17065G854q696j1960p505k512p592J4842K62l656L18J793O205n4J09K981J0691
17050C080J372l114J77j453m449j037K702l131l705K842q269j041R099k924n920
17035a5771Q640R749L578N366Q728j0805j3113l875J7983J0954N047Q358P934
$$ y = [-16186, -15333, -11751, -2867, 5780, -1935, -5450, -13179, -26366, -22844, -18705, -22386, -11003, -1850, -6501, -9227, -8944, -4783, 9093, 6076, -2953, 1700, -3133, -7373, -14297, -24710, -13112, 6724, 8442, 18289, 16372, 2564, -6435, -17704, -15631, 260, 386, 2616, 7774, 7197, 18083, 20014, -664, -11722, -8395, 2993, 6342, -4514, -7476, 2384, -7807, -14645, -21877, -13884, -3766, 14091, 17786, 3075, -13248, -18048, -9065, -11905, -8349, 276, 4773, 7333, 3751, -1735, 2298, 7854, -842, -12802, -20307, -22819, -30411, -15569, -15307, -18963, -18645, -16852, -10647, -10701, -10592, -7611, 3080, 4452, 1338, 1515, 62, -4387, -5424, -2722, -5853, -9558, -6716, -14985, -16026, -6927, -9851, -15771, -7131, 2618, 6196, 11562, 20290, 9485, -3628, -7503, 10480, 21434, 26481, 34839, 42773]
17022D2773R384J0382L4318L6650M7349Q9408J25303Q3259j7011p7609r1661o4958
17010B27587l1102r982R460L1677O3139R5714J35125J06305J1906p535J4221k8340
16998F18175r0139j05463q4125o4470l3613j5390J4897L3456N6459Q8690J06179
16987E24656K538r1710j16691p4041m7534l6678j8875k2907k8640j9197N425P998
16975H4344n814j2025j6073j3050O551M832m110j020p74J725R077Q66j1256j0035
16961C3238j39L606j9786q322O21k962J998Q278k28q982N76m852o959k720k426
16946i059J1901J039p645j1930l926J6471J0407j105j4841Q88O726Q04J514p178
16932e934O899Q174j14m357L113q695J175J1196K276n732j1123J686P081J0933
$$ y = [42773, 52157, 62539, 96857, 133507, 180856, 270264, 395567, 478826, 461815, 384206, 292545, 227587, 196485, 186503, 195963, 227640, 290779, 386493, 521618, 627923, 639829, 632294, 646515, 618175, 528036, 422573, 338448, 273978, 240365, 224975, 239872, 273328, 329787, 418477, 524656, 527194, 435484, 318793, 244752, 197218, 160540, 141665, 118758, 90118, 70921, 76346, 84344, 78530, 66505, 50432, 37382, 43933, 48765, 44655, 43635, 42861, 44586, 53663, 54529, 43273, 33238, 33099, 36705, 16919, 8597, 9218, 6256, 8254, 16532, 16304, 7322, 7898, 3046, -3913, -6633, -9059, 2842, 3881, -3764, -15694, -19620, -3149, 7258, 6153, -8688, -7800, -1074, -270, 1244, -5934, 965, 9139, 9025, 4668, 7781, -914, 261, 11457, 13733, 8001, -3122, -1436, 5645, 16578]
16918A6578k224q755p09L046j1326N7N243K646K41O147k150j4368l587K729M931
16903a501O043p475K266M809n781k400k154J416N415P720J051k755k458J8204
16889B2400K2378K3358J8311p346k1498k2594k5501J0314J2648O167Q489Q705
16877E5831J3547L0351J5387k826k8659j491k789J089p857j5779p732p93n681
16864D2598j7705O579J7981J7576J6056K682q081j9631j2592j0584j0463j953
16852B2463m780Q98J846q769j0268N44m608o982L786K727P943J3793m95Q12n137
16837A3773J189k433n72o267O543L81o367m798j82J2846m013Q21m949J241J779
16822H992k208R728N483n178L7J163P917Q480Q802J6760L2140K4864P427K2481
$$ y = [16578, 14354, 5599, 4890, 7936, -3390, -3333, 1910, 4556, 4797, 10944, 8794, -5574, -9161, -6432, -1501, 4542, -2933, -667, 4142, -1639, -4039, -6193, -4777, 638, 8358, 9409, 6654, 4196, 22400, 44778, 68136, 86447, 79101, 57603, 35009, 9508, 19822, 32470, 38637, 47126, 55831, 69378, 99729, 115116, 112290, 83631, 82140, 79351, 80440, 72583, 56804, 49072, 48279, 42598, 24893, 31472, 49453, 67029, 83085, 85767, 77686, 58055, 45463, 34879, 24416, 22463, 17683, 18581, 20427, 11658, 1390, 1934, -2674, -9656, -5870, -3143, 4800, 18593, 18098, 18910, 13773, 14962, 12529, 11957, 5690, 12233, 12614, 6247, 1449, 1267, 14113, 10100, 10921, 5972, 7213, 8992, 6784, 16512, 21995, 16817, 16854, 18017, 25934, 34414, 43216, 59976, 92116, 116980, 124407, 146888]
16808A46888L3881J2835j2923k0183j6805j7894p577J1504j956J5783K1750K2111
16796A87414J9987o539j9742k4880k8538l0405k8372o352j898N543j907j4648
16784D9663o902j1771m790K096q093r824j6598N951J4336O184j0215k453n474
16771B110R853q67j1373n420M875J0624r907m942R704l584k2629l953j896J256
16757b6149L828J1384J4107K081j6733l155J947K41n392Q073Q306j42N122L235
16743F753p803m745N52m17J1999N184j6893P4P549O681n809n437j2633m17o660
16728b2022K253N482O717L997j040L143M240j3432j8377p133J1277J2871p830
16715a9854p452Q734M653J1825K123l560J331J448Q74O759j1618r55M315L887
$$ y = [146888, 180769, 193604, 180681, 160498, 143693, 125799, 118222, 129726, 127770, 143553, 165303, 187414, 207401, 200862, 181120, 156240, 127702, 97297, 68925, 62573, 60675, 66218, 64311, 49663, 42761, 30990, 26200, 28296, 20203, 10379, -6219, -268, 14068, 20252, 10037, 7584, 2110, 11963, 11096, -277, -5697, -822, 9802, -105, -5047, 4657, 1073, -21556, -25509, -27405, -26149, -22321, -10937, 3170, 5251, -11482, -14637, -12690, -12449, -17841, -9768, -1462, -1604, 3518, 6753, -1050, -5795, -5243, -5660, 6339, 11523, -5370, -5296, 2253, 8934, 3125, -2312, -14945, -15362, -22022, -19769, -14287, -7570, -3573, -4613, -1470, 2770, -10662, -29039, -36172, -24895, -12024, -19854, -27306, -18572, -13919, -2094, 29, -3531, -2200, -752, 122, 6881, -4737, -5692, -1377, 2510]
16701B510l591o703O268m978o791L065l547R137K736r989L958M761K100n709O950
16686A77k255N070M985M07o893j8679O164J6230Q006n618R78m588l872q030r049
16671a6967j783j957K0262k777j3736m578n587J450Q481P054K668n308K206r386
16657a9958J3567J1497J804J0040m062p675j336q520p826k735N480O252O69j9602
16643b2405J114Q806k318M24p31o808J4768J2890q069k428j1517N586J3312p679
16629e055K21M19k418j5687j057J7139J4543L480k743m078o159n784J9988Q118
16615B0927j5434m627j2941J555Q305J2083J1324p342j9449j1047N227n618M2
16602a6995J4567P931r382j1041K898P469O431L411j2326r031Q24n92p737K3642
$$ y = [2510, -1081, -7784, -1516, -6494, -13285, -10220, -13767, -4630, -1894, -11883, -7925, -3164, -1064, -6773, 177, -2078, 2992, 7977, 8384, 1491, -17188, -11024, 5206, 13212, 7594, 8572, 3984, 112, -7918, -16967, -18750, -20707, -445, -3222, -16958, -21536, -27123, -25673, -17192, -10138, -7470, -12778, -10572, -19958, -6391, 5106, 6910, 16950, 12888, 5213, 3877, -4643, -12469, -15204, -9724, -3472, -2803, -22405, -21291, -12485, -14803, -14379, -15110, -21918, -7150, 5740, -2329, -4757, -16274, -10688, 2624, -5055, -4834, -4415, -6833, -22520, -23577, -6438, 8105, 11585, 8842, 4764, -1395, -7179, 12809, 20927, 5493, 866, -12075, -10520, -2215, 9868, 21192, 13850, -5599, -16646, -11419, -17037, -16995, -2428, 5503, -3879, -14920, -12022, -4553, 1878, 5289, -7037, -16068, -15244, -15836, -23573, 69]
16588F9J7950o734k937J032k118N109m818k851m132j1791p850K372j252O707N489
16573e755M970K253J834q293j1195q597L995P989J2361N218m943j2448k675R663
16559e623j72j0027p550J1880Q968J538Q57l244p86P632o48J387o484K189m659
16544d742k412P015L884O510J1347r202j8018Q678K842J1m586j1903j1069M698
16530a6947q75n048M186K302M398k484N627o226k427L972q025K451M240l043J0104
16515g795n402j4078j1794L804J630J4395K292o471j0915K367R457J1219K219
16502i072J40n185r39J1160m061p309K760J2262K229j2621n040o987j0419Q778
16488b4304Q003O148N64j1940o18K358O189q132j896N163K24L628J1434Q14O103
$$ y = [69, 18019, 11285, 8348, 9380, 7262, 12371, 7553, 4702, 570, -11221, -19071, -16699, -17951, -11244, -5755, -785, 1468, 3302, -4991, -16186, -24783, -20788, -12799, -438, 4780, -163, -12611, -15286, -5623, -5795, -15822, -23372, -11492, -2524, -986, -129, -3373, -4159, 3473, 2825, 4212, -2272, -83, -4742, -7154, -139, 3745, 10255, 21602, 12400, -5618, 3060, 5902, 5913, 1327, -10576, -21645, -16947, -17822, -22870, -18684, -16382, -11984, -14468, -8841, -15067, -17494, -13522, -21547, -19096, -14856, -17899, -7795, -13197, -27275, -39069, -35265, -33635, -19240, -16948, -23419, -34334, -31967, -22510, -11291, -9072, -8932, -14117, -15056, -3896, -7957, -15266, -12506, -244, 1985, -10636, -15676, -22663, -33082, -24304, -16301, -10153, -9589, -21529, -22147, -19789, -13600, -21732, -23628, -18465, -18241, -14613, -3179, -2365, 3738]
16473C738k454n953l102n656j0916q724O685Q372o301p034M620J35J3354J3245
16459Im91j5979j4505J0158Q373M891m110j2308o211J2356L212l295l288J834
16445a9354N091r383N088J3711n687l227l08l849k714J1952q496k871K676N56
16431a6815K609M35r28j0635J576j961q142p3k03J1637J8026J548j8406K796J8824
16416B88M019l597j884n241j4030P564R356o956q375J971J0631l317j461L831
16402g201j264o111k565r6r641N847P241N355q180P5K818J0535O043k871k504
16387b519N821L731m192j1932q686l429r192K348M398n344r876Q435K75M595O577
16372a8990Q182K509m139p615O854P733m205J865K102m989Q95q38p705j269J2912
$$ y = [3738, 1284, -4669, -7771, -13427, -24343, -33067, -26382, -18010, -24311, -31345, -26725, -26590, -13236, 9, -482, -16461, -30966, -20808, -12435, -7544, -11654, -23962, -30173, -17817, -14605, -17900, -21188, -19354, -14263, -23646, -18558, -4847, -10534, -13761, -14069, -17918, -20632, -8680, -17176, -20047, -17371, -16815, -14206, -13771, -14699, -25334, -23758, -25719, -33861, -33934, -34137, -22500, -4474, -2926, -21332, -18536, 288, 4307, 710, -1174, -6415, -20445, -12881, -3525, -10481, -18856, -16885, -6254, -9571, -11032, -7201, -8465, -14576, -17141, -17237, -26878, -21031, -13790, -8435, -16615, -16540, -13722, -3187, 2856, -15, -2519, 3302, 7033, 2841, -9091, -17777, -21206, -30398, -28050, -23652, -28996, -38872, -30437, -30162, -25567, -18990, -10808, -8299, -12438, -20053, -13199, -5466, -9671, -7806, -5704, -10693, -9798, -10636, -18341, -19610, -6698]
16357f698P832Q364K538p472m302R07p211j066O191j32j475J0076K399n309o246
16342a604j5477r437K399L421J2679m098j1969k141j097n283M785J3010O553N539
16328b720k736M607k202n66O429J992k764r825m424M279p00p61P017J0671o110
16313B187K458m488m983J96Q309l504P298L49m549m977j4495q733K162Q145J95
16298a4430M024J111P485R501O440p276n650O763k095n638n767N146O647J280
16284G541o100j1988r080P2N547L087M077J040n579j7177m736M785R604Q036N668
16269e203N463l106J1583N381r496m383k672p549J822M515R21j3516q30J2212
16255d858K271P352J2812O733j2501j6588q531k256Q810m352j5369J4148O212
$$ y = [-6698, 1134, 9498, 12036, 4564, 262, 1169, -6042, -7108, -917, -1049, -2524, 7552, 9951, 4642, -1604, -17081, -26518, -24119, -20698, -8019, -12117, -24086, -26227, -27324, -32607, -27822, -14812, -8259, -2720, -5456, -849, -3051, -3617, 2812, 4804, 2040, -7785, -12209, -7930, -8630, -9391, -2374, 8297, 2187, 4645, 157, -4826, -4630, 3679, 175, 7473, 7822, 3273, -1704, -16199, -24932, -22770, -14625, -14430, -10406, -9295, -1810, 7691, 14131, 6855, 1205, 7968, 5873, 235, -5532, -386, 6261, 7541, 1441, -10547, -19627, -19555, -14008, -10921, -6844, -5804, -11383, -28560, -33296, -28511, -18907, -10871, -5203, 260, -2846, 8737, 14118, 4622, 239, -2433, -9982, -8160, -3645, -2724, -16240, -17070, -4858, -2587, 4765, 17577, 24310, 11809, -4779, -13310, -15566, -6756, -11108, -26477, -12329, -6117]
16242f117r27k229j374M921m884o57L543r51l10N903P17Q215p990q103L576L576
16226c091P10p233j888N4p217K887j2409j976K0338Q282M059j6006O763M856j3066
16211a4937P68J0652n277n811n982j2105M089l052l960J0312K2428j601J23P246
16197B893N907l163m3l614l832m919N31p387k231p238o041n611N497J6668Q362
16182d221P018q450n854Q466m580o611K473K510J1284j022j7804j1950J3304J2553
16168b884M825p340J3091M640j192j2944o213O533l041l746j0847p354p194r50
16154c4616o3J367J4111P063l259m075q453r01k866R914L840Q233o949n218L447
16139a8425l757r488Q519J3872o66j2900l463N896J2417L899j4164P76R147O49
$$ y = [-6117, -7044, -9273, -10647, -5726, -10610, -11267, -7724, -8675, -8985, -3082, -2365, 5850, -2140, -10243, -6667, -3091, -2381, -9614, -11502, -11448, -18665, -15778, -28187, -30163, -9825, -1543, 2516, -13490, -6727, -1871, -14937, -14169, -3517, -8794, -14605, -20587, -32692, -28603, -31655, -35615, -25303, -2875, -4476, -4353, 2893, 8800, 5637, 5594, 1980, -1852, -6771, -6240, -13627, -15858, -23096, -29137, -34748, -29251, -12583, -4221, 2797, -5653, -11507, -3041, -7621, -14232, -11759, -9249, 2035, 1013, -16791, -28741, -15437, -2884, 1941, -5399, 7692, 12332, 11140, -1804, -8017, -1484, -4525, -8271, -19118, -26472, -33666, -34616, -34679, -33312, -19201, -12138, -15397, -19472, -27925, -28826, -31692, -21778, -17938, -9705, -16654, -21872, -18425, -22182, -31670, -23151, -9279, -9945, -22845, -26308, -20412, -7995, -4096, -18260, -17484, -8337, -7688]
16125g688J979R134r24q105R16k11L0L463K777q909l202n835P563r02K48m779
16109a4445K38Q404O010j390k09j994o234M048l806p241l006J1254N960J119n051
16094f343l089j1023j1154m117q366j238Q594O253Q599M383o416l199k715J0453
16080a9378L613m447k882l161Q179M319n317p046m834j442j734R55J7273J0970
16066d932m621j841l130r808M8l191l71J7871M280M39M093j5144j6501j656J6459
16051a8005m37L93R469k28m795O771m789K546N240L382p310l274m924Q264N902
16036a795p848l397R116k121N514L052o380k402R756J0043j1066l375o28L30m20
16021a621j1439l188j369q046L362m586L349J393n813l44J4283Q41p20L35K226
$$ y = [-7688, -5709, 3425, 2501, -5604, -4688, -4899, -4869, -1406, 1371, -7538, -10740, -16575, -9012, -9914, -9666, -14445, -14207, -5803, 207, -1183, -1392, -3386, -9620, -5572, -9378, -16619, -19625, -8371, -2411, -1292, -6343, -9432, -20455, -31609, -35726, -44092, -45330, -36736, -30483, -21884, -17501, -23917, -27116, -29831, -19378, -15765, -20212, -23094, -26255, -18076, -13757, -19074, -26120, -30954, -32396, -34130, -33175, -15902, -4932, -9553, -11394, -14524, -24332, -24284, -27475, -27846, -9975, -5695, -5256, -1163, -16307, -32808, -34464, -18005, -18442, -18049, -8580, -8808, -13603, -6832, -11621, -9075, -3835, -453, -7763, -11037, -15961, -7697, -1795, -9643, -13040, -3924, -6045, -531, 2521, -3859, -6261, 3495, 13538, 2472, -903, -1531, -1201, -1621, -13060, -16248, -17617, -25663, -22301, -26887, -23538, -22145, -27958, -28302, -14019, -13178, -13898, -13563, -11337]
16006a1337Q329L090R71j3621m836J082O287M502L507j971J0773Q456n057k499
15992G676m214j7372k995R33N104P70P222j0677r623R121j88j455Q981n601m987
15977a7305J7930K625j2799K181J1970l690N469R366N723j2584q096R3m993k315
15963f425J271l51Q06j240P056r384l629J141m630O969J0947m016p52m738m737
15948a1712J028J468q838k76k963N69N377R37n095n440n981P298R393Q426L08
15933e501m955p629M074N064l16Q96J0537K225m978j564M36K495j3130j1090o130
15918b9566J0792J2077K196P6m11o5m777J898J5982j1806j9553O97K824J951Q082
15903i603K089k160M304J0105J0372j4125q151J3219j14n402P103N215K208o916
$$ y = [-11337, -3008, 82, 1053, -12568, -17404, -16322, -10035, -5533, -2026, -3997, 6776, 15232, 10175, 7676, 3462, -13910, -16905, -15972, -10868, -10098, -2876, -13553, -23176, -14055, -14243, -15698, -6717, -12318, -17305, 625, 3250, -9549, -7368, 4602, 912, 6381, 15747, 21470, 8886, 790, 883, -4110, -6425, -5154, -5505, -4699, -5939, 1117, -8267, -11896, -10755, -15385, -8416, 2531, -1485, -2237, -6975, -11712, -10684, -9216, -18054, -18330, -21293, -20724, -15347, -14410, -19505, -24945, -30926, -23628, -14235, -5809, -5501, -10456, -18085, -14011, -8947, -9263, -8367, 2170, 4395, -583, -2147, -1711, 784, -12346, -23436, -29566, -18774, -6697, -4501, -4425, -4836, -4901, -9678, -7780, 8202, -3604, -23157, -22460, -19636, -17685, -9603, -7514, -9674, -5370, 4735, 15107, 982, -7169, 6050, 5936, 534, 7637, 12852, 15060, 8144]
15889H144r132N377k967j7938l271J3843M755p174m826L384L28Q767R061o468
15875A883k529o639J6176J0217r959o668k241j54O936o493J308j418j6160j053
15861a6794J2815P265j7722j3684J0499O587k634K691Q979J182m32l693r848N094
15847i695m645J836K826J3520j610j680k851j565j0294l494L651k09O731R470
15833A991j0391j108l119j381P195L478j4668R071M247m267J0384j2362O564J2881
15819H515j672j7487K484P151k728n049N091r45j4170O895J6395m524P11p495
15805f828K677Q874N181K905K167j7309p648J953q04k100P433L380J271j554j0655
15790a1057N139Q89j500O631O879n305M064Q83j1024q450p333J677l392j5358
$$ y = [8144, -988, 4389, 1422, -16516, -19787, -5944, -1189, -8363, -13189, -9805, -9477, -710, 8351, 1883, -646, -7285, 8891, 19108, 9149, 2481, 240, 86, 7022, 529, 1837, 419, -15741, -16794, -3979, 3286, -14436, -28120, -17621, -11034, -13668, -10977, -1998, -816, -1248, -4941, -14789, -9695, -14340, -12504, -9678, 3842, 2232, 552, -2299, -3864, -14158, -17652, -14001, -14210, -7479, 1991, -8400, -9508, -12627, -14008, -6813, -3335, -18003, -8932, -4685, -8952, 1432, -10930, -4366, 8515, 6843, -10644, -8160, -1009, -3737, -8786, -3695, -4640, -18810, -11915, 4480, -44, 667, -6828, -4151, 4723, 9904, 12809, 14976, -2333, -9981, -8028, -8832, -10932, -3499, -119, 1152, -402, -11057, -5918, -5029, -6529, 102, 6981, 1676, 5740, 6623, -4401, -12851, -20184, -18507, -21899, -37257]
15776c7257P337J8798K2688M170q370j2479p652k955J304k836m583p355k549J0991
15762b0748M049p826K368K265j643K625r61L013J51K417p343M249J748j2248M994
15747b2890m029L674J595k876R478R090j443l827J1677J0528n469N589J1138n955
15733A6280k1071j9734J1851J022m009J2766q719p88j488j492j805J1140M94M060
15719a493k518K127q412j0067M448J7013J1272j1982p330l595j2671j941P447
15706a7702Q956J2332J0k686Q25j1935j123k473N739j471j5877J0488k773q399
15692b6089k736r87P833j798M749M639R770K4L250k213k669o952M062j1774j2292
15677c3183J183Q167j990J292J1866K730J557r747q643J3928J5931k214o856M962
$$ y = [-37257, -29920, -11122, 11566, 15736, 7366, -5113, -12765, -15720, -14416, -17252, -21835, -29190, -31739, -20748, -16699, -24525, -22157, -19892, -21535, -18910, -19871, -16858, -16707, -14290, -21633, -17384, -15636, -27884, -22890, -26919, -23245, -21650, -24526, -15048, -5958, -7401, -11228, 449, 10977, 5508, 11097, 22235, 16280, -4791, -24525, -12674, -11652, -15661, -2895, -11614, -12402, -13890, -15382, -17187, -6047, -5553, -1493, -4011, -1884, -10296, -20363, -15915, 1098, 12370, 388, -6942, -10537, -23208, -25149, -17702, -8746, 3586, 3596, 910, 1735, -10200, -11323, -13796, -8057, -9528, -25405, -14917, -17690, -26089, -28825, -29812, -21979, -23777, -19028, -14389, -4619, -4595, -1345, -3558, -6227, -13179, -9117, -20891, -33183, -32000, -23833, -25823, -24531, -12665, -9935, -8378, -18125, -26768, -12840, 3091, 877, -5979, -1017]
15663a017n805J0423J4093j767n595p109m188j1384r303L298J0476J141l400l013
15649a3150Q521K803K123q142l613J219J4492p827k189J7149l417j1956L023O022
15635E058n13m159n988M430J793o669r013O434M691l201l262p849N432K2343R578
15620A9105J17j7272m827M590j4207n749R257J1996J587n020j1305n356Q247N870
15606b967l599j4016O246J9255j811O477O578q653r081j296j673o14o215p326
15592a8695R003l024j1231N838J0258R079R730l486j6402o021M65N151k638M736
15578g237P680l031O144P067N203J421J6514L8575K6171k3354l0023n823r526
15565B9781r939j539M05q07m618n087N922Q172l558j0476Q32J784o661m339J894
$$ y = [-1017, -6822, 3601, 17694, 15927, 10332, 3223, -965, -12349, -21652, -18354, -7878, -6737, -10137, -13150, -4629, -1826, 297, -7845, -11458, -10239, 4253, -3574, -5763, 11386, 7969, -3987, -964, 5058, 4545, 386, -5602, -1172, 621, -6048, -15061, -8627, -3936, -7137, -10399, -18248, -12816, 9527, 19105, 19222, 1950, -2877, 1713, -12494, -18243, -8986, 3010, 4597, -423, -11728, -17084, -8837, -2967, -6566, -20582, -14336, 4919, 3108, 9585, 16163, 7510, -1571, -2867, -4540, -5154, -11369, -18695, -9692, -12716, -23947, -18109, -7851, 1228, 10958, 7472, -8930, -14951, -14486, -9335, -11973, -7237, 443, -2588, 3556, 10623, 15826, 17247, 33761, 72336, 98507, 75153, 45130, 39307, 29781, 19842, 18303, 18708, 17901, 13283, 8196, 14118, 22290, 18732, 8256, 9088, 10872, 4211, -128, 1766]
15550A766J814J973q0M885R170J2191n757l401m26M90o378r709o736j2900j271
15535a4369N522J0841P467q694L715R542K433j374p30j920J326P753j4595p778
15521h61K727K54K719L213k279P59k995Q491j00j5953o879k113P811O907o955
15506e254j070l774r183p554p05Q063q41K582J1969P184J3695j2351m930l262
15492e431k815j537L072K204j2421j1699N939J2400n104m963N215j329k485r650
15478b8604j569J2126K80M754P721P224n558K476k730r029j079K022P016J0720
15464E770K116j0809r643L999m990K618J895L298O650Q273o483q394J30J4717
15450I147l473j2859l747J730R436P599l451N147l80O222m188r196o975o547N041
$$ y = [1766, 3580, 5553, 5473, 10358, 19528, 31719, 25962, 22561, 22135, 22625, 16247, 6538, -198, -13098, -14369, -8847, 1994, 9461, 767, 4482, 14024, 16457, 15083, 14353, 12433, 13759, 21512, 6917, -861, 1866, 2120, 4839, 8052, 5773, 6532, 3537, 12028, 11928, -4025, -10904, -13017, -5206, 1701, -5254, -6324, -10098, -19281, -26835, -27540, -19477, -20318, -17736, -5767, 1417, 15112, 2761, -2169, -5431, -8246, -9783, -6711, -4507, -16928, -28627, -22688, -10288, -15392, -20355, -15140, -16469, -18954, -28604, -30173, -18047, -17767, -13013, -5292, 1932, -3626, -1150, -3880, -12909, -13988, -11966, -4950, 5770, 7886, -2923, -12566, -8567, -13557, -10939, -9044, -5746, 904, 9177, 2694, -5700, -5570, 9147, 5674, -7185, -10932, -9202, 234, 7833, 4382, 9529, 9149, 15371, 11183, 1987, -4988, -11535, -6494]
15435f494O477Q69Q356O700p378J445l209k1j0128l102L332N666J951j1168o313
15420a3017K975O679l248j1185l343k713J1110Q67J3406K610p929j3043j147J3694
15406d284M148q819K37K893L293O93q451n802R345j529J3578M158j0190J253J2853
15391A3376j1417n28Q624m39L773k939l772p399J044n869k491k58J182J0952m382
15376e43K333j139q493o919J913Q128l784l546K475q26p48j039O273Q503m35L955
15360F108j0218r453L012R205O261q902j9682J28J2690o013j5434J084J4386J8440
15346A612k470L130j6804r526N007L62j318k390J3237P949o615r069J414M500
15332a0981l433N376J1764K835r283K952k871j879O352J100m817J898l006m365
$$ y = [-6494, -17, 852, 9208, 15908, 8530, 9975, 6766, 6745, -3383, -6485, -3153, 2513, 4464, -6704, -13017, -10042, -3363, -6611, -17796, -21139, -23852, -12742, -11875, 1531, 4141, -3788, -16831, -17978, -4284, -136, -8955, -8718, -5825, -2532, -1839, -10290, -16092, -6747, -8276, 5302, 9460, -730, 523, 13376, 1959, 1431, 10055, 9616, 13389, 10450, 6678, -721, 323, -5546, -8037, -8295, -7113, 3839, -543, 1790, 651, -7842, -14761, -12848, -4720, -8504, -12050, -9575, -10401, -11149, -12188, -5915, 2588, 2153, 6108, -4110, -13563, -10551, -1346, 4915, -3987, -23669, -23541, -10851, -16864, -32298, -31214, -16828, 1612, -858, 2272, -14532, -24058, -19051, -18689, -20007, -22397, -9160, -1211, -7826, -16895, -15481, -10981, -14414, -9038, 2726, 5561, -3722, -770, -3641, -5520, 832, 1932, -2885, -987, -3993, -8358]
15318h358L623Q271K87j852n720q929R279J296O659J0801L51p340j2010j2104
15304a5746p286O919J1691Q960j3263k205K273J6762R944m631j5988p360J1787
15291A857R624q37p466n528j904Q296j0988q634J5462j101j7348J1182K1061n797
15277G879M110j0380L037n6j694R86N57n786Q900J729J045N759q790q931M694
15262C059N465j911l293p307r545r330J560J076J1204N940N695o78j0407J262
15248g210k869j1832O926J784L27K238n48j0252k222J4539P596o70K470j274J302
15233C05Q828Q860k517m360j0745M903K887k401j940K37j1531j2889j107j392
15219b2862K760N838k683L737M802O362L268M018j2645o929L088L128J2594L668
$$ y = [-8358, -4735, 3536, 3823, 1971, -3749, -12678, -3399, -2103, 4556, 15357, 15708, 8368, -3642, -15746, -23032, -16113, -4422, 4538, -8725, -10930, -8657, 8105, 18049, 13418, -2570, -9930, 1857, 11481, 10644, 3178, -2350, -4254, 4042, -6946, -15580, -118, -1219, -18567, -7385, 13676, 7879, 11989, 1609, 4646, 4590, 2896, 3882, 4439, -1347, 7553, 9282, 10327, 16086, 7296, -1635, 3059, 8524, 6613, 3320, -3987, -13532, -22862, -21302, -20226, -9022, -3082, 2613, 1935, -8472, -7210, -10079, -21911, -14985, -13201, -12874, -10636, -11184, -21436, -23658, -9119, -1523, -2193, 277, -997, 305, 9133, 17993, 15476, 11116, 371, 5274, 8161, 5760, 3820, 4057, -7474, -20363, -21470, -22862, -20102, -14264, -16947, -13210, -8408, -2046, 1222, 5240, -7405, -14334, -11246, -8118, 4476, 8144]
15205H144J536j487o39M793j129R413q162o908O852j618J288k314m420r354q108
15190a2113KJ1394j055J1l377q771p42L896M427Q583r641o136J3621m284L977
15175b08N575r116j073m725k579j1768p394j924M351J4114K1103J758p090l836
15161b812N358q550q364J97J2285P762O348m349n253k322l507q379M674J1667
15147D755J5672j1959j4338J0507Q210n553j6688m143J6786J8853J8558J279n157
15134C6782r440j0943Q584K835l138j8664j2135j028N834J2051j791j1039l122
15121e214l553K679j645j489N323J9000L298j0836n97j478r946Q074J5M53M048
15106H132r653K491j111LO272R785l865r768O19N529Q847R452P23o712n969l389
$$ y = [8144, 9680, 8193, 7554, 12347, 11218, 20631, 12469, 5561, 12413, 10795, 12083, 9769, 5349, -4005, -12113, -12111, -717, -1772, -1761, -5138, -13909, -14651, -10755, -6328, 2255, -7386, -13522, 99, -4185, -208, 5367, -3749, -4822, -9547, -12126, -23894, -31288, -33212, -28861, -14747, 6356, 8114, 1024, -2812, 2546, -6004, -14368, -14171, -1886, 5876, 12224, 7875, 2622, 300, -3207, -11586, -6912, 4755, 20427, 8468, -5870, 4637, 12847, 7294, -9394, -13537, 3249, 22102, 40660, 41939, 36782, 27342, 16399, 24983, 27818, 24680, 6016, -6119, -7147, -1313, 10738, 8947, -2092, -5214, -8767, -6088, -7733, -9222, -3899, 15101, 18399, 7563, 6966, 5488, -4458, 3616, 3631, 4084, 8132, -1521, 970, -141, -138, 6134, 15919, 12054, 2286, 2905, 8434, 17281, 26733, 27456, 20744, 14775, 11386]
15090A1386k990R27l471j694R070P020j586J714p410j0085L89J4529J200l682
15076A5317j6655O874M044j643M861N534l492O92q244j3253J0182Q792L585l821
15062A2773m939J0587L318l92j4706K98J1393J3236K837M375M859N299L726K689
15048E5353j586r033J2526K989j2869K282Q921J5939K512j1807L01J4431K1436
15035A01395K3503K1238J5262M406M930O369K6800K6853K4664K7161L8866M9644
15023C71091P8985J05840J53701K19866L00377M39975O71918J134014K083456
15014E559223L830964M598493Q669l642201l717522k277580j245593p43008m75348
15005A896097l22316k34040j75681j43211j00749p6870m9479n3832n9043m3697
$$ y = [11386, 8396, 9323, 5852, 4158, 13228, 20248, 18662, 20376, 12966, 2881, 3270, 17799, 18999, 15317, -1338, 5536, 9580, 7937, 12798, 18332, 14840, 15532, 7288, -5965, 4217, 13009, 16594, 12773, 7834, 18421, 21739, 21347, 6641, 6939, 18332, 31568, 34405, 38780, 43639, 48938, 52664, 55353, 53767, 44734, 57260, 60249, 47380, 49662, 58583, 74522, 77034, 65227, 65528, 79959, 101395, 124898, 146136, 161398, 165804, 170734, 177103, 203903, 230756, 255420, 282581, 321447, 371091, 450076, 555916, 709617, 929483, 1229860, 1669835, 2341753, 3475767, 5559223, 9390187, 13988680, 13997349, 10355148, 6637626, 4360046, 3114453, 2371445, 1896097, 1573781, 1339741, 1164060, 1020849, 920100, 843230, 793751, 739919, 680876, 637179]
14995F37179l1984l2273k6764j494O436J867K0388K3403j1691m1442n2788l0446
14983D60391k0407k6170m4558l4312l7869k7190j6939l0115j4825m29j8488j3774
14971A75315N323N25j2702r285r594k3558j1513j976r576l170k936n014j0401
14958H1438p110l937N682M765k967k181m420j584j0812j0581p095m248k919K664
14944C6695K668L838o350k369N129q117r764k271p76q191k097J342O359P433j2527
14929A1002r630R078J199M408J3509j178n979j6941j0709l670J783L887k660n384
14915a1285p565p660O591J1533q160r907j470J1941M985n32J4701J7728j305j3924
14901E671j737N173n529q086k424N897J4721J4856p16j0907l610q475j8231p847
$$ y = [637179, 605195, 572922, 546158, 544664, 551100, 552967, 573355, 596758, 585067, 543625, 490837, 460391, 439984, 413814, 369256, 334944, 297075, 269885, 252946, 222831, 208006, 207577, 189089, 175315, 180638, 181163, 168461, 159176, 149582, 126024, 114511, 112535, 102959, 99789, 96853, 91839, 81438, 74328, 70391, 76073, 80838, 77871, 75690, 71270, 69686, 58874, 48293, 41198, 36950, 34031, 36695, 39363, 43201, 36851, 34482, 39611, 31494, 21730, 19459, 18683, 10492, 8395, 9737, 16096, 23529, 11002, 1372, 10450, 11649, 16057, 29566, 28388, 22409, 5468, -5241, -8911, -7128, -3241, -5901, -11285, -18850, -26510, -19919, -8386, -16546, -26453, -27923, -15982, -10997, -11529, 3172, 20900, 19595, 5671, 3934, 9107, 3578, -4508, -6932, -1035, 13686, 28542, 27826, 16919, 13309, 4834, -13397, -21244]
14887b1244n218p690J309K8975J9308m307n30L399n179q293j0718K30M021J3216
14873G279k529N09M5o15O165p063R59J386K520j128k936m81R353j811m434k004
14857E215N956m677p103k076O939k635O688P964K948n59l102p543m731p68K173
14842D689n133N012J877m440N138J620o699k010n355M230l893M946N608R749k88
14827A5051J653N758j805j6710j4041L277J1149R975o974o904j075j776p179O712
14813b889P257l345J6268K0425Q43r564j6261j0948m846J1046K259j314M921J0260
14799B4112j4650k6184j4293L466o916J0581J5186O100M805P921L441K998k466
14786A4101N705K0934K2501J4744p05k6070k1947r238k5397j5582N923R891J1434
$$ y = [-21244, -26462, -34152, -32843, -3868, 15440, 11133, 10603, 14002, 8823, 530, -10188, -9958, -5937, 7279, 4750, 5259, 5304, 4689, 10854, 3791, 4750, 6136, 8656, 7528, 4592, 4111, 13464, 11653, 7219, 5215, 11171, 6494, -609, -2685, 4254, 1619, 8307, 16271, 19219, 18660, 15558, 8015, 3284, 2516, 4689, -444, 4568, 6445, 2005, 7143, 8763, 2064, 54, -5301, -1071, -4964, -18, 5590, 15339, 15051, 16704, 22462, 20657, 3947, -10094, -6817, 4332, 14307, 7333, 429, -646, -2422, -9601, -2889, 4368, 1023, 17291, 37716, 38559, 28995, 12734, 1786, -3060, 7986, 10245, 8931, 13852, 24112, 9462, -16722, -31015, -27549, -34465, -23884, -8698, -2598, 2207, 10128, 13569, 16567, 14101, 19806, 40740, 63241, 77985, 77280, 51210, 29263, 20025, -5372, -20954, -15031, -5140, 6294]
14773F294j621j583j6929l959o249Q49L180K247J5194J4296q486j4536L508K512
14759e283m159k418J6528l058l733p527j390j500J588l281L049n69k203M516P130
14744b310J038K320N557k998k756l972q566O729k447k633M238J3348k226l593
14730A729m454M751j7697r418M726m225M295P363O756p45j3040k226M608P255
14716a0322l193J823K047o293m34k75J3455L07L016M182j1389j243n480n136l903
14701b2838J0619O970l060J2180J4034L910j267q296k825J3105K309j3232j0994
14688F15j644rj3609j340J225N223j2573p374K0706J1759Q444r00m969j4499m67
14673i412m087n7J7580P820J409o014J322o919n455N668L138m459J64o481J886
$$ y = [6294, 4673, 3090, -13839, -17798, -24047, -23198, -20018, -17771, -2577, 11719, 3233, -11303, -7795, -5283, -9442, -11860, 4668, 1610, -2123, -9650, -11040, -12540, -10952, -14233, -11184, -11753, -13956, -9440, -2310, -1272, 1048, 6605, 3607, 851, -3121, -11687, -4958, -7405, -10038, -5800, 7548, 5322, 1729, -2725, 2026, -15671, -25089, -20363, -24588, -20293, -12930, -6174, -6919, -19959, -22185, -17577, -10322, -13515, -11692, -9645, -15938, -16372, -16647, -3192, -2885, 131, 4313, -7076, -8319, -13799, -18935, -22838, -12219, -5249, -8309, 3871, 17905, 21815, 20548, 12252, 9427, 22532, 24841, 11609, 615, -1029, -1038, -14647, -15987, -14762, -9539, -22112, -29486, -8780, 2979, 11423, 10523, 5554, -8945, -9412, -13499, -13556, 4024, 11844, 13253, 7239, 8561, 1642, -3813, 1855, 4993, 534, 698, -5783, -3897]
14658c897p39j0585K706L684n297l159o295J4581Q151K425M289l733J380N863
14644I374p531j1451m338J41k259P70M800p461o073M389n251n040M576Q717L886
14629a2751j827O399J4451k817k846M08P318P248r763J024J1278o793j3214q311
14615a0196j846O643J476j965N666J2286J118J289o555j0161J981N680m675M021
14601D762R202l965r739j1350k424R200J2137Q70P434R051P600Q11r780j2397
14587A1412r880K645L843j2607q043J3809J2836K75j6864k53Q903J3474k964j4398
14573B188P08K436J2204n21j7021p928J69Q600j3019k731K7442J2052L019j38
14559B7460k1662n064K143j0212K784j320l596K921J610J954M840P718j659K812
$$ y = [-3897, -4636, -15221, -12515, -8831, -14128, -17287, -23582, -9001, -850, 1575, 5864, 2131, 3511, 9374, 1843, -9608, -13946, -13805, -16064, -15294, -10494, -17955, -24028, -19639, -24890, -29930, -25354, -16637, -12751, -14578, -8179, 6272, 3455, 609, 1017, 8335, 15583, 5820, 6844, 18122, 11329, -1885, -10196, -12042, -5399, -3923, -5888, -222, 12064, 13182, 14471, 7916, -2245, -264, 5416, 741, 4762, 13964, 9999, 260, -11090, -13514, -4314, 7823, 8693, 16127, 25178, 32778, 33589, 23809, 11412, 1532, 4177, 8020, -4587, -12630, 1179, 14015, 14290, -2574, -2827, 6076, 19550, 16586, 2188, 2896, 5332, 17536, 17015, -6, -7934, -7765, 835, -12184, -14915, 12527, 24579, 27598, 27460, 5798, 734, 2877, -7335, -4551, -5871, -9467, -6546, -4936, -2982, 1858, 9576, 7917, 10729]
14545A0729j102r992p560l348l109M737M006j484o839J274J826O792j189n59N657
14530a61o087o570O10N653r199l422R081j0514K449P340J1715J237m670o676k113
14515a1327o932K993j151K013J0112J5339O61K045j0671R68m426q513J708J414
14501e767m631J57O359M958k726P280n369L044j321J554J61p25o174j1416L560
14486a1056R95J0673j933J793N517j2828J204l32j1561j479M932M904K1011N104
14472A6944q783q201p385L48M632L740O069L839O779l016p500K886Q1m206k977
14457C250j2037q798K891K864o82Q118J8341J5704O960N982K9157K4429j5492
14444H0687k9657k4660q328m941L196P032r072l216r669m728O728m016K404n521
$$ y = [10729, 9627, -365, -7925, -11273, -14382, -9645, -5639, -7123, -13962, -12688, -10862, -4070, -5259, -5818, -161, -6248, -12818, -12208, -6555, -15754, -19176, -10095, -20609, -18160, -10820, 895, 2132, -2538, -9214, -11327, -18259, -15266, -16417, -14404, -4292, 11047, 11708, 13753, 3082, 4050, -376, -8889, -7181, -5767, -10398, -10241, -3882, 1076, -1650, 5630, 261, 3305, 1984, 3538, 3699, 2974, -3200, -14616, -11056, -10061, 612, -1321, 472, 5989, -6839, -5635, -5967, -17528, -19007, -14075, -9171, 11840, 16944, 8161, -40, -7425, -7077, -2445, 1295, 7364, 11203, 17982, 14966, 7466, 10352, 10433, 6227, 3250, -8787, -17585, -14694, -11830, -12512, -4394, 13947, 29651, 36611, 42593, 71750, 96179, 80687, 51030, 26370, 18042, 13101, 16297, 23329, 14257, 11041, 1372, -3356, 3372, -644, 1760, -3761]
14430c761l156P318N393P122l24o921J3237L621q122q018p311n85k700n464R693
14415B2N507p06n76N527p778n758o445p521R162R607j168J2308J943k614m209
14400G301n793M65j952M834n104n756l849r165P974R794q28R881R344n021j3830
14385a705M91j000q125K793p10r551J570O931p075R132J1888j258m432Q743J1986
14370A9678o076r611O87j0703M319j572m140M425J758J2717n599p238M20R738
14356H803o722J494J748K454L122k129R220M62j1357r790p825N92N221R30l050
14341f827j427m165R904J2053k666j6695J56J2037R245l841j1447J69k01L888
14327A83J6096k021j4006J189N229R752r991j313j576l204l20K239p491p430o784
$$ y = [-3761, -6917, 401, 5794, 12916, 12592, 5671, 18908, 22529, 14407, 6389, -922, -1507, -4207, -9671, 22, 5529, 4823, 4247, 9774, 1996, -3762, -10207, -17728, -8566, 1041, -127, 12181, 14124, 11510, 7301, 1508, 1973, 21, 4855, -249, -6005, -9854, -19019, -11045, -1251, -2079, 7802, 17146, 12125, -1705, -1214, -2214, -10339, -7546, -8256, -17807, -16237, -9306, -16381, -7249, 4639, 3381, -1051, 7692, 19678, 13602, 3991, 4678, -6025, -1706, -3278, -7418, -2993, -1235, 11482, 5883, -1355, -935, 8803, 2081, 3575, 5323, 7777, 10899, 8770, 17990, 18452, 7095, -2695, -10520, -9928, -4707, -3777, -6827, -8254, -12419, -2515, 9538, 6872, -9823, -9667, 2370, 11615, 7774, -3673, -3504, -3705, 183, 16279, 14258, 252, 1441, 6670, 16422, 6431, 5118, 3542, 338, 18, 2257, -5234, -12664, -19448]
14312a9448m274M502M489N899J3420L219R067O547j0465j2509n358l853J878J0716
14298C830p401m970o067p468o624K300K4824Q828J990m475n317N076k476j891
14284A59P232O48j0258q53P157K333r656j1357q791J6j370N982L037N870K551
14269g300P146j146m902O505N791r786n772k550M779N880p41L499N633l586j1176
14254g726k832j41m992J62J43o5k221O215J33N060j533k384M719J1731J002J329
14238H600l93J736p018J1960j231q346P063m639K916k592r440q857K386N448J1028
14223H621M035q032l756O13o520P931p68Q645M376j0270q88R044n090j4314M955
14208a418J1902o533p847l673o503K687O702K48j1002j5447P634k429Q520J106
$$ y = [-19448, -23722, -19220, -14731, -8832, 4588, 7807, 16874, 23421, 12956, 447, -4911, -8764, -6886, 3830, -3571, -8541, -14608, -22076, -28700, -26400, -1576, 7252, 9242, 4767, -550, 4526, 2050, 159, 7391, 8039, -2219, -3072, 4085, 6418, -3238, -14595, -23386, -23370, -24740, -18758, -15721, -9851, -7300, -154, -1300, -6202, 303, 6094, -3692, -9464, -12014, -7235, -1355, -2096, 1403, 7036, 3450, -7726, -10558, -10699, -15691, -15529, -15386, -15451, -17672, -11457, -11324, -6264, -7797, -10181, -5462, 6269, 7271, 8600, 8207, 9943, 2925, 14885, 13654, 5308, 12371, 7732, 10648, 8056, -1384, -10241, -7855, -2407, 8621, 12656, 4624, 868, 1481, -5039, 2892, 2124, 10769, 15145, 4875, 3987, 13031, 7941, -6373, -1418, 10484, 3951, -3896, -7569, -14072, -11385, -4683, -4435, -15437, -30884, -23250, -25679, -17159, -16053]
14194a6053j116K562P328N713M178Q4n584O136n014m697J2366J900k341r705M971
14179G28J7476o493k0532p28Q230J0412j963m96O365l663M606J782r223j6418
14165i917j7545M76k364J172O693l449K0905J0972J454L00k662J536N07q171j268
14150a361J8710L787j7480m587M349j645o256J323J1782j748m851p164j0508P395
14136h254p25j557m496j491j99J2388J2396J5160P70q850q438l212r510k670j765
14121a0453k439J6295J918M509l151j3804j3492k042K662K1646M146n862j5061
14108a5128N180J1842K719l191q821P108R400q847o360p463L597N011o164M949
14094f168n98q923l099J717K319J3733N04p788L875O230O25J1796N085o041j1591
$$ y = [-16053, -17169, -14607, -7279, -1566, 2612, 2696, -2888, 3248, -1766, -6463, 5903, 7803, 5462, -4243, 728, 18204, 11711, -8821, -9549, -1319, 9093, 7130, 6634, 12999, 9336, 13942, 15724, 6501, -9917, -27462, -26986, -29350, -28178, -21485, -24934, -4029, 6943, 8397, 8697, 6035, 7571, 8078, -93, -1361, 17349, 21136, 3656, -931, 3418, 1773, -4483, -3160, 8622, 6874, 2023, -5141, -15649, -8254, -8979, -10536, -15032, -16523, -16722, -4334, 8062, 23222, 23992, 15142, 6704, 3492, -6018, -8688, -10453, -12892, 3403, 5321, 9830, 6679, -7125, -20617, -22659, -19997, 1649, 5795, -67, -15128, -9948, 1894, 4613, 1422, -7399, -291, 9109, 262, -6098, -13561, -9964, -4953, -11117, -6168, -6766, -15689, -18788, -17071, -14752, -1019, -515, -8303, -4428, 1802, 2427, 14223, 19308, 13267, 1676]
14079A676r005J3412J278m066N72J232j361L056o34J2271J5409J716j0219q664
14065A6673r085p344p552K26N869L683q390J554J0822l120r334k182N17L464r518
14050a3717k754J780l70L883m835M312m515k803n78o00J5752Q749L150L151N055
14035A5660o219j801J741l616M893P331O136l299N132J578l6j0250j208k882k540
14020A0620J934L022R546J6618J5509K1920J325P897J3712Q957J0658M352m612
14007A21458R181Q110N235r19J2835M211m05K449Pn427l230j519K137L976j594
13992A56505K223n171K748N327J467J53l71j82J1312J0223L208q32q637R998m987
13977A82984J955P178J1698j0740j5859m286j3830j6969L168l933j3358j8385
$$ y = [1676, -7329, 6083, 7361, 3295, 3867, 5099, 3738, 6794, 6160, 18431, 33840, 35556, 25337, 16673, 7588, 244, -7308, -7082, -1213, 2470, -5920, -4366, 6456, 3336, -5998, -8180, -7663, -4199, -13717, -16471, -14691, -15061, -11178, -16013, -11701, -16216, -19019, -19597, -20197, -4445, 4304, 7454, 10605, 15660, 9441, 7640, 9381, 5765, 10658, 17989, 24125, 20826, 25958, 27536, 27500, 17250, 16042, 13160, 10620, 12554, 15576, 25122, 41740, 57249, 79169, 80494, 88391, 102103, 111060, 121718, 126070, 121458, 130639, 138749, 143984, 143065, 155900, 160111, 159706, 162155, 162162, 156735, 153505, 151986, 154123, 158099, 156505, 158728, 153557, 156305, 161632, 163099, 163252, 162881, 162699, 174011, 184234, 187442, 186610, 177973, 187971, 182984, 184939, 192117, 203815, 193075, 177216, 172930, 159100, 142131, 145299, 141366, 128008, 109623]
13965A09623m433p565j481r807j4994j0092o059q70l177l503m215j6898l484R72
13951B4017q061K775P480L580j0186J4773J0065j0166j913Q71r514j1788q841
13938C092k227j726l015M572J5535l087r356Q815k976n281n630l813P603J7217
13924A9723j232r990l164N783O019J838l807q044J510l227J996j489M124m313
13910E727o544O183J186j037j5989k749J0554m731l240N794J4052j602k68L264
13896A0600j6375q198J496j358L00J0557n77j2601l03L913m733n424R349J3933
13882E79P114P768P914r667M438K230O89O316j079k1640j1677K630j837m441j529
13867a2192J1807P391J156n914n17J2878m749m32q459q534l604K054N468K928
$$ y = [109623, 105190, 97625, 96144, 86337, 71343, 61251, 55192, 54322, 51145, 47642, 43427, 26529, 23045, 24017, 15956, 18731, 26211, 29791, 19605, 34378, 44443, 34277, 32364, 33235, 23721, 11933, 3092, 865, -861, -3876, 696, 16231, 13144, 3788, 12603, 9627, 4346, -1284, -5097, 2506, 19723, 18491, 8501, 5337, 11120, 17139, 18977, 15170, 7126, 8636, 5409, 7405, 5916, 10040, 5727, -817, 5366, 6552, 5515, -10474, -13223, -2669, -7400, -10640, -4846, 9206, 7604, 7336, 10600, -5775, -13973, -12477, -13835, -13535, -2978, -3555, -16156, -16459, -12546, -17279, -22703, -13354, 579, 7693, 15461, 23375, 13708, 18146, 20376, 21065, 27381, 26302, 4662, -7015, -4385, -6222, -10663, -12192, -385, 7006, 8162, 2248, 1731, 14609, 9860, 9428, 969, -7565, -11169, -9115, -3647, -719]
13853g19j5868p823O040L3l343n338K387P79l02M076J574p082N40J332K670J696
13837a9348L156R676L821K497j1015k142q46J8074m052n39q477n933n156J450
13823a8834k424M006L346O069L292l093l759o33Q044m395q42J67O597J1124l979
13808D686j0436J0323J0927r913k668Q55K208j18J878m887r975Q676P125j2655
13794c974l485k459O452K486J598j8634r011J4971K903k968J326R568L238q081
13780f070j3276J7098R195j1367l439J6268Q678Q04j9193q103N847J4916l988
13767G370n734N028o86k752k406K745p773J450l120m389j895P145O800n844r426
13752a3487r723J131Q927j466o309k417J0688J0243J0859r256p262K150O521K519
$$ y = [-719, -16587, -24410, -18370, -18337, -21680, -27018, -24631, -23852, -24154, -20078, -18504, -25586, -25046, -23714, -21044, -19348, -16192, -6516, -2695, -198, -11213, -13355, -14201, 3873, -179, -718, -9195, -15128, -20284, -18834, -21258, -17252, -13906, -7837, -4545, -7638, -11397, -12030, -3986, -8381, -9223, -9056, -2459, 8665, 4686, -5750, 4573, 15500, 5587, 2919, 3774, 5982, 5864, 7742, 2855, -7120, 1556, 8681, -3974, -7459, -9918, -3466, -980, 618, -18016, -27027, -12056, -9153, -12121, -10795, -1227, 2011, -6070, -19346, -2248, 6947, -4420, -7859, 8409, 17087, 17891, -1302, -9405, -3558, 11358, 7370, 1636, 6664, 5978, 3226, 820, 3565, -4208, -2758, -5878, -10267, -12162, -5017, 1783, -4061, -13487, -23210, -22079, -13152, -14618, -20927, -23344, -12656, -2413, 8446, -810, -8072, -5922, 599, 3118]
13738C118k332j4581K060N17n409P58L093J2716l25l560Q237O90J0152n177p636
13723B321j2687J0430O489Q004K149q793r088j608K902K448K05l164n410L207
13709b595j2002k187O072L313O366Q384m407n046m592j300j268N043J6545J8108
13695C0434l253n097J1546m676k0841p541L909K791k252r000J734K642K390N412
13681H198j32m019j995l866o747L631j777K142P415m530n164O619m522j3706k068
13666b0521Q044P993L484p517m757k991O485R516L87o662O378L427r347k575J051
13651g605O354K928j933J461P799m062l990j376M77L550j062j0467q473N642J0228
13636e29P149K92L651K235K524k663p13l302K685J0521k091k0191j0035j0103
$$ y = [3118, 786, -13795, -11735, -11218, -16627, -15869, -12776, -60, -385, -3945, 4292, 4982, 15134, 9957, 2321, -10366, 64, 6553, 14557, 16706, 7913, -1175, -2783, 119, 2567, 2772, -392, -5802, -2595, -14597, -16784, -10712, -7399, -1033, 7351, 2944, -2102, -6694, -7994, -9262, -4219, 12326, 30434, 27181, 22084, 33630, 28954, 8113, 572, 4481, 7272, 5020, -3980, -2246, 396, 2786, 8198, 8066, 4047, 2052, -1814, -8561, -4930, -6707, -4565, 2850, -1680, -6844, -225, -4747, -18453, -20521, -12477, -4484, -1000, -8517, -13274, -16265, -9780, -264, 123, -6539, -161, 3266, -6081, -8656, -7605, -1251, 1677, -256, 1205, 9004, 4942, 952, -424, 53, 3603, 2541, -7926, -16399, -10757, -529, 6620, 6912, 10563, 12798, 15322, 12659, 11946, 8644, 11329, 21850, 19759, -432, -10467, -20570]
13622b0570J8225Q900m811k336M699r653K450J467P486J1375p059o834K999j687
13608D651J00O423q5p959k1537k588N692O470J0813N386p54M091n861j4029q343
13593a7530o560l375J6945L328m813K26j0181R27J1565N778r577k27P487P795
13579A788P094M594o932n305j2200M150J244M886J589l959Q622k708K53j6451
13565a3335r060M083J1342j617P706J2530o156J391p68k747j1792O40K122J641
13551d020J2953O595k988m785J076M070r491o787p754p007J415q585K274J7402
13537e632P701J674M102K805J884l821j1674j3254L198o672j609k549J358L205
13523a9284J0152N574J636K768l624r650q419K056J1430Q583l420M198Q596R073
$$ y = [-20570, -2345, 6555, 1744, -592, 4107, -5546, -3096, -1629, 5857, 17232, 10173, 3339, 6338, 4651, 4751, 11174, 11089, 3130, -18407, -20995, -15303, -8833, 1980, 7366, 6612, 10703, 4842, -9187, -17530, -24090, -27465, -10520, -7192, -12005, -11779, -21960, -21033, -9468, -3690, -13267, -13494, -6007, 1788, 8882, 13476, 6544, 1239, -10961, -6811, -5567, -681, 908, -3051, 5571, 2863, 3116, -13335, -22395, -18312, -6970, -8587, -881, 11649, 5493, 6884, 6116, 3369, -8423, -7783, -5661, -4020, 8933, 15528, 12540, 7755, 8831, 12901, 3410, -3377, -11131, -18138, -16723, -25308, -23034, -5632, 2069, 3743, 7845, 10650, 12534, 8713, -2961, -16215, -13017, -19689, -21298, -23847, -22489, -19284, -9132, -3558, -1922, 846, -2778, -12428, -20847, -18791, -7361, 1222, -2198, 2000, 10596, 19669]
13509A9669R99k075r943j2006j1113n34L988M147m95J362P077r125J3693J1727
13495A7371j8657j6138O506J1474L581O580j287o198j4395J291j818Q851K421
13482d18L990K249j5068k174P583k527o999O555m18j3500l053J6960O496l812
13468d136J705j2946O172P645o706K262m839O98J189l791P907Q778K807J470J439
13453I654q869j960J889j3229J5469N94j744K885l68p933q494r047M639J5394
13439a120J4917p093o3J640l309n180M473Q003K522j1471R27n449R457q1K096
13424A0269N03J919n335j9282M507J2154l613j4477L217J1337O45j1457o845J025
13410a5433j189O064J281m19Q826q99l17M579Q019j4553j1959L084J5657J3815
$$ y = [19669, 20668, 18593, 8650, -3356, -14469, -15003, -11015, -6868, -7363, -6001, 1076, -8049, 5644, 17371, -1286, -17424, -10918, 556, 4137, 10717, 9430, 3232, -11163, -9872, -11690, -2839, -418, 3572, 5821, -9247, -11421, -3838, -6365, -13364, -6809, -7227, -20727, -23780, -6820, -324, -4136, -2431, -15377, -9205, -1560, -8266, -6004, -10843, -10145, -8956, -12747, -4840, 3938, 6745, 8215, 9654, 785, -1175, 714, -12515, 2954, 3548, 1804, 4689, 4321, -3612, -12106, -21153, -16514, -1120, 13797, 6704, 6641, 8281, 4972, -208, 4265, 12268, 14790, 3319, 4246, -1203, 8254, 8173, 10269, 10772, 12691, 7356, -11926, -7419, 4735, 1122, -13355, -10138, 1199, 1844, -9613, -16458, -15433, -16622, -10558, -9277, -9696, -870, -1769, -2086, 2493, 10512, -4041, -16000, -12916, 2741, 16556]
13396A6556M113j3N991N911j4127o785m201M112L551o633p386l722J0728J353
13382I448j2654n853j1815j7151L69J3900K5065J4305j0521j0781n914J3664k013
13369D9n439K591m335P552K981L573m658o285R037N816o749o446m063J480Q513
13354C617k452N873J416J84K795q862o291P106P657J0529M779j2099k1191r633
13340a6572R812O674o666q587q98J7361Q792p428r309j1502O050K735k149M715
13326f972j722j202L412l44j2619J0099J4645M284r416J436j5247N581J2855O573
13312A1363j6800m966Q362J478k701K886K711K625K511m561j798l682R89L956
13298B373L970p367j2513N44j543q269o69J0657J2340R812L016p627l835R818
$$ y = [16556, 20669, 20656, 26647, 32558, 18431, 11646, 7445, 11557, 15108, 8475, 1089, -2633, 8095, 9448, -3206, -9059, -20874, -38025, -37656, -23756, 1309, 15614, 5093, -5688, -11602, 2062, 49, -5390, -2799, -7134, 418, 3399, 6972, 2314, -3971, 5066, 10882, 4133, -2313, -6376, -4896, 3617, 1165, 7038, 8454, 8638, 11433, 2571, -3720, 3386, 11043, 21572, 26351, 14252, -6939, -16572, -6760, -86, -6752, -15339, -16237, 1124, 9916, 2488, -6821, -18323, -12273, -9538, -11687, -6972, -8694, -9896, -6484, -6828, -19447, -9348, 5297, 9581, 165, 1601, -13646, -8065, 4790, 11363, -5437, -10403, -2041, -563, -3264, -378, 2333, 4958, 7469, 2908, 1110, -2572, -1583, 2373, 6343, -1024, -13537, -12993, -14536, -22805, -23474, -12817, -477, 9335, 12351, 4724, 889, 10707]
13284A0707l089m161K141q743l780R075R286O659K733k302l752p999j2662r38
13270f825Q336J631J0828J167q020q713n246K56L092L467J3214J167j6092o682
13256h420r421L000J2451N07O724j0586o604J2310j945j1197L540M019M947j018
13242a693j9209o149J0703J3061O872K050j0819m655m55J3620J3857r219K069
13229A0033J8542K3896K7260K0260L736r506k7972k9495j8742j816k593j261M620
13216A6962q588l056L293j0582q698J2344Q004p821M571Q068r645j378L871J878
13202I223k413m912j2014K921J3045j772j673Q37M013R97K550J5785j61o752P290
13187B6964J8310J9043M606K7349O6553Q5699P1496L3794l5022o7088o8093o1650
$$ y = [10707, 7618, 3457, 5598, -3145, -6925, 2150, 11436, 18095, 20828, 18526, 14774, 6775, -5887, -6825, 1511, 3142, 13970, 15137, 7117, -1596, -6842, -6586, -3494, -27, 13187, 14354, -1738, -8420, -17841, -14841, -2390, -1883, 4841, -5745, -12349, -39, -1984, -13181, -9641, -5622, -675, -1693, -20902, -27051, -16348, -3287, 3585, 5635, -5184, -9839, -10294, 3326, 17183, 7964, 10033, 28575, 52471, 79731, 99991, 103727, 94221, 66249, 36754, 18012, 16196, 13603, 12342, 16962, 8374, 5318, 8611, -1971, -10669, 1675, 9679, 1858, 6429, 14497, 4852, 3474, 7345, 9223, 6810, 1898, -10116, -7195, 5850, 4078, 2405, 3242, 7255, 8252, 10802, 26587, 26426, 19674, 26964, 45274, 64317, 68923, 96272, 162825, 248524, 320020, 353814, 318792, 251704, 183611, 121961]
13175A21961m0898j9411r679K490j2767L00j049j451r33j1174j1158K106K672
13162B1009J129M381k849j1927n868n382O719N742M048M516N118k691k620J7598
13148C8923q328k972r548N833J6358J1868M607J3764K4372L7444N2120N8710O7486
13135C10637K9317j6149n9271p3445n5624k6311j7338j7663j6272m145k695l17
13123E0724j76k1961k848K3083l713k6612j2329Q901P799J834j165L452r461K64
13109A7792M984j669n575n568n558m115M724J671M572Q609o968J677Q770J3410
13095C6756O347J017J5843K9071K3791J9215j1084l7780k5674j7592r042L0n961
13082B4937m901R203P543j0395j1886j2251k881J1142R522j691p557k994r474
$$ y = [121961, 81063, 61652, 51973, 54463, 41696, 41996, 40947, 39496, 38563, 27389, 16231, 18337, 21009, 22138, 26519, 23670, 11743, 5875, 493, 7212, 12954, 17002, 21518, 26636, 23945, 21325, 38923, 30595, 27623, 18075, 23908, 40266, 52134, 56741, 70505, 94877, 132321, 184441, 243151, 310637, 339954, 323805, 264534, 191089, 135465, 109154, 91816, 74153, 57881, 53736, 51041, 50724, 50548, 28587, 25739, 48822, 45109, 18497, 6168, 15069, 22868, 24702, 23537, 26989, 17528, 17792, 22776, 21107, 15532, 9964, 4406, 291, 5015, 6686, 11258, 19867, 12899, 14576, 23346, 36756, 43103, 44120, 59963, 89034, 112825, 132040, 120956, 83176, 57502, 39910, 30868, 30898, 24937, 20036, 29239, 36782, 26387, 14501, 2250, -631, 10511, 20033, 18342, 10785, 7791, -1683]
13069a683j733k328P913J2851o846p36p921o837L235j112j3470j032K238O258
13055a1203Q489N611J0604K751j6066j2557P640J4295K794p025q205j2942k317
13042a8131R50N502O659J3176M459L087o21k920J549j0351q288J415P547K685
13028F718l004j8858l835R481L694O708J0377L820j1776l772R130J96o731k481
13014c33M337j887j6624l727P2Q825J3584j67l291O413o499j2107K725N030p668
12999a1317K216M592q826N982K3217J4668j990M942l97j4320j157N105j4319p447
12985I49j268p354r311n682K188K045k153R175R643J1501J4702j4499j7606p721
12971a5391o812r64n321K688P269l04J120K585k875R460O593L654l84P480J707
$$ y = [-1683, -3416, -5744, 2169, 15020, 8174, 7438, -483, -7320, -4085, -5197, -18667, -19699, -17461, -11203, -2714, 2897, 13501, 16252, 186, -12371, -4731, 9564, 12358, 5333, -2872, -15814, -18131, -17181, -11679, -5020, 8156, 12615, 15702, 15081, 12161, 13710, 3359, -4929, -3514, 4033, 6718, 3714, -15144, -18979, -9498, -5804, 904, 11281, 15101, 3325, -447, 8683, 8879, 2148, -333, 4004, 2117, -14507, -18234, -18162, -9337, 4247, 4080, 789, 7202, 703, -11404, -8679, -3649, -11317, -9101, -4509, -13335, -7353, 15864, 30532, 28542, 33484, 33087, 18767, 17610, 22715, 8396, 949, -319, -7673, -16984, -22666, -20478, -18433, -20586, -11411, -1768, 9733, 24435, 9936, -7670, -15391, -22203, -23167, -28488, -25800, -18531, -18835, -17715, -15130, -18005, -8545, -1952, 1702, 1318, 8798, 10505]
12956A0505J85q395m364l029r616j1567l066M618K682j458K155L90L961R447J0139
12941B587J795P7R669n169j9562k562K820k192K317m799P984L63l579K931J0718
12926C398o388o903P651Q542k711r109j328J923N694p460j7725n415k64N539N085
12911a9471J2233K85k779J0281K543l60K050L245r66j0029L173J5752J393j2548
12897D802p788M706K887o005p357j2677K148J8459R58k583m218J117j0275m454
12883b0280q16j2071J6748Q919o418P605N721J063j6299o665P537N900L953m251
12869i354K835j70j0128p391n08Q496J1557J641o931j568J0152J3656j680p701
12855B906m771N456j93K553l898m716P322p502m233L158k761K417M423r273P390
$$ y = [10505, 10690, 2295, -2069, -5098, -14714, -26281, -29347, -24729, -22047, -23505, -21350, -20960, -16999, -7552, 2587, 4382, 4459, 14128, 8959, -10603, -13165, -10345, -12537, -10220, -15019, -7035, -6672, -10251, -7320, 3398, -2990, -9893, -2242, 6300, 3589, -5520, -6848, -4925, 769, -6691, -24416, -29831, -30095, -24556, -19471, -7238, -6953, -9732, 549, 3092, 2732, 4782, 8027, 7061, -2968, 205, 15957, 17350, 4802, -2986, 1720, 4607, -1398, -8755, -21432, -19284, -825, 133, -2450, -6668, -5551, -15826, -20280, -21096, -33167, -16419, -7500, -13918, -6313, -592, 471, -15828, -22493, -14956, -9056, -5103, -9354, -6519, -6689, -16817, -24208, -24716, -16220, -4663, -3022, -9953, -11521, -1369, 12287, 10607, 2906, -1865, 3591, 3398, 5951, 2053, -2663, 4659, -2843, -7076, -3918, -6679, -4262, 161, -9112, -1722]
12840a722q895O831R047J725N015n709m719q159j5455n100Q360k921l568J798
12826b3472L882L25J3988R859j0130k498N76l566j42J5102o39J102J8423M346
12812B7156J125o758j0421l352m266k0r361j2821j402M236R082k188R100O505
12798F615o775R79M065N004L981j1521k322J1684J400J129k093q836N59J0190
12784A4059r591j6653N525l435m341j003R041J8892k397n307j2190j1371N727
12771a3044J1440m587m312J733n104j4180r779R959K0931M893j628o457j95O589
12757c741J3266j303p881k098L625j572Q498K042j6168r230o079M322K128p754
12743b1945k654R077J1083K432M56o664p886L393R375j120k395J153R085M2J742
$$ y = [-1722, -10617, -3786, 5261, 6986, 12001, 6292, 1573, -6586, -22041, -27141, -18781, -21702, -25270, -23472, -19590, -19265, -5277, 4582, -5548, -8046, -7470, -11036, -11178, 3924, 3285, 4387, 22810, 27156, 28281, 21523, 11102, 7750, 3484, 3464, -5897, -18718, -20120, -15884, -6802, -8990, 110, 6615, -160, 819, 4884, 9888, 13869, 2348, 26, 11710, 13110, 14239, 12146, 3310, 3869, 14059, 4468, -12185, -6660, -10095, -14436, -15439, -6398, 12494, 10097, 4790, -7400, -18771, -13044, -1604, -6191, -10503, -8770, -13874, -28054, -37833, -27874, -6943, -2050, -3678, -10135, -10330, -3741, 9525, 8222, 341, -1757, 1868, 296, 8794, 10836, -5332, -14562, -20641, -16319, -14191, -21945, -24599, -15522, -4439, -2007, -1551, -8215, -16101, -12708, -3333, -4453, -6848, -5695, 3390, 3432, 5174]
12728E174k873o481K378J9749N440l604j2146n578p307m603l285O621J523j0291
12714a5283K352M428p434O97l850P207q15k05o786N570n5q5l805K455L839P04
12698a1066P298K795m542j618K955J5491J374j0775j1045K268K535j260J4j749
12684g325L092j0190K496k27l24R05M031j430L636l655o124L839p965j5544L70
12669c4415O564N290J4863L123j0539J0764M556j477N863m14O398O612j3816j1860
12655h488n698K633L321k936J1884N019M456r473l204o47J6214J289q269l970
12641B131j629m977R058K833j739l722j8k711k829j895Q167j269K486j3807m478
12626a4399O318P580j648k068m418k677J793M790q95N549k606r905k303k612n96
$$ y = [5174, 2301, -4180, -1802, 17947, 23387, 19783, 7637, 2059, -5248, -9851, -13136, -6515, -4992, -15283, -12931, -8503, -15937, -15240, -19090, -11883, -12698, -12903, -19689, -14119, -14174, -14259, -18064, -15609, -11770, -11066, -3768, -973, -5515, -7133, -4178, 11313, 12687, 1912, -9133, -6865, -4330, -5590, -5576, -7325, -4233, -14423, -11927, -12154, -12478, -11573, -7542, -8972, -5336, -8991, -15115, -11276, -19241, -34785, -34415, -27851, -22561, -7698, -4575, -15114, -4350, 206, -1271, 4592, 4178, 10576, 17188, 3372, -8488, -14186, -11553, -8232, -11168, 716, 5735, 10191, 718, -2486, -3133, 13081, 14370, 6101, 2131, 502, -4475, 4583, 7416, 5677, 1955, 1937, -774, -3603, -5498, 2669, 1400, 3886, -9921, -14399, -8081, -501, -2149, -4217, -8635, -11312, -9519, -4729, -5624, -75, -2681, -12586, -14889, -17501, -18097]
12611a8097M31l992P086k25r391n431J5665L886J0578K483n443j4981P862L730
12597e839n073J63j744k961o851n303J0766K455N145O727p470m270J7423K439
12583E607o661K958m036k3120J179O255N568Q770l719n045J0192K764j2803m207
12569a6298L260n423R602k281j0175J409r06m144M963R746L714R645J972O025
12555A1109j4310o275J653J978n76m965J877l287K823J1411R920j1560K790r838
12541g250j1525K265R390J3326L054r223l178P769k831n262J759K26j537q110
12527a1127l949J915R451j2100l460N044K519q666O043Q595O782M724j027Q317
12513A3061j301r447p970l484n727J4131P24Q199N883j1862j4506n87Q446M409
$$ y = [-18097, -17666, -21658, -14572, -14797, -24188, -29619, -13954, -10068, 510, 2993, -2450, -17431, -9569, -5839, -10912, -10749, -12493, -15454, -22305, -27608, -16842, -14387, -9242, -2515, -9985, -14255, 3168, 5607, -1054, 1904, -2132, -25252, -24073, -17818, -12250, -3480, -7199, -12244, -2052, 712, -12091, -16298, -13038, -18461, -8859, -11140, -21315, -19906, -20812, -24956, -19993, -10247, -6533, 3112, 5084, 11109, -3201, -9476, -7823, -5845, -6421, -11386, -9509, -12796, -9973, 1438, 11358, -202, 2588, -7250, -18775, -16510, -7120, 6206, 9260, 37, -3141, 4628, 1797, -3465, -1706, -1480, -3017, -11127, -15076, -13161, -3710, -15810, -19270, -14226, -11707, -20373, -14330, -5735, 1047, 5771, 4744, 13061, 11760, 2313, -5657, -9141, -14868, -737, -13, 8186, 14069, 2207, -12299, -12886, -4440, -31]
12499c1M547P917j0255j6089R82K316j814R699m962l448M685l230m286P566R125
12484B722J945k013m121n060j1239K454L075l396Q965j611m485L289J2370M111
12470G006q149J274M474M168K711l513N738q893j7057j471M884N012J291M343
12456A818J917m524J186P603p723m829o286l719N702N083o070L812R363m895j3766
12441a5328m656k828n344M788Q189J3390J7187m629n085j2274R200R414o263j2096
12427f335p018P324J0554o159j233J3244L004n833j3083o602J982M56O385O086
12413B772j0104R083R965k247j546o751m88M857j5119j0036K517J4464J1335M577
12399A3279p859j3578k509P698m901j1367j0721P152Q695j933p415L76J9773L986
$$ y = [-31, 4516, 12433, 2178, -13911, -12929, -10613, -12427, -2728, -7690, -11138, -6453, -9683, -13969, -6403, 2722, 4667, 2654, -1467, -6527, -17766, -15312, -12237, -15633, -6668, -8279, -12764, -9475, 2895, 7006, -1143, 131, 4605, 8773, 11484, 7971, 13709, 4816, -12241, -13712, -8828, -3816, -2525, 1818, 3735, -789, 397, 8000, 277, -4552, -10838, -14557, -8855, -3772, -9842, -6030, 3333, -1562, -15328, -19984, -22812, -28156, -23368, -15179, -1789, 15398, 10769, 5684, -6590, 2610, 12024, 5761, -6335, -13353, -6029, 4525, -1634, -2867, 10377, 13381, 7548, -5535, -12137, -10155, -9699, -3314, 2772, -7332, 1751, 11716, 9469, 7923, 1172, 684, 5541, -9578, -19614, -17097, -2633, 8702, 13279, 5420, -8158, -10667, -2969, -7870, -19237, -29958, -22806, -14111, -16044, -23459, -23083, -3310, 676]
12385F76J256k127j70k092m387L413l230p449P198P615p479O91L864K588M799
12370E166N577n291q778j374K335p597L000l202p040r23j4J6055J6970r985j1683
12355f784J862P272k889J343O118J0121r223j4161r361L429J2564Q452j0154j0940
12341a2351K284R781j576j5620q65M545l537J465R524P12m494K761P346K094j0457
12326h388O326P747l377p940m932R144n208n609o028K545J6517O421p84J0451
12312A6885j1799j1841L553J692m37O044q646l547K596P524K668j1733j6300j985
12298b5326J2001J9085O392p379o486l516r47J0431m035j4238K66J211o730Q79
12284a8392L898N750K275O824Q428l833j1227l603p784j242Q035O954l591O249
$$ y = [676, 1932, -195, -365, -2457, -6844, -3431, -6661, -14110, -6912, 703, -6776, -6085, -2221, 367, 5166, 10743, 5452, -3326, -4700, -2365, -9962, -6962, -10164, -17204, -18127, -18141, -2086, 14884, 4899, -6784, -4922, 2350, -539, 804, 6922, 17043, 7820, -6341, -15702, -12273, 291, 8743, -1411, -12351, -10067, -286, -1862, -17482, -18347, -13802, -17339, -15874, -6350, -5638, -10132, -7371, -25, 2069, -8388, -2062, 5685, 2308, -5632, -10564, -1420, -6628, -12237, -18265, -15720, 797, 7218, 6434, 16885, 5086, -6755, -3202, -1510, -1947, 4097, -4549, -8096, -5500, 2024, 4692, -7041, -23341, -25326, -13325, 5760, 12152, 4773, -1713, -5229, -6176, 4255, 220, -14018, -13752, -12541, -19271, -18392, -14494, -8744, -6469, 355, 8783, 4950, -6277, -9880, -17664, -18906, -10871, -3917, -7508, -1259]
12270a259O019k273N294o227l468l231n312n664J0583L573J078J757j0120j6933
12256b6183o521J4434J2308L076O15k108l302P275L599Q14P810j422q307j938
12242A50j786q624l27m603M442o273l442J7128J0604K509o78K79m957R93K68r723
12226d040j156m354o892j245M287K092J2449O571p794m317n813n499k297r046
12212b7054k407K511O137K645N402K248O096k345j0451l962L3R711K242l787k117
12197a5098O138R688M477O652l708j0012m079K173q358k836O763L397n45p407
$$ y = [-1259, 4760, 2487, 7781, 1554, -1914, -5145, -10457, -16121, -5538, -1965, -887, 870, -9250, -26183, -32704, -18270, -5962, -2886, -2271, -4379, -7681, -406, 3193, 4007, 11817, 10395, 2088, 150, -1636, -10260, -10587, -15190, -10748, -17021, -20463, -3335, 7269, 9778, 9100, 9379, 4422, 5415, 5683, -4040, -5196, -9550, -16442, -17687, -13400, -11308, 1141, 7712, -82, -4399, -10212, -15711, -18008, -27054, -29461, -26950, -20813, -18168, -12766, -10518, -4422, -6767, -17218, -21180, -21147, -11436, -9194, -12981, -15098, -8960, 728, 5205, 11857, 8149, -1863, -5942, -3769, -12127, -14963, -8200, -4803, -5348, -12755]
$$ [...]
##END NTUPLES=NMR SPECTRUM
##END=
