##TITLE=317096
cc 29239
422/147
adrs
robb
##JCAMPDX= 6.0         $$ Bruker NMR JCAMP-DX V2.0
##DATA TYPE= NMR SPECTRUM
##DATA CLASS= NTUPLES
##ORIGIN= Bruker BioSpin GmbH
##OWNER= nmr
$$ XWIN-NMR		Version 3.5
$$ Wed Jul 12 09:02:54 2006 GMT Daylight Time (UT+1h)  MAYBRIDGE\nmr@NMR_250MHZ
##.OBSERVE FREQUENCY= 250.131544655141
##.OBSERVE NUCLEUS= ^1H
##.ACQUISITION MODE= SIMULTANEOUS (DQD)
##.ACQUISITION SCHEME= undefined
##.AVERAGES= 1
##.DIGITISER RES= 18
##SPECTROMETER/DATA SYSTEM= dpx250
##.PULSE SEQUENCE= zg30
##.SOLVENT NAME= CDCl3
##.SHIFT REFERENCE= (INTERNAL, CDCl3, 0, 16.522)
##AUDIT TRAIL= $$ (NUMBER, WHEN, WHO, WHERE, WHAT)
$$ ##TITLE= Audit trail, XWIN-NMR		Version 3.5
$$ ##JCAMPDX= 5.01
$$ ##ORIGIN= Bruker BioSpin GmbH
$$ ##OWNER= nmr
$$ C:/u/data/dgb/nmr/ADRS/15670/pdata/1/auditp.txt
$$ ##AUDIT TRAIL=  $$ (NUMBER, WHEN, WHO, WHERE, WHAT)
(   1,<2006-02-08 11:12:29.74 +000>,<MAYBRIDGE\nmr>,<NMR_250MHZ>,
      <created by zg, POWCHK disabled, PULCHK disabled
       terminated by command 'halt'
       configuration hash MD5:
       84 BC 41 DB A1 6E 1D 46 DA 25 12 A5 C1 ED C5 3A
       data hash MD5: 64K
       FB B9 88 E7 78 0B 8E DB A9 B9 00 17 17 15 68 21>)
(   2,<2006-02-08 11:12:36.86 +000>,<MAYBRIDGE\nmr>,<NMR_250MHZ>,
      <Start of raw data processing
       ef LB = 0.3 FT_mod = 6 PKNL = 1 SI = 32K 
       data hash MD5: 32K
       EC 21 38 CC E3 A1 01 48 B8 4D 65 2E 9A 96 31 FB>)
(   3,<2006-02-08 11:12:38.75 +000>,<MAYBRIDGE\nmr>,<NMR_250MHZ>,
      <apk 
       data hash MD5: 32K
       9D CF 34 91 76 F6 02 E7 B9 07 F1 14 57 21 83 84>)
(   4,<2006-02-08 11:12:39.75 +000>,<MAYBRIDGE\nmr>,<NMR_250MHZ>,
      <abs ABSG = 5 
       data hash MD5: 32K
       F2 23 5B 67 81 E9 C5 57 D1 A4 2C 6C 92 AE 52 FD>)
$$ ##END=
$$ 
$$ hash MD5
$$ 49 1A 81 B8 9D 98 80 91 DB 73 5E 82 F1 D9 8F BC
##$RELAX= 
##$RELAX= 
##$RELAX= 
##$RELAX= 
##$RELAX= 
##$RELAX= 
##$RELAX= 
$$ Bruker specific parameters
$$ --------------------------
##$DU= <C:\Restored>
##$EXPNO= 15670
##$NAME= <ADRS>
##$PROCNO= 1
##$TYPE= <nmr>
##$USER= <dgb>
##$AMP= (0..31)
100 100 100 100 100 100 100 100 100 100 100 100 100 100 100 100 100 100 
100 100 100 100 100 100 100 100 100 100 100 100 100 100 
##$AQSEQ= 0
##$AQ_mod= 3
##$AUNM= <au_zg>
##$AUTOPOS= <9 >
##$BF1= 250.13
##$BF2= 250.13
##$BF3= 250.13
##$BF4= 250.13
##$BF5= 500.13
##$BF6= 500.13
##$BF7= 500.13
##$BF8= 500.13
##$BYTORDA= 1
##$CFDGTYP= 0
##$CFRGTYP= 5
##$CHEMSTR= <none>
##$CNST= (0..31)
1 1 145 1 1 1 1 1 1 1 1 1 1 1 1 1 1 1 1 1 1 1 1 1 1 1 1 1 1 1 1 1 
##$CPDPRG= <>
##$CPDPRG1= <>
##$CPDPRG2= <>
##$CPDPRG3= <>
##$CPDPRG4= <mlev>
##$CPDPRG5= <mlev>
##$CPDPRG6= <mlev>
##$CPDPRG7= <mlev>
##$CPDPRG8= <mlev>
##$CPDPRGB= <>
##$CPDPRGT= <>
##$D= (0..31)
0 1 0 0 0 0 0 0 0 0.06 0 0 0 0 0 0 0.0002 0 0 0 0 0 0 0 0 0 0 0 0 0 0 
0 
##$DATE= 1139397148
##$DBL= (0..7)
120 120 120 120 120 120 120 120 
##$DBP= (0..7)
150 150 150 150 150 150 150 150 
##$DBP07= 0
##$DBPNAM0= <>
##$DBPNAM1= <>
##$DBPNAM2= <>
##$DBPNAM3= <>
$$ [...]
##$SUBNAM7= <"">
##$SUBNAM8= <"">
##$SUBNAM9= <"">
##$SW= 20.6930455092707
##$SWIBOX= (0..15)
0 0 3 0 0 0 0 0 0 0 0 0 0 0 0 0 
##$SW_h= 5175.983436853
##$TD= 65536
##$TD0= 1
##$TE= 293.16
##$TE2= 300
##$TE3= 300
##$TEG= 300
##$TL= (0..7)
0 120 120 120 120 120 120 120 
##$TP= (0..7)
150 150 150 150 150 150 150 150 
##$TP07= 0
##$TPNAME0= <>
##$TPNAME1= <>
##$TPNAME2= <>
##$TPNAME3= <>
##$TPNAME4= <>
##$TPNAME5= <>
##$TPNAME6= <>
##$TPNAME7= <>
##$TPOAL= (0..7)
0.5 0.5 0.5 0.5 0.5 0.5 0.5 0.5 
##$TPOFFS= (0..7)
0 0 0 0 0 0 0 0 
##$TUNHIN= 0
##$TUNHOUT= 0
##$TUNXOUT= 0
##$USERA1= <user>
##$USERA2= <user>
##$USERA3= <user>
##$USERA4= <user>
##$USERA5= <user>
##$V9= 5
##$VALIST= <valist>
##$VCLIST= <CCCCCCCCCCCCCCC>
##$VD= 0
##$VDLIST= <DDDDDDDDDDDDDDD>
##$VPLIST= <PPPPPPPPPPPPPPP>
##$VTLIST= <TTTTTTTTTTTTTTT>
##$WBST= 1024
##$WBSW= 4
##$XGAIN= (0..3)
0 0 0 0 
##$XL= 0
##$YL= 0
##$YMAX_a= 28560
##$YMIN_a= -26129
##$ZGOPTNS= <>
##$ZL1= 120
##$ZL2= 120
##$ZL3= 120
##$ZL4= 120
##$ABSF1= 16.522
##$ABSF2= -4.171173
##$ABSG= 5
##$ABSL= 3
##$ALPHA= 0
##$AQORDER= 0
##$ASSFAC= 0
##$ASSFACI= 0
##$ASSFACX= 0
##$ASSWID= 0
##$AUNMP= <proc_1d>
##$AZFE= 0.1
##$AZFW= 0.1
##$BCFW= 0
##$BC_mod= 0
##$BYTORDP= 0
##$COROFFS= 0
##$CY= 12.5
##$DATMOD= 1
##$DC= 0
##$DFILT= <>
##$DTYPP= 0
##$F1P= 14.0000005364418
##$F2P= -0.99999901652339
##$FCOR= 0.5
##$FTSIZE= 32768
##$FT_mod= 6
##$GAMMA= 0
##$GB= 0
##$INTBC= 1
##$INTSCL= 1
##$ISEN= 128
##$LB= 0.3
##$LEV0= 0
##$LPBIN= 0
##$MAXI= 10000
##$MC2= 0
##$MEAN= 0
##$ME_mod= 0
##$MI= 0
##$NCOEF= 0
##$NC_proc= -6
##$NLEV= 6
##$NOISF1= 0
##$NOISF2= 0
##$NSP= 0
##$NTH_PI= 0
##$NZP= 0
##$OFFSET= 16.522
##$PC= 1
##$PHC0= 102.2064
##$PHC1= 3.140747
##$PH_mod= 1
##$PKNL= yes
##$PPARMOD= 0
##$PSCAL= 4
##$PSIGN= 0
##$REVERSE= no
##$SF= 250.13
##$SI= 32768
##$SIGF1= 0
##$SIGF2= 0
##$SINO= 400
##$SIOLD= 32768
##$SREGLST= <1H.CDCl3>
##$SSB= 0
##$STSI= 32768
##$STSR= 0
##$SW_p= 5175.98343685301
##$SYMM= 0
##$S_DEV= 0
##$TDeff= 65536
##$TDoff= 0
##$TI= <Analysis number 999999
Compound Code 99
Book Reference 9
Project Code 9>
##$TILT= no
##$TM1= 0
##$TM2= 0
##$TOPLEV= 0
##$USERP1= <user>
##$USERP2= <user>
##$USERP3= <user>
##$USERP4= <user>
##$USERP5= <user>
##$WDW= 1
##$XDIM= 32768
##$YMAX_p= 467121561
##$YMIN_p= -1440192
$$ End of Bruker specific parameters
$$ ---------------------------------
##NTUPLES= NMR SPECTRUM
##VAR_NAME=  FREQUENCY,     SPECTRUM/REAL,   SPECTRUM/IMAG
##SYMBOL=    X,             R,               I
##VAR_TYPE=  INDEPENDENT,   DEPENDENT,       DEPENDENT
##VAR_FORM=  AFFN,          ASDF,            ASDF
##VAR_DIM=   32768,         32768,           32768
##UNITS=     HZ,            ARBITRARY UNITS, ARBITRARY UNITS
##FACTOR=    0.157963299565203, 1,           1
##FIRST=     4132.6476996994, 0,             0
##LAST=      -1043.33573715361, 0,           0
##MIN=       -1043.33573715361, -1440192,    0
##MAX=       4132.6476996994, 467121561,     0
$$ Real data points
##PAGE= N=1
##DATA TABLE= (X++(R..R)), XYDATA
$$ [...]
$$ plain form
14514 -67747 -86607 -105026 -127816 -141873 -36480 -36187 -74306 -67835 -40517 -13272 -8031 -74517
14502 -74517 2009 32111 53627 26274 8811 41970 71447 47304 64732 62689 31637 55708
14490 55708 61266 -5660 9832 -23897 -23493 -67133 -46405 -32984 -26777 -38584 -59326 -47132
14478 -47132 -58630 -20450 -24278 -23025 -55954 -36242 29284 11565 -20394 -50866 -82471 -24495
14466 -24495 65464 68823 67481 80507 54673 13720 27614 49429 18795 -13500 -20824 7537
14454 7537 100742 66243 21369 29484 1014 83000 79930 45317 21486 86513 16768 -58793
14442 -58793 -15450 49010 33270 -4809 -12745 -14957 -7236 -25242 -32799 -37809 -40841 -7101 -30134
14429 -30134 -43381 -21505 -27234 -67984 -15920 -979 10412 -14996 -18029 -57602 -61982 -73444
$$ packed form
14514f7747j8860j8419k2790j4057J05393K93l8119O471K7318K7245N241o6486
14502g4517P6526L0102K1516k7353j7463L3159K9477k4143J7428k043l1052K4071
14490E5708N558o6926J5492l3729M04m3640K0728J3421O207j1807k0742J2194
14478d7132j1498L8180l828J253l2929J9712O5526j7719l1959l0472l1605N7976
14466b4495Q9959L359j342J3026k5834m0953J3894K1815l0634l2295p324K8361
14454G537R3205l4499m4874Q115k8470Q1986l070l4613k3831O5027o9745p5561
14442e8793M3343O4460j5740l8079p936k212P721j8006p557n010l032L3740k3033
14429c0134j3247K1876n729m0750N2064J4941J1391k5408l033l9573m380j1462
$$ plain form
14417 -73444 -34960 1388 -21333 -61994 -40568 -27765 -49325 -50780 -6083 -25695 -33438 -5629
14405 -5629 -23717 -8948 46794 48873 25873 24379 -10936 -31993 15299 61901 54999 21647
14393 21647 -18848 -14999 -43673 -2671 6328 -21011 13491 127677 127427 133046 85068 63055
14381 63055 46805 10306 -8670 4149 31894 -13521 31258 19868 1118 15339 35178 49290
14369 49290 55224 70723 75123 34064 26062 42648 30637 35422 45552 62961 58587 -1471 -87722
14356 -87722 -54598 37664 71710 56395 38846 10988 -12483 -59773 -122066 -59279 -8996 -16191
14344 -16191 -6064 29960 81734 41647 16483 45290 21081 11014 18285 -3480 10600 -13282
14332 -13282 -55586 -69888 -58316 12878 -41918 -97362 -111485 -132905 -119536 -86545 -66863 -55153
$$ packed form
14417g3444L8484L6348k2721m0661K1426J2803k1560j455M4697j9612p743K7809
14405e629j8088J4769N5742K079k3000j494l5315k1057M7292M6602o902l3352
14393B1647m0495L849k8674M1002Q999k7339L4502J14186k50N619m7978k2013
14381F3055j6250l6499j8976J2819K7745m5415M4779j1390j8750J4221J9839J4112
14369D9290N934J5499M400m1059q002J6586j2011M785J0130J7409m374o0058q6251
14356h7722L3124R2262L4046j5315j7549k7858k3471m7290o2293O2787N0283p195
14344a6191J0127L6024N1774m0087k5164K8807k4209j0067P271k1765J4080k3882
14332a3282m2304j4302J1572P1194n4796n5444j4123k1420J3369L2991J9682J1710
$$ plain form
14320 -55153 -78821 -36620 -33680 -54215 -1361 13387 43517 68157 40310 374 62058 35369
14308 35369 5807 8597 70951 79813 26316 -39892 -62268 -7864 15481 27234 58884 16278
14296 16278 -9607 -19149 -34140 -63871 -101061 -63211 -57629 -36157 24770 82782 81346 37434
14284 37434 22487 -7341 -61573 -81194 -77241 -85797 -79504 -64274 -65957 -81354 -59354 -49021
14272 -49021 -65850 -27682 -31143 -35970 -39170 4711 -770 -23754 -66988 -13335 48233 5897
14260 5897 13508 -738 6996 -705 27631 31750 -36077 -83082 -59130 -74966 13893 79107 -16148
14247 -16148 -90816 -71924 -46023 -42699 -67414 -25604 12782 4964 25205 48572 35189 23225
14235 23225 51074 82639 99208 96734 32277 60535 72825 52145 51486 51018 21698 -27728 -38855
$$ packed form
14320e5153k3668M2201K940k0535N2854J4748L0130K4640k7847l9936O1684k6689
14308C5369k9562K790O2354Q862n3497o6208k2376N4404K3345J1753L1650m2606
14296A6278k5885r542j4991k9731l7190L7850N582K1472O0927N8012j436m3912
14284C7434j4947k9828n4232j9621L953q556O293J5230j683j5397K2000J0333
14272d9021j6829L8168l461m827l200M3881n481k2984m3234N3653O1568m2336
14260E897P611j4246P734p701K8336M119o7827m7005K3952j5836Q8859O5214r5255
14247a6148p4668J8892K5901L324k4715M1810L8386p818K0241K3367j3383j1964
14235B3225K7849L1565J6569k474o4457K8258J2290k0680o59m68k9320m9426j1127
$$ plain form
14222 -38855 -44322 -36042 -25130 -11536 5380 27096 61811 80730 55588 -2862 40890 60759
14210 60759 59227 48167 46299 72229 115012 83161 28544 7919 48059 105094 82498 23248
14198 23248 -41969 12084 45545 -4305 -48045 -77886 -92478 -81711 -37921 -12170 -30185 -66096
14186 -66096 -33895 -1378 49151 47160 -11875 -12016 30801 57603 51746 57360 25046 -18812 -7439
14173 -7439 -21629 30383 28115 -12630 -2066 -11251 -57535 -73411 -54360 -23716 -4106 -43897
14161 -43897 -84286 -63538 -16465 21492 33730 18539 -9665 -6123 56221 45368 24467 38890
14149 38890 69945 63200 60529 89329 95141 59377 -26266 -19590 -10840 -32409 -70509 -85789 -114118
14136 -114118 -71104 -32269 6237 59761 56091 32593 2888 10840 49584 82649 111964 124484
$$ packed form
14222c8855n467Q280J0912J3594J6916K1716L4715J8919k5142n8450M3752J9869
14210F0759j532j1060j868K5930M2783l1851n4617k0625M0140N7035k2596n9250
14198B3248o5217N4053L3461m9850m3740k9841j4592J0767M3790K5751j8015l5911
14186f6096L2201L2517N0529j991n9035j41M2817K6802n857N614l2314m3858J1373
14173g439j4190N2012k268m0745J0564r185m6284j5876J9051L0644J9610l9791
14161d3897m0389K0748M7073L7957J2238j5191k8204L542O2344j0853k0901J4423
14149C8890L1055o745k671K8800N812l5764q5643O676Q750k1569l8100j5280k8329
14136a14118M3014L8835L8506N3524l670k3498k9705P952L8744L3065K9315J2520
$$ plain form
14124 124484 142770 51485 30304 34263 -13 -19078 -17082 -36140 -37710 -31863 -11378 -57891
14112 -57891 -40198 2064 32507 46620 24195 -1036 -33690 -79740 -20682 -4907 -17069 40226
14100 40226 94471 84207 59435 31506 3468 -14419 -28745 5671 17701 -8682 -6627 -45026
14088 -45026 -4489 50088 45251 -26608 -95006 -86323 -66868 -74801 -60025 -14780 6812 -2634
14076 -2634 -22722 -35771 22086 83401 110249 130661 73493 38966 9673 6419 1918 3099
14064 3099 11886 24408 28871 -16406 -36252 -14806 -6216 13745 -26676 -50442 -69365 -47906
14052 -47906 -6144 5174 16285 49519 93117 75209 18567 8234 -24235 -55497 -43469 17892
14040 17892 51841 8237 -47480 -68457 -73675 -55925 -65552 -73935 -68682 -9883 -9419 -40951 -77587
$$ packed form
14124A24484J8286r1285k1181L959l4276j9065J996j9058j570N847K0485m6513
14112e7891J7693M2262L0443J4113k2425k5231l2654m6050N9058J5775j2162N7295
14100D0226N4245j0264k4772k7929k8038j7887j4326L4416J2030k6383K055l8399
14088d5026M0537N4577m837p1859o8398Q683J9455p933J4776M5245K1592r446
14076b634k0088j3049N7857O1315K6848K0412n7168l4527k9293l254m501J181
14064C099Q787J2522M463m5277j9846K1446Q590J9961m0421k3766j8923K1459
14052d7906M1762J1318J1111L3234M3598j7908n6642j0333l2469l1262J2028O1361
14040A7892L3949m3604n5717k0977n218J7750r627q383N253N8799M64l1532l6636
$$ plain form
14027 -77587 -92939 -56446 -3639 -14797 -13495 18224 40017 29275 108091 139476 128127 47419
14015 47419 34869 38312 48800 34090 3726 -70692 -61776 19263 119367 130581 129660 92403
14003 92403 63768 5876 -10244 -35867 -65469 -49948 -26711 -10003 18976 -22921 -42108 -40938
13991 -40938 -7550 18277 -6140 -52428 -83831 -80759 -88603 -21039 37992 104015 87139 66326
13979 66326 29418 -41690 -64575 -61133 -79887 -107212 -151148 -92455 699 -4798 -8715 -20748
13967 -20748 -63112 -38104 -52898 -7210 12569 -29339 -37171 -64115 -17935 39961 108114 34403
13955 34403 -55631 -106390 -89196 -60420 -67688 -46972 -31678 -25637 -854 15758 76217 120336
13943 120336 104615 54491 22266 -8407 -22502 -50666 -59587 -56013 -40921 -9874 22062 46183
$$ packed form
14027g7587j5352L6493N2807j1158J302L1719K1793j0742P8816L1385j1349q0708
14015D7419j2550L443J0488j4710l0364p4418Q916Q1039J00104J1214r21l7257
14003I2403k8635n7892j6120k5623k9602J5521K3237J6708K8979m1897j9187J170
13991d0938L3388K5827k4417m6288l1403L072p844O7564N9031O6023j6876k0813
13979F6326l6908p1108k2885L442j8754k7325m3936N8693R3154n497l917j2033
13967b0748m2364K5008j4794M5688J9779m1908p832k6944M6180N7896O8153p3711
13955C4403r0034n0759J7194K8776p268K0716J5294O041K4783J6612O0459M4119
13943A20336j5721n0124l2225l0673j4095k8164q921L574J5092L1047L1936K4121
$$ plain form
13931 46183 255 -16107 16924 16448 15494 39818 -4599 16787 -7432 28172 25483 -29554 13943
13918 13943 32254 23083 -19901 3820 78662 22879 -6269 -26485 -28957 -48921 -16436 -7113
13906 -7113 27588 34784 4139 11221 56058 94013 26624 3426 -2788 60685 49516 21566
13894 21566 -13893 -41128 -63418 -37015 -9088 19697 1393 -1891 44643 78699 42135 14290
13882 14290 41414 -33531 -66968 -4555 -18134 -13240 -42612 -2198 -7810 -42419 -11587 -8036
13870 -8036 -66154 -101376 -96639 -90331 -100068 -84749 -58326 -30600 -52792 -19311 62758 53419 6065
13857 6065 9105 13424 34542 26290 34693 57951 52888 19734 5180 58488 75387 83663 42494
13844 42494 -18864 -6950 -15592 -3540 -78786 -54773 23818 87872 72815 27847 9951 -1440
$$ packed form
13931D6183m5928j6362L3031m76r54K4324m4417K1386k4219L5604k689n5037M3497
13918A3943J8311r171m2984K3721P4842n5783k9148k0216k472j9964L2485R323
13906g113L4701P196l0645P082M4837L7955o7389k3198o214O3473j1169k7950
13894B1566l5459k7235k2290K6403K7927K8785j8304l284M6534L4056l6564k7845
13882A4290K7124p4945l3437O2413j3579M894k9372M0414n612l4609L0832L551
13870h036n8118l5222M737O308r737J5319K6423K7726k2192L3481Q2069r339m7354
13857F065L040M319K1118q252Q403K3258n063l3154j4554N3308J6899Q276m1169
13844D2494o1358J1914q642J2052p5246K4013P8591O4054j5057m4968j7896j1391
$$ plain form
13832 -1440 -61348 -45351 -29930 -57508 -43871 17213 23689 41958 15064 -7132 20762 52735
13820 52735 47828 32682 54595 152308 174829 151290 95654 67215 -48758 -104894 -83488 -25737
13808 -25737 -35408 -44138 -54281 -61260 -83552 -95828 -65011 -55150 -112361 -94035 -28689 1948
13796 1948 -6870 -13443 -641 -34168 -78117 -103116 -89005 -69562 -85696 -106542 -85978 -32228
13784 -32228 6499 -3304 -2890 44433 14912 11921 2544 11292 -30250 -66748 -21703 41105 58467
13771 58467 104884 50632 -52983 -115369 -95636 -99112 -83691 -120828 -66421 -8623 4205 25659
13759 25659 51587 61651 67909 83375 43852 16894 -4635 24361 37981 26709 16566 -3524
13747 -3524 -127714 -144444 -54831 26771 -45719 -138732 -89811 -35665 -25823 -41079 -22513 -37813
$$ packed form
13832a440n9908J5997J5421k7578J3637O1084O476J8269k6894k2196K7894L1973
13820E2735m907j5146K1913R7713K2521k3539n5636k8439j15973n6136K1406N7751
13808b5737r671q730j0143o979k2292j2276L0817R861n7211J8326O5346L0637
13796A948q818o573J2802l3527m3949k4999J4111J9443j6134k0846K0564N3750
13784c2228L8727r803M14M7323k9521k991r377Q748m1542l6498M5045O2808J7362
13771E8467M6417n4252j03615o2386J9733l476J5421l7137N4407N7798J2828K1454
13759B5659K5928J0064O258J5466l9523k6958k1529K8996J3620j1272j0143k0090
13747c524j24190j6730Q9613Q1602p2490r3013M8921N4146R842j5256J8566j5300
$$ plain form
13735 -37813 -46784 -67532 -31678 -37231 28457 41313 -30716 -58765 -100841 -131225 -76946 5197
13723 5197 -2551 -54083 -120288 -150652 -139751 -84529 -72800 -33749 20321 9433 -26235 -51011
13711 -51011 -29598 -13925 -55843 -68437 -25363 -16628 -13923 -12946 38526 27775 14626 -22571
13699 -22571 -10254 43253 34809 29116 74891 21825 -39856 -43044 -50043 -44828 -24507 6808 59489
13686 59489 57887 80440 64647 -40891 -43867 -17733 13211 9812 2449 -33391 -24047 -57522
13674 -57522 -52140 -15832 -8342 -44228 -63908 -77756 -73914 265 23147 9014 60918 49777
13662 49777 42723 37185 80148 119237 92886 -11593 -77205 -92101 -87216 -38832 28826 2829
13650 2829 10638 32295 52383 41026 21800 24038 34102 -57843 -53931 -13974 23231 51459
$$ packed form
13735c7813q971k0748L5854n553O5688J2856p2029k8049m2076l0384N4279Q2143
13723E197p748n1532o6205l0364J0901N5222J1729L9051N4070j0888l5668k4776
13711e1011K1413J5673m1918j2594M3074Q735K705R77N1472j0751j3149l7197
13699b2571J2317N3507q444n693M5775n3066o1681l188o999N215K0321L1315N2681
13686E9489j602K2553j5793j05538k976K6134L0944l399p363l5840R344l3475
13674e7522N382L6308P490l5886j9680j3848L842P4179K2882j4133N1904j1141
13662D9777p054n538M2963L9089k6351j04479o5612j4896M885M8384O7658k5997
13650B829P809K1657K0088j1357j9226K238J0064r1945L912L9957L7205K8228
$$ plain form
13638 51459 23256 -16313 -48795 -25825 -40596 -75168 -4081 -4325 -7732 26644 55309 68350
13626 68350 19795 42850 433 -21527 -23443 -19274 -27403 -4341 -54932 -38736 -28806 -27574 18331
13613 18331 -23334 -10876 39387 79390 63040 6455 -20643 13362 29283 9064 -15998 -58007
13601 -58007 -25891 -11104 -19146 -32728 37928 103355 94850 95558 103655 52642 10906 -6602 4495
13588 4495 36109 54730 -12022 -61198 -53376 247 10267 -9568 -27664 -64989 -45079 -29738
13576 -29738 -14386 -5809 8824 14943 89873 40200 -27961 -61085 -68766 -42174 -26554 -61797
13564 -61797 -86297 -91564 -47512 -549 -35411 -62180 -86752 -71006 -39090 4293 10090 79877
13552 79877 87760 39074 60509 67924 -37439 -87132 -78270 -22895 3420 5656 68698 106955
$$ packed form
13638E1459k8203l9569l2482K2970j4771l4572P1087k44l407L4376K8665J3041
13626F8350m8555K3055m2417k1960j916M169q129K3062n0591J6196R930J232M5905
13613A8331m1665J2458N0263M0003j6350n6585k7098L4005J5921k0219k5062m2009
13601e8007L2116J4787q042j3582P0656O5427q505P08Q097n1013m1736j7508J1097
13588D495L1614J8621o6752m9176P822N3623J0020j9835j8096l7325J9910J5341
13576b9738J5352Q577J4633O119P4930m9673o8161l3124p681K6592J5620l5243
13564f1797k4500n267M4052M6963l4862k6769k4572J5746L1916M3383N797O9787
13552G9877P883m8686K1435P415j05363m9693Q862N5375K6315K236O3042L8257
$$ plain form
13540 106955 120016 96103 58150 16457 34349 42395 21868 5620 10450 4237 -14252 -18780
13528 -18780 -35584 -31896 2626 -671 -15136 -8203 -34851 -11007 -63308 -76714 -28455 31485
13516 31485 50317 59433 40421 27141 -29560 -68137 -123735 -168771 -129850 -74488 -56176 -47255
13504 -47255 -46257 26748 23791 -41198 -95900 -52926 -15015 4123 33409 -823 -57008 -56287 -52221
13491 -52221 -74607 -60738 -15147 -13993 41287 50409 2697 -26791 -31802 -7101 -16913 -51375
13479 -51375 -47606 -20613 9580 18748 5111 -16406 -10371 33926 -22166 -76666 -19140 -12718
13467 -12718 6022 9775 -16588 -6643 -16204 -58009 -135527 -133852 -114794 -91871 -93687 -40785 -5785
13454 -5785 42830 29560 -26140 -55950 -33410 -83549 -105789 -126643 -67369 -43508 -89949 -106225
$$ packed form
13540A06955J3061k3913l7953m1693J7892Q046k0527j6248M830o213j8489m528
13528a8780j6804L688L4522l297j4465O933k6648K3844n2301j3406M8259N9940
13516C1485J8832R116j9012j3280n6701l8577n5598m5036L8921N5362J8312Q921
13504d7255R98P3005k957o4989n4702M2974L7911J9138K9286l4232n6185P21M066
13491e2221k2386J3869M5591J154N5280R122m7712k9488n011K4701r812l4462
13479e1375L769K6993L0193R168j3637k1517O035M4297n6092n4500N7526O422
13467a2718J8740L753k6363R945r561m1805p7518J675J9058K2923j816N2902L5000
13454e785M8615j3270n5700k9810K2540n0139k2240k0854N9274K3861m6441j6276
$$ plain form
13442 -106225 -66163 -25315 -50758 -34837 3474 90773 99663 50171 58958 29507 -22208 -48247
13430 -48247 -4974 23839 24919 -1796 -22483 -18297 -32941 -49529 38767 25532 -54271 -63460
13418 -63460 -40073 -19098 -5404 37698 83902 72955 40868 65485 68779 -11476 -58342 -65441
13406 -65441 -79262 -47457 14568 54404 31993 -46529 -74652 -53792 -36304 -13769 24827 -15981
13394 -15981 -69772 -111617 -91122 -41521 13892 9533 51155 29250 -46760 -54325 -70028 -69573
13382 -69573 -67055 -6421 -7604 2607 -19156 -10473 36463 89523 89759 92675 39601 21882 42884
13369 42884 39245 -14654 -17744 45139 32669 33474 37228 27763 74459 51440 -4517 -35145 7455
13356 7455 44993 52209 37090 24289 39704 21521 16488 -1413 18804 44873 62340 95501
$$ packed form
13442a06225M0062M0848k5443J5921L8311Q7299Q890m9492Q787k9451n1715k6039
13430d8247M3273K8813J080k6715k0687M186j4644j6588Q8296j3235p9803r189
13418f3460K3387K0975J3694M3102M6204j0947l2087K4617L294q0255m6866p099
13406f5441j3821L1805O2025L9836k2411p8522k8123K0860J7488K2535L8596m0808
13394a5981n3791m1845K0495M9601N5413m359M1622k1905p6010p565j5703M55
13382f9573K518O0634j183J0211k1763Q683M6936N3060K36K916n3074j7719K1002
13369D2884l639n3899l090O2883j2470Q05L754r465M6696k3019n5957l0628M2600
13356G455L7538P216j5119j2801J5415j8183n033j7901K0217K6069J7467L3161
$$ plain form
13344 95501 53362 64617 54024 60076 34098 23138 -14250 7467 16665 31221 46264 47401
13332 47401 30583 33981 54206 15495 -23824 9217 4365 6470 29950 10850 -48045 -115659
13320 -115659 -101170 -77319 -30498 8561 50492 99264 98487 73251 42897 2915 -6386 35858
13308 35858 8050 36545 43889 -13534 -132245 -201957 -139986 -40822 -24414 -18891 -8947 -21704
13296 -21704 -39129 -66812 -10309 63505 20005 -42869 -94538 -86205 -59614 -70883 -71343 -28601
13284 -28601 -28660 -61472 -75640 -7327 -65335 -90446 -46847 -16684 -37298 -67138 7495 49173
13272 49173 6406 -25413 34704 62099 52831 37397 4586 8397 54511 54031 22985 -17875
13260 -17875 -18685 5542 44807 5326 -71054 -91792 -82371 -52384 -41832 -15372 -21314 -20143 -36113
$$ packed form
13344I5501m2139J1255j0593O052k5978j0960l7388K1717R198J4556J5043J137
13332D7401j6818L398K0225l8711l9319L3041m852K105K3480j9100n8895o7614
13320a15659J4489K3851M6821L9059M1931M8772p77k5236l0354l9982r301M2244
13308C5858k7808K8495P344n7423j18711o9712O1971R9164J6408N523R944j2757
13296b1704j7425k7683N6503P3814m3500o2874n1669Q333K6591j1269m60M2742
13284b8601n9l2812j4168O8313n8008k5111M3599L0163k0614k9840P4633M1678
13272D9173m2767l1819O0117K7395r268j5434l2811L811M6114m80l1046m0860
13260a7875q10K4227L9265l9481p6380k0738R421K9987J0552K6460n942J171j5970
$$ plain form
13247 -36113 -94039 -63742 -5542 12341 -26342 -18075 -31087 3645 24766 68783 24078 -26985
13235 -26985 -9940 13537 64535 40053 -8494 60311 71331 15692 -36854 -105315 -138092 -91483
13223 -91483 -61258 -43048 -5100 13650 25475 -40465 -100680 -28807 26883 13856 28656 24866
13211 24866 -9530 -8751 5257 74403 99916 122595 123369 70694 65683 2425 -35058 -4866 -8143
13198 -8143 -1580 14252 51400 114150 71035 25528 -5460 -57908 -39933 20917 32403 42801
13186 42801 59174 124963 77764 46023 102521 132659 113877 64051 44365 28939 5962 5118
13174 5118 5567 35805 22494 -30023 -37026 -33416 -26023 -49492 -54773 27992 69421 71827 93587
13161 93587 80467 66920 89708 69471 73087 56572 47079 75991 78958 76142 76439 2178 11180
$$ packed form
13247c6113n7926L0297N8200J7883l8683Q267j3012L4732K1121M4017m4705n1063
13235b6985J7045K3477N0998k4482m8547O8805J1020n5639n2546o8461l2777M6609
13223i1483L0225J8210L7948J8750J1825o5940o0215P1873N5690j3027J4800l790
13211B4866l4396P79J4008O9146K5513K2679P74n2675n011o3258l7483L0192l277
13198h143O563J5832L7148O2750m3115m5507l0988n2448J7975O0850J1486J0398
13186D2801J6373O5789m7199l1741N6498L0138j8782m9826j9686j5426k2977q44
13174E118M49L0238j3311n2517p003L610P393k3469n281Q2765M1429K406K1760
13161I3587j3120j3547K2788k0237L616j6515r493K8912K967k816K97p4261R002
$$ plain form
13148 11180 75094 76540 21147 20896 20646 21378 20818 -34826 -34839 -48818 -41556 -35072 -32153 -49724 -59950
13133 -59950 -24419 31849 -19817 -34994 -87825 -165844 -139338 -105215 -99304 -95073 -108083 -144449
13121 -144449 -167431 -138395 -14792 17634 -29640 -61719 -25969 -3319 15412 32337 29816
13110 29816 3130 -21996 -9065 -4736 36629 7207 -5091 -5273 14367 -57300 -83857 -31887
13098 -31887 -3372 -29519 -19903 26596 5655 -21155 -26899 -33893 3265 39221 49079 -18898
13086 -18898 -112191 -119755 -74891 -26854 -46145 -84369 -97583 -112409 -73238 -58074 -27484 19783
13074 19783 36735 -15584 -34041 -6205 -20888 8360 29617 23321 86471 79524 56563 42408
13062 42408 -27575 -23650 -3961 -23120 -13138 47353 81494 64280 61971 -8115 5846 -27554
$$ packed form
13148A1180O3914J446n5393k51k50P32n60n5644j3j3979P262O484K919j7571j0226
13133e9950L5531N6268n1666j5177n2831p8019K6506L4123N911M231j3010l6366
13121a44449k2982K9036J23603L2426m7274l2079L5750K2650J8731J6925k521
13110B9816k6686k5126J2931M329M1365k9422j2298j82J9640p1667k6557N1970
13098c1887K8515k6147R616M6499k0941k6810n744o994L7158L5956R858o7977
13086a8898r3293p564M4864M8037j9291l8224j3214j4826L9171J5164L0590M7267
13074A9783J6952n2319j8457K7836j4683K9248K1257o296O3150o947k2961j4155
13062D2408o9983L925J9689j9159R982O0491L4141j7214k309p0086J3961l3400
$$ plain form
13050 -27554 -46828 -113695 -106821 -90425 -47744 647 -49989 -114075 -89681 -69951 -43934 -19244
13038 -19244 34220 55065 53930 22210 22134 55586 68012 63489 40332 21635 39785 6295 34724
13025 34724 13112 1319 -20694 11194 92945 128974 115437 78886 86859 99949 70084 15598
13013 15598 -14959 -11297 43134 64674 67313 107266 115410 48113 -47204 -87393 -57255 -49437
13001 -49437 -29428 -33058 -32978 -25637 -53613 -60743 -76448 -12214 60900 81815 74839 28338 35079
12988 35079 72151 31432 -15165 -2362 748 -33276 -51289 -41752 -19585 -73008 -56242 -45520
12976 -45520 -22544 45475 33906 43260 74381 77293 63131 33276 37445 -25684 -36603 -17609
12964 -17609 12721 4526 -33548 -4511 -23431 -52823 -60435 -4179 22210 13199 -6109 -37311
$$ packed form
13050b7554j9274o6867O874J6396M2681M8391n0636o4086K4394J9730K6017K4690
13038a9244N3464K0845j135l1720p6L3452J2426m523k3157j8697J8150l3490K8429
13025C4724k1612j1793k2013L1888Q1751L6029j3537l6551P973J3090k9865n4486
13013A5598l0557L662N4431K1540K639L9953Q144o7297r5317m0189L0138P818
13001d9437K0009l630Q0P341k7976p130j5705O4234P3114K0915o976m6501O741
12988C5079L7072m0719m6597J2803L110l4024j8013R537K2167n3423J6766J0722
12976d5520K2976O8019j1569R354L1121K912j4162k9855M169o3129j0919J8994
12964a7609L0330q195l8074K9037j8920k9392p612N6256K6389r011j9308l1202
$$ plain form
12952 -37311 -73761 -101166 -98630 -93436 -53844 -38541 -19255 -43283 -39573 -16962 -47667 -18027
12940 -18027 -11182 -19023 -25205 -26581 -43782 -2076 76955 89591 94281 41682 -12899 -38725 -23368
12927 -23368 -39143 -17371 21293 -30530 -39380 -54012 -54528 -40233 16597 19500 29587 52397
12915 52397 75274 118847 47301 -18868 -54210 -71310 -99685 -83454 -34846 33228 12806 -50677
12903 -50677 -71387 -3127 5929 8911 32607 33287 -36568 1459 39612 47325 75756 40952 32137
12890 32137 86765 140078 63731 17156 -12500 -28706 -11030 -66304 -137590 -69590 -23922 6605
12878 6605 16247 9394 4403 21967 30236 -3718 14197 20472 7092 54866 71066 27929 -39613
12865 -39613 -33227 31477 11142 26658 51720 37377 31141 15868 -20265 7209 75492 68754
$$ packed form
12952c7311l6450k7405K536N194L9592J5303J9286k4028L710K2611l0705K9640
12940a8027O845p841o182j376j7201M1706P9031J2636M690n2599n4581k5826J5357
12927b3368j5775K1772L8664n1823q850j4632n16J4295N6830K903J0087K2810
12915E2397K2877M3573p1546o6169l5342j7100k8375J6231M8608O8074k0422o3483
12903e0677k0710O8260R056K982K3696O80o9855L8027L8153P713K8431l4804q815
12890C2137N4628N3313p6347m6575k9656j6206J7676n5274p1286O8000M5668L0527
12878F605R642o853m991J7564Q269l3954J7915O275j3380M7774J6200m3137o7542
12865c9613O386O4704k0335J5516K5062j4343o236j5273l6133K7474O8283o738
$$ plain form
12853 68754 34362 -33934 -7001 -53401 -70543 -51003 1566 54613 36179 25632 5503 5129
12841 5129 -35219 -73118 -109766 -149361 -92024 -26920 -25174 -10162 -53901 -26779 -7180 4013
12829 4013 10395 40572 18700 -19910 -20512 12577 21084 38308 -16463 -13584 33305 54282 89471
12816 89471 78498 36718 3481 -11602 2705 13869 12485 -45108 -70289 -62628 -56858 -56890 -73953
12803 -73953 -14603 27322 81963 62987 1861 -10390 -47702 -36083 -27646 -9055 -29336 -28833
12791 -28833 30568 72761 104259 54237 20889 34626 6697 -44631 -105777 -87154 -46571 34377
12779 34377 15850 -39411 -86203 -121120 -49550 -30324 -27494 -58610 -11695 87 58614 96518
12767 96518 74802 22550 7599 10736 49489 60498 39330 60975 49160 34006 38116 52480
$$ packed form
12853F8754l4392o8296K6933m6400j7142J9540N2569N3047j8434j0547k0129l74
12841E129m0348l7899l6648l9595N7337O5104J746J5012m3739K7122J9599J1193
12829D013O382L0177k1872l8610o02L3089Q507J7224n4771K879M6889K0977L5189
12816H9471j0973m1780l3237j5083J4307J1164j384n7593k5181P661N770l2j7063
12803g3953N9350M1925N4641j8976o1126j2251l7312J1619Q437J8591k0281N03
12791b8833N9401M2193L1498n0022l3348J3737k7929n1328o1146J8623M0583Q0948
12779C4377j8527n5261m6792l4917P1570J9226K830l1116M6915J1782N8527L7904
12767I6518k1716n2252j4951L137L8753J1009k1168K1645j1815j5154M110J4364
$$ plain form
12755 52480 21588 -15571 -19774 -70363 -77821 12765 114066 97465 30173 11270 -39301 -44917
12743 -44917 -49367 -42728 51578 65483 42073 -12885 -22673 2593 41227 47859 67853 22347
12731 22347 13225 28664 47038 12872 34566 12933 44873 45623 52944 75802 49390 43874 40096
12718 40096 86219 57542 31485 16561 -26596 -29621 -73370 -76343 -107905 -80119 8814 36700
12706 36700 60370 97830 56384 66613 115415 99822 54007 31220 -337 -48851 -39910 -71027
12694 -71027 -48252 25375 71633 56977 41483 9734 31242 -3491 -48801 -62316 -40520 2645
12682 2645 7785 -43921 -85782 -76958 -25975 8510 -20842 -71342 -74045 -26881 -31184 -54915 -98796
12669 -98796 -64486 -53450 -53900 -56322 -74839 -57846 -16453 9204 19460 -8433 -26886 -69586
$$ packed form
12755E2480l0892l7159m203n0589p458R0586J01301j6601o7292j8903n0571n616
12743d4917m450O639R4306J3905k3410n4958r788K5266L8634O632J9994m5506
12731B2347r122J5439J8374l4166K1694k1633L1940P50P321K2858k6412n516l778
12718D0096M6123k8677k6057j4924m3157l025m3749k973l1562K7786Q8933K7886
12706C6700K3670L7460m1446J0229M8802j5593m5815k2787l1557m8514Q941l1117
12694g1027K2775P3627M6258j4656j5494l1749K1508l4733m5310j3515K1796M3165
12682B645N140n1706m1861Q824N0983L4485k9352n0500k703M7164m303k3731m3881
12669i8796L4310J1036m50k422j8517J6993M1393K5657J0256k7893j8453m2700
$$ plain form
12657 -69586 -93731 -28731 17280 51988 39803 60169 18676 31420 17000 -36123 -49772 -7410
12645 -7410 2771 4423 8744 30585 6930 7251 29704 46869 27772 61758 24426 -52230 -47622
12632 -47622 -48990 -46314 -35540 -29213 11710 106301 94032 57499 46314 78057 46312 2513
12620 2513 -29189 -30195 -46257 -18162 44681 -21224 -104388 -154991 -159132 -110071 -93159 -51121
12608 -51121 -35573 42350 126413 90095 55069 -19518 -83235 -94675 -62887 -22468 25398 45631
12596 45631 43698 63222 77797 62789 130006 139594 69047 -10877 -90781 -85744 -81575 -87900 -23363
12583 -23363 795 8112 -2547 -23858 -27150 10857 38902 -12544 -54731 -31049 -30543 -9757
12571 -9757 28946 17990 7058 -3740 -30009 -18672 -3854 -17009 -5027 -33624 -53282 7718
$$ packed form
12657f9586k4145O5000M6011L4708j2185K0366m1493J2744j4420n3123j3649M2362
12645g410J0181J652M321K1841k3655L21K2453J7165j9097L3986l7332p6656M608
12632d7622j368K676J0774O327M0923R4591j2269l6533j1185L1743l1745m3799
12620B513l1702j006j6062K8095O2843o5905q3164n0603m141M9061J6912M2038
12608e1121J5548P7923Q4063l6318l5026p4587o3717j1440L1788M0419M7866K0233
12596D5631j933J9524J4575j5008O7217R588p0547p9924p9904N037M169o325O4537
12583b3363K4158P317j0659k1311l292L8007K8045n1446m2187K3682N06K0786
12571i757L8703j0956j0932j0798k6269J1337J4818j3155J1982k8597j9658O1000
$$ plain form
12559 7718 53845 -20578 -103274 -99772 -65894 -92630 -157369 -161878 -28757 32264 -3251 -48559
12547 -48559 -48791 -77371 -144071 -83931 -9901 12731 -24505 -52183 -58331 -14941 -38404 -107977
12535 -107977 -118275 -152646 -119797 -101524 -132176 -152465 -65634 317 27003 32126 3495 -7908
12523 -7908 -36767 -14218 3010 35078 17736 -14324 -47680 -44886 -35734 -58954 -69656 -112890
12511 -112890 -142952 -142889 -44644 -6980 37711 39581 49365 27624 32361 12249 -27478 -44543 -86614
12498 -86614 -59640 23200 72815 45906 88369 86343 80926 27624 5540 49195 66059 25165
12486 25165 27853 32234 -7178 -49927 -49789 -92273 -116485 -55354 18839 58638 88104 55514
12474 55514 7407 -38288 -98202 -127681 -126618 -111100 -39275 -24370 -60494 -71504 -36314 25710
$$ packed form
12559G718M6127p4423q2696L502L3878k6736o4739m509J33121O1021l5515m5308
12547d8559k32k8580o6700O0140P4030K2632l7236k7678o148M3390k3463o9573
12535a07977j0298l4371L2849J8273l0652k0289Q6831O5951K6686N123k8631j1403
12523g908k8859K2549J7228L2068j7342l2060l3356K794R152k3220j0702m3234
12511a12890l0062O3R8245L7664M4691J870R784k1741M737k0112l9727j7065m2071
12498h6614K6974Q2840M9615k6909M2463k026n417n3302k2084M3655J6864m0894
12486B5165K688M381l9412m2749J38m2484k4212O1131P4193L9799K9466l2590
12474E5514m8107m5695n9914k9479J063J5518P1825J4905l6124j1010L5190O2024
$$ plain form
12462 25710 45076 71925 88512 83207 69135 47171 -19578 -15726 25920 -7457 -24862 -1213
12450 -1213 -7460 50270 83098 40438 12885 -60689 -12961 -42804 -52171 -20089 83534 82304
12438 82304 -9058 -67311 -47621 -8214 33508 45852 25256 -8211 -64040 -80450 -83605 -43739
12426 -43739 -60397 -48566 -38193 -54288 -15395 -18632 -46970 -102149 -68448 10682 64598 77916
12414 77916 94154 41357 24762 -9608 -13117 21398 -12715 -38203 35322 50691 25212 51550
12402 51550 53105 25914 17838 35807 36629 60881 84099 48934 41191 81178 107072 45574 13199
12389 13199 652 18252 37957 47532 36857 -28560 -49794 -40893 -63198 -66539 -51835 -1425
12377 -1425 -14119 -66627 -92551 -36375 1784 -18671 -58326 -137715 -134868 -118108 -96312 -42043
$$ packed form
12462B5710J9366K6849J6587n305j4072k1964o6749L852M1646l3377j7405K3649
12450a213o247N7730L2828m2660k7553p3574M7728k9843r367L2082J03623j230
12438H2304r1362n8253J9690L9407M1722J2344k0596l3467n5829j6410l155L9866
12426d3739j6658J1831J0373j6095L8893l237k8338n5179L3701P9130N3916J3318
12414G7916J6238n2797j6595l4370l509L4515l4113k5488P3525J5369k5479K6338
12402E1550J555k7191q076J7969Q22K4252K3218l5165p743L9987K5894o1498l2375
12389A3199j2547J7600J9705R575j0675o5417k1234Q901k2305l341J4704N0410
12377a425j2694n2508k5924N6176L8159k0455l9655p9389K847J6760K1796N4269
$$ plain form
12365 -42043 -46519 -11294 -17686 14242 11022 34888 27534 -12093 -5868 19742 -16904 -54104 -53081
12352 -53081 19617 34577 25518 -11346 20666 55061 28899 36011 47482 26918 -9177 7093
12340 7093 22325 27951 79708 58796 8471 -33110 -58495 -10049 7857 8649 23491 9460
12328 9460 4560 -17238 -19237 9556 -29488 -26453 33515 25410 25259 -13172 -43190 -55288 -61739
12315 -61739 -70177 -31767 9025 24675 42165 45896 58849 14942 10597 -33945 -87755 -139414
12303 -139414 -114982 -93979 -34133 21196 -16299 -79172 -48988 -70622 -83178 -69314 -95844
12292 -95844 -66099 -4154 -306 -4870 -23993 -58120 -51473 -17167 -43006 -55039 4568 22557
12280 22557 56615 125970 98777 35733 33120 33645 -2435 -23062 17353 38685 12271 -40261
$$ packed form
12365d2043m476L5225o392L1928l220K3866p354l9627O225K5610l6646l7200J023
12352e3081P2698J4960r059l6864L2012L4395k6162P112J1471k0564l6095J6270
12340G093J5232N626N1757k0912n0325m1581k5385M8446J7906P92J4842j4031
12328I460m900k1798j999K8793l9044L035N9968q105j51l8431l0018j2098o451
12315f1739q438L8410M0792J5650J7490L731J2953m3907m345m4542n3810n1659
12303a39414K4432K1003N9846N5329l7495o2873L0184k1634j2556J3864k6530
12292i5844K9745O1945L848m564j9123l4127O647L4306k5839j2033N9607J7989
12280B2557L4058O9355k7193o3044k613N25l6080k0627M0415K1332k6414n2532
$$ plain form
12268 -40261 -46863 17463 41931 17126 -23384 1354 24297 -11891 -38698 -34053 -69108 -33718
12256 -33718 -18598 18609 9990 -57223 -52463 -2986 22143 -19414 -34109 -45451 -35632 11314
12244 11314 -14864 12351 22448 11975 -23104 -61233 -65211 -39821 32462 59759 57702 15270
12232 15270 -6622 48868 18190 -47191 -30940 23618 31443 -21007 -31620 -67716 -43273 -12474
12220 -12474 -39411 16288 27258 55812 4260 -29500 -3972 -29268 -69111 -58440 -67004 -123187
12208 -123187 -72276 -68073 -50615 5984 -27678 -25301 58608 26963 4553 -42835 -32013 -12955
12196 -12955 31319 45500 29044 -48815 -106821 -67522 -68780 -42686 -94271 -93756 -68292 -108210
12184 -108210 -141018 -120079 -89407 -138429 -107744 -113286 -114268 -105690 -69503 -26611 -51980 -70759
$$ packed form
12268d0261o602O4326K4468k4805m0510K4738K2943l6188k6807M645l5055L5390
12256c3718J5120L7207q619o7213M760M9477K5129m1557j4695j1342R819M6946
12244A1314k6178K7215J0097j0473l5079l8129l978K5390P2283K7297k057m2432
12232A5270k1892N5490l0678o5381J6251N4558P825n2450j0613l6096K4443L0799
12220a2474k6937N5699J0970K8554n1552l3760K5528k5296l9843J0671q564n6183
12208a23187N0911M203J7458N6599l3662K377Q3909l1645k2410m7388J0822J9058
12196a2955M4274J4181j6456p7859n8006L9299j258K6094n1585N15K5464l9918
12184a08210l2808K0939L0672m9022L0685n542r82Q578L6187M2892k5369j8779
$$ plain form
12172 -70759 -24042 95130 68952 4017 5312 18710 33962 42775 -39823 -48550 -30877 3332
12160 3332 70220 40276 -42465 -37715 -8106 33767 55731 43793 91109 102678 89494 5112
12148 5112 -7055 -41509 -80197 -78312 -105624 -71003 -26232 -22043 -17455 -26792 -7084 8602 12578
12135 12578 67189 75265 9827 -35835 -20413 -11776 4501 5141 -4406 -14408 41869 -2525 -30341
12122 -30341 -33012 -72156 -54950 -43085 26208 8794 13299 -2495 316 20115 -5903 -46235
12110 -46235 -62507 -27285 -35940 -63593 -58743 -51345 -74376 -59194 6722 -32530 -83148 -65843
12098 -65843 -68187 -87934 -66321 -8582 25399 -10428 -51566 -20732 45022 7343 -22674 9373
12086 9373 48010 28847 -49334 -72842 -75352 -130346 -124697 -83896 -37229 -34775 -11245 86335
$$ packed form
12172g0759M6717J19172k6178o4935J295J3398J5252Q813q2598q727J7673L4209
12160C332O6888k9944q2741M750K9609M1873K1964j1938M7316J1569j3184q4382
12148E112j2167l4454l8688J885k7312L4621M4771M189M588r337J9708J5686L976
12135A2578N4611Q076o5438m5662J5422Q637J6277O40r547j0002N6277m4394k7816
12122c0341k671l9144J7206J1865O9293j7414M505j5794K811J9799k6018m0332
12110d6235j6272L5222q655k7653M850P398k3031J5182O5916l9252n0618J7305
12098f5843k344j9747K1613N7739L3981l5827m1138L0834O5754l7679l0017L2047
12086I373L8637j9163p8181k3508k510n4994N649M0801M6667K454K3530R7580
$$ plain form
12074 86335 81646 50558 26950 9663 17263 -21198 -17992 47266 25798 -30552 -38819 -105379
12062 -105379 -97046 20256 33951 -70117 -86272 -70237 -33843 -2059 -27492 36344 84892
12051 84892 69568 30552 12576 34927 50742 36159 6589 -4690 13699 -9232 14819 54347
12039 54347 68119 -26089 -53584 -26642 37165 29037 42297 32526 -6304 13411 26757 -13304
12027 -13304 -59326 -110607 -149290 -96690 -78520 -34065 -63851 -114515 -127632 -59353 -13707 -42623
12015 -42623 -15836 26477 44905 45653 13200 4039 -1064 -74560 -82418 -56781 -33924 -11703 50738
12002 50738 14382 -62621 -60561 -29149 -56513 -56237 -52503 -31203 -34900 13015 95383 42010 -50008
11989 -50008 -101986 -25665 -7277 26261 53350 24986 -30842 -5347 1110 -30459 -19224 1169
$$ packed form
12074H6335m689l1088k3608j7287P600l8461L206O5258k1468n6350q267o6560
12062a05379Q333J17302J3695j04068j6155J6035L6394L1784k5433O3836M8548
12051H4892j5324l9016j7976K2351J5815j4583k9570j1279J8389k2931K4051L9528
12039E4347J3772r4208k7495K6942O3807q128J3260r771l8830J9715J3346m0061
12027a3304m6022n1281l8683N2600J8170M4455k9786n0664j3117O8279M5646k8916
12015d2623K6787M2313J8428P48l2453r161n103p3496p858K5637K2857K2221O2441
12002E0738l6356p7003K060L1412k7364K76L734K1300l697M7915Q2368n3373r2018
11989e0008n1978P6321J8388L3538K7089k8364n5828K5495O457l1569J1235K0393
$$ plain form
11977 1169 -12338 -36923 -51330 -17123 -18999 -21478 -39393 21217 18905 17485 41104 24531 -17455
11964 -17455 -51304 -26389 -12691 -13219 -41318 -20475 34351 -22493 -14371 17585 -33657 -29969
11952 -29969 -58265 8856 46578 -3951 -53143 -19472 -20818 -14743 23393 24999 9724 -2372
11940 -2372 -60381 -92553 -37361 32619 33839 6644 -41596 -45255 -64415 -97758 -52260 13891
11928 13891 6057 -22902 -29243 4784 -8976 -8835 9397 35565 49845 -20797 -48217 -66345
11916 -66345 -25116 51368 -14324 -64615 -94252 -99711 -60552 -21129 -69140 -80389 -73695 -6923
11904 -6923 -22003 -107758 -113990 -73935 -18773 24845 -15104 -48460 -52085 -70324 -67372 -47949
11892 -47949 -15627 39346 31048 47499 -5414 -66529 -87318 -40635 -13630 -27674 -43027 -40300
$$ packed form
11977A169j3507k4585j4407L4207j876k479j7915O0610k312j420K3619j6573m1986
11964a7455l3849K4915J3698n28k8099K0843N4826n6844Q122L1956n1242L688
11952b9969k8296O7121L7722n0529m9192L3671j346O075L8136J606j5275j2096
11940b372n8009l2172N5192O9980J220k7195m8240l659j9160l3343M5498O6151
11928A3891p834k8959o341L4027j3760J41J8232K6168J4280p0642k7420j8128
11916f6345M1229P6484o5692n0291k9637n459L9159L9423m8011j1249O694O6772
11904f923j5080q5755o232M0055N5162M3618l9949l3356l625j8239K952J9423
11892d7949L2322N4973q298J6451n2913o1115k0789M6683K7005j4044j5353K727
$$ plain form
11880 -40300 26967 94978 56107 31193 22920 19595 -25769 -30056 -21261 -65281 -52693 1818
11868 1818 15188 -13684 -9520 53157 76736 54726 43213 45741 -12616 -53810 -39525 -53075
11856 -53075 -48662 -31041 11127 27793 12808 47329 35336 12598 28676 15392 -17029 -422
11844 -422 33240 49908 25641 -39216 1112 16692 38787 15289 4057 -25303 -53102 -40594
11832 -40594 -50934 -40631 9086 -52159 -13180 -52020 -64817 -32376 19763 23296 -19360 -24778
11820 -24778 -125041 -89327 -18466 49652 24477 -32985 -67778 -18175 -8588 -44543 -42807 -25746
11808 -25746 -22206 -28726 -1634 41632 48324 60090 82860 47918 -67554 -75298 -99149 -76459
11796 -76459 -12933 40225 29191 15640 -28623 -104545 -89195 -21518 14899 -49813 -103044 -74997
$$ packed form
11880d0300O7267O8011l8871k4914q273l325m5364m287Q795m4020J2588N4511
11868A818J3370k8872M164O2677K3579k2010j1513K528n8357m1194J4285j3550
11856e3075M413J7621M2168J6666j4985L4521j1993k2738J6078j3284l2421J6607
11844d22L3662J6668k4267o4857M0328J5580K2095k3498j1232k9360k7799J2508
11832d0594j0340J0303M9717o1245L8979l8840j2797L2441N2139L533m2656n418
11820b4778j00263L5714P0861O8118k5175n7462l4793M9603R587l5955J736J7061
11808b5746L540o520K7092M3266O692J1766K2770l4942j15472p744k3851K2690
11796g6459O3526N3158j1034j3551m4263p5922J5350O7677L6417o4712n3231K8047
$$ plain form
11784 -74997 -102540 -71679 7429 67173 40177 25576 5614 -72272 -83728 -74510 -37029 -45763
11772 -45763 -105779 -107445 -60948 -64868 -105633 -98751 -70898 -34479 1131 57975 104810 83244
11760 83244 68177 66853 23729 26192 66474 35201 45712 41246 31291 22600 31855 42580 -3710
11747 -3710 -17046 -60010 -67406 -25628 -6232 -44328 -65445 -43313 19370 74023 41915 -45505
11735 -45505 -43331 -34063 -68218 -38065 17058 44781 65303 52528 51592 20631 -16692 -24200 -35189
11722 -35189 -27792 -16027 -35632 -4166 62893 41487 22699 11244 36585 -27512 -18649 63087
11710 63087 92185 94729 38177 -3953 -37266 584 7700 -2589 -23240 -39565 -4274 2529
11698 2529 21790 1628 -51880 -85751 -77175 -32711 56505 93007 38996 -43728 -44462 8683
$$ packed form
11784g4997k7543L0861P9108N9744k6996j4601j9962p7886j1456R218L7481q734
11772d5763o0016j666M6497l920m0765O882K7853L6419L5610N6844M6835k1566
11760H3244j5067j324m3124K463M0282l1273J0511m466r955q691R255J0725m6290
11747c710j3336m2964p396M1778J9396l8096k1117K2132O2683N4653l2108q7420
11735d5505K174R268l4155L0153N5123K7723K0522j2775r36l0961l7323p508j0989
11722c5189P397J1765j9605L1466O7059k1406j8788j1455K5341o4097Q863Q1736
11710F3087K9098K544n6552m2130l3313L7850P116j0289k0651j6325L5291O803
11698B529J9261k0162n3508l3871Q576M4464Q9216L6502n4011q2724p34N3145
$$ plain form
11686 8683 -10511 -38246 42783 51407 37113 -2530 4626 3476 -29443 11156 22295 74636
11674 74636 90352 113012 78478 -26270 -35316 17124 61434 73032 50042 26024 2056 -22468
11662 -22468 -21796 17822 56345 35466 -23518 -25299 86182 106848 46737 23962 59141 114891
11650 114891 75898 44866 23521 16159 29587 56275 -13139 -48048 -50181 -31772 -17565 14168
11638 14168 -9047 -42541 -22631 -20415 -44791 -50281 -24052 -2808 18881 12772 -38334 -20982
11626 -20982 -62132 -80416 -96938 -50602 45479 81190 43368 6033 8807 34185 5825 -345
11614 -345 2357 24274 22311 26202 60139 13151 -20298 -56824 -62316 -11794 25233 53832 95883
11601 95883 45361 2400 71084 115371 41058 -16142 -34892 -84090 -96831 -103298 -55870 -38089
$$ packed form
11686H683j9194k7735Q1029Q624j4294l9643P156j150l2919M0599J1139N2341
11674G4636J5716K2660l4534j04748r046N2440M4310J1598k2990k4018k3968k4524
11662b2468O72L9618L8523k0879n8984j781J11481K0666o0111k2775L5179N5750
11650A14891l8993l1032k1345p362J3428K6688o9414l4909k133J8409J4207L1733
11638A4168k3215l3494J9910K216k4376n490K6229K1244K1689o109n1106J7352
11626b0982m1150j8284j6522M6336R6081L5711l7822l7335K774K5378k8360o170
11614c45K702K1917j963L891L3937m6988l3449l6526n492N0522L7027K8599M2051
11601I5883n0522m2961O8684M4287p4313n7200j8750m9198j2741o467M7428J7781
$$ plain form
11589 -38089 -80897 -95478 -37458 55117 60750 55149 37217 1735 52838 68422 19198 -6230
11577 -6230 2678 13285 24272 -9444 -8949 -16189 1160 53873 74565 47430 28698 -9608 -30045
11564 -30045 2969 30002 23731 61694 7601 -50819 -46167 -80657 -137243 -77492 -41197 -35963
11552 -35963 -27953 -12029 -20820 7916 82364 54125 -3176 -5325 -28720 -47963 -50848 -53520 -56931
11539 -56931 -48412 -56579 -19240 -28978 30536 61751 68136 67009 14756 26167 47374 80530 61311
11526 61311 -22882 -6005 45054 66574 70770 35984 37737 -3421 -8022 -20712 -86498 -124632
11514 -124632 -131640 -116551 -36378 26816 49756 -1611 -73815 -63796 -96329 -78509 -27240 -23518
11502 -23518 -36635 -52822 -97462 -93970 -64782 -51702 -59301 -44592 6032 32670 -396 -51829
$$ packed form
11589c8089m2808j4581N8020R2575N633n601j7932l5482N1103J5584m9224k5428
11577f230Q908J0607J0987l3716M95p240J7349N2713K0692k7135j8732l8306k0437
11564c0045L3014K7033o271L7963n4093n8420M652l4490n6586N9751L6295N234
11552c5963Q010J5924q791K8736P4448k8239n7301k149k3395j9243k885k672l411
11539e6931Q519q167L7339r738N9514L1215O385j127n2253J1411K1207L3156j9219
11526F1311q4193J6877N1059K1520M196l4786J753m1158m601j2690o5786l8134
11514a24632p008J5089Q0173O3194K2940n1367p2204J0019l2533J7820N1269L722
11502b3518j3117j6187m4640L492K9188J3080p599J4709N0624K6638l3066n1433
$$ plain form
11490 -51829 -105624 -89152 -65857 -70830 -49008 -26214 6020 -16365 6123 62702 49914 32168
11478 32168 -38555 -72136 -63896 -62708 -29980 -519 31003 59910 35920 22322 35179 -7792
11466 -7792 26477 8682 -47193 -61815 -41910 -41147 -74752 -38494 -26122 -41150 -66457 -94384
11454 -94384 -54622 14418 49863 14058 -27462 -25424 21849 24619 -11010 -4776 -19854 -39641
11442 -39641 -43872 40391 67422 45565 -45142 -71506 -80177 -39506 -12576 -7199 -35810 -50390
11430 -50390 7308 13948 -17967 -37857 -75350 -68811 -87391 -123181 -109271 -36403 -8300 -24172
11418 -24172 -479 48862 71244 46515 36440 3392 -26921 -34904 -64074 -57378 -27619 -52026
11406 -52026 -74055 -102219 -26928 -9388 32351 48289 78291 81335 41003 22075 24146 -1188
$$ packed form
11490e1829n3795J6472K3295m973K1822K2794L2234k2385K2488N6579j2788j7746
11478C2168p0723l3581Q240J188L2728K9461L1522K8907k3990j3598J2857m2971
11466g792L4269j7795n5875j4622J9905P63l3605L6258J2372j5028k5307k7927
11454i4384L9762O9040L5445l5805m1520K038M7273K770l5629O234j5078j9787
11442c9641m231Q4263K7031k1857r0707k6364q671M0671K6930N377k8611j4580
11430e0390N7698O640l1915j9890l7493O539j8580l5790J3910P2868K8103j5872
11418b4172K3693M9341K2382k4729j0075l3048l0313p983k9170O696K9759k4407
11406e2026k2029k8164P5291J7540M1739J5938L0002L044m0332j8928K071k5334
$$ plain form
11394 -1188 -1666 62773 106770 66960 13765 90 34580 20552 12029 -21733 -68136 -76583 -98197
11381 -98197 -134343 -138783 -133732 -149210 -128023 -106698 -123559 -80779 -36979 -22217 -46722 -23497
11369 -23497 4595 17471 39938 32072 28465 73845 38056 -23126 -507 44539 45913 40869
11357 40869 39213 -3358 -18602 -11095 29725 130184 109624 -11848 -5821 27540 -17041 -6788
11345 -6788 88056 180567 158660 106351 91152 34675 -25126 -37619 -119 71761 80411 23752
11333 23752 -18164 26587 129879 132291 134643 141384 197864 170057 66960 -15414 5216 88471
11321 88471 50406 -17936 -51767 -44542 -20808 15649 -7919 -80413 -151036 -110501 16513 57726
11309 57726 9320 -11651 -22109 -31296 -70405 -95382 -64102 -26659 -7232 15149 64010 56335
$$ packed form
11394a188m78O4439M3997l9810n3195j3675L4490j4028q523l3762m6403q447k1614
11381i8197l6146m440N051j5478K1187K1325j6861M2780M3800J4762k4505K3225
11369b3497K8092J2876K2467p866l607M5380l5789o1182K2619M5046J374n044
11357D0869j656m2571j5244P507M0820J00459k0560j21472O027L3361m4581J0253
11345f788R4844R2511k1907n2309j5199n6477n9801j2493L7500P1880Q650n6659
11333B3752m1916M4751J03292K412K352O741N6480k7807j03097q2374K0630Q3255
11321H8471l8065o8342l3831P225K3734L6457k3568p2494p0623M0535J27014M1213
11309E7726m8406k0971j0458r187l9109k4977L1280L7443J9427K2381M8861p675
$$ plain form
11297 56335 -9890 13724 29720 26794 949 5382 6928 -18264 -91498 -49688 32068 89778
11285 89778 85365 77278 17817 -6241 11564 -11970 -31719 10479 23492 81429 109801 91186
11273 91186 138151 210566 302182 452155 720105 856009 765039 572699 391464 233798
11263 233798 189992 166788 127723 108769 116370 127365 132339 94029 38463 33648 45334 71834
11251 71834 87712 63878 27345 29350 58928 46953 29223 -27020 -74263 -2895 -6832 -28046
11239 -28046 -45155 -38684 8232 -3546 -16911 12000 73785 24010 -26425 -12472 -11457 36676
11227 36676 43910 47023 26119 27126 36655 -8410 -23492 -81463 -91780 -26711 -20516 -35553 -102631
11214 -102631 -103401 -74618 -8849 81725 82079 -5150 -35003 -31232 -39110 -29276 -74670 -76782 -129852
$$ packed form
11297E6335o6225K3614J5996k926k5845M433J546k5192p3234M1810Q1756N7710
11285H9778m413q087n9461k4058J7805k3534j9749M2198J3013N7937K8372j8615
11273I1186M6965P2415R1616J49973K67950J35904r0970j92340j81235j57666
11263B33798m3806k3204l9065j8954P601J0995M974l8310n5566m815J1686K6500
11251G1834J5878k3834l6533K005K9578j1975j7730n6243m7243P1368l937k1214
11239b8046j7109O471M6916j1778j3365K8911O1785m9775n0435J3953J015M8133
11227C6676P234L113k0904J007R529m5065j5082n7971j0317O5069O195j5037o7078
11214a02631p70K8783O5769R0574L54q7229k9853L771p878R834m5394k112n3070
$$ plain form
11201 -129852 -164350 -121314 -72056 -49948 -15015 17564 -38175 -58905 -6498 13414 3873 -57228
11189 -57228 -116067 -95960 -33078 -4612 31226 83057 43218 -3599 -30920 -87658 -123194 -35631
11177 -35631 24638 81832 52501 19574 24547 -14459 -76505 -40908 43517 147269 187023 122971
11165 122971 78591 4808 40516 59848 93973 16274 -64243 -14034 47082 95582 76837
11154 76837 74976 56264 3163 3496 8210 -10041 15672 98773 101192 56920 80682 112405 81240
11141 81240 59378 26826 14208 1683 -11032 -47789 9628 45878 19688 36203 138782
11130 138782 146634 116518 109504 137178 164941 207974 192732 134865 61739 108549 102127 39247
11118 39247 8141 -4975 28300 1389 -41253 -79332 -22416 49070 118343 171152 152965 155181
$$ packed form
11201a29852l4498M3036M9258K2108L4933L2579n5739k0730N2407J9912r541o1101
11189e7228n8839K0107O2882K8466L5838N1831l9839m6817k7321n6738l5536Q7563
11177c5631O0269N7194k9331l2927M973l9006o2046L5597Q4425J03752L9754o4052
11165A22971m4380p3783L5708J9332L4125p7699q0517N0209O1116M8500j8745
11154G6837j861j8712n3101L33M714j8251K5713Q3101K419m4272K3762L1723l1165
11141H1240k1862l2552j2618j2525j2715l6757N7417L6250k6190J6515J02579
11130A38782P852l0116p014K7674K7763M3033j5242n7867p3126M6810o422o2880
11118C9247l1106j3116L3275k6911m2642l8079N6916P1486O9273N2809j8187K216
$$ plain form
11106 155181 138188 116001 107695 114532 141614 118949 79348 73696 22048 -24763 24736 55842
11094 55842 1509 2039 7356 1194 32121 29574 -54105 -80490 -20310 8594 12798 32484 47033
11081 47033 87144 110884 125643 152596 167063 93080 88812 41064 102617 122232 98408 74941
11069 74941 69074 40408 4559 -40598 -62593 -124065 -169611 -211561 -217977 -286684 -408304 -421748
11057 -421748 -379041 -397395 -330609 -221362 -13765 205601 305815 354170 335987 271787 209890
11046 209890 178159 142008 122659 108268 88227 131990 150164 124858 117194 115482 11779 -56415
11034 -56415 -40863 -33542 -45818 -67063 -57795 -32461 -25909 -40926 -63192 -143331 -157305 -133257
11022 -133257 -34403 196270 487708 636146 620564 545673 479223 440916 371432 342550 340903
$$ packed form
11106A55181j6993k2187q306O837K7082k2665l9601n652n1648m6811M9499L1106
11094E5842n4333N30N317o162L0927k547q3679k6385O0180K8904M204J9686J4549
11081D7033M0111K3740J4759K6953J4467p3983m268m7748O1553J9615k3824k3467
11069G4941n867k8666l5849m5157k1995o1472m5546m1950o416o8707j21620j3444
11057d21748M2707j8354O6786J09247K07597K19366J00214M8355j8183o4200o1897
11046B09890l1731l6151j9349j4391k0041M3763J8174k5306p664j712j03703o8194
11034e6415J5552P321j2276k1245R268K5334O552j5017k2266q0139j3974K4048
11022a33257R8854K30673K91438J48438j5582p4891o6450l8307o9484k8882j647
$$ plain form
11011 340903 253754 192083 132957 167688 189096 184000 174376 204011 142646 102676 166930 223678
10999 223678 222423 226188 161929 164738 146354 78132 -63010 -361074 -629108 -716372 -617479
10988 -617479 -468045 -273338 -113366 -66993 24085 51090 90022 94802 77399 141913 253567
10977 253567 228777 196242 211212 201293 212506 180598 162359 161379 162863 87165 131193 113637
10965 113637 74105 141189 129451 91084 89402 117115 165112 232051 282335 325742 319385 296059
10953 296059 276851 308850 301955 258113 251506 199206 178671 250408 271376 238571 194368 222865
10941 222865 257227 262543 243101 166620 154645 171756 226952 224362 228289 228479 207281 278024
10929 278024 346961 355153 358159 378052 393035 431692 429113 431264 445501 424733 375007 373191
$$ packed form
11011C40903q7149o1671n9126L4731K1408n096r624K9635o1365l9970O4254N6748
10999B23678j255L765o4259K809j8384o8222j41142k98064k68034q7264R8893
10988f17479J49434J94707J59972M6373R1078K7005L8932M780j7403O4514J11654
10977B53567k4790l2535J4970r919J1213l1908j8239r80J484p5698M4028j7556
10965A13637l9532O7084j1738l8367j682K7713M7997O6939N0284M3407o357k3326
10953B96059j9208L1999o895m3842o607n2300k0535P1737K0968l2805m4203K8497
10941B22865L4362N316j9442p6481j1975J7111N5196k590L927J90k1198P0743
10929B78024O8937Q192L006J9893J4983L8657k579K151J4237k0768m9726j816
$$ plain form
10917 373191 409079 443211 493462 477208 451420 461580 509582 485131 489979 519022 518247 581723
10905 581723 711421 757835 834278 941890 940016 848523 743247 711877 719349 786358 943449
10894 943449 1171851 1294638 1312089 1301880 1290089 1336018 1536637 1901607 2319457 2572988
10884 2572988 2704115 2799832 2917940 3118928 3545671 4183571 4985635 5702055 6361808 7222417
10874 7222417 8570117 10399122 13010038 16930124 23120462 33179219 50537774 80880600
10866 80880600 125596444 155497915 149974113 113082423 74458911 49946660 35243125
10859 35243125 26034446 20121129 16204623 13482662 11541665 10018890 8848237 7887245
10851 7887245 7024930 6115317 5284975 4595123 4070473 3790878 3750245 3848397 3828671 3607947
$$ packed form
10917C73191L5888L4132N0251j6254k5788J0160M8002k4451M848K9043p75O3476
10905E81723J29698M6414P6443J07612j874r1493j05276l1370P472O7009J57091
10894I43449K28402J22787J7451j0209j1791M5929K00619L64970M17850K53531
10884B572988J31127R5717J18108K00988M26743O37900Q02064P16420O59753Q60609
10874G222417J347700J829005K610916L920086O190338J0058757J7358555L0342826
10866H0880600M4715844K9901471n523802l6891690l8623512k4512251j4703535
10859C5243125r208679n913317l916506k721961j940997j522775j170653r60992
10851G887245q62315r09613q30342o89852n24650k79595m0633R8152j9726k20724
$$ plain form
10841 3607947 3196815 2764351 2354937 1913464 1549435 1307203 1302348 1312593 1319857 1265532
10831 1265532 1164656 1037188 911418 754368 679387 578232 514174 593484 644567 579453
10821 579453 532965 462039 471074 446573 396467 376745 348653 301142 269943 274138 249590 274828
10809 274828 293614 329652 310661 211664 55679 9053 32928 39843 83017 143167 174966
10798 174966 154659 86972 31935 64360 93126 153345 140884 165679 121295 85808 144450
10787 144450 121283 80728 83013 85595 32058 10978 -50311 -97882 -152867 -173428 -152922 -109673
10775 -109673 -108453 -89755 -63828 -37022 11505 89118 49860 54819 110298 100815 80592 20289
10763 20289 6227 53433 51312 20396 -5036 -59771 -83647 -76213 -46057 -44853 -14436 -11505
$$ packed form
10841C607947m11132m32464m09414m41473l64029k42232m855J0245P264n4325
10831A265532j00876j27468j25770j57050p4981j01155o4058P9310N1083o5114
10821E79453m6488p0926R035k4501n0106j9722k8092m7511l1199M195k4548K5238
10809B74828J8786L6038j8991r8997j55985m6626K3875O915M3174O0150L1799
10798A74966k0307o7687n5037L2425K8766O0219j2461K4795m4384l5487N8642
10787A44450k3167m0555K285K582n3537k1080o1289m7571n4985k0561K0506M3249
10775a09673J220J8698K5927K6806M8527P7613l9258M959N5479r483k0223o0303
10763B0289j4062M7206k121l0916k5432n4735k3876P434L0156J204L0417K931
$$ plain form
10751 -11505 -5850 12583 -25621 33621 48429 44414 97948 131975 141101 206670 377362 567948
10739 567948 635038 646897 482838 264642 101586 40948 3665 -24380 36374 8410 -37558
10728 -37558 -50842 -93517 -69430 -92772 -119028 -183162 -227160 -220074 -189567 -211723 -246123 -287684
10716 -287684 -348905 -363795 -403935 -472351 -543150 -596676 -585333 -402267 -109883 102320 238218
10705 238218 248675 231389 210112 218763 170392 162575 170642 187875 211548 87332 9823 35184
10693 35184 89219 99272 106676 28910 -17332 -57536 -74906 -128673 -149405 -162736 -166262 -143202
10681 -143202 -189446 -274367 -280185 -227664 -136080 -413 214780 391048 479480 462405 383202
10670 383202 290174 230203 188704 214420 233039 223094 214904 174295 102625 88370 108160 107710
$$ packed form
10751a1505N655J8433l8204N9242J4808m015N3534L4027R126O5569J70692J90586
10739E67948O7090J1859j64059k18196j63056o0638l7283k8045O0754k7964m5968
10728c7558j3284m2675K4087k3342k6256o4134m3998P086L0507k2156l4400m1561
10716b87684o1221j4890m0140o8416p0799n3526J1343J83066K92384K12203J35898
10705B38218J0457j7286k1277Q651m8371p817Q067J7233K3673j24216p7509K5361
10693C5184N4035J0053P404p7766m6242m0204j7370n3767k0732j3331l526K3060
10681a43202m6244q4921n818N2521R1584J35667K15193J76268Q8432j7075p9203
10670C83202r3028n9971m1499K5716J8619r945q190m0609p1670j4255J9790m50
$$ plain form
10658 107710 89730 86892 20985 -15541 -48307 -37132 -70301 -65080 -107362 -104677 -132909 -116057
10646 -116057 -80040 18336 67853 62831 53015 69123 -43857 -70645 -46716 -71281 -73219 -56241
10634 -56241 -51541 -89747 -59728 -1886 38106 12629 -39988 4593 94721 119018 82190 128842
10622 128842 157278 115167 104443 70764 42917 33822 42177 85365 56204 30323 -8907 -59774
10610 -59774 -78381 -55313 50481 114842 90981 84877 93812 129348 98710 43709 91033 131313
10598 131313 118111 37845 -8746 -3553 26504 86996 93948 76125 59985 112731 133292 87731
10586 87731 56402 95569 42764 32266 72995 69435 58281 41790 867 -34613 -29374 -13671
10574 -13671 6644 28845 49857 75464 34123 -8651 -58172 -43783 14771 60365 18407 -37787
$$ packed form
10658A07710j7980k838o5907l6526l2766J1175l3169N221m2282K685k8232J6852
10646a16057L6017R8376M9517n022r816J6108j12980k6788K3929k4565j938J6978
10634e6241M700l8206L0019N7842L9992k5477n2617M4581R0128K4297l6828M6652
10622A28842K8436m2111j0724l3679k7847r095Q355M3188k9161k5881l9230n0867
10610e9774j8607K3068J05794O4361k3861o104Q935L5536l0638n5001M7324M0280
10598A31313j3202q0266m6591N193L0057O0492O952j7823j6140N2746K0561m5561
10586H7731l1329L9167n2805j0498M0729l560j1154j6491m0923l5480N239J5703
10574a3671K0315K2201K1012K5607m1341m2774m9521J4389N8554M5594m1958n6194
$$ plain form
10562 -37787 -55742 -74205 -81697 -59212 -4140 -10103 -81011 -68864 -70519 -78319 -17595 76849
10550 76849 103859 112897 76102 15231 23053 -28404 -76371 -99169 -89386 -67335 -30096 -2193
10538 -2193 21507 -39202 -7908 50351 48079 -5068 46055 60334 58771 63372 5808 -7525
10526 -7525 -11764 -15610 3351 -7657 14749 73820 75797 38938 22203 -49898 -100664 -48724
10514 -48724 35042 87508 55135 74110 47684 -10134 -56862 -39760 36925 93117 57565 60202
10502 60202 65154 9103 -1031 -52024 -24756 -8414 -8073 -17829 -4286 22481 16753 36856 -17302
10489 -17302 -118287 -181593 -119254 -64504 -31407 -12362 2946 -18275 -3352 14209 -14712
10478 -14712 -11601 6217 63307 71756 16321 -14935 -40746 -49235 -52983 -76735 -60252 -122837
$$ packed form
10562c7787j7955j8463p492K2485N5072n963p0908J2147j655p800O0724R4444
10550G6849K7010R038l6795o0871P822n1457m7967k2798R783K2051L7239K7903
10538b193K3700o0709L1294N8259k272n3147N1123J4279j563M601n7564j3333
10526g525m239l846J8961j1008K2406N9071J977l6859j6735p2101n0766N1940
10514d8724Q3766N2466l2373J8975k6426n7818m6728J7102P6685N6192l5552K637
10502F0202M952n6051j0134n0993K7268J6342L41r756J3543K6767n728K0103n4158
10489a7302j00985o3306O2339N4750L3097J9045J5308k1221J4923J7561k8921
10478a4712L111J7818N7090Q449n5435l1256k5811q489l748k3752J6483o2585
$$ plain form
10466 -122837 -121767 -31035 45112 55725 75388 131201 227527 350000 564186 747099 770481
10455 770481 671406 488550 363885 217715 188026 205689 164902 130088 95510 40927 -44141
10444 -44141 14332 24333 -10999 -31163 -55962 -36223 -24190 -10275 -18934 -14091 -12174 2666
10432 2666 9545 -14446 58740 90093 93929 124432 81395 13949 -24518 -25480 1112 38819 -7665
10419 -7665 -1201 -11322 -14831 32239 53236 115203 78916 45256 51732 -4834 -29721 25560
10407 25560 68310 113244 77189 -12732 -42385 -65704 -76329 -39988 -14447 -25034 -75297 -60572
10395 -60572 -47706 -50628 18247 69172 27328 -25683 -25188 -21691 6994 -14840 12733 68214
10383 68214 72252 70865 -12119 -53802 -87372 -45100 -6667 75644 22889 -19435 -32473 -39314
$$ packed form
10466a22837J070R0732P6147J0613J9663N5813R6326J22473K14186J82913K3382
10455G70481r9075j82856j24665j46170k9689J7663m0787l4814l4578n4583q5068
10444d4141N8473J0001l5332k0164k4799J9739J2033J3915q659M843J917J4840
10432B666O879k3991P3186L1353L836L0503m3037o7446l8467r62K6592L7707m6484
10419g665O464j0121l509M7070K0997O1967l6287l3660O476n6566k4887N5281
10407B5560M2750M4934l6055q9921k9653k3319j0625L6341K5541j0587n0263J4725
10395f0572J2866k922O8875N0925m1844n3011M95L497K8685k1834K7573N5481
10383F8214M038j387q2984m1683l3570M2272L8433Q2311n2755m2324j3038o841
$$ plain form
10371 -39314 -20661 6801 37698 64974 26653 3603 -30004 -68740 -34071 -47299 -71871 -53343
10359 -53343 406 64465 66485 91175 130982 130393 61092 25995 28860 37556 37252 58461 49326
10346 49326 48538 60797 84193 66452 54350 85275 103067 85332 133634 205442 206362 177937
10334 177937 109846 102089 195867 168485 71845 62554 102433 74151 23023 17230 25218 8072
10322 8072 6459 -12277 23058 35748 49454 76533 57681 29096 75488 102591 -17823 -73047
10310 -73047 -23572 5151 19229 75764 23545 -2030 5694 21915 75276 27370 37714 95294
10298 95294 110837 134976 96303 34365 4972 -42757 -17677 -12897 8601 4729 24873 32074
10286 32074 58431 42205 41621 -3310 -39221 -38158 17110 76855 86220 97913 119460 101580
$$ packed form
10371c9314J8653K7462L0897K7276l8321k3050l3607l8736L4669j3228k4572J8528
10359e3343N3749O4059K020K4690L9807n89o9301l5097K865Q696l04K1209r135
10346D9326p88J2259K3396j7741j2102L0925J7792j7735M8302P1808R20k8425
10334A77937o8091p757R3778k7382r6640r291L9879k8282n1128n793P988j7146
10322H072j613j8736L5335J2690J3706K7079j8852k8585M6392K7103j20414n5224
10310g3047M9475K8723J4078N6535n2219k5575P724J6221N3361m7906J0344N7580
10298I5294J5543K4139l8673o1938k9393m7729K5080M780K1498l872K0144P201
10286C2074K6357j6226n84m4931l5911J063N5268N9745R365J1693K1547j7880
$$ plain form
10274 101580 47605 9489 -4146 -12552 1311 -18761 27730 -40476 -85843 -131659 -124100 -98756
10262 -98756 -40497 -25575 -47556 -29118 -52341 -70577 30637 88744 112056 116792 104166 132510
10250 132510 109219 121941 100156 70552 19847 21250 38077 50642 22307 -17155 31170 105182
10238 105182 43013 29508 28061 12288 26254 116002 118620 28688 -42703 -26947 -52860 -68672
10226 -68672 -49578 -24612 -106000 -56041 -15552 49773 24939 10663 55876 44935 41927 3499
10214 3499 -16141 27471 879 -51027 -43598 -397 -12981 -48673 -57261 -44785 -20569 -2100
10202 -2100 -18209 -35550 -67222 -67199 -22028 -23661 -5537 32817 20751 -14927 -8179 23718 33909
10189 33909 86200 89225 64340 -12212 -59831 -10124 18708 -18993 24578 3634 -45904 -30611
$$ packed form
10274A01580n3975l8116j3635q406J3863k0072M6491o8206m5367m5816P559K5344
10262i8756N8259J4922k1981J8438k3223j8236J01214N8107K3312M736j2626K8344
10250A32510k3291J2722k1785k9604n0705J403J6827J2565k8335l9462M8325P4012
10238A05182o2169j3505j447j5773J3966Q9748K618q9932p1391J5756k5913j5812
10226f8672J9094K4966q1388M9959M0489O5325k4834j4276M5213j0941l008l8428
10214C499j9640M3612k6592n1906P429M3201j2584l5692q588J2476K4216J8469
10202b100j6109j7341l1672K3M5171j633J8124L8354j2066l5678O748L1897J0191
10189C3909N2291L025k4885p6552m7619M9707K8832l7701M3571k0944m9538J5293
$$ plain form
10177 -30611 322 26853 31225 14884 -27788 -9808 -17511 35545 -14262 -13633 18341 463
10165 463 6343 167 -24053 -38997 -7842 43889 10919 -66187 -81804 -114128 -88540 -30246
10153 -30246 -3497 59107 11323 -48947 -21165 10109 18291 21625 15665 16189 17860 -16207 -59278
10140 -59278 7140 53806 25429 37446 8682 -23813 -46125 15113 59413 -25137 9953 76932
10128 76932 84670 29146 -4209 -5595 -17149 -33153 -18813 85449 24424 -96355 -2731 76880
10116 76880 142980 162466 189193 190849 115236 50228 17066 27357 33719 -11056 -77490 -148433
10104 -148433 -171583 -136882 -79860 -31349 -74119 -105463 -85848 -60728 -38058 33147 53558
10093 53558 -10391 -30236 -16648 5208 33605 -13819 9981 92574 117615 105081 70381 78616
$$ packed form
10177c0611L0933K6531M372j6341m2672J7980p703N3056m9807O29L1974j7878
10165D63N880o176k4220j4944L1155N1731l2970p7106j5617l2324K5588N8294
10153c0246K6749O2604m7784o0270K7782L1274Q182L334n960N24J671l4067m3071
10140e9278O6418M6666k8377J2017k8764l2495k2312O1238M4300q4550L5090O6979
10128G6932P738n5524l3355j386j1554j6004J4340J04262o1025j20779R3624P9611
10116G6880O6100J9486K6727J656p5613o5008l3162J0291O362m4775o6434p0943
10104a48433k3150L4701N7022M8511m2770l1344J9615K5120K2670P1205K0411
10093E3558o3949j9845J3588K1856K8397m7424K3800Q2593K5041j2534l4700Q235
$$ plain form
10081 78616 85959 14532 -17909 -48219 -115312 -153133 -66825 -19435 -14879 4702 28301 64557
10069 64557 102913 78519 -3389 -44514 -20157 -15413 -42472 -60853 -20043 -20281 -4459 -8634
10057 -8634 -53349 36951 78071 9702 4219 62273 16509 -26266 -52029 -59389 -39220 -17075
10045 -17075 -14316 -51444 -27452 -22330 1310 -61679 -82954 -64694 16947 45554 -24577 -74077
10033 -74077 -63041 -47276 -68026 -2267 96052 76023 68209 -12024 -43231 -30173 -16730 -7925
10021 -7925 54661 26540 -17120 -8516 62154 68810 40649 -17676 -6612 829 46145 36965 -60218
10008 -60218 -97933 -81729 -35288 16985 50315 93973 56316 18235 9731 -18883 -79304 -70234
9996 -70234 -14339 28913 38020 30653 32311 50098 36815 6507 9941 -1391 10472 34343 37613
$$ packed form
10081G8616P343p1427l2441l0310o7093l7821Q6308M7390M556J9581K3599L6256
10069F4557L8356k4394q1908m1125K4357M744k7059j8381M0810k38J5822m175
10057h634m4715R0300M1120o8369n483N8054m5764m2775k5763p360K0169K2145
10045a7075K759l7128K3992N122K3640o2989k1275J8260Q1641K8607p0131m9500
10033g4077J1036J5765k0750O5759R8319k0029p814q0233l1207J3058J3443Q805
10021g925O2586k8121m3660Q604P0670O656k8161n8325J1064P441M5316r180r7183
10008f0218l7715J6204M6441N2273L3330M3658l7657l8081q504k8614o0421R070
9996g0234N5895M3252R107p367J658J7787j3283l0308L434j1332J1863K3871L270
$$ plain form
9983 37613 60102 62746 50664 10773 -28644 -103596 -84322 -74474 -28088 -17005 1885 3932
9971 3932 -56023 -114249 -73483 -14285 18178 9051 22772 67629 30578 30452 64127 22460 -25627
9958 -25627 -40482 -9420 -1473 37752 19618 18968 2217 5650 11281 62846 123594 84150 28434
9945 28434 24021 -3732 -10860 -42625 7265 28170 -2235 -41757 -10076 30293 52363 64142
9933 64142 60509 69295 83653 75344 70947 76692 44859 14502 -6773 -65943 -53654 -27437 -56707
9920 -56707 -26154 3525 12606 53623 93788 97571 74952 66902 37460 17161 39260 58633
9908 58633 36046 4794 -37488 25293 45413 86129 35671 -7878 30600 62027 34928 22475
9896 22475 41898 -7244 4491 48097 77339 54490 61091 10477 -41592 850 87219 149274
$$ packed form
9983C7613K2489K644j2082l9891l9417p4952J9274R848M6386J1083J8890K047
9971C932n9955n8226M0766N9198L2463r127J3721M4857l7051j26L3675m1667m8087
9958b5627j4855L1062P947L9225j8134o50j6751L433N631N1565O0748l9444n5716
9945B8434m413k7753p128l1765M9890K0905l0405l9522L1681M0369K2070J1779
9933F4142l633Q786J4358q309m397N745l1833l0357k1275n9170J2289K6217k9270
9920e6707L0553K9679R081M1017M0165L783k2619q050k9442k0299K2099J9373
9908E8633k2587l1252m2282O2781K0120M0716n0458m3549L8478L1427k7099j2453
9896B2475J9423m9142J1735M3606K9242k2849O601n0614n2069M2442Q6369O2055
$$ plain form
9884 149274 156689 110128 113219 62127 -20730 -58642 -112429 -54400 -41101 -53377 -59812 -67960
9872 -67960 -5427 -2006 -18239 -32025 -47653 -10791 -24338 -37449 -27212 1272 -46651 -82155
9860 -82155 -78446 -71807 -67448 -1547 29600 20878 62320 133572 177799 83958 21858 36276 -6844
9847 -6844 10965 28712 28496 23925 34937 17017 62209 84058 75921 24676 60728 77596 -20593
9834 -20593 -85465 -84820 -93892 -69369 -43666 -94123 -136169 -130956 -79832 -48574 -8486 -27780 -49529
9821 -49529 -62759 -13028 -57704 -69230 213 76614 36942 -34395 -4791 3874 -14485 -12642
9809 -12642 -87834 -106269 -77298 7112 88473 95242 52113 56705 83819 68067 10254 -27235
9797 -27235 -32810 -21322 6793 7584 16969 26345 46732 116704 35576 -24400 -79574 -96161 -95326
$$ packed form
9884A49274P415m6561L091n1092q2857l7912n3787N8029J3299j2276o435q148
9872f7960O2533L421j6233j3786j5628L6862j3547j3111J0237K8484m7923l5504
9860h2155L709O639M359O5901L1147q722M1442P1252M4227r3841o2100J4418m3120
9847f844J7809J7747k16m571J1012j7920M5192K1849q137n1245L6052J6868r8189
9834b0593o4872O45r072K4523K5703n0457m2046N213N1124L1258M0088j9294k1749
9821d9529j3230M9731m4676j1526O9443P6401l9672p1337K9604Q665j8359J843
9809a2642p5192j8435K8971Q4410Q1361O769m3129M592K7114j5752n7813l7489
9797b7235n575J1488K8115P91R385R376K0387O9972q1128n9976n5174j6587Q35
$$ plain form
9784 -95326 -32227 54643 79286 62718 38234 -11120 -42377 -21829 -34321 -26905 -48831 -19754
9772 -19754 -34729 -51383 -8029 72820 61244 12694 30969 4167 -29733 -67701 -14196 25752
9760 25752 20762 1345 28080 56001 -445 -9561 -23766 -44356 -14331 5287 -39372 -34961
9748 -34961 -13732 -29776 -47385 -26514 -22853 -31869 26299 -1363 -60304 -83154 -6664 -36031
9736 -36031 -18707 29906 -55101 -41537 10179 48025 78753 80210 60218 93245 84731 38979
9724 38979 12121 50913 30696 21771 25372 109026 92539 72164 11610 2229 23731 46350
9712 46350 56845 42974 73273 57024 65015 163554 152506 96671 134342 113487 45757 6121
9700 6121 27253 42492 42772 37628 43549 56414 42426 -17400 -46187 -20950 28159 125461 190442
$$ packed form
9784i5326O3099Q6870K4643j6568k4484m9354l1257K0548j2492P416k1926K9077
9772a9754j4975j6654M3354Q0849j1576m8550J8275k6802l3900l7968N3505L9948
9760B5752m990j9417K6735K7921n6446r116j4205k0590L0025J9618m4659M411
9748c4961K1229j6044j7609K0871L661r016N8168k7662n8941k2850P6490k9367
9736c6031J7324M8613q5007J3564N1716L7846L0728J457j9992L3027q514m5752
9724C8979k6858L8792k0217q925L601Q3654j6487k0375o0554r381K1502K2619
9712D6350J0495j3871L0299j6249P991R8539j1048n5835L7671k0855o7730l9636
9700F121K1132J5239K80n144N921J2865j3988n9826k8787K5237M9109R7302O4981
$$ plain form
9687 190442 130970 118510 157453 128808 88502 78154 77661 60632 35626 54114 129500 117554
9675 117554 84818 35961 -24154 52903 113970 63476 46528 57849 47979 2375 44752 92939
9663 92939 61580 -30438 -40463 -2499 -26230 -66800 -16558 -19404 78508 134687 95095 50106
9651 50106 -3004 -14460 -4290 39656 33235 51530 71384 79491 27152 -21747 5449 19319
9639 19319 17485 9492 -7645 2477 -25888 -32446 -28441 -10706 33232 46305 58661 66566 25736
9626 25736 40836 51313 15820 46991 -1493 -11128 -15586 -2460 -26641 -72123 -37592 -56284
9614 -56284 10756 22450 24626 -24723 -47130 -38961 -49217 -61574 -20022 11253 2957 13544
9602 13544 20843 67904 44064 67024 64023 89685 89620 119903 89254 28974 36816 66301 49679
$$ packed form
9687A90442n9472j2460L8943k8645m0306j0348m93j7029k5006J8488P5386j1946
9675A17554l2736m8857o0115P7057O1067n0494j6948J1321r870m5604M2377M8187
9663I2939l1359r2018j0025L7964k3731m0570N0242k846R7912N6179l9592m4989
9651E0106n3110j1456J0170M3946o421J8295J9854Q107n2339m8899K7196J3870
9639A9319j834p993j7137J0122k8365o558M005J7735M3938J3073J2356P905m0830
9626B5736J5100J0477l5493L1171m8484r635m458J3126k4181m5482L4531j8692
9614e6284O7040J1694K176m9349k2407Q169j0256j2357M1552L1275q296J0587
9602A3544P299M7061k3840K2960l001K5662o5L0283l0649o0280P842K9485j6622
$$ plain form
9589 49679 37701 29707 438 -25438 27968 71096 103778 57783 43630 78524 75031 11859
9577 11859 27899 20927 57504 16119 -7660 192 11782 -38436 -5327 78944 125841 124717
9565 124717 99717 111479 53841 23537 54499 71458 65650 -2664 -64851 -128407 -143543 -120767
9553 -120767 -86518 -32249 -6321 -25582 -5692 53493 -3489 -70231 -37816 -60542 9877 111518
9541 111518 156989 93227 61005 111367 130371 111565 122464 182776 177305 144031 106341 63750
9529 63750 7638 25756 51507 37986 66105 57103 72321 55697 24726 36564 95898 138228
9517 138228 160526 149173 108055 117122 150307 108439 68493 63931 81355 55052 -6431 -12745
9505 -12745 79884 119925 148233 61463 36533 77813 17832 -25543 13470 35881 67283 54846
$$ packed form
9589D9679j1978p994k9269k5876N3406M3128L2682m5995j4153L4894l493o3172
9577A1859J6040o972L6577m1385k3779P852J1590n0218L3109Q4271M6897j124
9565A24717k5000J1762n7638l0304L0962J6959n808o8314o2187o3556j5136K2776
9553a20767L4249N4269K5928j9261J9890N9185n6982o6742L2415k2726P0419J01641
9541A11518M5471o3762l2222N0362J9004j8806J0899O0312n471l3274l7690m2591
9529F3750n6112J8118K5751j3521K8119r002J5218j6624l0971J1838N9334M2330
9517A38228K2298j1353m1118R067L3185m1868l9946m562J7424k6303o1483o314
9505a2745R2629M0041K8308q6770k4930M1280n9981m3375L9013K2411L1402j2437
$$ plain form
9493 54846 13979 43807 60845 47443 60862 93407 97268 107133 96069 69716 40009 41918
9481 41918 39451 42572 22094 21460 25824 38090 -7816 -52285 -5890 -46405 -48855 -44201 -6216
9468 -6216 21108 46802 43534 5745 11563 11393 44334 83365 130298 90906 54260 21024 7850
9455 7850 -28104 -38757 -15755 53476 111549 81746 15871 46507 49961 68317 104331 91417
9443 91417 33105 11323 -17250 -46974 -56643 -56094 -67525 -78530 -15043 44865 92527 109175
9431 109175 142672 91138 84635 19060 45444 -5690 -55497 -80089 -42243 2940 20540 -2528
9419 -2528 7791 31921 97032 95393 61872 22342 17024 21724 51180 93367 45550 34672 -39978
9406 -39978 -42282 -4563 29301 -1924 -11203 50190 101878 121813 128793 145733 99531 36362
$$ packed form
9493E4846m0867K9828J7038j3402J3419L2545L861R865j1064k6353k9707J909
9481D1918k467L121k0478o34M364J2266m5906m4469M6395m0515k450M654L7985
9468f216K7324K5694l268l7789N818j70L2941L9031M6933l9392l6646l3236j3174
9455G850l5954j0653K3002O9231N8073k9803o5875L0636L454J8356L6014j2914
9443I1417n8312k1782k8573k9724r669N49j1431j1005O3487N9908M7662J6648
9431A09175L3497n1534o503o5575K6384n1134m9807k4592L7846M5183J7600k3068
9419b528J0319K4130O5111j639l3521l9530n318M700K9456M2187m7817j0878p4650
9406c9978k304L7719L3864l1225r279O1393N1688J9935O980J6940m6202o3169
$$ plain form
9394 36362 -3349 -11967 -58197 -113639 -82773 3463 95399 50239 -38462 -59014 -25812 8679
9382 8679 -10564 88241 174130 173342 171720 123003 113839 46065 39059 49612 63288 69277 61705
9369 61705 78661 122358 144093 106826 111316 136231 109892 52766 12178 -2325 -24019 22811
9357 22811 47398 21969 -9043 -46319 -27409 -1912 -2551 35959 75661 76157 83932 41626 80538
9344 80538 150189 94117 790 -24842 -18397 -40695 -42707 -29621 -9973 -34286 -61059 -21833
9332 -21833 30774 23380 -37394 -25765 25025 62390 4394 -67255 -48322 6966 -21587 -88053
9320 -88053 -64050 -73017 -77791 -60171 13770 75454 95584 101688 138536 163408 112191 88705
9308 88705 57356 43977 104654 114458 111879 82829 36635 4389 -25483 -21327 60575 161720
$$ packed form
9394C6362l9711q618m6230n5442L0866Q6236R1936m5160q8701k0552L3202L4491
9382H679j9243R8805Q5889p88j622m8717r164o7774p006J0553J3676N989p572
9369F1705J6956M3697K1735l7267M490K4915k6339n7126m0588j4503k1694M6830
9357B2811K4587k5429l1012l7276J8910K5497o39L8510L9702M96P775m2306L8912
9344H0538O9651n6072r3327k5632O445k2298k012J3086J9648k4313k6773L9226
9332b1833N2607p394o0774J1629N0790L7365n7996p1649J8933N5288k8553o6466
9320h8053K4003q967m774J7620P3941O1684K0130O104L6848K4872n1217k3486
9308H8705l1349j3379O0677R804k579k9050m6194l2246k9872M156Q1902J01145
$$ plain form
9296 161720 215990 175069 139446 195839 230868 183238 143942 47044 -6379 8091 96086 143346
9284 143346 115211 91103 95449 112625 173390 197609 151494 85045 32328 -8286 61797 85275
9272 85275 78542 71656 67000 54096 102957 124175 108089 50059 59763 111410 141860 119408 92363
9259 92363 69458 30000 30454 58547 122529 145005 171096 142043 174227 185065 169654 53117
9247 53117 48466 161883 159616 106477 130831 222739 266557 273650 239862 158015 127736 112588
9235 112588 174258 188315 184816 245542 238108 262419 302503 303024 278163 284318 264924 269408 234758
9222 234758 214786 252595 245578 279156 331328 365058 342584 271376 253317 307731 355971 374321
9210 374321 330473 404267 485013 491013 581818 645361 787246 1072428 1424878 1883992 2436479
$$ packed form
9296A61720N4270m0921l5623N6393L5029m7630l9296r6898n3423J4470Q7995M7260
9284A43346k8135k4108M346J7176O0765K4219m6115o6449n2717m0614P0083K3478
9272H5275o733o886m656j2904M8861K1218j6086n8030R704N1647L0450k2452k7045
9259I2363k2905l9458M54K8093O3982K2476K6091k9053L2184J0838j5411j16537
9247E3117m651J13417k267n3139K4354R1908M3818P093l3788q1847l0279j5148
9235A12588O1670J4057l499O0726p434K4311M0084N21k4861O155j9394M484l4650
9222B34758j9972L7809p017L3578N2172L3730k2474p1208j8059N4414M8240J8350
9210C74321m3848P3794Q0746O000R0805O3543J41885K85182L52450M59114N52487
$$ plain form
9199 2436479 3231619 4360105 5889872 7709436 9034907 9186223 8043076 6381814 4854332
9190 4854332 3610464 2790902 2293802 1893681 1568992 1372378 1184779 1063580 954153
9181 954153 830027 711617 595234 618042 611789 542066 511550 455764 433952 491920 511540
9170 511540 517271 473878 465629 503238 490124 477216 522644 521257 600926 768768 922296 1073968
9158 1073968 1262070 1482375 1574359 1651445 1745531 1721358 1627405 1472016 1244419 1042061
9148 1042061 908104 701712 573191 509677 415313 325323 369238 415026 418101 403752 427281
9137 427281 361983 342847 344936 207129 132192 146029 161609 178337 203806 176604 147190 133701
9125 133701 135209 124906 71621 21450 -9080 -29386 -20369 7447 39362 86411 115981 146945
$$ packed form
9199B436479P95140J128486J529767J819564J325471J51316j143147j661262j527482
9190D854332j243868q19562m97100m00121l24689j96614j87599j21199j09427
9181I54153j24126j18410j16383K2808o253o9723l0516n5786k1812N7968J9620
9170E11540N731m3393q249L7609j3114j2908M5428j387P9669J67842J53528J51672
9158A073968J88102K20305R1984P7086R4086k4173r3953j55389k27597k02358
9148A042061j33957k06392j28521o3514r4364q9990M3915M5788L075j4349K3529
9137D27281o5298j9136K089j37807p4937J3837J5580J6728K5469k7202k9414j3489
9125A33701J508j0303n3285n0171l0530k0306R017K7816L1915M7049K9570L0964
$$ plain form
9113 146945 157796 154935 122435 138615 81337 73466 100237 96703 99967 86183 20732 -22312
9101 -22312 -42625 32552 83471 136049 146578 140961 168866 129464 32145 6687 817 -40200
9089 -40200 -15851 61134 41833 -709 -17839 27489 80414 104457 73079 35575 21909 10414
9077 10414 25472 -22220 -9223 29478 6731 19820 41971 72515 65426 173298 299251 284070
9065 284070 172378 119615 159387 158932 185298 221261 218303 176580 213899 156403 115046 80257
9053 80257 -4413 -34205 25669 40111 82523 131254 112852 85549 114923 113234 34220 12677
9041 12677 -20000 -43527 -60068 -89823 -27110 21740 33580 44476 4891 -73486 -52208 6517
9029 6517 17601 64579 100475 143662 238464 265368 261418 266448 191608 216154 244080 259898
$$ packed form
9113A46945J0851k861l2500J6180n7278p871K6771l534L264j3784o5451m3044
9101b2312k0313P5177N0919N2578J0529n617K7905l9402r7319k5458n870m1017
9089d0200K4349P6985j9301m2542j7130M5328N2925K4043l1378l7504j3666j1495
9077A0414J5058m7692J2997L8701k2747J3089K2151L0544p089J07872J25953j5181
9065B84070j11692n2763L9772m55K6366L5963k958m1723L7319n7496m1357l4789
9053H0257q4670k9792N9874J4442M2412M8731j8402k7303K9374j689p9014k1543
9041A2677l2677k3527j6541k9755O2713M8850J1840J0896l9585p8377K1278N8725
9029F517J1084M6978L5896M3187R4802K6904l950N030p4840K4546K7926J5818
$$ plain form
9017 259898 177497 190586 179600 142132 168223 159496 97750 112199 208769 280244 304945 299859
9005 299859 281594 254323 262551 240677 229018 159160 105142 63300 85085 87998 94693 157074
8993 157074 209821 187222 150833 142014 162649 167905 147544 170280 147880 149200 144297 172289
8981 172289 132588 125224 225121 237820 156611 149322 223727 203493 113817 113210 132325 131151 112790
8968 112790 124525 55280 29774 8312 -85700 -99164 -112193 -160576 -191546 -216673 -319244
8957 -319244 -397515 -412652 -494317 -595700 -672314 -820880 -916573 -1055857 -1163453 -1139492 -994494
8946 -994494 -586123 -125058 389523 778779 928350 999943 971695 819025 760660 612423
8936 612423 515252 499277 482495 434463 354204 233443 165261 94300 86198 90385 106975 22880
$$ packed form
9017B59898q2401J3089j0986l7468K6091q727o1746J4449R6570P1475K4701n086
9005B99859j8265k7271Q228k1874j1659o9858n4018m1842K1785K913O695O2381
8993A57074N2747k2599l6389q819K0635N256k0361K2736k2400J320m903K7992
8981A72289l9701p364R9897J2699q1209p289P4405k0234q9676o07J9115j174j8361
8968A12790J1735o9245k5506k1462r4012j3464j3029m8383l0970k5127j02571
8957c19244p8271j5137q1665j01383p6614j48566r5693j39284j07596K3961J44998
8946i94494M08371M61065N14581L89256J49571P1593k8248j52670n8365j48237
8936F12423r7171j5975j6782m8032q0259j20761o8182p0961q102M187J6590q4095
$$ plain form
8924 22880 -53115 -58313 -26237 -49493 -84178 -112499 -193323 -324493 -370617 -225369 105685
8913 105685 659229 1341356 1789355 2028843 1992685 1859300 1726229 1637301 1507284 1349304
8903 1349304 1228896 1155492 1040748 990387 936276 905788 928358 979275 1014681 1013002 951534
8892 951534 914210 885932 881303 775054 685878 603010 401508 -89465 -632504 -1127016 -1440192
8881 -1440192 -1411527 -1050634 -637391 -274379 60232 251396 310947 455753 561294 637285
8871 637285 678475 734042 844121 994704 1039913 1037166 997584 892074 894573 857864 776715
8860 776715 771255 768983 802224 759957 705318 653370 611124 584815 606695 693776 823725 944184
8848 944184 1086625 1236034 1321293 1408917 1482103 1476035 1473818 1410771 1283682 1206430 1119963
$$ packed form
8924B2880p5995n198L2076k3256l4685k8321q0824j31170m6124J45248L31054
8913A05685N53544O82127M47999K39488l6158j33385j33071q8928j30017j57980
8903A349304j20408p3404j14744n0361n4111l0488K2570N0917L5406j679o1468
8892I51534l7324k8278m629j06249q9176q2868k01502m90973n43039m94512l13176
8881a440192K8665L60893M13243L63012L34611J91164N9551J44806J05541P5991
8871F37285M1190N5567J10079J50583M5209k747l9582j05510K499l6709q1149
8860G76715n460k272L3241m2267n4639n1948m2246k6309K1880Q7081J29949J20459
8848I44184J42441J49409Q5259Q7624P3186o068k217o3047j27089p7252q6467
$$ plain form
8837 1119963 1132700 1147393 1166286 1151962 1106611 1054396 1115039 1129967 1208364 1277146 1412756
8826 1412756 1483249 1544178 1603686 1580372 1602474 1689894 1809014 1928549 2076673 2225503 2253182
8815 2253182 2189448 2066118 1962681 2056332 2153132 2189505 2240233 2221500 2262020 2277248 2332058
8804 2332058 2401601 2533357 2747066 2872941 2947401 3098942 3328490 3643078 3916188 4078989
8794 4078989 4217077 4369806 4397934 4370711 4387813 4513483 4891335 5458104 6070891 6557506
8784 6557506 6822550 6926564 6951274 7123648 7572591 8270472 9353865 10639188 12027444
8775 12027444 13615537 15360934 17301566 19738937 22837092 26640470 30962015 35598343
8767 35598343 40646659 46738644 54950511 66527413 83251085 107681184 143915070 198236965
$$ packed form
8837A119963J2737J4693J8893j4324m5351n2215O0643J4928P8397O8782J35610
8826A412756P0493O0929N9508k3314K2102Q7420J19120J19535J48124J48830K7679
8815B253182o3734j23330j03437R3651R6800L6373N0728j8733M0520J5228N4810
8804B332058O9543J31756K13709J25875P4460J51541K29548L14588K73110J62801
8794D078989J38088J52729K8128k7223J7102J25670L77852N66769O12787M86615
8784F557506K65044J04014K4710J72374M48943O97881J083393J285323J388256
8775A2027444J588093J745397J940632K437371L098155L803378M321545M636328
8767C5598343N048316O091985Q211867J1576902J6723672K4430099L6233886N4321895
$$ plain form
8759 198236965 277098243 374834884 453374658 467121561 411031408 319786432 237295648
8752 237295648 176745218 134646244 105542724 85233463 70888159 60608531 52809217
8745 52809217 46464605 41150837 36729762 32860143 29146631 25643057 22442941 19878120
8737 19878120 17908958 16348783 15026148 13888438 12784898 11661097 10475848 9244036
8729 9244036 8172058 7349610 6803287 6508893 6311826 5993550 5568736 5065841 4508861
8720 4508861 3978237 3522856 3266656 3118030 2947392 2806250 2607154 2419263 2266028 2179943
8710 2179943 2087704 1946885 1806472 1724659 1606340 1454639 1300900 1172294 1027381 926219
8700 926219 833087 734802 598703 477782 426796 436840 494433 524978 541358 594106 558132
$$ packed form
8759A98236965P8861278R7736641P8539774J3746903n6090153r1244976q2490784
8752B37295648o0550430m2098974k9103520k0309261j4345304j0279628p799314
8745E2809217o344612n313768m421075l869619l713512l503574l200116k564821
8737A9878120j969162j560175j322635j137710j103540j123801j185249j231812
8729I244036j071978q22448n46323k94394j97067l18276m24814n02895n56980
8720D508861n30624m55381k56200j48626j70638j41142j99096j87891j53235q6085
8710B179943r2239j40819j40413q1813j18319j51701j53739j28606j44913j01162
8700I26219r3132r8285j36099j20921n0986J0044N7593L0545J6380N2748l5974
$$ plain form
8689 558132 516475 462844 384055 413273 582041 670802 679496 656963 593626 547499 486838 468990
8677 468990 422994 386683 373959 265160 149461 70556 32367 5658 18480 31385 21426
8666 21426 9428 -20041 22172 118586 185355 262444 323267 343510 350319 335743 292102 190632
8654 190632 186261 212167 195868 144802 83819 -20541 -118133 -143282 -186248 -166194 -129852 -108665
8642 -108665 -13055 89797 165554 231348 357039 457845 610612 841214 1082138 1428549
8632 1428549 1834741 2134102 2213382 1871738 1320981 849433 460862 186055 33255 -19803
8622 -19803 -88066 -127023 -138496 -148229 -41893 -8341 70070 173858 324743 526368 606321
8611 606321 406902 82833 -259884 -552288 -788991 -931611 -1123235 -1298160 -1391631 -1332666
$$ packed form
8689E58132m1657n3631p8789K9218J68768Q8761Q694k2533o3337m6127o0661j7848
8677D68990m5996l6311j2724j08799j15699p8905l8189k6709J2822J2905r959
8666B1426j1998k9469M2213R6414O6769P7089O0823K0243O809j4576m3641j01470
8654A90632m371K5906j6299n1066o0983j04360r7592k5149m2966K0054L6342K1187
8642a08665R5610J02852P5757O5794J25691J00806J52767K30602K40924L46411
8632A428549M06192K99361P9280l41644n50757m71548l88571k74807j52800n3058
8622a9803o8263l8957j1473r733J06336L3552P8411J03788J50885K01625P9953
8611F06321j99419l24069l42717k92404k36703j42620j91624j74925r3471N8965
$$ plain form
8601 -1332666 -1036195 -442098 195266 667647 862725 864100 778376 677568 650828 630174
8591 630174 644458 655733 593342 509664 470011 430596 354156 281628 220878 176209 132644 74908
8579 74908 77240 97336 25456 -68761 -162834 -261760 -389488 -430453 -434325 -282716 12952 393650
8567 393650 849594 1293609 1581811 1636403 1574562 1419570 1246161 1115502 961497 818541
8557 818541 714019 668014 716877 686949 577605 507041 517778 524635 451980 341505 300421
8546 300421 290593 246949 203261 197316 203199 195631 192359 186666 230016 235721 290773 258303 128915
8533 128915 127044 138841 130421 92165 37010 26397 33257 28048 49417 71501 74180 55062 74048
8520 74048 76022 67166 174404 153555 131163 108339 66607 104493 126280 130721 111927 115089
$$ packed form
8601a332666K96471N94097O37364M72381J95078J375q5724j00808k6740k0654
8591F30174J4284J1275o2391q3678l9653l9415p6440p2528o0750m4669m3565n7736
8579G4908K332K0096p1880r4217r4073r8926j27728m0965l872J51609K95668L80698
8567C93650M55944M44015K88202N4592o1841j54992j73409j30659j54005j42956
8557H18541j04522m6005M8863k9928j09344p0564J0737O857p2655j10475m1084
8546C00421r828m3644m3688n945N883p568l272n693M3350N705N5052l2470j29388
8533A28915j871J1797q420l8256n5155j0613O860n209K1369K2084K679j9118J8986
8520G4048J974q856J07238k0849k2392k2824m1732L7886K1787M441j8794L162
$$ plain form
8508 115089 158707 182290 199702 250240 302263 271627 182576 117943 103670 84033 109440 116223
8496 116223 100367 70389 3596 -33893 -61782 -22788 -14600 69354 143012 196990 259614 265591
8484 265591 305981 341999 364047 400976 367651 256407 181437 220787 274970 211285 202078 193204
8472 193204 181982 209994 270415 260219 212215 184137 143259 144360 155562 120514 136651 107219
8460 107219 112215 125145 81903 -15527 -52805 -47437 -81805 -113088 -57207 -23570 -96109 -115924
8448 -115924 -125268 -90254 -89047 34398 82365 88407 110884 89842 101420 137123 79999 60029
8436 60029 77273 75229 125029 215107 203068 156765 74346 -45291 -66558 -14354 64148 54655
8424 54655 75181 86001 81505 95764 55204 73690 97435 97746 148062 139330 53278 38543 56361
$$ packed form
8508A15089M3618K3583J7412N0538N2023l0636q9051o4633j4273j9637K5407O783
8496A16223j5856k9978o6793l7489k7889L8994Q188Q3954P3658N3978O2624N977
8484B65591M0390L6018K2048L6929l3325j11244p4970L9350N4183o3685r207q874
8472A93204j1222K8012O0421j0196m8004k8078m0878J101J1202l5048J6137k9432
8460A07219M996J2930m3242r7430l7278N368l4368l1283N5881L3637p2539j9815
8448a15924r344L5014J207J23445M7967O042K2477k1042J1578L5703n7124j9970
8436F0029J7244k044M9800R0078j2039m6303q2419j19637k1267N2204P8502r493
8424E4655K0526J0820m496J4259m0560J8486K3745L11N0316q732q6052j4735J7818
$$ plain form
8411 56361 42480 42475 23979 55268 109416 109773 77854 76533 73725 73255 88025 126169 116174 85867
8397 85867 60497 28668 -2091 35938 48568 110368 155689 133485 45328 -41904 -32304 -48254
8385 -48254 -6099 15756 63104 89847 139512 167176 126359 47415 70999 75386 18228 -6442
8373 -6442 26717 68317 60940 150107 217466 249644 298408 303420 280825 232144 238034 277242 335688
8360 335688 422866 564889 762796 994844 1209552 1412919 1573078 1642328 1614133 1528425
8350 1528425 1359498 1283398 1173616 989127 729287 529034 458579 453405 385644 323408 299944
8339 299944 266282 215564 162866 139809 133260 167819 192152 141670 106178 123784 164352 154410
8327 154410 124573 153301 191186 221188 176520 136290 174914 193496 215872 175417 106230 84148
$$ packed form
8411E6361j3881nj8496L1289N4148L57l1919j321k808m70J4770L8144r995l0307
8397H5867k5370l1829l0759L8029J2630O1800M5321k2204q8157q7232R600j5950
8385d8254M2155K1855M7348K6743M9665K7664m0817p8944K3584M387n7158k4670
8373f442L3159M1600p377Q9167O7359L2178M8764N012k2595m8681N890L9208N8446
8360C35688Q7178J42023J97907K32048K14708K03367J60159O9250k8195q5708
8350A528425j68927p6100j09782j84489k59840k00253p0455n174o7761o2236k3464
8339B99944l3662n0718n2698k3057o549L4559K4333n0482l5492J7606M0568r942
8327A54410k9837K8728L7885L0002m4668m0230L8624J8582K2376m0455o9187k2082
$$ plain form
8315 84148 89420 78677 40086 66596 106439 156974 157544 133111 145159 95694 113997 128711
8303 128711 86695 147158 159824 88401 17878 69695 87904 70287 81941 101554 95943 136499
8291 136499 96712 46122 863 -66686 -34883 -47320 -131301 -115094 -60852 22574 21949 31730
8279 31730 88240 88718 29768 -7698 29790 104570 106596 66948 35899 11772 28718 14511
8267 14511 -22842 -57739 -82684 -112837 -106198 -32229 -31346 -31153 17441 91702 69528 13692 16073
8254 16073 49181 72930 48070 -25956 26670 146496 135854 151023 108416 101391 69619 19278
8242 19278 -44026 -35211 -19260 -29083 -61812 -30020 55848 42266 19181 32358 19108 -48328
8230 -48328 -96616 -29706 30358 34550 -25181 -36243 -110775 -87790 -47392 -20660 -38973 -27054
$$ packed form
8315H4148N272j0743l8591K6510L9843N0535N70k4433J2048m9465J8303J4714
8303A28711m2016O0463J2666p1423p0523N1817J8209j7617J1654J9613n611M0556
8291A36499l9787n0590m5259o7549L1803j2437q3981J6207N4242Q3426o25R781
8279C1730N6510M78n8950l7466L7488P4780K026l9648l1049k4127J6946j4207
8267A4511l7353l4897k4945l0153O639P3969Q83J93M8594P4261k2174n5836K381
8254A6073L3108K3749k4860p4026N2626J19826j0642J5169m2607p025l1772n0341
8242A9278o3304Q815J5951r823l2729L1792Q5868j3582k3085J3177j3250o7436
8230d8328m8288O6910O0064M192n9731j1062p4532K2985M0398K6732j8313J1919
$$ plain form
8218 -27054 -18209 -83433 -81880 3299 40306 42443 47766 40909 -28108 -88137 -3102 54029 72640
8205 72640 60527 21402 -30733 -33438 -24351 -81606 -45896 1233 44172 53712 23341 -19215
8193 -19215 -3480 5181 4715 -40130 -80606 -67991 -77291 -75473 -35096 -462 12785 -36489 -34184
8180 -34184 -17705 45749 46795 -3961 -30611 -29966 44010 60137 55285 69702 84333 432 -20366
8167 -20366 5852 39568 -15905 -61845 -44866 -32856 10742 73567 115888 166273 107893 53057
8155 53057 45711 38212 69612 88841 67825 27504 -34932 -23906 54300 53108 16916 -16100
8143 -16100 -11534 18794 -33622 -40143 -32143 28179 31533 -1872 -9636 -50374 -60884 -84773 -88691
8130 -88691 -103631 -35270 -49024 -85968 -36994 34623 27388 38432 46730 46648 13163 -32093 -74592
$$ packed form
8218b7054Q845o5224J553Q5179L7007K137N323o857o9017o0029Q5035N7131J8611
8205G2640j2113l9125n2135k705R087n7255L5710M7129M2939R540l0371m2556
8193a9215J5735Q661m66m4845m0476J2615r300J818M0377L4634J3247m9274K305
8180c4184J6479O3454J046n0756k6650O45P3976J6127m852J4417J4631q3901k0798
8167b0366K6218L3716n5473m5940J6979J2010M3598O2825M2321N0385n8380n4836
8155E3057p346p499L1400J9229k1016m0321o2436J1026P8206j192l6192l3016
8143a6100M566L0328n2416o521Q000O0322L354l3405p764m0738j0510k3889l918
8130h8691j4940O8361j3754l6944M8974P1617p235J1044Q298q2l3485m5256m2499
$$ plain form
8117 -74592 -111766 -66496 -31964 4369 -11757 -13092 24518 56608 65227 25286 17498 55794
8105 55794 57671 -1992 -35111 -56416 -9514 3491 -31137 -27316 -62807 -52910 3513 -6254 -96818
8092 -96818 -105932 -78227 -46902 12523 10593 -13503 9869 2207 8603 21311 45163 17353 -11521
8079 -11521 37964 41716 13192 13428 73651 58877 -1175 -1735 61505 100292 55077 -29414 -66879
8066 -66879 -49674 -34630 -72073 -76240 -75556 -46641 -70309 -86016 -52292 13798 41693 77174
8054 77174 65304 75880 72482 54361 7754 -46778 -89748 -43814 -51228 228 20776 -17297
8042 -17297 -5336 -26245 -4414 497 2322 -44617 -54837 -36876 -1621 -26713 -52033 -63129
8030 -63129 -86141 -81411 -118562 -77789 -23039 4727 71564 -1922 -75058 -27632 38159 41042
$$ packed form
8117g4592l7174M5270L4532L6333j6126j335L7610L2090Q619l9941p788L8296
8105E5794J877n9663l3119k1305M6902J3005l4628L821l5491R897N6423r767r0564
8092i6818r114K7705L1325N9425j930k4096K3372p662O396J2708K3852k7810k8874
8079a1521M9485L752k8524K36O0223j4774o0052n60O3240L8787m5215q4491l7465
8066f6879J7205J5044l7443m167O84K8915k3668j5707L3724O6090K7895L5481
8054G7174j1870J0576l398j8121m6607n4532m2970M5934p414N1456K0548l8073
8042a7297J1961k0909K1831M911J825m6939j0220J7961L5255k5092k5320j1096
8030f3129k3012M730l7151M0773N4750K7766O6837p3486p3136M7426O5791K883
$$ plain form
8018 41042 3216 -53500 -81491 12106 32384 38105 56054 56485 39333 -37010 -99615 -121986
8006 -121986 -124247 -73712 -43068 -52469 -31578 -67750 -53058 -23469 -11711 11243 44250 62434
7994 62434 59617 29339 28007 12722 15927 45170 99830 153756 193970 163717 114883 93269
7982 93269 91687 -12917 -85168 -35902 54531 33807 47296 68883 84211 98322 41887 -13920
7970 -13920 45219 50442 23473 74249 89322 56687 21987 -10027 -9704 -24247 -30660 -14563 -7290
7957 -7290 -23063 -16457 -19693 38799 86501 15836 -10173 -5743 -23797 -624 46623 74268 129815
7944 129815 123518 58756 2217 -45407 -36941 -6109 -30588 -61092 -14715 30382 -10088 -67604
7932 -67604 -35654 -48418 -104741 -98005 -59064 17175 67119 123111 136872 34105 -8347 -31765
$$ packed form
8018D1042l7826n6716k7991R3597K0278N721J7949M31j7152p6343o2605k2371
8006a21986k261N0535L0644r401K0891l6172J4692K9589J1758K2954L3007J8184
7994F2434k817l0278j332j5285L205K9243N4660N3926M0214l0253m8834k1614
7982I3269j582j04604p2251M9266R0433k0724J3489K1587J5328J4111n6435n5807
7970a3920N9139N223k6969N0776J5073l2635l4700l2014L23j4543o413J6097P273
7957g290j5773O606l236N8492M7702p0665k6009M430j8054K3173M7247K7645N5547
7944A29815o297o4762n6539m7624Q466L0832k4479l0504M6377M5097m0470n7516
7932f7604L1950j2764n6323O736L8941P6239M9944N5992J3761j02767m2452k3418
$$ plain form
7920 -31765 -1837 39616 -8789 -16314 6121 -3927 18583 24701 10148 11460 62542 78888
7908 78888 130138 119397 89256 20002 -21771 12185 48298 99800 61779 26931 -21253 -70059
7896 -70059 -84134 -65999 -59982 -17913 3895 -7159 -43081 -78572 -76812 -60677 -26880 -12505
7884 -12505 20985 51459 -10258 -65569 -68893 -70374 -76234 -82803 -42939 52510 13913 -10920 23586
7871 23586 15097 -61755 -85691 -95628 -40504 47075 21247 11564 36468 75409 46535 41157 74774
7858 74774 13475 -40073 -131507 -136271 -86063 -37971 -52999 -14219 21563 37951 13244 -61098
7846 -61098 -100994 -58590 -10584 -19256 -5105 15755 4590 45091 26883 16162 29010 79931
7834 79931 14597 -83019 -106755 -88694 -60501 -35833 17557 77451 47957 -41096 -42345 -25389
$$ packed form
7920c1765K9928M1453m8405p525K2435j0048K2510O118j4553J312N1082J6346
7908G8888N1250j0741l0141o9254m1773L3956L6113N1502l8021l4848m8184m8806
7896g0059j4075J8135O017M2069K1808j1054l5922l5491J760J6135L3797J4375
7884a2505L3490L0474o1717n5311l324j481n860o569L9864R5449l8597k4833L4506
7871B3586q489p6852k3936r937N5124Q7579k5828r683K4904L8941k8874n378L3617
7858G4774o1299n3548r1434m764N0208M8092j5028L8780L5782J6388k4707p4342
7846f1098l9896M2404M8006q672J4151K0860j1165M0501j8208j0721J2848N0921
7834G9931o5334r7616k3736J8061K8193K4668N3390N9894k9494q9053j249J6956
$$ plain form
7822 -25389 -32584 530 48583 34588 20764 -6778 39017 69956 30525 6930 16185 45944
7810 45944 852 -1247 17932 23131 -20488 -51584 -66207 -105727 -62283 -42854 -62701 -68650
7798 -68650 -48947 -66215 -92413 -99008 -58480 -213 36473 23408 -30053 -20912 -26155 -8471
7786 -8471 40310 85488 113177 52942 74097 52501 -24676 8806 47490 60296 -1190 2185
7774 2185 -44178 -21079 60989 40627 69334 67461 41828 36491 71300 75966 79278 61545 47768
7761 47768 11099 -24546 -50432 -72133 -86601 -95570 -35303 -30781 -30646 7420 -31787 -74708 -51377
7748 -51377 5620 -31626 -1039 -34121 -80079 -24186 54054 112537 103289 40831 -13595 -59346
7736 -59346 -110802 -115454 -129470 -39874 22483 46372 98156 36073 25271 60297 64791 42653
$$ packed form
7822b5389p195L3114M8053j3995j3824k7542M5795L0939l9431k3595R255K9759
7810D5944m5092k099J9179N199m3619l1096j4623l9520M3444J9429j9847n949
7798f8650J9703j7268k6198o595M0528N8267L6686j3065n3461R141n243J7684
7786h471M8781M5178K7689o0235K1155k1596p7177L3482L8684J2806o1486L375
7774B185m6363K3099Q2068k0362K8707j873k5633n337L4809M666L312j7733j3777
7761D7768l6669l5645k5886k1701j4468q969O0267M522J35L8066l9207m2921K3331
7748e1377N6997l7246L0587l3082m5958N5893P8240N8483r248o2458n4426m5751
7736e9346n1456m652j4016Q9596O2357K3889N1784o2083j0802L5026M494k2138
$$ plain form
7724 42653 49316 17371 39800 72713 86785 88566 55177 20566 -2631 -36178 -24736 25053
7712 25053 30490 48847 75573 30094 -40011 -74549 -82685 -59258 -30928 -62068 -73208 462
7700 462 87666 98840 80513 52933 75417 78108 79540 78442 84653 62697 77398 36087 -18040
7687 -18040 -71346 -80481 -113772 -101924 -45047 8073 26999 -6898 -4904 20810 60144 66657
7675 66657 31366 25337 53540 44557 16979 -41324 -39657 -14909 -27027 -34408 -28148 -15968 -10394
7662 -10394 -33361 -74848 -71584 -48505 -203 -30508 -41786 -15363 -17152 29388 89430 44149
7650 44149 -10056 12602 40959 15381 32318 25103 47390 31438 16218 31303 30301 -21508
7638 -21508 -37001 -37173 -16469 -38983 -13176 29323 13336 6696 -14641 -7789 -4286 6597 45233
$$ packed form
7724D2653O663l1945K2429L2913J4072J781l3389l4611k3197l3547J1442M9789
7712B5053N437J8357K6726m5479p0105l4538q136K3427K8330l1140j1140P3670
7700D62Q7204J1174j8327k7580K2484K691J432j098O211k1956J4701m1311n4127
7687a8040n3306r135l3291J1848N6877N3120J8926l3897J994K5714L9334O513
7675F6657l5291o029K8203q983k7578n8303J667K4748j2118p381O260J2180N574
7662a0394k2967m1487L264K3079M8302l0305j1278K6423j789M6540O0042m5281
7650D4149n4205K2658K8357k5578J6937p215K2287j5952j5220J5085j002n1809
7638b1508j5493j72K0704k2514K5807M2499j5987o640k1337O852L503J0883L8636
$$ plain form
7625 45233 47397 -2347 -22085 -20497 -25328 -1973 -34239 -60432 -33032 42606 26612 1610
7613 1610 13055 37072 30443 54423 53819 52879 60293 4568 -22608 73118 96207 87673 66200
7600 66200 1548 -31379 -39869 -42038 24953 46623 12345 76468 117683 139275 112880 56540
7588 56540 -26325 -8461 10757 -11593 -49852 -35472 -2503 41313 23469 -41582 -18611 2672
7576 2672 -80538 -115729 -87583 -37434 25690 78402 22615 -30438 -33720 -49053 22995 44406
7564 44406 -17459 -92826 -119351 -112160 -94109 -86812 -89494 -58020 -69212 -86772 -97820 -97545 -24812
7551 -24812 -3355 56787 32411 20325 36046 73296 12326 -28444 8682 48863 25862 -12225
7539 -12225 -88816 -111796 -143678 -172767 -96805 -53735 -24931 16738 44550 75397 57773 51064
$$ packed form
7625D5233K164m9744j9738J588m831K3355l2266k6193K7400P5638j5994k5002
7613A610J1445K4017o629K3980o04r40P414n5725k7176R5726K3089q534k1473
7600F6200o4652l2927q490k169O6991K1670l4278O4123M1215K1592k6395n6340
7588E6540q2865J7864J9218k2350l8259J4380L2969M3816j7844o5051K2971K1283
7576B672q3210l5191K8146N0149O3124N2712n5787n3053l282j5333P2048K1411
7564D4406o1865p5367k6525P191J8051P297k682L1474j1192j7560j1048K75P2733
7551b4812K1457O0142k4376j2086J5721L7250o0970m0770L7126M0181k3001l8087
7539a2225p6591k2980l1882k9089P5962M3070K8804M1669K7812L0847j7624o709
$$ plain form
7527 51064 22255 13533 49062 62630 54912 32067 15736 15091 77231 17911 -1381 16036 -22986
7514 -22986 3567 35828 14924 -6114 2501 5822 27161 -17852 -62440 5613 44645 61286
7502 61286 11746 59142 68916 64700 79066 84659 72314 20037 -8573 -25850 -22160 51735 78487
7489 78487 68022 8693 -18844 -26879 -35076 -1250 3013 -31262 -3781 6884 -10429 13318
7477 13318 44181 101128 85448 120 -32164 -15534 -6437 20514 38817 89525 130517 103327
7465 103327 61081 -9926 -26136 -48813 -90532 -105738 -58765 -52954 -59538 -50717 -135749 -141210
7453 -141210 -81353 -2106 36950 19813 4660 -51578 -96240 -60376 -1561 -36085 -41950 -56904
7441 -56904 -46559 -34229 62368 104545 87111 47955 10426 4744 -32115 -61120 -58396 -37288
$$ packed form
7527E1064k8809q722L5529J3568p718k2845j6331o45O2140n9320j9292J7417l9022
7514b2986K6553L2261k0904k1038Q615L321K1339m5013m4588O8053L9032J6641
7502F1286m9540M7396R774m216J4366N593j2345n2277k8610j7277L690P3895K6752
7489G8487j0465n9329k7537q035q197L3826M263l4275K7481J0665j7313K3747
7477A3318L0863N6947j5680q5328l2284J6630R097K6951J8303N0708M0992k7190
7465A03327m2246p1007j6210k2677m1719j5206M6973N811o584Q821q5032n461
7453a41210N9857P9247L9056j7137j5153n6238m4662L5864N8815l4524n865j4954
7441e6904J0345J2330R6597M2177j7434l9156l7529n682l6859k9005K724K1108
$$ plain form
7429 -37288 13706 40592 26789 60527 57986 28022 -6370 -129225 -131546 -40527 -17974 -59527
7417 -59527 -78124 -107024 -38494 -13706 -23573 -1372 65646 53539 -13577 -37263 -30484 -38509
7405 -38509 -74744 -145816 -131660 -23377 90521 106335 78284 103130 69968 55467 48498 26071
7393 26071 8344 -4328 -32849 -53889 -32477 -46550 -47972 -52466 -32019 10418 -7684 -25456
7381 -25456 -47078 -51771 -89596 -157730 -140219 -58136 1334 4330 -39366 -19745 -23654 -32303 -36066
7368 -36066 48485 88834 41789 -23527 -10046 14885 -11047 14463 48906 30650 -10626 -29747
7356 -29747 -55729 -80020 -63488 -15912 -19153 -42263 -48489 -40150 -6401 -57674 -84117 -37380
7344 -37380 -17720 -14375 16082 -6271 -44889 -112377 -51903 21133 11997 -2172 -35167 -26839
$$ packed form
7429c7288N0994K6886j3803L3738k541k9964l4392j22855k321R1019K2553m1553
7417e9527j8597k8900O8530K4788r867K2201O7018j2107o7116k3686O779q025
7405c8509l6235p1072J4156J08283J13898J5814k8051K4846l3162j4501o969k2427
7393B6071j7727j2672k8521k1040K1412j4073j422m494K0447M2437j8102j7772
7381b5456k1622m693l7825o8134J7511Q2083N9470K996m3696J9621l909q649l763
7368c6066Q4551M0349m7045o5316J3481K4931k5932K5510L4443j8256m1276j9121
7356b9747k5982k4291J6532M7576l241k3110o226Q339L3749n1273k6443M6737
7344c7380J9660L345L0457k2353l8618o7488O0474P3036r136j4169l2995Q328
$$ plain form
7332 -26839 -24555 -49296 -16177 25578 69928 67326 40179 17562 -25272 3183 53377 25674
7320 25674 14097 38294 -17893 -15948 15749 9139 -18164 -19797 -9515 1294 -26398 -24920 -1703
7307 -1703 11307 -27323 -9965 -2944 20992 58025 84632 42411 45649 20876 1550 -5594 -40660
7294 -40660 -54809 -54933 -47000 -42762 -21480 -72565 -83867 -21457 -31737 -29717 -4343 11421 52638
7281 52638 60225 57258 56377 91961 51242 38983 36613 47570 64935 63760 56760 40591 19658
7268 19658 12918 24853 7268 -41480 -67005 -124171 -77846 -50501 -65725 -36317 -22158 -17351
7256 -17351 -29180 -12681 27134 33239 23552 6799 89910 66296 -675 17107 27690 39006
7244 39006 2271 13440 64058 115831 44545 1242 20803 31220 52471 43322 54100 8616
$$ packed form
7332b6839K284k4741L3119M1755M4350k602k7147k2617m2834K8455N0194k7703
7320B5674j1577K4197n6187J945L1697o610k7303j633J0282J0809k7692J478K3217
7307a703J3010l8630J7358P021K3936L7033K6607m2221L238k4773j9326p144l5066
7294d0660j4149j24P933M238K1282n1085j1302O2410j0280K020K5374J5764M1217
7281E2638P587k967q81L5584m0719j2259k370J0957J7365j175p000j6169k0933
7268A9658o740J1935j7585m8748k5525n7166M6325K7345j5224K9408J4159M807
7256a7351j1829J6499L9815O105r687j6753Q3111k3614o6971J7782J0583J1316
7244C9006l6735J1169N0618N1773p1286m3303J9561J0417K1251r149J0778m5484
$$ plain form
7232 8616 991 -11598 7822 53964 33151 -16812 -34628 -51960 -74427 -51693 -6716 75009
7220 75009 46443 18605 12377 -21763 -35446 -13060 28461 18951 5428 -64805 -62031 -56773 -59145
7207 -59145 -40732 -48091 -3970 13046 -8161 1855 2004 -797 -21415 -71165 -25854 -60743 -93953
7194 -93953 -60123 -11692 9260 -1046 -6683 25003 33609 11668 28654 8860 11255 -5319
7182 -5319 46916 49455 7735 1113 -12049 -44059 -44274 -29531 -44639 -44868 -56315 -48229 -52914 -62712
7168 -62712 -78909 -94413 -74570 -46860 -38653 -14533 2986 62059 84255 79198 46578 20910
7156 20910 11031 57758 67267 7920 -42393 -39481 -5859 -22773 -46644 -112153 -124130 -46113
7144 -46113 -28788 -29305 7963 43955 15842 -7779 -2659 -47611 -2138 38297 47431 104652 136605
$$ packed form
7232H616p625j2589J9420M6142k0813m9963j7816j7332k2467K2734M4977Q1725
7220G5009k8566k7838o228l4140j3683K2386M1521r510j3523p0233K774N258k372
7207e9145J8413p359M4121J7016k1207J0016J49k801k0618m9750M5311l4889l3210
7194i3953L3830M8431K0952j0306n637L1686Q606k1941J6986j9794K395j6574
7182e319N2235K539m1720o622j3162l2010k15J4743j5108k29j1447Q086m685r798
7168f2712j6197j5504J9843K7710Q207K4120J7519N9073K2196n057l2620k5668
7156B0910r879M6727R509n9347n0313K912L3622j6914k3871o5509j1977P8017
7144d6113J7325n17L7268L5992k8113k3621N120m4952M5473M0435R134N7221L1953
$$ plain form
7131 136605 126429 90122 61887 58445 35600 85861 90913 29591 -23995 -6420 3619 1262
7119 1262 21538 25035 1 10107 87772 91822 53896 2760 42711 119999 115246 79388 75055
7106 75055 72080 23488 16674 -32255 -70413 -115607 -146413 -175413 -135637 -87370 -41300 -72623
7094 -72623 -84100 -61103 -16967 -42476 -48005 -94430 -31538 -44071 -1740 14596 -8076 -67166
7082 -67166 -96986 -82239 -56930 -2214 3025 -3225 68964 60188 18409 30695 43402 34262 22125
7069 22125 -21487 -12414 -26695 -39187 -20587 12376 -9736 -57884 -105861 -173517 -174590 -79656
7057 -79656 -83738 -72387 -69592 -65672 -55824 -13264 101468 141642 22312 -23576 -8172 -34994
7045 -34994 -68813 -44767 -79910 -98419 -34201 2651 28874 31342 6369 -27620 -43997 -66324
$$ packed form
7131A36605j0176l6307k8235l442k2845N0261N052o1322n3586J7575J0039k357
7119A262K0276L497k5034J0106P7665M050l7926n1136L9951P7288m753l5858m333
7106G5055k975m8592o814m8929l8158m5194l0806k9000L9776M8267M6070l1323
7094g2623j1477K2997M4136k5509n529m6425O2892j2533M2331J6336k2672n9090
7082f7166k9820J4747K5309N4716N239o250P2189q776m1779J2286J2707r140j2137
7069B2125m3612R073j4281j2492J8600L2963k2112m8148m7977o7656j073R4934
7057g9656m082J1351K795L920R848M2560J14732M0174j19330m5888J5404k6822
7045c4994l3819K4046l5143j8509O4218L6852K6223K468k4973l3989j6377k2327
$$ plain form
7033 -66324 -12398 36723 39883 -13136 -88359 -85581 12239 49477 2091 47395 111464 87812
7021 87812 58192 44639 -4137 -70930 -64610 23033 8357 -32762 7306 56820 -1519 -43384
7009 -43384 -56095 -32983 -27476 -4269 36756 4622 -59355 -67804 -8190 44002 127047 129119
6997 129119 78861 28057 8541 -46222 -44330 -61572 -80055 -61778 -60681 -16349 51301 39157
6985 39157 53213 35081 -58787 -48979 -42269 -58691 -35397 26156 96575 137448 87710 18783
6973 18783 -25296 -27146 -62377 -137384 -123440 -67837 -70570 -101733 -70877 -44788 -55900 -32061
6961 -32061 80190 59570 35702 71928 80552 52930 58156 69417 4549 -54345 8985 35098
6949 35098 17340 -14216 42527 46222 59050 79932 1073 -32910 8889 34692 60868 79629
$$ packed form
7033f6324N3926M9121L160n3019p5223K778R7820L7238m7386M5304O4069k3652
7021H7812k9620j3553m8776o6793O320Q7643j4676m1119M0068M9514n8339m1865
7009d3384j2711K3112N507K3207M1025l2134o3977q449N9614N2192Q3045K072
6997A29119n0258n0804j9516n4763J892j7242j8483J8277J097M4332O7650j2144
6985C9157J4056j8132r3868R808O710j6422K3294O1553P0419M0873m9738o8927
6973A8783m4079j850l5231p5007J3944N5603k733l1163L0856K6089j1112K3839
6961c2061J12251k0620k3868L6226Q624k7622N226J1261o4868n8894O3330K6113
6949C5098j7758l1556N6743L695J2828K0882p8859l3983M1799K5803K6176J8761
$$ plain form
6937 79629 3467 32992 65248 93183 80812 75140 725 -17645 9474 -50362 -3592 40169
6925 40169 68863 35515 3244 12545 -30742 -22854 9307 3842 -49897 -69624 -49101 -97028
6913 -97028 -108036 -51370 -57719 -88914 -95421 -55902 -88118 -79655 -77661 -58408 -54047 3175 49394
6900 49394 10711 20624 1143 12097 -6913 559 4874 -30997 -38375 -61018 -77264 -76924 -98989
6887 -98989 -94473 -30228 -13704 20934 22892 -3652 -23395 -18658 -72727 -76936 -75506 -21072 29177
6874 29177 -19565 -66521 -29133 -44467 -124090 -216159 -190565 -86958 -31987 -75844 -59820 13203
6862 13203 8128 27360 66310 61824 63506 88817 129553 102397 53214 10416 27945 53601
6850 53601 126686 94414 42449 50499 38290 55206 38332 -19282 -32501 -6838 -30450 -56509
$$ packed form
6937G9629p6162K9525L2256K7935j2371n672p4415j8370K7119n9836M6770M3761
6925D0169K8694l3348l2271R301m3287P888L2161n465n3739j9727K0523m7927
6913i7028j1008N6666o349l1195o507L9519l2216Q463J994J9253M361N7222M6219
6900D9394l8683R913j9481J0954j9010P472M315l5871p378k2643j6246L40k2065
6887i8989M516O4245J6524L4638J958k6544j9743M737n4069m209J430N4434N0249
6874B9177m8742m6956L7388j5334p9623r2069K5594J03607N4971m3857J6024P3023
6862A3203n075J9232L8950m486J682K5311M0736k7156m9183m2798J7529K5656
6850E3601P3085l2272n1965Q050j2209J6916j6874n7614j3219K5663k3612k6059
$$ plain form
6838 -56509 -61895 -92167 -147598 -146113 -85892 -19503 80835 68483 -25104 -32194 -4936 21170
6826 21170 24451 31629 22744 46270 17750 -18207 -27056 -36029 -57051 -56584 -53542 -66093 -111215
6813 -111215 -154319 -97949 -43027 8795 -7629 -25702 10475 40719 3230 -45266 -87277 -66796
6801 -66796 -23052 11003 -11143 -89274 -64635 -20247 10128 -5019 -58902 -74241 -17562 -35405
6789 -35405 -58697 -15669 63134 55190 22877 -25234 -75740 -65409 -35770 -80494 -101346 -114663
6777 -114663 -93975 -117366 -175150 -170768 -195449 -147463 -78519 -38338 -19039 -8222 -5782 -5465
6765 -5465 24445 28819 7155 -81433 -86370 -26592 2560 12631 20894 12366 59011 48040 -25380
6752 -25380 32280 19350 61620 60620 27607 -5380 -10670 -14921 -41017 -36449 -3270 -75023 -110166
$$ packed form
6838e6509n386l0272n5431J485O0221O6389J00338j2352r3587p090K7258K6106
6826B1170L281P178q885K3526k8520l5957q849q973k1022M67L042j2551m5122
6813a11215m3104N6370N4922N1822j6424j8073L6177L0244l7489m8496m2011K0481
6801f6796M3744L4055k2146p8131K4639M4388L0375j5147n3883j5339N6679j7843
6789c5405k3292M3028P8803p944l2313m8111n0506J0331K9639m4724k0852j3317
6777a14663K0688k3391n7784M382k4681M7986O8944M0181J9299J0817K440L17
6765e465K9910M374k1664q8588m937N9778K9152J0071Q263q528M6645j0971p3420
6752b5380N7660j2930M2270j000l3013l2987n290m251k6096M568L3179p1753l5143
$$ plain form
6739 -110166 -108378 -107126 -77538 -11117 28399 4723 -17424 9531 309 8617 6702 -30011 -58187
6726 -58187 -55696 -11767 -1383 8677 -7605 -33615 -40396 -34958 -63679 -59516 -42172 -32611 19972
6713 19972 104886 80919 33054 23176 53419 63076 71414 89388 57722 34034 26785 15979 44568
6700 44568 16420 -18224 -47176 -1536 71441 61585 41994 54236 10210 -6794 -45593 -14632
6688 -14632 5808 35979 27866 -21119 -19318 -14079 8437 4256 1412 26265 23308 -16064 18855
6675 18855 54958 2989 22803 57218 22718 -94338 -139260 -132189 -93064 -36132 6082 -76852
6663 -76852 -107729 -43135 -3207 53751 81762 67759 28189 18739 25277 11907 4853 -37164
6651 -37164 -51242 -4949 32210 4005 22066 -24775 -69304 -22121 28878 43163 42861 -16984
$$ packed form
6739a10166J788J252K9588O6421L9516k3676k2147K6955r222Q308j915l6713k8176
6726e8187K491M3929J0384J0060j6282k6010o781N438k8721M163J7344R561N2583
6713A9972Q4914k3967m7865r878L0243R657Q338J7974l1666k3688p249j0806K8589
6700D4568k8148l4644k8952M5640P2977r856j9591J2242m4026j7004l8799L0961
6688a4632K0440L0171q113m8985J801N239K2516m181k844K4853k957l9372L4919
6675A8855L6103n1969J9814L4415l4500j17056m4922P071L9125N6932M2214q2934
6663g6852l0877O4594L9928N6958K8011j4003l9570r450O538j3370p054m2017
6651c7164j4078M6293L7159k8205J8061m6841m4529M7183N0999J4285l02n9845
$$ plain form
6639 -16984 -11590 10170 -30023 -75131 -40076 -30138 -8125 19764 66082 59820 21707 -29066
6627 -29066 -30865 -37279 -85265 -77917 -66214 -80632 -66968 -51041 -51627 -1320 101216 70176 19358
6614 19358 36522 9812 17305 29765 -27784 -22238 -43315 -17468 -6301 -6554 46695 53481 -20089
6601 -20089 -80483 -112204 -56629 -19177 -20858 -36320 -51243 -37186 -3114 6968 11953 -18175
6589 -18175 -34322 -46605 -10094 4925 -31177 -6626 -49619 -66383 -49863 -42454 -85577 -43726
6577 -43726 -40629 -4989 38508 59444 14326 -68209 -69596 -29686 42611 38861 23613 3396
6565 3396 10526 4627 -39214 -82783 -94156 -101857 -59680 -18358 -3263 -23143 -31145 -11546 -493
6552 -493 48550 26829 15629 -5119 -50158 -53340 7730 12994 8730 22006 14530 63142 85195
$$ packed form
6639a6984N394K1760m0193m5108L5055R938K2013K7889M6318o262l8113n0773
6627b9066j799o414m7986P348J1703j4418J3664J5927n86N0307J02536l1040n0818
6614A9358J7164k6710P493J2460n7549N546k1077K5847J1167k53N3249O786p3570
6601b0089o0394l1721N5575L7452j681j5462j4923J4057L4072J0082M985l0128
6589a8175j6147j2283L6511J5019l6102K4551m2993j6764J6520P409m3123M1851
6577d3726L097L5640M3497K0936m5118q2535j387L9910P2297l750j5248k0217
6565C396P130n899m3841m3569j1373p701M2177M1322J5095j9880q002J9599J1053
6552d93M9043k1721j1200k0748m5039l182O1070N264m264J3276p476M8612K2053
$$ plain form
6539 85195 75752 97645 96969 105691 92981 27071 23351 123871 119637 38581 18422 27049 57721
6526 57721 61201 82879 144836 128272 79026 73998 85968 25456 36479 51872 33419 -22714
6514 -22714 -19353 4696 59601 11395 -6680 43241 26528 73070 71421 64654 55453 36644 92427
6501 92427 106270 74156 9560 -53575 -99228 -89497 -89770 -101491 -101416 -95350 -100388 -66891 -63816 -90788
6487 -90788 -93682 -5567 5100 12758 30496 -5636 3005 -23966 -26558 31435 -13290 -6766 -12693
6474 -12693 12744 -13492 20491 30625 45789 17806 16479 -16032 -27224 17299 -14905 38283
6462 38283 43533 -8860 -51516 -62893 -69602 -22254 13326 26527 32425 2463 -34888 -27707 17251
6449 17251 74443 61263 -19153 -60303 -74795 -66542 -33590 -27960 18430 32493 4501 -5688
$$ packed form
6539H5195r443K1893o76Q722j2710o5910l720J00520m234q1056k0159Q627L0672
6526E7721L480K1678O1957j6564m9246n028J1970o0512J1023J5393j8453n6133
6514b2714L361K4049N4905m8206j8075M9921j6713M6542j649o767r201j8809N5783
6501I2427J3843l2114o4596o3135m5653R731k73j1721P5O066n038L3497L075k6972
6487i0788k894Q8115J0667P658J7738l6132Q641k6971k592N7993m4725O524n927
6474a2693K5437k6236L3983J0134J5164k7983j327l2511j1192M4523l2204N3188
6462C8283N250n2393m2656j1377o709M7348L5580J3201N898k9962l7351P181M4958
6449A7251N7192j3180q0416m1150j4492Q253L2952N630M6390J4063k7992j0189
$$ plain form
6437 -5688 13090 34252 12490 -31501 13773 61595 8942 -9263 32249 66997 68517 18485
6425 18485 -27169 -64834 -17895 16446 47926 44337 -10925 -44020 -68907 -73178 -72778 -84324 -66240
6412 -66240 -78290 -42986 -5939 24328 50580 83146 48424 12770 22382 23409 -22975 -125
6400 -125 86843 68280 -21861 -18309 75 -240 30798 44374 -18602 -66482 -108036 -60127 1157
6387 1157 25723 13267 -66363 -68425 -32504 -36371 -11105 2546 40491 103399 49675 2525
6375 2525 24908 33342 -13530 -43284 14889 44710 53374 71566 39099 43225 -7080 -39134 5662
6362 5662 35387 27482 46293 -12905 -70370 -37715 2671 -56160 -60734 -29952 -17414 -7130
6350 -7130 19461 -8960 -52743 3807 93240 46156 51514 60293 40690 17099 17362 -11021 -29162
$$ packed form
6437e688J8778K1162k1762m3991M5274M7822n2653j8205M1512L4748J520n0032
6425A8485m5654l7665M6939L4341L1480l589n5262l3095k4887m271M00j1546J8084
6412f6240j2050L5304L7047L0267K6252L2566l4722l5654R612J027m6384K2850
6400a25Q6968j8563r0141L552J8384l15L1038J3576o2976m7880m1554M7909O1284
6387A157K4566j2456p9630k062L5921l867K5266J3651L7945O2908n3724m7150
6375B525K2383Q434m6872k9754N8173K9821Q664J8192l2467M126n0305l2054M4796
6362E662K9725p905J8811n9198n7465L2655M0386n8831m574L0782J2538J0284
6350g130K6591k8421m3783N6550Q9433m7084N358Q779j9603k3591K63k8383j8141
$$ plain form
6337 -29162 -58591 -5188 -15963 -10719 24704 912 32270 11515 -3539 14098 110357 180836
6325 180836 134957 95995 63111 63957 45693 7484 -33681 -33687 -18204 -1743 -20038 -68227 -83303
6312 -83303 -74520 -84739 -97248 -68033 -63100 -43999 -43066 -28823 -15754 20385 -15438 -23173 -7415
6299 -7415 -32975 -44356 -15967 5957 41227 55582 65062 82464 83680 75655 31303 13886 31692
6286 31692 54811 69126 74318 58334 22331 4882 -16448 -30294 -41614 -16916 -7450 50982
6274 50982 25771 -30206 -38981 -65869 -33784 8983 23270 3216 -16373 -64431 -74032 -30757
6262 -30757 -75334 -140556 -66688 47750 57641 -23232 -23479 -59957 -31091 -18105 4663 38054
6250 38054 50402 22895 60036 46429 -6109 15879 34871 1109 20674 9226 -27260 -42915
$$ packed form
6337b9162k9429N3403j0775N244L5423k3792L1358k0755j5054J7637R6259P0479
6325A80836m5879l8962l2884Q46j8264l8209m1165oJ5483J6461j8295m8189j5076
6312h3303Q783j0219j2509K9215M933J9101R33J4243J3069L6139l5823p735J5758
6299g415k5560j1381K8389K1924L5270J4355R480J7402J216q025m4352j7417J7806
6286C1692K3119J4315N192j5984l6003j7449k1330j3846j1320K4698R466N8432
6274E0982k5211n5977q775k6888L2085M2767J4287k0054j9589m8058r601M3275
6262c0757m4577o5222P3868J14438R891q0873k47l6478K8866J2986K2768L3391
6250C8054J2348k7507L7141j3607n2538K1988J8992l3762J9565j1448l6486j5655
$$ plain form
6238 -42915 -30011 -26888 2779 79340 85982 33596 -2953 -24710 -31074 -38287 -138045 -48272 79665
6225 79665 122342 107660 88124 88596 20100 -6429 44851 97947 71632 41171 31451 26391 -47355
6212 -47355 -100327 -71944 -29615 -51741 -100953 -127949 -61010 -1188 45340 27203 64505 69463
6200 69463 33138 -32628 10816 -10916 -8513 30842 12224 3211 -35127 -58260 -54682 -15313
6188 -15313 -38893 -1000 43989 30148 80606 55139 -24060 -54996 -36933 -16227 -23503 6660
6176 6660 18860 -12041 -42899 -52799 -71757 -59483 -407 -12779 -32169 23177 64448 50409
6164 50409 56902 22304 6258 -2999 -49556 -4446 41584 75054 134460 113071 68374 40368
6152 40368 29701 9054 -14274 4691 7457 5566 21181 -19419 -13649 -12146 -19235 -32562 -17115
$$ packed form
6238d2915J2904L123K9667P6561O642n2386l6549k1757o364p213r9758Q9773J27937
6225G9665M2677j4682j9536M72o8496k6529N1280N3096k6315l0461r720n060p3746
6212d7355n2972K8383M2329k2126m9212k6996O6939N9822M6528j8137L7302M958
6200F9463l6325o5766M3444k1732K403L9355j8618r013l8338k3133L578L9369
6188a5313k3580L7893M4989j3841N0458k5467p9199l0936J8063K0706p276L0163
6176F660J2200l0901l0858r900j8958J2274N9076j2372j9390N5346M1271j4039
6164E0409O493l4598j6046r257m6557M5110M6030L3470N9406k1389m4697k8006
6152D0368j0667k0647k3328J8965K766j891J5615m0600N770J503p089j3327J5447
$$ plain form
6139 -17115 20767 -20305 -31832 -35203 -10277 -31514 -78285 -90215 -96756 12490 35806 -10698
6127 -10698 21325 53386 104197 95627 72527 32220 1094 11182 35854 -17078 -30784 -21354
6115 -21354 -54082 -39385 13420 -10552 -40378 7119 38268 38383 55620 12490 1275 -33808
6103 -33808 -74567 -32799 -57751 -77475 -159079 -112010 -51899 -21229 30273 61418 26149 22157
6091 22157 39706 12322 12464 -22549 9787 28424 75340 54806 33501 59988 77382 70640
6079 70640 66479 66400 42453 18698 -41133 -70139 -18340 14517 -16455 -21922 17888 -13255 -9810
6066 -9810 31299 21552 17982 -7411 1802 42635 -18739 -84747 -64306 1805 13702 -6911 1751
6053 1751 -19552 -2370 41209 71691 34604 32498 12589 -27961 -19137 -47262 -12509 2991
$$ packed form
6139a7115L7882m1072j1527l371K4926k1237m6771j1930o541J09246K3316m6504
6127a0698L2023L2061N0811q570k3100m0307l1126J0088K4672n2932j3706R430
6115b1354l2728J4697N2805k3972k9826M7497L1149J15J7237m3130j1215l5083
6103c3808m0759M1768k4952j9724q1604M7069O0111L0670N1502L1145l5269l992
6091B2157J7549k7384J42l5013L2336J8637M6916k0534k1305K6487J7394o742
6079G0640m161p9k3947k3755n9831k9006N1799L2857l0972n467L9810l1143L445
6066i810M1109r747l570k5393R213M0833o1374o6008K0441O6111J1897k0613Q662
6053A751k1303J7182M3579L0482l7087k106j9909m0550Q824k8125L4753J5500
$$ plain form
6041 2991 3089 -24930 -3660 24893 70347 90144 27532 29480 26784 -39604 -93194 -38478 18764
6028 18764 40225 5821 -27196 -69499 -36412 33721 75152 30963 -31083 -16818 -14470 23072
6016 23072 81478 17511 -27471 -30085 9821 13798 3676 -39280 -20233 -76779 -38552 -22439
6004 -22439 -39444 -71887 -87656 -59353 -59844 -72692 -32925 10160 -56668 -107100 -182406 -151167
5992 -151167 -126003 -111725 -70145 -88218 -105206 4229 62804 35340 119835 117668 12784
5981 12784 -1449 72278 72315 63908 79578 69326 116703 123341 86394 96143 40991 27365 34104
5968 34104 11573 27462 15025 57490 53240 4042 -50436 -62519 -38654 -60013 -24845 -29070
5956 -29070 -23950 -24682 -71762 -111731 -78298 -57301 -65614 12166 74384 53522 21793 -21779 -21447
$$ packed form
6041B991R8k8019K1270K8553M5454J9797o2612J948k696o6388n3590N4716N7242
6028A8764K1461l4404l3017m2303L3087P0133M1431m4189o2046J4265K348L7542
6016B3072N8406o3967m4982k614L9906L977j0122m2956J9047n6546L8227J6113
6004b2439j7005l2443j5769K8303m91j2848L9767M3085o6828n0432p5306L1239
5992a51167K5164J4278M1580j8073j6988J09435N8575k7464Q4495k167j04884
5981A2784j4233P3727L7q407J5670j0252M7377O638l6947R749n5152j3626O739
5968C4104k2531J5889j2437M2465m250m9198n4478j2083K3865k1359L5168m225
5956b9070N120p32m7080l9969L3433K0997q313P7780O2218k0862l1729m3572L32
$$ plain form
5943 -21447 -33516 -58165 -48906 -56419 -33840 -37234 34267 95881 78251 -11578 -60236 -43179
5931 -43179 24575 57523 6872 -34791 -22067 -21711 -27783 -6724 8088 20357 65856 109751
5919 109751 123851 169450 107396 15636 -10500 -45510 -77029 -50084 71164 99436 -34807
5908 -34807 -65510 -43022 -54382 -17260 -788 28733 12826 -6248 -34562 -81534 -82490 -160487
5896 -160487 -143856 -56355 4836 27094 28684 24279 100464 126840 137543 98094 12983 37899
5884 37899 58122 40197 46355 43143 -3720 -41600 -69941 -57864 -39718 12287 36174 -20475
5872 -20475 -13501 -12965 42807 23351 -33791 -75436 -80635 -90949 -91580 -66586 -87957 -87488 -58650
5859 -58650 -56882 -63252 -50805 -80241 -53458 -81809 -86784 -68113 -74733 4243 33759 -32681 -24631
$$ packed form
5943b1447j2069k4649R259p513K2579l394P1501O1614j7630q9829m8658J7057
5931d3179O7754L2948n0651m1663J2724L56o072K1059J4812J2269M5499M3895
5919A09751J4100M5599o2054r1760k6136l5010l1519K6945J21248K8272j34243
5908c4807l0703K2488j1360L7122J6472K9521j5907j9074k8314m6972r56p7997
5896a60487J6631Q7501O1191K2258J590m405P6185K6376J0703l9449q5111K4916
5884C7899K0223j7925O158l212m6863l7880k8341J2077J8146N2005K3887n6649
5872b0475O974N36N5772j9456n7142m1645n199j0314o31K4994k1371M69K8838
5859e8650J768o370J2447k9436K6783k8351m975J8671o620P8976K9516o6440Q050
$$ plain form
5846 -24631 48612 33297 -2110 -12267 -21324 5479 -3731 -34858 -88463 -112443 -135723 -102133
5834 -102133 -69955 -32919 -34765 -70779 -74739 -59191 -70896 -57779 348 38429 37498 55526
5822 55526 86019 92424 56754 33523 33043 -15148 -30222 -54225 -86511 -85364 -97838 -94879 -66270
5809 -66270 -34574 2893 2009 32577 49156 101934 59756 47522 99991 38141 36660 48770
5797 48770 81470 113220 92727 54753 40568 83898 60858 43599 20531 32000 34053 25825
5785 25825 -51062 -96640 -11733 23588 15552 -2321 -29352 -27581 -54271 -96937 -100145 -68464
5773 -68464 -32160 -55460 -48886 -106337 -25858 39728 9696 13891 -65797 -105918 -37908 58841
5761 58841 69287 -51180 -57146 -39797 -48794 -57085 -67331 -97573 -118691 -122086 -61863 -27056
$$ packed form
5846b4631P3243j5315l5407j0157r057K6803r210l1127n3605k3980k3280L3590
5834a02133L2178L7036j846l6014l960J5548j1705J3117N8127L8081r31J8028
5822E5526L0493O405l5670k3231m80m8191j5074k4003l2286J147j2474K959K8609
5809f6270L1696L7467q84L0568J6579N2778m2178j2234N2469o1850j481J2110
5797D8770L2700L1750k0493l7974j4185M3330k3040j7259k3068J1469K053q228
5785B5825p6887m5578Q4907L5321q036j7873k7031J771k6690m2666l208L1681
5773f8464L6304k3300O574n7451Q0479O5586l0032M195p9688m0121O8010R6749
5761E8841J0446j20467n966J7349q997q291j0246l0242k1118l395O0223L4807
$$ plain form
5749 -27056 19944 37696 31281 35203 20672 13902 38855 53385 134908 73526 3548 6539 29995
5736 29995 21036 -31427 40094 143708 147960 104516 31388 19480 -35543 17912 8474 -8086
5724 -8086 -10749 -43341 -37551 -51400 -69327 -4576 28202 20525 16234 60939 66104 11773 -28674
5711 -28674 -12388 8263 8072 -12112 4730 -4101 3497 -9774 -38515 -13968 10536 76084 28803
5698 28803 2643 30685 34666 62515 67971 69949 62749 100854 88865 47762 -42033 -77340 -29012
5685 -29012 17081 -53381 -37314 -14878 -22676 -8790 -29329 -46866 -24622 -62356 -115632 -102396
5673 -102396 -89573 -105849 -64940 -50013 18650 81253 5030 -48322 -79002 -111672 -75273 -29552
5661 -29552 14192 92881 108884 68397 23528 12849 -41201 -44859 -34522 29985 62479 -10983
$$ packed form
5749b7056M7000J7752o415L922j4531o770K4953J4530Q1523o1382o9978K991K3456
5736B9995q959n2463P1521J03614M252m3444p3128j1908n5023N3455r438j6560
5724h086k663l2592N790j3849j7927O4751L2778p677m291M4705N165n4331m0447
5711b8674J6286K0651j91k0184J6842q831P598j3271k8741K4547K4504O5548m7281
5698B8803k6160K8042L981K7849N456J978p200L8105j1989m1103q9795l5307M8328
5685b9012M6093p0462J6067K2436p798J3886k0539j7537K2244l7734n3276J3236
5673a02396J2823j6276M0909J4927O8663O2603p6223n3352l0680l2670L6399M5721
5661b9552M3744P8689J6003m0487m4869j0679n4050l658J0337O4507L2494p3462
$$ plain form
5649 -10983 -31436 8910 -21328 -30701 -44438 -56925 -8899 42208 30489 43955 29793 27468
5637 27468 3888 -40622 -72738 -38501 -60770 -61254 -28375 18089 56234 49767 69985 99297
5625 99297 77546 29746 66319 41471 16816 -28771 3504 66753 84404 66021 23046 -58185
5613 -58185 -64422 -60132 -68069 -66313 -31770 13224 -20975 45082 102221 97880 82543 56962 22537
5600 22537 45946 41431 47363 27564 22474 34513 14070 13712 22723 16446 1703 15436 25226
5587 25226 50877 54331 79048 80098 98831 129293 79270 44846 -31843 1215 100194 33278
5575 33278 -45165 -401 15881 -35171 -44754 -42683 -15427 -17166 -9301 -29045 -65029 -73668 -72190
5562 -72190 -99679 -79460 -41313 -77379 -118666 -165942 -105460 -19846 17005 16602 6065 14246
$$ packed form
5649a0983k0453M0346l0238r373j3737j2487M8026N1107j1719J3466j4162k325
5637B7468k3580m4510l2116L4237k2269m84L2879M6464L8145o467K0218K9312
5625I9297k1751m7800L6573k4848k4655m5587L2275O3249J7651j8383m2975q1231
5613e8185o237M290p937J756L4543M4994l4199O6057N7139m341j5337k5581l4425
5600B2537K3409m515N932j9799n090J2039k0443l58R011o277j4743J3733R790
5587B5226K5651L454K4717J050J8733L0462n0023l4424p6689L3058R8979o6916
5575C3278p8443M4764J6282n1052r583K071K7256j739P865j9744l5984q639J478
5562g2190k7489K0219L8147l6066m1287m7276O0482Q5614L6851m03j0537Q181
$$ plain form
5550 14246 62683 34075 15034 3167 -26981 -48843 -41512 -70227 -72776 -32642 -64950 20169
5538 20169 54626 48961 17092 -6615 -37928 -95135 -108953 -71493 -17563 28795 -43187 -56629
5526 -56629 -90184 -129083 -109824 -86933 -38277 -18916 -90925 -114353 -59597 -34689 -47511 -26662
5514 -26662 61809 27776 6494 -38650 -83851 -97948 -82308 -84203 -31476 2522 38979 109661
5502 109661 44715 -13677 20730 6986 8382 32971 70607 67347 -3855 -41739 -20792 27206
5490 27206 10838 -6336 -18909 -9779 18123 50912 12842 -44390 -144 20608 16951 22753
5478 22753 4774 -27388 -25370 11201 35264 -44035 -109259 -143911 -112165 -89459 -106301 -91151
5466 -91151 -103545 -72972 -119365 -101327 -104565 -102156 -122339 -126967 -88912 -101482 -99293 -47082 -20311
$$ packed form
5550A4246M8437k8608j9041j1867l0148k1862P331k8715k549M0134l2308Q5119
5538B0169L4457n665l1869k3707l1313n7207j3818L7460N3930M6358p1982j3442
5526e6629l3555l8899J9259K2891M8656J9361p2009k3428N4756K4908j2822K0849
5514b6662Q8471l4033k1282m5144m5201j4097J5640j895N2727L3998L6457P0682
5502A09661o4946n8392L4407j3744J396K4589L7636l260p1202l7884K0947M7998
5490B7206j6368j7174j2573R130K7902L2789l8070n7232M4246K0752l657N802
5478B2753j7979l2162K018L6571K4063p9299o5224l4652L1746K2706j6842J5150
5466i1151j2394L0573m6393J8038l238K409k0183m628L8055j2570K189N2211K6771
$$ plain form
5453 -20311 -8122 -79332 -119170 -95584 6379 -35656 -111590 -94911 -41366 -44697 -106024 -46601
5441 -46601 24367 5815 -60224 -131954 -104575 -93768 -77286 -19737 -16788 46777 79706 52753
5429 52753 43541 50942 -18430 -28457 -11711 19884 -42400 -79481 -96492 -46541 32086 70582
5417 70582 98822 84406 40613 32790 -3706 -24944 -2422 17262 53999 71958 89735 147129
5405 147129 72579 13418 18743 -2961 13534 -2653 6978 201 -18553 -36685 21172 10257
5393 10257 -38054 -68726 -44351 21154 97674 73024 -3137 -18442 -25161 7533 2965 -905
5381 -905 -25250 -56130 -21243 -1158 -14765 -4106 11018 51437 18552 -6635 23751 76281
5369 76281 90862 111943 41949 943 -13630 -56610 -92521 -140820 -86859 -8717 -22342 -19343
$$ packed form
5453b0311J2189p1210l9838K3586J01963m2035p5934J6679N3545l331o1327N9423
5441d6601P0968j8552o6039p1730K7379J0807J6482N7549K949O3565L2929k6953
5429E2753r212P401o9372j0027J6746L1595o2284l7081j7011M9951P8627L8496
5417G0582K8240j4416m3793p823l6496k1238K2522J9684L6737J7959J7777N7394
5405A47129p4550n9161N325k1704J6495j6187R631o777j8754j8132N7857j0915
5393A0257m8311l0672K4375O5505P6520k4650p6161j5305o719L2694m568l870
5381i05k4345l0880L4887K0085j3607J0659J5124M0419l2885k5187L0386N2530
5369G6281J4581K1081o9994m1006j4573m2980l5911m8299N3961P8142j3625K999
$$ plain form
5357 -19343 -25335 -5046 -16606 -23160 -2952 -56523 -27315 -5503 -23226 -8714 36543 3580
5345 3580 -26849 -22990 9463 -3581 2883 -31104 -6960 -55800 -32228 41883 67127 62892 72533
5332 72533 45844 -27589 -74622 -107753 -113814 -96032 -64791 -52019 -29770 45283 22014 49940
5320 49940 107034 99668 43203 -5790 -10176 -21417 3020 5897 -9282 -43361 -74312 -41324
5308 -41324 5254 21359 73906 110980 105372 16358 -27629 -3793 16016 16446 -573 5968 26808
5295 26808 26290 44706 64198 66662 59064 90638 117186 96207 59736 10690 -30101 -87606 -59486
5282 -59486 -11743 -43 -27589 -18872 -16495 66550 106408 136495 111724 47109 -17572 -19482
5270 -19482 -24923 8047 11520 -5737 -3233 47499 81449 58194 -16472 -10175 -588 -48788 -96556
$$ packed form
5357a9343n992K0289j1560o554K0208n3571K9208K1812j7723J4512M5257l2963
5345C580l0429L859L2453j3044O464l3987K4144m8840K3572P4111K5244m235R641
5332G2533k6689p3433m7033l3131o061J7782L1241J2772K2249P5053k3269K7926
5320D9940N7094p366n6465m8993m386j1241K4437K877j5179l4079l0951L2988
5308d1324M6578J6105N2547L7074n608q9014m3987K3836J9809M30j7019O541K0840
5295B6808n18J8416J9492K464p598L1574K6548k0979l6471m9046m0791n7505K8120
5282e9486M7743J1700k7546Q717K377Q3045L9858L0087k4771o4615o4681j910
5270a9482n441L2970L473j7257K504N0732L3950k3255p4666O297R587m8200m7768
$$ plain form
5257 -96556 -60763 -16420 899 -25141 -30450 13461 22999 -9048 12555 16934 -52533 -45314 -2775
5244 -2775 53828 42897 48018 43708 79457 38863 -20407 -5186 24135 -5244 22003 46344
5232 46344 689 -33679 -24724 40454 55205 49083 5239 -65817 -65291 -10748 12780 -39673 -46012
5219 -46012 -41986 -69936 -70529 -34891 47588 97172 109066 82547 75974 72040 46236 10938 45383
5206 45383 28547 40312 116611 121472 111839 55997 -7624 -72420 -82089 -53354 -48038 -37594 11048
5193 11048 -23426 -65075 -114718 -97316 27951 103050 74424 24352 5610 75525 130618 189550
5181 189550 99058 -26786 -49854 -295 17761 9967 12948 -51520 -132842 -97317 -76800 -105735
5169 -105735 -21739 -38191 -105231 -120324 -155965 -157835 -125124 -80964 -44511 -67005 -22027 33125
$$ packed form
5257i6556L5793M4343J7319k6040n309M3911R538l2047K1603M379o9467P219M2539
5244b775N6603j0931N121m310L5749m0594n9270J5221K9321k9379K7247K4341
5232D6344m5655l4368Q955O5178J4751o122m3844p1056N26N4543K3528n2453o339
5219d6012M026k7950n93L5638Q2479M9584J1894k6519o573l934k5804l5298L4445
5206D5383j6836J1765P6299M861r633n5842o3621o4796r669K8735N316J0444M8642
5193A1048l4474m1649m9643J7402J25267P5099k8626n0072j8742O9915N5093N8932
5181A89550r0492j25844k3068M9559J8056p794K981o4468q1322L5525K0517k8935
5169a05735Q3996j6452o7040j5093l5641j870L2711M4160L6453k2494M4978N5152
$$ plain form
5157 33125 1492 -12903 -8073 -14784 11218 72923 84724 144283 134716 159227 134125 88300
5145 88300 4825 24934 88060 31983 -39057 -34415 -37913 -63232 -48040 -44795 -55632 -16504
5133 -16504 7416 16903 21165 29022 33927 -13328 -28007 2685 53182 71788 82285 61477 34216
5120 34216 36286 12702 -838 -48883 -58040 -53095 -75569 -38359 -36203 -11561 8178 81260 153447
5107 153447 143664 67483 -27760 46312 116214 124012 99550 63329 95019 101904 60524 -4442
5095 -4442 -63430 -70771 -85569 -100524 -73663 -32433 -41962 -47428 -85136 -106413 -128971 -101334 -16866
5082 -16866 -1222 36497 63696 55439 89342 44784 -43370 -103681 -44636 -37231 -45708 -34819
5070 -34819 6907 8888 36074 116413 148701 102095 -2618 -42931 -22328 16691 20457 22277
$$ packed form
5157C3125l1633j4395M830o711K6002O1705J1801N9559r567K4511k5102m5825
5145H8300q3475K0109O3126n6077p1040M642l498k5319J5192L245j0837L9128
5133a6504K3920R487M262P857M905m7255j4679L0692N0497J8606J0497k0808k7261
5120C4216K070k3584j3540m8045r157M945k2474L7210K156K4642J9739P3082P2187
5107A53447r783p6181r5243P4072O9902P798k4462l6221L1690O885m1380o4966
5095d442n8988p341j4798j4955K6861M1230r529n466l7708k1277k2558K7637Q4468
5082a6866J5644L7719K7199q257L3903m4558q8154o0311N9045P405q477J0889
5070c4819M1726J981K7186Q0339L2288m6606j04713m0313K0603L9019L766J820
$$ plain form
5058 22277 34872 -18262 3647 50242 18766 14805 43912 26325 48512 52974 30371 37602
5046 37602 53532 -25601 -52882 -64194 -34306 -35805 -31335 -27673 14343 71895 72674 -12759 -32434
5033 -32434 -28412 -25951 -9474 -29116 -51663 -55984 -41927 10704 2145 -20100 -31972 -55377 -49927
5020 -49927 -9435 -20549 -23222 -9034 -39638 -78423 -69689 -62540 -42907 -63785 -106830 -77386
5008 -77386 -22652 23859 74226 54446 19089 -204 7384 36409 73015 61102 62764 144415
4996 144415 112348 70427 15356 26970 18536 2451 53172 -4093 1321 4807 34191 97339
4984 97339 107854 101730 75896 39952 27756 50836 100089 111408 112141 50083 46685 38306 31250
4971 31250 53512 52973 80048 21836 -74189 -95630 -85864 -90399 -110022 -83878 -83410 -125395 -120112
$$ packed form
5058B2277J2595n3134K1909M6595l1476l961K9107j7587K2187M462k2603P231
5046C7602J5930p9133k7281j1312K9888j499M470L662M2016N7552P79q5433j9675
5033c2434M022K461J6477j9642k2547m321J4057N2631q559k2245j1872k3405N450
5020d9927M0492j1114k673J4188l0604l8785Q734P149J9633k0878m3045K9444
5008g7386N4734M6511N0367j9780l5357j9293P588K9025L6606j1913J662Q1651
4996A44415l2067m1921n5071J1614q434j6085N0721n7265N414L486K9384O3148
4984I7339J0515o124k5834l5944j2196K3080M9253J1319P33o2058l398q379p056
4971C1250K2262n39K7075n8212r6025k1441R766m535j9623K6144M68m1985N283
$$ plain form
4958 -120112 1919 61597 60860 64443 40772 -5666 20884 23207 1170 -22502 33057 18198
4946 18198 7472 -5650 -19256 -663 -39010 -89853 -34029 -32427 -67272 -64217 -50099 -17350
4934 -17350 23005 -4390 -103705 -183737 -133704 -25752 31481 -26587 -61680 -45050 -42592 -78548
4922 -78548 -30601 -54227 -64050 -45433 -76119 -40661 9015 68783 14667 -10049 233 53575
4910 53575 109653 79129 92689 45946 22849 7822 -9908 11755 51451 23372 -5215 36880
4898 36880 22218 -20703 -29748 6599 3384 20475 7024 17041 -7404 -47447 -101352 -143568
4886 -143568 -118928 -79246 -22240 13945 58217 66311 44673 42423 -5696 4248 30815 32006
4874 32006 1882 -20214 77882 127595 107313 32561 -57853 -63969 -27802 -33394 -85142 -18155
$$ packed form
4958a20112J22031N9678p37L583k3671m6438K6550K323k2037k3672N5559j4859
4946A8198j0726j3122j3606J8593l8347n0843N5824J602l4845L055J4118L2749
4934a7350M0355k7395r9315q0032N0033J07952N7233n8068l5093J6630K458l5956
4922g8548M7947k3626r823J8617l0686L5458M9676N9768n4116k4716J0282N3342
4910E3575N6078l0524J3560m6743k3097j5027j7730K1663L9696k8079k8587M2095
4898C6880j4662m2921r045L6347l215J7091j3451J0017k4445m0043n3905m2216
4886a43568K4640L9682N7006L6185M4272Q094k1638k250m8119R944K6567J191
4874C2006l0124k2096R8096M9713k0282p4752r0414o116L6167n592n1748O6987
$$ plain form
4862 -18155 85483 54384 -26646 -88360 -72453 1858 66163 -1417 -10724 2006 -4539 50910
4850 50910 115544 76608 -37864 -95372 5363 9124 21406 33913 38211 49828 3810 3136
4838 3136 -16255 -6644 17584 10596 -18462 -7727 -2902 -17667 -9453 -24297 -13771 -15196 28228
4825 28228 99385 9862 -28509 -20030 5797 77619 46521 26220 22401 44715 16857 -39592
4813 -39592 -37096 -69694 -30187 17825 49063 68164 56107 57086 -11007 15468 75674 -15612
4801 -15612 -88333 -42788 -7504 -67304 -50865 -23677 12388 -11336 -30424 -19166 3676 -2431
4789 -2431 -11855 -46760 -67084 -117787 -65330 1007 17291 -11098 -28389 35195 35464 73393 82471
4776 82471 22611 30370 24468 367 -9348 16556 -9375 -75128 -117707 -103124 -21186 -9414
$$ packed form
4862a8155J03638l1099q1030o1714J5907P4311O4305o7580r307J2730o545N5449
4850E0910O4634l8936j14472n7508J00735L761J2282J2507M298J1617m6018o74
4838C136j9391R611K4228o988k9058J0735M825j4765Q214j4844J0526j425M3424
4825B8228P1157q9523l8371Q479K5827P1822l1098k0301l819K2314k7858n6449
4813c9592K496l2598L9507M8012L1238J9101j2057R79o8093K6475O0206r1286
4801a5612p2721M5545L5284n9800J6439K7188L6065k3724j9088J1258K2842o107
4789b431r424l4905k0324n0703N2457O6337J6284k8389j7291O3584K69L7929R078
4776H2471n9860P759n902k4101r715K5904k5931o5753m2579J4583Q1938J1772
$$ plain form
4764 -9414 32617 81107 81097 40398 -38528 -54130 -2471 -6806 -39668 -30670 -39573 -31900 -28979 27152
4750 27152 46159 -16580 -25408 -14262 -11595 30194 22601 47016 26277 23014 48279 13984 792
4737 792 -37057 -85730 -96870 -55282 -7696 23109 80032 66960 31375 18561 -5502 -19219
4725 -19219 -71475 -118969 -39090 -44386 -78880 -70539 -8384 -22690 4219 43672 52057 48826 28537
4712 28537 117300 75999 41917 40369 99609 101229 15369 -25357 -18662 42855 48850 17310 -42743
4699 -42743 -60497 -125778 -102115 -106990 -37360 -94556 -93879 20603 26017 -27718 79458 37928
4687 37928 -48143 -119016 -68414 -7419 -7730 16989 70590 98140 76893 52880 19100 48493
4675 48493 83030 107223 95150 54491 996 16720 -40479 -55906 -40714 20221 168 -1217
$$ packed form
4764i414M2031M8490j0m0699p8926j5602N1659m335l2862Q998q903P673K921N6131
4750B7152J9007o2739q828J1146K667M1789p593K4415k0739l263K5265l4295j3192
4737G92l7849m8673j1140M1588M7586L0805N6923j3072l5585j2814k4063j3717
4725a9219n2256m7494P9879n296l4494Q341O2155j4306K6909L9453Q385l231k0289
4712B8537Q8763m1301l4082j548N9240J620q5860m0726O695O1517N995l1540o0053
4699d2743j7754o5281K3663m875O9630n7196O77J14482N414n3735J07176m1530
4687C7928q6071p0873N0602O0995l11K4719N3601K7550k1247k4013l3780K9393
4675D8493L4537K4193j2073m0659n3495J5724n7199j5427J5192O0935k0053j385
$$ plain form
4663 -1217 31589 -19662 -58478 -64051 -23356 40359 108213 50086 28272 16609 -5967 -15664
4651 -15664 -13586 -17590 38505 17144 -65286 15709 29799 36999 82015 33105 -7461 6786
4639 6786 -37505 -79001 -47119 4252 44385 9254 -27415 -65198 -78180 -36751 -110735 -154555
4627 -154555 -95662 -41072 -5417 13037 -2286 -34602 -24487 -31189 -6495 26404 -45920 -94529
4615 -94529 -73226 -48759 -66229 -45476 -14088 -53277 -25715 16351 17574 26602 -3763 18504
4603 18504 57553 52229 54913 56164 55979 49561 43215 -11999 -18666 -28783 -44852 -95223 -78059
4590 -78059 -16264 -22019 -31997 -11959 -51322 -12326 -8286 -52221 -2944 -9662 4032 74350 38561
4577 38561 6576 -9052 -16161 -37359 -54526 -46365 37424 42510 89937 137504 135591 58854 54241
$$ packed form
4663a217L2806n1251l8816n573M0695O3715O7854n8127k1814j1663k2576r697
4651a5664K078m004N6095k1361q2430Q0995J4090P200M5016m8910m0566J4247
4639F786m4291m1496L1882N1371M0133l5131l6669l7783j2982M1429p3984m3820
4627a54555N8893N4590L5655J8454j5323l2316J0115o702K4694L2899p2324m8609
4615i4529K1303K4467j7470K0753L1388l9189K7562M2066J223R028l0365K2267
4603A8504L9049n324K684J251j85o418o346n5214o667j0117j6069n0371J7164
4590g8059O1795n755r978K0038l9363L8996M040m3935M9277o718J3694P0318l5789
4577C8561l1985j5628p109k1198j7167Q161Q3789N086M7427M7567j913p6737m613
$$ plain form
4564 54241 56571 54848 22862 -37519 -97663 -113201 -80443 -78915 -94180 -53248 -3057 -11934 32835
4551 32835 51131 21446 26407 82969 47685 32319 31250 -6973 -1122 34317 89834 65641
4539 65641 37310 -3753 -57577 -49161 -36723 -96931 -11073 6756 -41285 1974 -16190 -42088
4527 -42088 -84962 -104503 -55354 -41257 -113291 -105722 -114255 -100886 -57976 -37750 -73245 -53737
4515 -53737 -78796 -28709 18395 29526 40188 40173 75340 55290 58947 97986 34732 2776 -15731
4502 -15731 -32161 -35166 4066 92795 105256 64030 35162 75070 119428 113048 60737 80110
4490 80110 65767 13580 3562 -3632 56717 47298 59730 73976 42274 -20891 1769 -28544
4478 -28544 -52727 -71708 -8035 -28931 -68089 -148638 -129755 -56712 -54792 -38391 37973 68197
$$ packed form
4564E4241K330j723l1986o0381o0144j5538L2758J528j5265M0932N0191q877M4769
4551C2835J8296k9685M961N6562l5284j5366j069l8223N851L5439N5517k4193
4539F5641k8331m1063n3824Q416J2438o0208Q5858J7829m8041M3259j8164k5898
4527d2088m2874j9541M9149J4097p2034P569q533J3369M2910K0226l5495J9508
4515e3737k5059N0087M7104J1131J0662j5L5167k0050L657L9039o3254l1956j8507
4502a5731j6430l005L9232Q8729J2461m1226k8868L9908M4358o380n2311J9373
4490H0110j4343n2187j0018p194O0349r419J2432J4246l1702o3165K2660l0313
4478b8544k4183j8981O3673k0896l9158q0549J8883P3043J920J6401P6364L0224
$$ plain form
4466 68197 32275 -26112 -62044 -66701 -71545 -74822 -8321 -11476 -3561 -15396 -6011 -38449 -38077
4453 -38077 -63473 -68098 31013 31098 36139 6601 -52313 -15927 9982 7295 -4515 -31744 -5297
4440 -5297 9079 25507 11993 27080 41214 -3399 35222 103689 86054 58537 46606 87022
4428 87022 85182 39678 57528 86223 57726 10552 -16177 -8401 -80906 -81594 -36170 21305 38897
4415 38897 27379 -6035 14005 17660 -27648 -72600 -94704 -26842 16355 7933 35855 50872
4403 50872 32500 -50517 -43695 -13927 59814 76372 54389 62276 66232 77828 55593 40908
4391 40908 43176 -7716 -83809 -59186 -31462 -16382 -72376 -152857 -93043 -28932 -97010 -45466
4379 -45466 417 12886 30466 21645 -45259 -62809 -29136 -18525 82943 106067 65314 41501
$$ packed form
4466F8197l5922n8387l5932m657m844l277O6501l155P915j1835R385l2438L72
4453c8077k5396m625R9111Q5N041k9538n8914L6386K5909k687j1810k7229K6447
4440e297J4376J6428j3514J5087J4134m4613L8621O8467j7635k7517j1931M0416
4428H7022j840m5504J7850K8695k8497m7174k6729P776p2505o88M5424N7475J7592
4415C8897j1518l3414K0040L655m5308m4952k2104O7862M3197q422K7922J5017
4403E0872j8372q3017O822K9768P3741J6558k1983P887L956J1596k2235j4685
4391D0908K268n0892p6093K4623K7724J5080n5994q0481N9814O4111o8078N1544
4379d5466M5883J2469J7580q821o6904j7550L3673J0611J01468K3124m0753k3813
$$ plain form
4367 41501 72666 48042 16824 31178 17874 15396 -55326 -80005 -22933 9283 -71550 -112628
4355 -112628 -80935 -5971 39080 56570 80194 98082 64397 41362 43930 68413 84120 125579
4343 125579 132224 105841 34525 44051 59761 40749 15457 13007 -44855 -20019 37239 -8561
4331 -8561 -101772 -88381 -57504 -38623 17827 32041 -8015 -30765 -87756 -111760 -82777 -51034
4319 -51034 -13181 36612 44530 62876 42199 22197 -39364 -34157 -48139 -24147 -28244 -24632 27183
4306 27183 34629 42017 51838 48560 14696 -31049 -7155 96519 136176 128937 36408 10830 -25055
4293 -25055 -50643 -85966 -56813 -58253 -15943 38549 68636 29450 40952 -12338 -9227 24204
4281 24204 13858 9970 9283 62231 82412 49760 54927 38750 5421 9796 34792 9901 -45670
$$ packed form
4367D1501L1165k4624l1218J4354j3304k478p0722k4679N7072L2216q0833m1078
4355a12628L1693P4964M5051J7490K3624J7888l3685k3035K568K4483J5707M1459
4343A25579O645k6383p1316R526J5710j9012k5292k450n7862K4836N7258m5800
4331h561r3211J3391L0877J8881N6450J4214m0056k2750n6991k4004K8983L1743
4319e1034L7853M9793P918J8346k0677k0002o1561N207j3982K3992m097L612N1815
4306B7183P446P388R821l278l3864m5745K3894J03674L9657p239r2529k5578l5885
4293b5055k5588l5323K9153j440M2310N4492L0087l9186J1502n3290L111L3431
4281B4204j0346l888o87N2948K0181l2652N167j6177l3329M375K4996k4891n5571
$$ plain form
4268 -45670 -55363 -22775 -43935 -44880 -40883 -58050 -47997 -7055 22535 9868 15425 39485 48774
4255 48774 60587 76365 60313 -42959 -87245 -59194 -19837 51411 27567 16291 -75993 -75262
4243 -75262 -55372 30247 25268 -2826 19434 73766 46124 -42741 -41774 -33992 -29462 -7420 -6010
4230 -6010 31684 -12055 -38042 -78107 -54675 -51119 -108331 -75709 -26214 1204 10083 -13354
4218 -13354 -60588 -55394 -63058 -71419 -35701 -47038 -70260 -48110 -40933 -52667 -13874 59905 81031
4205 81031 48592 -2292 -9947 -40823 -75738 -34912 -17141 5678 13228 -1386 -65502 -39093
4193 -39093 -38983 -31391 -60996 -46271 -26528 -22946 -9113 -23559 -39438 -24989 59329 100429 60451
4180 60451 65623 39367 -21052 -34380 -55292 -20683 -33122 -54255 -35848 -46827 -124202 -123492
$$ packed form
4268d5670r693L2588k1160r45L997j7167J0053M0942K9590j2667N557K4060R289
4255D8774J1813J5778j6052j03272m4286K8051L9357P1248k3844j1276r2284P31
4243g5262J9890Q5619m979k8094K2260N4332k7642q8865R67P782M530K2042J410
4230f010L7694m3739k5987m0065K3432L556n7212L2622M9495K7418Q879k3437
4218a3354m7234N194p664q361L5718j1337k3222K2150P177j1734L8793P3779K1126
4205H1031l2439n0884p655l0876l4915M0826J7771K2819P550j4614o4116K6409
4193c9093J10P592k9605J4725J9743L582J3833j4446j5879J4449Q4318M1100l9978
4180F0451N172k6256o0419j3328k0912L4609j2439k1133J8407j0979p7375P10
$$ plain form
4168 -123492 -111156 -72673 -16437 -1638 73625 28860 32560 54288 21287 -2436 40246 101092
4156 101092 128017 152695 99416 65281 38582 14912 2952 21233 73840 126458 158173 205726
4144 205726 155611 94645 42665 43724 111746 76793 -1376 -24871 29618 25187 32688 54759
4132 54759 66190 75699 22814 -54438 -59118 -21903 32502 34531 -2663 -29827 -67056 -2979
4120 -2979 83672 75057 18797 10661 2169 24315 45199 64574 17106 -75417 -72209 -40306 2229
4107 2229 -22786 -33598 -6527 40772 46280 6554 -31226 -10175 11117 44370 37413 5769
4095 5769 32979 101032 114012 67628 51034 86515 86162 16251 -35286 -50534 -47371 -16661 -9278
4082 -9278 4993 27240 62939 -6456 -50609 -49791 -26177 -12279 -15116 33271 129081 135453 83366
$$ packed form
4168a23492J2336L8483N6236J4799P5263m4765L700K1728l3001k3723M2682O0846
4156A01092K6925K4678n3279l4135k6699k3670j1960J8281N2607N2618L1715M7553
4144B05726n0115o0966n1980J059O8022l4953p8169k3495N4489m431P501K2071
4132E4759J1431R509n2885p7252m680L7215N4405K029l7194k7164l7229O4077
4120b979Q6651q615n6260q136q492K2146K0884J9375m7468r2523L208L1903M2535
4107B229k5015j0812K7071M7299N508l9726l7780K1051K1292L3253o957l1644
4095E769K7210O8053J2980m6384j6594L5481l53o9911n1537j5248L163L0710P383
4082i278J4271K2247L5699o9395m4153Q18K3614J3898k837M8387R5810O372n2087
$$ plain form
4069 83366 47891 -31754 -56174 -43243 -44687 -66883 -47173 10627 57770 -6897 -21621 -65736
4057 -65736 -114358 -35408 48806 23631 -19711 -77333 -39348 14793 -22649 -36072 -6545 14066
4045 14066 56658 19118 -45293 -42841 -48962 -72338 -55104 -27639 -15462 49665 20031 17787
4033 17787 87023 97134 17024 -11475 -58677 -87444 -44102 24430 -41671 -60286 -4539 75753
4021 75753 19443 -39669 -66811 -74223 -25145 33469 28802 17404 51897 49499 -36685 -123522
4009 -123522 -46711 5633 32649 28396 -15081 -34869 -44348 -51679 -17993 44433 62359 61859 27327
3996 27327 -5058 -15386 -14241 12880 -14901 -25115 -69502 -92401 -95134 -29288 -17506 -21424
3984 -21424 -52844 -46259 -14595 42940 -12128 1856 30534 28582 -10470 -8689 -14457 -54747 -21253
$$ packed form
4069H3366l5475p9645k4420J2931j444k2196J9710N7800M7143o4667j4724m4115
4057f5736m8622P8950Q4214k5175m3342n7622L7985N4141l7442j3423K9527K0611
4045A4066M2592l7540o4411K452o121k3376J7234K7465J2177O5127k9634k244
4033A7787O9236J0111q0110k8499m7202k8767M3342O8532o6101j8615N5747Q0292
4021G5753n6310n9112k7142p412M9078N8614m667j1398L4493k398q6184q6837
4009a23522P6811N2344K7016m253m3477j9788r479p331L3686O2426J7926n00l4532
3996B7327l2385j0328J145K7121k7781j0214m4387k2899k733O5846J1782l918
3984b1424l1420O585L1664N7535n5068J3984K8678j952l9052J781n768m0290L3494
$$ plain form
3971 -21253 20119 50887 -19877 -90878 -9781 78797 63143 95949 48628 13145 45004 64887
3959 64887 50920 42258 31391 27975 37417 11266 -51866 -59985 -48035 -22908 -60752 -21110 29859
3946 29859 88262 57157 11782 -15869 -72492 -70377 -6567 29374 95376 81788 39328 61374
3934 61374 4296 -58501 -134184 -98478 -76592 -73613 -39501 -82271 -133801 -126521 -127910 -99354
3922 -99354 -52060 -2649 20789 -12108 21901 13068 -22273 -34626 -78666 -40996 40 -26301
3910 -26301 11187 73013 32442 -23951 -72374 -59118 -33466 12530 33593 -10163 -26740 43512
3898 43512 34073 -2431 -34245 -46015 -92363 -36006 -29494 -26241 -48231 -57205 -35167 6117 -25863
3885 -25863 14426 -1487 -78366 -79782 -29915 -56190 -74134 -67482 -73422 -71150 -57725 -56099 -37030
$$ packed form
3971b1253M1372L0768p0764p1001Q1097Q8578j5654L2806m7321l5483L1859J9883
3959F4887j3967q662j0867l416R442k6151o3132q119J1950K5127l7844L9642N0969
3946B9859N8403l1105m5375k7651n6623K115O3810L5941O6002j3588m2460K2046
3934F1374n7078o2797p5683L5706K1886K979L4112m2770n1530P280j389K8556
3922i9354M7294M9411K3438l2897L4009q833l5341j2353m4040L7670M1036k6341
3910b6301L7488O1826m0571n6393m8423J3256K5652M5996K1063m3756j6577P0252
3898D3512r439l6504l1814j1770m6348N6357O512L253k1990q974K2038M1284l1980
3885b5863M0289j5913p6879j416M9867k6275j7944O652n940K272J3425J626J9069
$$ plain form
3872 -37030 -25822 -6634 19172 -2629 -24468 -70124 -24018 -27407 -8201 38716 14087 -59107
3860 -59107 -69512 -82337 -114534 -22892 -3434 -33096 -45557 -14597 34130 48800 49720 -10585
3848 -10585 -14661 80441 102788 48270 52573 62719 49378 34639 -32060 -65563 -35980 11588
3836 11588 72358 76025 42927 62652 90663 48871 17027 -28340 -78763 -86038 -90761 -61645
3824 -61645 -68640 -80931 -72198 -135058 -184614 -130668 -31338 -22584 -1569 -18594 -3568 18618
3812 18618 28671 -46077 -59212 8163 81296 46863 8785 52283 35300 19602 21022 -11835
3800 -11835 -15197 -23474 -41187 -7314 8547 70682 66451 22820 -17240 -12935 -28866 -72298 -26577
3787 -26577 -40541 -74593 -65781 -39159 -52943 -64036 -72376 -34186 -42610 -88241 -78161 -64160
$$ packed form
3872c7030J1208J9188K5806k1801k1839m5656M6106l389J9206M6917k4629p3194
3860e9107j0405j2825l2197R1642J9458k9662j2461L0960M8727J4670R20o0305
3848a0585m076R5102K2347n4518M303J0146j3341j4739o6699l3503K9583M7568
3836A1588O0770L667l3098J9725K8011m1792l1844m5367n0423p275m723K9116
3824f1645o995j2291Q733o2860m9556N3946R9330Q754K1015j7025J5026K2186
3812A8618J0053p4748j3135O7375P3133l4433l8078M3498j6983j5698J420l2857
3800a1835l362q277j7713L3873J5861O2135m231m3631m0060M305j5931m3432M5721
3787b6577j3964l4052Q812K6622j3784j1093q340L8190q424m5631J0080J4001
$$ plain form
3775 -64160 -53768 4670 33127 59124 49367 71038 115589 110390 124711 39120 46047 51219 46753
3762 46753 40561 47006 49418 14300 13267 10113 5606 34741 5275 17327 -18288 -1596 75826
3749 75826 107338 -1270 -118220 -64756 31866 107703 83572 66089 14388 -59548 -70283
3738 -70283 -51404 -20563 53465 56636 30966 44382 8369 -3828 19348 53350 98215 55654
3726 55654 42115 76371 48308 50992 91848 51097 23460 42864 103159 78239 45188 93058
3714 93058 134259 115860 36553 51533 118714 72349 -12125 -12776 32557 -80 28821 109278
3702 109278 99290 92654 110982 69356 28612 30035 -4525 -37337 -63969 -121619 -110174 -64579
3690 -64579 1484 12202 -26543 -14991 6349 52552 71621 29126 12767 -16045 -38810 -59379
$$ packed form
3775f4160J0392N8438K8457K5997r757K1671M4551n199J4321q5591O927N172m466
3762D6753o192O445K412l5118j033l154m507K9135k9466J2052l5615J6692P7422
3749G5826L1512j08608j16950N3464R6622P5837k4131j7483n1701p3936j0735
3738g0283J8879L0841P4028L171k5670J3416l6013j2197K3176L4002M4865m2561
3726E5654j3539L4256k8063K684M0856m0751k7637J9404O0295k4920l3051M7870
3714I3058M1201j8399p9307J4980O7181m6365q4474o51M5333l2637K8901Q0457
3702A09278r988o636J8328m1626m0744J423l4560l2812k6632n7650J1445M5595
3690f4579O6063J0718l8745J1552K1340M6203J9069m2495j6359k8812k2765k0569
$$ plain form
3678 -59379 -74372 -33844 -6702 31507 51917 60187 105454 129787 84443 27545 2334 -8299
3666 -8299 -27323 -55931 -17148 -38598 -44228 -34912 2226 28127 49723 -25034 -65813 -71671 -37604
3653 -37604 -11219 -42229 28647 39509 18316 26996 -17719 -55390 -57967 -1706 99717 76806
3641 76806 -39231 -31514 -20423 -55808 -39975 -43998 -31247 -20406 -33195 -34117 51956 68269
3629 68269 21559 18782 13097 -2840 13029 -10904 -59819 -130922 -125148 -70401 -69942 -65187 -8748
3616 -8748 73688 92010 100362 109040 32923 -58105 -54335 44329 58770 42498 31031 -53375 -134780
3603 -134780 -127057 -130930 -74099 -34270 -16996 18218 68255 73010 48471 4423 15061 -964
3591 -964 -76603 -107802 -104148 -83012 -39239 -17337 -27841 -8256 -29692 -36341 -15270 -54803 -52405
$$ packed form
3678e9379j4993M0528K7142L8209K0410Q270M5267K4333m5344n6898k5211j0633
3666h299j9024k8608L8783k1450n630R316L7138K5901K1596p4757m0779n858L4067
3653c7604K6385l1010P0876J0862k1193Q680m4715l7671k577N6261J01423k2911
3641G6806j16037P717J1091l5385J5833m023J2751J0841j2789r22Q6073J6313
3629F8269m6710k777n685j5937J5869k3933m8915p1103N774N4747M59M755N6439
3616h748Q2436J8322Q352Q678p6117r1028L770R8664J4441j6272j1467q4406q1405
3603a34780P723l873N6831L9829J7274L5214N0037M755k4539m4048J0638j6025
3591i64p5639l1199L654K1136M3773K1902j0504J9585k1436o649K1071l9533K398
$$ plain form
3578 -52405 21531 58631 52837 -5364 -62828 -105840 -83408 -71453 -76480 -118067 -110086 -59572
3566 -59572 -13631 31075 -1730 -34811 -1283 38273 9531 -66960 -23157 83040 70040 54096
3554 54096 75444 67466 104441 81841 5786 -30668 -50827 8357 -4275 10437 24849 -4405
3542 -4405 29403 28142 16199 53379 51410 -28382 -122769 -117112 -100524 -102704 -58153 -22451 -42419
3529 -42419 -15266 -16617 -29388 -87608 -126374 -123172 -68861 -20429 39659 56625 59769 59737 83519
3516 83519 72941 50682 90263 66333 51356 94214 64230 24269 33301 37868 430 -19346
3504 -19346 -954 -15190 -22281 14727 42459 36337 39249 31769 -33213 -19136 44123 15753 5194
3491 5194 49453 28703 73842 159453 119235 86162 70435 93418 74799 71152 49706 -8695
$$ packed form
3578e2405P3936L7100n794n8201n7464m3012K2432J1955n027m1587P981N0514
3566e9572M5941M4706l2805l3081L3528L9556k8742p6491M3803J06197j3000j5944
3554E4096K1348p978L6975k2600p6055l6454k0159N9184j2632J4712J4412k9254
3542d405L3808j261j1943L7180j969p9792r4387N657J6588k180M4551L5702j9968
3529d2419K7153j351j2771n8220l8766L202N4311M8432O0088J6966L144l2K3782
3516H3519j0578k2259L9581k3930j4977M2858k9984l9961R032M567l7438j9776
3504a9346J8392j4236p091L7008K7732o122K912p480o4982J4077O3259k8370j0559
3491E194M4259k0750M5139Q5611m0218l3073j5727K2983j8619l647k1446n8401
$$ plain form
3479 -8695 -30465 -3240 -26072 -50838 -75310 -64990 -26079 -33170 -26036 10829 51593 61758
3467 61758 54670 59109 90902 72069 83816 25520 -2262 31458 23495 -25411 -77616 -55440
3455 -55440 -19231 -29623 9741 37600 49660 51737 46134 11398 23983 14754 40351 35970 -6433
3442 -6433 8996 22372 35568 5713 -65725 -91922 -41493 -33524 -28259 -16234 -30422 -75479
3430 -75479 -34934 26026 32642 148467 116437 24803 25788 -8482 -1512 -11052 -4817 -52671 -67277
3417 -67277 -45201 -101032 -121277 -55288 4915 44001 29013 16166 3584 -52423 -26682 -16892
3405 -16892 -71289 -89047 -76758 -25068 -1492 71983 22125 13889 38477 -1028 -19907 -17431
3393 -17431 -39362 -52475 -58211 -33683 -24254 -40123 -20694 -56294 -46893 -27569 -22883 27579 84429
$$ packed form
3479h695k1770K7225k2832k4766k4472J0320L8911p091P134L6865M0764J0165
3467F1758p088M439L1793j8833J1747n8296k7782L3720p963m8906n2205K2176
3455e5440L6209j0392L9364K7859J2060K077n603l4736J2585r229K5597m381m2403
3442f433J5429J3376J3196k9855p1438k6197N0429P969N265J2025j4188m5057
3430g5479M0545O0960O616J15825l2030r1634R85l4270O970r540O235m7854j4606
3417f7277K2076n5831k0245O5989O0203L9086j4988j2847j2582n6007K5741R790
3405a6892n4397j7758J2289N1690K3576P3475m9858q236K4588l9505j8879K476
3393a7431k1931j3113n736K4528R429j5869J9429l5600R401J9324M686N0462N6850
$$ plain form
3380 84429 86446 79350 -1976 14507 8324 -25043 -61761 -50094 -6381 61073 101428 71734
3368 71734 60086 21067 -5670 55607 26231 50960 61786 15161 -16132 13005 13367 1894
3356 1894 -13352 -6986 68786 80533 -33791 -62411 -94359 -39388 85574 124404 25625 -7952
3344 -7952 -18958 -18506 5791 -22786 -19452 -4030 -493 13494 36115 20306 5863 15524 3320
3331 3320 -4727 32047 94800 112389 54785 -1038 -36869 -22717 15172 14517 37015 51134 -7354
3318 -7354 -37146 -90428 -42138 63541 48519 64908 32712 5359 30949 7468 35217 81714
3306 81714 100099 60928 -31302 -20172 51018 32150 -2592 38397 73028 18420 6977 35181
3294 35181 16650 70484 39967 -254 9541 42639 54764 74921 44062 -38285 -22272 -1622
$$ packed form
3380H4429K017p096q1326J6483o183l3367l6718J1667M3713O7454M0355k9694
3368G1734j1648l9019k6737O1277k9376K4729J0826m6625l1293K9137L62j1473
3356A894j5246O366P5772J1747j14324k8620l1948N4971J24962L8830r8779l3577
3344g952j1006M52K4297k8577L334J5422L537J3987K2621j5809j4443R661j2204
3331C320q047L6774O2753J7589n7604n5823l5831J4152L7889o55K2498J4119n8488
3318g354k9792n3282M8290J05679j5022J6389l2196k7353K5590k3481K7749M6497
3306H1714J8385l9171r2230J1130P1190j8868l4742M0989L4631n4608j1443K8204
3294C5181j8531N3834l0517m0221R795L3098J2125K0157l0859q2347J6013K0650
$$ plain form
3282 -1622 18684 26980 90469 100026 44320 9987 65769 105516 68086 22727 20130 -22209 -41544
3269 -41544 -42588 9112 71130 26315 -13934 -67339 -86948 -119942 -57214 -41893 -64288 -14807
3257 -14807 11895 -25896 -14164 -1647 2663 -28926 -50283 -55259 -28777 -65908 -25741 -548
3245 -548 -7425 35627 35918 -7388 -69407 -49820 34623 56075 29400 -16857 -2973 3855 -17257
3232 -17257 -4193 36979 46179 27526 3279 31783 58184 32227 20961 18322 -19601 3800
3220 3800 -16995 -46958 -23044 5321 40421 55826 -10414 -85299 -55421 26405 11724 14097
3208 14097 14845 -35854 -65812 -40466 26082 45327 71563 68306 86461 66657 88514 132510
3196 132510 112566 63061 90535 112288 141516 132061 38063 -27647 -35201 -23457 -36091 -39738
$$ packed form
3282a622K0306Q296O3489R557n5706l4333N5782L9747l7430m5359k597m2339j9335
3269d1544j044N1700O2018m4815m0249n3405j9609l2994O2728J5321k2395M9481
3257a4807K6702l7791J1732J2517M310l1589k1357m976K6482l7131M0167K5193
3245e48o877M3052K91m3306o2019J9587Q4443K1452k6675m6257J3884O828k1112
3232a7257J3064M1172R200j8653k4247K8504K6401k5957j1266k639l7923K3401
3220C800k0795k9963K3914K8365L5100J5405o6240p4885K9878Q1826j4681K373
3208A4097P48n0699k9958K5346O6548J9245K6236l257J8155j9804K1857M3996
3196A32510j9944m9505K7474K1753K9228r455r3998o5710p554J1744j2634l647
$$ plain form
3184 -39738 -34369 2383 29693 20233 -15717 -54917 -51692 -61735 -41834 20169 57052 16992
3172 16992 -33581 9814 83074 161417 131480 12440 3944 -16481 -94344 -68829 -17523 -21802
3160 -21802 -31427 -49935 -25934 -30020 -31499 51642 89945 81531 120195 147186 150924 116135 74571
3147 74571 58928 69337 91903 32561 -25318 1391 72889 120941 114657 86538 112979 53412
3135 53412 149 -32950 -16371 147 30404 30478 74844 68821 56436 22053 -50544 -31159 30700
3122 30700 -15103 -48139 -61276 -41884 -17742 10797 43434 4858 -22156 -19132 -14327 12578
3110 12578 -14438 -91685 -98358 -108601 -52750 -7039 25117 -5128 15365 29663 -28331 -21822
3098 -21822 -1778 61639 41773 31016 28350 38890 71830 19025 -20093 37083 45632 -17828
$$ packed form
3184c9738N369L6752K7310r460l5950l9200L225j0043J9901O2003L6883m0060
3172A6992n0573M3395P3260P8343k9937j19040q496k0425p7863K5515N1306m279
3160b1802r625j8508K4001m086j479Q3141L8303q414L8664K6991L738l4789m1564
3147G4571j5643J0409K2566n9342n7879K6709P1498M8052o284k8119K6441n9567
3135E3412n3263l3099J6579J6518L0257P4M4366o023j2385l4383p2597J9385O1859
3122C0700m5803l3036j3137J9392K4142K8539L2637l8576k7014L024M805K6905
3110A2578k7016p7247o673j0243N5851M5711L2156l0245K0493J4298n7994O509
3098b1822K0044O3417j9866j0757k666J0540L2940n2805l9118N7176Q549o3460
$$ plain form
3086 -17828 29975 19685 4346 7660 -31982 -3019 -6542 -35421 -35569 -19817 -15461 -45848 -53584
3073 -53584 25622 12075 -61655 8733 95887 110990 129733 100037 29430 -13408 -72486 -111268
3061 -111268 -82374 21691 86921 42670 34980 42350 -12438 -27161 -19298 -25191 -42591 -20107
3049 -20107 14005 -24378 -53897 -42620 -103195 -109248 -68912 -51006 -60161 -20497 31065 -9215
3037 -9215 -68223 -145499 -191521 -154398 -49960 273 -13903 2249 21500 9477 -40822 -41307
3025 -41307 40304 101361 48690 -72384 -69422 -33454 -64528 -67417 -94134 -62495 26594 68191
3013 68191 64648 58780 -71394 -88875 -25025 54407 22234 7813 -31561 -61636 -62532 -74951
3001 -74951 -45149 -61454 -89303 -110603 -152820 -116420 -42649 -21510 -24744 -36061 -14256 3229
$$ packed form
3086a7828M7803j0290j5339L314l9642K8963l523k8879j48J5752M356l0387p736
3073e3584P9206j3547p3730P0388Q7154J5103J8743k9696p0607m2838n9078l8782
3061a11268K8894J04065O5230m4251p690P370n4788j4723P863n893j7400K2484
3049b0107L4112l8383k9519J1277o0575o053M0336J7906r155L9664N1562m0280
3037i215n9008p7276m6022L7123J04438N0233j4176J6152J9251j2023n0299m85
3025d1307Q1611O1057n2671j21074K962L5968l1074k889k6717L1639Q9089M1597
3013F8191l543n868j30174j7481O3850P9432l2173j4421l9374l0075q96j2419
3001g4951K9802j6305k7849k1300m2217L6400P3771K1139l234j1317K1805J7485
$$ plain form
2989 3229 7388 -6937 -21938 -61284 -94083 -69360 -36455 10144 32894 54979 74265 79923
2977 79923 63527 55494 85690 83428 15984 -30663 -1023 8321 -46099 -21715 -736 -28256
2965 -28256 16930 28972 -47768 -82279 -32045 19896 71622 85384 26742 61619 75415 38603
2953 38603 -11426 -15135 23329 20729 31534 19896 -25356 -45380 11319 62236 68238 53237
2941 53237 2119 -51544 -40815 5182 38079 -20215 -21494 -24326 -41686 -57442 -39173 2189
2929 2189 -3361 12506 47398 83615 89787 50904 99077 91596 28817 -9940 21051 34200 13177
2916 13177 -17794 -83435 -41252 -15989 15848 26385 37760 53909 79437 16726 -63730 -88675
2904 -88675 -34505 -42170 -43972 49029 80769 -1717 -38321 -12047 32012 62663 41756 -34873
$$ packed form
2989C229M159j4325j5001l9346l2799K4723L2905M6599K2750K2085J9286N658
2977G9923j6396q033L0196k262o7444m6647K9640R344n4420K4384K0979k7520
2965b8256M5186J2042p6740l4511N0234N1941N1726J3762n8642L4877J3796l6812
2953C8603n0029l709L8464k600J0805j1638m5252k0024N6699N0917O002j5001
2941E3237n1118n3663J0729M5997L2897n8294j279k832j7360j5756J8269M1362
2929B189n550J5867L4892L6217O172l8883M8173p481o2779l8757L0991J3149k1023
2916A3177l0971o5641M2183K5263L1837J0537J1375J6149K5528o2711q0456k4945
2904h8675N4170p665j802R3001L1740q2486l6604K6274M4059L0651k0907p6629
$$ plain form
2892 -34873 -75755 -36155 11352 -40586 -56425 -11313 57264 62652 54957 11224 -11940 17642
2880 17642 48142 34798 43028 111824 109933 -1672 -48698 -33989 -93731 -111416 -44705 29008
2868 29008 25897 -11334 -81649 -66919 13552 55002 23672 20293 45960 53553 81060 114049
$$ packed form
2892c4873m0882L9600M7507n1938j5839M5112O8577N388p695m3733k3164K9582
2880A7642L0500j3344Q230O8796j891j11605m7026J4709n9742j7685O6711P3713
2868B9008l111l7231p0315J4730Q0471M1450l1330l379K5667P593K7507L2989
$$ [...]
##END NTUPLES=NMR SPECTRUM
##END=
