##TITLE=Analysis number 320855
Compound Code cc 29339
Project Code adrs
Chemist Name af chempharm
##JCAMPDX= 6.0         $$ Bruker NMR JCAMP-DX V2.0
##DATA TYPE= NMR SPECTRUM
##DATA CLASS= NTUPLES
##ORIGIN= Bruker BioSpin GmbH
##OWNER= nmr
$$ XWIN-NMR		Version 3.5
$$ Thu Jul 13 11:12:32 2006 GMT Daylight Time (UT+1h)  MAYBRIDGE\nmr@NMR_250MHZ
##.OBSERVE FREQUENCY= 250.131544655141
##.OBSERVE NUCLEUS= ^1H
##.ACQUISITION MODE= SIMULTANEOUS (DQD)
##.ACQUISITION SCHEME= undefined
##.AVERAGES= 16
##.DIGITISER RES= 18
##SPECTROMETER/DATA SYSTEM= dpx250
##.PULSE SEQUENCE= zg30
##.SOLVENT NAME= CDCl3
##.SHIFT REFERENCE= (INTERNAL, CDCl3, 0, 16.522)
##AUDIT TRAIL= $$ (NUMBER, WHEN, WHO, WHERE, WHAT)
$$ ##TITLE= Audit trail, XWIN-NMR		Version 3.5
$$ ##JCAMPDX= 5.01
$$ ##ORIGIN= Bruker BioSpin GmbH
$$ ##OWNER= nmr
$$ C:\u/data/dgb/nmr/ADRS/2670/pdata/1/auditp.txt
$$ ##AUDIT TRAIL=  $$ (NUMBER, WHEN, WHO, WHERE, WHAT)
(   1,<2006-07-13 11:12:10.53 +100>,<MAYBRIDGE\nmr>,<NMR_250MHZ>,
      <created by zg, POWCHK disabled, PULCHK disabled
       configuration hash MD5:
       E2 DF 36 D8 04 B2 41 60 5A D7 A3 38 5A 4B D0 FE
       data hash MD5: 64K
       3D 63 88 10 4F 7A AF AF 00 4B 48 1A B8 FC A8 84>)
(   2,<2006-07-13 11:12:23.05 +100>,<MAYBRIDGE\nmr>,<NMR_250MHZ>,
      <Start of raw data processing
       ef LB = 0.3 FT_mod = 6 PKNL = 1 SI = 32K 
       data hash MD5: 32K
       F0 A0 E2 12 88 2E 4E 39 E5 BF 0F F8 19 F7 CA F7>)
(   3,<2006-07-13 11:12:24.70 +100>,<MAYBRIDGE\nmr>,<NMR_250MHZ>,
      <apk 
       data hash MD5: 32K
       C5 F8 1D 65 18 10 90 CF 89 23 01 C3 74 67 01 7E>)
(   4,<2006-07-13 11:12:25.75 +100>,<MAYBRIDGE\nmr>,<NMR_250MHZ>,
      <abs ABSG = 5 
       data hash MD5: 32K
       07 8F 92 FC A9 44 1F D2 2A C1 81 0F 01 97 78 03>)
$$ ##END=
$$ 
$$ hash MD5
$$ 88 36 D9 06 FF B4 8B 68 1C 1D 91 1D 5D 89 2F E5
##$RELAX= 
##$RELAX= 
##$RELAX= 
##$RELAX= 
##$RELAX= 
##$RELAX= 
##$RELAX= 
$$ Bruker specific parameters
$$ --------------------------
##$DU= <C:\u>
##$EXPNO= 2670
##$NAME= <ADRS>
##$PROCNO= 1
##$TYPE= <nmr>
##$USER= <dgb>
##$AMP= (0..31)
100 100 100 100 100 100 100 100 100 100 100 100 100 100 100 100 100 100 
100 100 100 100 100 100 100 100 100 100 100 100 100 100 
##$AQSEQ= 0
##$AQ_mod= 3
##$AUNM= <au_zg>
##$AUTOPOS= <11 >
##$BF1= 250.13
##$BF2= 250.13
##$BF3= 250.13
##$BF4= 250.13
##$BF5= 500.13
##$BF6= 500.13
##$BF7= 500.13
##$BF8= 500.13
##$BYTORDA= 1
##$CFDGTYP= 0
##$CFRGTYP= 5
##$CHEMSTR= <none>
##$CNST= (0..31)
1 1 145 1 1 1 1 1 1 1 1 1 1 1 1 1 1 1 1 1 1 1 1 1 1 1 1 1 1 1 1 1 
##$CPDPRG= <>
##$CPDPRG1= <>
##$CPDPRG2= <>
##$CPDPRG3= <>
##$CPDPRG4= <mlev>
##$CPDPRG5= <mlev>
##$CPDPRG6= <mlev>
##$CPDPRG7= <mlev>
##$CPDPRG8= <mlev>
##$CPDPRGB= <>
##$CPDPRGT= <>
##$D= (0..31)
0 1 0 0 0 0 0 0 0 0.06 0 0 0 0 0 0 0.0002 0 0 0 0 0 0 0 0 0 0 0 0 0 0 
0 
##$DATE= 1152785529
##$DBL= (0..7)
120 120 120 120 120 120 120 120 
##$DBP= (0..7)
150 150 150 150 150 150 150 150 
##$DBP07= 0
##$DBPNAM0= <>
##$DBPNAM1= <>
##$DBPNAM2= <>
$$ [...]
##$SUBNAM7= <"">
##$SUBNAM8= <"">
##$SUBNAM9= <"">
##$SW= 20.6930455092707
##$SWIBOX= (0..15)
0 0 3 0 0 0 0 0 0 0 0 0 0 0 0 0 
##$SW_h= 5175.983436853
##$TD= 65536
##$TD0= 1
##$TE= 296.16
##$TE2= 300
##$TE3= 300
##$TEG= 300
##$TL= (0..7)
0 120 120 120 120 120 120 120 
##$TP= (0..7)
150 150 150 150 150 150 150 150 
##$TP07= 0
##$TPNAME0= <>
##$TPNAME1= <>
##$TPNAME2= <>
##$TPNAME3= <>
##$TPNAME4= <>
##$TPNAME5= <>
##$TPNAME6= <>
##$TPNAME7= <>
##$TPOAL= (0..7)
0.5 0.5 0.5 0.5 0.5 0.5 0.5 0.5 
##$TPOFFS= (0..7)
0 0 0 0 0 0 0 0 
##$TUNHIN= 0
##$TUNHOUT= 0
##$TUNXOUT= 0
##$USERA1= <user>
##$USERA2= <user>
##$USERA3= <user>
##$USERA4= <user>
##$USERA5= <user>
##$V9= 5
##$VALIST= <valist>
##$VCLIST= <CCCCCCCCCCCCCCC>
##$VD= 0
##$VDLIST= <DDDDDDDDDDDDDDD>
##$VPLIST= <PPPPPPPPPPPPPPP>
##$VTLIST= <TTTTTTTTTTTTTTT>
##$WBST= 1024
##$WBSW= 4
##$XGAIN= (0..3)
0 0 0 0 
##$XL= 0
##$YL= 0
##$YMAX_a= 417951
##$YMIN_a= -512054
##$ZGOPTNS= <>
##$ZL1= 120
##$ZL2= 120
##$ZL3= 120
##$ZL4= 120
##$ABSF1= 16.522
##$ABSF2= -4.171173
##$ABSG= 5
##$ABSL= 3
##$ALPHA= 0
##$AQORDER= 0
##$ASSFAC= 0
##$ASSFACI= 0
##$ASSFACX= 0
##$ASSWID= 0
##$AUNMP= <proc_1d>
##$AZFE= 0.1
##$AZFW= 0.1
##$BCFW= 0
##$BC_mod= 0
##$BYTORDP= 0
##$COROFFS= 0
##$CY= 12.5
##$DATMOD= 1
##$DC= 0
##$DFILT= <>
##$DTYPP= 0
##$F1P= 14.0000005364418
##$F2P= -0.99999901652339
##$FCOR= 0.5
##$FTSIZE= 32768
##$FT_mod= 6
##$GAMMA= 0
##$GB= 0
##$INTBC= 1
##$INTSCL= 1
##$ISEN= 128
##$LB= 0.3
##$LEV0= 0
##$LPBIN= 0
##$MAXI= 10000
##$MC2= 0
##$MEAN= 0
##$ME_mod= 0
##$MI= 0
##$NCOEF= 0
##$NC_proc= -2
##$NLEV= 6
##$NOISF1= 0
##$NOISF2= 0
##$NSP= 0
##$NTH_PI= 0
##$NZP= 0
##$OFFSET= 16.522
##$PC= 1
##$PHC0= 161.1757
##$PHC1= 7.797515
##$PH_mod= 1
##$PKNL= yes
##$PPARMOD= 0
##$PSCAL= 4
##$PSIGN= 0
##$REVERSE= no
##$SF= 250.13
##$SI= 32768
##$SIGF1= 0
##$SIGF2= 0
##$SINO= 400
##$SIOLD= 32768
##$SREGLST= <1H.CDCl3>
##$SSB= 0
##$STSI= 32768
##$STSR= 0
##$SW_p= 5175.98343685301
##$SYMM= 0
##$S_DEV= 0
##$TDeff= 65536
##$TDoff= 0
##$TI= <Analysis number 999999
Compound Code 99
Book Reference 9
Project Code 9>
##$TILT= no
##$TM1= 0
##$TM2= 0
##$TOPLEV= 0
##$USERP1= <user>
##$USERP2= <user>
##$USERP3= <user>
##$USERP4= <user>
##$USERP5= <user>
##$WDW= 1
##$XDIM= 32768
##$YMAX_p= 305240248
##$YMIN_p= -234475
$$ End of Bruker specific parameters
$$ ---------------------------------
##NTUPLES= NMR SPECTRUM
##VAR_NAME=  FREQUENCY,     SPECTRUM/REAL,   SPECTRUM/IMAG
##SYMBOL=    X,             R,               I
##VAR_TYPE=  INDEPENDENT,   DEPENDENT,       DEPENDENT
##VAR_FORM=  AFFN,          ASDF,            ASDF
##VAR_DIM=   32768,         32768,           32768
##UNITS=     HZ,            ARBITRARY UNITS, ARBITRARY UNITS
##FACTOR=    0.157963299565203, 1,           1
##FIRST=     4132.6476996994, 0,             0
##LAST=      -1043.33573715361, 0,           0
##MIN=       -1043.33573715361, -234475,     0
##MAX=       4132.6476996994, 305240248,     0
$$ Real data points
##PAGE= N=1
##DATA TABLE= (X++(R..R)), XYDATA
$$ [...]
14945e162M771K634m204J440n344O60J1294K745p160M49J2262P92k290p300L608
$$ -5162 -391 2243 -1961 -521 -5865 -5205 6089 8834 1674 2123 14385 15177 12887 5587 9195
14930I195o393j0398R781J5707P925j3123k5586j4277p302L429N612J231J4507
$$ 9195 2802 -7596 2185 17892 25817 12694 -12892 -27169 -34471 -31042 -25430 -24199 -9692
14917i692J9221K888n397k421o317l380j3680j766Q528R945m855M460j476j937
$$ -9692 9529 12417 7020 4599 -1718 -5098 -18778 -20544 -12016 -2071 -6926 -2466 -3942 -5879
14903e879O424J0422M687m040j3941L181j407j4361R192J9126l170N229N118q736
$$ -5879 545 10967 15654 11614 -2327 854 -553 -14914 -5722 13404 10234 15463 20581 11845
14889A1845m446N961k940J2037L341j7594j2988k969K592n716j0354k79J0213
$$ 11845 7399 13360 10420 22457 25798 8204 -4784 -7753 -5161 -10877 -21231 -21510 -11297
14876a1297J2986J2088Q806j284q445k1437r941m34O365P667j1824r434J1116
$$ -11297 1689 13777 22583 21299 12854 -8583 -18524 -18958 -12593 -4926 -16750 -26184 -15068
14863a5068J2026P115l288m929O010o490L279N121o951m311j883Q890K026o877
$$ -15068 -3042 4073 785 -4144 1866 -4624 -1345 3776 -3175 -7486 -9369 -479 1547 -5330
14849e330j033J220P761L112p383j2937p927J4731M530m327J0180M747N400N12
$$ -5330 -6363 -5143 2618 5730 -1653 -14590 -22517 -7786 -3256 -7583 2597 7344 12744 13256
14835A3256p239j43K881r231j3038r584J1972P655k693m821M70k513p379j7141
$$ 13256 6017 5874 8755 -476 -13514 -23098 -11126 -3471 -6164 -10985 -10515 -13028 -20407 -37548
14821c7548R256J6328L716P621j94j231O50o333O969J365J6769m320p549p067
$$ -37548 -28292 -11964 -8248 -627 -821 -2052 -1402 -7735 -766 599 17368 13048 5499 -1568
14807a568o741j094L410k563M739n604N988J4987l21M984j35n175k719K229j46
$$ -1568 -8309 -9403 -5993 -8556 -3817 -9421 -3433 11554 11233 16217 16082 10907 8188 10417 10271
14792A0271k080n26J329K160r586j1554j0410n652J948N298N798N595k343m965
$$ 10271 8191 7665 8994 11154 1568 -9986 -20396 -26048 -24100 -18802 -13004 -7409 -9752 -14717
14778a4717j005K409j2179j0654O143J4784L915k44J6596K606r106j4116p964
$$ -14717 -15722 -13313 -25492 -36146 -30003 -15219 -11304 -11548 5048 7654 -1452 -15568 -23532
14765b3532K386M097k585m075k09n589j126j641j051J4380O59l67j676M647N873
$$ -23532 -21146 -17049 -19634 -23709 -23918 -29507 -30633 -32274 -33325 -18945 -18286 -18653 -20329 -15682 -9809
14750i809Q000m646j2782m497J4482J4134K546L453K133k97P447J0788j4184r955
$$ -9809 -1809 -6455 -19237 -23734 -9252 4882 7428 10881 13014 12717 20164 30952 16768 6813
14736F813l473j1170M012J0092R097Q538l496k70k726m537p592l97j7218k982
$$ 6813 3340 -7830 -3818 6274 15371 23909 20413 20143 17417 12880 5288 4891 -12327 -15309
14722a5309Q964K778J707j529Q919r873o604Q48J501K985J477L3m717j0849n387
$$ -15309 -6345 -3567 -1860 -3389 5530 -4343 -10947 -10099 -8598 -5613 -4136 -4103 -8820 -19669 -25056
14707b5056M61r565P766P930l535J212N757J0955O861q567q004Q364O729M505
$$ -25056 -24595 -34160 -26394 -18464 -21999 -20787 -15030 -4075 2786 -5781 -13785 -5421 1308 5813
14693E813m174j4604k254J0438O490j0197M145P333R049L37J0193l997j9147l626
$$ 5813 1639 -12965 -15219 -4781 1709 -8488 -4343 2990 12039 12376 22569 18572 -575 -4201
14679d201j1647k690l002O957P88o08p840P885k39M467L932k802K900O176L955
$$ -4201 -15848 -18538 -21540 -14583 -13795 -14403 -22243 -14358 -14597 -10130 -6198 -9000 -6100 76 4031
14664D031M850j429j4794p835K096q896o664N237R051Q564J3726J4564J4230O861
$$ 4031 8881 7452 -7342 -15177 -13081 -21977 -28641 -23404 -14353 -5789 7937 22501 36731 43592
14650D3592j6467j6313q63m563P81o603j313m003K484m834m603j759p050J0670
$$ 43592 27125 10812 9949 5386 6167 -436 -1749 -5752 -3268 -8102 -12705 -14464 -21514 -10844
14636a0844L31l180r551p900O601J3898Q176M756K416Q040l341j6691j9156K899
$$ -10844 -10513 -13693 -23244 -31144 -24543 -10645 -2469 2287 4703 12743 9402 -7289 -26445 -23546
14622b3546J3236q22n188N019J1278j951k956M343p679K764K835l629K794J1683
$$ -23546 -10310 -11132 -16320 -11301 -23 -1974 -4930 -587 -8266 -5502 -2667 -6296 -3502 8181
14608H181o639j467J091j0783j1062K583J0803K036j955j408l336O757m952l375
$$ 8181 1542 75 1166 -9617 -20679 -18096 -7293 -5257 -7212 -8620 -11956 -5199 -10151 -13526
14594a3526P557N957R31N531K936l019K147J0371j0452j8096j4191J568K910j586
$$ -13526 -5969 -12 919 6450 9386 6367 8514 18885 8433 -9663 -23854 -22286 -19376 -20962
14580b0962M8n857j233K345J0658P021J5638J426q42N344k917Q38r182p815O895
$$ -20962 -20914 -26771 -28004 -25659 -15001 -7980 7658 9084 8242 13586 10669 11507 2325 -5490 1405
14565A405k712o408j0731j2383j0958J1648K9344o099j1478l377M702J0557M489
$$ 1405 -1307 -7715 -18446 -30829 -41787 -30139 -795 -6894 -18372 -21749 -17047 -6490 -2001
14552b001n364o52N368L166P98O463N16J2125q76k12j4117j1983k610K93K968
$$ -2001 -7365 -8017 -2649 517 1315 7778 8294 20419 19543 19331 5214 -6769 -9379 -9086 -6118
14537f118P3j0827Q678M585J913j10K356j6205J012j356K338r54J3796P316P380
$$ -6118 -6045 -16872 -8194 -3609 -1696 -1806 550 -15655 -14643 -15999 -13661 -14615 -819 6497 13877
14522A3877r66k993o933P352n84k817o985j56J1635r000N120J0483l273j8033
$$ 13877 12911 9918 2985 10337 9753 6936 -49 -205 11430 2430 7550 18033 14760 -3273
14508c273k495J0663M293n908P128J1213R468j264q923j6857j6329J134P423l90
$$ -3273 -5768 4895 9188 3280 10408 21621 31089 29825 20902 4045 -12284 -11150 -3727 -4117
14494d117l187r320O448Q340p964j4728l88P385P962P0J2520R087N781Q15l347
$$ -4117 -7304 -16624 -10176 -1836 -9800 -24528 -24916 -17531 -9569 -9499 3021 12108 17889 18704 15357
14479A5357j3963j103j666n548J6735K199r001J970q625Q390J935q003L246K015
$$ 15357 1394 291 -1375 -6923 9812 12011 3010 4980 -3645 4745 6680 -1323 1923 3938
14465C938J1686J999j4052j9225L78J2868L500l347l156R672K44P033k800o373
$$ 3938 15624 17623 3571 -15654 -15276 -2408 1092 -2255 -5411 4261 4505 11538 8738 2365
14451B365M188m672j9660L058J7757Q846j1010J526J4544j3102j8376N72P819
$$ 2365 6553 1881 -17779 -14721 3036 11882 872 2398 16942 3840 -14536 -13964 -6145
14438f145r376R64R636P082o92j47J0971j0842P095j5493k712J3290J6940l300
$$ -6145 -15521 -14557 -4921 2161 1469 1322 12293 1451 8546 -6947 -9659 3631 20571 17271
14424A7271j2052j999r021j438K960l384l862p721J5512J235l308L365K942j351
$$ 17271 5219 3220 -5801 -7239 -4279 -7663 -11525 -19246 -3734 -2499 -5807 -2442 500 -851
14410h51j7468p751J953J0297J1022k544L504j366j2972Q058N256j0089j2393
$$ -851 -18319 -26070 -24117 -13820 -2798 -5342 -1838 -3204 -16176 -8118 -2862 -12951 -25344
14397b5344j52O04k4J4132J808k613L434j381j3205k478J2284N633M749j3612
$$ -25344 -25496 -24892 -24916 -10784 -8976 -11589 -8155 -9536 -22741 -25219 -12935 -7302 -2553 -16165
14383a6165n484M006L920j0646p130O497M875j7272O761R376k083J2971Q206p768
$$ -16165 -21649 -17643 -13723 -24369 -31499 -25002 -20127 -37399 -30638 -21262 -23345 -10374 -2168 -9936
14369i936k289M189J4526R037j434m219P86n141j0156L078p200Q047k747n35n175
$$ -9936 -12225 -8036 6490 15527 14093 9874 10660 5519 -4637 -1559 -8759 -712 -3459 -3994 -9169
14354i169p227M387N982J685N614M346p191m222m878K531m08J943L166M086m011
$$ -9169 -16396 -12009 -6027 -4342 1272 5618 -1573 -5795 -10673 -8142 -8550 -6607 -3441 645 -3366
14339c366l169P95M821m824m150m557j3594J0P857j409k611J0428M487p294J9908
$$ -3366 -6535 -5740 -919 -5743 -9893 -14450 -28044 -28034 -20177 -21586 -24197 -13769 -9282 -16576 3332
14324C332M818l122N128P806j4968j2142M613Q916r173M533J65l057M001p777
$$ 3332 8150 5028 10156 17962 2994 -9148 -4535 4381 -4792 -259 -94 -3151 850 -6927
14310f927N972R690m110k98k420r592k792N449M856o597N180J5810Q04n861o168
$$ -6927 -955 8735 4625 4327 1907 -7685 -10477 -5028 -172 -6769 -1589 14221 15025 9164 2996
14295B996j1517j74L100q285o454P349M314L13k335l92L176J0167J2072l402p191
$$ 2996 -8521 -8695 -5595 -13880 -20334 -12985 -8671 -8358 -10693 -11085 -7909 2258 14330 10928 3737
14280C737k102p417m316J949K240n522r641n162P926N82J1182J6862K020n616
$$ 3737 1635 -5782 -10098 -8149 -5909 -11431 -21072 -26234 -18308 -17726 -6544 10318 12338 6722
14266F722j4854L651J224J683N061m42o18j6458O399J2276Q537P007j072j0955
$$ 6722 -8132 -4481 -3257 -1574 3487 3045 2427 -14031 -7632 4644 13181 20188 19116 8161
14252H161n107o562P535M34m188o697j93J3365P913Q72L859j4784j2035R15R534
$$ 8161 3054 -3508 4027 4461 273 -6424 -6617 6748 14661 15533 19392 4608 -7427 -6512 3022
14237C022P36j4602m976N797l117q928K773N686N537N961J2095L744j5465j0476
$$ 3022 3758 -10844 -15820 -10023 -13140 -22068 -19295 -13609 -8072 -2111 9984 13728 -1737 -12213
14223a2213K348M37n879j929p242p69j77J8342L558j312M275j375j1264j991m3
$$ -12213 -9865 -9428 -15307 -17236 -24478 -25247 -25424 -7082 -3524 -4836 -561 -1936 -13200 -15191 -15234
14208a5234P677k557j276M581j691j731L979j6111n385R296J0174J0016n473r386
$$ -15234 -7557 -10114 -11390 -6809 -8500 -10231 -6252 -22363 -27748 -18452 -8278 1738 -3735 -13121
14194a3121n896q689O483M898R534R8j2937K431N90J0914N638n906N132L019J2175
$$ -13121 -19017 -27706 -21223 -16325 -6791 -6693 -19630 -17199 -16609 -5695 -57 -5963 -831 2188 14363
14179A4363J773n545J337p304p006m878m702j424P132l634L847J935k841K897
$$ 14363 16136 10591 11928 4624 -2382 -7260 -11962 -13386 -6254 -9888 -6041 -4106 -6947 -4050
14165d050L084k662k875Q897j825n059R654Q54J45l178q993m222O639J4845O373
$$ -4050 -966 -3628 -6503 2394 569 -4490 5164 6018 6163 2985 -6008 -10230 -3591 11254 17627
14150A7627r300j800O553K0324J082n993l970j9951k3235J0157J2403k104j0031
$$ 17627 8327 6527 13080 33404 34486 28493 24523 4572 -18663 -8506 3897 1793 -8238
14137h238n969M766k701N633r376p158m288j3354J2107K762J1378Q366J77J453
$$ -8238 -14207 -9441 -12142 -6509 -15885 -23043 -27331 -40685 -28578 -25816 -14438 -6072 -5895 -4442
14123d442P539n90n481P3n831M526q868j728J4845j9552O549J7313K0527J611
$$ -4442 3097 2507 -2974 -2901 -8732 -4206 -13074 -14802 43 -19509 -12960 4353 24880 26491
14109B6491o743q421n820Q441J076q456j3140n728J3201O202q894k435r268M816
$$ 26491 19748 11327 5507 13948 15024 6568 -6572 -12300 901 7103 -1791 -4226 -13494 -8678
14095h678J2761m009j1233k458p89K712O923J2487J987K2586r824k1267L940L12
$$ -8678 4083 74 -11159 -13617 -14406 -11694 -4771 7716 9703 32289 22465 1198 5138 5450
14081E450m287M495j758r776Q781o129j8261N701J3855J186p35j6821p787j170
$$ 5450 1163 5658 3900 -5876 2905 -3224 -21485 -15784 -1929 -743 -1478 -18299 -26086 -27256
14067b7256p42Q580o123m618K412N965J8291J2456L715J840k557P98j0792j2134
$$ -27256 -27998 -19418 -25541 -30159 -27747 -21782 -3491 8965 12680 14520 11963 12761 1969 -10165
14053a0165k709l242j8793J4J9762R407M495l667j1033j2423M09P101p352m088
$$ -10165 -12874 -16116 -34909 -34895 -15133 -5726 -1231 -4898 -15931 -28354 -27945 -20844 -28196 -32284
14039c2284J104R69N646n093l543J7481O487P921m012L228M068p773o533o458
$$ -32284 -31180 -30211 -24565 -29658 -33201 -15720 -9233 -1312 -5324 -2096 1972 -5801 -12334 -18792
14025a8792M423L338O238P132r86N806m941R78k650m207M047j060q352j1717o201
$$ -18792 -14369 -11031 -4793 2339 1353 7159 2218 3196 546 -3661 386 -674 -9026 -20743 -26944
14010b6944J7935J2667j1924k512J1019L592j757L149q230J354j2464n883O26
$$ -26944 -9009 3658 -8266 -10778 241 3833 2076 5225 -3005 -1651 -14115 -19998 -19372
13997a9372p802J6524J7174R775K332j166j5477k201P968j987j3208p466l280
$$ -19372 -27174 -10650 6524 16299 18631 17465 1988 -213 7755 5768 -7440 -14906 -18186
13984a8186o31p75N232P248M099N855O960p76j1453O41J1565j0153p549Q2J3590
$$ -18186 -18817 -19592 -14360 -7112 -3013 2842 9802 9026 -2427 -1786 9779 -374 -7923 -7841 5749
13969E749J060N801k750M97m218k185Q789R60L153L393n145m837p249q382j1093
$$ 5749 6809 12610 9860 10357 6139 3954 12743 13703 16856 20249 15104 10267 3018 -5364 -16457
13954a6457J865m910o975J4209J2178K1444M851r421j1277r008K403Q463m303
$$ -16457 -14592 -19502 -26477 -12268 -90 21354 26205 16784 5507 -3501 -1098 7365 3062
13941C062L91q648n955L979j0430K473O640J4611J0289J2443K14J868l961r834
$$ 3062 3453 -5195 -11150 -7171 -17601 -15128 -8488 6123 16412 28855 29069 30937 26976 17142
13927A7142r007P999J0785N07j2749j5203j2660Q90J442J8024M338p107j0514
$$ 17142 8135 16134 26919 27426 14677 -526 -13186 -12296 -10854 7170 11508 4401 -6113
13914f113o298r942r136J185M206M504J3790Q601j0135j4237p834L8J6389K003
$$ -6113 -12411 -22353 -31489 -30304 -26098 -21594 -7804 797 -9338 -23575 -31409 -31371 -14982 -12979
13900a2979Q697J5274r038j6953j291J4818O051m17k993P179N61R393j9324P67
$$ -12979 -4282 10992 1954 -14999 -16290 -1472 4579 4162 1169 8348 8909 18302 -1022 -255
13886b55Q925r476o367k71M218j39o989l97J5346j155j3397j7663J4293Q015o600
$$ -255 8670 -806 -7173 -7444 -3226 -3365 -10354 -10751 4595 3440 -9957 -27620 -13327 -5312 -11912
13871a1912j0027J3795J1388j29R021P710j0938j2637k3178M596J7216M303K038
$$ -11912 -21939 -8144 3244 3115 12136 19846 8908 -3729 -26907 -22311 -5095 -792 1246
13858A246j608o012k524j835J394o652L937J9547p038j239J4590L712j0550j606
$$ 1246 -362 -6374 -8898 -10733 -9339 -15991 -12054 7493 455 -784 13806 17518 6968 5362
13844E362m507k767R460o610o61O147R016j5395j7038M690J5623j74J0456j5238
$$ 5362 855 -1912 7548 938 277 6424 15440 45 -16993 -12303 3320 3146 13602 -1636
13830a636l166J286j36O898L192K926j2102p643N359P224J3442j2388p083J4620
$$ -1636 -4802 -3516 -3652 3246 6438 9364 -2738 -10381 -5022 2202 15644 3256 -3827 10793
13816A0793j9008k088N790O085k925O189J0355o784j0432j2378j5397N665J2211
$$ 10793 -8215 -10303 -4513 1572 -1353 4836 15191 8407 -2025 -14403 -29800 -24135 -11924
13803a1924J0710J936j6101m849J2544j083k636R122R773P030r870o969k551N834
$$ -11924 -1214 722 -15379 -20228 -7684 -8767 -11403 -2281 7492 14522 4652 -2317 -4868 966
13789I66k938J1918j704K370o267K623r921o77j636Q728m509j2506M870M591n118
$$ 966 -1972 9946 8242 10612 4345 6968 -2953 -3630 -5266 3462 -1047 -13553 -8683 -4092 -9210
13774i210L33N762O380P045k518j2321j1979J7031J8463l71j2420j0038K809L860
$$ -9210 -8877 -3115 3265 10310 7792 -4529 -16508 523 18986 18615 6195 -3843 -1034 2826
13760B826P818R983N585k336r539r685N997R080l220o688r611m459k514o78J3801
$$ 2826 10644 20627 26212 23876 14337 4652 10649 19729 16509 9821 210 -4249 -6763 -7441 6360
13745F360O982r705m217l663l770O701Q249j3799j2978L051R14k693J2372M652
$$ 6360 13342 3637 -580 -4243 -8013 -1312 6937 -6862 -19840 -16789 -15875 -18568 -6196 -1544
13731a544L459n350j7829j5181J1629J5237L162l185N787p949R065L723o183l355
$$ -1544 1915 -3435 -21264 -36445 -24816 -9579 -6417 -9602 -3815 -11764 -2699 1024 -5159 -8514
13717h514j061M120J0052o742n979R722k433r921o990j2754R513J3342K75J774
$$ -8514 -9575 -5455 4597 -2145 -8124 1598 -835 -10756 -17746 -30500 -20987 -7645 -7370 -5596
13703e596Q5j1682K962L709K794K881r415J614J2610j491o24j713K876M870q867
$$ -5596 -5511 -17193 -14231 -10522 -7728 -4847 -14262 -12648 -38 -1529 -2153 -3866 -990 3880 -4987
13688d987j2125k15O090Q096l6O933o95m208Q03Q932Q321k975j4017l712Q687
$$ -4987 -17112 -17327 -11237 -3141 -3177 3756 3061 -1147 -344 8588 16909 13934 -83 -3795 4892
13673D892l284q014r69o192j0210J883M017M477J9115K3109p514j2408q927n779
$$ 4892 1608 -6406 -7375 -13567 -23777 -21894 -17877 -13400 5715 28824 21310 8902 -25 -5804
13659e804q842J7497J0202m082l899p611N991O104J129J0209m39j7826J415j9255
$$ -5804 -14646 2851 13053 8971 5072 -2539 3452 9556 10685 20894 20455 2629 4044 -15211
13645a5211j0337L630q76M525J7363p51O612K40j3795L003k80j341N403K416N251
$$ -15211 -25548 -21918 -22794 -18269 -906 -1657 4955 5195 -8600 -5597 -5877 -7218 -1815 601 5852
13630E852l83n335j5783r692J1495K2848n06M555J0082K960K155j1062j6701j3785
$$ 5852 5469 134 -15649 -25341 -13846 9002 8496 13051 23133 26093 28248 17186 485 -13300
13616a3300Q770R125J7536p101o419J798j2248J1330J3021j1390j2096Q762k53
$$ -13300 -4530 4595 22131 15030 8611 10409 -1839 9491 22512 11122 -974 7788 7535
13603G535j5278p050R936P876O08o486j0724j0229P553j751n016O087q244k910
$$ 7535 -7743 -14793 -4857 3019 3627 -2859 -13583 -23812 -16259 -18010 -23026 -16939 -25183 -28093
13589b8093R804M71k555JJ0335J3150j0416l834n13J2732J378n604j7888k5425
$$ -28093 -18289 -17818 -20373 -20372 -10037 3113 -7303 -11137 -11650 1082 2460 -3144 -21032 -46457
13575d6457K914J0158P442N205Q861Q681K068K585L203K436P501j0417QR266p835
$$ -46457 -43543 -33385 -25943 -20738 -11877 -3196 -1128 1457 4660 7096 14597 4180 4188 13454 5619
13560E619n803p893K490l158L032n123L977Q076p538P389Q860P028j05m842K052
$$ 5619 -184 -8077 -5587 -8745 -5713 -10836 -6859 1217 -6321 1068 9928 16956 16851 12009 14061
13545A4061J336o001Q28N429o671k84o708j2957r17Q654O020R802K999L172P539
$$ 14061 15397 9396 10224 15653 8982 8698 1990 -10967 -11884 -3230 2790 12592 15591 18763 26302
13530B6302j4407j6224J81J545o971m12j307l488M653l600M047P423k574N011
$$ 26302 11895 -4329 -4148 -2603 -9574 -9986 -11293 -14781 -10128 -13728 -9681 -2258 -4832 179
13516A79p223j1064P513J7539K132r753r205m130m347j6137m311J0161M152N556
$$ 179 -7044 -18108 -10595 6944 9076 -677 -9882 -14012 -18359 -34496 -38807 -28646 -24494 -18938
13502a8938M681K658J1958n873j425K322K752j1672J0899M236K183k905J912J2552
$$ -18938 -14257 -11599 359 -5514 -6939 -4617 -1865 -13537 -2638 1598 3781 876 2788 15340
13488A5340K348R473M547p381l399k982p62p937n098q304K16l97M284J4245o939
$$ 15340 17688 27161 31708 24327 20928 17946 17184 9247 4149 -4155 -3939 -4336 -52 14193 7254
13473G254J845M114j481k277k820J735j416k994J981O586k614P709J550k0427
$$ 7254 9099 13213 11732 9455 6635 8370 6954 3960 5941 12527 9913 17622 19172 -1255
13459a255m804P308m431J0593J765k2202q257k420J6643J6282n36o019L985k88
$$ -1255 -6059 1249 -3182 7411 9176 -13026 -21283 -23703 -7060 9222 8686 2667 6652 6364
13445F364L387J2806q369j8398o906K1692l066m314J545j6886J286n659m145J2129
$$ 6364 9751 22557 14188 -4210 -11116 10576 7510 3196 4741 -12145 -10859 -16518 -20663 -8534
13431h534M162K119m007k845M877k706j333O468P629J1286K448j1420q383k656
$$ -8534 -4372 -2253 -6260 -9105 -4228 -6934 -8267 -1799 5830 17116 19564 8144 -239 -2895
13417b895m545J132j328K660J5897M632O734P452j393j3779j0653j1273j2985
$$ -2895 -7440 -6308 -7636 -4976 10921 15553 22287 29739 28346 14567 3914 -7359 -20344
13404b0344j259R115q53q772M463J3668M626P680N326j710p848R028l777j4957
$$ -20344 -21603 -12488 -13341 -22113 -17650 -3982 644 8324 13650 11940 4092 13120 9343 -5614
13390e614j956m00n095R522L135J0177O554j9275k662J029J917Q77o003m504r50
$$ -5614 -7570 -7970 -13065 -3543 -408 9769 16323 -2952 -5614 -4585 -2668 -1791 -7794 -12298 -13248
13375a3248k436n639q138p574M332J9318Q020n837q879O666N559l763L660q382
$$ -13248 -15684 -21323 -29461 -37035 -32703 -13385 -5365 -11202 -20081 -13415 -7856 -11619 -7959 -16341
13361a6341k248J662L446P429MN795J3557J1753J4120o50j0691j8977k0704p13
$$ -16341 -18589 -16927 -13481 -6052 -6048 -253 13304 25057 39177 38527 27836 8859 -11845 -12558
13347a2558J7515K071K170R571L284O628J2348j3826l554j1130L434j384j6764
$$ -12558 4957 7028 9198 18769 22053 28681 41029 27203 23649 12519 15953 14569 -2195
13334b195K092Q489L117j9405l074Q678j46j237k387P443J0302o625K263Q304
$$ -2195 -103 8386 11503 -7902 -10976 -2298 -2444 -3681 -6068 1375 11677 5052 7315 15619
13320A5619j1416j4295L613O542p90K170O755J415j0062l228M013j552J362R20
$$ 15619 4203 -10092 -6479 63 -727 1443 8198 9613 -449 -3677 336 -1216 146 1066
13306A066k807k798k2897J1893J5415j5604O367J757o643P092J8677J3033n439
$$ 1066 -1741 -4539 -27436 -15543 -128 -15732 -9365 -7608 -14251 -7159 11518 24551 19112
13293A9112k0619J43R418K93j2907r497J1046Q281k654O722J03j2235j156p775
$$ 19112 -1507 -1364 8054 8347 -4560 -14057 -3011 5270 2616 9338 9441 -2794 -3950 -11725
13279a1725k071M442J2426q737p970j1045L220M680P465M812N489m060n062J5
$$ -11725 -13796 -9354 3072 -5665 -13635 -24680 -21460 -16780 -9315 -4503 986 -3074 -8136 -8121
13265h121o590n467J508O921O146J0870M168M881K160M967J926K739j2841n631
$$ -8121 -14711 -20178 -18670 -11749 -5603 5267 9435 14316 16476 21443 23369 26108 13267 7636
13251G636L070N81k60j664k815p498k99J1919j111j4095n219N292m099j2593L990
$$ 7636 10706 11287 11027 9363 6548 -950 -1249 10670 9559 -4536 -9755 -4463 -8562 -21155 -17165
13236a7165L607N146N187K709P614o110J667J4553j1759k6203K777P641R336n815
$$ -17165 -13558 -8412 -3225 -516 7098 988 2655 17208 5449 -20754 -17977 -10336 -1000 -6815
13222f815n371K053j5840q615J405P03J1463J3479O16O249O452k520J595j1335
$$ -6815 -12186 -10133 -25973 -34588 -33183 -32480 -21017 -7538 -6922 -673 5779 3259 4854 -6481
13208f481l725J3975j0662j804M140m691J875J3529K0129L007l971r095j1082
$$ -6481 -10206 3769 -6893 -8697 -4557 -9248 -7373 6156 26285 29292 25321 16226 5144
13195E144J1366J0030M072m830r181j1352J88Q197q917q692K0555J3027j0138
$$ 5144 16510 26540 30612 25782 16601 5249 5437 13634 4717 -3975 16580 29607 19469
13182A9469p7Q515j2602j0501n772k862j850L394o247J159J1027m507J354K0927
$$ 19469 19392 27907 15305 4804 -968 -3830 -5680 -2286 -8533 -7374 3653 -854 500 21427
13168B1427r020J0561M718r482r586N704k629L141k217m965L069k442j5891p959
$$ 21427 12407 22968 27686 18204 8618 14322 11693 14834 12617 7652 10721 8279 -7612 -15571
13154a5571J4078K617L090K3n976j2522J4564J1735N0m671J357m983Q560O711
$$ -15571 -1493 1124 4214 4237 -1739 -14261 303 12038 12088 7417 8774 3791 12351 19062
13140A9062k836j547j5139l750L982N207j3702M561O664q560j0310o773j1300
$$ 19062 16226 14679 -460 -4210 -228 4979 -8723 -4162 2502 -6058 -16368 -23141 -34441
13127c4441N447J476K076J7045J9241N605k532j879O774L982j1391P287K921j2029
$$ -34441 -28994 -27518 -25442 -8397 10844 16449 13917 12038 18812 22794 11403 18690 21611 9582
13113I582k1438n536K3706J3196l232q296n50J7752l869j1739n872o942J2301
$$ 9582 -11856 -17392 6314 19510 16278 7982 7432 25184 21315 9576 3704 -3238 9063
13100I063Q3L09j410J0688j149N213K560j0045j0713N446l847o429R177J5921
$$ 9063 9146 9455 8045 18733 17584 22797 25357 15312 4599 10045 6198 -231 8946 24867
13086B4867j732k531q406k325M535R339K268o641j726Q654R590j4661m349O108
$$ 24867 23135 20604 12198 9873 14408 23747 26015 19374 17648 26302 35892 21231 16882 22990
13072B2990Q728p74j079j658j81j800j0799n301l549j440n02L345o206j0076n884
$$ 22990 31718 30944 29865 28207 28026 26226 15427 10126 6577 5137 4635 7980 1774 -8302 -14186
13057a4186l679K049P125K1577J938j7095K516J0649p893l431J98o416J0304l725
$$ -14186 -17865 -15816 -8691 12886 14824 -2271 245 10894 3001 -430 -232 -6648 3656 -69
13043f9o492M194K951J0291K595o578j2221k098P7M567j616j202J544j180k346
$$ -69 -6561 -2367 584 10875 13470 6892 -5329 -7427 -7350 -2783 -4399 -5601 -4057 -5237 -7583
13028g583K230J0240J7369j632r212j4067R409J0246j0063j0250N35M515j119
$$ -7583 -5353 4887 22256 20624 11412 -2655 6754 17000 6937 -3313 -2778 1737 618
13015F18N55R56J275K135j538p064K475J3279J558Q778K3O823o317j7150o20O375
$$ 618 1173 2129 3404 5539 4001 -3063 -588 12691 14249 23027 23050 29873 23556 6406 5786 12161
12999A2161Q685n485j3231j4194J583J1386J170N772l642j2750K730P818M008
$$ 12161 20846 15361 2130 -12064 -10481 905 2075 7847 4205 -8545 -5815 2003 6011
12986F011m32N63j1862m20k401k010j0540J0500O731j1723J2152P6J703J3803
$$ 6011 5579 6142 -5720 -6140 -8541 -10551 -21091 -10591 -3860 -15583 -3431 -3355 -1652 12151
12972A2151n582j6300l171j2597L598R914O449J0493k54J1157K1395j813k1610
$$ 12151 6569 -9731 -12902 -25499 -21901 -11987 -5538 4955 4701 15858 37253 35440 13830
12959A3830N034K688m879N321j1611j0835J1796Q910O642J1492J4316M963P369
$$ 13830 18864 21552 16673 21994 10383 -452 11344 20254 26896 38388 52704 57667 65036
12946F5036J2466J4325K473J1563N876j747j9234l8485q360Q381J0472j648l40
$$ 65036 77502 91827 94300 105863 111739 109992 90758 52273 43913 52294 62766 61118 60778
12933F0778K394N731n31l723P274L609J687J665J682M867K145J0187K0108R109
$$ 60778 63172 68903 68372 64649 71923 75532 77219 78884 80566 85433 87578 97765 117873 126982
12919A26982o544j509j75N360Q855K143q140j281m07m173j5411j2653M922r06
$$ 126982 120438 118929 118754 124114 132969 135112 126972 125691 125284 121111 105700 93047 97969 97063
12905I7063j0943j5915L181M921K086q150j4280n434N304J143L255K25J1741L180
$$ 97063 86120 70205 73386 78307 80393 72243 57963 52529 57833 58976 62231 62456 74197 77377
12891G7377N483J0868J1533N33M56O672J687L869n873j3240j2318p671l906o293
$$ 77377 82860 93728 105261 105794 106250 112922 114609 118478 112605 99365 87047 79376 75470 69177
12877F9177J7471M924q365j5776j3304m955Q652l779o77j510j0356J714n038j1897
$$ 69177 86648 91572 83207 67431 54127 49172 57824 54045 53368 51858 41502 43216 38178 26281
12863B6281J988J1558n435j5898J273k229O178L787P03o009L054L77k772k514
$$ 26281 28269 39827 34392 18494 19767 17538 23716 27503 28206 22197 25251 25628 22856 20342
12849B0342O662Q241J6179J4111p347j6704r741P240p790r366M020q379J459L62
$$ 20342 27004 35245 51424 65535 58188 41484 31743 38983 31193 21827 25847 17468 18927 19289
12835A9289p188j654n002J437K870j764n20J000m74J179M068O248p035M079J1946
$$ 19289 12101 10447 5445 6882 9752 7988 7468 8468 7994 9173 13241 19489 12454 16533 28479
12820B8479p684R973m478K304j2742j491N030j009L060K467k824O80o776p697
$$ 28479 20795 30768 26290 28594 15852 14361 19391 18382 21442 23909 21085 21765 14989 7292
12806G292O676O006m003J479j972l554L912L273j165J0101N95j2055P105q147
$$ 7292 13968 19974 15971 17450 15478 11924 15836 19109 17944 28045 28640 16585 23690 15543
12792A5543k873J2978M013j3737j8658j3761J1803L699Q508J0428J457O930r55
$$ 15543 12670 25648 29661 15924 -2734 -16495 -4692 -993 7515 17943 19400 26330 25375
12779B5375j40O177N311m129n82n628o766J728j921j856O669M286M55m977P444
$$ 25375 25235 31412 36723 32594 32012 26384 19618 21346 19425 17569 24238 28524 28979 24002 31446
12764C1446O955j0779p735m374Q873N074p171m059j0790n227J2261K1784J1256
$$ 31446 38401 27622 19887 15513 24386 29460 22289 18230 7440 2213 14474 36258 47514
12751D7514o81j1360m082O317M104K398L666N199j696j0659j291K124k376l024
$$ 47514 46833 35473 31391 37708 41812 44210 47876 53075 51379 40720 39429 41553 39177 36153
12737C6153J1983l358q252Q594R247N89n596j9886p559J6648M979m856J4929j059
$$ 36153 48136 44778 36526 45120 54367 54956 49360 29474 21915 38563 43542 38686 53615 52556
12723E2556n433L480j1496l045J0430J1590L080K096o742l467j4472j1052K6014
$$ 52556 47123 50603 39107 36062 46492 58082 61162 63258 56516 53049 38577 27525 53539
12710E3539K356n645o793R622p352P677P677K187l50m035o751J1850J1993l512
$$ 53539 55895 50250 43457 53079 45727 53404 61081 63268 62918 58883 52132 63982 75975 72463
12696G2463M514j332L099J2890O433Q650M475m898M48K415j5700p645j0727j9997
$$ 72463 76977 75645 78744 91634 98067 106717 111192 106294 106742 109157 93457 85812 75085 55088
12682E5088q152j1854j638J0141L447M770J1727J8367P364n397r46p394k622P844
$$ 55088 46936 35082 33444 43585 47032 51802 63529 81896 89260 83863 82917 75523 72901 80745
12668H0745n312L345J3540N02l423j0564j5800J646N192L495o733Q77r926j3749
$$ 80745 75433 78778 92318 92820 89397 78833 63033 64679 69871 73366 66633 67510 57584 43835
12654D3835j279J3942N627j2322p564J080q174o302j53j368l640n61Q914P230
$$ 43835 42556 56498 62125 49803 42239 43319 35145 28843 28690 27322 23682 23121 32035 39265
12640C9265n303m870m331M312n640Q668O923j856J2133J0502q042p517M58R234
$$ 39265 33962 29092 24761 29073 23433 32101 39024 37168 49301 59803 51761 44244 44702 53936
12626E3936L869j3212l484j6017k2760j1727K3123P252k549M974j3392J237J1546
$$ 53936 57805 44593 41109 25092 2332 -9395 13728 20980 18431 23405 10013 11250 22796
12613B2796J5798K9o111n394P030k717j949Q971P382L47J2609Q52m38j2092P663
$$ 22796 38594 38623 32512 27118 34148 31431 29482 38453 45835 46182 58791 59643 59205 47113 54776
12598E4776R165R152J5011K0845l815l540J5510J8834P696O10Q377P491Q166L4150
$$ 54776 63941 73093 88104 108949 105134 101594 117104 135938 143634 144244 152621 160112 168278 202428
12584B02428K2549K9458J7968K408m238o300j106j7461j9418k0607j2594k453
$$ 202428 224977 254435 272403 274811 270573 264273 263167 245706 226288 205681 193087 190634
12572A90634k840q040m667K386q338r538k829j2669j1101N165P954J4003J3376
$$ 190634 187794 179754 175087 177473 169135 159597 156768 144099 132998 138163 146117 160120 173496
12559A73496k030n598N818J4632R515J2704J394m887j3587q91J6506M350J6909
$$ 173496 171466 165868 171686 186318 195833 208537 209931 205044 191457 190566 207072 211422 228331
12546B28331O633M172K1115l050N785k112O727K907J4637J5188K2035P033P056
$$ 228331 234964 239136 260251 257201 262986 260874 267601 270508 285145 300333 322368 329401 336457
12533C36457J1586J7062J3078J8268J6155M604O489J2785M1827L4971K8858L6827
$$ 336457 348043 365105 378183 396451 412606 417210 423699 436484 478311 513282 542140 578967
12521E78967N5673O3521N8381P2149Q0814Q6414J09143J21602J36682J57318J97565
$$ 578967 634640 698161 756542 828691 909505 995919 1105062 1226664 1363346 1520664 1718229
12510A718229K15439K47123L27707M14128N28351O74008R06195J202018J567382
$$ 1718229 1933668 2180791 2508498 2922626 3450977 4124985 5031180 6233198 7800580
12501G800580K002604K409241K614734K472693J879030R01037k67671j340463
$$ 7800580 9803184 12212425 14827159 17299852 19178882 20079919 19812248 18471785
12493A8471785j954354k046951j797242j417138j029722o68054l91250j65777
$$ 18471785 16517431 14470480 12673238 11256100 10226378 9558324 9167074 9001297
12485I001297L9801K38992L84614N30541O67044Q02143Q72537R25117R76164J010680
$$ 9001297 9041098 9280090 9664704 10195245 10862289 11664432 12536969 13462086 14438250 15448930
12475A5448930J059949J107945J108349J083276J031139R36636P70361N58726
$$ 15448930 16508879 17616824 18725173 19808449 20839588 21776224 22546585 23105311
12467B3105311K86475K2179k22266m57499o14304p27707q02425q45972q66862
$$ 23105311 23391786 23413965 23191699 22734200 22119896 21392189 20589764 19743792 18876930
12458A8876930q54923q25332q14895q04073p85269p76606p13625o34110n40766
$$ 18876930 18022007 17196675 16381780 15577707 14792438 14015832 13302207 12668097 12127331
12449A2127331m31617k72729p6841J46952L95639P17389J084977J492401J895240
$$ 12127331 11695714 11422985 11346144 11493096 11888735 12606124 13691101 15183502 17078742
12440A7078742K121467K070248J618669P50750l41897j441072k254873k548238
$$ 17078742 19200209 21270457 22889126 23639876 23297979 21856907 19602034 17053796
12432A7053796k386603k018771j626612j289734j017172q09989o63023n60359
$$ 17053796 14667193 12648422 11021810 9732076 8714904 7904915 7241892 6681533
12424F681533m70774l98921l39306k95011k67593k38878k27311j99737j91283
$$ 6681533 6210759 5811838 5472532 5177521 4909928 4671050 4443739 4244002 4052719
12415D052719j55329j48968j43251j28434j35844j20569j16452j24583j17730
$$ 4052719 3897390 3748422 3605171 3476737 3340893 3220324 3103872 2979289 2861559
12406B861559q7002q9426q2949p9116q8866r4329o4609o1786p5220r4440q2297
$$ 2861559 2774557 2685131 2602182 2523066 2434200 2339871 2275262 2213476 2138256 2043816 1961519
12395A961519n3249n5027o8185n3081n0346l9371m0138k8880k6931k7970m5042
$$ 1961519 1908270 1853243 1785058 1731977 1681631 1642260 1602122 1573242 1546311 1518341 1473299
12384A473299l5226m7787m3582l0057l8327l4520l0962k5505k7116j9444k8526
$$ 1473299 1438073 1390286 1346704 1316647 1278320 1243800 1212838 1187333 1160217 1140773 1112247
12373A112247l2648j4660k0266l4737j6074k2503j8187j5531k5399q729j7157
$$ 1112247 1079599 1064939 1044673 1009936 993862 971359 953172 937641 912242 903513 886356
12362H86356l6569j6270j0577j3456k139p861j2561k2919k5053k3041k2758k2691
$$ 886356 849787 833517 822940 809484 807345 799484 786923 764004 738951 715910 693152 670461
12350F70461l3903j5198j8130j9621k1938k0833j2748k1388j3004P63j2917j948
$$ 670461 636558 621360 603230 583609 561671 540838 528090 506702 493698 494461 481544 479596
12338D79596j2855j5278j1334j133q261o927p976j3958j572q955q757J6365J605
$$ 479596 466741 451463 440129 438996 430735 423808 415832 401874 400302 391347 382590 398955 400560
12325D00560j1071j6654k277j912J01p731k2965j3147R006O31P082j2804j9014
$$ 400560 389489 372835 370558 368646 368747 361016 338051 324904 333910 334541 341623 328819 309805
12312C09805m887P201n541k1027k1770j4594j9205r851l138p085J28R09j3828
$$ 309805 304918 312119 306578 285551 263781 249187 229982 220131 216993 209908 210036 210945 197117
12299A97117o447J600m583l629q223M419J4140J1136j0801j4539j756L14Q640
$$ 197117 190670 192270 187687 184058 175835 180254 194394 205530 194729 180190 178434 178748 187388
12286A87388J5439l285j5299K370n048j2312p913r665k2251J832P287J782N605
$$ 187388 202827 199542 184243 186613 181565 169253 161340 151675 129424 131256 138543 140325 145930
12273A45930m869p949m345L903J465K585J663P865p559q545J2302J471R64J2107
$$ 145930 141061 133112 128767 132670 134135 136720 138383 146248 138689 130144 142446 143917 144881 156988
12259A56988N936n208j3614q297J4911O291j9416n8J0429O217r380j0954k0940
$$ 156988 162924 157716 144102 135805 150716 157007 137591 137533 147962 154179 144799 133845 112905
12246A12905j7620J622n200M655J0430J3693M018m156L037k720R530M219Q171
$$ 112905 95285 96907 91707 96362 106792 120485 124503 120347 123384 120664 130194 134413 142584
12233A42584J2400P635m892j0171J272M077k629j62L01Q214r667O842J4620P646
$$ 142584 154984 162619 157727 147556 148828 152905 150276 150114 150415 158629 148962 155804 170424 178070
12219A78070L50Q722O819m427P452n995L833K875J4052K3855J4007R336J2729
$$ 178070 178420 187142 193961 189534 196986 190991 194824 197699 211751 235606 249613 258949 271678
12206B71678M585J6370J2669K5716L4434J5078J7445J7238K2118L0976L3299L3808
$$ 271678 276263 292633 305302 331018 365452 380530 397975 415213 437331 468307 501606 535414
12194E35414L9973L5021M5674N3833P6702J06386J19509J43097J79563K02724
$$ 535414 575387 610408 656082 709915 786617 893003 1012512 1155609 1335172 1537896
12184A537896K41801K88218K95590K95763L43192L95195M62310N90160P88098
$$ 1537896 1779697 2067915 2363505 2659268 3002460 3397655 3859965 4450125 5238223
12175E238223J099725J580928K221203K941869L622576M175322M435479M281645
$$ 5238223 6337948 7918876 10140079 13081948 16704524 20879846 25315325 29596970
12167B9596970L678689K674176J372942j01784j573743k811957l620178l967603
$$ 29596970 33275659 35949835 37322777 37220993 35647250 32835293 29215115 25247512
12159B5247512l919667l597831l029781k381507j730218j225959q77660o78947
$$ 25247512 21327845 17730014 14700233 12318726 10588508 9362549 8484889 7805942
12151G805942n50721m67709m18749l94692l83818l50197l03128k74393k31678
$$ 7805942 7255221 6787512 6368763 5974071 5590253 5240056 4936928 4662535 4430857
12142D430857j73252j46670j50657j69671j86561k38195k02340j57020j30803
$$ 4430857 4257605 4110935 3960278 3790607 3604046 3365851 3163511 3006491 2875688
12133B875688j21342j31554j11913j12938q4851q0074q5652q2987p4494o9649
$$ 2875688 2754346 2622792 2510879 2397941 2313090 2233016 2147364 2064377 1989883 1920234
12123A920234q0356n7229m2326n4026n5461n3686m9431l7589l5602m9594k6768
$$ 1920234 1839878 1782649 1740323 1686297 1630836 1577150 1527719 1490130 1454528 1404934 1378166
12112A378166k8724m1451l7714l9777k2798k2253m3838m5153l1912k2884j4421
$$ 1378166 1349442 1307991 1270277 1230500 1207702 1185449 1141611 1096458 1064546 1041662 1027241
12101A027241j0507j3793J0973J3514L0642J8038q076l2930q1219q5512n7434
$$ 1027241 1016734 1002941 1013914 1027428 1058070 1076108 1068032 1035102 953883 868371 810937
12090H10937n3731l6365k5278k5440j1970k0521j1820j3879l4655p500j2722k3219
$$ 810937 757206 720841 695563 670123 658153 637632 625812 611933 577278 569778 557056 533837
12078E33837n253q547k0421r033K847j8908j4687k9559o132m685j0470m773j6210
$$ 533837 528584 520037 499616 490583 493430 474522 459835 430276 424144 419459 408989 404216 388006
12065C88006l988p373l967p881o525j0751k0533q258M616M176N910J5786J3983
$$ 388006 384018 376645 372678 364797 358272 347521 326988 318730 323346 327522 333432 349218 363201
12052C63201J7630M079n646k0530j7357j5688j4454M582Q422o974N698J2568N562
$$ 363201 380831 384910 379264 358734 341377 325689 311235 315817 324239 317265 322963 335531 341093
12039C41093R41Q409j944k1227j4432k526r87r510q513j3338k088l882m437m731
$$ 341093 342034 350443 348499 327272 312840 310314 309327 299817 291304 277966 275878 271996 267559 262828
12025B62828k28j6392j5199L45p932m835Q203K2793N764j449o573J4222O38p746
$$ 262828 262600 246208 231009 231354 223422 218587 226790 249583 255347 253898 247325 261547 262185 254439
12011B54439j1269r844l523M852j0489K89q836j5222p23m606J403K703j9267j1648
$$ 254439 243170 233326 229803 234655 224166 224455 215619 200397 199674 195068 196471 199174 179907 168259
11997A68259N162m845n812K406j5631j3065J0127J3377J256Q870J4242J4746R232
$$ 168259 173421 168576 162764 165170 149539 136474 146601 159978 161234 170104 184346 199092 208324
11984B08324j409j595R196n821j0699k2234k6038l3433k6727k9860j8362j3309
$$ 208324 206915 205320 214516 208695 197996 175762 149724 116291 89564 59704 41342 28033
11972B8033n209o121j1859J1703N474p157o019N793Q09r983k314O083J1821O86
$$ 28033 22824 16703 4844 16547 22021 14864 8845 14638 15447 5464 3150 9233 21054 21740
11958B1740k574o011O78J2089l235r201j5640P069J6530J6219l699j4959q81J2875
$$ 21740 19166 13155 13833 25922 22687 13486 -2154 4915 21445 37664 33965 19006 18125 31000
11944C1000P739k288J575r189M554k14o279N338J8039M900j3751o580o733l705
$$ 31000 38739 36451 38026 28837 33391 33177 26898 32236 50275 55175 41424 34844 28111 24406
11930B4406P228R074R217q788j7411j1996n190J3030M947L82j6146k331j4366
$$ 24406 31634 40708 49925 41137 23726 11730 6540 19570 24517 24899 8753 6422 -7944
11917g944Q915O327j47K843J0441k166j1837m80K3956J2316j1406o773L824m91
$$ -7944 971 7298 7151 9994 20435 18269 6432 5952 29908 42224 30818 24045 27869 27378
11903B7378J363j939j5810l198O808m439j064R101Q007j1160j5956j3731K070
$$ 27378 28741 26802 10992 7794 14602 10163 9099 18200 26207 15047 -909 -14640 -12570
11890a2570J9214J3939O65j2424j6818P642J721J977M785N222o035j2060Q496
$$ -12570 6644 20583 21248 8824 -7994 -352 1369 3346 8131 13353 7318 -4742 3754
11877C754J9221P551k262L944J2218p784j1889j1113K991j1882o578J740N842
$$ 3754 22975 30526 28264 32208 44426 36642 24753 13640 16631 4749 -1829 -89 5753
11864E753J939o587o033j744J1327Q529K5q43J491j437n987p276Q424O050r299
$$ 5753 7692 1105 -4928 -6672 4655 13184 13209 12366 13857 12420 6433 -843 7581 13631 4332
11849D332J2063J0k2400j4877l951J6717R456Q183p57q96R017o005j1026n901
$$ 4332 16395 16405 -5995 -20872 -24823 -8106 1350 9533 8776 7880 16897 10892 -134 -6035
11835f035O909p082j1480O815Q228j0907Q380J0617l174N156O445j542l824k0266
$$ -6035 874 -6208 -17688 -10873 -2645 -13552 -5172 5445 2271 7427 13872 12330 8506 -11760
11821a1760k590K986J0065j377p5R768p26k3796Q58k639P055M450M822J1545l859
$$ -11760 -14350 -11364 -1299 -2676 -2751 7017 6291 -17505 -16647 -19286 -12231 -7781 -2959 8586 4727
11806D727K760Q897m133j6070J993R468k250m721R88j531m667J5622M283q434
$$ 4727 7487 16384 12251 -3819 -1826 7642 5392 671 1659 128 -4539 11083 15366 6932
11792F932o782J935k745k781P037K635l888q588J933M9j954p598R940K164l585
$$ 6932 150 2085 -660 -3441 3596 6231 2343 -6245 -4312 -4263 -6217 -13815 -3875 -1711 -5296
11777e296k897O802N248P33O419n028l857j7925l298l846j218m271L117J2676
$$ -5296 -8193 -1391 3857 4590 11009 5981 2124 -15801 -19099 -22945 -24163 -28434 -25317 -12641
11763a2641J2968P231K56N417L791L930P421o5J2371L373m175j491J3672L1116
$$ -12641 327 7558 7814 13231 17022 20952 28373 28308 40679 44052 39877 38386 52058 83174
11749H3174J4677R911J1198J6047K3289J8944J4900O738j1679j7603j7279j0503
$$ 83174 97851 107762 118960 135007 158296 177240 192140 198878 187199 169596 152317 141814
11737A41814r479j9417k8240j7011j0275k5942j0986l42J7026Q571p386L09l704
$$ 141814 132335 112918 84678 67667 57392 31450 20464 20122 37148 45719 38333 38642 34938
11724C4938j4456M329J0323j9175l543O666R725n560r855N688p06R955J327j3633
$$ 34938 20482 24811 35134 15959 12416 19082 28807 23247 13392 19080 18374 28329 29656 16023
11710A6023j5451J260m806O713J2873o430J053p846r046R914Q448J609O274J0128
$$ 16023 572 1832 -2974 3739 16612 10182 11235 3389 -5657 4257 12705 14314 20588 30716
11696C0716m824j1732j1671l075j2515k452M335J4699O489j3434q159j247J778
$$ 30716 25892 14160 2489 -586 -13101 -15553 -11218 3481 9970 -3464 -11623 -12870 -11092
11683a1092j832J4713J1159K106j5606p333j6958l785O949K741J0055M537J266
$$ -11092 -12924 1789 12948 15054 -552 -7885 -24843 -28628 -21679 -18938 -8883 -4346 -3080
11670c080j2969j526J2941P004J4593r061o710m972O691J4932q922l623r68j2684
$$ -3080 -16049 -17575 -4634 2370 16963 7902 1192 -3780 2911 17843 8921 5298 4330 -8354
11656h354K671j2271m449J3959K0776n952q65o301K830k656q807J1767J0838k363
$$ -8354 -5683 -17954 -22403 -8444 12332 6380 5515 -786 2044 -612 -9419 2348 13186 10823
11642A0823p159j8329R3J5402R043J750k582k158J757N750j5442j855L64j636
$$ 10823 3664 -14665 -14572 830 9873 11623 9041 6883 8640 14390 -1052 -2907 -2543 -4179
11628d179N813J1849N87k877p983O18r668j7833J3960N010p406R671J15n391K062
$$ -4179 1634 13483 14070 11193 3210 3828 -5840 -23673 -9713 -4703 -12109 -2438 -2323 -7714 -5652
11613e652j020n654m762N23K844K530l467M001M718p872o374J0636K6109l700
$$ -5652 -6672 -12326 -17088 -16565 -13721 -11191 -14658 -10657 -5939 -13811 -20185 -9549 16560 12860
11599A2860j9079k2647P832Q519J439p796J883K4005j1100j0836j830J0275P856
$$ 12860 -6219 -28866 -21034 -12515 -11076 -18872 -16989 7016 -4084 -14920 -16750 -6475 1381
11586A381P677L702j5870j350k846N611P305j5117j8641Q305L660J3964J4792
$$ 1381 9058 12760 -3110 -4460 -7306 -1695 5610 -9507 -28148 -19843 -16183 -2219 12573
11573A2573K677Q132P13j118m435j9737j8036m421M766J0503Q272O473n054O314
$$ 12573 15250 23382 24095 22977 18542 -1195 -19231 -23652 -18886 -8383 -111 6362 1308 7622
11559G622k004p868o085Q898M035J224l932P363k459j7815j0099Q021m498J230
$$ 7622 5618 -2250 -8335 563 4598 5822 1890 9253 6794 -11021 -21120 -13099 -17597 -16367
11545a6367M400O275j8657n593J0797J7533k100j757Q691J840j95R620q211J0775
$$ -16367 -11967 -5692 -24349 -29942 -19145 -1612 -3712 -5469 3222 5062 4867 14487 6276 17051
11531A7051R928q676j1792p180O736M955n74J670p844N59K134o218o185J750j19
$$ 17051 26979 18303 6511 -669 6067 11022 10448 12118 4274 4833 6967 749 -5436 -3686 -3805
11516c805K772m305J060K0240n26k243p217J721k405J342P985Q899l893j5020
$$ -3805 -1033 -5338 -4278 15962 15436 13193 5976 7697 5292 6634 14619 23518 19625 4605
11502D605l664p969O165q81N479L537K329K486k042K900r011j1583P07o108j1571
$$ 4605 941 -7028 -863 -1744 3735 7272 9601 12087 10045 12945 3934 -7649 -6942 -13050 -24621
11487b4621p391N575J9947n282N442J1537Q644l424j8805j2548O586K385l178
$$ -24621 -32012 -26437 -6490 -11772 -6330 5207 13851 10427 -8378 -20926 -14340 -11955 -15133
11474a5133p843j2758Q519J4503J7551m397j0271j217L78N885k67J34J1289P499
$$ -15133 -22976 -35734 -27215 -12712 4839 442 -9829 -11046 -10668 -4783 -5050 -4916 6373 13872
11460A3872j601j0223N471m708l548M130Q947J3501K337k3240j6205j368R184
$$ 13872 12271 2048 7519 2811 -737 3393 12340 25841 28178 4938 -11267 -12635 -3451
11447c451M243p255l674J00j408m158j2903K208N30r836L112J7214N025R35N802
$$ -3451 792 -6463 -10137 -10037 -11445 -15603 -28506 -26298 -25768 -35604 -32492 -15278 -10253 -9318 -3516
11432c516j2392j95O445J2086k752J0613N555j1395j1039Q381k651q064j397J47
$$ -3516 -15908 -16103 -9658 2428 -324 10289 15844 4449 -6590 1791 -860 -8924 -10321 -10174
11418a0174J0685J503j0031j248r307l113J1439p412r267J5280Q366k80K861j620
$$ -10174 511 2014 -8017 -9265 -18572 -21685 -10246 -17658 -26925 -11645 -3279 -3559 -698 -2318
11404b318o9Q882L739P408o799j1743o61J037p313P006R565m181o480M156o850
$$ -2318 -2387 6495 10234 17642 10843 -900 -1561 -524 -7837 -831 8734 4553 -1927 2229 -4621
11389d621m722K482l604k892J5740J2183r239j2178l307Q249n976j4525P758j972
$$ -4621 -9343 -6861 -10465 -13357 2383 14566 5327 -6851 -10158 -1909 -7885 -22410 -14652 -16624
11375a6624O300P850K303m918l62J1213J1404L178N635j3394q971j0873J2143
$$ -16624 -10324 -2474 -171 -5089 -5451 5762 17166 20344 25979 12585 3614 -7259 4884
11362D884J5972k689j1718K66j3619p306R220M678P729J1706J794K31j1527k602
$$ 4884 20856 18167 6449 6715 -6904 -14210 -4990 -312 7417 19123 20917 21148 9621 7019
11348G019k119j3007K531p63j720L922O91K684Q041j0555o521Q648J4706j5133
$$ 7019 4900 -8107 -5576 -6339 -8059 -4137 -3446 -762 7279 -3276 -9797 -1149 13557 -1576
11334a576j2642q5J927L54R925J1154R611m24k924K690n21j3016j0233J381Q598
$$ -1576 -14218 -14303 -12376 -12022 -2097 9057 18668 18244 15320 18010 17489 4473 -5760 -4379 4219
11319D219n740j0420r039j326J2927K816J015N109j0671k070r502m910O687R987
$$ 4219 -1521 -11941 -20980 -22306 -9379 -6563 -5548 -439 -11110 -13180 -22682 -27592 -20905 -10918
11305a0918K20l619J869J2076M537j5531o523j172o395J77r510P167K258J898
$$ -10918 -10698 -14317 -12448 -372 4165 -11366 -17889 -19061 -25456 -25279 -34789 -27622 -25364 -23466
11291b3466L002L810J583j3508N167J601J335N758k121P271N083m906r033J352
$$ -23466 -20464 -16654 -15071 -28579 -23412 -21811 -20476 -14718 -16839 -9568 -4485 -9391 -18424 -17072
11277a7072M748P43K791K419n479j4965r133R015J0706N020K725j909m043l556
$$ -17072 -12324 -11581 -8790 -6371 -11850 -26815 -35948 -26933 -16227 -11207 -8482 -10391 -14434 -17990
11263a7990O292m082p56J1281p181M115P270N703M605O208O444j2930j0671R778
$$ -17990 -11698 -15780 -16536 -5255 -12436 -8321 -1051 4652 9257 15465 21909 8979 -1692 8086
11249H086P855n746L805m044j4709N915O833L861k191j358L822l245J832J6899
$$ 8086 15941 10195 14000 9956 -4753 1162 7995 11856 9665 8307 12129 8884 10716 27615
11235B7615K810j0432o956l980P094n981k858J1406k724o180M954l061J73j001
$$ 27615 30425 19993 13037 9057 16151 10170 7312 18718 15994 9814 14768 11707 11880 10879
11221A0879l311r720j1244R621J2016p82K674J2915J979j5256m756M04j086M46
$$ 10879 7568 -2152 -13396 -3775 8241 7459 10133 23048 25027 9771 5015 5419 4333 4779
11207D779L228J2849m756p697j2974R712K960l797q13Q341K215l06R0k6l953n646
$$ 4779 8007 20856 16100 8403 -4571 5141 8101 4304 3491 11832 14047 13741 13831 13805 9852 4206
11191D206O497J865J820J616j5682k435J7267Q078j1072j946K278Q459p863R12
$$ 4206 10703 12568 14388 16004 322 -2113 15154 23232 12160 10214 12492 20951 13088 14000
11177A4000L840k910j3529K631R895K743k002K287p776r210J710J876P145O214
$$ 14000 17840 14930 1401 4032 13927 16670 14668 16955 9179 -31 1679 3555 10700 16914
11163A6914q817k036k195l481j2941k467q23Q67O771j472M776N146k019J8163
$$ 16914 8097 6061 3866 385 -12556 -15023 -15846 -14979 -8208 -9680 -4904 242 -1777 16386
11149A6386M334l293O511j6445r72n615l164r6J764L039J504J8548Q823j3510
$$ 16386 20720 17427 23938 7493 6521 906 -2258 -2354 -590 2449 3953 22501 31324 17814
11135A7814q543q495m630j605K918K2240p740k4102N120O903N55L857J872J5065
$$ 17814 9271 776 -3854 -5459 -2541 19699 11959 -12143 -7023 -120 435 4292 6164 21229
11121B1229Q451M608j6325j3839J076K2437m461l837j026r103o917P914O284l046
$$ 21229 29680 34288 17963 4124 5200 27637 23176 19339 18313 9210 2293 10207 16491 13445
11107A3445n939m91J0383l449Q729P28r407j1254M821l601q663J6483N452m15
$$ 13445 7506 7015 17398 13949 22678 23406 13999 2745 7566 3965 -4698 11785 17237 16822
11093A6822l582K788j0533j3097n551k213j655J1142J554J4916J4830n548n223
$$ 16822 13240 16028 5495 -7602 -13153 -15366 -17021 -5879 -4325 10591 25421 19873 14650
11080A4650j645J4276M738o530J484n134j519o914k966J315j5057k48Q727J6303
$$ 14650 13005 27281 32019 25489 26973 21839 20320 13406 10440 11755 -3302 -3550 5177 21480
11066B1480R124L010j2368q428m579J4371J0380o318j5800K666j794o639L161
$$ 21480 30604 33614 21246 12818 8239 22610 32990 26672 10872 13538 11744 5105 8266
11053H266M195P860J6493P187j411r628L242J662m165j9114j2367l087k009J0954
$$ 8266 12461 20321 36814 44001 42590 32962 36204 37866 33701 14587 2220 -867 -2876 8078
11039H078J3478J0062J704p393n548r80j504m317j3808n130M448Q300O447p665
$$ 8078 21556 31618 33322 25929 20381 19401 17897 13580 -228 -5358 -910 7390 13837 6172
11025F172j0980J5l914M396O572O710J3376O414M57j2478L810n754o497r072k095
$$ 6172 -4808 -4793 -8707 -4311 2261 8971 22347 28761 29218 16740 20550 14796 8299 -773 -2868
11010b868m98N774J8054R520q184j1753m963r773L170Q220J3081l25j501O096
$$ -2868 -3366 2408 20462 29982 21798 10045 5082 -4691 -1521 6699 19780 19455 17954 24050
10996B4050N122m152q135q091P657L221j7571K646J1547k272l172j3532l353J6181
$$ 24050 29172 25020 16885 8794 16451 19672 2101 4747 16294 14022 10850 -2682 -6035 10146
10982A0146K062K548j466l019l980J0772R984n409n623q391q037m198J3775J0357
$$ 10146 12208 14756 13290 10271 6291 17063 27047 21638 16015 7624 -413 -4611 9164 19521
10968A9521r165j0414J5576J0792N044l834n707J4555M034n290m338j845p952
$$ 19521 10356 -58 15518 26310 31354 27520 21813 36368 40402 35112 30774 28929 20977
10955B0977N678J1766m30j2304o420j1016n990l857N75J1688o830N593R743N818
$$ 20977 26655 38421 37991 25687 19267 8251 2261 -1596 -1021 10667 3837 9430 19173 24991
10941B4991r3Q19J0693n121n348M434J935n714q548j339L616K854j067N062j963
$$ 24991 24898 25717 36410 31289 25941 30375 32310 26596 18048 16709 20325 23179 22112 27174 25211
10926B5211j3028O931Q332n12M47j5192P157o058l33J2505J4045o34m257J5633
$$ 25211 12183 19114 27446 26934 27381 12189 19346 13288 12955 25460 39505 38871 34614 50247
10912E0247J5110J301j039n145J3222J1145J0656J84n17k0748P366J1312M039
$$ 50247 65357 66658 65619 60474 73696 84841 95497 95681 95164 74416 81782 93094 97133
10899I7133j2619N359K307j8179O86Q4j386l133O758p718J5876R619m59j0321
$$ 97133 84514 89873 92180 74001 74687 74771 73385 70252 77010 69292 85168 94787 94328 84007
10885H4007r787N085M044J9148J5803r789j7118J984J7593J1371Q410M564j8296
$$ 84007 74220 79305 83349 102497 118300 108511 91393 93377 110970 122341 130751 135315 117019
10872A17019j5420l34N886J155J0673K147K551m953l346j6436j0400p937m790
$$ 117019 101599 101265 107151 108306 118979 121126 123677 118724 115378 98942 88542 80605 75815
10859G5815J3730L188K880J728p758n748m244Q66K029l476K1833J0713l990Q56
$$ 75815 89545 92733 95613 97341 89583 83835 79591 80457 82486 79010 100843 111556 107566 108422
10845A08422j0700k577l315k182K055r949n898N2K012l150o03j4672k1362r621
$$ 108422 97722 95145 91830 89648 91703 81754 75856 75908 77920 74770 74167 59495 38133 28512
10831B8512P039j162l570P587J0987j205K790J785J079M333N364N062J575j5366
$$ 28512 35551 34389 30819 38406 49393 48188 50978 52763 53842 58175 63539 68601 70176 54810
10817E4810p922l584q459n601l440N170J32N477J3541n231M772q882P646O779
$$ 54810 46888 43304 34845 29244 25804 30974 31106 36583 50124 44893 49665 40783 48429 55208
10803E5208j1601P24q898m865M6J266L345N937Q486K980j5001j180J1324J7124
$$ 55208 43607 44331 35433 30568 30614 31880 35225 41162 49648 52628 37627 36447 47771 64895
10789F4895J6707r659j1782p105j286k330n471p786K884O633J077O14n706r654
$$ 64895 81602 71943 60161 53056 51770 49440 43969 36183 39067 45700 46777 47391 41685 32031
10775C2031L783J9l444L981o82R01Q013L848p024r134J0227J6818r369j3073o314
$$ 32031 35814 35833 32389 36370 35688 36589 44602 48450 41426 32292 42519 59337 49968 36895 30581
10760C0581J4041K265n270K590l363R76Q75o374J51J491K2221L602k834J547j2065
$$ 30581 44622 46887 41617 44207 40844 41820 42695 36321 36472 37963 60184 63786 60952 62499 50434
10745E0434n097Nj4439l25J117K892Q486n354o522m891j024J6645J0089J0328
$$ 50434 45337 45342 30903 30578 31695 34587 43073 37719 31197 26306 25282 41927 52016 62344
10731F2344o387p849O040j8489j0692M554N582l939L100M938M860o84K712J2453
$$ 62344 55957 48108 54148 35659 24967 29521 35103 31164 34264 39202 44062 43378 46090 58543
10717E8543J3561O392K231r174j0257l25K253m112m811N919r993j5129L956K3999
$$ 58543 72104 78496 80727 71553 61296 60971 63224 59112 54301 60220 50227 35098 39054 63053
10703F3053M696k085J341J650R202J1963J676J331j1897o068K36j4225p391J1077
$$ 63053 67749 65664 67005 68655 77857 89820 91496 92827 80930 74862 75098 60873 53482 64559
10689F4559J6292J5066Q848q58m158M091k253R550J4249j577K539r811j9128N410
$$ 64559 80851 95917 104765 103907 99749 103840 101587 111137 125386 123809 126348 116537 97409 102819
10675A02819J2763j1377p070j4403o714L375P314L895o735N639l622j1146N761
$$ 102819 115582 104205 97135 82732 76018 79393 86707 90602 83867 89506 85884 74738 80499
10662H0499n91M54N569r379j0847k753K025k272O556P433K376J328q279P086P573
$$ 80499 79908 80362 85931 76552 65705 62952 64977 62705 69261 76694 79070 80398 72119 79205 86778
10647H6778k828j5743q477O599J6669o49l65n877j4291j449l646m593N611m313
$$ 86778 83950 68207 59730 66329 82998 82349 81984 76107 61816 60367 56721 52128 57739 53426
10633E3426n713K718n314j3498R153M518R411P406J1655L600q334K533J0056O5
$$ 53426 47713 50431 45117 31619 40772 45290 54701 62107 73762 77362 69028 71561 81617 81682
10619H1682j8534j0722N000l842j0526J3205R541q384p850K471O168M262J9284
$$ 81682 63148 52426 57426 53584 43058 56263 65804 57420 49570 52041 58209 62471 81755
10606H1755P693Q779J3006j976j1596n745K589k117Q038K415n65N85K015M935
$$ 81755 89448 98227 111233 109257 97661 91916 94505 92388 100426 102841 102276 102861 104876 109811
10592A09811l337J5368J2274l979q042k816j822J1654O682m989J0911J8229j0473
$$ 109811 106474 121842 134116 130137 122095 119279 117457 129111 135793 130804 141715 159944 149471
10579A49471N927J347p423k0852j2829N029K342J1339J7599J7373P071P344N223
$$ 149471 155398 156745 149322 128470 115641 120670 123012 134351 151950 169323 176394 183738 188961
10566A88961J3825Q259J338k499j4894n519K623n985K4884P972Q838J1985O487
$$ 188961 202786 211045 212383 209884 194990 189471 192094 186109 210993 218965 227803 239788 246275
10553B46275j534J4244J2178r907j7351J0016K0987K3023Q018O743J2261J1972
$$ 246275 244741 258985 271163 261256 243905 253921 274908 297931 305949 312692 324953 336925
10541C36925J1802R513J5195K127p218Q77J0427K9447J3351J9410J8673J8986
$$ 336925 348727 358240 373435 375562 368344 369221 379648 409095 422446 441856 460529 479515
10529D79515J9526Q357J3832K8655R857J9556K5101K2744L8623K7347L0396K6420
$$ 479515 499041 507398 521230 549885 559742 579298 604399 627143 665766 693113 723509 749929
10517G49929M5356N7317N1145M4661P6478P4299Q2225Q6721R2609J19654J39554
$$ 749929 795285 852602 903747 948408 1024886 1099185 1181410 1268131 1360740 1480394 1619948
10506A619948J50364J63796J90786K08331K62407L08428L46993M11233M89118
$$ 1619948 1770312 1934108 2124894 2333225 2595632 2904060 3251053 3662286 4151404
10497D151404N94229P28034Q66124J056464J238455J394400J501606J535540J409702
$$ 4151404 4745633 5473667 6339791 7396255 8634710 10029110 11530716 13066256 14475958
10488A4475958J109388O49896J47482l27323o98744r02927r47310q80986p09110
$$ 14475958 15585346 16235242 16382724 16055401 15356657 14453730 13506420 12625434 11916324
10479A1916324n32380l45010j21184P6742K48520M16687N54283O17697O35076
$$ 11916324 11383944 11038934 10917750 10994492 11243012 11659699 12213982 12831679 13466755
10470A3466755N83679M83787L61287K60048K22299K76148M19619N92602P71172
$$ 13466755 14050434 14534221 14895508 15155556 15377855 15654003 16073622 16666224 17437396
10461A7437396Q79065R17274Q06155N78713K43615j15993m34112o50128p59469
$$ 17437396 18316461 19233735 20039890 20618603 20862218 20746225 20312113 19661985 18902516
10452A8902516p60702o38842m68109l07418k33293k02337k42817l58154m75680
$$ 18902516 18141814 17502972 17034863 16727445 16494152 16291815 16048998 15690844 15215164
10443A5215164n65385o00142n57971m56551l31465k04860m1806J65456L57356
$$ 15215164 14649779 14049637 13491666 13035115 12703650 12498790 12456984 12622440 12979796
10434A2979796N37776O95572P98187Q37333P54574N71462K68533r6268m89942
$$ 12979796 13517572 14213144 15011331 15848664 16603238 17174700 17443233 17346965 16857023
10425A6857023q47652j075464j202696j201174j117323j014715q85166p65698
$$ 16857023 16009371 14933907 13731211 12530037 11412714 10397999 9512833 8747135
10417H747135o74924n92395n21465m41432l81894l32220l23448k86277k45875
$$ 8747135 8072211 7479816 6958351 6516919 6135025 5802805 5479357 5193080 4947205
10408D947205k25116k07353j96543j80293j66450j57538j58444j37962j31225
$$ 4947205 4722089 4514736 4318193 4137900 3971450 3813912 3655468 3517506 3386281
10399C386281j33449j01133r9115j07941j01413r3255j05017r7856q7565o9529
$$ 3386281 3252832 3151699 3052584 2944643 2843230 2749975 2644958 2547102 2459537 2390008
10389B390008p3059p4271p5244o8867o4729n1884n2959m8141m7071o2373o6768
$$ 2390008 2316949 2242678 2167434 2098567 2033838 1981954 1928995 1880854 1833783 1771410 1704642
10378A704642m3290m8980l0922l4182m0611m6588l9180m5089l5425k1847l8036
$$ 1704642 1661352 1612372 1581450 1547268 1506657 1460069 1420889 1375800 1340375 1318528 1280492
10367A280492l1253j4132l2461k6769m3359l2482l1136k0666j5603p616j1053
$$ 1280492 1249239 1235107 1202646 1175877 1132518 1100036 1068900 1048234 1032631 1025015 1013962
10356A013962j0300j7314l7057m5998k5754p018j7402k9072k7191k2889p285j5422
$$ 1013962 1003662 986348 949291 903293 877539 870521 853119 824047 796856 773967 766682 751260
10344G51260j8084j9224n390j5879k7927l0237r072J798j3326k2409o543k6001
$$ 751260 733176 713952 708562 692683 664756 634519 625447 627245 613919 591510 584967 558966
10332E58966j8229j7498j0854J0136n398O622J054j1057k1734j4937m266j4093
$$ 558966 540737 523239 512385 522521 517123 523745 524799 513742 492008 477071 472805 458712
10320D58712L490m806j3495r153j8072l734j567P997n985n737K620m643q408j729
$$ 458712 462202 457396 443901 434748 416676 412942 411375 419372 413387 407650 410270 405627 397219 395490
10306C95490L18j5396k2709k8758r888n643J1519j1845j9497j6494q321q114n107
$$ 395490 395808 380412 357703 328945 319057 313414 324933 313088 293591 277097 268776 260662 255555
10293B55555j4631K493J0672o933r187n895J991P124O97K911p111N31r156n822
$$ 255555 240924 243417 254089 247156 237969 232074 234065 241189 241886 244797 237686 238217 229061 223239
10279B23239l5j0651j7918j8223m632j5903o172Q77M654j901q744q933m902r271
$$ 223239 223204 212553 194635 176412 171780 155877 149705 150582 155236 153335 144591 135658 130756 121485
10265A21485j6176o408k426P067l11k3797O932R776K454K159K668j6367K13J196
$$ 121485 105309 98901 96475 103542 103231 79434 86366 96142 98596 100755 103423 87056 87269 88465
10251H8465j0756m98K1028R304q762j1705J143N559K858m533L250k407o625j3777
$$ 88465 77709 77211 98239 107543 98781 87076 88219 93778 96636 92103 95353 92946 86321 72544
10237G2544j3726j8034j0297L398R671k245j0943J1255N439P91k020o02l705p911
$$ 72544 58818 40784 30487 33885 43556 41311 30368 41623 47062 47853 45833 45231 41526 33615
10223C3615k83M176J3661J0046K55j454j3840j4313K200Q966K1925N778L809J016
$$ 33615 33332 37508 51169 61215 61470 60016 46176 31863 34063 43029 64954 70732 74541 75557
10209G5557j1627R316l050l087K704k632l357o48J815p366O254k435o566M771
$$ 75557 63930 73246 70196 67109 69813 67181 63824 63176 64991 57625 63879 61444 54878 59649
10195E9649m784k165j448n333m11m686O951J1941m967m700o564K275M024N686
$$ 59649 54865 52700 51252 45919 45508 40822 47773 59714 54747 50047 43483 45758 49782 55468
10181E5468o360k757N408m219l657J1538P504k095j2051o477o777L072P196P588
$$ 55468 49108 46351 51759 47540 43883 55421 62925 60830 48779 42302 35525 38597 45793 53381
10167E3381J294j4339j3657N006j51n839P119O951k913n20j1683j3164l350M893
$$ 53381 54675 40336 26679 31685 31534 25695 32814 39765 36852 36332 24649 11485 8135 13028
10153A3028Q000N517L628q458m882J2417n94K274J067j573q22Q939m644n33q898
$$ 13028 21028 26545 30173 21715 16833 29250 28656 30930 31997 30424 29602 38541 33897 33364 24466
10138B4466j1347M806o314j2082p731R353J6013R71j95j0598j3692l997J3556
$$ 24466 13119 17925 11611 -471 -8202 1151 17164 18135 17940 7342 -6350 -10347 3209
10125C209P744q403m434k876K3j822P041P452R440L347L690j201R79r134P643
$$ 3209 10953 2550 -1884 -4760 -4737 -6559 482 7934 17374 20721 24411 23210 24189 15055 22698
10110B2698m199o712k919Q676J7016M88j3277j425j211m879M29J1639L722n133
$$ 22698 18499 11787 8868 17544 34560 35048 21771 20346 19135 14256 14685 26324 30046 24913
10096B4913n583P75k437k7492J0585Q240J185J030j3805J220P879m23O326J5683
$$ 24913 19330 20105 17668 -9824 761 9001 10186 11216 -2589 -1369 6510 6087 12413 28096
10082B8096J918j283J302J0162K466q753J893m136k884M787N366k424k936R152
$$ 28096 30014 28731 30033 40195 42661 33908 35801 31665 28781 33568 38934 36510 33574 42726
10068D2726R781J0284J2582Q487J8079Q645m528j3352j0324j900l67j459M546
$$ 42726 52507 62791 75373 83860 101939 110584 106056 92704 82380 80480 80113 78654 83200
10055H3200k878l498J2842l238J451K54k840J6934J3774k929j4547o301r363J9478
$$ 83200 80322 76824 89666 86428 87879 88133 85293 102227 116001 113072 98525 92224 82861 102339
10041A02339J5697N759n806q003J5595l906j1561K226j272j652o841n39L078l465
$$ 102339 118036 123795 117989 109986 125581 121675 110114 112340 111068 109416 102575 102036 105114 101649
10027A01649j363N647J0539J13q645J084M837P50r32N629p177p475j9679K443
$$ 101649 100286 105933 116472 116585 107940 109024 113861 114611 113679 119308 112131 104656 84977 87420
10013H7420l114m557Q026L004j803l185J8671J6839r824q211L235m337l195p878
$$ 87420 84306 79749 87775 90779 88976 85791 104462 121301 111477 103266 106501 102164 98969 91091
9999I1091l462p410p410m665j3867p840O426N270r043j6921r431o17q554N713
$$ 91091 87629 80219 72809 68144 54277 46437 52863 58133 49090 32169 22738 22121 13567 19280
9985A9280J3015J495l357j701J2188P832k476q411l027j0536l410o387n815k620
$$ 19280 32295 33790 30433 28732 40920 48752 46276 37865 34838 24302 20892 14505 8690 6070
9971F070Q237p11p925j173J1635j548j9300K375P975J4154L849J551Q65m586j3101
$$ 6070 14307 13596 5671 4498 16133 14585 -4715 -2340 5635 19789 23638 25189 26054 21468 8367
9956H367n5j766o502L80L484J1830k839j0413J7765M612J6883p672j1134J769
$$ 8367 8312 6546 44 424 3908 15738 12899 2486 20251 24863 41746 34074 22940 24709
9942B4709p971M502m291j2609j0086J1467O483m005K069J737n311j1040L100k245
$$ 24709 16738 21240 16949 4340 -5746 5721 12204 8199 10268 12005 6694 -4346 -1246 -3491
9928c491m314J3456P498p976o429q79L861M329j0667J573J3495l456q108j066
$$ -3491 -7805 5651 13149 5173 -1256 -2135 1726 6055 -4612 -3039 10456 7000 -1108 -2174
9914b174K76k075K186J2171j365M659n369p534K413K029P60Q417n57J180j4078
$$ -2174 -1898 -3973 -1787 10384 9019 13678 8309 775 3188 5217 5977 14394 13837 15017 939
9899I39o841Q175Q287R987K070K383J3319L757j6514k0080j4387O930K6157J3564
$$ 939 -5902 2273 10560 20547 22617 25000 38319 42076 25562 5482 -8905 -1975 24182 37746
9885C7746J092j611p705j5665j0970k96Q74P554K07p82Q151o59Q56K907p606q36
$$ 37746 38838 37227 29522 13857 2887 2591 3465 11019 11226 10444 18595 17936 18792 21699 14093 13257
9869A3257l096o758P969j806n879k875o385L230K375O668P83k294K1793J2000
$$ 13257 10161 3403 11372 9566 3687 812 -5573 -2343 32 6700 7483 5189 26982 38982
9855C8982K407L278K570j3157j8654j3812n720j544J205O364O985O39j2191J349
$$ 38982 41389 44667 47237 34080 15426 1614 -4106 -5650 -4445 1919 8904 9543 -2648 -1299
9841a299N38O521P173J0891p905m521k451q641M04P88Q599L193j939n405L189
$$ -1299 -761 5760 12933 23824 15919 11398 8947 306 710 1498 10097 13290 11351 5946 9135
9826I135P671P880k934j0451M39O954m681l263J751j367r321O338M654J3646K987
$$ 9135 16806 24686 21752 11301 11740 18694 14013 10750 12501 11134 1813 8151 12805 26451 29438
9811B9438o273n191k785n978J177Q091j797n557j2337J627J1390M699N240N834
$$ 29438 23165 17974 15189 9211 10388 18479 16682 11125 -1212 415 11805 16504 21744 27578
9797B7578l711P782r738N543k660j0747j3735J1316L683l04Q08k849j7292n314
$$ 27578 23867 31649 21911 27454 24794 14047 312 11628 15311 15007 15815 12966 -4326 -9640
9783i640R723M789O27l266N195P416o847M463J7637p536K093R995K2j6025r646
$$ -9640 83 4872 5499 2233 7428 14844 7997 12460 30097 22561 24654 34649 34671 18646 9000
9768I000k549Q01P399n635j2816n73N709J2746J2818K676r527q033J7765M467
$$ 9000 6451 7252 14651 9016 -3800 -4373 1336 14082 26900 29576 20049 12016 29781 34248
9754C4248o363j0118K179j23P375r042k562k466J7335O048J451L069j883r212
$$ 34248 27885 17767 19946 19823 27198 18156 15594 13128 30463 36511 37962 41031 39148 29936
9740B9936j7976P244j323J1305R923j1827j5146k329j293K0462J6524l932o124
$$ 29936 11960 19204 17881 29186 39109 27282 12136 9807 8514 28976 45500 41568 35444
9727C5444K350K217J1722K0058r215m222K2104K0814n781m205j332J2109J8921
$$ 35444 37794 40011 51733 71791 62576 58354 80458 101272 95491 91286 89954 102063 120984
9714A20984K8078J7725K3047J2989J3174K1064L4073M9131L9896M6527N6833P6892
$$ 120984 149062 166787 189834 202823 215997 237061 271134 320265 360161 406688 463521 540413
9702E40413Q1649Q9162J20000J35004J44045J38510J40708J23355P2707L8404
$$ 540413 622062 711224 831224 966228 1110273 1248783 1389491 1512846 1585553 1623957
9692A623957l9064q1959j20413j34775j25939j13159j03515q2650q2446p3599
$$ 1623957 1584893 1502934 1382521 1247746 1121807 1008648 905133 822483 740037 666438
9682F66438o8219m5026m3853l1400k0404l4060k3367k6710k5950j9300j5522j7393
$$ 666438 598219 553193 509340 477940 457536 423476 400109 373399 347449 328149 312627 295234
9670B95234j2685j8442o735j4116j4380j918r902l0789m260O415l657j0205p381
$$ 295234 282549 264107 257372 243256 228876 226958 217056 186267 182007 188422 184765 174560 167179
9657A67179j9582N64n691o48Q962M07k0480K99r04k0002O443J523p051N098N916
$$ 167179 147597 148161 142470 141822 150784 151191 130711 131010 130106 110104 116547 118070 111019 116117 122033
9642A22033J423j1145p686l959o734J3259o124p451n159o371q055n427O645L979
$$ 122033 123456 112311 104625 100666 93932 107191 101067 93616 88457 82086 74031 68604 75249 79228
9628G9228k155j8258k508J0125Q791J0210K039j7180j9264o720l645N369J703
$$ 79228 77073 58815 56307 66432 75223 85433 87472 70292 51028 44308 40663 46032 47735
9615D7735n119p777j1296K926M623k250p407j459J001L04P372l109l641j5306
$$ 47735 42616 34839 23543 26469 31092 28842 21435 19976 20977 21281 28653 25544 21903 6597
9601F597O552J1777J1541r718K822L788j1829j2542J5605J6179M753r77j032L901
$$ 6597 13149 24926 36467 26749 29571 33359 21530 8988 24593 40772 45525 44548 43516 47417
9587D7417j0182p920p030K217J5609j776p392L834L159j1130Q245k87q809j0788
$$ 47417 37235 29315 22285 24502 40111 38335 30943 34777 37936 26806 35051 34764 25955 15167
9573A5167M501k0635r102O644J1639L371J0222J9654R387k917J756R092o107j5141
$$ 15167 19668 -967 -10069 -3425 8214 11585 21807 41461 50848 47931 49687 58779 52672 37531
9559C7531o280m381P354p326m064l902n381j1353l790N877J6367J6339j0112N48
$$ 37531 31251 26870 34224 26898 22834 18932 13551 2198 -1592 4285 20652 36991 26879 27427
9545B7427J0512o516j060j746j6444O998K1897J1520j925q632r042M067j682M729
$$ 27427 37939 31423 30363 28617 12173 19171 41068 52588 50663 42031 32989 37056 35374 40103
9531D0103j1981j0566r808k284j2066q182O312N282J0531J2365k35r001K465N714
$$ 40103 28122 17556 7748 5464 -6602 -14784 -8472 -3190 7341 19706 19471 10470 12935 18649
9517A8649M142m956q22q036J3361j1043q623J52J247J4782k129M786j097n533
$$ 18649 22791 17835 17013 8977 22338 11295 2672 2824 4071 18853 16724 21510 20413 14880
9503A4880r146J660O969J1344P298j579J1089k750r091J3360j737o528P22j217
$$ 14880 5734 7394 14363 25707 33005 31426 42515 39765 30674 44034 42297 35769 36491 35274
9489C5274j5017k46j587K060q36k107J909k295m600J767M284L024R327O034Q995
$$ 35274 20257 20011 18424 20484 19648 17541 19450 17155 12555 14322 18606 21630 30957 36991 45986
9474D5986J773o4M310N297p632l246n020r854o528q258O907m764L658P32J967
$$ 45986 47759 47695 52005 57302 49670 46424 41404 31550 25022 16764 23671 18907 22565 23297 25264
9459B5264P892Q6j990J149k922k452N444J187r8m841Q94j851J1996q790J4725
$$ 25264 33156 33242 31252 32401 29479 27027 32471 33658 33560 28719 29613 27762 39758 30968 45693
9444D5693J0238J1230Q13n330j2475K821r496L458M813j59j4692Q980K803m598
$$ 45693 55931 67161 67974 62644 50169 52990 43494 46952 51765 51606 36914 45894 48697 44099
9430D4099k407M230j1031j6987q400R759J5288l41N569m456j514M777m77j0416
$$ 44099 41692 45922 34891 17904 9504 19263 34551 34210 39779 35323 33809 38586 38109 27693
9416B7693q474j0798J42J5559O773j0809l208l41o726J0936O574J2955O172k459
$$ 27693 19219 8421 8563 24122 30895 20086 16878 16537 9811 20747 27321 40276 46448 43989
9402D3989J283j1211r405J4092P861m505j2311n288P697L285j85j6734Q14L715
$$ 43989 45272 34061 24656 38748 46609 42104 29793 24505 32202 35487 35302 18568 19382 23097
9388B3097j2735r922Q668J622n709M43N471P477R212O725j186l849J844K509k605
$$ 23097 10362 440 9108 10730 5021 5464 10935 18412 27624 34349 33163 29314 31158 33667 31062
9373C1062M366M624n712l508J233l147R235P900O156K0646N53K795j2374Q990
$$ 31062 35428 40052 34340 30832 32065 28918 38153 46053 52209 72855 73408 76203 63829 72819
9359G2819P082j0755q460m061J184Q4Q731P009J2971K382k759j711N159k668o851
$$ 72819 79901 69146 60686 56625 57809 57893 66624 73633 86604 88986 86227 84516 89675 87007 80156
9344H0156j6722J1190P817P633q439N416r50j7712m05J5212p189j2899Q782N160
$$ 80156 63434 74624 82441 90074 81635 87051 86101 68389 67984 83196 76007 63108 71890 77050
9330G7050q256K131O046M000L255J1990L818M403N695P874n070o80O885l310r465
$$ 77050 68794 70925 76971 80971 84226 96216 100034 104437 110132 118006 112936 112256 119141 115831 106366
9315A06366N151J1365j0761n476k498m089j032J552J6878K3195L09p766L60Q160
$$ 106366 111517 122882 112121 106645 104147 100058 99026 100578 117456 140651 140960 133194 133554 141714
9301A41714K1126K581o825J3379P511R713O374j0797J5935J2831K011L328J351
$$ 141714 162840 165421 158596 171975 179486 189199 195573 184776 200711 213542 215553 218881 220232
9288B20232P557R01J2327J2300J9556L4886J2321J5810J8098J6180K5534L0939
$$ 220232 227789 228690 241017 253317 272873 307759 320080 335890 353988 370168 395702 426641
9276D26641L2397J9922J4650K6499K9957M4648L3800M7573N0305O2811Q4747O4742
$$ 426641 459038 478960 493610 520109 550066 594714 628514 676087 726392 789203 873950 938692
9264I38692O7532J06897J14352J22186J48046J79230K06060K45376K87849L48852
$$ 938692 1006224 1113121 1227473 1349659 1497705 1676935 1882995 2128371 2416220 2765072
9254B765072M21937N25699O29554P28866Q58054R64689J041140J062941R43739
$$ 2765072 3187009 3712708 4342262 5071128 5929182 6893871 7935011 8997952 9941691
9245I941691P00381L49006q8166m73470p62010r21851r45255q79279p82298o78672
$$ 9941691 10642072 10991078 10902912 10429442 9667432 8745581 7800326 6921047 6138749 5460077
9235E460077n75830m80598m16411l51758k79926k46360k19163j85606j66257j60263
$$ 5460077 4884247 4403649 3987238 3635480 3355554 3109194 2890031 2704425 2538168 2377905
9225B377905j38545j24152j15936j06721q5702o3527p7277o9574p3208p0482o5785
$$ 2377905 2239360 2115208 1999272 1892551 1806849 1743322 1666045 1596471 1523263 1452781 1386996
9214A386996m8315m5753m6197m2835l8415l4827m1864m3323m4360n1301l5539
$$ 1386996 1338681 1292928 1246731 1203896 1165481 1130654 1088790 1045467 1001107 949806 914267
9203I14267k0267k4790l8077l7272k4149j5313k4757j4140j867j0090n582k7453
$$ 914267 894000 869210 831133 793861 769712 754399 729642 715502 713635 703545 697963 670510
9191F70510k8517k0640k3817k4266j8004k0059j7207k735j3917k6416r422k103
$$ 670510 641993 621353 597536 573270 555266 535207 518000 515265 501348 474932 465510 463407
9179D63407q947k2351k4847p256j087O32r009r692J088q069q746m306j1128k3683
$$ 463407 454460 432109 407262 400006 398919 399551 390542 380850 381938 373869 365123 360817 349689 326006
9165C26006j5785p038j0742j2450J1972l952L077o11j6668k4432j3730m992R04
$$ 326006 310221 303183 292441 279991 291963 288011 291088 290477 273809 249377 235647 230655 231559
9152B31559O470J6291Q882Q64j90Q447J1727J170N473K5768K9919J3564K9684
$$ 231559 238029 254320 263202 264066 263876 272323 284050 285220 290693 316461 346380 359944 389628
9139C89628M6284N0003O5565R9981J01189J29438J27398J05731R9489N7751J3288
$$ 389628 435912 485915 551480 651461 752650 882088 1009486 1115217 1214706 1272457 1285745
9128A285745k3754n8574j01372j03851j18412j08632r5417p9976n2205l0926l8375
$$ 1285745 1261991 1203417 1102045 998194 879782 771150 675733 595757 543552 512626 474251
9117D74251l1922l9708k2060j9006k4657k6456o262j464j7058p960J754q685j5118
$$ 474251 442329 402621 380561 361555 336898 310442 304180 302716 285658 277698 279452 270767 255649
9104B55649k1786L632m610j4569r346O72l298j1607k806L158o733k1465j1073
$$ 255649 233863 237495 232885 218316 208970 209642 206344 194737 191931 195089 188356 166891 155818
9091A55818J5507J026n999r056M304K766p796j1742k4548q256P401O912k660j00
$$ 155818 171325 172351 166352 157296 161600 164366 156570 144828 120280 112024 119425 126337 123677 123577
9077A23577m785m016J4919l367l0468L886K3881L782O709M315j6100q252K00L66
$$ 123577 118792 114776 129695 126328 95860 99746 123627 127409 134118 138433 122333 114081 114281 114647
9063A14647K96P04J599j2282l918l145q478j2938q47k103Q117j6389n267M145
$$ 114647 114943 115647 117246 104964 101046 97901 89423 76485 75638 73535 81652 65263 59996 64141
9049F4141l438J89Q759l027J1848N622L998K8850J5019P346O829j1769l583N137
$$ 64141 60703 60892 69651 66624 78472 84094 88092 116942 131961 139307 146136 134367 130784 135921
9035A35921j9398k0363j5464j5173j3730K501J0040Q896J433R101J3224m589j0099
$$ 135921 116523 96160 80696 65523 51793 54294 64334 73230 74663 83764 96988 92399 82300
9022H2300k639N546j842n846L233l537r254L335J887n516n358O208J1985Q522
$$ 82300 79661 85207 83365 77519 80752 77215 67961 71296 73183 67667 62309 68517 80502 89024
9008H9024m402p217Q249J285l147L503j0013R323k529j588J6114J0599J9063R521
$$ 89024 84622 77405 85654 86939 83792 87295 77282 86605 84076 82488 98602 109201 128264 137785
8994A37785n314j012P437K288K2451K1452K2503K6391K6054Q188r075q883j8854
$$ 137785 132471 131459 138896 141184 163635 185087 207590 233981 260035 268223 259148 250265 231411
8981B31411j0145j013n807j9971k1050r310j967N191Q814J9031J8854N50Q537
$$ 231411 221266 220253 214446 194475 173425 164115 162148 167339 176153 195184 214038 214588 223125
8968B23125O456N414R80q107r397j1591o097o433k326K946O668J8470J339o561
$$ 223125 229581 234995 235975 227868 218471 206880 200783 194350 192024 194970 201638 220108 221447 214886
8954B14886k216j4717m771L778L600Q498J8928O142K0109J1956j024O286M754
$$ 214886 212670 197953 193182 196960 200560 209058 227986 234128 254237 266193 265169 271455 276209
8941B76209m368l000J1323N783M308P913J8116J9117M0957K8070K5655J8979L5009
$$ 276209 271841 268841 280164 285947 290255 298168 316284 335401 376358 404428 430083 449062 484071
8928D84071N0196N2926O9404P9691O2754L757r7565j42178j98316k42646k09077
$$ 484071 534267 587193 656597 736288 799042 802799 705234 563056 364740 122094 -86983
8917h6983j09748k8711r033J2822K6558J8448K0191K7148M992J46J598J819k968
$$ -86983 -196731 -225442 -234475 -221653 -195095 -176647 -156456 -129308 -124316 -124170 -122572 -120753 -123721
8904a23721m460n439q086J2142K1272K0214J990M827N333J5808J4536J574K779
$$ -123721 -128181 -133620 -141706 -129564 -108292 -88078 -86088 -81261 -75928 -60120 -45584 -44010 -41231
8891d1231j1133j2035r38J0208J5052R322O304j6311j7182j7198k5075j5022m67
$$ -41231 -52364 -64399 -65337 -55129 -40077 -30755 -24451 -40762 -57944 -75142 -100217 -115239 -115706
8878a15706Q665K815J4569P574O319J9545R998J4117J5617K344k0448k3213p942
$$ -115706 -107041 -104226 -89657 -82083 -75764 -56219 -46221 -32104 -16487 -14143 -34591 -57804 -65746
8865f5746p027J0958o274r604O417J2986L1197M7506L8431N1588O4632J8610R232
$$ -65746 -72773 -61815 -68089 -77693 -71276 -58290 -27093 20413 58844 110432 175064 193674 202906
8852B02906J9592R377q474L76J0831M585o980l662k571J3428K3092J6068J6817
$$ 202906 222498 231875 223401 223777 234608 239193 232213 228551 225980 239408 262500 278568 295385
8839B95385K1317K9425J7148Q924J8344J7186J3788J1627K231n221L676M852j600
$$ 295385 316702 346127 363275 372199 390543 407729 421517 433144 435375 430154 433830 438682 437082
8826D37082j5691j3165o722N113J1314N234J705n671J0596J4789P874M418L080
$$ 437082 421391 408226 401504 406617 417931 423165 424870 419199 429795 444584 452458 456876 459956
8813D59956O344Q337N508J7002K2574K1244J1154o620j3268k858n924j3782j7726
$$ 459956 466300 474637 480145 497147 519721 540965 552119 545499 532231 529373 523449 509667 491941
8800D91941J94P437K2028K0135J9561Q325k35J831L1611N2759M6388L7629L6113
$$ 491941 492135 499572 521600 541735 561296 569621 569386 571217 602828 655587 701975 739604 775717
8787G75717K8948L1169L7912M4384L9563M0518L3140R838J5972L5085P1257R3147
$$ 775717 804665 835834 873746 918130 957693 998211 1031351 1041189 1057161 1092246 1163503 1256650
8775A256650R4798Q1677R7251O4891M6845O6463Q4163J09972J37690J74855J64260
$$ 1256650 1351448 1433125 1530376 1595267 1642112 1708575 1792738 1902710 2040400 2215255 2379515
8764B379515J54923J51056J57882J66358J80271J97511K45165L26717M02781N05395
$$ 2379515 2534438 2685494 2843376 3009734 3190005 3387516 3632681 3959398 4362179 4867574
8754D867574O25871P13095P76554Q67555J001219J216439J536835J927075K301387
$$ 4867574 5493445 6206540 6983094 7850649 8851868 10068307 11605142 13532217 15833604
8745A5833604K697091L092221L512351M104516N084157O789149R655401J4250445
$$ 15833604 18530695 21622916 25135267 29239783 34323940 41113089 50768490 65018935
8737F5018935K1420250L2098987M5213570N3704776M8160727L1010143Q612860
$$ 65018935 86439185 118538172 163751742 217456518 265617245 296627388 305240248
8730C05240248k2709669n1569073n5095586m1741801k8201565j8796524j2846085
$$ 305240248 282530579 230961506 175865920 134124119 105922554 87126030 74279945
8723G4279945r171980o865190n318710m301701l687639l294340k971134k679950
$$ 74279945 65107965 58242775 52924065 48622364 44934725 41640385 38669251 35989301
8715C5989301k491825k297797k006261j692104j382378j129069r63950q62487
$$ 35989301 33497476 31199679 29193418 27501314 26118936 24989867 24025917 23163430
8707B3163430q13379q44572q99223r10034r27032q91953p96025p04221o67218
$$ 23163430 22350051 21505479 20606256 19696222 18769190 17877237 17081212 16376991 15709773
8698A5709773o07450n47103n08881m82768m94363m95455m87079m69445m32270
$$ 15709773 15102323 14555220 14046339 13563571 13069208 12573753 12086674 11617229 11184959
8689A1184959l82215l32832l06912k83909k66401k49356k39909k39544k24785
$$ 11184959 10802744 10469912 10163000 9879091 9612690 9363334 9123425 8883881 8659096
8680H659096k27647k42030k42665k52373k50215k54332k35963k35259k03630j85418
$$ 8659096 8431449 8189419 7946754 7694381 7444166 7189834 6953871 6718612 6514982 6329564
8670F329564j83404j80199j65439j64337j50203j47461j50305j62404j42880j41314
$$ 6329564 6146160 5965961 5800522 5636185 5485982 5338521 5188216 5025812 4882932 4741618
8660D741618j27608j38432j48952j28304j14459j27742j15131q6271q8226j12110
$$ 4741618 4614010 4475578 4326626 4198322 4083863 3956121 3840990 3754719 3666493 3554383
8650C554383r2706r0230q1910o1629o8425o8707n5716n4925n8328o6832n8678
$$ 3554383 3461677 3371447 3289537 3227908 3159483 3090776 3035060 2980135 2921807 2854975 2796297
8639B796297p3510p0386p7258p1701o8180q1005q1228o4598n8239n8272o6877
$$ 2796297 2722787 2652401 2575143 2503442 2435262 2354257 2273029 2208431 2150192 2091920 2025043
8628B025043o5933m3898l8433k6126j3159j6880l3595k8562k8533l8565l3809
$$ 2025043 1959110 1915212 1876779 1850653 1837494 1820614 1787019 1758457 1729924 1691359 1657550
8617A657550k6791l0907l8900k7039j2503J75J8322L4342L7722O1502Q6922J24620
$$ 1657550 1630759 1599852 1560952 1533913 1521410 1521585 1539907 1574249 1611971 1673473 1760395 1885015
8605A885015J49091J48948P1017M621n5522j50439k08027j77516j20608q1730
$$ 1885015 2034106 2183054 2254071 2258692 2203170 2052731 1844704 1667188 1546580 1464850
8595A464850l5899j9998j3183q37o23Q491K7980N6301Q3239R8148J15150J42243
$$ 1464850 1428951 1408953 1395770 1394933 1394310 1402801 1430781 1487082 1570321 1668469 1783619 1925862
8583A925862J46106J54122J66343K56939M48140P79508J374963K523105M333042
$$ 1925862 2071968 2226090 2392433 2649372 3097512 3877020 5251983 7775088 12108130
8574A2108130N311139L847852K173480M90334m176837o431318m134364k219814
$$ 12108130 17419269 21267121 23440601 23930935 19754098 13322780 9188416 6968602
8566F968602j279978q12046n53574l92182l08219k17638j82666j84775j69555
$$ 6968602 5688624 4876578 4323004 3930822 3622603 3404965 3222299 3037524 2867969
8557B867969j55252j50853j17471j15491r9375p0455l4609j5232k1231k0406l9908
$$ 2867969 2712717 2561864 2444393 2328902 2229527 2159072 2124463 2109231 2088000 2067594 2027686
8546B027686r5904j56418k18984k66500k87480k57247j32211k0874L8150K6832
$$ 2027686 1931782 1775364 1556380 1289880 1002400 745153 612942 592068 630218 657050
8536F57050J8727K1737J1155O033m908j837K334N553L4540O0457J12936J23918
$$ 657050 675777 697514 708669 714702 709794 707957 710291 715844 750384 810841 923777 1047695
8524A047695J05656L6907k8052j05399j56280j32106p3876l7154l2703k9121j8972
$$ 1047695 1153351 1190258 1162206 1056807 900527 768421 694545 657391 624688 595567 576595
8513E76595j3148P234r909j8247k9665k7478j7071j4461J3081K729j3528k3792
$$ 576595 563447 570681 560772 542525 512860 485382 468311 453850 466931 469660 456132 432340
8501D32340p096j2934k02Q689j568M47j4286m946j3367m160O530r264m862M283
$$ 432340 425244 412310 412108 420797 419229 419676 405390 400444 387077 382917 389447 380183 375321 379604
8487C79604J454R537P894L471K2297L9270O2912M2581J8938k185l7580n6900o8564
$$ 379604 381058 390595 398489 401960 424257 463527 526439 569020 587958 585773 548193 491293 422729
8474D22729m8225k8052j8296j3598k9784k1748l643m316o484P951R448K095P252
$$ 422729 374504 346452 328156 314558 284774 263026 259383 255067 248583 256534 265982 268077 275329
8461B75329m323j1131j0521J900n750K752j0009j0043J7427j203k2546j2206R438
$$ 275329 271006 259875 249354 251254 245504 248256 238247 228204 245631 244428 221882 209676 219114
8448B19114O033r320n368N406m483j3222j459j2726j5848r728j0279P95m476O619
$$ 219114 225147 215827 210459 215865 211382 198160 196701 183975 168127 158399 148120 148915 144439 151058
8434A51058R796m870j8730j3022k1864j2282p494o756m452j0159l34O232J2513
$$ 151058 160854 155984 137254 124232 102368 90086 82592 75836 71384 61225 60891 67123 79636
8421G9636k388Q07J314M184J6910J1711J04n968J58j0366j0207M206N294n131
$$ 79636 77248 78055 79369 83553 100463 112174 112278 106310 106468 96102 85895 90101 95395 90264
8407I0264j5145J58m601J5949O70q40k056j2566l234L470N755Q775J990R647j525
$$ 90264 75119 75277 70676 86625 87295 86455 84399 71833 68599 72069 77824 86599 88589 98236 96711
8392I6711j3300o518j6659J1687J4393O484J2423m234k9870k7982k6063j2522
$$ 96711 83411 76893 60234 71921 86314 92798 105221 100987 71117 43135 17072 4550
8380D550L52N622K0566P417M401o138P283m483O19K3640J4883j2684k6414p306
$$ 4550 4902 10524 31090 38507 42908 36770 44053 39570 40189 63829 78712 66028 39614 32308
8366C2308O492Q047J0031K585L58K723q64j1883J0359J2145N353K3060O878P704
$$ 32308 38800 46847 56878 59463 59821 62544 61680 49797 60156 72301 77654 100714 107592 115296
8352A15296Q79k8039o050P766j226J193k428J3529K7832J6524R701K1333L2373
$$ 115296 116175 88136 82086 89852 88626 89819 87391 100920 128752 145276 154977 176310 208683
8339B08683L3236K7065O5133Q9323Q7157J05385J18970J19636J17528J09190O4269
$$ 208683 241919 268984 334117 423440 510597 615982 734952 854588 972116 1081306 1145575
8328A145575J9889k1401l9113p2873r6689j19224j07268j03968q8968n6184l8132
$$ 1145575 1165464 1144063 1104950 1032077 935388 816164 708896 604928 515960 459776 421644
8317D21644l2608l2959m1216k5847J698j1818j6782j0946j3232j6403j1911j4300
$$ 421644 389036 356077 314861 289014 290712 278894 262112 251166 237934 221531 209620 195320
8305A95320n282J0174p973p469o655k028p955M416K824j4548j6725n975m094r659
$$ 195320 190038 200212 192239 184770 178115 176087 168132 172548 175372 160824 144099 138124 134030 124371
8291A24371N936r494m551p912j2750Q491M371K73k119k939j3131l220N231M866
$$ 124371 130307 120813 116262 108350 95600 104091 108462 108735 106616 103677 90546 87326 92557 97423
8277I7423J03K281L112j4881j9361j0854L93R295m47P379o910P549K6659K7791
$$ 97423 97526 99807 102919 88038 68677 57823 58216 67511 67064 74443 67533 75082 101741 129532
8263A29532J1076j0255p565l7n838k3300L94J838k4716j5670j0048j592R979J3534
$$ 129532 140608 130353 122788 122751 116913 93613 94007 95845 71129 55459 45411 43819 53798 67332
8249F7332L638J0289J3595j6741p820R042p533k527l100k343o367M008J0057K350
$$ 67332 70970 81259 94854 78113 70293 79335 71802 69275 66175 63832 57465 61473 71530 73880
8235G3880q403j3642P02j191M18o342j9587J6677J1743O882Q480o465j5384L80
$$ 73880 65477 51835 52537 51346 51764 45422 25835 42512 54255 61137 69617 63152 47768 48148
8221D8148l049n323J7095k041J686l830j740J4200M7m789j5538P16N318l356K546
$$ 48148 45099 39776 56871 54830 56516 52686 50946 65146 65193 60404 44866 45582 50900 47544 50090
8206E0090K242J634o442L065O609L822j662k411o554q893j4308m018k774N571
$$ 50090 52332 53966 47524 50589 57198 61020 59358 56947 50393 41500 27192 23174 20400 25971
8192B5971J5814J3266M598j2186j15m850J02R1j730q24J4238M919j4826r261K599
$$ 25971 41785 55051 59649 47463 47348 42498 42600 42691 40961 40137 54375 59294 44468 35207 37806
8177C7806J8914J1189L438N98L2220K1455k893j0014j198j639j2323o886j2116
$$ 37806 56720 67909 71347 71945 104165 125620 122727 112713 111515 109876 97553 90667 78551
8164G8551j5541p600j491L4K882q059j1889n284m150R986J1672r777j7012L916
$$ 78551 63010 55410 53919 53953 56835 48776 36887 31603 27453 37439 49111 39334 22322 26238
8150B6238J4972j255k517j900j3452n787O746J1990l146J1158O412m723m68k288
$$ 26238 41210 39955 37438 35538 22086 16299 23045 35035 31889 43047 49459 44736 44268 41980
8136D1980p957K968Q576M541p887p15p017N489j7165j1181k056J3351j0425J53
$$ 41980 34023 36991 45567 50108 42221 41506 34489 39978 22813 11632 9576 22927 12502 12655
8122A2655k849q416O208Q325J868P128j179j931N28q955j6981J1568J0015K076
$$ 12655 9806 1390 7598 15923 17791 24919 23740 21809 22337 13382 -3599 7969 17984 20060
8108B0060r84O288J3909k892m401P94j572k983l165k318J366l705l542J296q697
$$ 20060 19076 25364 39273 36381 31980 32774 31202 28219 25054 22736 24102 20397 16855 18151 9454
8093I454j0917J7427K7279P760j0400j7861j2068K555m509j743o64j863K677Q620
$$ 9454 -1463 15964 43243 51003 40603 22742 10674 13229 8720 6977 6313 4450 7127 15747
8079A5747k10Q022J4344L361j2874J570r372o348r248O231J1727j447r555p953
$$ 15747 15537 23559 37903 41264 28390 29960 20588 14240 4992 11223 22950 21503 11948 3995
8065C995M560J5616p747L30L046M823p903j3118R473J5132J3567k581j601k930
$$ 3995 8555 24171 16424 16754 19800 24623 16720 3602 13075 28207 41774 39193 37592 34662
8051C4662Q135k213Q31m10q273n038J359J744m256j307O512j0635m126m993Q794
$$ 34662 42797 40584 41415 41005 32732 27694 29053 30797 26541 25234 31746 21111 16985 11992 20786
8036B0786K874j2812N265N193q558N109k229O055p793j2486k227L071N697P732
$$ 20786 23660 10848 16113 21306 12748 17857 15628 21683 13890 1404 -823 2248 7945 15677
8022A5677j3175m527J070J0202M345P462p831j0114n489j2246K678j045M263R589
$$ 15677 2502 -2025 -955 9247 13592 21054 13223 3109 -2380 -14626 -11948 -12993 -8730 859
8008H59Q372J4940j2777J344J3476j0338m003J3240L784J797j6662J27N266M540
$$ 859 9231 24171 11394 12738 26214 15876 11873 25113 28897 30694 14032 14159 19425 23965
7994B3965L382k995k308J065L998j290j1229n842l801J0260M400r57R345N417
$$ 23965 27347 24352 22044 23109 27107 25817 14588 8746 4945 15205 19605 18648 27993 33410
7980C3410N174r928j3374j0504k674o079M59m907R201J6867R543j608n236O164
$$ 33410 38584 28656 15282 4778 2104 -3975 -3516 -8423 778 17645 27188 25580 20344 26508
7966B6508M331o753o967M108Q544p510N236K659J7383j10j0658o279J2152M467
$$ 26508 30839 24086 17119 21227 29771 22261 27497 30156 47539 47429 36771 30492 42644 47111
7952D7111r193J988n518r64N077j7387j1192j668Q344j06K375k904j4325L743
$$ 47111 37918 39906 34388 33424 38501 21114 9922 8254 16598 16492 18867 15963 1638 5381
7938E381M197J646m253k28J3030J2960p48N53j563o861q71R979r133j0587P842
$$ 5381 9578 11224 6971 6743 19773 32733 31985 32538 30975 24114 23243 33222 24089 13502 21344
7923B1344J6727P520j8473K830Q203P458r109r622k235O46M877M606Q134R548
$$ 21344 38071 45591 27118 29948 38151 45609 36500 26878 24643 25289 30166 34772 42906 52454
7909E2454P593j0339j2056j0542j602m050J2841j181j476p688l849J1467j2282
$$ 52454 60047 49708 37652 27110 25508 21458 34299 33118 31642 23954 20105 31572 19290
7896A9290m373J4567J986r827j6457J0708J3309k2968j2321J2921k106J776J1995
$$ 19290 14917 29484 31470 21643 5186 15894 29203 6235 -6086 6835 4729 6505 18500
7883A8500J1651k393l159N582j192k201p139Q332j8746j0740J9875J4383r315
$$ 18500 30151 27758 24599 30181 28989 26788 19649 27981 9235 -1505 18370 32753 23438
7870B3438j2643Q464K249q299k342k889P956Q000P030J8046l966j2963j7340J0467
$$ 23438 10795 19259 21508 13209 10867 7978 15934 23934 30964 49010 45044 32081 14741 25208
7856B5208q369j705o546R705l393P292r71l416R05M128L516Q9l96n445n182J892
$$ 25208 16839 15134 8588 18293 14900 22192 21221 17805 18710 22838 26354 26443 26047 20602 15420 17312
7840A7312M548O963p307j2066L621k156R310l426q687k474j4195J3073J5410J2315
$$ 17312 21860 28823 21516 9450 13071 10915 20225 16799 8112 5638 -8557 4516 19926 32241
7826C2241J535O867n870j7051j0350P622J029j180n165L467L06r444O611J0713
$$ 32241 33776 40643 34773 17722 7372 14994 16023 14843 9678 13145 13451 4007 10618 21331
7812B1331P357J134n371j5027O671J3986J5631R196p755j7862j566m832R580N195
$$ 21331 28688 29822 24451 9424 16095 30081 45712 54908 47153 29291 27725 22893 32473 37668
7798C7668j7867j9640o169M244N677P300K552O039k085M922m301M310m413p544
$$ 37668 19801 161 -6008 -1764 3913 11213 13765 19804 17719 22641 18340 22650 18237 10693
7784A0693k0167k202Q361J3846J753l942M317k768m787M144M450r31O896J4846
$$ 10693 -9474 -11676 -3315 10531 12284 8342 12659 9891 5104 9248 13698 12767 19663 34509
7770C4509j087k4002P585J8107m299j1230L875n187k3305K622J4086p963L641
$$ 34509 33422 9420 17005 35112 30813 19583 23458 18271 -5034 -2412 11674 3711 7352
7757G352N477j6926O883Q603r806j7213k329R049R726Q073k3392l629P248J9402
$$ 7352 12829 -4097 2786 11389 1583 -15630 -17959 -8910 816 8889 -14503 -18132 -10884 8518
7743H518J1192L534o520R81L776O408j1729k1063j3408J7837N577K009K893l97
$$ 8518 19710 23244 16724 17705 21481 27889 16160 -4903 -18311 -474 5103 7112 10005 9608
7729I608n51M337q886Q36J3687p693j2665N308K181K014o740n701N168j8116J1295
$$ 9608 9057 13394 4508 5344 19031 11338 -1327 3981 6162 8176 1436 -4265 903 -17213 -5918
7714e918J4321J7823J86M722n00p097k391K490l551j0371j5053j481M171K806
$$ -5918 8403 26226 26412 31134 30634 23537 21146 23636 20085 9714 -5339 -6820 -2649 157
7700A57J3516N586k442j1946q522J0017L424N30k88O574j0466j8810J2765J2227
$$ 157 13673 19259 16817 4871 -3651 6366 9790 10320 10032 16606 6140 -12670 95 12322
7686A2322N648L121j4610j1748O423O909j664N39P632p115M134Q581j0428j868
$$ 12322 17970 21091 6481 -5267 1156 8065 6401 6940 14572 7457 11591 20172 9744 7876
7672G876J0704r376j7610Q691Q427J0814R26p086k063k128o082q03L689Q976j5194
$$ 7876 18580 9204 -8406 285 8712 19526 20452 13366 11303 9175 3093 2290 5979 14955 -239
7657b39p641L256M256n105n492L434Q857R942J636r282j5035N171k157P97R749
$$ -239 -7880 -4624 -368 -5473 -10965 -7531 1326 11268 12904 3622 -11413 -6242 -8399 -7602 2147
7642B147o797p293o730p529J571J2339K1114L873N63R226j5671n712J739j0951
$$ 2147 -4650 -11943 -18673 -26202 -24631 -12292 8822 12695 13258 22484 6813 1101 2840 -8111
7628h111J538O479P528j0194n893J8707o669Q68Q564M7j241k684q017j7821J451
$$ -8111 -6573 -94 7434 -2760 -8653 10054 3385 4253 12817 12864 11623 8939 922 -16899 -15448
7613a5448J48o170m311P395L126M404P265R093R771O690m963j9814m224P922J318
$$ -15448 -15300 -21470 -25781 -18386 -15260 -10856 -3591 5502 15273 21963 17000 -2814 -7038 884 2202
7598B202n653N88L334J7382k604Q92K348P818Q165N057l258j0447q918K557J258
$$ 2202 -3451 -2863 471 17853 15249 16141 18489 26307 34472 39529 36271 25824 16906 19463 20721
7583B0721p312j5324L50Q617M41j7014R145p891J3401O325K332Q84j425r01n05
$$ 20721 13409 -1915 -1565 7052 7493 -9521 -376 -8267 5134 11459 13791 14675 13250 12349 11844
7568A1844N325Q773j4790j6318q808j4422J5768J2875j098N602p956k489P149
$$ 11844 17169 25942 11152 -5166 -13974 -28396 -12628 247 -851 4751 -3205 -5694 1455
7555A455M855k060Q315p61j5868l148J0215P685l550L17p298N586J5615Q42Q469
$$ 1455 6310 4250 12565 11804 -4064 -7212 3003 10688 7138 7455 157 5743 21358 22200 30669
7540C0669j1841r077k224r349P908J4230o88M47j001J106Q328j6925p298l436
$$ 30669 18828 9751 7527 -1822 6086 20316 19628 20075 19074 20180 28508 11583 4285 849
7526H49M026n987k0299l693K0838K0400q15R4O847j3005O02O421n932q859m636
$$ 849 4875 -1112 -21411 -25104 -4266 16134 15319 15413 22260 9255 9857 16278 10346 1487 -3149
7511c149P821K727J245p351N355j139L681J1921O919M393m159j0192p979O021
$$ -3149 4672 7399 8644 1293 6648 5509 9190 21111 28030 32423 28264 18072 10093 16114
7497A6114J3960j4755j2179J0619J60R96qN333J2306p019j3006j2940k271q476
$$ 16114 30074 15319 3140 13759 13919 14915 14907 20240 32546 25527 12521 -419 -2690 -11166
7483a1166o607P136J2990J1132k239r020k806O194P16j254J1230R909p717r423
$$ -11166 -17773 -10637 2353 13485 11246 2226 -580 5614 6330 5076 16306 26215 18498 9075
7469I075K910k899K523K329j1522M073M600O84j031n271P38n702M605j2706K446
$$ 9075 11985 9086 11609 13938 2416 6489 11089 11773 10742 5471 6209 507 5112 -7594 -5148
7454e148J71k183M067J2536P643r303L152q155O34k692l887O063P609K138j642
$$ -5148 -4977 -7160 -3093 9443 17086 7783 10935 2780 3414 722 -3165 2898 10507 12645 11003
7439A1003O273j1829m904m832J727r233q315l304P6J4916L669J029O064N004j444
$$ 11003 17276 5447 543 -4289 -2562 -11795 -20110 -23414 -23338 -8422 -4753 -3724 2340 7344 5900
7424E900j5114j2006N294l165J1165O598p590M409Q944K786r898M447J0548P6
$$ 5900 -9214 -21220 -15926 -19091 -7926 -1328 -8918 -4509 4435 7221 -2677 1770 12318 12394
7410A2394l356r679j2988M194J945q62K586O549L97J256l304P377P589J677Q333
$$ 12394 9038 -641 -13629 -9435 -7490 -8352 -5766 783 1180 2436 -868 6509 14098 15775 24108
7395B4108o911Q80l765j1639j2476O57J1118j066j002J632O776R582j018q241
$$ 24108 17197 18077 14312 2673 -9803 -9146 1972 906 -96 1536 8312 17894 16876 8635
7381H635r481R047J5727r403k8933M475L060P214J771k509j916M073J4322l679
$$ 8635 -846 8201 23928 14525 -14408 -9933 -6873 341 2112 -397 -2313 1760 16082 12403
7367A2403q504K171n656m645J742M444k153q296n199K159j546K280J9127J2232
$$ 12403 3899 6070 414 -4231 -2489 1955 -198 -8494 -13693 -11534 -13080 -10800 8327 20559
7353B0559j3829j7744k120J3223R666Q730q92N66l528q236n185L581O837l224
$$ 20559 6730 -11014 -13134 89 9755 18485 17593 18159 14631 6395 1210 4791 11628 8404
7339H404j2986k422Q630N310k231P608L923N933l875K256K005j467L068J701j1964
$$ 8404 -4582 -7004 1626 6936 4705 12313 16236 22169 18294 20550 22555 21088 24156 25857 13893
7324A3893k1982P301Q744q713j2439Q070L834M899o233M396M725j3425q21J563
$$ 13893 -8089 -788 7956 -757 -13196 -5126 -1292 3607 -2626 1770 6495 -6930 -7751 -6188
7310f188M828O700P797J526P629j1796j6409n545K13J413K068q996k693J7419
$$ -6188 -1360 5340 13137 14663 22292 10496 -5913 -11458 -11245 -9832 -7764 -16760 -19453 -2034
7296b034m983M975M286P645j0350l007L355l070k388L51J1599q417p63J6622Q567
$$ -2034 -7017 -2042 2244 9889 -461 -3468 -113 -3183 -5571 -5220 6379 -2038 -2801 13821 22388
7281B2388j1174j4181p218n19m63L148L804M801R067Q229l851j444p156R031M5
$$ 22388 11214 -2967 -10185 -10704 -11167 -8019 -4215 586 9653 17882 14031 12587 5431 14462 14507
7266A4507j330n192p231N903m835j751n077m946Q353P343K425q686l421o186J5117
$$ 14507 13177 7985 754 6657 1822 71 -5006 -9952 -1599 5744 8169 -517 -3938 -10124 4993
7251D993J8539j670q910p7O713j1047j0054l921k967N515n115o88M898j198M030
$$ 4993 23532 21862 12952 12875 19588 8541 -1513 -5434 -8401 -2886 -8001 -8689 -3791 -4989 -959
7236i59k066j623P33n888n789J654q069J873J4730Q054p52J407L19J22j3816K733
$$ -959 -3025 -4648 -3915 -9803 -15592 -13938 -22007 -20134 -5404 2650 1898 3305 3624 3746 -10070 -7337
7220g337J4429M209m170j6041r298J979L445K129L336J2087J9341n881P583N560
$$ -7337 7092 11301 7131 -8910 -18208 -16229 -12784 -10655 -7319 4768 24109 18228 25811 31371
7206C1371j718j0287M900o56j023P691j2249p352q524J3371J3933k587j4254j1364
$$ 31371 29653 19366 24266 23610 22587 30278 18029 10677 2153 15524 29457 26870 12616 1252
7192A252K086n96j0554m174K2257J1417j4009q196L729j817P200o998l454J3828
$$ 1252 3338 2742 -7812 -11986 10271 21688 7679 -517 3212 1395 8595 1597 -1857 11971
7178A1971K1889k00r512j5250k3507Q88N723j266P244K796J939j288k656O075
$$ 11971 33860 33660 24148 8898 -14609 -13721 -7998 -9264 -2020 776 2715 1427 -1229 4846
7164D846L541J0952J062j4229o677O166J0265R584n52j1426M610N2j2850j296
$$ 4846 8387 19339 20401 6172 -505 5661 15926 25510 24958 13532 18142 18194 5344 4048
7150D048j2159J74J3976l340K571J970r808j2109J1011k851k398k860J858P45
$$ 4048 -8111 -7937 6039 2699 5270 7240 -2568 -14677 -3666 -6517 -8915 -11775 -9917 -9172
7136i172l083j2525N909J6694O964o447k977j0164m16R108L564J909m702R256
$$ -9172 -12255 -24780 -18871 -2177 4787 -1660 -4637 -14801 -15217 -6109 -2545 -636 -5338 3918
7122C918P803m139r972o175K207J17K513N353R65J813n858Q216O2j3169q345K846
$$ 3918 11721 7582 -2390 -8565 -6358 -6241 -3728 1625 2590 4403 -1455 6761 6823 -6346 -14691 -11845
7106a1845J1288N386J4137P103p393k930j2766k0181j0558P191L788J5991k148
$$ -11845 -557 4829 18966 26069 18676 15746 2980 -17201 -27759 -20568 -16780 -789 -2937
7093b937k090j2837j074J497M023J2038M624L906j157k30L843K357q38L445P97
$$ -2937 -5027 -17864 -18938 -17441 -13418 -1380 3244 7150 5993 5763 9606 11963 11125 14570 15367
7078A5367k622n543L057k01j6318j3244Q710j6775k8J3216J2154m220L53K0145
$$ 15367 12745 7202 10259 10058 -6260 -19504 -10794 -27569 -27597 -14381 -2227 -6447 -6094 14051
7064A4051M566p53o875j684m271j1495o202M951r49J556J6300O568M333R688j0697
$$ 14051 18617 17864 10989 9305 5034 -6461 -12663 -7712 -8661 -7105 9195 15763 20096 29784 19087
7049A9087r659j1364l570J1718o266q470P97O924J4965J0159J1371M039k4146
$$ 19087 9428 -1936 -5506 6212 -54 -8524 -7727 -803 14162 24321 35692 39731 15585
7036A5585j0663m921P081J534R248j413k0289l683J6527o516j0752J15J9397O783
$$ 15585 4922 1 7082 8616 17864 16451 -3838 -7521 9006 2490 -8262 -8147 11250 18033
7022A8033M547P76O318j130m257k430K607K195r372j8124j5826m010J7703R107
$$ 18033 22580 23356 29674 28544 24287 21857 24464 26659 17287 -837 -16663 -20673 -2970 6137
7008F137p900q276n029Q099k899n911O905J5255j686r217j337j1857r850M0J3002
$$ 6137 -1763 -10039 -15068 -6969 -9868 -15779 -8874 6381 4695 -4522 -5859 -17716 -27566 -27526 -14524
6993a4524N870K981O303K956J2049J112p264m358r846j0432q261m619J3684J3426
$$ -14524 -8654 -5673 630 3586 15635 16747 9483 5125 -4721 -15153 -23414 -28033 -14349 -923
6979i23J3255m900r079K390O209l131j1588j5576J2307L965j116m222N97J7254
$$ -923 12332 7432 -1647 743 6952 3821 -7767 -23343 -11036 -7071 -8187 -12409 -11812 5442
6965E442j248r023L973j3471p918j1606L258J7465L889O656R115l43j5413n627
$$ 5442 4194 -4829 -856 -14327 -22245 -33851 -30593 -13128 -9239 -2583 6532 6189 -9224 -14851
6951a4851R42J158O255q376P720J1498m704m619J180m193j363m403J250N74J749
$$ -14851 -13909 -12751 -6496 -14872 -7152 4346 -358 -4977 -3797 -7990 -9353 -13756 -12506 -11932 -10183
6936a0183O194J0322j0272o164Q516L195j784N641k074J762j1925j6136J4810
$$ -10183 -3989 6333 -3939 -10103 -1587 1608 -176 5465 3391 5153 -6772 -22908 -8098
6923h098J4306N83K136J1249J0206r892j3914K119N062k317j1730J623J6748K761
$$ -8098 6208 6791 8927 20176 30382 20490 6576 8695 13757 11440 -290 1333 18081 20842
6909B0842j8853M739O266m799r758j0783J2336j406m594j658J929K1840N45j1361
$$ 20842 1989 6728 12994 8195 -1563 -12346 -10 -1416 -6010 -7668 -5739 16101 16646 5285
6895E285l552M574M907N266j2962r938P380J2434l419n628P22L736j1264p762
$$ 5285 1733 6307 11214 16480 3518 -6420 960 13394 9975 4347 5069 8805 -2459 -10221
6881a0221N019J3394J3205j0696j625j908r956m425j646j1174q329O931Q926M965
$$ -10221 -5202 8192 21397 10701 9076 7168 -2788 -7213 -8859 -20033 -28362 -21431 -12505 -7540
6867g540O081j1839m200J3748J0272k088J1168m65j2414k640J663k811K012R473
$$ -7540 -1459 -13298 -17498 -3750 6522 4434 15602 15137 2723 83 1746 -1065 947 10420
6853A0420N151n630r171r761m541J3373P302m868k239k528K829M214o569l545
$$ 10420 15571 9941 770 -8991 -13532 -159 7143 2275 36 -2492 337 4551 -2018 -5563
6839e563L190l439n615q20Q903m399j2223M302P654K460R52K0244p520j4563k337
$$ -5563 -2373 -5812 -11427 -12247 -3344 -7743 -19966 -15664 -8010 -5550 -4598 15646 8126 -6437 -8774
6824h774J4297O076N498p483q2o07m019o058q669k019K88P600j898N91M168Q752
$$ -8774 5523 11599 17097 9614 9532 8925 4906 -1152 -9821 -11840 -11552 -3952 -5850 -5259 -1091 7661
6808G661k917L133n388L206R902K71j5243j1767k046O324K2318P15L93k4682J0028
$$ 7661 4744 7877 2489 5695 15597 15868 625 -11142 -13188 -6864 15454 16169 16562 -8120 1908
6793A908J0730J0455j643j7627m070l013p390Q370n287Q757Q124r780k950K660
$$ 1908 12638 23093 21450 3823 -247 -3260 -10650 -2280 -7567 1190 9314 -466 -3416 -756
6779g56J2733J719k4109M362Q339K52n414j8899l924J7956k895q143l907J1569
$$ -756 11977 13696 -10413 -6051 2288 2540 -2874 -21773 -25697 -7741 -10636 -18779 -22686 -11117
6765a1117J4173P555k561J845L327q538j8789q33O061P239r31J5156R321p888
$$ -11117 3056 10611 8050 9895 13222 4684 -14105 -14938 -8877 -1638 -2569 12587 21908 14020
6751A4020L072o253k466o466M479j449q9k3327k199J0478L148R398p850K012J5959
$$ 14020 17092 10839 8373 1907 6386 4937 4848 -18479 -20678 -10200 -7052 2346 -5504 -3492 12467
6736A2467J0922n533j3321M215J0970n814q641J13K90n947j1630L816J2096Q573
$$ 12467 23389 17856 4535 8750 19720 13906 5265 5378 5668 -279 -11909 -8093 4003 12576
6722A2576j3461J24k409L149j1133K624J4694M323j176n32M144R231q260l499
$$ 12576 -885 -761 -3170 -21 -11154 -8530 6164 10487 9311 8779 12923 22154 13894 10395
6708A0395l451j461Q240r666r608n378J1706J0903M199p010l485o104n018K561
$$ 10395 6944 5483 13723 4057 -5551 -10929 777 11680 15879 8869 5384 -720 -5738 -3177
6694c177q809l910J3050J0892K219K092N250o679m213P904K973l308m158q97p631
$$ -3177 -11986 -15896 -2846 8046 10265 12357 17607 10928 6715 14619 17592 14284 10126 9229 1598
6679A598o129P046J0685O933j6916j7028J770N836J2925j897J888r113m468M681
$$ 1598 -4531 2515 13200 20133 3217 -13811 -12041 -6205 6720 4823 6711 -2402 -6870 -2189
6665b189M938M293m230r737p488P949J3115o5m951o167O871o714m456j703R932
$$ -2189 2749 7042 2812 -6925 -14413 -6464 6651 6586 1635 -4532 2339 -4375 -8831 -10534 -602
6650f02J998l574M775L318L013o707J56k029K160K735n806K1K150J410Q176J677
$$ -602 1396 -2178 2597 5915 8928 2221 2377 348 2508 5243 -563 -542 1608 3018 11194 12871
6634A2871N5N436n037q317j2311Q042n985O328J1896k586O618r271K305k446q467
$$ 12871 12926 18362 13325 5008 -7303 739 -5246 1082 12978 10392 17010 7739 10044 7598 -869
6619h69N563K548J3697j95P787Q766j4408j3743r179m751m197Q96N021L390J688
$$ -869 4694 7242 20939 20744 28531 37297 22889 9146 -33 -4784 -8981 -8085 -3064 326 2014
6604B014R871J3859l742l073m363O341j3282p395l8N617P299J998n874r253J2586
$$ 2014 11885 25744 22002 18929 14566 20907 7625 230 192 5809 13108 15106 9232 -21 12565
6589A2565N643j1103j1783J0328q16L246J3984J2822N35o670o238m161q056m997
$$ 12565 18208 7105 -4678 5650 4834 8080 22064 34886 35421 28751 22513 18352 10296 5299
6575E299m920M804L300J211n14j4069P314l339k678O177k633O528k554k201m439
$$ 5299 379 5183 8483 9694 9180 -4889 2425 -914 -3592 2585 -48 6480 3926 1725 -2714
6560b714j4932J6146P006j016m03l774R43k798O380J4025J082j3944m430n489
$$ -2714 -17646 -1500 5506 4490 4087 313 1256 -1542 4838 18863 19945 6001 1571 -3918
6546c918J88M204j745J5723M85o857n175r140k769j8795p469Q529J3650P866k438
$$ -3918 -3730 474 -1271 14452 14937 8080 2905 -6235 -9004 -27799 -35268 -26739 -13089 -5223 -7661
6531g661j306J0876J3209n645n141o987N756r056M124J634n600L608J2483p442
$$ -7661 -8967 1909 15118 9473 4332 -2655 3101 -5955 -1831 -197 -5797 -2189 10294 2852
6517B852q481n747K790J6604Q617r886j387j3382q757n33L132j387K4343o851
$$ 2852 -5629 -11376 -8586 8018 16635 6749 5362 -8020 -16777 -17310 -14178 -15565 8778 1927
6503A927J269Q20j3390p267j2390R32J414M408r08m966J3458J0755J907M654K226
$$ 1927 3196 4016 -9374 -16641 -29031 -28099 -26685 -22277 -23185 -28151 -14693 -3938 -2031 2623 4849
6488D849K789n910Q579M249J5503K322l716j138j1688m142P648r878j2472n828
$$ 4849 7638 1728 10307 14556 30059 32381 28665 27527 15839 11697 19345 9467 -3005 -8833
6474h833K722q62j220r411M517K391O819j0010j819J853O260j972O808N993q00
$$ -8833 -6111 -6973 -8193 -17604 -13087 -10696 -3877 -13887 -15706 -13853 -7593 -9565 -2757 3236 2436
6459B436o28L428o258j1082o3q146J2767L575P157J4149Q156J465k6196j1646
$$ 2436 1808 5236 -1022 -12104 -12167 -20313 -7546 -3971 3186 17335 25491 26956 760 -10886
6445a0886n06r410M585j496J979k999l915J759L969O659K133N798K588j4228O165
$$ -10886 -11392 -20802 -16217 -17713 -15734 -18733 -22648 -20889 -16920 -10261 -8128 -2330 258 -13970 -7805
6430g805R607j404j0754K649L654N145O467n601O986J5823m617q130p88J1472
$$ -7805 1802 398 -10356 -7707 -4053 1092 7559 1958 8944 24767 20150 12020 11232 22704
6416B2704l375q122j2553J73j0425J2638L523j3754O041j781o108L290j6772N794
$$ 22704 19329 11207 -1346 -1173 -11598 1040 4563 -9191 -3150 -4931 -11039 -7749 -24521 -18727
6402a8727J3263O163N820q432K548Q829K770J61k537q28k616j736j2143n835P546
$$ -18727 -5464 699 6519 -1913 635 9464 12234 12395 9858 9030 6414 4678 -7465 -13300 -5754
6387e754n689J2537J0678l872n022j2103j0410K483m245m088R985J4628L588q237
$$ -5754 -11443 1094 11772 7900 2878 -9225 -19635 -17152 -21397 -25485 -15500 -872 2716 -5521
6373e521n387q271K069J0225K0027J1542m486j2472j3776m604N384k129L005J375
$$ -5521 -10908 -19179 -17110 -6885 13142 24684 20198 7726 -6050 -10654 -5270 -7399 -4394 -3019
6359c019j87J2001M169j179J1605m667k198o735q044n621k22l479L080n196p193
$$ -3019 -3206 8795 12964 11785 23390 18723 16525 9790 1746 -3875 -4097 -7576 -4496 -9692 -16885
6344a6885L084q00O076k891K195k409K083m876K3054K186K01J864j0626j7753
$$ -16885 -13801 -14601 -8525 -11416 -9221 -11630 -9547 -14423 8631 10817 11018 12882 2256 -15497
6330a5497k000K960R423O950k006j2049r708O989O318O245K299j7222k1465J12
$$ -15497 -17497 -14537 -5114 1836 -170 -12219 -21927 -14938 -8620 -2375 -76 -17298 -38763 -38651
6316c8651Q180J6936J6374Q094J76k350J562n208j5891j1416o25J4604L504N607
$$ -38651 -30471 -13535 2839 10933 11109 8759 10321 5113 -10778 -22194 -22819 -8215 -4711 896
6302H96O964j2287L393J4644j760j4806k433R458k031k891K109k932J82J6715
$$ 896 7860 -4427 -1034 13610 11850 -2956 -5389 4069 2038 -853 1256 -1676 -1494 15221
6288A5221R394q077L196l879j838N134O86r30J186j6888m764p031J4201O770j1658
$$ 15221 24615 16538 19734 15855 14017 19151 19837 18907 20093 3205 -1559 -8590 5611 12381 723
6273G23j7040L216O822L546l438L187n086n03K391n056k151J9471J6833M023n982
$$ 723 -16317 -13101 -6279 -2733 -6171 -2984 -8070 -8573 -6182 -11238 -13389 6082 22915 26938 20956
6258B0956r161r343j0564n882O921m768k303N476N861J5366N223k740k610J207
$$ 20956 11795 2452 -8112 -13994 -7073 -11841 -14144 -8668 -2807 12559 17782 15042 12432 13639
6244A3639p034j456q447o419J3500J7253P496j8889j7419J722J3217L559n368
$$ 13639 6605 5149 -3298 -9717 3783 21036 28532 9643 -7776 -6054 7163 10722 5354
6231E354k496J1129p701p760J2721P428P804r080j5383o203m22r47N81m979Q971
$$ 5354 2858 13987 6286 -1474 11247 18675 26479 17399 2016 -4187 -4609 -5556 -4975 -9954 -983
6216i83P841m140p800r441l415J761O378J4665L048p976J683o276j998j1J0318
$$ -983 6858 2718 -5082 -14523 -17938 -16177 -9799 4866 7914 -62 1621 -4655 -6653 -6664 3654
6201C654l826Q695J0414j2309J62q997o794O284J2864o888r424K950m841L732
$$ 3654 -172 8523 18937 6628 6790 -2207 -9001 -2717 10147 3259 -6165 -3215 -8056 -4324
6187d324Q874l073L893J949o695J558J3694j63j2531m123l40k066k017J697p249
$$ -4324 4550 1477 5370 7319 624 2182 15876 15713 3182 -941 -1281 -3347 -5364 -3667 -10916
6172a0916J3184R744p454j8027l166J876J0504p089j7449n392P021j953j1325
$$ -10916 2268 12012 4558 -13469 -16635 -14759 -4255 -11344 -28793 -34185 -27164 -29117 -40442
6159d0442k488J8715J3839R734l662l683q699r4q92N028l410M034P657j2425n236
$$ -40442 -42930 -24215 -10376 -642 -4304 -7987 -16686 -16780 -17672 -12644 -16054 -12020 -4363 -16788 -22024
6144b2024p989N117R758p875J3660O087N93k768J25R828P758l336J9264O166L233
$$ -22024 -30013 -24896 -15138 -23013 -9353 -3266 -2673 -5441 -5316 4512 12270 8934 28198 34364 37597
6129C7597j3288j2918j3264j205O723Q159Q994J365o641l541R0m680K197k562
$$ 37597 24309 11391 -1873 -3078 3645 11804 20798 22163 15522 11981 12071 7391 9588 7026
6115G026m13J6225P181j0733o502O239j4805N174n92k161m115J760l366k429j382
$$ 7026 6613 22838 30019 19286 12784 19023 4218 9392 8800 6639 2524 4284 918 -1511 -2893
6100b893P640l797J554l634L002N91j4983o880M749Q374M311J0504R31q601p288
$$ -2893 4747 950 2504 -1130 1872 2463 -12520 -19400 -14651 -6277 -1966 8538 9469 868 -6420
6085f420M609J0459O327k596m821p948j237P855P8m618n293M894o409r771l060
$$ -6420 -1811 8648 14975 12379 7558 -390 -1627 6228 6306 1688 -3605 1289 -5120 -14891 -17951
6070a7951R393Q574N315M218P392j821m352m968k071n064j0641O930J415Q754
$$ -17951 -8558 16 5331 9549 16941 15120 10768 5800 3729 -1335 -11976 -5046 -3631 5123
6056E123j0075r155J1682Q406k489J626m704j7948J408m658Q742O439o90K493
$$ 5123 -4952 -14107 -2425 5981 3492 5118 414 -17534 -16126 -20784 -12042 -5603 -6293 -3800
6042c800N705k641p119O127j324r272J669J304K966P154r5J461j942K518J3996
$$ -3800 1905 -736 -7855 -1728 -3052 -12324 -10655 -9351 -6385 769 674 2135 193 2711 16707
6027A6707j2192j2610O306j414J931J833r147q776K237K3126Q323N843K766j1118
$$ 16707 4515 -8095 -1789 -3203 -1272 561 -8586 -17362 -15125 8001 16324 22167 24933 13815
6013A3815j4579k713k935o237P987P704J5333q173k87p911k975j1540L314J3712
$$ 13815 -764 -3477 -6412 -12649 -4662 3042 18375 10202 9915 2004 -971 -12511 -9197 4515
5999D515J0597r347j2430K296j50j588o753l643j46m265L705O673p69P030j2635
$$ 4515 15112 5765 -6665 -4369 -4519 -6107 -12860 -16503 -16649 -20914 -17209 -10536 -11305 -4275 -16910
5984a6910j407J6837L080m425J3111J6613r741j0696k37n470J5L306N258r779
$$ -16910 -18317 -1480 1600 -2825 10286 26899 17158 6462 6225 755 770 4076 9334 -445
5970d45o895p61j1091P97P476J4565p60o455P890L713N512R35J484K435j0144
$$ -445 -7340 -8101 -19192 -18395 -10919 3646 2886 -3569 4321 8034 13546 14481 15965 18400 8256
5955H256j6594j5628J1205J1982j2181j5276Q473J2686N489j3889r305o096P688
$$ 8256 -8338 -23966 -12761 -779 -12960 -28236 -19763 -7077 -1588 -15477 -24782 -30878 -23190
5942b3190O171K51J412O204P382N151p310j0956R571k145j5625j990J5955r94
$$ -23190 -17019 -16768 -15356 -9152 -1770 3381 -3929 -14885 -5314 -7459 -23084 -25074 -9119 -10113
5928a0113n498p802N231K290m138K657m718j1979j3884j839J2847J3949K1550
$$ -10113 -15611 -23413 -18182 -15892 -20030 -17373 -22091 -34070 -47954 -49793 -36946 -22997 -1447
5915a447R650k719M501l721n599n345j2371m39Q31J3330J2055K317r148m217p687
$$ -1447 8203 5484 9985 6264 665 -4680 -17051 -17490 -16659 -3329 8726 11043 1895 -2322 -10009
5900a0009K361J1444M614r295j2322j1390l294J6791J2072j590M159L171m878
$$ -10009 -7648 3796 8410 -885 -13207 -24597 -27891 -11100 972 -618 3541 6712 1834
5887A834l938J0041N956o625n313L277m182m267O278P92q503p24L858o946K642
$$ 1834 -2104 7937 13893 7268 1955 5232 1050 -3217 3061 3853 -4650 -5374 -1516 -8462 -5820
5872e820j750O417N332n49Q785l6p566q693P511L065q798J291L864j0560n722
$$ -5820 -7570 -1153 4179 3630 12415 12379 4813 -3880 3631 6696 -2102 -811 3053 -7507 -13229
5857a3229J0019l237j752R039J7664n243M080k608l221J8382M511n103o90k635
$$ -13229 -3210 -6447 -8199 840 18504 13261 17341 14733 11512 29894 34405 29302 28612 25977
5843B5977j4915j2909o729M590j783o172q839J0463k468l892j431K350O695n037
$$ 25977 11062 -1847 -8576 -3986 -5769 -11941 -20780 -10317 -12785 -16677 -18108 -15758 -9063 -14100
5829a4100q441K841k500J0177m52q785p285J4215n556k090P655J2481N924m640
$$ -14100 -22541 -19700 -22200 -12023 -12475 -21260 -28545 -14330 -19886 -21976 -14321 -1840 4084 -556
5815e56n479Q288M794l938J0876n108r222M546L842K659P181q574j1215r810j3155
$$ -556 -6035 2253 7047 3109 13985 8877 -345 4201 8043 10702 17883 9309 -1906 -11716 -24871
5800b4871J3803J7091r417j0816M707K076J4233Q0j5190k2933m356j891M017N742
$$ -24871 -11068 6023 -3394 -14210 -9503 -7427 6806 6886 -8304 -31237 -35593 -37484 -33467 -27725
5786b7725j556M384J5344j199M553L158j2999p707Q635k352J483J4718K976q280
$$ -27725 -29281 -24897 -9553 -10752 -6199 -3041 -16040 -23747 -15112 -17464 -15981 -1263 1713 -6567
5772f567L089l282J70K1015J1908j3451j8753L604K252Q041k635N216j106r79
$$ -6567 -3478 -6760 -6590 14425 26333 12882 -5871 -2267 -15 8026 5391 10607 9501 8522
5758H522N838K363j8270j3110l161J5098J5642P632N864j2719l436K211k179j5642
$$ 8522 14360 16723 -1547 -14657 -17818 -2720 12922 20554 26418 13699 10263 12474 10295 -5347
5744e347P160J0951l430P319Q344r909j1523P94J3751q477o869L821p452q168
$$ -5347 1813 12764 9334 16653 24997 15088 3565 4359 18110 9633 2764 6585 -867 -9035
5730i035j0088k802M785M48r460O465J3652Q265M174M694m659j5187J3419J2718
$$ -9035 -19123 -21925 -17140 -16692 -26152 -19687 -6035 2230 6404 11098 6439 -8748 4671 17389
5716A7389P803j1178r755J398k249n80j0423j213q588J0178P241q816j2661m148
$$ 17389 25192 14014 4259 5657 3408 2828 -7595 -8808 -17396 -7218 23 -8793 -21454 -25602
5702b5602P196J1976p438r674M385q057n809P053M941L574J0760R142J2554k066
$$ -25602 -18406 -6430 -13868 -23542 -19157 -27214 -33023 -25970 -21029 -17455 -6695 2447 15001 12935
5688A2935k600j493j4179j2353L784o578K677l351K165l062n224o7J0245j678
$$ 12935 10335 8842 -5337 -17690 -13906 -20484 -17807 -21158 -18993 -22055 -27279 -27346 -17101 -18779
5674a8779r333q563J0380P221J751N502Q549J2340K503J3591j1244j1034j0744
$$ -18779 -28112 -36675 -26295 -19074 -17323 -11821 -3272 9068 11571 25162 13918 2884 -7860
5661g860j17J3350l823j867K2382N583p420k438Q446q759p383q524K465R772k959
$$ -7860 -7977 5373 1550 -317 22065 27648 20228 17790 26236 17477 10094 1570 4035 13807 10848
5646A0848j0821q135k260n01P731J0398L837l348K707J753J284r495p422l515
$$ 10848 27 -8108 -10368 -10869 -3138 7260 11097 7749 10456 12209 13493 3998 -3424 -6939
5632f939P867O3k534J0778l144j1946j537q628k672K748J0825J6857R063J5133
$$ -6939 928 991 -1543 9235 6091 -5855 -7392 -16020 -18692 -15944 -5119 11738 20801 35934
5618C5934l319r738j6467q310n431J6408J589N74m967q840q965O91j1555Q820
$$ 35934 32615 22877 6410 -1900 -7331 9077 10666 11240 6273 -2567 -11532 -10841 -22396 -13576
5604a3576K688R50N445m463r14j7954j731J9333J8206J718j1745o96N97L29L909
$$ -13576 -10888 -9938 -4493 -8956 -9870 -27824 -29555 -10222 7984 9702 -2043 -2739 -2142 -1813 2096
5589B096m752N830K4544J0410j2619j0771N370O577j1842j6203j7765n50N519
$$ 2096 -2656 3174 27718 38128 25509 14738 20108 26685 14843 -1360 -19125 -19675 -14156
5576a4156p060j5698J3897J8604L655P565o21j1045j3827J487J3282J896K872
$$ -14156 -21216 -36914 -23017 -4413 -758 6807 6186 -4859 -18686 -17199 -3917 -2021 851
5563H51j914K068k278k126r36K674L392J1153p603k869J907j4497j5541P737N98
$$ 851 -1063 1005 -1273 -3399 -4335 -1661 1731 12884 5281 2412 4319 -10178 -25719 -17982 -17384
5548a7384R414j2504k809p681M793j826k448Q576j0347J3105J1937J89j3708k779
$$ -17384 -7970 -20474 -23283 -30964 -26171 -27997 -30445 -21869 -32216 -19111 -7174 -6985 -20693 -23472
5534b3472n721O707J3311j672P669Q832m754l877q94m098Q412Q415p68l950l0
$$ -23472 -29193 -22486 -9175 -10847 -3178 5654 900 -2977 -3871 -7969 443 8858 8090 4140 4110
5519D110M89k725R991K222M98j5623m548j0735q84K368J441l817n755J3392M724
$$ 4110 4599 1874 11865 14087 14585 -1038 -5586 -16321 -17205 -14837 -13396 -17213 -22968 -9576 -4852
5504d852j0859M477N194J506o530p539K557n994J358P132J0399K1983O512l977
$$ -4852 -15711 -11234 -6040 -4534 -11064 -18603 -16046 -22040 -20682 -13550 -3151 18832 25344 21367
5490B1367j3217r818l519j726K848L798K686J4172J2683m958r184r543r853o440
$$ 21367 8150 -1668 -5187 -6913 -4065 -267 2419 16591 29274 24316 15132 5589 -4264 -10704
5476a0704k820N528J4180j785j3080O254J6868O330j5314j0584L743M970M238
$$ -10704 -13524 -7996 6184 4399 -8681 -2427 14441 20771 5457 -5127 -1384 3586 7824
5463G824J523J3345J733j6988L086R029o288j5414P822P233O613j3099N509j0259
$$ 7824 9347 22692 24425 7437 10523 19552 13264 -2150 5672 12905 19518 6419 11928 1669
5449A669n141N786j2421o377R547K295o576j5192M627J5441J1414j0978k150Q901
$$ 1669 -3472 2314 -10107 -16484 -6937 -4642 -11218 -26410 -21783 -6342 5072 -5906 -8056 845
5435H45n541O900j042m184N278J1211j259q028K503o643N030M922o63r234o16
$$ 845 -4696 2204 1162 -3022 2256 13467 12208 4180 6683 40 5070 9992 9329 95 -521
5420e21M532J1149k448r91K328p826M28R721p053n790j5324j0417L507J7081k419
$$ -521 4011 15160 12712 11721 14049 6223 6651 16372 9319 3529 -11795 -22212 -18705 -1624 -4043
5405d043k756m196K341M816L530p940l44n503K41J0940M918N95r812k751K550
$$ -4043 -6799 -10995 -8654 -3838 -308 -8248 -8592 -14095 -13854 -2914 2004 2599 -7213 -9964 -7414
5390g414J706m26m567j6923R6J8498M335q769J022K435R713Q108N353M595l539
$$ -7414 -5708 -6134 -10701 -27624 -27528 -9030 -4695 -13464 -12442 -10007 -294 7814 13167 17762 14223
5375A4223j7820k0169P138P282Q169m481q789p406q73M830M938l9k940P055J552
$$ 14223 -3597 -23766 -16628 -9346 -1177 -5658 -14447 -21853 -22726 -17896 -12958 -12997 -15937 -8882 -7330
5360g330k98q710j2139K189J5800O124Q11P673j0436j4091O74J7123J7139K297
$$ -7330 -7628 -16338 -28477 -26288 -10488 -4364 -3553 4120 -6316 -20407 -19733 -2610 14529 16826
5346A6826j3915P088j563l022n042n941m781P844q251M41P889j0220M229Q82j75
$$ 16826 2911 9999 8436 5414 372 -5569 -10350 -2506 -10757 -10316 -2427 -12647 -8418 -7536 -7711
5331g711n59J5953M551m140p421p560O279P442l787K786K498j5699m265q42o553
$$ -7711 -8270 7683 12234 8094 673 -6887 -608 6834 3047 5833 8331 -7368 -11633 -12475 -19028
5316a9028r29r459M164J2520p407M632J2475l928J946M867j539j068k1477p861
$$ -19028 -19957 -29416 -25252 -12732 -20139 -15507 -3032 -6960 -5014 -147 -1686 -2754 -24231 -32092
5302c2092J3219J3843l837K352J3535q2o930k616M155j4136o617R475R029N312
$$ -32092 -18873 -5030 -8867 -6515 7020 6938 8 -2608 1547 -12589 -19206 -9731 -702 4610
5288D610J0925j650j0928J060l782J743P353r930m370O337j098N851q178j4836
$$ 4610 15535 13885 2957 4017 235 1978 9331 -599 -4969 1368 270 6121 -2057 -16893
5274a6893L586J0695Q102r808m528p883R507J1130K937J144K398j3037L657o746
$$ -16893 -13307 -2612 5490 -4318 -8846 -16729 -7222 3908 6845 7989 10387 -2650 1007 -5739
5260e739j114K2261J718j6036j2277L611M106Q605q441O809j4410j1309m543J0523
$$ -5739 -6853 15408 17126 1090 -11187 -7576 -3470 5135 -3306 3503 -10907 -22216 -26759 -16236
5246a6236j714Q769J8768j2321m776K400k1680p116L670Q968O654O736N673K232
$$ -16236 -17950 -9181 9587 -2734 -7510 -5110 -26790 -33906 -30236 -21268 -14614 -7878 -2205 27
5232B7m812k0370O370J8973p465P336O490O31q201j3281O779j339O865j0212l375
$$ 27 -4785 -25155 -18785 188 -7277 59 6549 7180 -1021 -14302 -7523 -8862 -1997 -12209 -15584
5217a5584P595L912l401L342J3881M090p668j1598j574j602J9640J1244j182r127
$$ -15584 -7989 -4077 -7478 -4136 9745 13835 6167 -5431 -7005 -8607 11033 22277 21095 11968
5203A1968q938O549N34J608j580j464L33J1509K127J124P07R25k46M01j331k0563
$$ 11968 3030 9579 10113 11721 10141 8677 9010 20519 22646 23770 24477 25402 25156 25557 24226 3663
5187C663k1479l75J7207J4025r610j695K29N180m500J180O678K951n261j6608
$$ 3663 -17816 -18191 -984 13041 3431 1736 1965 7145 2645 3825 10503 13454 8193 -8415
5173h415p062J475L693J6306L763p075n585J0876J1649j491j0297m235J718o09
$$ -8415 -15477 -14002 -10309 5997 9760 2685 -2900 7976 19625 18134 7837 3602 5320 4711
5159D711n585k320n214L02p512k0388J6649J9222N616j1112j160K34J2854J3839
$$ 4711 -874 -3194 -8408 -8106 -15618 -36006 -19357 -135 5481 -5631 -6791 -6557 6297 20136
5145B0136m568j698j811q917Q74j2207Q427k727j0152o453O105k122L206J1273
$$ 20136 15568 13870 12059 3142 4016 -8191 236 -2491 -12643 -19096 -12991 -15113 -11907 -634
5131f34N564m924n984m119P780P429n204N849n891k212L823P430j900J646n253
$$ -634 4930 6 -5978 -10097 -2317 5112 -92 5757 -134 -2346 1477 8907 7007 8653 3400
5116C400p105k235N387J1589P176K724q97N716M285J3043O190j6901q914R617
$$ 3400 -3705 -5940 -553 11036 18212 20936 20039 25755 30040 43083 49273 32372 23458 33075
5102C3075n308o286m062k852r273M771J0602l127j7107m429m753o291P453m353
$$ 33075 27767 21481 17419 14567 5294 10065 20667 17540 433 -3996 -8749 -15040 -7587 -11940
5088a1940l715N615k126J7018J3599j356j0322k422J2405j412j5486j6251Q568
$$ -11940 -15655 -10040 -12166 4852 18451 17095 6773 4351 16756 15344 -142 -16393 -7825
5075g825J5449j5091q438R556J0489m590m322k880j4993L859J6347J8562j3404
$$ -7825 7624 -7467 -15905 -6349 4140 -450 -4772 -7652 -22645 -18786 -2439 16123 2719
5062B719j3215o355j23M64J309K3086P841J183l150k130O43l799J428k1653l625
$$ 2719 -10496 -16851 -16974 -16510 -15201 7885 15726 16909 13759 11629 12272 8473 9901 -11752 -15377
5047a5377J0372J3588K475O601n046R08j9585q887N266Q306O313O977N376q735
$$ -15377 -5005 8583 11058 17659 12613 13521 -6064 -14951 -9685 -1379 4934 11911 17287 8552
5033H552K561j150n169P693N715k013M569k123J99N60K977p006L535l818j939
$$ 8552 11113 9963 4794 12487 18202 16189 20758 18635 18834 19394 22371 15365 18900 15082 13143
5018A3143l747M190J24N817j7680j3453N00j4182L915j40M178O661K0706R451
$$ 13143 9396 13586 13710 19527 1847 -11606 -11106 -25288 -21373 -21513 -17335 -10674 10032 19483
5004A9483r450p354j3173l07Q010M003j843q826m032m712n517O100J7220J5169
$$ 19483 10033 2679 -10494 -10801 -2791 1212 -631 -9457 -13489 -18201 -23718 -17618 -398 14771
4990A4771j801j0918j3923M597l019p765J58O314J903l000N04J4101l476n023
$$ 14771 12970 2052 -11871 -7274 -10293 -18058 -17900 -11586 -9683 -12683 -12179 1922 -1554 -6577
4976f577j1791p472J7863J3436M973N851k1226j949R360o502r68r27J6431M098
$$ -6577 -18368 -25840 -7977 5459 10432 16283 -4943 -6892 2468 -4034 -5002 -5929 10502 14600
4962A4600j250m775N395j5914q713m957L974N053j1566K652K456P14j147M906
$$ 14600 13350 8575 13970 -1944 -10657 -15614 -11640 -6587 -18153 -15501 -13045 -12331 -13478 -8572
4948h572j328J121o275N351m944O417P764R206j465r023l795J842j888p832J4520
$$ -8572 -9900 -8779 -15054 -9703 -14647 -8230 -466 8740 7275 -1748 -5543 -3701 -5589 -13421 1099
4933A099K3631j4995j8315o032q005l84M578O724L607L363K915m327m307j1312
$$ 1099 24730 9735 -8580 -14612 -22617 -23001 -18423 -11699 -8092 -4729 -1814 -6141 -10448 -21760
4919b1760K03J9858k058k192N61Q401j0677j7511l15P405K508Q550Q380L425o914
$$ -21760 -21557 -1699 -3757 -5949 -5388 3013 -7664 -25175 -25490 -18085 -15577 -7027 1353 4778 -2136
4904b136p245p503Q511m098N945Q768N375n661p844l220o487l967q438J0234J7263
$$ -2136 -9381 -16884 -8373 -12471 -6526 2242 7617 1956 -5888 -9108 -15595 -19562 -28000 -17766 -503
4889e03P336O111k591J832n034j2822j0492K740J5577k874p597l110O779M366
$$ -503 6833 12944 10353 12185 7151 -5671 -16163 -13423 2154 -720 -8317 -11427 -4648 -282
4875b82p083k990j758J559m1k255o648K731J4939k181N244O024m034o719J006
$$ -282 -7365 -10355 -12113 -10554 -10595 -12850 -19498 -16767 -1828 -4009 1235 7259 3225 -3494 -2488
4860b488J431J881j4j540M921k702m22l550r076R705J4925N892k0373j7377j2523
$$ -2488 -1057 824 810 -730 4191 1489 1067 -2483 -11559 -1854 13071 18963 -1410 -18787 -31310
4845c1310K4203R539O025p378j5281N79N311l177l115M759n15j224j468P146O555
$$ -31310 -7107 2432 8457 1079 -14202 -13623 -8312 -11489 -14604 -9845 -10360 -11584 -13052 -5906 649
4830F49J389k815p916J03N540j1076m686k473J4000R268O285n917l184n685o174
$$ 649 2038 -777 -8693 -8590 -3050 -14126 -18812 -21285 -7285 1983 8268 2351 -833 -6518 -12692
4815a2692o627J383M047J1394m350J8548n69j2237K899O783k907r023l808j042
$$ -12692 -19319 -17936 -13889 -2495 -6845 11703 11134 -1103 1796 8579 5672 -3351 -7159 -8201
4801h201O277J0420J0824l509j6077j1667M976O686N308L436M323q616q1n495
$$ -8201 -1924 8496 19320 15811 -266 -11933 -6957 -271 5037 8473 12796 4180 4099 -1396
4787a396L228J3013P110j429K459n616j5297K689Q306j5406r747j3121R848O71
$$ -1396 1832 14845 21955 20526 22985 17369 2072 4761 13067 -2339 -12086 -25207 -15359 -14688
4773a4688J4540J4564K49J2272o05M049j4030j0222n32k0144q37J0380K95L940
$$ -14688 -148 14416 14665 26937 26332 30381 16351 6129 5597 -14547 -15384 -5004 -4709 -769
4759g69r460Q626M040m266K185n099L980p110j2901J734M920J0107o256k128J2291
$$ -769 -10229 -1603 2437 -1829 356 -4743 -763 -7873 -20774 -19040 -14120 -4013 -10269 -12397 -106
4744a06J0342L867j0077j5112Q37J1235O147k452P206N221o452n847n602o245
$$ -106 10236 14103 4026 -11086 -10249 986 7133 4681 11887 17108 10656 4809 -793 -7038
4730g038k2580M117J0212J0470J0255m345m175o126l768k281L005J6057J8319
$$ -7038 -29618 -25501 -15289 -4819 5436 1091 -3084 -9210 -12978 -15259 -12254 3803 22122
4717B2122L874j045r185l282N495N420o147o508K385j3178p17p452K72J0292K791
$$ 22122 25996 24951 15766 12484 17979 23399 17252 10744 13129 -49 -766 -8218 -7946 2346 5137
4702E137p003J0775n12m943k014p253j0609m83J3597J2469N730P74n409r848J446
$$ 5137 -1866 8909 8397 3454 1440 -5813 -16422 -16905 -3308 9161 14891 15665 10256 408 1854
4687A854J996J6472N402j6765p469p825j3119J4945J4170r406J124M654p25q022
$$ 1854 3850 20322 25724 8959 1490 -6335 -19454 -4509 9661 255 1379 6033 5308 -2714
4673b714j085p604k816k97n502k786o43k888n036J12J3257J4647J2608O795K773
$$ -2714 -3799 -11403 -14219 -14516 -20018 -22804 -23447 -26335 -31371 -31259 -18002 -3355 9253 16048 18821
4658A8821j2040j4311k359R430n192q981l981M777J3037J118r38r197r998J991
$$ 18821 6781 -7530 -9889 -459 -5651 -14632 -18613 -13836 -799 319 -619 -9816 -19814 -17823
4644a7823N751M822p284k1791K369J8757J1980o170j0713L748N245N58n323l22
$$ -17823 -12072 -7250 -14534 -36325 -33956 -15199 -3219 -9389 -20102 -16354 -11109 -10551 -15874 -16196
4630a6196M635M411L35P879M097n155N386P156P075p747j6583k880R111R277K197
$$ -16196 -11561 -7150 -6815 1064 5161 6 5392 12548 19623 11876 -4707 -7587 1524 10801 12998
4615A2998j4584K875J4168m981k1176L611J3488N31r432j4571R786P252K591R829
$$ 12998 -1586 1289 15457 10476 -10700 -7089 6399 6930 -2502 -17073 -7287 -35 2556 12385
4601A2385J2613m60j2030o747j0418J148o045M26J6791j076j3986j0152M602m882
$$ 12385 24998 24538 12508 5761 -4657 -3509 -9554 -9128 7663 6587 -7399 -17551 -12949 -17831
4587a7831o883J612j3849o575R256K1239J2907q150n288N95m889p536O687L000
$$ -17831 -24714 -23102 -36951 -43526 -34270 -13031 -124 -8274 -13562 -12967 -17856 -25392 -18705 -15705
4573a5705N217q699Q189Q202J4033n967l090L755q56o39k731Q51M167j1382J03
$$ -15705 -10488 -19187 -10998 -2796 11237 5270 2180 5935 5079 4440 1709 2560 6727 -4655 -4552
4558d552L816J2702R104k2161J286n136j5552J5108O281n485l188l497k576O863
$$ -4552 -736 11966 21070 -1091 195 -4941 -20493 -5385 896 -4589 -7777 -11274 -13850 -6987
4544f987J6996n624j3659n395J2271K753O234P45j2125q643J4001j1238j6825
$$ -6987 10009 4385 -9274 -14669 -2398 355 6589 7334 -4791 -13434 567 -10671 -27496
4531b7496j577J0377K4353R449m077r482r629o148m435J6502J8280K357j2151
$$ -27496 -29073 -18696 5657 15106 11029 1547 -8082 -14230 -18665 -2163 16117 18474 6323
4518F323l599K785j292K802r014j430j852J2511J7215n67n251o532j3135J00l113
$$ 6323 2724 5509 4217 7019 -1995 -3425 -5277 7234 24449 23882 18631 12099 -1036 -936 -4049
4503d049j9801q305J4163J1091K554n365P987l224j2135N999J3324J9116K557
$$ -4049 -23850 -32155 -17992 -6901 -4347 -9712 -1725 -4949 -17084 -11085 2239 21355 23912
4490B3912j6027r507n614N896J892p093L044m392j3096o83J1669J8231J1853r483
$$ 23912 7885 -1622 -7236 -1340 552 -6541 -3497 -7889 -20985 -21668 -9999 8232 20085 10602
4476A0602j3432j1866L916J3090q027r282m238M254P123N242J0979j5516j1343
$$ 10602 -2830 -14696 -10780 2310 -5717 -14999 -19237 -14983 -7860 -2618 8361 -7155 -18498
4463a8498p11J6942j0296M376n324J449n897r06J4136j064p057J7964J1645l413
$$ -18498 -19209 -2267 -12563 -8187 -13511 -12062 -17959 -18865 -4729 -5793 -12850 5114 16759 13346
4449A3346N150k786r785o710P45J0914L06r287n836j7191K1260J6006n559r990
$$ 13346 18496 15710 5925 -785 -40 10874 11180 1893 -3943 -21134 126 16132 10573 583
4435E83K947K305N317J018J142j3445j2415O213N564L194j135l708m16j2631k879
$$ 583 3530 5835 11152 12170 13312 -133 -12548 -6335 -771 2423 1288 -2420 -2836 -15467 -18346
4420a8346J7780N35q499M973P974L22O867j692J2286j173q835K640m793j544l921
$$ -18346 -566 -31 -8530 -3557 4417 4739 11606 9914 22200 21027 12192 14832 10039 8495 4574
4405D574l882k621m044L954l769q543k363J0159L773L533N996k685m983m436r020
$$ 4574 692 -1929 -5973 -2019 -5788 -14331 -16694 -6535 -2762 771 6767 4082 -901 -5337 -14357
4390a4357n268P67K1581J3690j303j0983n565r120j1200k757R15J6131L045K131
$$ -14357 -19625 -18858 2723 16413 15110 4127 -1438 -10558 -21758 -24515 -23600 -7469 -4424 -2293
4376b293m485o94n860j123O285M119N041j3056n610m830J6039J0668N27J4071
$$ -2293 -6778 -7472 -13332 -14455 -8170 -4051 990 -12066 -17676 -22506 -6467 4201 4728 18799
4362A8799P072j634J718K01j4306k3968l158J2436m50q474O376P794j0069p593
$$ 18799 25871 24237 25955 26156 11850 -12118 -15276 -2840 -3290 -11764 -5388 2406 -7663 -15256
4348a5256j902R001J625l423r381n114J0639j265N831R899l586R201n792M154
$$ -15256 -17158 -8157 -6532 -9955 -19336 -24450 -13811 -15076 -9245 654 -2932 6269 477 4631
4334D631Q501j0034K682M105o848n360K842J3279l218j0666j2537P786O352J769
$$ 4631 13132 3098 5780 9885 3037 -2323 519 13798 10580 -86 -12623 -4837 1515 3284
4320C284p512j4060K817Q308R243R202p446r718m652O824k817m805J372L964P172
$$ 3284 -4228 -18288 -15471 -7163 2080 11282 3836 -5882 -10534 -3710 -6527 -11332 -9960 -5996 1176
4305A176L991Q850j807M754R24k1059p893J6099k686r610m706p01O994N111J1007
$$ 1176 5167 14017 12210 16964 17888 -3171 -11064 5035 2349 -7261 -11967 -12668 -5674 -563 10444
4290A0444N967m938p027Q417l13m352O888o530r273q131k182R235N49N245N195
$$ 10444 16411 11473 4446 12863 12550 8198 15086 8556 -717 -8848 -11030 -1795 -1246 3999 9194
4275I194p490l262k80J1345R414r666j1256O029K3570n98j7756n033R218J020
$$ 9194 1704 -1558 -1838 9507 18921 9255 -2001 4028 27598 27000 9244 4211 13429 14449
4261A4449k493r842K64j9210n469J9317K3648k1q665o019n226N590p241N273J419
$$ 14449 11956 2114 2378 -16832 -22301 -2984 20664 20643 11978 5959 733 6323 -918 4355 5774
4246E774J461j2399M747R269r061j0335M87M597N629R003j3864q408O745J0742
$$ 5774 7235 -5164 -417 8852 -209 -10544 -10057 -5460 169 9172 -4692 -13100 -6355 4387
4232D387l285l135Q080R477N005p572q871n144J2429R264M146L947m007p417k866
$$ 4387 1102 -2033 6047 15524 20529 12957 4086 -1058 11371 20635 24781 28728 24721 17304 14438
4217A4438k994p609r188n668J2874J0389N87m471j05P517P349o683j6908J0932
$$ 14438 11444 3835 -5353 -11021 1853 12242 12829 8358 8253 15770 23119 16436 -472 10460
4203A0460J4014R223p272j5308j8330p12L797J241p563r610p70J1142R725J126
$$ 10460 24474 33697 26425 11117 -7213 -7925 -4128 -2887 -10450 -20060 -20830 -9688 37 1163
4189A163J2260r86r271K87r52L16R279m549j2090j4566m204K397p60J1102J0655
$$ 1163 13423 12437 3166 3453 2501 2817 12096 7547 -4543 -19109 -23313 -20916 -21676 -10574 81
4174H1P502q01m273k837o796n345O219M583k973L133K945m40J752l889m280k34
$$ 81 7583 6782 2509 -328 -7124 -12469 -6250 -1667 -4640 -1507 1438 998 2750 -1139 -5419 -5653
4158e653p569K921j0756n562J8484J6790n361L127j446o077K235O949K656k0013
$$ -5653 -13222 -10301 -21057 -26619 -8135 8655 3294 6421 4975 -1102 1133 8082 10738 -9275
4144i275k2601J793K1113L43j1750j2900n442l787J4107K7621P873m387q877k28
$$ -9275 -31876 -30083 -8970 -8627 -20377 -33277 -38719 -42506 -28399 -778 7095 2708 -6169 -6397
4130f397N104n278R839J4315L43l057q237J5717r511j1479Q238N165L295j590
$$ -6397 -1293 -6571 3268 17583 17926 14869 6632 22349 12838 1359 9597 14762 18057 16467
4116A6467K701O587j4608j1131J7317o62p164Q215j1661j0912j2111M829J2599
$$ 16467 19168 25755 11147 16 17333 16671 9507 17722 6061 -4851 -16962 -12133 466
4103D66J260M361K623o976l749L089n095j367K769J6493n801r557r617O252K028
$$ 466 1726 6087 8710 1734 -2015 1074 -4021 -5388 -2619 13874 8073 -1484 -11101 -4849 -2821
4088b821m107j8305l748J4929J174P338O531j0939k066J3137r900j4025p561j507
$$ -2821 -6928 -25233 -28981 -14052 -12878 -5540 991 -9948 -12014 1123 -8777 -22802 -30363 -31870
4074c1870j1542O605K3539J5435M057Q147p593j6978p298J0018J4995j989j887
$$ -31870 -43412 -36807 -13268 2167 6224 14371 6778 -10200 -17498 -7480 7515 5526 3639
4061C639q107p605k092j963p09J5197J9101k737j5082L962j6592o260L836o767
$$ 3639 -4468 -12073 -14165 -16128 -16837 -1640 17461 14724 -358 3604 -12988 -19248 -15412 -22179
4047b2179K726J1349P88j508j1746l970K409J0896Q854j1346q73J4141n757j336
$$ -22179 -19453 -8104 -7316 -8824 -20570 -24540 -22131 -11235 -2381 -13727 -14600 -459 -6216 -7552
4033g552N352j1966k799N555M087j3949j892J270M781M195p645m729J2736P956
$$ -7552 -2200 -14166 -16965 -11410 -7323 -21272 -23164 -21894 -17113 -12918 -20563 -25292 -12556 -4600
4019d600O124L541J37O839j1403j1174J0536r40k89N954l684m365l704j2547l285
$$ -4600 1524 5065 5202 12041 638 -10536 0 -940 -1229 4725 1041 -3324 -7028 -19575 -22860
4004b2860J6299J41N440J645p844j5175M926J1237k060m795J6578Q425o615j204
$$ -22860 -6561 -6420 -980 665 -7179 -22354 -17428 -6191 -8251 -13046 3532 11957 5342 4138
3990D138q259j993J353k500K481N501m259J4082p222o938J1253j188J786P448
$$ 4138 -4121 -6114 -4761 -7261 -4780 721 -3538 10544 3322 -3616 7637 6449 8235 15683
3976A5683o782K748j371M417M544O01l669j5601q611m733j501J52L824N652M576
$$ 15683 8901 11649 10278 14695 19239 19840 16171 570 -8041 -12774 -14275 -14123 -10299 -4647 -71
3961g1N731j173O144J248L777q253j306j0318Q575R700J0722J140l972o811j3406
$$ -71 5660 4487 10631 11879 15656 7403 6097 -4221 4354 14054 24776 25916 21944 15133 1727
3946A727L674j5925m652J4945J8833P457m955k551j1812j5526p679O071l980j0322
$$ 1727 5401 -10524 -15176 -231 18602 26059 21104 18553 6741 -8785 -16464 -10393 -14373 -24695
3932b4695l556J4198M672R70J1080j3456p324m911q89J964J3200O262J5436M763
$$ -24695 -28251 -14053 -9381 -8411 2669 -10787 -18111 -23022 -23911 -21947 -8747 -2485 12951 17714
3918A7714q685j7751q235j562o887M107J4937M495J55P838q526P162P3p245l005
$$ 17714 9029 -8722 -16957 -18519 -25406 -21299 -6362 -1867 -1712 6126 -2400 4762 4835 -2410 -5415
3903e415R657j2641p85R143k559j0102R04K162L406m345P195K857j6541Q941O282
$$ -5415 4242 -8399 -9184 -41 -2600 -12702 -11798 -9636 -6230 -10575 -3380 -523 -17064 -8123 -1841
3888a841R080j4704j7944N018J6907J2831N625p278j1653p864l737M669M822M884
$$ -1841 7239 -7465 -25409 -20391 -3484 9347 14972 7694 -3959 -11823 -15560 -10891 -6069 -1185
3874a185m424j4039q189R259R666P83M238J0668J1669q232j6119o122K196L348
$$ -1185 -5609 -19648 -27837 -18578 -8912 -8129 -3891 6777 18446 10214 -5905 -12027 -9831 -6483
3860f483J378L997R219O405L050J4628M375l818j2248j8574K750J512j1597j2702
$$ -6483 -5105 -1108 8111 14516 17566 32194 36569 32751 20503 1929 4679 6191 -5406 -18108
3846a8108J0427J5027N585M623J1462J743j0454m394J27j3042j7868l657Q617
$$ -18108 -7681 7346 12931 17554 29016 30759 20305 15911 16038 2996 -14872 -18529 -9912
3833i912J2518M02j516o388r229m518j316O712P932m305k004P07K355j3855N24
$$ -9912 2606 3008 1492 -4896 -14125 -18643 -19959 -13247 -5315 -9620 -11624 -10917 -8562 -22417 -21893
3818b1893j94j8293R882R768K395J5322J338j3138r075J2458K489j2519Q078J0925
$$ -21893 -22087 -40380 -30498 -20730 -18335 -3013 -1675 -14813 -23888 -11430 -8941 -21460 -13382 -2457
3804b457K91m436p648l509L545J5806J1789J934j1175m531j287j2283N539J130
$$ -2457 -2166 -6602 -14250 -17759 -14214 1592 13381 15315 4140 -391 -1678 -13961 -8422 -7292
3790g292n231M302P490l37J4261l15p546P065n582N689R249L581r619j1415l957
$$ -7292 -12523 -8221 -731 -1068 13193 12878 5332 12397 6815 12504 21753 25334 15715 4300 343
3775C43Q823J191j1316j3163O545P469J735j1227J1754J0075P65J3283P027k2223
$$ 343 9166 10357 -959 -14122 -7577 -108 1627 -9600 2154 12229 12994 26277 33304 11081
3761A1081n472p236J804p405M644k284j024Q501j1278o636J2245K713j1303k401
$$ 11081 5609 -1627 177 -7228 -2584 -4868 -5892 2609 -8669 -15305 -3060 -347 -11650 -14051
3747a4051q914q558j423J4014J6225j1119O05J159O606J4770k349j7662k54Q505
$$ -14051 -22965 -31523 -32946 -18932 -2707 -13826 -13221 -12062 -5456 9314 6965 -10697 -10951 -2446
3733b446L287j182K377K152N088j2717P841N486J315l533n128k414m400m410j021
$$ -2446 841 -341 2036 4188 9276 -3441 4400 9886 11201 7668 2540 126 -4274 -8684 -9705
3718i705K847K379K137J842o083l030k922o292K92k073J1111J435P344P349q006
$$ -9705 -6858 -4479 -2342 -500 -6583 -9613 -12535 -18827 -18535 -20608 -9497 -8062 -718 6631 -1375
3703a375L36o71j2327q188O354N37K787N067L002l685K998k310o74m224m450P483
$$ -1375 -1039 -1710 -14037 -22225 -15871 -15334 -12547 -7480 -4478 -8163 -5165 -7475 -8149 -12373 -16823 -9340
3687i340K315J1453j0570p124o885K193j1862q409n150J401O675R338J1613K359
$$ -9340 -7025 4428 -6142 -13266 -20151 -17958 -29820 -38229 -43379 -41978 -35303 -25965 -14352 -11993
3673a1993N118o49n388J7316J0949l451k9229j2024J4026J6233k571j2075m029
$$ -11993 -6875 -7524 -12912 4404 15353 11902 -17327 -29351 -15325 908 -1663 -13738 -17767
3660a7767k033r79M632N576m258m546O641Q550J7395j885Q821j701j1230k209
$$ -17767 -19800 -20779 -16147 -10571 -14829 -19375 -12734 -4184 13211 11326 20147 18446 7216 5007
3646E007J5875J924n952O426j215j2469q440K793N250L855M960M999j997N792
$$ 5007 20882 22806 16854 23280 22065 9596 1156 3949 9199 13054 18014 23013 21016 26808
3632B6808p134j1886l520r400j0952L004K4534J8979j6934j3025k0906k787J6315
$$ 26808 19674 7788 4268 -5132 -16084 -13080 11454 30433 13499 474 -20432 -23219 -6904
3619f904J2097j4078M334J372k021r85q983J3094Q256K807j5404p861N900N02
$$ -6904 5193 -8885 -4551 -3179 -5200 -6185 -15168 -2074 6182 8989 -6415 -14276 -8376 -7874
3605g874P642J2501O993q232o675j3889L79J1968Q323o318r376j3793R988Q986
$$ -7874 -232 12269 19262 11030 4355 -9534 -9155 2813 11136 4818 -4558 -18351 -8363 623
3591F23l653J9617k742j1448m499j0575M343L42Q87N698j204L746j1409k026m931
$$ 623 -3030 16587 13845 2397 -2102 -12677 -8334 -7992 -7105 -1407 -2611 1135 -10274 -12300 -17231
3576a7231J479N932J0150Q90k533L656p75o912l183N65p295R459J3196N101j260
$$ -17231 -15752 -9820 330 1220 -1313 2343 1568 -5344 -8527 -7962 -15257 -5798 7398 12499 11239
3561A1239n926j3551N038M766m938o432N037n54o332l93j810R52R201R828l456
$$ 11239 5313 -8238 -3200 1566 -3372 -9804 -4767 -5321 -11653 -12046 -13856 -12904 -3703 6125 2669
3546B669n944j1701K084n109j0957L302p882P150J7034J2194J963j2506j5720
$$ 2669 -3275 -14976 -12892 -18001 -28958 -25656 -33538 -26388 -9354 2840 4803 -7703 -23423
3533b3423M86j341K798J5448K296o718q192r687J4221q25N238Q860J911j347J3094
$$ -23423 -22937 -24278 -21480 -6032 -3736 -10454 -18646 -28333 -14112 -14937 -9699 -839 1072 -275 12819
3518A2819l223R3N14m809J304m161j501M043L018k3687j7463J7460J6512L783
$$ 12819 9596 9689 10203 5394 6698 2537 1036 5079 8097 -15590 -33053 -15593 919 4702
3504D702J4406J175j4473j5554n666P009R512l803k1514j6822j5205L462K4049
$$ 4702 19108 20283 5810 -9744 -15410 -8401 1111 -2692 -24206 -41028 -56233 -52771 -28722
3491b8722K5850J707M616J2416q817p678M307P945K187L01o121j2345o189J89
$$ -28722 -2872 -1165 3451 15867 7050 -628 3679 11624 13811 14112 7991 -4354 -10543 -10354
3477a0354K374K749m292o052j0401R471J8204R169Q63q355q86P215j2429k207
$$ -10354 -7980 -5231 -9523 -15575 -25976 -16505 1699 10868 11731 3376 2490 9705 -2724 -4931
3463d931P291J72q960J396L987Q09N090K461j5434j0797J6045J4016L828m174
$$ -4931 2360 2532 -6428 -5032 -1045 -236 4854 7315 -8119 -18916 -2871 11145 14973 10799
3449A0799r82r206j1645M646m12m67l730j517P050l555j0679N566m390n243P777
$$ 10799 9817 611 -11034 -6388 -6800 -7267 -10997 -12514 -5464 -9019 -19698 -14132 -18522 -23765 -15988
3434a5988J2048n63j5705P033J2334O550P38o427R341M75l668l015m73Q525r593
$$ -15988 -3940 -4503 -20208 -13175 -841 5709 6447 20 9361 9836 6168 3153 2680 11205 1612
3419A612r286J401M886P356j0601m213J6903J7218l065j5822k899K714m971j59
$$ 1612 -7674 -6273 -1387 5969 -4632 -8845 8058 25276 22211 6389 3490 6204 1233 1074
3405A074l168N011n994p816n268J2557R625J7808j935j5912k263l446j7234k467
$$ 1074 -2094 2917 -3077 -10893 -16161 -3604 6021 23829 21894 5982 3719 273 -16961 -19428
3391a9428L188q72r000j561Q509Q640j1564n43M279P979L271P975J618q525o901
$$ -19428 -16240 -17112 -26112 -27673 -19164 -10524 -22088 -22631 -18352 -10373 -7102 873 2491 -6034 -12935
3376a2935K80J0472j664j0888j965L001J2815J0352l638j0377K041R439j0882
$$ -12935 -12655 -2183 -3847 -14735 -16700 -13699 -884 9468 5830 -4547 -2506 6933 -3949
3363c949r41P973J1357l36m223j143k159N345p656j9144o24J2469K428R752M737
$$ -3949 -4890 3083 14440 14104 9881 8738 6579 11924 4268 -14876 -15500 -3031 -603 9149 13886
3348A3886m607j652j0836k041L189J241j8596n590J2434J6858m712Q61O287k793
$$ 13886 9279 7627 -3209 -5250 -2061 -820 -19416 -25006 -12572 4286 -426 435 6722 3929
3334C929n84o140R967N714o209l073p570K586N006J8325J2593j7134j7217m118
$$ 3929 3345 -2795 7172 12886 6677 3604 -3966 -1380 3626 21951 34544 17410 193 -3925
3320c925M634j3159k624J4039j867j3145J0919J1520O231K889M880q051j6579
$$ -3925 709 -12450 -15074 -1035 -2902 -16047 -5128 6392 12623 15512 20392 12341 -4238
3307d238kJ129o356m835J1067J2772M5n525O94K371K477k925N56r866k1454O698
$$ -4238 -4240 -3111 -9467 -14302 -3235 9537 9582 4057 4751 7122 9599 6674 7230 -2636 -24090 -17392
3291a7392J5168O877k844n498k888n435Q929O791M172p053n606J631r115m0M1
$$ -17392 -2224 4653 1809 -3689 -6577 -12012 -3083 3708 7880 827 -4779 -3148 -12263 -12303 -12262
3276a2262M984N397r277k19q7j9589L580J6350Q382j345J967n552p607j820J4951
$$ -12262 -7278 -1881 -11158 -11377 -11464 -31053 -27473 -11123 -2741 -4086 -2119 -7671 -15278 -17098 -2147
3261b147M817l057K691L599J634K1384J829l863j3637o493j348q751L023L006
$$ -2147 2670 -387 2304 5903 7537 28921 30750 26887 13250 6757 5409 -3342 -319 2687
3247B687N014J251j19O773j413p621j569J832l172Q360O101r834J834J335J7931
$$ 2687 7701 8952 8833 15606 14193 6572 5003 6835 3663 12023 18124 8290 10124 11459 29390
3232B9390j087j7171K240O581q764q042R413l370r42n532j0192J8405l915k624
$$ 29390 28303 11132 13372 19953 11189 3147 12560 9190 8248 2716 -7476 10929 7014 4390
3218D390M774P434p947k1338k116J806J6121R045O776q922j3138j4579M082N937
$$ 4390 9164 16598 8651 -12687 -14803 -12997 3124 12169 18945 10023 -3115 -17694 -13612 -7675
3204g675N849k413L368n018R66J0271O00p943k37P837J0116j877j1620j4866K365
$$ -7675 -1826 -4239 -871 -5889 -4923 5348 5948 -1995 -2232 5605 15721 13844 2224 -12642 -10277
3189a0277k023J0424N317N957J1582j6152j4446R706q45j1160n234J788O768J1540
$$ -10277 -12300 -1876 3441 9398 20980 4828 -9618 88 -757 -11917 -17151 -15363 -8595 2945
3175B945J083p406n621N374P216q375O990j5118j4666N348K0763J8077J0929o425
$$ 2945 4028 -3378 -8999 -3625 3591 -4784 2206 -12912 -27578 -22230 -1467 16610 27539 21114
3161B1114n056j2292n030l017J399L311j061L960k709k938m895p929n384p962
$$ 21114 16058 3766 -1264 -4281 -2882 429 -632 3328 619 -2319 -7214 -15143 -20527 -28489
3147b8489o930M091J460L140J2180n59J0697M325j4465P12J1057L445o052K364
$$ -28489 -35419 -31328 -29868 -26728 -14548 -15107 -4410 -85 -14550 -13838 -2781 664 -5388 -3024
3133c024O309o31r279n499o705j720J2118K657k816o884K636P763k96K15m486
$$ -3024 3285 2654 -6625 -12124 -18829 -20549 -8431 -5774 -8590 -15474 -12838 -5075 -5371 -5156 -9642
3118i642j0300r040O120n729l08K4376j659j3722M26J6194J4341p795J237K905
$$ -9642 -19942 -28982 -22862 -28591 -28899 -4523 -6182 -19904 -19478 -3284 11057 3262 4499 7404
3104G404j1180q418r927L196O925M821J296K496q010q375J659k000p823j0705
$$ 7404 -3776 -12194 -22121 -18925 -12000 -7179 -5883 -3387 -11397 -19772 -18113 -20113 -27936 -38641
3090c8641J1418J4662M91K31O739k534j775N28j052O712R570l022k373M104j4218
$$ -38641 -27223 -12561 -12070 -11839 -5100 -7634 -9409 -8881 -9933 -3221 6349 3327 954 5058 -9160
3075i160o249K153o172j733l15N027R487k705l726p582J2700M22j240J5085O503
$$ -9160 -15409 -13256 -19428 -21161 -21476 -16449 -6962 -9667 -13393 -20975 -8275 -7853 -9093 5992 12495
3060A2495r410j5791n062O280l910k546J0622N269l871k329m733p455J0982k114
$$ 12495 3085 -12706 -17768 -11488 -15398 -17944 -7322 -2053 -5924 -8253 -12986 -20441 -9459 -11573
3046a1573J0994J2254N52j3504j4175k016P846m81j1151J23J0340j1387l886M963
$$ -11573 -579 11675 12227 -1277 -15452 -17468 -9622 -10103 -21254 -21131 -10791 -22178 -26064 -21101
3032b1101p276R702j99k153Q45R277J5325j599l963r332o60O779r593q743K2554
$$ -21101 -28377 -18675 -18874 -21027 -20182 -10905 4420 2821 -1142 -10474 -11134 -4355 -13948 -22691 -137
3017a37J0678j1396r906q90P326J606K298L359R952o339j6889M578K492j535N349
$$ -137 10541 -855 -10761 -11651 -4325 -2719 -421 2938 12890 6551 -10338 -5760 -3268 -4803 546
3002E46K751m772j2553k918J2902j743j0251j2990l320L111J4324J4927l016p374
$$ 546 3297 -1475 -14028 -16946 -4044 -5787 -16038 -29028 -32348 -29237 -14913 14 -3002 -10376
2988a0376j2289p133J6625J1889m820R011P485q168j3805n985M554N567J965r270
$$ -10376 -22665 -29798 -13173 -1284 -6104 2907 10392 2224 -11581 -17566 -13012 -7445 -5480 -14750
2974a4750j5437R96J4375L368q256J0923M081K097q853j7892K59J7703M239p464
$$ -14750 -30187 -29191 -14816 -11448 -19704 -8781 -4700 -2603 -11456 -29348 -29089 -11386 -7147 -14611
2960a4611J684N592m46P129M415p795n787J2862J369o117k760j2200J1151j268
$$ -14611 -12927 -7335 -7781 -652 3763 -4032 -9819 3043 4412 -1705 -4465 -16665 -5514 -6782
2946f782p599O85k0296k167p242K054K899P249J3117j3m973M570J3120n79j3431
$$ -6782 -14381 -13696 -33992 -36159 -43401 -41347 -38448 -31199 -18082 -18095 -23068 -18498 -5378 -5957 -19388
2931a9388J096M842k514O630K700o073m527L381M020m25n013q750O202M743r00
$$ -19388 -18292 -13450 -15964 -9334 -6634 -12707 -17234 -13853 -9833 -10258 -15271 -24021 -17819 -13076 -13976
2916a3976m247l514O049l753j0814l295O170K036J3349K4097R487m314j0046o868
$$ -13976 -18223 -21737 -15688 -19441 -30255 -33550 -27380 -25344 -11995 12102 21589 17275 7229 361
2902C61L902r683n343j1371N144P306L50q674p121Q502l435N387J6n910J856O5
$$ 361 4263 -5420 -10763 -22134 -16990 -9684 -9334 -18008 -25129 -16627 -20062 -14675 -14659 -20569 -18713 -18648
2886a8648R040J7629K191m548N418M683O994o457p69r922p628j83K1631J5491
$$ -18648 -9608 8021 10212 5664 11082 15765 22759 16302 15533 5611 -2017 -2200 19431 34922
2872C4922m210o592r85j0811k493M243L353q649m095M590K7m300j0812j2586Q750
$$ 34922 30712 24120 23135 12324 9831 14074 17427 8778 4683 9273 9300 5000 -5812 -18398 -9648
2857i648K0307O167j3127j9215o942j219M912J3159o150j3931K39P615J3958P652
$$ -9648 10659 16826 3699 -15516 -22458 -23677 -18765 -5606 -11756 -25687 -25448 -17833 -3875 3777
2843C777J1367j2712k504k765n118O384j255j1563O601M607o566o425N905N532
$$ 3777 15144 2432 -72 -2837 -7955 -1571 -2826 -14389 -7788 -3181 -9747 -16172 -10267 -4735
2829d735J900J2187J644j645n668M41K151j0874J4027R166j3641p294J593o188
$$ -4735 -2835 9352 10996 9351 3683 4124 6275 -4599 9428 18594 4953 -2341 -748 -6936
2815f936j3696j237o412n247r97J3049R894R74J365k65o015J2170n583r679k973
$$ -6936 -20632 -21869 -28281 -33528 -34525 -21476 -11582 -10608 -9243 -9508 -15523 -3353 -8936 -18615 -21588
2800b1588j930J1839J0924N276p776r530J2642R427j1793j0128J230O73k713P960
$$ -21588 -23518 -11679 -755 4521 -3255 -12785 -143 9284 -2509 -12637 -11407 -10734 -13447 -5487
2786e487M827K92J2325J828j1108k448r58K025J2044L861o566j642o017p82J054
$$ -5487 -660 -368 11957 13785 2677 229 -729 1296 13340 17201 10635 8993 2976 2194 3248
2771C248K726j4916j5823l969R258r943j55J4128r98J993N239J3063Q60m492j051
$$ 3248 5974 -8942 -24765 -28734 -19476 -29419 -29574 -15446 -16444 -14451 -9212 3851 4711 219 -832
2756h32r269O576j2160O752J9319O111j2309M672o333j0387l616J0207K964p678
$$ -832 -10101 -3525 -15685 -8933 10386 16497 4188 8860 2527 -7860 -11476 -1269 1695 -5983
2742e983k956Q155J0271p960j3915q203p295L40L780P165J3619O857j688j1392
$$ -5983 -8939 -784 9487 1527 -12388 -20591 -27886 -27546 -23766 -16601 -2982 3875 2187 -9205
2728i205q875K0670M752p330l750J3352L9j2631j5725j5885J173J1158K366R566
$$ -9205 -18080 2590 7342 12 -3738 9614 9653 -2978 -18703 -34588 -33415 -22257 -19891 -10325
2714a0325l384j784J6820O293p555q964m675O379N740J848Q332p015j3265m314
$$ -10325 -13709 -15493 1327 7620 65 -8899 -13574 -7195 -1455 393 8725 1710 -11555 -15869
2700a5869K614O680N846R490R906J2160j3079j6092n878m975K559M648m70Q018
$$ -15869 -13255 -6575 -729 8761 18667 30827 17748 1656 -4222 -9197 -6638 -1990 -2460 5558
2686E558j196O757o61l44r605r98m355p257K207K155l019J2681M874Q47P000p92
$$ 5558 4362 11119 10458 10114 509 -489 -4844 -12101 -9894 -7739 -10758 1923 6797 7644 14644 13852
2670A3852j2839j9687j1366K1526K0715J5083p753k754m272j131j8002n600N88
$$ 13852 1013 -18674 -30040 -8514 12201 27284 19531 16777 12505 11374 -6628 -12228 -11640
2657a1640J8786r20q297j854j4364L210K687M55k071M388R684N948j0412l928
$$ -11640 7146 6226 -2071 -3925 -18289 -15079 -12392 -11937 -14008 -9620 64 6012 -4400 -8328
2643h328J0529K50j7939o365q17Q748M377L20J2783J285p076j5850P226K2253
$$ -8328 2201 2451 -15488 -21853 -22670 -13922 -9545 -9225 3558 4843 -2233 -18083 -10857 11396
2629A1396N498N959q748m371K221q232L272J0038O717L197j3762j1847j2792j4387
$$ 11396 16894 22853 14105 9734 11955 3723 6995 17033 23750 26947 13185 1338 -11454 -25841
2615b5841P344J4349R219R249o28m456J19N756j6940m802L084p22M554K181L344
$$ -25841 -18497 -4148 5071 14320 13692 9236 9355 15111 -1829 -6631 -3547 -4269 285 2466 5810
2600E810J0108k414j1253j056q137L522M437J1210J5196J540j116j1j6509P746
$$ 5810 15918 13504 2251 1195 -6942 -3420 1017 12227 27423 28963 27847 27836 11327 19073
2586A9073L559K422N919m997j1975p534l969J1281J101j0857j1164p809o827J0286
$$ 19073 22632 25054 30973 25976 14001 6467 2498 13779 14880 4023 -7141 -14950 -21777 -11491
2572a1491J3693j0265j559J5113K621k0488J529P461N505J1034q517j6016o906
$$ -11491 2202 -8063 -9622 5491 8112 -12376 -10847 -3386 2119 13153 4636 -11380 -18286
2559a8286J4365N744R350k869l232j910l821j2092p069O257P500L165l131L072
$$ -18286 -3921 1823 11173 8304 5072 3162 -659 -12751 -19820 -13563 -6063 -2898 -6029 -2957
2545b957p389n956P375P776L308L120J985p085R25j523K096N212j0929o460K883
$$ -2957 -10346 -16302 -8927 -1151 2157 5277 7262 177 1102 -421 1675 6887 -4042 -10502 -7619
2530g619L242J3181l147q930M039K0626J246j8261q816j078J0488k872j1403M776
$$ -7619 -4377 8804 5657 -3273 766 21392 22638 4377 -4439 -5517 4971 2099 -9304 -4528
2516d528J1907j0400j4163l647j502J4091Q971N207J680o527j0552j607n459K770
$$ -4528 7379 -3021 -17184 -20831 -22333 -8242 729 5936 7616 1089 -9463 -11070 -16529 -13759
2502a3759M145k938M821J288r481o560l181J43J0973N520l938q002N167J2186
$$ -13759 -9614 -12552 -7731 -6443 -15924 -22484 -25665 -25522 -14549 -9029 -12967 -20969 -15802 -3616
2488c616J1193n562J322K263N69j9700j1339M854J3293J3005k155J772j2462j0357
$$ -3616 7577 2015 3337 5600 6169 -13531 -24870 -20016 -6723 6282 4127 5899 -6563 -16920
2474a6920R437O776n231k549P34P658O711M319r805j0039J1568K196r177l082
$$ -16920 -7483 -707 -5938 -8487 -7753 -95 6616 10935 1130 -8909 2659 4855 -4322 -7404
2460g404L655n499j685P295M04j2875L704J1742P23j0484P932R903j02J7217m729
$$ -7404 -3749 -9248 -10933 -3638 -3234 -16109 -12405 -663 60 -10424 -2492 7411 7309 24526 19797
2445A9797j1397r407m281R478J1722j1886j1751k555J1281k587q463n679Q118
$$ 19797 8400 -1007 -5288 4190 15912 4026 -7725 -10280 1001 -1586 -10049 -15728 -7610
2432g610R87M685J5109r133j4179Q367M479m245M286J3962O295o710k0615J568
$$ -7610 -6623 -1938 13171 4038 -10141 -1774 2705 -1540 2746 16708 23003 16293 -4322 -2754
2418b754j759q372m411M090n492J0663K0105k386j6237L003O205p40q991k940
$$ -2754 -4513 -12885 -17296 -13206 -18698 -8035 12070 9684 -6553 -3550 2655 1915 -7076 -10016
2404a0016N765J1814o099j2954M914j427l583M564O366J067O014p470j2759M206
$$ -10016 -4251 7563 1464 -11490 -6576 -8003 -11586 -7022 -656 411 6425 -1045 -13804 -9598
2390i598l163j278J4442O577L982O326p961n692j2258k1373P085J0889K488L40
$$ -9598 -12761 -14039 403 6980 10962 17288 9327 3635 -8623 -29996 -22911 -12022 -9534 -9194
2376i194N76k349J2160M506p271L109J3974l264p734K988q993q772p711j61K075
$$ -9194 -8618 -10967 1193 5699 -1572 1537 15511 12247 4513 7501 -1492 -10264 -17975 -18136 -16061
2361a6061Q414L651J247O759n307o802M939k2q043N331L82K822O914k077m390
$$ -16061 -7647 -3996 -2749 4010 -1297 -8099 -3160 -3182 -11225 -5894 -5512 -2690 4224 2147 -2243
2346b243p439J062J381N625K267j286J0628Q811j2539n574r520K088Q368k5828
$$ -2243 -9682 -8620 -7239 -1614 653 -633 9995 18806 6267 693 -8827 -6739 1629 -24199
2332b4199r151J8139J3898J3998M155j7759n391Q046p06n862l152J4757J4171
$$ -24199 -33350 -15211 -1313 12685 16840 -919 -6310 1736 1030 -4832 -7984 6773 20944
2319B0944l992q313r044j050j880l581m182Q092n252m938K563R94K397J2999O324
$$ 20944 16952 8639 -405 -1455 -3335 -6916 -11098 -3006 -8258 -13196 -10633 -9639 -7242 5757 12081
2304A2081j6486j7163j0103k471J4620N736j3299P90J4542k165J2003J3835J194
$$ 12081 -4405 -21568 -31671 -34142 -19522 -13786 -27085 -26295 -11753 -13918 -1915 11920 13114
2291A3114j733j8304L45L272K162L338j180j0431p912O2M013q03L216j736J0744
$$ 13114 11381 -6923 -6578 -3306 -1144 2194 1014 -9417 -17329 -17267 -13254 -14057 -10841 -12577 -1833
2276a833j42j283J1284M243k302P627k24l091q408j0535q871k703j360o771P851
$$ -1833 -1975 -3258 8026 12269 9967 17594 17370 14279 5871 -4664 -13535 -16238 -17598 -24369 -16518
2261a6518J9684J1492j703j6207j547j946l83O000O972l563J537o720p116O158
$$ -16518 3166 14658 12955 -3252 -4799 -6745 -7128 -1128 5844 2281 3818 -2902 -10018 -3860
2247c860J1812R502P342J0727R20j7685j3100J1273M991j094r665j589l883j9420
$$ -3860 7952 17454 24796 35523 36443 18758 5658 16931 21922 20828 11163 9574 5691 -13729
2233a3729N094P009M508k737P227p678p501O781M137j4885j2381J6867J5721k0337
$$ -13729 -8635 -1626 2882 145 7372 -306 -7807 -1026 3111 -11774 -24155 -7288 8433 -11904
2219a1904j0985J1584J279j0435O331J0438L829j181j0389j862J3775M434r041
$$ -11904 -22889 -11305 -10026 -20461 -14130 -3692 137 -1044 -11433 -13295 480 4914 -4127
2206d127n27J3564K422Q88n884j3383o899j346M968O87r671j485N101N977J8526
$$ -4127 -4654 8910 11332 12220 6336 -7047 -13946 -15292 -10324 -9637 -19308 -20793 -15692 -9715 8811
2191H811J957j4259l00J3542j568j3265L480K794l613o113j2311R627M888R423
$$ 8811 10768 -3491 -3791 9751 8183 -5082 -1602 1192 -2421 -8534 -20845 -11218 -6330 3093
2177C093J627O08K671l798l418m063K765j2267L093J9763J5254r551j5141r21
$$ 3093 4720 5328 7999 4201 783 -3280 -515 -12782 -9689 10074 25328 15777 636 -285
2163b85M396l39J233j4647m570J7015J7636R393m293M900N27p69n194K501p481
$$ -285 4111 3772 5005 -9642 -14212 2803 20439 29832 25539 30439 30966 30197 25003 27504 20023
$$ [...]
##END NTUPLES=NMR SPECTRUM
##END=
