##TITLE=Analysis number 320218
Compound Code cc 30942
Book Reference 471/84
Project Code adrs
Chemist Name carlr
##JCAMPDX= 6.0         $$ Bruker NMR JCAMP-DX V2.0
##DATA TYPE= NMR SPECTRUM
##DATA CLASS= NTUPLES
##ORIGIN= Bruker BioSpin GmbH
##OWNER= nmr
$$ XWIN-NMR		Version 3.5
$$ Mon Jun 19 08:41:43 2006 GMT Daylight Time (UT+1h)  MAYBRIDGE\nmr@NMR_250MHZ
##.OBSERVE FREQUENCY= 250.131544655141
##.OBSERVE NUCLEUS= ^1H
##.ACQUISITION MODE= SIMULTANEOUS (DQD)
##.ACQUISITION SCHEME= undefined
##.AVERAGES= 16
##.DIGITISER RES= 18
##SPECTROMETER/DATA SYSTEM= dpx250
##.PULSE SEQUENCE= zg30
##.SOLVENT NAME= CDCl3
##.SHIFT REFERENCE= (INTERNAL, CDCl3, 0, 16.4528)
##AUDIT TRAIL= $$ (NUMBER, WHEN, WHO, WHERE, WHAT)
$$ ##TITLE= Audit trail, XWIN-NMR		Version 3.5
$$ ##JCAMPDX= 5.01
$$ ##ORIGIN= Bruker BioSpin GmbH
$$ ##OWNER= nmr
$$ C:\u/data/dgb/nmr/ADRS/950/pdata/1/auditp.txt
$$ ##AUDIT TRAIL=  $$ (NUMBER, WHEN, WHO, WHERE, WHAT)
(   1,<2006-06-19 08:41:09.48 +100>,<MAYBRIDGE\nmr>,<NMR_250MHZ>,
      <created by zg, POWCHK disabled, PULCHK disabled
       configuration hash MD5:
       E2 DF 36 D8 04 B2 41 60 5A D7 A3 38 5A 4B D0 FE
       data hash MD5: 64K
       C0 C2 F8 45 6E 5B 83 87 3D 02 BE F1 CF 24 69 14>)
(   2,<2006-06-19 08:41:27.43 +100>,<MAYBRIDGE\nmr>,<NMR_250MHZ>,
      <Start of raw data processing
       ef LB = 0.3 FT_mod = 6 PKNL = 1 SI = 32K 
       data hash MD5: 32K
       01 69 8E 69 D3 CE 8F B6 9F 9C 21 EA 5B 08 AF 9C>)
(   3,<2006-06-19 08:41:31.01 +100>,<MAYBRIDGE\nmr>,<NMR_250MHZ>,
      <apk 
       data hash MD5: 32K
       7C 16 5F E9 78 71 48 5C D6 64 B6 84 23 ED 82 95>)
(   4,<2006-06-19 08:41:32.46 +100>,<MAYBRIDGE\nmr>,<NMR_250MHZ>,
      <abs ABSG = 5 
       data hash MD5: 32K
       42 D9 4F 19 42 83 0E 81 14 AC CC 67 58 87 B1 F2>)
$$ ##END=
$$ 
$$ hash MD5
$$ 0E C4 35 DF 06 D4 DF DD 08 32 9D B4 C3 BF 34 4D
##$RELAX= 
##$RELAX= 
##$RELAX= 
##$RELAX= 
##$RELAX= 
##$RELAX= 
##$RELAX= 
$$ Bruker specific parameters
$$ --------------------------
##$DU= <C:\u>
##$EXPNO= 950
##$NAME= <ADRS>
##$PROCNO= 1
##$TYPE= <nmr>
##$USER= <dgb>
##$AMP= (0..31)
100 100 100 100 100 100 100 100 100 100 100 100 100 100 100 100 100 100 
100 100 100 100 100 100 100 100 100 100 100 100 100 100 
##$AQSEQ= 0
##$AQ_mod= 3
##$AUNM= <au_zg>
##$AUTOPOS= <6 >
##$BF1= 250.13
##$BF2= 250.13
##$BF3= 250.13
##$BF4= 250.13
##$BF5= 500.13
##$BF6= 500.13
##$BF7= 500.13
##$BF8= 500.13
##$BYTORDA= 1
##$CFDGTYP= 0
##$CFRGTYP= 5
##$CHEMSTR= <none>
##$CNST= (0..31)
1 1 145 1 1 1 1 1 1 1 1 1 1 1 1 1 1 1 1 1 1 1 1 1 1 1 1 1 1 1 1 1 
##$CPDPRG= <>
##$CPDPRG1= <>
##$CPDPRG2= <>
##$CPDPRG3= <>
##$CPDPRG4= <mlev>
##$CPDPRG5= <mlev>
##$CPDPRG6= <mlev>
##$CPDPRG7= <mlev>
##$CPDPRG8= <mlev>
##$CPDPRGB= <>
##$CPDPRGT= <>
##$D= (0..31)
0 1 0 0 0 0 0 0 0 0.06 0 0 0 0 0 0 0.0002 0 0 0 0 0 0 0 0 0 0 0 0 0 0 
0 
##$DATE= 1150702868
##$DBL= (0..7)
120 120 120 120 120 120 120 120 
##$DBP= (0..7)
150 150 150 150 150 150 150 150 
##$DBP07= 0
##$DBPNAM0= <>
##$DBPNAM1= <>
$$ [...]
##$SUBNAM7= <"">
##$SUBNAM8= <"">
##$SUBNAM9= <"">
##$SW= 20.6930455092707
##$SWIBOX= (0..15)
0 0 3 0 0 0 0 0 0 0 0 0 0 0 0 0 
##$SW_h= 5175.983436853
##$TD= 65536
##$TD0= 1
##$TE= 295.16
##$TE2= 300
##$TE3= 300
##$TEG= 300
##$TL= (0..7)
0 120 120 120 120 120 120 120 
##$TP= (0..7)
150 150 150 150 150 150 150 150 
##$TP07= 0
##$TPNAME0= <>
##$TPNAME1= <>
##$TPNAME2= <>
##$TPNAME3= <>
##$TPNAME4= <>
##$TPNAME5= <>
##$TPNAME6= <>
##$TPNAME7= <>
##$TPOAL= (0..7)
0.5 0.5 0.5 0.5 0.5 0.5 0.5 0.5 
##$TPOFFS= (0..7)
0 0 0 0 0 0 0 0 
##$TUNHIN= 0
##$TUNHOUT= 0
##$TUNXOUT= 0
##$USERA1= <user>
##$USERA2= <user>
##$USERA3= <user>
##$USERA4= <user>
##$USERA5= <user>
##$V9= 5
##$VALIST= <valist>
##$VCLIST= <CCCCCCCCCCCCCCC>
##$VD= 0
##$VDLIST= <DDDDDDDDDDDDDDD>
##$VPLIST= <PPPPPPPPPPPPPPP>
##$VTLIST= <TTTTTTTTTTTTTTT>
##$WBST= 1024
##$WBSW= 4
##$XGAIN= (0..3)
0 0 0 0 
##$XL= 0
##$YL= 0
##$YMAX_a= 517428
##$YMIN_a= -536119
##$ZGOPTNS= <>
##$ZL1= 120
##$ZL2= 120
##$ZL3= 120
##$ZL4= 120
##$ABSF1= 16.45279
##$ABSF2= -4.240383
##$ABSG= 5
##$ABSL= 3
##$ALPHA= 0
##$AQORDER= 0
##$ASSFAC= 0
##$ASSFACI= 0
##$ASSFACX= 0
##$ASSWID= 0
##$AUNMP= <proc_1d>
##$AZFE= 0.1
##$AZFW= 0.1
##$BCFW= 0
##$BC_mod= 0
##$BYTORDP= 0
##$COROFFS= 0
##$CY= 12.5
##$DATMOD= 1
##$DC= 0
##$DFILT= <>
##$DTYPP= 0
##$F1P= 14.0000005364418
##$F2P= -0.99999901652339
##$FCOR= 0.5
##$FTSIZE= 32768
##$FT_mod= 6
##$GAMMA= 0
##$GB= 0
##$INTBC= 1
##$INTSCL= 1
##$ISEN= 128
##$LB= 0.3
##$LEV0= 0
##$LPBIN= 0
##$MAXI= 10000
##$MC2= 0
##$MEAN= 0
##$ME_mod= 0
##$MI= 0
##$NCOEF= 0
##$NC_proc= -2
##$NLEV= 6
##$NOISF1= 0
##$NOISF2= 0
##$NSP= 0
##$NTH_PI= 0
##$NZP= 0
##$OFFSET= 16.45279
##$PC= 1
##$PHC0= 171.6528
##$PHC1= 5.004976
##$PH_mod= 1
##$PKNL= yes
##$PPARMOD= 0
##$PSCAL= 4
##$PSIGN= 0
##$REVERSE= no
##$SF= 250.130017311303
##$SI= 32768
##$SIGF1= 0
##$SIGF2= 0
##$SINO= 400
##$SIOLD= 32768
##$SREGLST= <1H.CDCl3>
##$SSB= 0
##$STSI= 32768
##$STSR= 0
##$SW_p= 5175.98343685301
##$SYMM= 0
##$S_DEV= 0
##$TDeff= 65536
##$TDoff= 0
##$TI= <Analysis number 999999
Compound Code 99
Book Reference 9
Project Code 9>
##$TILT= no
##$TM1= 0
##$TM2= 0
##$TOPLEV= 0
##$USERP1= <user>
##$USERP2= <user>
##$USERP3= <user>
##$USERP4= <user>
##$USERP5= <user>
##$WDW= 1
##$XDIM= 32768
##$YMAX_p= 370995478
##$YMIN_p= -63009
$$ End of Bruker specific parameters
$$ ---------------------------------
##NTUPLES= NMR SPECTRUM
##VAR_NAME=  FREQUENCY,     SPECTRUM/REAL,   SPECTRUM/IMAG
##SYMBOL=    X,             R,               I
##VAR_TYPE=  INDEPENDENT,   DEPENDENT,       DEPENDENT
##VAR_FORM=  AFFN,          ASDF,            ASDF
##VAR_DIM=   32768,         32768,           32768
##UNITS=     HZ,            ARBITRARY UNITS, ARBITRARY UNITS
##FACTOR=    0.157963299565203, 1,           1
##FIRST=     4115.33647408924, 0,            0
##LAST=      -1060.64696276377, 0,           0
##MIN=       -1060.64696276377, -63009,      0
##MAX=       4115.33647408924, 370995478,    0
$$ Real data points
##PAGE= N=1
##DATA TABLE= (X++(R..R)), XYDATA
$$ [...]
15230B53810j600j7698q993j2565M039n375n047j1622L935Q066n280l196K943
15217B01417N866j865L912j7690J50R547O78n486n4O227j317j586N103N395M060
15202B14357p458q873J6617n777k2327l0962k1719J883J2892Q885P361L787j495
15189A67171p428K542j729L984O234J567p298K525P595L819r691j6768o678r287
15175A36558q857K89O163R630q188n638P355k111J637J5898M137l339j2957k437
15161A38140M473o61m402J0143R444r171j4898j3410n092N760O040n289n683j2082
15147A03312j9248R059P672J4014r06j8835k191m802O234P018r570m964Q724l923
15133I1594l4271p636J8949J2520N819M888n658M130j4031J0969O697J4063q137
$$ y = [253810, 252210, 234512, 225519, 212954, 216993, 211618, 206571, 194949, 198884, 206950, 201670, 198474, 201417, 207283, 205418, 209330, 191640, 191790, 201337, 202015, 196529, 196475, 202702, 201385, 199799, 204902, 210297, 214357, 206899, 198026, 214643, 208866, 186539, 155577, 133858, 135741, 148633, 157518, 164879, 168666, 167171, 159743, 162285, 160556, 164540, 170774, 172341, 165043, 167568, 175163, 178982, 169291, 152523, 145845, 136558, 127701, 127990, 134153, 143783, 135595, 129957, 137312, 135201, 136838, 152736, 156873, 153534, 140577, 138140, 142613, 141952, 137550, 147693, 157137, 147966, 133068, 119658, 114566, 120326, 126366, 121077, 115394, 103312, 84064, 93123, 100795, 114809, 113903, 95068, 92877, 88075, 94309, 101327, 91757, 86793, 95517, 91594, 57323, 49687, 68636, 81156, 86975, 91863, 86205, 90335, 76304, 87273, 93970, 108033, 99896]
15120I9896j4643l96n178J3464o78M417N457M381j4252L725J5893k962n350o891
15106I6883l538M208j0961k596p629n963M573O608l019j1225k775J0266n067m084
15092F5681J6261Q831r540j925q164j0243j2830k317K109J3354l297r649j0261
15079C8010m198J2491R470L842k393q067q014j3292L797O543R105J2131P657j0437
15065E6645n252J30L003j3956J6636p230j1715o931R822J1799K0709p014l884
15052F2762J3685J685r821r415j2936N571P142N472k83q882j358p076M600L287
15038E4433r767L61q78m494J87j2489k734j652j5j561k471p182K930O350J5275
15023C6293J8854r490n676j115Q668r50r115j824r877P183J6162M141l661j930
$$ y = [99896, 85253, 84857, 79679, 93143, 92465, 96882, 102339, 106720, 92468, 96193, 112086, 109124, 103774, 96883, 93345, 97553, 86592, 83996, 76367, 70404, 74977, 81585, 78566, 67341, 64566, 74832, 69765, 65681, 81942, 90773, 81233, 79308, 71144, 60901, 48071, 45754, 47863, 61217, 57920, 48271, 38010, 33812, 46303, 55773, 59615, 57222, 49155, 41141, 27849, 31646, 38189, 47294, 59425, 67082, 56645, 51393, 51523, 54526, 40570, 57206, 49976, 38261, 31330, 41152, 52951, 73660, 66646, 62762, 76447, 78132, 68311, 58896, 45960, 51531, 58673, 64145, 63862, 54980, 53622, 46546, 51146, 54433, 44666, 45027, 44149, 39655, 39842, 27353, 24619, 22967, 22952, 21391, 18920, 11738, 14668, 21018, 36293, 55147, 45657, 39981, 38866, 47534, 46584, 37469, 35645, 25768, 32951, 49113, 53254, 49593, 47663]
15009D7663j0599r660L991J1062N827o265L339K2754J5947J5837J5163j0119K407
14996A07347J3008o124k5606j7658j059o493n227R76r05o079n847Q140J919k757
14982E3635q586j0087N568l338J660N028L43m047J0611J5529o3k2534k7497J2496
14968B8718J1702K098l022L064P170P214k976j6571q197j357Q958o840j893q481
14954A9587j2961Q621L350M678n321j5086m636M685J1877p853P33J9151n014l264
14940A8547P22L794k2702j4353J3727J0775Q513K3938l982j2849N590j0278n365
14927A6077j2279l014J173k958M91J8762R000K249J3020R438k0927j0519L003
14914B3516K248p269j026R034n76m266J3468J1974q858j4672j1186k165R550P499
$$ y = [47663, 37064, 27404, 31395, 42457, 48284, 42019, 45358, 68112, 84059, 99896, 115059, 104940, 107347, 120355, 114231, 88625, 70967, 69908, 63415, 58188, 59164, 58259, 52180, 46333, 54473, 56392, 53635, 45049, 34962, 40530, 37192, 38852, 43880, 44223, 40176, 50787, 66316, 66253, 43719, 16222, 28718, 40420, 42518, 39496, 42560, 49730, 56944, 53968, 37397, 29200, 27843, 36801, 29961, 28068, 19587, 6626, 15247, 18597, 23275, 17954, 2868, -1768, 2917, 14794, 6941, 7674, 26825, 21811, 18547, 19269, 23063, 361, -13992, -265, 10510, 19023, 42961, 38979, 26130, 31720, 21442, 16077, 3798, 784, 1957, -1001, -510, 18252, 27252, 29501, 42521, 51959, 31032, 20513, 23516, 25764, 18495, 17469, 26503, 25927, 21661, 35129, 47103, 38245, 23573, 12387, 10222, 19772, 27271]
14900B7271J48K0419K270P05k1027k0882o701M90j860Q349J4986N88R89j5761
14886I984R8N459J0942L50m742j4183K1264l974L03j779p711k02J4177o582O61
14871B4065m116J47R738N520j6578j8779k491Q296J3827O772Q423K357q515k1124
14857G542o368q110p087k1677R019J9585K1290M239J3131q198k251p207j3462
14844D46q237O052R185J2130Q573P047j0494n636j138O28K484J174K966j4338
14830A0842k986q856k386J0893O717L230j0925M09J229J419L601l296j9821O516
14816c414K4373J7270j1329q290J013l934J2240M636m298M745K073m048n412m654
14802B0971o634M056l132j1786m455N295P827r910p715J2604N255J7091J6822
$$ y = [27271, 27419, 47838, 50108, 50813, 29786, 8904, 2203, 2693, 833, 9182, 24168, 24756, 25745, 9984, 10082, 15541, 26483, 26833, 22091, 7908, 29172, 25198, 25501, 23722, 16011, 15809, 29986, 23404, 24065, 19949, 20096, 29834, 35354, 18776, -3, -2494, 5802, 19629, 26401, 34824, 37181, 28666, 7542, 1174, -6936, -14023, -35700, -26681, -7096, 14194, 18433, 31564, 23366, 21115, 13908, 446, -7791, -1739, 7446, 19576, 28149, 35196, 24702, 19066, 17928, 18556, 21040, 22214, 25180, 10842, 7856, -1000, -3386, 7507, 14224, 17454, 6529, 6938, 8167, 9586, 13187, 9891, -9930, -3414, 20959, 38229, 26900, 18610, 19623, 15689, 27929, 32565, 28267, 33012, 35085, 31037, 25625, 20971, 14337, 18393, 15261, 3475, -980, 4315, 12142, 2232, -5483, 7121, 12376, 29467, 46289]
14789D6289o864l905O887j420L010l585O549q592j2283q46K285n568m783l289
14775A3885j3803r50Q697J7822L463K899j4582j5587Q578Q263l366Q596J159q895
14761A6179r943N882L638K558J2023p623o230K413j1277j374R543O843N166J397
14747B9195O11j2258n970m158m208q154R061Q462j1808K108l237L190r059m656
14733a0881K413J5034L88j0401M47l34O61R699J4540K532j982L981l846L451O889
14718C2591k66k1824q425L833o528l188o010k094J4057P672k937m811K030N287
14704I387Q363o59n685j9124o23n516M060R316Q973M072j1441j1238m445O7O027
14689h466O543K1976M222k1166J0827J3900Q179N536j552j7823J2919k797k3209
$$ y = [46289, 39425, 35520, 42407, 40987, 43997, 40412, 46961, 38369, 26086, 25240, 27525, 21957, 17174, 13885, 82, -868, 7829, 25651, 29114, 32013, 17431, 1844, 10422, 18685, 15319, 23915, 25074, 16179, 6236, 12118, 15756, 18314, 30337, 22714, 16484, 18897, 7620, 6246, 15789, 22632, 27798, 29195, 29806, 17548, 11578, 7420, 3212, -4942, 4119, 12581, 773, 2881, -356, 2834, -6225, -10881, -8468, 6566, 6954, -3447, -3000, -3334, -2673, 7026, 21566, 24098, 22116, 26097, 22251, 25702, 32591, 32325, 10501, 2076, 5909, -619, -3807, -9817, -11911, 2146, 9818, 6881, 2070, 4100, 9387, 17750, 17091, 11406, -7718, -8341, -13857, -9797, -481, 8492, 12564, 1123, -10115, -14560, -14493, -8466, -1923, 20053, 24275, 3109, 13936, 27836, 36015, 41551, 39999, 22176, 35095, 32298, 9089]
14676I089r946m735J0027O468j0263M739R234J5308J0319j1374p658O929j782
14663B6355m051j905n986m794o260J1681O8p611q977m098L607q63K697m357K92
14648d202O546o978m624p76O188K001R307o543l758r471n274J8659J598p117N363
14633I19k603l80J8118L780j1947l832o459n864p167K0294J3147n298j9743j039
14619h074k798J9866Q673l627Q927K440L602p652p949K671L050k2981l225M04
14605f673J8152J9461j4398j6040L727J3439j3807l0435J1065J4137L128Q794
14593A0550J6892q692k35q322m400n591P35Q934J2629P80j2090o296L667L912
14579A2473o511q998n073K421J2946Q50J2927j1299J787j3084R228n39o514N53
$$ y = [9089, -857, -5592, 4435, 10903, 640, 5379, 14613, 29921, 40240, 28866, 21208, 28137, 26355, 22304, 20399, 14413, 9619, 3359, 15040, 15108, 7497, -1480, -5578, -1971, -2834, -137, -4494, -4202, 2344, -4634, -9258, -10034, -3846, -1845, 7462, 919, -2839, -12310, -17584, 1075, 2673, -4444, 919, -1684, -2064, 16054, 19834, 7887, 4055, -2404, -8268, -15435, 4859, 18006, 12708, -7035, -8074, -10872, 8994, 17667, 14040, 22967, 25407, 29009, 21357, 13408, 16079, 19129, -3852, -7077, -6673, 11479, 30940, 16542, 502, 4229, 17668, 3861, -26574, -15509, -1372, 1756, 10550, 27442, 18750, 18515, 10193, 5793, 202, 937, 9871, 22500, 23280, 11190, 4894, 8561, 12473, 5962, -3036, -8109, -5688, 7258, 8108, 21035, 9736, 11523, -1561, 7667, 7128, 614, 1167]
14565A167j1393J0081J3824J3703O227j821j6102j4232J639k550M8J0859l80O28
14551A1698J0609l411k1277r069J4511o450l718O086R618J0833k925M013j0253
14538A0265j8006J80Q40J0717j976j090K447j6975l914l075m306K0170K5527L919
14524B4723k124j6462m749J2703L310j5550j9895n333J5677R085J9208q893p893
14511C807j0504R702J3211J6656l105j8700j3545J1438R872k651R55p390p704
14498B042p654J776j868P609J043N366j4237P119J2547J886m891o911k44P200
14484A0783L085j3155P056J665J0508n899P554j5175j6006N619J0076Q27r503
14471b565k239J7785K1058M050j7948p358N53q658k1731J1735j158j0408K538
$$ y = [1167, -10226, -145, 13679, 27382, 33609, 31788, 15686, 1454, 3093, 543, 591, 11450, 11070, 11698, 22307, 18896, -2381, -11450, 3061, -3389, -7107, -1021, 8597, 19430, 16505, 20518, 10265, -7741, -7561, -6721, 3996, 2020, 930, 3377, -13598, -17512, -20587, -24893, -4723, 20804, 24723, 22599, 6137, 1388, 14091, 17401, 1851, -18044, -23377, -7700, 1385, 20593, 11700, 3807, -6697, 3005, 16216, 32872, 29767, 11067, -2478, 8960, 18832, 16181, 17136, 9746, 2042, -5612, -3836, -5704, 1905, 2948, 8314, -5923, 1196, 13743, 15629, 10738, 3827, 3583, 10783, 13868, 713, 7769, 9434, 19942, 14043, 21597, 6422, -9584, -3965, 6111, 6938, -2565, -4804, 12981, 34039, 38089, 20141, 12783, 13336, 4678, -17053, -5318, -6476, -16884, -14346]
14458a4346p61J4704M182j364O30n177q461j7781o347J1235M200R983J4292p070
14444b081q349J302Q876r759K710K0029J6571n65j2239m340K474R091k746j9326
14430A648o973J5517m468o54R427J087r809O855L239K41n066L545J3869j2603
14416A5855r725O24k564J1490J1228K22m066j2013j753o951m619P88j933O687
14402C270L535R698J2283l615j6559j0766Q946L505j012o810j1580m927J9837
14389E805J2531j5376O097k818J434n839k530J0191N455o022R600J2650p191k2468
14375A519j4289N376L873N281J4387J5927J846q680j6199q051m455q295N923J7376
14361A1539L559L244Q391j7764j9837R13O451O137O389M830j4594n689J3113o741
$$ y = [-14346, -15107, -403, 3779, 2415, 3045, -2132, -10593, -28374, -34721, -23486, -19286, -9303, 4989, -2081, -10430, -9128, -252, -10011, -7301, 12728, 29299, 28734, 16495, 12155, 14629, 23720, 20974, 1648, -5325, 10192, 5724, 5070, 14497, 15584, 5775, 12630, 15869, 16110, 11044, 14589, 28458, 15855, 6130, 6754, 4190, 15680, 26908, 27130, 23064, 11051, 9298, 2347, -2272, -1484, -3417, 3270, 6805, 16503, 28786, 25171, 8612, -2154, 6792, 10297, 9285, 2475, -9105, -14032, 5805, 18336, 2960, 9057, 6239, 7673, 1834, -696, 9495, 14950, 8928, 18528, 31178, 23987, 1519, -12770, -7394, -3521, 1760, 16147, 32074, 33920, 25240, 9041, 990, -3465, -11760, -5837, 11539, 15098, 18342, 26733, 8969, -10868, -9955, -3504, 2633, 9022, 13852, -742, -6431, 6682, -59]
14347e9q379r328L803q44M844L986K057N165j6552j9333Q395J2927M758J2259
14333C699Q417J1051Q896Q290j8352k2072J806n965j3040M07J7310J3603M61l656
14319A0855j2133N210J0744j268J7708N014n947j1478j4298p256J725J1101L799
14306A3776K929J2972p55j1087K61k919P086K759m761k123m255j2539j5494P099
14292g051J3184M564j7979j1018J0887M415K465M433M458M059L722Q463N678r954
14278B0326j0287q03J980J276K49m35n121J5954K0831j6977j9164P071Q723N360
14264B8983M969o2n721m71k881J8243J3410q821j1952R94J6105K4269P207o618
14250G7654R006L245n870j0376P835P4r810j364l57J501l103p16J4733j98p891
$$ y = [-59, -8438, -17766, -13963, -14807, -9963, -5977, -3920, 1245, -15307, -34640, -26245, -13318, -8560, 3699, 12116, 23167, 32063, 40353, 22001, -71, 1735, -4230, -17270, -16863, 447, 14050, 14511, 10855, -1278, 3932, 14676, 13408, 31116, 36130, 30183, 18705, 4407, -2849, -1124, 9977, 13776, 16705, 29677, 28922, 17835, 18096, 15177, 22263, 25022, 20261, 18138, 13883, 1344, -14150, -7051, 6133, 10697, -7282, -18300, -7413, -2998, -533, 3900, 8358, 12417, 16139, 24602, 30280, 20326, 10039, 9236, 11216, 12492, 12741, 12306, 7185, 23139, 43970, 26993, 7829, 14900, 23623, 28983, 33952, 33890, 28169, 27698, 24817, 43060, 56470, 47649, 35697, 36691, 52796, 77065, 84272, 77654, 86660, 89905, 84035, 73659, 81494, 81568, 71758, 70394, 70037, 71538, 68435, 67719, 82452, 82254, 74363]
14235G4363j865R006K423r074m196J6922K446J290n935N302p776j7980p928J8867
14221G5865K0476j0195r353j4645L897K3905R824J4599n697j7940j1951K615M212
14208H5612n244R647J953N567L954j5250j4594O870J9193o083l516j5479j6678
14195E5952j3055j0942n229M423r280l037J2276M851j79l600j2894J4248K5854
14182E9388J0844j9948q410k499j3523m129J0866k927O803k148j447j978q110
14169B2782j3073J047K338L826l19J3225M812j220j778r081K287j2886M450K2941
14155C9351J1108j6663p717j8551N469L780j0850P252K2979r060k127l157j159
14142B0655J2095j773m810j2701p477M676L070q880m855N446k992J3762M038k2657
$$ y = [74363, 72498, 81504, 83927, 74853, 70657, 87579, 90025, 91315, 85380, 90682, 82906, 64926, 56998, 75865, 96341, 86146, 76793, 62148, 66045, 89950, 99774, 114373, 108676, 90736, 78785, 81400, 85612, 80368, 90015, 91968, 97535, 101489, 86239, 71645, 78515, 97708, 91625, 88109, 72630, 55952, 42897, 31955, 26726, 31149, 21869, 18832, 31108, 35959, 35780, 32180, 19286, 33534, 59388, 70232, 50284, 41874, 39375, 25852, 21723, 32589, 29662, 36465, 34317, 32870, 30892, 22782, 9709, 10756, 13094, 16920, 16601, 29826, 34638, 33418, 31640, 22559, 24846, 11960, 16410, 39351, 50459, 33796, 26079, 7528, 12997, 16777, 5927, 13179, 36158, 27098, 24971, 21814, 20655, 32750, 30977, 26167, 13466, 5989, 10665, 13735, 4855, 0, 5446, 2454, 16216, 20254, -2403]
14128b403j4672k707M20k254M625K0039K0255O07p530J778j037n282O425J0970
14114B9234j094j3708k903N900l448J691Q552p757K999N099J0351k840m229j5477
14100A2370J3485n594j7937J936J455N740n46O29k384Q448o778N256q786L957
14086A1251J528j936j565j719J3268M074M989P801n115k3785j1946L597Q790J9026
14072B8258P981k497l62R28r924K526J3662j347N766l616o78Q13J889k502O294
14057D7191p861n685p270N251O085j438P402R567r629n235m312o284M529K053
14043C4364J3782J995n16J3040o750q924r525J933J1003O838J176j3299j5212
14030B9905J1554J0389J841N314k1033k8139J353J9251J9622R01l364j878J5769
$$ y = [-2403, -17075, -19782, -19362, -21616, -16991, 3048, 23303, 23910, 16380, 18158, 17121, 11839, 18264, 29234, 28140, 14432, 11529, 17429, 13981, 15672, 24224, 16467, 19466, 24565, 34916, 32076, 27847, 12370, 25855, 20261, 2324, 4260, 5715, 11455, 10909, 11538, 9154, 17602, 10824, 16080, 7294, 11251, 12779, 10843, 9278, 7559, 20827, 24901, 29890, 37691, 32576, 8791, -3155, 442, 9232, 28258, 36239, 33742, 33380, 34308, 24384, 26910, 40572, 39225, 44991, 41375, 40697, 41510, 43399, 40897, 47191, 39330, 33645, 26375, 31626, 37711, 36273, 43675, 53242, 43613, 38378, 34066, 27782, 32311, 34364, 48146, 50141, 49625, 62665, 55915, 46991, 37466, 39399, 50402, 57240, 58416, 45117, 29905, 41459, 51848, 53689, 59003, 37970, 9831, 11184, 30435, 50057, 50958, 47594, 45716, 61485]
14017F1485j7395o198K1876j460n549m972j5085j1174j948J0831M476M356l003
14004C6240P150M927L812j4107n685J9163P620M81q199L13J8j1148q913r053Q575
13989C1194K596k3080l466Q281Q928j0921j249L059J0018N813k138J865Q226N283
13975D4409m724N52N120l663k668k314J6328Q735q916r588J5546r694r784M163
13961D3502L902j0771K970J0433K064j0820J4165o159J702p03L536n9k448l832
13947D7482O774n63l171Q018Q831k184J6807o856o548J6964N33P434M390p92M887
13932A02006j403l065J153M089L637J17J24J0085n214R331q35m836l158R582q227
13917A13386n979R844Q075n552L889J4802P89r710K874R048P335q319p060j3228
$$ y = [61485, 44090, 37892, 59768, 58308, 52759, 47787, 32702, 21528, 19580, 30411, 34887, 39243, 36240, 43390, 48317, 52129, 38022, 32337, 51500, 59120, 59601, 51402, 51715, 51733, 40585, 31672, 22619, 31194, 33790, 10710, 7244, 15525, 24453, 13532, 12283, 15342, 25360, 31173, 29035, 30900, 39126, 44409, 39685, 40237, 45357, 41694, 39026, 36712, 53040, 61775, 52859, 43271, 58817, 49123, 39339, 43502, 47404, 36633, 39603, 50036, 52100, 41280, 55445, 49286, 50988, 50285, 53821, 53762, 51314, 47482, 54256, 53693, 50522, 58540, 67371, 65187, 81994, 75138, 68590, 85554, 86087, 93521, 97911, 97119, 102006, 100603, 97538, 98691, 102780, 106417, 106534, 106658, 116743, 111529, 120860, 120025, 115189, 112031, 121613, 113386, 107407, 117251, 125326, 119774, 123663, 138465, 139254, 129544, 132418, 141466, 148801, 140482, 133422, 120194]
13903A20194O765K723Q874K18N530R258J2014O764r919J1121N048q477k240J0425
13889A78298K2079M480n8K224j784o015J46M715K362N277J2833J1085J9413n377
13875B49678k2537O705K8221K4310P157o2L204K0815J8586J4529R781j709K1699
13862C80377L640J2000J7280Q088J2635K0477K4443O246Q047K3981K8932J3467
13850E59613J4022J6545J8516N2706L3812K2644K8917K9843L3575M3424N8109
13839I11726O8032N4239M7206O7026M5799Q1689R6231R1847Q3637R8995J08866
13828A755293J28677J44803J60669J65110J68556J96724K11302K27225K43491
13819C401850K82030L14262L58588L78419M25060M73525N03887N58873N78717
$$ y = [120194, 126959, 129682, 138556, 138774, 144304, 153562, 165576, 172340, 162421, 173542, 178590, 170113, 167873, 178298, 200377, 204857, 204799, 207023, 205239, 199224, 199370, 204085, 206447, 211724, 224557, 235642, 255055, 249678, 227141, 233846, 262067, 286377, 293534, 293472, 296676, 317491, 336077, 350606, 360387, 358678, 380377, 384017, 396017, 413297, 421385, 434020, 454497, 478940, 485186, 493233, 517214, 546146, 559613, 573635, 590180, 608696, 661402, 695214, 717858, 746775, 776618, 810193, 853617, 911726, 979758, 1033997, 1081203, 1148229, 1194028, 1275717, 1371948, 1463795, 1547432, 1646427, 1755293, 1883970, 2028773, 2189442, 2354552, 2523108, 2719832, 2931134, 3158359, 3401850, 3683880, 3998142, 4356730, 4735149, 5160209, 5633734, 6137621, 6696494, 7275211]
13810G275211O08073O27678O24143O15593O14039N90727N49301N10619M71286
13801A2486670M14811L64408L21617K72637K50687K05500J57830J26289P9004
13792A4679453k687l3695o8940j10830j39949j57381j69327j56992j18170q4403
13782A3637079m4888R32P4597J09483J36662J96590K37548K50786K54044K45560
13772A5098393K17108J79801J41455J28910R2694N3038j2558n9032q3645j21245
13762A5634919j67419k12004k52148l03212l67891m36115m68548n06568n10744
13753A2410270n35627n43636n45532n33704n30739m75882m53195m44286m01481
13744G946188l58713l29033l13782l07082k93790k62208k60137k30001k11085
$$ y = [7275211, 7883284, 8510962, 9135105, 9750698, 10364737, 10955464, 11504765, 12015384, 12486670, 12901481, 13265889, 13587506, 13860143, 14110830, 14316330, 14474160, 14600449, 14679453, 14676766, 14643071, 14574131, 14463301, 14323352, 14165971, 13996644, 13839652, 13721482, 13637079, 13592191, 13593123, 13667720, 13777203, 13913865, 14110455, 14348003, 14598789, 14852833, 15098393, 15315501, 15495302, 15636757, 15765667, 15858361, 15911399, 15898841, 15839809, 15756164, 15634919, 15467500, 15255496, 15003348, 14700136, 14332245, 13896130, 13427582, 12921014, 12410270, 11874643, 11331007, 10785475, 10251771, 9721032, 9245150, 8791955, 8347669, 7946188, 7587475, 7258442, 6944660, 6637578, 6343788, 6081580, 5821443, 5591442, 5380357]
13735E380357k00710k03385j76753j59991j60839j48069j41082j23421j23249
13726C942858j20327j13013j01445j07289j13932j21934p4837p0754q8601r1595
13716B939131p7115p5450q2427o4124o4353p1432o0994m9174n7599o6883m9990
13705B219590n1634m8744l5358m7890l7460j9357n8817o3479n7421n9437l4752
13694A705241j4800l1331l6456k0196k5134l9647r511l9494m5732m5509m1094
13683A356337k2592j8636j8548j7527k9554m6557j9488j8890k3797j0150j1578
13672A119020k6845k5486l0055k8800n582k3623k2834k1289j1473j3100k6724
13661H83209j0316j9735k5391j9383k1535j7888m352j1129m2200m816J6122l381
$$ y = [5380357, 5179647, 4976262, 4799509, 4639518, 4478679, 4330610, 4189528, 4066107, 3942858, 3822531, 3709518, 3608073, 3500784, 3386852, 3264918, 3190081, 3119327, 3030726, 2939131, 2862016, 2786566, 2704139, 2640015, 2575662, 2504230, 2443236, 2394062, 2336463, 2269580, 2219590, 2167956, 2119212, 2083854, 2035964, 1998504, 1979147, 1920330, 1856851, 1799430, 1739993, 1705241, 1690441, 1659110, 1622654, 1602458, 1577324, 1537677, 1528166, 1488672, 1442940, 1397431, 1356337, 1333745, 1315109, 1296561, 1279034, 1249480, 1202923, 1183435, 1164545, 1140748, 1130598, 1119020, 1092175, 1066689, 1036634, 1007834, 1002252, 978629, 955795, 934506, 923033, 909933, 883209, 872893, 853158, 827767, 808384, 786849, 768961, 764609, 753480, 711280, 706464, 722586, 719205]
13649G19205k6224l0664j2635m291j4140p854q647j4467j6551j0033J003J6574
13637E91276J921j4735k513N473J3653j1918J531Q442L219N773J972j1733j2425
13624E79936R229J8757N177j3323j314J476n995j0877r235Q559l686k2098j0039
13611E46567j1727j0453j8681j9832q873Q76p457O962k2261j1793j1654r053l77
13598D22244Q556j7404J4487N657k728o477O062J5000J5173R826K261M466J2906
13585D90029J9670R704j2405j6742k0518j5689j2978q612Q219j588r818j9503
13573D09769m0354j9959j7172j9587k7271j3967j3545j230R3J55n664k0028j4674
13560B16566Q473P131J0344o727k3913p777j1580r91j752k087m398M892q41j748
$$ y = [719205, 692981, 662317, 649682, 645391, 631251, 623397, 614750, 600283, 583732, 573699, 574702, 591276, 593197, 578462, 575949, 581422, 595075, 583157, 584688, 593130, 596349, 602122, 604094, 592361, 579936, 589165, 607922, 613099, 599776, 598462, 599938, 593943, 583066, 573831, 582390, 578704, 556606, 546567, 534840, 524387, 505706, 485874, 477001, 477877, 470420, 477382, 455121, 443328, 431674, 422621, 422244, 430800, 413396, 427883, 433540, 430812, 424335, 430397, 445397, 460570, 470396, 472657, 477123, 490029, 509699, 519403, 506998, 490256, 469738, 454049, 441071, 432459, 440678, 439090, 429272, 409769, 369415, 349456, 332284, 312697, 285426, 271459, 257914, 256684, 256777, 256932, 251268, 231240, 216566, 225039, 232170, 242514, 235787, 211874, 204097, 192517, 191526, 189774, 187687, 183289, 188181, 187340, 185592]
13546A85592l136O893L836m157p007j4268r774j4003j3856k173K901P123j6294
13533A21677p991r603m673P740J684k390j687J0588o444k9011m741R719r941J672
13519G6599O653J1981P282j6723q569m879o950P170K9081k557j6908L090M383
13506H9653N474m180j8994j7216O627K351K45M825k295o258j2599j0562N469J4246
13492E6786n9j387p376m994r608j1316K661J2290Q759j2533j3575Q976J1976l11
13478D0289n037L200j0966j070J1947j5883k878J9853J2290j7983o916Q863J2495
13465D8204O009J7483O065j4101j1161j3632r957k876o701j532N536L412k43k061
13451B4445N93O139P522J525r458p914p316j2809P864Q696J4224j09p070j448
$$ y = [185592, 182456, 189349, 193185, 189028, 182021, 167753, 157979, 143976, 130120, 127947, 130848, 137971, 121677, 113686, 104083, 99410, 107150, 108834, 106444, 104757, 115345, 108901, 79890, 75149, 84868, 74927, 76599, 83252, 95233, 102515, 85792, 77223, 72344, 65394, 72564, 101645, 99088, 82180, 85270, 89653, 95127, 90947, 71953, 54737, 61364, 63715, 63960, 68785, 66490, 60232, 47633, 37071, 42540, 56786, 56727, 55340, 47964, 42970, 33362, 22046, 24707, 36997, 45756, 33223, 19648, 28624, 40600, 40289, 35252, 38452, 27486, 26416, 38363, 22480, 19602, 39455, 51745, 33762, 26846, 35709, 48204, 54213, 71696, 77761, 63660, 52499, 38867, 28910, 26034, 19333, 17801, 23337, 26749, 26506, 24445, 25038, 31177, 38699, 40224, 30766, 22852, 15536, 2727, 10591, 19287, 33511, 33402, 26332, 24884]
13437B4884j2076L031N590q303K0585n78j7141j282K584J824k400j7727q222k357
13423a1588J8803J4704j4322q687J1742j5645n502J6509J0316Q32p834m583n72
13410D173N744j7379m564K0403K3195l992n762k925j747r832j6681J8221R109
13397A7963M054M20j048O364o475N670R088n59j3541O274M103J109j5166j4999
13383C257Q335O348n597p592J7848O26j7455l05J1441K0851R72j8933o527J7155
13369C0424K2084k854m067J2443J9326m773j1303j8711N033J1242J2533K425r046
13356F4756r219J183J5732P353K386j24k74J114J91m403L018N923J712k0095j8037
13341E1216m168J5167J0691K5309K43j1803o095o368o787Q007m199R41o254j728
$$ y = [24884, 12808, 15839, 21429, 13126, 33711, 33133, 15992, 14710, 17294, 19118, 16718, -1009, -9231, -11588, 7215, 21919, 7597, -1090, 10652, -4993, -10495, 6014, 16330, 17162, 9328, 4745, 4173, 9917, -7462, -12026, 8377, 31572, 27580, 21818, 18893, 17146, 7314, -9367, 8854, 17963, 22017, 22437, 21389, 27753, 21278, 26948, 36036, 35477, 21936, 28210, 32313, 33422, 18256, 3257, 11592, 17940, 12343, 4751, 22599, 23225, 5770, 5465, 16906, 37757, 38729, 19796, 13269, 30424, 52508, 49654, 45587, 58030, 77356, 72583, 61280, 42569, 47602, 58844, 71377, 73802, 64756, 55537, 56720, 72452, 79805, 82191, 82067, 81793, 82907, 83098, 78695, 81713, 87636, 89348, 69253, 51216, 47048, 62215, 72906, 98215, 98458, 86655, 80560, 74192, 67405, 75412, 71213, 72154, 65900, 64172]
13327F4172l063P826J143J773l287R475j2708l660J2264n350J754Q651o364L641
13313G6267J1721j1798r787m768J5398k999r993K248j584k314M61K225O249J2100
13299H3426j288j8567q108j0962j5378j37J2894O269q41j90J6056k549k5775j5039
13285A9811L267K557l033r015K933l701O198Q146J007l632p276o118m097k746
13271D301j8131O322J2838L016J061N5k964O694J1251r320j2823l852k31O119
13257D336O15l094R857N748J141R739j4307r279m797j3777r892L524J0145J3085
13243C044Q626q628J266k443L117J9976J0845J1770L77j6313n960r132l289L989
13229A7245J596p05j4970L846L526r892m160o830J6394J7853j2730k0350Q034
$$ y = [64172, 61109, 68935, 70078, 71851, 68564, 78039, 65331, 61671, 73935, 68585, 70339, 78990, 72626, 76267, 87988, 76190, 66403, 61635, 77033, 74034, 64041, 66289, 64705, 62391, 62852, 65077, 71326, 83426, 82138, 63571, 55463, 44501, 29123, 28986, 41880, 48149, 47308, 47118, 63174, 60625, 34850, 19811, 23078, 25635, 22602, 13587, 16520, 12819, 19017, 27163, 28170, 24538, 17262, 11144, 7047, 4301, -13830, -7508, 5330, 8346, 9407, 9462, 6498, 13192, 24443, 15123, 2300, -1552, -1783, 4336, 4951, 1857, 11714, 17462, 18603, 28342, 14035, 4756, -41, -13818, -23710, -20186, -10041, 3044, 11670, 3042, 4308, 1865, 4982, 24958, 35803, 47573, 47950, 31637, 25677, 16545, 13256, 17245, 18841, 18136, 3166, 7012, 10538, 646, -3514, -10344, 6050, 23903, 11173, -9177, -1143]
13216a143O986Q01j2795J2002n023p967P883J3488k089j1166k0299m619n784p01
13202c0426P789J3349j0046l968O104J2436Q565P265J1375o1j5328j7365N370
13189d941j1540p572n037O936K0730J0410J0601Q671m956o159p436j6386r066
13176a5745J6507N572m281o290o60o064M724M002J8189n283j1714j1925P209J8764
13162A3005p219N338l817j4019K206J2444R449J146r922j5597n006o857J0252
13149h597J5974N502j9599q807J1134k146L747r039r75O516L170o17j2998o861
13135b3596J216K202q004N051K221k147j454J4093N673m564J1034p730p695K4759
13121A1059J9546j2664k2917q167n098p859J5734K6150J4282j2132k2688j5665
$$ y = [-1143, 5843, 6644, -6151, 5851, 828, -7139, 744, 14232, 12143, 977, -19322, -23941, -29725, -30426, -22637, -9288, -19334, -23302, -17198, -4762, 3803, 11068, 22443, 22382, 7054, -10311, -4941, -16481, -24053, -29090, -22154, -1424, 8986, 19587, 28258, 23302, 17143, 9707, -6679, -15745, 762, 6334, 2053, -4237, -4897, -10961, -6237, -2235, 15954, 10671, -1043, -12968, -5759, 13005, 5786, 11124, 7307, -6712, -4506, 7938, 17387, 18533, 8611, -6986, -11992, -18849, -8597, 7377, 12879, -6720, -15527, -4393, -6539, -2792, -11831, -12806, -6290, -3120, -3737, -16735, -23596, -22380, -20178, -28182, -23131, -20910, -23057, -24511, -10418, -4745, -9309, 1725, -6005, -13700, 11059, 30605, 17941, -4976, -13143, -18241, -26100, -10366, 15784, 30066, 17934, -4754, -20419]
13109b0419J0054O513J0461P899L166m730j705m864J531P643Q700L709j2101j4086
13095A771p27p01o64l999J2715O266j2011J236k71j9074j5956J6123K2619j241
13081F086r322J478N47n543r693j6978O379J1095j719k935J6076m46o858o898
13067a8731o439O42p133l334K4166K297q093O652K169j0338M033P703l409N087
13053d728N128j250j112J6389k126N789J6191J663j7116k1310j0706J3094M899
13040D805O37O826n354l908j1879P834J3016M091J1155m859o832p170j0914q415
13026a0967l038j8191n494P480K0712J6471n260q209j805K1049L899O592j7997
13013E242m324m975j2911O8J2307Q454K7380L284j9954k1561j6964R622K1699
$$ y = [-20419, -10365, -3852, 6609, 14508, 17674, 12944, 11239, 6375, 7906, 15549, 24249, 27958, 15857, 1771, 1044, 343, -321, -4320, 8395, 14661, 2650, 3886, 3615, -15459, -31415, -15292, 7327, 6086, -3236, -1758, -1211, -6754, -16447, -33425, -27046, -15951, -17670, -20605, -4529, -4975, -11833, -18731, -25170, -24528, -31661, -34995, -10829, -8532, -16625, -9973, -7804, -18142, -14109, -6406, -9815, -4728, 400, -850, -1962, 14427, 12301, 18090, 34281, 35944, 18828, -2482, -13188, -94, 4805, 5442, 12268, 6914, 3006, -8873, -1039, 11977, 16068, 27223, 22364, 15532, 8362, -2552, -10967, -14005, -32196, -37690, -30210, -9498, 6973, 1713, -6496, -8301, 12748, 16647, 23239, 5242, 918, -4057, -16968, -16900, -4593, 3861, 31241, 34525, 14571, -6990, -23954, -14332, 7367]
13000G367k129m232j604m88j0122j7317k579N17J2450K0217K817R893J452J1770
12986B8012M938k4841j8144q58R811J7319p512j3457P012k335p144L666n885o439
12972a5857m833p097R707P001L404p012J5052k291o104o177J0874K581j669M53
12958a968j1533p889N833M845l921r42n8l91L246M371P894N052J509j062j2653
12943g667k5299M132J5901J1169j1789j858J5472Q215J8240J5835j6166k0323
12931E862r066m598m41Q68l651R353R326J030p071j9730K206o10p846J5003M186
12916e179M84M052j819r897n887P887l408J1193Q318o414J6040J3444o488j3558
12902H768l280J4590O25l60k591m682n629j6840k392O573n055m430R165J2205
$$ y = [7367, 5238, 1006, -598, -1086, -11208, -28525, -31104, -30587, -18137, 2080, 4897, 14790, 16242, 28012, 32950, 8109, -10035, -10893, -1082, 16237, 8725, -4732, 2280, -55, -7199, -3533, -9418, -15857, -20690, -27787, -18080, -11079, -7675, -14687, 365, -1926, -8030, -14207, -3333, -752, -2421, -1968, -13501, -21390, -15557, -10712, -14633, -15575, -15633, -16024, -12778, -8407, -513, 4539, 6048, 4986, -7667, -32966, -28834, -12933, -1764, -13553, -15411, 61, 8276, 26516, 42351, 26185, 5862, -3204, -7802, -8243, -7375, -11026, -1673, 7653, 8683, 1612, -18118, -15912, -16522, -24368, -9365, -5179, -4695, -643, -2462, -12359, -18246, -10359, -13767, -2574, 5744, -670, 15370, 28814, 22326, 8768, 5488, 20078, 20703, 20343, 17752, 13070, 7441, -9399, -11791, -5218, -10273, -14703, -5538, 6667]
12888F667l255j5710K925J1078k214n58j2999r708l727J5663j227J224J2496l937
12874c282m222p72j4020l321p548j2378J8502R911k217n017J2744R418N483p25
12860B556j2793l604k1618L952J8258j0393K125K0487K1232o471j1190j9076k05
12847a6740P007j5253n274J9924J308l483M970p97R43J3956M166J5k1648j0255
12833b1161J0161j00k0763J657J3638J2583J394P760O174Q226N61j2896l535J2078
12819A5777K389J2l836j968j015Q042K6283l281j5487Q908M897n250r145j2966
12805A3360m160q796n954L125L077M464j1729L400J1404l996j8334j0772k791
12792b7702Q828K4713N717j0287L059K0331l107j2525J930k38O04r914k397j1033
$$ y = [6667, 3412, -12298, -9373, 1705, -509, -1067, -14066, -23774, -27501, -11838, -13065, -11841, 655, -3282, -7504, -8276, -22296, -25617, -33165, -45543, -27041, -17130, -19347, -24364, -11620, -2202, 3281, 2556, -10237, -13841, -35459, -31507, -13249, -23642, -21517, -1030, 20202, 13731, 2541, -16535, -16740, -9733, -24986, -30260, -10336, -9028, -12511, -7541, -8338, -7395, 6561, 10727, 10742, -10906, -21161, -11000, -11100, -31863, -30206, -16568, -3985, -2591, 5169, 11343, 19569, 20130, 7234, 3699, 15777, 18166, 18178, 14342, 12374, 11359, 19401, 45684, 42403, 26916, 35824, 40721, 35471, 26326, 13360, 9200, 404, -5550, -2425, 652, 5116, -6613, -3213, 8191, 4195, -14139, -24911, -27702, -18874, 5839, 11556, 1269, 4328, 24659, 21552, 9027, 10957, 10719, 11323, 1409, -988, -12021]
12778a2021l563o941Q499J0324K400l065p273R314K458j1321j4228J4054K5012
12765A3649P22j0487r493j2105K5Q179J1599K90o789l072R294R782J1701m733
12751A8562j6934k2688o00M198P05k031L876K0776N365j352r007q296k0440j2990
12737d0856O945J3550p241L25L670J1711Q269n202l990j7981j95M336J7530R458
12723C29o18m255Q79J4332J240R314o037j0138J1903m83j735Q948n669j7873K466
12708B603K288J954p980j1034N019l217J153O808J1448l893r849j3937l018J1205
12694a0450K229P978Q829R487j699j0026J351J940o394j5946k812Q314P987k020
12680a232N099L475L439j7141j8729K615L379J8395k934o482l050J642j571K322
$$ y = [-12021, -15584, -22525, -14026, -3702, -1302, -4367, -11640, -2326, 132, -11189, -25417, -11363, 13649, 14371, 3884, -5609, -17714, -17689, -9510, 2089, 2379, -4410, -7482, 1812, 11594, 23295, 18562, 1628, -21060, -21660, -17462, -16757, -18788, -14912, 5864, 11229, 9877, 870, -7426, -27866, -40856, -33911, -20361, -27602, -27277, -23607, -11896, -3627, -8829, -12819, -30800, -30995, -26659, -9129, 329, -289, -4544, -3665, 10667, 11907, 21221, 15184, 5046, 16949, 16466, 14731, 23679, 18010, 137, 2603, 4891, 6845, -1135, -12169, -7150, -10367, -9214, -2406, 9042, 5149, -4700, -18637, -21655, -10450, -8221, -243, 8586, 18073, 16374, 6348, 7699, 9639, 3245, -12701, -15513, -7199, 788, -1232, 3867, 7342, 10781, -6360, -25089, -22474, -19095, -700, -3634, -10116, -13166, -11524, -13095, -10773]
12666a0773j0810r416J1953M342q936r32r658l962J7384J9719o771Q305J4795
12653A5240J509j5908N928l852r789J2095J3914L567j1543M9n674M175J237P286
12639A8234j1560j3019J871L805J8693l371j4840o907j3045M302O722J581q424
12626a5958J4382m74K916o73l468J6528o843J0365n952j2022P393N962m994J2969
12612B0131l377j4541j6330R77J296K017J0067O392J1282n573j3352n877j1096
12599a7984Q677K0091n294j5300m905N125j448L203Q538j708M618m660j4855M204
12585a1698J9844j889r241K190J65L111M511n204l073J875J79N8M277L021j7888
12570i762L681J7684Q31o857j7047j2960L133q823j6262J5706K6065R474J693
$$ y = [-10773, -21583, -30999, -19046, -14704, -23640, -24572, -34230, -38192, -20808, -1089, -7860, 445, 15240, 16749, 841, 6769, 2917, -6872, 5223, 19137, 22704, 11161, 11210, 5536, 9711, 10948, 18234, 6674, -6345, -4474, -669, 18024, 14653, -187, -7094, -20139, -15837, -9115, -7534, -15958, -1576, -2050, 866, 193, -3275, 13253, 6410, 16775, 10823, -1199, 6194, 12156, 7162, 20131, 16754, 2213, -14117, -13140, -11844, -9827, 240, 6632, 17914, 12341, -1011, -6888, -17984, -9307, 10784, 5490, -9810, -14715, -9590, -11038, -7835, 703, -1005, 3613, -1047, -15902, -11698, 8146, 6257, -2984, -794, -629, 2482, 6993, 1789, -1284, 591, 770, 828, 5105, 8126, -9762, -6081, 11603, 12434, 5577, -11470, -24430, -21297, -30120, -46382, -30676, -4611, 4863, 6556]
12557F556k720k187J233j420o249J05q137P88l894o186j2169p433O245J3431J2282
12542i755k420L086J18k235L749j0544M17l230p528K129K195K292P984O06p557
12527b0693P76J5928N456J6354n562j6054K918J245K027j8194p161N296k725J012
12513a9377q853l635J4275J6232p292r650p574J743Q390r255j3000l467O324J7288
12499a7851J0912j499K364j3638n168J3450R554k823p101K011P901J1286k863
12486F535l844q127O525O685o409n000N80L593n891Q685o26o488j285R404Q469
12471A2806r598q57j6334m882J5473J2114j451R877n520j0677r774j6018p318
12458c2159l231J4926J2708O854p856M229J8937j0855l4852k615Q500J5985K1561
$$ y = [6556, 3836, 1649, 2882, 1462, -4787, -4682, -12819, -12031, -15925, -22111, -34280, -41713, -35468, -22037, -9755, -12175, -9089, -8971, -11206, -7457, -18001, -17584, -20814, -28342, -26213, -24018, -21726, -13742, -13136, -20693, -19917, -3989, 1467, 17821, 12259, -3795, -877, 368, 2395, -15799, -22960, -17664, -20389, -19377, -28230, -31865, -17590, -1358, -8650, -18300, -25874, -24131, -15741, -24996, -37996, -41463, -35139, -17851, -6939, -8438, -6074, -19712, -24880, -11430, -1876, -4699, -11800, -9789, -1888, 9398, 6535, 2691, -5436, 1089, 7774, 1365, -3635, -3055, 538, -5353, 3332, 2706, -3782, -5067, 4337, 12806, 3208, 2351, -13983, -18865, -3392, 8722, 7271, 17148, 11628, 951, -8823, -24841, -32159, -35390, -20464, -7756, -902, -8758, -4529, 14408, 3553, -31299, -33914, -25414, -9429, 12132]
12445A2132L193j813o54M119J4068j2104n394P529Q845k140l241j584j0911K638
12431A4683k75q767j356o817k1180Q29n029j1379J1190O030K845J1559P979J1223
12417A1535J67j2101j0838J3296Q466j4554m192J6559L381n286r382j373n009
12404i331l964L107J2831r730j7468j883M022J7335J4320l862j1859n227L721
12391g988M169p952k626m160l686L110J7343P913k0926j2628j7187J0939J7184
12378a6495J5266K031p125n496K568K1425r478k8659j4770J8151n379j6360J9204
12365b5117L5127k636m762M497j3332m956R857J7177j765k2691j9047J0221N124
12352a2303N661L885P336j330j77p076j87R750j1206l045R418m171p565L126P260
$$ y = [12132, 15325, 13512, 12858, 16977, 31045, 18941, 13547, 21076, 29921, 27781, 24540, 22956, 12045, 14683, 14408, 5641, 4285, -2532, -23712, -22883, -27912, -39291, -28101, -22071, -19226, -7667, 312, 11535, 11702, -399, -11237, 2059, 10525, -4029, -8221, 8338, 11719, 6433, -2949, -4322, -9331, -13295, -10188, 2643, -7087, -24555, -26438, -22416, -5081, 9239, 5377, -6482, -11709, -7988, -3819, -11771, -14397, -18557, -22243, -19133, -1790, 6123, -14803, -27431, -44618, -33679, -16495, -1229, 802, -6323, -11819, -9251, 12174, 2696, -25963, -40733, -22582, -27961, -44321, -25117, 10010, 7374, 2612, 7109, -6223, -11179, -1322, 15855, 14090, -8601, -27648, -17427, -12303, -6642, -2757, 4579, 3249, 3072, -4004, -4191, 5559, -5647, -8692, 726, -3445, -11010, -7884, -624]
12337f24L651k323k370r874P540J0638M081j623q101k295n632p313J7129R035
12323A1919r082l429Q585l559M498L550q377k879R791n319j2912r807J60R465
12309g396n889Q549p213K291K523O984P020J91o837k5913o469Q025J0837n541
12295a8838p980q011n075N795J3330j0344j2600K299J1350O119j0405J4740J8561
12282a059l290r676o59K443O331K1630P31j6313k573j116j536J3905J241P039
12268A7098q266L694q01p702N590p098J993J0450j9467k6052k188K1909J1178
12255C38N466j125n748L074o911R615K630p994K150j468Q351K623J5515l191m366
12240A8959j2316k610J5321J4096l14j7779j4280l338m460l869J219J847J3921
$$ y = [-624, 3027, 704, -1666, -11540, -4000, 6638, 10719, 9096, 995, -1300, -6932, -14245, 2884, 11919, 2837, -592, 7993, 4434, 8932, 12482, 4105, 1226, 11017, 5698, -7214, -17021, -16861, -7396, -13285, -4736, -11949, -9658, -7135, -151, 6869, 7060, 223, -25690, -32159, -24134, -13297, -18838, -26818, -34829, -39904, -34109, -20779, -31123, -43723, -41424, -30074, -23955, -34360, -19620, -1059, -4349, -14025, -14684, -12241, -5910, 15720, 16451, 138, -2435, -3551, -5087, 8818, 10059, 17098, 8832, 12526, 11725, 4023, 9613, 2515, 4508, 14958, -4509, -30561, -32749, -10840, 338, 5804, 4679, -1069, 2005, -4906, 4709, 7339, -655, 1495, 27, 8378, 11001, 26516, 23325, 18959, 6643, 4033, 19354, 33450, 33136, 15357, 1077, -2261, -6721, -10590, -9371, -7524, 6397]
12227F397q112j3892K02J1181R726j6747j8221Q51O535r568M869P297J635j4949
12213c2796j3969J0276J189p45r05J5724P18K804Q589r841K70J931j1596J4322
12199a4029L0501j0866j2963j4042M272J3038m822r368J8K952M802r485q574K1870
12185f696K605j26k3837q03R749J8044J0485J0726K327L361n794j7912p455J4348
12171I022J428j0251l945J3648J3147l363l289J8666K415K663j4176p557p49k873
12157A4786R361J1856j3729O606K448J242r466k905k202r963p950N494L625k993
12143F210l229j0760L396J1559n710j1401N357J315o430o69J8816j050N763J2634
12129B5801p909o850o667n493n795M189q761J729J0646J4214P666j5466J0425
$$ y = [6397, -1715, -15607, -15405, -4224, 5502, -11245, -29466, -28615, -22080, -31648, -26779, -19482, -17847, -32796, -46765, -36489, -35300, -36045, -36950, -21226, -20508, -17704, -9115, -18956, -18686, -16755, -28351, -14029, 16472, 5606, -7357, -21399, -17127, -4089, -8911, -18279, -18261, -15309, -10507, -19992, -28566, -6696, -4091, -4217, -28054, -28857, -19108, -1064, 9421, 20147, 22474, 25835, 20041, 2129, -5326, 9022, 10450, 199, -3746, 9902, 23049, 19686, 16397, 35063, 37478, 40141, 25965, 18408, 17659, 14786, 24147, 36003, 22274, 28880, 31328, 32570, 23104, 20199, 17997, 8034, 84, 5578, 9203, 6210, 2981, -7779, -4383, 7176, 1466, -9935, -4578, -3263, -9693, -10362, 8454, 7404, 13167, 25801, 17892, 11042, 4375, -1118, -6913, -2724, -11485, -9756, 890, 15104, 22770, 7304, 17729]
12116A7729pJ310q986j2810K340m420N077J4960k952M393o54p403j5751Q108P565
12101H499j2492M700O941n226j2929p239J5798J0887R302q373p005M089k324m569
12087E9r074m265j0185N29Q969j0793J1019J1414j2675p389Q297J261N368Q662
12073A197Q55n697l042J2373N183J1118p990j6212p04J4187J153m764j9392m854
12059a6589M787J6241m583P553Q926m114j5951j2785J8434J377m915k82J45J3676
12045A1920K555m429K845N479m688l716o572J095J884n817J714k616K886M349
12031F889j740n057j2668K00Q382J1188L497l011k672n019l081q280j6430j1901
12017c9703L0590J7814q985r367M041r666o299l804n146J1560L955K971r201K083
$$ y = [17729, 17722, 19032, 10046, -2764, -424, -4844, 233, 15193, 12241, 16634, 15980, 8577, -7174, 934, 8499, -3993, 707, 7648, 2422, -10507, -17746, -1948, 8939, 18241, 9868, 2863, 6952, 4628, 59, -9015, -13280, -23465, -22936, -13967, -24760, -13741, -2327, -15002, -22391, -14094, -12833, -7465, 1197, 2052, -3645, -6687, 5686, 10869, 21987, 13997, -2215, -2919, 11268, 12421, 7657, -11735, -16589, -11802, 4439, -144, 7409, 16335, 12221, -3730, -16515, 1919, 3296, -1619, -1901, -1756, 11920, 14475, 10046, 12891, 18370, 13682, 9966, 3394, 4489, 6373, 556, 2270, -346, 2540, 6889, 5149, 92, -12576, -12376, -3994, 7194, 10691, 7680, 5008, -11, -3092, -11372, -27802, -39703, -9113, 8701, -284, -9651, -5610, -15276, -21575, -25379, -30525, -18965, -15010, -12039, -21240, -19157]
12003a9157N558j410q521O387R876j19J812l361P670J2628J1699j4646l0547r937
11989c2068K784J0541l797j1287P21r488M811P962J2995J1667m54M68p662q084
11975b0891j629M228J845P480L128j1969j888J0739J4549M552N826j3699m134
11962a863m350K12R207J0819o317j7001j0237M683o50P96O221N697J4845j9667
11948g605n818r522p288J933Q052K1258J3856p927q223Q251m203m155j5020j0384
11934b6795n046j729n930J3198J3094J5169L485j1048q879p263J3633J9423j066
11921A0246j3682q419n657k571K263K692m181L57j7747j3517J2779J4294J1565
11908a1578K805j5115j6627l304K5916K920j882O703j0396p881P707J1377l333
$$ y = [-19157, -13599, -15009, -23530, -17143, -7267, -7386, -5574, -8935, -1265, 11363, 23062, 8416, -22131, -32068, -29284, -18743, -22540, -33827, -33106, -42594, -37783, -29821, -16826, -5159, -5613, -5145, -12807, -20891, -22520, -18292, -16447, -8967, -5839, -17808, -19696, -8957, 5592, 10144, 15970, 2271, -1863, -6213, -6001, 3206, 14025, 7708, -9293, -19530, -14847, -15497, -14701, -8480, -2783, 12062, -7605, -13423, -22945, -30233, -28300, -20248, 1010, 14866, 6939, -1284, 6967, 2764, -1391, -16411, -26795, -31841, -33570, -39500, -26302, -13208, 1961, 5446, -5602, -14481, -21744, -8111, 11312, 10246, -3436, -11855, -17512, -20083, -17820, -15128, -19309, -18952, -36699, -50216, -37437, -23143, -11578, -8773, -23888, -40515, -43819, -17903, -14983, -16865, -10162, -20558, -28439, -20732, -9355, -12688]
11895a2688R477J2117p745r007J670Q946j0415j5042J688O220J9537J0759J2359
11882B7876l996k9991r300L629L019J2803N249L333q585N308J1060j8386j4353
11869a2334J425j95p191R233J1699N919k343j5187j9800M10J5688L103M256j1008
11855a6325j2147q422K933K3500N732K738q999Q63J873m664P200P500J2507Q998
11841B3287O081L50j4153j6834j0962N680r211j3813K1091J1903P195L567K610
11828A6791K45j2588q829q714l650l448r11M673O274J4616j9272j4937O003M145
11814a9602M992J0325m431p620J1279n619j7261R890K1157J2273K725j389j2568
11801D151k184Q404k0699m018q66l723j1080J0764R486Q173o000n61o136n791
$$ y = [-12688, -3211, 8906, 1161, -7846, -6176, 2770, -7645, -22687, -20999, -14779, 4758, 15517, 27876, 23880, -6111, -15411, -11782, -8763, 4040, 9289, 12622, 4037, 9345, 20405, 2019, -12334, -10909, -11104, -18295, -9062, 2637, 8556, 6213, -8974, -28774, -28364, -12676, -9573, -5317, -16325, -28472, -36894, -33961, -10461, -4729, -1991, -10990, -10127, -8254, -12918, -5718, 1782, 14289, 23287, 29368, 29718, 15565, -1269, -12231, -6551, -15762, -29575, -8484, 3419, 10614, 14181, 16791, 17036, 4448, -4381, -13095, -16745, -20193, -21104, -16431, -10157, 4459, -14813, -29750, -23747, -19602, -14610, -4285, -8716, -16336, -5057, -10676, -27937, -18047, 3110, 15383, 18108, 16719, 4151, 1967, 10371, -10328, -14346, -15212, -18935, -30015, -19251, -9765, -1592, -7592, -8153, -14289, -20080]
11787b0080J1626J8147r10r959L461M934j2425m107J0601m517j3196j0051J052
11774b5424k379k688m063M514Q95M366q605l867P437J2430J4957J6178l138o266
11760D347j1090L935J2537K952r87k436k033j1248j5434P157N502k467N059l719
11746g925p463Q864J6386K519o440N633J0745n695j388Q806L29j3670q029k4204
11732b1532M755J2564K133j965k71j2064M218M36O067J3683M541k1829j0514J1642
11718h136j3570l350j674J5476P894j0311j9530j178J0292n199j2203K631K803
11705c6055M266J8469J5972l769j1549j482K133k590J643n296N972N000j2423
11692a9709j1557K454J7146q98J400J1034P200M841n340n470N077p663N399K358
$$ y = [-20080, -8454, 9693, 8783, -1176, 2285, 7219, -5206, -9313, 1288, -3229, -16425, -26476, -25424, -27803, -30491, -34554, -30040, -29145, -24779, -33384, -37251, -29814, -17384, -2427, 13751, 10613, 4347, -6743, -2808, 9729, 12681, 11694, 9258, 7225, -4023, -19457, -12300, -6798, -9265, -4206, -7925, -15388, -6524, 9862, 12381, 5941, 11574, 22319, 16624, 15236, 24042, 24371, 10701, 2672, -21532, -16777, -4213, -2080, -4045, -4316, -16380, -12162, -11726, -5659, 8024, 12565, -9264, -19778, -8136, -21706, -25056, -26730, -11254, -3360, -13671, -33201, -34379, -24087, -29286, -41489, -38858, -36055, -31789, -13320, 2652, -1117, -12666, -14148, -12015, -14605, -12962, -18258, -12286, -7286, -19709, -31266, -28812, -11666, -12564, -11164, -130, 7070, 11911, 6571, 1101, 6178, -1485, 3914, 6272]
11678F272p264Q127M695K438q665m042m367j2384k493J056J967q397k492J1675
11664a3874J4206k377k7141j8242N523P575p811Q039J0267n083L838N259O085
11651a3736m91k436J2737m290r05R92J897k003K238O998O873N290J4284J0639
11637C8087j7412j5876o458o819q292L265K272m238m684l567l844Q39p19Q68J9672
11622f906K964j2100j4938M395J3455J2330K119J565l959m262j0508P880J290
11609f675q93l551k364M879N713q763p060o497o1l614N956J554J6229L974J6443
11594A5270l66k0953k060j1777q39j331R651N370P09J414O514j0538P167L935
11580B166o707K869j1353j252o858m754o510K088L599K2003J0143j2303k2647
$$ y = [6272, -992, 7135, 11830, 14268, 5603, 1561, -2806, -15190, -17683, -16627, -14660, -23057, -25549, -13874, 332, -2045, -29186, -47428, -41905, -34330, -42141, -34102, -23835, -28918, -25080, -19821, -13736, -14227, -16663, -3926, -8216, -9121, -8129, -6232, -8235, -5997, 1001, 7874, 13164, 27448, 38087, 20675, 4799, -1659, -8478, -16770, -13505, -11233, -15471, -20155, -23722, -27566, -26727, -27446, -26578, -6906, -3942, -16042, -30980, -26585, -13130, -800, 1319, 2884, -1075, -5337, -15845, -7965, -6675, -7568, -11119, -13483, -8604, -2891, -11654, -18714, -25211, -25272, -28886, -22930, -21376, -5147, -1173, 15270, 14904, -6049, -8109, -19886, -20725, -22056, -12405, -7035, -6326, -4912, 1602, -8936, -1769, 2166, -4541, -1672, -13025, -14277, -21135, -25889, -32399, -30311, -26712, -4709, 5434, -6869, -29516]
11567b9516j0464J6846K0578k298k1916l019J1529p55Q016k417O903k0329l93
11554b7235J1592k313j2085l649P712J7558P805j2589p74J1969J4071r027j1261
11541h226p84k75L756J97q461j128P806J4031k741j0818q912N248M117J6468m569
11526E709j0651j3j155j5322L45Q511l751l376j1722j2358L082M173k392R978
11512b8942J9326j154l798j3062l55J1911m205n421J581m962o679M987J5556K389
11498a2828J9760J817p143K765K188o247J360k163j6169m610n475N57M462K325
11484a9401k094Q39J7814o089K096J5404q608j76l77j5650r203J1186O264J6022
11470H027l013o798j5420r804j399N330J936J1509Q77n718L53J4963l697j0555
$$ y = [-29516, -39980, -23134, -2556, -4854, -26770, -29789, -18260, -19015, -10999, -13416, -6513, -26842, -27235, -15643, -17956, -30041, -33690, -25978, -8420, -615, -13204, -13978, -2009, 12062, 3035, -8226, -9010, -9285, -5529, -5332, -13793, -14921, -7115, 6916, 4175, -6643, -15555, -10307, -6190, 10278, 5709, -4942, -4955, -6110, -21432, -21087, -12576, -16327, -19703, -31425, -43783, -40701, -36528, -38920, -28942, -9616, -10770, -14568, -27630, -27985, -16074, -20279, -25700, -24119, -29081, -35760, -30773, -15217, -12828, 6932, 8749, 1606, 4371, 6559, 312, 1672, -491, -16660, -21270, -26745, -26188, -21726, -19401, -21495, -20656, -2842, -8931, -6835, 8569, -39, -215, -592, -16242, -25445, -14259, -7995, 8027, 5014, -1784, -17204, -27008, -28407, -23077, -21141, -9632, -8755, -14473, -14120, 843, -2854, -13409]
11456a3409j071j471M8J0844k367l780J7498Q605j2281n503j1568o134L853J3515
11442c221P189n527m577J0373J5501O231n505j1008j9371p856J578K1104r786
11429d875j3655j440j107L416J4470J6292R151n226o718J074l606p355J4326L555
11415A8302P20O64o948k2001j9229J5905J2657q392l889K898J399N233m287j4305
11401b1273q126Q290L861J1293R979N936j6345l696O869j121j3788p556l572r199
11387c8448M651L738k287l429O934K3781K0046N480j1132q209K730j1134M555
11374b724P209Q425k565j2597j2699L202K576O610J345J0706M35k1708n647j18
11360a7550J7952l44m450J2337J1286p325l088j0537J0496J8311n349k5088k515
$$ y = [-13409, -14480, -15951, -15903, -5059, -7426, -11206, 6292, 14897, 2616, -2887, -14455, -20589, -16736, -3221, 3968, -1559, -6136, 4237, 19738, 25969, 20464, 9456, -9915, -17771, -16193, 4911, -4875, -18530, -19970, -21077, -17661, -3191, 13101, 22252, 17026, 10308, 11382, 7776, 421, 14747, 18302, 19022, 19686, 12738, -9263, -28492, -12587, 70, -8322, -12211, -9313, -7914, -2681, -6968, -21273, -29399, -21109, -17248, -5955, 4024, 9960, -6385, -10081, -3212, -4333, -18121, -25677, -29249, -38448, -33797, -30059, -32346, -35775, -28841, -5060, 14986, 20466, 9334, 1125, 3855, -7279, -2724, 4485, 12910, 10345, -2252, -14951, -11749, -9173, -2563, -1218, 9488, 9923, -11785, -17432, -17550, 402, 58, -4392, 7945, 19231, 11906, 8818, -1719, 8777, 27088, 21739, -3349, -5864]
11347e864j42N92l408R73J0328n043j4356j5200p152J1493J3803K766J1556O261
11333F607j1959J1558n611q119p711K940O931m941O997K125n483M997N85K2333
11319B1249O007m028n106p998k423L62q494m047k915Q800J1949j6970r343J0020
11305b937Q146J124j6735r729j0816k142K793L830K258O885K1484K5586k19m563
11291B4965Q639J1613n772o569o263j2965n323j7581O131k671P94j2217j305L546
11277a4978r171k190O762R788Q898q326L507k9244j1064J0328J1746M509l495
11264b2930q380J7251l723o243K567L12k540P443O172n642J309J572J2934L624
11250C726L277J146p811j4168j6839Q956J5520L806o567J749N942o11J686O419
$$ y = [-5864, -6006, -5414, -8822, -7849, 2479, -2564, -16920, -32120, -39272, -27779, -13976, -11210, 346, 6607, -5352, 6206, 595, -7524, -15235, -12295, -5364, -10305, -3308, -1183, -6666, -1669, -1084, 21249, 27256, 23228, 18122, 10124, 7701, 8063, -431, -4478, -7393, 1407, 13356, -3614, -12957, -2937, 5209, 6333, -10402, -20131, -30947, -33089, -30296, -26466, -24208, -17323, 4161, 29747, 29528, 24965, 33604, 45217, 39445, 32876, 26613, 13648, 8325, -9256, -3125, -5796, -5002, -17219, -18524, -14978, -24149, -26339, -19577, -9789, -891, -9217, -5710, -34954, -46018, -35690, -23944, -19435, -22930, -31310, -14059, -17782, -24025, -21458, -21146, -23686, -16243, -10071, -15713, -14404, -12832, 102, 3726, 7003, 8149, 338, -13830, -30669, -21713, -6193, -2387, -8954, -7205, -1263, -1874, -188, 6231]
11236F231q273K479l450k375j4838L8R680l51Q125L14J234J1520M444k552j7674
11221e448r262L638O81K1k733o903q000p489O485P737J0019m07k856q219N769
11206a6967J5570j615M331k865J263j083j4234j242K52J0840P223N026L629k889
11192G239p246l951O98M991j241L087K3762J403j2872j4749M737L62q299m920
11178f999L354J8467J2590N49j3985n943k389j2638p389R571M915K5j1900K69
11164a1503N165J5023m721j6546K155P544p5q148o22p452j1068J8305k668j1641
11150b6252l88J3219M10M317j6822M394K506j871n657J0700R026k122L925p14
11136e329j107m926N857o06j0169P040j892o216m286j424O626L08J952j347J0394
$$ y = [6231, -2042, 437, -3013, -5388, -20226, -20188, -10508, -10859, -2734, -2420, -1186, 10334, 14778, 12226, -5448, -14710, -11072, -10391, -10370, -13103, -20006, -28006, -35495, -29010, -21273, -11254, -11661, -14517, -22736, -16967, -1397, -3012, 1319, -1546, -283, -1366, -15600, -16842, -16590, -5750, 1473, 6499, 10128, 7239, -7, -3958, -3260, 1731, 490, 3577, 27339, 28742, 15870, 1121, 5858, 6220, -2079, -6999, -3645, 14822, 27412, 27961, 13976, 8033, 5644, -6994, -14383, -4812, 103, 128, -11772, -11503, -6338, 8685, 3964, -12582, -10427, -2883, -2958, -11106, -11728, -19180, -30248, -11943, -14611, -26252, -26640, -13421, -13011, -8694, -25516, -21122, -18616, -20487, -26144, -15444, -6418, -8540, -4615, -5329, -6436, -11362, -5505, -6111, -16280, -9240, -11132, -17348, -21634, -23058, -16432, -16124, -14172, -15519, -5125]
11121e125p960o907J757j485O704L074j683M070M695M052P86k293l510J604K445
11106B24j8538j7366L106J6875J0619q5M28j128n800p218J1278j61j366j2508
11092b1640n891J7286K284o671j0763J2050J097r772J72J5569R284n408j0517
11079a2920O635j2400j2268R439J3480J0618L769o823n070K478J6514L902k276
11066A5078P064n875M353J5707p719j8303k008K17p623m568N90j4730j7747j1523
11052d7087j3485k437K7464K6289K151j458j4629N097K932k439o552Q45K342m193
11038b5160Q437J4607J2708q450p002j2471P575J2182J7407l043j134j9416j3982
11025a7742P403J4622J1599k234j4498k1163r476K6896P031k43l36j2449m196
$$ y = [-5125, -13085, -19992, -18235, -19720, -13016, -9942, -11625, -7555, -2860, 1192, 1978, -315, -3825, -2221, 224, -18314, -35680, -32574, -15699, -5080, -5165, -4737, -5865, -11665, -18883, -7605, -7766, -9132, -21640, -27531, -10245, -7961, -14632, -25395, -13345, -12248, -22020, -21848, -6279, 3005, -2403, -12920, -6285, -18685, -30953, -21514, -8034, 2584, 6353, -470, -5540, -3062, 13452, 17354, 15078, 22142, 16267, 20620, 36327, 28608, 10305, 8297, 8514, 891, -3677, -3087, -17817, -35564, -47087, -60572, -63009, -35545, -9256, -7105, -8563, -23192, -18095, -15163, -17602, -24154, -23309, -20967, -25160, -16723, -2116, 10592, 2142, -4860, -17331, -9756, 2426, 19833, 16790, 15656, -3760, -17742, -10339, 4283, 15882, 13648, -850, -22013, -31489, -4593, 2438, 2195, 1859, -10590, -14786]
11012a4786J5533M034j991j7274j829l179K650N816O558k050l483p10k589K275
10998a1025P049P296k662j5812k034J2859L282l593o431J3573R957Q634j396j223
10984A8474J894K947j2739L466r575j2260O79K6372p220r703J0057J1141r646
10971A3887j1055k064p98q246k195o380M904M64k0448q586K0218J4864n946L588
10957g793R164l09Q029J52j3867q953l267J0868J829n610P81M21L56n187j0380
10942b3766N543P988M194P1k144Q50j385n039K50j279R922n08j44J5134j840j0878
10926c031l727M795J6237n562j773L515J0834j831q116j5359j1806n511K137j776
10912b0974J2058N234R767r030n875Q165q078j1689J2980L596O378r536L941J3143
$$ y = [-14786, 747, 4781, 2790, -14484, -16313, -19492, -16842, -11026, -4468, -6518, -10001, -10711, -13300, -11025, -3976, 3320, 658, -15154, -17188, -4329, -1047, -4640, -11071, 2502, 12459, 21093, 19697, 18474, 20368, 23315, 10576, 14042, 4467, -7793, -7114, 19258, 12038, 2335, 12392, 23533, 13887, 2832, 768, -30, -8276, -10471, -16851, -11947, -11483, -31931, -40517, -20299, -5435, -11381, -7793, 1371, 1062, 9091, 9243, -4624, -13577, -16844, -5976, -4147, -9757, -8976, -8555, -8199, -13386, -23766, -18223, -10235, -6041, -5970, -8114, -7264, -8649, -13688, -13438, -14717, -4795, -5303, -5447, 9687, 7847, -3031, -6758, -1963, 14274, 8712, 6939, 10454, 21288, 19457, 11341, -4018, -15824, -21335, -19198, -20974, -8916, -3682, 6085, -2945, -8820, -655, -8733, -20422, -7442, -3846, 2532, -7004, -3063, 10080]
10898A0080m345j9646l320J0788J28q034k415q492M584L172q686p40j833J718
10884b7041m690j5172m941N448J490P787J4629Q550P355J5579J395j0750j556
10871a917J923J0651M247j1656r582O443o219q326N129N523n512j5853j9372J4174
10857c0347P505O265m686k024N477J5598m47J420j848m357N834k920j0869j4312
10843b9711L786J1604N16N31N665m658P637N366k56r570r233O410K774J063j5647
10828b3723m304M987j804J7282N009j257k572r707j253J4595O779J5928j997O444
10814B4407m023j6242K756N08j7894j0604o262Q705L595k650K757m796J3233J4395
10800G885O99j7979m806j4687r380J2917J2351K042P168Q077J035j8796J0073
$$ y = [10080, 5735, -13911, -17231, -6443, -6315, -14349, -16764, -25256, -20672, -17500, -26186, -26926, -28759, -27041, -31731, -46903, -51844, -46396, -44906, -37119, -22490, -13940, -6585, 8994, 10389, -361, -1917, 6, 10657, 14904, 3248, -6334, 109, -6110, -14436, -9307, -3784, -9296, -25149, -44521, -30347, -22842, -16577, -21263, -23287, -17810, -2212, -2659, -1239, -3087, -7444, -1610, -4530, -15399, -29711, -25925, -14321, -13805, -13274, -7609, -12267, -4630, 736, 480, -9090, -18323, -11913, -9139, -8076, -23723, -28027, -23040, -24844, -7562, -2553, -3810, -6382, -16089, -17342, -2747, 4032, 19960, 17963, 24407, 20384, 4142, 6898, 7406, -10488, -21092, -27354, -18649, -15054, -17704, -14947, -19743, -6510, 7885, 8584, -9395, -14201, -28888, -38268, -25351, -13000, -10958, -3790, 4287, 5322, -13474, -3401]
10787c401J2963J1596j1740k5812k238j188J6264J0294k536j1731j339j800o151
10774a6819J0675J0057q173n553j3041q56N954P34O444o28J124k151Q560j2948
10760a6621n858O164l16J4422K087p135n076j640J5125n026m741k777R112J130
10746a150j2181P59p011k619n36N853m095m160P89N082p841j457J3500L488K348
10731i231r971j161J1722M282j2885j0762j3554k305O308Q89J7864J0475r567
10718a7896l776L390J1051J0152Q386j3688j0818K819m243q772P318J1446j3689
10705a8320l538K3607J3906M409j0011l037j9603j4781r671p389L925k649q51
10692d4003J1338J2910J1750J5635n995n628O318J072N493R770j2275j4770p010
$$ y = [-3401, 9562, 21158, 9418, -16394, -18632, -19820, -3556, 6738, 4202, -7529, -8868, -10668, -16819, -6144, 3913, -4260, -9813, -22854, -23710, -17756, -17022, -10578, -11206, -10082, -12233, -3673, -16621, -22479, -16315, -16631, -2209, -122, -7257, -12333, -13973, 1152, -3874, -8615, -11392, -2280, -1150, -13331, -12572, -19583, -22202, -22738, -16885, -20980, -25140, -24351, -19269, -27110, -28567, -15067, -11579, -9231, -19202, -20363, -8641, -4359, -17244, -28006, -41560, -43865, -37557, -36668, -18804, -8329, -17896, -21672, -18282, -7231, 2921, 11307, -2381, -13199, -10380, -14623, -23395, -16077, -4631, -18320, -21858, 1749, 15655, 20064, 10053, 7016, -12587, -27368, -37039, -44428, -40503, -43152, -44003, -32665, -19755, -8005, 7630, 1635, -3993, 2325, 3397, 8890, 18660, 6385, -8385, -15395]
10679a5395J6969J520j7185o138K062k364P808R225J2805J6058j2457j0464j3156
10666a0712K035J7358o328q454k006J92L566j0602J3097R159q626o951Q635J6688
10652A7051p406j0251J486K302j8867O949m299j2270P888j0576n818K8439J0255
10639D883J670J9243r87j8556j2552o716K26R063N719n86r937J61N266q951L467
10624h587k515J1109l060J386J0606R718J0400L759k0017m609j95k626M498o70
10610I197J01q774j4011p041j362J5212M677j932k335O274P068L670J022o671
10596E095j412P296j249J2385j1110K506P976m120M413n50N841n174l750r379
10582H768n885N158j0448r837n960m197o103N924L171O636Q878n015J780m293
$$ y = [-15395, 1574, 3094, -14091, -20229, -18167, -20531, -12723, -3498, 9307, 25365, 12908, 2444, -10712, -8677, 8681, 2353, -6101, -8107, -7915, -4349, -14951, -1854, 7305, -1321, -8272, 363, 17051, 9645, -606, 880, 3182, -15685, -8736, -13035, -25305, -17417, -27993, -33811, -5372, 4883, 6553, 25796, 24809, 6253, -6299, -13015, -12789, -3726, 1993, 1407, -8530, -8369, -3103, -12054, -8587, -11102, 7, -3053, -1667, 8939, 18657, 29057, 32816, 12799, 8190, 7995, 5369, 9867, 9197, 9298, 524, -13487, -20528, -21890, -6678, -2001, -3933, -6268, 6, 7074, 10744, 11766, 5095, 3683, 10979, 9730, 22115, 11005, 13511, 21487, 17367, 21780, 21230, 27071, 21897, 18147, 8768, 2883, 8041, -2407, -12244, -18204, -22401, -28504, -22580, -19409, -12773, -3895, -8910, -7130, -11423]
10568a1423j5857p734J0011J5759Q319J374p300L816r43o215n682L845P764l147
10554g413l499N129o710K306O9j132j875j311l916k421R01Q158J2187O524j6206
10539i209j4212j033Q095K430n021p568j1227L104O121J7586J5081L185o419j5409
10525a4496m132N908O477M555J6107l107j3101n505Q915m043R947R20l301r897
10511d753j1464m104J6349j249p747n686M929p289j284R517l609O472n527j307
10497a6752O659M537J506j0989j1467j192R076N603M806o082M22p311o980L251
10483b4913J4861L146J685L262q934j2346L060m106R645P391j7017j3515m980
10470d2761K323Q556K4850J5065L349r698k906m794j0025j7434q693O967J3801
$$ y = [-11423, -27280, -35014, -25003, -9244, -925, 449, -6851, -3035, -3978, -10193, -15875, -12030, -4266, -7413, -10912, -5783, -12493, -10187, -10118, -11250, -13125, -14436, -18352, -20773, -19872, -11714, 473, 6997, -9209, -23421, -24454, -16359, -13929, -18950, -26518, -37745, -34641, -28520, -10934, 4147, 7332, 913, -14496, -18628, -12720, -6243, -1688, 14419, 11312, -1789, -7294, 1621, -2422, 7525, 8445, 5144, -4753, -16217, -20321, -3972, -5221, -12968, -18654, -13725, -21014, -22298, -12781, -16390, -9918, -15445, -16752, -10093, -5556, -4050, -15039, -26506, -27698, -18622, -13019, -8213, -14295, -13873, -21184, -28164, -24913, -10052, -6906, -5221, -1959, -10893, -23239, -20179, -24285, -14640, -7249, -24266, -37781, -42761, -40438, -31882, -7032, 8033, 11382, 1684, -1222, -6016, -16041, -33475, -42168, -35201, -21400]
10457b1400J1974J1252J853n916j0307n002J0071N506l077q678j0676J38j166
10444b5428n070N300L056J1449P232j535j0347M453M450j821R1Q565J4275J1465
10430B6135l158j3099k1624K898J0851r414L425j6972N025J4339n564j8275j1378
10417c6811R30l639P644J0431L336Q946O990J0798J230r131o243Q07J235j1481
10403a4958r711J1339J4974J0431j0762J725J6896o549J209j1182r364o915P47
10390a2120P228L749r286j2253L584r49J2945J9755L432q318j2577J136p378m467
10376a5519J4330J0990p367J722P95p277k6724n554J7849J4504J472R06j1109
10363a0982j4999n812J9068N945K846L745q548N848R534j699M731J121k786L476
$$ y = [-21400, -9426, 1826, 3679, -2237, -12544, -17546, -7475, -1969, -5046, -13724, -24400, -24262, -25428, -30498, -25198, -22142, -10693, -3461, -4996, -15343, -10890, -6440, -8261, -8170, 395, 14670, 26135, 22977, 9878, -11746, -8848, 2003, -7411, -3986, -20958, -15933, -1594, -7158, -25433, -36811, -35881, -39520, -31876, -21445, -18109, -9163, -2173, 8625, 9855, 724, -5519, -4712, -3477, -14958, -24669, -13330, 1644, 12075, 1313, 3038, 19934, 13385, 14594, 3412, -5952, -12867, -12120, -4892, -1143, -10429, -22682, -19098, -20047, -7102, 12653, 16085, 7767, -4810, -3674, -11052, -15519, -1189, 9801, 2434, 4156, 4951, -2326, -29050, -34604, -16755, -2251, -779, 127, -10982, -25981, -31793, -12725, -6780, -3934, -189, -8737, -2889, 6645, 4946, 9677, 10798, 8012, 11488]
10349A1488J193n032j486P172j2042j985j0779m667J3839k97k004J7402K520o615
10335H707j515n700m554K840N84j1278L586K188R107o164L14l137O728n324p20
10320d338o41J415J30j3890j951J761O088M450Q025P71l85l394K90k667q24Q092
10304B932r595J2514R445j5051p920m538J506j4773N5J1356Q575q149J66J3932
10290D55J4699r132o374K40J95k944m655o634K857J1945l969m289m413m272J0017
10275f274J1285O609j971j3065j6910n194J2097O644J2783M766q960M187K621
10262H618m398m682J2944k821r645k295l792n741j428J2031n021j7444L294L934
10248a6446P59O594J2806L113j2207m897l888J97R94J2326j5137q227K690K954
$$ y = [11488, 12681, 7649, 6163, 13335, 1293, -692, -11471, -16138, -2299, -2596, -4600, 12802, 15322, 8707, 7192, 1492, -3062, -222, 362, -10916, -7330, -5142, 3965, -2199, -1885, -5022, 1706, -3618, -4338, -4979, -3564, -3434, -17324, -19275, -17514, -11426, -6976, 1049, 1820, 1435, -1959, -1669, -4336, -5160, 2932, -6663, 5851, 15296, 245, -7675, -12213, -10707, -25480, -25425, -14069, -5494, -13643, -13477, 455, 15154, 6022, -352, -112, 83, -2861, -7516, -14150, -11293, 652, -3317, -7606, -12019, -16291, -6274, 5011, 11620, 9649, -3416, -20326, -25520, -13423, -6779, 6004, 10770, 1810, 5997, 8618, 4220, -462, 12482, 9661, 16, -2279, -6071, -11812, -13240, -1209, -6230, -23674, -20380, -16446, -15687, -9093, 3713, 6826, -5381, -10278, -14166, -13969, -12975, -649, -15786, -24013, -21323, -18369]
10234a8369Q433j248n940K238J4407L128N896j937L381o861Q006k172M794J6766
10220C0522J324O278j1834q475L086p674o018m173q370q769J716m766j499K721
10206a5931m32R978N652O581l774j1545J02K588O214Q227R582j4610r739p168
10192a4275M211J9391q79n189L671j664k790O719r800r849J6159J796L058m069
10178F490o561K773J1789m593j010l45j0428o891Q244J160l417q662P090q359
10164a2720k807K396M650O621J8193Q086q487p929j6965q400N29k629L678N237
10150a0547Q206j5632L408R164k708O871J3491L653k0358k921J3105O063o890
10137D905L959l012j1785J1712N706Q25m575k052o325p040k801M672L554r352
$$ y = [-18369, -9936, -11184, -17124, -14886, -479, 2649, 8545, 6608, 9989, 3128, 11134, 8962, 13756, 30522, 31846, 38124, 26290, 17815, 20901, 13227, 7209, 3036, -5334, -14103, -12387, -17153, -18652, -15931, -16363, -6385, -733, 5848, 2074, -9471, -9369, -6781, -567, 7660, 17242, 2632, -7107, -14275, -10064, 9327, 8448, 3259, 6930, 5266, 2476, 9195, -605, -10454, 5705, 7501, 10559, 6490, -71, 2702, 14491, 9898, 8888, 8543, -1885, -8776, -532, 628, -2789, -11451, -4361, -12720, -15527, -13131, -8481, -1860, 16333, 24419, 15932, 8003, -8962, -17362, -16833, -19462, -15784, -10547, -2341, -17973, -14565, -5401, -8109, -1238, 12253, 15906, -4452, -7373, 5732, 11795, 4905, 8864, 5852, -5933, 5779, 11485, 12310, 7735, 5683, -642, -7682, -10483, -5811, -2257, -11609]
10123a1609l106Q541q578J0178J3928j2629j4128J6546q037j1313O455O082O9
10110g601j0502p426J5594J7202K2113K251o395l585m883j2799n00m816J178r57
10096a126J9225K721r513Q407Q11O454J4265M195j6778j3312m802o70Q98J006
10082A1781o768o034j7414j444P006j0423r188J1883P862J2688M442j5807j0522
10069b1938N093N932o09M463Q815J3825o135o702n319n263j2147K351O810j3882
10055b4706J0868J3971N448R690Q495J4552K1769K7159L2189L1791J4448k145
10043A63529j3790K041M666m5444m4423j4443q113j5512J7805K718j6994j5623
10031A6417J5067p193j2557j2223O422P447L226j068o365o696r73j820l871o27
$$ y = [-11609, -14715, -6174, -14752, -4574, 9354, -3275, -17403, -857, -8894, -20207, -13752, -7670, -7601, -18103, -25529, -9935, 7267, 29380, 31631, 25236, 21651, 16768, 3969, 3469, -1347, -169, -1126, 18099, 20820, 11307, 19714, 20525, 26979, 41244, 45439, 28661, 15349, 10547, 9877, 10775, 11781, 5013, -1021, -18435, -19879, -12873, -23296, -32484, -20601, -12739, -51, 4391, -11416, -21938, -16845, -10913, -11522, -7059, 1756, 15581, 9446, 2744, -2575, -7838, -19985, -17634, -10824, -24706, -13838, 133, 5581, 15271, 23766, 38318, 60087, 87246, 119435, 151226, 165674, 163529, 149739, 151780, 156446, 111002, 66579, 52136, 44023, 28511, 46316, 49034, 32040, 16417, 31484, 24291, 11734, -489, 5933, 13380, 16606, 15538, 9173, 2477, 1504, -316, -4187, -4814]
10017d814R005L979o007j6108J917J5367o774P753O414K706p61j7449j3311k478
10003b0561J614j058M882J9089K738j8932j1574P659J784j2026L749N872P319
9990i445J4386M295q431p558p734J2818n997j026r474O7J339J1436O733N805M253
9975A1467k0406j1142M963J0019P2m1K387o011J3966R966j0936j6287j6392K363
9961b6012J4257Q64j0089m79J3152L025L815j2628n159J4963J7521l768j8872
9948i410j368L0500K84q766o54n134r458j3504p222J7980K234n196l789J7724
9934D221m00n336O290J0775J4023o775m657o868r887L531L994O677o066m065J4849
9919B0306k312j2444j386K1094k782j3104l639o532N028k25J669L813o767k268
$$ y = [-4814, 4191, 8170, 2163, -13945, -12028, 3339, -3435, 4318, 10732, 13438, 12677, -4772, -18083, -20561, -18947, -20005, -15123, 3966, 6704, -12228, -23802, -16143, -14359, -26385, -22636, -16764, -9445, 4941, 9236, 805, -6753, -14487, -1669, -7666, -8692, -18166, -18099, -16760, -5324, 1409, 7214, 11467, -8939, -20081, -15118, -5099, -5027, -5068, -2681, -8692, 5274, 15240, 4304, -11983, -28375, -26012, -11755, -10891, -20980, -21459, -8307, -5282, -1467, -14095, -19254, -4291, 13230, 9462, -9410, -10778, 19722, 20006, 11240, 10586, 5452, -4006, -17510, -24732, -6752, -4518, -9714, -13503, 4221, 3821, -1515, 4775, 15550, 29573, 22798, 18141, 11273, 1386, 4917, 8911, 15588, 9522, 5457, 20306, 17994, 5550, 4164, 25258, 22476, 9372, 5733, -799, 4229, 4004, 5673, 9486, 2719, 451]
9905D51m547j2554j0733n156O513N116J696K475Q015K709J5837L934L625J777
9891A9158j0828l139J0009O076j5269j165P586K524N272r858r032j1613J0902
9878F23J871r494j1581K389N473Q472J1856J6763j0648j7190l007N230J9828j046
9864A9539o10L095j5506k833j498J2389L590j6858j0375J5005J0583j0638o993
9851a110Q226J9422q42K801K478n796p396Q9P271L493L307j0985l306j4203k191
9836A258l01J4097j7496j3765J0016j1900n039J5285J2669N79J2777R948L035
9823C1163m370j0031n720O794J102p677k235M827n854n23K265L273P268m321j266
9808A4695n49p155p646k952J8210J734o798j3700j98J2724O167o726j853K1312
$$ y = [451, -4096, -16650, -27383, -32539, -26026, -20910, -19214, -16739, -8724, -6015, 9822, 13756, 17381, 19158, 8330, 5191, 15200, 21276, 6007, 4842, 12428, 14952, 20224, 10366, 1334, -10279, 623, 2494, -7000, -18581, -16192, -10719, -2247, 9609, 26372, 15724, -1466, -4473, 757, 20585, 19539, 18929, 22024, 6518, 3685, 2187, 14576, 18166, 1308, -9067, 5938, 16521, 5883, -1110, 7116, 26538, 25696, 28497, 30975, 25179, 17783, 17872, 25143, 28636, 31943, 20958, 17652, 3449, 1258, 957, 15054, -2442, -16207, -6191, -18091, -23130, -7845, 4824, 5403, 18180, 28128, 31163, 26793, 16762, 11042, 17836, 18938, 11261, 9026, 13853, 7999, 7476, 9741, 13014, 20282, 15961, 14695, 14146, 6991, -655, -3607, 14603, 16337, 9539, -4161, -4359, 8365, 14532, 7806, 5953, 27265]
9794B7265J013k594m422j3938N255R138J3069R186L286k3544l1498k952p433K2665
9780D496K5107l338j4698j4352J6238P691j3172q496n302J41O800l106O190J6810
9766B1009O839r344n580M127n128j7070m99L373j315J1207Q545j0690j2363P859
9752I70N261J2960j602q531j5088m025J1281J1549r714O06J6667l949K944n358
9738A3971j2286Q41P299j624O059J2625J1955J473r163P36p956j1702j2357o65
9724g94n881P008M860J0225P249r224j5510j5148j2057J3302J5559o785p568K462
9710a2302J4821J4605j0866j6351P64m499r63J79P390J8731N334j9032j840J8252
9696A4223J1280r461p653O797r194L074m217o890K193J3982L983j6589Q34K3498
$$ y = [27265, 28278, 25684, 21262, 7324, 12579, 21717, 34786, 43972, 47258, 23714, -7784, -10736, -18169, 4496, 29603, 26265, 11567, -2785, 13453, 21144, 7972, -524, -5826, -5685, 1115, -1991, 4199, 21009, 27848, 18504, 12924, 17051, 11923, -5147, -5646, -2273, -3588, 7619, 16164, 5474, -6889, 970, 6231, 19191, 17589, 9058, -6030, -10055, 1226, 12775, 3061, 3667, 20334, 16385, 19329, 13971, 1685, 2526, 9825, 8201, 14260, 26885, 38840, 40313, 31150, 31886, 23930, 12228, -129, -794, -6675, 333, 5193, 15418, 22667, 13443, -2067, -17215, -29272, -15970, -411, -7196, -14764, -12302, 2519, 17124, 6258, -10093, -9329, -13828, -14791, -14612, -7222, 11509, 16843, -2189, -4029, 14223, 25503, 16042, 8389, 15186, 5992, 9066, 4849, -2041, 152, 14134, 18117, 1528, 2362, 25860]
9682B5860k331n206P108J5965J1560k418m027O871J9110j0267r242j0177m373
9669C8433o265j8335j3232Q26M533J3345O660j8458k170j131K108N710o239j6036
9655a0251L288J4419K720J2452q053L936j6292q413Q813P864N460N20n258n75
9641A0630m611l011O358M991k912m124r235J1160J2062J42L331J0888K659o796
9627C1532O191m834K56l767J0359O651m676j263j97p577R08o332J968M304J9897
9612E3420P946p204l501k9545m566J8422O730o688N680Q810n26J350J407M507
9598E6242o208N326n235r687o051k884O280l019l180R702N111l390K224L391l171
9583D5451j4585j3115P272Q571l897q077P356J7186N444k0633k873p066n316J2240
$$ y = [25860, 23529, 18323, 25431, 41396, 52956, 50538, 46511, 53382, 72492, 62225, 52983, 42806, 38433, 32168, 13833, 601, 1427, 5960, 19305, 25965, 7507, 5337, 4206, 6314, 12024, 5785, -10251, -6963, 7456, 10176, 22628, 14575, 18511, 2219, -6194, 2619, 10483, 15943, 16463, 11205, 10630, 6019, 3008, 9366, 14357, 11445, 7321, -1914, 9246, 21308, 21450, 24781, 35669, 38328, 31532, 37723, 32889, 33145, 29378, 39737, 46388, 41712, 40449, 40252, 32675, 33583, 27251, 29219, 33523, 53420, 61366, 54162, 50661, 21116, 16550, 34972, 41702, 35014, 40694, 49504, 48978, 50328, 51735, 56242, 50034, 55360, 50125, 40438, 34387, 31503, 37783, 34764, 31584, 41286, 46397, 43007, 45231, 48622, 45451, 30866, 17751, 25023, 33594, 29697, 21620, 28976, 46162, 51606, 30973, 28100, 21034, 15718, 27958]
9569B7958K5243j1203n924M205J174q260j66n922R757Q185j1302j2047J2265R194
9555D3157R341n934j1558r878Q590L436N37J0672M189l322r869j3760q517l542
9541A3542j365P469O54k339N05L309R76q231L434l37k022K197M536n103o877Q543
9525A8891m774O852o5p027j810l690j4577j1114K948J892J1789J8194N593o390
9511A6712N459N849k828J756L133k042j3658K177J4049o153K27J7093j5723r305
9497A6746j0155j1200O928J8545J725k559J028M503r032k192R154O539q059N053
9483B7024J614k993K635l798J8560J3126k536j5302j5248p992J259L315J5920
9470C5584K1982j8310j4916m93j146l400J6167J0079j0763j7075r923J2344O924
$$ y = [27958, 53201, 41998, 36074, 40279, 41453, 33193, 33027, 27105, 36862, 45047, 33745, 21698, 33963, 43157, 52498, 46564, 35006, 25128, 33718, 37154, 37691, 48363, 52552, 49230, 39361, 25601, 17084, 13542, 12177, 19646, 20300, 17961, 18466, 21775, 22751, 14520, 17954, 17617, 15595, 17792, 22328, 17225, 10348, 18891, 14117, 20969, 20904, 13877, 12067, 8377, -6200, -17314, -14366, -12474, -685, 17509, 23102, 16712, 22171, 28020, 25192, 26948, 30081, 28039, 14381, 16558, 30607, 24454, 24681, 41774, 26051, 16746, 6591, -4609, 2319, 20864, 22589, 20030, 21058, 25561, 16529, 14337, 23491, 30030, 21971, 27024, 28638, 25645, 28280, 24482, 43042, 56168, 53632, 38330, 23082, 15090, 16349, 19664, 35584, 57566, 39256, 24340, 23847, 22701, 19301, 35468, 45547, 34784, 17709, 7786, 20130, 27054]
9457B7054p911R751Q731J3110j0959k0800K034J007q280Q558J0801j1487J6230
9444C7839O962j7047N925R904P859j482P708j571j566L866k837r575j0312Q855
9430D4528J4433L43q033m772o567n081m408J1102o263q666Q275K0930J3683K624
9416G2128j872j5020N888Q005r428j42p137j5768n964j3083M19j752O685j653
9402B1306R276J9352J0114o53l970K386N123R30P754J2244J5178j7240k3174q991
9388D9635j965J8239J962R339J0010k899r172j0378j6018k661j5246q97r261j1756
9374H932j1932J4202K897J2316J2141R680j78k130Q584N296J4288J6465o996J4267
9360I7832J5361n947l713J0971J2364J22k436L167J5823J7727m036N160J5404
$$ y = [27054, 19143, 28894, 37625, 50735, 39776, 18976, 21010, 22017, 13737, 22295, 33096, 21609, 37839, 44801, 27754, 33679, 43583, 51442, 49960, 57668, 56097, 54531, 58397, 55560, 45985, 35673, 44528, 58961, 59304, 51271, 46499, 39932, 34851, 30443, 41545, 35282, 26616, 34891, 55821, 69504, 72128, 70256, 55236, 61124, 69129, 59701, 59559, 52422, 36654, 30690, 17607, 18026, 16274, 22959, 21306, 30582, 49934, 60048, 59395, 55425, 57811, 62934, 63864, 71618, 83862, 99040, 81800, 58626, 49635, 47670, 65909, 67871, 77210, 87220, 84321, 75149, 64771, 48753, 46092, 30846, 29949, 20688, 8932, -3000, 11202, 14099, 26415, 38556, 48236, 48058, 45928, 54512, 59808, 74096, 90561, 83565, 97832, 113193, 107246, 103533, 114504, 126868, 126990, 124554, 127721, 143544, 161271, 157235, 162395, 177799]
9347A77799Q353K344J4798K5272K7612L5381L5557N8644N3054P6628J02127J22597
9335G40166J38914J47591J48121J51914J46289J12939N9133J2445j9481l9217
9325A598814q3367j16463j16655j11392j16368r3202r8076o0698k1405j9502Q658
9314G70344M6106M7904P1259J04367J32454K02962K96433M42280O40395R00980
9304C655484J116495J057214O52964K23349K8592l9753l35259q97129j173155
9295D288802r78643p03693m83749l36231k40003j83978j38526j05139q9735o3401
9285I65704n1952n6736k9260k1693l2342m4041m1535k8749k9878k9093j5838m0159
9273E44428k3665k2222k7680k1990j6690k9424k1344j0397k5132j6429l964P588
$$ y = [177799, 186152, 188496, 203294, 228566, 256178, 291559, 327116, 385760, 438814, 515442, 617569, 740166, 879080, 1026671, 1174792, 1326706, 1472995, 1585934, 1645067, 1657512, 1638031, 1598814, 1515447, 1398984, 1282329, 1170937, 1054569, 961367, 863291, 802593, 781188, 761686, 770344, 816450, 864354, 935613, 1039980, 1172434, 1375396, 1671829, 2114109, 2754504, 3655484, 4771979, 5829193, 6482157, 6705506, 6734098, 6694345, 6359086, 5461957, 4288802, 3310159, 2606466, 2122717, 1786486, 1546483, 1362505, 1223979, 1118840, 1029105, 965704, 913752, 857016, 827756, 806063, 773721, 729680, 688145, 659396, 629518, 600425, 584587, 544428, 520763, 498541, 470861, 448871, 432181, 402757, 381413, 371016, 345884, 329455, 325491, 333079]
9261C33079m694j3412j7578p535R615k727j5608L412n180k8435n783k159Q280
9248B51275j4701j2197Q630j6263n648j902j2764q029J1664o156n345J5550r355
9235A94759P468q274J3812R33o671p487q72K2092J6480J0743j3k1678j5029M281
9221B10544Q646j4829k0047l152J1542j819k5932n587J2774j5446k2134j0213
9209A24347o333j0575J551J8988L002J6140J5848l453j1105j0113k589K546k993
9196A35261j066P056N222O931K1990M977j1334M756R431N1688M8124K7011m879
9183C05168q059j397J508j0727j6535k75j6043m605k1084k4955j1629L830k780
9170A92417j162j0047j2070p701l675o686R749J7999L887j2729O880q03j0692
$$ y = [333079, 328385, 314973, 297395, 289860, 299475, 296748, 281140, 284552, 279372, 250937, 245154, 242995, 251275, 236574, 224377, 233007, 216744, 211096, 209194, 196430, 188401, 200065, 193909, 188564, 204114, 194759, 202227, 193953, 207765, 208698, 202027, 194540, 193668, 215760, 232240, 242983, 242970, 221292, 206263, 210544, 219190, 204361, 184314, 181162, 192704, 190885, 164953, 159366, 172140, 156694, 134560, 124347, 118014, 107439, 108990, 127978, 130980, 147120, 162968, 159515, 148410, 138297, 135708, 138254, 135261, 134195, 141251, 146473, 153404, 175394, 180371, 169037, 173793, 183224, 234912, 283036, 310047, 305168, 297109, 295712, 297220, 286493, 269958, 269683, 253640, 249035, 227951, 202996, 191367, 195197, 192417, 191255, 181208, 169138, 161437, 157762, 151076, 160825, 178824, 182711, 169982, 176862, 176059, 165367]
9157A65367R838J3390J0797k106j6847q797q385n211j8842j1486m439j1107j1230
9144A00942p012k132J2483R100r261J2124r053N896O156N296J1559O734N312J0935
9130A59079J6331m026k145O588J3215j1431q723k4143l4906j7949j7127M608m226
9117G5145M759l963m835J3361J7307p289n445q345J063J7345J4579M800J367O045
9103A25894M049N70O481J0079j576J1921l870O378k280O487K2359K8474J0850
9090B25816J1469r44r755k759K780o50j8918o921j460N724J7744n235J5056K3881
9076B55828K5358L8619K0018J2378L1421L6137L6205L4018J8535M1332M9298O7505
9064F66652R4876P9143M0641J30k0767o0295o0846n6082r4822j09757j19282q5433
$$ y = [165367, 175205, 188595, 199392, 197286, 180439, 171642, 163257, 158046, 139204, 127718, 123279, 112172, 100942, 93930, 91798, 104281, 113381, 104120, 116244, 107191, 113087, 119243, 124539, 136098, 142832, 148144, 159079, 175410, 171384, 169239, 175827, 189042, 177611, 168888, 144745, 109839, 91890, 74763, 79371, 75145, 79904, 75941, 71106, 84467, 101774, 94485, 89040, 80695, 81758, 99103, 113682, 118482, 119849, 125894, 129943, 130513, 136994, 147073, 145497, 157418, 153548, 159926, 157646, 164133, 186492, 214966, 225816, 237285, 236341, 226586, 223827, 226607, 225957, 207039, 200118, 198658, 204382, 222126, 216891, 231947, 255828, 281186, 319805, 339823, 352201, 383622, 419759, 455964, 489982, 508517, 549849, 599147, 666652, 761528, 840671, 881312, 881442, 860675, 800380, 739534, 683452, 588630, 478873, 359591, 274158]
9052B74158n3047K3953M4662L4089O780P220K0418L0748L3421J2417J9945K9742
9040D84506L8174R739o817k706J8507J5912l765r642j7118j8764j72K7755J1831
9027E47440K345k155m598j3270k6248j5988j4776P816K1556J5457L793j1749j8199
9014D91424P901J8631J3025L809J9826K2456K0853l891j4544J6539J2018Q953
9002F17000K4879L6745M8393M6153M7926N8795N6216M6957K4175O578o652J4796
8990A021961L1368J9864M737L166K5771N3863N0586L3796J8173L1876N9006Q0045
8978A434212O7963P2176Q3979Q9762J05230J10913J05584J04690J03801J14843
8968B393153J32492J40787J47466J96355K54029K76462K94974L38177L53454L82066
$$ y = [274158, 221111, 245064, 289726, 323815, 330595, 337815, 358233, 388981, 422402, 434819, 454764, 484506, 522680, 532419, 525602, 522896, 541403, 557315, 553550, 543908, 526790, 508026, 507854, 535609, 547440, 549785, 547630, 543032, 529762, 503514, 487526, 472750, 480566, 502122, 517579, 521372, 509623, 491424, 499325, 517956, 530981, 534790, 554616, 577072, 597925, 594034, 579490, 596029, 608047, 617000, 641879, 678624, 727017, 773170, 821096, 879891, 936107, 983064, 1007239, 1013817, 1007165, 1021961, 1053329, 1073193, 1077930, 1081096, 1106867, 1160730, 1211316, 1245112, 1263285, 1295161, 1354167, 1434212, 1502175, 1574351, 1658330, 1748092, 1853322, 1964235, 2069819, 2174509, 2278310, 2393153, 2525645, 2666432, 2813898, 3010253, 3264282, 3540744, 3835718, 4173895, 4527349, 4909415]
8958D909415M12312M65917N19897N88956O80441P92906R72160J189158J432501
8949A1963663J751399K064920K382243K637915K906607L199995L588193M194426
8941C4689361N338552P382061J0383790J5426118K4350789L8948881N8686446
8934A95205998P4399261O6057821K9123669R94087p91116O005758j6505218p0741512
8926B83748748q0455623n4934797l3504239k1134099j3879809r270509o355671
8919F4214001m609049l579023k894091k515580k345379k359923k638860k756363
8911D0515733k656410k469479k229722k036306j947058j785889j521428j281056
8903B4588385j251084j346735j224912j062647r61298q53430p68073p15055o81105
$$ y = [4909415, 5321727, 5787644, 6307541, 6896497, 7576938, 8369844, 9342004, 10531162, 11963663, 13715062, 15779982, 18162225, 20800140, 23706747, 26906742, 30494935, 34689361, 40027913, 47409974, 57793764, 73219882, 97570671, 136519552, 195205998, 269605259, 335663080, 364786749, 365780836, 364989720, 370995478, 354490260, 283748748, 203293125, 148358328, 114854089, 93719990, 79840181, 70569672, 64214001, 59604952, 56025929, 53131838, 50616258, 48270879, 45910956, 43272096, 40515733, 37859323, 35389844, 33160122, 31123816, 29176758, 27390869, 25869441, 24588385, 23337301, 21990566, 20765654, 19703007, 18741709, 17888279, 17120206, 16405151, 15724046]
8894A5724046o48698o04672n54550n21455m90937m85016m51654m15726m05383
8885A1145955l75502l44476l26528l06133k96891k82284k89240k92876l01316
8876H330709k91794k81297k92750k89895k63079k19948k15302k13409j79379j63015
8866E920841j65368j36462j12667j11946p1085o1669p3542q3206j07797j23540
8856D873559j33644j21745j45286j47578j27972j14133j15169j27172j19802j05704
8846C615354r0849r0356r7158r2241o5027n2717p5989q5322p1358o3615n7155
8835B773567m0191m0389o0552o3282p5338q4351q5389q5321p8171j02718r5732
8824A962133j05272r7118p6634m4491m4052p2105n3742m8633m9465m0387l1932
$$ y = [15724046, 15075348, 14470676, 13916126, 13394671, 12903734, 12418718, 11967064, 11551338, 11145955, 10770453, 10425977, 10099449, 9793316, 9496425, 9214141, 8924901, 8632025, 8330709, 8038915, 7757618, 7464868, 7174973, 6911894, 6691946, 6476644, 6263235, 6083856, 5920841, 5755473, 5619011, 5506344, 5394398, 5323313, 5261644, 5188102, 5104896, 4997099, 4873559, 4739915, 4618170, 4472884, 4325306, 4197334, 4083201, 3968032, 3840860, 3721058, 3615354, 3524505, 3434149, 3336991, 3244750, 3179723, 3127006, 3051017, 2965695, 2894337, 2830722, 2773567, 2733376, 2692987, 2632435, 2569153, 2493815, 2409464, 2324075, 2238754, 2160583, 2057865, 1962133, 1856861, 1759743, 1683109, 1638618, 1594566, 1522461, 1468719, 1420086, 1370621, 1330234, 1298302]
8813A298302j2508R359l535k5047n9634j07268j14759j02618j10015r1693m5623
8802F34961o1197m6764j2319j1696k6272l243M611J8654K5946Q648J793j3508
8790E19614o707Q905L6112K8795k21J7457K6877K2353N505L812j3031j9766m592
8777F25113q20q983q297j5687r192k999P313J5847Q830K2411K0627J7254J5778
8764F87195L4450L5864L1836L2227L0832M0803M5005O5629Q0923J00639J37090
8753A322493J21578J32814J65317J83673J76863J48742J22350P5545M0966j2446
8743B477895q0425j22417j31107j30264j48330j52284j37624j34515r8132j04968
8733A237829r3631n8736m0601l5029l0440l1596k0929l3054l4751k3939l6942
$$ y = [1298302, 1285794, 1295153, 1291618, 1266571, 1206937, 1099669, 984910, 882292, 772277, 680584, 634961, 573764, 527000, 514681, 502985, 476713, 473470, 478081, 496735, 522681, 531329, 533122, 519614, 512907, 521812, 557924, 586719, 586498, 603955, 630832, 653185, 658690, 662502, 649471, 629705, 625113, 624293, 615310, 607013, 591326, 582134, 579135, 586448, 602295, 611125, 633536, 654163, 671417, 687195, 721645, 757509, 789345, 821572, 852404, 893207, 938212, 1003841, 1084764, 1185403, 1322493, 1444071, 1576885, 1742202, 1925875, 2102738, 2251480, 2373830, 2449375, 2490341, 2477895, 2397470, 2275053, 2143946, 2013682, 1865352, 1713068, 1575444, 1440929, 1342797, 1237829, 1144198, 1085462, 1044861, 1009832, 979392, 947796, 926867, 893813, 859062, 835123, 798181]
8722G98181k2753r853k25j4128j1725j0767k6142l6247l0629j9733j7867n103
8710E93009j1283n687l2646k4266k6368j3984j1588n949j7588j4827J1804r000
8698D31627J110j937j1560m365k445j2340q475o380m090l1385q214m892r91J0825
8684C46488j672m616j1930l742J3450L518j1178o840J2817J0805o145K50j7694
8671C23511k9761j5689n730p913j1393k4190j5545n866o864l34R070L010O502
8658B18808K516J2174J5069M062K629O477l484r700l304q031j1003k690L215k996
8644B23742R240J0770P774K0730J3835K571J8341K3692J7027K4022N4763P3937
8632E00444N6359M2189M6075J8227J3070j020j9171k1452k3981l6048l1037m0331
$$ y = [798181, 775428, 765575, 765350, 751222, 739497, 728730, 702588, 666341, 635712, 615979, 598112, 593009, 581726, 576039, 543393, 519127, 492759, 478775, 467187, 461238, 443650, 428823, 440627, 431627, 432737, 430800, 419240, 414875, 412430, 400090, 391615, 385235, 381145, 349760, 341546, 336654, 335663, 346488, 344816, 340200, 328270, 324528, 337978, 341496, 330318, 323478, 336295, 347100, 340955, 341205, 323511, 293750, 278061, 272331, 264418, 253025, 228835, 213290, 207424, 200560, 200226, 209296, 212306, 218808, 221324, 233498, 248567, 252629, 255258, 261735, 258251, 248551, 245247, 237216, 226213, 223523, 226738, 223742, 232982, 243752, 251526, 272256, 286091, 288662, 307003, 330695, 347722, 371744, 426507, 500444, 556803, 598992, 645067, 663294, 676364, 675344, 656173, 634721, 610740, 574692, 543655, 503324]
8620E03324m5016l9582m533L242q497j2019j4883O808q773r602r974j490K033
8607C61038Q096j3437l413r587n122J252J0095m588k354j5457j7443k2354j3825
8594B72901j955J3193J1154P668k1363j2332k2620m39l648j1119K483J930j8177
8581B17676k1353P845n476l115j9827j5155N374r58L322k896r936n95k629K266
8567A54543n09J1729J5194J1327m732j7247j289L780q812j0642j0628P591K0899
8554A71204L329l261j3468j1403M792j3006j0431K668J4110J5355L7072L0208
8542B27169J2287M453K8367L6602N0260P6240R1714J16803J29555J41061J43458
8531A057969J56603J45401J28210P5597M3257N171m1297p7032j07986j26067j17487
$$ y = [503324, 458308, 418726, 414193, 417435, 408938, 396919, 382036, 388844, 380071, 370469, 360495, 359005, 361038, 369134, 355697, 352284, 342697, 337575, 338827, 348922, 344334, 341980, 326523, 309080, 286726, 272901, 270946, 284139, 295293, 302961, 281598, 269266, 246646, 246207, 242559, 231440, 233923, 235853, 217676, 196323, 204168, 198692, 195577, 175750, 160595, 165969, 165011, 168333, 165437, 155501, 154906, 152277, 154543, 154034, 165763, 180957, 192284, 187552, 170305, 169016, 172796, 163984, 153342, 142714, 150305, 171204, 174533, 171272, 157804, 146401, 151193, 138187, 127756, 130424, 144534, 159889, 196961, 227169, 239456, 243909, 272276, 308878, 359138, 435378, 527092, 643895, 773450, 914511, 1057969, 1214572, 1359973, 1488183, 1563780, 1607037, 1612208, 1570911, 1493879, 1385893, 1259826, 1142339]
8520A142339j51453j46215j28426j01277o6851o1606q2817m5510m440k4806k6684
8509C02254j2632j6646j5024j7306k0926j5242j4203n895j7949j0373O293j960
8497A60391m990o291k0206J1421J6491O361J2894O983n647p787P20l70p950j3237
8483A48783Q93j1812j5392q400k576j121n425r403j6684J0616P394j7477k4512
8470E4884j4251O661p014j210O702J8238J7331P039M346K927p300R32n094L387
8456H7578n995k7609j73J8215J1875M925p484j8738q371O832n314n699j412j8120
8442C0510r795L167J5222N148L90j63N133l529K732J2639J2343M551j0226p876
8428F0246j3126L831J6988l949j3266M249L700P086q113j9716J1201J864o39k580
$$ y = [1142339, 990886, 844671, 716245, 614968, 548117, 486511, 403694, 358184, 353744, 328938, 302254, 289622, 272976, 257952, 240646, 219720, 204478, 190275, 184380, 166431, 156058, 162351, 160391, 155401, 149110, 128904, 140325, 156816, 163177, 176071, 183054, 177407, 169620, 170340, 169970, 162020, 148783, 149676, 137864, 122472, 114072, 111496, 110375, 104950, 95547, 78863, 89479, 96873, 79396, 54884, 40633, 47294, 40280, 39070, 45772, 64010, 81341, 88380, 92726, 95653, 88353, 89285, 84191, 87578, 81583, 53974, 53801, 72016, 83891, 88816, 81332, 62594, 54223, 61055, 55741, 50042, 48630, 30510, 20715, 23882, 39104, 44252, 44642, 44479, 49612, 46083, 48815, 61454, 73797, 78348, 68122, 60246, 47120, 50951, 67939, 63990, 50724, 54973, 58673, 65759, 57646, 37930, 49131, 50995, 50356, 47776]
8414D7776L843j3786j1657l892O484k47J297R895Q663P450r014O909j2549o362
8400C4810p4Q774j4117j6569q382m572J4571J2418K730N20p310K105K207l950
8386B3161j2900N289K7658K3029Q127k7260k2730q310J2464K8227J7337j2836
8374F1256m310l140o959j2978o100Q361J5381J2516r050j2481k192O183p992K637
8360D1132l71j4278P543J8368o110r954K516J2753N637m302j2709k339j8362j936
8346A7588R833J3136P055q247R72R373M119m056j8828O63J823m699J3760Q847
8332E1339m528m8j4274j2999o47J8904R418k583l524Q919k03j0811r361M566K439
8317C6607o426j2085j0619P759P086J0182m302j708m223L095r173Q09J2930R359
$$ y = [47776, 51619, 37833, 26176, 22284, 28768, 28521, 29818, 39713, 48376, 55826, 46812, 53721, 41172, 34810, 34736, 43510, 29393, 12824, 4442, -130, 14441, 26859, 29589, 30109, 22799, 24904, 27111, 23161, 10261, 15550, 43208, 66237, 74364, 47104, 24374, 16064, 28528, 56755, 74092, 61256, 56946, 53806, 46847, 33869, 27769, 36130, 51511, 64027, 54977, 42496, 40304, 46487, 38495, 41132, 40761, 26483, 34026, 52394, 46284, 36330, 38846, 51599, 57236, 52934, 40225, 37886, 19524, 17588, 27421, 40557, 47612, 39365, 40337, 49710, 53829, 49773, 30945, 31608, 33431, 28732, 42492, 51339, 46811, 46763, 32489, 19490, 18843, 37747, 47165, 44582, 41058, 49977, 49774, 38963, 29602, 34168, 36607, 30181, 18096, 7477, 15236, 22322, 32504, 28202, 26494, 22271, 25366, 16193, 17002, 29932, 39291]
8303C9291Q637j4099K75l071l2002q384P071L781M474L444j780M005j0606j5309
8289a4273j1557R421K2910Q861j2192k296k239n017l538J1816O005j0364L954
8276A491O369o973k895L221K716n365p495J1614J6008j2499Q588O342m904Q406
8262B4624k328r481l376k481K87J055J2321J2581j2825j9392Q262J3752j457o160
8248A5382m051q245J144J1145J4880N381j0229n267r93j547P097j126j2607j219
8234I745J0040K587J695J2575O086j4531o973j8605K675K2049n776m159j2908
8221D500j6823N974M623K8570R436k40P848q794N413j948r816L02J474m941j0519
8206A5059r04J0740P421N191p79K550r260r277j090J017n412k376J1459P55L833
$$ y = [39291, 47928, 33829, 34104, 31033, -969, -9353, -2282, 1499, 5973, 9417, 7637, 11642, 1036, -14273, -25830, -16409, 6501, 15362, 3170, 874, -1365, -6382, -9920, 1896, 7901, -2463, 1491, 7860, 887, -2008, 1213, 3929, -1436, -8931, 2683, 18691, 6192, 14780, 21122, 16218, 24624, 22296, 12815, 9439, 6958, 7245, 8300, 20621, 33202, 20377, 985, 9247, 22999, 21542, 15382, 11331, 3086, 4230, 15375, 30255, 35636, 25407, 20140, 19147, 17600, 24697, 23571, 10964, 9745, 19785, 22372, 24067, 36642, 42728, 28197, 21224, 2619, 5294, 27343, 21567, 17408, 4500, -12323, -6349, -1726, 26844, 36280, 36040, 43888, 35094, 40507, 38559, 28743, 29045, 30519, 25578, 15059, 14155, 24895, 32316, 37507, 36728, 39278, 30018, 20741, 19651, 20668, 15256, 12880, 24339, 25094, 28927]
8191B8927J1296l253j0450n585k035N438K063j3083M269N231J824o982r431j5263
8177g034n194J1054j853n410j279o410j3196n1R011J4885m425k1047J8353K1714
8163I118P023J3478r961j9241K0764J1815l29o493N514O200K393N666J0781L883
8149F0611n619R49J2056P048j8849j9463p942k707j317m543r575L598Q77O258
8135B1382J3334l440p849j525m721k3602M306P794N314J393n396K376M790j3120
8121A036m266j509L256P977J2217R566j044J262O823k012J3407n927J3302Q665
8107F2753q927l184J5041j2378j9233K941j1048k0888L089j1266J584J0642J6492
8094B5618J1530P488n343j1143r216j303K0680p601r702J6312N10n855o897K707
$$ y = [28927, 40223, 36970, 26520, 20935, 18900, 24338, 26401, 13318, 17587, 22818, 24642, 17660, 8229, -7034, -12228, -1174, -3027, -8437, -9716, -16126, -29322, -29373, -20362, -5477, -9902, -30949, -12596, 9118, 16141, 29619, 19658, 417, 21181, 32996, 32667, 26174, 31688, 37888, 40281, 45947, 56728, 60611, 54992, 55941, 67997, 75045, 56196, 36733, 28791, 26084, 24767, 20224, 10649, 14247, 15124, 21382, 34716, 31276, 23427, 21902, 17181, -6421, -2115, 5679, 10993, 12386, 6990, 9366, 14156, 1036, -3230, -4739, -1483, 6494, 18711, 28277, 27233, 28495, 35318, 33306, 46713, 40786, 54088, 62753, 53826, 50642, 65683, 53305, 34072, 37013, 25965, 5077, 8166, -3100, -1516, 9126, 25618, 37148, 44636, 39293, 28150, 18934, 17631, 38311, 30710, 21008, 37320, 37830, 31975, 25078, 27785]
8080B7785l510K252n49j90L2k754J112R162L367j3450p758Q823r864J481L436
8065A9375K584j1813Q06m43j539R67J3919M60Q42J810j638J3662J5247K0187L35
8050G4761j2290o889J863J6137L441M326Q494R420P719j0437r769j0803n622J4470
8036H4821K060J2794J4080L165l625N302q092m608j4103j9678r174r357L763J6155
8022G3503M109J0529P093n629o685j0318N62J1360k309l036j0360N677J5130R166
8008I8792Q625n06K8456J6332J592J2610K9448L1280K9916J5325R00r50o083j5208
7994B50529l2725l4998k6556j5065J280J7448M7387J4416o512n875o86j3514l2314
7981A62815l0422l324N45q982p606j0276k2380p672L153R632j7206L970N649R39
$$ y = [27785, 24275, 26527, 25978, 25788, 25820, 23066, 24178, 33340, 36707, 23257, 15499, 24322, 14458, 15939, 19375, 21959, 10146, 10952, 10509, 8970, 9937, 23856, 24316, 25158, 26968, 25330, 38992, 54239, 74426, 74761, 62471, 55582, 57445, 73582, 77023, 81349, 89843, 99263, 106982, 96545, 86776, 75973, 70351, 84821, 86881, 99675, 113755, 116920, 113295, 118597, 110505, 105897, 91794, 72116, 62942, 53585, 57348, 73503, 77612, 88141, 95234, 89605, 82920, 72602, 73164, 84524, 82215, 79179, 68819, 74496, 89626, 98792, 107417, 106911, 135367, 151699, 153291, 165901, 195349, 226629, 256545, 271870, 272770, 271820, 265737, 250529, 217804, 182806, 156250, 141185, 142465, 159913, 207300, 221716, 215204, 209329, 208643, 195129, 162815, 132393, 129069, 129614, 120632, 113026, 102750, 80370, 72698, 75851, 85483, 68277, 72247, 77896, 78835]
7967G8835j834L21J6666L807j3761l472J2690N653K0154L1440K0705O805J4550
7954A92559O55n528N913m083k0907N1M504L608J603L328Q078r41j2377l1774k2899
7939A21790j1661k2385r635Q63l131J4383L63k3291j5096l387J6393p282m113
7926E3811r156R40L4216p959k89p969r609Q070J9557j4918J1057J3949P672j976
7912I7396n571R060m699j2000j7904j1789J821J7793J7508J2418j544l429o878
7899I2182k5796j0547o612m11O022J167j723r09R764k498k8369r853J1292p65
7885C2944p232J0408j937P081J4764L367r743j6271O59q552j4007L162m367P38
7871A1014J382J3499L18o498r324J1516N612J407k710o472j865n294k997R10j1505
$$ y = [78835, 77001, 77322, 93988, 97795, 84034, 80562, 93252, 98905, 119059, 150499, 171204, 178009, 192559, 193214, 187686, 193599, 189516, 168609, 168660, 173164, 176772, 178375, 181703, 189781, 188840, 176463, 144689, 121790, 110129, 87744, 78109, 78972, 75841, 90224, 90587, 67296, 52200, 48813, 65206, 57924, 53811, 44655, 45595, 79811, 71852, 71563, 63594, 53985, 62055, 81612, 66694, 77751, 91700, 99372, 97396, 91825, 100885, 96186, 84186, 66282, 54493, 56314, 74107, 91615, 104033, 102489, 99060, 92182, 66386, 55839, 49227, 48816, 54838, 56005, 54282, 53373, 63137, 60639, 32270, 22417, 33709, 32944, 25712, 36120, 34183, 41264, 56028, 59395, 49652, 33381, 34040, 25488, 11481, 14643, 10276, 11014, 12396, 25895, 26213, 19715, 10391, 21907, 27519, 28926, 26216, 19744, 17879, 12585, 9588, 10498, -1007]
7856a007q012p075j0147J6862J3506N741M64O247j739n93P876k526O640K391j2518
7841A6110l300J4437k385J167m419R958R123q65p385q857j618o44j3478P415k667
7826A2592R69k605M052O442p382l256L196j0524j0042n414L242L384j0203J2472
7812c077J1850p34J0825j189J4529K589j7286K679k1194j8018J6902J5161J2469
7799B5506j1548j1858k459J2647l261p183k730k481l354P812K361j1509n125K258
7785a0924p122J4639R108J534j0476r829R655J7998n97j3606p510q950J1726N703
7771A349j562r261J923K731n768L778m567k854N234J3503J782K971j512o779P31
7756A699J061J2378n220k4717n371J3425J4341J2021R149q552k0959J7042l515
$$ y = [-1007, -9019, -16094, -26241, -9379, 4127, 9868, 10332, 16579, 14840, 14247, 22123, 19597, 26237, 28628, 16110, 12810, 27247, 24862, 26029, 21610, 31568, 40691, 39826, 32441, 23584, 21966, 21322, 7844, 15259, 12592, 13561, 10956, 15008, 21450, 14068, 10812, 14008, 3484, -6558, -11972, -8730, -5346, -15549, -3077, 8773, 8039, 18864, 17675, 32204, 34793, 17507, 20186, -1008, -19026, -2124, 13037, 25506, 13958, 2100, -359, 12288, 9027, 1844, -886, -3367, -6721, 1091, 3452, -8057, -13182, -10924, -18046, -3407, 5701, 7235, -3241, -13070, -3415, 14583, 13986, 380, -7130, -16080, -4354, 1349, -213, -9474, -7551, -4820, -10588, -6810, -11377, -14231, -8997, 4506, 6288, 9259, 7747, 968, 1699, 2760, 15138, 9918, -14799, -20170, -6745, 7596, 19617, 28766, 20214, -745, 16297, 12782]
7743A2782k0677l688J0574Q520J3673p849j0760P008m559O650J3591k005j5928
7730G332n797r10L09n43l149l629n755j3788R749J2899J323k051p365j906J1874
7715a407M107n142M81O970K586n298l143q585m071K461j2027J652J0863Q454Q479
7700F380J6077j4283j5575j6737o017K0179J6998R530l849J2053L955o997J344
7687B3058o181k867j071L572K710p599p232Q936Q168j2177j4334J0210J8539m430
7673A9302m704q592r288j468k220m430K521o033j3384m842r48L951r260L789N443
7658c0163r371O626R758P065J7224K012K755r538j2529N627P247j2635n110p463
7644b8495K0414J5478K447j3831N127J4767M683p349M178M323Q83m173m318m840
$$ y = [12782, -7895, -11583, -1009, 7511, 21184, 13335, 2575, 9583, 5024, 11674, 25265, 23260, 7332, 1535, 625, 934, 391, -2758, -6387, -12142, -25930, -16181, -3282, -1959, -4010, -11375, -13281, -1407, 2700, -2442, -1961, 5009, 7595, 2297, -846, -9431, -13502, -11041, -23068, -21416, -10553, -2099, 6380, 22457, 8174, -7401, -24138, -30155, -9976, 7022, 16552, 12703, 24756, 28711, 21714, 23058, 16877, 14010, 12939, 16511, 19221, 11622, 4390, 13326, 21494, 9317, -5017, 5193, 23732, 19302, 14598, 6006, -3282, -4750, -6970, -11400, -8879, -14912, -28296, -33138, -34086, -30135, -39395, -35606, -30163, -39534, -32908, -23150, -16085, 1139, 3151, 5906, -3632, -16161, -10534, -3287, -15922, -21032, -28495, -8081, 7397, 9844, -3987, 1140, 15907, 20590, 13241, 17419, 21742, 22625, 18452, 14134, 9294]
7630I294L174j5744o390M750O716J929n94J1295J0476p945o584j63n862j2557
7616h205j950k97m829q928M947k658K108K0918j964L400o956n2N649K448j9631
7601a6000j4208Q063J1973K461N684j0024j2345J1024J8707j8275j3212J6603
7589i549J2139R825j206p94R021r897j0648k455J737N987J6052N78j7108M560
7575H242L498p025j3991Q17j3346M138j6890j4666O364J2737L518J5956J3869
7562C221o863N321O403J0627m384k0450k398k288j4260j1637P272P987K1125M845
7548D521r164l681J147q556j819Q708k881R313O482J0057l254k3606m894J9151
7534A524K247j6094K353q519JK099R399K435Q6L089n140m848O561J2882L850M152
$$ y = [9294, 12468, -3276, -9666, -4916, 1800, 3729, 3135, 14430, 24906, 16961, 10377, 10214, 4352, -8205, -10155, -10452, -15281, -24209, -19262, -21920, -19812, 1106, -858, 2542, -4414, -4466, 1183, 3631, -16000, -30208, -22145, -10172, -7711, -2027, -12051, -24396, -13372, 5335, -12940, -26152, -9549, 2590, 12415, 11209, 10415, 19436, 9539, -1109, -3564, -1827, 4160, 20212, 20790, 3682, 8242, 11740, 4715, -9276, -8459, -21805, -17667, -34557, -49223, -42859, -30122, -26604, -10648, 3221, -3642, 1679, 8082, 18709, 14325, -6125, -8523, -10811, -25071, -36708, -29436, -21449, -324, 4521, -4643, -8324, -7177, -15733, -17552, -8844, -11725, -2412, 4070, 14127, 10873, -12733, -17627, 1524, 3771, -12323, -9970, -18489, -18488, -16389, -6990, -4555, -4469, -1380, -6520, -11368, -4807, 8075, 11925, 16077]
7518A6077J0419j4715j0552M78P286J0391J5691N923k642n098L172q839k6807
7505G84q876j811l929L79N059J7896Q500R249M186l421m284K730q458j217Q000
7490B4787k492k896o376n767l549r641J462P924l745J0766J9647R267l088j6367
7476A9932m705j1851k1299o493J6539J2230M15o669m622m650q558J1416Q066L827
7462C578N079j1323m073N553k317Q67l561L572P181l302o424n033J241k100R063
7447a999K5762Q870q298n024j861r330l881N078l014M990l067P775k684p926k1061
7432a5670k55M072J1582J2957M971O375j0095L095j0651R039j852j3296m431J3905
7418I746J4057J2852n913j6311k0781N37Q759P704M235R31q502j2822j2113p76
$$ y = [16077, 26496, 11781, 1229, 1707, 8993, 19384, 35075, 40998, 38356, 33258, 36430, 27591, 784, -8092, -9903, -13832, -13453, -8394, 9502, 18002, 27251, 31437, 28016, 23732, 26462, 18004, 16787, 24787, 22295, 19399, 13023, 7256, 3707, -5934, -4472, 3452, -293, 10473, 30120, 39387, 36299, 19932, 15227, 3376, -17923, -24416, -7877, 4353, 4768, -1901, -6523, -11173, -19731, -8315, -249, 3578, 8657, -2666, -6739, -1186, -3503, -2636, -6197, -2625, 4556, 1254, -5170, -10203, -8962, -11062, -1999, 23763, 32633, 24335, 19311, 17450, 8120, 4239, 9317, 6303, 11293, 8226, 16001, 13317, 5391, -15670, -15925, -11853, -271, 12686, 17657, 24032, 13937, 17032, 6381, 15420, 13568, 272, -4159, 9746, 23803, 36655, 30742, 14431, -6350, -5813, 2946, 10650, 14885, 15816, 7314, -5508, -17621, -18397]
7404a8397L4630K0822j3761j4549Q352M38j2210K863O893J991N739K444j565O583
7390C0273l73k7828o734P14O543J0408R901J2150J6299m974k1364k3441k3285
7377b1711P720K7334K610j4233j641O926m976J1374R417Q8M374j0545j5761R461
7363A0437l701j2037m176J3761P870q530k550j5021p650J4867K2997j4847k256
7350h36j2017N96K0319l112m923n407j3856k2716J75J8745M393k659J477K2347
7336B526o23j001l121q305P486P304j730j5510j4408p5K1160R940m522L918M917
7321G956J0230Q796J0694K662l755j0195n305j1449k527r820M353O448q849r891
7307a0652N619j755k095l955J1049P216J2271Q083r886j0964P888k87j2410j810
$$ y = [-18397, 16233, 37055, 23294, 8745, 17097, 17535, 5325, 8188, 15081, 17072, 22811, 25255, 23690, 30273, 29900, 2072, -4662, -3948, 2595, 13003, 22904, 35054, 51353, 46379, 25015, 1574, -21711, -13991, 13343, 15953, 1720, 79, 7005, 2029, 13403, 22820, 22908, 27282, 16737, 976, 10437, 6736, -5301, -9477, 4284, 12154, 3624, 1074, -13947, -21597, -6730, 16267, 1420, -836, -12853, -12257, 8062, 4950, 27, -5380, -19236, -41952, -41777, -23032, -18639, -21298, -19821, 2526, 1903, 902, -2219, -10524, -3038, 4266, 2536, -12974, -27382, -27457, -6297, 3643, -879, 3039, 7956, 18186, 26982, 37676, 40338, 36583, 26388, 21083, 9634, 7107, -2713, 1640, 8088, -761, -10652, -5033, -6788, -8883, -12838, -1789, 5427, 17698, 25781, 15895, 4931, 12819, 12532, 122, -1688]
7293a688q136L271J6267j5841q520J3717N682k482p679j0834L395R009N661Q177
7279I999M902k471j6216l325k170o751n667N535J6696j0484r107M562K1884N920
7265A3307j3246k1729l000P24j555J440r729K724J2683J6664O393o982j52o293
7251h751n060k253k155R646L696J9002L990j9623j7657J0082J0496L44N824J3989
7237B1570m756j3302j2171J456O916J1143j0708q653K382J6359j1006j3456O776
7224g450q590M86J4183l983o697R721J1977j5026M491J5p464N75J6917p536j4921
7209a3302M701Q247N193p58J2377J0127j3539j1144n51P520P96Q463N994j2925
7195A1199j7231j8467L101P783J1121Q425j488J66J3176K442o782j2527J981N216
$$ y = [-1688, -9824, -6553, 9714, -6127, -14647, -930, 4752, 2270, -5409, -16243, -12848, -3839, 1822, 9999, 14901, 12430, -3786, -7111, -9281, -16032, -21699, -16164, 532, -9952, -19059, -14497, 7387, 13307, 61, -21668, -24668, -23944, -25499, -24059, -33788, -31064, -18381, -1717, 4676, -2306, -2458, -8751, -13811, -16064, -18219, -8573, -4877, 14125, 18115, -1508, -19165, -9083, 1413, 1757, 7581, 21570, 16814, 3512, -8659, -7203, -287, 10856, 148, -8505, -6123, 10236, -770, -14226, -7450, -16040, -15554, -1371, -5354, -12051, -2330, 9647, -5379, -888, -873, -8337, -7762, 9155, 1619, -13302, -8601, -354, 4839, 4081, 16458, 26585, 13046, 1902, 1351, 8871, 9667, 18130, 24124, 11199, -6032, -24499, -21398, -13615, -2494, 5931, 4443, 4609, 17785, 20227, 13445, 918, 2899, 8115]
7181H115L222j0701j5762J576L1017L187j270k1449l000L68m823r075j3256J3878
7167a7973K7735K310j7101l288J5651L211L337r032o161n295Q624l744j1049P02
7153a2073J4467j584M122J0726o29r334R870n530o812j4253j3965o30J1173K5756
7139A1304M711r035l777n169J1267P717k1444R542J8851M624l840K53j6901j0700
7125b597m760N07R636j872p9L25p090j025N029O396J6308n528j7364k062m113
7110h289N18n609J8098J4668L088q231k3969O026J6704K565m835k693j664J1247
7096A7624n337j1165M56p134M623J2236j925q522K379k200O034N496j1147K630
7082D048J504P51r346J401j4081J413L820M474K1629p4k1108r228j697l855Q196
$$ y = [8115, 11337, 636, -15126, -13550, 17467, 20654, 19384, -2065, -5065, -4697, -9520, -18595, -31851, -17973, 9762, 12072, -5029, -8317, 7334, 10545, 13882, 4850, -1311, -6606, 2018, -1726, -12775, -12073, 2394, 810, 4932, 15658, 15029, 5695, 15565, 10035, 3223, -11030, -24995, -25625, -14452, 11304, 16015, 6980, 3203, -1966, 9301, 17018, -4426, 5116, 23967, 28591, 24751, 25004, 8103, -2597, -7357, -6850, 2786, 914, 835, 1160, -5930, -6955, -1926, 4470, 20778, 15250, -2114, -4176, -8289, -7771, -13380, 4718, 19386, 22474, 14243, -9726, -3700, 13004, 15569, 10734, 8041, 6377, 17624, 12287, 1122, 1578, -5556, -933, 11303, 9378, 856, 3235, 1035, 7069, 12565, 1418, 4048, 5552, 6303, -3043, -1642, -15723, -14310, -10490, -6016, 15613, 15539, -5569, -14797, -16494, -20349, -12153]
7067a2153J3850J1832l386k962j0669j7825l675N225Q069R257K041j2081j5298
7054b7775P254J8337J2969l497J26O891p998k81J923M723M122n346J742m544j3053
7039d407j7669m360L406L562J322r286o491k578L435N52L544J7703O998J3580
7025I311J6339j5835l667Q445N841r098m635J123K149J157j3471J582j4335r70
7011a6064N601R21O986M367P673O284n959P212K846n422O51o757q546k733j6058
6996a8998K3615J4533M112j0911k0328J152r06K705j833k513N777K98J4439N266
6982A6408O486k6886j0498J7948J0173j03j3364k8538j7288r11J3412J0814J5775
6969f572R005R455J159r499m197N911l071j3721R42R296N272j7825J102l732o364
$$ y = [-12153, 1697, 13529, 10143, 7181, -3488, -21313, -24988, -19763, -11694, -2437, -396, -12477, -27775, -20521, -2184, 10785, 7288, 7414, 14305, 6307, 6026, 7949, 12672, 16794, 11448, 13190, 8646, -4407, -22076, -26436, -23030, -19468, -18146, -27432, -33923, -36501, -33066, -32514, -28970, -11267, -4269, 9311, 25650, 9815, 6148, 14593, 20434, 11336, 6701, 7824, 9973, 11130, -2341, -759, -15094, -16064, -10463, -9542, -2556, 1811, 9484, 15768, 9809, 17021, 19867, 14445, 15096, 8339, -207, -2940, -18998, 4617, 19150, 23262, 12351, -7977, -6825, -7731, -5026, -6859, -9372, -3595, -3297, 11142, 16408, 22894, -3992, -14490, 3458, 13631, 13528, 164, -28374, -45662, -46573, -33161, -22347, -6572, 2433, 11888, 13047, 3548, -649, 5262, 2191, -11530, -10588, -1292, 3980, -13845, -12743, -16475, -22839]
6954b2839J8045j616j4479O761J502j4204O073O542K529k1542P478J6084R23n128
6940a3871j934j9281q427M841R248Q062L197N83k472m679Q654M862R332N217j9182
6925a5850M667M968q041L315n766P647J0189M351N533p027o66J2893j635n385
6911I193O426l356j1742l026K035j1333p684J633M334k188K300J2426N251j79
6897D090o063l923R009j126j6649p77N414P373M645M270q670r20O220j749M980
6882F124N953j0375q90k729Q850J4123L229r994j2610K64J0m393J081p941L084
6867f214K086J9503L198o601o437K682K555j627o703j076r05j2904n774j5302
6853c3519J2672L334k286J6961K4341J8669M235m558j5543q003p927O366o012
$$ y = [-22839, -4794, -6410, -20889, -14128, -12626, -26830, -20757, -14215, -11686, -33228, -25750, -9666, -8743, -13871, -15805, -35086, -43513, -38672, -29424, -21362, -18165, -17582, -20054, -24733, -16079, -11217, -1885, 3332, -15850, -11183, -6215, -14256, -10941, -16707, -9060, 1129, 5480, 11013, 3986, 3320, 16213, 14578, 9193, 15619, 12263, 521, -2505, -470, -11803, -19487, -17854, -13520, -15708, -13408, -982, 4269, 4090, -1973, -5896, 3113, 1987, -14662, -15439, -10025, -2652, 1993, 6263, -2407, -3327, 2893, 1144, 6124, 12077, 1702, 812, -1917, 6933, 21056, 24285, 14291, 1681, 1945, 1955, -2438, -1357, -9298, -6214, -4128, 15375, 18573, 11972, 5535, 8217, 10772, 9145, 2442, 1366, 461, -12443, -18217, -33519, -20847, -17513, -19799, -2838, 21503, 40172, 44407, 39849, 24306, 16303, 8376, 14742, 8730]
6840H730j7364l740K1863J7566o474k2834J5717J0608n796j7405m796m253r51
6827i129Q385J3813J7792k2915k1205q736m982P769J4156q30n193P674J0168j9256
6813a2489j9322P291P777Q403J2097L384Q818l251l585N946J0397l290r519J1173
6799B3830n00j1223O108R431k4800o738K478L104M736m617k328K437M466j9511
6785a3127n327M207J5199n51j8896l542l283k542J080j456J0281J3734J0060o077
6771b40k261K0517j386j2071o316r788R303Q766J2231J5844j390M39L892l547
6757C3993j5677n996l730J08L988R20o150j0553P237R367N37Q203j2363j9850
6743i966r599Q335K2750J2947P917R246k4745l038k355j3583M835O697n184k464
$$ y = [8730, -8634, -12374, 9489, 27055, 20581, -2253, 13464, 24072, 18276, 871, -3925, -8178, -9129, -744, 13069, 30861, 7946, -13259, -21995, -26977, -19208, -5052, -5882, -11075, -3401, 6767, -12489, -31811, -24520, -16743, -8340, 3757, 7141, 15959, 12708, 9123, 15069, 25466, 22176, 12657, 23830, 23330, 12107, 18215, 27646, 2846, -3892, -1414, 1690, 6426, 1809, -519, 1918, 6384, -13127, -18454, -14247, 952, 401, -18495, -22037, -25320, -27862, -26782, -28238, -17957, -4223, 5837, -240, -2501, 18016, 16630, 4559, -1757, -11545, -2242, 6524, 18755, 34599, 33209, 33648, 37540, 33993, 18316, 12320, 8590, 8698, 12686, 13606, 7456, -3097, 4140, 13507, 14044, 22247, 9884, -9966, -19565, -11230, 11520, 24467, 32384, 41630, 16885, 13847, 11492, -2091, 2744, 9441, 4257, 1793]
6729A793m436j3495J15J2061q625O388Q055J3867J4232o320N35J2262L3056L4963
6715A04451J6536m857o402j787J0043o212l5475k3498j3658l215L486k789K820
6702C9443j0147N731l824j9076j0372n101M079j1174N207k97k127J714K852Q342
6688E250N317k0140K616R985K369N924l439k3071q738J2311J9221M471r010m116
6674a050m412M629j7264j7464J836Q532J1544p31M466N806m163j1103J2400L786
6660c188O557J3063J625K5k975j1509k5930l611K2888q606o568J1205J5088N77
6646H641J1198q261j8801q068J2156O401j2030q18k077P021q191M364J2410o238
6632b293M36R384K796j073J652K440j0738j0396k77J0005j0944j2625M918P157
$$ y = [1793, -2643, -16138, -16023, -3962, -12587, -6199, 1856, 15723, 29955, 23635, 24170, 36432, 69488, 104451, 120987, 116130, 109728, 107941, 117984, 111772, 76297, 52799, 39141, 35926, 39412, 36623, 39443, 29296, 35027, 31203, 12127, 1755, -3346, 733, -10441, -5234, -5531, -7658, -5944, -3092, 5250, 10567, -9573, -6957, 3028, 5397, 11321, 7882, -15189, -23927, -11616, 7605, 12076, 3066, -1050, -5462, -833, -18097, -35561, -33725, -25193, -13649, -14380, -9914, -4108, -8271, -19374, -6974, -3188, 3369, 16432, 18057, 18082, 15107, 3598, -22332, -25943, -3055, -11661, -18229, -7024, 8064, 8641, 19839, 11578, -7223, -15291, -3135, 3266, -8764, -9582, -11659, -4638, -12829, -8465, 3945, -2293, -1857, 7527, 10323, 9250, 10902, 13342, 2604, -7792, -8069, 1936, -9008, -21633, -16715, -9558]
6618i558p070p415M095n452l149j651M067J8852L513K665n323m419R872n582j8169
6603b4724j2659J9546K6287o090j0841p812r464M784k516j564N457J2502Q954
6590A860M763l284M310P26j6995j2757p942P228K6217J2923r543o844O049J6867
6576B3578J137j0218j3467j2429J9717O568r185p331L202O826n91k966r676j890
6562f725k1252O990J9524R224P308k987k346R797m061j1113l718l549p719K066
6548h561n576j5767P219J3347J8497K454O499J679r462L843O89Q818m53n027j6042
6533B157k261M217o833o107J92P362N19J585L666J4018J540q81q851j3533J29
6518c081j7509j4533J6941K1307l069q065N361j0896m405J0849R802Q835k2082
$$ y = [-9558, -16628, -24043, -19948, -25400, -28549, -30200, -26133, -7281, -3768, -1103, -6426, -10845, -973, -6555, -24724, -37383, -17837, 8450, 2360, -8481, -16293, -25757, -20973, -23489, -25053, -19596, -7094, 1860, 6623, 3339, 7649, 8375, -8620, -21377, -29319, -22091, 4126, 17049, 7506, 662, 6711, 23578, 24715, 14497, 1030, -11399, 8318, 14886, 5701, -1630, 1572, 8398, 7807, 4841, -4835, -6725, -27977, -20987, -1463, 7761, 15069, 12082, 9736, 19533, 15472, 4359, 641, -2908, -10627, -8561, -14137, -29904, -22685, -9338, 9159, 11613, 18112, 19791, 10329, 14172, 14861, 23679, 23226, 18199, 2157, -104, 4113, -2720, -8827, -8635, -1273, -754, 831, 4497, 18515, 20055, 19174, 10323, -3210, -3081, -20590, -35123, -18182, 3125, 56, -8009, -2648, -13544, -17949, -7100, 2702, 11537, -10545]
6505a0545p647o528P231J2430N229j0643o718J7672K1715J824p59j4779p125j2142
6491a0785q168J2870J5418j000p287m320k101N296n648n341J3482L027n176L860
6477D127m475j0002K623O486n156O447m327q93R78n490o553k810J909Q984O169
6462a983N178J5779M08K99l421n998o116q395L34n199p528R326j527j779J3285
6447B663Q013j0557j3829l371O078N727j6386j1564l682P462J4069K4034Q426
6434A7083J722m648j0224j4115N190J2978J0204N39j3409j4269R544j114j0152
6421a0671M289J2117M3m303j6056m500J36N806m215j3996p158Q547J2593M656
6407a2712J992j898l017q40J2482L360n964j321k161j3460M532J1416R283R530
$$ y = [-10545, -18192, -24720, -17489, -5059, 170, -10473, -17191, 481, 22196, 24020, 23261, 8482, 1357, -10785, -18953, -6083, 9335, 8335, 1048, -3272, -5373, -77, -5725, -11066, 2416, 5443, 267, 4127, -348, -10350, -7727, -1241, -6397, 50, -4277, -5170, -4192, -9682, -16235, -19045, -17136, -8152, -1983, 3195, 18974, 19382, 19681, 16260, 10262, 4146, -4249, -3915, -9114, -16642, -7316, -8843, -10622, 2663, 10676, 119, -13710, -17081, -11003, -5276, -21662, -33226, -36908, -29446, -15377, 8657, 17083, 18805, 14157, 3933, -10182, -4992, 7986, 18190, 18729, 5320, -8949, 595, -519, -10671, -6382, 5735, 5778, 1475, -14581, -19081, -18945, -13139, -17354, -31350, -38508, -29961, -17368, -12712, -10720, -12618, -15635, -16475, -3993, -633, -6597, -7918, -10079, -23539, -19007, -7591, 1692, 11222]
6393A1222q926K966L927P48Q498j012J649j7020k0972j90P564J8196Q833p385
6379H098k2843K666J2391K228k4741k0723k931K0315J2518p311o08M341P423K040
6365g137l312J595O547J6978n80l606J4628M925k7691R955p312l925Q406k500
6351F971o61L985l019m252j2519j4500J1500J5884l314j6011L840J399r306J0625
6337i378L247n672J1239J3439j285m658m879n311L173m441J2963J4017J130M142
6323B7726p953k8988k650K1008O136O34O926P413r886j1453l403j0397o375J2741
6309A479K48o931o65L258P011L538Q70O906r174Q661P225n716m173j7524j449
6294f436j209j324M113K147r805q077q707J336N627J4425R539m893K238r850n621
$$ y = [11222, 2296, 5262, 9189, 9937, 18435, 17423, 19072, 2052, -18920, -19110, -11546, 6650, 15483, 8098, -14745, -12079, 312, 2540, -22201, -42924, -45855, -25540, -13022, -20333, -20941, -16600, -9177, -7137, -10449, -8854, -2307, 14671, 14091, 10485, 25113, 30038, 2347, 12302, 4990, 1065, 9471, 6971, 6310, 10295, 7276, 3024, -9495, -23995, -12495, 3389, 75, -15936, -12096, -10697, -20003, -9378, -6131, -11803, -564, 12875, 11590, 6932, 2053, -3258, -85, -4526, 8437, 22454, 23584, 27726, 19773, -9215, -11865, 9143, 15279, 15913, 22839, 30252, 20366, 8913, 5510, -4887, -11262, 1479, 1727, -5204, -5869, -2611, 4400, 7938, 8808, 15714, 6540, 15201, 22426, 16710, 12537, -4987, -6436, -7645, -8969, -4856, -2709, -12514, -20591, -29298, -27962, -22335, -7910, 1629, -3264, -1026, -10876, -16497]
6279a6497L704J5398O361q479r588J0403m409j0032p931J1397J0551J821l808
6266a109Q79p531m875O299O339n102J7529R091k0190q903J880N201l62P689J8619
6251B5454p978k6669j9405J3409K6250p286J7004K3677j7071j4663j401J564j5394
6238b509j2627q09J2613J829o491M713P058k132j0143J524N614J089J210M784
6224E723o511j62k772J0898j467j7173Q60O762N230r430p295J9894J8965Q365
6210C1887k0590m031l023o29k780m657R55K2802k236j1969J609J7919P118p010
6196B5365K616j5932o326j0174J0610m694l660J1545O68O055l144m000J162L191
6182A3282J5502J0079l223J517l344j8694k1112j6420J7740K0216j903j0771j651
$$ y = [-16497, -12793, 2605, 8966, 487, -9101, 1302, -3107, -13139, -21070, -9673, 878, 2699, -1109, -230, -7761, -12636, -6337, 2, -5100, 12429, 21520, 1330, -7573, -5693, -492, -854, 6835, 25454, 17476, -9193, -28598, -15189, 11061, 3775, 20779, 44456, 27385, 12722, 11321, 12885, -2509, -15136, -15945, -3332, -1503, -7994, -3281, 3777, 1645, -8498, -6974, -1360, -271, 939, 5723, -788, -950, -3722, 7176, 5709, -11464, -10604, -3842, 1388, -8042, -15337, 4557, 23522, 31887, 11297, 7266, 4243, 3614, 834, -3823, -2868, 19934, 17698, 5729, 7338, 25257, 32375, 25365, 27981, 12049, 5723, -4451, 6159, 1465, -2195, 9350, 10018, 16073, 12929, 8929, 10091, 13282, 28784, 38863, 35640, 37157, 33813, 15119, -5993, -22413, -4673, 15543, 13640, 2869, 1218]
6169A218q031j42m725M760J2947r311J877N061R948m07o962j5111j20j0566q292
6154b7856k665m96O419j723R204J7122o804J0339J4714k467k8185j617o812M74
6140b0353L1854J7586j0826l3661n859J2987l412Q627l979N361L233n591M970
6127I37J2485J2652o664j644n136p78K448m026J2919N24j8434k7739m140O103
6113b0493J1097j079j2059L759K379o86R599J3535P915K878m836L797R046L947
6099B8799o787o763o106j7675p658j300L168Q107Q921O126p463k3309R14J3880
6085g146J4724k326j2613j007K0367K0101k4285o393k626j3974o002O483J0439
6072d258K909J0695J0498q111j2356j3478K2619P337m668R405o685j3294j3611
$$ y = [1218, -6813, -6955, -11680, -6920, 6027, -3284, -1407, 3654, 13602, 13195, 6233, -8878, -8998, -19564, -27856, -30521, -31017, -24598, -26321, -17117, 5, -6799, 3540, 18254, 15787, -12398, -14015, -20827, -20353, 11501, 29087, 18261, -15400, -21259, -8272, -11684, -3057, -7036, -1675, 1558, -4033, 937, 13422, 26074, 19410, 17766, 12630, 11852, 14300, 10274, 23193, 23717, 5283, -22456, -26596, -20493, -9396, -10475, -22534, -18775, -16396, -17082, -7483, 6052, 13967, 16845, 12009, 15806, 24852, 28799, 22012, 15249, 9143, -8532, -16190, -17490, -14322, -6215, 2706, 8832, 1369, -21940, -21026, -7146, 7578, 5252, -7361, -8368, 11999, 32100, 7815, 1422, -1204, -15178, -21180, -14697, -4258, -1349, 9346, 19844, 11733, -623, -14101, 8518, 15855, 11187, 20592, 13907, 613, -12998]
6059a2998o16J5689k31p997j5441p072k451P273K1704p78P485K148j2929p901
6045a4115J4663l665k005O239N425j0302j715j062J211J121o364P069j0931m393
6031a8824J1595J4569o050O41K158P1m727m150n598j2195M74M928P804m146J2218
6016a232J3065k1025k4663P28J662R290R554R339l080k25M303O688k207l32K727
6001D592M368q377j861m263l334M942j0056M665J6304l155n299J485R334o324
5987C021o092r671l12k86m670R46j9305j1712J3640J2699J9764N358L031l471
5973B940n976l280J5394P216L122J811l980k5251j0018N749l131J0206K1883P193
5959B3878r357j1604O09N081Q535J533j978R026P948n656j6595k370Q238J3840
$$ y = [-12998, -13614, 2075, 1844, -6153, -21594, -28666, -31117, -23844, -2140, -2918, 4567, 6715, -6214, -14115, 548, -3117, -5122, 1117, 6542, -3760, -5475, -6537, -5326, -4205, -10569, -3500, -14431, -18824, -7229, 7340, 1290, 1931, 4089, 4160, -567, -4717, -10315, -22510, -22036, -17108, -9304, -13450, -1232, 11833, -9192, -33855, -33127, -31465, -22175, -12621, -3282, -6362, -6587, -2284, 4404, 2197, 1865, 4592, 8960, 583, -1278, -5541, -8875, -3933, -13989, -9324, 6980, 3825, -1474, 11, 9345, 3021, -3071, -12742, -13054, -13340, -18010, -17064, -36369, -48081, -34441, -21742, -1978, 3380, 6411, 2940, -3036, -6316, 9078, 16294, 19416, 21227, 17247, -8004, -18022, -12273, -15404, -5198, 16685, 23878, 14521, 2917, 3526, 8607, 17142, 18675, 16697, 25723, 33671, 28015, 11420, 9050, 17288, 31128]
5945C1128K883k298o051p48l31n853k5273m85J1024J737q796j1968O525J0039
5931A533Q124k1901j2653n730R974K5260K1287K902j8771j3755j1993J3892J4544
5918A2713L348J157j2865N569Q05l219o391m401K164j463L891r9n914o258J6855
5903E892P125j1599J3992J214o37r17N703r683j504L124l115l886J2051J812N408
5888B4980q572k0874O24n633o63j195R084J5313O289j0804j9766o218Q891J3089
5874D545m889j2274J9659J8582q076j2569j0384N907L40r777l599J228J3547n266
5860c026K711Q128n61J658j380p766n810R70J3926l649j2711j1375j0246J3309
5846a5822m265N839J8807J9422K383j4460l823p079j5961L866N370O098n840M232
$$ y = [31128, 34011, 31713, 25662, 24914, 24583, 18730, -6543, -7028, 3996, 5733, -3063, -15031, -8506, 1533, 9657, -12244, -24897, -30627, -20653, 4607, 25894, 28796, 10025, -3730, -15723, -1831, 12713, 16061, 17218, 4353, 9922, 10727, 7508, 1117, -3284, -1120, -2583, 1308, 1209, -4705, -10963, 5892, 13017, 1418, 15410, 16624, 15987, 15070, 20773, 11090, 9586, 12710, 9595, 5709, 17760, 19572, 24980, 16408, -4466, -3842, -9475, -10138, -11333, -2249, 13064, 19353, 8549, -11217, -17435, -8544, 4545, -344, -12618, 7041, 25623, 17547, 4978, -5406, 501, 841, -8936, -12535, -11307, 2240, -3026, -315, 7813, 7252, 8910, 7530, -236, -6046, -5076, 8850, 5201, -7510, -18885, -29131, -15822, -20087, -14248, 4559, 23981, 26364, 11904, 8081, 1002, -14959, -11093, -5723, 375, -5465, -1233]
5832a233N473m949k0753N705R996M844j0227j0270j028m503p935L757J3448k141
5818a9816M322J0717q243Q50O435j3693k981L671J3185N092q942j0790M818J996
5804a3379J0509m044o883o699o800J3230J2866P775P667q278p563J0624R761P070
5790B5856l12j8765p329K621M929N026O011L015j4722KP439R138L413j8776n87
5775F959O744q376p862k383j5198j7697k139M947Q073N226R868l073j234R101
5761g044P437o816R73P259l234o868J5218p882j4080O726O020Q414r101o149M285
5746d842k46j141n341p839l386m877O948O273q839K047k011k12o48p27L863K3267
5730B289o007o426J0636j1949j0210r23k597L382J4770J7326M050o830j1763j4396
$$ y = [-1233, 4240, -709, -21462, -15757, -5761, -917, -11144, -21414, -22442, -26945, -34880, -31123, -17675, -19816, -15494, -4777, -13020, -12170, -5735, -19428, -22409, -18738, -5553, -461, -9403, -20193, -15375, -13379, -2870, -6914, -13797, -20496, -27296, -14066, -1200, 6575, 14242, 5964, -1599, 9025, 18786, 25856, 25544, 6779, -550, 2071, 7000, 12026, 18037, 21052, 6330, 6332, 13771, 22909, 26322, 7546, 6959, 13703, 5327, -2535, -4918, -20116, -37813, -39952, -35005, -26932, -21706, -11838, -14911, -16145, -7044, 393, -6423, -5450, 1809, -1425, -8293, 6925, -957, -15037, -8311, -2291, 6123, -2978, -9127, -4842, -5088, -6229, -11570, -19409, -22795, -27672, -20724, -14451, -23290, -21243, -23254, -23466, -24114, -24841, -20978, 2289, -3718, -10144, 492, -11457, -21667, -22590, -25187, -21805, -7035, 10291, 14341, 7511, -4252, -18648]
5716a8648Q63K582J4084Q92O506J3517J1949j5893j1196j980j7124r037J6633
5703f852O965P367j3584p057P968p789m625J2839L122j80J1166o921k737Q000
5689G682l929L402N381Q641j1825j3732j5196J0532J8173M309n845j4408n386
5676a2201J0257J2640O798j0537N00j5040m728O673q181o761P05R205P492J9192
5662A6014j0011j9221M75J2729J5060R89j3433j1572q178J0082L982L214O149
5649F279r216q481N074J003k761m517P280J2643J0051l813m248j0814r792R374
5635a938k69q645O752O506j2197P396K294r338M084M808J384J0368k18q108j4298
5620a1419n833p451N407j9945L910K5690R273J0949k770j4638K401P033P836N979
$$ y = [-18648, -17785, -15203, -1119, -227, 6279, 19796, 31745, 15852, 4656, 2676, -14448, -23485, -6852, 113, 7480, -6104, -13161, -5193, -12982, -17607, -4768, -1646, -1826, 9340, 2419, -318, 7682, 3753, 7155, 12536, 21177, 9352, -4380, -19576, -9044, 9129, 13438, 7593, -6815, -12201, -1944, 10696, 17494, 6957, 7457, -7583, -12311, -5638, -13819, -20580, -19875, -10670, -3178, 16014, 6003, -13218, -12743, -14, 15046, 16035, 2602, -8970, -17148, -7066, -3084, 130, 6279, -2937, -11418, -6344, -5341, -8102, -12619, -5339, 7304, 17355, 13542, 9294, -1520, -11312, -1938, -2207, -10852, -4100, 2406, -9791, -2395, -101, -9439, -5355, -547, 837, 11205, 10987, 2879, -11419, -17252, -24703, -19296, -39241, -35331, -9641, -368, 10581, 7811, -6827, -4426, 2607, 10443, 16422]
5606A6422Q41j6184j3753M847P221n223r619L447n678N059K639r216K203Q976
5592h018p224n829R79j3518j3960O956J5372P452K0888J2790l765o629r416p722
5578a1644J0709M30p849J2087J5126J3564J900l069j1923k2649p954j7904J0079
5565a9097J3029J8610j290j907L661K1469l827k0572k919j1240j1034J7894J4531
5552A7308r858p148n826k697L969j1052P705J3373j548J3406j1391m233K462m100
5538C70k4407k55L1713J0303J213k1134p23K112L68J7527J104o468l568j8921
5524a0766j0615K252N424P937J9376l974j0799k431r046K739p159J251J6271J9041
5510A9501q926j1077K91L896m664q892R137j94J439K8k097J0m862RL061N887K000
$$ y = [16422, 17263, 1079, -12674, -7827, -606, -5829, -15448, -12001, -17679, -12620, -9981, -19197, -16994, -8018, -15242, -21071, -20092, -33610, -47570, -40614, -25242, -17790, 3098, 15888, 12123, 5494, -3922, -11644, -935, -505, -8354, 3733, 18859, 32423, 34323, 31254, 19331, -3318, -11272, -29176, -19097, -6068, 12542, 11252, 9345, 13006, 34475, 30648, 10076, 7157, -4083, -15117, 2777, 17308, 7450, 302, -5524, -8221, -4252, -15304, -7599, 5774, 4226, 17632, 6241, 2008, 4470, 370, -24037, -24292, 7421, 17724, 18937, -2197, -2920, -808, -440, 17087, 18191, 11723, 8155, -10766, -21381, -19129, -13705, -5768, 13608, 9634, -1165, -3596, -12642, -9903, -17062, -15811, 460, 19501, 10575, -502, -211, 3685, -979, -9871, -734, -928, 511, 539, -1558, -1548, -6410, -6401, -3340, 2547, 4547]
5493D547P15r6j8216n93J5148J4204j0802r858J863J5919m184o446J1897k621
5479A1477m882k911m101n495J241K655m722J642N780N439n6p621M08J0140K974
5464A1968j644r602j2189n665L769J0075M034J1965o8k015J3842j5686j6690q43
5450h749J1011R28J4230M647J4044j3330J192n987r825j3631J0006Q683o360o863
5436dm045O004n047n399L939R296J6238r482R73j61l599L981J5180K294M740j3496
5420B1412j2730j0480l857m951j6737m179J4869R370K156n206j953J7686J2756
5407A8156j7788l818o273n731K091J2634j895n67R011K556J7393O605k0986j8612
5393g224q699l004p270K3003J3456M559j076m737J356N196K282l27O647j1883
$$ y = [4547, 5262, 5166, -13050, -13643, 1505, 15709, 4907, -4951, -3088, 12831, 8647, 2201, 14098, 11477, 6595, 3684, -417, -5912, -4671, -2016, -6738, -5096, 684, 6123, 6067, -1554, -1146, 8994, 11968, 10324, 722, -11467, -17132, -13363, -3288, 746, 12711, 12643, 10628, 24470, 8784, -7906, -8749, 2262, 3190, 17420, 22067, 36111, 22781, 23973, 17986, 8161, -5470, 4536, 13219, 6859, -4, -4049, 1955, -3092, -8491, -4552, 4744, 20982, 11500, 12473, 12312, 8713, 12694, 27874, 30168, 34908, 21412, 8682, -1798, -5655, -10606, -27343, -31522, -16653, -7283, -5127, -10333, -12286, 5400, 18156, 368, -3450, -9723, -15454, -13363, -729, -2624, -3191, 5820, 8376, 25769, 32374, 11388, -7224, -15923, -18927, -26197, -3194, 10262, 14821, 13745, 9008, 10364, 15560, 17842, 17515, 24162, 12279]
5379A2279p886l655r548m913P980J1483M462J825j813r244N410O341K553J998
5365A7272r739j5633l944j055o93J3937j033r939J1529L972l538N506J6504O327
5351B9473j7178k1642o323J972N770l592K117J683O841M612P321O152M277j2248
5337I235j1581r087J0524j3001o88J1581Q215P648p202J549M721O403K1690M665
5323D4672k0669k2739n511R485J2817q258j6183L397J6681r062m658J752J6426
5310A8150n049k4087j1746K723J1481N553J0028q942j5628r88K496m666R495M046
5296g134k337K368J513r515r243J210N079J0793Q485q020N080k895J647O303M064
5281G398M996k2295l1435n5l197J9552K5390J1209Q053m987j5717K665M217j3849
$$ y = [12279, 4393, 738, -8810, -13723, -5743, 5740, 10202, 12027, 10214, 970, 6380, 12721, 15274, 17272, 7533, -8100, -12044, -13099, -13792, 145, -888, -10827, 702, 4674, 1136, 6642, 23146, 29473, 12295, -9347, -15670, -13698, -7928, -11520, -9403, -7720, -879, 3733, 11054, 17206, 21483, 9235, -2346, -11433, -909, -13910, -14598, -3017, 5198, 12846, 5644, 7193, 11914, 18317, 40007, 44672, 24003, 1264, -4247, 5238, 18055, 9797, -6386, -2989, 13692, 4630, -28, 1724, 18150, 13101, -10986, -22732, -20009, -8528, -2975, 7053, -1889, -17517, -18505, -16009, -20675, -11180, -7134, -9471, -7103, -5590, -15105, -24348, -23138, -18059, -7266, 1219, -6801, -1721, -4616, -2969, 3334, 7398, 12394, -9901, -41336, -41391, -44588, -25036, 354, 11563, 19616, 14629, -1088, 1577, 5794, -8055]
5267h055p416m115R856J0430J1121J0427j0433j7399j2900j528J3579j41L072
5254c502o721q30j3969k288K6470J4223L770j1590j2581M395J2610m194j559j554
5240B680P532n85L825j3160j3168R317q428l156J1834J2175J2675j4346j2325
5227e130o482K185j5317j467R049K45N799l156j7109K47J6348L949q517R573J3374
5212C591m274r308j2423j3222j120P309K2333K1010m442k0228q360L853n519M100
5198a6700J6471J1866P106j3407q8M963L682J0617j0007j4493q03K1748m427k7422
5184a0894p147m356P519J4265J1515r444j6421P3J2690l501j628J1084k382o791
5170e418j5471M354J2772m638O58K1979M952n682j2761J467r39Q397j296N1k538
$$ y = [-8055, -15471, -19586, -9730, 700, 11821, 22248, 11815, -5584, -18484, -20012, -6433, -6574, -3502, -10223, -11053, -25022, -27310, -840, 13383, 17153, 5563, -7018, -2623, 9987, 5793, 4234, 2680, 10212, 9627, 13452, 292, -12876, -3559, -11987, -15143, -3309, 8866, 21541, 7195, -5130, -11612, -9427, -24744, -26211, -17162, -16917, -11118, -14274, -31383, -31136, -14788, -10839, -19356, -9783, 3591, -683, -9991, -22414, -35636, -36756, -29447, -7114, 13896, 9454, -10774, -19134, -15281, -20800, -16700, -229, 11637, 18743, 5336, 5248, 10211, 13893, 24510, 14503, 10, -793, 20955, 16528, -10894, -18041, -22397, -14878, -613, 10902, 1458, -14963, -14890, -2200, -5701, -7329, 3755, 1373, -5418, -20889, -16535, -3763, -8401, -7743, 14236, 19188, 13506, 745, 2212, 1273, 9670, 8374, 8425, 5887]
5155E887p975O633Q386O439q703j76Q436m882j5010r617Q867J5018N118j036j0134
5140G251N650r428o959L09J2414p164M12m858j9109K396K1410J074j1833j3935
5126b2370R011J0368k516N074O619p527K510P331N578K86O529O740L750j7561
5112A3822j5436N341n672j50J032K682P675K5184K761j243N59m254j1242j0341
5098A0718n372l308P46K514M5k961O133J048q591P75j0471n972J0271j212n963
5083a1600J6568J3487n498o225l757o832j492P265J2045O355J2398j0196j2327
5070A0191n593J373m079j2802Q005L446m677M161j910N193M996J2833n116j074
5056A4947L221J3135j0123k8160J58L711P669J0455L210j1775j0103R859K613
$$ y = [5887, -2088, 4545, 12931, 19370, 10667, 10491, 18927, 14045, -965, -10582, -1715, 13303, 18421, 17385, 7251, 12901, 3473, -3486, -3177, 9237, 2073, 2485, -2373, -21482, -19086, 2324, 3398, -8435, -22370, -13359, -2991, -5507, -433, 6186, -1341, 1169, 8500, 14078, 14364, 20893, 27633, 31383, 13822, -1614, 3727, -1945, -2095, -1063, 1619, 9294, 34478, 37239, 35996, 36555, 32301, 21059, 10718, 5346, 2038, 2784, 5298, 5343, 2382, 8515, 9563, 972, 1747, -8724, -14696, -4425, -5637, -11600, 4968, 18455, 12957, 6732, 2975, -3857, -5349, 1916, 13961, 20316, 32714, 22518, 10191, 4598, 5971, 1892, -10910, -2905, 541, -4136, 25, -1885, 3308, 8304, 21137, 16021, 14947, 18168, 31303, 21180, -6980, -6822, -3111, 4558, 15013, 18223, 6448, -3655, 6204, 8817]
5043H817n411j280L314O660J1652j6574j7355j688K87K253J3190o290L37j5716
5029a7804k951M243O350K2406o762m495m039j7382o594Q396J2762J6679m720r857
5015c768K72O028R080k598m07j0113k3165M549R281Q104Q967N330P706K0820n014
5000C5072j1621j6041k2324l740K6506J0674p900j0951J1465N025J8598j33q919
4987B5711j4986n330n39J5609o124m779l998j43j1149p756J5426M387l100J2758
4973A5987q096k2547Q062j862R705j650l376j1781j1931K2827j750j6155J7083
4960e484K087J977M595N186j1970O769K055q48l725P679J3097J4326q463j0283
4946A6998k1612q180l857j880l329j0424O762Q945J4475J1844J957j2189j0820
$$ y = [8817, 3406, 2126, 5440, 12100, 23752, 7178, -10177, -11865, -11578, -9325, 3865, -2425, -2088, -17804, -20755, -16512, -10162, 12244, 5482, 987, -3052, -20434, -27028, -18632, -5870, 10809, 6089, -3768, -3496, 2532, 11612, 9014, 8607, -1506, -24671, -20122, -10841, -2737, 6230, 11560, 19266, 40086, 35072, 23451, 7410, -14914, -18654, 7852, 18526, 10626, -325, 11140, 16165, 34763, 34630, 25711, 10725, 5395, 4856, 20465, 14341, 9562, 5564, 5421, -5728, -13484, 1942, 6329, 3229, 15987, 7891, -14656, -6594, -8456, 1249, -401, -3777, -15558, -27489, -4662, -6412, -22567, -5484, -3397, -1420, 3175, 8361, -3609, 3160, 5215, 4367, 642, 8321, 21418, 35744, 27281, 16998, -4614, -12794, -16651, -18531, -21860, -32284, -25522, -16577, -2102, 9742, 11699, -490, -11310]
4933a1310p573k51K9550J2574j1960r048j1862O080m454j2615J2774R528r230
4920g797n687q686l499M343Q214J598J1029k355j844q798q995J406J5822K3611
4906A8362O358M484j2469l3008O07J1968m046O153n761o109r871r499R032K5336
4892A537P79j8322m798o986N255k64J4700J0783J476j534r875J062j8533r982
4878c4702J1524J2128J522j427J5710R244j215j6879n879J1333N371l628K648
4865E750j582p072M224n838K182O741M301r602j3775o028J3393q98Q452l598j3180
4850a6530J6200K957r969k732Q844L075Q67J6156j1229m456j406j626j1847n604
4836a7300J9182j769q912k923J6702r420n425K78M37O512J0682L015o919r565
$$ y = [-11310, -18883, -19134, 10416, 22990, 11030, 1982, -9880, -3800, -8254, -20869, -8095, 1433, -7797, -13484, -22170, -25669, -21326, -13112, -11514, -485, -2840, -4684, -13482, -22477, -21071, -5249, 18362, 24720, 29204, 16735, -16273, -15666, -3698, -7744, -1591, -7352, -13461, -23332, -32831, -23799, 1537, 2316, -16006, -20804, -27790, -22535, -22799, -8099, 2684, 4160, 2626, -7249, -6187, -24720, -34702, -23178, -11050, -9528, -10955, 4755, 13999, 12784, -4095, -9974, 1359, 6730, 3102, 5750, 4168, -2904, 1320, -4518, -2336, 4405, 8706, -896, -14671, -20699, -7306, -8204, 248, -3350, -16530, -330, 2627, -7342, -10074, -1230, 1845, 2712, 18868, 7639, 3183, 1777, 151, -11696, -17300, 1882, 113, -8799, -11722, 4980, -4440, -9865, -9587, -9150, -2638, 8044, 11059, 4140, -5425]
4822e425n396J0650J66j1605K142j287j5699j0187K0269N687k788r534Q120O754
4808h133Q229n366k814k502q801k467P842M206j0786J5706N519j1930j2064J2107
4794a1254P776n20J0517L283Q897N198N648J898j4531k7788M318J5379J7369J5291
4780D1481M846k0085j8452p84j341o270l8M59L642j5616M320P300j0724O914L456
4765h92q455R35K2020j632j387J516M612r034n536q318M260L870o392P450J7019
4750B0036n344m332N157p330p779M759Q415N117k580o077j3854n421j2683P512
4736a4404P881j0154K809J1840K62r259Q347l805J1819J0990j0093j2055j0513
4723a6335J599R527M006j1447j9322O423R37j870P98J0770m412k217K1864P169
$$ y = [-5425, -10821, -171, -5, -11610, -9468, -10755, -26454, -36641, -16372, -10685, -13473, -23007, -14887, -8133, 96, -5270, -8084, -10586, -19387, -21854, -14012, -9806, -20592, -4886, 633, -11297, -23361, -11254, -3478, -3998, 6519, 9802, 18699, 23897, 29545, 31443, 16912, -10876, -6558, 8821, 26190, 41481, 46327, 26242, 7790, 7006, 5665, -605, -643, -184, 3458, -12158, -7838, -538, -11262, -4348, -892, -9347, -8412, 13608, 11976, 10589, 12105, 16717, 7683, 2147, -6171, -1911, 1959, -4433, 3017, 20036, 14692, 10360, 15517, 8187, 408, 5167, 13582, 18699, 16119, 10042, -3812, -9233, -21916, -14404, -6523, -16677, -13868, -2028, -1766, -11025, -2678, -6483, 5336, 16326, 6233, -5822, -16335, -14736, -5209, -1203, -12650, -31972, -25549, -24612, -26482, -25684, -14914, -19326, -21543, 321, 7490]
4709G490k719k332o487N460j3500l644r23l301N152N817M70J2018k03m041L278
4694B535j1630l963J1158Q787J6470O457j3978K395j1266k708j033O426R159l483
4680A5326r434n251J5666J6170L563j4752j7698r598R3K123L05Q595J1425j0524
4666F009R386k0574j0207P409L479L476P021P572l704j1861m200l945R93J5640
4652F494k596j3421J1367O6k0859k54P440J1204Q686j299q192q824N34J6064O1
4637F471r414k803n913J4764M972R449R690L436j1675k455j0022q251m721J1469
4623D997O25N697J1772r815O61M367J74K17l077p708N297O906p21l570M547l439
4607A6930j195j0652o796n237n295O716L022K565k353o757j247l254l179K550
$$ y = [7490, 4771, 2439, -4048, 1412, -12088, -15732, -16655, -19956, -14804, -8987, -8517, 3501, 3298, -743, 2535, -9095, -13058, -1900, 6887, 23357, 29814, 15836, 18231, 6965, 4257, 3224, 9650, 18809, 15326, 5892, 641, 16307, 32477, 36040, 21288, 3590, -6008, -5915, -3792, -3487, 5108, 16533, 6009, 15395, -5179, -15386, -7977, -4498, -1022, 5999, 13571, 9867, -1994, -6194, -10139, -9146, 6494, 3898, -9523, 1844, 1910, -18949, -19203, -11763, -559, 8127, 6828, -1364, -10188, -9654, 6410, 6471, -2943, -5746, -11659, 3105, 8077, 17526, 27216, 30652, 18977, 16522, 6500, -1751, -6472, 4997, 5622, 11319, 23091, 13276, 13937, 18304, 18478, 18695, 15618, 7910, 13207, 20113, 19392, 15822, 20369, 16930, 15735, 5083, -1713, -6950, -12245, -5529, -2507, 58, -2295, -9052, -10299, -13553, -16732, -14182]
4593a4182R436M825Q495J653j5044j2710J0316J1745r505j2602P371J231O144
4580b827J2260K633p199N484l044j5705L157L006j984M61J646p746N270j0898
4566a5486j1186r393K0756K4842R58j1242m631n533J101J0059q580Q93J0352J6850
4552A9760J0579j1711j3433j1548O033M751M64J7244J2000J0318j5280j9511j614
4539H052r91M164m324j1846o718Q54J0314r630O745M341J418Q610R023K65j6905
4524C372P113N079j778O02j5819n727Q503r621r744Q454p759j974K776Q363J3939
4509E779J0074O156l45J986n018j9809r362o235j669J6522k2125o613J669l517
4495c2507O943J3244L002L841J2741o481n418L706J3003K373O311k348m000j4811
$$ y = [-14182, -4746, 79, 8574, 10227, -4817, -17527, -7211, 4534, -4971, -17573, -10202, -8971, -2827, 9433, 12066, 4867, 10351, 7307, -8398, -5241, -2235, -4219, -3758, -2112, -9858, -4588, -15486, -26672, -36065, -15309, 9533, 10491, -751, -5382, -10915, -9814, 245, -8335, -7442, 2910, 19760, 30339, 18628, 5195, -6353, -320, 4431, 4895, 22139, 34139, 44457, 29177, 9666, 8052, 7061, 11225, 6901, -4945, -11663, -10809, -495, -10125, -3380, 961, 2379, 10989, 20012, 20277, 3372, 10485, 15564, 13786, 14388, -1431, -7158, 1345, -8276, -18020, -9566, -17325, -19299, -16523, -8160, 5779, 15853, 22009, 21664, 23650, 18632, -1177, -10539, -16774, -18443, -1921, -24046, -30659, -28990, -32507, -25564, -12320, -9318, -5477, 7264, 783, -4635, -929, 12074, 14447, 20758, 18410, 14410, -401]
4481d01k4401O838K0411J0480k1499j5718q089K574P280J0073r621J1135J0516
4468d22L362m142K385L14m769n09J1186p40j2495k5349Q281J263P523J0798j2791
4453a6105O33j72J0890l369J4986J2827j2900j4373J3137K324J646M191J3608
4440B7323r369k2644p606R628o445j4095l231j680Q940o851P864l726J0201J9865
4426H174J7450P403N016n502j5953j8006q42r180k759j05K4515J3592N976j6388
4412A3391n701J109J964K671q158r762j7693Q765J7005J1030k155j8949M989j2564
4398a4058q176O830R949K4560Q280n062q771Q006L805l313r692K250L575r962
4384H221K651J504p098m517J0223N199m558q499j1331k948j7048p006j272R561
$$ y = [-401, -24802, -17964, 2447, 12927, -8572, -24290, -32379, -29805, -22525, -12452, -22073, -10938, -422, 2940, -1202, 1183, 1497, -3272, -3781, 7405, 6665, -5830, -31179, -22898, -21635, -14112, -3314, -16105, -15472, -15644, -4754, -8123, 6863, 19690, 6790, -7583, 5554, 7878, 9524, 13715, 27323, 17954, -4690, -12296, -2668, -9113, -23208, -26439, -28119, -19179, -26030, -18166, -21892, -11691, 8174, 25624, 33027, 38043, 32541, 16588, -1418, -2260, -11440, -14199, -14304, 10211, 23803, 29779, 13391, 7690, 8799, 10763, 13434, 5276, -4486, -22179, -13414, 3591, 14621, 12466, -6483, -1494, -14058, -22234, -15404, -5455, 19105, 27385, 22323, 13552, 21558, 25363, 22050, 12358, 14608, 18183, 8221, 10872, 12376, 5278, 761, 10984, 16183, 11625, 3126, -8205, -11153, -28201, -35207, -36479, -26918]
4370b6918R465m659l67J5481Q282K118J460J083j2351K623q833j0301Q064q120
4356b2973J531P25K2158L506p911P239Q403o334j0345j9815O4j093m27N244N065
4341a4963n054R341N034J3554L695j970P159q09l542m378J0708k565L2Q254k900
4326B1596J359q008j3955L885q82q169R105r91J2384K096j224m262j2758j1541
4312a1365R269J2896j2069J090J3283j099J713J205J4174o733l642Q322j0034
4299A7010k1518K165J6238N745j0701P419m570Q266q301n659l66l822o26P399
4285H679J50J94m260M022P15j1518o73M804M002Q036J1905K259k559o10M70r250
4269A6366p127l573p615m42O573o6K845J1343P447j056q526j4167k595k061R359
$$ y = [-26918, -17453, -22112, -22479, -6998, 1284, 3402, 4862, 5945, -6406, -3783, -12616, -22917, -14853, -22973, -21442, -20717, 1441, 4947, -2964, 4275, 12678, 6344, -4001, -23816, -23752, -24845, -25272, -20028, -14963, -20017, -10676, -5642, 7912, 11607, 9637, 16796, 15987, 12445, 8067, 18775, 16210, 16242, 24496, 21596, 22955, 14947, 992, 4877, 3995, -4174, 4931, 3940, 16324, 18420, 17196, 12934, 176, -11365, -2096, 10800, -1269, -179, 13104, 12005, 13718, 14923, 29097, 22364, 18722, 27044, 17010, -4508, -2343, 13895, 19640, 8939, 16358, 11788, 20054, 11753, 6094, 5728, 1906, 1280, 8679, 8829, 9023, 4763, 8785, 9500, -2018, -2691, 2113, 6115, 14151, 26056, 28315, 25756, 25146, 25616, 16366, 9239, 5666, -1949, -2391, 4182, 4116, 6961, 18304, 25751, 24695, 16169, 2002, -593, -2654, 6705]
4254F705M263l488Q58p833K02O536J1119j133j9431j292M598j6205J663J8702
4240E264J0760j0992k932J7244J1726M285l603j1243j3577j7972j911O975O543
4227E67J2120q698J6226P202k7405j3634p46J4698m496P494N800k636N393K5210
4213C7095o708k1195j3723n520n392k984K374J1281R009l242j0102q490M523L337
4199i737R705n568n660j3319Q129r50n633p789J8729Q144m583R931M657l890o331
4184d165P675m23J9481j1129J871j4833J262K776L297P072m36P925j3385k4091
4170a7103J724j120J5468O947J630k076j3649j0623J5970r777N871J6943P989
4157A8194l252m855q038k2682j7506o825K6474J378J975Q351J4201M782o547k922
$$ y = [6705, 10968, 7480, 8338, 505, 707, 7243, 18362, 17229, -2202, -3494, 1104, -15101, -13438, 5264, 16024, 5032, 2100, 19344, 31070, 35355, 31752, 20509, 6932, -11040, -12951, -5976, 567, 12687, 3989, 20215, 27417, 12, -13622, -14368, 330, -4166, 3328, 9128, 6492, 11885, 37095, 30387, 9192, -4531, -10051, -15443, -18427, -16053, -4772, 4237, 995, -9107, -17597, -13074, -9737, -32, -5600, -11260, -24579, -16450, -17400, -23033, -30822, -12093, -3949, -8532, 1399, 6056, 2166, -4165, 3510, 3087, 22568, 11439, 13310, -1523, -261, 2515, 5812, 12884, 12448, 20373, 6988, -17103, -15379, -16499, -1031, 5916, 7546, 5470, -8179, -18802, -2832, -12609, -6738, 10205, 18194, 14942, 10087, 2049, -20633, -38139, -44964, -18490, -17112, -15137, -6786, 7415, 12197, 5650, 2728]
4143B728K499L477j0362j267L650J0630O874O848N05l115O128n606M473j0930
4129A6532j1360O354j4498j0064M636j870P200m447r776m306R658J2821L259L703
4115G842o702j8841n411o732J255K0476J7510l850O53J448j617r54q728p900n007
4100a6558J88O787J3190M710J659K309R21m407j7016l323l602J2072o673l371
4086a3114J2577O245N714r20r467N929J2260q99n460k320o944m589k469O073M857
4071G473N057q9J1135j0862j0926l119k903j3039Q181J8860k330j0714j2257j1393
4057b6926M424R117Q78J4538R531q381P5N435J281P361M81j2300n627J1049j068
4042I868Q692P857K370K111j2046j3348j6571o501R060Q198j4849j3016J526P672
$$ y = [2728, 5227, 8704, -1658, -2925, 725, 11355, 18229, 25077, 25582, 22467, 28595, 22989, 27462, 16532, 5172, 11526, -2972, -13036, -8400, -10270, -3070, -7517, -17293, -21599, -11941, 880, 4139, 7842, 1140, -17701, -23112, -29844, -28589, -8113, 9397, 5547, 6200, 7648, 6031, 5077, -3651, -11551, -16558, -16370, -9583, 3607, 8317, 9976, 12285, 13206, 8799, -8217, -11540, -15142, -3070, -9743, -13114, -537, 5708, 11422, 10502, 1035, 6964, 19224, 18325, 12865, 10545, 3601, -988, -3457, 2616, 7473, 12530, 12441, 23576, 12714, 1788, -1331, -4234, -17273, -9092, 9768, 7438, -3276, -15533, -26926, -22502, -13385, -12507, 2031, 11562, 3181, 3256, 8691, 9972, 17333, 17814, 5514, -113, 10936, 9868, 18560, 26417, 28787, 30898, 18852, 5504, -11067, -17568, -8508, -310, -15159, -28175, -26649, -18977]
4028a8977O72N270P678J3821j3422j0546j702M419N308L270k056Q25k486m815
4014a2741j026j215n301M103L478j852J2632J2276l852r675j2949j4083n033J7029
4000a8209J4334K996P898L723O448j7837r938L06o011L634L367l294p009q406
3986b7998L773R473r162M298Q504M543q759p210n790M691R149J5446P873j2549
3972c718l713j231J017p203m287Q80M13k91q68R906M883O622m592o726R025J1655
3956A1772k50J0995k450r751j8741q5N876J3392J453j4660j2504O707M538k780
3942f488Q854l606j2616P072m163P158o861k3872J692K0015o50r99r007o289l451
3927c3211J1600J6050p678j0824K0183M923l334P8N330q015p089j6447l847M512
$$ y = [-18977, -18305, -13035, -5357, 8464, -4958, -15504, -17206, -12787, -7479, -4209, -6265, -5440, -7926, -12741, -13767, -14982, -20283, -16180, -12702, -14554, -1922, 10354, 6502, -3173, -16122, -30205, -35238, -18209, -3875, -879, 7019, 10742, 17190, -647, -10585, -10279, -16290, -12656, -9289, -12583, -19592, -27998, -24225, -14752, -23914, -19616, -11112, -6569, -15328, -22538, -28328, -23637, -14488, 958, 8831, -3718, -7431, -8662, -7645, -14848, -19135, -18255, -17842, -18133, -19001, -9095, -4212, 2410, -2182, -8908, 117, 11772, 11522, 22517, 20067, 10316, -8425, -8510, -2634, 10758, 12211, -2449, -14953, -8246, -3708, -6488, 2366, -1240, -13856, -6784, -10947, -3789, -10650, -34522, -32830, -12815, -13465, -14464, -23471, -29760, -33211, -21611, -5561, -13239, -24063, -3880, 1043, -2291, -2213, 3117, -4898, -11987, -28434, -32281, -27769]
3913b7769J4104R595L368j1579J1185J4023M356M119N00p276n977M437L781O250
3899B3117L890K35j0408k693K51l667k6187k58R513O332N883j2745L223O98j8466
3884b1282R955J4219j1317l854k888O548J0258L813J2656m428j9019P4N972P02
3870A409n347o645j3506m071L15J8062J3226J759Q5r639N710P684P610j0947o570
3855h65m056q714O43q493j802L931R740J419m90J4042J2972j663o293j1850J0168
3840H689N477q094o496n308j928R968n407k108o298O954J842j458R85n361P971
3825e72N98Q58P004p961O78N716j0815j2283O821L702j1274P500J3554k616L785
3810D695K1238J6496p172j4825r734L587N514j3531j0205l744P819J665O155N64
$$ y = [-27769, -13665, -4070, -702, -12281, -1096, 12927, 17283, 21402, 21902, 14626, 8649, 13086, 16867, 23117, 27007, 27242, 16834, 14141, 14392, 10725, -15462, -15720, -6207, 125, 6008, -6737, -3514, -2816, -21282, -11327, 2892, -8425, -12279, -15167, -8619, 1639, 5452, 18108, 13680, -5339, -5265, 707, 1409, -3938, -10583, -24089, -28160, -27845, -9783, 3443, 5202, 5287, -4352, 1358, 9042, 16652, 5705, -865, -4921, -13635, -12992, -21485, -23287, -19356, -9616, -8197, -8687, 5355, 18327, 16664, 10371, -1479, 8689, 14166, 6072, -424, -5732, -7660, 2308, -3099, -5207, -11505, -4551, -2709, -4167, -3182, -8543, -572, 26, 884, 7888, -73, 605, 6321, -4494, -16777, -9956, -6254, -17528, -10028, 3526, 910, 4695, 25933, 42429, 35257, 20432, 10698, 14285, 19799, 6268, -3937, -7681, 138, 1803, 7958, 8522]
3796H522L732j4664l937p498j2037j010P867J6291P310m859j0118k13R386O250
3782E022j7265M773J3843N954n163J347n933m581R256N564l422J1010p72j2000
3768G633j1886n011j1406l920J0779j405R155P839k1518j9826J1903J2864p861
3755b2660O896M841k139K624q53R29J8702m658P877K627n442J351J663R930q850
3740A2838j7881l268L484l567J971N835q074n144Q582O870J1594j7128J810J2677
3726A0599N284k472j3333N561l223j5257p94J66J0559J1802K620j8027K337K66
3712c912L440n097j699J4884j308j4654r047k429L190K830J480K902J1923l749
3698a246j0835J6806m201p271j0438P136K3140o074r450n004J0384k298J584j267
$$ y = [8522, 12254, -2410, -6347, -13845, -25882, -26892, -19025, -2734, 4576, -283, -10401, -10614, -1228, 5022, -12243, -7470, 6373, 12327, 7164, 8511, 2578, -2003, 7253, 12817, 9395, 20405, 19633, 7633, -4253, -9264, -20670, -24590, -13811, -15216, -6061, 1778, -19740, -39566, -27663, -14799, -22660, -15764, -10923, -13062, -10438, -11291, -10362, 8340, 3682, 11559, 14186, 8744, 10095, 11758, 21688, 12838, -5043, -8311, -4827, -8394, -6423, -588, -8662, -13806, -5224, 1646, 13240, -3888, -2078, 10599, 15883, 13411, 78, 5639, 2416, -12841, -13635, -13469, -2910, 8892, 11512, -6515, -4178, -3912, -472, -5569, -7268, 7616, 6308, -8346, -17393, -19822, -16632, -13802, -12322, -9420, 2503, -1246, -12081, 4725, 524, -6747, -17185, -10049, 13091, 7017, -2433, -7437, 2947, 649, 2233, 966]
3684I66r059O879j2297L609R213P686o763m482n10N870P623m897K267n908k781
3669b584j1247O032O104J5382P035l212j1870j373j787k035q203J958K0358k0689
3655f131j6457k840J0186L015O809J713o408N936l577r846R565J0062J8213O733
3641B6973j0797j57o859j1434Q893j068n613J0004K193m020k1719n474K523J971
3627a4584O626J224L500o493l637J5633O737j1566K609R018k0309l568N144P72
3613h894L387j3210r839J663R484K744j0480M378J5439j107M943J3552N683o372
3599A1371L519J9588K455p750j7427n446Q577M02M361m562M142K4j5968o140J7269
3584A4415J381o987k058J4712j075o712j1404L376Q961r000j3585L177K828l68
$$ y = [966, -8093, -1214, -13511, -9902, -689, 6997, 234, -4248, -4758, 1112, 8735, 3838, 6105, 197, -2584, -13831, -7799, -1695, 13687, 20722, 17510, 5640, 4267, 2480, 445, -7758, -5800, 14558, -6131, -22588, -25428, -15242, -12227, -5418, -3705, -10113, -4177, -7754, -17600, -8035, 2027, 20240, 26973, 16176, 16019, 9160, -2274, 6619, 5551, -62, 9942, 12135, 8115, -13604, -19078, -16555, -14584, -7958, -6734, -3234, -9727, -13364, 2269, 9006, -2560, 49, 9067, -11242, -14810, -9666, -8894, -5507, -18717, -28556, -26893, -17409, -14665, -25145, -20767, -5328, -6435, -1492, 12060, 17743, 11371, 14890, 34478, 36933, 29183, 11756, 6310, 14887, 15289, 19650, 15088, 19230, 19254, 3286, -2854, 14415, 15796, 8809, 6751, 21463, 20388, 13676, 2272, 5648, 14609, 5609, -7976, -4799, -1971, -2339]
3570b339m66O090P766j0987J175j021k74j4529j5550R939O594l723N734O940k410
3555g061k767j252l923j2548J4217N383L860J1221l51j1504K962o17J3598K186
3541A3404M512K295j5206K172M017j652P530p553q005L764J949O515Q043j0336
3527A1449n137k449l159Q49R835k075n832m609L363o083n234N305P298K3508M687
3512C1716l0390k0093j785J1924L317l866L52J3909m929j2833n963K1730Q618
3499A1707Q397k41j3757P3Q282j1033j4033j17J5878K0494O920j6655r261M718
3485A1372j8029R85J0656j2560j1317m805J1685O743J7729J4230r88j6009k2616
3472a2924j4005m04J3572R858M679j0193m307M071J4219O565O149j2631j518j7731
$$ y = [-2339, -2805, 3285, 11051, 64, 1239, 218, -56, -14585, -30135, -20196, -13602, -17325, -11591, -4651, -7061, -9828, -11080, -15003, -27551, -13334, -7951, -4091, 7130, 6779, -4725, -1763, -2380, 11218, 13404, 17916, 20211, 5005, 7177, 11194, 9542, 17072, 9519, 1514, 5278, 7227, 13742, 21785, 11449, 6312, 3863, 704, 1553, 11388, 9313, 3481, -1128, 2235, -3848, -9082, -3777, 3521, 27029, 31716, 1326, -18767, -20552, -8628, -5311, -9177, -8825, 5084, 155, -12678, -18641, 3089, 11707, 20104, 19863, 6106, 6179, 14461, 3428, -10605, -10722, 5156, 25650, 32570, 15915, 6654, 11372, -6657, -5672, 4984, -7576, -18893, -23698, -12013, -5270, 12459, 26689, 25701, 9692, -12924, -26929, -27333, -13761, -3903, 776, -9417, -13724, -9653, 4566, 11131, 17280, 4649, 3131, -14600]
3458a4600k8064p086K0864P302m866j0100P955p86J0367O400j0026M536Q941J0505
3444A342l674j083k181m102J786j1931n066K0313J8663p961j166q53m663K628
3430B052p172j5616p235O268N934J1164p072l778J3697R386n304l985o549O309
3416a901N084L931l438p80O128J1521o365J465k326m754j4672J433N057j4324
3402a3941m134J0850K707K78j1920j0788J0413O230j160q514j5244l104J1573
3389b6754J3107O348m281M825J7682j936k5480N695n076M482J807Q081P466N822
3375A1788q83K718j2384j4784j0433r782q1R321O343K700L915j3655n28P013k550
3360b1282O456J3380K481r508l027r519J3845m864J420M750J3062M818j2585n44
$$ y = [-14600, -42664, -49750, -28886, -21584, -26450, -36550, -28595, -29381, -19014, -12614, -22640, -18104, -9163, 1342, -2332, -3415, -5596, -9698, -7912, -19843, -24909, -4596, 14067, 6106, 4940, 4087, -576, 2052, -5120, -20736, -27971, -21703, -15769, -4605, -11677, -15455, -1758, 7628, 2324, -1661, -8210, -1901, 3183, 7114, 3676, 2896, 9024, 20545, 14180, 15645, 13319, 8565, -6107, -4674, 383, -13941, -18075, -7225, -4518, -4240, -16160, -26948, -16535, -10305, -11465, -19979, -35223, -38327, -26754, -13647, -7299, -11580, -6755, 10927, 8991, -16489, -10794, -15870, -11388, -9581, -1500, 5966, 11788, 10905, 13623, 1239, -13545, -23978, -33760, -33841, -24520, -18177, -15477, -11562, -25217, -25745, -18732, -21282, -14826, -1446, 1035, -8473, -11500, -21019, -7174, -12038, -10618, -5868, 7194, 12012, -573, -1117]
3346a117l776P612J4020j1141j5548j7227j971J1701M085J4128J7715p888k702
3333G891J63Q02l89L928p545M197O826R279q347P265M501j3335p393j3346Q098
3318B595Q719n178k232J038l451K81Q329q096j669m681P788O007M303j8830k8545
3303c3622R82K0630J3170J1235m941k81K068M611M236N789r483r373m26R566o744
3288G417j0491l227O6n876J5076J6997J5443q75j4438k0280n316J9415j555M39
3274A2795l586j1346n832J2759m912j9778J0892L740j4045L97L648J1222L825
3261b21r324j0723r329P945K0289M707p853j184N233j1726J5634J5968j1620J214
3247I010k636q259L659R070l967p4M215Q438q58j9078k0319j0598O537J3718K321
$$ y = [-1117, -4893, 2719, 16739, 5598, -9950, -27177, -29148, -17447, -13362, 766, 18481, 10593, 7891, 8054, 8856, 8467, 12395, 4850, 9047, 15873, 25152, 16805, 24070, 28571, 15236, 7843, -5503, 2595, 11314, 6136, 3904, 4942, 1491, 1772, 10101, 2005, 336, -4345, 3443, 9450, 13753, -5077, -33622, -32640, -12010, 1160, 12395, 7454, 7173, 9241, 13852, 18088, 23877, 14394, 5021, 4595, 14161, 7417, -3074, -6301, -6235, -12111, 2965, 19962, 35405, 34530, 20092, -188, -5504, 13911, 12356, 12795, 9209, -2137, -7969, 4790, -122, -19900, -9008, -5268, -19313, -18916, -15268, -4046, -221, -9545, -20268, -29597, -21652, -1363, 3344, -4509, -5693, -460, -12186, 3448, 19416, 7796, 9010, 6374, -1885, 1774, 10844, 6877, 6803, 11018, 19456, 18598, -480, -20799, -31397, -24860, -11142, -8821]
3232h821M664p343q482M775j597j493Q659O150J617J0541J03o02p924P415O662
3217A4324o214j4878l405l20o573J939N802k306J3350J4752P743p495j3490M951
3203H180q445j0927n605n390J7687Q949N013J2422j6217j2866j067N943J3221
3190A0898l600L345P645j2715j6m445p260N006J3298L417m903l741L905K101R915
3175B2850n735j6158L492k803o473Q169J166j0082J7982J4463k502j5757q749
3162a37j24M065J8568J031j7495O836j1017j234N78j6720N130J0068k0759o978
3148b8188J8793K0991l138j6408K491J5682J7525k2591j3317o447p93N370R641
3135c89Q24j26q316L332J6160R371j5551m726q665l201N016R637r606R852J5964
$$ y = [-8821, -4157, -11500, -19982, -15207, -16804, -18297, -9638, -3488, -1871, 8670, 8773, 8171, 247, 7662, 14324, 8110, -6768, -10173, -10493, -17066, -15127, -9325, -11631, 1719, 16471, 24214, 16719, 3229, 8180, -265, -11192, -16797, -22187, -4500, 4449, 9462, 21884, 5667, -7199, -8266, -2323, 10898, 7298, 10643, 18288, 5573, 5557, 1112, -6148, -1142, 12156, 15573, 10670, 6929, 10834, 12935, 22850, 17115, 957, 4449, 1646, -4827, 3342, 4508, -5574, 12408, 26871, 24369, 8612, -137, -261, 3804, 22372, 23403, 5908, 12744, 1727, 493, 1071, -15649, -10519, -451, -21210, -28188, -9395, 11596, 8458, -7950, -5459, 10223, 27748, 5157, -8160, -14607, -15400, -10030, -389, 435, 309, -8007, -4675, 11485, 20856, 5305, 579, -8086, -11287, -6271, 3366, -6240, 3612, 19576]
3120A9576K745q901n462j1636k364q251k856R485K553J7008q995j7497p784m465
3106b6844p767l61J7791J3624k421K607N098J9599P433o482j3769j1330j6528
3093a9350J2511K3870J4545l648o939j4544j0832J292J3771j5847j6591M661K0553
3080C452J1641N288M763J3093M963k3678J7435j061r454j7317j2463l987O162
3067a163J7483J506Q00q01p957q385Q022M055m089M721j2134r795Q182N642P250
3052A3337k791l263j1216j4913p357j1458o719J1178M981j164J4737L460r780
3039b0968Q863N66R762j2021Q711J507p577P092O349M673M966J701m457K131J4609
3024B5907L687j0330p122J87m672P362O112q458o904R454J3182M89p454k532m808
$$ y = [19576, 22321, 13420, 7958, -3678, -6042, -14293, -17149, -7664, -5111, 11897, 2902, -14595, -22379, -26844, -34611, -34972, -17181, -3557, -5978, -3371, 1727, 21326, 28759, 22277, 8508, -2822, -19350, -6839, 17031, 31576, 27928, 20989, 6445, -4387, -3095, 10676, -5171, -21762, -17101, 3452, 15093, 20381, 25144, 38237, 43200, 19522, 36957, 35896, 26442, 9125, -3338, -7325, -1163, 16320, 17826, 18626, 17825, 9868, 1483, 9505, 13560, 9471, 14192, 2058, -7737, 445, 6087, 13337, 10546, 7283, -3933, -18846, -26203, -37661, -44380, -33202, -28221, -29385, -14648, -11188, -20968, -12105, -11539, -1777, -13798, -5087, -3580, -11157, -4065, 2284, 6957, 11923, 13624, 9167, 11298, 25907, 29594, 19264, 12142, 12329, 7657, 15019, 21131, 12673, 5769, 15223, 28405, 28894, 21440, 18908, 14100]
3009A4100m093q269j250J4204L695j800O187K3097j647j1361j0941N955K065p06
2995B9236j6518q116o517j0196K4759J9576N408j5095j0872j2594q448m100n303
2982a8780n774K672j143K71K977q254K852l358k36M148M74J7503k122m779J2703
2967h46M060M420J9587R310j082j0156q646r257n077o681q496p155N92J859P418
2952a0150K0151M560K856J3189n519k341K562m880j0848o630m627m977j422N706
2938b370m915n977J4120J3554j57j1685l827K97l788l318j4068P038J0923J859
2924b314j0918r767j042J2921P097Q551l280L980o111J263n716j5353n703J7340
2910i052l387L282K022L520l349N444Q107o851q41J7470m004l187l804j50J22
$$ y = [14100, 10007, 1738, 488, 14692, 18387, 16587, 22774, 45871, 44224, 32863, 21922, 27877, 29942, 29236, 12718, 4602, -1915, -12111, 12648, 32224, 37632, 22537, 11665, -929, -9377, -13477, -18780, -24554, -21882, -23025, -22754, -19777, -28031, -25179, -28537, -28773, -24625, -24151, -6648, -8770, -13549, -846, 3214, 7634, 27221, 36531, 35449, 25293, 16647, 7390, 2313, -4368, -12864, -20019, -19427, -17568, -10150, 10001, 14561, 17417, 30606, 25087, 22746, 25308, 20428, 9580, 2950, -1677, -6654, -8076, -2370, -7285, -13262, 858, 14412, 14255, 2570, -1257, -960, -4748, -8066, -22134, -15096, -4173, -2314, -13232, -22999, -24041, -11120, -4023, 4528, 1248, 5228, -883, 380, -5336, -20689, -26392, -9052, -12439, -9157, -7135, -3615, -6964, -1520, 6587, -264, -1105, 16365, 12361, 9174, 5370, 5220, 5342]
2895E342k129R17J6649K353j1885l380m606j3966q996J6105J269N312O973j3021
2881c063N082q009m059P749J3119n053q591J338j1261n076J3039P818j6246M473
2867h740J3166j165q961N552P99n922j2687j6639R557R463K594L1851k519j2369
2853C980J06R340j0500j952j715M721K8r003q844k719K321j0744j842O737P749
2838a2337K6602o963j5347q32k821k1184R112J6346K214O833J0011Q491m7J3153
2824C3231m531M508N878j6529k4813l076J6290J0651M704j9743p312Q159N995
2811A3412q43m254j91j623O33l431L630o931m252J3007J6335p29j7480K006k0641
2796a1352J9K0834P309N381p827j6359N63N499k3367j6226L807J0235R109K4336
$$ y = [5342, 3213, 4130, 20779, 23132, 11247, 7867, 3261, -10705, -19701, -3596, -2327, 2985, 9958, -3063, 2019, -5990, -10049, -2300, 10819, 5766, -2825, -1487, -12748, -17824, -4785, 3033, -13213, -8740, 4426, 3261, -5700, -148, 651, -5271, -17958, -34597, -25040, -15577, -12983, 18868, 16349, 3980, 4086, 13426, 2926, 974, -741, 3980, 4008, -4995, -13839, -16558, -14237, -24981, -26823, -20086, -12337, 14265, 7302, -8045, -8877, -11698, -32882, -23770, -7424, -5210, 1623, 11634, 20125, 20078, 33231, 28700, 33208, 39086, 22557, -2256, -5332, 10958, 21609, 26313, 6570, -742, 7417, 13412, 12569, 8315, 8124, 6501, 7134, 3703, 7333, 402, -3850, 9157, 25492, 24763, 7283, 9289, -11352, -11333, 9501, 16810, 22191, 14364, -1995, -1432, 4067, -19300, -35526, -31719, -21484, -12375, 11961]
2782A1961R006K348J530P390j3154j6445o276j0814N405J2486q663q670J4616
2769G20J3705m73j5186L563Q127J966J6732j919j6404j2355l376O752J9557l422
2755A7987j3647K692k12m655m052L326J0939K969q930j2853M66J0493n511q058
2741i046n153N72P426N946K0303M50R93K859j09j6610l373m10r251O032J3584
2726A4213J3168r580q97P267m014K828n440j597k0278l724m120J921l343j1239
2712b4835M336J2961Q549n042k2930R145J6056J4523N785j0573j3299N95J0471
2699E742j5002j7405R265R295K4879p053j5833O940m452N788j564J229o788L396
2685a563J6359k851k064Q413j0417o185L10J3822m798j0905q969O213J1752N354
$$ y = [11961, 20967, 23315, 24845, 32235, 19081, 2636, -3640, -14454, -9049, 3437, -5226, -13896, 720, 14425, 13952, -1234, 2329, 10456, 12422, 29154, 27235, 10831, -1524, -4900, 1852, 21409, 17987, 4340, 7032, 6820, 2165, -1887, 1439, 12378, 15347, 6417, -6436, -5970, 4523, -988, -9046, -14199, -13627, -6201, -255, 20048, 20498, 21491, 24350, 24241, 7631, 4258, 3848, -5403, 629, 14213, 27381, 17801, 16904, 24171, 20157, 22985, 17545, 15948, -4330, -8054, -12174, -10253, -13596, -24835, -20499, -7538, 1011, -4031, -26961, -17816, -1760, 12763, 18548, 7975, -5324, -4729, 5742, -9260, -26665, -17400, -8105, 16774, 9721, -6112, 828, -3624, 2164, 600, 1829, -4959, -1563, 14796, 11945, 9881, 18294, 7877, 1692, 2002, 15824, 11026, 121, -8848, -2635, 9117, 14471]
2671A4471N593o165j1409o583J0392O788O264j462k553k0133R101J5163p231j4589
2657b353M595j3083J0412j540n47r00q018M383m527L709j81l824l479R312M558
2642a483J817k133k300R222Q457q569p872M264O887J0803j796r251j3044m767
2628i765K989p61K869M891k83j4236O425j956j2783L138P670m166n932J2090Q756
2613a054J4706m900O277P053j5856p460j5018M4J777j2165R864J0097O603Q140
2599H108N812K712k780j0809j6396j9370n461P657J5807J3496M45K010m997O419
2585B653J0471j639k0292N078M710r267k2962k33J2797R600J7l135j2150K076
2571b2276Q194O181j598L380p874L618J0248P514l07q341J625j0865p672J24K4014
$$ y = [14471, 20064, 13899, 2490, -4093, 6299, 13087, 19351, 17889, 15336, -4797, 4304, 19467, 12236, -2353, 2242, -10841, -429, -1969, -2516, -3416, -11434, -7051, -11578, -7869, -8050, -11874, -15353, -6041, -1483, 334, -1799, -4099, 5123, 13580, 5011, -2861, 1403, 8290, 19093, 17297, 8046, -4998, -9765, -6776, -7537, -4668, 223, -60, -14296, -7871, -9827, -22610, -19472, -11802, -15968, -21900, -9810, -1054, 13652, 8752, 15029, 22082, 6226, -1234, -16252, -16208, -14431, -26596, -16732, -6635, -32, 8108, 13920, 16632, 13852, 3043, -13353, -32723, -38184, -30527, -14720, -1224, -779, 1231, -3766, 2653, 13124, 11485, -8807, -3729, 981, -8286, -31248, -31481, -18684, -9084, -9067, -12202, -24352, -22276, -14082, -7901, -9499, -6119, -13993, -10375, -127, 7387, 7080, -1261, 364, -10501, -18173, -18049, 5965]
2556E965Q662j3256q280J4877Q229k0712n613P092p908q154J704o148L011O877
2542a3654M892j5747J0294M515M322J6354Q979P75o542Q381M466j032r094J367
2528A8276N945r524M236k700j6201J761K0672j936j3986m803j5412K740J0028
2515i04m136m60R505Q758K833L791j6850j6736L881J9553l607n524P813p427P409
2500G899l12P82L325M435j2598L940Q141o824j0992L0J0859m613m550J1480J69
2485A1171o260q37m110M425N45p686j4363k0845J6633J3957L754m400j038n892
2471a4946Q322P548R965N780L039N665n560k307L29n706j5946l89J2680Q35o479
2456B830J332J1602j0482k2486Q872J1007j0785j5667k606Q37J5593O187J0650
$$ y = [5965, 14627, 1371, -6909, 7968, 16197, -4515, -10128, -3036, -10944, -19098, -17394, -23542, -20531, -13654, -8762, -24509, -14215, -9700, -5378, 10976, 19955, 20730, 14188, 22569, 27035, 26003, 16909, 18276, 24221, 14697, 18933, 16233, 32, 1793, 22465, 20529, 6543, 1740, -13672, -10932, -904, -5040, -5500, 4005, 12763, 15596, 19387, 2537, -14199, -10318, 9235, 5628, 104, 7917, 490, 7899, 7587, 8369, 11694, 16129, 3531, 7471, 15612, 8788, -2204, -2174, 8685, 4072, -478, 11002, 11171, 4911, 4074, -36, 4389, 4934, -2752, -17115, -37960, -21327, -7370, -3616, -8016, -9054, -14946, -6624, 924, 10889, 16669, 19708, 25373, 19813, 17506, 17835, 12129, -3817, -4206, 8474, 9309, 2830, 4162, 15764, 5282, -17204, -8332, 2675, -8110, -23777, -26383, -25546, -9953, -3766, 6884]
2443F884J1631r078j321j2103r697K932J0845Q482j0250j7629p026M535P22l579
2429b4652j3808M203O521Q021J4432O245K900J0323r257k0249P09K582L748O056
$$ y = [6884, 18515, 9437, 8116, -3987, -13684, -10752, 93, 8575, -1675, -19304, -26330, -21795, -21073, -24652, -38460, -34257, -27736, -19715, -5283, 962, 3862, 14185, 4928, -15321, -14612, -12030, -8282, -2226]
$$ [...]
##END NTUPLES=NMR SPECTRUM
##END=
