##TITLE=Analysis number 321387
Compound Code cc 31351
Project Code adrs
Chemist Name robb
##JCAMPDX= 6.0         $$ Bruker NMR JCAMP-DX V2.0
##DATA TYPE= NMR SPECTRUM
##DATA CLASS= NTUPLES
##ORIGIN= Bruker BioSpin GmbH
##OWNER= nmr
$$ XWIN-NMR		Version 3.5
$$ Tue Aug  8 12:12:19 2006 GMT Daylight Time (UT+1h)  MAYBRIDGE\nmr@NMR_250MHZ
##.OBSERVE FREQUENCY= 250.131544655141
##.OBSERVE NUCLEUS= ^1H
##.ACQUISITION MODE= SIMULTANEOUS (DQD)
##.ACQUISITION SCHEME= undefined
##.AVERAGES= 16
##.DIGITISER RES= 18
##SPECTROMETER/DATA SYSTEM= dpx250
##.PULSE SEQUENCE= zg30
##.SOLVENT NAME= DMSO
##.SHIFT REFERENCE= (INTERNAL, DMSO, 0, 16.522)
##AUDIT TRAIL= $$ (NUMBER, WHEN, WHO, WHERE, WHAT)
$$ ##TITLE= Audit trail, XWIN-NMR		Version 3.5
$$ ##JCAMPDX= 5.01
$$ ##ORIGIN= Bruker BioSpin GmbH
$$ ##OWNER= nmr
$$ C:\u/data/dgb/nmr/ADRS/430/pdata/1/auditp.txt
$$ ##AUDIT TRAIL=  $$ (NUMBER, WHEN, WHO, WHERE, WHAT)
(   1,<2006-08-08 12:11:59.75 +100>,<MAYBRIDGE\nmr>,<NMR_250MHZ>,
      <created by zg, POWCHK disabled, PULCHK disabled
       configuration hash MD5:
       E2 DF 36 D8 04 B2 41 60 5A D7 A3 38 5A 4B D0 FE
       data hash MD5: 64K
       1D AC A0 2F D8 90 C4 53 D6 1C 40 7D 34 F7 DA 95>)
(   2,<2006-08-08 12:12:11.18 +100>,<MAYBRIDGE\nmr>,<NMR_250MHZ>,
      <Start of raw data processing
       ef LB = 0.3 FT_mod = 6 PKNL = 1 SI = 32K 
       data hash MD5: 32K
       F3 F4 56 5B 67 13 59 78 1B 37 F4 A0 8E 1A 17 E1>)
(   3,<2006-08-08 12:12:13.00 +100>,<MAYBRIDGE\nmr>,<NMR_250MHZ>,
      <apk 
       data hash MD5: 32K
       F3 22 89 88 BF 9A 12 87 87 01 FC 31 D2 4A E2 2F>)
(   4,<2006-08-08 12:12:13.75 +100>,<MAYBRIDGE\nmr>,<NMR_250MHZ>,
      <abs ABSG = 5 
       data hash MD5: 32K
       87 F4 0B 7D 20 D1 58 CA E2 33 AC FE 6A BC 9B 52>)
$$ ##END=
$$ 
$$ hash MD5
$$ 59 61 98 30 97 CB A8 02 B4 F8 B2 1D D2 A9 B4 30
##$RELAX= 
##$RELAX= 
##$RELAX= 
##$RELAX= 
##$RELAX= 
##$RELAX= 
##$RELAX= 
$$ Bruker specific parameters
$$ --------------------------
##$DU= <C:\u>
##$EXPNO= 430
##$NAME= <ADRS>
##$PROCNO= 1
##$TYPE= <nmr>
##$USER= <dgb>
##$AMP= (0..31)
100 100 100 100 100 100 100 100 100 100 100 100 100 100 100 100 100 100 
100 100 100 100 100 100 100 100 100 100 100 100 100 100 
##$AQSEQ= 0
##$AQ_mod= 3
##$AUNM= <au_zg>
##$AUTOPOS= <24 >
##$BF1= 250.13
##$BF2= 250.13
##$BF3= 250.13
##$BF4= 250.13
##$BF5= 500.13
##$BF6= 500.13
##$BF7= 500.13
##$BF8= 500.13
##$BYTORDA= 1
##$CFDGTYP= 0
##$CFRGTYP= 5
##$CHEMSTR= <none>
##$CNST= (0..31)
1 1 145 1 1 1 1 1 1 1 1 1 1 1 1 1 1 1 1 1 1 1 1 1 1 1 1 1 1 1 1 1 
##$CPDPRG= <>
##$CPDPRG1= <>
##$CPDPRG2= <>
##$CPDPRG3= <>
##$CPDPRG4= <mlev>
##$CPDPRG5= <mlev>
##$CPDPRG6= <mlev>
##$CPDPRG7= <mlev>
##$CPDPRG8= <mlev>
##$CPDPRGB= <>
##$CPDPRGT= <>
##$D= (0..31)
0 1 0 0 0 0 0 0 0 0.06 0 0 0 0 0 0 0.0002 0 0 0 0 0 0 0 0 0 0 0 0 0 0 
0 
##$DATE= 1155035518
##$DBL= (0..7)
120 120 120 120 120 120 120 120 
##$DBP= (0..7)
150 150 150 150 150 150 150 150 
##$DBP07= 0
##$DBPNAM0= <>
##$DBPNAM1= <>
##$DBPNAM2= <>
##$DBPNAM3= <>
$$ [...]
##$SUBNAM7= <"">
##$SUBNAM8= <"">
##$SUBNAM9= <"">
##$SW= 20.6930455092707
##$SWIBOX= (0..15)
0 0 3 0 0 0 0 0 0 0 0 0 0 0 0 0 
##$SW_h= 5175.983436853
##$TD= 65536
##$TD0= 1
##$TE= 295.16
##$TE2= 300
##$TE3= 300
##$TEG= 300
##$TL= (0..7)
0 120 120 120 120 120 120 120 
##$TP= (0..7)
150 150 150 150 150 150 150 150 
##$TP07= 0
##$TPNAME0= <>
##$TPNAME1= <>
##$TPNAME2= <>
##$TPNAME3= <>
##$TPNAME4= <>
##$TPNAME5= <>
##$TPNAME6= <>
##$TPNAME7= <>
##$TPOAL= (0..7)
0.5 0.5 0.5 0.5 0.5 0.5 0.5 0.5 
##$TPOFFS= (0..7)
0 0 0 0 0 0 0 0 
##$TUNHIN= 0
##$TUNHOUT= 0
##$TUNXOUT= 0
##$USERA1= <user>
##$USERA2= <user>
##$USERA3= <user>
##$USERA4= <user>
##$USERA5= <user>
##$V9= 5
##$VALIST= <valist>
##$VCLIST= <CCCCCCCCCCCCCCC>
##$VD= 0
##$VDLIST= <DDDDDDDDDDDDDDD>
##$VPLIST= <PPPPPPPPPPPPPPP>
##$VTLIST= <TTTTTTTTTTTTTTT>
##$WBST= 1024
##$WBSW= 4
##$XGAIN= (0..3)
0 0 0 0 
##$XL= 0
##$YL= 0
##$YMAX_a= 259493
##$YMIN_a= -438707
##$ZGOPTNS= <>
##$ZL1= 120
##$ZL2= 120
##$ZL3= 120
##$ZL4= 120
##$ABSF1= 16.522
##$ABSF2= -4.171173
##$ABSG= 5
##$ABSL= 3
##$ALPHA= 0
##$AQORDER= 0
##$ASSFAC= 0
##$ASSFACI= 0
##$ASSFACX= 0
##$ASSWID= 0
##$AUNMP= <proc_1d>
##$AZFE= 0.1
##$AZFW= 0.1
##$BCFW= 0
##$BC_mod= 0
##$BYTORDP= 0
##$COROFFS= 0
##$CY= 12.5
##$DATMOD= 1
##$DC= 0
##$DFILT= <>
##$DTYPP= 0
##$F1P= 14.0000005364418
##$F2P= -0.99999901652339
##$FCOR= 0.5
##$FTSIZE= 32768
##$FT_mod= 6
##$GAMMA= 0
##$GB= 0
##$INTBC= 1
##$INTSCL= 1
##$ISEN= 128
##$LB= 0.3
##$LEV0= 0
##$LPBIN= 0
##$MAXI= 10000
##$MC2= 0
##$MEAN= 0
##$ME_mod= 0
##$MI= 0
##$NCOEF= 0
##$NC_proc= -5
##$NLEV= 6
##$NOISF1= 0
##$NOISF2= 0
##$NSP= 0
##$NTH_PI= 0
##$NZP= 0
##$OFFSET= 16.522
##$PC= 1
##$PHC0= 135.3971
##$PHC1= 12.93076
##$PH_mod= 1
##$PKNL= yes
##$PPARMOD= 0
##$PSCAL= 4
##$PSIGN= 0
##$REVERSE= no
##$SF= 250.13
##$SI= 32768
##$SIGF1= 0
##$SIGF2= 0
##$SINO= 400
##$SIOLD= 32768
##$SREGLST= <1H.DMSO>
##$SSB= 0
##$STSI= 32768
##$STSR= 0
##$SW_p= 5175.98343685301
##$SYMM= 0
##$S_DEV= 0
##$TDeff= 65536
##$TDoff= 0
##$TI= <Analysis number 999999
Compound Code 99
Book Reference 9
Project Code 9>
##$TILT= no
##$TM1= 0
##$TM2= 0
##$TOPLEV= 0
##$USERP1= <user>
##$USERP2= <user>
##$USERP3= <user>
##$USERP4= <user>
##$USERP5= <user>
##$WDW= 1
##$XDIM= 32768
##$YMAX_p= 420481665
##$YMIN_p= -602672
$$ End of Bruker specific parameters
$$ ---------------------------------
##NTUPLES= NMR SPECTRUM
##VAR_NAME=  FREQUENCY,     SPECTRUM/REAL,   SPECTRUM/IMAG
##SYMBOL=    X,             R,               I
##VAR_TYPE=  INDEPENDENT,   DEPENDENT,       DEPENDENT
##VAR_FORM=  AFFN,          ASDF,            ASDF
##VAR_DIM=   32768,         32768,           32768
##UNITS=     HZ,            ARBITRARY UNITS, ARBITRARY UNITS
##FACTOR=    0.157963299565203, 1,           1
##FIRST=     4132.6476996994, 0,             0
##LAST=      -1043.33573715361, 0,           0
##MIN=       -1043.33573715361, -602672,     0
##MAX=       4132.6476996994, 420481665,     0
$$ Real data points
##PAGE= N=1
##DATA TABLE= (X++(R..R)), XYDATA
$$ [...]
29494 -96763 -32093 55615 79824 65469 98248 128413 79348 -75322 -108956 -122357 -58768
29483 -58768 4909 -42397 -145237 -45812 -1430 129268 125207 164408 215318 209579 84051
29472 84051 -100378 -186154 -110694 10467 30144 -74983 -48310 -98373 -194723 -125430 -67264
29461 -67264 -132198 -194708 -180573 -105356 -86428 -8554 2150 -109986 -124018 -128583 -40298 59582
29449 59582 44787 62650 108983 -23995 5591 28899 23128 37894 146034 100808 -50506
29438 -50506 -167561 -251735 -230599 -231475 -258864 -225365 -136765 -22294 57189 -103379 -199068
29427 -199068 -218493 -276299 -88539 22693 24240 86445 93201 -19937 -36811 35038 99538
29416 99538 201849 183591 126635 79119 -29144 -59824 -100502 -159807 -98119 -143970 -132878
29405 -132878 63852 227141 312939 302816 213330 97894 39653 -11707 -45114 82459 -9024
29394 -9024 -51938 -136024 -94592 28705 -55680 -67869 13415 47336 57150 86031 54737 -29711
29382 -29711 -97127 -155481 -186707 -82271 -60406 11159 4155 33872 90623 93140 2336 -200191
29370 -200191 -318512 -285721 -211096 -186875 -277334 -305429 -141401 -33443 13564 -31868 -64209
29359 -64209 -70016 -179583 -136108 -78591 -46186 -67072 -159222 -129007 -106985 -55359 91454
29348 91454 151170 146578 85722 142121 86929 124603 16595 -276969 -290966 -188343 -142583
29337 -142583 -166800 -54528 -17273 -84989 -138236 -84655 -11788 39067 51881 42526 59483
29326 59483 -49714 -113982 -135132 -23592 3920 -93819 -81194 -54841 1382 -48451 -54269
29315 -54269 -7164 10769 -16149 -3936 -97052 -138737 -180043 -150316 177868 261890 257372 129184
29303 129184 247 -53440 -87481 -120698 -237805 -226385 -245529 -113122 -15825 -101297 -179926
29292 -179926 -138887 -29920 103275 64756 -63316 -138036 -97503 38806 19376 -174610
29282 -174610 -136661 -105194 -123232 -214656 -257768 -84643 -14014 -53451 -126700 -81315 -36028
29271 -36028 -13725 -5831 22764 -80261 -278529 -325621 -284369 -299550 -175292 -141642 -134232
29260 -134232 -92962 -141866 -353558 -320892 -257786 -154793 11993 23628 -220169 -219244 -221885
29249 -221885 -249324 -148791 36130 138851 98217 -16132 -67464 -3798 -71032 -150331 -145089
29238 -145089 -137559 -177496 -200259 -166137 -110415 105445 152165 133935 58980 -40682 59292
29227 59292 34636 -65066 -91411 -37545 19003 -4351 -211253 -306381 -190005 -46901 29637
29216 29637 36968 90370 107309 18602 -107897 -167784 -132638 -115717 -165127 -46010 4889
29205 4889 -51344 -74983 -204552 -176155 -84709 -52971 -219814 -236596 -234842 -240157 -230989 -197454
29193 -197454 -139323 -45475 70767 112267 52178 -35653 62362 62266 47806 35682 -25559 -24903
29181 -24903 24923 -92716 -7351 143288 97982 29057 64359 -19405 -41787 -79337 -109960
29170 -109960 -90858 -90620 -1254 68137 152115 113951 55366 8445 -46336 -44521 29376 -17393
29158 -17393 -97420 12843 -11505 -51288 -173626 -160570 -123101 -183863 -243850 -104697 13978
29147 13978 -49957 20843 -50284 -229151 -303901 -275968 -305105 -343410 -414858 -353183 -288465
29136 -288465 -57303 28044 -87218 -170851 -117001 -105138 -154794 -283052 -377037 -366500 -311556
29125 -311556 -232613 -43141 59475 25375 -103101 -114020 -44523 -63525 -78218 -15118 -9425
29114 -9425 -69077 -143255 -272537 -214169 -220297 -212827 -169357 -104374 -141702 -73356 -67947 -18158
29102 -18158 -44180 -16998 -156166 -260332 -204491 -262428 -144896 -34637 -2947 2876 -64687
29091 -64687 51202 69202 9957 -68851 -31132 -83896 -232872 -308937 -210876 -56973 -26645
29080 -26645 -606 38334 -91505 -77645 -134683 -64425 -29205 -91589 -94155 2508 43113 -19667
29068 -19667 -49567 -44202 -91417 -147078 -151648 -23783 -104836 -91526 -114391 -181061 -13769 95619
29056 95619 172964 282440 272694 137101 20412 -188367 -185664 36696 54167 -149657 -171817
29045 -171817 -79401 67184 129309 159902 59041 -18488 102530 69064 146121 152486 143748
29034 143748 -50160 -159184 -119190 12946 52602 -6861 117233 134442 61048 76489 25440
29023 25440 8085 108412 -13877 -166292 -232309 -132826 -16250 -74392 -60949 -288 19289
29012 19289 -39753 86912 135293 111422 82306 136100 230239 267978 281186 248067 192180
29001 192180 129031 194574 253190 181757 155300 146785 87120 12017 -62951 -67016 -12983 88039
28989 88039 124010 81533 105346 -95146 -82521 -165566 -218779 -268033 -89700 -1909 12849
28978 12849 -136338 -224653 -66509 -82610 -81259 -58410 -36432 -75125 -59056 -45569 -153602
28967 -153602 -143304 -4583 48489 57314 -51931 -201772 -343278 -250719 -215187 -183079 -196592
28956 -196592 -335613 -223676 -88556 -31095 122997 160363 -23879 -176557 -103968 -35427
28946 -35427 -105450 -60939 19625 -26235 -40775 -960 -35390 -27464 -126483 -179380 -194532 -72943
28934 -72943 17737 -113928 -144951 -198634 -60427 15611 35520 -355 -119595 -224567 -307601
28923 -307601 -295996 -185069 -99889 7555 121048 87395 87045 -8521 -165173 -251059 -168919
28912 -168919 -109939 -186932 -330281 -462760 -447991 -428753 -261445 -91319 -3525 62632 113710
28901 113710 131696 156586 136835 24891 -81361 -179815 -195855 -188782 -271241 -195983 -78712
28890 -78712 -45544 -102934 -94066 -131722 -140761 -210043 -274092 -319917 -184131 -59476 -124678 -245162
28878 -245162 -110187 -111908 -130988 -151366 -114425 -83640 -123700 -242241 -280276 -135734 -73850
28867 -73850 -59181 -56916 -30082 17870 93068 33158 -90845 -109027 -9214 46562 -73378
28856 -73378 -220090 -292060 -322685 -136840 41457 25743 -87493 -72079 135547 154984 17018
28845 17018 -113803 -192509 -307019 -206216 -109211 -234054 -370230 -237863 -51637 -65102
28835 -65102 -199140 -305928 -283470 -109758 -4030 -77637 -141686 -120928 -140400 -156413 -15659
28824 -15659 100817 183616 101855 2700 -14748 53733 55395 -77939 -152163 -241438 -173038
28813 -173038 31637 26197 54613 15349 -221128 -311234 -384462 -376380 -238527 -80833 -32713
28802 -32713 -52324 -59410 -136411 -166990 -77461 -99761 -203583 -233566 -149579 -29404 42389
28791 42389 -81112 -93747 -132472 -224118 -299162 -242319 -228100 -268542 -333819 -290976 -192135
28780 -192135 -65550 -64373 -20701 -28593 -104646 -204798 -123476 -64029 -6030 -63114 48859
28769 48859 40012 -94574 -118247 -28965 18194 -129700 -263657 -226580 -208381 -297341 -351545
28758 -351545 -230572 -171779 -81955 25956 33083 -200782 -233678 -237662 -193333 -209254 -159203
28747 -159203 31327 24785 -20136 97711 96071 17674 -50811 -61951 -28198 -1621 -13087
28736 -13087 -54094 -152441 -133474 -207653 -209516 -63109 38200 -122948 -248944 -200160 -134257
28725 -134257 -111421 -184980 -26486 -18793 -146522 -120749 -180405 -190788 -198171 -9641 -79492
28714 -79492 -96165 -45833 -191830 -241255 -90677 -86890 -109635 -20351 -29540 -205781 -370300
28703 -370300 -337759 -341243 -220787 -167927 -215152 -274298 -211080 -203468 -247260 -197110 -80478
28692 -80478 -69140 -13784 16801 -66852 -119349 -247856 -221867 -208422 -272756 -184819 -102571
28681 -102571 -36332 31548 -21303 -62148 -230325 -236641 -201163 -274912 -174183 -51598 -118194
28670 -118194 -54932 19223 72837 -10563 -109105 -129806 -64921 -78075 -34315 57364 10768
28659 10768 88132 11465 -82612 -67936 -171552 -179985 -245094 -265002 -231013 -133616 -248951
28648 -248951 -400105 -300241 -145406 -2095 183866 37800 -163953 -299197 -380873 -347125
28638 -347125 -199585 -270632 -197766 -181527 -129160 -96003 -257239 -293330 -292936 -304375 -117457
28627 -117457 -146800 -117312 -219433 -304916 -256934 -221191 -146007 -34960 -187323 -137789 16533
28616 16533 -51659 -14702 -39753 13686 124319 218531 118362 120994 180050 215102 232776
28605 232776 105504 84146 153108 202802 171730 171017 177541 151893 66215 -29594 -82966 -46738
28593 -46738 -66339 -143642 -143736 -87664 -114054 -52556 85333 79873 -19425 -68963 -79250 -87283
28581 -87283 -124852 -135165 -143334 -148747 -81041 44665 88488 71208 -1426 -169984 -277777
28570 -277777 -145504 13810 16860 10268 9998 -89307 -139244 -189006 -183028 -128500 -132413 -147733
28558 -147733 -254092 -188618 -170567 -210340 -266001 -155291 -77340 -181218 -208982 -207301 -142752
28547 -142752 -39068 -12603 -236545 -187767 -157011 -188865 -143090 -75291 64613 68488 -49920
28536 -49920 -82893 -93654 -268346 -417060 -321760 -333238 -398416 -412085 -318861 -180448 -58845
28525 -58845 -39965 -95896 -76608 -124197 -153778 -220095 -242808 -208140 -88829 -80105 -198491
28514 -198491 -273135 -180373 -142882 -124365 -42950 89404 48119 77756 104270 131134 102857
28503 102857 60890 137190 145297 110564 -56222 -106905 -297398 -396755 -281326 -110198 -62344
28492 -62344 -170743 -16130 140236 104417 -10688 -84257 -101260 -220320 -238338 -199784 -39311
28481 -39311 40938 -10897 -107033 -10919 68583 -26199 -22853 -80699 -56345 -87013 -125639 -142702
28469 -142702 -121326 36720 -7892 -126192 -228917 -221087 -172467 -221430 -350322 -363477 -398365
28458 -398365 -409467 -445620 -315568 -169185 -164558 -138526 -18667 31329 -32420 -3603 -74266
28447 -74266 -89269 -184908 -131293 -199202 -123824 36876 16210 -116845 -186940 -294503 -190061
28436 -190061 -158305 -129488 -238062 -175694 -11017 -36151 -151293 -149982 -129913 -190751 -189777
28425 -189777 -123776 -93791 -111114 -135948 -93483 63429 103062 76138 10701 -35075 -11476
28414 -11476 19272 116775 -10226 -9508 -60302 -115575 -107670 -48434 -97901 -158803 -108135 -6808
28402 -6808 56593 41918 -80346 -167773 -150627 -130383 -88369 -20838 -30997 -241909 -189556
28391 -189556 -104583 -168845 -91511 -182 25586 16453 34367 -34434 -131970 -67884 -58797 44122
28379 44122 126902 189874 212833 12128 114898 129628 71460 -16811 -148789 -160580 -69892
28368 -69892 -65087 -54398 -92357 -46659 -59321 -142291 -285742 -322844 -177859 -84711 65006
28357 65006 16325 -121189 -329763 -410272 -497396 -483704 -408347 -287419 -151146 -203419 -267233
28346 -267233 -236608 -66882 -70939 -189083 -92306 -35074 -50011 -30862 -71094 -164163 -121356
28335 -121356 18278 -120184 -209960 -171531 -95879 17303 -13885 -84009 -149808 -189265 -72991
28324 -72991 -114580 -119609 -147894 -231857 -389470 -347326 -121617 -22883 11475 -36823 -92241
28313 -92241 -90896 -112016 -8111 38976 -17610 23363 -11296 -65131 35704 135169 196374
28302 196374 167564 -24746 -163593 -130202 -97660 -29083 -147572 -128820 -103905 -42517 -4865
28291 -4865 -59142 -159427 -199846 -185041 -139518 -115300 -63409 -73312 -77943 34687 94615 99137
28279 99137 -49349 -182982 -332254 -311723 -133566 -92965 -83609 -4083 -84419 3553 86004
28268 86004 12772 -27570 -62973 -9676 -17238 -10208 -66566 -88499 -97073 -39392 -13216 -135991
28256 -135991 -216152 -160199 -81746 16038 -106375 -180464 -139083 -188546 -74059 -56811 22890
28245 22890 90892 15925 21072 -96245 -92523 -98911 -180348 -240925 -163552 -89734 -49351 52019
28233 52019 151879 143250 126775 63235 12002 42031 7324 -34753 -64858 -59265 -62963 -164823
28221 -164823 -117216 10306 -85392 -239774 -79489 37870 -30536 38154 99632 54929 -47332
28210 -47332 -48606 -65415 -162114 -16472 83509 -103760 -192038 -168026 -254495 -180489 -171294 -176030
28198 -176030 -107571 -74884 -72053 3699 83419 61731 -162921 -99811 -3882 9503 117046
28187 117046 63681 41538 8403 -59646 -147154 -155826 -194256 -129653 -63185 -46863 -118538 -17965
28175 -17965 -50762 -136412 -87075 -84267 -72658 55952 -1846 -107595 -137568 -221198 -58540
28164 -58540 -53100 28140 65758 80271 -33181 -14624 -122732 -197994 -191101 -138255 -145781 -157019
28152 -157019 -30256 -91267 -99022 -68838 -100647 -151010 -218166 -189820 -156294 -79843 -16501
28141 -16501 25255 131154 139790 119285 -6480 -38440 -195405 -252021 -160924 -176370 -167100
28130 -167100 -26325 39795 4819 66927 -88913 -167952 -180493 -262928 -287605 -158274 -290770
28119 -290770 -341887 -353839 -286607 -209093 -161538 -80887 -106755 5860 -65542 -37262 -97262
28108 -97262 -109132 -137884 -193497 -212223 -133320 10808 -53786 -206685 -145172 -151240 -178809
28097 -178809 -90597 -159422 -181411 -163460 -159481 -107806 -103331 -49478 46195 24377 18151 52574
28085 52574 24100 -4458 -17694 15650 40792 106759 79076 -1381 -24716 83293 139668
28074 139668 117029 78563 100207 133596 124068 -12536 -14632 149460 48384 -98128 -45293
28063 -45293 -118562 -99284 -33795 72131 130468 114203 50768 0 -51506 -180994 -137009
28052 -137009 -16061 20359 19010 -19839 112386 121778 22363 71430 2497 -81984 -39713
28041 -39713 -70593 -123164 -260531 -325340 -458591 -340776 -119012 -69990 -165641 -273231 -298991
28030 -298991 -247413 -65467 16742 -15361 -681 -24594 -104417 -183574 -161002 -77208 49668
28019 49668 -60949 -156165 -133882 -38303 47745 120920 92874 109812 153412 156398 16903
28008 16903 -17792 -100109 -99951 -24947 -88782 -215004 -176141 -135722 -259277 -216983 -91606
27997 -91606 -43337 192113 194083 71358 58419 71191 77800 -33147 -29101 21154 53267 58037
27985 58037 139289 166588 177836 160123 -96222 -286996 -284758 -299741 -201924 -137449 -80092
27974 -80092 -74428 -23810 -17537 57185 30018 -94019 -64549 116695 152043 110263 115718 77154
27962 77154 85266 45463 -17705 -215195 -263416 -323131 -184514 -193872 -279892 -368866 -224762
27951 -224762 2241 35755 43219 -130407 -209097 -107837 -73765 -28066 -9262 -71332 -207677
27940 -207677 -332312 -420414 -323469 -69157 -104433 -246832 -164508 -85557 3079 -81008 -79143
27929 -79143 -114317 -37488 -60959 13477 14235 -52560 -13667 -32547 -80326 -166856 -48704 69998
27917 69998 168174 235514 272144 210482 227390 182168 35886 -134453 -61776 88320 92178
27906 92178 202820 113996 55040 -142837 -216051 -156564 -112486 -141223 -62077 73256 125359
27895 125359 34044 -61966 -112558 83429 -31909 -102724 -177715 -86940 1959 -31134 -100469
27884 -100469 -61458 8940 -25521 -69001 -32613 83296 126045 24400 -247487 -295315 -228395
27873 -228395 -220188 -147453 -46849 56273 40491 -34812 -136573 -56257 38784 35216 -42474
27862 -42474 -174809 -204660 -179483 -28165 60827 -8286 -13482 -88634 -318105 -332354 -159166
27851 -159166 -140369 -125482 -120433 -121392 -179655 -143337 64550 3802 -54520 -85234 -116608 71506
27839 71506 112408 27556 -44208 -106858 -65295 -154077 -258232 -150625 80363 177731 179923
27828 179923 102229 -58134 -95920 -86543 -39968 -55819 -124282 -231992 -137310 -63746 -16005
27817 -16005 -49024 -125237 -115991 -16271 -9834 -29094 -91746 -149303 -211995 -264421 -190746 -208407
27805 -208407 -142992 -115746 -125044 -129909 -68156 30020 -20295 -148690 -162907 -142451 -149375 -107417
27793 -107417 -90364 -130539 -38520 -75915 -8873 103123 81320 21353 153902 36895 -126953
27782 -126953 -154168 -82524 13278 -39194 -193635 -177040 -110838 -40505 69439 -39343 -98069
27771 -98069 -214940 -186769 -173296 -201884 -139812 86968 149800 108136 48090 -73133 -215989
27760 -215989 -195779 -118160 -30162 -84257 -102899 -125914 -171435 -64061 5801 37904 125047
27749 125047 148987 63278 9703 23303 -82697 36706 -2599 -18556 -156002 -207303 -144133
27738 -144133 -75369 -132904 -214487 -77568 63782 154247 219392 -46215 -93677 -157374 -197883
27727 -197883 -89258 -120056 84 -62311 -177246 -243995 -182607 -67563 -138210 -130275 -122326
27716 -122326 -193093 -264775 -141604 -20543 39230 188751 310244 207015 183414 67026
27706 67026 -9686 -15769 -119427 -46703 -7438 -43307 -60304 35551 26468 51010 67702 11695
27694 11695 -102714 -165317 20871 106521 124565 106067 -36883 -100977 32332 141653 86333
27683 86333 -7823 -134884 -169143 -267761 -196415 -145204 -142177 -258412 -249979 -61080 47292
27672 47292 187653 64496 -60176 -185663 -328306 -168242 60408 -145076 -320617 -223089
27662 -223089 -79795 18266 1122 -35715 -97848 -111048 -14795 -71549 -155069 -66503 45207
27651 45207 -44039 -212676 -229735 -163757 -66947 64647 40614 -21896 -123624 -197752 -142440
27640 -142440 37219 196889 116662 -18359 58162 28858 51171 39020 -49715 -232728 -207901
27629 -207901 -170206 -293091 -219124 -95132 77586 114315 33763 10390 131789 120592 -8457
27618 -8457 11175 44042 58804 -78016 -149987 -66948 -64770 -82189 33193 32697 -60216 -39707
27606 -39707 -93162 -180983 -80612 -39527 -45881 -23078 -173002 -102604 -42136 -107041 -84028
27595 -84028 -31112 -64353 -193796 -214670 -158474 -150922 -157672 -139345 -261883 -183243 -146658 -221041
27583 -221041 -296685 -271141 -162690 -29952 -59587 -80155 -14399 54766 43931 65846 51749
27572 51749 7703 -58637 -113421 -80740 -173223 -182361 -105691 -183766 -181257 -204804 -332217 -415363
27560 -415363 -225355 -137091 -105544 -126728 -181468 -95685 -13081 22946 96006 105200 118717
27549 118717 177782 57476 -194937 -193913 -125175 -140899 -191529 -181032 -132789 -120742 -185648
27538 -185648 -120764 85141 128078 27421 -52909 29745 -42198 -181060 -105424 -87517 -2787
27527 -2787 89843 -50422 -111696 -180770 -182947 -135927 -65652 -40640 9112 139392 147815 196288
27515 196288 168280 131101 134160 135820 205576 252951 191214 48741 -51835 -57616 -59767 -42917
27503 -42917 72646 216500 238052 96570 -110886 -33395 1865 28205 35781 -51799 90404
27492 90404 57562 -30509 28306 73786 18196 -53641 -9686 26256 -49378 -124102 -136842 16915
27480 16915 4935 -12773 -6996 -31215 25595 70307 -40597 -21481 -70779 -54456 2373 -98080
27468 -98080 -202528 -154877 -110839 -71054 -139376 -189960 -218042 -222820 -305501 -328336 -286846 -295594
27456 -295594 -310505 -297354 -226860 -8907 65652 104599 167259 25264 -51536 23787 92414
27445 92414 30133 -21966 -42477 -100983 -169679 -160756 -136816 -34731 -94890 -180176 -84634 -51168
27433 -51168 -113021 -133007 -98073 -66514 9488 95319 -1267 10308 -7696 -271 -102014 -158530
27421 -158530 -181914 -256193 -229550 -60555 33012 -127286 -269107 -216446 -122514 44120 120570
27410 120570 64393 62004 28462 -111591 -215420 -192786 -90278 -70398 -105464 -83178 125217
27399 125217 95403 39243 112267 76687 96361 128501 78718 9330 -59565 -137736 -258298
27388 -258298 -350753 -167355 -21574 -7720 22496 118832 68760 30957 -72487 -46237 -43227
27377 -43227 -69575 -54146 98910 58769 27123 42714 76675 73111 -47653 -54552 -45653 -56180
27365 -56180 -79832 -78496 -107339 -66037 -90753 -213815 -209980 -133819 -1545 25105 -35806 -99790
27353 -99790 -40626 -9113 -49125 -70076 -72949 -56077 -80806 -165549 -82793 69899 64491 -69695
27341 -69695 -202805 -206233 -151772 5856 47845 -44999 -73356 -23205 135480 209843 79243
27330 79243 44382 57329 72492 88232 26388 89573 81262 -23126 3683 -42095 -102320 -251290
27318 -251290 -238011 -199752 -178096 -54971 -42842 -145178 -139018 -71737 -159245 -212841 -34587
27307 -34587 73170 129088 -45503 -137178 -78628 -154067 -43386 120180 176827 124944 117528
27296 117528 149881 105394 28622 10315 87872 142177 148417 56434 -29955 -63516 -184636
27285 -184636 -188396 -148937 -36659 -82731 24152 113828 35289 -187213 -215475 -175306 -199066
27274 -199066 -179039 -244130 -227505 -69863 268 -2576 11622 10453 -74382 -110004 -134501 -138362
27262 -138362 -105087 -117551 -84190 -106184 -78783 130476 146059 38512 22607 17847 -98376
27251 -98376 76296 109427 11102 -153775 -183170 -199615 -240283 -116101 -2965 -28828 -38466
27240 -38466 16129 92189 25572 -27005 89382 247009 180232 209170 180435 -10239 -106767
27229 -106767 -204877 -106425 -191101 -265608 -320236 -281493 -101395 101909 137739 -32077 -180642
27218 -180642 -300028 -165831 -71955 8810 10011 -40903 -136496 -134895 -135480 46777 227742
27207 227742 133451 -1366 -88129 -72694 73967 76978 -30577 28759 68041 50737 -37924
27196 -37924 32035 -2160 17172 -52962 -73798 -58675 -21970 16503 38090 -3050 77958 30663
27184 30663 -144712 -274111 -174643 -37120 -61489 -119539 -137655 -44845 54652 69291 199909
27173 199909 6214 -142970 -248096 -231554 -81905 -36379 -118367 -20133 7358 -159842
27163 -159842 -341781 -276972 -129316 -77652 -43123 -131084 -125900 -84034 -35260 -3883 84192
27152 84192 58432 -28162 -80618 -79786 -54232 -126066 -170853 -214276 -249949 -206317 -187119 -258640
27140 -258640 -340232 -337437 -221847 -260844 -210862 -151483 -244907 -237045 -212366 -178013 -128827 -107896
27128 -107896 -196674 -242775 -211723 -195601 -108575 -109277 -41049 -17253 -57334 -206431 -269877 -200597
27116 -200597 -255636 -347431 -159260 -122219 -102232 -38606 5620 14388 -91053 -166402 -99989
27105 -99989 69228 172893 186277 231285 247495 225399 87381 -50760 -67373 42428 14195
27094 14195 -70635 -41453 -3868 -88868 -68455 -6475 28303 -47298 -65328 -67949 81730 136128
27082 136128 48733 54302 30002 -5845 -54126 -52773 -57605 -11823 -109940 -209469 -226368 -161589
27070 -161589 -52625 -134372 -196498 -116198 52502 69841 10984 7286 19027 -56002 6187
27059 6187 -14851 -20020 -114434 -174752 -96704 -10162 -149523 -265093 -238074 -132170 -86369
27048 -86369 -37734 -68816 -2709 200783 217883 97948 -16518 -103179 -193133 -76550 -26721
27037 -26721 2457 125747 220287 170993 127632 68009 -34019 -42599 -75262 -130231 -136131 -70744
27025 -70744 62839 -99417 -243040 -303111 -254409 -191195 -163644 -143535 -101175 4076 -75660
27014 -75660 -253791 -333176 -351729 -364637 -437163 -341159 -267198 -86935 -110494 -170297 -220334
27003 -220334 -185414 -28981 58165 161505 221898 98706 -30324 -74487 -151582 -84091 -70956
26992 -70956 -51069 29017 98206 31024 -72060 -113492 -16655 72635 114532 74265 -73639
26981 -73639 -77402 -29007 -162759 -282975 -165457 -44986 -33978 98236 124355 698 -241974
26970 -241974 -276806 -141151 -3901 89844 -111087 -184571 -227561 -208472 -115594 10101 7319
26959 7319 -15991 9832 53034 98995 133088 174092 41548 -28167 -148175 -169970 -80785
26948 -80785 -53624 62466 -910 -59363 -111595 -71085 -21280 8413 -15244 -37256 -118787
26937 -118787 -51023 -106841 -49604 -17619 -77307 -24537 7360 -96034 -64043 -86291 31829
26926 31829 42244 -37533 -97931 4729 6737 -73481 -1836 72316 86291 153296 145446 -13173
26914 -13173 -19366 3093 -30984 93334 103578 -112042 -72409 63935 80831 100454 101558
26903 101558 112395 126112 220147 7043 -193474 -228836 -136117 -41236 41351 -102635 -98704
26892 -98704 -37453 -67250 -2410 -83493 60063 -61592 -190882 -206968 -238088 -145372 55254
26881 55254 100883 159032 241993 113809 -28455 -6747 1574 17682 140060 165653 -44517
26870 -44517 -52439 -30825 15379 104513 35575 -50546 40241 71992 -215 -71918 -31662 -84247
26858 -84247 -67371 43276 128090 88775 31563 104166 64674 5007 12285 -96146 -101360 -1169
26846 -1169 64120 29816 55395 123571 162869 247009 228072 126299 72293 110093 -29728
26835 -29728 -157934 -67096 -32603 349 -20259 -19071 185663 195802 144790 103076 231958
26824 231958 136310 42601 56286 -15177 -145611 -142321 -150017 -26224 186074 235899 174649
26813 174649 164859 108116 32056 -58144 -198152 -228650 -281054 -313085 -271942 -112115 -30741
26802 -30741 -58497 -130441 -238336 -158778 -131122 -264720 -198527 -151722 -121934 -78514 11509
26791 11509 -75961 -23973 -20105 -24963 -31506 90421 151525 266449 221025 180128 200801 137486
26779 137486 32312 25546 46385 39397 -158775 -124880 70877 62484 4726 61745 52754 -113887
26767 -113887 -114680 -44134 117377 167875 48955 -31139 -73464 -49708 27497 -65218 -263326
26756 -263326 -65432 15589 40802 58732 77628 -4910 -198623 -88492 -101592 -197711 -79401
26745 -79401 -120015 -96356 65545 -7805 -64937 61866 137126 13482 -186438 -87719 -54853
26734 -54853 -136053 -209119 -278950 -252067 -172383 -127923 -27655 -24685 -27945 100712 109094 75120
26722 75120 -628 -171818 -251320 -247018 -84365 -17384 70642 53979 9840 -79677 -60673
26711 -60673 -83825 -27844 83396 -47389 -114851 -206758 -176679 -86659 -58946 12777 26535
26700 26535 -23310 -85766 -80291 -30233 -70021 -135109 -225362 -379820 -325853 -244120 -236818 -200649
26688 -200649 -46730 103143 -17115 -60297 72704 115891 95941 6599 -144909 -26221
26678 -26221 102763 76041 109190 145983 153611 103594 71244 -42232 -102022 -71826 -159434
26667 -159434 -202240 -206610 -160840 -122970 -172742 -84359 -80483 -57535 -11207 -95564 -143146 -221785
26655 -221785 -273846 -147259 -34204 11384 -47406 -34198 11999 174532 181383 129896 63158
26644 63158 30369 159056 165925 79480 -151583 -136434 -76141 20222 82724 244169 383268
26633 383268 316239 152881 15480 -22005 -128023 -165170 42781 111890 46067 -24244 64819
26622 64819 18414 -61644 -196238 -244443 -96613 21593 -3613 -15073 -103969 -202244 -190622
26611 -190622 -99304 78300 136314 160057 169332 -48416 -202546 -272957 -144299 -9133 44357
26600 44357 116 -129445 -191688 -120498 -206868 -372644 -342838 -180629 -112893 4277 85690
26589 85690 148501 10513 -74170 -53003 46300 47999 -6104 3101 83813 216809 192697 117907
26577 117907 242923 220674 126720 124868 106910 100173 64606 76191 42382 58396 -29250 -69173
26565 -69173 74135 77449 -22343 49471 100212 75503 66506 6509 -58749 -116521 -188188 -153479
26553 -153479 -80745 35486 259112 258272 147708 68724 92690 -23532 -155334 -53653 24959
26542 24959 30503 160722 101778 -59798 -52985 38256 -60677 -106041 -81324 -227887 -328268
26531 -328268 -257571 -27292 102958 187115 222504 157094 10927 50409 109450 45169 -34621
26520 -34621 -107395 -45002 84717 15149 -87078 -150635 -107434 55157 7110 1097 -35569
26509 -35569 -147882 -309564 -213920 -222380 -137494 -74649 17584 7266 -50898 -43044 -56969 -196121
26497 -196121 -230420 -321345 -250229 -135585 -80913 43697 73524 -16700 -38551 19072 97
26486 97 -27201 -29788 -106566 -270816 -292796 -323502 -241540 -132883 -76305 -116714 -9217 93147
26474 93147 131814 113353 12901 2304 -18485 52158 -80308 -187352 -151336 68988 166506
26463 166506 -84136 -87304 88023 29011 89460 251164 118350 -98254 -33024 13134 37871
26452 37871 72520 135887 132474 170545 163387 147678 59016 62565 96817 218791 169491 168650
26440 168650 93354 65136 -33707 -98410 -139795 -155244 -47175 27496 -77918 -21389 19904
26429 19904 -20978 -6597 3454 -19480 -12808 32219 38420 59491 32458 -53161 -114522 -33616
26417 -33616 24834 -97304 -79334 -66413 -155686 -212201 -363494 -320152 -198468 -52688 45466
26406 45466 -69973 -94450 -77273 -78610 36823 86106 153515 -45051 -33884 -11179 -56731
26395 -56731 -128817 -234296 -95330 -16556 -8272 -120655 -219028 -50221 104116 276387 221130
26384 221130 123585 186741 70919 -108067 -52816 84635 68030 97008 94090 52899 7235
26373 7235 -39829 -46508 176413 239342 310550 310034 149555 51389 -38838 49486 86226 146263
26361 146263 86588 135972 199437 227435 164087 136057 18827 -29793 31111 36232 -40325
26350 -40325 -69645 -106671 -155027 -220288 -182482 -322018 -370449 -292612 -116626 -32268 -3160
26339 -3160 -32678 -44528 40087 -69364 -70103 17543 115938 144842 147866 63746 51264 121352
26327 121352 146793 91666 -5278 -44355 13510 -94634 -292631 -257127 -126621 -73110 -10480
26316 -10480 114876 113446 140937 65376 -45276 -106886 -143513 11394 137718 190522 236031
26305 236031 304957 247294 109120 -88094 -140638 -98368 -74900 -147503 -167049 -230468 -219669
26294 -219669 -104714 -28453 -80957 1522 58780 25063 79830 34282 -90839 -37938 -76600
26283 -76600 -76866 -6342 87369 12273 -58007 74857 75096 20086 -29196 -149445 -143100 -169132
26271 -169132 -109194 -29970 101021 159749 79442 -36702 -41170 -166442 -198090 -295164 -245173
26260 -245173 -46900 5788 -105058 -61292 55836 96828 -80861 -110846 -725 -12384
26250 -12384 50649 65903 -40449 -116001 -95092 -85922 -168250 -116598 -164323 -195158 -235621 -228332
26238 -228332 -106604 11622 87253 138772 133520 43371 -87123 -154542 -235991 -13772 163994
26227 163994 182171 -13800 -129662 -58351 -87153 -79425 -1787 48206 32894 -20952 -38998
26216 -38998 6452 73674 152733 176099 85671 74906 43200 -79904 -108377 -47027 70064
26205 70064 187664 70441 -72796 -204853 -328942 -136734 -96252 -257801 -166314 -172711
26195 -172711 -163818 -197357 -182547 -129329 -106589 -121489 -219891 -162453 -169039 -120028 834 39167
26183 39167 26343 -84076 33141 160840 201902 195002 68268 -85593 -127402 -41494 -28203
26172 -28203 68074 10332 91976 193352 81796 75455 122676 97338 -29874 37592 138533
26161 138533 190231 179304 144258 129261 97879 3733 -53252 -108533 -96139 -123509 -182826
26150 -182826 -195661 -216516 -144263 -10705 119664 209337 105386 -62575 -100606 -98472 81805
26139 81805 190420 109618 122249 212810 113328 -114804 -161305 -108237 -126292 -123347 -129554 -183467
26127 -183467 -171170 -124178 -118581 5382 84687 -74199 -112447 -45018 82527 221360 219146
26116 219146 125443 231987 333123 205740 -16024 -101146 30938 91268 111998 125851
26106 125851 240142 348698 384077 207999 157353 49093 -132763 -167460 -189098 -98888
26096 -98888 10631 45967 131252 181625 281135 141360 67409 154128 267958 198512 219992
26085 219992 254136 170445 -33470 -61543 7582 154549 181798 102611 24729 -71878 -206320
26074 -206320 -217559 -229456 -161698 -34347 -46442 11861 62459 -11515 -114937 -64606 88287
26063 88287 111601 -3066 -142328 -234053 -263091 -198356 -73190 57838 3245 67157 124965
26052 124965 149828 109503 6833 37829 72966 95821 73309 110240 195789 350564 342727
26041 342727 295899 203755 167987 137995 76310 -71987 3163 154773 191698 155198 -15566
26030 -15566 -43103 -16486 120554 127781 8755 -22364 2269 -32029 -34680 -93441 49587
26019 49587 -16122 -60703 -58612 72309 242902 150254 97040 95220 84223 193957 208425
26008 208425 296895 227610 226497 171639 122428 39995 -22314 -14671 6821 52208 19013 6642
25996 6642 9951 4102 83928 75527 -74007 12979 -724 -214257 -11665 177573 15536
25985 15536 1156 116819 594 -233238 -153067 -18388 47994 -84710 -203031 -146910
25975 -146910 -4796 -127649 -149083 -21993 56187 29061 -24689 -34711 -72899 90856 199968
25964 199968 60896 67729 137426 90900 -3330 -67319 -54437 -105551 28208 107390 80672
25953 80672 135674 103397 115299 103871 117226 163311 183502 99863 91157 245894 318902 166892
25941 166892 9654 -96973 -35066 133895 82081 64103 46608 -50402 -158787 -53492
25931 -53492 147071 145027 178459 152213 125530 194965 93805 -110952 -97444 32397 90969
25920 90969 142453 230675 178166 153428 161619 268339 204900 163055 157305 69756 -108902 -188619
25908 -188619 -197892 -214200 -132965 -59852 -98537 -70266 24835 172787 157127 41288 -71310
25897 -71310 -201334 -267277 -170579 -143674 -188344 -276291 -204619 -64089 153590 176787 -52542
25886 -52542 -102600 -45222 -41385 77764 63676 -35239 -205740 -299741 -215216 -106444 -122436
25875 -122436 -184698 -171362 -123491 -54183 -84413 -99537 -42670 6795 13870 -93310 -117728
25864 -117728 -69348 -92222 -44173 -43135 -46527 44122 117398 78751 -8186 -124804 46813
25853 46813 112288 18461 -5480 -42314 -17933 -22473 -118523 -54774 25292 179844 197857 241872
25841 241872 174497 203198 286633 311849 251532 105199 57519 76220 98341 120351 72607
25830 72607 120449 131861 121791 60819 -19739 -29980 -11353 12899 140582 156159 102094
25819 102094 98854 148683 194117 59419 -21354 17819 35305 56670 14280 37512 165791
25808 165791 168357 136776 84444 -25189 -132665 -106685 -72418 -106675 -103079 -20998 85362
25797 85362 122677 315485 276246 133042 153551 288777 189902 68013 62692 15958 53120
25786 53120 38551 -15963 -28228 80579 192426 228858 130052 209483 303145 213382 269056
25775 269056 207011 -7410 -117585 -70240 -165485 -159658 -105914 32233 79250 68404 93757
25764 93757 -9254 -35933 57190 -59342 -211882 -165357 -130121 -81908 -125 3616 79875
25753 79875 11936 2415 -128438 -105531 80662 115021 157991 115774 47497 19143 -167443
25742 -167443 -97987 -6283 108597 100623 60075 10675 -190448 -131153 50150 197794 133815
25731 133815 94449 80052 21105 -107690 -96427 -64886 -69679 -115259 -130938 43297 193456
25720 193456 169435 197890 112392 27568 -110166 -63657 23519 51965 4881 -134848 -267988
25709 -267988 -190373 -120955 -56588 -72326 -115909 -175608 -56077 57864 215549 121929 23008
25698 23008 49450 218543 213886 132458 88876 22641 41427 145893 142057 38331 -3833
25687 -3833 19384 13531 68245 48944 -5900 -39083 -13114 -61728 -72457 3262 101825 -62514
25675 -62514 -14629 -89730 -99907 -16161 90143 167204 32408 -30084 -96886 -116568 -82994
25664 -82994 -53622 -9271 -53198 -77250 -24196 45457 45660 94622 203680 237514 247152 162274
25652 162274 63394 15941 64068 122857 96834 86280 83632 105830 145564 33948 -63050
25641 -63050 -39842 -37363 -13521 29082 -127467 -32675 19782 193189 283428 200377 199133 243836
25629 243836 92289 148439 197812 182692 208154 232828 233820 168779 164433 82783 77262 223860
25617 223860 205438 117101 132085 83654 97833 61808 12186 -33187 57153 89586 211276
25606 211276 264556 151569 14970 -71995 -40249 -100663 -65054 -129203 -122972 -27617 33937
25595 33937 70067 199723 346006 323167 146820 186314 89393 -51937 -47666 -58037 -20023
25584 -20023 -37491 -36100 -50411 89112 185936 17634 -123721 -206546 -228848 -75659 -4475
25573 -4475 -37708 -31634 -23107 5081 32600 -23793 -4240 179017 173106 62779 -15106 -50064
25561 -50064 -76797 -80579 14040 123300 220917 136010 122391 257493 312770 312494 341452 262244
25549 262244 59768 -75923 -149647 -94763 90178 237431 239079 198263 70085 -27436 4836
25538 4836 18128 63858 231575 264677 224478 187445 196658 142265 183364 168784 45792 96369
25526 96369 109733 54684 15617 -102792 -73076 176396 259446 256526 141360 50848 84361
25515 84361 94266 164055 163624 6003 69949 148288 300207 298865 312437 248056 181900 76182
25503 76182 67497 271166 292240 253514 156850 28069 -21075 -51869 45908 94955 87066 69044
25491 69044 109239 96742 21109 11276 -4050 31927 -65044 -22073 37209 175432 205068 201051
25479 201051 112292 197560 158073 26900 55281 67065 131507 135998 71011 -79709 -7124
25468 -7124 60666 124453 103753 45941 -33757 60816 36816 -8046 -147017 -293588 -227919
25457 -227919 -226778 -212984 -58173 91327 188448 140129 63605 -45864 14992 101876 37794
25446 37794 -21520 40738 94234 148226 151947 53936 56748 192202 233438 162245 192785 90052
25434 90052 45106 116204 35996 36585 113959 32789 -40701 -187198 -129807 39898 110032 138717
25422 138717 -37069 -19241 129631 84710 9898 106115 50642 -150614 -175638 -88033 -68161
25411 -68161 30813 62081 48451 84929 67671 -26780 53037 98922 36272 53659 75805 95768
25399 95768 131581 57191 30273 26767 -42409 48106 159469 118138 173088 148909 15931
25388 15931 -98890 -186368 -82803 61565 -59567 -42618 -16692 -219870 -265840 -175935 -52762
25377 -52762 39279 272840 282385 228533 216239 120913 122100 107669 31561 -80313 -147320 -62684
25365 -62684 -15324 -55273 -116368 -158140 -39334 50114 20671 -75192 -68306 -6508 142310
25354 142310 214398 76816 -126745 -27995 95985 68398 13765 58003 159594 144248 75737
25343 75737 3649 2601 226 -335 76627 138151 235177 142360 47176 14718 74751 67088 164650
25330 164650 245325 351475 320649 175816 140086 102374 122432 115666 220486 249379 127394
25319 127394 114426 280673 215176 224852 272762 208882 198157 165719 125887 154150 59517
25308 59517 131248 139833 89970 20683 16800 -5495 -7826 -106205 -45043 28543 105615 273829
25296 273829 259087 152360 174028 125701 44683 98438 111490 -15240 -96804 -82113 -33218
25285 -33218 -81125 -15098 -14034 8732 90049 85452 107202 -33776 -155277 -158310 -121104 -117817
25273 -117817 -9730 39274 104873 66025 -153202 -131199 -67119 -87667 6775 91103 116689
25262 116689 129900 198674 82033 53298 129653 45976 11768 89107 197873 194679 81449
25251 81449 -125355 -112768 -92525 -174856 -64650 -47741 -4292 77028 78532 71256 86312 38866
25239 38866 15210 -4807 -116755 -104200 -17034 26480 78214 29653 -24652 57168 -18600
25228 -18600 -162823 -128031 58077 105736 12126 -47243 -98848 -63642 46083 73948 34179
25217 34179 -38234 82977 97603 -44225 -168504 -237344 -171205 -145187 -241308 -227708 -151420
25206 -151420 -35181 106051 -19306 -50806 -11045 91794 229394 158958 48510 36316
25196 36316 152192 264986 224812 -8908 -113145 -48597 103803 187802 234332 215408 198932
25185 198932 249686 237251 191112 231622 214369 170951 -32131 -65253 -58654 101447 96665
25174 96665 89804 285814 291409 215613 137024 287282 304552 177492 210258 248722 270002
25163 270002 253334 240126 225019 137115 46379 -4140 -3815 69546 8760 16013 139960 163452
25151 163452 47566 51589 -93480 -21289 95706 67891 100127 21014 63939 69939 42440
25140 42440 -85286 -25371 20973 -83798 -6338 -1993 -87311 -58107 -41616 29241 76728
25129 76728 36205 -62870 1096 101218 33883 -81500 -127958 35744 74618 -24953 744
25118 744 131700 106272 147653 267422 184393 166906 253078 315981 387166 182366 -53636
25107 -53636 -1673 4848 -63839 88878 136885 229878 231682 46264 13429 151384 249075
25096 249075 154350 84353 128818 35390 -60739 30025 237241 339122 326934 269230 277449
25085 277449 233867 176799 114474 72907 93838 117410 25447 28049 120728 73943 8447 -100146
25073 -100146 -96644 -22790 104592 175832 223380 185601 183666 222053 108600 181270 219203
25062 219203 220366 102909 -140009 -242112 -227753 -81495 14351 9061 18415 8967 51912
25051 51912 102171 86895 54047 69971 120461 175890 181623 193690 245722 215465 193605 250841
25039 250841 297693 190293 23680 -77960 58020 131759 152989 167767 160896 153202 102231
25028 102231 35397 95964 115819 43050 132724 155528 138268 108046 97721 124983 -15927
25017 -15927 97145 124141 183423 39934 -68885 24348 93654 136683 121221 144898 70488
25006 70488 134622 212457 47981 21781 151313 254078 247130 133158 -11082 2193 100533
24995 100533 159860 261537 272241 175584 27247 -13227 -9351 136820 234073 190368 204006
24984 204006 126757 15429 50471 48071 100110 184827 152868 146825 135848 129190 -26316 -66137
24972 -66137 -51689 -22558 52712 187701 197336 212907 197279 115588 -93180 -29285 -59895
24961 -59895 -45780 80955 217276 219201 242641 361532 263732 51630 37161 156577 122182
24950 122182 -23680 -103676 -48083 129792 199339 83016 28805 117811 -4963 -128965
24940 -128965 2391 11842 88768 194711 236450 236993 257546 163673 122211 108075 101473 218274
24928 218274 318683 261351 168423 191382 244761 240235 64948 -87628 -4535 88055 153580
24917 153580 268 -95922 -86896 -59818 36921 17569 -29660 -2119 27172 -127740 -154024
24906 -154024 -209689 -216296 -186688 -223009 -87687 203864 308527 251183 185376 38432 -43797
24895 -43797 152561 247839 186058 49695 59089 114692 -17848 -42364 3930 41886 75488
24884 75488 120710 177773 220652 230346 240291 136836 40348 39214 71948 153285 230438 212551
24872 212551 239125 109484 62464 11760 45508 80232 82338 151962 170549 99228 119950
24861 119950 218734 287126 270253 230195 157813 18996 -86594 -121039 -966 112685 11563
24850 11563 -19057 -7014 -14388 -6929 132361 253692 179430 29429 21774 58016 138770 86973
24838 86973 30823 112684 224161 312950 91775 99700 157660 134788 66779 26442 -57795
24827 -57795 -22950 228061 272486 242459 -34502 -4057 11109 -43871 -135927 -131772 -42014
24816 -42014 73496 176854 27325 -154013 -31554 264365 146223 85345 317874 188894
24806 188894 102267 80491 -64401 -165137 -142359 -23327 123023 -11895 -65125 41086
24796 41086 177916 116870 129131 262570 280601 211047 152600 55614 47543 52625 42508 65751
24784 65751 82419 -545 -16045 -45972 20530 84329 103181 40617 83254 107845 115322 37021
24772 37021 18760 -26956 -22846 -102449 -115840 -66770 57279 342764 420704 374044 267534
24761 267534 171235 200030 97407 94879 92208 23439 20585 70400 156990 130887 67722 108525
24749 108525 124190 90260 58939 62164 68558 148697 116976 36121 -53030 -7099 78884 228424
24737 228424 223791 241267 86033 27268 -69279 -140869 -128359 -24038 -30004 -42836 14227
24726 14227 -68441 -859 72613 78791 62489 65637 -16905 70359 -10152 -102638 -45412 18577
24714 18577 72113 28861 -55413 -51558 11033 52923 -18394 -57896 -29911 53790 -31827 -124715
24702 -124715 -98869 -94811 -9783 31960 104050 192040 120273 85856 117277 70065 -108267
24691 -108267 -92429 83168 124076 108767 168148 106710 80804 72020 -5588 -98779 -71300
24680 -71300 10060 87370 71185 156883 17541 -72154 -105217 -179824 -272293 -192297 -132211
24669 -132211 -37817 47767 64435 106071 215641 180819 127380 112835 194856 239516 249231
24658 249231 218484 310052 310620 186256 204199 7133 -60829 68529 165354 145272 166813
24647 166813 102393 44022 -2244 56636 23252 33823 116476 114933 172774 87116 -21856
24636 -21856 31484 61758 45848 112264 102574 183885 251193 277297 211335 185347 216218 323421
24624 323421 147812 -195437 -296700 -89989 75417 29316 -27138 -4302 -40139 -165366
24614 -165366 -124035 44125 155194 194445 73379 30404 78184 164866 122119 13059 -2214
24603 -2214 50084 135032 201796 232218 69057 22390 66643 75385 98808 26914 43226 28000
24591 28000 -73309 -39954 -46612 -26194 66658 182713 106756 -44849 -96230 -54713 -31006
24580 -31006 -27982 -46732 -32704 -76729 -119245 -150803 -47805 -48253 -46779 111533 249597 210677
24568 210677 212395 265903 218317 186613 110505 24468 4179 48903 157701 100250 -76110
24557 -76110 -116814 -162222 -130847 -88284 45949 136791 76031 156033 191481 197396 109708 21214
24545 21214 -39587 -57245 -69861 47212 124128 181444 91419 10626 -128742 -160213 -135864
24534 -135864 -69190 -46093 81620 229955 242382 211787 163142 259117 188050 259475 174717
24523 174717 122394 131038 146793 195015 279314 203893 19422 70305 158418 90324 77949
24512 77949 194619 215183 156384 196198 226639 329175 231593 257882 286991 325063 282350
24501 282350 205137 281214 241806 163364 57961 109361 -63731 -141259 -155196 -192791 -311056
24490 -311056 -301091 -117985 9780 -57817 -173543 -33851 6557 -136792 -160240 -46412
24480 -46412 -127585 -132725 111473 128470 43093 -83623 -112161 -10132 -9713 2180 -128866
24469 -128866 -165993 -75190 17334 2317 8160 11899 63778 10182 -75749 -116334 -48780 45507
24457 45507 30468 27162 16991 -273954 -350603 -328502 -58140 10625 -24450 -94199 -36293
24446 -36293 38391 39143 116849 215189 279251 135940 167768 110517 29950 87959 27524 52945
24434 52945 33931 79843 204814 187855 109627 70557 93444 50884 133889 213087 51011
24423 51011 54381 118664 9700 -109393 -17060 53659 41957 10614 49570 68892 6160
24412 6160 11001 84105 110518 112347 10070 12450 84937 52816 5419 17319 -3299 -50590
24400 -50590 -105305 62893 102257 159946 182000 90775 207933 262568 270053 187808 210698
24389 210698 214818 213154 292467 245204 106922 81320 197938 279881 188364 155336 103506
24378 103506 45555 -39230 -121084 -80983 15092 7584 -6796 62369 176375 148640 57872
24367 57872 -43165 -55112 -34632 -48806 -116146 -33544 39020 -57488 -84442 -112181 -52187
24356 -52187 16417 54543 146293 35901 76670 62160 -5076 -68708 -26159 91387 98047
24345 98047 -3782 39625 84504 160706 135410 84989 63172 98006 218660 193594 41499
24334 41499 30799 84085 99370 28990 37719 109425 68888 15421 -36691 9222 96816 65615
24322 65615 82618 43463 -32487 140901 24439 61361 230806 115830 -41601 -61917 34785
24311 34785 73706 39683 -51445 -23744 102086 276272 359186 267009 142068 -16553 121202
24300 121202 107670 141294 50533 -98875 -230345 -251248 -298459 -226605 -224255 -198600 -124153
24289 -124153 10043 178627 109686 83930 86737 198010 246609 196039 208037 102807 -631
24278 -631 -50393 1152 -7812 67449 63123 -368 4814 7453 145893 123164 187035 339968
24266 339968 191095 19737 41345 141940 181717 110883 90609 169879 195018 204034 184837
24255 184837 250842 292499 166043 57681 41831 -120680 -20384 81678 -12020 -28054
24245 -28054 39252 47357 133796 66188 49328 97759 88174 85134 65790 55802 106606 120143
24233 120143 71351 122731 156565 22911 1252 -98177 -75784 99494 76851 44483 93592
24222 93592 263497 413944 266687 63607 163571 140154 162837 159970 115366 96393 -46139
24211 -46139 -134703 -149072 -63273 57267 55413 -44151 -152883 -33974 131382 87494 -18513
24200 -18513 -101590 -121905 -112530 -3781 -5336 76097 150436 200445 236935 56414 -30808 63120
24188 63120 18567 -60432 -10031 74782 29506 114759 107370 59918 -40684 96148 89238 98130
24176 98130 71704 4333 -117959 -77973 -23170 -55536 -34516 -25339 12931 4832 -87779 -162172
24164 -162172 -137897 -83073 48456 19510 40624 134883 117470 5806 -116197 -26800 15118
24153 15118 129598 182308 170410 111123 195770 147346 39645 137216 260181 109477 144481
24142 144481 152016 21143 -131454 -91998 -105857 -62354 -53831 -162091 -261389 -242040 -208579
24131 -208579 -206885 -193961 -85375 -2117 110967 43056 -13789 27634 92637 179667 120877
24120 120877 118239 -51269 -138230 -16133 39170 -42234 -74728 18336 74607 168199 166078
24109 166078 96645 126935 -32696 -161335 -127443 -142580 -147683 112605 76859 -20930 2010
24098 2010 72470 214051 348738 257865 174619 134314 185831 211123 87136 91410 87660 -32063
24086 -32063 -137452 -220900 -240905 -220628 -125866 -52874 -106116 -78034 103482 155387 150027
24075 150027 120310 135231 81900 75963 61146 130300 177820 34893 46592 115706 191163
24064 191163 111196 2261 -12327 -90736 -60664 -62332 -154170 -236644 -178388 22156 201710
24053 201710 225017 188681 139158 103895 49473 78252 104665 105533 94298 101957 150971 235513
24041 235513 234403 164514 111759 121551 210469 117416 15035 35734 33844 10214 10033 -67050
24029 -67050 11072 45717 85708 58601 15212 142006 203945 268807 247787 161368 186922
24018 186922 182872 219280 189651 77413 -20657 -64865 -32013 61084 119603 87548 143795
24007 143795 245263 273343 343463 188031 6963 -44112 -38480 131874 254398 279885 216443
23996 216443 84188 -5023 87198 159178 202005 246806 156302 137555 130355 -65804 -6690
23985 -6690 83650 137983 178775 100162 -30737 -81138 52253 67122 92853 104218 -2911
23974 -2911 -35739 6155 -33614 -75628 -42597 -60924 38281 258160 306367 281472 162172
23963 162172 84589 17029 -185870 -212211 -154500 -49101 -118438 -69014 122488 27383 -109680
23952 -109680 -166657 -90741 1249 6497 65762 -18695 -45164 -51906 -103875 -111500 -98066 -19627
23940 -19627 121366 142040 33817 103465 144765 67438 -411 -44218 -93987 -55787 -79081
23929 -79081 -97983 -71368 39268 -11754 -52663 -16262 103476 94181 105796 112471 178045 129897
23917 129897 74162 27039 -79938 -160706 -161529 -35706 79648 -9946 14853 24986 32426
23906 32426 57942 118499 98700 157840 151116 113726 -3512 8163 42794 -82396 -60449
23895 -60449 57044 84278 74589 229440 216660 166476 60792 -62340 78062 61498 223293
23884 223293 153201 51791 69417 49274 -36219 -60751 -100418 -96248 33153 77073 -48145
23873 -48145 -108844 -160112 9385 123527 147279 182348 275814 302309 167942 -21950 -16230
23862 -16230 8657 28719 98656 -17042 48812 73792 21422 52441 73874 94423 184896
23851 184896 62495 -31506 -132749 -99333 -23599 39348 143071 218594 331301 273546 194658
23840 194658 157698 59507 -2812 -77604 -43497 -42958 -188737 -184175 -55538 -49911 -53603 -167347
23828 -167347 -207435 -169526 -159568 -104073 -25047 -75700 -140323 -83254 62720 132295 174825
23817 174825 96262 -26067 -64715 23012 -38932 -110218 48365 48338 63768 163034 205238 223782
23805 223782 209024 212959 178954 272808 279124 237802 182546 198392 154850 155274 269008 380248
23793 380248 366158 282878 208875 266629 281433 136267 55955 98673 39538 -62763 -29733
23782 -29733 88676 219460 235588 188804 20567 -60935 41083 65454 64541 92191 70109
23771 70109 60827 34079 126473 129171 81343 81247 119013 78950 -67717 -185360 -117039 -51039
23759 -51039 -23356 -52575 73355 159028 154661 144510 -12808 -50707 60803 151201 133341
23748 133341 59609 10305 7741 6018 -13460 83585 18071 -65364 -31776 -21460 -56391 43219
23736 43219 130099 75670 131937 123778 173234 218467 85270 -2962 112720 193645 154324
23725 154324 74368 28163 -47067 -9860 -2480 -43679 24065 94192 104861 148998 114834 39247
23713 39247 157878 142844 -38798 -41799 201016 222587 59488 50325 -23535 -60695 24603
23702 24603 174978 159085 43946 154181 84749 44001 45266 40621 135356 197308 149359
23691 149359 101635 143660 142502 199032 197419 184281 191852 184811 272300 282158 309796 361118
23679 361118 221854 194593 79660 18221 38366 61420 85028 38022 -5177 88565 104062
23668 104062 69232 124250 11106 -74243 4585 90148 101849 193265 109758 107599 189013
23657 189013 194189 206637 241766 127831 33626 318772 250356 145716 55139 55298 18571
23646 18571 22047 35212 -37515 10039 -17813 20619 70147 202389 -19485 -106857 -111224 -89591
23634 -89591 -146489 -296154 -338504 -232582 -53659 85624 94934 27807 122118 141001 -6585
23623 -6585 -13978 -40793 -105832 -33056 -97953 -21299 -76250 -110556 -22669 136036 162201 49823
23611 49823 41319 72037 154146 174472 282006 205884 184109 155821 18638 85289 43184
23600 43184 144795 216808 177272 91399 -83710 -234933 -245972 -256570 -249993 -47652 -29124
23589 -29124 -54297 78259 121297 5614 -130597 -16898 67470 48556 -74481 -22521 99697
23578 99697 131916 220567 177311 259191 212093 145868 44955 -1837 -83882 -107680 -24497
23567 -24497 957 -12152 50618 37931 -65329 70881 195952 80164 -13650 21626 170442
23556 170442 206512 108579 203000 275983 175857 28510 15478 187339 222715 237046 223431
23545 223431 160239 126761 128419 128806 179740 197159 294628 253058 183558 73633 85897 150260
23533 150260 170403 258344 239763 262573 267418 314936 281246 297473 329176 218841 183357
23522 183357 227697 250100 189564 19035 -31845 17673 -121248 -90449 83031 76666 108135
23511 108135 121992 66955 -20416 -19179 18710 -126219 -112167 -40561 70765 90688 42568
23500 42568 27783 12809 -79469 -32542 32945 22304 -24855 -70904 24930 178272 200453
23489 200453 260886 220361 200297 94825 41605 99264 126372 105742 23821 -36287 60905
23478 60905 -36350 -125840 -111348 -35201 57771 168654 170725 170963 212494 221080 97573 107141
23466 107141 97718 49851 19523 37333 82064 -45310 -31914 25897 69247 209825 232101
23455 232101 16681 -131557 -49754 80054 166670 85514 -48977 28786 142879 91467
23445 91467 151416 296369 149511 30505 27711 48181 32853 57845 138791 120993 65045
23434 65045 73668 109638 249557 117318 115618 -54092 -82795 -29284 -116944 -145433 -235830
23423 -235830 -260538 -153280 68297 61326 -2401 -66463 -117192 37294 178113 168277 43240
23412 43240 -37915 -142969 -79916 69571 156312 147574 133320 211624 156637 107179 83609
23401 83609 33261 -92313 -134699 -105910 -35781 63413 16130 -18564 74900 29755 88027
23390 88027 -6435 -94892 -85914 -52553 -15532 110887 137376 125780 69876 72105 104344 45611
23378 45611 -105428 59262 132020 90472 -41365 -373 66910 79536 79527 24576 -5842 151957
23366 151957 255668 65068 -111521 -226745 -240075 -126740 -27899 2947 -51647 -66219
23356 -66219 -62431 34725 78445 68193 -45044 42558 177194 209229 139561 48438 -16407
23345 -16407 25925 79153 -35170 -39854 -83075 -42589 10245 96072 81384 34910 81551 82402
23333 82402 126431 137004 158410 886 -15913 39887 58087 75271 695 65466 379393
23322 379393 357643 281241 181618 104096 67538 128286 106187 -60857 -270279 -212135 -90101
23311 -90101 -20523 -97746 -36508 -14602 -19655 99086 35504 54487 14515 -48813 35962 63178
23299 63178 -8238 -28013 59729 30866 -26258 -45492 -37365 58047 97538 164511 207518 197248
23287 197248 194106 279392 136736 -55031 -59947 126959 206539 179441 155115 111038 81086
23276 81086 31085 15475 -77632 -71016 129963 117729 8614 4787 42785 99551 138644 92344
23264 92344 63255 84241 64326 95766 61790 52189 76333 5238 -103201 -232154 -248188
23253 -248188 -192573 -76948 -132565 -173320 -147949 -1546 104281 -3615 -91794 -6308 134733
23242 134733 185365 72954 98099 140364 104914 59453 60197 52046 -13836 -65476 -178509 -125591
23230 -125591 4275 2032 -33023 -23310 -13014 113882 136790 66991 11332 63812 109792
23219 109792 154017 251461 253971 129602 48274 71469 217655 128911 9596 -93967 -9605
23208 -9605 -4755 39285 85340 -66487 -118718 -63840 -48251 -132381 -215786 -234580 39264 71919
23196 71919 -101725 -111825 -75737 -17679 11185 58248 -36658 -110344 -166052 -130521 -119359
23185 -119359 -130862 -143678 -39571 -688 55487 94547 70652 199794 163025 83830 62788
23174 62788 -15012 -154421 -234418 -130853 55189 246635 232933 76959 -47731 19842
23164 19842 28991 -32496 -19438 -152967 -200356 -1694 184706 142288 -45281 -192023 -60048
23153 -60048 40760 56698 150179 -31318 -123788 -23105 31537 -74117 -154197 -75417 17742
23142 17742 31273 -80353 -238 69006 63352 34728 -63416 -73589 -100755 -174382 -133499 -243155
23130 -243155 -280383 -251001 -171071 -9439 -61627 52462 94246 1828 -94139 -135958 -110215
23119 -110215 39096 156070 214899 158420 21440 56440 34147 -11350 -114068 -75701 26905
23108 26905 -69362 -63325 2085 108956 143533 74676 23183 129201 69328 -23494 112452
23097 112452 98697 13397 -121325 -198333 -135256 -45059 -6090 -75771 -2420 12884 52389
23086 52389 53271 47509 60697 38272 65994 35960 110705 193668 212548 159449 77465 120249
23074 120249 69771 -57395 -136711 -29668 -22292 -30923 -9062 -30695 8350 130305 81228
23063 81228 -107298 -220632 -218005 -101028 -5158 58417 238210 266332 111425 113631 103009
23052 103009 95848 107325 61384 133896 159635 24097 -100840 69443 139510 -76696 -51242
23041 -51242 -81034 -136422 -110085 -118722 -156523 -118366 -33194 45047 96454 -39571 -22857 -2271
23029 -2271 -19787 -34190 15938 -8570 -78003 -65998 -89683 -55973 -7354 93826 70688 -94314
23017 -94314 -100925 -65840 -58318 36413 78513 -122364 -197795 -48516 86371 200945 169521
23006 169521 107431 2739 96747 140323 142118 90642 19205 -12215 -132945 -123004 -145801
22995 -145801 -18915 101472 24154 -92738 4715 61752 92470 172595 176624 55640 -113870
22984 -113870 -110386 4196 -3582 -58186 -2018 -90140 -106947 -50016 -51009 -103077 22811 70726
22972 70726 56232 -85021 -184551 -99281 -132429 -233619 -260082 -189538 10717 72238 97974
22961 97974 66553 76456 150158 160146 30788 -14292 70114 147370 144613 90262 78172 97152
22949 97152 22299 -90237 -88197 13251 152745 226013 127781 -64769 -56564 -9796 59036
22938 59036 6630 5203 71986 22474 -17809 23812 40356 185322 276546 280713 157494 18432
22926 18432 -45383 -89298 -92937 -65631 3467 58513 40199 -76014 -92991 -54293 54851
22915 54851 176577 262233 195923 169229 89055 -37816 -18912 -116001 -164108 -194173 -217187
22904 -217187 -142725 -82832 -105856 -102790 -122504 -75111 68102 196024 86155 23229 98176
22893 98176 60123 -24643 -121474 -85966 -104673 -200940 -224210 -336018 -288105 -209134 -257356
22882 -257356 -236830 -152687 34474 76005 205954 266802 283820 166962 159347 119770 13644
22871 13644 -3087 -106057 -197815 -185641 -159473 -192053 -162219 -168641 -210081 -120903 -68890 97230
22859 97230 265788 230588 19428 -57479 -38226 25304 93273 13498 32916 30395 20201
22848 20201 64852 45946 44994 27507 -115169 -128655 -30297 16438 -23409 51290 120549 25240
22836 25240 91780 91070 -108939 -214206 -87056 -50014 -38802 -40097 -21056 27215 -140241
22825 -140241 -511 119304 71334 20555 108966 173985 126535 91205 170354 104213 122393
22814 122393 205024 351420 286563 83836 -76647 -17854 -6565 92347 158476 169955 209127
22803 209127 163757 -44337 -57069 -2435 -43791 -21200 -69252 -89957 -178460 -138942 2127
22792 2127 -12746 -76421 -140969 -153854 -283284 -244843 -113942 -13016 15963 -171175 -203201
22781 -203201 -131063 -69612 -72752 -132823 -51509 -57123 -44249 -15211 -18660 -163024 -250521 -308560
22769 -308560 -289658 -248299 -182160 -150925 -87523 -165650 -237813 -210269 -64498 -6226 -18197
22758 -18197 -18467 -190586 -246915 -188551 -147027 -52142 46225 52796 75091 166410 83775 -30314
22746 -30314 -11536 22815 36790 -86868 -122875 -74187 -68424 23304 180364 150682 140167
22735 140167 49513 -197328 -269280 -278046 -215605 -205410 -36210 -114056 -197050 -216417 -181907
22724 -181907 -111283 29008 81664 -237 -22195 -142014 -202485 -158236 -161479 -107968 -171906
22713 -171906 -276356 -208746 -35901 -4396 -96990 -60329 -18164 -84547 -88737 -80310 -154041
22702 -154041 -139494 -91988 -47791 10754 71732 -66339 -254468 -238317 -195705 -209951 -207767
22691 -207767 -167320 -64664 65693 173023 102849 169944 131553 -38054 -35971 60894 109842
22680 109842 207355 81332 1169 -41279 -30367 45910 214874 276912 228370 115754 133972
22669 133972 11489 -127572 -92930 -163316 -140456 -92364 -232969 -56438 80445 95140
22659 95140 -8598 -118378 -119369 29737 -4607 2328 -64353 -218031 -231459 -210924 -193498
22648 -193498 -246320 -246038 -242637 -214329 -144986 -183084 -268414 -347214 -289234 -54539 3482 57621
22636 57621 168081 196825 138304 -91636 -263922 -313413 -236998 -46229 -121947 -181020 -205044
22625 -205044 24773 170252 80620 -10569 -133390 -185702 -141089 -128417 -96960 23269 144896
22614 144896 161280 18790 -19759 71270 93111 93494 36196 138266 140789 -112571 -107305 30936
22602 30936 93192 131174 -47081 -65115 -22816 52211 97707 96205 30886 22276 77298 -4829
22590 -4829 -45774 44342 141912 39472 -48373 -67176 -3843 -9641 -81102 -92022 125799 86527
22578 86527 74259 132053 187186 184884 136554 99662 94212 140634 129132 -36160 -63793 -94
22566 -94 24214 3812 58574 116800 127853 154300 230854 382893 397180 170082 -5442 54037
22554 54037 6347 57730 139081 177981 8087 37692 -19673 -287041 -268895 -105214 -45383
22543 -45383 -27484 -156304 -253668 -267541 -97578 -40646 -96042 -74635 -129469 -171327 -159276
22532 -159276 37076 43833 -29087 18649 162822 243757 140911 93585 -86044 -122080 -92970
22521 -92970 -2228 -44352 30409 132740 22317 122828 185108 199071 75990 -34302 10123
22510 10123 -60253 -100278 -59274 -2894 65846 177085 277186 192490 136995 177055 185225
22499 185225 110903 7886 24998 56407 68954 317 10048 -119277 -73930 42153 71572
22488 71572 103785 102643 84756 -34913 -26848 -46424 -73863 -36375 -48834 -38082 -78158 -118608
22476 -118608 -188876 -124473 59987 35600 -250818 -314339 -210571 -183127 -199994 -177003 -101617
22465 -101617 -90177 -14938 14563 24524 4739 -30666 -25520 -15002 71005 177754 93604 -66407
22453 -66407 54103 123454 70345 102706 178816 93355 122389 207736 187989 22913 -49
22442 -49 -34223 -101429 -27643 11017 99030 103133 100980 71478 114481 163478 101961 -5502
22430 -5502 34297 87097 130841 25305 107396 100222 -14529 -36129 -30062 -61085 -173307 -289817
22418 -289817 -275110 -174303 -31709 3598 76222 122064 100073 46713 38989 70757 55754
22407 55754 -44695 -137788 -165401 -192057 -83703 -74403 -102795 -102666 30101 82221 95421 67580
22395 67580 40886 108818 143912 32307 -7544 44011 96633 185564 114280 161295 250405
22384 250405 271044 252415 176082 206278 226504 127698 73438 148706 274306 294961 301257
22373 301257 332737 264156 202358 94457 159318 249761 167823 17661 -40217 96856 33978
22362 33978 -119834 -74667 -25556 -58525 -14840 71082 146235 123553 123279 44578 3827 -49992
22350 -49992 -32099 -43812 -33349 -5881 -41337 62199 80698 102919 115258 125028 83698 52976
22338 52976 1284 -23227 -13228 -51998 -57600 -25062 79161 189392 369034 454715 435187
22327 435187 324285 247635 276709 204399 248081 160381 96210 62943 -20333 -210172 -211090
22316 -211090 -154515 -85049 35215 108310 85184 30233 103606 106388 -20864 67257 31055
22305 31055 -90917 -200992 -183448 -149223 -86207 -120919 -194152 -171817 -122847 -62993 -55079
22294 -55079 -55769 179710 245184 128061 95728 25775 -184203 -246666 -182540 -22648 73725
22283 73725 57824 -6704 -17434 -78779 -125145 -117624 -42781 24159 -9865 -1152 -31460 -97196
22271 -97196 -91559 9628 59773 -38448 -123063 -90865 -59362 13650 -22183 -43402 -165676
22260 -165676 -181647 -195646 -117572 -27071 -29914 -121307 -276858 -414070 -356134 -130626 -82039
22249 -82039 79644 108417 41393 53599 55698 -14281 -113438 -50023 88351 -22367 801
22238 801 139617 100231 16677 -17804 66849 83223 -92614 -141474 -115014 -145897 -48176 -23426
22226 -23426 34036 -29103 55883 39380 -18890 38716 102321 52270 99021 85960 -85917
22215 -85917 -132314 -10375 60603 -138681 -178998 -79700 -62939 -23110 -51403 -99645 -162785
22204 -162785 -248474 -208535 -236783 -272692 -196911 -123900 -20663 13168 49362 45148 117869
22193 117869 97970 119633 17034 48482 71630 149797 53104 -3184 -31199 -113869 -176509
22182 -176509 -199339 -169510 -212745 -251730 -178796 -201417 -205841 -53694 -27008 -106038 -140217
22171 -140217 -31493 -20432 25697 24916 15417 -117712 -138117 -69185 -54319 -25482 -316 95485
22159 95485 26963 63388 41360 -46040 94867 138753 -7799 17147 70240 97974 106197
22148 106197 126603 -93001 -86100 -47249 -145005 -37450 -59423 -130254 -129996 -53333 15229 -2444
22136 -2444 -32344 -187074 -284848 -196431 8591 155819 77188 -22293 -141978 -210689 -250627
22125 -250627 -311307 -375364 -321194 -367112 -311314 -157781 -5709 12150 135290 4362 -88044
22114 -88044 -122322 3264 156632 105669 19412 44580 111676 -67809 -127136 -167773 -215427
22103 -215427 -170107 -45623 45060 87802 19148 -45087 -9105 143220 31748 -96257 -113978
22092 -113978 -64833 -50580 -111794 -168835 -120409 -90771 -145486 -107313 4614 -32261 -24146
22081 -24146 126319 156859 104511 28413 -80224 58232 63564 -64300 20205 102353 76124
22070 76124 35350 -57746 6255 78781 21520 9426 -36136 -185658 -111826 3563 61874
22059 61874 -65264 -9182 -3166 -123460 -216412 -201041 -126239 101335 123178 28865 -70523
22048 -70523 -23800 -64389 -215919 -195143 -121333 11190 74680 111940 -40781 -21185 87282
22037 87282 110148 63875 17251 48363 -7010 -134359 -56070 -103554 -242433 -214687 -139326
22026 -139326 -120189 9954 16236 16939 64005 15469 162872 211744 188685 184050 214593 207646
22014 207646 148290 87429 -40165 -50273 -126902 -199781 -89820 11697 3474 30407 143674
22003 143674 178418 58628 -34428 23976 13678 -93796 -136525 3409 -19491 21818 40263
21992 40263 24195 -75877 -52663 -64270 -66531 -47311 37665 55083 183179 281984 244237
21981 244237 129567 63937 -28740 -2841 79974 67344 -17032 -58264 -77109 27869 82530
21970 82530 168124 98841 39655 47483 -14369 -13342 143535 143936 -71725 -202463 -227488 -181277
21958 -181277 -122662 -59803 64420 186450 302823 244845 105246 -79216 -57094 -125006
21948 -125006 -162861 -188652 -9893 -5563 -103642 -75540 -43602 -5637 -50060 -107128 -87677
21937 -87677 -55296 -99512 -53451 -67478 -9464 19847 155 49326 186978 98768 -24987
21926 -24987 -141353 -222344 -158326 -72161 -46336 -61929 -58292 -92453 -100574 -35080 -63457 -36762
21914 -36762 -94099 -35371 -15943 -32860 -31682 -49754 -117864 -46545 112956 142639 246589
21903 246589 312658 338751 172778 75061 74038 142954 75088 3039 -33640 3507 -1247 -24459
21891 -24459 -104173 -15264 180305 187149 96325 142494 95892 87839 99737 71589 1799 114536
21879 114536 144422 76556 8037 -65222 12115 -18395 -78436 -114922 -47574 100235 48088
21868 48088 -127964 -250091 -179718 -118040 -273858 -342802 -329926 -285458 -182286 -98820 -136401
21857 -136401 -150779 -92658 -83315 -121714 -142841 -146376 -168501 -144535 -22989 71250 105461 65372
21845 65372 49811 35604 -53850 -110416 -169005 -206813 -203992 -153187 -133484 -85911 -166437 -133658
21833 -133658 -52448 -49798 -53886 -82407 -42021 -75068 -47699 40344 8253 -63596 -25043 41453
21821 41453 -43225 -92756 66667 88924 -20144 -43780 72727 127006 133832 -75939 -47690
21810 -47690 -67054 -43943 -92391 -224714 -159229 -58304 24698 -161081 -267086 -232321 -127725
21799 -127725 -110073 -97975 85321 269608 145022 -28213 -53868 -110317 -129252 -213612 -177510
21788 -177510 -160486 -225621 -99625 -16034 -54895 -145442 -45109 106281 58232 42696 23287
21777 23287 83202 -26678 -37950 -44171 -19709 -182855 -194811 -137927 7248 76271 37477
21766 37477 55738 317 71634 7947 -59217 -95007 41359 84715 53330 -32769 -78477
21755 -78477 -14600 40844 209157 138353 29915 -18747 -31447 87822 83395 68040 113945
21744 113945 6878 47335 -11228 -36348 48527 169818 44744 -117677 -80945 61955
21734 61955 167314 161611 124404 195801 113929 43375 -24529 -93473 -90328 12365 92635 79973
21722 79973 167243 212716 250514 190080 148835 38845 -5162 -107293 -50031 81405 158425
21711 158425 93687 -2201 86253 80512 -2951 -137195 -186920 -132859 -8895 6449 48426
21700 48426 89940 43392 -38063 -100567 -139021 3570 93470 167118 129106 7994 -95418
21689 -95418 -119904 -55336 -9786 -20907 -56159 -101568 -48860 38713 59679 98303 -1054 -182589
21677 -182589 -187930 -2763 103479 150113 164369 178737 199264 79052 -5393 -73798 -97625
21666 -97625 -66617 -77868 -173853 -104362 -69701 -86522 -60409 -96286 -160911 -225440 -166927 -57118
21654 -57118 -92649 66800 107814 -47268 -146624 -8694 58011 -12543 -209706 -148701 -169783
21643 -169783 -147562 -157611 -242392 -313081 -115896 -18643 -43528 20954 159234 199220 74609
21632 74609 -23095 -86576 -77884 -38567 20046 -31712 -7288 -58337 -47882 170646 120828 -159631
21620 -159631 -193120 -130147 -190545 -180610 -125024 -17947 62899 23427 -95339 7901 115146
21609 115146 159987 191544 106819 -122021 -176337 -125039 -89274 58813 61936 14849 93321
21598 93321 199514 161090 152049 222212 230473 123333 -20532 -26809 51631 167963 153595
21587 153595 137894 282551 199779 110851 -35651 -105992 -183229 -155029 -104949 -174838 -133582
21576 -133582 -146931 -230360 -116761 79329 70496 -109555 -619 27083 -41590 88600 -58952
21565 -58952 -204450 -109713 -48825 -113576 -194063 -171717 -145870 -166255 -258804 -274893 -279556 -412604
21553 -412604 -383373 -288886 -214736 -297032 -58738 7002 -11656 27944 -24728 -65821 -182810
21542 -182810 -147832 -178885 -9757 39529 122079 176419 89138 -55168 -19110 -83078 -127764
21531 -127764 -170044 52578 160909 384899 311635 173740 153397 8093 -27731 -60965
21521 -60965 61553 149607 63932 75836 139839 188021 159996 169394 233110 31018 22927 109212
21509 109212 114627 31374 -20989 -73791 -72352 3382 -89460 -129841 -166135 -125684 -133935 -168049
21497 -168049 -164165 -132867 -65806 33798 -9319 -40737 -64423 -60784 -6841 6879 56085 63940
21485 63940 -45169 -152662 -168508 -147202 -122618 -120152 -191949 -192214 -189633 -123122 -55554 18255
21473 18255 -87728 -174942 -119631 -78383 78550 148564 91111 22906 -80631 -34014 17188
21462 17188 -180561 -204882 -99480 -88696 -102353 -102274 -81275 91562 152223 113905 98135 60697
21450 60697 105480 199119 147334 -12129 100273 183323 60822 10469 120832 61801 -31334
21439 -31334 -103004 -153054 -131419 50955 50277 -55545 -164802 -54158 24794 13305 5915
21428 5915 70057 45319 106685 51342 -5102 43961 -14437 -80800 -93579 -53728 -93377 -321822
21416 -321822 -354673 -241144 -126555 -117071 -122207 -113965 -20483 97228 180864 21899 35571
21405 35571 104774 63274 47799 1433 -89985 -166821 -229557 -278123 -162341 -156700 -64750 -34918
21393 -34918 -103741 -80413 -21752 -25242 -33337 63866 213408 100050 39111 83109 44779 2047
21381 2047 112074 230685 161198 105419 63113 41105 38671 -65714 -76161 38243 -168675
21370 -168675 -256982 -188261 -1353 -23460 -62784 -74192 -33440 -17758 -94411 -87520 8112
21359 8112 47606 33056 87348 -9112 -174436 -156561 53467 115960 4450 -54405 58186
21348 58186 127787 53692 16760 50552 65300 27502 6877 51797 108619 56953 -66936
21337 -66936 -98671 62177 103991 100912 8589 -38847 120948 -27961 1217 15689 -58590
21326 -58590 66480 148698 162519 191035 -64589 -146552 -246538 -331351 -224628 -78420 35655
21315 35655 16328 -36136 8140 89783 -26167 -30820 -71753 -51872 -12682 -16883 40898 40290
21303 40290 26877 -53231 115249 243485 226817 24927 67985 233946 175759 207322 110602
21292 110602 67224 150793 57755 -138607 -126620 -22988 60764 190756 226183 149361 -47067
21281 -47067 -186741 -222218 -212480 -160909 -33750 -118786 -168565 -183897 -181653 -152448 -207580 -62185
21269 -62185 95600 88474 11772 8770 85648 48922 -36102 -105285 -211964 -186527 -191756 -90415
21257 -90415 33337 201743 246527 209762 128384 89058 -53098 -172181 -154238 -193189 -190943
21246 -190943 -152197 -98353 -207460 -253210 -229205 -90607 10327 12007 -91073 -276976 -326437
21235 -326437 -253550 -205249 -242983 -261064 -179933 -100219 -57489 7876 33058 -58320 33143
21224 33143 109711 69030 -22103 25389 15218 -45065 -4577 68268 11271 -95621 -700
21213 -700 48936 -43829 25494 229478 341329 347660 301747 249016 121100 16073 -41681
21202 -41681 -52623 62166 82465 21191 -25790 11721 73125 27144 -57856 -92223 -259597
21191 -259597 -297593 -329366 -272985 -150132 -124203 -180207 -268906 -112629 -19775 9708 35534
21180 35534 144913 259369 226736 245489 108933 -97594 -188779 -88259 35909 54898
21170 54898 182515 307622 281184 261103 334525 102715 -5234 116937 44187 -41285 -102997
21159 -102997 -46792 58460 42958 25765 24760 -13568 122027 125913 11509 -22051 -27189
21148 -27189 3492 26439 -68558 -82831 -25067 -12089 13522 -52966 -184338 -154232 -79244
21137 -79244 -50170 -21870 -49245 94514 238112 139950 135189 256097 118289 11520 21455
21126 21455 -36102 16009 -49674 -6 123874 168772 101431 34364 -57468 -53735 -5234 -22586
21114 -22586 67284 45732 1225 136586 288910 309638 194324 132606 22472 -4556 175897
21103 175897 189094 -3031 -126896 -157550 -86054 21415 91717 34857 86286 -7542 -183645
21092 -183645 -292451 -265186 -180947 -122032 -162263 -195903 -236463 -169078 -120933 -101018 44399
21081 44399 -49272 -159554 -217817 -198296 74639 268478 252379 125883 25302 4282 -10348
21070 -10348 -17564 77359 110388 114550 -46200 -101544 -113899 -47227 -69701 48988 123280 230560
21058 230560 271880 133128 97016 64368 79516 126166 177520 281284 176038 185308 289845
21047 289845 256652 187330 168559 20034 -57563 -152037 -145971 -171393 -175209 -191713 -85267
21036 -85267 -36715 -109296 -235468 -173116 -88353 -48019 -157797 -207575 -128520 -21850 -76387
21025 -76387 -89166 -32393 80768 114727 86854 91927 19427 21344 58331 -119126 21826
21014 21826 157579 135176 67135 79296 -64518 28640 179871 167579 73433 147950 205232
21003 205232 237029 214045 216844 110590 84737 109161 119782 92674 40969 68562 45869
20992 45869 -27550 81175 49117 -52643 -62360 7051 101734 69826 -9939 42707 -11742
20981 -11742 -10519 17074 134301 111198 54700 -404 -61329 -122143 -39685 20790 17584 -78724
20969 -78724 101965 203179 161352 101265 19294 -105243 -97642 -9602 134735 222921 113682
20958 113682 109634 137655 175609 114244 174824 142422 9362 -31599 27376 18774 33061 37353
20946 37353 -62154 -103026 43686 125933 104045 -49358 -52788 -146446 -213957 -58687 124860
20935 124860 144098 94609 -50230 -152568 -217910 -165448 -186006 -96389 -118188 -201096 -134822
20924 -134822 23257 122323 153364 121260 -49045 -32741 87138 43523 22904 -121820 -183863
20913 -183863 -67950 -29385 12737 -1016 -19511 91536 172632 131899 120917 182590 140664
20902 140664 120579 102498 181917 201148 196693 180467 96788 103889 158727 126603 34946 -62589
20890 -62589 -162719 -153433 32198 115986 196903 135247 -60640 -149823 -45280 38247 63512
20879 63512 25881 -38864 93721 127045 73361 108812 91429 146611 135197 196260 197310 260441
20867 260441 341920 222319 224243 296248 198535 164648 208697 251900 264197 184599 243951
20856 243951 328746 268052 341465 234756 165062 128206 25028 -14083 7727 98612 317753
20845 317753 271388 96838 15056 -72108 -59860 -92985 -36831 -4728 -139009 -114591 -5443
20834 -5443 56326 166018 313476 368927 224005 129963 425516 484154 476089 484383 517131
20823 517131 448088 529495 498380 412970 552247 639293 611766 634873 653396 741674 665467
20812 665467 721176 853198 828594 771656 978478 973512 806788 673539 644599 704186 716891
20801 716891 639261 567699 503441 405192 455333 479000 479847 450107 380813 453603 448168 438201
20789 438201 346316 286663 296898 305512 255312 281861 349462 356359 307469 360962 349369 500033
20777 500033 730860 868260 938294 1053930 1064051 1101011 1165487 1239192 1251427 1173610 1236605
20766 1236605 1256604 1012279 904238 795220 723770 616582 726664 764007 795896 839476
20756 839476 807625 693764 562993 507608 416473 476491 390051 460603 443893 177206 72976
20745 72976 181529 270965 309303 266310 192076 229161 267899 280292 300864 434769 503874
20734 503874 611705 704836 647785 703797 634634 541315 409948 330502 255054 226485 220120
20723 220120 274864 337058 462282 465385 413118 372278 320203 280872 361987 379221 254852
20712 254852 449874 490574 484305 797351 1133495 1303135 1432829 1694230 1825006 1981801
20702 1981801 2045183 2017555 1961886 1989322 1987122 1891073 1634708 1447548 1273655 1038971 840820
20691 840820 772276 752127 725534 681499 656597 476099 341161 340122 436246 395414 371746
20680 371746 325695 390819 458920 413093 449321 486436 387563 377004 384916 330882 336377 337546
20668 337546 279164 297013 201142 161882 146219 203314 163810 227740 301571 414551 344458
20657 344458 206800 85040 132893 209182 142402 71526 109004 108951 115286 142554 56142 -72224
20645 -72224 -47668 -12873 73677 177316 156877 24048 -12916 16253 97505 30888 8371
20634 8371 201907 330106 229095 117156 82531 146925 201267 165612 257184 240676 262458
20623 262458 251410 393925 432285 442739 308025 226943 233066 85217 57189 34118 34852
20612 34852 152354 277230 243803 263474 316831 410105 385377 294311 111360 131326 123564
20601 123564 96957 -24066 255 -9851 36064 78315 116092 143007 186606 212385 244507
20590 244507 302298 391670 385348 321136 195474 188563 149088 215694 256476 397653 507121
20579 507121 576201 450499 345791 262706 164850 343276 496073 471052 327776 429565
20569 429565 517165 614936 542180 314965 203184 144111 130361 239859 344341 193940
20559 193940 155897 140381 107962 46702 70171 142273 72759 18497 73786 97891 115350
20548 115350 109720 207925 193706 179263 100002 147757 182410 257088 260447 334710 357048 342860
20536 342860 349046 349681 288801 236593 139286 165774 233482 215995 250794 222488 185273 163447
20524 163447 199233 202955 262143 275868 237877 209569 322018 314197 334551 273896 83878
20513 83878 96376 184021 256947 306932 446308 430445 470690 539035 612969 543219 473017
20502 473017 443482 384384 373141 493721 502473 285310 71346 78102 188621 293241 361206
20491 361206 352889 459570 227747 18665 97092 103238 207444 289958 369495 457140 558386
20480 558386 529456 446926 529507 621130 563492 418983 460505 572042 776145 846840 885798
20469 885798 983523 892938 642936 436621 451643 437536 398181 273292 115698 98759 105657
20458 105657 110997 88848 230788 314260 262712 288582 242333 247353 222163 176741 231664 285853
20446 285853 363571 267266 257905 412846 425981 430460 426596 418502 404810 336851 364287 402500
20434 402500 432715 400325 411020 472997 413365 443167 442900 504672 546452 509681 623556 644908
20422 644908 586309 618632 510778 511720 555460 507225 578595 573477 547340 546414 699414 735589
20410 735589 705717 773814 903579 990816 953296 717459 585538 813856 822384 802333 702130
20399 702130 725101 716091 676286 641377 651512 621429 530500 530299 659649 568148 578810 438282
20387 438282 363586 386643 394566 414022 531186 418048 442174 572314 590452 486386 571870
20376 571870 548284 570469 615450 672334 712975 884793 973648 870878 770351 759225 683785
20365 683785 715770 773505 687635 625121 629207 618555 636184 672178 722939 718429 803180 867199
20353 867199 735336 712982 825110 1018322 1008373 1069941 1052054 1026377 897681 962732 989709
20342 989709 859006 871352 1051595 1194494 1319569 1395640 1322255 1272703 1370766 1462449 1510102
20331 1510102 1463917 1508875 1541847 1424098 1293873 1312050 1169245 1188382 1329358 1465762
20321 1465762 1552708 1511976 1484196 1341663 1334525 1438997 1439880 1399415 1403417 1624179 1700275
20310 1700275 1721385 1529814 1352653 1450702 1599842 1760020 1848597 1904673 1917490 1947975
20300 1947975 2133870 2269907 2347609 2222269 2139178 2043678 2094449 2123139 2163117 2195596 2226167
20289 2226167 2239647 2266475 2314575 2289076 2273646 2426610 2540024 2607849 2553643 2481282 2445171
20278 2445171 2404999 2341305 2515453 2643085 2668252 2664124 2776272 2798333 2887311 2899028 2988096
20267 2988096 3180497 3385142 3560919 3713856 3704280 3856785 3922505 3909011 4032616 4358118
20257 4358118 4554389 4797529 5023816 5233738 5494830 5879856 6375651 6879548 7262905
20248 7262905 7678716 8088890 8644313 9238682 9908190 10641165 11652762 12604153 13860780
20239 13860780 15527084 17211039 19223540 21942367 25297935 29547208 35089743 42131717
20231 42131717 50610508 59432630 67083833 74181369 82271138 92582594 105073515 118245876
20223 118245876 129439370 135068983 135664018 135487626 137753394 142816030 148876123 152373135
20215 152373135 148722532 136340266 120215384 106975573 98778611 94227048 90683241
20208 90683241 85673356 77142434 65711589 55340330 47966803 43195455 39976942 37579819
20200 37579819 35739691 34614813 33804964 33421506 33593118 33966806 34707824 36048235 38077773
20191 38077773 41087763 45360085 51110516 58468557 66957887 75256068 82554695 89949116
20183 89949116 99014662 110430764 123863834 136949783 145810200 148077869 147015272 147054778
20175 147054778 150349999 155990181 160904208 160538301 151227692 135235825 118989793 107237860
20167 107237860 100211781 95675718 91281299 84465693 73705219 61074194 50617763
20160 50617763 43264119 38195994 34498069 31759689 29394906 27347967 25558094 23917383
20152 23917383 22503179 21416325 20545905 19636401 18846206 18049177 17153568 16430987 15809846
20143 15809846 15349261 14921217 14423744 14052004 13685970 13346561 12958330 12402797 11985071
20134 11985071 11788029 11526450 11322789 11147874 11026618 10776726 10688127 10522588 10353166
20125 10353166 10243300 10087094 10054263 10137906 10117668 10214804 10234285 10290679 10343141 10409294 10675609
20114 10675609 10857141 11116394 11469157 11803207 12225454 12733874 13360301 14074786 14839577
20105 14839577 15659482 16563487 17633112 18830662 19797664 20743004 21730593 22753714 23871759
20096 23871759 25557464 27573655 29765254 32407258 35810317 40240578 46072326 53868553
20088 53868553 64247388 78440224 98212236 125166343 159957925 199182901 235374013
20081 235374013 265550735 297360802 336990562 379836340 411722774 420481665 401842166
20074 401842166 366711784 336970929 316174372 292105129 250004803 194453253 147133113
20067 147133113 115617622 95457551 81860900 72078601 64582067 58590195 53826217
20060 53826217 50007380 46676999 43697490 41180688 39112859 37202399 35557807 34079695
20052 34079695 32679769 31390656 30108843 28915191 27689485 26371122 24882047 23597776
20044 23597776 22524702 21460406 20505499 19477848 18377496 17699886 17006211 16292690 15614845
20035 15614845 14977746 14359253 13737181 13236597 12802807 12281660 11757624 11369173 11066111
20026 11066111 10718907 10261122 9809689 9532777 9301328 9043341 8721148 8361383 8160054
20017 8160054 8008546 7834381 7514023 7176409 6806759 6718754 6555938 6349610 6076582 5966223
20007 5966223 5700715 5509069 5502524 5406169 5293304 5139020 4947638 4764142 4576829 4498959
19997 4498959 4385281 4151315 3900771 3788165 3619405 3621698 3642411 3472253 3344275 3211664
19987 3211664 3098176 3138703 3254096 3265864 2978457 2855852 2783653 2714698 2602342 2569464
19977 2569464 2577342 2586836 2484432 2459022 2398156 2304554 2165180 2149608 2061143 1999969 2051008
19966 2051008 2067789 1869837 1693281 1730420 1546715 1382456 1279052 1332467 1298500 1218015
19956 1218015 1227657 1360127 1406850 1301981 1257762 1231150 1163360 1225322 1347184 1404227 1436103
19945 1436103 1307208 985271 810633 825163 830375 951590 902928 895617 903030 804686 673084
19934 673084 528911 526390 685105 789020 626252 497593 448600 408773 394974 407537 444433
19923 444433 498146 580358 557062 530318 385797 342239 353532 451000 471242 493713 437405
19912 437405 384922 429735 582124 624311 505377 523997 594897 497647 472165 345681 235860
19901 235860 198918 241874 114593 20302 95814 231381 280197 391774 305241 154855 88742
19890 88742 8082 47105 210726 168490 103953 50149 144735 304295 367047 189618 129333
19879 129333 197343 183040 204029 186450 144637 73527 1674 -15935 106031 115426 150852
19868 150852 159414 217490 246476 70725 7158 -59533 -28958 -80267 -23896 167889 59998
19857 59998 -74081 -37524 -33031 -46081 63230 130225 112173 87263 19137 121908 192055
19846 192055 84317 58854 79790 23313 103942 145713 -48193 -58347 -98240 -98775 33697
19835 33697 42660 138824 129965 226843 65655 81267 177799 34083 60457 65453 18661 67742
19823 67742 58498 176806 180832 294729 196565 106476 -28123 -20726 -63722 -153867 -158574 -194050
19811 -194050 -355762 -299559 -272947 -94266 145655 182297 59942 -433 83269 225712
19801 225712 15781 -81984 -108566 -64705 49358 -22262 -95820 -1244 -70282 -44383 -61450
19790 -61450 14460 -74671 -36208 -2381 -41633 -97898 -28177 -174476 -258229 -292334 -221187
19779 -221187 -279600 -189762 -74363 -107669 -173498 -132793 -295219 -292595 -233761 -204298 -281159
19768 -281159 -155043 -83017 -111226 -131756 -121503 -62529 -95076 -305209 -262112 -67607 -75711
19757 -75711 -192931 -231984 -215599 -197201 -172551 -157975 -27318 -161778 -160564 -163300 -179187
19746 -179187 -246656 -198174 -278191 -294163 -191081 -299846 -424043 -355641 -282824 -294229 -241352
19735 -241352 -267591 -152366 -1627 -89328 -332600 -381128 -412908 -387089 -385666 -362654 -350402
19724 -350402 -366924 -339489 -283385 -144991 56664 59599 54314 28432 -756 20056 3766
19713 3766 -132295 -217442 -168496 -252173 -348544 -340492 -285296 -168774 -171593 -52104 -74263 -99940
19701 -99940 -262187 -212639 -196058 -199035 -146057 -211789 -322520 -328017 -225836 -5052 178460
19690 178460 236221 155341 98858 81097 8798 -153371 -252632 -167312 -135088 -220550 -340991
19679 -340991 -268544 -68852 -25581 -185137 -284458 -354400 -342041 -288266 -274833 -221164 -155521
19668 -155521 -60948 -3456 60574 32738 5455 -109324 -252179 -244241 -216387 -165737 -201016
19657 -201016 -193889 -94573 -196173 -177660 -186157 -181660 -102386 -64368 -94261 -111068 10168 -114875
19645 -114875 -205668 -248682 -236491 -50785 123376 83495 26584 37256 6163 57865 12602
19634 12602 -53321 10308 117980 80771 124051 206312 252480 264481 448241 605451 654758
19623 654758 535958 470912 505813 543623 580012 646179 619984 503983 477766 411478 317776
19612 317776 364213 403649 545511 495040 434466 309895 153924 221096 280480 317171 319754
19601 319754 286889 344327 361217 287376 210096 195471 270087 179238 258583 309132 187511
19590 187511 155623 246505 231157 293596 321239 421324 537809 707829 785395 761577 668185
19579 668185 541453 600762 708050 665031 699049 828401 813152 723413 544298 538291 688886
19568 688886 829518 784886 547065 358364 381106 321058 158049 -360 95608 131576
19558 131576 154178 125456 192669 72124 -48594 -32287 8008 -5212 -28934 -72514 -100544
19547 -100544 -65548 7694 82703 46502 -111906 -102571 72009 72053 104528 -26165 -46910 19842
19535 19842 127565 124213 42822 -74406 -144337 -133938 -34889 38646 -53513 -274536 -302605
19524 -302605 -211402 -37921 -85929 -184124 -194331 -121622 -138277 -139070 -117218 35415 99196
19513 99196 49443 -34198 -212198 -247704 -229880 -38212 196676 176252 -97165 -165752 -135285
19502 -135285 -226248 -311209 -251868 -229092 8795 24454 -6359 25818 7866 -73918 -85975
19491 -85975 -1172 -18054 -28732 79107 258657 189569 167370 220389 311143 244719 217504
19480 217504 91393 65453 77178 121159 150485 115683 110411 -34697 22956 21719 -12529
19469 -12529 -170687 -289892 -283579 -149169 -94114 -59026 91307 53685 -8563 -107925 -46437
19458 -46437 1849 44454 242614 440201 531070 670621 950385 1207982 1368739 1460963
19448 1460963 1558744 1778987 1749424 1677086 1530596 1323514 1391618 1451980 1440591 1331365
19438 1331365 1129723 1012808 868376 681593 421842 290077 299549 360049 324898 237744
19428 237744 163855 153421 226036 293554 287657 209211 160569 118188 82373 107126 94924 60551
19416 60551 142377 57141 4627 -48021 -92324 93309 177216 65874 101255 200743 197188
19405 197188 215850 160116 42408 18077 140487 268503 223638 118856 -11608 -9665 57516
19394 57516 -30603 -1682 39011 41827 68185 52461 -53419 -113005 28289 95384 99405 -4576
19382 -4576 -81407 -124216 -119684 -93117 -81394 -145916 -220827 -105757 -43587 -23900 15748 138958
19370 138958 108693 75285 93123 -97147 -200838 -132726 -58623 26063 3188 -47122 32473
19359 32473 -43748 -45479 57563 141731 193108 127698 65474 29167 -43877 -114341 -221222
19348 -221222 -187938 -226877 -108546 -3391 -55547 -191333 -303721 -207780 -178232 -178860 -153252
19337 -153252 -19694 36794 61927 62286 628 -7832 -59658 -212404 -78423 152094 239021
19326 239021 30630 -86087 -75202 36148 116505 63378 -124533 -171511 -211932 -160822 -241942
19315 -241942 -276642 -367567 -322859 -149003 -92235 -78383 -66511 -31332 -84419 -129124 -150701
19304 -150701 -1908 -5355 116551 115646 56097 29753 -8512 -101336 -100937 35090 -94348 -116373
19292 -116373 -140547 -187256 -304074 -349879 -197567 -31733 86010 51602 -16410 60217 -35594
19281 -35594 -24389 34044 20217 21382 57266 79916 16260 -33369 55010 13127 -104280 -2571
19269 -2571 14954 -29039 -99394 -50297 -75996 -121705 -194237 -139619 -77088 -66993 -42342 57313
19257 57313 93865 51240 135095 50847 18471 63500 2421 121731 345903 411745 294692
19246 294692 241560 353747 468547 414997 325234 411744 385419 376931 423844 548487 654549
19235 654549 592677 553934 559555 637371 757735 804099 732277 625697 663279 649571 659723
19224 659723 728700 574156 439544 441217 322622 315165 326635 344528 315945 292203 293074 279621
19212 279621 235860 90027 120387 -16277 -119191 -22960 173646 224678 159875 70986 23204
19201 23204 57982 167156 103314 63383 109461 7926 -42622 -65108 -135111 -58013 -24441
19190 -24441 23763 40380 -1033 27409 -61596 27188 233757 430508 490941 581240 688117
19179 688117 708392 692652 725737 793974 753205 790598 792822 824719 795946 716059 627549 577751
19167 577751 693720 636876 538404 512919 466221 431071 343014 205764 117698 167314 192697
19156 192697 119257 90169 66787 134381 119567 109501 134705 111344 139730 122556 73387
19145 73387 40027 -13846 -92371 -60430 -36613 -16595 -24436 -15779 -7167 8347 79420 91816
19133 91816 146017 152632 145580 146206 208306 291537 275604 136619 71990 48898 15583 1088
19121 1088 -21936 27923 165110 116958 115607 105124 61798 -41636 -111914 -125578 -187634 -233950
19109 -233950 -377020 -277598 -158275 37438 201228 301218 245643 61027 15285 -77591
19099 -77591 -98710 -130925 -102351 -18777 25674 61522 65750 40587 157284 159391 57204 99802
19087 99802 106562 63686 94031 196098 126027 297001 329566 65398 27792 60855 -61883
19076 -61883 13319 120692 121263 116302 248372 165955 107702 192688 266659 230414 190683 107172
19064 107172 -715 -58516 4213 15944 16712 26630 18855 110772 96500 88835 127346 65142
19052 65142 117463 142299 61726 61078 -23271 -11704 78378 15801 -93165 -148484 -126319 -91801
19040 -91801 -43271 -35988 -15254 75335 344656 274187 35989 76784 107863 128477 -31379
19029 -31379 -127517 -44443 -68013 127692 218433 287802 197550 68277 7494 68649 121172
19018 121172 142036 237171 337576 340346 177582 103112 24941 100533 173617 179016 167312
19007 167312 156009 184467 120314 -213571 -301952 -188357 -74235 8794 53291 129433 167530
18996 167530 97146 5914 37326 -1071 31690 141220 133940 105979 43709 -9916 -48447
18985 -48447 50467 89834 63386 28393 -34872 92918 66385 -31273 132261 102447 73343
18974 73343 113461 169553 284564 274519 246307 182452 56839 154095 89958 20523 161776
18963 161776 198837 164618 222335 208687 63035 145838 186446 239559 152660 141247 243775
18952 243775 297388 288881 148894 125838 102999 161303 297244 288574 281635 234035 88686
18941 88686 84889 173064 153476 183705 211505 368963 269784 268265 99545 -95906 57867
18930 57867 93458 201657 191873 81729 74633 291240 392651 390402 299460 134652 89039
18919 89039 138028 241430 304319 216870 65457 101174 226348 315162 397194 424415 368290
18908 368290 114507 -31466 -43305 99742 197506 139489 172076 243932 185158 -34846 -60691
18897 -60691 132616 282805 361108 418836 344108 323284 363715 302495 225461 373419 451421
18886 451421 415779 351158 209053 151026 194693 202778 226331 184732 226168 330871 378930
18875 378930 298814 269277 328031 221935 238892 316642 294338 289704 241712 336896 437952
18864 437952 314268 151374 140566 121039 165544 207314 300302 409533 405867 346980 301522
18853 301522 233853 188325 206896 241783 189168 151435 320892 399601 369378 358041 349220
18842 349220 272368 348712 505537 712527 604176 627778 805980 790203 762502 719031 737139
18831 737139 688436 779429 729079 863217 1095818 1103789 1017782 824080 706041 848458 1019630
18820 1019630 1132232 1045518 831484 933048 936783 944352 960666 784967 740010 749950 651394
18809 651394 403862 468904 643009 633268 607802 605323 593487 699240 784917 858439 840822
18798 840822 757652 707125 680371 811785 996440 1121804 1117466 1119112 1225255 1239603 1309818
18787 1309818 1214097 1143802 1201762 1135927 1125543 1178370 1153396 1207687 1325750 1403100 1448056
18776 1448056 1579376 1529050 1499931 1603735 1725652 1667806 1578981 1698717 1891561 1952681
18766 1952681 2029123 2105121 2192840 2209952 2179012 2284952 2326117 2390269 2264159 2115865 1972717
18755 1972717 1858730 1949471 2042573 2120458 2185897 2308133 2293944 2348071 2435682 2589157 2811402
18744 2811402 2850474 2813586 2871724 2969635 3016642 3121228 3404223 3665345 3957958 4262472
18734 4262472 4604424 4794157 4889396 5129096 5495352 5901071 6342509 6856867 7281660 7677041
18724 7677041 8250242 8960882 9866947 10849581 12217065 13789674 15854723 18569784 22192675
18715 22192675 27054157 32604628 37942075 43582236 50440962 59195390 69702842 80854925
18707 80854925 90640359 97352865 102017812 107809992 116291853 125674875 131892777 133104170
18699 133104170 129040178 122290019 117558009 115684488 114165067 108859027 98978457 87445517
18691 87445517 76559573 67945201 61743253 56483421 50561450 43909797 37690378 33049354
18683 33049354 29748510 27406256 25572543 23943138 22597068 21491053 20631151 19985081
18675 19985081 19524611 18937510 18613743 18373832 18256886 18097948 18068410 18184325 18329090
18666 18329090 18396042 18831874 19468426 20497332 21794846 23459131 25732004 28733084 32835609
18657 32835609 38433359 45336204 52313943 59208055 67198701 77900879 91216240 105614990
18649 105614990 119117868 128981451 135239052 141855831 151646696 163920649 173557927 176599549
18641 176599549 172795147 164229297 156535075 152617445 150780277 145547787 133819377 118917395
18633 118917395 104073319 91470357 82185574 74917102 67500686 58990621 50330663 43048757
18625 43048757 37523959 33673931 30765713 28458462 26350675 24615357 23145283 21776010
18617 21776010 20535253 19582444 18478170 17550563 16884517 16101843 15343214 14769504 14331291
18608 14331291 13680478 12987327 12430279 12017428 11490683 11048499 10680509 10221687 9543977
18599 9543977 9119900 8904320 8654884 8294645 8116338 8018862 7732958 7239045 6949321 6710163
18589 6710163 6524390 6455379 6250369 5887589 5696613 5442464 5109357 5084766 4952336 4837137
18579 4837137 4667687 4531105 4431773 4229272 4074736 3937900 3881593 3729610 3578665 3346522
18569 3346522 3235868 3147021 3140375 3167530 3054564 3027183 3016144 2970136 2913242 2807058 2754011
18558 2754011 2573334 2512438 2446023 2281910 2031939 1882791 2046318 2062029 1988599 1915995
18548 1915995 1857110 1861880 1945165 1884521 1778629 1632330 1517840 1518158 1555932 1574983 1522775
18537 1522775 1554993 1410219 1305352 1154010 1154990 1137115 1128731 1102199 1141343 1272952 1271814
18526 1271814 1245787 1219010 1175876 1158240 1184511 1061917 772147 704422 771580 869534 809603
18515 809603 764296 859638 802718 788425 831379 871580 997978 999586 1046925 923280 696208
18504 696208 588292 563625 607973 623750 552842 640410 855779 870333 932791 753995 599075
18493 599075 678866 679545 691329 576139 627505 761627 612449 494912 419914 477845 586366
18482 586366 653610 650374 628058 467861 401430 569096 619288 563803 688945 698732 704089
18471 704089 620145 611239 609700 656483 614293 458447 388293 441984 481025 601405 666582
18460 666582 700043 734265 599016 515871 552089 512143 297103 193909 323938 480244
18450 480244 555578 650155 787043 774051 789915 859873 836689 838758 752749 826915 771575
18439 771575 663927 577705 668491 638990 626586 698355 754524 558535 495938 530803 536258
18428 536258 626322 805388 890194 846387 735618 606141 632318 643805 716249 831887 767958
18417 767958 605436 555287 608577 652620 627130 720758 716776 625738 672697 708131 763152
18406 763152 917495 871339 877570 880892 792108 653211 784872 851674 874574 872136 736194
18395 736194 649942 629191 517774 646851 979563 939513 878509 879717 950524 1133943 1156079
18384 1156079 1133766 1049428 943949 957667 995738 923219 883837 961659 921022 955843 938789
18373 938789 967830 1099195 1137660 1127614 1100182 1257873 1349345 1347158 1350445 1383535 1380505 1302106
18361 1302106 1332765 1424297 1348999 1321360 1417720 1452496 1328672 1311706 1424340 1546356 1544175
18350 1544175 1384451 1420689 1731736 1742050 1737528 1777253 1811042 1823903 1957939 2005809 2037825
18339 2037825 2021698 2240955 2303498 2373090 2392179 2636626 2880161 3024270 3067335 3289300
18329 3289300 3423938 3491510 3679263 3835352 3985953 4105993 4255383 4561310 4895256 5194013
18319 5194013 5402737 5724764 6181947 6628636 7183916 7821439 8503674 9358643 10526808
18310 10526808 12048775 14029601 16837946 20847605 26330197 33907350 43158951 51565525
18302 51565525 57512250 62106728 67208941 73816343 81876634 89672770 93814006 91997284
18294 91997284 86277117 80612452 77259416 76417194 76981473 76792684 72472316 62146596
18286 62146596 49441468 39464995 32729172 28278797 25385838 23375738 21977869 20921601
18278 20921601 20158015 19464286 19007098 18965536 19110658 19327008 19733283 20255735 20975051
18269 20975051 21955666 23473099 25203041 27880974 31736813 37292239 44996051 54596419
18261 54596419 64684406 72620454 78127319 83382392 90281307 98930447 107993622 114062152
18253 114062152 113849996 108659324 102809655 99432311 99483396 102580796 107162118 110047575
18245 110047575 107555142 99662501 91090198 85707909 84052419 85105603 87880255 89934677
18237 89934677 88613872 83928580 78652432 74607239 72373212 71631305 71049760 68547115
18229 68547115 61751209 51891791 42854473 36468511 32173832 29276509 27304762 25627975
18221 25627975 24235218 23217101 22265049 21469974 20946865 20519262 20240142 20104962 19966106
18212 19966106 20001891 20399594 21091929 22140717 23643215 26001699 29534828 34679159 41635936
18203 41635936 49654951 56428527 60696852 63969250 68255989 74156472 81163837 87306832
18195 87306832 88861246 84755065 78445393 73246185 70426822 69765336 69996175 69135401
18187 69135401 64034004 53637746 42325773 33726777 27942388 24118644 21412297 19381345
18179 19381345 17754394 16461893 15360928 14483598 13718583 12960579 12249389 11713934 11334681
18170 11334681 10917874 10418897 9980213 9619751 9346166 9115062 8926464 8655575 8401533
18161 8401533 8220842 7862427 7627785 7575704 7455768 7234564 6953171 6620805 6425988 6296152
18151 6296152 6044521 5758250 5677070 5512027 5389239 5255020 5041529 4791265 4647279 4536065
18141 4536065 4475401 4184915 3931015 3627237 3387067 3300976 3215196 3062382 3017528 2968053
18131 2968053 2962986 2900720 2826987 2762341 2780113 2629848 2531671 2336613 2318867 2222957 2121987
18120 2121987 2013014 1806513 1860236 1799543 1761151 1797534 1676143 1576653 1565725 1607667 1694668
18109 1694668 1650458 1589764 1632240 1756527 1698117 1540644 1546619 1566354 1475895 1443711 1534818
18098 1534818 1637121 1690800 1625306 1475804 1354463 1328473 1256289 1264263 1184266 1139188 1222517
18087 1222517 1268817 1218963 1167148 1137464 1054964 966446 859786 747669 780625 929693 1021015
18076 1021015 1100547 795395 530831 519882 552198 609112 537639 458758 360255 366094 544858
18065 544858 720598 746883 722428 585563 507497 549209 478622 354605 235575 190677 296198
18054 296198 447814 454452 407292 328994 323503 339331 271396 102350 60912 311965 491952
18043 491952 529782 480948 460505 251342 96240 -38285 -41015 110494 250527 212010 182810
18032 182810 327294 411186 488207 447684 344433 212274 109053 158792 152884 199335 248514
18021 248514 322113 327368 195370 214117 184205 42504 48652 49261 14982 54222 100506 24882
18009 24882 110784 219005 262499 302427 349800 309875 318055 245351 251681 75153 110112 114990
17997 114990 197091 213291 112072 25745 -86131 -8106 223004 252112 239756 224169 147080
17986 147080 178139 243484 263100 296296 218780 90226 85478 237484 305388 260497 230499
17975 230499 168724 153637 260713 345867 353858 342568 321179 314226 179241 185203 194795 186068
17963 186068 306890 295828 282085 131137 112527 324895 280730 158256 194248 363635
17953 363635 401447 472359 569697 429380 368464 436646 375426 353838 322650 310651 280092
17942 280092 280953 194308 83016 138290 61036 -24809 -33611 101783 170293 200809 113902 74596
17930 74596 242818 303786 243659 218987 59977 -9049 131025 219536 262030 130932 35534
17919 35534 -52573 -115330 -88691 -22470 -28283 -52431 -72528 -43744 -8497 -6630 -24121 154739
17907 154739 208944 180274 103642 88229 34777 69640 116684 219107 174736 133241 64318
17896 64318 194510 329322 472928 477724 410434 389267 265440 232320 209697 224475 230353
17885 230353 160154 56340 177473 195269 216660 261554 249016 332117 348723 271393 436710
17874 436710 497650 542651 465475 439744 452383 593536 683422 715470 544533 375415 375565
17863 375565 371783 419125 422758 277631 237115 408385 521739 507755 379037 394763 415305
17852 415305 471600 563746 546291 423075 477778 670137 622065 494786 429712 427602 450789
17841 450789 517377 496323 471584 533856 481880 560940 617336 653818 737960 663820 591895
17830 591895 689724 746063 739474 730998 879642 953362 885649 1043888 1077694 1068957 1109987 1157461
17818 1157461 1158269 1046279 866498 902156 1024042 985786 1005995 959345 976527 988393 997581
17807 997581 1096746 1002239 1047943 1153971 1166250 1127888 1227245 1368105 1474241 1436802 1584545
17796 1584545 1560202 1550993 1587530 1703853 1666228 1539559 1458844 1553308 1660616 1712350 1818138
17785 1818138 1910221 1884668 1981254 2040845 2024530 2096129 2126790 2236950 2444991 2555748 2863925
17774 2863925 3029885 2952890 3028100 3198056 3427714 3692868 3907015 4092184 4412902 4608639
17764 4608639 4833909 5263380 5745472 6115658 6532035 7129366 7761537 8522080 9351972
17755 9351972 10297905 11469386 12922185 14802258 17132060 20391276 25000899 31293330
17747 31293330 39691203 48810206 56636716 62224562 67407830 73712399 81749382 90701872
17739 90701872 98001464 99219073 93993767 87232994 82573112 80762202 80551597 79421979
17731 79421979 74268864 63839151 51992585 42611365 36176245 31867407 29007293 27058418
17723 27058418 25732946 24618740 23800205 23135133 22797144 22789869 22918167 23338188 23760416
17714 23760416 24326049 25410042 26687596 28283735 30506903 33634402 37876606 43771826
17706 43771826 52148323 63458727 77554575 92528035 105472121 115838929 125347700
17699 125347700 136495613 149952741 164119237 174371934 175427448 167492811 156562178
17692 156562178 148195989 143578692 141045739 137119138 127219763 110209003 90466964 73475318
17684 73475318 61288842 52812563 46864255 42561328 39100898 36366562 34134035 32449455
17676 32449455 31066769 30006009 28998803 28109532 27414474 26889283 26474105 26086923 25924530
17667 25924530 26219607 27054745 28417638 30581722 33873958 38713327 45315869 52376977
17659 52376977 58195466 62337532 65968904 70485063 76499364 83347637 88688942 88560437
17651 88560437 83105400 76634660 72191567 70191654 69373362 67693106 62881677 53925757
17643 53925757 43650991 35615146 30046916 26164915 23377217 21242004 19620788 18218268
17635 18218268 17006273 15976305 15018844 14230944 13527413 12851827 12163022 11615407 11135112
17626 11135112 10478893 9902293 9459767 9024516 8677223 8438301 8284844 8001791 7591967
17617 7591967 7205520 6838760 6545588 6270533 6022841 5864029 5621411 5580379 5623921 5397891
17607 5397891 5162959 5008092 4787321 4600214 4390920 4355615 4307292 4195864 4080070 3855114
17597 3855114 3702727 3749938 3620770 3528705 3420641 3221189 3188423 3104520 2948935 2805467
17587 2805467 2753700 2757481 2627899 2532396 2538443 2466041 2367432 2321132 2341208 2316285 2225825
17576 2225825 2037886 1883086 1846050 1784200 1716335 1610662 1559227 1646313 1582751 1500140 1580794
17565 1580794 1592463 1622581 1622797 1569540 1497381 1390665 1273296 1177692 1183858 988944 950897
17554 950897 942396 947623 1000069 876448 761361 805896 825163 848353 743285 796461 937166
17543 937166 951918 844915 668582 623468 581162 670309 803627 833451 843311 727051 618431
17532 618431 677019 707380 680610 604375 600849 634498 666086 598861 596979 540554 452295 454105
17520 454105 497894 530500 532774 423646 345427 323002 271640 262397 331717 283157 170845
17509 170845 158209 115110 39218 51867 156051 311196 232877 123918 54191 16976 44922
17498 44922 163672 260992 243891 184971 127714 157926 113027 235410 468224 524544 367536
17487 367536 213732 204339 294974 376999 282044 211089 319515 403393 295368 368613 290744
17476 290744 151194 125521 188028 147744 157931 101418 65670 69439 135311 144131 40997
17465 40997 77593 128518 101968 -11398 7762 -40949 59030 180648 207265 142870 77613
17454 77613 77131 225898 311804 273946 288759 218627 130433 164925 131999 149078 101815 135717
17442 135717 158535 175942 119598 108486 77297 38040 21763 -35501 -3396 28648 115769
17431 115769 188864 264970 247911 76644 46710 -24157 -75108 -8625 276 14015 -32462
17420 -32462 22493 167695 229045 157069 73426 53765 76247 -47444 -96093 -77388 42167
17409 42167 101896 17100 -105733 -115996 55298 147099 116883 139472 162745 -121730 -241128
17398 -241128 -298975 -268002 -241577 -31227 132979 181786 80494 134054 116670 133236 168465
17387 168465 92163 15808 21611 38152 -7699 -102860 -86083 -127150 -121172 11014 151362
17376 151362 94720 105894 72075 12946 16294 34197 76618 18400 -47529 -58621 -250802
17365 -250802 -232430 -275160 -380992 -472349 -285268 -153700 -148163 -143064 -146941 -158141 -216972
17354 -216972 -148749 -168531 -394322 -445325 -464489 -429617 -422998 -200087 -20924 -51499 29930
17343 29930 54319 101275 2154 -244521 -415411 -366538 -221316 -227421 -255631 -177907 -150459
17332 -150459 -211151 -265412 -154353 -84019 -1125 35972 42409 -330 -88489 -88451 -10305 140769
17320 140769 146143 -10191 -41743 -31339 -30028 39356 -27477 -54137 47758 22321 -72165
17309 -72165 -118579 -157028 -98655 -45484 -200561 -322521 -160816 821 36334 61019 -56374
17298 -56374 -160382 -170633 -169816 -229758 -255029 -160944 -143733 -156227 -148694 -157399 -203659 -177189
17286 -177189 -81760 69875 67090 -83031 -32236 75492 25127 -78441 -137910 -161634 -27914
17275 -27914 -29672 -93081 -142784 -165936 -115910 -174906 -295041 -353066 -323309 -285660 -274394 -316691
17263 -316691 -330117 -265424 -225490 -197028 -98735 -75969 -124700 -66822 -126125 -110240 11874
17252 11874 41128 7136 -68008 -127515 -218811 -153704 -130790 -153716 -154841 -238048 -190115 -115258
17240 -115258 -34324 -99740 -85152 -86330 -117171 -146382 -164691 -82253 -44449 -36871 66928 22589
17228 22589 16876 25439 -38121 -21345 77070 38701 78104 134266 138542 142491 153192 200480
17216 200480 195049 95872 -42052 -67602 43370 199148 135413 199100 213538 259212 422054
17205 422054 542159 589858 616415 501682 284255 232230 313899 466146 434927 233752
17195 233752 145301 105553 151684 83465 -42949 18391 115227 90132 51434 73691 54511
17184 54511 54089 157704 197517 193925 97961 24657 1807 75851 218755 307289 299619 379758
17172 379758 403420 330653 317618 276141 152735 132251 253518 375602 507326 666494
17162 666494 776698 535430 428646 480312 558525 615577 593162 632435 539223 414363 216765
17151 216765 130250 106 65853 106603 226653 172382 93348 159445 230913 208135 215450
17140 215450 133786 42565 96922 233303 185520 107745 105690 130346 78620 89656 -4901
17129 -4901 9853 110958 242205 234980 213326 254895 286110 180229 142851 205152 312664
17118 312664 322166 293749 241828 177011 146246 81848 122861 241428 366673 305131 282078
17107 282078 242092 225694 214187 93772 -7668 -58245 -112725 -242984 -346499 -343570 -159678
17096 -159678 -86106 -20957 -70544 -46451 -40400 -51501 -122556 -68203 -44751 -151328 -217628
17085 -217628 -165776 -13294 -24371 -3933 -33263 -80670 -13796 33470 8013 -29441 -60984
17074 -60984 -36691 10443 -110308 -170389 -176102 -150180 -95208 -134751 -72689 -112388 -104712 -144001
17062 -144001 -22901 20495 -171593 -273970 -258276 -207148 -88850 142716 94831 -69580
17052 -69580 -105157 -117783 -129040 -160354 -169303 -122823 -13211 3066 -81319 -29069 57768 -25856
17040 -25856 -52456 -196585 -280025 -155709 -144244 -177216 -212402 -83387 -38569 -88026 -68837
17029 -68837 -42940 15670 -151255 -267651 -154907 2119 -77374 -144523 -147581 -113292 -125520
17018 -125520 -70288 8812 -36584 -50566 -89078 -20274 81368 67070 -71603 -158667 -191499
17007 -191499 8047 79989 117249 86705 22417 -128683 -250252 -178434 -71439 84946
16997 84946 179597 -42427 -188466 -218716 -262599 -252239 -256739 -249451 -207421 -146189 -176984 -153399
16985 -153399 -137105 -79442 -76105 30360 40284 3161 -124492 -85612 -118534 -108228 -44517
16974 -44517 -123654 -240665 -254425 -343888 -395363 -331582 -219236 -203058 -326458 -258367 -82163
16963 -82163 -215095 -293893 -183929 -122044 -144065 -97933 -42254 -61087 -65949 -71969 -75433 -60391
16951 -60391 -191899 -209406 -254060 -323043 -175764 -199163 -257185 -136123 31261 48913 121771
16940 121771 233285 7871 -209288 -151042 -116531 -106405 -218589 -196086 -214020 -149388 -200098
16929 -200098 -206939 -249024 -294136 -411564 -297274 -97955 -58576 -117704 -152531 -130416 -138963
16918 -138963 -214192 -194225 -76006 -27933 -92780 -208083 -300117 -349437 -306073 -331179 -249788
16907 -249788 -279712 -126211 43165 -5853 -127142 -173749 -210696 -262552 -298946 -339953 -334784
16896 -334784 -189724 -221413 -253699 -366190 -364072 -224771 -92762 -51111 -90660 -153907 -140727
16885 -140727 -77537 -60701 -46168 19995 74498 47401 128595 172363 60721 114724 213942
16874 213942 271384 195020 106304 -34082 -133616 -165563 -119211 -155446 -196904 -121311 18946
16863 18946 -17877 -21099 -81606 -129966 -28540 -108665 -123422 -157202 -138582 -91160 -279905
16852 -279905 -295967 -242985 -222565 -225694 -161265 -136752 -110373 -61301 -42225 -21277 -166634
16841 -166634 -79858 -3654 -53625 4116 -119355 -155702 -241166 -382378 -403432 -349715 -171169
16830 -171169 -60169 6364 -116243 -321658 -196228 -14809 -44951 -81634 -121963 -120961 -73751
16819 -73751 -167647 -195570 -148903 -113928 -55896 -74705 -81983 -204778 -263250 -115278 -791
16808 -791 -56480 -105846 -75300 -151697 -213515 -202291 -91961 -13637 46735 48903 124772 188610
16796 188610 129830 65924 -71503 -111133 -105603 -122905 -96717 -155605 -153250 -53171 45600
16785 45600 33504 103123 41705 -72112 8813 42142 -124747 -129621 -65016 -29673 -16524
16774 -16524 50251 186951 234086 196234 -60016 -59984 65257 128097 78059 -115509 -199557
16763 -199557 -164341 -149356 -183649 -215790 -160385 -196717 -208134 -58272 -31815 56307 101495
16752 101495 -59926 -150868 -157767 -301512 -340440 -344644 -271934 -223359 -154827 -66823 -12367
16741 -12367 -7972 -23364 -71121 -29905 -48034 -90787 -66989 6329 39609 112756 163504 24373
16729 24373 -13290 -51958 -121361 -228238 -258219 -231966 -290124 -251269 -152677 -151845 -177510 -214887
16717 -214887 -191826 -203518 -219115 -181529 -229950 -256360 -111096 -137859 -9729 85612 -28650
16706 -28650 -52438 24686 84926 8261 -69361 -27610 -60510 -42859 -28624 -16791 -24410 -5295
16694 -5295 -59741 -107220 -23327 -98877 -220578 -86934 -113007 -316846 -391122 -390719 -236729
16683 -236729 -177902 -134843 -137285 -130520 27168 28102 -101797 -104795 27288 -120990 -131673 -81827
16671 -81827 -63510 -47450 29824 63864 209869 163470 -4922 -100767 -55146 -36220 -54822
16660 -54822 -32010 -163011 -291320 -157124 -26580 28816 35107 -63999 -17390 -22422 -20102
16649 -20102 31850 33294 -118201 -84692 -58801 -145142 -130262 -76570 -47787 -22190 -63360 -23704
16637 -23704 -171470 -241969 -215051 -205235 -180713 -230084 -231844 -202532 -266491 -305344 -310691 -215532
16625 -215532 -36129 107611 116962 14734 -73647 -33517 -8363 17158 -17790 -26136 -147834
16614 -147834 -215918 -131553 -156061 -102443 -70969 -143950 -218578 -212317 -167208 26651 99195
16603 99195 -56219 -104159 -78547 -99467 -116034 -75959 -20034 44800 162640 177711 192888
16592 192888 152254 -34785 -109642 -54636 -10258 -62865 -75329 -100741 -257884 -223419 -121484
16581 -121484 -26881 -97146 -69663 -131228 -149091 -4458 -19348 -116984 -128894 -116490 48799
16570 48799 34716 -92093 -143473 -222452 -300919 -329039 -272391 -71905 -18957 -174230 -252585
16559 -252585 -170816 -233487 -167153 -1829 24858 79854 83191 -5496 2463 -67854 -159238 -169407
16547 -169407 -144350 -94572 -93339 -41897 -75655 -80435 -164512 -133192 -9333 44778 126113 186054
16535 186054 143891 -26597 -144813 -121462 -150420 -203844 -245007 -346225 -496707 -350530
16525 -350530 -158382 -13435 61843 128605 128826 58137 72575 50101 -12151 -157824 -55083
16514 -55083 61560 17626 -8582 2844 -115349 -157257 -56835 -45184 -124139 -141538 -162304
16503 -162304 -65689 -74 -21442 55075 200700 189046 218810 100589 -43619 -92805 -69580
16492 -69580 -87799 -153268 -110438 -14582 -75247 -180586 -189850 -51982 -82711 -86049 -85219 -208706
16480 -208706 -225829 -124186 28065 -14634 -29889 17111 -69921 -112111 -80945 14190 55918
16469 55918 96069 -45583 -198264 -173299 -151616 -46259 -133181 -3040 44613 -74058 -77078
16458 -77078 -30577 48509 128734 114143 -74183 -227784 -240523 -191909 -187656 -174573 -245505
16447 -245505 -242929 -128546 -83293 -42361 -22645 -55711 -32447 61671 -66661 -167509 -181951
16436 -181951 -42202 70570 160244 69032 45521 56660 106761 80432 76613 92499 -54079
16425 -54079 -170273 -162494 -53172 -87508 -11478 87629 159193 176710 82443 41346 -61260
16414 -61260 -103257 -36385 -115050 -72096 -91129 -200513 -254774 -226226 -144276 -47070 165208
16403 165208 150994 -51613 -258075 -169883 -12086 93414 84381 200595 165610 14407
16393 14407 -85216 -25799 -44826 -21415 -104135 -185618 -151766 -12183 176237 161753 141672
16382 141672 110101 51847 41049 -54909 -27859 -138204 -104124 -55426 116330 218966 149558
16371 149558 67814 15904 149690 147482 93258 -50325 -7861 -83686 -112992 -116969 -58757
16360 -58757 -19088 -48395 -177343 -78696 62269 -36858 -146130 -144827 -84114 -40795 -89419
16349 -89419 -123862 -98513 -136848 -183796 -301634 -242644 -137264 -129377 -132758 -49636 14268 -19119
16337 -19119 -34975 51421 53825 78285 128532 207009 119176 -23261 82374 128801 111017
16326 111017 47451 30151 51925 24278 86803 111079 126710 29867 72714 297241 252355
16315 252355 166026 174672 173286 257891 242668 160272 159660 163581 208644 209510 39586 -205173
16303 -205173 -127931 -92020 -94573 -96797 -16253 70899 113229 202649 208721 221909 241051 55973
16291 55973 138812 87175 13949 8134 46570 67017 -1360 -23858 72271 149330 66869 -38503
16279 -38503 31890 148446 75082 35662 74774 79340 -73825 -130588 -47838 60321 170186
16268 170186 200017 107723 -18041 -89267 -178732 -121043 8216 136273 144954 142219 -24978
16257 -24978 -134826 -89323 -26592 -122121 -119645 -77782 -12912 40307 71608 -64771 -166786
16246 -166786 -171468 -211281 -191573 -186374 -171541 -153862 -105985 28579 50975 57076 161906 165260
16234 165260 155031 50930 47442 161876 139207 -47236 -130036 -108174 -138524 -164742 -270821
16223 -270821 -304978 -155051 -8569 -112761 -213762 -186670 -105050 -82037 -204918 -232635
16213 -232635 -197634 -106846 -54772 -24275 -57424 -55997 -59698 -27367 40944 229168 204815 -22667
16201 -22667 -139919 -14599 -13292 -157030 -44680 44698 46145 58423 60173 25689 20464 -55600
16189 -55600 -48935 -106714 -40940 -49670 -118130 -146661 -273957 -115866 -3564 112401 181841
16178 181841 -24180 -85033 -6510 54658 74375 -8575 -18950 46246 139386 126285 38701
16167 38701 -133919 -125625 -34683 -67362 -119234 -80745 -60774 -60925 -106164 -127371 -36334 10311
16155 10311 83359 135730 34378 -61182 -236811 -262975 -352766 -324495 -243996 -50572 -88016
16144 -88016 -139524 -94212 13263 -52051 -24196 -83200 -124616 -187606 -88715 -90434 -62410 20149
16132 20149 150810 118823 -89862 -127091 -134167 -298714 -415711 -565232 -602672 -477916 -329333
16121 -329333 -213834 -136486 -88171 -97146 -108132 -165800 -144339 -26802 51042 -12046 -14081
16110 -14081 -38383 43730 106289 161905 247807 231985 215674 -952 -113757 -175672 -64565
16099 -64565 41294 17559 -48300 -37460 -24286 11343 -49853 -65472 -13198 1393 -82641
16088 -82641 20162 65994 17368 -44546 -42618 52999 15538 10581 -65558 -103817 -54566 -38798
16076 -38798 -3925 -44909 -203466 -28816 35403 2665 -98527 -241741 -261344 -197366 -157407
16065 -157407 -46107 -40272 -111326 -186216 -126419 -24407 69426 51787 -8112 -81929 -44965
16054 -44965 -83773 -144507 -199354 -175368 -174046 -251887 -131253 -228072 -260668 -315030 -243828 -161652
16042 -161652 -91964 -73080 -208933 -260194 -233671 -28916 -27323 -135438 -173575 -121158 -241
16031 -241 14583 33061 91463 65137 -6460 -34430 -41135 2449 103879 197210 288178 281174
16019 281174 200040 136881 1699 56993 178549 121645 98580 33152 14517 -32766 -3284
16008 -3284 115246 68222 -27337 -44913 -95386 -118963 4010 47655 36521 26482 -127821
15997 -127821 -172647 -138624 -117458 -39764 22164 107597 89505 82711 200826 65333 -22899
15986 -22899 37056 -27489 -4788 133797 129856 72236 18146 -43634 -148864 -153752 -207865 -196359
15974 -196359 -202090 -91709 10382 17471 8671 41933 69365 -93225 -134086 361 49582
15963 49582 35309 35279 41183 29613 -74836 -146809 -168130 -114563 -169527 -293636 -337642 -366382
15951 -366382 -188887 -125477 -40970 18349 -36096 8598 21495 -153180 -194946 -188745 -143952
15940 -143952 -69661 -82027 -93239 -128835 -41491 60515 -60999 -100068 -86831 -107483 -168627
15929 -168627 -205101 -4922 89168 12202 4368 20056 107670 255488 201544 73212 -27772
15918 -27772 -71073 125088 255391 288428 250005 216256 186370 240688 305448 170830 308839
15907 308839 199450 188057 208045 209747 95434 11567 26384 44274 25642 -131513 -144880
15896 -144880 -149552 -168161 -191579 -191013 -16329 101190 185626 180226 61173 27109 12805 -30811
15884 -30811 -82050 17885 -38568 -76936 -4331 -68194 -100544 -218890 -160602 -77959 -53969
15873 -53969 -136651 -119288 -41566 -101223 -79652 81329 58264 -36557 -33080 38375 96889 67091
15861 67091 -42036 -82769 -139461 -16047 -13735 -8147 121765 211350 106254 -38934 -172703
15850 -172703 -187099 -53759 62454 -81076 -132269 -70389 -116744 -97742 -85149 -77373 -58772
15839 -58772 -7564 -74259 -168336 -222610 -86399 130939 186401 183527 82271 84691 -15846
15828 -15846 -31037 -125988 -165163 -6821 61019 91958 176503 177058 34404 -33821 20859 28836
15816 28836 73125 10247 -136943 -122017 3078 101271 133513 152113 184268 188776 185799 83527
15804 83527 7101 -33673 -125259 -240064 -271911 -200535 -49000 4798 -22345 21200 -43999
15793 -43999 -41092 21506 5434 -70741 -61593 -96971 -160144 -142886 -40496 181960 181482 68506
15781 68506 150577 216852 109291 85217 92461 49141 123401 179018 51929 41836 99571
15770 99571 75313 47021 27016 -7814 -54417 11375 145857 240438 219310 277155 166986
15759 166986 -45072 -182971 -136140 -90352 11054 72787 -4301 -6013 45394 98331 84324
15748 84324 172519 93932 32446 -22027 92365 107647 138214 136097 175756 95087 216582
15737 216582 142526 151402 245696 151136 -66359 -246374 -154915 -140434 -30534 109142 -38044
15726 -38044 -98967 165441 210178 148987 154616 187692 117621 140828 183580 193709 60619
15715 60619 -39986 -119325 -214855 -169162 -52398 49129 -2146 -104349 -149816 -70618 108376
15704 108376 100915 121567 107700 140230 140549 110564 137937 165170 115524 -18642 -27260 -375
15692 -375 68256 164061 252313 208764 165727 133644 647 -87405 -109088 -145470 -193733 -132516
15680 -132516 -149582 -62534 -42482 -19185 28586 29319 25258 45229 -90715 -168017 -16301 122904
15668 122904 130386 108914 80765 54757 149434 240814 113538 -74677 -23356 -29897 56684
15657 56684 125399 19940 11228 96792 -27882 -34068 -62132 -31485 -153583 -210307 -269406
15646 -269406 -117002 33044 146390 129303 186682 164650 203048 213571 82863 207934
15636 207934 232571 143193 151388 26523 -12485 -498 -76191 -69687 -16579 97691 165818
15625 165818 184258 173429 235714 407943 565874 371696 117970 52144 71630 171153 192856
15614 192856 9213 -62988 19613 62389 -24139 11170 146464 195145 274107 283961 251014
15603 251014 234537 64242 56813 186049 172471 164203 224753 88672 -26749 -31651 34877
15592 34877 69207 -46763 -66483 -87423 -109277 -159874 -77860 -33269 42927 86613 86430 -55451
15580 -55451 -59907 -54123 -54814 -58021 -70759 -96039 61852 75108 -27290 5890 48988 229848
15568 229848 192021 87183 -29477 -159198 -235664 -249264 -174182 -119338 -123517 -159121 -247773
15557 -247773 -303816 -328098 -161086 -64455 -31018 -26452 -90976 -163434 3389 38845 -38016
15546 -38016 -69300 18920 -41678 -145531 -162491 -32927 -50196 -110906 -229651 -103865 -22427
15535 -22427 -13365 -94259 -86627 -128553 -112610 -77090 -20706 59547 68002 -28174 -112946 -201299
15523 -201299 -325745 -347651 -200258 -91036 -80396 35891 170746 174373 122789 96163 64693
15512 64693 101120 59946 19108 -14267 -71226 -76841 1611 -88223 -163299 -222066 -214662 -267844
15500 -267844 -197609 -149316 -59828 -184769 -290744 -184437 -219125 -237789 -265168 -177539 -115857
15489 -115857 52845 209123 330236 258732 12544 -58540 -61977 -40890 -72619 -104756 -24887
15478 -24887 46782 81652 34125 7094 -8592 25604 13915 -8158 101980 132905 89756
15467 89756 174293 79569 -63792 41834 109844 147956 -39138 -115658 -145907 -121243 -121389
15456 -121389 -165538 -144281 -173276 -202125 -165530 -226767 -131215 -48224 86405 117389 69210
15445 69210 17467 158693 131853 118012 84137 46327 61831 -93262 -66567 -3657 -22605
15434 -22605 -66361 10193 82636 63056 115613 3416 -58234 4835 57290 104776 6738
15423 6738 -128197 -181850 -154734 -209791 -151886 -86449 -59907 -29336 -20322 94947 42907 -104907
15411 -104907 -131533 -34021 -2804 -55071 -88220 -18614 -9562 -136081 -238550 -200928 -178243
15400 -178243 -184719 -171546 -190006 -114540 -5244 27281 18198 -122090 -168762 -43800 -43250 -202161
15388 -202161 -387103 -321135 -218148 -238456 -230561 -241104 -212035 -159997 -152235 -89742 -119179
15377 -119179 -218918 -201761 -29280 154903 140340 11058 -51008 3250 -98773 -115951 -85514
15366 -85514 -58670 -48340 -130772 -71219 -16768 -139946 -64436 -154858 -211842 -105756 -107408
15355 -107408 -181378 -132818 80702 133616 106158 -8862 -209410 -108230 9679 162359
15345 162359 44226 201 102326 70326 -124451 -230530 -134711 -125866 -63203 35983 46240
15334 46240 46963 -23717 35543 31617 -219789 -216092 -47141 31989 30228 -85941 -152855 -113082
15322 -113082 -66006 -142864 -137959 -196987 -49417 -39304 -44398 -14741 17538 -73704 -68399 25766
15310 25766 64303 -84154 -30150 110767 56261 16859 93720 -58738 -198802 -270595 -95903
15299 -95903 70330 118246 119894 82305 -86187 -37098 32954 -58667 -1600 -62400 -181197
15288 -181197 -207734 -102264 47101 87171 -53076 -28209 48617 157628 207698 68455
15278 68455 65777 114641 39205 -32067 -59731 51387 125192 22525 12490 13868 -95481
15267 -95481 -25439 -132955 -43486 142564 263239 199871 65024 32283 -75607 -67799 -50885
15256 -50885 32494 140725 84872 68300 19515 7804 7210 22973 18710 75666 -15803 93149
15244 93149 34456 -190544 -254170 -9815 105888 27144 179002 100023 -41046 -160346
15234 -160346 -245861 -372679 -405930 -283286 -162623 -99298 -18394 -59524 52068 56392 58327
15223 58327 21308 -55923 -109098 -171969 -303455 -169662 -177402 -93505 23288 -74953 -42905
15212 -42905 102726 187935 288248 349090 225138 116636 122744 130586 22387 -120624 -68633
15201 -68633 -23671 -115443 -175392 -196751 -72473 -18572 -48295 -69107 -53642 -86255 -126125
15190 -126125 -85124 12451 76054 152706 260640 296255 244226 126677 115643 238870 239941
15179 239941 144235 201386 194284 279938 277748 364661 338307 291408 196367 25950 -63544 -46560
15167 -46560 -100514 -70871 34267 83319 -11678 -25230 21071 116688 220483 268348 115241
15156 115241 -9906 -99841 -83160 -85487 47219 176365 209849 71708 -26890 -160346 -241387
15145 -241387 -62113 10413 -20954 -59594 -190011 -122830 43930 69435 82403 -20805 -156189
15134 -156189 -297398 -256689 -181074 -10502 -34068 -17287 34813 100736 108827 84922 66632
15123 66632 32520 12942 -6991 -52729 -42155 113964 88872 -42190 12676 66858 -1912
15112 -1912 31928 41332 127594 165599 132316 17037 18386 -25285 -64376 -17540 -76271 -80587
15100 -80587 -143371 -142249 -102609 -37605 14554 -23669 -10725 207806 222860 117592 -28509
15089 -28509 -153300 -194963 -125795 -85231 -28526 -32485 62693 51450 8436 -170927 -235754
15078 -235754 -296437 -308611 -202712 -40097 -116061 -120015 -54782 -25354 39972 -6653 -52564
15067 -52564 -58834 -22946 84611 -4924 -39629 -64023 -127912 -293512 -224654 -81724 97310
15056 97310 128053 56642 48446 93706 62356 -71062 -160740 -169023 -200489 -166537 -27054 52387
15044 52387 41897 -106922 -136575 -178440 -160116 18381 95599 38307 -60426 58738 148392
15033 148392 181925 179044 75187 70741 88376 127321 296634 307427 36351 -48269 12693
15022 12693 -36584 -106243 -53964 -75768 -160085 -145444 -116585 -60603 -68656 -138604 -12892 68233
15010 68233 -5462 28760 107331 178579 68348 96779 -19163 -13882 -53715 -43408 23791
14999 23791 82212 41791 129 22635 112321 85752 -30945 -79723 -269333 -309000 -143925
14988 -143925 -14627 -195203 -250351 -191272 -24571 102310 12790 9646 -194680 -115018 -107672
14977 -107672 -229564 -163819 -87823 49927 159992 257864 202520 34181 -176795 -87304
14967 -87304 -45400 -90045 -130454 -73877 -44494 185963 85184 84651 27047 -80585 -77931 -155372
14955 -155372 -30051 -14765 -38472 -38886 -183222 -108723 61111 196069 80120 45512 129350
14944 129350 170631 120427 72777 -75959 -64791 96952 146175 207153 222894 162221 88200
14933 88200 52958 143917 139649 58012 54592 -99030 -39731 -46010 -122976 14978 140174 4874
14921 4874 21152 -69574 -90514 -70682 -80376 -46902 59464 -33222 -189834 -123764 26456
14910 26456 67750 -21684 -22122 52052 34711 2907 -55001 -23677 91118 60471 -13218 -47491
14898 -47491 -12611 2734 -38531 -98104 -162163 -112783 -31317 68142 53239 122204 153212 131436
14886 131436 135955 106116 -64894 -26035 -113078 -272371 -301068 -153997 -23395 -26162 -19108
14875 -19108 -139341 -250814 -119426 13605 100772 63199 10286 37760 -42822 -55370 -66853
14864 -66853 -174629 -185555 -101578 -27008 -149094 -211146 -146892 -174585 -33515 51847 20383
14853 20383 100721 192118 112134 95728 38044 -38381 -61481 -682 101404 83878 70905
14842 70905 213841 307732 257483 167602 99726 205404 178560 105972 162387 167207 4819
14831 4819 -59127 15398 66478 84751 161735 113488 34855 -138162 -168338 -71349 -23688 31135
14819 31135 -12019 101306 167669 119362 204610 219046 126816 30016 -16050 -55393 -214771
14808 -214771 -123962 -123091 -200023 -142631 -127555 -193927 15434 134639 131448 -45890 -49739 32199
14796 32199 91173 74389 6892 43363 78479 44143 -60727 -32382 168668 145726 129781
14785 129781 37932 -80901 -120831 -44763 -36041 -90805 -184995 -118051 -133407 -79835 15135
14774 15135 -36991 -78642 -79613 -26308 104249 266334 227032 241506 213232 151625 134834 155220
14762 155220 81000 41712 -37897 -213120 -277944 -239019 -137870 -70248 -3153 80525 158619
14751 158619 180777 204900 156768 104493 132224 37061 -1319 6688 140498 241191 104893
14740 104893 28283 77304 22659 72137 193233 127891 -101907 -9202 45827 -56180 -185229
14729 -185229 -218602 -186164 12878 116531 135406 166894 -26761 -49157 100448 132313 42144
14718 42144 61451 49450 182151 207056 110073 41264 80954 169880 102600 147164 143128 129292
14706 129292 36541 -17698 -110546 -139041 -56971 8322 -14824 -57480 51587 200176 200727
14695 200727 195025 71209 1885 -77564 178236 404394 267837 90783 31212 32529 106831
14684 106831 -56770 -102477 -90427 -39224 -14692 49383 109427 94374 111768 178244 107266
14673 107266 25567 -93057 -105691 -166843 -104810 -34087 55908 63997 31020 176341 257899
14662 257899 210963 49454 -60420 -104600 -81793 48004 84178 116872 129870 107814 68220
14651 68220 241360 292271 301774 252382 223265 82747 -34064 -123791 -61100 -62877 25539
14640 25539 57219 -35567 -27020 -106224 -58553 -97658 -44812 -102451 -74249 -35048 -38688 -48852
14628 -48852 -115776 -100588 -49212 -253740 -247364 -169309 -209343 -373346 -398653 -261081 -201023
14617 -201023 -288796 -226789 -125659 -39813 69938 113182 141624 82359 20990 98233 88438
14606 88438 55810 113160 214136 93546 -109428 -93728 -46818 61163 208727 177497 227897
14595 227897 319575 261211 230182 154024 42239 111375 156025 130697 165499 122200 60576
14584 60576 5411 -77104 -67325 -109909 -101523 -9386 179472 202911 186957 109438 120548 107182
14572 107182 149858 190808 113991 56781 -666 -27581 1111 48193 66220 121083 87154
14561 87154 149020 132526 115096 247301 213749 243990 192116 -18261 -59326 -54946 -118331
14550 -118331 -54644 -30807 -31668 -58536 138269 125976 -16799 -77485 -87105 -125345 -45023 -98276
14538 -98276 -173762 -44411 78718 24082 37583 59129 -21907 -167431 38443 67376 20129
14527 20129 111739 132669 108412 48931 49342 -101463 -179149 -215394 -189073 12854 145738
14516 145738 183305 162220 180298 129362 119875 56603 111917 161963 59423 131525 32848
14505 32848 -19748 -6040 88267 200660 163834 3630 -108581 -150732 -251692 -232203 -201595
14494 -201595 -134005 -48541 -56793 -46026 -117834 -94129 -141493 -207343 -200724 -161382 -25463 6845
14482 6845 -22229 -85925 -41300 47313 23927 97654 164459 96608 -68966 -96535 -36957 131580
14470 131580 186150 43348 102927 85054 77586 90844 86771 39896 1312 -169282 -46717
14459 -46717 149398 104272 44843 -26458 -31544 24812 9940 142052 196681 246930 38432
14448 38432 -168220 -225898 -129665 92058 105083 63634 -30819 -73200 -177321 -135484 -83296
14437 -83296 -235210 -307853 -161940 -73635 -29745 1634 -18057 12316 17751 57920 -7976
14426 -7976 122582 218326 116593 51429 132466 39062 -88594 -195990 -103702 -25856 10454
14415 10454 -27761 3304 29038 136026 125365 -12021 -237702 -304999 -336194 -306269 -109404
14404 -109404 30873 132669 230291 254899 154385 69178 15591 77951 92030 -58568 -164817
14393 -164817 -222487 -260851 -246947 -88898 113734 134294 172678 184398 195246 329424 273509
14382 273509 36779 75528 -1708 -205450 -178236 -68404 82663 -17599 -99620 18150
14372 18150 20851 -26784 -72729 -160964 -91794 21767 -6914 51129 143824 227681 186761 99772
14360 99772 -39538 14507 142168 138973 134834 52766 -29602 -65328 -151816 -148612 -161955 -164818
14348 -164818 -195698 -388740 -302523 -108165 -110050 -194802 -214083 -232666 -248282 -221472 -232653
14337 -232653 -144454 -227436 -322916 -243376 -144992 -31604 -13019 30260 98620 44475 -121355
14326 -121355 -185718 -160448 -124029 -74281 -106160 -142199 58054 136825 106573 84754 60553
14315 60553 20657 -32649 26177 54086 -59963 -170298 -188060 -3325 94296 44274 99188
14304 99188 165582 219159 126171 144122 117134 9195 -109059 -121326 -139524 -105686 -67679
14293 -67679 20669 -10394 -45205 12036 54786 123644 232653 223548 234334 150565 -27701
14282 -27701 -99760 -24350 34352 -10138 79870 181068 146440 128680 112865 145438 132891
14271 132891 74604 -8623 -117086 -165683 -120949 -123393 -145922 -103702 -69638 -66410 -149817 -4517
14259 -4517 144060 63320 -105923 -131018 126825 278387 264354 198314 254895 116054 87947
14248 87947 179352 194890 257135 354805 363108 237720 9576 -82595 73643 265646 154396
14237 154396 91034 182122 63256 25211 13564 -75833 -22812 119500 133412 19114 -16074
14226 -16074 114817 229127 350219 377261 276204 97380 138562 269868 279625 203362 155085
14215 155085 172866 83568 53512 177208 43580 -23991 -107350 -183479 -210982 -143140 -14106
14204 -14106 -71849 -76842 -19954 -113364 -126409 -166364 14574 179126 45974 -24482 41941
14193 41941 115418 97693 31004 26019 174335 106876 33271 100379 97894 72081 14410 1865
14181 1865 -68476 -138168 -165686 -31973 132865 214461 299203 275357 213839 159419 191873
14170 191873 184308 25584 -231 -32055 59710 136046 94947 158439 197772 89458 2571
14159 2571 -46076 -48847 -28041 -4294 14679 -134427 -146469 -78806 -1929 -129974 -123126 119669
14147 119669 223569 161744 68682 -78404 -15237 94051 154342 95698 14678 -68280 -141986
14136 -141986 -126687 -30042 -77593 -27874 -36340 15954 228622 250729 256576 206611 146421 83845
14124 83845 -26660 -88099 -68450 23157 43791 84435 44580 7183 -91505 -97903 -20849 -50987
14112 -50987 -181544 -127198 120604 173945 120740 -39654 -89940 -61130 -46444 55829 -23201
14101 -23201 -47784 -58544 -137127 -147334 -11719 165677 37181 -62680 80776 209245 -2773
14090 -2773 -40250 -62069 -123628 -68403 9401 7903 75011 42602 105354 159719 119500 -27375
14078 -27375 -111331 97564 189658 296249 301943 336123 422658 389280 320192 183754 181476
14067 181476 223245 231637 337796 276199 138152 172406 147128 35242 6865 70617 66465
14056 66465 -61093 -23886 35730 59418 18368 121835 266693 217879 104713 18191 120911
14045 120911 54126 -36884 -140439 -263671 -311351 -176214 -116729 -119283 31822 15480 -40160
14034 -40160 22446 61459 34534 13880 75096 197634 193175 7851 -77332 -147022 -99743
14023 -99743 -82403 -125171 -133033 -30469 16029 -181137 -326828 -332412 -238045 -130549 -137976
14012 -137976 -112482 -51935 -117825 -125870 -67100 60360 173141 259083 215442 45035 21310
14001 21310 18832 87069 101623 81573 -16608 66271 151345 145774 -67332 -137409 46641 100451
13989 100451 77460 94350 27320 -48620 34189 29177 77868 31044 186575 87065 -90557
13978 -90557 -110695 -3573 -133781 -128943 -127244 -96330 -62127 -70282 49279 101160 -6281
13967 -6281 -83312 -33933 58156 47763 108055 193290 223174 82461 -53913 31890 -8270
13956 -8270 56399 148309 220255 121102 81499 88811 -26149 50395 197840 209550 256900 323148
13944 323148 295485 339280 307146 227152 135747 92941 138216 224885 156156 125749 191807
13933 191807 205464 268964 434638 415747 160220 -57279 -181888 -61011 65807 57327
13923 57327 35811 143820 133496 -58392 -15574 81889 -6529 35194 -8831 92476 187189
13912 187189 232545 266205 230621 155518 93200 210668 334656 188465 111912 133305 67740
13901 67740 -98777 -1958 120186 137002 32424 -93951 -46204 -97724 -158354 -58134 80680
13890 80680 136816 -118362 -157992 -117726 -17805 -162227 -121131 -224788 -118689 79550 63345
13879 63345 1043 7034 -78987 -33038 56441 51969 -71044 -16515 -35174 -93611 -117177 -79051
13867 -79051 -89300 -93385 -8669 13946 -47617 4640 -69453 -180292 -86651 -32217 -2184 -41834
13855 -41834 -142254 -163159 -29999 -53509 -79027 -23537 19356 117656 86724 69775 36535
13844 36535 -52389 -34565 110170 204037 268164 160331 124738 31044 5608 -1258 -8327 -70349
13832 -70349 -197143 -217828 -194584 -58724 19362 -13526 32786 10870 -69222 -21400 6674
13821 6674 -88519 -82656 -119606 -84482 74838 -14986 -130086 -215199 -96144 -92410 -134667 -1307
13809 -1307 88288 89422 53192 13183 71939 10756 5684 104241 72263 69872 49100 -23588
13797 -23588 5042 143529 214893 122217 133611 130413 28757 -35753 -43782 -31179 -46135 5006
13785 5006 35506 84212 74696 59950 -43636 -103280 -73984 -373 -24079 -62640 -185775 -149285
13773 -149285 46175 116487 202553 149709 79231 2923 -81256 -101994 -99077 -154050 -211971
13762 -211971 -342541 -273450 -61904 -63278 -28429 77110 2200 -40780 -138564 -235486 -124439
13751 -124439 82600 77210 -16209 19554 64503 103379 184913 230797 272930 146274 19185
13740 19185 -49916 -173300 -228953 -71346 -15490 -100152 -89122 -76711 -172347 -225281 -84569
13729 -84569 45971 -43086 -51574 -2026 8141 139250 65786 -23938 -74769 -25308 -16861 3128
13717 3128 -33685 19419 -40899 -8145 -40467 4389 91117 58233 -32511 43896 118934 123064
13705 123064 151125 444787 608768 599940 450248 322826 295784 291013 258737 271742 320827
13694 320827 270236 112314 62667 46286 -99510 -236003 -195353 -111292 -139001 -21548 63497
13683 63497 174845 113873 37167 -45412 -65521 45467 114390 51830 -53608 -115744 -51775
13672 -51775 34134 78186 145367 252674 236572 223133 223866 150258 154317 121074 107357 148815
13660 148815 126974 157835 91904 87040 102151 82707 140341 159790 -25312 -193428 -130066
13649 -130066 -93162 -91047 -116399 -184042 -133081 -103193 -17462 -65318 7753 132541 95419
13638 95419 238157 259028 313287 236417 171897 39547 27706 45417 -9928 -126101 -175252
13627 -175252 -188452 -77290 14286 32444 133386 154266 27943 -85549 -153963 -183998 -114379
13616 -114379 12408 70772 30766 3586 14774 -26051 -38796 7299 30552 32531 56913
13605 56913 140180 113470 145285 -18074 -16279 -107209 -64338 92173 76469 -67373 72601
13594 72601 242711 327474 266490 171677 75999 -65636 -142717 -56940 9692 18435 -52546
13583 -52546 -54462 -157145 -67171 -2989 86294 200054 130035 150297 206625 238331 138545
13572 138545 59119 -74868 -197613 -164720 -128844 -125216 31789 78739 -19966 -114371 -48974
13561 -48974 -12012 54890 -30869 -145537 -61236 -25111 -12389 102486 140256 121368 100503
13550 100503 -37837 13297 77875 173058 220080 154970 159690 228287 129325 124679 170227 97812
13538 97812 -39164 -198242 -273086 -148908 -61748 -76407 31146 8564 -150231 -226671 -144289
13527 -144289 -8209 -61939 -77167 -16797 -22538 -143624 -131589 -104979 -48885 7634 34778
13516 34778 102847 111835 78837 134834 160900 169846 168864 85487 -17042 -188158 -232364 -62363
13504 -62363 -11385 -31319 -33649 29581 -14825 -217852 -370379 -268052 -137944 -125172 -38564
13493 -38564 -195127 -134023 -83857 -42932 -17480 -9668 95037 194747 89032 -57002 -180948
13482 -180948 -120460 -43159 -29912 30951 98517 175827 100504 53451 -8334 21835 13694 -21694
13470 -21694 23730 20430 -82072 -125522 -50307 46202 87567 79900 112369 114036 61374 -31014
13458 -31014 -42678 26796 51813 -47031 -68717 -13383 -44878 -135035 -56242 -20453 -2177 -58475
13446 -58475 -65594 -98336 -241850 -282831 -218713 -255019 -112251 22267 257409 342790 370581
13435 370581 227318 133348 155766 104910 189521 184215 76684 92218 99165 81656 111680
13424 111680 138952 128618 207141 287013 184475 189397 164449 124781 -64180 -84557 6735
13413 6735 50964 -84232 -89783 -21918 -79273 -97353 -131401 -299235 -278221 -103147 100633
13402 100633 211065 137010 15194 86736 237337 214362 239721 258124 201179 170385 36311
13391 36311 -102634 9619 99067 -6530 -172365 -94137 -57978 -119553 -60401 -37422 -34378
13380 -34378 -30558 -59860 -64860 -66768 -68005 -3724 17358 18749 -11968 13013 49136 104990 75253
13367 75253 16022 49694 214332 389236 251818 41246 3182 48768 53508 166030 130737
13356 130737 107695 82407 64474 -14727 -81115 -149033 -250943 -269197 -74284 -63199 -180908
13345 -180908 -129895 -86567 -163250 -209951 -180997 -84226 -79286 -92550 -44602 -180229 -287276
13334 -287276 -293331 -129776 54105 60733 39357 11608 -173895 -233776 -130464 -68221 -81417
13323 -81417 -59772 -3556 6280 40895 104921 68025 93144 120878 38098 -10210 -80680 -92081
13311 -92081 -60434 657 -112133 -153158 -120721 -23828 81072 69202 15552 1568 57840
13300 57840 106912 37396 31202 39285 36931 47130 10878 160154 237631 132880 163842 306466
13288 306466 311292 166370 92725 100003 -4026 -40751 -96413 -295337 -385869 -347169 -164535
13277 -164535 -44129 -22682 -111884 -52675 14816 19110 -22161 -127545 -170081 -73495 -97395
13266 -97395 -346332 -434141 -198695 -4088 72724 -7009 -59579 30591 9756 -61956 -63661
13255 -63661 -107115 17864 -45757 -31699 -67616 -53280 31808 -11527 2747 56137 -42017
13244 -42017 132656 409422 300399 138480 90725 54303 135251 252457 282268 312329 166137
13233 166137 37994 -33554 -43614 -53684 -97993 -136905 -185907 -133249 -96554 -100763 27482
13222 27482 83918 -7910 -31300 -137432 -215610 -48267 72138 130629 93140 24136 37546
13211 37546 50030 15666 15949 26641 67188 28483 -18711 -18233 -56161 -43985 -32851 63236
13199 63236 138624 140426 134885 139492 15124 -133975 -1729 81386 103495 -51522 -135338
13188 -135338 -194768 -258354 -208500 -131404 -154310 -215793 -257014 -321512 -354480 -97291 168096
13177 168096 205286 128800 14193 124652 132608 293485 290336 303416 261821 129927 160114
13166 160114 156653 88104 139598 185597 258232 223000 290197 184854 182351 156160 37500
13155 37500 122339 122580 205656 237020 137854 80685 5642 -75868 -149072 -131927 -149405 -170141
13143 -170141 -142281 -138772 16652 -11885 111714 269718 301413 361964 449577 403231 296058
13132 296058 104973 98770 107727 97535 110628 144433 221063 136728 100093 95699 -59632 -108784
13120 -108784 3082 2701 -138609 -100321 51584 168716 223416 39891 32161 118525 152663
13109 152663 205682 111654 -6053 18809 35538 -30114 25836 94608 103865 101522 -48243
13098 -48243 -72324 -23030 -14454 77639 146928 115442 86287 -16886 -170959 -59101 28266
13087 28266 85123 86413 110438 183635 264383 72218 -111921 -70342 -31317 -38503 93663
13076 93663 177941 163071 104157 68904 68402 51134 48762 86330 110935 59013 5641 -48024
13064 -48024 -57017 -106827 -83051 4537 133843 127626 41727 18830 -34241 -92343 -36005 -234
13052 -234 59225 109142 204688 152175 -202 66548 182740 140202 48445 -34024 -40070 -193049
13040 -193049 -195402 -64074 4697 26406 98670 90786 133774 78364 85171 233091 222365 92722
13028 92722 74817 28929 -54623 -53952 81506 226607 229503 89455 104758 85930 186732
13017 186732 262753 294293 149118 114307 117872 107786 190010 283253 297791 343815 341814 292904
13005 292904 180980 152402 126572 153382 31778 -25036 -74100 -51716 -64298 -1588 151039
12994 151039 66823 16359 -116968 -234184 -183893 -65390 -49887 -97876 -25582 -83094 -103014
12983 -103014 -4787 -68369 47169 61607 -26025 -92877 -74965 138118 29661 -80377 -44980
12972 -44980 -22496 7510 72559 216507 157304 86939 29348 15231 -76094 -83131 -68880 -105092
12960 -105092 -8475 81421 202275 171921 38780 -49159 -59023 52294 64299 -14159 90413
12949 90413 -39463 -16900 29722 105434 233982 177417 145403 150410 208849 156207 90350
12938 90350 55819 80738 32182 -94576 -30162 62525 84495 -100922 -206000 -211557 -90103
12927 -90103 21484 51565 14283 3120 -51248 -36208 37039 70466 93322 19734 -6980
12916 -6980 -59511 -125845 -19695 -30930 2484 123600 144475 167963 61522 62094 -4653 -111847
12904 -111847 -65091 -731 -26508 35006 -20106 -75782 -90922 -172011 -166740 -89033 14376
12893 14376 -85499 -91812 -127183 -135018 -159586 -206701 -98128 -93433 -184382 -188341 -202930 52257
12881 52257 70526 -13077 -61540 -55920 -74306 -33524 37280 -9554 48370 157040 220566 287715
12869 287715 171024 65514 122221 133828 18178 -5579 64918 144588 187449 163272 58406
12858 58406 -15740 -27725 -19435 -127537 -195275 -188017 -62198 -224172 -202758 -102527 -112570
12847 -112570 -25755 208706 340229 171406 132649 196071 165707 152407 130648 143972 176631
12836 176631 63328 -103509 -228838 -289158 -199138 -138555 -67950 151280 163203 200800 207506
12825 207506 3576 -42696 57781 98305 154351 156849 250383 190636 38781 -32075 -56611
12814 -56611 -120370 -96144 -95678 -14292 -37284 -103301 -45767 11987 -105533 -20916 82574 11605
12802 11605 -10413 -48209 -52531 -34858 -45100 -142142 -219376 -151867 -219575 -246194 -137725 -140031
12790 -140031 -188900 -144056 -82550 -60830 -16832 59174 211039 170689 241445 216444 227083
12779 227083 130274 -3510 -22957 -8392 26200 59461 -69815 -40623 21214 -51875 -30220
12768 -30220 20795 32575 -161604 -66581 -35888 -17939 -14625 -105620 -85597 -63244 -93697 -88375
12756 -88375 -154055 -212012 -111934 -134619 -132552 -67209 -8955 -150723 -127909 -43058 23473
12745 23473 53417 44499 -59232 -126036 -48994 -98166 -168186 31213 -6823 -72493 93543
12734 93543 48900 -32598 -14106 -17189 9419 44728 -13331 5232 23130 -16098 -111845 -77976
12722 -77976 64594 107036 92010 103913 46651 -20848 -108370 -140249 -50288 13105 -69858
12711 -69858 -104708 -150527 -119555 36958 84762 79298 20045 -16403 -35836 -95725 -149601 -114336
12699 -114336 -57067 -8860 13346 -43930 -32187 -35240 18592 106755 175776 279882 247608
12688 247608 85614 20516 26840 -201662 -207646 -156318 -73546 -86232 -98851 -98458 -85539 33744
12676 33744 52883 1116 -23827 -58868 -60294 -107213 -316929 -263605 16762 25206 69894 71253
12664 71253 11473 10400 -38922 -198612 -206689 -92606 130986 144780 -17580 -59695 23627
12653 23627 54242 90824 103454 34905 47322 111469 56490 -68250 -181555 -157403 -164672
12642 -164672 -254180 -250268 -98495 -97188 -9729 77461 -37916 -119750 -127752 -154190 -30321
12631 -30321 6974 -71612 -160423 -71954 -20994 10954 34714 35445 -7768 15265 52152 144674
12619 144674 110638 94042 130844 199919 181454 197311 128028 217403 144400 146803 14267
12608 14267 -38876 -29131 -130287 -83467 -172786 -134408 -160348 -163420 -19393 139676 307090
12597 307090 438866 425108 368416 162315 115375 104864 236681 110041 36211 -2988 51787
12586 51787 -54086 -51386 -40067 -18631 68195 -11675 -6770 137920 221948 146994 83258 63568
12574 63568 130520 208621 81047 -15454 -72365 -126191 -150335 -302242 -364100 -374261 -178131
12563 -178131 23103 -26529 72660 66195 17370 10521 18740 99918 134531 -35083 -158432
12552 -158432 -99161 -146733 105089 170449 194528 191611 71736 196923 192450 47574 44853
12541 44853 30798 9936 -7053 35341 -29915 25174 104843 27341 49225 -3665 -9916 -16780
12529 -16780 -66657 -4201 140686 201844 68734 63627 132137 80814 69587 37726 -13072
12518 -13072 -40115 -46716 -51643 -81832 -166452 -186641 -128051 -48571 49080 -2686 58983 92718
12506 92718 -12228 -59268 -155417 -159492 -169884 -107874 -66914 -1890 -13887 -89797 -114753 -93504
12494 -93504 -38780 -36319 -39915 -127378 -107607 -184652 -161115 -86850 -3276 116720 269830 241151
12482 241151 57496 -90948 -30303 38552 50872 100938 -7399 -144825 -175672 -235031 -212201
12471 -212201 -125977 -82829 89426 139556 14361 -136662 -263087 -170054 -127069 -214926 -116058
12460 -116058 -82704 -27160 -31897 -69255 2736 15379 -29361 17059 -38974 -7314 181307
12449 181307 144405 81517 30827 -59564 -86224 -71776 -45545 57728 60936 -94530 57622
12438 57622 110617 -87682 -180259 -39657 65306 95742 109399 122586 187536 130263 90422
12427 90422 -19517 18096 77418 55034 -37134 40823 131736 95967 149758 119376 81294
12416 81294 -8015 -78758 -156614 -249545 -216303 -239096 -317604 -154548 182249 149051 20912
12405 20912 16159 -42019 -200718 -184445 -179779 -158474 -245547 -303939 -292153 -173870 -137626 -182496
12393 -182496 -170277 -40168 24377 66921 -27849 75893 253846 236000 61161 -101190
12383 -101190 -162467 -147561 -174610 -226092 -186257 -134031 45724 12886 122511 141752 94525
12372 94525 74382 134660 95847 31466 -80837 -41388 13353 49002 -26692 -149346 -116471
12361 -116471 -10807 47365 49076 132117 10042 112648 160017 -12534 54250 205188 224917
12350 224917 37617 -65472 -40556 -59253 -54882 63770 123532 112802 6223 -197 86504
12339 86504 93268 -63139 -126631 -2361 72575 108530 93579 110419 151626 119179 33089
12328 33089 23501 46653 -138084 -206146 -180562 -17935 67641 40658 42988 -43771 -57398 11523
12316 11523 -118103 -60526 -43270 -149446 -252098 -118997 -55785 -60406 -105309 -185469 -169123
12305 -169123 -182065 -152370 -102646 -23901 -154275 -137503 -65310 -109271 -247062 -220393 -291647
12294 -291647 -121531 -180523 -266359 -205137 -170088 -136001 -76482 -58392 -167409 -221050 -201142
12283 -201142 -122308 -3895 49728 1555 31803 70887 -9896 20178 72247 21026 15008
12272 15008 86068 -32276 -72903 -35184 -63928 -247904 -330526 -238825 -28025 21109 39296
12261 39296 20441 25037 115180 266636 173564 65936 -39184 28798 -9508 17052 112607
12250 112607 202846 178415 98730 60867 37296 -37893 -62583 -60130 -4047 84171 255567
12239 255567 266881 200174 8718 17802 65513 28750 53337 134642 134626 90561 132153 -33421
12227 -33421 -139400 -114425 -104153 -121884 -77639 51580 77119 -38273 -77958 -73404 -20140
12216 -20140 -23759 -247705 -300274 -188502 -110413 -77010 43481 225938 233232 129402 68141
12205 68141 41879 102376 18762 -62873 -88724 -104300 25658 172648 82315 146286 145980 86429
12193 86429 8835 73415 121866 177060 196717 46254 -97686 -31687 168665 308623 205204
12182 205204 10582 -8713 24864 26725 -19527 21977 46594 -1130 -50326 19386 66891
12171 66891 100313 -18512 -65843 9343 85531 55273 26284 98891 9864 -1067 -65081
12160 -65081 -87426 20860 70861 56057 25513 29331 57555 -40286 -51302 -10395 131627
12149 131627 35296 13088 72531 154566 189999 109719 90779 212755 182453 52885 -136499
12138 -136499 -200952 -122321 -44258 -12709 -18490 21140 51932 13999 -93553 -55015 39333
12127 39333 20383 -45210 -17172 -104877 -75449 -22201 17000 81130 49490 -27775 -182956
12116 -182956 -153694 -5249 43813 -9885 -9662 9248 -28271 32992 117533 140595 127339 184365
12104 184365 127072 59045 66707 -58477 -86637 -149942 -53872 -9808 12537 50666 31115
12093 31115 68932 2656 -31932 -38996 -29153 3975 51649 -24080 -21045 37185 75263 4705
12081 4705 -55464 -63918 -158205 -184024 -198950 -174411 -151813 -172317 -136743 -182144 -189277 -159652
12069 -159652 -85632 -16404 130893 194567 161134 -49363 -173838 -193507 -175935 -233707 -255993
12058 -255993 -256292 -141271 1334 178325 196634 214695 102486 127887 142778 122961 58222
12047 58222 162004 58554 -15829 -55238 34689 84703 -122808 -160233 -80939 -164768 -194281
12036 -194281 -169627 -95233 -59649 -113445 -227486 -271550 -82030 3111 65969 -146852 -72873
12025 -72873 -34058 -12926 -22389 -78712 -180251 -203031 -34408 106683 -18950 -102007 -18416
12014 -18416 21652 106386 -47682 -124499 -8762 136151 15337 -64425 -145724 -89443 -63365
12003 -63365 31119 227063 229438 114843 -11819 69529 57952 -86452 -2960 103844 94958
11992 94958 111580 103473 53463 16840 -68707 -85802 12083 97842 64499 21415 -11838 -34187
11980 -34187 -15684 -52667 74462 69503 27507 101685 114940 111577 52273 -43978 -49323 -69957
11968 -69957 -153143 -23597 57669 42817 47086 25084 -81996 -125457 -8569 -661 -34559
11957 -34559 -36959 32077 -23194 -30822 -36918 -62938 -40779 8089 71051 54080 28203 68743
11945 68743 64901 85227 52809 -43800 -159823 -43130 36197 -43910 -48459 16137 -128926
11934 -128926 -199839 -53048 -79643 -158640 -269475 -219018 -110134 -153192 -143544 -146366 -92114
11923 -92114 -74811 8606 133344 124212 -10918 -84553 -190344 -310971 -488727 -427595 -392761
11912 -392761 -374967 -398983 -480004 -366409 -105201 32218 12171 -55315 -8800 12173 -34547
11901 -34547 -58121 -96640 -132607 -143604 -61292 108731 114071 23919 -20027 -139276 -149044 -178939
11889 -178939 -19008 66500 201632 236871 51345 133 28684 -55425 -42337 -86924 2686
11878 2686 108942 67609 -66332 -40602 33887 -38798 -120566 -11536 60336 24497 22303
11867 22303 -40308 -87500 -35599 -5139 -51630 -53557 -19162 7959 -63402 -151423 -133526 -69216
11855 -69216 -73867 2228 65275 90946 140911 166265 79258 25847 -50868 31107 42323 66688
11843 66688 66345 65792 -87527 -196737 -135924 -74626 -158827 -210484 -121868 -92920 -124836 -69544
11831 -69544 -58954 -87896 -92739 -137372 -178123 -148078 -101348 123626 250094 220768 -41009
11820 -41009 -224741 -194954 -184323 -181140 -146381 -195721 -303573 -284673 -202874 -45392 -17641
11809 -17641 -58908 -86164 -26511 101727 98056 63144 -50533 -145208 -78865 -92385 -131788
11798 -131788 -103268 -281811 -298328 -266045 -191299 -92211 -200497 -353169 -401355 -306797 -156522
11787 -156522 -162791 -192972 -195315 -137408 -113716 -58963 -85683 -77056 -66644 -35499 -72516 -130941
11775 -130941 -113328 -71294 9472 -40765 -123925 -218659 -226680 -229013 -191464 -157990 -60045 -39874
11763 -39874 -88788 -68787 -70563 13598 61024 122365 236133 188325 251398 208033 -52789
11752 -52789 -132629 -162668 -108387 -161485 -261421 -202317 -208674 -84072 -141046 -212259 -395111
11741 -395111 -308369 -71161 -39163 87029 117512 -44144 -32526 -38570 -59380 7681 214553
11730 214553 240478 260067 179168 46312 30293 91180 101849 50631 50440 -56966 -108525
11719 -108525 -135686 -128260 -112215 5281 -91716 -55955 -14153 -105637 -149381 -71369 -25470
11708 -25470 -49479 -2782 -37749 -137777 -179155 -22751 82140 60921 39293 -132457 -131997
11697 -131997 -48387 49371 91747 40198 -15233 -9504 -105151 -100328 -130244 -2083 -12944 -89259
11685 -89259 51886 90039 76850 -62366 -60049 -23747 -56724 -45821 -107560 -173032 -113323
11674 -113323 -10326 -25919 -112153 -209425 -336741 -319092 -254739 -204529 -138682 -172691 -248737
11663 -248737 -128204 15468 -737 197964 211006 131160 296814 164606 51022 -52087
11653 -52087 -161550 -112588 -89252 -167601 -204278 -163133 -147629 -180495 -130939 10231 7917
11642 7917 31590 44028 42573 119160 -36792 -247605 -100451 -16389 -6241 -116576 -197495
11631 -197495 -242716 -332080 -360416 -148701 -110659 -92759 -107351 -137465 -119967 21508 98148
11620 98148 96813 -11017 -39254 -49429 26488 -158170 -166964 -126422 -67868 23972 78337 17208
11608 17208 -63005 -179110 -209437 -120802 -51858 -80714 -58479 -11289 -25974 8453 84821
11597 84821 70465 42671 109919 -4932 -155250 -126852 -117 78886 42453 62282 141302
11586 141302 260142 176464 49601 20113 -21896 -10713 56207 123575 49835 -101818 -70187
11575 -70187 -167389 -303940 -221348 -131361 -256940 -285657 -145006 -129421 -82553 -153023 -142619
11564 -142619 -100651 -130409 -124396 -66583 -6250 90907 48306 88442 129770 -4546 -38435
11553 -38435 -36935 -115053 -160571 -112082 -96629 -67390 -102790 -58920 -77140 -202579 -112662 133980
11541 133980 190245 210386 121527 82365 144205 84206 138018 4491 -76358 36162 -25852
11530 -25852 -136200 -98981 -70818 -109022 -71596 -63574 -131210 -30003 -34909 -65203 -54673 19514
11518 19514 30296 139701 113150 87387 -21592 -55615 1638 40675 41065 53715 32839 25629
11506 25629 -4068 -34946 -23283 -12817 -78778 -44388 -46278 -61626 -160618 -190197 -108049 67197
11494 67197 121964 62276 74761 102288 44195 -137410 -189276 -88905 16595 78844 57991
11483 57991 34578 -47379 -88160 -157888 -306620 -285355 -90705 37508 -59668 -151649 -52216
11472 -52216 -3487 -128927 -67558 -127969 -155696 793 -24655 -108532 -243648 -195493 -220014
11461 -220014 -288915 -285171 -249137 -293207 -236975 -268607 -296598 -205872 -110357 -223675 -197277
11450 -197277 -117056 -33642 30966 82237 2141 -768 89945 -15580 80264 112539 10621
11439 10621 101690 136608 -81365 -158791 -26723 15689 -13749 -11613 42827 93239 -42480
11428 -42480 -98628 -35746 -57826 -28462 -27512 -23358 49630 -18232 7676 47249 -31216 -37993
11416 -37993 -175488 -347534 -264144 19849 98896 79443 27681 -49672 37754 -100499 -227960
11405 -227960 -131946 -45470 -83391 -50569 112918 274648 245872 114436 59414 124801 155443
11394 155443 34887 -91916 -79261 4275 24528 59048 -59481 -117251 -182407 -261248 -167584
11383 -167584 -165640 -179059 -253186 -307685 -163600 -139306 45439 63136 -271238 -327045 -255599
11372 -255599 -252627 -162888 22978 28621 -13478 -75189 -174474 -167735 -208734 -155090 -102412 -142047
11360 -142047 -226113 -254033 -140990 -5801 47336 53112 -16137 65266 115292 152727 48696
11349 48696 52639 76355 118727 -60413 -234940 -266537 -191855 -239747 -236777 -200666 1922
11338 1922 87164 8977 94880 109345 24535 98166 -34851 -150466 -209061 -262142 -200196
11327 -200196 -161127 7266 -40861 12357 -70250 -265712 -235390 -239354 -139546 -4375 -29818
11316 -29818 -46195 -46695 -74669 -173376 -250127 -208401 -110786 18772 -43387 -37466 -119788 -250948
11304 -250948 -201346 -49561 -9791 -30028 -83787 -142305 -182356 -93523 -131249 -131228 -147976 -186730
11292 -186730 -101615 -6127 -129199 -141102 -67460 -17122 160259 144319 57186 105245 21596
11281 21596 -55456 -153063 -214347 -260599 -201822 -145479 -209625 -154341 -114038 5784 -7961
11270 -7961 -152956 -132354 -205726 -251418 -288893 -194966 -96482 -49100 9564 -5080 -112196
11259 -112196 -190120 -54802 8380 -102487 897 -44306 7308 95363 47027 -27572 -26000
11248 -26000 23521 -104870 -205613 -156379 -75140 -22554 111659 95353 36872 -66835 -89216
11237 -89216 -65075 -83705 78282 114424 95420 68263 68294 102882 -42507 -263383 -228020 -107107
11225 -107107 -48662 8381 59859 116832 33459 -184220 -217863 -131537 -19562 -68279 -183252
11214 -183252 -117468 33672 68097 19656 -50580 -42855 -34846 51689 143310 -47155 -71830
11203 -71830 5299 53418 90396 71938 -54351 -194721 -192455 3900 110295 -81823 -163370
11192 -163370 -143898 -101188 -52320 -68707 -11704 126548 28934 -129041 -208644 -212793 -157905
11181 -157905 -196442 -240117 -157156 -7427 -55073 -151379 -242031 -279416 -265053 -331863 -319314
11170 -319314 -190699 -72276 -121402 -157487 -141213 -290651 -272104 -208025 -102411 -49954 -63027
11159 -63027 -137609 -242292 -155093 -100868 -85911 -101746 -122591 -94295 -80911 -99448 -78370
11148 -78370 -102390 -162938 15574 142371 195452 96545 83251 66358 -67088 -218289 -151710
11137 -151710 -41655 -63209 -213007 -325944 -307800 -207411 -136755 -62458 -175718 -114798
11127 -114798 -96225 -139728 -106452 -19280 -104418 -206782 -230511 -191212 -188873 -107911 -131323
11116 -131323 -233451 -135267 -96615 -59940 -25927 -54934 -89576 -76177 -103260 -30028 17193
11105 17193 19241 -97022 -52585 68789 75024 45464 123879 107878 -5181 54705 66058
11094 66058 37789 2179 -28279 -11601 -129473 -220106 -262015 -288848 -87144 131236 28287
11083 28287 -251816 -406713 -430785 -484281 -415004 -193837 -26064 -109875 -201791 -244635 -205479
11072 -205479 -336670 -296270 -132090 -134335 -215576 -134299 -171784 -185817 -174851 -160588 -107035
11061 -107035 -47921 -186342 -191469 -114297 -63086 -58161 46162 37404 -39295 -109533 -221812
11050 -221812 -325684 -239645 -154432 -138436 -20075 24615 64225 115517 204522 382264 393016
11039 393016 348699 227126 214956 294308 414401 446321 303306 189538 302977 446027
11029 446027 485172 568141 613464 674622 585904 550786 603960 581965 583936 554601 478553 609356
11017 609356 754653 771436 739853 829166 838224 836378 883765 862540 831330 932155 870327
11006 870327 780940 782271 769312 693280 759867 780282 828137 804067 827951 750497 646994
10995 646994 633831 567678 456995 539811 648760 519353 382805 305290 246564 257377 355589
10984 355589 360755 255757 180265 208130 336734 307178 325586 246744 230275 234343 114487
10973 114487 65380 -24805 -43562 -13092 53366 6769 -95306 -147598 -156444 -123046 -33334
10962 -33334 -16376 -35433 51939 92136 175602 171965 117233 21230 -51582 8909 -46237 -49972
10950 -49972 -136980 -135396 -451 60509 -47840 32069 103321 95502 42276 -23927 45271 96087
10938 96087 24399 -119444 -126653 -67309 -184382 -168881 -162294 -224899 -289826 -276562 -162671
10927 -162671 -173466 -155169 -49141 -119786 -116510 -298812 -331786 -170599 16534 154545 175107
10916 175107 58383 15831 -39767 -83311 -176225 -216439 -207640 -62558 43090 -41056 269
10905 269 -46413 -130545 -208513 -227868 -263922 -141817 -7523 58505 87003 32961 -18610 931
10893 931 74618 -4760 -17727 -197029 -153880 -100977 -43041 -312 -80868 45629 104043 -14118
10881 -14118 -113814 -194651 -260367 -245421 -329373 -334102 -261988 -184241 -155363 -143826 -124463 -211978
10869 -211978 -255874 -191986 -202449 -142489 -127294 -223998 -222452 -122498 -38120 -22070 -75542 -112139
10857 -112139 -123224 -122534 -81105 -60147 -44517 -68035 -238502 -255414 -303769 -365714 -349025 -215201
10845 -215201 -152937 -69264 -110277 -140777 -74554 -70941 -98154 -126463 -185552 -345084 -471520
10834 -471520 -312736 -204930 -148833 -123196 -94577 -29198 65501 -74013 -204714 -239715 -86924
10823 -86924 20116 86891 90082 50584 -93105 -172538 -266422 -257209 -17296 77973 33532
10812 33532 -20839 -154196 -121627 -151860 -85579 -173441 -206806 -130806 3651 45638 70344
10801 70344 -2148 -13799 10829 -128729 -39577 93941 52266 22160 -107945 -68767 -50938
10790 -50938 -104461 -264745 -244851 -154076 -201157 -157028 -111577 -124028 -197770 -221121 -231719
$$ [...]
##END NTUPLES=NMR SPECTRUM
##END=
