##TITLE=Analysis number 320223
Compound Code cc 32714
Book Reference 486/22
Project Code adrs
Chemist Name simons
##JCAMPDX= 6.0         $$ Bruker NMR JCAMP-DX V2.0
##DATA TYPE= NMR SPECTRUM
##DATA CLASS= NTUPLES
##ORIGIN= Bruker BioSpin GmbH
##OWNER= nmr
$$ XWIN-NMR		Version 3.5
$$ Mon Jun 19 10:25:24 2006 GMT Daylight Time (UT+1h)  MAYBRIDGE\nmr@NMR_250MHZ
##.OBSERVE FREQUENCY= 250.131544655141
##.OBSERVE NUCLEUS= ^1H
##.ACQUISITION MODE= SIMULTANEOUS (DQD)
##.ACQUISITION SCHEME= undefined
##.AVERAGES= 16
##.DIGITISER RES= 18
##SPECTROMETER/DATA SYSTEM= dpx250
##.PULSE SEQUENCE= zg30
##.SOLVENT NAME= TFA
##.SHIFT REFERENCE= (INTERNAL, TFA, 0, 17.5255)
##AUDIT TRAIL= $$ (NUMBER, WHEN, WHO, WHERE, WHAT)
$$ ##TITLE= Audit trail, XWIN-NMR		Version 3.5
$$ ##JCAMPDX= 5.01
$$ ##ORIGIN= Bruker BioSpin GmbH
$$ ##OWNER= nmr
$$ C:\u/data/dgb/nmr/ADRS/1001/pdata/1/auditp.txt
$$ ##AUDIT TRAIL=  $$ (NUMBER, WHEN, WHO, WHERE, WHAT)
(   1,<2006-06-19 10:25:03.23 +100>,<MAYBRIDGE\nmr>,<NMR_250MHZ>,
      <created by zg, POWCHK disabled, PULCHK disabled
       configuration hash MD5:
       E2 DF 36 D8 04 B2 41 60 5A D7 A3 38 5A 4B D0 FE
       data hash MD5: 64K
       39 31 70 62 05 27 03 36 D2 33 AF AC BF 5F 43 49>)
(   2,<2006-06-19 10:25:15.76 +100>,<MAYBRIDGE\nmr>,<NMR_250MHZ>,
      <Start of raw data processing
       ef LB = 0.3 FT_mod = 6 PKNL = 1 SI = 32K 
       data hash MD5: 32K
       88 35 31 23 01 7C C8 AC 90 51 66 4E 94 33 9C BF>)
(   3,<2006-06-19 10:25:17.59 +100>,<MAYBRIDGE\nmr>,<NMR_250MHZ>,
      <apk 
       data hash MD5: 32K
       BC 9B 73 24 53 A2 D2 05 50 EE 5C 0E 4F EB 93 71>)
(   4,<2006-06-19 10:25:18.71 +100>,<MAYBRIDGE\nmr>,<NMR_250MHZ>,
      <abs ABSG = 5 
       data hash MD5: 32K
       BA 15 6B 0E D7 53 4D 57 7A 88 AF DC 19 E5 4B E9>)
$$ ##END=
$$ 
$$ hash MD5
$$ D4 30 6B 48 91 3F F7 A7 65 59 4A 6D 42 FC 9A 03
##$RELAX= 
##$RELAX= 
##$RELAX= 
##$RELAX= 
##$RELAX= 
##$RELAX= 
##$RELAX= 
$$ Bruker specific parameters
$$ --------------------------
##$DU= <C:\u>
##$EXPNO= 1001
##$NAME= <ADRS>
##$PROCNO= 1
##$TYPE= <nmr>
##$USER= <dgb>
##$AMP= (0..31)
100 100 100 100 100 100 100 100 100 100 100 100 100 100 100 100 100 100 
100 100 100 100 100 100 100 100 100 100 100 100 100 100 
##$AQSEQ= 0
##$AQ_mod= 3
##$AUNM= <au_zg>
##$AUTOPOS= <14 >
##$BF1= 250.13
##$BF2= 250.13
##$BF3= 250.13
##$BF4= 250.13
##$BF5= 500.13
##$BF6= 500.13
##$BF7= 500.13
##$BF8= 500.13
##$BYTORDA= 1
##$CFDGTYP= 0
##$CFRGTYP= 5
##$CHEMSTR= <none>
##$CNST= (0..31)
1 1 145 1 1 1 1 1 1 1 1 1 1 1 1 1 1 1 1 1 1 1 1 1 1 1 1 1 1 1 1 1 
##$CPDPRG= <>
##$CPDPRG1= <>
##$CPDPRG2= <>
##$CPDPRG3= <>
##$CPDPRG4= <mlev>
##$CPDPRG5= <mlev>
##$CPDPRG6= <mlev>
##$CPDPRG7= <mlev>
##$CPDPRG8= <mlev>
##$CPDPRGB= <>
##$CPDPRGT= <>
##$D= (0..31)
0 1 0 0 0 0 0 0 0 0.06 0 0 0 0 0 0 0.0002 0 0 0 0 0 0 0 0 0 0 0 0 0 0 
0 
##$DATE= 1150709102
##$DBL= (0..7)
120 120 120 120 120 120 120 120 
##$DBP= (0..7)
150 150 150 150 150 150 150 150 
##$DBP07= 0
##$DBPNAM0= <>
##$DBPNAM1= <>
$$ [...]
##$SUBNAM7= <"">
##$SUBNAM8= <"">
##$SUBNAM9= <"">
##$SW= 20.6930455092707
##$SWIBOX= (0..15)
0 0 3 0 0 0 0 0 0 0 0 0 0 0 0 0 
##$SW_h= 5175.983436853
##$TD= 65536
##$TD0= 1
##$TE= 295.16
##$TE2= 300
##$TE3= 300
##$TEG= 300
##$TL= (0..7)
0 120 120 120 120 120 120 120 
##$TP= (0..7)
150 150 150 150 150 150 150 150 
##$TP07= 0
##$TPNAME0= <>
##$TPNAME1= <>
##$TPNAME2= <>
##$TPNAME3= <>
##$TPNAME4= <>
##$TPNAME5= <>
##$TPNAME6= <>
##$TPNAME7= <>
##$TPOAL= (0..7)
0.5 0.5 0.5 0.5 0.5 0.5 0.5 0.5 
##$TPOFFS= (0..7)
0 0 0 0 0 0 0 0 
##$TUNHIN= 0
##$TUNHOUT= 0
##$TUNXOUT= 0
##$USERA1= <user>
##$USERA2= <user>
##$USERA3= <user>
##$USERA4= <user>
##$USERA5= <user>
##$V9= 5
##$VALIST= <valist>
##$VCLIST= <CCCCCCCCCCCCCCC>
##$VD= 0
##$VDLIST= <DDDDDDDDDDDDDDD>
##$VPLIST= <PPPPPPPPPPPPPPP>
##$VTLIST= <TTTTTTTTTTTTTTT>
##$WBST= 1024
##$WBSW= 4
##$XGAIN= (0..3)
0 0 0 0 
##$XL= 0
##$YL= 0
##$YMAX_a= 423791
##$YMIN_a= -492235
##$ZGOPTNS= <>
##$ZL1= 120
##$ZL2= 120
##$ZL3= 120
##$ZL4= 120
##$ABSF1= 17.52546
##$ABSF2= -3.167734
##$ABSG= 5
##$ABSL= 3
##$ALPHA= 0
##$AQORDER= 0
##$ASSFAC= 0
##$ASSFACI= 0
##$ASSFACX= 0
##$ASSWID= 0
##$AUNMP= <proc_1d>
##$AZFE= 0.1
##$AZFW= 0.1
##$BCFW= 0
##$BC_mod= 0
##$BYTORDP= 0
##$COROFFS= 0
##$CY= 12.5
##$DATMOD= 1
##$DC= 0
##$DFILT= <>
##$DTYPP= 0
##$F1P= 14.0000005364418
##$F2P= -0.99999901652339
##$FCOR= 0.5
##$FTSIZE= 32768
##$FT_mod= 6
##$GAMMA= 0
##$GB= 0
##$INTBC= 1
##$INTSCL= 1
##$ISEN= 128
##$LB= 0.3
##$LEV0= 0
##$LPBIN= 0
##$MAXI= 10000
##$MC2= 0
##$MEAN= 0
##$ME_mod= 0
##$MI= 0
##$NCOEF= 0
##$NC_proc= -4
##$NLEV= 6
##$NOISF1= 0
##$NOISF2= 0
##$NSP= 0
##$NTH_PI= 0
##$NZP= 0
##$OFFSET= 17.52546
##$PC= 1
##$PHC0= 168.3759
##$PHC1= 3.190785
##$PH_mod= 1
##$PKNL= yes
##$PPARMOD= 0
##$PSCAL= 4
##$PSIGN= 0
##$REVERSE= no
##$SF= 250.129749008251
##$SI= 32768
##$SIGF1= 0
##$SIGF2= 0
##$SINO= 400
##$SIOLD= 32768
##$SREGLST= <1H.TFA>
##$SSB= 0
##$STSI= 32768
##$STSR= 0
##$SW_p= 5175.98343685301
##$SYMM= 0
##$S_DEV= 0
##$TDeff= 65536
##$TDoff= 0
##$TI= <Analysis number 999999
Compound Code 99
Book Reference 9
Project Code 9>
##$TILT= no
##$TM1= 0
##$TM2= 0
##$TOPLEV= 0
##$USERP1= <user>
##$USERP2= <user>
##$USERP3= <user>
##$USERP4= <user>
##$USERP5= <user>
##$WDW= 1
##$XDIM= 32768
##$YMAX_p= 344922186
##$YMIN_p= -1039233
$$ End of Bruker specific parameters
$$ ---------------------------------
##NTUPLES= NMR SPECTRUM
##VAR_NAME=  FREQUENCY,     SPECTRUM/REAL,   SPECTRUM/IMAG
##SYMBOL=    X,             R,               I
##VAR_TYPE=  INDEPENDENT,   DEPENDENT,       DEPENDENT
##VAR_FORM=  AFFN,          ASDF,            ASDF
##VAR_DIM=   32768,         32768,           32768
##UNITS=     HZ,            ARBITRARY UNITS, ARBITRARY UNITS
##FACTOR=    0.157963299565203, 1,           1
##FIRST=     4383.63873334966, 0,            0
##LAST=      -792.344703503352, 0,           0
##MIN=       -792.344703503352, -1039233,    0
##MAX=       4383.63873334966, 344922186,    0
$$ Real data points
##PAGE= N=1
##DATA TABLE= (X++(R..R)), XYDATA
$$ [...]
30787c4588k1434M066L5573j0987l432J3091k6669l0631L8225L8845J1712q132
$$ -34588 -56022 -51956 -16383 -27370 -30802 -17711 -44380 -75011 -36786 2059 13771 5639
30775E639m0771m852O475K2989o679N7414L3268q825m365k0908n8181k6722J9459
$$ 5639 -35132 -39984 -33509 -10520 -17199 40215 73483 64658 60293 39385 -18796 -45518 -26059
30762b6059Q7219J6210Q062j353j7882l0525M1971m6342k7680J104n80J7773k5734
$$ -26059 61160 77370 85432 84079 66197 35672 77643 31301 3621 4725 4145 21918 -3816
30749c816k8618O4596M4542K5844N6622q132m5974l1656n6511o3264J2015P760
$$ -3816 -32434 32162 76704 102548 159170 151038 105064 73408 16897 -46367 -34352 -26592
30737b6592M0884k0432r242N2926K8648L4233L6130J6294J3346p0392n0287L8205
$$ -26592 14292 -6140 -15382 37544 66192 100425 136555 152849 166195 95803 45516 83721
30725H3721j0205m5449k9763m4736j7003L6137k6l0301L2671l4510l4929M1115
$$ 83721 73516 28067 -1696 -46432 -63435 -27298 -27324 -57625 -24954 -59464 -94393 -53278
30713e3278J8896K6160L064K7581l9720q271L7589o768k3308J241p016l932n7803
$$ -53278 -34382 -8222 -5158 22423 -17297 -25568 12021 5253 -18055 -16814 -23830 -27762 -85565
30700h5565m1523L8227Q2649l1819r752J3444Q634m0171K4465J4009k7231n580
$$ -85565 -127088 -88861 -6212 -38031 -47783 -34339 -25705 -65876 -41411 -27402 -54633 -60213
30688f0213K5321O1137J9915j7175n7691p6231o4131K0549N6186J8328R648k3885
$$ -60213 -34892 26245 46160 28985 -28706 -104937 -169068 -148519 -92333 -74005 -64357 -88242
30676h8242K205L292J5655N2956J5204N3127L012r5364L4146K5465M6239q073
$$ -88242 -86037 -82745 -67090 -14134 1070 54197 57209 -38155 -4009 21456 67695 59622
30664E9622o489l1408m5296m6265k1422K0236O0414M08l2082J4009L4897k2083
$$ 59622 53133 21725 -23571 -69836 -91258 -71022 -10608 -10200 -42282 -28273 6624 -15459
30652a5459o38K9801k254K1071L3073N915n2720p9385j86N2649K1074k5876L742
$$ -15459 -16097 13704 11450 32521 65594 71509 18789 -60596 -60782 -8133 12941 -12935 -9193
30639i193J4435j1016J9697l7642K4004P7076m7079m6600k1538j0532k1264M1413
$$ -9193 5242 -5774 13923 -23719 285 77361 30282 -16318 -37856 -48388 -69652 -28239
30627b8239L6359p410Q543m4765k851K3868o281L9754J4146n0592k1874L9533
$$ -28239 8120 710 9253 -35512 -38363 -14495 -20776 18978 33124 -17468 -39342 191
30615A91J3805J2976M633N0133J1726N847m3439L892k75l0942m4289p2040l9985
$$ 191 13996 26972 31605 81738 93464 99311 55872 59764 59489 28547 -15742 -87782 -127767
30602a27767k6827N6659N9654k2695L8909N3076j5232n1032J4567J3800J0873
$$ -127767 -154594 -97935 -38281 -60976 -22067 31009 15777 -35255 -20688 -6888 3985
30591C985j1313j8433k7739l3501M8332M9025L1368N6392l1389p649l1589o085
$$ 3985 -7328 -25761 -53500 -87001 -38669 10356 41724 98116 66727 59078 27489 21404
30579B1404m4873J8641K0169j8270M617j7493K2757P2595j6269k3179l5457J2771
$$ 21404 -23469 -4828 15341 -2929 1688 -15805 6952 79547 63278 40099 4642 17413
30567A7413R0298k3419j02334m4476o5033L1004Q6583N9576o262L939K312J7626
$$ 17413 107711 84292 -18042 -62518 -127551 -96547 -9964 49612 43350 47289 49601 67227
30555F7227j4914n0681j7815J1059K8403m332k0483j6034N4409K7600J3612k651
$$ 67227 52313 1632 -16183 -5124 23279 18947 -1536 -17570 36839 64439 78051 75400
30543G5400K9688K0205p164p8035q7251k8749j5821k8537Q615L4860P5877k4490
$$ 75400 105088 125293 118129 40094 -47157 -75906 -91727 -120264 -111649 -76789 -912 -25402
30531b5402m0748J6675N8091o39M6724J4299N7519L8752k0135m7987r325j1275
$$ -25402 -66150 -49475 8616 7977 54701 69000 126519 165271 145136 97149 87824 76549
30519G6549m0420L2961k0454j8527k451K9393l1774n0478O907J2946j0799m3570
$$ 76549 36129 69090 48636 30109 27658 57051 25277 -25201 -18294 -5348 -16147 -59717
30507e9717j9675l4770J7046K8656P9973j7923l2370n735O7013m1743l7843L5781
$$ -59717 -79392 -114162 -97116 -68460 11513 -6410 -38780 -44515 22498 -19245 -57088 -21307
30495b1307o0130l6656M390N3130R7816O0190m8010n8391K1354l086j6993m8341
$$ -21307 -81437 -118093 -113703 -60573 37243 97433 49423 -8968 12386 9300 -7693 -56034
30483e6034K8520L2937N3059m1335M9696P9128J4596o2546r9319R4042O4732k7278
$$ -56034 -27514 5423 58482 17147 66843 145971 160567 98021 -1298 92744 157476 130198
30471A30198m4496n9408n674j774J2193L449l2475k8176q27M7894N6895l849p6761
$$ 130198 85702 26294 20620 18846 31039 34488 2013 -26163 -26990 20904 77799 73950 -2811
30458b811J187J3391o6403m482L260J04141p057m3896n477L5307m5640n8750K5463
$$ -2811 -1624 11767 -54636 -59118 -55858 48283 41226 -2670 -8147 27160 -18480 -77230 -51767
30445e1767L7103K0183M7517K6144m3660o2917M2736m6150r20P1335N0752m9953
$$ -51767 -14664 5519 53036 79180 35520 -27397 15339 -30811 -31731 39604 90356 40403
30433D0403j05035k2236J02083L8832k4812O833P979L1453j6414J5031M4794j1061
$$ 40403 -64632 -86868 15215 54047 29235 36068 44047 75500 59086 74117 118911 107850
30421A07850j0259p635n1980n4583l1353l1144j464J1858O553J6090K627n9684
$$ 107850 97591 89956 37976 -16607 -47960 -79104 -80568 -68710 -62157 -46067 -43440 -103124
30409a03124n0901K4581R0436N3681K712m527M1202L4050n517j03162n350L3098
$$ -103124 -154025 -129444 -39008 14673 17385 12858 54060 88110 82593 -20569 -25919 7179
30397G179K9701K5486J6432L804o6164o0323l367k971o094N2609K1999J2905M287
$$ 7179 36880 62366 78798 82602 16438 -43885 -47252 -50223 -56317 -3708 18291 31196 35483
30384C5483n66m2405k9713k1162p739K9845L5658J8329j4255Q281P910m9221n3381
$$ 35483 34917 -7488 -37201 -58363 -66102 -36257 -599 17730 3475 11756 19666 -29555 -82936
30371h2936N293N9292o228K5381m6890j1403K9988Q2234N4914j08389m9851L5417
$$ -82936 -77643 -18351 -24579 802 -46088 -57491 -27503 54731 109645 1256 -48595 -13178
30359a3178N5166m2913n3857m1195O5553L226j7242L9566L0619j5976k0565J9461
$$ -13178 41988 -925 -54782 -95977 -30424 -27198 -44440 -4874 25745 9769 -10796 8665
30347H665O1197j6243l8125n6078l1463K9040j2464J0374K0539J8362M4214J5475
$$ 8665 69862 53619 15494 -40584 -72047 -43007 -55471 -45097 -24558 -6196 38018 53493
30335E3493r377n4453k4924p324M628M6929q199J725L6433j6393k6243J8206m1996
$$ 53493 44116 -10337 -35261 -42585 -37957 8972 773 2498 38931 22538 -3705 14501 -27495
30322b7495N032J01964K7678m4928p2409n7483J2197J2414m0476k749O599O0757
$$ -27495 -22463 79501 107179 62251 -10158 -67641 -55444 -43030 -83506 -86255 -79656 -18899
30310a8899L5737J2299k0602N488j1866J7833j78M9450j1456k6454m3786l2519
$$ -18899 16838 29137 8535 14023 2157 19990 19812 69262 57806 31352 -12434 -44953
30298d4953L3204l310J646p0885l9186L6996N6117K9715M1859k8888k1431P7977
$$ -44953 -11749 -15059 -13413 -84298 -123484 -86488 -30371 -656 41203 12315 -9116 68861
30286F8861j4255k4451Q698n5176j6963L5735M7248M2746Q329m6695J4828m2967
$$ 68861 54606 30155 38853 -16323 -33286 2449 49697 92443 100772 54077 68905 25938
30274B5938j6648p767l8513J0836m879K5325K6028k9682k0302k0078K5526n41
$$ 25938 9290 1523 -36990 -26154 -31033 -5708 20320 -9362 -29664 -49742 -24216 -24757
30262b4757n812P331k8490k5936M528J9656J2108P006J7143K8150P521R052O3140
$$ -24757 -30569 -23238 -51728 -77664 -73136 -53480 -41372 -34366 -17223 10927 18448 27500 90640
30249I0640M02o2483L4664J223l3316J0959l3025M40q3415n189L9560J4921K398
$$ 90640 91042 28559 63223 64446 31130 42089 9064 9504 -73911 -79100 -39540 -24619 -22221
30236b2221M270p25n0340j7287K719J0221k5435M2765P4628r617l7687R71J16727
$$ -22221 -17951 -18676 -69016 -86303 -83584 -73363 -98798 -56033 18595 8978 -28709 -27738 88989
30223H8989L0689n028n6124k3838o0295L7803J0263n5712k1069l1022M1424O4340
$$ 88989 119678 114650 58526 34688 -25607 12196 22459 -33253 -54322 -85344 -43920 20420
30211B0420J0706K7333j4042k2887k8359K4423j838k4039o8986J1442O4089K0427
$$ 20420 31126 58459 44417 21530 -6829 17594 15756 -8283 -77269 -65827 -1738 18689
30199A8689K454k5237J3775j6783P432P0521r856m9504l1076M614L7804K8893
$$ 18689 21143 -4094 9681 -7102 330 70851 60995 11491 -19585 -14971 22833 51726
30187E1726l886P43k1864p8856J0726L2996o0004n7688M7351K2823L930J79O6380
$$ 51726 47840 48583 26719 -52137 -41411 -8415 -68419 -126107 -78756 -55933 -52003 -51824 14556
30174A4556J9660K5333N9p795l4822k3742l0708j8460O803m440K8775K2082k2797
$$ 14556 34216 59549 59608 51813 16991 -6751 -37459 -55919 -49116 -53556 -24781 -2699 -25496
30161b5496P203J7339J0118m025K6960m4285j4721J1902Q182K3886J4075M3584
$$ -25496 -18293 -954 9164 5139 32099 -12186 -26907 -15005 -6823 17063 31138 74722
30149G4722J3118p6883J2959L3520q24l3006n7725K6705O0876Q952j1524j7262
$$ 74722 87840 10957 23916 57436 56612 23606 -34119 -7414 53462 62414 50890 33628
30137C3628R912N180l4915M1944M6557j09219l6738J20585k0212p6117q592k1797
$$ 33628 43540 48720 13805 55749 102306 -6913 -43651 76934 56722 -19395 -27987 -49784
30125d9784L0252J2429k1429j4238K1581Q5347R063M1149l9186o5525j942J9592
$$ -49784 -19532 -7103 -28532 -42770 -21189 64158 73221 114370 75184 9659 7717 27309
30113B7309K8J6911L6956j1419m9284n6765k4410J5654M3826q291j4281J6745
$$ 27309 27337 44248 81204 69785 20501 -36264 -60674 -45020 -1194 -9485 -23766 -7021
30101g021n459n7855o2902J3146L2155J2193L2951k589j9831O35K4276K9559J7254
$$ -7021 -12480 -70335 -133237 -120091 -87936 -75743 -42792 -45381 -65212 -64577 -40301 -10742 6512
30088F512J5093k9819p2879l726O1444p311j2752J1651L4108l1616m915N8372
$$ 6512 21605 -8214 -81093 -84819 -23375 -30686 -43438 -31787 2321 -29295 -34210 24162
30076B4162l095N985l5954m2444N6297m549k480J8988p707j7570p136K9363Q854
$$ 24162 21067 27052 -8902 -51346 4951 402 -2078 16910 9203 -8367 -15503 13860 22714
30063B2714K5734L1384K343p8728q754o837j0522k5971J3873J9993J3395O4070
$$ 22714 48448 79832 82175 3447 -5307 -12144 -22666 -48637 -34764 -14771 -1376 62694
30051F2694L62r581o0707o8231Q2392L0737k7442K8171k7317k1650o649K052r174
$$ 62694 63056 53475 -7232 -75463 6929 37666 10224 38395 11078 -10572 -17221 -15169 -24343
30038b4343n4352R3445M0308j4991N901J592O6177L775o1678l8267l5652L1291
$$ -24343 -78695 14750 55058 40067 45968 47560 113737 117512 55834 17567 -18085 13206
30026A3206O61m0041k161K82o0188p307J8261O618m2209J3050Q5138N4792k9358
$$ 13206 13867 -26174 -28335 -28053 -88241 -95548 -77287 -70669 -112878 -99828 -14690 40102 10744
30013A0744m5872K4221M3765J9061l8901o5032M6075l8440M0477L1912j7032n29
$$ 10744 -35128 -10907 32858 51919 13018 -52014 -5939 -44379 -3902 28010 10978 10449
30001A0449n706q112l301M0202R373L8592j1318m3195j5006K3056J5331M5441
$$ 10449 4743 -3369 -6670 33532 42905 81497 70179 26984 11978 35034 50365 95806
29989I5806k7478J6946k3482n4972o0763J3085o4821n9336M7844K9884L5998p141
$$ 95806 68328 85274 61792 6820 -53943 -40858 -105679 -165015 -117171 -87287 -51289 -58430
29977e8430o602N5172L7063k671l6451O560k4850l199M046O49m639L8795J9264
$$ -58430 -65032 -9860 27203 24532 -11919 -5359 -30209 -33408 -29362 -28713 -33352 5443 24707
29964B4707l413p231k0717p737J0343J23730n5111j01434k6563O2984N9800o7615
$$ 24707 21294 14063 -6654 -14391 -4048 119682 64571 -36863 -63426 -442 59358 -8257
29952h257m8833P7274L2311Q350p322m7975p6828K4238K9089J0513K1800m53j8594
$$ -8257 -57090 20184 52495 60845 53523 5548 -71280 -47042 -17953 -7440 14360 13907 -4687
29939d687k8930k8446k0103R399l0806J1996l0898J4767J9142r871L1272N7234
$$ -4687 -33617 -62063 -82166 -72767 -103573 -91577 -122475 -107708 -88566 -98437 -67165 -9931
29927i931p3080j9684K2024J4529O95j8608J0336k096j7904n130K6071N0144j1466
$$ -9931 -83011 -102695 -80671 -66142 -65447 -84055 -73719 -75815 -93719 -98849 -72778 -22634 -34100
29914c4100R250M3812L7597q7660m5519P6140J9445j447R031r718K8820o3112
$$ -34100 -24850 18962 56559 -31101 -76620 -480 18965 17518 26549 16831 45651 -17461
29902a7461q3023L0017n55l3707N4075N8763N9130k5771l2467k0819n493K6718
$$ -17461 -100484 -70467 -71022 -104729 -50654 8109 67239 41468 9001 -11818 -17311 9407
29890I407j207k0950j3483p8833l8238N2869L2010J3486l6472m264n202K044J8051
$$ 9407 8200 -12750 -26233 -105066 -143304 -90435 -58425 -44939 -81411 -85675 -90877 -88833 -70782
29877g0782L9109N6624k7381J9479R3469j5368p2081l1344o6950n1639M8693L4177
$$ -70782 -31673 24951 -2430 17049 110518 95150 23069 -8275 -75225 -126864 -78171 -43994
29865d3994j904m7534q0234M3221M3033k1687N1488J4125k5247K6064K4050N2069
$$ -43994 -45898 -93432 -173666 -130445 -87412 -109099 -57611 -43486 -68733 -42669 -18619 33450
29853C3450o315l3691j6424l4987Q3179Q0914n102o5921L1836N349n637o5816
$$ 33450 27135 -6556 -22980 -57967 25212 106126 101024 35103 66939 72288 66651 835
29841H35K3939L8787k3570L6094n317j578j8791J2916n931k1797m8240l1151k7137
$$ 835 24774 63561 39991 76085 70768 69190 50399 63315 57384 35587 -12653 -43804 -70941
29828g0941nl1557L7403K8374J0727J07937k5658k2311Q902l471m6460j5888M9040
$$ -70941 -70946 -102503 -65100 -36726 -25999 81938 56280 33969 42871 39400 -7060 -22948 26092
29815B6092M1878J7832J7240r3303k8269j9888j3185M3747k6346L2935l7984m2565
$$ 26092 67970 85802 103042 9739 -18530 -38418 -51603 -7856 -34202 -1267 -39251 -81816
29803h1816L5058r680m526l3185K0349j6002j1674O2745J4166N3343M6730n3286
$$ -81816 -46758 -56438 -60964 -94149 -73800 -89802 -101476 -38731 -24565 28778 75508 22222
29791B2222j0607R593r374K757J4640J5315J6839p4106n4264N2793K3473q170
$$ 22222 11615 21208 11834 14591 29231 44546 61385 -12721 -66985 -14192 9281 1111
29779A111N5942r900N921p0636n0157L1195m090K2826N055l0152p928L1008L9928
$$ 1111 57053 47153 53074 -17562 -67719 -36524 -40614 -17788 -12733 -42885 -50813 -19805 20123
29766B0123J989j5309k3570N2958O6522l619q0238m8827m6784k6243L3440N2249
$$ 20123 22112 6803 -16767 36191 102713 99094 18856 -29971 -76755 -102998 -69558 -17309
29754a7309J7155l9833J6838M8453L1049l1776p676O3663j6054l4951j3805m2978
$$ -17309 -154 -39987 -23149 25304 56353 24577 16901 80564 64510 29559 15754 -27224
29742b7224K9731N096o2299l5480J778L1819J2348k7440l1484O2398K4815J4663
$$ -27224 2507 7603 -54696 -90176 -88398 -56579 -44231 -71671 -103155 -40757 -15942 -1279
29730a279L8834o145l3530p0120K3353j0330J2814J566J2297K1011L2240k0731
$$ -1279 37555 31410 -2120 -72240 -48887 -59217 -46403 -44837 -32540 -11529 20711 -20
29718b0J3374m035J8886M1780J9748P348k1626m8626M111j5490k8060k6641l523
$$ -20 13354 9319 28205 69985 89733 97081 75455 26829 30940 15450 -12610 -39251 -42774
29705d2774m0235l3061J4910P717K3673L1187q515P2674l4477Q276O683k6446
$$ -42774 -83009 -116070 -101160 -93443 -69770 -38583 -47098 25576 -8901 -625 6058 -20388
29693b0388n7628m1009M9956l0441P0863O3122M6462J7133n1638K2272K1720k3888
$$ -20388 -78016 -119025 -69069 -99510 -28647 34475 80937 98070 46432 68704 90424 66536
29681F6536q136K2654o0130l3979k1029r0597N0969O4490m3409o7126j9138M4172
$$ 66536 58400 81054 20924 -13055 -34084 -124681 -73712 -9222 -52631 -119757 -138895 -94723
29669i4723N9247N8870L7635k3148o8692j98Q784J2069n8256j6900P1346L5011
$$ -94723 -35476 23394 61029 37881 -30811 -31009 -22225 -10156 -68412 -85312 -13966 21045
29657B1045l2178q718k8093j0010J8536j6972k9179L5319k664K0541P4656K7095
$$ 21045 -11133 -19851 -47944 -57954 -39418 -56390 -85569 -50250 -52914 -32373 42283 69378
29645F9378l834m8401q5298k1j4964n9523Q9521J2517n6120j428K980l4224O1033
$$ 69378 65544 17143 -68155 -68176 -83140 -142663 -53142 -40625 -96745 -98173 -95193 -129417 -68384
29632f8384J5773K2053M3129J2731Q7392K2009p9844m9628N8521P7319l065o7585
$$ -68384 -52611 -30558 12571 25302 112694 134703 54859 5231 63752 141071 138006 70421
29620G0421k0794n314k7267K5510r99j7620K4314p8013m4891J6803M2979r774
$$ 70421 49627 44313 17046 42556 41557 23937 48251 -29762 -74653 -57850 -14871 -24645
29608b4645k4389m8694q194L0194o206P9582j0654L0470O0090j2087m1812m2485
$$ -24645 -49034 -97728 -105922 -75728 -81934 -2352 -13006 17464 77554 65467 23655 -18830
29596a8830l0846J0999j8657L4774Q583k4322J116N5541L3104k2289k5561J2509
$$ -18830 -49676 -38677 -57334 -22560 -13977 -38299 -37183 18358 51462 29173 3612 16121
29584A6121K9033n4381K1200K5358J4405o0096J5233M0498L2133m764j4767J4465
$$ 16121 45154 -9227 11973 37331 51736 -8360 6873 47371 79504 74740 59973 74438
29572G4438l1918j02761l0827N7125Q0666n0859j257j4272L9554K7350o1204n23
$$ 74438 42520 -60241 -91068 -33943 46723 -4136 -5393 -19665 19889 47239 -13965 -14488
29560a4488l9687J9916O8761L5806q0561o0850K613m251m904K1410L7006J2756
$$ -14488 -54175 -34259 34502 70308 -10253 -71103 -68490 -72741 -77645 -56235 -19229 -6473
29548f473M3777N959J6068l5511J0171N4314j6096j0632o709q258K9698L3781
$$ -6473 37304 43263 59331 23820 33991 88305 72209 61577 54868 46610 76308 110089
29536A10089P308m3527j11901j6170p3642L3509M4025j9832j3994P1088P7915
$$ 110089 117397 73870 -38031 -54201 -127843 -94334 -50309 -70141 -84135 -13047 64868
29525F4868L432m0114m2711q331j8398m899p0379K408O1267q199L592N9694L3837
$$ 64868 68300 28186 -14525 -22856 -41254 -46153 -116532 -114124 -52857 -61056 -57464 2230 36067
29512C6067P535J3873k704M4495N522m8461o9230l1385j5624L1620J5077K0599
$$ 36067 43602 57475 54771 99266 104788 56327 -12903 -44288 -59912 -28292 -13215 7384
29500G384j8231J3094j7546k9655n396K4437M8738J7754P893p421r25m3354L4276
$$ 7384 -10847 2247 -15299 -44954 -50350 -25913 22825 40579 48472 41051 40126 -3228 31048
29487C1048J9945j249M6368J7216j9013l8898j314l7190K318L6510L2384p32l535
$$ 31048 50993 49744 96112 113328 94315 55417 54103 16913 19231 55741 88125 87393 83858
29474H3858l8390j9064o2601P8083J9542l3650m3703j0174J7378j2177k8698J6962
$$ 83858 45468 26404 -36197 41886 61428 27778 -15925 -26099 -8721 -20898 -49596 -32634
29462c2634M0008k4247J5741K9660k8843l4534J1526l644p1793j6169j4960J7721
$$ -32634 7374 -16873 -1132 28528 -315 -34849 -23323 -26967 -98760 -114929 -129889 -112168
29450a12168L3358M0671L3274O2409K3980l7035J3318j196k66j8775l5858p537
$$ -112168 -78810 -38139 -4865 57544 81524 44489 57807 56611 56345 37570 1712 -5825
29438e825j2439j2812R916R219P607P5156J254J6489M1721k8601p9277j0661m4132
$$ -5825 -18264 -31076 -21160 -11941 -4334 70822 72076 88565 130286 101685 22408 11747 -32385
29425c2385K6934J1497K4045R834n0683M3706K7583j670l3107l4240k1471o305
$$ -32385 -5451 6046 30091 39925 -10758 32948 60531 58861 25754 -8486 -29957 -36262
29413c6262K0926j6633L2817M0064j4736n0469K0856P97q3688m3190J03500O927
$$ -36262 -15336 -31969 848 40912 26176 -24293 -3437 -2640 -86328 -129518 -26018 -19091
29401a9091m653k6124K8109J3429m261K2880J761k5732j6L4482j7232p1251J070
$$ -19091 -23744 -49868 -21759 -8330 -12591 10289 12050 -13682 -13698 20784 3552 -67699 -66629
29388f6629M7054k3733P311n8105n4108K8574P8216m804k7612k7680l5889O312
$$ -66629 -19575 -43308 -35997 -94102 -148210 -119636 -41420 -46224 -73836 -101516 -137405 -131093
29376a31093M6444K0617m667L4321k7212J9579L2771j21788j3317Q3793L3647
$$ -131093 -84649 -64032 -68699 -34378 -61590 -42011 -9240 -131028 -144345 -60552 -26905
29365b6905M808L9588K6898l0070o0116J5305n005K092O2676P861j9358L4027
$$ -26905 -22097 17491 44389 14319 -45797 -30492 -35497 -33405 29271 37132 17774 51801
29353E1801R785j4774j1558k4791n6079L0176N1584k1894q8142j6326N2831k8762
$$ 51801 61586 46812 35254 10463 -45616 -15440 36144 14250 -73892 -90218 -37387 -66149
29341f6149O8243K5667K810K5091m1829n1449K6786N7774j7671J6106m4549p4692
$$ -66149 2094 27761 30571 55662 13833 -37616 -10830 46944 29273 45379 830 -73862
29329g3862r3858J471L0696Q991O9598J09150J2063m2015j1380K997p9209k3476
$$ -73862 -167720 -166249 -135553 -126562 -56964 52186 64249 22234 10854 13851 -65358 -88834
29317h8834j7214j8248m02L0311o801j5356r679O5999J5918j0667M2524N2355
$$ -88834 -106048 -124296 -124698 -94387 -101188 -116544 -126223 -60224 -44306 -54973 -12449 39906
29305C9906K0471o0510n9729m4949p090O7287K8651l8882O960J3511N575J3088
$$ 39906 60377 -133 -59862 -104811 -111901 -44614 -15963 -54845 -47885 -34374 -28799 -15711
29293a5711N7796R061n3605P276J6754n5945o3961M8832N1556N865R453L467M699
$$ -15711 42085 51146 -2459 4817 21571 -34374 -98335 -49503 2053 7918 17371 20838 25537
29280B5537n4137l758P7930j128l2201J8941k0329k4882M780J3488p039K3220
$$ 25537 -28600 -32358 45572 44444 12243 31184 10855 -14027 -9247 4241 -2798 20422
29268B0422J8886k3415m7170n0231L0741N040l1904j1848N2138N715L7269K5155
$$ 20422 39308 15893 -31277 -81508 -50767 -45727 -77631 -89479 -37341 -31626 5643 30798
29256C0798L0821m5758m8469N793j8488R770J4693J7222P0939k2365k7290j2139
$$ 30798 61619 15861 -32608 -26815 -45303 -35533 -20840 -3618 67321 44956 17666 5527
29244E527j758o81L0151M1087l3772k7811m9723J0008K4972j8088k900J2900K1520
$$ 5527 3769 3088 33239 74326 40554 12743 -36980 -26972 -2000 -20088 -22988 -10088 11432
29231A1432J6775k9800o3013q252K5407O5396K1675j0711m3844k4425m9014J0779
$$ 11432 28207 -1593 -64606 -72858 -47451 17945 39620 28909 -14935 -39360 -88374 -77595
29219g7595Q6277j8998K6145M0127l496j4754J855L09k4069m1658J9935o966J1242
$$ -77595 8682 -10316 15829 55956 52460 37706 39561 39870 15801 -25857 -5922 -12888 -1646
29206a646k5987K1595J190J389n795l3186O750M341J0634M3393K1614n1305j2072
$$ -1646 -27633 -6038 -4848 -3459 -9254 -42440 -35690 -31349 -20715 22678 44292 -7013 -19085
29193a9085J5202N0545R368n0960k0152N81K653J3680q474R013l5480o7569l136
$$ -19085 -3883 46662 56030 5070 -15082 -14501 -11848 1832 -6642 2371 -33109 -100678 -103814
29180a03814L6923M7878p985J3208M6856n4051m9358N1794L046J8238j3614n6978
$$ -103814 -66891 -19013 -26998 -13790 33066 -20985 -70343 -18549 -15503 2735 -10879 -67857
29168f7857K7611Q2351J1711j3551r321M338M4707l4497m3143q159L257l9915
$$ -67857 -40246 42105 53816 40265 30944 35282 79989 45492 2349 -5810 -2553 -42468
29156d2468K7223L9030m6487o16J1913P8590J4963j4797o4995k3415l7034n7404
$$ -42468 -15245 23785 -22702 -23318 -11405 67185 82148 67351 2356 -21059 -58093 -115497
29144a15497N484O1150J7787J9992K8630J446J6290q40l5579n028Q1398N7399
$$ -115497 -110013 -48863 -31076 -11084 17546 18992 35282 34442 -1137 -6165 75233 132632
29132A32632k5920N1927m2569r4024p6435J8640P8266j5009m3149O539J2027j6471
$$ 132632 106712 158639 116070 22046 -54389 -35749 42517 27508 -15641 -9102 2925 -13546
29120a3546k3998N947J1142p0553K9433N6701J6715k4993j2248M8915l248l7281
$$ -13546 -37544 -31597 -20455 -91008 -61575 -4874 11841 -13152 -25400 23515 20267 -17014
29108a7014O157M3040l7715J1798o4554l6973N529L7632L1624N7931n1239P132
$$ -17014 -10857 32183 -5532 6266 -58288 -95261 -89732 -52100 -20476 37455 -13784 -6652
29096f652K3317r600m5818R534N2025N6289o7996l0374n3057l0439N4002P2576
$$ -6652 16665 7065 -38753 -29219 22806 79095 11099 -19275 -72332 -102771 -48769 23807
29084B3807K2198M1235l331k9931k9692n0683K436K9437N0690m469k8595r85l4062
$$ 23807 46005 87240 83909 53978 24286 -26397 -23961 5476 56166 51697 23102 22117 -11945
29071a1945k7882m5540o250J3910N8701l6322j7520r040J1438J2347K3691j775
$$ -11945 -39827 -85367 -91617 -77707 -19006 -55328 -72848 -81888 -70450 -58103 -34412 -36187
29059c6187Q281R545K0664m6127K1484L4802l9385n9111l0752J4484J354J6338
$$ -36187 -27906 -18361 2303 -43824 -22340 12462 -26923 -86034 -116786 -102302 -100948 -84610
29047h4610O7429N9777L9939j7237l4457n895k5922o2683J4945M7399M2816j5664
$$ -84610 -17181 42596 82535 65298 30841 24946 -976 -63659 -48714 -1315 41501 25837
29035B5837o492K6466k3780k5269P769n5611J5356L2946p567o844m6499n1620
$$ 25837 19345 45811 22031 -3238 4531 -51080 -35724 -2778 -10345 -17189 -63688 -115308
29023a15308n281P2940J5037o0015m721J5309L8156J8819K2949m6794o8055O181
$$ -115308 -120589 -47649 -32612 -92627 -97348 -82039 -43883 -25064 -2115 -48909 -116964 -110783
29011a10783P5967N1373P1348K2272l2056k558o2321j2798K73j1541k7811P4656
$$ -110783 -34816 16557 87905 110177 78121 75563 13242 444 717 -10824 -38635 36021
28999C6021j4308r590M3690N0221l8389j7562k3453n9677N76K0331K4543k4634
$$ 36021 21713 12123 55813 106034 67645 50083 26630 -33047 -32471 -12140 12403 -12231
28987a2231J7382O84o0855k7981r687L0680P7307j0610l1776m2461L6449P3316
$$ -12231 5151 5835 -55020 -83001 -92688 -62008 15299 4689 -27087 -69548 -33099 40217
28975D0217K8540J6215Q0437j9002p1198p7565n4877R451N1492j7888L7266N0444
$$ 40217 68757 84972 165409 146407 75209 -2356 -57233 -47782 3710 -14178 23088 73532
28963G3532O390K7512k5543r8097l0740J2710K7972k6138l3643N8532L3104L1374
$$ 73532 79922 107434 81891 -16206 -46946 -34236 -6264 -32402 -66045 -7513 25591 56965
28951E6965l5529j6578J4067J715j3431J9752J3260l4870n4785k2564L1026L9865
$$ 56965 21436 4858 18925 20640 7209 26961 40221 5351 -49434 -71998 -40972 -1107
28939a107m961M3053m7906J5136L9039j1224r1596j3963K1728O9113L6932m0097
$$ -1107 -6068 36985 -10921 4215 43254 32030 -59566 -73529 -51801 17312 54244 14147
28927A4147J5558n7027j4465Q248L6801K9276k7084n5370M7357N3051k1908J8785
$$ 14147 29705 -27322 -41787 -33539 3262 32538 5454 -49916 -2559 50492 28584 47369
28915D7369K6508O5705M6749m2620l0904m1628n6725l1522r899j8645M7689J2653
$$ 47369 73877 139582 186331 143711 112807 71179 14454 -17068 -26967 -45612 2077 14730
28903A4730P900L5013p58j819K0897j5697K3585k7485L0419n7327k3602m9613
$$ 14730 22630 57643 56885 55066 75963 60266 83851 56366 86785 29458 5856 -43757
28891d3757r167q0074L0105M1203N8608M2300m542K4076L2908k7351l1040l212
$$ -43757 -52924 -132998 -102893 -61690 -3082 39218 34676 58752 91660 64309 33269 30057
28879C0057j2112p98j4435j860j362J5677l3281o3789P669m355k347M3969K3531
$$ 30057 17945 17147 2712 852 -510 15167 -18114 -81903 -74234 -78589 -80936 -36967 -13436
28866a3436J1721J0188N9896K5311P915l9393q146m7651m3642L4277M6867J7072
$$ -13436 -1715 8473 68369 93680 101595 62202 54056 6405 -37237 -2960 43907 60979
28854F0979J8389R576K991n6184k2857n6415R000N1546R742k9979J6357n5392
$$ 60979 79368 88944 91935 35751 12894 -43521 -34521 17025 26767 -3212 13145 -42247
28842d2247P0223p9123L7719M5349o2658M321L4155q172l0258k4965M397K7990
$$ -42247 27976 -51147 -13428 31921 -30737 -26416 7739 -433 -30691 -55656 -51259 -23269
28830b3269O5853J1441j5412m630K8071k0987L282j3995r705j1476J2957j4673
$$ -23269 42584 54025 38613 33983 62054 41067 44349 30354 20649 9173 22130 7457
28818G457j1217K2786M1314r8019j1419Q891n8435L4486P1229l7207n4055K9077
$$ 7457 -3760 19026 60340 -37679 -49098 -40207 -98642 -64156 7073 -30134 -84189 -55112
28806e5112k2002J9775J3771J3255L2322j041K8915j1032K4468P4682r168o5074
$$ -55112 -77114 -57339 -43568 -30313 2009 968 29883 18851 43319 118001 108833 43759
28794D3759l0054r033J4487J7550J897J6283n0952J4432K9863J9156j8949J8433
$$ 43759 13705 4672 19159 36709 38606 54889 3937 18369 48232 67388 48439 66872
28782F6872r2841J5838L0166m7836o8484P849O2972j3904m3396k000R2234L7223
$$ 66872 -25969 -10131 20035 -27801 -96285 -88436 -25464 -39368 -82764 -84764 7470 44693
28770D4693L3521m5275P934k4580J3089l5213k7483N2594m861l802J4693N849
$$ 44693 78214 32939 40873 16293 29382 -5831 -33314 19280 14419 10617 25310 31159
28758C1159Q877J0138m4963o2900K4035J1580l2725p322P1608O957k6314k1042
$$ 31159 40036 50174 5211 -57689 -33654 -22074 -54799 -62121 9487 16444 -9870 -30912
28746c0912n3154j8249M3298M360M3700L3561j4099n0184J1648L6196L8042K0016
$$ -30912 -84066 -102315 -59017 -54657 -10957 22604 8505 -41679 -30031 6165 44207 64223
28734F4223J9331j9613r0960n481J971k8793K2114o6677J5271M2051M0976Q535
$$ 64223 83554 63941 -27019 -32500 -30529 -59322 -37208 -103885 -88614 -46563 -5587 2948
28722B948j7417P10J1550o3827J1314N8343K4208j6362m5904m1406L9030j676
$$ 2948 -14469 -13759 -2209 -66036 -54722 3621 27829 11467 -34437 -75843 -36813 -38489
28710c8489J3575K0291l871J4662l3633l785N6312L0874Q044r875m0540K9322
$$ -38489 -24914 -4623 -8494 6168 -27465 -31250 25062 55936 63980 54105 13565 42887
28698D2887K01o1001L413L6122L2812L381o369N1882n455q3696p0162M181M3879
$$ 42887 43088 -17913 -14500 21622 54434 57815 51446 103328 97873 14177 -55985 -51804 -7925
28685g925Q209l0923j9215L1838m6197m8565M7927N4352k0771k4017l5876L1813
$$ -7925 284 -30639 -49854 -18016 -64213 -112778 -64851 -10499 -31270 -55287 -91163 -59350
28673e9350L5541j3212K0924N8627k829p5280m3929R8946N580r2680J4608J00634
$$ -59350 -23809 -37021 -16097 42530 39701 -35579 -79508 19438 25018 -67662 -53054 47580
28661D7580m772p3459j1393J9292m8162J5119R478n6053K4342R397R5820M4159
$$ 47580 42808 -30651 -42044 -22752 -70914 -55795 -46317 -102370 -78028 -68631 27189 71348
28649G1348m8690p2446q2912j8948K3339Q9125j3108L4470L2032O7508k2847k4892
$$ 71348 22658 -49788 -132700 -151648 -128309 -39184 -52292 -17822 14210 81718 58871 33979
28637C3979k642q2553m0734Q959L8197n9469l5128r707P5109M2244R149j7089
$$ 33979 31337 -51216 -91950 -82991 -44794 -104263 -139391 -149098 -73989 -31745 -22596 -39685
28625c9685O0452M4053j1794l3555J2860N735l9675m4747L8096M5526P8477l7444
$$ -39685 20767 64820 53026 19471 32331 38066 -1609 -46356 -8260 37266 115743 78299
28613G8299k1197J1926m8064j2163j9470K6173K7752J0903l3969j0435L6619l1965
$$ 78299 57102 69028 20964 8801 -10669 15504 43256 54159 20190 9755 46374 14409
28601A4409n1314n7303l5930M9085N8014O319K8805k5183o8638k8708O1523N5196
$$ 14409 -36905 -94208 -130138 -81053 -23039 -16720 12085 -13098 -81736 -110444 -48921 6275
28589F275m3897j14715K8097O1760J430J2675M0760n8582J1760K2299n952J8748
$$ 6275 -37622 -152337 -124240 -62480 -61050 -48375 -7615 -66197 -54437 -32138 -38090 -19342
28577a9342j0679N0236L6100N857n727N6047n1678j0849m1409k2097q209m1935
$$ -19342 -30021 20215 56315 62172 56445 112492 60814 49965 8556 -13541 -21750 -63685
28565f3685j1477M2949m1468p379M6450r854l7141k4219k0975K8857K6238O5323
$$ -63685 -75162 -32213 -73681 -81060 -34610 -44464 -81605 -105824 -126799 -97942 -71704 -6381
28553f381K5394o434l0865l0364M0252r306Q088k983K777l8233O744P6896l9839
$$ -6381 19013 12579 -18286 -48650 -8398 -17704 -9616 -12599 -9822 -48055 -41311 35585 -4254
28540d254l3370J4480K9833j0455K2990J7651J0284j5958n2358m3770k8956Q827
$$ -4254 -37624 -23144 6689 -3766 19224 36875 47159 31201 -21157 -64927 -93883 -85056
28528h5056J5264m5830J2108J3725p723L9506O1844L3007k4072l1370k6295M6484
$$ -85056 -69792 -115622 -103514 -89789 -97512 -58006 3838 36845 12773 -18597 -44892 1592
28516A592K6715p762m8301p2588O6815K5902n2674N3664N996M4965L6021q3565
$$ 1592 28307 20545 -27756 -100344 -33529 -7627 -60301 -6637 -641 44324 80345 -3220
28504c220k8193k7277m7077j2713L6732k9738O569M7302R981K1596P592N0303
$$ -3220 -31413 -58690 -105767 -118480 -81748 -111486 -104917 -57615 -47634 -26038 -18446 31857
28492C1857j6547M2473J239k1328M6421l6362k7995J9686P8506K3410l8476o0483
$$ 31857 15310 57783 59022 37694 84115 47753 19758 39444 117950 141360 102884 42401
28480D2401m8975m8287O3655K444J8174K6529O635n3444L0904J9952l9993L702
$$ 42401 -6574 -54861 8794 11238 29412 55941 62576 9132 40036 59988 19995 23697
28468B3697q079p415r37k1983O927j3760k09J2261J044K258o3465p0313o536L9732
$$ 23697 15618 8203 7266 -14717 -7790 -21550 -21759 -9498 -8454 -6196 -69661 -139974 -146510 -106778
28454a06778R2772Q030O004k9497j8666l9961j0042K0430L0884N3570O4347n6488
$$ -106778 -14006 -5976 28 -29469 -48135 -88096 -98138 -77708 -46824 6746 71093 14605
28442A4605J714l5690j7462K6307j43k915k6317j7549O7821L1466K170k8015N660
$$ 14605 16319 -19371 -36833 -10526 -10669 -13584 -39901 -57450 10371 41837 44007 15992 21652
28429B1652l4056J57L1921j8857O478M8315K6269P917p3513k3844o1688k841J3802
$$ 21652 -12404 -12247 19674 817 7295 55610 81879 89796 16283 -7561 -69249 -72090 -58288
28416e8288L3956L7773n29j9635J7309L3922j4475K0126Q7426j4517q3633q1771
$$ -58288 -24332 13441 12912 -6723 10586 44508 30033 50159 137585 123068 39435 -42336
28404d2336l7180l9990K0591J6599R717M2068K1787K3539K6847k4958l5448j8908
$$ -42336 -79516 -119506 -98915 -82316 -72599 -30531 -8744 14795 41642 16684 -18764 -37672
28392c7672K1970k4941m6930J4132j271Q0574O1476l4442p358N397l5628o5198
$$ -37672 -15702 -40643 -87573 -73441 -74712 5862 67338 32896 25538 30935 -4693 -69891
28380f9891l2112j9209N8651N8247J5565p2981p200N1656j8120o1910l166O3463
$$ -69891 -102003 -121212 -62561 -4314 11251 -61730 -68930 -17274 -35394 -97304 -100470 -37007
28368c7007k567r430N3664n3849n247P0875r463n1356k1531O4395K0278O563J825
$$ -37007 -39574 -49004 4660 -49189 -54436 16439 6976 -44380 -65911 -1516 18762 25325 27150
28355B7150k4676n996l2540J6628k5408n864K5614N833q070m2301K9454k507J1260
$$ 27150 2474 -3522 -36062 -19434 -44842 -50706 -25092 -19259 -27329 -69630 -40176 -42683 -31423
28342c1423Q0311j3767r866P60L6321k2110K4686K3508k7665k1498k9600k7786
$$ -31423 48888 35121 25255 26015 62336 40226 64912 88420 60755 39257 9657 -18129
28330a8129K6605p864n3032M4231J1689o2193l9424M3561M8904L6961L6450p452
$$ -18129 8476 612 -52420 -8189 3500 -58693 -98117 -54556 -5652 31309 67759 60307
28318F0307j5516j0934m5827l4236O8313O2899n2297Q08k113j9317k2188j8055
$$ 60307 44791 33857 -11970 -46206 22107 85006 32709 33517 31404 12087 -10101 -28156
28306b8156K1324L642m8751n0159Q555J2845k3489J0616M8747N857J7445o925
$$ -28156 -6832 -3190 -51941 -102100 -93545 -80700 -104189 -93573 -44826 -38969 -21524 -28449
28294b8449L5139j3090O177k5053K7195J8780K2419M1926J0881j9530K1209k4794
$$ -28449 6690 -6400 -223 -25276 1919 20699 43118 85044 95925 76395 97604 72810
28282G2810j8425l12K7375n107k9648m288m6510p413k0330o8119K556R0525J1530
$$ 72810 54385 54073 81448 76341 46693 42405 -4105 -11518 -31848 -99967 -97411 -6886 4644
28269D644n1302k8971N8854K2964M4935r915j3730N9837m635j6863j215p446l8757
$$ 4644 -46658 -75629 -16775 6189 51124 41209 27479 87316 82681 65818 64603 57157 18400
28256A8400l0833J9481J377k563l8170J013L4885J706N1219K8141m0259l9566
$$ 18400 -12433 7048 8425 5862 -32308 -31295 3590 5296 56515 84656 44397 4831
28244D831L595J0238J3413n256k4440M1000j0556J9955j8170o537n0985m3033
$$ 4831 8426 18664 32077 26821 2381 43381 32825 52780 34610 28073 -22912 -65945
28232f5945k1039O680M3449K1585M0847j3265j6539k3976l9344q914k1990Q094
$$ -65945 -86984 -80304 -36855 -15270 25577 12312 -4227 -28203 -67547 -76461 -98451 -90357
28220i0357j0255J4824N8962Q3128j0284l7320q616j7617k2960K5452p1615k9027
$$ -90357 -100612 -85788 -26826 56302 46018 8698 82 -17535 -40495 -15043 -86658 -115685
28208a15685N4912R1914N1247n072l1903q0058n2861l4751O0107N9503Q177j3684
$$ -115685 -60773 31141 82388 77316 45413 -34645 -87506 -122257 -62150 -2647 5530 -8154
28196h154j1150N266k886J9443K3050k3654K1350Q729L392L487K388m667K479
$$ -8154 -19304 -14038 -16924 2519 25569 1915 23265 31994 35386 38873 41261 36594 39073
28183C9073K1572k345J1351M0738l6739o0317N801l602l0790j3687M2330k2650
$$ 39073 60645 58300 69651 110389 73650 13333 19134 15532 -15258 -28945 13385 -9265
28171i265K2479J0038k2153j1538j4217O214J2754M5831l2425m4979Q5693J2112
$$ -9265 13214 23252 1099 -10439 -24656 -18442 -5688 40143 7718 -37261 48432 60544
28159F0544j9394r3029j9331J6193M2820j262r187l495Q642K2196K7597J9402
$$ 60544 41150 -51879 -71210 -55017 -12197 -13459 -22646 -26141 -17499 4697 32294 51696
28147E1696J3323o0304m162p782K9723P561l2470k5658l5777k323j2322l3683
$$ 51696 65019 4715 553 -7229 22494 30055 -2415 -28073 -63850 -66173 -78495 -112178
28135a12178L6681O5798M8375J2285L664p6162n7167K42l9556K5294k8804l6245
$$ -112178 -75497 -9699 38676 50961 54625 -21537 -78704 -78462 -118018 -92724 -121528 -157773
28123a57773M5142P7466m9051j235j6956M960o5018j0884J1732Q5433L7181M5369
$$ -157773 -112631 -35165 -84216 -85451 -102407 -97447 -162465 -173349 -161617 -76184 -39003 6366
28111F366K8773K0821k2809j6840K3430p678R520m1459M191L4578n056j9863L252
$$ 6366 35139 55960 33151 16311 39741 32063 41583 124 4315 38893 33837 13974 17226
28098A7226m796O417n6848M6661Q9295o8326o0571J324l6615L7306R891l204N1155
$$ 17226 12430 18847 -38001 8660 97955 29629 -30942 -29618 -66233 -28927 -19036 -22240 28915
28085B8915O15m4555j4254L1992l1774o543K2406K9082o5943M98R3120N0875n8040
$$ 28915 29530 -15025 -29279 2713 -29061 -35604 -13198 15884 -50059 -49561 43559 94434 36394
28072C6394k0664L384j5579j2843K1739L2496o4388N7326N3382J4418l6289J6155
$$ 36394 15730 19114 3535 -9308 12431 44927 -19461 37865 91247 105665 69376 85531
28060H5531k9924j6477j1693L0568J2568m6769J5974j5086p0851k0623P715J7703
$$ 85531 55607 39130 27437 58005 70573 23804 39778 24692 -46159 -66782 -59067 -41364
28048d1364J2987j9755j9884k5662L6520P0824k2736n1254R327M2942j4579l0558
$$ -41364 -28377 -48132 -68016 -93678 -57158 13666 -9070 -60324 -50997 -8055 -22634 -53192
28036e3192o7959M942K4621l6794M1410M5633j381m3818L3793j5064Q292j0729
$$ -53192 -121151 -116209 -91588 -128382 -86972 -41339 -42720 -86538 -52745 -67809 -59517 -70246
28024g0246m2195L6875L2197N6016J3903N6166p375n76m9449j7029M716m9495
$$ -70246 -112441 -75566 -43369 12647 26550 82716 75341 74765 25316 8287 13003 -36492
28012c6492r243M1193R928l4956k7004k1285J7952J4703J1982j6360K9068M7609
$$ -36492 -45735 -4542 5386 -29570 -56574 -77859 -59907 -45204 -33222 -49582 -20514 27095
28000B7095j6103J0484L0238l5183o2927l8496j7421n9294O477M9426L1501O9456
$$ 27095 10992 21476 51714 16531 -46396 -84892 -102313 -161607 -155130 -105704 -74203 -4747
27988d747N8682m652m6691n740J6966K1318j9140m2565k5044L4505K2068J0462
$$ -4747 53935 49283 2592 -3148 13818 35136 15996 -26569 -51613 -17108 4960 15422
27976A5422m61K5157L1826l8637l3967l5912j6015J2117L6736l8000l9270r6433
$$ 15422 14961 40118 71944 33307 -660 -36572 -52587 -40470 -3734 -41734 -81004 -177437
27964a77437R64P7595L4953K1075R289R657k8217N488O8353L7080n041l8292l4022
$$ -177437 -176473 -98878 -63925 -42850 -33561 -23904 -52121 -46633 21720 58800 53759 15467 -18555
27951a8555P75K6396M086j5254j7252J871j3872m7268J1426M2474M1422n2688
$$ -18555 -17780 8616 12702 -2552 -19804 -17933 -31805 -79073 -67647 -25173 16249 -36439
27939c6439N938L2328J6093j6013M6823k971K0960q3479n3652O557O924L8955
$$ -36439 -30501 1827 17920 1907 48730 45759 66719 -16760 -70412 -63855 -56931 -17976
27927a7976O2657M8243J3200L9631J6297o1153j21717r6117o14J6551J7689o011
$$ -17976 44681 92924 106124 145755 162052 100899 -20818 -116935 -117549 -100998 -83309 -89320
27915h9320j2424K2378M9575k865q1409k9924K6266J140P6771P7722m1818m7058
$$ -89320 -101744 -79366 -29791 -32656 -114065 -143989 -117723 -116583 -39812 37910 -3908 -50966
27903e0966L0105J2010L217K7787L2205l6045j5039l970o9048N8524J3523K7166
$$ -50966 -20861 -8851 -5634 22153 54358 18313 3274 -696 -69744 -11220 2303 29469
27891B9469o465m6444R488p244N9428L238o5656j7606K3929n9392n2615k3825
$$ 29469 23004 -23440 -13952 -21196 38232 41470 -24186 -41792 -17863 -77255 -129870 -153695
27879a53695Q8064L2200M8131K8455K1779k1356j3303m1923P609J7715n1452M1830
$$ -153695 -65631 -33431 14700 43155 64934 43578 30275 -11648 -4039 13676 -37776 4054
27867D054n862m7728m9554r246N8956J2107n3670K2026l3475L487L2730k5748
$$ 4054 -1808 -49536 -99090 -108336 -49380 -37273 -90943 -68917 -102392 -98905 -66175 -91923
27855i1923n326K5395J7091q031j3240j9915m5732k5809J8999O0819L7445p4691
$$ -91923 -97249 -71854 -54763 -62794 -76034 -95949 -141681 -167490 -148491 -87672 -50227 -124918
27843a24918k3706M2200j0603l0684K0089Q2914K1639K1060K9259J0033J4646
$$ -124918 -148624 -106424 -117027 -147711 -127622 -44708 -23069 -2009 27250 37283 51929
27832E1929q54j3619l308l4116l2859o843p960k2929K2372L9768J1871j4273M229
$$ 51929 51075 37456 34148 32 -32827 -39670 -47630 -70559 -48187 -8419 3452 -10821 -6592
27819f592m4819J0217J9633r0022o24L6902L0974m4486n0827J0171L3158P1187
$$ -6592 -51411 -41194 -21561 -111583 -112207 -75305 -44331 -88817 -139644 -129473 -96315 -25128
27807b5128p561q897k3967m0536N8745j3857l0957M5838J7684j0422P4529K5258
$$ -25128 -32689 -41586 -65553 -106089 -47344 -61201 -92158 -46320 -28636 -39058 35471 60729
27795F0729n5124n4661J4858L5762p057j5882j159M6233j1536p4311J6257l909
$$ 60729 5605 -49056 -34198 1564 -5493 -21375 -22534 23699 12163 -62148 -45891 -49800
27783d9800o281k4844M724p431J7j1227L1356J5943k2742M3578O6781Q78l0356
$$ -49800 -56081 -80925 -76201 -83632 -83615 -94842 -63486 -47543 -70285 -26707 40074 40952 10596
27770A0596p4291k1087K7766L6518p512j7815R964n8020k8206m510J1705K8882
$$ 10596 -63695 -84782 -57016 -20498 -28010 -45825 -35861 -93881 -122087 -126597 -114892 -86010
27758h6010N5652O0719l0831p9243K7329o559L3568n621j3210K7771N1507M2702
$$ -86010 -30358 30361 -470 -79713 -52384 -58943 -25375 -30996 -44206 -16435 35072 77774
27746G7774m3828o4878N2416L8730o476l8457k2767n4127l5382k2937J3093k673
$$ 77774 33946 -30932 21484 60214 53738 15281 -7486 -61613 -96995 -119932 -106839 -109512
27734a09512L9051L7493J0435M8468Q5250p1949o3463j7962L3221m149l0766J6726
$$ -109512 -70461 -32968 -22533 25935 111185 39236 -24227 -42189 -8968 -13117 -43883 -27157
27722b7157M3671L7457n1383l3338K509M5357L719l2709l5364J5237J7805K8315
$$ -27157 16514 53971 2588 -30750 -28241 17116 20835 -11874 -47238 -32001 -14196 14119
27710A4119l5798n4844K7625J06417m3799q588J2167k9873K680L8354M41R440
$$ 14119 -21679 -76523 -48898 57519 13720 5132 17299 -12574 -9894 28460 28901 38341
27698C8341n9196J212N7924P7143o3117j00747J7648R4781N0197r3342q3120K1042
$$ 38341 -20855 -19643 38281 115424 52307 -48440 -30792 63989 114186 20844 -62276 -41234
27686d1234J451O4398K2636r493m7754L7792k7636m1882K9405j5184n3340K5313
$$ -41234 -39783 24615 47251 37758 -9996 27796 160 -41722 -12317 -27501 -80841 -55528
27674e5528K5811l7172L7571K3200k4055J2189O214j0492j9528M8610K4836m2459
$$ -55528 -29717 -66889 -29318 -6118 -30173 -17984 -11770 -22262 -41790 6820 31656 -10803
27662a0803n9211m8129K2518K3393L415l8239r657M4967k0059M0786P8060N5266
$$ -10803 -70014 -118143 -95625 -72232 -68817 -107056 -116713 -71746 -91805 -51019 27041 82307
27650H2307k1362K2328R186p4857l176M50j5648L619j3262n0671k952K2545J2427
$$ 82307 60945 83273 92459 17602 14426 14876 -772 2847 -10415 -61086 -64038 -41493 -29066
27637b9066n3512K0645K875k334J5625J3490J833n3534j560L3626O4625K8433
$$ -29066 -82578 -61933 -59058 -61392 -45767 -32277 -30444 -83978 -85538 -51912 12713 41146
27625D1146P980n225n5954J5539j1801n1448n6474k308Q9778J4337L2875K1074
$$ 41146 49126 43901 -12053 3486 -8315 -59763 -116237 -118545 -28767 -14430 18445 39519
27613C9519m7630m2175l6285M4684L1344m125k131l8113l7584J2922q766n8360
$$ 39519 -8111 -50286 -86571 -41887 -10543 -14668 -16799 -54912 -92496 -79574 -88340 -146700
27601a46700P831J4815k758L0704M2166M4051p831o009L5823p905j0838k3329
$$ -146700 -138869 -124054 -126812 -96108 -53942 -9891 -17722 -23731 12092 4187 -6651 -29980
27589b9980p0084L2043M8048k0269j01675J0328J2318K9601J06774L4321l9900
$$ -29980 -100064 -68021 -19973 -40242 -141917 -131589 -119271 -89670 17104 51425 11525
27578A1525J8710R4417q965o6299m8752k655J6201k0574K0938J0395L5978P830
$$ 11525 30235 124652 115687 49388 636 -2019 14182 -6392 14546 24941 60919 68749
27566F8749j31991N131r879k7436M5123J6549M7864M3572l804m9817o1941l7954
$$ 68749 -63242 -58111 -67990 -95426 -50303 -33754 14110 57682 53878 4061 -57880 -95834
27554i5834J8824q554m3217K5198N7554K5513J0537m1947k5924p530M2118M0201
$$ -95834 -77010 -85564 -128781 -103583 -46029 -20516 -9979 -51926 -77850 -85380 -43262 -3061
27542c061L496J9390J336k2076k7343P865L1664N0495N4441k9386l7352n2108
$$ -3061 435 19825 21161 -915 -28258 -20393 11271 61766 116207 86821 49469 -2639
27530b639n0248q9824N4464k7026L6939L9794L4385m8683k5195j7939j6813j2997
$$ -2639 -52887 -142711 -88247 -115273 -78334 -38540 -4155 -52838 -78033 -95972 -112785 -125782
27518a25782L882J8935N5608L0720k7028k0554K584M1581P2902N2797j5368r6424
$$ -125782 -121900 -102965 -47357 -16637 -43665 -64219 -61635 -20054 52848 105645 90277 -6147
27506f147n7236J2017O2476k3326r1416L9389O0681J1601k4623K3438K1554m9772
$$ -6147 -63383 -51366 11110 -12216 -103632 -64243 -3562 8039 -16584 6854 28408 -21364
27494b1364p868L1246k4810m9807J0819J3908j8509K6920L5944r398L215l3387
$$ -21364 -29232 2014 -22796 -72603 -61784 -47876 -66385 -39465 -3521 -12919 -9704 -43091
27482d3091n5645j3431R610O8867P4523J370m0387K1798J689j1792m4399l3492
$$ -43091 -98736 -112167 -102557 -33690 40833 42203 1816 23614 25303 13511 -30888 -64380
27470f4380j3979M852J9118L2932L9129J5572K6484n1188M6000R0561o4425m5080
$$ -64380 -78359 -73507 -54389 -21457 17672 33244 59728 8540 54540 145101 80676 35596
27458C5596j34K5317n465P4034o9184r7960N329J0847l6288L2570K7793k1165
$$ 35596 35462 60779 55314 129348 60164 -37796 -32467 -21620 -57908 -25338 2455 -18710
27446a8710m5772K296q832L0584Q4893Q3497n485m7246q9235q732P2158P2942
$$ -18710 -64482 -62186 -71018 -40434 44459 127956 122471 75225 -14010 -22742 49416 122358
27434A22358M8106l2555l5161j9411j0463k8677m0873J6078j0687R039J2868J8157
$$ 122358 170464 137909 102748 83337 72874 44197 3324 19402 8715 17754 30622 48779
27422D8779o4817m0828M4163L7660k821k8191K5363Q170j4074J4278m1416m2564
$$ 48779 -16038 -56866 -12703 24957 22136 -6055 19308 27478 13404 27682 -13734 -56298
27410e6298L9217P8882j0522l8943n9856N163M8853P173M447N52l2306k2723j5062
$$ -56298 -17081 61801 51279 12336 -47520 -42357 6496 13669 18116 18668 -13638 -36361 -51423
27397e1423j625R2644l9698q0870l1165L6650M9885P3114l5101j6514L4348N7755
$$ -51423 -53048 39596 -102 -80972 -112137 -75487 -25602 47512 12411 -4103 30245 88000
27385H8000K2423p2291j9242P7452K6299O7522p2690j92913n0101j4569K7713
$$ 88000 110423 38132 18890 96342 122641 190163 117473 -75440 -125541 -140110 -112397
27374a12397M1643R4834J0751p1249K6987M7848n9913j3061L0180l0964j4094
$$ -112397 -70754 24080 34831 -36418 -9431 38417 -21496 -34557 -4377 -35341 -49435
27363d9435O9287P5238m8971r4045k113P8797j5050o3930n394N0228n398K4973
$$ -49435 19852 95090 46119 -47926 -50039 28758 13708 -50222 -55616 -5388 -10786 14187
27351A4187K1374n6178J9737J1876k0848k9634j743K9236J1551K9400j8622m625
$$ 14187 35561 -20617 -880 10996 -9852 -39486 -41229 -11993 -442 28958 10336 5711
27339E711j0599J7943m1270K551L4146l6739p3514m145N8025J8275L3458N9826
$$ 5711 -4888 13055 -28215 -25664 8482 -28257 -101771 -105916 -47891 -29616 3842 63668
27327F3668M599O38j5854n9078R6856M6557l3723l3940j6591L663Q522k5203p0228
$$ 63668 68267 68905 53051 -6027 90829 137386 103663 69723 53132 56795 65317 40114 -30114
27314c0114J5770j5497J587j7411o4770K3240M3096P6229M6621L1753k4425J8830
$$ -30114 -14344 -29841 -28254 -45665 -110435 -87195 -44099 32130 78751 110504 86079 104909
27302A04909j2814o8297n4470J0952P5406M4714N9073J1738m3760m0564o3567
$$ 104909 92095 23798 -30672 -19720 55686 100400 159473 171211 127451 86887 23320
27291B3320K1686k5900k0094p686L1003O7582m1433R037l5156m339l274K6906
$$ 23320 45006 19106 -988 -8674 22329 89911 48478 57515 22359 18020 14746 41652
27279D1652L524l1939j8282N058o756O1174O872l2335M3547N0957J9729M7620
$$ 41652 45176 13237 -5045 13 -6743 54431 61303 28968 72515 123472 143201 190821
27267A90821p984p7000k3202j5393m740L36k2444m2424K1728K0797j8364o147
$$ 190821 182837 105837 82635 67242 62502 62838 40394 -2030 19698 40495 22131 15984
27255A5984M3345M1654k4406l7879j4935l6398k4046j8858N673O3801P2113L2293
$$ 15984 59329 100983 76577 38698 23763 -12635 -36681 -55539 -49866 13935 86048 118341
27243A18341n6556n0208R373J4942M8409o9482k8978j2387r787O2590o163o9590
$$ 118341 61785 11577 20950 35892 84301 14819 -14159 -26546 -36333 26257 20094 -49496
27231d9496N8138R1259J7064j559j8283r24J1722l2515j7717j3679n1142J3164
$$ -49496 8642 99901 116965 115406 97123 96199 107921 75406 57689 44010 -7132 6032
27219F032J9731p3644o1019P5006J4641J6266L1122k2474J1440K7611N627j8237
$$ 6032 25763 -47881 -108900 -33894 -19253 -2987 28135 5661 17101 44712 50339 32102
27207C2102l0629J3653L595K1305O779L7668m9462j0214L3692M6251M3638q007
$$ 32102 1473 15126 18721 40026 46805 84473 35011 24797 58489 104740 148378 140371
27195A40371k3593o0082m9230J509K486m9509n2282J3385P3457M6827Q059N8321
$$ 140371 116778 56696 7466 8975 11461 -38048 -90330 -76945 -3488 43339 51398 109719
27183A09719p752q39k2328J9081k6988m1226k5147J8380K3777j2771p3603n2914
$$ 109719 101967 101128 78800 97881 70893 29667 4520 22900 46677 33906 -39697 -92611
27171i2611k8270O648J0440M4610N4621K6768K8596J8326o605K4593q8615n4134
$$ -92611 -120881 -114233 -103793 -59183 -4562 22206 50802 69128 62523 87116 -1499 -55633
27159e5633K4716N7644L9806K5736o8689l3443O3580L3240L9439j8068p118K2390
$$ -55633 -30917 26727 66533 92269 23580 -9863 53717 86957 126396 108328 101210 123600
27147A23600m9161L688N19n077M7415K0575j7040p7758k7455K8392M7539L9303
$$ 123600 74439 78127 78646 73569 120984 141559 124519 46761 19306 47698 95237 134540
27135A34540k2727K0640l7963k878J898l962l5122j9544l8785M1833M2005m587
$$ 134540 111813 132453 94490 91612 93510 89548 54426 34882 -3903 37930 79935 75348
27123G5348j1329r505M2444j0057j7388j1297k6104o7968m276J2977O9275K623
$$ 75348 64019 54514 96958 86901 69513 58216 32112 -35856 -40132 -27155 42120 44743
27111D4743P920N5337M8208j8m7623o4814R823K3787k5339J7505L7063J3386l3643
$$ 44743 52663 108000 156208 156190 108567 43753 53576 77363 52024 69529 106592 119978 86335
27098H6335l3434k9911J9792q599j2309L7461L7577j7841l304J3573m7859n5302
$$ 86335 52901 22990 42782 34183 21874 59335 96912 79071 75767 89340 41481 -13821
27086a3821N2477k9722N5420K7403J7231K2335n308l1449m3436k4435j262K0933
$$ -13821 38656 8934 64354 91757 108988 131323 126015 94566 51130 26695 25433 46366
27074D6366O4370q997m1790m4644N0142M2126J9260j4151M1929L8906J5400M033
$$ 46366 110736 101739 59949 15305 65447 107573 126833 112682 154611 193517 208917 212950
27062B12950o7366n3962N1431L4357m5444r8577l2519O027M7195O1863N9300K3624
$$ 212950 145584 91622 143053 177410 131966 33389 870 6897 54092 115955 175255 198879
27050A98879k3717l2685m4469M1430J2707j0503j5536l4596m7350j3584J0269
$$ 198879 175162 142477 98008 139438 152145 141642 126106 91510 44160 30576 40845
27039D0845L7700M9813P391m9290l0389L5384M6966N3847k6913J1803J674k1591
$$ 40845 78545 128358 135749 86459 56070 91454 138420 192267 165354 177157 178831 157240
27027A57240r545o1471J4978L5211k9987j4943j7856O2255N5758q975l442l0669
$$ 157240 147695 86224 101202 136413 106426 91483 73627 135882 191640 182665 179223 148554
27015A48554K7102J1734L739K6836m3192o1546n9576q374O0133K2087j2090r355
$$ 148554 175656 187390 191129 217965 174773 113227 53651 45277 105410 127497 115407 106052
27003A06052l9560j5176K8919L6525j958j742K7588L4837k3078l759K8797j3620
$$ 106052 66492 51316 80235 116760 114802 113060 140648 175485 152407 148648 177445 163825
26991A63825n3969k1198j8540l0806r486M9678P2881j4942R740K179o4358r2715
$$ 163825 109856 88658 70118 39312 29826 79504 152385 137443 147183 149362 85004 -7711
26979g711L3066j1054p050J9841j1374L998L646L0895N66M2563N6807J6236k4826
$$ -7711 25355 14301 7251 27092 15718 19716 23362 54257 54823 97386 154193 170429 145603
26966A45603n0524j7020k7919L1166k1392K6732K8279M0498M1317L1298o9622
$$ 145603 95079 78059 50140 81306 59914 86646 114925 155423 196740 228038 158416
26955A58416k6870k1272J2424O0286k1175p8591J7628K2815J5823j5634k5747
$$ 158416 131546 110274 122698 182984 161809 83218 100846 123661 139484 123850 98103
26944I8103k9180J6402N3778l4489M1019J0696o3552K4242J128m1898N936L8558
$$ 98103 68923 85325 139103 104614 145633 156329 92777 117019 118147 76249 82185 120743
26932A20743J1211j0191N6243J0870p430n765n4020j4269j2506M2839J1997n5711
$$ 120743 131954 121763 178006 188876 181446 175681 121661 107392 94886 137725 149722 94011
26920I4011l9038K5343N129k7937k6681j2516L4264M7201O3263j5825j7669r727
$$ 94011 54973 80316 85445 57508 30827 18311 52575 99776 163039 147214 129545 119818
26908A19818n4110Q104J31462N4117k223m474n0872l1461q0606j9261j6577k01
$$ 119818 65708 73812 205274 259391 257168 252694 201822 170361 89755 70494 53917 53716
26896E3716O952M9379L5828P871n8463j1233k8574j1117N3461k3248o0410j788
$$ 53716 60668 110047 145875 153746 95283 84050 55476 44359 97820 74572 14162 12374
26884A2374j9283N4513N3444j255J6619J8715m4138l8234L1558L0213p7657j5315
$$ 12374 -6909 47604 101048 99793 116412 135127 90989 52755 84313 114526 36869 21554
26872B1554j1939P988K2978L7713K2436m776J8111P223k1379k5086N061j8876
$$ 21554 9615 17603 40581 78294 100730 95954 114065 121288 99909 74823 79884 61008
26860F1008p1282M7477M4928M1451J3514k2190m2807l6152j8454j2663j4244L1624
$$ 61008 -10274 37203 82131 123582 137096 114906 72099 35947 17493 4830 -9414 22210
26848B2210r934m0583N4833M5783n943n2969n0439J5228K7575N7621K7108q005
$$ 22210 12276 -28307 26526 72309 66366 13397 -37042 -21814 5761 63382 90490 82485
26836H2485m2460L5628J07956p1566j02240J942L6912N3388K6284P67k3974k7035
$$ 82485 40025 75653 183609 112043 9803 11745 48657 102045 128329 129096 105122 78087
26824G8087k9502n3891m7530L564l8541O2075K9075O6781k4702m4401P185N5609
$$ 78087 48585 -5306 -52836 -49272 -87813 -25738 3337 70118 45416 1015 8200 63809
26812F3809L463k5481k146L9962O4322n901m2918k875j0279m213P411k1510l7207
$$ 63809 67272 41791 39645 79607 143929 138028 95110 92235 81956 77743 85154 63644 26437
26799B6437j4917K063K393N0428j8727k6291k8164N2266N8939m5389J9378j9875
$$ 26437 11520 13583 15976 66404 47677 21386 -6778 45488 104427 59038 78416 58541
26787E8541p6181k2404J9466N4758K1283k6799k8177L3439p673L9170L5569j7860
$$ 58541 -17640 -40044 -20578 34180 55463 28664 487 33926 26253 65423 100992 83132
26775H3132k9646j9114Q352K4424k0466p1896K35L5192M8918j826r037J5852L3217
$$ 83132 53486 34372 42724 67148 46682 -25214 -24979 10213 59131 57305 48268 64120 97337
26762I7337K4476k2008Q674j3831q68m9172M0315P415l005k3930o4049m3947M5056
$$ 97337 121813 99805 108479 94648 93780 44608 84923 92338 89333 65403 1354 -42593 2463
26749B463K4999J16j6926l5121p159J2116o320L322l9102R0061L6811o1249j5645
$$ 2463 27462 27578 10652 -24469 -31628 -19512 -25832 -22510 -61612 28449 65260 4011 -11634
26736a1634J1582J444K8063m1761J5900J1164k7903m8390m5257O8810J06433m3027
$$ -11634 -52 1392 29455 -12306 3594 14758 -13145 -61535 -106792 -37982 68451 25424
26724B5424r1232K1729L9488o534L8239M8445Q227n8216j6751N1054j0922p6554
$$ 25424 -65808 -44079 -4591 -11125 27114 75559 83786 25570 8819 59873 48951 -27603
26712b7603l2339L2841J7540o628J1360k1418K6143n424k7863j3398O794O5121
$$ -27603 -59942 -27101 -9561 -16189 -4829 -26247 -104 -5528 -33391 -46789 -39995 25126
26700B5126J5678k3414K481Q089K1566N6216J9188k8623l9439q0459l0407K0714
$$ 25126 40804 17390 19871 27960 49526 105742 124930 96307 56868 -23591 -53998 -33284
26688c3284K669Q473j3756K4560P2321J426k227k398L3129j4782n8701M457p255
$$ -33284 -30615 -22142 -35898 -11338 60983 62409 60182 57784 90913 76131 17430 21887 14632
26675A4632j0131l1688n56K783p931J8882M9083k0106k2888J3394R9078M2553
$$ 14632 4501 -27187 -27743 -24960 -32891 -14009 35074 14968 -7920 5474 104552 147105
26663A47105P724k6494l0135k6104J319m4950l3430k445J3309J1729k4636r431
$$ 147105 154829 128335 98200 72096 73415 28465 -4965 -7410 5899 17628 -7008 -16439
26651a6439R204N407J3932k6806p457k5554J4457o640r65K9066L5540j9527K3842
$$ -16439 -7235 -1828 12104 -14702 -22159 -47713 -33256 -39896 -40861 -11795 23745 4218 28060
26638B8060K0573q5247l4667L2861L2154K2870j1903k7374m1308M2403O3772P8425
$$ 28060 48633 -36614 -71281 -38420 -6266 16604 4701 -22673 -63981 -21578 42194 120619
26626A20619M9042j4839j08377m8258j3307M352m4354p419L1607N369K4009j3299
$$ 120619 169661 154822 46445 -1813 -15120 -10768 -55122 -62541 -30934 -25565 -1556 -14855
26614a4855p989K2482J7759j4710O288L751j0900j2684l5419j2479J2042p704
$$ -14855 -22844 -362 17397 2687 8975 12726 1826 -10858 -46277 -58756 -46714 -54418
26602e4418M7924J1304k3258L9364K8127n3898j252J7838N9382L0260J815J556
$$ -54418 -6494 4810 -18448 20916 49043 -4855 -6107 11731 71113 101373 103188 104744
26590A04744n1380o0802l2063j2087O213L3900J882j9874J2720q331M5503N5j8549
$$ 104744 53364 -7438 -39501 -51588 -45375 -11475 -9593 -29467 -16747 -25078 20425 20480 1931
26577A931O2158j8136j5107o376j2541n9584N9240N830k9670N618J5696j1201
$$ 1931 64089 45953 30846 24470 11929 -47655 11585 17415 -12255 -6637 9059 -2142
26565b142O675J5166o1408r1397r234Q5072O0908j7282M1636L4626j6840n1025
$$ -2142 4533 19699 -41709 -133106 -142340 -57268 3640 -13642 27994 62620 45780 -5245
26553e245n1832j1289k7819r271O6481N6720o7763k8069L7862M6756J8361l1156
$$ -5245 -57077 -68366 -96185 -105456 -38975 17745 -50018 -78087 -40225 6531 24892 -6264
26541f264K351K3901J2185r829k0056K032n2403j9221L4384K1285L8325N585n8913
$$ -6264 -3913 19988 32173 22344 2288 4320 -48083 -67304 -32920 -11635 26690 32275 -26638
26528b6638J9374l9760o2004L4777N6597J5031j6941q113j8580l9085K8040L4010
$$ -26638 -7264 -47024 -109028 -74251 -17654 -2623 -19564 -27677 -46257 -85342 -57302 -23292
26516b3292M5304r808K8322j8690p3001N0325M3183l04M2645m5306m6850j6227
$$ -23292 22012 12204 40526 21836 -51165 -840 42343 42039 84684 39378 -7472 -23699
26504b3699J789N754n1100j5767N1818K1215K4841K5340k7528j2004n7851M7318
$$ -23699 -21910 -16156 -67256 -83023 -31205 -9990 14851 40191 12663 659 -57192 -9874
26492i874M2380J1576q3151k8696Q0889J6508n3096o8244M3679k7954n3205J352
$$ -9874 32506 44082 -39069 -67765 13124 29632 -23464 -91708 -48029 -75983 -129188 -127836
26480a27836N1065J11881O0859O946j0420r8429l0393M1694l1799n3421M7422
$$ -127836 -76771 35110 95969 102915 92495 -5934 -36327 5367 -26432 -79853 -32431
26469c2431j6239M7714J6607k9975k5883J0250M9096J6510j4769m9149n8253K1567
$$ -32431 -48670 -956 15651 -14324 -40207 -29957 19139 35649 20880 -28269 -86522 -64955
26457f4955P2634P213n3353n5751K030M8425O1939P701o8935k6868j0817l6556
$$ -64955 7679 14892 -38461 -94212 -92182 -43757 18182 25883 -43052 -69920 -80737 -117293
26445a17293O2262L9685K8389K7058j8020K1231q360J3137j5574o590o8747N078
$$ -117293 -55031 -15346 13043 40101 22081 43312 34952 48089 32515 25925 -42822 -37744
26433c7744K4864K6054J7695r919j8232m3070j5947p902n0354K7444O9397k40
$$ -37744 -12880 13174 30869 20950 2718 -40352 -56299 -64201 -114555 -87111 -17714 -17954
26421a7954J4421K8538j3312p421k5389j4225k4147m7666j9004j8736L5241j4675
$$ -17954 -3533 25005 11693 4272 -21117 -35342 -59489 -107155 -126159 -144895 -109654 -124329
26409a24329L1434o065k8956n944M2391K8717r137J494L3491N427J1954o263q744
$$ -124329 -92895 -98960 -127916 -133860 -91469 -62752 -71889 -70395 -36904 -31477 -19523 -25786 -34530
26396c4530K4324k0203J8736M2910L6417J8009J2475n2404o8094P02l7510N627
$$ -34530 -10206 -30409 -11673 31237 67654 85663 98138 45734 -22360 -21658 -59168 -53541
26384e3541n150P101K5013l6793P7606N9236m1383m4459K070r633J8510l749n069
$$ -53541 -58691 -51590 -26577 -63370 14236 73472 32089 -12370 -10300 -19933 -1423 -5172 -10241
26371a0241j2079J2269M8635m9868l1912K4736M8451L266p5097l3676k4877j5169
$$ -10241 -22320 -10051 38584 -11284 -43196 -18460 29991 33257 -41840 -75516 -100393 -115562
26359a15562K310O9483k0253L117m1486o1760J1155M9392K8972m8Q568M5939J5787
$$ -115562 -113252 -43769 -64022 -60905 -102391 -164151 -152996 -103604 -74632 -74680 -66112 -20173 -4386
26346d386o050j7400L0786p029l0234M9141K876p1524j5220J8903L8345P8J8441
$$ -4386 -10436 -27836 2950 -4079 -34313 14828 17704 -53820 -69040 -50137 -11792 -11714 6727
26333F727K6480m1594k8747k1037k975M0435M6219N178q699K9735K2600k7445
$$ 6727 33207 -8387 -37134 -58171 -61146 -20711 25508 30686 21987 51722 74322 46877
26321D6877m027l1575p8300n8166K9684J4634k8323K0034L9186L2406m020j6770
$$ 46877 42850 11275 -67025 -125191 -95507 -80873 -109196 -89162 -49976 -17570 -21590 -38360
26309c8360j2834o657J567k8418j7451K026K5141K4900Q888m6200M0031j1084
$$ -38360 -51194 -57851 -56284 -84702 -102153 -100127 -74986 -50086 -41198 -87398 -47367 -58451
26297e8451j2347O681L70k176K1443K0397j0697L6980m5099o0714N3924N33N636
$$ -58451 -70798 -64117 -63747 -65923 -44480 -24083 -34780 2200 -42899 -103613 -49689 -49156 -43520
26284d3520O7538Q99J2705K2907k9066j9093n2215k9018o49K168L8534R4583J7193
$$ -43520 24018 24917 37622 60529 31463 12370 -39845 -68863 -69512 -67344 -28810 65773 82966
26271H2966p0721m3114J4717j8678k056N1035O0582k0724k0858k3799K1653L4272
$$ 82966 12245 -30869 -16152 -34830 -36886 14149 74731 54007 33149 9350 31003 65275
26259F5275K3059j9473n0176n1859K161j5827L3198k2393m1567K8859K2315K2648
$$ 65275 88334 68861 18685 -33174 -31013 -46840 -13642 -36035 -77602 -48743 -26428 -3780
26247c780j4742K5151j1888j5239n2580N944O9302O8970o6942m3379j8467k3656
$$ -3780 -18522 6629 -5259 -20498 -73078 -67134 2168 71138 4196 -39183 -57650 -81306
26235h1306M3702J9695q850k4875l3081P4994P0565P9355J1672m2619j4089k3334
$$ -81306 -37604 -17909 -26759 -51634 -84715 -9721 60844 140199 151871 109252 95163 71829
26223G1829P0391j7872p3123m653l3738l3706n5784J7213N2740K6865k285N8822
$$ 71829 142220 124348 51225 46572 12834 -20872 -76656 -59443 -6703 20162 17877 76699
26211G6699j3498q0250o2316O3968J1076O535j3348o0720Q3938P7423Q628k2173
$$ 76699 63201 -17049 -79365 -15397 -4321 2214 -11134 -71854 12084 89507 98135 75962
26199G5962n4408n0219K3656l180l0376k4681j9358r450L1264L866J1599R167
$$ 75962 21554 -28665 -5009 -8189 -38565 -63246 -82604 -92054 -60790 -56924 -45325 -36158
26187c6158L3202j0187J3867N4618l5355o1231K5643L7430J5563L1835J3832n0893
$$ -36158 -2956 -13143 724 55342 19987 -41244 -15601 21829 37392 69227 83059 32166
26175C2166K1787m2662j1179j1469m0450m4809o0604N3991N4482J3319j5058L82
$$ 32166 53953 11291 112 -11357 -51807 -96616 -157220 -103229 -48747 -35428 -50486 -50104
26163e0104J4331j7353q8723j867Q0974K6089m4072j4978K7812L4698J6750j0702
$$ -50104 -35773 -53126 -141849 -143716 -62742 -36653 -80725 -95703 -67891 -33193 -16443 -27145
26151b7145j558j0894m0329k0879l491O3570Q1675K2948m4866m237M6028M2304
$$ -27145 -28703 -39597 -79926 -100805 -104296 -40726 40949 63897 19031 14794 60822 103126
26139A03126j7057k1255o1964l5368m1070k1422O0090Q732N1701m721L6441J2560
$$ 103126 86069 64814 2850 -32518 -73588 -95010 -34920 -26188 25513 20792 57233 69793
26127F9793o2005P336n168N7567L5893J8140l6392n9313o1265Q570p272n117N5113
$$ 69793 7788 15124 9956 67523 103416 121556 85164 25851 -35414 -26844 -34116 -39233 15880
26114A5880M0431p8972m771O3067m86K6485n1326o2340O1738K0890l879l4713
$$ 15880 56311 -22661 -27432 35635 35149 61634 10308 -52032 9706 30596 26717 -7996
26102g996m1364J156L3425J2665p9268l9367P1279P5879k2867k2876l0934l8261
$$ -7996 -49360 -48204 -14779 -2114 -81382 -120749 -49470 26409 3542 -19334 -50268 -88529
26090h8529J3503N0225K6210O0870J3095K4752K1753o4969k5878j1634Q386k6257
$$ -88529 -75026 -24801 1409 62279 75374 100126 121879 56910 31032 19398 27784 1527
26078A527J0820K2316p2031p5703k899o337J8403O4463R251J9836m8939j4857
$$ 1527 12347 34663 -37368 -113071 -115970 -122307 -103904 -39441 -30190 -10354 -59293 -74150
26066g4150J1556k4470l3624R42j639J4408J2268J4279R6639N4113j02922k4448
$$ -74150 -62594 -87064 -120688 -119746 -121385 -106977 -94709 -80430 16209 70322 -32600 -57048
26054e7048l4144k0286L0032R5440j5573n3863J3356L8264J6332j0539j4261J9136
$$ -57048 -91192 -111478 -81446 13994 -1579 -55442 -42086 -3822 12510 1971 -12290 6846
26042F846L6593l8267k9713Q424J3584n0832j8391L6250P3868K3878o8863k0227
$$ 6846 43439 5172 -24541 -16117 -2533 -53365 -71756 -35506 38362 62240 -6623 -26850
26030b6850j7685J2637J24322L8111j6082m7128k7620o3520j8294O446L0385J9104
$$ -26850 -44535 -31898 92424 130535 114453 67325 39705 -23815 -42109 -35663 -5278 13826
26018A3826J3760K8347M9999j9798k0489K1912j8844o4164p937K1206q790k2623
$$ 13826 27586 55933 105932 86134 65645 87557 68713 4549 -3388 17818 9028 -13595
26006a3595j0371M0003m7978l9478M3784M4079J4192n2834j2428M9798N14L5438
$$ -13595 -23966 16037 -31941 -71419 -27635 16444 30636 -22198 -34626 15172 15686 51124
25994E1124q8052m261M983q489l9317k5242N3806M7198n6071n7347R1590O8135
$$ 51124 -36928 -41189 -36206 -44695 -84012 -109254 -55448 -8250 -64321 -121668 -30078 38057
25982C8057N0606J3702k7922J9649l8951L436M924k9857n858J6321K2098n9002
$$ 38057 88663 102365 74443 94092 55141 58577 63501 33644 27786 44107 66205 7203
25970G203m3344j3858L2221J1686L9811M1273J3272n7607o4259m0421P1423O2008
$$ 7203 -36141 -49999 -17778 -6092 33719 74992 88264 30657 -33602 -74023 -2600 59408
25958E9408k8627k2751j3602m4542n286M2260N1728o2133l6378k5998j8966Q991
$$ 59408 30781 8030 -5572 -50114 -55400 -13140 38588 -23545 -59923 -85921 -104887 -95896
25946i5896O836K4783l0345L7025O3333n3073n6809O097L6489J9843l2659O526
$$ -95896 -89060 -64277 -94622 -57597 5736 -47337 -104146 -98049 -61560 -41717 -74376 -67850
25934f7850N8502K6817L4577J0694L0938j2822k7450p233M1663K6982j2757m3077
$$ -67850 -9348 17469 52046 62740 93678 80856 53406 46173 87836 114818 102061 58984
25922E8984m7587j0332j08791J4480R2378M5778l1104o1730N976j666j5295N176
$$ 58984 11397 1065 -107726 -93246 -868 44910 13806 -47924 -41948 -43614 -58909 -53733
25910e3733k4833p7320l141N4166J37744J5676K0139P51p248O115m4550l9137
$$ -53733 -78566 -155886 -159027 -104861 32883 48559 68698 69449 62201 68316 23766 -15371
25898a5371K2028j4317p3485M983N2807R553l9057m3574K9901K0474o553p0248
$$ -15371 6657 -7660 -81145 -76162 -23355 -13802 -52859 -96433 -66532 -46058 -52611 -122859
25886a22859Q2666O5052k5191M974J1751m088r184O011K0862O2458M2705o173
$$ -122859 -40193 24859 -332 4642 16393 12305 3121 9132 29994 92452 135157 128984
25874A28984k3532q0907j9037J5134o934K8600l1717j9896J14826L2770j9738
$$ 128984 105452 24545 5508 20642 13708 42308 10591 -9305 105521 138291 118553
25863A18553q8859J3290J23732j3378M641j4941j6169j6762j0614k0244m7121
$$ 118553 29694 42984 166716 153338 157979 143038 126869 110107 99493 79249 32128
25852C2128j9873N2462M969j8124M6470j4701k7817j8525m682N3395p32K5903
$$ 32128 12255 64717 69686 51562 98032 83331 55514 36989 32307 85702 84970 110873
25840A10873n0856P1465J306p0726l0534j1036K2241p270Q7755Q1643l8523n2490
$$ 110873 60017 131482 132788 62062 31528 20492 42733 35463 123218 204861 166338 113848
25828A13848L1513K6820k5420n8211N0534l1629j8950J715M131p178o1371J0368
$$ 113848 145361 172181 146761 88550 139084 107455 88505 90220 94351 87173 25802 36170
25816C6170J7084J2525n772l3182K9223L4086j3010k3280O9333L771r479q160
$$ 36170 53254 65779 60007 26825 56048 90134 77124 53844 123177 126948 117469 109309
25804A09309k6972m6224p5188M4258L6171k8351J8363n634j3477P031j573q114
$$ 109309 82337 36113 -39075 5183 41354 13003 31366 25732 12255 19286 17713 9599
25792I599L9640L4948P354n2885n2854K2864j5913J0437N3557O3441j4305k8922
$$ 9599 49239 84187 91541 38656 -14198 8666 -7247 3190 56747 120188 105883 76961
25780G6961m6273j4802K5857K4859j1725J5260j3538k0989m6367L7397k9094K5372
$$ 76961 30688 15886 41743 66602 54877 70137 56599 35610 -10757 26640 -2454 22918
25768B2918N1100j7224J3638k9500l193p312k2495K8022L2442k7453m1173Q517
$$ 22918 74018 56794 70432 40932 37739 30427 7932 35954 68396 40943 -230 8287
25756H287K7852M0987L022O557m9351m6299K6062M8925l6912k2438L2445m4341
$$ 8287 36139 77126 80148 86705 37354 -8945 17117 66042 29130 6692 39137 -5204
25744e204l8571R299M4844M7945J3851m3058o6934P130l9022j0794Q274m1312
$$ -5204 -43775 -34476 10368 58313 72164 29106 -37828 -30698 -69720 -80514 -72240 -113552
25732a13552K1369Q3763R0011L7180J3443j1703J10376j742p556l6790m6505l3179
$$ -113552 -92183 -8420 81591 118771 132214 120511 230887 229145 221589 184799 138294 105115
25720A05115m7590l8166k5072K5859N00k0888l1022L81r053k9129m4538M9904
$$ 105115 57525 19359 -5713 20146 20646 -242 -31264 -30883 -39936 -69065 -113603 -63699
25708f3699L8463l5787n6916J3712J0902P3911L4901J234m649N3814j758n2682
$$ -63699 -25236 -61023 -117939 -104227 -93325 -19414 15487 16721 12072 65886 64128 11446
25696A1446K5000K6620j9593l1722O352n5920m0997l8953j2232K5761L5307K9584
$$ 11446 36446 63066 43473 11751 18103 -37817 -78814 -117767 -129999 -104238 -68931 -39347
25684c9347L566q025n3099K5061m3930k4340j0981J0237N5434O3368M0196J080
$$ -39347 -35781 -43806 -96905 -71844 -115774 -140114 -151095 -140858 -85424 -22056 18140 19220
25672A9220L0155N8736j9355j8811j8620J9217k1767K4023j7986o5538j0002k7579
$$ 19220 49375 108111 88756 69945 51325 70542 48775 72798 54812 -10726 -20728 -48307
25660d8307N1595N2162O384k74N12j7078m2840L981j659l4275m9512m7610l6048
$$ -48307 3288 55450 61834 61560 62072 44994 2154 6135 4476 -29799 -79311 -126921 -162969
25647a62969L6776L3308j5762m3748L3889k5436r131Q058M810m3890k3900O4686
$$ -162969 -126193 -92885 -108647 -152395 -118506 -143942 -153073 -145015 -140205 -184095 -207995 -143309
25635a43309J00701r792k2000o704r573N4741O6802Q359m3080n0106j1798L1413
$$ -143309 -42608 -52400 -74400 -81104 -90677 -35936 30866 39225 -3855 -53961 -65759 -34346
25623c4346M5417O5325M572p5854l0826k1991M441N1152m4904o61M0565j4360
$$ -34346 11071 76396 80968 5114 -25712 -47703 -43262 7890 -37014 -37675 2890 -11470
25611a1470l3134n2541j8305l1922J426j7302k8589L908Q208j4969L8661j4645
$$ -11470 -44604 -97145 -115450 -147372 -145946 -163248 -191837 -187929 -179721 -194690 -156029 -170674
25599a70674k0561j5602O607j0440j6853Q5127j373L272m944J4476L8232l3807
$$ -170674 -191235 -206837 -200230 -210670 -227523 -142396 -143769 -140497 -145441 -130965 -92733 -126540
25587a26540l1182j7514n8248M0262j6654l5511M4558O6463M6429l1393m7232
$$ -126540 -157722 -175236 -233484 -193222 -209876 -245387 -200829 -134366 -87937 -119330 -166562
25576a66562m0965l4628L7101O5248o329J38067J12558O9911k2480o6478O4768
$$ -166562 -207527 -242155 -205054 -139806 -146135 -8068 104490 174401 151921 85443 150211
25565A50211M6063k6077m2059O9011k709k5229N7072N5389K9504K4408M2417j6037
$$ 150211 196274 170197 128138 197149 194440 169211 226283 281672 311176 335584 378001 361964
25553C61964j1009N923l3311m2799o2513L0094p156j1145K1661k7527l7320j8581
$$ 361964 350955 356878 323567 280768 218255 248349 241193 230048 251709 224182 186862 168281
25541A68281k1511K3940r341J6174o6024j6349j7233K6667m3685K3050R7890L723
$$ 168281 146770 170710 161369 177543 111519 95170 77937 104604 60919 83969 181859 185582
25529A85582m0350Q11k0567l8979j600n0715K9154L2514N7300J0117l1592L586
$$ 185582 145232 146043 125476 86497 84897 34182 63336 95850 153150 163267 131675 135261
25517A35261J5386j364R350P2453J7959K5845k5705m9641n1020n2278L1235l7096
$$ 135261 150647 149283 158633 231086 249045 274890 249185 199544 148524 96246 127481 90385
25505I0385o195L3346k0769j420M5471L7686o0706p3187n8998m4206k2136m0714
$$ 90385 84190 117536 96767 95347 140818 178504 117798 44611 -14387 -58593 -80729 -121443
25493a21443l5494n55R826j3420j0291l1458p8797N6135o0363k8733J6109m6174
$$ -121443 -156937 -157492 -147666 -161086 -171377 -202835 -281632 -225497 -285860 -314593 -298484 -344658
25481c44658Q697J2796M3713k4846O2379O0471o2875q2316m5095M8447J1694Q915
$$ -344658 -335961 -323165 -279452 -304298 -241919 -181448 -244323 -326639 -371734 -323287 -311593 -302678
25469c02678M3881M776k6723j1584k5220K0818j4551Q390L4933j0981K5878M8978
$$ -302678 -258797 -254021 -280744 -292328 -317548 -296730 -311281 -302891 -267958 -278939 -253061 -204083
25457b04083P8301N212j9079p2074p1735Q187J7348n3032m137J8155k7106j4782
$$ -204083 -125782 -120570 -139649 -211723 -283458 -275271 -257923 -310955 -315092 -296937 -324043 -338825
25445c38825N135O678k8220O4235Q1979k3552n9831L5136K9905L7771m3861k7403
$$ -338825 -333690 -327012 -355232 -290997 -209018 -232570 -292401 -257265 -227360 -189589 -233450 -260853
25433b60853L2166j2813M7420K6311J8363R9260Q5469O2276N7J6535O7358M4181
$$ -260853 -228687 -241500 -194080 -167769 -149406 -50146 35323 97599 97656 114191 181549 225730
25421B25730K8249L0391P0761J9353K5153l605m6967K2725L7977n2116p0761J8892
$$ 225730 253979 284370 355131 374484 399637 396032 349065 371790 409767 357651 286890 305782
25409C05782R8853K0109l3535j8329l6881o44K7259j1185o1414o4992r9288l278
$$ 305782 404635 424744 391209 372880 335999 335355 362614 351429 290015 225023 125735 122457
25397A22457m1537J3842m1448m475N0202k100q165L2141L0914O0775n0811q3799
$$ 122457 80920 94762 53314 48839 99041 96941 88776 120917 151831 212606 161795 77996
25385G7996J5447j6066n4934k6197O7044K958L8146N6569K4611k7183P9853L5240
$$ 77996 93443 77377 22443 -3754 63290 66248 104394 160963 185574 158391 238244 273484
25373B73484m715N8080O6248o5607l8469q538l5709n3701l0414l2760J2772M6796
$$ 273484 268769 326849 393097 327490 289021 280483 244774 191073 160659 127899 140671 187467
25361A87467k0254J065o228n4718M3617N347r8852p0440M64K444K6006N1593M6438
$$ 187467 167213 168278 162050 107332 150949 156296 57444 -12996 -12532 -10088 15918 67511 113949
25348A13949L8121J543M6865M5908M9210O8060j4463k5619J06706M6626k6349
$$ 113949 152070 153613 200478 246386 295596 363656 349193 323574 430280 476906 450557
25337D50557k7241O3793L0946Q233P5090N4623J0500N81M8710O7932N8028L9361
$$ 450557 423316 487109 518055 526288 601378 656001 666501 667082 715792 783724 841752 881113
25325H81113o321m0519j1712o2942j9247j6975l0309n1209J300R982m6228o9670
$$ 881113 874792 834273 822561 759619 740372 723397 693088 641879 643179 653161 606933 537263
25313E37263L6364Q2711J0066N0048M8122K2907J07508Q0081J00645Q0243N8882
$$ 537263 573627 656338 666404 716452 764574 787481 894989 975070 1075715 1155958 1214840
25302A214840N3273M7922J2350j0750q6923r4204q5207r9569q1223j9265q036
$$ 1214840 1268113 1316035 1328385 1317635 1230712 1136508 1051301 951732 870509 851244 843208
25291H43208m9829o6411L2803O7730O4163K7211n5432k9863l7158l2808l5091
$$ 843208 793379 726968 759771 827501 891664 918875 863443 833580 796422 763614 728523
25280G28523p963o5396q7241m0332q735n73o2826j12248j12224o2013o6K1395
$$ 728523 720560 655164 567923 527591 518856 518283 455457 343209 230985 168972 168906 190301
25268A90301J5605l2437n0019n063K8749m358R998n522N1480M19r2246k0959K8167
$$ 190301 205906 173469 123450 118387 147136 142778 152776 147254 198734 199153 106907 85948 114115
25255A14115J0895n17R789L8195O2899O3331O5406L8296o680L4457p655k9714
$$ 114115 125010 124493 134282 172477 235376 298707 364113 402409 395729 430186 422531 392817
25243C92817j758J4912J761n557m7784L0411P3001P1384O7103K7724O5085k9361
$$ 392817 391059 405971 407732 402175 354391 384802 457803 529187 596290 624014 689099 659738
25231F59738k6765j357K2323P1913L7692M52l2475j37514j09416n1610k7172M2062
$$ 659738 632973 631616 653939 725852 763544 763996 731521 594007 484591 432981 405809 447871
25219D47871n4091j09853L841n2088n7436m3004j2114l0970O072l1446k3925L203
$$ 447871 393780 283927 287768 235680 178244 135240 123126 92156 98228 66782 42857 46060
25207D6060R2494L9389N6334M9143K1942N4506P6155k6115M9402Q426l9112j33738
$$ 46060 138554 177943 234277 283420 305362 359868 436023 409908 459310 467736 428624 294886
25195B94886j26373n0360r4705p3978r1270r0162j08378j14377q5855n7688j5629
$$ 294886 168513 118153 23448 -50530 -141800 -231962 -340340 -454717 -540572 -598260 -613889
25184f13889L2128J21553J20285N3211M8747L3609J55618J64192J34973P5310
$$ -613889 -581761 -460208 -339923 -286712 -237965 -204356 -48738 115454 250427 325737
25174C25737J01409M2588r0604k1773O316m8521N6334L3620N3866j5259j19271
$$ 325737 427146 469734 379130 357357 363673 315152 371486 405106 458972 443713 324442
25163C24442j60421k01086j91487j73282r2032j6427L167K2346R373j36924j53217
$$ 324442 164021 -37065 -228552 -401834 -493866 -510293 -507126 -484780 -475407 -612331 -765548
25152g65548j70634j03051J3110K5361J40539J88015J61841K05904K16350L02342
$$ -765548 -936182 -1039233 -1026123 -1000762 -860223 -672208 -510367 -304463 -88113 214229
25142B14229J71595J53518P3091Q5921L2548m7885O627L7634P2200J06186R7467
$$ 214229 385824 539342 612433 698354 730902 683017 689644 727278 799478 905664 1003131
25131A003131K6512M6685L3297o2481n3536l5263o5874p7657J5394m4862j36301
$$ 1003131 1029643 1076328 1109625 1047144 993608 958345 892471 814814 830208 785346 649045
25120F49045j15153j44033j40880q0730q8071r2455o9992K3296Q6229J25964J57411
$$ 649045 533892 389859 248979 168249 80178 -12277 -82269 -58973 27256 153220 310631
25109C10631J70360K35153K48516K33578J55817J40046K05413K84567L18660L84714
$$ 310631 480991 716144 964660 1198238 1354055 1494101 1699514 1984081 2302741 2687455
25099B687455L53477L66678L78410L89907M69507O22808O31154O32717O18304
$$ 2687455 3040932 3407610 3786020 4175927 4645434 5268242 5899396 6532113 7150417
25090G150417P39682P61485Q78752Q36361Q06021Q22910R77373J125355J223501
$$ 7150417 7890099 8651584 9530336 10366697 11172718 11995628 12973001 14098356 15321857
25081A5321857J355155J458894J399143J353348J478511J586800J809170K223572
$$ 15321857 16677012 18135906 19535049 20888397 22366908 23953708 25762878 27986450
25073B7986450K650736L123641L486824L843127M190198M593029N084829N536835
$$ 27986450 30637186 33760827 37247651 41090778 45280976 49874005 54958834 60495669
25065F0495669O053531O540433P102486P625118Q030260Q568164R372732J0479559
$$ 60495669 66549200 73089633 80192119 87817237 95847497 104415661 113788393 124267952
25057A24267952J2027053J3961255J6379436J9197397K2351012K4940899K5888958
$$ 124267952 136295005 150256260 166635696 185833093 208184105 233125004 259013962
25050B59013962K4330300K0353854J5121923J0181397O681841M705944L337596
$$ 259013962 283344262 303698116 318820039 329001436 335683277 340389221 343726817
25043C43726817J195369k931119r973542j9368503k8268046l4054122l5708741
$$ 343726817 344922186 341991067 332017525 312649022 284380976 250326854 214618113
25036B14618113l3750789k9601971k4673779j9920581j6094131j2808310j0128510
$$ 214618113 180867324 151265353 126591574 106670993 90576862 77768552 67640042
25029F7640042q001899o380971n053909l956601l235371k641574k271304j903475
$$ 67640042 59638143 53257172 48203263 44246662 41011291 38369717 36098413 34194938
25021C4194938j575966j296102j233704j211066j238638j225112j170669j079230
$$ 34194938 32618972 31322870 30089166 28878100 27639462 26414350 25243681 24164451
25013B4164451j010134r66978r30517r02044r35754r34023p68139o07477n24098
$$ 24164451 23154317 22187339 21256822 20354778 19419024 18485001 17716862 17109385 16585287
25004A6585287m80929l93966l91038m97175n30326m23788m06532k79914k47757
$$ 16585287 16104358 15710392 15319354 14822179 14291853 13868065 13461533 13181619 12933862
24995A2933862k42860k13561k14868k03375k48117l31648l31365k68143k34766
$$ 12933862 12691002 12477441 12262573 12059198 11811081 11479433 11148068 10879925 10645159
24986A0645159j61897o3587l9816o5109m9586j97032k88003l06363l16983l32369
$$ 10645159 10483262 10419675 10379859 10314750 10265164 10068132 9780129 9473766 9156783 8824414
24976H824414m04236l88523k92497l57404l64571l41095l95033m05201l62558
$$ 8824414 8420178 8031655 7739158 7381754 7017183 6676088 6281055 5875854 5513296
24967E513296k65416j76628k21185j07767j12860q5755l1439J7624P749O291K1787
$$ 5513296 5247880 5071252 4850067 4742300 4629440 4543685 4512246 4529870 4537619 4543910 4565697
24956D565697j3361l5261j0240p0748o0435k4999r0318m0716k0004j6484k8079
$$ 4565697 4552336 4517075 4506835 4436087 4375652 4350653 4260335 4219619 4199615 4183131 4155052
24945D155052o3253m2210N0757Q1110M3453M2376M01o0135o0986q6754p1735k0387
$$ 4155052 4091799 4049589 4100346 4181456 4224909 4267285 4267686 4207551 4146565 4059811 3988076 3967689
24933C967689J7260N4060K5782p626k9434j4584r8156m2981N6508J44426J39480
$$ 3967689 3984949 4039009 4064791 4057165 4027731 4013147 3914991 3872010 3928518 4072944 4212424
24922D212424R1293L1169j1227j43227k30332k32480k06986k26229k55052k05234
$$ 4212424 4303717 4334886 4323659 4180432 3950100 3717620 3510634 3284405 3029353 2824119
24912B824119k04354k51604k03878j01310j36146p9286q0046r8130k1444j04493
$$ 2824119 2619765 2368161 2164283 2062973 1926827 1847541 1767495 1669365 1647921 1543428
24902A543428j81544l5326o742R500m9389o1122K9445j0428k3592n646p510q659
$$ 1543428 1361884 1326558 1319816 1329316 1279927 1218805 1248250 1237822 1214230 1208584 1201074 1192415
24890A192415l6801r2968J6290j073m6937J4157J85873J34419J19275J09554Q828
$$ 1192415 1155614 1062646 1078936 1077863 1030926 1045083 1230956 1365375 1484650 1594204 1603032
24879A603032O4442N4720L5551J8946q8437n0879q2572o5282J0794k2723n7203
$$ 1603032 1667474 1722194 1757745 1776691 1688254 1637375 1554803 1489521 1500315 1477592 1420389
24868A420389q4418j00260p4767o4818j4155o1486M0039J1118j9681j4064j8612
$$ 1420389 1335971 1235711 1160944 1096126 1081971 1020485 1060524 1071642 1051961 1037897 1019285
24857A019285m5436l5328j8389m3248j07330j04104n0004l006k2503K2117M0471
$$ 1019285 973849 938521 920132 876884 769554 665450 615446 612440 589937 612054 652525
24846F52525n3815q303l3127q1114m4813n5423k6700M3877M6413l7963J2598L2355
$$ 652525 598710 590407 557280 476166 431353 375930 349230 393107 439520 401557 414155 446510
24834D46510L923K8177J7322J6383M3390J6947j5920J7956l3658o0508K0090k6421
$$ 446510 450433 478610 495932 512315 555705 572652 556732 574688 541030 480522 500612 474191
24822D74191l9798j1853n8246q7396l6356O946o9497j41514j7090K1758J2187
$$ 474191 434393 422540 364294 276898 240542 247488 177991 36477 19387 41145 53332
24811E3332m7844o6159m809O497J0167o1140l0430j12271o8187L4860Q416m9666
$$ 53332 5488 -60671 -65480 -58983 -48816 -109956 -140386 -252657 -320844 -285984 -277568 -327234
24799c27234n9144P086J9596M4569L2848K4226k0275o5446m8543L2215K5399k7539
$$ -327234 -386378 -379292 -359696 -315127 -282279 -258053 -278328 -343774 -392317 -360102 -334703 -362242
24787c62242M045N3524P0273L6386J05497P9812L020p6203k1240N7235M1289M1361
$$ -362242 -358197 -304673 -234400 -198014 -92517 -12705 -9685 -85888 -107128 -49893 -8604 32757
24775C2757K6538j2154l2316r8626l6544n5465n1866o2621j1645J264l2014K3009
$$ 32757 59295 47141 14825 -83801 -120345 -175810 -227676 -290297 -301942 -300678 -332692 -309683
24763c09683M3545M46m5928M9658O9616K3970N2361K0469K5715M5384K0434P833
$$ -309683 -266138 -265692 -311620 -261962 -192346 -168376 -116015 -95546 -69831 -24447 -4013 3820
24751C820n2461k1570K2867O2551P0912M363k3061l0576j6516K2906m6753j3405
$$ 3820 -48641 -70211 -47344 15207 86119 90482 67421 36845 20329 43235 -3518 -16923
24739a6923J2386M5726J3614p197L6332P5788p680q714Q7724O0397K2307N3481
$$ -16923 -4537 41189 54803 47606 83938 159726 152046 143332 231056 291453 313760 367241
24727C67241j2155o2941n937o6955k3162k6503k076o0449j0085o3245k184m2298
$$ 367241 355086 292145 286208 219253 196091 169588 167512 107063 96978 33733 31549 -10749
24715a0749J63l4491K1911K6709N6789L8223O6888K4285O485k5154L324K9321
$$ -10749 -10586 -45077 -23166 3543 60332 98555 165443 189728 196213 171059 174383 203704
24703B03704l0412r7712n4518k3956K6212l9309p2813m7941J0538K9040m3572
$$ 203704 173292 75580 21062 -2894 23318 -15991 -88804 -136745 -126207 -97167 -140739
24692a40739M727M9820k3622j6373M3413m5724n8859K9697R1149O9459M8643J6574
$$ -140739 -136012 -86192 -109814 -126187 -82774 -128498 -187357 -157660 -66511 2948 51591 68165
24680F8165k2782m1537k3072j3472o887n5333J6996J2593M6508O6823Q0767Q3416
$$ 68165 45383 3846 -19226 -32698 -39585 -94918 -77922 -65329 -18821 48002 128769 212185
24668B12185J2905n9615r993O4624Q8088M8822K7646l8879J3315P2133L4961k5953
$$ 212185 225090 165475 155482 220106 308194 357016 384662 345783 359098 431231 466192 440239
24656D40239R220j8533k5086O3712M3591o1431K149K1628o7734p0036k4670m6970
$$ 440239 449459 430926 405840 469552 513143 451712 453861 475489 407755 337719 313049 266079
24644B66079m6854J4556L8710O5301O677J6300N4711n2137o515K147l9305j4615
$$ 266079 219225 233781 272491 337792 344469 360769 415480 363343 356828 358975 319670 305055
24632C05055j2585k0878M9515N2900m2010N6379M2823K3602r813j1883q341l452
$$ 305055 292470 271592 321107 374007 331997 388376 431199 454801 444988 433105 424764 421312
24620D21312k2k0626m510j1513k8226J6740o44J268M211k2318o388L2899M8243
$$ 421312 421290 400664 396154 384641 356415 373155 372511 373779 377990 355672 349284 382183 430426
24607D30426k5406o6481k9946J5995L7224O8320J7689r0709j5311L1288j6571
$$ 430426 405020 338539 308593 324588 361812 430132 447821 357112 341801 373089 356518
24596C56518m8670o6738K4756J9717m9313q6966o3715p4714j3558M4954M3376
$$ 356518 307848 241110 265866 285583 236270 149304 85589 10875 -2683 42271 85647
24585H5647m7420O148K9276o0164o8909o6449L4342L0784L3768K8573k6570n7529
$$ 85647 38227 44375 73651 13487 -55422 -121871 -87529 -56745 -22977 5596 -20974 -78503
24573g8503l6610k232K5353L6751J8904J5456L6257K2515O3971L2425k8976J7605
$$ -78503 -115113 -117345 -91992 -55241 -36337 -20881 15376 37891 101862 134287 105311 122916
24561A22916L6687n9238l8063p163P709N4736R125q5287o6302l934k2406p289
$$ 122916 159603 100365 62302 55139 62848 117584 126709 41422 -24880 -28814 -51220 -58509
24549e8509n3767o1998J9501j3470K6024M7859j8237l3398L7603L309q076k7578
$$ -58509 -112276 -174274 -154773 -168243 -142219 -94360 -112597 -145995 -108392 -105083 -113159 -140737
24537a40737j2979J2392j6814m4903J5446L0018J7937Q7945N5112K7077p5190
$$ -140737 -153716 -141324 -158138 -203041 -187595 -157577 -139640 -51695 3417 30494 -44696
24526d4696k5884N3759K8216J7907J7447N9836P9872K4594o736k0052n7264K6263
$$ -44696 -70580 -16821 11395 29302 46749 106585 186457 211051 204315 184263 126999 153262
24514A53262P4019P8266m5184J0084L0561k4159m7669m3014j9625j9177K9552
$$ 153262 227281 305547 260363 270447 301008 276849 229180 186166 166541 147364 176916
24503A76916l3071m8297j3746K7947J8581k2332l0204J2105N8518N6854K5100
$$ 176916 143845 95548 81802 109749 128330 105998 75794 87899 146417 203271 228371
24492B28371K7662O0786k9150l9833k5008n5088K6769M5855l5282j7205j8539
$$ 228371 256033 316819 287669 247836 222828 167740 194509 240364 205082 187877 169338
24481A69338j15825l4069R290O3615K6230J6838m7629n0426k005L5804K1860j964
$$ 169338 53513 19444 28734 92349 118579 135417 87788 37362 35357 71161 93021 91057
24469I1057P366j5557L8100k3181j9438K648J3913J2790l8405m8365O1058K7063
$$ 91057 98423 82866 120966 97785 78347 80995 94908 107698 69293 20928 81986 109049
24457A09049O646L2919L9226N552n38j8160j9900o422l4763l1320n0682n857M8537
$$ 109049 115695 148614 187840 193392 192854 174694 154794 148372 113609 82289 31607 25750 74287
24444G4287J16568J4466j8058l2183n4930n881n3979n0463O997O157q5996J1975
$$ 74287 190855 205321 187263 155080 100150 94269 40290 -10173 -3176 2981 -83015 -71040
24432g1040J4988L1085k8605l2064L8808M2380o0731m6112N1980N9369Q3121J3988
$$ -71040 -56052 -24967 -53572 -85636 -46828 -4448 -65179 -111291 -59311 58 83179 97167
24420I7167O4379k9958l4322N1924n899j6091l255j8454n7556K2056K3963p332
$$ 97167 161546 131588 97266 149190 143291 127200 123945 105491 47935 69991 93954 86622
24408H6622k2452N618J2966m4225p130L4767j4709L3930k2403l9982l132N7525
$$ 86622 64170 69788 82754 38529 31399 66166 51457 85387 62984 23002 19870 77395
24396G7395R602O4577Q0400J0081l3821j1408j7237m227q696m7249l7781o3849
$$ 77395 86997 151574 231974 242055 208234 196826 179589 175362 166666 119417 81636 17787
24384A7787j5192M8795O4611R263m9228k0376K3873J2797j2983j4046J6652N474
$$ 17787 2595 51390 116001 125264 76036 55660 79533 92330 79347 65301 81953 87427
24372H7427n4759r1156J8517k578L0728n574n6611k5480M2821J28694N5504o2348
$$ 87427 32668 -58488 -39971 -42549 -11821 -17395 -74006 -99486 -56665 72029 127533 65185
24360F5185n0620q5656R303J1508J6798O8563Q741J4109n5444j1086N9167k6353
$$ 65185 14565 -71091 -61788 -50280 -33482 35081 43822 57931 2487 -8599 50568 24215
24348B4215q1096p259P2408J8763k3281P2848p122j2063o5876k421K0511J7899
$$ 24215 -56881 -64140 8268 27031 3750 76598 69476 57413 -8463 -10884 9627 27526
24336B7526M9627k7015k9031k4288J7893p884j4551k7733N330O3143M2786j00367
$$ 27526 77153 50138 21107 -3181 14712 6828 -7723 -35456 -30126 33017 75803 -24564
24324b4564R571N4658L1591J4488K787L8107k3790m8679l6554M8431r713l4481
$$ -24564 -14993 39665 71256 85744 88531 126638 102848 54169 17615 66046 56333 21852
24312B1852p1969K5995L4427O4159K310r371j6018J1367m0945O829j0396l2916
$$ 21852 -50117 -24122 10305 74464 76774 67403 51385 62752 21807 28636 18240 -14676
24300a4676j1223k0055L5460N5292M465o867J6992J964q2253l3729j161K9472
$$ -14676 -25899 -45954 -10494 44798 49263 42396 59388 61352 -20901 -54630 -55791 -26319
24288b6319j0164j6836J9423M8715p7490J1860R8959M8137O366n3844n892J325
$$ -26319 -36483 -53319 -33896 14819 -62671 -50811 48148 96285 102651 48807 42915 44240
24276D4240Q233j6064m0701m9085k8917K013j4436K3670j3291n503M6277N4688
$$ 44240 52473 36409 -4292 -53377 -82294 -80281 -94717 -71047 -84338 -89841 -43564 11124
24264A1124J3031o273K910j6287M6680L5305o967o7754k824L0193L2750K5638
$$ 11124 24155 17882 20792 4505 51185 86490 79523 11769 8945 39138 71888 97526
24252I7526K6035L981o0573n134j5867P499m2977k2220k21l6928O9018M3792m5922
$$ 97526 123561 127542 66969 61835 45968 53467 10490 -11730 -11951 -48879 20139 63931 18009
24239A8009m6165R917K5190O890l536k2717K8161P6974m0224l0453k1185m4474
$$ 18009 -28156 -18239 6951 13841 10305 -12412 15749 92723 52499 22046 861 -43613
24227d3613Q3100O8943K0253j1130m6695m7795l4158N3456l1054n0411O2201K232
$$ -43613 39487 108430 128683 117553 70858 23063 -11095 42361 11307 -39104 23097 25329
24215B5329m083N6275k8625p7989M3188P0374J4508l4599k1868N3807L64l6799
$$ 25329 21246 77521 48896 -29093 14095 84469 98977 64378 42510 96317 96681 59882
24203E9882m3596o477j660K1230l7672J1043M5589j3682n8166k8341q619k3029
$$ 59882 16286 9809 8149 29379 -8293 2750 48339 34657 -23509 -51850 -60469 -83498
24191h3498O2248M9992p76K3030M621m0602j3808Q192K1262N9459N5810k0205
$$ -83498 -21250 28742 27966 50996 55617 15015 1207 9399 30661 90120 145930 125725
24179A25725j2740q5456r247M3983J370j4234L5222n5515k8564j9142m0388m388
$$ 125725 112985 27529 18282 62265 63635 49401 84623 29108 544 -18598 -58986 -63374
24167f3374k809j5102M1180J2352J7123k58k0573j0103L788j3081M1519L8176
$$ -63374 -66183 -81285 -40105 -27753 -10630 -10888 -31461 -41564 -37776 -50857 -9338 28838
24155B8838l2194k881p096O0364N4271N412m5395M9017N0720m7586j02655p9160
$$ 28838 -3356 -6237 -13333 47031 101302 106714 61319 110336 161056 113470 10815 -68345
24143f8345m1570l397L6675j9075M2048M2161L46L0576n053n2501m0055J8980
$$ -68345 -109915 -113312 -76637 -95712 -53664 -11503 -11157 19419 14366 -38135 -78190 -59210
24131e9210M4109K2056k7452R325L8418o5429j0827K2308J5569J9848L6273J4614
$$ -59210 -15101 6955 -20497 -11172 27246 -38183 -49010 -26702 -11133 8715 44988 59602
24119E9602q478O761k450l4840j2559N694K4171K461L2822k288p8759j2903K7838
$$ 59602 51124 57885 55435 20595 8036 13730 37901 40362 73184 70896 -7863 -20766 7072
24106G072n6785j4122J7631k4333j1985N444m979J281Q117L7675N2018K3411K9457
$$ 7072 -49713 -63835 -46204 -70537 -82522 -77078 -82057 -80776 -72659 -34984 17034 40445 69902
24093F9902K8003l308p2358m7164M595j7890m9166j443o4550M517P4838o053M1431
$$ 69902 97905 94597 22239 -24925 -20330 -38220 -87386 -88829 -153379 -148862 -74024 -80077 -38646
24080c8646O4798r563o5111k6859m1725K2693N9830K1030j3786M2578k1828k0612
$$ -38646 26152 16589 -48522 -75381 -117106 -94413 -34583 -13553 -27339 15239 -6589 -27201
24068b7201j160R001q5840n2689K8153P6159L2016J4299J899k1791l4487J3152
$$ -27201 -28361 -19360 -105200 -157889 -129736 -53577 -21561 -7262 -5363 -27154 -61641 -48489
24056d8489J7851N7365L1779K0449M93n96o2860r687R533J8843L2222l3186N012
$$ -48489 -30638 26727 58506 78955 79448 78852 15992 6305 15838 34681 66903 33717 38729
24043C8729o39L8796j8321k5644o4433o4388J5929O510l0221M4743N4295L3516
$$ 38729 38090 76886 58565 32921 -31512 -95900 -79971 -73461 -103682 -58939 -4644 28872
24031B8872J4192j238k6850n721K69P0853M5914p7547l7939k5170k2952o654P038
$$ 28872 43064 41826 14976 9255 9524 80377 126291 48744 10805 -14365 -37317 -43971 -36933
24018c6933J6083L748K9671J8485J7317L9266j3909K9925l217l7012J0244k740
$$ -36933 -20850 -17102 12569 31054 48371 87637 73728 103653 100436 63424 73668 70928
24006G0928j3619m805K1485O3254m1590n0426j6816k8297m4956k0064J60k0845
$$ 70928 57309 52504 73989 137243 95653 45227 28411 114 -44842 -64906 -64746 -85591
23994h5591l8349K0293P563J3327L7979J6541K2152k3850R926K6661R933l1761
$$ -85591 -123940 -103647 -96084 -82757 -44778 -28237 -6085 -29935 -20009 6652 16585 -15176
23982a5176N9438m0595o1263L1173P0612J3998n2947l4212J3400l3093l1100K7068
$$ -15176 44262 3667 -57596 -26423 44189 58187 5240 -28972 -15572 -48665 -79765 -52697
23970e2697L6528N04k7343j2431n583J0052O0492Q3151R597n8184n5975n2824
$$ -52697 -16169 -15665 -43008 -55439 -61022 -50970 9522 92673 102270 44086 -11889 -64713
23958f4713K5026K6071R165j7086L2058l5443o5762K4029P5397O0091L8466J2404
$$ -64713 -39687 -13616 -4451 -21537 10521 -24922 -90684 -66655 8742 68833 107299 119703
23946A19703n2356k1932j8960l2109J5039j485l1076L8357M9851j9527L4221J3838
$$ 119703 67347 45415 26455 -5654 9385 7900 -23176 15181 65032 45505 79726 93564
23934I3564O2667n3688N003j9888p44l6825L2337l455o863l9215p453N6505m5602
$$ 93564 156231 102543 107546 87658 86914 50089 82426 78971 72108 32893 25440 81945 36343
23921C6343l4963k8559k7713k489M0903J1892j5218J6777q615J6138K781J556
$$ 36343 1380 -27179 -54892 -57381 -16478 -4586 -19804 -3027 -11642 4496 7277 8833
23909H833o3215m686l1363l7650O9905K5848P44J5601J6142M840K3844M6900j6982
$$ 8833 -54382 -59068 -90431 -128081 -58176 -32328 -31584 -15983 159 4999 28843 75743 58761
23896E8761n8623j7787J029k7934J2238J2764Q070N230R902N2400N0435n8542
$$ 58761 138 -17649 -16620 -44554 -32316 -19552 -11482 -6252 3650 56050 106485 47943
23884D7943l991k8175k6908L4801j21J4156k9043m012K3671M21M3898j2915l0794
$$ 47943 43952 15777 -11131 23670 23549 37705 8662 4650 28321 28742 72640 59725 28931
23871B8931k5870P900j2422o6765M050j382l1619O096l2039m3456Q1544O894r068
$$ 28931 3061 10961 -1461 -68226 -64176 -65558 -97177 -91081 -123120 -166576 -85032 -78138 -87206
23858h7206R816J06757n986M08K0795n4761r406K3681k2632K7907L2124l1015
$$ -87206 -77390 29367 23381 23789 44584 -10177 -19583 4098 -18534 9373 41497 10482
23846A0482j6875J247N011M0539m9545n4173P8263L3132J2966l8765j5341N831
$$ 10482 -6393 -5146 -135 40404 -9141 -63314 14949 48081 61047 22282 6941 12772
23834A2772L344P4793K4178q5418J1904M0271l5686L5302o889l4168o0182l3276
$$ 12772 16116 90909 115087 29669 41573 81844 46158 81460 74571 40403 -19779 -53055
23822e3055L4903L0652J9828n5939k1781R993k7617l1488N430L9582M7964m74
$$ -53055 -18152 12500 32328 -23611 -45392 -35399 -63016 -94504 -89074 -49492 -1528 -2002
23810b002n5732l3262K1369N7954K8661L0648r02o9120o0550J3608M0912J3218
$$ -2002 -57734 -90996 -69627 -11673 16988 47636 46734 -22386 -82936 -69328 -28416 -15198
23798a5198K279n7710k5450O8713M3871m8424q9607l595Q9309L5264l549K467
$$ -15198 -12919 -70629 -96079 -27366 16505 -31919 -121526 -125121 -35812 -548 -4097 -1630
23786a630O6036J4307j268l6942l6636J0639P857k007k7199P2257P832m4804O7012
$$ -1630 64406 78713 77445 40503 3867 14506 22363 20356 -6843 65414 73246 28442 95454
23773I5454J9015m3896k5365J1969o0068k5261N0817M8486J5873N128L5310J5304
$$ 95454 114469 70573 45208 57177 -2891 -28152 22665 71151 87024 92152 127462 142766
23761A42766K5722l2230l9665k8035p7331j9068P415J8870l3375K4476M2639M541
$$ 142766 168488 136258 96593 68558 -8773 -27841 -20426 -1556 -34931 -10455 32184 36725
23749C6725n9932m3931J7801O3342l3648j3751J451j5344L989J3300K8616M341
$$ 36725 -23207 -67138 -49337 14005 -19643 -33394 -31943 -47287 -43298 -29998 -1382 2959
23737B959L2732j7153k4951j5431k3121O7055R780o638K6774K8334J0681J8437
$$ 2959 35691 18538 -6413 -21844 -44965 22090 31870 25232 52006 80340 91021 109458
23725A09458j764M0349K1886m1033k0165q6941j23273m8411P4285J01646N0929
$$ 109458 107694 148043 169929 128896 108731 21790 -101483 -149894 -75609 26037 76966
23714G6966l3664n0850m8914Q820J8946j0623L0127m461j3958o031L9868j7680
$$ 76966 43302 -7548 -56462 -47642 -28696 -39319 -9192 -13653 -27611 -33642 6226 -11454
23702a1454J1527J7825n470J2366o218k5991l4284J8002K4488o65k3617o8292
$$ -11454 73 17898 12428 24794 18576 -7415 -41699 -23697 791 126 -23491 -91783
23690i1783J8593O7297N5592L2211J2975n5189k8884K1140L1469N475j8487m382
$$ -91783 -73190 -5893 49699 81910 94885 39696 10812 31952 63421 68896 50409 46027
23678D6027k7924n8680K2200k6647K4982L2734L850J5381K1088k4957m2111j0453
$$ 46027 18103 -40577 -18377 -45024 -20042 12692 16542 31923 53011 28054 -14057 -24510
23666b4510L060M2072k0978k563k7610L16o446p9227k3417M0379P1056K6184n0819
$$ -24510 -21450 20622 -356 -2919 -30529 -30213 -36659 -115886 -139303 -98924 -27868 -1684 -52503
23653e2503n870J9642J9364l1609K8724O15K3524J7165n320R533K0579K9154m337
$$ -52503 -58373 -38731 -19367 -50976 -22252 -21637 1887 19052 13732 23265 43844 72998 68661
23640F8661k3340p954j9515N1668Q865l9405J3366M3328l106n679k1472J4073
$$ 68661 45321 37367 17852 69520 78385 38980 52346 95674 92568 86889 65417 79490
23628G9490l2535p028P568N802K6414k4436p282L2148P7826j9452o0362j8208
$$ 79490 46955 39927 47495 53297 79711 55275 47993 80141 157967 138515 78153 59945
23616E9945l0080n7584k2325J0655K0840k6138o279O706l7869J4738j7646k6110
$$ 59945 29865 -27719 -50044 -39389 -18549 -44687 -50966 -44260 -82129 -67391 -85037 -111147
23604a11147L368K412j4918K2054K5848L7591N5563K6341p184l10j1975j7747
$$ -111147 -107779 -105367 -120285 -98231 -72383 -34792 20771 47112 39928 39618 27643 9896
23592I896L3773K9486r711l3672J5359n1070Q565N0337k9761K2926k0477L811
$$ 9896 43669 73155 63444 29772 45131 -5939 2626 52963 23202 46128 25651 29462
23580B9462k6506k0507K2166J6798r649j4043K7537O3810R862k3182K6116N1200
$$ 29462 2956 -17551 4615 21413 11764 -2279 25258 89068 98930 75748 101864 153064
23568A53064K4592j497o1702j6000O614l0864p1310J1208J8289K0582J1410l6360
$$ 153064 177656 176159 114457 98457 105071 74207 2897 14105 32394 52976 64386 28026
23556B8026J2805K4325p739l6668n6863J2610O874M3966j7460Q136o7197j307
$$ 28026 40831 65156 57417 20749 -36114 -23504 -16630 27336 9876 18012 -49185 -50492
23544e0492J1068l2578p778M614J2172L597j7279n44O5968N3199O1174n1103m8848
$$ -50492 -39424 -72002 -79780 -75166 -62994 -59397 -76676 -77220 -11252 41947 103121 52018 3170
23531C170p8831k6968O26K2283J5964K6313M5603J2178N4839J7850l4604J4604
$$ 3170 -75661 -102629 -102003 -79720 -63756 -37443 8160 20338 75177 93027 58423 73027
23519G3027M8237k623j11551j07542q523M2485O8900O0853n590k4941j6454m0637
$$ 73027 121264 118641 7090 -100452 -108975 -66490 2410 63263 57673 32732 16278 -24359
23507b4359j7869O9089j2604m9260n931L2100N5163k1752p3211n5386J6834Q622
$$ -24359 -42228 26861 14257 -35003 -40934 -8834 46329 24577 -48634 -104020 -87186 -78564
23495g8564o4921m26P6229L2974O4538O65o4549k5393J4539P4203j8372J1737
$$ -78564 -143485 -143911 -67682 -34708 29830 30495 -34054 -59447 -44908 29295 10923 22660
23483B2660j4142k1693M3131j4334M397j8109j6426j5385L9077M4178k2294p9818
$$ 22660 8518 -13175 29956 15622 20019 1910 -14516 -29901 9176 53354 31060 -48758
23471d8758n6533N7983n20n828l8287m0350J9815M7614q296l217k1056Q196Q7037
$$ -48758 -105291 -47308 -47828 -53656 -91943 -132293 -112478 -64864 -73160 -76377 -97433 -89237 -2200
23458b200J00180m7368l3882K5748K9670M8420n0487q4442p8764j50M966K6600
$$ -2200 97980 50612 16730 42478 72148 120568 70081 -14361 -93125 -93275 -88309 -61709
23446f1709R1508K954k7650l2421J1631L277L0912m1057R531J3665p339q951j0665
$$ -61709 29799 32753 5103 -27318 -15687 -12410 18502 -22555 -13024 641 -6698 -15649 -26314
23433b6314J3540r404J8156j0082N542Q886p4356M545r061m3781R643J6466M9635
$$ -26314 -12774 -22178 -4022 -14104 -8562 324 -74032 -69487 -78548 -122329 -112686 -96220 -46585
23420d6585Q010k8565o199L7788L4926j3668K4526L4079o3019n1467k0540J608
$$ -46585 -38575 -67140 -73339 -35551 -625 -14293 10233 44312 -18707 -70174 -90714 -89106
23408h9106O1773K8127l244P563N5435M2928K2078m6629p6035j8625j3503p107
$$ -89106 -27333 794 -2450 5113 60548 103476 125554 78925 2890 -15735 -29238 -36345
23396c6345K8568l8177M7206K7846J6431N1102K592k9011o2366M14l118m1090
$$ -36345 -7777 -45954 1252 29098 45529 96631 99223 70212 7846 8260 5142 -35948
23384c5948j4055N0256r558p9050M127O3695K661K9942k5453L7817L6414K1066
$$ -35948 -50003 253 -9305 -88355 -84228 -20533 -17872 12070 -13383 24434 60848 81914
23372H1914l3028J642p074K2963k8233r2086M077M7932l6609K2455j2289q461
$$ 81914 48886 50528 43454 66417 38184 -53902 -49825 -1893 -38502 -16047 -28336 -36797
23360c6797K5584l3178l9117N6858k603k5873l4102P2253j7481j0963p480M310
$$ -36797 -11213 -44391 -83508 -26650 -29253 -55126 -89228 -16975 -34456 -45419 -52899 -48589
23348d8589L5245J3058j4666J9460k662q0157j6724O9687M603P461l483m317N0410
$$ -48589 -13344 -286 -14952 4508 1846 -78311 -95035 -25348 -20745 -13284 -16767 -21084 29326
23335B9326l659k3057k3868j2449o3675M5024K4170M662K9969K9904j4854K4662
$$ 29326 25667 2610 -21258 -33707 -97382 -52358 -28188 -23526 6443 36347 21493 46155
23323D6155K5195J1284J2889p449p7261k7919Q970k966m0158j2824K0148N4319
$$ 46155 71350 82634 95523 88074 10813 -17106 -8136 -11102 -51260 -64084 -43936 10383
23311A0383j6889J4040K9646K8589J8959l6255N565J0205j1280k7139K9415L988
$$ 10383 -6506 7534 37180 65769 84728 48473 54038 64243 52963 25824 55239 59227
23299E9227k3838l0996J5121j1484j7735m6207j4558O4871P1888R238m4041P178
$$ 59227 35389 4393 19514 8030 -9705 -55912 -70470 -5599 66289 75527 31486 38664
23287C8664l3633o8899k302N1639k097n0698J8028q623O3331P7316p1931m6341
$$ 38664 5031 -63868 -66170 -14531 -16628 -67326 -49298 -57921 5410 82726 10795 -35546
23275c5546m019q563J4577m1141k0512R048N7264j2083l8246j4955P4484L9806
$$ -35546 -39565 -48128 -33551 -74692 -95204 -86156 -28892 -40975 -79221 -94176 -19692 20114
23263B0114K4708k2331n1764k5614L5173J5328j3597J2719k0539k4690M0660J4254
$$ 20114 44822 22491 -29273 -54887 -19714 -4386 -17983 -5264 -25803 -50493 -9833 4421
23251D421j1891K800K7461J8771l8975Q154K7728o4833l3718k2326J2430Q2324
$$ 4421 -7470 -4670 22791 41562 2587 10741 38469 -26364 -60082 -82408 -69978 12346
23239A2346M1966J4272J6815o2701m3752p3780o1908J1110M8487J6090L4652Q3989
$$ 12346 54312 68584 85399 22698 -21054 -94834 -156742 -145632 -97145 -81055 -46403 37586
23227C7586r735j6574J9853K6701n0288n3820j5193K534K1248O7118O6240J9507
$$ 37586 27851 11277 31130 57831 7543 -46277 -61470 -58936 -37688 29430 95670 115177
23215A15177m2603n1064o362o3781q7270k9243L3429l899J1499j3601K0554j0434
$$ 115177 72574 21510 15148 -48633 -135903 -165146 -131717 -135616 -124117 -137718 -117164 -127598
23203a27598p264O9837M3978O0227n048k1671k8326k9299m0898L6963Q1888k3053
$$ -127598 -134862 -65025 -21047 39180 34132 12461 -15865 -45164 -86062 -49099 32789 9736
23191I736L1577l6229o2633q347K5301J4641l283N8375N6943l5215n8457m028
$$ 9736 41313 5084 -57549 -65896 -40595 -25954 -29237 29138 86081 50866 -7591 -11619
23179a1619m8755l2558L4131Q113R4j0914q922L455J812j6107l077N7302K1517
$$ -11619 -60374 -92932 -58801 -50688 -50594 -61508 -70430 -66975 -65163 -81270 -84347 -27045 -5528
23166e528n3788q930L7349N9914M7339l8123m9401r655n2668P542K1528m6053
$$ -5528 -59316 -68246 -30897 29017 76356 38233 -11168 -20823 -73491 -65949 -44421 -90474
23154i0474J8028J08315K8396M192m5835k2975l0318n7272j1399K5622k8764K7971
$$ -90474 -72446 35869 64265 68457 22622 -353 -30671 -87943 -99342 -73720 -102484 -74513
23142g4513J39263k3451p8409M3915L629j6589l0968K9249K0032n6060k8418M2460
$$ -74513 64750 41299 -37110 6805 10434 -6155 -37123 -7874 12158 -43902 -72320 -29860
23130b9860k7497j6034K0164J01163L8822o7592l5072j8209O149J5422J6235m3526
$$ -29860 -57357 -73391 -53227 47936 86758 19166 -15906 -34115 -27966 -12544 3691 -39835
23118c9835J5170L1618L3066k8801n2726j0016m150J434m9032L0290M6240K8224
$$ -39835 -24665 6953 40019 11218 -41508 -51524 -55674 -54240 -103272 -72982 -26742 1482
23106A482M5766k3022k6216J5496j7612l6798m078L9825P5496K8179l8322q3438
$$ 1482 47248 24226 -1990 13506 -4106 -40904 -44982 -5157 70339 98518 60196 -23242
23094b3242o7727P376J00798N9721l2484l1220P054J03615O1k3351P483j1177
$$ -23242 -90969 -83593 17205 76926 44442 13222 20276 123891 123952 100601 108084 96907
23082I6907l1291j08450n4503j6388O6834L6506Q641K7379n8532o1162k7750K2585
$$ 96907 65616 -42834 -97337 -113725 -46891 -10385 -1744 25635 -32897 -94059 -121809 -99224
23070i9224K8776Q1423N6845M4542P764k2307L5527k1347k5899J8651n046J9140
$$ -99224 -70448 10975 67820 112362 120126 97819 133346 111999 86100 104751 99705 118845
23058A18845m5440n0025m8910N314k4335K7849M1360p0957O286N4511O7910R947
$$ 118845 73405 23380 -25530 -20216 -44551 -16702 24658 -46299 -40013 14498 82408 92355
23046I2355m927J5811k5007l4154m7880N4147R9597k8892q7615k9844L3039j01
$$ 92355 87428 103239 78232 44078 -3802 50345 149942 121050 33435 3591 36630 36529
23034C6529l3482M0975J9748k8077n4272j7175p0473N188M931Q353K8296L6581
$$ 36529 3047 44022 63770 35693 -18579 -35754 -106227 -101039 -96108 -87755 -59459 -22878
23022b2878L431K9843k361q2444l9912J4645L3866K2661L874J7931M4401J4135
$$ -22878 -19447 10396 8035 -74409 -114321 -99676 -65810 -43149 -39275 -21344 23057 37192
23010C7192M8829k6372j7761p2442l6062L820q063N235n629k8542K6168O2344
$$ 37192 86021 59649 41888 -30554 -66616 -62796 -70859 -65624 -71253 -99795 -73627 -11283
22998a1283K7919O7568o3284m5009o420k5704j2961r729L1048k4895J5612l5281
$$ -11283 16636 84204 20920 -24089 -30509 -56213 -69174 -78903 -47855 -72750 -57138 -92419
22986i2419O270J9295n1342M8014J14879m9720K757L6819L3741k0969p2671m4056
$$ -92419 -86149 -66854 -118196 -70182 44697 -5023 -2266 34553 68294 47325 -25346 -69402
22974f9402J9018M7170L8478r663l7957j1327O0378j4043j6247k6248j3239m6018
$$ -69402 -50384 -3214 35264 25601 -12356 -23683 36695 22652 6405 -19843 -33082 -79100
22962g9100r430L4825Q2105J5352r3821j9211N4902Q691l3448m5693l3895l1130
$$ -79100 -88530 -53705 28400 43752 -50069 -69280 -14378 -5687 -39135 -84828 -118723 -149853
22950a49853L3059l215j656R421j3781N2395Q0681L2748n3274j2515j9604K7879
$$ -149853 -116794 -120009 -121665 -112244 -126025 -73630 7051 39799 -13475 -25990 -45594 -17715
22938a7715K3438j1242n5188p150J4392j9693l5317r025m2363r845P9580L0918
$$ -17715 5723 -5519 -60707 -67857 -53465 -73158 -108475 -117500 -159863 -169708 -90128 -59210
22926e9210j6634M0708r301L1746K37j9899J6668O1222p30l7650j3160K1572l3719
$$ -59210 -75844 -35136 -44437 -12691 -12454 -32353 -15685 45537 44807 7157 -6003 15569 -18150
22913a8150k3113J4093n325j7937l0404O850N6996K7388k3843m6715K6715P0869
$$ -18150 -41263 -27170 -32495 -50432 -80836 -73986 -16990 10398 -13445 -60160 -33445 37424
22901C7424L0467J6210l7026m0414j9536p628L5735j5627m3534M558k7619m3549
$$ 37424 67891 84101 47075 6661 -12875 -20503 15232 -395 -43929 -39371 -66990 -110539
22889a10539M1283K4958L3733L2110J5223l2867k6182o2924m7792J7166J7566
$$ -110539 -69256 -44298 -10565 21545 36768 3901 -22281 -85205 -132997 -115831 -98265
22878i8265N6421J00319N2597k6971m4672J0950M3601m4257l6157K803p995k0010
$$ -98265 -41844 58475 111072 84101 39429 50379 93980 49723 13566 16369 8374 -11636
22866a1636K5021K832o2856k3368j874L7801L9450k326J0837l4313l6210m2781
$$ -11636 13385 16217 -46639 -70007 -71881 -34080 5370 3044 13881 -20432 -56642 -99423
22854i9423n6035L4102M1088j8319K426L646l2535k2574N7653J7330P9137J0221
$$ -99423 -155458 -121356 -80268 -98587 -96161 -92515 -125050 -147624 -89971 -72641 6496 16717
22842A6717j085K5534j4950j2552O380p90m7372k2968N3051M4428r414o3893l8166
$$ 16717 15632 41166 26216 13664 20044 19254 -28118 -51086 1965 46393 36979 -26914 -65080
22829f5080P661l0154o341l1577k0919k9986n464R2273P6314j387j7920Q738k7778
$$ -65080 -57419 -87573 -93914 -125491 -146410 -176396 -181860 -89587 -13273 -14660 -32580 -23842 -51620
22816e1620m8696O0108k6148j1264K4053J761J1814P731J4399M2526j2442n416
$$ -51620 -100316 -40208 -66356 -77620 -53567 -51806 -39992 -32261 -17862 24664 12222 6806
22804F806N623k2358N9138L9741k7081J1524p473k3056l3941P428P217l9628l2400
$$ 6806 12429 -9929 49209 88950 61869 73393 65920 42864 8923 16351 23568 -16060 -48460
22791d8460k856K3437J9335O144Q552N45O0261k0801n6635L0504n5063l7397K5592
$$ -48460 -51316 -27879 -8544 -2400 6152 6697 66958 46157 -10478 20026 -35037 -72434 -46842
22778d6842K4333L3737j2604p455k9179L2087M7934m1811J0169M3223m7821l7535
$$ -46842 -22509 11228 -1376 -8831 -38010 -5923 42011 200 10369 53592 5771 -31764
22766c1764O339m2884k8769M8236J7360k3882O8437L0858k7671o5307j0494k1187
$$ -31764 -25425 -68309 -97078 -48842 -31482 -55364 13073 43931 16260 -49047 -59541 -80728
22754h0728j1755m7719K1064o80K094j5164j5869K5555j431J0134N9914o400L5969
$$ -80728 -92483 -140202 -119138 -119818 -117724 -132888 -148757 -123202 -124633 -114499 -54585 -60985 -25016
22741b5016K9965K4176k2199j8239Q0364N6979k5642k9534o2048p9407l1317N6593
$$ -25016 4949 29125 6926 -11313 69051 126030 100388 70854 8806 -70601 -101918 -45325
22729d5325L9703k6822N0144m717J7604K8904k4391l3826J413m9121j4471M1400
$$ -45325 -5622 -32444 17700 12983 30587 59491 35100 1274 2687 -46434 -60905 -19505
22717a9505l533j4117j8664M459J9373n644O797j1728m475O4578K065m4222K8752
$$ -19505 -23038 -37155 -55819 -51360 -31987 -37631 -30834 -42562 -47037 17541 19606 -24616 4136
22704D136N3977N1223l7957n7308p5587N6488k7323o4459K9718J7615J9913l8078
$$ 4136 58113 109336 71379 14071 -61516 -5028 -32351 -96810 -67092 -49477 -29564 -67642
22692f7642k0550Q131K7071N7164L2401K6319N1940r432r242j3405l2394K1104
$$ -67642 -88192 -80061 -52990 4174 36575 62894 114834 105402 96160 82755 50361 71465
22680G1465j8912p232k8010K4335k4271q1466q281P1067K8568m9283k0493K1603
$$ 71465 52553 45321 17311 41646 17375 -64091 -72372 -1305 27263 -22020 -42513 -20910
22668b0910O315K526J8641n4259L1672O0571Q947m8628o6640l3026M8636N0902
$$ -20910 -14595 -12069 6572 -47687 -16015 44556 53503 4875 -61765 -94791 -46155 4747
22656D747m0571j589m7329J5716P6617o8409k9472k534q388l228m498L5448J9715
$$ 4747 -35824 -37413 -84742 -69026 7591 -60818 -90290 -92824 -101212 -104440 -108938 -73490 -53775
22643e3775p0128l0854N718N1202l1418M5858K6445L4192J8182l0076j4959l0390
$$ -53775 -123903 -154757 -149039 -97837 -129255 -83397 -56952 -22760 -4578 -34654 -49613 -80003
22631h0003N1288K2358k2646L9736K1558L97J8000l6918k5306l4113k2784J6874
$$ -80003 -28715 -6357 -29003 10733 32291 32688 50688 13770 -11536 -45649 -68433 -51559
22619e1559k4739P1811M1438K838Q3214k4891j18599l5217l414k7649k3635P661
$$ -51559 -76298 -4487 36951 39789 123003 98112 -20487 -55704 -59118 -86767 -110402 -102741
22607a02741m8116p35K1720l7370N3118O9148k4802k2603J3694K259j106N349
$$ -102741 -150857 -151592 -129872 -167242 -114124 -44976 -69778 -92381 -78687 -76428 -77534 -72185
22595g2185k3731K8748K2639l6441R693J8208l0550l2784L2832l2822n9416O1542
$$ -72185 -95916 -67168 -44529 -80970 -71277 -53069 -83619 -116403 -83571 -116393 -175809 -114267
22583a14267L1004L5880q707j7840l1898J5273N7628k4531k4302n9078q33r843
$$ -114267 -83263 -47383 -56090 -73930 -105828 -90555 -32927 -57458 -81760 -140838 -141671 -151514
22571a51514J8647J1628N5177K7330q483j5088N4026M1659Q503n0236o045L510
$$ -151514 -132867 -121239 -66062 -38732 -47215 -62303 -8277 33382 41885 -8351 -14396 -10886
22559a0886J8035J2780k5008N8390M6976N2487n2596l904L557l4672l5093k1533
$$ -10886 7149 19929 -5079 53311 100287 152774 100178 96274 99831 65159 30066 8533
22547H533j9462K4037n480l4640q754n5785l8493M3066J5207K8494J9907K058
$$ 8533 -10929 13108 7628 -27012 -35766 -91551 -130044 -86978 -71771 -43277 -23370 -21312
22535b1312p2695o3386L1433N9426O2308L7426L2998j6161q5411k1945P4547M362
$$ -21312 -94007 -157393 -125960 -66534 -4226 33200 66198 50037 -35374 -57319 17228 21590
22523B1590l7034j5582L6265J3262M1324l9480j01006Q081N3939L7353q927k5024
$$ 21590 -15444 -31026 5239 18501 59825 20345 -80661 -72580 -18641 18712 9785 -15239
22511a5239k8737J3222l0360l6659K7453O0305P050k8571J2785l674k025n3321
$$ -15239 -43976 -30754 -61114 -97773 -70320 -10015 -2965 -31536 -18751 -22425 -24450 -77771
22499g7771j227k012L376j859L8611K5313m6494N6061P1333l1002l9987L547j6985
$$ -77771 -78998 -81010 -77634 -79493 -40882 -15569 -62063 -6002 65331 34329 -5658 -2111 -19096
22486a9096j8950j6642j6770K3077L4449m6631M608M0928J3191j6207n6856j4891
$$ -19096 -38046 -54688 -71458 -48381 -13932 -60563 -55955 -15027 -1836 -18043 -74899 -89790
22474h9790M6451K8703K6708O236j6056Q29J3288m2195k5330l8980K2576J5508
$$ -89790 -43339 -14636 12072 18308 2252 3081 16369 -25826 -51156 -90136 -67560 -52052
22462e2052k0717M3271N6565L9537k2222J7685J9472K0263m0201l4296n7460J0642
$$ -52052 -72769 -29498 27067 66604 44382 62067 81539 101802 61601 27305 -30155 -19513
22450a9513J9140j04651K7635L1037K3973n770l1348J2034R7705K2884m9962j8562
$$ -19513 -373 -105024 -77389 -46352 -22379 -28149 -59497 -47463 50242 73126 23164 4602
22438D602K4871l322k314M2748o5057l883N8805K605l9159l6564J194r811O015
$$ 4602 29473 26151 23837 66585 1528 -2355 56450 59055 19896 -16668 -15474 -25285 -19270
22425a9270K2665o470l5583K0533M1233K8988M762n5593j8982M9304j3539j4781
$$ -19270 3395 -3075 -38658 -18125 23108 52096 56858 1265 -17717 31587 18048 3267
22413C267k4724J5373J8913k8257j2421j6776J5752j2422l2145j9328L9554P9291
$$ 3267 -21457 -6084 12829 -15428 -27849 -44625 -28873 -41295 -73440 -92768 -53214 26077
22401B6077n373L5881R553j6209n0426N6125M1308r938o3597J379M8222K1535
$$ 26077 20704 56585 66138 49929 -497 55628 96936 86998 23401 24780 73002 94537
22389I4537k1345J8263j3064q8917m2257K4799M9122m674m8891m5430R0149L3394
$$ 94537 73192 91455 78391 -10526 -52783 -27984 21138 16464 -32427 -77857 12292 45686
22377D5686J796m3922L1923Q824M338k937k3170o2754L2742N9137L6672K744q4159
$$ 45686 47482 3560 35483 44307 48645 45708 22538 -40216 -7474 51663 88335 91079 6920
22364F920k1580O517j6753J1373L419J7565l3645j3552k7458j2071n6726N602
$$ 6920 -14660 -8143 -24896 -13523 -10104 7461 -26184 -39736 -67194 -79265 -135991 -130389
22352a30389Q8665N6980n7400n0241R078O4307j1488P619M761j1227l4086k472
$$ -130389 -41724 15256 -42144 -92385 -83307 -19000 -30488 -22869 -18108 -29335 -63421 -65893
22340f5893P3479r614N691K8378j1863o6307j6044M4347K2467j6156j6180K9730
$$ -65893 7586 -2028 3663 32041 20178 -46129 -62173 -17826 4641 -11515 -27695 2035
22328B035N1306K7754o0364n0341o7774R5241q318r989Q196Q1965L3k9275l2762
$$ 2035 53341 81095 20731 -29610 -97384 -2143 -10461 -20450 -12254 69711 69744 40469 7707
22315G707j1718J4787j3513L5782m910j333L4882n9755m3249O6027P1878r807
$$ 7707 -4011 10776 -2737 33045 28135 26802 61684 1929 -41320 24707 96585 86778
22303H6778j9250K7362j6224n4972n5597L5394J0002p5937l7871J4743L5424q410
$$ 86778 67528 94890 78666 23694 -31903 3491 13493 -62444 -100315 -85572 -50148 -58558
22291e8558l9519L7686L7844k1395l0969l3574o031n579K2261N3478j5061N1668
$$ -58558 -98077 -60391 -22547 -43942 -74911 -108485 -114516 -120095 -97834 -44356 -59417 -7749
22279g749P407l9719j7378m4403J4917L3186l9215n273k7636J3285M3873M1797
$$ -7749 -342 -40061 -57439 -101842 -86925 -53739 -92954 -98227 -125863 -112578 -68705 -26908
22267b6908Q1841l7080n2748m2063M9221J9823m7205n145l4147K0485L1636k1966
$$ -26908 54933 17853 -34895 -76958 -27737 -7914 -55119 -60264 -94411 -73926 -42290 -64256
22255f4256K3828J5485Q359J4441K0877m2097l5129n1718k4870K4728L3243K5509
$$ -64256 -40428 -24943 -16584 -2143 18734 -23363 -58492 -110210 -135080 -110352 -77109 -51600
22243e1600J0396M6555k8079k8371l997n9072J2702k3209r506K7946Q0041O8609
$$ -51600 -41204 5351 -22728 -51099 -55096 -114168 -101466 -124675 -134181 -106235 -26194 42415
22231D2415k0421m5828L8141o107n3258O2J2012K6608J5435k2369M486n401M9714
$$ 42415 21994 -23834 14307 8200 -45058 -44996 -32984 -6376 9059 -13310 -8824 -14225 35489
22218C5489k1151p0155l2724P3950N3300k0718m1582l0694k3524j4530L8533O0865
$$ 35489 14338 -55817 -88541 -14591 38709 17991 -23591 -54285 -77809 -92339 -53806 7059
22206G059J7668J8131M0896J1588l5524k7701L7292J2833p870l7415m2213O0145
$$ 7059 24727 42858 83754 95342 59818 32117 69409 82242 74372 36957 -5256 54889
22194E4889M4514j6588J1148J7053l5681j08919k0384l385J7177M1571J7566j037
$$ 54889 99403 82815 93963 111016 75335 -33584 -53968 -57353 -40176 1395 18961 17924
22182A7924k4848J5536O1211k0669j4475j8558K0631M3004O746P231q393o4480
$$ 17924 -6924 8612 69823 49154 34679 16121 36752 79756 86502 93733 85340 20860
22170B0860r6142j465L0707J5113J8100J8890j9569q265j4512N0182J442j5316
$$ 20860 -75282 -76747 -46040 -30927 -12827 6063 -13506 -21771 -36283 13899 15341 25
22158B5k0271k678J0411M1433p9977p9354P695J686j1503k4287J1652J7757k0406
$$ 25 -20246 -22924 -12513 28920 -51057 -130411 -122716 -121030 -132533 -156820 -145168 -127411 -147817
22145a47817l7768K1770j2091P090L0364M4731N5993J3194J8313K4921P2905k4345
$$ -147817 -185585 -163815 -175906 -168816 -138452 -93721 -37728 -24534 -6221 18700 91605 67260
22133F7260k8250k8941k7916J3762J6343J9583l8361j8086k1311j7640L6135L8743
$$ 67260 39010 10069 -17847 -4085 12258 31841 -6520 -24606 -45917 -63557 -27422 11321
22121A1321K6524j2713L5210k9713k4269n5684K6976M5010K3856p2100j5074M8101
$$ 11321 37845 25132 60342 30629 6360 -49324 -22348 22662 46518 -25582 -40656 7445
22109G445J9837J890k9143p1081n8867J92l208P069L3171m0167j2989L1431j3705
$$ 7445 27282 29172 29 -71052 -129919 -129727 -132935 -125866 -92695 -132862 -145851 -114420 -128125
22096a28125L72K439Q4148M6312k239j4376j5927J0113j8211k0223J8990J3072
$$ -128125 -127753 -125314 -41166 5146 2907 -11469 -27396 -17283 -35494 -55717 -36727 -23655
22084b3655P005K4610J3745j268o0921l1429k7207K2647L5162L2709j3477L1131
$$ -23655 -16650 7960 21705 20437 -40484 -71913 -99120 -76473 -41311 -8602 -22079 9052
22072I052N6406J136k6469L0859M2275L2033m8089o6152l801j05m8689k0914M499
$$ 9052 65458 66594 40125 70984 113259 145292 97203 31051 27250 27145 -21544 -42458 -37959
22059c7959P546m7510K1487L3403j0473l6190j3028K5533M339R069K6733O1037
$$ -37959 -30413 -77923 -56436 -23033 -33506 -69696 -82724 -57191 -52852 -43783 -17050 43987
22047D3987p174n0564j3825j225p692j4794J0012K4862J9480L821J1066l4092
$$ 43987 36813 -13751 -27576 -28801 -36493 -51287 -41275 -16413 3067 6888 17954 -16138
22035a6138J699m0176l6037j0198K0K90N1960R1713q5917n4328k8104J7582N1739
$$ -16138 -14439 -54615 -90652 -100850 -100830 -100540 -48580 43133 -42784 -97112 -125216 -107634 -55895
22022e5895K4417l0773J8611r449k6363j5599L2457k5645J1202l7304M679K6753
$$ -55895 -31478 -62251 -43640 -53089 -79452 -95051 -62594 -88239 -77037 -114341 -109662 -82909
22010h2909M4139P2299J5261m6032Q706j0427J8162J3156j5792J7192j7250k1988
$$ -82909 -38770 33529 48790 2758 11464 1037 19199 32355 16563 33755 16505 -5483
21998e483O1032J3269r1876K4680K044n1354j1974M173k1576K479N9572M659J2297
$$ -5483 55549 68818 -23058 1622 3666 -47688 -59662 -55489 -77065 -74586 -15014 -10355 1942
21985A942K5301n4899o6006M66L6687q418m2817l9923l8858J06354Q2710l9177
$$ 1942 27243 -27656 -93662 -93196 -56509 -64927 -107744 -147667 -186525 -80171 2539 -36638
21973c6638m2274N0397k00m2290L6911K0617o219J3052J4800L7515k7340k0252
$$ -36638 -78912 -28515 -28715 -71005 -34094 -13477 -19696 -6644 8156 45671 18331 -1921
21961a921M9660J9792R815J487n2487m5566p2138j6148P2643M4790j4598k9128
$$ -1921 47739 67531 77346 78833 26346 -19220 -91358 -107506 -34863 9927 -4671 -33799
21949c3799n2103M688O634N1384O1532N2014J3658P274k905r13j2149m3216j7859
$$ -33799 -85902 -81214 -74580 -23196 38336 90350 104008 111282 108377 107464 95315 52099 34240
21936C4240J7811K470J5189J287j3323j277J0494m4825k5716K7162J2305J1415
$$ 34240 52051 54521 69710 70997 57674 56397 66891 22066 -3650 23512 35817 47232
21924D7232K808r509l8844r375p2414K5404J3751L7229M198J7977k5042l0222
$$ 47232 50040 40531 1687 -7688 -80102 -54698 -40947 -3718 480 18457 -6585 -36807
21912c6807p040k7929n3795N1457K6905L2682K432J326K6322k4590k6615k573
$$ -36807 -43847 -71776 -125571 -74114 -47209 -14527 -12095 -10769 15553 -9037 -35652 -38225
21900c8225J8189l3725k4574P2582J6725K7660J6743n444j1169k1782k2145l1
$$ -38225 -20036 -53761 -78335 -5753 10972 38632 55375 49931 38762 16980 -5165 -5196
21888e196k3168j0412j1647k5006m5884l0140N8359J05803j2597K6334N1183n9808
$$ -5196 -28364 -38776 -50423 -75429 -121313 -151453 -93094 12709 112 26446 77629 17821
21876A7821j4006q773M8334O8796k5197p3124K1137N6500J9699Q919j1830m8390
$$ 17821 3815 -4958 43376 112172 86975 13851 34988 91488 111187 120106 108276 59886
21864E9886l7908j5737P542j5577l1051J0564K8843j8426N140k1264N536L8654
$$ 59886 21978 6241 13783 -1794 -32845 -22281 6562 -11864 -6724 -27988 -22452 16202
21852A6202o613k8198J7876K5608K6195K2157O403J7492P0423K2865q3935q5458
$$ 16202 9589 -18609 -733 24875 51070 73227 79630 97122 167545 190410 106475 21017
21840B1017L5284N7160k7433L3554L8925m9782n9881l6714J9065k1684R906J2496
$$ 21017 56301 113461 86028 119582 158507 108725 48844 12130 31195 9511 19417 31913
21828C1913K943l4715m891M8786P366o078J2330m9585J3258K7285J8544J0765
$$ 31913 34856 141 -4750 44036 51402 45324 57654 8069 21327 48612 67156 77921
21816G7921j2841M6192K9879K7347l9966o9317l2769n4619n488N6254J4486j9015
$$ 77921 65080 111272 141151 168498 128532 59215 26446 -28173 -33661 22593 37079 18064
21804A8064L5184l3367l2970N5294M722J972K2360L2208K9369l7854j8027R835
$$ 18064 53248 19881 -13089 42205 46927 48899 71259 103467 132836 94982 76955 86790
21792H6790O9624J076l4590l2809K2439M1214J15295J9420p9908k7353J8021M670
$$ 86790 156414 157490 122900 90091 112530 153744 269039 288459 208551 181198 199219 203889
21780B03889m282K2217K6118J7599M9327M4664k7743L742o2964Q741K2977J5833
$$ 203889 199607 221824 247942 265541 314868 359532 331789 335531 272567 281308 304285 320118
21768C20118J7362K4954j2070l0910J782L1714O3047L7487j3583K3423l1386m9298
$$ 320118 337480 362434 350364 319454 321236 352950 415997 453484 439901 463324 431938 382640
21756C82640R2399J0773r1004q3456m9436o219P2163K3183N224m209k3677m4266
$$ 382640 475039 485812 394808 311352 261916 255697 327860 351043 356267 352058 328381 284115
21744B84115n361p8664m0354K9892J0917p545m2895L2952K0461l849J0836q069
$$ 284115 278754 200090 159736 189628 200545 193000 150105 183057 203518 199669 210505 202436
21732B02436j0367m6551o2225q33j9518J4763M8091l5345l4601R005n2496q348
$$ 202436 192069 145518 83293 82460 62942 77705 125796 90451 55850 64855 12359 4011
21720D011K1973J4187o245q569K2997P1652k7775Q106J9933j5043l1207k411k6685
$$ 4011 25984 40171 33926 25357 48354 120006 92231 100337 120270 105227 74020 71609 44924
21707D4924k4053J3340j626L2768l8528N2755m829L4764j6163m8480J3271K585
$$ 44924 20871 34211 32585 65353 26825 79580 74751 109515 93352 44872 58143 60728
21695F0728o994J1691k7283o2361j9003L1173l5866k4073J08153K6011j5310j7499
$$ 60728 53734 65425 38142 -24219 -43222 -12049 -47915 -71988 36165 62176 46866 29367
21683B9367J7675r549K092L0249m4106l3276j0875o6732M4415O5198M4500L6033
$$ 29367 47042 37493 39585 69834 25728 -7548 -18423 -85155 -40740 24458 68958 104991
21671A04991m1629j07816P936J709K3509M5527K0523j3359J5384l2184l3072N8437
$$ 104991 63362 -44454 -36518 -34809 -11300 34227 54750 41391 56775 24591 -8481 49956
21659D9956J0126K6932j0815q3471r802M1315L2153j5638j1875q228k0007J6085
$$ 49956 60082 87014 76199 -7272 -17074 24241 56394 40756 28881 20653 646 16731
21647A6731O423l5778k9826N951L2911n8358Q491N4873o4221j1262o309M6282
$$ 16731 23154 -12624 -42450 -36499 -3588 -61946 -53455 1418 -62803 -74065 -80374 -34092
21635c4092Q445j3929K207J9713k0033K5118L0927k5197j4810l4383j1082n451
$$ -34092 -25647 -39576 -37369 -17656 -37689 -12571 18356 -6841 -21651 -56034 -67116 -72567
21623g2567O4781Q7729J0865j04425q852L1858q179n3054K9841J19631k874K1912
$$ -72567 -7786 79943 90808 -13617 -22469 9389 1210 -51844 -22003 97628 94754 116666
21611A16666K0177J6220m6234j44147n146K8241J5251n0384m748O095K3464l7077
$$ 116666 136843 153063 106829 -37318 -42464 -14223 1028 -49356 -54104 -48009 -24545 -61622
21599f1622m269M8962O760n7289m4775J0979J5785L1000L7512M9764n1560l6075
$$ -61622 -65891 -16929 -10169 -67458 -112233 -101254 -85469 -54469 -16957 32807 -18753 -54828
21587e4828M0074L7082j1611q7262o081M9503L7504m5122k1583J8607N1449m1451
$$ -54828 -14754 22328 10717 -76545 -82626 -33123 4381 -40741 -62324 -43717 7732 -33719
21575c3719q4582J9884J2333M7961n0669j1765K4803J9495j4524L3489N1085O1384
$$ -33719 -118301 -98417 -86084 -38123 -88792 -100557 -75754 -56259 -70783 -37294 13791 75175
21563G5175j5873J5624M7894j1318O922l2863m2392P539N9628o067K2966J5352
$$ 75175 59302 74926 122820 111502 118424 85561 43169 50708 110336 104269 127235 142587
21551A42587k1307j7321m0868K0664J078j443K2444N0615k549k4000Q058k962
$$ 142587 121280 103959 63091 83755 84833 83390 105834 156449 153900 129900 137958 134996
21539A34996k1585K2030k8943l3964K4338J746k1792k3908k0908K9062K3618k380
$$ 134996 113411 135441 106498 72534 96872 98618 76826 52918 32010 61072 84690 82310
21527H2310P298l0906L5915K2492K0965n1452k1234J5763q335j1844j5864J042
$$ 82310 89608 58702 94617 117109 138074 86622 65388 81151 72816 60972 45108 46150
21515D6150L3352J6459j8947K0979M5420Q914l0321k1012n5866R966l327n3651
$$ 46150 79502 95961 77014 97993 143413 152327 122006 100994 45128 55094 51767 -1884
21503a884o4061K5159L3822O66k8578j2521K7584l582k3838n452l7572J1290M1108
$$ -1884 -65945 -40786 -6964 -6298 -34876 -47397 -19813 -23395 -47233 -52685 -90257 -78967 -37859
21490c7859M3801k5226k2219l383R612n364j6274k220l1904p836K0915M8869l3648
$$ -37859 5942 -19284 -41503 -44886 -35274 -40638 -56912 -59132 -91036 -98872 -77957 -29088 -62736
21477f2736j240K2016l8619k9717j1792m2719P541O6331O2706L3890J5887k3382
$$ -62736 -63976 -41960 -80579 -110296 -122088 -164807 -157266 -90935 -28229 5661 21548 -1834
21465a834J2530r249K9603k0314O476l3097m1156j9578n698J3525K6340N9920
$$ -1834 10696 1447 31050 10736 17212 -15885 -57041 -76619 -82317 -68792 -42452 17468
21453A7468j9036q2267o145M6946k2476j8507J1267p2545q047J10135P1361j8077
$$ 17468 -1568 -83835 -89980 -43034 -65510 -84017 -72750 -145295 -153342 -43207 28154 10077
21441A0077m2889J3559j5692M4435N1283k7439k5871j7999K3904M766J0407m957
$$ 10077 -32812 -19253 -34945 9490 60773 33334 7463 -10536 13368 18134 28541 23584
21429B3584k3230R0575K2973J0680k9103o8902k944p2M8784K2815N0720k3999
$$ 23584 354 90929 113902 124582 95479 26577 23633 23561 72345 95160 145880 121881
21417A21881o0330l016K5241n21k3337o8144J3862L4083Q5070j4608l5243L579
$$ 121881 61551 58535 83776 83255 59918 -8226 5636 39719 124789 110181 74938 78517
21405G8517K2945K2026j7222q0533J3773J10287O422m1866k1926J7480L5825Q375
$$ 78517 101462 123488 106266 25733 39506 149793 156215 114349 92423 109903 145728 154103
21393A54103m2440L075p533n3464k4772K4676o242L720J774K6910N2156M1557
$$ 154103 111663 114738 107205 53741 28969 53645 47403 51123 52897 79807 131963 173520
21381A73520k4164j1462j3429l3j3458j0188J8701R381N136J2539k8768k3327
$$ 173520 149356 137894 124465 124432 110974 100786 119487 128868 134004 146543 117775 94448
21369I4448o557N3016J04999q164o5793p5116L1017k5638Q467J6658m0132l8351
$$ 94448 87891 140907 245906 237742 171949 96833 127850 102212 110679 127337 87205 48854
21357D8854k2015K7238M6621J5318k7585j2503n2699k1337K7639R0317O6734p4574
$$ 48854 26839 54077 100698 116016 88431 75928 23229 1892 29531 119848 186582 112008
21345A12008j1955O5696J0127n0513m1899P0985M9418M9538n0685k3419L6592
$$ 112008 100053 165749 175876 125363 83464 154449 203867 253405 202720 179301 215893
21334B15893L2422L4919k765m9250j7834N3206N2475M5093L8223K3729j6616p2990
$$ 215893 248315 283234 280469 231219 213385 266591 319066 364159 402382 426111 409495 336505
21322C36505j0185K2571M5592n9247m9117K2198l6091j4512j4972K2703O9696
$$ 336505 326320 348891 394483 335236 286119 308317 272226 257714 242742 265445 335141
21311C35141l2646n5254J6103N5481Q4511P8701l722j463k5549j4998K0143L1848
$$ 335141 302495 247241 263344 318825 403336 482037 478315 476852 451303 436305 456448 488296
21299D88296m7774j3245K3516k7702o4717j889M2087k3339k7161M018p3518L8346
$$ 488296 440522 427277 450793 423091 358374 356485 398572 375233 348072 352090 278572 316918
21287C16918M8697Q349M798K5473R443m5493k6963p6348j13539K5024R085K1434
$$ 316918 365615 373964 378762 404235 413678 368185 341222 264874 151335 176359 185444 206878
21275B06878Q9655M0401J1891j701r317j9790O832m8195n1695J5066j8487N1214
$$ 206878 296533 336934 348825 347124 337807 318017 324849 276654 224959 240025 221538 272752
21263B72752n2185k3061j0840M3739R3613k0628m9449q2024K0559M8898p47k9819
$$ 272752 220567 197506 186666 230405 324018 303390 253941 171917 192476 241374 240627 210808
21251B10808M6539N2232J2221j4432J0202K5590O5109k5160r1333j3528N9444
$$ 210808 257347 309579 321800 307368 317570 343160 408269 383109 291776 278248 337692
21240C37692Q192j3473l1826n4944L233L5938J0960N5114m958n8680p473k986
$$ 337692 345884 332411 300585 245641 248874 284812 295772 350886 345928 287248 279775 276789
21228B76789J9387K6413M0971k656k0568J7139k5082j6552J9437l8179p676m5579
$$ 276789 296176 322589 363560 360904 340336 357475 332393 315841 335278 297099 289423 243844
21216B43844k5903K6086M4321k8615l5456k2829N979L9367M9689M8508k1416p3124
$$ 243844 217941 244027 288348 259733 224277 201448 207427 246794 296483 344991 323575 250451
21204B50451L813M9042M5816j0397N792m3487J02K8586k4182k9015n2652j1329
$$ 250451 254264 303306 349122 338725 344517 301030 301132 329718 305536 276521 223869 212540
21192B12540l1546k2260N3697Q216l6148m5045K5416p402K2872K2127L3251M8109
$$ 212540 180994 158734 212431 220647 184499 139454 164870 157468 180340 202467 235718 283827
21180B83827N8134K4963k8088o756l7482l7283k3727L5813R381j0722l6663J10532
$$ 283827 341961 366924 338836 332080 294598 257315 233588 269401 278782 268060 231397 341929
21168C41929P6097M9765q7221q6423K8585K3893l5354k8391L0874N1119j2067
$$ 341929 418026 467791 380570 294147 322732 346625 311271 282880 313754 364873 352806
21157C52806m4204m2733J4301N9756O6215L3484l0017O876M0796k7667M9373O5695
$$ 352806 308602 265869 280170 339926 406141 439625 409608 416484 457280 429613 478986 544681
21145E44681L0709P8727L9222l4397K6004P7264Q537K5970J7878J8462K5166O6883
$$ 544681 575390 654117 693339 658942 684946 762210 770747 796717 814595 833057 858223 925106
21133I25106O4242m0629k0405k5667n144L2906Q2420O5596l910Q441L7332j4251
$$ 925106 989348 948719 928314 902647 897503 930409 1012829 1078425 1074515 1082956 1120288 1106037
21121A106037N8054R7249K7346M4281N5807P6172M8740J34433P4756j350M0720
$$ 1106037 1164091 1261340 1288686 1332967 1388774 1464946 1513686 1648119 1722875 1721525 1762245
21110A762245J05879J27217J23059Q0248J37432J19994J43717J63071J59493J83588
$$ 1762245 1868124 1995341 2118400 2198648 2336080 2456074 2599791 2762862 2922355 3105943
21100C105943K35983K53188K40169K85760K94586L09829K54983K68642L59802
$$ 3105943 3341926 3595114 3835283 4121043 4415629 4725458 4980441 5249083 5608885
21091E608885M39830M56073M47011M40060M81714N26475N97471O42337P00004
$$ 5608885 6048715 6504788 6951799 7391859 7873573 8400048 8997519 9639856 10339860
21082A0339860O98959P20967Q40405Q98218R85847R60233J065668J214994J306809
$$ 10339860 11038819 11759786 12600191 13498409 14484256 15444489 16510157 17725151 19031960
21073A9031960J406860J543091J662462J713270J863094K016223K043267K362757
$$ 19031960 20438820 21981911 23644373 25357643 27220737 29236960 31280227 33642984
21065C3642984K464808K565877K767048K848710K889493L044190L073366L076726
$$ 33642984 36107792 38673669 41440717 44289427 47178920 50223110 53296476 56373202
21057E6373202L051840L004995K876838K715032K557803K374282K018310J614083
$$ 56373202 59425042 62430037 65306875 68021907 70579710 72953992 74972302 76586385
21049G6586385J257197R11575M77016m8266m02314q92369j308721j704562k123107
$$ 76586385 77843582 78755157 79232173 79183907 78781593 77889224 76580503 74875941 72752834
21040G2752834k488743k833932k992953l177669l325794l366694l351781l355278
$$ 72752834 70264091 67430159 64437206 61259537 57933743 54567049 51215268 47859990
21032D7859990l275640l133758l029027k900266k652595k453011k297639k109320
$$ 47859990 44584350 41450592 38421565 35521299 32868704 30415693 28118054 26008734
21024B6008734j913150j747148j607820j336012j226348j147638j001614r00425
$$ 26008734 24095584 22348436 20740616 19404604 18178256 17030618 16029004 15128579
21016A5128579q73032p44798o54433o42229n88976n06598n26885m54680l92353
$$ 15128579 14255547 13510749 12856316 12214087 11625111 11118513 10591628 10136948 9744595
21007I744595l50638l75822l82067l20006l28535l15634k71514k08973j76844
$$ 9744595 9393957 9018135 8636068 8316062 7987527 7671893 7400379 7191406 7014562
20998G014562j71922k12343k39664j64325j62868j47104j64810k47496j63731
$$ 7014562 6842640 6630297 6390633 6226308 6063440 5916336 5751526 5504030 5340299
20989E340299m1952j12052k04081j92964j49473m7883o6157r4313j26552m2597
$$ 5340299 5298347 5186295 4982214 4789250 4639777 4591894 4525737 4431424 4304872 4262275
20979D262275j23253j40220j38033q6725j29347r5414p4568q5409j49299j04635
$$ 4262275 4139022 3998802 3860769 3774044 3644697 3549283 3474715 3389306 3240007 3135372
20969C135372r1204p5694j49646j38954m8179J6221r1372q8128p2081n1815m2713
$$ 3135372 3044168 2968474 2818828 2679874 2631695 2647916 2556544 2468416 2396335 2344520 2301807
20958B301807L5842M3215m9509l4893l652j10508m3025l1262l94n5867q2221l1342
$$ 2301807 2337649 2380864 2331355 2296462 2292810 2182302 2139277 2108015 2107621 2051754 1969533 1938191
20946A938191k2481R374M2668m5416n902L3461o1062n5490p9108k0063n862k9933
$$ 1938191 1915710 1925084 1967752 1922336 1916434 1949895 1888833 1833343 1754235 1734172 1728310 1698377
20934A698377J4004o1722k1252J5679N3921K6889M4432N234n8027j15246o8885
$$ 1698377 1712381 1650659 1629407 1645086 1699007 1725896 1770328 1775562 1717535 1602289 1533404
20923A533404k1166l1758o7750k935n678Q1348k3510p9427j25839o4656j6682
$$ 1533404 1512238 1480480 1412730 1409795 1404117 1485465 1461955 1382528 1256689 1192033 1175351
20912A175351l5859k0484m2524r6204k9318o5734K9253P4963L7428k6297n5234
$$ 1175351 1139492 1119008 1076484 980280 950962 885228 914481 989444 1026872 1000575 945341
20901I45341l9150j0221m1214l1451j3721R726K4097m8099j35602n6145L3217
$$ 945341 906191 895970 854756 823305 809584 819310 843407 795308 659706 603561 636778
20890F36778M2803n5438j4404M6276k3364r756O8805J7098k8607L5374L159l2895
$$ 636778 679581 624143 609739 656015 632651 622895 691700 708798 680191 715565 718724 685829
20878F85829o3184M313L4056L0307n3586k1823K3892K7484k1457n5987o8298k6636
$$ 685829 622645 626958 661014 691321 637735 615912 639804 667288 645831 589844 521546 494910
20866D94910j5343K1496K3306J0863j3839l0446l1142j8229l9586j5594Q222J062
$$ 494910 479567 501063 524369 535232 521393 490947 459805 441576 401990 386396 394618 395680
20854C95680K2954M7120n3297r8009m1862J1497M3833N8511K8599m0779p4821
$$ 395680 418634 465754 412457 314448 272586 284083 327916 386427 415026 374247 299426
20843B99426m198N0707K3600m2441q5J436L5995l0312k2442k9859o7532k4624
$$ 299426 295228 345935 369535 327094 327009 328445 364440 334128 311686 281827 214295 189671
20831A89671R40J7770r371L2457L6228K034l8062L6158l6692J2524j1879l3034
$$ 189671 190611 208381 199010 231467 267695 269729 231667 267825 231133 243657 231778 198744
20819A98744k354m8725m609l756p753K0228J6364p977m7079p0409J9336L0773
$$ 198744 196390 147665 143056 139300 131547 151775 168139 160162 113083 42674 62010 92783
20807I2783J7742L2979r618o5937m787L3562J4483m5035n6770m6718M256J0829
$$ 92783 110525 143504 133886 67949 63162 96724 111207 66172 9402 -37316 -33060 -22231
20795b2231m083L809j2085K5341J1559P471m4191k54j1106L923L7236k3739j4517
$$ -22231 -26314 -22505 -34590 -9249 2310 9781 -34410 -34664 -45770 -41847 -4611 -28350 -42867
20782d2867k1336L3533J727l5790L3505L5958k3569l6131K1589J9334J4302L1715
$$ -42867 -64203 -30670 -28943 -64733 -31228 4730 -18839 -54970 -33381 -14047 255 31970
20770C1970j8369l5308n2156m6369L8697N2203L1291m6394m6816p0760M4687L7461
$$ 31970 13601 -21707 -73863 -120232 -81535 -29332 1959 -44435 -91251 -162011 -117324 -79863
20758g9863K3501n508J2551k199l6808p094L4769M1222M1457J05011L8170n347
$$ -79863 -56362 -61870 -49319 -51518 -88326 -95420 -60651 -19429 22028 127039 165209 159862
20746A59862j5805q3888m6836R566M3919L3932k8489O047K5660j9368K2274j9981
$$ 159862 144057 60169 13333 22899 66818 100750 72261 78308 103968 84600 106874 86893
20734H6893L0585K3469J9887L0545K713n8020n3088L430j3179j2324J18N5982
$$ 86893 117478 140947 160834 191379 194092 136072 82984 86414 73235 60911 61029 117011
20722A17011L5819K7230l2840j4267J3722k3501p6212K7185O7850M397j7015m2510
$$ 117011 152830 180060 147220 132953 146675 123174 46962 74147 141997 146394 129379 86869
20710H6869j127m739K2758l5722m813K2002m1916r277M3612J4069k3144o805j2737
$$ 86869 85742 81003 103761 68039 63226 85228 43312 34035 77647 91716 68572 61767 49030
20697D9030K5484J9682m7562K1821O7671q390n6846m5105L8308j9556k4240J4175
$$ 49030 74514 94196 46634 68455 136126 127736 70890 25785 64093 44537 20297 34472
20685C4472K4498k257j0046j6303J6369j1837M4716M7020j3744j7610K4061L3826
$$ 34472 58970 56713 46667 30364 46733 34896 79612 126632 112888 95278 119339 153165
20673A53165k4364K297m505J221q540k3183K0757N3334M0353p6464L198O4439
$$ 153165 128801 131098 126593 127814 119274 96091 116848 170182 210535 134071 137269 201708
20661B01708L9300M354L8973n3401p5179j4582l6448m1693K0632l3471j8257l4431
$$ 201708 241008 245362 284335 230934 155755 141173 104725 63032 83664 50193 31936 -2495
20649b495R3312O6189N556R493P002p470n4951k1672K9032M7103k020n1k0611
$$ -2495 90817 157006 162562 172055 179057 171587 116636 94964 123996 171099 169079 169028 148417
20636A48417k2790J04352J5756k5566K7761j7244n2943k471l4676L4928M1374
$$ 148417 125627 229979 245735 220169 247930 230686 177743 175272 140596 175524 216898
20625B16898J4406n0463r5014j4104N2063L7529l2212K3568j985k2281K7815N1183
$$ 216898 231304 180841 85827 71723 123786 161315 129103 152671 150686 128405 156220 207403
20613B07403N958l6649k6515l9480k9622P8637L4818P168J415n508m0898k1305
$$ 207403 213361 176712 150197 110717 81095 159732 194550 201718 203133 197625 156727 135422
20601A35422j899J1330m742q2490j9636J2399l1127J9659L3721M2101J7196l2135
$$ 135422 133523 144853 140111 57621 37985 50384 19257 38916 72637 114738 131934 99799
20589I9799J4170k9439M462K6773P137p4385o4800O972L6177J4802o602j224K3941
$$ 99799 113969 84530 88992 115765 122902 48517 -16283 -9311 26866 41668 35066 33842 57783
20576E7783n1866O9605K7159n2487o845k1372k6990M1412M0720m9087J5361O0751
$$ 57783 5917 75522 102681 50194 43349 21977 -5013 36399 77119 28032 43393 104144
20564A04144n4839J1453P1698M0914J3481o6480L3174m4904l6586n1225j0864
$$ 104144 49305 60758 132456 173370 186851 120371 153545 108641 72055 20830 9966
20553I966N802p6685P857M3905l9591m0291P0194M9818l6517L5722J9735J8524
$$ 9966 15768 -60917 -53060 -9155 -48746 -89037 -18843 30975 -5542 30180 49915 68439
20541F8439L9556K9964l3628n4970m0006k8656k8686m3664k4470M9542J5042j6509
$$ 68439 107995 137959 104331 49361 9355 -19301 -47987 -91651 -116121 -66579 -51537 -68046
20529f8046K4061M2341O2316l9677m1318q098M6183R096j0662K4540J9771K8006
$$ -68046 -43985 -1644 60672 20995 -20323 -28421 17762 26858 16196 40736 60507 88513
20517H8513m7979k8046J4063Q7870K306m0527q5859j1637J00394L9283J4303K3135
$$ 88513 40534 12488 26551 114421 116727 76200 -9659 -21296 79098 118381 132684 155819
20505A55819n457k3983J2461k322n3757p886J4064j8136L0095J3649m6162o7489
$$ 155819 150362 126379 138840 136518 82761 74875 88939 70803 100898 114547 68385 896
20493H96m1641L2667J5286M0453p1957M984M19j7253K6593O8877o203m3898N3005
$$ 896 -40745 -8078 7208 47661 -24296 -19312 -18893 -36146 -9553 59324 53121 9223 62228
20480F2228J9458l9504j06093o7996m196Q0067J8065L9601R49J7800k1012q57
$$ 62228 81686 42182 -63911 -131907 -136103 -56036 -37971 1630 2579 20379 -633 -1490
20468a490m318R769n5173m1004O8781K8994o034k600J0635K2914l0996l042k0975
$$ -1490 -5808 3961 -51212 -92216 -23435 5559 -475 -3075 7560 30474 -522 -3564 -24539
20455b4539m4925J06486N3901k3836q0758k9659M2957O7639N1832j0671p5994
$$ -24539 -69464 37022 90923 67087 -13671 -43330 -373 67266 119098 108427 32433
20444C2433k8811k65k5128M6956M8198n272J5148m3219l0924k6547k3674K7055
$$ 32433 3622 3357 -21771 25185 73383 68111 83259 40040 9116 -17431 -41105 -14050
20432a4050K5713LL0613j9075K1519L5923o7224p0369K5790m4856l0964O0543
$$ -14050 11663 11666 42279 23204 44723 80646 13422 -56947 -31157 -76013 -106977 -46434
20420d6434L5389K741K3128L0285p7984k7017Q9960M9678k6805M315l4761J4006
$$ -46434 -11045 -8304 14824 45109 -32875 -59892 30068 79746 52941 57256 22495 36501
20408C6501N6963P342j7557K1433q524K7421R337j9602M081J680O059l3135n3238
$$ 36501 93464 100806 83249 104682 96158 123579 132916 113314 117395 119075 125134 91999 38761
20395C8761k1019r767J6497N9480r123N8581m0437j8836P154j5298J3821R902
$$ 38761 17742 7975 24472 83952 74829 133410 92973 74137 81291 65993 79814 89716
20383H9716q57p0415m3638L754J7380k2677N2658K7897j7915j0650J8747M5296
$$ 89716 88859 18444 -25194 -21440 -4060 -26737 25921 53818 35903 25253 44000 89296
20371H9296n702k0813k4755j8601J9365j016k3482n2941j5850L2636J7486M2782
$$ 89296 83594 62781 38026 19425 38790 37774 14292 -38649 -54499 -21863 -4377 38405
20359C8405O1488L1059n5235o4192J8644K4240k4335Q28M6192K0261L4377L2563
$$ 38405 99893 130952 75717 11525 30169 54409 30074 30902 77094 97355 131732 164295
20347A64295n298J476K497J097q886K2913m325J4902N6179O0247K5887N0485K3292
$$ 164295 158997 160473 162970 164067 155181 178094 173769 188671 244850 305097 330984 381469 404761
20334D04761l5657K752p802l0716q743Q494K52N3365K0748K467o8046n4921M5047
$$ 404761 369104 371856 364054 333338 324595 333089 333341 386706 407454 409921 341875 286954 332001
20321C32001J0795m0697m8975J4220K9762l551J7113L4148o3333m9551o5968p6132
$$ 332001 342796 302099 253124 267344 297106 293555 310668 344816 281483 231932 165964 89832
20309H9832o515M7390N6531K690K752M9135n7429m0485l0062r4097k480J3278
$$ 89832 83317 130707 187238 189928 192680 241815 184386 143901 113839 19742 17262 30540
20297C0540p4963o5663R1293L4851O882p042p994O0448P9639L5878k8537m0552
$$ 30540 -44423 -110086 -18793 16058 22940 15898 7904 68352 147991 183869 155332 114780
20285A14780n6134R994J1519n4804L54M1502j7021L2944K7989o5670n3193n0255
$$ 114780 58646 68640 80159 25355 25709 67211 50190 83134 111123 45453 -7740 -57995
20273e7995l1049L4986M2666O8363N9713p5914n0622Q907j2568M2260K9997k3506
$$ -57995 -89044 -54058 -11392 56971 116684 40770 -9852 -945 -13513 28747 58744 35238
20261C5238m1006N8734K7775j7500k9601N3628L758o8152J833r673Q208n4470
$$ 35238 -5768 52966 80741 63241 33640 87268 91026 22874 24707 15034 23242 -31228
20249c1228j128m3723M9720N6018J1014L1962O807k2169o712q961j3913J1602
$$ -31228 -32356 -76079 -26359 29659 40673 72635 79442 57273 50561 41600 27687 39289
20237C9289j3475l9708m0263k4895J606K074m713k2719N9859L3463N6453l6197
$$ 39289 25814 -13894 -54157 -79052 -77446 -75372 -80085 -102804 -42945 -9482 46971 10774
20225A0774j5288N8746K5293K386k3754p963P323o097n078l3398m516K3895M5355
$$ 10774 -4514 54232 79525 81911 58157 50194 57517 51420 46342 12944 8428 32323 77678
20212G7678M6322J1774j8543l3827L844J9724K709k7220k9749j3065M4912r759
$$ 77678 124000 135774 117231 83404 87248 106972 109681 82461 52712 39647 84559 74800
20200G4800k4029J4576j6037k5274L0418l4001L0749R087J9362q242o2100l8133
$$ 74800 50771 65347 49310 24036 54454 20453 51202 60289 79651 71409 9309 -28824
20188b8824P076M5956L6574r457M1730n0842p3580l0708O0003J1463M439L0649
$$ -28824 -21748 24208 60782 51325 93055 42213 -31367 -62075 -2072 9391 13830 44479
20176D4479J1324m8963k1841L154P3715K243J6520j0775p1441M307j1274N933
$$ 44479 55803 6840 -15001 -11847 61868 64111 80631 69856 -1585 2722 -8552 -2619
20164b619n0943P124k9404J943Q8698L704Q771j4483l2390J2261L7515M483k4063
$$ -2619 -53562 -46438 -75842 -73899 14799 18503 27274 12791 -19599 -7338 30177 34660 10597
20151A0597N7219N9R82J7579m9471l5363l1290K0018M3830M8819K7573j3448j3434
$$ 10597 67816 67875 68857 86436 36965 1602 -29688 -9670 34160 82979 110552 97104 83670
20138H3670n310l3825k2462K0897m83M4581Q6485k8630o9658m6598O0247N5798
$$ 83670 78360 44535 22073 42970 42487 87068 173553 144923 75265 28667 88914 144712
20126A44712k6101p5917q0367K8184Q7038j1149J1920k7434M6740j138n2145N4670
$$ 144712 118611 42694 -37673 -9489 77549 66400 78320 50886 97626 96488 44343 99013
20114I9013Q9693o2166n2174L6979k6260l3718m4187L074j7939j397O2682m286
$$ 99013 188706 126540 74366 111345 85085 51367 7180 10254 -7685 -9082 53600 49314
20102D9314M750j7033P0308N7884j6245l4799m5098q9653P6115J520J5022o882
$$ 49314 54064 37031 107339 165223 148978 114179 69081 -20572 55543 57063 72085 65203
20090F5203r9519j4183J6468L660q874J1675M362J8703j2297m7545N5527N9282
$$ 65203 -34316 -48499 -32031 -28371 -37245 -25570 -21208 -2505 -14802 -62347 -6820 52462
20078E2462m640K3729k793o8825N5896K6288m2931o1696J1798K7860j7027l9701
$$ 52462 47822 71551 68758 -67 55829 82117 39186 -22510 -10712 17148 121 -39580
20066c9580p6095J2717Q8805J03361N9808l9934l8386j9083n933J9091p29k3224
$$ -39580 -115675 -102958 -14153 89208 149016 109082 70696 51613 45680 64771 64042 40818
20054D0818k3134m3921L7805j1790k0751K1302j1944M1800L3339l3990J5611p9114
$$ 40818 17684 -26237 11568 -222 -20973 329 -11615 30185 63524 29534 45145 -33969
20042c3969j3476P1759J8118J1509l4029o2016p461m1174N2119K6785L2076L6913
$$ -33969 -47445 24314 42432 53941 19912 -42104 -49565 -90739 -38620 -11835 20241 57154
20030E7154M0178J5179L2397m7799q579P995M11p0442n574j2919K4012J2379l5605
$$ 57154 97332 112511 144908 97109 88530 96525 96936 26494 20920 8001 32013 44392 8787
20017H787m0790j4615Q180j7386K3314J9099K6259k8536j6881L9495N8569l6072
$$ 8787 -32003 -46618 -38438 -55824 -32510 -13411 12848 -15688 -32569 6926 65495 29423
20005B9423n5978n2052R019O5122K2924J8711l5437N2316l4790n7372J6035M1830
$$ 29423 -26555 -78607 -69588 -4466 18458 37169 1732 54048 19258 -38114 -22079 19751
19993A9751J4230k1428J9323j3627j1650J40J872O4844M3445p7475n4207l6743
$$ 19751 33981 12553 31876 18249 6599 6739 8611 73455 116900 39425 -14782 -51525
19981e1525O3100J6267m4118n4384O072L7994M2959M6054M1137J523k6222K1614
$$ -51525 11575 27842 -16276 -70660 -64588 -26594 16365 62419 103556 105079 78857 100471
19969A00471P0859L5634K9391m3544K7311m6639m1420K6172M0824m4116k2059
$$ 100471 171330 206964 236355 192811 220122 173483 132063 158235 199059 154943 132884
19958A32884l8189m9812M712J0813K0126j6814m2711J4536k705n4103K0096N5160
$$ 132884 94695 44883 49595 60408 80534 63720 21009 35545 32840 -21263 -1167 53993
19946E3993k7412n604N7482j4192p3876J5855M0991L2516K1278j5181k6649L0575
$$ 53993 26581 20977 78459 64267 -9609 6246 47237 79753 101031 85850 59201 89776
19934H9776k1583q0210m90Q1716O7859L1107P044n8173J798q240p1504o6924J1488
$$ 89776 68193 -12017 -12507 69209 137068 168175 175219 117046 118844 110604 39100 -27824 -16336
19921a6336L0312M7022l3723j3415m454K1406P0082l9741j9105O0770K8339k2445
$$ -16336 13976 60998 27275 13860 9406 30812 100894 61153 42048 102818 131157 108712
19909A08712n3421l5387M044J9113K1934K0429k3404j1707K8113P836M7967r865
$$ 108712 55291 19904 23948 43061 64995 85424 62020 50313 78426 86262 134229 124364
19897A24364j12404m392K909L2681L9456M4734n3540o8384l5291K1651L6309j1661
$$ 124364 11960 7568 10477 43158 82614 127348 73808 5424 -29867 -8216 28093 16432
19885A6432M261J6525L5572O1476k86p045j2705j7380q999l2647j1193m3481L3282
$$ 16432 20693 37218 72790 134266 133980 126935 114230 96850 87851 55204 44011 530 33812
19872C3812J6898P110m4320l8650Q7412J19291K5052q826k9633l6606j6256M1870
$$ 33812 50710 57820 13500 -25150 62262 181553 206605 197779 168146 131540 115284 157154
19860A57154o162m7891N3839k2279J3741k6916m0675L2719O1694j0272o1281q8103
$$ 157154 150992 103101 156940 134661 148402 121486 80811 113530 175224 164952 103671 15568
19848A5568j964P1904N543O2837J3437l8571j0964K568L3882k8870m5672k8686
$$ 15568 13604 85508 91051 153888 167325 128754 117790 120358 154240 125370 79698 51012
19836E1012j0288l4555K422J08133P8692k2188n0190k6112K1547N5785N411k8829
$$ 51012 40724 6169 8591 116724 195416 173228 123038 96926 118473 174258 179669 150840
19824A50840j8344K8086L7526J419m06l6968q8809j1061l1283O472K4941O0411
$$ 150840 132496 160582 198108 199527 199121 162153 73344 62283 31000 37472 62413 122824
19812A22824j6412j1827K7940K1798O9490k3869j1290l2856r9500j7606M4645
$$ 122824 106412 94585 122525 144323 213813 189944 178654 145798 46298 28692 73337
19801G3337O8453K9863k0326p795N3101O0722l5268m1323K9784j6464j4861k8668
$$ 73337 141790 171653 151327 143532 196633 257355 222087 180764 210548 194084 179223 150555
19789A50555j9744J2252n5013j8947K3960K7623L0468k5352J6162K9619L5438
$$ 150555 130811 143063 88050 69103 93063 120686 151154 125802 141964 171583 207021
19778B07021O39l7404n7056q8907L0228m104L7714L2520K724p905n0911K9253
$$ 207021 207660 170256 113200 24293 54521 50417 88131 120651 123375 115470 64559 93812
19766I3812L0466M7635K0211P267l9004j6624k2709K1264K4007j9834J0961k5076
$$ 93812 124278 171913 192124 199391 160387 143763 121054 142318 166325 146491 157452 132376
19754A32376J9300j8914n896J7024L1388K4358j07881M354K9815O1622L512K8959
$$ 132376 151676 132762 126866 143890 175278 199636 91755 96109 125924 187546 191058 220017
19742B20017j4443L4389j9884o4065o3741j3866K3336N172J4703j8100O869J768
$$ 220017 205574 239963 220079 156014 92273 78407 101743 106915 121618 103518 110387 112155
19730A12155J1329M8055L8378j887Q570n4622j6851j5047n8226k4057M6095L9959
$$ 112155 123484 171539 209917 208030 216600 161978 145127 130080 71854 47797 93892 133851
19718A33851l152m4293O351K0287J3624k0712J6544N7385m5056l3353J2498j3136
$$ 133851 130699 86406 92757 113044 126668 105956 122500 179885 134829 101476 113974 100838
19706A00838m2953M4052K656N404M5135O7448m6036m1469P0513N0186l9866j01982
$$ 100838 57885 101937 104593 109997 155132 222580 176544 135075 205588 255774 215908 113926
19694A13926m6269J1285j480K1364r694Q1684Q455m4963J9670O1412M1731l4906
$$ 113926 67657 78942 77462 98826 89132 170816 179271 134308 153978 215390 257121 222215
19682B22215K0810M6068R47j9471j8168l1355N933l5547J2282Q4286p278R731
$$ 222215 243025 289093 290040 270569 252401 221046 226979 191432 203714 288000 280722 290453
19670B90453j9636m6485L1333j6642J0646L6620l1777r045L1780k3808l0082M8645
$$ 290453 270817 224332 255665 239023 249669 286289 254512 245467 277247 253439 223357 272002
19658B72002J0272l8698L461P8205k548k2345K6547M5856L6787j0249m832K8203
$$ 272002 282274 243576 247037 325242 322694 300349 326896 372752 409539 399290 394458 422661
19646D22661J9905j9101L7605K9894L4584L0018j699P6645l0039j1258j8931L779
$$ 422661 442566 423465 461070 490964 525548 555566 553867 630512 600473 589215 570284 574063
19634E74063L5100N2565O2122Q868O916j342n047k5424L0029K3266l8245K9212
$$ 574063 609163 661728 723850 732718 739634 738292 733245 707821 737850 761116 722871 752083
19622G52083m6036M061N3084n1234k4577M0668k536K297J049n0841j7708J626
$$ 752083 706047 710108 763192 711958 687381 728049 725513 727810 728859 678018 660310 661936
19610F61936j5896l51K824j3291r9321J304L1957q6530o9885L664j3463k7898
$$ 661936 646040 645689 648513 635222 535901 537205 569162 482632 412747 416411 402948 375050
19598C75050O1209J4650n3804l2946K1806R6656O3584J7930o3497p7064J9628
$$ 375050 436259 450909 397105 364159 385965 482621 546205 564135 500638 423574 443202
19587D43202j449m4450J2114P0473M1945R6649L2744l515l1108Q300n1782q417
$$ 443202 441753 397303 409417 479890 521835 618484 651228 647713 616605 624905 573123 564706
19575E64706m366o290l3174J8519O0387L6054J7283L9296N9821m136N4190M8262
$$ 564706 560340 554050 520876 539395 599782 635836 653119 692415 752236 748100 802290 850552
19563H50552m1773N566k7976m7919N416l7060l2482J5066N0577r161m9660q2509
$$ 850552 808779 814345 786369 738450 743866 706806 674324 689390 739967 730806 681146 598637
19551E98637m7981j9068m6914L9721N4917J2606p780Q014N1282K5835k8741M704
$$ 598637 550656 531588 484674 524395 579312 591918 584138 592152 643434 669269 640528 645232
19539F45232k1944K0020k498r3017q8861k7244N793k2450j8483R6263Q4022l2891
$$ 645232 623288 643308 640810 547793 458932 431688 437481 415031 396548 492811 576833 543942
19527E43942q5182O626N5923J890k2554K9202M6612j9227p933j8494L2184j1059
$$ 543942 458760 465386 521309 523199 500645 529847 576459 557232 549299 530805 562989 551930
19515E51930J2092L8923Mn6807L9340N0371L3171M1853m980k9207l0826J1270
$$ 551930 564022 602945 602949 546142 585482 635853 669024 710877 705897 676690 645864 657134
19503F57134N5084J9848J0199M258K7827m2411L421l2022k5592l6518n0924K845
$$ 657134 712218 732066 742265 746523 774350 731939 735360 703338 677746 641228 590304 593149
19491E93149K9656j1916k5947o2466m2430Q984K2846j7686j5114M335R58l1933
$$ 593149 622805 610889 584942 522476 480046 489030 511876 494190 479076 483411 484369 452436
19479D52436m6031n2642k4155J1368j6245O201p9448O361O3939j9944J917M3542
$$ 452436 406405 353763 329608 340976 324731 330932 251484 257845 321784 301840 303757 347299
19467C47299k2153L161M687q790J9778M9644K1965m6261n8903J4217p717j293
$$ 347299 325146 328307 332994 324204 343982 393626 415591 369330 310427 324644 316927 315634
19455C15634J4152J6784K9971K5899J8893j7217r718M582j4857m975o0783N6459
$$ 315634 329786 346570 376541 402440 421333 404116 394398 398980 384123 379148 318365 374824
19443C74824M1208k1327K9750m81L639k6319n7253N6485Q5689j092J810j6512
$$ 374824 416032 394705 424455 423974 427613 401294 344041 400526 486215 485123 486933 470421
19431D70421J0273L1549j2275r3129o6551l7943K7233L6382M2561Q717J1932k6464
$$ 470421 480694 512243 499968 406839 340288 302345 329578 365960 408521 417238 429170 402706
19419D02706j8859M109K0015o9167o0200M2896L0405O794p9462m3343J3654M1746
$$ 402706 383847 387956 407971 338804 278604 321500 351905 358699 279237 235894 249548 291294
19407B91294k1623n0944j5398J2180r217j055q884j8120J350m1335L8849O3786
$$ 291294 269671 218727 203329 215509 206292 205237 196353 178233 179583 138248 177097 240883
19395B40883N6343p6005l8493M2950N7691k1581j5558K064O5184J0715k5989j41
$$ 240883 297226 221221 182728 225678 283369 261788 246230 248294 313478 324193 298204 298063
19383B98063N800l472L7134O5812M3220r843K1264M3175K04n3954l953N9152K3591
$$ 298063 303863 300391 337525 403337 446557 436714 457978 501153 501357 447403 443450 502602 526193
19370E26193K0826J1120j5400O508N0533K2445j3332l6297l4098L1286J20483
$$ 526193 547019 558139 542739 549247 599780 622225 608893 572596 538498 569784 690267
$$ [...]
##END NTUPLES=NMR SPECTRUM
##END=
