##TITLE=Analysis number 311294
Compound Code cc 32916
Book Reference 422/65
Project Code adrs
Chemist Name robb
##JCAMPDX= 6.0         $$ Bruker NMR JCAMP-DX V2.0
##DATA TYPE= NMR SPECTRUM
##DATA CLASS= NTUPLES
##ORIGIN= Bruker BioSpin GmbH
##OWNER= NMR
$$ XWIN-NMR		Version 3.5
$$ Tue Jul  5 12:11:28 2005 GMT Daylight Time (UT+1h)  MAYBRIDGE\NMR@NMR_250MHZ
##.OBSERVE FREQUENCY= 250.131544655141
##.OBSERVE NUCLEUS= ^1H
##.ACQUISITION MODE= SIMULTANEOUS (DQD)
##.ACQUISITION SCHEME= undefined
##.AVERAGES= 16
##.DIGITISER RES= 18
##SPECTROMETER/DATA SYSTEM= dpx250
##.PULSE SEQUENCE= zg30
##.SOLVENT NAME= CDCl3
##.SHIFT REFERENCE= (INTERNAL, CDCl3, 0, 16.522)
##AUDIT TRAIL= $$ (NUMBER, WHEN, WHO, WHERE, WHAT)
$$ ##TITLE= Audit trail, XWIN-NMR		Version 3.5
$$ ##JCAMPDX= 5.01
$$ ##ORIGIN= Bruker BioSpin GmbH
$$ ##OWNER= NMR
$$ C:\u/data/dgb/nmr/ADRS/5340/pdata/1/auditp.txt
$$ ##AUDIT TRAIL=  $$ (NUMBER, WHEN, WHO, WHERE, WHAT)
(   1,<2005-07-05 12:11:07.24 +100>,<MAYBRIDGE\NMR>,<NMR_250MHZ>,
      <created by zg, POWCHK disabled, PULCHK disabled
       configuration hash MD5:
       62 19 C7 07 E1 42 D1 B7 37 6C 3D D0 77 39 F9 E6
       data hash MD5: 64K
       4C 21 DB FD 6F 1C 8B 1D 2F BD 59 AD C7 FB AC 62>)
(   2,<2005-07-05 12:11:19.50 +100>,<MAYBRIDGE\NMR>,<NMR_250MHZ>,
      <Start of raw data processing
       ef LB = 0.3 FT_mod = 6 PKNL = 1 SI = 32K 
       data hash MD5: 32K
       78 38 4F 9E 7D 31 D2 90 10 13 9D 8B 4B D1 95 0E>)
(   3,<2005-07-05 12:11:21.44 +100>,<MAYBRIDGE\NMR>,<NMR_250MHZ>,
      <apk 
       data hash MD5: 32K
       BB 0B 5E D6 9A 63 BB 1E ED F6 43 B6 E5 E3 74 71>)
(   4,<2005-07-05 12:11:22.16 +100>,<MAYBRIDGE\NMR>,<NMR_250MHZ>,
      <abs ABSG = 5 
       data hash MD5: 32K
       7F 9A A5 6D 20 B3 0C A7 8F 4F 3F 69 5B 57 2B 96>)
$$ ##END=
$$ 
$$ hash MD5
$$ C2 39 FB 57 2A 49 19 8D 60 0F EF 4B E6 E5 4D 26
##$RELAX= 
##$RELAX= 
##$RELAX= 
##$RELAX= 
##$RELAX= 
##$RELAX= 
##$RELAX= 
$$ Bruker specific parameters
$$ --------------------------
##$DU= <C:\u>
##$EXPNO= 5340
##$NAME= <ADRS>
##$PROCNO= 1
##$TYPE= <nmr>
##$USER= <dgb>
##$AMP= (0..31)
100 100 100 100 100 100 100 100 100 100 100 100 100 100 100 100 100 100 
100 100 100 100 100 100 100 100 100 100 100 100 100 100 
##$AQSEQ= 0
##$AQ_mod= 3
##$AUNM= <au_zg>
##$AUTOPOS= <27 >
##$BF1= 250.13
##$BF2= 250.13
##$BF3= 250.13
##$BF4= 250.13
##$BF5= 500.13
##$BF6= 500.13
##$BF7= 500.13
##$BF8= 500.13
##$BYTORDA= 1
##$CFDGTYP= 0
##$CFRGTYP= 5
##$CHEMSTR= <none>
##$CNST= (0..31)
1 1 145 1 1 1 1 1 1 1 1 1 1 1 1 1 1 1 1 1 1 1 1 1 1 1 1 1 1 1 1 1 
##$CPDPRG= <>
##$CPDPRG1= <>
##$CPDPRG2= <>
##$CPDPRG3= <>
##$CPDPRG4= <mlev>
##$CPDPRG5= <mlev>
##$CPDPRG6= <mlev>
##$CPDPRG7= <mlev>
##$CPDPRG8= <mlev>
##$CPDPRGB= <>
##$CPDPRGT= <>
##$D= (0..31)
0 1 0 0 0 0 0 0 0 0.06 0 0 0 0 0 0 0.0002 0 0 0 0 0 0 0 0 0 0 0 0 0 0 
0 
##$DATE= 1120561866
##$DBL= (0..7)
120 120 120 120 120 120 120 120 
##$DBP= (0..7)
150 150 150 150 150 150 150 150 
##$DBP07= 0
##$DBPNAM0= <>
##$DBPNAM1= <>
$$ [...]
##$SUBNAM7= <"">
##$SUBNAM8= <"">
##$SUBNAM9= <"">
##$SW= 20.6930455092707
##$SWIBOX= (0..15)
0 0 3 0 0 0 0 0 0 0 0 0 0 0 0 0 
##$SW_h= 5175.983436853
##$TD= 65536
##$TD0= 1
##$TE= 295.16
##$TE2= 300
##$TE3= 300
##$TEG= 300
##$TL= (0..7)
0 120 120 120 120 120 120 120 
##$TP= (0..7)
150 150 150 150 150 150 150 150 
##$TP07= 0
##$TPNAME0= <>
##$TPNAME1= <>
##$TPNAME2= <>
##$TPNAME3= <>
##$TPNAME4= <>
##$TPNAME5= <>
##$TPNAME6= <>
##$TPNAME7= <>
##$TPOAL= (0..7)
0.5 0.5 0.5 0.5 0.5 0.5 0.5 0.5 
##$TPOFFS= (0..7)
0 0 0 0 0 0 0 0 
##$TUNHIN= 0
##$TUNHOUT= 0
##$TUNXOUT= 0
##$USERA1= <user>
##$USERA2= <user>
##$USERA3= <user>
##$USERA4= <user>
##$USERA5= <user>
##$V9= 5
##$VALIST= <valist>
##$VCLIST= <CCCCCCCCCCCCCCC>
##$VD= 0
##$VDLIST= <DDDDDDDDDDDDDDD>
##$VPLIST= <PPPPPPPPPPPPPPP>
##$VTLIST= <TTTTTTTTTTTTTTT>
##$WBST= 1024
##$WBSW= 4
##$XGAIN= (0..3)
0 0 0 0 
##$XL= 0
##$YL= 0
##$YMAX_a= 522136
##$YMIN_a= -345194
##$ZGOPTNS= <>
##$ZL1= 120
##$ZL2= 120
##$ZL3= 120
##$ZL4= 120
##$ABSF1= 16.522
##$ABSF2= -4.171173
##$ABSG= 5
##$ABSL= 3
##$ALPHA= 0
##$AQORDER= 0
##$ASSFAC= 0
##$ASSFACI= 0
##$ASSFACX= 0
##$ASSWID= 0
##$AUNMP= <proc_1d>
##$AZFE= 0.1
##$AZFW= 0.1
##$BCFW= 0
##$BC_mod= 0
##$BYTORDP= 0
##$COROFFS= 0
##$CY= 12.5
##$DATMOD= 1
##$DC= 0
##$DFILT= <>
##$DTYPP= 0
##$F1P= 14.0000005364418
##$F2P= -0.99999901652339
##$FCOR= 0.5
##$FTSIZE= 32768
##$FT_mod= 6
##$GAMMA= 0
##$GB= 0
##$INTBC= 1
##$INTSCL= 1
##$ISEN= 128
##$LB= 0.3
##$LEV0= 0
##$LPBIN= 0
##$MAXI= 10000
##$MC2= 0
##$MEAN= 0
##$ME_mod= 0
##$MI= 0
##$NCOEF= 0
##$NC_proc= -5
##$NLEV= 6
##$NOISF1= 0
##$NOISF2= 0
##$NSP= 0
##$NTH_PI= 0
##$NZP= 0
##$OFFSET= 16.522
##$PC= 1
##$PHC0= -75.10892
##$PHC1= 4.415344
##$PH_mod= 1
##$PKNL= yes
##$PPARMOD= 0
##$PSCAL= 4
##$PSIGN= 0
##$REVERSE= no
##$SF= 250.13
##$SI= 32768
##$SIGF1= 0
##$SIGF2= 0
##$SINO= 400
##$SIOLD= 32768
##$SREGLST= <1H.CDCl3>
##$SSB= 0
##$STSI= 32768
##$STSR= 0
##$SW_p= 5175.98343685301
##$SYMM= 0
##$S_DEV= 0
##$TDeff= 65536
##$TDoff= 0
##$TI= <Analysis number 999999
Compound Code 99
Book Reference 9
Project Code 9>
##$TILT= no
##$TM1= 0
##$TM2= 0
##$TOPLEV= 0
##$USERP1= <user>
##$USERP2= <user>
##$USERP3= <user>
##$USERP4= <user>
##$USERP5= <user>
##$WDW= 1
##$XDIM= 32768
##$YMAX_p= 512997810
##$YMIN_p= -349404
$$ End of Bruker specific parameters
$$ ---------------------------------
##NTUPLES= NMR SPECTRUM
##VAR_NAME=  FREQUENCY,     SPECTRUM/REAL,   SPECTRUM/IMAG
##SYMBOL=    X,             R,               I
##VAR_TYPE=  INDEPENDENT,   DEPENDENT,       DEPENDENT
##VAR_FORM=  AFFN,          ASDF,            ASDF
##VAR_DIM=   32768,         32768,           32768
##UNITS=     HZ,            ARBITRARY UNITS, ARBITRARY UNITS
##FACTOR=    0.157963299565203, 1,           1
##FIRST=     4132.6476996994, 0,             0
##LAST=      -1043.33573715361, 0,           0
##MIN=       -1043.33573715361, -349404,     0
##MAX=       4132.6476996994, 512997810,     0
$$ Real data points
##PAGE= N=1
##DATA TABLE= (X++(R..R)), XYDATA
$$ [...]
$$ plain form
24669 -4807 -58342 -175835 -151907 -155813 -151358 -182013 -165807 -128120 -19224 18066 690 -67840
24657 -67840 -94720 -145879 -35482 75652 96816 120755 122611 101700 94743 82567 47446 -20160
24645 -20160 -93651 -81632 -65786 -52201 -88830 61962 150993 215651 115970 -16104 -50512
24634 -50512 -68929 -80846 -43972 -1004 94202 28767 3237 107763 93131 44372 49018 49507
24622 49507 55517 165757 85933 -33608 -122732 -126566 -101051 -89205 -131817 -207052 -149972 -43999
24610 -43999 9133 -40442 -53194 -36814 -47889 -114582 -201071 -210819 -186385 -173693 -131188 -115028
24598 -115028 -57577 41156 -9673 -76601 -86510 -164146 -182349 -84516 -98414 -116983 -41346 58159
24586 58159 26115 -40019 -33848 18347 22239 9585 -17374 24886 -28235 -138192 -148354 -174636
$$ packed form
24669d807n3535j17493K3928l906M455l0655J6206L7687J08896L7290j7376o8530
24657f7840k6880n1159J10397J11134K1164K3939J856k0911o957j2176l5121o7606
24645b0160p3491J2019J5846J3585l6629J50792Q9031O4658r9681j32074l4408
24634e0512j8417j1917L6874M2968R5206o5435k5530J04526j4632m8759M646M89
24622D9507O010J10240p9824j19541q9124l834K5515J1846m2612p5235N7080J05973
24610d3999N3132m9575j2752J6380j1075o6693q6489r748K4434J2692M2505J6160
24598a15028N7451R8733n0829o6928r909p7636j8203R7833j3898j8569P5637R9505
24586E8159l2044o6134O171N2195L892j2654k6959M2260n3121j09957j0162k6282
$$ plain form
24574 -174636 -92222 -107698 -117190 -39081 -61037 -19988 14313 4898 -11904 6085 -34455 -47453
24562 -47453 -34710 31327 43390 -40860 49223 39477 888 13725 9465 73024 86025 42334
24550 42334 -69161 -35491 -63721 -36925 -75227 -68681 -7924 41508 -65726 1519 52972
24539 52972 58165 -20264 15459 47399 23058 66170 97152 111518 14261 71669 215975 209995
24527 209995 133369 140951 101535 -51711 -35029 -67586 -71418 -101684 -139561 -134193 -66021 -34139
24515 -34139 -80275 -89534 -14951 -72219 -86406 -92111 -87407 -157222 -134632 27827 151701 148192
24503 148192 128041 56071 -14103 -10235 43450 -80678 -86216 -41217 -139431 -246503 -243229 -165118
24491 -165118 -113034 -49299 71472 128985 108151 10170 -39143 23562 39173 55060 13195
$$ packed form
24574a74636Q2414j5476r492P8109k1956M1049L4301r415j6802J7989m0540j2998
24562d7453J2743O6037J2063q4250R0083r746l8589J2837m260O3559J3001m3691
24550D2334j11495L3670k8230K6796l8302O546O0757M9432j07234O7245N1453
24539E2972N193p8429L5723L1940k4341M3112L0982J4366r7257N7408J44306n980
24527B09995p6626P582l9416j53246J6682l2557l832l0266l7877N368O8172L1882
24515c4139m6136r259P4583n7268j4187n705M704o9815K2590J62459J23874l509
24503A48192k0151p1970p0174L868N3685j24128n538M4999r8214j07072L274P8111
24491a65118N2084O3735J20771N7513k0834r7981m9313O2705J5611J5887m1865
$$ plain form
24480 13195 -43951 20837 170103 119277 10590 -56571 -131009 -95633 -56842 -64048 -88283
24469 -88283 -47061 -47789 -40227 588 -15886 -63510 -100798 -10454 -3257 -33336 24768 146546
24457 146546 154945 182837 141319 58201 -32690 -58792 -84981 -36312 38162 54378 -19968 -7362
24445 -7362 34124 -3625 -30652 -58985 -11706 -52716 -11013 77210 125076 70691 53162 50977
24433 50977 127342 174229 192460 178244 138455 57998 -1672 -51993 -8504 -70535 -79598 -76674
24421 -76674 -80304 -72121 -92783 35966 48708 33415 35828 3784 -31636 -79363 -154527 -157526
24409 -157526 -48692 -47337 -75205 -40817 -69422 -140199 -132398 -94325 -121485 -149542 -92273 -56627
24397 -56627 -102215 -102736 -56725 -32079 -24925 -20179 36887 30660 16700 8594 -61371 -14798 -6008
$$ packed form
24480A3195n7146O4788J49266n0826j08687o7161p4438L5376L8791p206k4235
24469h8283M1222p28P562M0815j6474m7624l7288R0344P197l0079N8104J21778
24457A46546Q399K7892m1518q3118r0891k6102k6189M8669P4474J6216p4346J2606
24445g362M1486l7749k7027k8333M7279m1010M1703Q8223M7866n4385j7529k185
24433E0977P6365M6887J8231j4216l9789q0457n9670n0321M3489o2031r063K924
24421g6674l630Q183k0662J28749J2742j5293K413l2044l5420m7727p5164k999
24409a57526J08834J355k7868L4388k8605p0777P801L8073k7160k8057N7269L5646
24397e6627m5588n21M6011K4646P154M746N7066o227j3960q106o9965M6573Q790
$$ plain form
24384 -6008 20055 76760 -4094 -130910 -175350 -108949 -79281 -5731 -36773 -93894 -116162 -15065
24372 -15065 -4747 -10738 -107191 -147245 -93874 -97268 29618 11071 -64250 -57275 -25918 -38450
24360 -38450 -28579 -78825 -119563 50034 114441 7884 -15072 -49696 -28639 -32677 -8560 -69304
24348 -69304 -90152 -84654 -28985 34504 134460 220076 200006 102719 112324 116935 79943 36651
24336 36651 33319 86097 139448 124594 28808 -63743 13970 34925 69744 115064 114088 25141
24324 25141 3283 58181 108121 91985 13890 -35614 -6677 26481 -48383 -92984 -113543 -97358
24312 -97358 -50243 -29258 -25168 -5401 22608 41048 16561 -92395 -113590 -115054 -136497 -122773
24300 -122773 -162204 -165412 -112905 -56660 -81586 -116873 -77444 23123 28362 20312 -42381 -81237
$$ packed form
24384f008K6063N6705q0854j26816m4440O6401K9668P3550l1042n7121k2268J01097
24372a5065J0318n991r6453m0054N3371l394J26886j8547p5321O975L1357j2532
24360c8450R871n0246m0738J69597O4407j06557k2956l4624K1057m038K4117o0744
24348f9304k0848N498N5669O3489R9956Q5616k0070r7287R605M611l6992m3292
24336C6651l332N2778N3351j4854r5786r2551P7713K0955L4819M5320r76q8947
24324B5141k1858N4898M9940j6136p8095m9504K8937L3158p4864m4601k0559J6185
24312i7358M7115K0985M090J9767K8009J8440k4487j08956k1195j464k1443J3724
24300a22773l9431l208N2507N6245k4926l5287L9429J00567N239q050o2693l8856
$$ plain form
24288 -81237 -86989 -3975 23688 167761 140222 101964 39059 -5239 -42281 -62208 -62250 -29350
24276 -29350 -31245 26045 30223 28951 140750 247697 230352 177877 74262 26684 102654 17016
24264 17016 30050 24986 -14370 -28005 -32462 8169 -30094 -18930 16345 -12339 -15839 28244
24252 28244 81301 208818 249672 190685 115993 11361 -33753 -33322 -56911 -32569 -14616 70695
24240 70695 143758 187625 244182 160115 122661 82772 -66786 -143647 -134253 -175685 -244005 -137039
24228 -137039 -115299 -149943 -206792 -114981 -25995 40397 -3633 -42933 -3383 5756 -37159 -105866
24216 -105866 -160617 -157156 -116604 6184 91512 94828 72584 76000 -18246 -8671 116472 127964
24204 127964 67188 76226 28935 -64848 -176401 -122194 -16113 21971 -91060 -113151 -131513
$$ packed form
24288h1237n752Q3014K7663J44073k7539l8258o2905m4298l7042j9927m2L2900
24276b9350j895N7290M178j272J11799J06947j7345n2475j03615m7578P5970q5638
24264A7016J3034n064l9356j3635m457M0631l8263J1164L5275k8684l500M4083
24252B8244N3057J27517M0854n8987p4692j04632m5114M31k3589K4342J7953Q5311
24240G0695P3063M3867N6557q4067l7454l9889j49558p6861R394m1432o8320J06966
24228a37039K1740l4644n6849R1811Q8986O6392m4030l9300L9550R139m2915o8707
24216a05866n4751L461M0552J22788Q5328L316k2244L416r4246R575J25143J1492
24204A27964o0776R038m7291r3783j11553N4207J06081L8084j13031k2091j8362
$$ plain form
24193 -131513 -144286 -43700 42144 -55998 -87452 -125059 -130547 -130598 -25482 60834 28817 10539
24181 10539 19180 25270 42089 52709 107099 112528 149093 180830 155116 150042 210466 169244
24169 169244 96994 -11137 -29125 -33306 -51938 -27988 87764 98290 55042 28234 1734
24158 1734 41774 54194 67007 22433 47544 52181 41807 170689 213555 155339 99011 102441
24146 102441 94581 95507 36435 1109 10233 -17673 -51525 -111467 -75281 -83325 -148020 -221270
24134 -221270 -191718 -93450 -11318 27152 55850 94785 64151 46779 -25293 -69010 -45690
24123 -45690 -26118 -14679 -68200 -15972 76145 113198 94800 183764 123177 -41598 -46490 40905
24111 40905 86755 114051 64188 13961 28960 22418 3164 -7356 -39109 -28145 35570 -63320
$$ packed form
24193a31513j2773J00586Q5844r8142l1454l7607n488n1J05116Q6316l2017j8278
24181A0539Q641O090J6819J0620N4390N429L6565L1737k5714n074O0424m1222
24169A69244p2250j08131j7988m181j8632K3950J15752J0526m3248k6808k6500
24158A734M0040J2420J2813m4574K5111M637j0374J28882M2866n8216n6328L430
24146A02441p860R26n9072l5326R124k7906l3852n9942L6186q044o4695p3250
24134b21270K9552R8268Q2132L8470K8698L8935l0634j7372p2072m3717K3320
24123d5690J9572J1439n3521N2228R2117L7053j8398Q8964o0587j64775m892Q7395
24111D0905M5850K7296m9863n0227J4999o542j9254j0520l1753J0964O3715r8890
$$ plain form
24099 -63320 -75753 -61700 -57155 -87139 -23052 60304 47493 43512 46235 71591 118860 121696
24087 121696 26071 -74665 -147375 -193004 -261428 -277373 -281928 -191759 -34681 -92698 -124634
24076 -124634 -66991 -49854 -79878 -105291 -160677 -80709 15877 9399 11939 -17054 -67452 -161616
24064 -161616 -196365 -174605 -70589 -71311 25233 24477 63635 120331 64540 -62886 -196056 -176996
24052 -176996 -130757 -15316 12337 -48694 -84796 -103569 -97363 -50380 13743 -23799 -44534
24041 -44534 -6208 -65705 -153224 -96682 -62494 -72689 6289 54382 101379 45000 59608 133431
24029 133431 -37448 -21771 70234 173897 110796 152916 128492 22561 21366 -13359 -70429
24018 -70429 19733 51772 67589 43280 23044 -48175 -42818 8191 47339 -5497 -48961 65947
$$ packed form
24099f3320j2433J4053M545k9984O4087Q3356j2811l981K723K5356M7269K836
24087A21696r5625j00736p2710m5629o8424j5945m555R0169J57078n8017l1936
24076a24634N7643J7137l0024k5413n5386P9968R6586o478K540k8993n0398r4164
24064a61616l4749K1760J04016p22R6544p56L9158N6696n5791j27426j33170J9060
24052a76996M6239J15441K7653o1031l6102j8773O206M6983O4123l7542k0735
24041d4534L8326n9497q7519N6542L4188j0195P8978M8093M6997n6379J4608P3823
24029A33431j70879J5677R2005J03663o3101M2120k4424j05931j195l4725n7070
24018g0429R0162L2039J5817k4309k0236p1219N357N1009L9148n2836m3464J14908
$$ plain form
24006 65947 67779 4464 12786 -775 41431 -14220 29522 25485 64605 77604 29531 -33830
23994 -33830 -57574 -22992 -30937 -22383 3712 -26787 42445 84973 16637 37816 26469 -52321
23982 -52321 -105571 -83704 -32087 -48417 -96154 -180731 -192587 -96113 -68903 -81338 -64672 -108277
23970 -108277 -55268 -24746 -3900 -8117 -81647 -61151 -85590 -112954 -84846 -78377 -17346 864
23958 864 70809 -21782 -61437 -27967 -63830 -50264 -90316 -88311 -130072 -201057 -214247 -192153
23946 -192153 -16130 -51377 -30693 110875 176698 160929 170623 13027 -105456 -87501 5533
23935 5533 92373 130815 27296 22628 -40510 -69576 -90840 -118915 -166218 -150032 -124117 -44014
23923 -44014 -48674 -34799 20483 21482 36384 69693 32704 33270 50261 27341 -105355 -149131
$$ packed form
24006F5947J832o3315Q322j3561M2206n5651M3742m037L9120J2999m8073o3361
23994c3830k3744L4582p945Q554K6095l0499O9232M2528o8336K1179j1347p8790
23982e2321n3250K1867N1617j6330m7737q4577j1856R6474K7210j2435J6666m3605
23970a08277N3009L0522K0846m217p3530K0496k4439k7364K8108O469O1031J8210
23958H64O9945r2591l9655L3470l5863J3566m0052K005m1761p0985j3190K2094
23946a92153J76023l5247K0684J41568O5823j5769R694j57596j18483J7955R3034
23935E533Q6840L8442j03519m668o3138k9066k1264k8075m7303J6186K5915Q0103
23923d4014m660J3875N5282R99J4902L3309l6989N66J6991k2920j32696m3776
$$ plain form
23911 -149131 -75788 -68288 -48684 -24019 48216 12942 -34128 21139 40645 -31993 -104345 -123323
23899 -123323 -2353 61089 26311 31769 46723 54255 -91085 -133370 -83758 -36283 -174766
23888 -174766 -165340 -139616 -104668 -85804 -14748 14114 -115305 -121034 -44570 -66919 -40217 -20318
23876 -20318 -37904 -65368 -118856 -166890 -133898 -120490 -74260 -57695 42613 85066 100028
23865 100028 109156 77880 28910 -41033 -65178 -52980 -65834 84109 209771 297253 158535
23854 158535 -79165 -35109 28805 85273 48477 -77946 -137035 -134020 -173194 -173170 -35002 123405
23842 123405 149207 183793 258745 97918 1483 2121 -26726 3890 62934 40637 70540 49298
23830 49298 23474 69958 27065 24368 79722 19261 -27492 9380 -11847 -75814 -35464 43225
$$ packed form
23911a49131P3343P500J9604K4665P2235l5274m7070N5267J9506p2638p2352j8978
23899a23323J20970O3442l4778N458J4954P532j45340m2285M9612M7475j38483
23888a74766R426K5724L4948J8864P1056K8862j29419n729P6464k2349K6702J9899
23876b0318j7586k7464n3488m8034L2992J3408M6230J6565J00308M2453J4962
23865A00028R128l1276m8970o9943k4145J2198j2854J49943J25662Q7482j38718
23854A58535k37700M4056O3914N6468l6796j26423n9089L015l9174K4J38168J58407
23842A23405K5802L4586P4952j60827r6435O38k8847L0616N9044k2297K9903k1242
23830D9298k5824M6484m2893k697N5354o0461m6753L6872k1227o3967M0350P8689
$$ plain form
23818 43225 46023 -63241 -5605 94541 97148 -408 82164 103456 87815 101701 25061 -35130
23806 -35130 -201602 -266398 -251748 -143322 -117273 -144929 -69177 30512 35700 106950 66543
23795 66543 60127 70590 58333 1266 22271 134857 172820 48853 34229 172320 114954
23784 114954 38471 -96644 -68114 -27951 -2491 -72473 -95142 -19519 9131 8984 48835 3868
23772 3868 -22458 -20009 11321 20037 -103283 -99609 -93708 -105067 -80165 -182216 -199295 -147282
23760 -147282 -124640 -207302 -235269 -123669 -54629 -72044 -192684 -188683 -163173 -141466 -2055
23749 -2055 37403 -122456 -169235 -117948 -45821 -32676 13223 -61687 -165676 -102700 17168
23738 17168 29165 -133277 -152504 -105528 -56543 -97705 -30105 47593 70780 39541 -900
$$ packed form
23818D3225K798j09264N7636J00146K607r7556Q2572K1292j5641J3886p6640o0191
23806c5130j66472o4796J4650J08426K6049k7656P5752R9689N188P1250m0407
23795F6543o416J0463j2257n7067K1005J12586L7963j23967j4624J38091n7366
23784A14954p6483j35115K8530M0163K5460o9982k2669P5623K8650j47L9851m4967
23772C868k6326K449L1330Q716j23320L674N901j1359K4902j02051j7079N2013
23760a47282K2642q2662k7967J11600O9040j7415j20640M001K5510K1707J39411
23749b055L9458j59859m6779N1287P2127J3145M5899p4910j03989O2976J19868
23738A7168J1997j62442j9227M6976M8985m1162O7600P7698K3187l1239m0441
$$ plain form
23727 -900 -46533 -39675 31703 2078 -74821 -6511 -69066 -115889 -71043 -37892 33952 75761
23715 75761 39700 19152 -16151 -77216 -79208 -109213 -178641 -171507 -174016 -142156 -103452 -124482
23703 -124482 -153540 -13722 86368 32530 86795 138875 90981 -24180 -98491 -103599 -55243
23692 -55243 -30013 -72620 -82399 45464 19593 -4069 -18905 24833 123395 147594 100365 -19283
23680 -19283 17549 38128 16771 -27122 -72307 13322 -68588 -102460 -31648 51421 26259 -26262
23668 -26262 -110457 -130780 -53386 -7681 6625 68067 30818 3132 100279 134755 85267 56570
23656 56570 12400 45339 53841 13592 -24460 -17974 -4805 29331 -14095 -57349 -43538 42594
23644 42594 72797 -1997 -120907 -154253 -97061 -56992 -49232 -39576 -6496 -21700 -11898 52641
$$ packed form
23727i00m5633O858P1378k9625p6899O8310o2555m6823M4846L3151P1844M1809
23715G5761l6061k0548l5303o1065j992l0005o9428P134k509L1860L8704k1030
23703a24482k9058J39818J00090n3838N4265N2080m7894j15161p4311n108M8356
23692e5243K5230m2607r779J27863k5871k3662j4836M3738R8562K4199m7229j19648
23680a9283L6832K0579k1357m3893m5185Q5629q1910l3872P0812Q3069k5162n2521
23668b6262q4195k0323P7394M5705J4306O1442l7249k7686R7147L4476m9488k8697
23656E6570m4170L2939Q502m0249l8052O486J3169L4136m3426m3254J3811Q6132
23644D2594L0203p4794j18910l3346N7192M0069P760R656L3080j5204R802O4539
$$ plain form
23632 52641 -8337 -91127 -74107 -77842 -43559 -40997 -62463 -18711 -32049 -108908 -102885 -78826
23620 -78826 -37134 -83790 -134068 -100745 -46982 -83524 -95859 -11002 66929 116123 98329 72506
23608 72506 -4210 -198 30680 26465 16116 31701 26348 21007 -27291 -117573 -122954 -76871 -160396
23595 -160396 -105925 -49817 -98137 -126804 -146570 -55688 19810 27407 21430 50439 -49509 -131713
23583 -131713 -77755 -86941 -112360 -142156 -128276 -80039 -64747 -16289 -91464 -61868 7603 52992
23571 52992 16129 62978 129046 282953 234711 143463 106691 94219 -23272 -83163 -44122
23560 -44122 -38280 -44971 2054 18531 -75011 -96693 -86213 -14847 58895 154248 209662 155579
23548 155579 164635 108020 2571 -79854 -42765 -63972 -11526 89642 111985 40852 -44755
$$ packed form
23632E2641o0978q2790J7020l735L4283K562k1466M3752j3338p6859O023K4059
23620g8826M1692m6656n0278L3323N3763l6542j2335Q4857P7931M9194j7794k5823
23608G2506p6716M012L0878m215j0349J5585n353n341m8298r0282n381M6083q3525
23595a60396N4471N6108m8320k8667j9766R0882P5498P597n977K9009r9948q2204
23583a31713N3958r186k5419k9796J3880M8237J5292M8458p5175K9596O9471M5389
23571E2992l6863M6849O6068J53907m8242r1248l6772j2472j17491n9891L9041
23560d4122N842o691M7025J6477r3542k1682J0480P1366P3742R5353N5414n4083
23548A55579R056n6615j05449q2425L7089k1207N2446J01168K2343p1133q5607
$$ plain form
23537 -44755 -68314 -100290 -128074 -109780 -113823 -77113 -22805 -9176 -82683 -57620 -77989 -120208
23525 -120208 -24679 43012 63897 -65 -78918 -34410 -41057 -54671 -55992 15953 31393 77162
23513 77162 18843 -85033 -68431 -72856 -45065 -71773 -87707 -67607 -45798 -67069 -153330 -103233
23501 -103233 -124747 -130433 -161592 -259232 -231042 -74336 -42695 -123994 -72287 -85617 -31727
23490 -31727 -28793 -62419 -63275 -172686 -218254 -180937 -81579 -6764 -19912 -610 -88894 -104146
23478 -104146 -99957 -176702 -148583 5629 3433 -50097 -3923 -30346 -81573 -86762 -91589 -69476
23466 -69476 -52389 -63520 -138559 -150377 -157375 -100091 -24535 -46396 -91645 -39897 -82975 -142015
23454 -142015 -152309 -99040 9014 -4771 -22359 -5089 83000 60292 -20999 -73206 -16671
$$ packed form
23537d4755k3559l1976k7784J8294m043L6710N4308J3629p3507K5063k0369m2219
23525a20208R5529O7691K0885o3962p8853M4508o647j3614j321P1945J5440M5769
23513G7162n8319j03876J6602m425K7791k6708j5934K0100K1809k1271q6261N0097
23501a03233k1514n686l1159r7640K8190J56706L1641q1299N1707j3330N3890
23490c1727K934l3626q56j09411m5568L7317R9358P4815j3148J9302q8284j5252
23478a04146M189p6745K8119J54212k196n3530M6174k6423n1227n189m827K2113
23466f9476J7087j1131p5039j1818o998N7284P5556k1861m5249N1748m3078n9040
23454a42015j0294N3269J08054j3785j7588J7270Q8089k2708q1291n2207N6535
$$ plain form
23443 -16671 18825 -23548 -59176 -38827 -35644 -147746 -107352 -110470 -128429 -31876 -7094 -31897
23431 -31897 -25523 -2993 13014 62792 -15387 -28739 -1890 8026 -6724 -75874 -141485 -149529
23419 -149529 -41751 34162 64951 17773 -48485 -113129 -89710 -112075 -137716 -78805 -171975
23408 -171975 -251809 -227992 -115627 -67696 -78984 -148290 -165492 -187994 -144596 -142324 -133902 -88176
23396 -88176 2714 46488 -21586 -22515 -13261 -52058 -100552 -106432 -114265 -152715 -185195 -212957 -206323
23383 -206323 -147026 -125941 -96125 -10994 -34089 -42026 15398 -33688 -131591 -209359 -170400 -54118
23371 -54118 -92977 -83555 -48118 -14336 244 22945 23393 79585 63355 33399 34324 88057 8623
23358 8623 -45481 -53919 2100 20474 71365 93736 27926 -1346 -34989 -43805 -18354 -55129
$$ packed form
23443a6671L5496m2373l5628K0349L183j12102M0394l118j7959R6553K4782k4803
23431c1897O374K2530J6007M9778p8179j3352K6849R916j4750o9150o5611q044
23419a49529J07778P5913L0789m7178o6258o4644K3419k2365k5641N8911r3170
23408a71975p9834K3817J12365M7931j1288o9306j7202k2502M3398K272Q422M5726
23396h8176R0890M3774o8074r29R254l8797m8494n880p833l8450l2480k7762O634
23383b06323N9297K1085K9816Q5131k3095p937N7424m9086r7903p7768L8959J16282
23371e4118l8859R422L5437L3782J4580K2701M48N6192j6230k9956R25N3733p9434
23358H623n4104q438N6019J8374N0891K2371o5810k9272l3643q816K5451l6775
$$ plain form
23346 -55129 -84497 -28950 -20781 -75762 -55591 43519 74430 82542 53169 29960 -2904 36500
23334 36500 124444 -189 -110951 -50056 -40953 -30259 -46966 -48707 -50241 -105940 -123755 -157480
23322 -157480 -137296 -83682 -79274 -59013 -114103 -56397 -28532 -11026 -71346 -99890 -36330 -38666
23310 -38666 -80474 -68891 -81665 -18772 55557 -27453 -49638 -137906 -75209 25120 32407 120606
23298 120606 163741 195003 202386 180141 56425 -43673 40532 83942 53799 -4099 -53318
23287 -53318 -58950 -37756 -2437 50817 77935 74478 34905 3428 26248 83274 131956 51291
23275 51291 59279 13006 78344 30221 21500 21310 46177 1827 -54848 -20353 30513 101213
23263 101213 59027 40450 69592 86591 -9118 -67711 -63794 -101018 -59984 20807 80655 28504
$$ packed form
23346e5129k9368N5547Q169n4981K0171R9110L0911Q112k9373k3209l2864L9404
23334C6500Q7944j24633j10762O0895R103J0694j6707j741j534n5699j7815l3725
23322a57480K0184N3614M408K0261n5090N7706K7865J7506o0320k8544O3560k336
23310c8666m1808J1583j2774O2893P4329q3010k2185q8268O2697J00329P287Q8199
23298A20606M3135L1262P383k2245j23716j00098Q4205M3410l0143n7898m9219
23287e3318n632K1194L5319N3254K7118l457l9573l1477K2820N7026M8682q0665
23275E1291P988m6273O5338m8123q721j90K4867m4350n6675L4495N0866P0700
23263A01213m2186j8577K9142J6999r5709n8593L917l7224M1034Q0791N9848n2151
$$ plain form
23251 28504 -149981 -259964 -222428 -195788 -168986 -218134 -177896 -199468 -215749 -191014 -138073
23240 -138073 -172613 -160350 -108045 -86253 -92978 -34650 52069 75442 62489 34570 -75052
23229 -75052 -207940 -166033 -49055 -86298 -116472 -104514 -142224 -182751 -117822 -21496 90290
23218 90290 113263 205300 212298 161072 97222 -71698 -198073 -190545 -155105 -101226 -88696 -153572
23206 -153572 -103757 -37908 -27064 -17517 7955 -29354 -79282 -83139 -19599 1185 71758 119166
23194 119166 60912 57456 111699 137231 121631 23602 -83987 -105170 -69738 50733 73347
23183 73347 108609 47036 -31355 -194636 -184871 -64813 41277 58619 -76058 -166151 -145133
23172 -145133 -95751 -70778 -80449 -53169 6677 3521 24284 5114 -22515 17509 -8324 1898
$$ packed form
23251B8504j78485j09983L7536K6640K6802m9148M0238k1572j6281K4735N2941
23240a38073l4540J2263N2305K1792o725N8328Q6719K3373j2953k7919j09622
23229g5052j32888M1907J16978l7243l0174J1958l7710m0527O4929R6326J11786
23218I0290K2973R2037O998n1226o3850j68920j26375P528L5440N3879J2530o4876
23206a53572M9815O5849J0844R547K5472l7309m9928l857O3540K0784P0573M7408
23194A19166n8254l456N4243K5532j5600r8029j07589k1183L5432J20471K2614
23183G3347L5262o1573p8391j63281R765J20058J06090J7342j34677r0093K1018
23172a45133M9382K4973r671K7280N9846l156K0763j9170k7629M0024k5833J0222
$$ plain form
23160 1898 -8474 39780 167267 130250 42666 -59886 -92033 -122870 -175147 -176233 -116654 27311
23148 27311 22964 -18966 19410 5189 -64044 -53586 -31836 30944 49015 -18776 -85825 -66718
23136 -66718 -9172 -20878 -70054 -134249 -102707 -46930 -103138 -128659 -33582 60168 -38934 -180288
23124 -180288 -204606 -150079 -43263 -75714 -91560 -74251 -64555 -72429 -137104 -173840 -87183 -56952
23112 -56952 -69470 -80118 -78854 -77134 -1246 36406 -52562 -111805 -209278 -156182 -76688 -4490
23100 -4490 -89018 -125050 -208918 -150155 -99463 -79015 -64728 -4938 -4922 -15626 -22459 -77795 -92623
23087 -92623 -89649 31032 134933 144466 45469 -23744 -32024 -100479 -131897 -42179 13472 101129
23075 101129 33349 22684 5941 -68511 -34897 21879 18001 35113 56371 59326 105084 42495
$$ packed form
23160A898j0372M8254J27487l7017q7584j02552l2147l0837n2277j086N9579J43965
23148B7311m347m1930L8376j4221o9233J0458K1750O2780J8071o7791o7049J9107
23136f6718N7546j1706m9176o4195L1542N5777n6208k5521R5077R3750r9102j41354
23124a80288k4318N4527J06816l2451j5846J7309R696p874o4675l6736Q6657L0231
23112e6952j2518j0648J264J720P5888L7652q8968n9243r7473N3096P9494P2198
23100d490q4528l6032q3868N8763N0692K0448J4287N9790J6j0704o833n5336j4828
23087i2623K974J20681J03901R533r8997o9213q280o8455l1418Q9718N5651Q7657
23075A01129o7780j0665j6743p4452L3614N6776l878J7112K1258K955M5758o2589
$$ plain form
23063 42495 -76482 -74971 -15960 22846 -23292 -93992 -113830 -55623 30191 93398 56885 77286
23051 77286 63024 -21016 -25656 -62922 -82235 -65763 -102336 -124692 -101625 -79411 -47763 -17444
23039 -17444 -31357 -12865 -18338 -103879 -205704 -179514 -177398 -213696 -130888 -161836 -199653 -176057
23027 -176057 -193884 -105301 -26371 -24557 -45870 -41824 -60436 -60942 -1100 -12122 -58281 20374
23015 20374 66054 83803 121385 87806 -23207 -87810 -78186 -47027 -98753 -174700 -148985 -110204
23003 -110204 -142617 -200540 -192682 -176882 -116097 -116519 -134760 -178486 -175142 -66631 -102876 -84902
22991 -84902 -46025 -133045 -154716 -59456 -6400 57470 51222 1714 16135 -3856 69562 23538
22979 23538 -33283 -63848 -104870 -32261 36931 74210 54377 32919 63081 139494 187898 167566
$$ packed form
23063D2495j18977J511N9011L8806m6138p0700j9838N8207Q5814O3207l6513K0401
23051G7286j4262q4040m640l7266j9313J6472l6573k2356K3067K2214L1648L0319
23039a7444j3913J8492n473q5541j01825K6190K116l6298Q2808l0948l7817K3596
23027a76057j7827Q8583P8930J814k1313M046j8612n06N9842j1022m6159P8655
23015B0374M5680J7749L7582l3579j11013o4603R624L1159n1726p5947K5715L8781
23003a10204l2413n7923P858J5800O0785m22j8241m3726L344J08511l6245J7974
22991h4902L8877q7020k1671R5260N3056O3870o248m9508J4421j9991P3418m6024
22979B3538n6821l0565m1022P2609O9192L7279j9833k1458L0162P6413M8404k0332
$$ plain form
22967 167566 43120 42467 44456 -73965 -178292 -208110 -157182 -127304 -60953 -12382 -68841
22956 -68841 -54394 -46589 -63882 1703 96095 67663 -27919 -38910 55023 91487 58121 95100
22944 95100 153035 99950 14078 -24872 -10297 -17686 -40686 -96175 -128576 -184895 -222291 -181753
22932 -181753 -144472 -141735 -115137 -35831 -13508 62733 32780 24425 35110 1165 13418 108882
22920 108882 222618 155142 23481 -19597 116758 163840 78529 61002 -16100 -65886 -40094
22909 -40094 -745 105699 203588 172983 110841 20794 33882 22520 112092 61166 -80258
22898 -80258 -7731 103027 142546 123359 116707 6108 -42331 89359 171495 225618 168828
22887 168828 81643 20920 -15852 -38485 -85240 -116936 -73510 -30954 -12396 -29464 -75024
$$ packed form
22967A67566j24446o53J989j18421j04327k9818N0928K9878O6351M8571n6459
22956f8841J4447P805j7293O5585R4392k8432r5582j0991R3933L6464l3366L6979
22944I5100N7935n3085q5872l8950J4575p389k3000n5489l2401n6319l7396M0538
22932a81753L7281K737K6598P9306K2323P6241k9953q355J0685l3945J2253R5464
22920A08882J13736o7476j31661m3078J36355M7082q5311j7527p7102m9786K5792
22909d0094L9349J06444R7889l0605o2142r0047J3088j1362Q9572n0926j41424
22898h0258P2527J10758L9519j9187o652j10599m8439J31690Q2136N4123n6790
22887A68828q7185o0723l6772k2633m6755l1696M3426M2556J8558j7068m5560
$$ plain form
22876 -75024 -33271 21777 78167 30376 -69059 -177903 -145112 -118383 -63310 -606 41094
22865 41094 -19508 -39329 -68989 -86381 -88743 -184782 -186061 -104420 -129241 -203968 -165928 -119325
22853 -119325 -120756 -142944 -187623 -142875 -139221 -158541 -116257 -81564 -145723 -176839 -114890 -37890
22841 -37890 -15283 -58249 -54355 12735 -9739 -61792 -11146 7368 50766 33591 9138 -19224
22829 -19224 -111122 -73903 -36814 -20540 -88331 -112227 -69274 -77143 -112507 -111957 -90101 -56950
22817 -56950 -60347 -68758 -45619 -100815 10232 43577 -114172 -44629 35253 55739 60046 71679
22805 71679 89318 117957 56827 -10020 94280 166599 156427 117463 64860 97877 125612
22794 125612 58575 33411 47801 78733 68595 20177 -4608 -10670 -48405 -79774 -17305 -7621
$$ packed form
22876g5024M1753N5048N6390m7791r9435j08844L2791K6729N5073O2704M1700
22865D1094o0602j9821k9660j7392k362r6039j279Q1641k4821p4727L8040M6603
22853a19325j431k2188m4679M4748L654j9320M2284L4693o4159l1116O1949P7000
22841c7890K2607m2966L894O7090k2474n2053N0646J8514M3398j7175k4453k8362
22829a9224r1898L7219L7089J6274o7791k3896M2953p869l5364N50K1856L3151
22817e6950l397q411K3139n5196J11047L3345j57749O9543P9882K0486M307J1633
22805G1679J7639K8639o1130o6847J04300P2319j0172l8964n2603L3017K7735
22794A25612o7037k5164J4390L0932j0138m8418k4785o062l7735l1369O2469R684
$$ plain form
22782 -7621 -76945 -121607 -134223 -145634 -147183 -167849 -125004 -12601 79278 184399 93150 -71875
22770 -71875 -40504 -10420 -7874 15115 4589 -34733 -45650 -27694 16209 -38571 -17665 -31482
22758 -31482 11382 55180 86572 75001 24746 50449 102723 126968 115832 20166 -86433
22747 -86433 -98962 -57678 -83654 -117787 -89557 -60663 -17101 20728 39942 -58218 -45043 -66863
22735 -66863 -121000 -46156 24927 31302 64043 107289 72853 -21451 -115563 14419 132008
22724 132008 80714 -37695 -50442 -92603 -34734 31493 20982 -63523 -93458 -15514 -780
22713 -780 -53327 -136344 -155122 -233432 -187159 -130006 -112945 -154005 -27531 60401 49078 39402
22701 39402 -52942 -71829 -51758 6392 63309 149292 148880 46694 30351 -42977 -97946 -158247
$$ packed form
22782g621o9324m4662j2616j1411j549k0666M2845J12403R1879J05121r1249j65025
22770g1875L1371L0084K546K2989j0526l9322j0917J7956M3903n4780K0906j3817
22758c1482M2864M3798L1392j1571n0255K5703N2274K4245j1136r5666j06599
22747h6433j2529M1284k5976l4133K8230K8894M3562L7829J9214r8160J3175k1820
22735f6863n4137P4844P1083O375L2741M3246l4436r4304r4112J29982J17589
22724A32008n1294j18409j2747m2161N7869O6227j0511q4505k9935P7944J4734
22713g80n2547q3017j8778p8310M6273N7153J7061m1060J26474Q7932j1323r676
22701C9402r2344j8887K0071N8150N6917Q5983m12j02186j6343p3328n4969o0301
$$ plain form
22689 -158247 -138718 -120356 -101725 -37391 39962 88329 50945 -3112 29233 -59230 -139001
22678 -139001 -98280 -1253 -38981 -142830 -206812 -157843 -45140 -9955 -36531 5589 89726
22667 89726 155855 146566 150934 174625 65518 -18397 -76750 -89100 -142657 -223682 -150551 -16724
22655 -16724 -20078 -64515 -65149 -52585 -12991 -21537 47214 48493 4920 65851 52261 22524 -4692
22642 -4692 -77333 -123511 -139538 -229851 -188119 -64523 -98452 -167050 -146546 -219379 -233924 -176161
22630 -176161 -140566 -56956 -24182 -75642 -117939 -43513 36136 -21106 -71187 -89777 -133992
22619 -133992 -116945 -128448 -120120 61346 7836 -44851 -47550 -90585 -144827 -105225 -144262 -107707
22607 -107707 -163175 -151602 -88770 -58448 -14978 29312 19587 39951 71942 24098 -80825
$$ packed form
22689a58247J9529J8362J8631O4334P7353M8367l7384n4057L2345q8463p9771
22678a39001M0721R7027l7728j03849o3982M8969J12703L5185k6576M2120Q4137
22667H9726O6129r289M368K3691j09107q3915n8353j2350n3557q1025P3131J33827
22655a6724l354m4437o34J2564L9594q546O8751J279m3573O0931j3590k9737k7216
22642d692p2641m6178j6027r0313M1732J23596l3929o8598K0504p2833j4545N7763
22630a76161L5595Q3610L2774n1460m2297P4426P9649n7242n0081j8590m4215
22619a33992J7047j1503Q328J81466n3510n2687k699m3035n4242L9602l9037L6555
22607a07707n5468J1573O2832L0322M3470M4290r725K0364L1991m7844j04923
$$ plain form
22596 -80825 -101774 -130750 -66191 16741 8276 -118141 -19722 112248 220911 305033 245580
22585 245580 196955 42982 19936 75041 24795 46333 65211 28740 -33267 -115572 -134372
22574 -134372 -95294 -57555 -23952 -13497 33832 28857 128680 124000 33852 -55970 -80153 -54895
22562 -54895 44629 72298 65522 114802 149329 71200 -14821 63727 13752 -69283 -232244 -281518
22550 -281518 -252057 -220375 -160921 -133910 -133155 -75391 116296 159280 47248 9679 -47219
22539 -47219 -51720 31479 -7786 -15379 -50047 -55430 -111438 -208246 -155028 -105595 -100849 -100421 -150671
22526 -150671 -160464 -162869 -157581 -118294 -26363 -23592 -66582 -29564 96517 57190 -24332 -80913
22514 -80913 -124369 -85816 -93364 -160193 -141021 -42477 -15319 8942 -109633 -128269 19940
$$ packed form
22596h0825k0949k8976O4559Q2932q465j26417R8419J31970J08663Q4122n9453
22585B45580m8625j53973k3046N5105n0246K1538J8878l6471o2007q2305j8800
22574a34372L9078L7739L3603J0455M7329m975R9823m680r0148q9822k4183K5258
22562e4895R9524K7669o776M9280L4527p8129q6021P8548m9975q3035j62961m9274
22550b81518K9461L1682N9454K7011P55N7764J91687M2984j12032l7569n6898
22539d7219m501Q3199l9265p593l4668n383n6008r6808N3218M9433M746M28n0250
22526a50671r793k405N288L9287R1931K771m2990L7018J26081l9327q1522n6581
22514h0913m3456L8553p548o6829J9172R8544K7158K4261j18575j8636J48209
$$ plain form
22503 19940 110808 18204 -14264 -11251 68440 28010 -9890 -31570 -88129 -45617 75006 150062
22491 150062 35458 -16584 -43956 -12056 68449 64301 89462 108200 92038 82471 106456 97294
22479 97294 39700 111193 121125 66514 110887 89651 -14381 -26377 3484 -40873 -85042 -46367
22467 -46367 -29838 -8999 -80302 -57717 -56391 -189878 -271174 -142027 -67911 -61736 -46936 -76067
22455 -76067 -6605 -18637 24518 65954 51600 8906 54171 44764 -13524 -38714 -95433 -34453
22443 -34453 -32358 984 -34133 -8244 4515 -75409 -173208 -156237 -82525 -62503 -65427 -76242
22431 -76242 -55528 -67678 -82101 11142 39823 -100928 -158219 -128671 -83041 -84288 -49779 -83070
22419 -83070 -77529 -110331 -91426 -114793 -55803 49741 -14481 -57271 -74168 -49426 -38515 14258
$$ packed form
22503A9940R0868r2604l2468L013P9691m0430l7900k1680n6559M2512J20623P5056
22491A50062j14604n2042k7372L1900Q0505m148K5161J8738j6162r567K3985r162
22479I7294n7594P1493R932n4611M4373k1236j04032j1996K9861m4357m4169L8675
22467d6367J6529K0839p1303K2585J326j33487q1296J29147P4116O175J4800k9131
22455g6067O9462j2032M3155M1436j4354m2694M5265r407n8288k5190n6719O0980
22443c4453K095L3342l5117K5889J2759p9924r7799J6971P3712K0022k924j0815
22431g6242K0714j2150j4423R3243K8681j40751n7291K9548M5630j247L4509l3291
22419h3070N541l2802J8905k3367N8990J05544o4222m2790j6897K4742J0911N2773
$$ plain form
22407 14258 77940 126981 142021 123312 28654 -28754 18127 37125 -56342 -33431 -27252 -57571
22395 -57571 -111888 -72428 -16742 33841 93208 5511 -111175 -68159 -58580 -56847 -88029 -75553
22383 -75553 -74620 -40957 6605 6017 -4637 93976 117444 78347 82589 284315 293532 187796
22371 187796 98020 181248 81277 -44138 -89052 -25551 14885 -7105 51240 -39878 -6008
22360 -6008 63346 69132 25294 22034 -35221 -43142 64842 81159 134255 84670 -12795 -8880
22348 -8880 -4464 -40583 -126948 -113901 -95341 -21226 101114 116047 21378 -30653 -63108 -20752
22336 -20752 66115 34386 -51663 -75711 -76620 -146475 -156959 -104963 -64127 -91587 -181822 -248898
22324 -248898 -214202 -159146 -94019 2076 28518 16555 67170 515 -140617 -129743 -91167
$$ packed form
22407A4258O3682M9041J5040j8709r4658n7408M6881J8998r3467K2911O179l0319
22395e7571n4317L9460N5686N0583N9367q7697j16686M3016R579J733l1182J2476
22383g5553R33L3663M7562n88j0654R8613K3468l9097M242K01726R217j05736
22371A87796q9776Q3228r9971j25415m4914O3501M0436k1990N8345r1118L3870
22360f008O9354N786m3838l260n7255p921J07984J6317N3096m9585r7465L915
22348h880M416l6119q6365J3047J8560P4115J22340J4933r4669n2031l2455M2356
22336b0752Q6867l1729q6049k4048r09o9855j0484N1996M0836k7460r0235o7076
22324b48898L4696N5056O5127R6095K6442j1963N0615o6655j41132J0874L8576
$$ plain form
22313 -91167 -122954 -181596 -196277 -187115 -141157 -79779 -80909 -117031 -82991 -139801 -113564 -165985
22301 -165985 -224569 -166513 -184748 -160255 -184279 -106131 -33765 -53243 -64548 -106975 -175056
22290 -175056 -202954 -140221 -136907 -39224 25248 28111 29743 -21757 -127625 -135976 -95347 -85458
22278 -85458 -86466 -129316 -146548 -164789 -189658 -121855 -179938 -194636 -53399 11622 31452 69462
22266 69462 89140 41884 48448 78975 53559 131641 62315 -5047 6511 25180 -90125 -176419
22254 -176419 -190790 -279762 -349404 -250323 -209998 -184165 -98677 -60102 -3531 7162 4976 84516
22242 84516 -4985 -31822 -65020 39206 34843 -27188 -17659 -42911 -53557 -115381 -96393 -19528
22230 -19528 15580 -17582 -64134 -2444 119744 92508 86598 89227 40272 91213 34059 2436
$$ packed form
22313i1167l1787n8642j4681R162M5958O1378j130l6122L4040n6810K6237n2421
22301a65985n8584N8056j8235K4493k4024P8148P2366j9478j1305m2427o8081
22290a75056k7898O2733L314R7683O4472K863J632n1500j05868q351M0629R889
22278h5458j008m2850j7232j8241k4869O7803n8083j4698J41237O5021J9830L8010
22266F9462J9678m7256O564L0527k5416P8082o9326o7362J1558J8669j15305q6294
22254a76419j4371q8972o9642R9081M0325K5833Q5488L8575N6571J0693k186P9540
22242H4516q9501k6837l3198J04226m363o2031R529k5252j0646o1824J8988P6865
22230a9528L5108l3162m6552O1690J22188k7236n910K629m8955N0941n7154l1623
$$ plain form
22218 2436 44418 7166 13233 11890 18121 11141 57550 36244 43416 -11685 -100346 -152618 -192264
22205 -192264 -215750 -137176 -111616 -124505 -171599 -232927 -94993 -32002 -56643 -103947 -95161
22194 -95161 -114095 -71899 -71049 -121047 -270844 -345278 -267045 -229579 -125329 -95336 31960
22183 31960 127731 76854 19061 -60136 -22064 7868 -8481 30995 87447 66959 5289 -45777
22171 -45777 -48775 -17771 51578 55639 2546 -63377 -44377 -29197 -112189 -130615 -152088 -170524
22159 -170524 -143091 -56453 9181 3027 32308 71456 104211 178406 148153 168336 189331 147301
22147 147301 36642 -35807 -79181 -223967 -302681 -235730 -139045 -62683 -8621 -108861 -145358
22136 -145358 -66376 -65013 -55172 -8173 -88586 -27782 -13940 9837 -53465 -71526 -49385 -39716
$$ packed form
22218B436M1982l7252O067j343O231o980M6409k1306P172n5101q8661n2272l9646
22205a92264k3486P8574K5560j2889m7094o1328J37934O2991k4641m7304Q786
22194i5161j8934M2196Q50m9998j49797p4434P8233L7466J04250K9993J27296
22183C1960R5771n0877n7793p9197L8072K9932j6349L9476N6452k0488o1670n1066
22171d5777k998L1004O9349M061n3093o5923J9000J5180q2992j8426k1473j8436
22159a70524K7433Q6638O5634o154K9281L9148L2755P4195l0253K0183K0995m2030
22147A47301j10659p2449m3374j44786p8714O6951R6685P6362N4062j00240l6497
22136a45358P8982J363R841M6999q0413O0804J3842K3777o3302j8061K2141R669
$$ plain form
22124 -39716 -64806 -91500 -38792 -7170 33143 47633 6741 -27671 -97251 -144674 -167246 -163224
22112 -163224 -84633 -14957 -19586 102361 157890 174561 105779 -31767 -99770 -95224 -118299
22101 -118299 -28134 35920 -48445 60194 149120 121159 39064 36311 70848 61193 40673 22150
22089 22150 -28921 -25494 27353 92188 84482 83683 84796 85332 109514 100228 101945 125543 115671 46449
22075 46449 -80208 -103731 -174953 -170706 -102880 -20846 45365 124457 116163 159652 108487 78179
22063 78179 32834 -113981 -127631 -140129 -115020 -12689 6463 -70839 -140606 -137325 -13341
22052 -13341 7670 -95661 -107619 -19856 40039 31068 952 -60798 -79917 -19783 -10327 4903
22040 4903 79054 161663 70204 56829 65104 25561 23730 4245 -30951 -75734 -124343 -187288
$$ packed form
22124c9716k5090k6694N2708L1622M0313J4490m0892l4412o9580m7423k2572M022
22112a63224P8591O9676m629J21947N5529J6671o8782j37546o8003M546k3075
22101a18299R0165O4054q4365J08639Q8926k7961q2095k753L4537r655k0520j8523
22089B2150n1071L427N2847O4835p706p99J113N36K4182r286J717K3598r872o9222
22075D6449j26657k3523p1222M247O7826Q2034O6211P9092q294M3489n1165l0308
22063G8179m5345j46815j3650j2498K5109J02331J9152p7302o9767L281J23984
22052a3341K1011j03331j1958Q7763N9895q971l0116o1750j9119O0134R456J5230
22040D903P4151Q2609r1459j3375Q275l9543j831j9485l5196m4783m8609o2945
$$ plain form
22028 -187288 -154462 -150612 -96385 -30117 -12133 -20466 -50875 -8218 57104 30941 17860 54568
22016 54568 98314 86101 106045 112356 103535 85214 41719 59570 56892 -114507 -108342 66412
22004 66412 160937 83676 -40453 -71561 -123972 -104459 -9064 41255 10139 -15353 -5067
21993 -5067 -33248 2022 86552 117057 103708 51599 13182 20390 103085 96781 69735 37566
21981 37566 -23060 -1419 1464 -17778 -58866 -93837 -54179 -66730 -89269 -157509 -108712 55100
21969 55100 54519 -78391 -108001 -3387 92439 53129 58240 60536 115441 95499 19146 12694
21957 12694 14920 34669 96602 110496 33725 -21205 -71214 -24456 28150 78962 41369 -32432
21945 -32432 32997 -16945 -47270 77349 115974 129519 159318 228369 211724 108629 72163
$$ packed form
22028a87288L2826L850N4227O6268J7984q333l0409M2657O5322k6163j3081L6708
22016E4568M3746j2213J9944O311q821j8321m3495J7851k678j71399O165J74754
22004F6412R4525p7261j24129l1108n2411J9513R5395N0319l1116k5492J0286
21993e067k8181L5270Q4530L0505j3349n2109l8417P208Q2695o304k7046l2169
21981C7566o0626K1641K883j9242m1088l4971L9658j2551k2539o8240M8797J63812
21969E5100n81j32910k9610J04614R5826l9310N111K296N4905j9942p6353o452
21957A2694K226J9749O1933J3894p6771n4930n0009M6758N2606N0812l7593p3801
21945c2432O5429m9942l0325J24619L8625J3545K9799O9051j6645j03095l6466
$$ plain form
21934 72163 97698 116831 46281 -16226 10533 97926 57327 -12692 -51338 56594 42728
21923 42728 -91452 -83784 -20472 61515 92957 -4203 -10078 16550 -93636 -161628 -148701 -31534
21911 -31534 -23783 -75145 -15018 42738 44920 -62094 -110269 -4056 10552 -67219 -142223 -104710
21899 -104710 -102129 -125722 -5955 107073 101372 23287 -73423 -121128 -99737 11957 77240
21888 77240 86480 43011 791 -12191 -20034 -56310 -132410 -49877 20123 101041 210790 269935
21876 269935 178216 151703 47602 -26399 4308 54455 19432 -17240 16537 41248 36305
21865 36305 25876 -17543 -51642 -42032 3401 25349 -40439 -79943 14715 -66957 -126594 -130533
21853 -130533 -129566 -68871 -73160 -41911 -166270 -187373 -33046 -14729 30989 77859 93754 69428
$$ packed form
21934G2163K5535J9133p0550o2507K6759Q7393m0599p0019l8646J07932j3866
21923D2728j34180P668O3312Q1987L1442r7160n875K6628j10186o7992J2927J17167
21911c1534P751n1362O0127N7756K182j07014m8175J06213J4608p7771p5004L7513
21899a04710K581k3593J19767J13028n701p8085r6710m7705K1391J11694O5283
21888G7240R240m3469m2220j2982p843l6276p6100Q2533P0000Q0918J09749N9145
21876B69935r1719k6513j04101p4001L0707N0147l5023l6672L3777K4711m943
21865C6305j0429m3419l4099R610M5433K1948o5788l9504R4658q1672n9637l939
21853a30533R67O0695m289L1249j24359k1103J54327J8317M5718M6870J5895k4326
$$ plain form
21841 69428 82037 73506 -29653 -72184 -32895 -49777 -49535 -49946 -11501 63103 108854 99944 51941
21828 51941 906 8956 22676 14378 -42961 -43162 -10249 -90511 -92174 -22738 -32254 -67904 -54422
21815 -54422 -14898 -75299 -155919 -89569 6645 17169 33528 -69211 -126954 -91371 -15147
21804 -15147 -6668 20819 128125 44944 -16012 16457 -3389 20195 30040 97476 115442 42265
21792 42265 -23117 -56959 -55117 -101292 -3393 18526 39678 42828 106501 225163 254522 241814
21780 241814 195661 184725 124559 59369 18666 18073 42048 97631 131024 75077 25603 -35202
21768 -35202 -50940 -77234 -178902 -218574 -143702 -70629 -21525 -37372 -104572 -128991 -192107
21757 -192107 -203863 -187504 -122470 -135913 44740 110276 -25894 -58080 30463 20351 -81738
$$ packed form
21841F9428J2609q531j03159m2531L9289j6882K42m11L8445P4604M5751q910m8003
21828E1941n1035Q050J3720q298n7339k01L2913q0262j663O9436r516l5650J3482
21815e4422L9524o0401q0620O6350R6214J0524J6359j02739n7743L5583P6224
21804a5147Q479K7487J07306q3181o0956L2469j9846K3584R845O7436J7966p3177
21792D2265o5382l3842J842m6175R7899K1919K1152L150O3673J18662K9359j2708
21780B41814m6153j0936o0166o5190m0703n93K3975N5583L3393n5947m9474o0805
21768c5202j5738k6294j01668l9672P4872P3073M9104j5847o7200k4419o3116
21757a92107j1756J6359O5034j3443J80653O5536j36170l2186Q8543j0112j02089
$$ plain form
21746 -81738 -103711 -33870 34214 28308 63960 71203 -128652 -145324 -145709 -162361 -111040 -9549
21734 -9549 -622 28103 93447 45862 35703 -17918 -21534 -3139 61530 104009 117774 171327
21722 171327 165445 141577 80967 30637 57829 103261 30832 -5980 -44973 -115777 -157415 -116701
21710 -116701 -21968 -26771 -25106 54707 72099 84793 12345 -62551 33243 101644 75831 97123
21698 97123 51326 38136 -26142 -57784 66119 125728 54659 21032 51052 110410 102523 60330
21686 60330 -4557 26275 73562 43765 87102 207389 115918 -2911 -49293 -25257 -49538
21675 -49538 -68821 -110277 -143569 -228958 -187441 -93796 -134816 -211868 -285133 -253799 -226586 -203735
21663 -203735 -170385 -81878 -84179 -40387 43273 -30315 -107227 -98762 -39238 93424 159806 205113
$$ packed form
21746h1738k1973O9841O8084n906L5652P243j99855j6672l85j6652N1321J01491
21734i549Q927K8725O5344m7585j0159n3621l616J8395O4669M2479J3765N3553
21722A71327n882k3868o0610n0330K7192M5432p2429l6812l8993p0804m1638M0714
21710a16701R4733m803J665P9813J7392J2694p2448p4896R5794O8401k5813K1292
21698I7123m5797j3190o4278l1642J23903N9609p1069l3627L0020N9358p887m2193
21686F0330o4887L0832M7287k9797M3337J20287r1471j18829m6382K4036k4281
21675d9538j9283m1456l3292q5389M1517R3645m1020p7052p3265L1334K7213K2851
21663b03735L3350Q8507k301M3792Q3660p3588p6912Q465N9524J32662O6382M5307
$$ plain form
21651 205113 134640 105765 128262 123495 14989 -91826 -79733 -52492 45967 57304 18821
21640 18821 -787 139981 124693 84452 58704 38565 84319 8292 83227 2387 -159795
21629 -159795 -145717 -125515 -44809 -53276 -123997 21733 50902 -3666 -61693 -96055 -5463
21618 -5463 31723 -51020 -31727 -89159 33912 102839 138477 115924 144301 71224 21941 -80917
21606 -80917 14622 9897 -1716 -78512 -59138 -91628 -25705 -37054 -28660 -40263 65660 76031
21594 76031 -35585 -82610 -107568 -105903 -28255 39808 30936 43547 -21241 -129991 -139594 -122377
21582 -122377 -33151 35341 5110 -14388 -13652 -26604 -66956 -21101 -6504 -11265 -78635 -87721
21570 -87721 -82876 -209261 -184522 -85534 -20188 -20105 33122 52890 -10481 -20622 40814 49031
$$ packed form
21651B05113p0473k8875K2497m767j08506j06815J2093K7241R8459J1337l8483
21640A8821j9608J40768j5288m0241k5748k0139M5754p6027P4935q0840j62182
21629a59795J4078K0202Q0706q467p0721J45730K9169n4568n8027l4362R0592
21618e463L7186q2743J9293n7432J23071O8927L5638k2553K8377p3077m9283j02858
21606h0917R5539m725j1613p6796J9374l2490O5923j1349Q394j1603J05923J0371
21594G6031j11616m7025k4958J665P7648O8063q872J2611o4788j08750r603J7217
21582a22377Q9226O8492l0231j9498P36j2952m0352M5855J4597m761o7370r086
21570h7721M845j26385K4739R8988O5346Q3N3227J9768o3371j0141O1436Q217
$$ plain form
21558 49031 3945 -83276 -206774 -104883 17641 -27981 -18661 25475 -4330 -1939 -38397
21547 -38397 -18284 19212 -38196 -124662 -238098 -268114 -251245 -206567 -165981 -79916 17274
21536 17274 78862 100380 101191 73544 141379 129817 117734 88369 97785 108201 73678 98533
21524 98533 194147 237697 122407 67284 88700 72719 79 -2737 117147 207084 211059 153381
21512 153381 55592 1488 -55184 -117097 -72951 -5374 -68084 -110023 -92877 -109891 -121419
21501 -121419 -114903 -130430 -5613 2760 24185 13878 -23226 -69618 -84164 -21079 52926 58181
21489 58181 97206 86912 90394 -36711 22707 120654 129555 149888 180950 215942 129186 8173
21477 8173 25779 68845 -50959 -108154 -65608 -93480 -66821 -18038 -178 -54232 -23441 -27014
$$ packed form
21558D9031m5086q7221j23498J01891J22524m5622R320M4136k9805K391l6458
21547c8397K0113L7496n7408q6466j13436l0016J6869M4678M0586Q6065R7190
21536A7274O1588K1518Q11k7647O7835j1562j2083k9365R416J0416l4523K4855
21524I8533R5614M3550j15290n5123K1416j5981p2640k816J19884Q9937L975n7678
21512A53381r7789n4104n6672o1913M4146O7577o2710m1939J7146j7014j1528
21501a21419O516j5527J24817Q373K1425j0307l7104m6392j4546O3085P4005N255
21489E8181L9025j0294L482j27105N9418R7947Q901K0333L1062L4992q6756j21013
21477H173J7606M3066j19804n7195M2546k7872K6659M8783J7860n4054L0791l573
$$ plain form
21465 -27014 49585 134531 -24792 -32707 -34726 -24087 -42055 -133363 -239538 -207801 -161333 -145847
21453 -145847 -120289 -52235 -82554 -126394 62001 128355 64230 -83937 -250556 -153290 -65170
21442 -65170 -45820 -84147 -84522 -82238 47271 121490 46491 13374 34049 -34179 -47742 33836
21430 33836 110526 -7976 -179039 -97706 27994 66913 59263 69263 84478 162456 182534
21419 182534 119993 71886 21165 34192 23089 51701 8408 -17550 -34408 -5852 -24686
21408 -24686 19149 -21357 -35501 35121 125617 62295 60237 97648 64929 90874 21470 52619
21396 52619 23561 -10011 -92330 -113718 -62974 27153 58511 32624 77190 10824 30109 101639
21384 101639 31131 4376 -31345 -57876 -86299 -117919 -126538 -64457 132446 219318 173304
$$ packed form
21465b7014P6599Q4946j59323p915k019J0639j7968r1308j06175L1737M6468J5486
21453a45847K5558O8054l0319m3840J88395O6354o4125j48167j66619R7266Q8120
21442f5170J9350l8327l75K284J29509P4219p4999l3117K0675o8228j3563Q1578
21430C3836P6690j18502j71063Q1333J25700L8919p650J0000J5215P7978K0078
21419A82534o2541m8107n0721J3027j1103K8612m3293k5958j6858K8556j8834
21408b4686M3835m0506j4144P0622R0496o3322k058L7411l2719K5945o9404L1149
21396E2619k9058l3572q2319k1388N0744R0127L1358k5887M4566o6366J9285P1530
21384A01639p0508k6755l5721k6531k8423l1620q619O2081J96903Q6872m6014
$$ plain form
21373 173304 39727 16268 30450 -39404 29751 79760 205959 216175 122515 42837 -37045
21362 -37045 -147800 -138763 -52492 -63288 -7414 46126 100170 173482 230115 133964 67710 72473
21350 72473 27668 -35415 -111193 -51610 -20761 -29750 -82466 -152628 -107796 -41795 -25195 -34937
21338 -34937 21875 62208 108271 196663 175057 168242 188251 158311 102876 26808 18593 -28756
21326 -28756 -10997 35917 63085 113178 79044 128460 134952 -18310 30455 -2783 -85433 -52584
21314 -52584 42863 100271 79626 35822 -73066 -6215 7801 23066 52524 1266 -51723
21303 -51723 93026 207583 143412 145167 63156 -110513 -97639 -103494 -174334 -87392 -37963
21292 -37963 -4249 456 7924 500 11738 8615 -34577 -20057 -15024 -115437 -344 18864
$$ packed form
21373A73304j33577k3459J4182o9854O9155N0009J26199J0216r3660p9678p9882
21362c7045j10755R037Q6271j0796N5874N3540N4044P3312N6633r6151o6254M763
21350G2473m4805o3083p5778N9583L0849q989n2716p0162M4832O6001J6600r742
21338c4937N6812M0333M6063Q8392k1606o815K0009k9940n5435p6068q215m7349
21326b8756J7759M6914K7168N0093l4134M9416O492j53262M8765l3238q2650L2849
21314e2584R5447N7408k0645m3804j08888O6851J4016J5265K9458n1258n2989
21303e1723J44749J14557o4171J755q2011j73669J2874n855p0840Q6942M9429
21292c7963L3714M705P468p424J1238l123m3192J4520N033j00413J15093J9208
$$ plain form
21280 18864 7378 64597 176240 111714 -17673 -102474 -105067 -103846 -195786 -177580 -44004
21269 -44004 108324 141253 85898 60485 88732 72882 115998 127312 93905 131306 61643
21258 61643 31445 42846 -35743 16405 6471 -64927 15306 4556 76788 118450 87377 11461
21246 11461 -18412 184 54629 -13450 -1483 3031 16177 -13310 -77067 -85199 -39044 -35087
21234 -35087 -16574 48246 9672 -12651 -42279 -141144 -139427 -109619 -184757 -135474 -128545 -129127
21222 -129127 -153641 -108275 -67728 -52650 -52021 16173 -40787 -88439 -18101 43760 118383 78719
21210 78719 4492 -64817 -9286 36257 83716 41343 38790 19911 -642 6479 -10021 -67401
21198 -67401 -70775 1700 -5672 9808 44319 -37154 -52985 -106303 -104413 -38823 -17896 -22215
$$ packed form
21280A8864j1486N7219J11643o4526j29387q4801k593J221r1940J8206J33576
21269d4004J52328L2929n5355k5413K8247j5850M3116J1314l3407L7401o9663
21258F1643l0198J1401p8589N2148r934p1398Q0233j0750P2232M1662l1073p5916
21246A1461k9873J8596N4445o8079J1967M514J3146k9487o3757q132M6155L957
21234c5087J8513O4820l8574k2323k9628r8865J717K9808p5138M9283O929n82
21222a29127k4514M5366M0547J5078O29O8194n6960m7652P0338O1861P4623l9664
21210G8719p4227o9309N5531M5543M7459m2373k553j8879k0553P121j6500n7380
21198f7401l374P2475p372J5480L4511q1473j5831n3318J890O5590K0927m319
$$ plain form
21186 -22215 -40821 -36294 27716 117854 96096 35868 94154 141275 110039 115939 92961 107536
21174 107536 103359 94002 105392 87307 112613 169918 119038 62212 -26260 -23660 -16952 -14259
21162 -14259 61798 61728 22657 14775 46404 18551 7890 -36046 -66703 -44335 16195 25205 -9112
21149 -9112 38119 -17486 -29104 2088 15329 108806 113591 156213 201030 154008 73939 -2859
21137 -2859 -61074 41774 60242 93013 109083 113378 128241 10270 -1315 -31255 -40076 -15424
21125 -15424 28283 67703 92530 47101 -46095 -920 -23970 -97590 -94643 -26287 39331 -3099
21113 -3099 -84970 -8652 72512 135157 160737 41745 27042 25031 4126 -18335 -79643 -142370
21101 -142370 -122444 -62498 26625 29295 26360 17675 -11382 -4754 -46114 -130053 -57936 10645
$$ packed form
21186b2215j8606M527O4010R0138k1758o0228N8286M7121l1236N900k2978J4575
21174A07536m177r357J1390j8085K5306N7305n0880n6826q8472K600O708K693
21162a4259P6057p0l9071p882L1629k7853j0661m3936l0657K2368O0530R010l4317
21149i112M7231n5605j1618L1192J3241R3477M785M2622M4817m7022q0069p6798
21137b859n8215J02848J8468L2771J6070M295J4863j17971j1585k9940q821K4652
21125a5424M3707L9420K4827m5429r3196M5175k3050p3620K947O8356O5618m2430
21113c099q1871P6318Q1164O2645K5580j18992j4703k011k0905k2461o1308o2727
21101a42370J9926N9946Q9123K670k935q685k9057O628m1360q3939P2117O8581
$$ plain form
21089 10645 -81819 -99573 -17001 53953 65950 28904 206 267 -18577 -292 77420 1160
21077 1160 -117651 -127920 -123302 -42987 -31145 -53737 -13865 -9953 -115194 -150722 -90273 -1541
21065 -1541 68449 60536 -52216 -27105 -41867 -79992 -4441 162378 127836 99943 169164 96815
21053 96815 -50573 -119515 -92162 -48861 -19383 -69664 -127100 -96702 -90985 -70983 -35604 -16727
21041 -16727 53717 111290 -2533 -58250 -49567 30524 63415 167244 130339 55740 -21918
21030 -21918 14395 143221 175405 110936 175555 185248 92196 60677 56966 36430 -11581 2487
21018 2487 -27209 10365 143882 195727 89876 31682 -40914 -28470 -27386 -85228 -103349 -92259
21006 -92259 -44312 12578 11753 -892 -74495 -143077 -76233 41413 58628 52052 -35133 -99764
$$ packed form
21089A0645r2464j7754Q2572P0954J1997l7046k8698O1j8844J8285P7712p6260
21077A160j18811j0269M618Q0315J1842k2592L9872L912j05241l5528O0449Q8732
21065a541O9990p913j12752K5111j4762l8125P5551J66819l4542k7893O9221p2349
21053I6815j47388o8942K7353M3301K9478n0281n7436L0398N717K0002L5379J8877
21041a6727P0444N7573j13823n5717Q683Q0091L2891J03829l6905p4599p7658
21030b1918L6313J28826L2184o4469O4619R693r3052l1519l711k0536m8011J4068
21018B487k9696L7574J33517N1845j05851n8194p2596J2444J084n7842j8121J1090
21006i2259M7947N6890q25j2645p3603o8582O6844J17646J7215o576q7185o4631
$$ plain form
20994 -99764 -62623 -41168 92442 147297 19163 -58228 -39599 127862 106363 28918 11225
20983 11225 23249 10381 -33246 48575 78289 103284 170881 182743 125350 1501 28614
20972 28614 105785 44093 6354 -61852 -46645 -95215 -87507 -94200 -92832 -37050 -15567 -6064
20960 -6064 -4626 -57052 -2921 -15778 -157261 -255098 -199333 -191255 -136322 -24227 124085 123621
20948 123621 29988 73744 15541 -103921 -118364 -56408 -51537 -10783 39685 -15977 -95329
20937 -95329 -112077 33649 183260 181596 189340 165771 77095 -3670 -32323 52945 19043 -62848
20925 -62848 -48815 9077 71997 51543 34624 -8329 -27700 -34118 17818 68991 103905 90561
20913 90561 24111 -39800 -91699 -86244 -11279 -9267 -15627 2783 -58186 -20446 -42735 -5418
$$ packed form
20994i9764L7141K1455J33610N4855j28134p7391J8629J67461k1499p7445j7693
20983A1225J2024j2868m3627Q1821K9714K4995O7597J1862n7393j23849K7113
20972B8614P7171o1692l7739o8206J5207m8570P708o693J368N5782K1483R503
20960f064J438n2426N4131j2857j41483r7837N5765Q078N4933J12095J48312m64
20948A23621r3633M3756n8203j19462j4443O1956M871M0754N0468n5662p9352
20937i5329j6748J45726J49611j664P744k3569q8676q0765k8653Q5268l3902q1891
20925f2848J4033N7892O2920k0454j6919m2953j9371o418N1936N1173L4914j3344
20913I0561o6450o3911n1899N455P4965K012o360J8410o0969L7740k2289L7317
$$ plain form
20901 -5418 -9096 -16139 -27205 -57293 49436 54667 18312 63253 84564 99393 108086 122631
20889 122631 176110 130257 19151 2767 75271 115477 72915 68370 30013 42787 28617
20878 28617 16102 14488 31680 119419 190579 163006 78100 -29653 -40769 -24758 -3338 56221
20866 56221 111793 115053 108275 143210 131011 77992 59572 48871 74482 -22174 -91871 -108139
20854 -108139 -88410 -67406 17757 44142 45101 54939 -13213 -84032 -12323 71196 74579 -23522
20842 -23522 -36327 72258 45299 58356 -7958 -64471 -34528 39168 37537 -29198 63537 91945
20830 91945 44213 46024 78831 118211 159123 221179 247619 200130 186182 149685 71504 36991
20818 36991 50690 77345 174495 127910 74279 31515 5111 7507 85612 59671 -15966 41149
$$ packed form
20901e418l678p043j1066l0088J06729N231l6355M4941K1311J4829Q693J4545
20889A22631N3479m5853j11106j6384P2504M0206m2562m545l8357J2774j4170
20878B8617j2515j614J7192Q7739P1160k7573q4906j07753j1116J6011K1420N9559
20866E6221N5572L260o778L4935j2199n3019j8420j0701K5611r6656o9697j6268
20854a08139J9729K1004Q5163K6385R59R838o8152p0819P1709Q3519L383r8101
20842b3522j2805J08585k6959J3057o6314n6513K9943P3696j631o6735R2735K8408
20830I1945m7732J811L2807L9380M0912O2056K6440m7489j3948l6497p8181l4513
20818C6991J3699K6655R7150m6585n3631m2764k6404K396P8105k5941p5637N7115
$$ plain form
20806 41149 70955 28603 -1825 -27664 -15803 29703 27075 -33627 -29202 -15908 -5322 68172
20794 68172 201462 193107 147961 160819 128008 24705 59133 75970 60588 60487 116443 140096
20782 140096 73223 30400 4017 25550 -16750 -83884 -104586 -150077 -109396 37282 91968
20771 91968 56786 72464 44548 4752 39690 5304 -23679 41885 -44309 -63354 42251
20760 42251 -2058 -46639 -75829 -75417 -86920 16603 66402 160922 177576 87086 34699 46640
20748 46640 68316 80348 108357 116233 161301 209680 206235 119383 154015 175675 60504 -65528
20736 -65528 3741 96909 64064 64904 112714 101788 62358 20318 34519 -37599 -64952 -19576
20724 -19576 45663 38886 118592 186655 164152 159344 140591 190061 94448 -34997 -24078 -45805
$$ packed form
20806D1149K9806m2352l0428k5839J1861M5506k628o0702M425J3294J0586P3494
20794F8172J33290q355m5146J2858l2811j03303L4428J6837j5382j01N5956K3653
20782A40096o6873m2823k6383K1533m2300o7134k0702m5491M0681J46678N4686
20771I1968l5182J5678k7916l9796L4938l4386k8983O5564q6194j9045J05605
20760D2251m4309m4581k9190M12j1503J03523M9799R4520J6654r0490n2387J1941
20748D6640K1676J2032K8009P876M5068M8379l445q6852L4632K1660j15171j26032
20736f5528O9269R3168l2845Q40M7810j0926l9430m2040J4201p2118k7353M5376
20724a9576O5239o777P9706O8063k2503m808j8753M9470r5613j29445J0919k1727
$$ plain form
20712 -45805 -99565 -44242 1751 95412 53201 40437 1341 27180 7246 59169 69448 63275
20700 63275 79171 36317 110192 155770 153804 62824 -8198 44087 -21068 -43300 110859 173029
20688 173029 188041 243245 219621 161656 89772 146708 189826 202143 212401 91621 4218
20677 4218 -26082 82213 85555 5581 15946 -50600 26233 101241 112194 71248 -14857 53875
20665 53875 170565 173901 223547 218221 123271 109728 170762 257435 257804 259398 308522 296371
20653 296371 205679 105551 43145 -18478 -63292 13353 175380 161341 130864 160710 161136
20642 161136 230747 223403 214948 285273 246599 187149 130909 181146 228415 247160 242768 212101
20630 212101 140442 89354 -24799 10489 94741 108173 129846 124477 25418 13080 74686
$$ packed form
20712d5805n3760N5323M5993R3661m2211j2764l9096K5839j9934N1923J0279o173
20700F3275J5896m2854P3875M5578j966r0980p1022N2285o5155k2232J54159O2170
20688A73029J5012N5204k3624n7965p1884N6936M3118J2317J0258j20780q7403
20677D218l0300J08295L342p9974J0365o6546P6833P5008J0953m0946q6105O8732
20665E3875J16690L336M9646n326r4950j3543O1034Q6673L69J594M9124j2151
20653B96371r0692j00128o2406o1623m4814P6645J62027j4039l0477K9846M26
20642A61136O9611p344q455P0325l8674n9450n6240N0237M7269J8745m392l0667
20630B12101p1659n1088j14153L5288Q4252J3432K1673n369r9059j2338O1606
$$ plain form
20619 74686 67960 121873 81131 44017 39582 -29022 -24064 38251 78208 143318 81192 -15883
20607 -15883 -39006 -4535 49364 -13813 -43101 -43801 -50781 -82839 -100494 -39283 -77907 -129595
20595 -129595 -104968 -8974 -17638 -61590 -89432 -73636 -23982 12382 -40271 -25131 11098 77921
20583 77921 106172 95923 -7624 -109331 -25740 53008 3470 17202 -24865 13723 41916
20572 41916 85751 107859 9192 -40932 -19210 807 -13687 54593 139230 134526 11635 -23080
20560 -23080 -59114 -8569 28434 101832 130502 80146 123205 169229 208571 83406 24522
20549 24522 30691 106133 88337 57031 59377 95840 79662 65126 7005 -84850 -162854 -92059
20537 -92059 41441 -23961 39441 20236 19584 -11609 -19251 -26986 9717 26845 -26282 23344
$$ packed form
20619G4686o726N3913m0742l7114m435o8604M958O2315L9957O5110o2126r7075
20607a5883k3123L4471N3899o3177k9288p00o980l2058j7655O1211l8624n1688
20595a29595K4627R5994q664m3952k7842J5796M9654L6364n2653J5140L6229O6823
20583G7921K8251j0249j03547j01707Q3591P8748m9538J3732m2067L8588K8193
20572D1916M3835K2108r8667n0124K1722K0017j4494O8280Q4637m704j22891l4715
20560b3080l6034N0545L7003P3398K8670n0356M3059M6024L9342j25165n8884
20549B4522O169P5442j7796l1306K346L6463j6178j4536n8121r1855p8004P0795
20537i2059J33500o5402O3402j9205o52l1193p642p735L6703J7128n3127M9626
$$ plain form
20525 23344 128929 160716 163781 196679 282660 367046 370366 356199 246408 70841 79429 131897
20513 131897 77623 -16937 -76180 -14814 14902 -58628 -85736 -1739 36798 34993 68389 64687
20501 64687 38873 -56649 -34730 -88160 -185477 -213419 -98273 55098 130784 87279 46167
20490 46167 77845 126917 44006 77077 8889 -36724 -3991 21970 5901 126869 147255
20479 147255 29675 36984 65998 59733 67865 87501 46988 24069 111237 178326 230947 198021
20467 198021 137069 141299 120718 132071 125561 13421 58970 57822 126775 123849 81926 171932
20455 171932 200604 66246 -31540 -14709 -54227 -43013 -4046 36772 106379 86075 58554
20444 58554 66810 46370 91249 1245 -69 -32526 -43119 -10607 -61334 -37797 -15450 -41206
$$ packed form
20525B3344J05585L1787L065L2898Q5981Q4386L320j4167j09791j75567Q588N2468
20513A31897n4274r4560n9243O1366K9716p3530k7108Q3997L8537j805L3396l702
20501F4687k5814r5522K1919n3430r7317k7942J15146J53371P5686m3505m1112
20490D6167L1678M9072q2911L3071o8188m5613L2733K5961j6069J20968K0386
20479A47255j17580P309K9014o265Q132J9636m0513k2919Q7168O7089N2621l2926
20467A98021o0952M230k0581J1353o510j12140M5549j148O8953k926m1923R0006
20455A71932K8672j34358r7786J6831l9518J1214L8967M0818O9607k0304k7521
20444E8554Q256k0440M4879r0004j314l2457j0593L2512n0727K3537K2347k5756
$$ plain form
20432 -41206 -26692 -82028 -81682 10942 23321 -1273 28455 34743 -44299 43728 26045 70584
20420 70584 149405 117920 172414 179887 124398 33781 39808 162186 230963 137210 49509 -6334
20408 -6334 81098 125319 16331 -72105 -102881 -41059 -53307 -20937 -19525 59282 39163 20279
20396 20279 101572 140800 77635 60707 77488 92919 28785 91277 179624 117366 54662 63229
20384 63229 129201 12993 -98538 -19970 52418 31036 81298 134022 187667 302984 293013
20373 293013 121513 11462 58378 96294 115479 158515 222755 187739 166378 153623 105858
20362 105858 98919 172667 244533 270668 244990 306399 266322 224424 106074 57943 85716
20351 85716 60824 49835 61997 80142 15658 -24812 33394 15799 -21808 8131 131273
$$ packed form
20432d1206J4514n5336L46R2624J2379k4594K9728O288p9042Q8027j7683M4539
20420G0584P8821l1485N4494P473n5489r0617O027J22378O8777r3753q7701n5843
20408f334Q7432M4221j08988q8436l0776O1822j2248L2370J412P8807k0119j8884
20396B0279Q1293L9228o3165j6928J6781J5431o4134O2492Q8347o2258o2704Q567
20384F3229O5972j16208j11531P8568P2388k1382N0262N2724N3645J15317r971
20373B93013j71500j10051M6916L7916J9185M3036O4240l5016k1361j2755m7765
20362A05858o939P3748P1866K6135k5678O1409m0077m1898j18350m8131K7773
20351H5716k4892j0989J2162J8145o4484m0470N8206j7595l7607K9939J23142
$$ plain form
20340 131273 160769 121256 86785 30583 64920 75961 41524 -15297 61664 181715 145337
20329 145337 121032 75135 165122 154805 22057 -21621 -1115 9878 -25694 26217 94993
20318 94993 121937 145713 166389 203889 175449 215085 147357 23453 -23380 38242 112491
20307 112491 111193 107470 94385 -49825 -100457 -24168 767 -45539 -71957 55391 127964
20296 127964 275524 219869 25990 -25395 52905 119366 87089 -44864 -59405 -2510 80748
20285 80748 126462 116892 69843 106464 192477 238186 200355 224476 250016 228655 155121 -7446
20273 -7446 -45918 126389 171652 103878 47891 121317 72426 29784 120148 126066 136350 202102
20261 202102 191391 168576 191960 156672 210806 263394 189290 136601 136807 116146 71886 127957
$$ packed form
20340A31273K9496l9513l4471n6202L4337J1041l4437n6821P6961J20051l6378
20329A45337k4305m5897Q9987j0317j32748m3678K0506J0993l5572N1911O8776
20318I4993K6944K3776K0676L7500k8440L9636o7728j23904m6833O1622P4249
20307A12491j298l723j3085j44210n0632P6289K4935m6306k6418J27348P2573
20296A27964J47560n5655j93879n1385P8300O6461l2277j31953j4541N6895Q3258
20285H0748M5714r570m7049L6621Q6013M5709l7831K4121K5540k1361p3534j62567
20273g446l8472J72307M5263o7774n5987P3426m8891m2642R0364N918J0284O5752
20261B02102j0711k2815K3384l5288N4134N2588p4104n2689K06k0661m4260N6071
$$ plain form
20249 127957 151237 199468 183004 190089 174769 106621 82230 120821 214998 201434 139813 168701
20237 168701 193339 55688 -56361 -69308 -37668 55441 57866 35074 41558 29243 97075
20226 97075 146022 74593 -17093 112968 137334 110098 95305 36281 121025 165875 217886
20215 217886 173822 60333 74798 86086 127508 191160 202815 78705 98921 97344 142650
20204 142650 106098 66124 23457 27890 10590 76551 110118 121093 152559 123390 107881 56252
20192 56252 43837 52143 92757 111042 168273 209628 144155 172714 275537 325892 227672 190614
20180 190614 137701 74339 144255 143116 167091 48831 -50592 -26689 105368 125188 104804
20169 104804 52961 14176 -47005 -87668 -83471 -56876 21731 23366 -6266 21682 46893 131380
$$ packed form
20249A27957K3280M8231j6464P085j5320o8148k4391L8591R4177j3564o1621K8888
20237A68701K4638j37651j12049j2947L1640R3109K425k2792O484j2315O7832
20226I7075M8947p1429r1686J30061K4366k7236j4793n9024Q4744M4850N2011
20215B17886m4064j13489J4465J1288M1422O3652J1655j24110K0216j577M5306
20204A42650l6552l9974m2667M433j7300O5961L3567J0975L1466k9169j5509n1629
20192E6252j2415Q306M0614J8285N7231M1355o5473K8559J02823N0355r8220l7058
20180A90614n2913o3362O9916j139K3975j18260r9423K3903J32057J9820k0384
20169A04804n1843l8785o1181m0663M197K6595P8607J635k9632K7948K5211Q4487
$$ plain form
20157 131380 87165 -4127 72028 122288 66450 132168 223990 227516 144600 183639 276298 327105
20145 327105 367938 296085 168691 116433 75089 114650 209645 165475 176885 154166 105780
20134 105780 189284 135875 116476 184147 149676 187960 236941 283030 248617 216553 210698 128841
20122 128841 28705 -695 -27559 -26707 -118837 -91914 -33649 56557 122602 162546 47368
20111 47368 9667 117028 142110 88023 65253 97251 140267 163100 189518 283548 230883
20100 230883 90873 28501 59359 172108 205033 161692 81702 -31898 32593 85740 216452
20089 216452 235913 239226 232510 101068 56420 47291 -28341 -19700 99568 96722 93337 8974
20077 8974 -46972 1347 179351 188293 136999 152732 157262 219379 174591 228091 308277 368025
$$ packed form
20157A31380m4215r1292P6155N0260n5838O5718R1822L526q2916L9039R2659N0807
20145C27105M0833p1853j27394n2258m1344L9561R4995m4170J1410k2719m8386
20134A05780Q3504n3409j9399O7671l4471L8284M8981M6089l4413l2064n855q1857
20122A28841j00136k9400k6864Q52r2130K6923N8265R0206O6045L9944j15178
20111D7368l7701J07361K5082n4087k2770L1998M3016K2833K6418R4030n2665
20100B30883j40010o2372L0858J12749L2925m3341p9990j13600O4491N3147J30712
20089B16452J9461L313o716j31442m4648r129p5632Q641J19268k846l385q4363
20077H974n5946M8319J78004Q942n1294J5733M530O2117m4788N3500Q0186N9748
$$ plain form
20065 368025 380236 242929 208410 165912 161548 142117 83467 141567 204598 116113 72642
20054 72642 119438 162898 161749 144595 203148 312420 156062 190893 155263 76106 2524
20043 2524 99664 127507 92640 111146 174577 201769 185915 242627 253282 226274 232784 196484
20031 196484 139515 173793 140796 163736 194401 139504 163065 273329 208142 128081 179604
20020 179604 323803 339802 347993 385974 333236 252176 285341 331822 251076 268172 289671
20009 289671 389225 357250 292733 267204 229780 220321 282714 283959 192162 151719 122571 71027
19997 71027 84371 180773 188492 89667 44512 55087 97536 133706 123666 28310 -61917 -21337
19985 -21337 58013 54271 101213 89569 95689 250490 256085 280575 306890 278860 208298 309039
$$ packed form
20065C68025J2211j37307l4519m2498m364j9431n8650N8100O3031q8485m3471
20054G2642M6796M3460j149j7154N8553J09272j56358L4831l5630p9157p3582
20043B524R7140K7843l4867J8506O3431K7192j5854N6712J0655k7008O510l6300
20031A96484n6969L4278l2997K2940L0665n4897K3561J10264o5187q0061N1523
20020A79604J44199J5999Q191L7981n2738q1060L3165M6481q0746J7096K1499
20009B89671R9554l1975o4517k5529l7424r459O2393J245r1797m0443k9148n1544
19997G1027J3344R6402P719r8825m5155J0575M2449L6170j0040r5356r0227M0580
19985b1337P9350l742M6942j1644O120J54801N595K4490K6315k8030p0562J00741
$$ plain form
19973 309039 305199 256279 213189 182341 177983 222693 213285 162736 239634 237149 214338 258143
19961 258143 265569 216444 194672 156279 171997 207101 208928 275333 227590 75191 27239 75788
19949 75788 155775 148891 58229 2974 11802 45625 57256 106620 199395 160643 154882 223900
19937 223900 201170 261561 303241 260093 238057 132896 113640 118703 130644 172228 137830
19926 137830 75301 19584 2217 58001 115822 212859 254557 356034 244078 152161 180695
19915 180695 137896 107594 163273 149644 135494 150265 192970 200902 175155 22667 46283
19904 46283 205256 196365 196946 164237 149172 105021 59150 77983 30624 69758 83572 79826
19892 79826 80662 60358 120920 265636 297443 313404 253718 250612 153498 171855 232676 329782
$$ packed form
19973C09039l840m8920m3090l0848m358M4710r408n0549P6898k485k2811M3805
19961B58143P426m9125k1772l8393J5718L5104J827O6405m7743j52399m7952M8549
19949G5788P9987o884r0662n5255Q828L3823J1631M9364R2775l8752n761O9018
19937B23900k2730O0391M1680m3148k2036j05161j9256N063J1941M1584l4398
19926A37830o2529n5717j7367N5784N7821R7037M1698J01477j11956r1917K8534
19915A80695m2799l0302N5679j3629j4150J4771M2705P932k5747j52488K3616
19904D6283J58973q891N81l2709j5065m4151m5871J8833m7359L9134J3814l746
19892G9826Q36k0304O0562J44716L1807J5961n9686l106r7114J8357O0821R7106
$$ plain form
19880 329782 328364 284605 197174 177081 205125 229605 254949 306296 398710 430648 399291 378597
19868 378597 323534 374051 458962 486207 475864 545258 559554 624469 741433 859909 919689
19857 919689 1086507 1164044 1255463 1292441 1271692 1324974 1372200 1476927 1566819 1550859 1505802
19846 1505802 1501814 1583001 1732554 1776543 1775014 1696066 1591379 1444510 1393225 1540666 1674772
19835 1674772 1600358 1482925 1516697 1424887 1275358 1221196 1198550 1197772 1156264 1061575 975692
19824 975692 864968 817034 882468 867223 801714 749048 721584 710056 685505 611206 599423
19813 599423 567481 660786 688625 692079 781037 838674 812996 890130 1037948 1325177 1496156
19802 1496156 1623777 1744905 1931634 2111861 2146598 2137980 2107663 1831922 1478391 1376561
$$ packed form
19880C29782j418m3759q7431k0093K8044K4480K5344N1347R2414L1938l1357k0694
19868C78597n5063N0517Q4911K7245j0343O9394J4296O4915J16964J18476N9780
19857I19689J66818P7537R1419L6978k0749N3282M7226J04727Q9892j5960m5057
19846A505802l988Q1187J49553M3989j529p8948j04687j46869n1285J47441J34106
19835A674772p4414j17433L3772r1810j49529n4162k2646p78m1508r4689q5883
19824I75692j10724m7934O5434j5245o5509n2666k7464j1528k4551p4299j1783
19813E99423l1942R3305K7839L454Q8958N7637k5678P7134J47818K87229J70979
19802A496156J27621J21128J86729J80227L4737q618l0317k75741l53531j01830
$$ plain form
19792 1376561 1297770 1129948 1068992 1122552 1235500 1424249 1557594 1622501 1897805 2165702
19782 2165702 2120777 1978240 1806932 1720272 1525638 1246683 1094810 976004 912595 868875
19772 868875 772276 710596 646389 671686 739356 767041 824562 812558 779617 750435 691273
19761 691273 684615 750399 679591 631986 574738 551136 612784 645355 769607 837252 913925
19750 913925 959125 974570 1029959 1015111 849816 783212 808855 705726 617635 614531 593852
19739 593852 681631 719525 787439 934488 1066288 1142979 1116470 974254 888001 780451 702552
19728 702552 709054 709301 767487 771915 843869 907831 868263 971242 1044935 1006560 993345 1083772
19716 1083772 1064714 1076340 997162 859013 894272 962922 965131 899612 967784 1003977 1063787
$$ packed form
19792A376561p8791j67822o0956N3560J12948J88749J33345O4907K75304K67897
19782B165702m4925j42537j71308q6660j94634k78955j51873j18806o3409m3720
19772H68875r6599o1680o4207K5297O7670K7685N7521j2004l2941k9182n9162
19761F91273o658O5784p0808m7605n7248k3602O1648L2571J24252O7645P6673
19750I13925M5200J5445N5389j4848j65295o6604K5643j03129q8091l104k0679
19739E93852Q7779L7894O7914J47049J31800P6691k6509j42216q6253j07550p7899
19728G02552O502K47N8186M428P1954O3962l9568J02979P3693l8375j3215R0427
19716A083772j9058J1626p9178j38149L5259O8650K209o5519O8172L6193N9810
$$ plain form
19705 1063787 1134792 1174014 1205074 1185422 1067744 1029174 935165 850745 861124 811304 807174
19694 807174 801305 795121 755532 828145 851388 860559 917847 949636 893977 836721 798815 764900
19682 764900 754600 828684 816359 807347 809853 861171 881550 868367 940716 862416 816533 764176
19670 764176 777607 792500 781477 721822 560402 472759 517055 532423 499003 543925 593055
19659 593055 529362 453190 455170 477170 562249 530719 538624 492185 485086 436393 372913 469421
19647 469421 511363 475239 507705 543405 573965 601643 589058 560647 590179 591264 622781 571632
19635 571632 445668 439464 448770 429312 462821 466421 477155 485993 457504 497625 527696 522464
19623 522464 480887 429586 506598 636087 693172 701347 638766 655707 592368 535300 511198
$$ packed form
19705A063787P1005L9222L1060j9652j17678l8570r4009q4420J0379m9820m130
19694H07174n869o184l9589P2613K3243R171N7288L1789n5659n7256l7906l3915
19682G64900j0300P4084j2325r012K506N1318K0379j3183P2349p8300m5883n2357
19670G64176J3431J4893j1023n9655j61420q7643M4296J5368l3420M4922M9130
19659E93055o3693p6172J980K2000Q5079l1530P905m6439p099m8693o3480R6508
19647D69421M1942l6124L2466L5700L0560K7678j2585k8411K9532J085L1517n1149
19635E71632j25964o204R306j9458L3509L600J0734Q838k8489M0121L0071n232
19623E22464m1577n1301P7012J29489N7085Q175o2581J6941o3339n7068k4102
$$ plain form
19612 511198 496506 509241 573458 497339 464836 439928 471808 491212 474739 579700 460359
19601 460359 304637 340182 328239 402850 417188 467423 425721 448182 423091 423591 425554 448794
19589 448794 488870 464065 498401 478274 425498 364161 409335 446933 452038 436066 399308 443983
19577 443983 456421 497267 546799 607561 636373 560426 596877 625832 704780 766472 698050
19566 698050 638657 597375 613819 787602 1040250 1147821 1202610 1097130 1005058 1116380
19556 1116380 1024586 1036428 1093168 1095890 1037154 914685 837785 825713 883995 988718 1033915
19545 1033915 1086314 1148158 1157685 1164487 1331017 1406429 1351284 1301227 1222565 1102162 1100910
19534 1100910 1119873 1129695 1138727 1123551 1084556 1106604 1078127 1041781 1078346 1121197 1035395 973890
$$ packed form
19612E11198j4692J2735O4217p6119l2503k4908L1880J9404j6473J04961j19341
19601D60359j55722L5545j1943P4611J4338N0235m1702K2461k5091N00J963K3240
19589D48794M0076k4805L4336k0127n2776o1337M5174L7598N105j5972l6758M4675
19577D43983J2438M0846M9532O0762K8812p5947L6451K8955P8948O1692o8422
19566F98050n9393m1282J6444J73783K52648J07571N4789j05480r2072J11322
19556A116380r1794J1842N6740K722n8736j22469p6900j2072N8282J04723M5197
19545A033915N2399O1844R527O802J66530P5412n5145n0057p8662j20403j252
19534A100910J8963R822R032j5176l8995K2048k8477l6346L6565M2851q5802o1505
$$ plain form
19522 973890 905849 894777 977736 1046287 996325 941807 892239 872700 879917 909966 847529 800711
19510 800711 823031 961551 997487 904609 949696 909100 857137 862916 967185 921081 809260
19499 809260 880576 940981 868013 870232 971949 1048579 1062842 1110162 1227284 1255650 1330793
19488 1330793 1461782 1574314 1576906 1760725 1880285 2061101 2210622 2292352 2409854 2379865
19478 2379865 2288780 2228953 2074565 1981286 1927934 1927772 1999224 2212078 2458828 2451950 2405968
19467 2405968 2416348 2486426 2461295 2285262 2061929 1779039 1522463 1389726 1382747 1216951
19457 1216951 1044113 1064483 1136829 1199676 1178766 1205264 1272648 1406486 1490902 1483474 1480762
19446 1480762 1476218 1589056 1592119 1378655 1257865 1335671 1425763 1466219 1482400 1341212 1266066
$$ packed form
19522I73890o8041j1072Q2959O8551m9962n4518m9568j9539P217L0049o2437m6818
19510H00711K2320J38520L5936r2878M5087m0596n1963N779J04269m6104j11821
19499H09260P1316O0405p2968K219J01717P6630J4263M7320J17122K8366P5143
19488A330793J30989J12532K592J83819J19560J80816J49521Q1730J17502k9989
19478B379865r1085n9827j54388r3279n3352j62P1452K12854K46750o878m5982
19467B405968J0380P0078k5131j76033k23333k82890k56576j32737o979j65796
19457A216951j72838K0370P2346O2847k0910K6498O7384J33838Q4416p428k712
19446A480762m544J12838L063k13464j20790P7806R0092M0456J6181j41188p5146
$$ plain form
19435 1266066 1127959 1061167 1233667 1435098 1471102 1442204 1429308 1411482 1421973 1527108
19425 1527108 1589943 1564840 1437911 1290137 1291058 1290597 1304171 1280583 1389847 1521659 1591077
19414 1591077 1645182 1592484 1552271 1567036 1728711 1812426 1829983 1925708 1959633 1985853 1887070
19403 1887070 1875581 1971622 2001303 2034272 2122220 2257621 2326111 2352620 2369316 2539057 2619404
19392 2619404 2640790 2742114 2812732 2815148 2857466 2987762 3155948 3254251 3286216 3243177 3264094
19381 3264094 3341814 3269047 3288907 3465783 3583137 3746949 3862848 3819720 3876128 3977548
19371 3977548 4153972 4239452 4416968 4633442 4862891 5065103 5239286 5429456 5559571 5791131
19361 5791131 6095573 6582172 7126506 7674373 8171057 8629561 9183424 9734783 10411090
$$ packed form
19435A266066j38107o6792J72500K01431L6004k8898j2896j7826J0491J05135
19425A527108O2835k5103j26929j47774R21m61J3574k3588J09264J31812O9418
19414A591077N4105n2698m0213J4765J61675Q3715J7557R5725L3925K6220r8783
19403A887070j1489R6041K9681L2969Q7948J35401O8490K6509J6696J69741Q0347
19392B619404K1386J01324P0618K416M2318J30296J68186R8303L1965m3039K0917
19381C264094P7720p2767J9860J76876J17354J63812J15899m3128N6408J01420
19371C977548J76424Q5480J77516K16474K29449K02212J74183J90170J30115K31560
19361E791131L04442M86599N44334N47867M96684M58504N53863N51359O76307
$$ plain form
19352 10411090 11265837 12388807 13584502 14882035 16314688 17887654 19359381 20970529
19344 20970529 22775205 24693896 26877200 29494172 32750748 36448040 40597906 45420110
19336 45420110 51162292 57991547 66534007 77475915 91431158 108643415 128963636
19329 128963636 150248573 165940815 172085426 176521288 187162881 202016439 210237233
19322 210237233 210180992 212199768 218827563 223822045 227953224 239054265 258545219 276973832
19314 276973832 280611536 265492288 243750907 232611276 238335656 257593645 280337190
19307 280337190 287312464 263444403 224054203 193885116 180124703 177705097 176883340
19300 176883340 164639157 139192209 112860820 93386762 80533737 71992819 65966714
$$ packed form
19352A0411090Q54747J122970J195695J297533J432653J572966J471727J611148
19344B0970529J804676J918691K183304K616972L256576L697292M149866M822204
19336D5420110N742182O829255Q542460J0941908J3955243J7212257K0320221
19329A28963636K1284937J5692242O144611M435862J0641593J4853558Q220794
19322B10237233n6241K018776O627795M994482M131179J1101041J9490954J8428613
19314B76973832L637704j5119248k1741381j1139631N724380J9257989K2743545
19307B80337190O975274k3868061l9390200l0169087j3760413k419606q21757
19300A76883340j2244183k5446948k6331389j9474058j2853025q540918o026105
$$ plain form
19293 65966714 61471191 58089600 55515176 53135546 50787445 48607864 46773679 45283314
19285 45283314 43985584 42812240 41495987 40178973 38883372 37783061 36943253 36036943
19277 36036943 35171859 34183741 33152196 32164098 31259102 30466068 29663535 28749402 27845971
19268 27845971 27039127 26391348 25891955 25609098 25445912 25440676 25696630 26139638 26984154 28360410
19258 28360410 30183169 32525789 34891570 35870317 34292782 31294443 28804054 27420895
19250 27420895 26974367 27119371 27754074 28656393 29828785 31375819 33451278 36015945 38324979
19241 38324979 39558324 40535082 42457476 45564365 49863244 55318218 62088669 70980291
19233 70980291 82677999 97299012 114163718 130520382 137258525 127575976 110260812
$$ packed form
19293F5966714m495523l381591k574424k379630k348101k179581j834185j490365
19285D5283314j297730j173344j316253j317014j295601j100311q39808r06310
19277C6036943q65084r88118j031545r88098r04996p93034q02533r14133r03431
19268B7845971q06844o47779m99393k82857j63186n236K55954M43008Q44516J376256
19258B8360410J822759K342620K365781R78747j577535k998339k490389j383159
19250B7420895m46528J45004O34703R02319J172392J547034K075459K564667K309034
19241C8324979J233345R76758J922394L106889M298879N454974O770451Q891622
19233G0980291J1697708J4621013J6864706J6356664O738143r682549j7315164
$$ plain form
19226 110260812 96661315 89704168 87911097 89959892 94964503 102427501 112609055 126266760
19218 126266760 144109783 166366650 192396873 219171316 240872681 259064758 283961979
19211 283961979 321749077 369237505 406520313 417308193 420816360 425000594 402075400
19204 402075400 343680593 285530792 248607959 231930902 230031991 239931170 261432381
19197 261432381 295622460 343028256 402213944 464389121 500305415 479781528 432564732
19190 432564732 396290525 362390700 307104736 247024983 202405480 174522180 158135439
19183 158135439 149238334 145580861 146190306 150936709 159632922 171294721 182537850 185431222
19175 185431222 177461852 168313554 166649005 173082794 183800747 189843080 179210494 155138687
$$ packed form
19226A10260812j3599497o957147j793071K048795N004611P462998J0181554J3657705
19218A26266760J7843023K2256867K6030223K6774443K1701365J8192077K4897221
19211B83961979L7787098M7488428L7282808J0787880L508167M184234k2925194
19204D02075400n8394807n8149801l6922833j6677057j898911R899179K1501211
19197B61432381L4190079M7405796N9185688O2175177L5916294k0523887m7216796
19190D32564732l6274207l3899825n5285964o0079753m4619503k7883300j6386741
19183A58135439q897105l657473O09445M746403Q696213J1661799J1243129K893372
19175A85431222p969370r148298j664549O433789J0717953O042333j0632586k4071807
$$ plain form
19167 155138687 131821203 115898635 106547193 101506216 99300349 98727322 99853357 103240297
19159 103240297 109304002 118146846 129310086 139502037 139678667 124553346 103019326
19152 103019326 85193414 73204746 65672994 61252449 59002577 58250619 58416686 58815226
19144 58815226 58101277 54582201 49185216 44204666 40501271 37850631 35885738 34204399
19136 34204399 32874286 31888049 31221332 30984106 31348134 32358844 33727493 35024594 35432935
19127 35432935 33564355 29814806 26185200 23329060 21194044 19566330 18243901 17142841
19119 17142841 16135239 15290511 14501998 13792937 13186644 12717822 12140489 11523639 10977550
19110 10977550 10492762 10120031 9907159 9764546 9632237 9352978 9020313 8818822 8555685
$$ packed form
19167A55138687k3317484j5922568r351442n040977k205867n73027J126035L386940
19159A03240297O063705Q842844J1163240J0191951J76630j5125321k1534020
19152A03019326j7825912j1988668p531752m420545k249872p51958J66067L98540
19144E8815226p13949l519076n396985m980550l703395k650640j964893j681339
19136C4204399j330113r86237o66717k37226L64028J010710J368649J297101M08341
19127C5432935j868580l749549l629606k856140k135016j627714j322429j101060
19119A7142841j007602q44728p88513p09061o06293m68822n77333o16850n46089
19110A0977550m84788l72731k12872j42613j32309k79259l32665k01491k63137
$$ plain form
19101 8555685 8159529 7754132 7339786 6891663 6471509 6134590 5875821 5619676 5427499
19092 5427499 5300739 5212769 5035466 4925099 4944927 4913290 4903896 4867821 4887022 4952867 4967700
19081 4967700 4959601 4878066 4827465 4819955 4780590 4634629 4553788 4506686 4368570 4215472 4041990
19070 4041990 3866178 3763718 3713532 3829582 4010314 4013761 3988497 3892410 3610955 3326332
19060 3326332 3191829 3001696 2865530 2857342 2843297 2747974 2836736 2987289 3056877 3059224 3033862
19049 3033862 3036557 3017372 2925683 2835516 2791550 2837727 2861605 2892354 2793185 2670396 2592165
19038 2592165 2505608 2444715 2454253 2489763 2441494 2416638 2445180 2414556 2418467 2491950 2494997 2447846
19026 2447846 2479419 2548125 2574894 2597869 2516056 2467498 2444511 2492715 2606006 2603640 2538029
$$ packed form
19101H555685l96156m05397m14346m48123m20154l36919k58769k56145j92177
19092E427499j26760q7970j77303j10367J9828l1637r394l6075J9201O5845J4833
19081D967700q099q1535n0601p510l9365j45961q0841m7102j38116j53098j73482
19070D041990j75812j02460n0186J16050J80732L447k5264r6087k81455k84623
19060C326332j34503j90133j36166q188j4045r5323Q8762J50553O9588K347k5362
19049C033862K695j9185r1689r0167m3966M6177K3878L0749r9169j22789p8231
19038B592165q6557o0893R538L5510m8269k4856K8542l0624L911P3483L047m7151
19026B447846L1573O8706K6769K2975q1813m8558k2987M8204J13291k366o5611
$$ plain form
19015 2538029 2510719 2441656 2427206 2393384 2410982 2589383 2626867 2646844 2675736 2687977 2786327
19004 2786327 2836191 2791413 2736318 2717905 2836437 2978797 2895894 2899185 2955129 2909563 2851380
18993 2851380 2815944 2807683 2836455 2866454 2895091 2912351 2980053 2977624 2868644 2853159 2913558
18982 2913558 2984741 2996863 2964467 2966840 3029240 3094168 3109792 3129162 3090274 3227423 3314664
18971 3314664 3363040 3431286 3411100 3450630 3519485 3533114 3567443 3712435 3820102 3836966 3840988
18960 3840988 3848013 3893483 3893297 3878302 3894496 3922234 4072338 4315849 4407245 4591523 4822752
18949 4822752 4962756 5061489 5153839 5306417 5467687 5728885 5936755 6105295 6264269 6392654
18939 6392654 6593290 6840507 6970518 7196462 7521916 7969036 8486922 8957457 9385183
$$ packed form
19015B538029k7310o9063j4450l3822J7598J78401L7484J9977K8892J2241R8350
19004B786327M9864m4778n5095j8413J18532J42360q2903L291N5944m5566n8183
18993B851380l5436q261K8772K9999K8637J7260O7702k429j08980j5485O0399
18982B913558P1183J2122l2396K373O2400O4928J5624J9370l8888J37149Q7241
18971C314664M8376O8246k0186L9530O8855J3629L4329J44992J07667J6864M022
18960C840988P025M5470j86j4995J6194K7738J50104K43511R1396J84278K31229
18949D822752J40004R8733R2350J52578J61270K61198K07870J68540J58974J28385
18939F392654K00636K47217J30011K25944L25454M47120N17886M70535M27726
$$ plain form
18930 9385183 9902114 10496038 11204730 12001996 12755449 13462204 14120742 14882901 15781461
18921 15781461 16694219 17657209 18785841 20100304 21614497 23218638 25055349 27103340
18913 27103340 29331775 31716676 34491886 37549320 40842537 44492560 48753590 53696351
18905 53696351 59503474 66384841 74446975 84046492 95545014 109295078 126113462 146827873
18897 146827873 171874379 201144444 232918091 263009131 285292018 296477210 299178414
18890 299178414 296188952 286601990 271367380 257147154 250826284 254603247 266717070
18883 266717070 281948749 292712008 293296178 284471856 269165129 246492261 215510781
18876 215510781 181044610 149843929 125058831 106488799 92935387 83000222 75424468
$$ packed form
18930I385183N16931N93924P08692P97266P53453P06755O58538P62159Q98560
18921A5781461R12758R62990J128632J314463J514193J604141J836711K047991
18913B7103340K228435K384901K775210L057434L293217L650023M261030M942761
18905E3696351N807123O881367Q062134R599517J1498522J3750064J6818384K0714411
18897A46827873K5046506K9270065L1773647L0091040K2282887J1185192K701204
18890B99178414k989462r586962j5234610j4220226o320870L776963J2113823
18883B66717070J5231679J0763259N84170q824322j5306727k2672868l0981480
18876B15510781l4466171l1200681k4785098j8570032j3553412r935165p575754
$$ plain form
18869 75424468 69641947 65208114 61592214 58633276 56156681 54071562 52200205 50501546
18861 50501546 48870651 47336632 45879580 44427667 43034278 41733515 40585829 39505220
18853 39505220 38445736 37355128 36248974 35072172 33886957 32526554 30934343 29378723
18845 29378723 27782907 26295663 24900258 23574766 22304420 21121188 19946306 18758905
18837 18758905 17696361 16744469 15745081 14745845 13921729 13214210 12548810 11934900 11315810
18828 11315810 10765555 10217681 9718437 9357574 9033853 8719182 8416138 8141187 7935656
18819 7935656 7708580 7447721 7225504 6876116 6524136 6284995 6067212 5822587 5676190
18810 5676190 5563890 5382934 5211915 4989463 4796914 4649555 4503588 4395679 4370755 4336041
$$ packed form
18869G5424468n782521m433833l615900k958938k476595k085119j871357j698659
18861E0501546j630895j534019j457052j451913j393389j300763j147686j080609
18853C9505220j059484j090608j106154j176802j185215j360403j592211j555620
18845B9378723j595816j487244j395405j325492j270346j183232j174882j187401
18837A8758905j062544r51892r99388r99236q24116p07519o65400o13910o19090
18828A1315810n50255n47874m99244l60863l23721l14671l03044k74951k05531
18819G935656k27076k60859k22217l49388l51980k39141k17783k44625j46397
18810E676190j12300j80956j71019k22452j92549j47359j45967j07909k4924l4714
$$ plain form
18800 4336041 4281340 4153723 4058692 4011577 4082950 4003565 3984191 3984110 3990167 3931160 3802444 3594026
18788 3594026 3471363 3400241 3444399 3391826 3293064 3357431 3317860 3163280 3021510 2891169
18778 2891169 2752456 2772656 2914623 2967832 2981633 2861766 2722399 2609710 2670725 2713827
18768 2713827 2794405 2838870 2855660 2856272 2650117 2378641 2227384 2147290 2031242 1889923 1703492
18757 1703492 1711412 1790009 1923788 1982406 2061522 2115028 2019301 1875296 1750630 1668148 1607724
18746 1607724 1631077 1596744 1528505 1566828 1508197 1597240 1602925 1534969 1558904 1561168 1520543 1591194
18734 1591194 1682537 1609583 1516203 1623052 1700033 1784015 1804560 1770317 1739520 1860239 2034206
18723 2034206 2142229 2196197 2219410 2213435 2166561 2229681 2228284 2313841 2491957 2632428 2673144
$$ packed form
18800D336041n4701j27617r5031m7115P1373p9385j9374q1O057n9007j28716k08418
18788C594026j22663p1122M4158n2573r8762O4367l9571j54580j41770j30341
18778B891169j38713K0200J41967N3209J3801j19867j39367j12689O1015M3102
18768B713827Q0578M4465J6790O12k06155k71476j51257q0094j16048j41319j86431
18757A703492P920P8597J33779N8618P9116N3506r5727j44005j24666q2482o0424
18746A607724K3353l4333o8239L8323n8631Q9043N685o7956K3935K264m0625P0651
18734A591194R1343p2954r3380J06849P6981Q3982K0545l4243l0797J20719J73967
18723B034206J08023N3968K3213n975m6874O3120j397Q5557J78116J40471M0716
$$ plain form
18712 2673144 2561146 2446785 2405170 2359545 2406704 2554442 2714582 2837741 2839159 2777243
18702 2777243 2785510 2897667 2994618 2859658 2829347 2838606 2784478 2844701 2919874 2973667 3057492
18691 3057492 3167572 3284970 3412526 3449996 3571483 3721500 3842356 4070354 4297036 4432659
18681 4432659 4545484 4799382 5019570 5216931 5378616 5512818 5665514 5901870 6077236
18672 6077236 6329156 6549560 6664932 6779896 7010515 7446142 7850295 8287192 8699848
18663 8699848 9319711 10051625 10796801 11823962 13212533 14831492 16772437 19263862 22462370
18654 22462370 26465775 31585838 37368806 41901335 41907623 40254371 40394772 42120898 40989423
18645 40989423 34360903 27083265 22139306 19354113 17876363 17112610 16788565 16575265
$$ packed form
18712B673144j11998j14361m1615m5625M7159J47738J60140J23159J418o1916
18702B777243Q267J12157R6951j34960l0311R259n4128O0223P5173N3793Q3825
18691C057492J10080J17398J27556L7470J21487J50017J20856K27998K26682J35623
18681D432659J12825K53898K20188J97361J61685J34202J52696K36356J75366
18672F077236K51920K20404J15372J14964K30619M35627M04153M36897M12656
18663H699848O19863P31914P45176J027161J388571J618959J940945K491425L198508
18654B2462370M003405N120063N782968M532529O288j653252J40401J726126j131475
18645D0989423o628520p277638m943959k785193j477750p63753l24045k13300
$$ plain form
18637 16575265 16515817 16633749 16844824 17102410 17490047 18059348 18822319 19648017 20580178
18628 20580178 21609007 22657293 23782717 24986787 26271774 27635654 29001150 30588376
18620 30588376 32591054 35094148 38010480 41444330 45368413 49888507 54763289 60464345
18612 60464345 67534467 76051799 86245186 98219516 113034386 132487713 158323709
18605 158323709 191380767 231065192 273413510 299343989 293395653 281605577 283264095
18598 283264095 292014014 280000212 244029799 212589889 198736499 201410404 216923457
18591 216923457 241386216 268818291 280582285 258639257 225995040 206060079 202539256
18584 202539256 211935350 230441445 254202080 273221237 263970977 230421711 199510333
$$ packed form
18637A6575265n9448J17932K11075K57586L87637N69301P62971Q25698R32161
18628B0580178J028829J048286J125424J204070J284987J363880J365496J587226
18620C0588376K002678K503094K916332L433850L924083M520094M874782N701056
18612F0464345P070122Q517332J0193387J1974330J4814870J9453327K5835996
18605A58323709L3057058L9684425M2348318K5930479n948336j1790076J658518
18598B83264095Q749919j2013802l5970413l1439910j3853390K673905J5513053
18591B16923457K4462759K7432075J1763994k1943028l2644217j9934961l520823
18584B02539256R396094J8506095K3760635J9019157r250260l3549266l0911378
$$ plain form
18577 199510333 181697443 175031635 176198618 183273764 195415460 214004850 241466701
18570 241466701 280404745 332906323 398172880 469166661 512997810 483459500 423338124
18563 423338124 390512811 395282086 426127266 462501521 446740749 359651069 267897967
18556 267897967 204697596 165246025 140215848 123816532 112541820 104472247 98505450
18549 98505450 93717520 89534827 85870836 82919627 80740438 79851292 80308206 81791652
18541 81791652 83508905 82597220 77862081 73002616 69996065 68558003 68285490 69126995
18533 69126995 70759044 71290541 66836371 59549406 52839614 47735081 43790868 40513496
18525 40513496 37711574 35323214 33174084 31416840 29775314 28241327 26882903 25630686
$$ packed form
18577A99510333j7812890o665808J166983P075146J2141696J8589390K7461851
18570B41466701L8938044N2501578O5266557P0993781M3831149k9538310o0121376
18563D23338124l2825313M769275L0845180L6374255j5760772q7089680r1753102
18556B67897967o3200371l9451571k5030177j6399316j1274712q069573n966797
18549I8505450m787930m182693l663991k951209k179189q89146M56914J483446
18541H1791652J717253r11685m735139m859465l006551j438062k72513Q41505
18533F9126995J632049N31497m454170p286965o709792n104533l944213l277372
18525D0513496k801922k388360k149130j757244j641526j533987j358424j252217
$$ plain form
18517 25630686 24375880 22881534 21531205 20435612 19405280 18372546 17525335 16772566
18509 16772566 15939217 15073222 14298056 13498292 12808363 12278688 11801943 11297783 10797412
18500 10797412 10282323 9860621 9493358 9140978 8760539 8391216 8070312 7731288 7326544
18491 7326544 6913731 6437196 6108851 5790710 5513676 5220665 4956361 4655295 4358572
18482 4358572 4218815 4037320 3818456 3603479 3432597 3320980 3419330 3334941 3203115 3108055
18472 3108055 3024566 2861122 2755033 2671106 2624269 2498826 2454124 2320727 2128419 2014428
18462 2014428 1947030 1922826 1916536 1905911 1886281 1879380 1872917 1840150 1796589 1750106 1699257 1626759
18450 1626759 1470483 1350878 1263543 1253053 1280945 1175529 1144437 1220661 1381480 1537186
$$ packed form
18517B5630686j254806j494346j350329j095593j030332j032734q47211p52769
18509A6772566q33349q65995p75166p99764o89929n29675m76745n04160n00371
18500A0797412n15089m21702l67263l52380l80439l69323l20904l39024m04744
18491G326544m12813m76535l28345l18141k77034k93011k64304l01066k96723
18482D358572j39757j81495k18864k14977j70882j11617R8350q4389j31826r5060
18472C108055q3489j63444j06089q3927m6837j25443m4702j33397j92308j13991
18462B014428o7398k4204o290j0625j9630o901o463l2767m3561m6483n0849p2498
18450A626759j56276j19605q7335j0490K7892j05416l1092P6224J60819J55706
$$ plain form
18440 1537186 1726000 1856713 1950845 1893594 1791347 1854878 1941577 2061045 2075476 2094802
18430 2094802 2064421 1993379 1858877 1732061 1683157 1703244 1749550 1595989 1498881 1454663 1501772
18419 1501772 1468400 1476369 1570497 1639111 1654790 1720604 1714488 1563559 1631482 1667139 1678501
18408 1678501 1692135 1712406 1728893 1743097 1638373 1690375 1689875 1533830 1498484 1546494 1574758
18397 1574758 1712842 1746776 1681953 1679777 1710026 1701864 1679319 1691650 1647044 1532209 1424062
18386 1424062 1436006 1570819 1693033 1709492 1559336 1366592 1402222 1460191 1418794 1367599
18376 1367599 1346603 1328970 1139983 1110562 1040069 979584 1006720 1035861 1058749 1057623 1043510
18365 1043510 1020268 1031269 938323 825849 907388 999936 1100103 1076499 1014930 1066293 1036507
$$ packed form
18440A537186J88814J30713R4132n7251j02247O3531Q6699J19468J4431J9326
18430B094802l0381p1042j34502j26816m8904K0087M6306j53561r7108m4218M7109
18419A501772l3372P969R4128O8614J5679O5814o116j50929O7923L5657J1362
18408A678501J3634K0271J6487J4204j04724N2002n00j56045l5346M8010K8264
18397A574758J38084L3934o4823k176L0249q162k2545J2331m4606j14835j08147
18386A424062J1944J34813J22214J6459j50156j92744L5630N7969m1397n1195
18376A367599k0996j7633j88987k9421p0493o0485K7136K9141K2888j126j4113
18365A043510k3242J1001r2946j12474Q1539R2548J00167k3604o1569N1363k9786
$$ plain form
18354 1036507 975062 905687 957601 918845 903867 871795 834389 776175 861761 866510 839751
18343 839751 868625 990254 1063129 1045685 1040794 1027924 988256 1011661 986416 989028 916291 914195
18331 914195 870798 842697 822057 743293 708830 670427 655648 764742 836530 793041 709377
18320 709377 685254 669062 658357 783874 875542 896971 837011 735984 634137 600575 653035
18309 653035 711458 747478 840511 877089 974082 1044326 1276334 1389892 1584404 1831647 1983445
18298 1983445 2156763 2235404 2211539 2176977 2065504 2073225 2022291 1906262 1699049 1635176 1711693
18287 1711693 1780107 1783197 1829310 1945996 1811920 1619538 1538105 1401704 1192578 1051793
18277 1051793 896952 760615 667206 632845 642302 626473 557223 517969 606258 677826 570911
$$ packed form
18354A036507o1445o9375N1914l8756j4978l2072l7406n8214Q5586M749k6759
18343H39751K8874J21629P2875j7444m891j2870l9668K3405k5245K612p2737k096
18331I14195m3397k8101k0640p8764l4463l8403j4779J09094P1788m3489q3664
18320G09377k4123j6192j0705J25517R1668K1429n9960j01027j01847l3562N2460
18309F53035N8423L6020R3033L6578R6993P0244K32008J13558J94512K47243J51798
18298A983445J73318P8641k3865l4562j11473P721n0934j16029k07213o3873P6517
18287A711693O8414L090M6113J16686j34076j92382q1433j36401k09126j40785
18277A051793j54841j36337r3409l4361R457j5829o9250l9254Q8289P1568j06915
$$ plain form
18266 570911 607774 552756 413083 345644 281482 285506 238867 189148 197929 274543 310716 316742
18254 316742 407975 452989 396926 338440 331400 324289 339933 342847 454428 574635 562380 552642
18242 552642 412572 359788 423307 374473 285373 141496 125129 187592 189250 309812 333643
18231 333643 284134 205730 221305 250087 211594 234568 234988 213692 267532 263382 295952 335971
18219 335971 271311 273773 287638 247476 183189 218011 251599 288260 325799 198288 85977
18208 85977 36061 138761 290845 278059 249399 224096 250488 176093 143486 176971 170168
18197 170168 155409 169617 277812 276642 240053 249079 285509 339324 413869 441563 423205 401559
18185 401559 321713 303153 227309 320926 389183 440767 442977 429893 404727 440461 475067 442846
$$ packed form
18266E70911L6863n5018j39673o7439o4162M024m6639m9719Q781P6614L6173O026
18254C16742R1233M5014n6063n8486p040p111J5644K914J11581J20207j2255r738
18242E52642j40070n2784O3519m8834q9100j43877j6367O2463J658J20562K3831
18231C33643m9509p8404J5575K8782l8493K2974M20k1296N3840m150L2570M0019
18219C35971o4660K462J3865m0162o4287L4822L3588L6661L7539j27511j12311
18208H5977m9916J02700J52084j2786k8660k5303K6392p4395l2607L3485o803
18197A70168j4759J4208J08195j170l6589R026L6430N3815P4545K7694j8358k1646
18185D01559p9846j8560p5844R3617O8257N1584K210j3084k5166L5734L4606l2221
$$ plain form
18173 442846 452229 421196 316117 277735 291007 277968 357940 459964 392825 329117 333987
18162 333987 437757 504662 570220 574704 606355 627892 656502 590843 705591 794988 751774
18151 751774 778067 771276 789646 839222 829951 962778 1140750 1166768 1188889 1241266 1340142
18140 1340142 1441261 1565393 1726406 1870046 2146906 2425875 2708003 3022193 3288379
18131 3288379 3537796 3916833 4377075 4796049 5341529 5962952 6537480 7092837 7671014
18122 7671014 8418401 9474438 10677387 12147736 14022582 16338629 19167368 22602776
18114 22602776 26673888 31628405 38262124 47740109 61239470 79061223 100539338 122231962
18106 122231962 121031486 90265053 59371114 39811048 28750353 22312276 18247062
$$ packed form
18173D42846R383l1033j05079l8382J3272j3039P9972J02024o7139o3708M870
18162C33987J03770O6905O5558M484L1651K1537K8610o5659J14748Q9397m3214
18151G51774K6293o791J8370M9576r271J32827J77972K6018K2121N2377R8876
18140A340142J01119J24132J61013J43640K76860K78969K82128L14190K66186
18131C288379K49417L79037M60242M18974N45480O21423N74528N55357N78177
18122G671014P47387J056037J202949J470349J874846K316047K828739L435408
18114B2602776M071112M954517O633719R477985J3499361J7821753K1478115K1692624
18106A22231962j200476l0766433l0893939j9560066j1060695o438077m065214
$$ plain form
18099 18247062 15562991 13780060 12437671 11355781 10457243 9631779 8979842 8346919 7769412
18090 7769412 7409179 7114982 6827710 6579253 6465063 6307468 6248440 6199546 6154658 6137452
18080 6137452 6110443 6158007 6362894 6558860 6434137 6144173 5861323 5645537 5326488 5098836
18070 5098836 5024863 4924425 4773659 4727469 4744244 4772090 4713169 4665662 4756833 4747967 4687149
18059 4687149 4605649 4411439 4107330 3750305 3339442 2978482 2696429 2522260 2389634 2324575
18049 2324575 2207420 2050543 1887710 1673623 1582415 1473438 1442695 1424608 1304061 1168711
18039 1168711 1125457 1136719 1138306 1084789 1118384 1149395 1137051 1151358 1075254 945954 918083
18028 918083 807876 840350 855631 945840 1065890 1114285 1044824 1042846 1144816 1148208 1184443
$$ packed form
18099A8247062k684071j782931j342389j081890q98538q25464o51937o32923n77507
18090G769412l60233k94197k87272k48457j14190j57595n9028m8894m4888j7206
18080F137452k7009M7564K04887J95966j24723k89964k82850k15786l19049k27652
18070E098836p3973j00438j50766m6190J6775K7846n8921m7507R1171q866o0818
18059D687149q1500j94210l04109l57025m10863l60960k82053j74169j32626o5059
18049B324575j17155j56877j62833k14087r1208j08977l0743j8087j20547j35350
18039A168711m3254J1262J587n3517L3595L1011j2344J4307p6104j29300k7871
18028I18083j10207L2474J5281R0209J20050M8395o9461j978J01970L392L6235
$$ plain form
18017 1184443 1310137 1419054 1375485 1460326 1688506 1826693 1933804 1917749 1802483 1702648
18007 1702648 1556351 1348580 1182473 1064527 1050519 1140397 1055202 849664 650237 545027
17997 545027 477164 451486 424268 356562 317398 381207 444147 382006 331744 292884 263100
17986 263100 164675 250499 340560 314187 340580 450062 491310 450963 451025 421922 304040 243549
17974 243549 305630 264494 247022 195282 201398 222661 323376 380280 354910 323648 269855
17963 269855 315599 350433 300764 160204 173994 232259 237936 211585 156054 232509 173330
17952 173330 105225 134730 229679 197655 73406 33011 41097 81969 128194 153378 252243
17941 252243 318014 301308 281016 248654 265354 325591 324536 205176 85373 19445 53322
$$ packed form
18017A184443J25694J08917m3569Q4841K28180J38187J07111j6055j15266r9835
18007A702648j46297k07771j66107j17946j4008Q9878q5195k05538j99427j05210
17997E45027o7863k5678k7218o7706l9164O3809O2940o2141n0262l8860k9784
17986B63100r8425Q5824R0061k6373K6393J09482M1248m0347O2k9103j17882o0491
17974B43549O2081m1136j7472n1740O116K1263J00715N6904k5370l1262n3793
17963B69855M5744L4834m9669j40560J3790N8265N677k6351n5531P6455n9179
17952A73330o8105K9505R4949l2024j24249m0395Q086M0872M6225K5184R8865
17941B52243O5771j6706k0292l2362J6700O0237j055j19360j19803o5928L3877
$$ plain form
17930 53322 109083 104150 96132 19146 -5200 46968 148402 287767 213866 181236 109536 90169
17918 90169 96931 43313 135087 210035 181723 88924 80332 140573 111798 89202 74378 47961
17906 47961 35090 31779 -18612 -55391 51683 -5582 -3364 37414 101247 140469 157410 111161
17894 111161 100230 144130 200322 295492 186570 42569 -5953 -11810 -89290 -120351 -60798
17883 -60798 -14593 -117685 -122848 -78651 -77803 -18504 74919 91771 83590 162282 172520 100644
17871 100644 145027 204248 57861 5348 99602 137302 129787 113984 139156 89249 70443
17860 70443 99324 105284 110193 162185 147175 137287 141629 144980 101395 -22671 -37114 -14296
17848 -14296 4280 2616 -49523 34754 176362 193963 145274 34423 -96481 -56255 -71860
$$ packed form
17930E3322N5761m933q018p6986k4346N2168J01434J39365p3901l2630p1700j9367
17918I0169O762n3618R1774P4948k8312r2799q592O0241k8775k2596j4824k6417
17906D7961j2871l311n0391l6779J07074n7265K218M0778O3833L9222J6941m6249
17894A11161j0931M3900N6192R5170j08922j44001m8522n857p7480l1061N9553
17883f0798M6205j03092n163M4197Q48N9299R3423J6852q181P8692J0238p1876
17871A00644M4383N9221j46387n2513R4254L7700p515j5803K5172m9907j8806
17860G0443K8881N960M909N1992j5010r888M342L351m3585j24066j4443K2818
17848a4296J8576j664n2139Q4277J41608J7601m8689j10851j30904M0226j5605
$$ plain form
17837 -71860 -20840 -41490 -81666 -42369 -41963 -137307 -122605 -113931 -65199 -1950 35827 7961
17825 7961 -38261 -87215 -110550 -70425 50738 36403 -26362 -47840 -42211 36371 63211 67600
17813 67600 12303 -1464 -8642 111265 206248 293252 258927 213501 192476 63480 99430
17802 99430 86470 33083 57937 11473 -46584 24845 132522 86952 54205 1626 -92847
17791 -92847 -89680 -23668 84321 39404 68893 102933 126714 176451 146091 141668 123996 132823
17779 132823 128425 152907 83331 57300 108543 145260 101472 100555 18461 -58449 -94659 -118369
17767 -118369 -121446 -131348 -74266 -62980 -27225 70105 171469 143382 169578 239621 227133 141394
17755 141394 4881 15064 54502 141058 92190 -1178 -25926 -66064 -3075 59290 111588
$$ packed form
17837g1860N1020k0650m0176L9297M06r5344J4702Q674M8732O3249L7777k7866
17825G961m6222m8954k3335M0125J21163j4335o2765k1478N629P8582K6840M389
17813F7600n5297j3767p178J19907R4983Q7004l4325m5426k1025j28996L5950
17802I9430j2960n3387K4854m6464n8057P1429J07677m5570l2747n2579r4473
17791i2847L167O6012J07989m4917K9489L4040K3781M9737l0360m423j7672Q827
17779A32823m398K4482o9576k6031N1243L6717m3788r17q2094p6910l6210k3710
17767a18369l077r902N7082J1286L5755R7330J01364k8087K6196P0043j2488q5739
17755A41394j36513J0183L9438Q6556m8868r3368k4748m0138O2989O2365N2298
$$ plain form
17744 111588 67346 -4483 -14459 -7628 92597 103930 -30382 -78411 4071 42253 52487
17733 52487 -25797 78703 124938 95608 172349 137920 105190 60920 53442 65599 -2439 -109313
17721 -109313 15113 33720 38515 -22260 -59054 -35753 24762 42715 71703 78394 -20365 -17844
17709 -17844 86515 156434 216751 173904 229106 194639 20616 -48785 14063 32943 -24321
17698 -24321 -21954 -45908 -38047 34820 13090 -2355 28700 80547 12553 34575 94360 91365
17686 91365 94961 62372 11065 1952 51468 28265 28226 -27292 -86640 -15571 -58638 -70270 -139271
17673 -139271 -179071 -273830 -246016 -111050 -15541 15443 -10346 -102312 -123272 -141055 -74578
17662 -74578 -111288 -75410 -49152 -59444 -53966 -81762 -100217 -61775 3599 -53314 -46491 23881
$$ packed form
17744A11588m4242p1829r976O831J00225J1333j34312m8029Q2482L8182J0234
17733E2487p8284J04500M6235k9330P6741l4429l2730m4270p478J2157o8038j06874
17721a09313J24426J8607M795o0775l6794K3301O0515J7953K8988O691r8759K521
17709a7844J04359O9919O0317m2847N5202l4467j74023o9401O2848J8880n7264
17698b4321K367k3954P861P2867k1730j5445L1055N1847o7994K2022N9785k995
17686I1365L596l2589n1307r113M9516k3203l9n5518n9348P1069m3067j1632o9001
17673a39271l9800r4759K7814J34966R5509L0984k5789r1966k0960j7783O6477
17662g4578l6710L5878K6258j0292N478k7796j8455L8442O5374n6913O823P0372
$$ plain form
17650 23881 95849 142326 116805 5199 24896 22409 -52888 18635 2054 -88339 -87629 -69920
17638 -69920 -40303 8656 48548 20890 -17111 -53715 -79883 -85703 -156004 -161681 -113727 -59715
17626 -59715 -12494 68130 65026 76933 48935 18375 118439 163282 121862 29891 -28232 24156
17614 24156 107090 112300 64493 -12632 -39921 -39747 17418 20931 -64312 -47938 -35797 -65636
17602 -65636 2009 29063 19066 48710 18593 50752 -17687 -100123 -164567 -189845 -68464 19514
17590 19514 62374 36539 58411 22222 23485 -28532 -57953 -31992 -78916 -4815 162850 285258
17578 285258 260399 167650 89173 146348 154173 135296 53509 -89519 -63270 36926 75200
17567 75200 24826 -95147 -144285 -130788 -108256 -53342 -96757 -78186 -16509 -112709 -126540
$$ packed form
17650B3881P1968M6477k5521j11606J9697k487p5297P1523j6581r0393P10J7709
17638f9920K9617M8959L9892k7658l8001l6604k6168n820p0301n677M7954N4012
17626e9715M7221Q0624l104J1907k7998l0560J00064M4843m1420r1971n8123N2388
17614B4156Q2934N210m7807p7125k7289J74N7165L513q5243J6374J2141k9839
17602f5636O7645K7054r997K9644l0117L2159o8439q2436o4444k5278J21381Q7978
17590A9514M2860k5835K1872l6189J263n2017k9421K5961m6924P4101J67665J22408
17578B85258k4859r2749p8477N7175P825j8877q1787j43028K6249J00196L8274
17567G5200n0374j19973m9138J3497K2532N4914m3415J8571O1677r6200j3831
$$ plain form
17556 -126540 -112678 -95344 -17226 -3739 -543 17640 693 -66756 -122758 -170543 -74221 41979
17544 41979 58026 1954 43081 141002 105693 128183 106372 31157 -63752 -58345 99748 201879
17532 201879 126506 10574 -40176 7537 50879 -16386 45457 133773 211140 219871 229067 188470
17520 188470 222258 258657 332323 386016 437407 524179 740373 819059 957942 1169874 1294927
17509 1294927 1316320 1243455 1039789 867476 907312 861934 972631 1015804 1201332 1410779
17499 1410779 1511555 1507648 1393105 1414609 1462116 1418913 1364016 1284031 1065329 911379 897202
17488 897202 793463 797965 876044 969319 1160552 1270107 1237495 1110747 1022017 880954 649012
17477 649012 530604 407648 376619 412481 386526 337780 285572 217398 177330 132405 87059
$$ packed form
17556a26540J3862J7334P8118J3487L196J8183j6947o7449n6002m7785R6322J16200
17544D1979J6047n6072M1127R7921l5309K2490k1811p5215r4909N407J58093J02131
17532B01879p5373j15932n0750M7713M3342o7265O1843Q8316P7367Q731R196m0597
17520A88470L3788L6399P3666N3693N1391Q6772K16194P8686J38883K11932J25053
17509A294927K1393p2865k03666j72313L9836m5378J10697M3173J85528K09447
17499A410779J00776l907j14543K1504M7507m3203n4897p9985k18702j53950j4177
17488H97202j03739M502P8079R3275J91233J09555l2612j26748q8730j41063k31942
17477F49012j18408j22956l1029L5862k5955m8746n2208o8174m0068m4925m5346
$$ plain form
17466 87059 159157 190511 227491 226648 228318 295415 261620 176073 135424 255592 284340 285136
17454 285136 275294 281858 271479 241936 201112 207515 166666 219393 261339 266136 261695 306628
17442 306628 345010 482546 680260 661588 527563 501604 424201 260552 209014 191795 133289
17431 133289 134339 190136 184258 167374 153013 169805 98949 138154 100284 98569 109988 163805
17419 163805 267847 288998 148262 170445 124627 52854 102852 162207 134524 92550 8294
17408 8294 -38055 56561 48576 87631 107012 84124 76235 88837 18702 30301 -40745 -5900
17396 -5900 2261 33259 41126 15981 -19552 10594 -12034 -60016 -49978 -285 37222 91748
17384 91748 34947 14629 35669 151721 98105 58470 144990 81108 54812 16866 19718 147062
$$ packed form
17466H7059P2098L1354L6980q43J670O7097l3795q5547m0649J20168K8748P96
17454B85136r842O564j0379k9543m0824O403m0849N2727M1946M797m441M4933
17442C06628L8382J37536J97714j8672j34025k5959p7403j63649n1538j7219n8506
17431A33289J050N5797n878j6884j4361J6792p0856L9205l7870j715J1419N3817
17419A63805J04042K1151j40736K2183m5818p1773M9998N9355k7683m1974q4256
17408H294m6349R4616p985L9055J9381k2888p889J2602p0135J1599p1046L4845
17396e900Q161L0998P867k5145l5533L0146k2628m7982J0038M9693L7507N4526
17384I1748n6801k0318K1040J16052n3616l9635Q6520o3882k6296l7946K852J27344
$$ plain form
17372 147062 219355 199859 100585 73895 87852 111549 115620 158672 192961 161452 120146 74090
17360 74090 72117 13907 -85389 -159696 -111441 -56543 -21129 21719 75886 61859 66158 147488
17348 147488 230054 226077 170186 166519 154919 139283 168815 63237 -31676 -70833 -154761 -82950
17336 -82950 -70317 -147623 -127997 -66789 -66050 -97029 -74029 -37359 21149 71568 14922 70443
17324 70443 183536 123532 64103 74557 24185 -28679 84877 199702 165177 103781 91649
17313 91649 113162 98973 -7197 -929 153667 139674 134992 65051 -10218 19737 -16482 -17497
17301 -17497 -100565 -124225 -104873 -80215 972 79379 87815 60027 42978 76068 66429 51834
17289 51834 -49410 -55035 14894 63680 137628 154675 82154 30155 55409 110301 98961 50067
$$ packed form
17372A47062P2293j9496r9274k6690J3957K3697M071M3052L4289l1509m1306m6056
17360G4090j973n8210r9296p4307M8255N4898L5414M2848N4167j4027M299Q1330
17348A47488Q2566l977n5891l667j1600j5636K9532j05578r4913l9157q3928P1811
17336h2950J2633p7306J9626O1208P39l0979K3000L6670N8508N0419n6646N5521
17324G0443J13093o0004n9429J0454n0372n2864J13556J14825l4525o1396j2132
17313I1649K1513j4189j06170O268J54596j3993m682o9941p5269K9955l6219j015
17301a7497q3068k3660J9352K4658Q1187P8407Q436k7788j7049L3090r639j4595
17289E1834j01244n625O9929M8786P3948J7047p2521n1999K5254N4892j1340m8894
$$ plain form
17277 50067 94945 144161 128478 77647 8266 -7623 81090 178130 144242 72593 126560 119475
17265 119475 105449 38333 47399 80417 109355 214362 162662 75931 81630 93153 154363 164027
17253 164027 184018 175536 155197 165488 217043 240346 191831 123009 66407 149858 115431 141099
17241 141099 99737 14115 62205 78907 100865 129485 172022 230781 185224 138451 175100
17230 175100 133673 9072 84827 41963 -14283 83472 222303 240668 169805 96113 63436
17219 63436 70935 74296 94476 73179 -32528 -36157 -50358 15380 63921 48444 68213 108454
17207 108454 111265 46886 -12462 30346 69511 11022 -4510 15836 20420 69957 141460 188790
17195 188790 296950 341584 293148 351392 470446 433747 371354 383344 348606 362450 375292
$$ packed form
17277E0067M4878M9216j5683n0831o9381j5889Q8713R7040l3888p1649N3967p085
17265A19475j4026o7116R066L3018K8938J05007n1700q6731N699J1523O1210R664
17253A64027J9991q482k0339J0291N1555K3303m8515o8822n6602Q3451l4427K5668
17241A41099m1362q5622M8090J6702K1958K8620M2537N8759m5557m6773L6649
17230A75100m1427j24601P5755m2864n6246R7755J38831J8365p0863p3692l2677
17219F3436P499L361K0180k1297j05707l629j4201O5738M8541j5477J9769M0241
17207A08454K811o4379n9348M2808L9165n8489j5532K0346M584M9537P1503M7330
17195A88790J08160M4634m8436N8244J19054l6699o2393J1990l4738J3844J2842
$$ plain form
17184 375292 459472 406870 285433 241859 234261 178130 144805 169553 216382 266250 340738
17173 340738 340083 287413 291449 257111 229231 218404 200455 101811 51473 28142 -75518 -52235
17161 -52235 -38150 -31281 7466 -29937 57356 109290 57487 20369 16493 -71000 -82351 -147728
17149 -147728 -59225 41255 -60879 -35741 -19418 58633 150575 82422 -10916 -6811 -46363
17138 -46363 -5204 58238 46557 5414 -53070 -82016 -11288 38432 55115 12345 -19623 100892
17126 100892 15662 -26483 49357 178867 189311 152017 207862 240250 218620 242414 265478
17115 265478 185247 229342 206780 267348 235581 281655 346903 336884 291847 262995 178232
17104 178232 194869 226603 179643 162352 158037 205358 163222 254507 342517 298009 271542 258241
$$ packed form
17184C75292Q4180n2602j21437m3574p598n6131l3325K4748M6829M9868P4488
17173C40738o55n2670M036l4338k7880j0827j7949r8644n0338k3331j03660K3283
17161e2235J4085O869L8747l7403Q7293N1934n1803l7118l876q7493j1351o5377
17149a47728Q8503J00480j02134K5138J6323P8051R1942o8153r3338M105l9552
17138d6363M1159O3442j1681m1143n8484k8946P0728M9720J6683m2770l1968J20515
17126A00892q5230m2145P5840J29510J0444l7294N5845L2388k1630K3794K3064
17115B65478q0231M4095k2562O0568l1767M6074O5248j0019m5037k8852q4763
17104A78232J6637L1734m6960j7291m315M7321m2136R1285Q8010m4508k6467j3301
$$ plain form
17092 258241 239067 135366 40564 22277 181135 296782 120162 69642 215692 287638
17082 287638 284538 304393 217352 202722 215194 206191 261673 363378 435908 468288 518784 494415
17070 494415 487065 414847 244746 222903 340093 473329 543047 515419 505570 546845 511047
17059 511047 540432 647110 798287 852666 807272 850851 842347 752395 768158 885104 886934
17048 886934 937174 1059997 1081442 1131393 1208659 1221110 1187822 1230155 1224244 1176806 1110943
17037 1110943 1127538 1082582 1093479 1208753 1321764 1436813 1546381 1526167 1447230 1330101
17027 1330101 1351683 1431970 1491816 1585569 1622283 1680654 1743176 1938860 1986277 1926507 2028887
17016 2028887 2020521 1930358 2005213 2082668 2168841 2255398 2317360 2450586 2496610 2651258 2658166
$$ packed form
17092B58241j9174j03701r4802j8287J58858J15647j76620n0520J46050P1946
17082B87638l100J9855q7041j4630J2472r003N5482J01705P2530L2380N0496k4369
17070D94415p350p2218j70101k1843J17190J33236O9718k7628r849M1275l5798
17059E11047K9385J06678J51177N4379m5394M3579q504q9952J5763J16946J830
17048H86934N0240J22823K1445M9951P7266J2451l3288M2333n911m7438o5863
17037A110943J6595m4956J0897J15274J13011J15049J09568k0214p8937j17129
17027A330101K1582Q0287N9846R3753L6714N8371O2522J95684M7417n9770J02380
17016B028887q366r0163P4855P7455Q6173Q6557O1962J33226M6024J54648O908
$$ plain form
17005 2658166 2646250 2763668 2858767 2929767 3082194 3091973 3117644 3224293 3386457 3450082 3518580
16994 3518580 3699720 3908537 4192515 4410520 4498172 4566892 4775577 4945140 5096387 5330270
16984 5330270 5698490 6127186 6593352 7027588 7495987 8015394 8668867 9444050 10207646
16975 10207646 11038791 11788695 12587128 13621646 14727209 16046942 17617928 19185809
16967 19185809 20891661 22791263 24828180 26984022 29333598 31959611 35311467 39620552
16959 39620552 44703459 50753342 57801532 66034003 75875612 88267750 104661394 126149541
16951 126149541 153097150 184183919 213940002 227370632 212464845 182879107 158666105
16944 158666105 146528974 145169418 153141087 169630295 194055331 225022603 258746773
$$ packed form
17005B658166j1916J17418R5099P1000J52427R779K5671J06649J62164O3625O8498
16994C518580J81140K08817K83978K18005Q7652O8720K08685J69563J51247K33883
16984E330270L68220M28696M66166M34236M68399N19407O53473P75183P63596
16975A0207646Q31145P49904P98433J034518J105563J319733J570986J567881
16967A9185809J705852J899602K036917K155842K349576K626013L351856M309085
16959C9620552N082907O049883P048190Q232471R841609J2392138J6393644K1488147
16951A26149541K6947609L1086769K9756083J3430630j4905787k9585738k4213002
16944A58666105j2137131j359556P971669J6489208K4425036L0967272L3724170
$$ plain form
16937 258746773 284129174 286863688 274228337 266103755 268323829 268344152 247570882 210558262
16929 210558262 176435083 154227104 143272114 141589828 147934694 161652649 181399939
16922 181399939 203695747 219159650 210882510 177816942 139810995 110227719 90086177
16915 90086177 76646822 67600867 61275674 56499855 52826225 49905106 47511023 45622108
16907 45622108 43957269 42330596 40779649 39465726 38318392 37138071 35829670 34147287
16899 34147287 32382540 30678706 29138469 27786685 26631280 25678019 24962734 24402335
16891 24402335 23667317 22798675 21766242 20430052 19155925 17977769 17003155 16082871 15177735
16882 15177735 14321598 13474664 12587226 11759893 11013970 10359532 9823213 9207925 8767495
$$ packed form
16937B58746773K5382401K734514j2635351q124582K220074K0323k0773270l7012620
16929B10558262l4123179k2207979j0954990j682286O344866J3717955J9747290
16922A81399939K2295808J5463903q277140l3065568l8005947k9583276k0141542
16915I0086177j3439355r045955o325193m775819l673630k921119k394083j888915
16907D5622108j664839j626673j550947j313923j147334j180321j308401j682383
16899C4147287j764747j703834j540237j351784j155405r53261p15285n60399
16891B4402335p35018q68642j032433j336190j274127j178156r74614r20284r05136
16882A5177735q56137q46934q87438q27333p45923o54438n36319o15288m40430
$$ plain form
16873 8767495 8398977 7947855 7587045 7234228 6892758 6554654 6220144 5813886 5378958
16864 5378958 5017545 4855178 4681631 4457300 4215364 4023735 3842843 3752885 3531266 3373036
16854 3373036 3247768 3052923 2915454 2841835 2721832 2554888 2423452 2367017 2265325 2151897
16844 2151897 1976545 1949664 1858804 1739940 1693464 1673897 1727806 1636077 1522096 1510174 1344086
16833 1344086 1236919 1146700 1015419 1005310 986622 934986 795455 782331 907509 927795
16823 927795 941163 920711 923253 887874 802324 855040 964735 890037 692930 585738 489356
16812 489356 648797 794708 841793 804281 663322 678387 781340 846844 879254 883587 795323
16801 795323 728932 610196 593968 564495 594641 629731 683180 878738 838941 793345 831162
$$ packed form
16873H767495l68518m51122l60810l52817l41470l38104l34510m06258m34928
16864E378958l61413j62367j73547k24331k41936j91629j80892q9958k21619j58230
16854C373036j25268j94845j37469p3619j20003j66944j31436n6435j01692j13428
16844B151897j75352k6881r0860j18864m6476j9567N3909r1729j13981j1922j66088
16833A344086j07167r0219j31281j0109j8688n1636j39531j3124J25178K0286
16823I27795J3368k0452K542l5379q5550N2716J09695p4698j97107j07192r6382
16812D89356J59441J45911M7085l7512j40959J5065J02953O5504L2410M333q8264
16801G95323o6391j18736j6228k9473L0146L5090N3449J95558l9797m5596L7817
$$ plain form
16790 831162 722170 630860 619889 639397 654388 594696 624505 741193 772501 740751 741863
16779 741863 705185 671327 640327 654357 691634 648107 614422 716645 735567 819534 830308
16768 830308 760681 661838 633730 793697 872588 876376 764361 683863 700017 831296 914093
16757 914093 936215 922576 872394 777722 780036 826059 814427 876571 923458 922577 853261 804724
16745 804724 739572 667946 598159 592314 597401 594625 620522 617264 631452 710503 685125 632193
16733 632193 625539 638530 617648 537761 495991 523357 433204 357216 333499 349468 351854 388451
16721 388451 395058 242639 219136 162120 124553 207670 304501 333157 216404 149208 268256
16710 268256 359615 331274 376699 453564 479351 414343 335255 373651 455934 480840 544895
$$ packed form
16790H31162j08992r1310j0971J9508J4991n9692K9809J16688L1308l1750J112
16779G41863l6678l3858l1000J4030L7277m3527l3685J02223J8922Q3967J0774
16768H30308o9627r8843k8108J59967P8891L788j12015q0498J6154J31279Q2797
16757I14093K2122j3639n0182r4672K314M6023j1632O2144M6887q81o9316m8537
16745H04724o5152p1626o9787n845N087k776K5897l258J4188P9051k5378n2932
16733F32193o654J2991k0882p9887m1770K7366r0153p5988k3717J5969K386L6597
16721C88451O607j52419k3503n7016l7567Q3117R6831K8656j16753o7196J19048
16710B68256R1359k8341M5425P6865K5787o5008p9088L8396Q2283K4906O4055
$$ plain form
16699 544895 520615 474342 354237 315392 274534 206641 248822 249062 255583 237457 190058 234181
16687 234181 135376 104730 115147 188807 284678 342873 382001 340256 340205 348128 473081 496660
16675 496660 379575 351501 307367 339010 217179 186107 319845 276655 169035 127132 216876
16664 216876 212615 111889 82866 92250 36553 138565 213441 308659 367643 298674 184371
16653 184371 146621 95861 -3951 47571 102483 145059 111182 107361 54429 -72537 13094
16642 13094 64435 81161 126654 175296 177745 125581 96203 84521 144156 170630 220696 252349
16630 252349 267493 220342 236363 319325 324390 309875 312527 258543 325079 324471 362263 318931
16618 318931 290191 313402 296575 317044 238148 287513 297856 342436 322471 294846 221377
$$ packed form
16699E44895k4280m6273j20105l8845m0858o7893M2181K40O521j8126m7399M4123
16687B34181r8805l0646J0417P3660R5871N8195L9128m1745n1P923J24953K3579
16675D96660j17085k8074m4134L1643j21831l1072J33738m3190j07620m1903Q9744
16664B16876m261j00726k9023R384n5697J02012P4876R5218N8984o8969j14303
16653A84371l7750n0760r9812N1522N4912M2576l3877l821n2932j26966Q5631
16642A3094N1341J6726M5493M8642K449n2164k9378j1682N9635K6474N0066L1653
16630B52349J5144m7151J6021Q2962N065j4515K652n3984O6536o08L7792m3332
16618C18931k8740K3211j6827K0469p8896M9365J0343M4580j9965k7625p3469
$$ plain form
16607 221377 288035 331179 265301 200718 154719 145843 96611 143795 257864 171570 113187
16596 113187 151993 158262 122646 2593 -24025 -48180 -120785 -6088 -10629 21025 -12531
16585 -12531 -52837 -112246 -88789 -82686 -136541 -121219 -95968 -101932 45311 90503 50897 38796
16573 38796 2217 -44958 -80060 -84384 -88718 -95595 -72388 -40288 -84391 -39762 -139737 -153681
16561 -153681 -51563 55215 205262 241773 227663 196320 246131 166204 90413 50729 87360
16550 87360 84129 92470 -35775 -104428 -27488 -31269 -4881 15973 28797 98428 157972 123115
16538 123115 126111 86120 43348 7824 16116 83211 87322 23738 -18190 -119482 -74624 29116
16526 29116 47279 18634 33273 14597 93733 19719 20258 47823 26792 41573 31225 87998
$$ packed form
16607B21377O6658M3144o5878o4583m5999q876m9232M7184J14069q6294n8383
16596A13187L8806O269l5616j20053k6618k4155p2605J14697m541L1654l3556
16585a2531m0306n9409K3457O103n3855J5322K5251n964J47243M5192l9606j2101
16573C8796l6579m7175l5102m324m334o877K3207L2100m4103M4629r9975j3944
16561a53681J02118J06778J50047L6511j4110l1343M9811p9927p5791l9684L6631
16550H7360l231Q341j28245o8653P6940l781K6388K0854J2824O9631N9544l4857
16538A23115K996l9991m2772l5524Q292O7095M111o3584m1928j01292M4858J03740
16526B9116J8163k8645J4639j8676P9136p4014N39K7565k1031J4781j0348N6773
$$ plain form
16514 87998 89243 -78851 -142608 -73066 -62277 -130686 -76221 -99546 -112115 -117958 -225771 -185175
16502 -185175 1045 91795 65292 72181 108438 89750 134771 117261 91823 28499 -45037
16491 -45037 -90726 -61925 -2275 58707 -39056 -44622 25192 65422 57429 87778 95970 133515
16479 133515 235600 267935 325948 263335 141595 125952 159245 178431 259590 187663 95832
16468 95832 124196 94721 29989 -27144 -15643 101657 110312 102053 87152 94734 139973 52426
16456 52426 23074 -7373 27135 27572 -19325 -88220 -53179 -27003 -53374 -45932 -71921 -56455
16444 -56455 -36203 23823 -3169 -43041 85733 116644 102362 76491 83557 109585 60506 112246
16432 112246 159205 155210 213755 232827 112586 89726 30361 -23069 -83053 -67144 -41311
$$ packed form
16514H7998J245j68094o3757O9542J0789o8409N4465k3325j2569n843j07813M0596
16502a85175J86220R0750k6503O889L6257j8688M5021j7510k5438o3324p3536
16491d5037m5689K8801N9650O0982r7763n566O9814M0230p993L0349Q192L7545
16479A33515J02085L2335N8013o2613j21740j5643L3293J9186Q1159p1927r1831
16468I5832K8364k9475o4732n7133J1501J17300Q655q259j4901P582M5239q7547
16456E2426k9352l0447L4508M37m6897o8895L5041K6176k6371P442k5989J5466
16444e6455K0252O0026k6992l9872J28774L0911j4282k5871P066K6028m9079N1740
16432A12246M6959l995N8545J9072j20241k2860n9365n3430n9984J5909K5833
$$ plain form
16421 -41311 -84590 -73428 -61534 -82789 -33964 49511 -23696 -421 -272 30705 22607 33628
16409 33628 42927 39237 54339 105406 126542 33023 47217 75357 24518 55283 162493 248205
16397 248205 304330 251720 283489 269511 184275 203194 247419 294325 360169 386424 400746
16386 400746 472698 499062 540016 709343 845735 897499 1015828 1109539 1055672 891629 856227
16375 856227 892402 872733 873633 969781 1226893 1384178 1582331 1648903 1577218 1481532 1378527
16364 1378527 1383236 1359712 1296803 1114839 935637 838433 786743 752729 756054 818180 974987
16353 974987 1126486 1167520 1072038 957834 888238 793044 632541 567518 455208 380969 404470
16342 404470 364489 315748 382376 334487 287544 154197 116287 119118 220887 353645 432524
$$ packed form
16421d1311m3279J1162J1894k1255M8825Q3475p3207K3275J49L0977q098J1021
16409C3628R299l690J5102N1067K1136r3519J4194K8140n0839L0765J07210Q5712
16397B48205N6125n2610L1769j3978q5236J8919M4225M6906O5844K6255J4322
16386D00746P1952K6364M0954J69327J36392N1764J18329R3711n3867j64043l5402
16375H56227L6175j9669R00R6148K57112J57285J98153O6572p1685r5686j03005
16364A378527M709k3524o2909j81964j79202r7204n1690l4014L325O2126J56807
16353I74987J51499M1034r5482j14204o9596r5194j60503o5023j12310p4239K3501
16342D04470l9981m8741O6628m7889m6943j33347l7910K831J01769J32758P8879
$$ plain form
16331 432524 388732 325273 286550 248600 192937 184475 171799 202195 220234 143672 81513 44601
16319 44601 -38659 -64663 -62702 -5134 66458 117996 18838 -38880 -37321 -45049 19819 64610
16307 64610 92111 50724 59343 -11560 -80826 11895 38722 28056 38001 75734 75272 29420
16295 29420 103702 204479 151242 14091 -117956 -148072 -108214 -117889 46886 91357 124251
16284 124251 169817 199422 156377 64235 64037 105592 89830 82081 112436 -22509 -38135 -23883
16272 -23883 18254 69359 92640 48363 73855 130249 71019 92825 91865 84154 2933 -4413
16260 -4413 39129 44624 642 -9030 1949 59409 66677 16548 30652 83898 84265 55918 9732
16247 9732 81407 114931 -19361 -76591 -67614 -60669 -93480 -92629 -71914 7639 -3123 11235
$$ packed form
16331D32524m3792o3459l8723l7950n5663q462j2676L0396J8039p6562o2159l6912
16319D4601q3260k6004J961N7568P1592N1538r9158n7718J559p728O4868M4791
16307F4610K7501m1387Q619p0903o9266R2721K6827j0666R945L7733m62m5852
16295B9420P4282J00777n3237j37151j32047l0116L9858r675J64775M4471L2894
16284A24251M5566K9605m3045r2142j98M1555j5762p749L0355j34945j5626J4252
16272b3883M2137N1105K3281m4277K5492N6394n9230K1806r60p711q1221p346
16260d413M3542N495m3982r672J0979N7460P268n0129J4104N3246L67k8347m6186
16247I732P1675L3524j34292n7230Q977O945l2811Q51K0715P9553j0762J4358
$$ plain form
16235 11235 87579 56573 131373 119890 -14282 -123602 -119116 -30967 31177 47443 -43785
16224 -43785 39140 122405 108644 -27320 -43678 -97582 -140656 -35868 -59624 -51464 -35911
16213 -35911 -82380 -100775 -72164 46808 11272 58701 102068 65991 23715 81998 21928
16202 21928 -18542 -88109 -122201 -66808 -8646 63455 144186 265483 293499 240635 183481
16191 183481 40110 -41654 48390 130258 168963 57854 111136 53707 -5881 -30218 -88381
16180 -88381 -7011 84727 119278 23099 41836 93963 62287 63719 -10950 -124876 -167350 -83692
16168 -83692 -2676 4532 -47101 -5944 53352 103492 110669 -2848 -66930 -48425 -205710 -205928
16156 -205928 -199525 -148459 -89928 -61433 36586 58538 69915 79698 104308 72315 -6844 -94103
$$ packed form
16235A1235P6344l1006P4800j1483j34172j09320M486Q8149O2144J6266r1228
16224d3785Q2925Q3265j3761j35964j6358n3904m3074J04788k3756Q160J5553
16213c5911m6469j8395K8611J18972l5536M7429M3367l6077m2276N8283o0070
16202B1928m0470o9567l4092N5393N8162P2101Q0731J21297K8016n2864n7154
16191A83481j43371q1764R0044Q1868L8705j11109N3282n7429n9588k4337n8163
16180h8381Q1370R1738L4551r6179J8737N2127l1676J432p4669j13926m2474Q3658
16168h3692Q1016P208n1633M1157N9296N0140P177j13517o4082J8505j57285k18
16156b05928O403N1066N8531K8495R8019K1952J1377R783K4610l1993p9159q7259
$$ plain form
16144 -94103 -101722 -149483 -175051 -194881 -184443 -164821 -150667 -95975 -7537 44169 22542 32078
16132 32078 -33539 -5624 99947 83692 5268 -9612 -161058 -130988 -45026 -12473 -34849
16121 -34849 -42335 -14800 14762 3830 -10088 -3991 -70948 -39707 -68109 -114802 -81539 -11822
16109 -11822 -49599 -84970 -105807 -111721 -169558 -214491 -156900 -165090 -93740 -118259 -80808 -56623
16097 -56623 -57412 -64989 -31461 10767 -25766 -82881 -52155 39553 23019 -8831 -62267 -58221
16085 -58221 -19840 1586 5341 45143 101798 154804 156290 -7807 -75111 -24485 -4006 -77094
16073 -77094 -75874 -44710 19436 -74980 -36566 44934 -88328 -149318 -108690 -67213 31912 6270
16061 6270 87388 102102 52659 -63315 8185 -8269 -126237 -213317 -173874 -79333 -64999
$$ packed form
16144i4103p619m7761k5568j9830J0438J9622J4154N4692Q8438N1706k1627R536
16132C2078o5617K7915J05571j6255p8424j4880j51446L0070Q5962L2553k2376
16121c4849p486K7535K9562j0932j3918O097o6957L1241k8402m6693L3263O9717
16109a1822l7777l5371k0837n914n7837m4933N7591q190P1350k4519L7451K4185
16097e6623p89p577L3528M2228l6533n7115L0726R1708j6534l1850n3436M046
16085e8221L8381K1426L755L9802N6655N3006J486j64097o7304N0626K0479p3088
16073g7094J220L1164O4146r4416L8414Q1500j33262o0990M0628M1477R9125k5642
16061F270Q1118J4714m9443j15974P1500j6454j17968q7080L9443R4541J4334
$$ plain form
16050 -64999 -78221 -104323 -110014 -180406 -231491 -158807 -118098 -133475 -20729 -3328 -66702 -131172
16038 -131172 -98565 -13592 -44798 -33143 -63254 1810 2542 64034 125113 19914 -29410 19358
16026 19358 55388 119380 36003 -10134 45710 36657 -37031 -140510 -128123 -83591 -152126 -235139
16014 -235139 -239143 -282442 -254441 -161631 -215346 -205658 -158038 -85253 -76373 -91924 -86137 -27441
16002 -27441 69130 145789 125027 117651 54391 31693 87158 33030 -4522 -7151 54338 120988
15990 120988 72359 47045 16453 -36808 -64830 -121728 -115226 -27001 -14739 -8369 -69297 -147399
15978 -147399 -121461 -55829 -36204 -28872 45116 -70719 -115664 -72380 -54913 -37029 -37761 10379
15966 10379 87879 -2231 -10045 -11140 63954 116692 67623 15663 35538 88389 42571 -52012
$$ packed form
16050f4999j3222k6102n691p0392n1085P2684M0709j5377J12746J7401o3374o4470
16038a31172L2607Q4973l1206J1655l0111O5064P32O1492O1079j05199m9324M8768
16026A9358L6030O3992q3377m6137N5844r053p3688j03479J2387M4532o8535q3013
16014b35139m004m3299K8001R2810n3715R688M7620P2785Q880j5551N787N8696
16002b7441R6571P6659k0762p376o3260k2698N5465n4128l7552k629O1489O6650
15990A20988m8629k5314l0592n3261k8022n6898O502Q8225J2262O370o0928p8102
15978a47399K5938O5632J9625P332P3988j15835m4945M3284J7467J7884p32M8140
15966A0379P7500r0110p814j095P5094N2738m9069n1960J9875N2851m5818r4583
$$ plain form
15954 -52012 -126288 -65899 -53784 -71608 -19034 14383 1595 -25903 -99051 -66234 84037
15943 84037 130116 85266 -3983 -59093 -65352 -60393 -75995 -126354 -107506 -121318 -106114 -74195
15931 -74195 -18538 -18725 4286 68157 32310 -5605 -61778 -113065 -60869 33913 96405 146926
15919 146926 75412 20415 39013 55589 -6764 -37484 1871 -55922 -172720 -149524 -168946
15908 -168946 -155701 -130282 -168461 -156831 -96200 -68254 -167839 -187379 -173458 -87986 -14573
15897 -14573 35261 27007 -6496 -60667 -123716 -157431 -101449 -99978 -153356 -139453 -143079 -93916
15885 -93916 -81061 -106769 -35135 -3834 -46247 17363 7891 -57278 -13531 49827 37521 98048
15873 98048 105711 13858 -14731 -40662 -7825 -37872 -58830 -104982 -58538 23083 58773 -24675
$$ packed form
15954e2012p4276O0389J2115j7824N2574L3417j2788k7498p3148L2817J50271
15943H4037M6079m4850q9249n5110o259M959j5602n0359J8848j3812J5204L1919
15931g4195N5657j87K3011O3871l5847l7915n6173n1287N2196R4782O2492N0521
15919A46926p1514n4997J8598J6576o2353l0720L9355n7793j16798K3196j9422
15908a68946J3245K5419l8179J1630O0631K7946r9585j9540J3921Q5472P3413
15897a4573M9834q254l3503n4171o3049l3715N5982J471n3378J3903l626M9163
15885i3916J2855k5708P1634L1301m2413O3610r472o5169M3747O3358j2306O0527
15873I8048P663r1853k8589k5931L2837l0047k0958m6152M6444Q1621L5690q3448
$$ plain form
15861 -24675 -79601 -88034 -15313 -44919 -96974 -54350 -107705 -236456 -144623 -44280 -35831 52123
15849 52123 93443 86345 65140 -12189 5707 105396 111032 -23160 -129996 -77539 19655 -18472
15837 -18472 -51836 -74683 -70571 -105749 -168925 -223457 -139969 -127220 -138943 -100058 -57646 -45571
15825 -45571 -79170 -122870 76476 166278 86226 126911 118996 -76572 -86508 -30859 186577
15814 186577 189558 80381 39086 -38495 -46978 30060 48287 39340 173256 205630 156169 156732
15802 156732 98527 72057 67459 105660 52102 -48730 -17422 17394 -5603 4802 -29963
15791 -29963 35395 87836 60719 -22990 -9231 25516 114494 150405 112884 64154 -34368 -82002
15779 -82002 -154557 -155657 -110471 -119067 -109653 -125247 -85547 -82478 -61444 -33191 -20594 -8252
$$ packed form
15861b4675n4926q433P2721k9606n2055M2624n3355j28751R1833J00343Q449Q7954
15849E2123M1320p098k1205p7329J7896R9689N636j34192j06836N2457R7194l8127
15837a8472l3364k2847M112l5178o3176n4532Q3488J2749j1723L8885M2412J2075
15825d5571l3599m3700J99346Q9802q0052M0685p915j95568r936N5649K17436
15814A86577K981j09177m1295p7581q483P7038J8227q947J33916L2374m9461N63
15802A56732n8205k6470m598L8201n3558j00832L1308L4816k2997J0405l4765
15791b9963O5358N2441k7117q3709J3759L4747Q8978L5911l7521m8730r8522m7634
15779h2002p2555j100M5186q596R414j5594L9700L069K1034K8253J2597J2342
$$ plain form
15767 -8252 56202 85954 86168 13261 -20397 60658 -282 -40553 22669 20355 5450 21707
15755 21707 -89481 -145204 -58975 63681 48284 97515 63620 25487 -53339 9083 57335
15744 57335 -15765 -87163 -223945 -246743 -252810 -208730 -95193 41990 98733 93796 77245
15733 77245 52311 -44823 -23922 28946 -1692 -73700 -6659 26968 -13916 -53570 -17210 32387
15721 32387 65882 88574 91475 99584 -2130 -60860 -130024 -141835 -170720 -126422 -64844 -30360
15709 -30360 -14467 -144076 -134479 -152906 -230734 -200215 -126252 -124157 -24262 25811 -55087 -137297
15697 -137297 -108933 -140260 -107350 -77254 -67440 -66799 -102896 -191601 -105648 1598 -19110 -44541
15685 -44541 80960 105817 -7196 -15188 -75065 -81381 19022 93258 23656 -26684 -72703
$$ packed form
15767h252O4454K9752K14p2907l3658Q1055o0940m0271O3222k314j4905J6257
15755B1707j11188n5723Q6229J22656j5397M9231l3895l8133p8826O2422M8252
15744E7335p3100p1398j36782k2798o067M4080J13537J37183N6743m937j6551
15733G7245k4934r7134K0901N2868l0638p2008O7041L3627m0884l9654L6360M9597
15721C2387L3495K2692K901Q109j01714n8730o9164j1811k8885M4298O1578L4484
15709c0360J5893j29609R597j8427p7828L0519P3963K095R9895N0073q0898q2210
15697a37297K8364l1327L2910L0096R814O41l6097q8705Q5953J07246k0708k5431
15685d4541J25501K4857j13013p992n9877o316J00403P4236o9602n0340m6019
$$ plain form
15674 -72703 -141333 -196580 -177642 -260699 -233019 -266238 -115055 370 -132620 -95310 -7187
15663 -7187 9133 -6451 -45749 -25164 33493 56600 76373 8383 -44020 -40866 44473 155048
15651 155048 134557 1486 21992 21516 58902 85511 87203 162519 150811 147533 77730 49485
15639 49485 -7467 -38406 -114454 -33599 -7660 27368 60699 99273 38637 -15726 -24542 38165
15627 38165 -31639 -124972 -123988 -117656 -165857 -90755 -42692 48013 29227 -73911 -75246 76740
15615 76740 128613 152462 170460 177906 73860 12952 -128040 -177328 -44698 7692 23181
15604 23181 -18502 -53987 -64354 -64871 -48000 -110550 -59026 64951 117701 139690 81790 26031
15592 26031 25787 99256 242721 179802 168330 136822 169985 198429 98198 -59251 -116337
$$ packed form
15674g2703o8630n5247J8938q3057K7680l3219J51183J15425j32990L7310Q8123
15663g187J6320j5584l9298K0585N8657K3107J9773o7990n2403L154Q5339J10575
15651A55048k0491j33071K0506m76L7386K6609J692P5316j1708l278o9803k8245
15639D9485n6952l0939p6048Q0855K5939L5028L3331L8574o0636n4363q816O2707
15627C8165o9804r3333R84O332m8201P5102M8063R0705j8786j03138j335J51986
15615G6740N1873K3849J7998P446j04046o0908j40992m9288J32630N2390J5489
15604B3181m1683l5485j0367n17J6871o2550N1524J23977N2750K1989n7900n5759
15592B6031k44P3469J43465o2919j1472l1508L3163K8444j00231j57449n7086
$$ plain form
15581 -116337 -131937 -119503 -108151 -44976 -145772 -87217 51347 166760 170535 158408 90455
15570 90455 73775 124537 150139 59253 159666 224495 184355 215143 198569 154885 78482
15559 78482 3791 -110481 -158442 -164783 -87447 28108 68822 76952 2066 -86192 -159082 -132304
15547 -132304 -31665 -116376 -78568 -24165 -23240 38894 170034 193657 225258 205421 122737
15536 122737 69404 30736 -47937 -63824 -20880 11089 -75515 382 110502 115571 143767
15525 143767 157391 108764 78529 67536 31301 -35387 62805 70648 13237 -28946 31971 1420
15513 1420 -43778 122674 159235 69526 114636 115612 13952 -12792 7966 31684 22216 -21412
15501 -21412 -6512 31901 18332 50644 41538 1832 31862 167398 316948 253338 124707
$$ packed form
15581a16337j5600J2434J1352O3175j00796N8555J38564J15413L775j2127o7953
15570I0455j6680N0762K5602r0886J00413O4829m0140L0788j6574m3684p6403
15559G8482p4691j14272m7961o341P7336J15555M0714Q130p4886q8258p2890K6778
15547a32304J00639q4711L7808N4403R25O2134J31140K3623L1601j9837q2684
15536A22737n3333l8668p8673j5887M2944L1969q6604P5897J10120N069K8196
15525A43767J3624m8627l0235j0993l6235o6688R8192P843n7411m2183O0917l0551
15513A420m5198J66452L6561q9709M5110R76j01660k6744K0758K3718r468m3628
15501b1412J4900L8413j3569L2312r106l9706L0030J35536J49550o3610j28631
$$ plain form
15490 124707 85442 2656 -39288 -46489 23461 74874 151665 181901 137968 164307 224134 156793
15478 156793 130237 149673 49735 -43815 -10569 57965 137918 166940 70435 54268 8204
15467 8204 8194 128086 163575 172559 196856 153778 83591 89549 44216 47086 49256 109401 48351
15454 48351 30620 68563 13680 -9186 24923 63792 -4234 -101146 -39023 26133 55657 92461
15442 92461 101454 119571 134937 77337 -19613 -40465 72279 99791 86158 48660 46186 22723
15430 22723 48002 10923 2838 -29633 -39601 -23985 -10845 -49461 -62952 -39349 -76716 -73424
15418 -73424 -22649 -43466 -26143 -74689 -102669 -72672 -18340 -62302 -61509 14905 46754 30403
15406 30403 -40451 37950 28583 -25550 -58793 -35954 -30132 -63598 36832 73973 27379 22011
$$ packed form
15490A24707l9265q2786m1944p201O9950N1413P6791L0236m3933K6339N9827o7341
15478A56793k6556J9436r9938r3550L3246O8534P9953K9022r6505j6167m6064
15467H204j0J19892L5489Q984K4297m3078p0187N958m5333K870K170O0145o1050
15454D8351j7731L7943n4883k2866L4109L8869o8026r6912O2123O5156K9524L6804
15442I2461Q993J8117J5366n7600r6950k0852J12744K7512j3633l7498k474k3463
15430B2723K5279l7079q085l2471r968J5616J3140l8616j3491K3603l7367L292
15418g3424N0775k0817J7323m8546k7980K9997N4332m3962P93P6414L1849j6351
15406C0403p0854P8401r367n4133l3243K2839N822l3466J00430L7141m6594n368
$$ plain form
15394 22011 44825 -13917 -40417 -16922 51587 145080 63452 36272 62488 20638 -91343
15383 -91343 -137761 -112956 -117495 13769 81116 91157 102013 77330 14386 -56827 76388
15372 76388 132463 120841 34576 14160 33494 88266 26476 47602 70485 49660 -20353 -141162
15360 -141162 -96289 -663 15602 4988 -3356 -65739 -87817 -63809 34257 55238 -3721 -78195
15348 -78195 -100702 -103834 -85641 -38023 -30668 -46799 4254 -3882 49133 31641 -32996 -19646
15336 -19646 80228 88667 140439 120559 118720 125902 101711 37028 45978 40954 81201 116408 109672
15323 109672 86214 122465 118162 31638 -63635 -78024 -81428 -72096 -55419 -12817 -112118 -67873
15311 -67873 -126445 -123714 -61444 -60136 12476 -22814 -63112 -38463 -40045 -9136 -35232 -82269
$$ packed form
15394B2011K2814n8742k6500K3495O8509R3493q1628k7180K6216m1850j11981
15383i1343m6418K4805m539J31264O7347J0041J0856k4683o2944p1213J33215
15372G6388N6075j1622q6265k0416J9334N4772o1790K1126K2883k0825p0013j20809
15360a41162M4873R5626J6265j0614q344o2383k2078K4008R8066K0981n8959p4474
15348g8195k2507l132J8193M7618P355j6131N1053q136N3015j7492o4637J3350
15336a9646R9874Q439N1772j9880j839P182k4191o4683Q950n024M0247L5207o736
15323A09672k3458L6251m303q6524r5273j4389l404R332J6677M2602r9301M4245
15311f7873n8572K731O2270J308P2612l5290m0298K4649j582L0909k6096m7037
$$ plain form
15299 -82269 8533 103526 128774 85777 -15001 -125776 -171612 -166955 -106093 -91360 -79622
15288 -79622 -7587 25200 97736 92041 76748 59563 89487 100686 57831 59235 43901 5537
15276 5537 20537 69971 56294 66276 35557 31597 97355 36683 2166 9856 40572 32646 -18603
15263 -18603 -151469 -126378 -158263 -129632 -51446 -26271 -43205 -105545 -99962 -107546 -62722 21959
15251 21959 151075 140917 27665 -137454 -163138 -94056 -49758 26187 25902 18841 -37749 -84585
15239 -84585 18197 -32485 -121767 -106754 12955 60658 91303 126386 144661 36162 -696
15228 -696 22801 47271 -45021 -67794 1000 -41994 -67164 -22944 -50347 -26851 29759 10598
15216 10598 -9909 -37170 -50897 -207426 -158814 -140650 -157165 -82156 -34470 -3240 80660
$$ packed form
15299h2269R0802R4993K5248m2997j00778j10775m5836M657O0862J4733J1738
15288g9622P2035L2787P2536n695j5293j7185K9924J1199m2855J404j5334l8364
15276E537J5000M9434j3677R982l0719l960O5758o0672l4517P690L0716p926n1249
15263a8603j32866K5091l1885K8631P8186K5175j6934o2340N583p584M4824Q4681
15251B1959J29116j0158j13252j65119k5684O9082M4298P5945k85p061n6590m6836
15239h4585J02782n0682q9282J5013J19709M7703L0645L5083J8275j08499l6858
15228f96K3497K4470r2292k2773O8794m2994k5170M4220k7403K3496N6610j9161
15216A0598k0507k7261j3727j56529M8612J8164j6515P5009M7686L1230Q3900
$$ plain form
15205 80660 179004 170143 30083 16433 -19459 12155 69199 132807 115572 83903 114552 7877
15193 7877 -14064 54720 -545 -24321 -19352 -115175 -186897 -57216 4622 -48869 -84916 -98456
15181 -98456 -143732 -126491 1529 142532 92955 7751 -25705 -12385 -23492 -18533 -76920
15170 -76920 -56582 -105417 -58153 7494 -9790 -16441 -90998 3849 12834 -22388 -56206 -15799
15158 -15799 -26927 -48625 -80613 -124783 -139282 -95967 -48074 -74351 5037 -37786 802 85920
15146 85920 104656 75961 1200 -63947 -25283 -43101 -43360 -2328 -22149 -50124 -10082 32938
15134 32938 -6868 -30991 -77336 -39222 -8268 -20936 -63285 -78642 7378 -55426 -67820 -54229
15122 -54229 -11464 -11101 15338 -10067 -30366 -65660 -145383 -147728 -72025 16388 -57345 -80442
$$ packed form
15205H0660R8344q861j40060j3650l5892L1614N7044O3608j7235l1669L0649j06675
15193G877k1941O8784n5265k3776M969r5823p1722J29681O1838n3491l6047j3540
15181i8456m5276J7241J28020J41003m9577q5204l3456J3320j1107M959n8387
15170g6920K0338m8835M7264O5647j7284o651p4557R4847Q985l5222l3818M0407
15158a5799j1128k1698l1988m4170j4499M3315M7893k6277P9388m2823L8588Q5118
15146H5920J8736k8695p4761o5147L8664j7818k59M1032j9821k7975M0042M3020
15134C2938l9806k4123m6345L8114L0954j2668m2349j5357Q6020o2804j2394J3591
15122e4229M2765L63K6439k5405k0299l5294p9723k345P5703Q8413p3733k3097
$$ plain form
15110 -80442 17959 41700 61130 130108 86161 -4335 -1535 31701 61926 135018 142809 104542
15098 104542 61320 73706 68122 92586 139060 197097 220061 110973 -109314 -88358 -2501
15087 -2501 44695 41874 -5313 -65723 -95779 -122362 -54067 14678 -31574 -53617 -89766 -102661
15075 -102661 -121699 -11539 111628 44504 99687 117108 -8358 -88054 -134188 -86876 -59397
15064 -59397 -70614 -146456 -127226 -35256 -34504 -14363 -39256 -53667 -63629 -51714 57548 87270
15052 87270 51544 52532 29606 -61000 -3782 30269 28795 -46457 -57746 -2042 15800 13283
15040 13283 -53735 -89688 -67162 -82358 -89663 -42394 -33864 -65190 -36386 -50371 47634 78259
15028 78259 37400 82259 37951 -4798 -13115 17057 -51523 -98862 -119217 -124578 -124031 -96740
$$ packed form
15110h0442R8401K3741J9430O8978m3947r0496K800L3236L0225P3092P791l8267
15098A04542m3222J2386n584K4464M6474N8037K2964j09088k20287K0956Q5857
15087b501M7196k821m7187o0410l0056k6583O8295O8745m6252k2043l6149j2895
15075a02661j9038J10160J23167o7124N5183J7421j25466p9696m6134M7312K7479
15064e9397j1217p5842J9230R1970P52K0141k4893j4411r962J1915J09262K9722
15052H7270l5726R88k2926r0606N7218L4051j474p5252j1289N5704J7842k517
15040A3283o7018l5953K2526j5196p305M7269Q530l1326K8804j3985R8005L0625
15028G8259m0859M4859m4308m2749q317L0172o8580m7339k0355n361N47K7291
$$ plain form
15016 -96740 -10814 78047 -8823 -9469 -26933 -17265 -129851 -236102 -135493 -67178 -11034 -41440
15004 -41440 -15497 -62316 -81408 -126047 -152063 -229777 -219537 -223698 -152123 -49459 -70364 -125521
14992 -125521 -73381 -116685 -162742 -79916 -24194 -6557 68698 64914 -38463 -17902 -44640
14981 -44640 -187311 -147225 -93827 31546 151897 111337 -59747 -177012 -185089 -120221 -128765
14970 -128765 -158163 -85375 -59829 -68910 -111889 -59653 -12736 -63624 -114970 -141008 -184878 -144206
14958 -144206 -80834 -71218 -224606 -331731 -244710 -169310 -89370 -63183 -11184 35861 23966
14947 23966 -127850 -143080 -93528 -52080 -46168 -39104 -51179 -90236 -68587 22840 -4449 9803
14935 9803 10490 -12320 -48534 -1887 10870 -106252 -150330 -104093 -32024 -64859 -123605 -104342
$$ packed form
15016i6740Q5926Q8861q6870o46j7464R668j12586j06251J00609O8315N6144l0406
15004d1440K5943m6819j9092m4639k6016p7714J0240m161P1575J02664k0905n5157
14992a25521N2140m3304m6057Q2826N5722J7637P5255l784j03377K0561k6738
14981d4640j42671M0086N3398J25373J20351m0560j71084j17265q077O4868q544
14970a28765k9398P2788K5546r081m2979N2236M6917n0888n1346k6038m3870M0672
14958a44206O3372R616j53388j07125Q7021P5400P9940K6187N1999M7045j1895
14947B3966j51816j5230M9552M1448N912P064j2075l9057K1649R1427k7289J4252
14935I803O87k2810l6214M6647J2757j17122m4078M6237P2069l2835n8746J9263
$$ plain form
14923 -104342 -66801 -29129 -1781 -8120 -55947 -47915 -49078 94231 101348 -22086 -58112 -58458
14911 -58458 -70110 -34492 -33534 22726 61337 63124 100561 35669 -14228 20099 29624 -32343
14899 -32343 -69949 -32847 -43207 -17673 2977 -76513 -194233 -255081 -188105 -78194 27436
14888 27436 16563 -20872 24139 28384 4647 -42573 -131717 -84043 6172 -44660 -23416 47398
14876 47398 82732 -2071 -90303 -140459 -107305 -66715 -82572 6359 -7268 -89926 -83034 -39964
14864 -39964 -17407 -73679 -21551 -18224 -78702 -44224 80637 43911 50505 118055 108216 89146
14852 89146 79698 -32608 -98752 -75352 -54020 27713 -47408 -37956 66812 33078 -23205 -71944
14840 -71944 -118029 -35286 48621 25644 44254 90392 88481 185073 144488 -19635 -53605 -18402
$$ packed form
14923a04342L7541L7672K7348o339m7827Q032j163J43309P117j23434l6026l46
14911e8458j1652L5618R58N6260L8611J787L7437o4892m9897L4327R525o1967
14899c2343l7606L7102j0360K5534K0650p9490j17720o0848O6976J09911J05630
14888B7436j0873l7435M5011M245k3737m7220q9144M7674R0215n0832K1244P0814
14876D7398L5334q4803q8232n0156L3154M0590j5857Q8931j3627q2658O892M3070
14864c9964K2557n6272N2128L327o0478L4478J24861l6726O594O7550r839j9070
14852H9146r448j12306o6144K3400K1332Q1733p5121R452J04768l3734n6283m8739
14840g1944m6085Q2743Q3907k2977J8610M6138j911R6592m0585j64123l3970L5203
$$ plain form
14828 -18402 24138 33250 87228 121565 86381 34331 10692 -49014 -91104 -125814 -110593 -97145
14816 -97145 -149613 -43718 69171 146279 37769 -89349 -112297 -57665 -99359 -60368 31066
14805 31066 -3930 -134956 -107401 -37127 -12904 -84514 -86188 8854 33804 115417 72251 -956
14793 -956 93268 119199 122328 165863 168111 187318 183087 112900 102228 88281 -15713 -152815
14781 -152815 -190352 -226058 -159952 -111260 -113124 -93015 -18547 -66306 -143584 -73986 -68341 -188322
14769 -188322 -193758 -120217 -156457 -94664 87386 101105 -14484 -84400 4690 105940 127568
14758 127568 23922 21249 -19567 42984 56084 -1596 8072 84261 57652 20828 46101 -55794
14746 -55794 -94404 -2168 -10946 -61879 -21077 25022 -43 -16762 126111 147029 121638 89725
$$ packed form
14828a8402M2540R112N3978L4337l5184n2050k3639n9706m2090l4710J5221J3448
14816i7145n2468J05895J12889P7108j08510j27118k2948N4632m1694L8991R1434
14805C1066l4996j31026K7555P0274K4223p1610j674R5042K4950Q1613m3166p3207
14793i56R4224K5931L129M3535K248J9207m231p0187j0672j3947j03994j37102
14781a52815l7537l5706O6106M8692j864K0109P4468m7759p7278O9598N645j19981
14769a88322n436P3541l6240O1793J82050J3719j15589o9916Q9090J01250K1628
14758A27568j03646k673m0816O2551J3100n7680R668P6189k6609l6824K5273j01895
14746e5794l8610R2236q778n0933M0802M6099k5065j6719J42873K0918k5391l1913
$$ plain form
14734 89725 53766 47811 10913 7642 -30762 -78326 -16835 8612 -55299 -161604 -70544 13146
14722 13146 79543 50138 43940 15535 40993 47586 86734 140725 93928 164522 101085 24329
14710 24329 153210 154825 122125 -11062 -87664 -118264 -86773 1879 -6909 -121265 -103821
14699 -103821 -33322 37624 67108 67497 44235 76171 154237 239536 181102 85035 -15857 -34184
14687 -34184 -51022 -67844 -123133 -47540 24555 154565 189527 164820 131736 149923 170132
14676 170132 100026 -24256 -44981 -16649 -50351 12075 27945 -10032 -111013 10387 130012
14665 130012 132644 172440 219822 114578 16805 -21625 -36456 -15741 -131143 -162996 -188329
14654 -188329 -136759 -66724 -107124 -101113 -160725 -131611 -90194 -145484 -116939 -38005 -22326 -47317
$$ packed form
14734H9725l5959n955l6898l271l8404m7564O1491K5447o3911j06305R1060Q3690
14722A3146O6397k9405o198k8405K5458O593L9148N3991m6797P0594o3437p6756
14710B4329J28881J615l2700j33187p6602l0600L1491Q8652q788j14356J7444
14699a03821P0499P0946K9484L89k3262L1936P8066Q5299n8434r6067j00892j8327
14687c4184j6838j6822n5289P5593P2095J30010L4962k4707l3084J8187K0209
14676A70132p0106j24282k0725K8332l3702O2426J5870l7977j00981J21400J19625
14665A30012K632L9796M7382j05244r7773l8430j4831K0715j15402l1853k5333
14654a88329N1570P0035m0400O011n9612K9114M1417n5290K8545P8934J5679k4991
$$ plain form
14642 -47317 12171 33050 72543 31734 -13884 -41104 -114215 -169958 -222939 -258863 -230950 -232693
14630 -232693 -229282 -226404 -203890 -139666 -102492 -64052 -79180 -97633 -60566 -110411 -214531 -167331
14618 -167331 -31548 29548 -62744 -30977 -16399 66469 117515 99038 44153 -43753 -152069
14607 -152069 -185426 -134078 -150523 -143159 -159070 -231211 -241639 -157700 -77318 -56120 -126150 -153641
14595 -153641 -114697 -56008 -4589 315 95976 69998 6529 -13326 -16093 -43628 -65904 -61599
14583 -61599 -83990 -90806 -58416 66175 52282 16850 18089 3798 -22667 53342 13789 -57983
14571 -57983 728 26331 40349 37040 -33211 -54583 -22609 50711 48669 61446 109806 52913
14559 52913 -68715 -38922 -7143 80420 90223 109504 9203 -91404 -79997 -10929 -69357
$$ packed form
14642d7317N9488K0879L9493m0809m5618k7220p3111n5743n2981l5924K7913j743
14630b32693L411K878K2514O4224L7174L8440j5128j8453L7067m9845j04120M7200
14618a67331J35783O1096r2292L1767J4578Q2868N1046j8477n4885q7906j08316
14607a52069l3357N1348j6445P364j5911p2141j0428Q3939Q0382K1198p0030k7491
14595a53641L8944N8689N1419M904R5661k5978o3469j9855k767k7535k2276M305
14583f1599k2391o816L2390J24591j3893l5432J239j4291k6465P6009l9553p1772
14571e7983N8711K5603J4018l309p0251k1372L1974P3320k042J2777M8360n6893
14559E2913j21628K9793L1779Q7563R803J9281j00301j00607J1407O9068n8428
$$ plain form
14548 -69357 60768 80149 30101 -17366 18856 70905 97170 22355 -89871 -156535 -120697
14537 -120697 -14878 19227 -106861 -151831 -83177 101762 99769 15345 23714 43536 42558 25987
14525 25987 58995 71698 34407 -31598 -78351 -90380 -80477 -20155 27260 -14446 -29353 -121443
14513 -121443 -170877 -157657 -143900 -71287 -14733 65066 187518 158594 31398 -35193 -43362
14502 -43362 -44774 17799 5448 -22111 4196 3364 -69652 -65410 -32543 -89676 -11709 -48885
14490 -48885 -153478 -114448 -138608 -121053 -74096 -96104 -83546 -100265 -45336 -32441 -57303
14479 -57303 -19791 -48439 -65235 -34898 32472 68691 111527 96931 71229 100067 127258 128403
14467 128403 110900 29572 29161 44555 81656 115286 53330 94384 11591 -14056 -80762 -63879
$$ packed form
14548f9357J30125J9381n0048m7467L6222N2049K6265p4815j12226o6664L5838
14537a20697J05819L4105j26088m4970O8654J84939j993q4424Q369J9822r78j6571
14525B5987L3008J2703l7291o6005m6753j2029R903O0322M7415m1706j4907r2090
14513a21443m9434J3220J3757P2613N6554P9799J22452k8924j27196o6591q169
14502d3362j412O2573j2351k7559K6307q32p3016M242L2867n7133P7967l7176
14490d8885j04593L9030k4160J7555M6957k2008J2558j6719N4929J2895k4862
14479e7303L7512k8648j6796L0337O7370L6219M2836j4596k5702K8838K7191J145
14467A28403j7503q1328m11J5394L7101L3630o1956M1054q2793k5647o6706J6883
$$ plain form
14455 -63879 34397 12602 10073 -105554 -177138 -184888 -223921 -139880 -106861 -58695 -12181 -34995
14443 -34995 -59652 -126765 -180455 -157541 -47224 -15006 -14136 -62927 -86843 -55318 -147735 -220986
14431 -220986 -122163 -113918 -103790 -202107 -212480 -62419 -19234 -143839 -75110 27022 5672
14420 5672 29899 70235 64299 5625 -51639 -56185 -60262 -40982 106350 88122 -30920 16048
14408 16048 112248 91591 38522 -64669 -88258 -97788 -148979 -167482 -202088 -172184 -146085 -110877
14396 -110877 -11317 24574 37175 -23077 -112098 -187711 -145163 -154514 15735 86979 -21012
14385 -21012 -10548 -23440 -30888 -52427 -84180 -66227 -9822 -15760 -65485 -82112 -18301 -37654
14373 -37654 -11909 86865 114058 162331 52406 21134 56424 74150 -10788 -43965 -21689
$$ packed form
14455f3879R8276k1795k529j15627p1584p750l9033Q4041L3019M8166M6514k2814
14443c4995k4657o7113n3690K2914J10317L2218Q70m8791k3916L1525r2417p3251
14431b20986R8823Q245J0128r8317j0373J50061M3185j24605O8729J02132k1350
14420E672K4227M0336n936n8674n7264m546m077J9280J47332j8228j19042M6968
14408A6048R6200k0657n3069j03191k3589r530n1191j8503l4606K9904K6099L5208
14396a10877R9560L5891J2601o0252q9021p5613M2548r351J70249P1244j07991
14385b1012J0464j2892p448k1539l1753J7953N6405n938m9725j6627O3811j9353
14373c7654K5745R8774K7193M8273j09925l1272L5290J7726q4938l3177K2276
$$ plain form
14362 -21689 -61580 -54899 -57834 -120154 -113705 -128965 -165134 -131493 -14236 9065 -17725 -75448
14350 -75448 -75449 -129375 -53634 -82726 -107713 22014 42144 -57933 -46304 -27908 55569 123287
14338 123287 41375 14964 6329 -78892 -69640 -147209 -139464 -126876 -179074 -143860 -60501 -13077
14326 -13077 42740 90952 81091 113874 124083 216064 303887 181788 60305 46819 -7031
14315 -7031 -1652 -11089 -19343 -116499 -145698 -180680 -172982 -1640 26190 -28622 16083 -26148
14303 -26148 -35301 -122297 -154767 -43214 -29957 -2453 47584 -9694 -66475 -78935 -110887 -64116
14291 -64116 6545 114545 113968 74570 95235 73931 7150 -46169 30779 51288 -23583 29951
14279 29951 30671 -23952 -36567 -44800 -123063 -164372 -168948 -107515 34433 90237 31476 31099 4428
$$ packed form
14362b1689l9891O681k935o2320O449j5260l6169L3641J17257K3301k6790n7723
14350g5448jn3926P5741k9092k4987J29727K0130j00077J1629J8396Q3477O7718
14338A23287q1912k6411q635q5221R252p7569P745J2588n2198L5214Q3359M7424
14326a3077N5817M8212r861L2783J0209R1981Q7823j22099j21483j3486n3850
14315g031N379r437q254r7156k9199l4982P698J71342K7830n4812M4705m2231
14303b6148r153q6996l2470J11553J3257K7504N0037n7278n6781j2460l1952M6771
14291f4116P0661J08000n77l9398K0665k1304o6781n3319P6948K0509p4871N3534
14279B9951P20n4623j2615q233p8263m1309m576O1433J41948N5804n8761l77k6671
$$ plain form
14266 4428 76122 131058 129334 -9595 -57115 -2366 55270 -4971 82625 214287 150763 -45331
14254 -45331 -49255 13524 -11581 14283 25073 35216 67215 93662 59846 -50420 -100588 -72871
14242 -72871 -46244 -117162 -186161 -128600 -51387 -28079 -133218 -141696 -132176 -137184 -83724 -28302
14230 -28302 -89632 -26452 6764 12126 -564 21922 27106 53973 -33507 12405 35023 -47441
14218 -47441 -65049 -47298 -30154 -8728 -41276 -11257 6961 31134 -36102 -46832 -4598 56375
14206 56375 40608 82055 152185 84608 112313 54558 20681 -6128 -122618 -135033 -67219
14195 -67219 31344 53132 31993 -52867 35759 129362 53869 -116590 -107093 -59178 -18991 -73756
14183 -73756 -71206 -74286 -39847 34423 96076 155172 116104 38953 -13371 -3917 36060 52537
$$ packed form
14266D428P1694N4936j724j38929m7520N4749N7636o0241Q7596J31662o3524j96094
14254d5331l924O2779k5105K5864J0790J0143L1999K6447l3816j10266n0168K7717
14242g2871K6627p0918o8999N7561P7213K3308j05139q478R520n008N3460N5422
14230b8302o1330O3180L3216N362j2690K2486N184K6867q7480M5912K2618q2464
14218d7441j7608J7751J7144K1426l2548L0019J8218K4173o7236j0730M2234O0973
14206E6375j5767M1447P0130o7577K7705n7755l3877k6809j16490j2415O7814
14195f7219R8563K1788k1139q4860Q8626R3603p5493j70459R497M7915M0187n4765
14183g3756K550l080L4439P4270O1653N9096l9068p7151n2324R454L9977J6477
$$ plain form
14171 52537 -10916 -28882 -59045 -12585 8787 -520 3583 -829 -5636 -21810 41096 64570
14159 64570 -8410 -10171 48593 20529 -65835 -43453 -5997 -77688 -90275 -78836 -66396 -51278
14147 -51278 -57505 69774 71169 47252 67180 65290 85996 49673 -42 2808 2463 -14548 9475
14134 9475 -79579 -130234 -131066 -91249 -45936 13334 60310 30093 35662 87934 -20447 -56369
14122 -56369 -66577 -158463 -138375 -51637 -51339 -42312 -106067 -158854 -114763 -132561 -62865 10844
14110 10844 12172 -75434 -160681 -148664 -92703 -84859 -71849 -21748 -32303 -67822 -46405 -39718
14098 -39718 -53466 -66758 -102853 -43753 1405 -30427 -77176 -36264 -9393 72266 32220 -21560
14086 -21560 -37444 -41933 10344 -10068 -17730 55037 96161 55484 -36196 -103381 -157758 -121466
$$ packed form
14171E2537o3453j7966l0163M6460K1372r307M103m412m807j6174O2906K3474
14159F4570p2980j761N8764k8064q6364K2382L7456p1691j2587J1439J2440J5118
14147e1278o227J27279J395k3917J9928j890K0706l6323m9715K850l45j7011K4023
14134I475q9054n0655q32L9817M5313N9270M6976l0217N569N2272j08381l5922
14122e6369j0208r1886K0088Q6738K98R027o3755n2787M4091j7798O9696P3709
14110A0844J328q7606q5247J2017N5961P844J3010N0101j0555l5519K1417O687
14098c9718j3748j3292l6095N9100M5158l1832m6749M0912K6871Q1659m0046n3780
14086b1560j5884m489N2277k0412p662P2767M1124m0677r1680o7185n4377L6292
$$ plain form
14074 -121466 -22233 -38714 -173093 -171973 -115740 -61728 -150829 -91459 -15792 506 28091
14063 28091 10843 -4110 -9111 48552 122705 45596 19326 -12426 -215 -16140 -56187 -38202
14051 -38202 -34641 30811 11176 -71881 -148851 -90318 -68838 20783 -4420 27520 29392 -33661
14039 -33661 -136227 -195365 -201174 -217828 -177850 -140592 -83651 21045 18400 -22561 -117513 -120458
14027 -120458 -50170 -48565 -62946 -78562 -47803 -14993 -83406 -156182 -186812 -117616 13722
14016 13722 -18703 -130681 -54825 11976 34473 3110 -23657 -87246 -127763 -127236 -155007 -96730
14004 -96730 -100271 -48931 50483 -37925 -140242 -225792 -222230 -144854 -131358 -137028 -127941 -97214
13992 -97214 -109492 -90240 61810 97664 114272 68490 -48749 -124382 -176633 -119051 811
$$ packed form
14074a21466R9233j6481j34379J120N6233N4012q9101N9370P5667J6298K7585
14063B8091j7248j4953n001N7663P4153p7109k6270l1752J2211j5925m0047J7985
14051c8202L561O5452j9635q3057p6970N8533K1480Q9621k5203L1940J872o3053
14039c3661j02566n9138n809j6654L9978L7258N6941J04696k645m0961r4952k945
14027a20458P0288J605j4381j5616L0759L2810o8413p2776l0630O9196J31338
14016A3722l2425j11978P5856O6801K2497l1363k6767o3589m0517N27k7771N8277
14004i6730l541N1340R9414q8408j02317q5550L562P7376J3496n670R087L0727
13992i7214j2278J9252J52050L5854J6608m5782j17239p5633n2251N7582J19862
$$ plain form
13981 811 125344 40609 -70931 -83337 -23080 -43696 -99917 -128024 -137534 -166453 -137819 -132049
13969 -132049 -45812 -5517 -91951 -117798 -43530 -56201 -31938 -64537 -38174 -64496 -86529
13958 -86529 -3955 14525 37144 -41757 -68479 -78501 -61335 -111716 -159216 -118903 -49637 -13766
$$ packed form
13981H11J24533q4735j11540j2406O0257k0616n6221k8107r510k8919K8634N770
13969a32049Q6237M0295q6434k5847P4268j2671K4263l2599K6363k6322k2033
13958h6529Q2574J8480K2619p8901k6722j0022J7166n0381m7500M0313O9266L5871
$$ [...]
##END NTUPLES=NMR SPECTRUM
##END=
