##TITLE=Analysis number 307369
Compound Code cc 33528
Book Reference 378/133/1
Project Code qc-cat
Chemist Name benw
##JCAMPDX= 6.0         $$ Bruker NMR JCAMP-DX V2.0
##DATA TYPE= NMR SPECTRUM
##DATA CLASS= NTUPLES
##ORIGIN= Bruker BioSpin GmbH
##OWNER= NMR
$$ XWIN-NMR		Version 3.5
$$ Thu Apr 28 13:03:29 2005 GMT Daylight Time (UT+1h)  MAYBRIDGE\NMR@NMR_250MHZ
##.OBSERVE FREQUENCY= 250.131544655141
##.OBSERVE NUCLEUS= ^1H
##.ACQUISITION MODE= SIMULTANEOUS (DQD)
##.ACQUISITION SCHEME= undefined
##.AVERAGES= 16
##.DIGITISER RES= 18
##SPECTROMETER/DATA SYSTEM= dpx250
##.PULSE SEQUENCE= zg30
##.SOLVENT NAME= CDCl3
##.SHIFT REFERENCE= (INTERNAL, CDCl3, 0, 16.522)
##AUDIT TRAIL= $$ (NUMBER, WHEN, WHO, WHERE, WHAT)
$$ ##TITLE= Audit trail, XWIN-NMR		Version 3.5
$$ ##JCAMPDX= 5.01
$$ ##ORIGIN= Bruker BioSpin GmbH
$$ ##OWNER= NMR
$$ C:\u/data/dgb/nmr/ADRS/2490/pdata/1/auditp.txt
$$ ##AUDIT TRAIL=  $$ (NUMBER, WHEN, WHO, WHERE, WHAT)
(   1,<2005-04-28 13:03:10.37 +100>,<MAYBRIDGE\NMR>,<NMR_250MHZ>,
      <created by zg, POWCHK disabled, PULCHK disabled
       configuration hash MD5:
       62 19 C7 07 E1 42 D1 B7 37 6C 3D D0 77 39 F9 E6
       data hash MD5: 64K
       E9 3B 1F B9 BA 0A B4 33 C1 C9 B5 03 E9 D3 D8 13>)
(   2,<2005-04-28 13:03:21.01 +100>,<MAYBRIDGE\NMR>,<NMR_250MHZ>,
      <Start of raw data processing
       ef LB = 0.3 FT_mod = 6 PKNL = 1 SI = 32K 
       data hash MD5: 32K
       E5 20 5A CA 12 9C AC 65 5A 04 24 46 AF D6 43 69>)
(   3,<2005-04-28 13:03:22.67 +100>,<MAYBRIDGE\NMR>,<NMR_250MHZ>,
      <apk 
       data hash MD5: 32K
       76 9F 7D 15 41 0A 1E 9C 5D B4 7A 32 B3 10 C1 65>)
(   4,<2005-04-28 13:03:23.43 +100>,<MAYBRIDGE\NMR>,<NMR_250MHZ>,
      <abs ABSG = 5 
       data hash MD5: 32K
       3B 9E 38 12 40 CA 2A 9B A5 54 59 FC DB 79 98 D1>)
$$ ##END=
$$ 
$$ hash MD5
$$ 8E 44 49 0D 9D 70 55 B1 2B D8 D5 A0 16 52 22 96
##$RELAX= 
##$RELAX= 
##$RELAX= 
##$RELAX= 
##$RELAX= 
##$RELAX= 
##$RELAX= 
$$ Bruker specific parameters
$$ --------------------------
##$DU= <C:\u>
##$EXPNO= 2490
##$NAME= <ADRS>
##$PROCNO= 1
##$TYPE= <nmr>
##$USER= <dgb>
##$AMP= (0..31)
100 100 100 100 100 100 100 100 100 100 100 100 100 100 100 100 100 100 
100 100 100 100 100 100 100 100 100 100 100 100 100 100 
##$AQSEQ= 0
##$AQ_mod= 3
##$AUNM= <au_zg>
##$AUTOPOS= <31 >
##$BF1= 250.13
##$BF2= 250.13
##$BF3= 250.13
##$BF4= 250.13
##$BF5= 500.13
##$BF6= 500.13
##$BF7= 500.13
##$BF8= 500.13
##$BYTORDA= 1
##$CFDGTYP= 0
##$CFRGTYP= 5
##$CHEMSTR= <none>
##$CNST= (0..31)
1 1 145 1 1 1 1 1 1 1 1 1 1 1 1 1 1 1 1 1 1 1 1 1 1 1 1 1 1 1 1 1 
##$CPDPRG= <>
##$CPDPRG1= <>
##$CPDPRG2= <>
##$CPDPRG3= <>
##$CPDPRG4= <mlev>
##$CPDPRG5= <mlev>
##$CPDPRG6= <mlev>
##$CPDPRG7= <mlev>
##$CPDPRG8= <mlev>
##$CPDPRGB= <>
##$CPDPRGT= <>
##$D= (0..31)
0 1 0 0 0 0 0 0 0 0.06 0 0 0 0 0 0 0.0002 0 0 0 0 0 0 0 0 0 0 0 0 0 0 
0 
##$DATE= 1114689789
##$DBL= (0..7)
120 120 120 120 120 120 120 120 
##$DBP= (0..7)
150 150 150 150 150 150 150 150 
##$DBP07= 0
##$DBPNAM0= <>
##$DBPNAM1= <>
$$ [...]
##$SUBNAM7= <"">
##$SUBNAM8= <"">
##$SUBNAM9= <"">
##$SW= 20.6930455092707
##$SWIBOX= (0..15)
0 0 3 0 0 0 0 0 0 0 0 0 0 0 0 0 
##$SW_h= 5175.983436853
##$TD= 65536
##$TD0= 1
##$TE= 295.16
##$TE2= 300
##$TE3= 300
##$TEG= 300
##$TL= (0..7)
0 120 120 120 120 120 120 120 
##$TP= (0..7)
150 150 150 150 150 150 150 150 
##$TP07= 0
##$TPNAME0= <>
##$TPNAME1= <>
##$TPNAME2= <>
##$TPNAME3= <>
##$TPNAME4= <>
##$TPNAME5= <>
##$TPNAME6= <>
##$TPNAME7= <>
##$TPOAL= (0..7)
0.5 0.5 0.5 0.5 0.5 0.5 0.5 0.5 
##$TPOFFS= (0..7)
0 0 0 0 0 0 0 0 
##$TUNHIN= 0
##$TUNHOUT= 0
##$TUNXOUT= 0
##$USERA1= <user>
##$USERA2= <user>
##$USERA3= <user>
##$USERA4= <user>
##$USERA5= <user>
##$V9= 5
##$VALIST= <valist>
##$VCLIST= <CCCCCCCCCCCCCCC>
##$VD= 0
##$VDLIST= <DDDDDDDDDDDDDDD>
##$VPLIST= <PPPPPPPPPPPPPPP>
##$VTLIST= <TTTTTTTTTTTTTTT>
##$WBST= 1024
##$WBSW= 4
##$XGAIN= (0..3)
0 0 0 0 
##$XL= 0
##$YL= 0
##$YMAX_a= 389991
##$YMIN_a= -309697
##$ZGOPTNS= <>
##$ZL1= 120
##$ZL2= 120
##$ZL3= 120
##$ZL4= 120
##$ABSF1= 16.522
##$ABSF2= -4.171173
##$ABSG= 5
##$ABSL= 3
##$ALPHA= 0
##$AQORDER= 0
##$ASSFAC= 0
##$ASSFACI= 0
##$ASSFACX= 0
##$ASSWID= 0
##$AUNMP= <proc_1d>
##$AZFE= 0.1
##$AZFW= 0.1
##$BCFW= 0
##$BC_mod= 0
##$BYTORDP= 0
##$COROFFS= 0
##$CY= 12.5
##$DATMOD= 1
##$DC= 0
##$DFILT= <>
##$DTYPP= 0
##$F1P= 14.0000005364418
##$F2P= -0.99999901652339
##$FCOR= 0.5
##$FTSIZE= 32768
##$FT_mod= 6
##$GAMMA= 0
##$GB= 0
##$INTBC= 1
##$INTSCL= 1
##$ISEN= 128
##$LB= 0.3
##$LEV0= 0
##$LPBIN= 0
##$MAXI= 10000
##$MC2= 0
##$MEAN= 0
##$ME_mod= 0
##$MI= 0
##$NCOEF= 0
##$NC_proc= -3
##$NLEV= 6
##$NOISF1= 0
##$NOISF2= 0
##$NSP= 0
##$NTH_PI= 0
##$NZP= 0
##$OFFSET= 16.522
##$PC= 1
##$PHC0= -75.6159
##$PHC1= 6.806725
##$PH_mod= 1
##$PKNL= yes
##$PPARMOD= 0
##$PSCAL= 4
##$PSIGN= 0
##$REVERSE= no
##$SF= 250.13
##$SI= 32768
##$SIGF1= 0
##$SIGF2= 0
##$SINO= 400
##$SIOLD= 32768
##$SREGLST= <1H.CDCl3>
##$SSB= 0
##$STSI= 32768
##$STSR= 0
##$SW_p= 5175.98343685301
##$SYMM= 0
##$S_DEV= 0
##$TDeff= 65536
##$TDoff= 0
##$TI= <Analysis number 999999
Compound Code 99
Book Reference 9
Project Code 9>
##$TILT= no
##$TM1= 0
##$TM2= 0
##$TOPLEV= 0
##$USERP1= <user>
##$USERP2= <user>
##$USERP3= <user>
##$USERP4= <user>
##$USERP5= <user>
##$WDW= 1
##$XDIM= 32768
##$YMAX_p= 501984973
##$YMIN_p= -151709
$$ End of Bruker specific parameters
$$ ---------------------------------
##NTUPLES= NMR SPECTRUM
##VAR_NAME=  FREQUENCY,     SPECTRUM/REAL,   SPECTRUM/IMAG
##SYMBOL=    X,             R,               I
##VAR_TYPE=  INDEPENDENT,   DEPENDENT,       DEPENDENT
##VAR_FORM=  AFFN,          ASDF,            ASDF
##VAR_DIM=   32768,         32768,           32768
##UNITS=     HZ,            ARBITRARY UNITS, ARBITRARY UNITS
##FACTOR=    0.157963299565203, 1,           1
##FIRST=     4132.6476996994, 0,             0
##LAST=      -1043.33573715361, 0,           0
##MIN=       -1043.33573715361, -151709,     0
##MAX=       4132.6476996994, 501984973,     0
$$ Real data points
##PAGE= N=1
##DATA TABLE= (X++(R..R)), XYDATA
$$ [...]
16674h9097K2973L7578O19j0739J4547K818p818K8460K789j2600J929k2540n6845
$$ -89097 -66124 -28546 -27927 -38666 -24119 -21301 -29119 -659 2130 -10470 -8541 -31081 -87926
16661h7926K2069j096j8628M5645K0710r842l1168l490L0316Q14q458n4698k7572
$$ -87926 -65857 -66953 -85581 -39936 -19226 -29068 -60236 -63726 -33410 -32596 -41054 -95752 -123324
16648a23324M3476K733k1158j1577J7296K8239L4514J6495j8656k4394j738j557
$$ -123324 -79848 -77115 -98273 -109850 -92554 -64315 -29801 -13306 -31962 -56356 -58094 -59651
16636e9651Q879q729L0358n140p884K7705Q0P34j168j2944m464q864K7365J5623
$$ -59651 -50772 -59501 -29143 -34283 -42167 -14462 -14382 -13648 -14816 -27760 -32224 -41088 -13723 1900
16622A900k1115j3012J9223K0625J3245k8823n944K4791p220K655Q975k6456O722
$$ 1900 -19215 -32227 -13004 7621 20866 -7957 -13901 10890 3670 6325 15300 -11156 -4434
16609d434j0017r688J7844J642q502O953K907N98o883l594M2903n208k9396m468
$$ -4434 -14451 -24139 -6295 -4653 -13155 -6202 -3295 -2697 -9580 -13174 29729 24521 -4875 -9343
16595i343L1986O497l5352j1067k6051k3676o084K6278P538p789J3440J4510m0226
$$ -9343 22643 29140 -6212 -17279 -43330 -67006 -73090 -46812 -39274 -47063 -33623 -19113 -59339
16582e9339p314J6592l332K0074k9063K93J0343J5157K1141k216j0750l686R85
$$ -59339 -66653 -50061 -53393 -33319 -62382 -62089 -51746 -36589 -15448 -17664 -28414 -32100 -31115
16569c1115J2983j4554j5342M662M768j6454j1331M1036j0528k2273J1902k0636
$$ -31115 -18132 -32686 -48028 -43366 -38598 -55052 -66383 -25347 -35875 -58148 -46246 -66882
16557f6882j5250M55L2895j363K726J7512J9637j1885j7814j9467J0374J5576
$$ -66882 -82132 -81677 -48782 -50145 -47419 -29907 -10270 -22155 -39969 -59436 -49062 -33486
16545c3486J069k68k861r21J6983j7240k3153J6570P788J0246j5449J9226k0567
$$ -33486 -32417 -32685 -35546 -36467 -19484 -36724 -59877 -43307 -35519 -25273 -40722 -21496 -42063
16532d2063L056J6012J3165j4090j2545Q331l0795N731m69J8251L801J5828n144
$$ -42063 -39007 -22995 -9830 -23920 -36465 -28134 -58929 -53198 -53667 -35416 -31615 -15787 -20931
16519b0931j8219l2173j3670K1013M9266j8273j6186K9062n986m1868n684J5292
$$ -20931 -39150 -71323 -84993 -63980 -14714 -32987 -49173 -20111 -26097 -67965 -73649 -58357
16507e8357m0k3202j9751J8629J0282J9918J7546O760l079M541k1756j4039r028
$$ -58357 -58397 -81599 -101350 -82721 -72439 -52521 -34975 -28215 -31294 -26753 -48509 -62548 -71576
16494g1576J6886N145K0115K7667n171p271j608k6467j2074P778j9419K153r206
$$ -71576 -54690 -49545 -29430 -1763 -6934 -14205 -15813 -42280 -54354 -46576 -65995 -63842 -73048
16481g3048k2073J1518M2673L6167P98L296j5205k5734j1836L0174J5184j8693
$$ -73048 -95121 -83603 -40930 -4763 -3965 -669 -15874 -41608 -53444 -23270 -8086 -26779
16469b6779k4777j9491L3684N0562K8326k795N381j2588m6713j0654K0709m516
$$ -26779 -51556 -71047 -37363 13199 41525 38730 44111 31523 -15190 -25844 -5135 -9651
16457i651j3637J5329J2319J4295n537k6912k0257J3417n649K2846j1464k5371
$$ -9651 -23288 -7959 4360 18655 13118 -13794 -34051 -20634 -26283 -3437 -14901 -40272
16445d0272L861l365N123L4190k2881r69J361j3768K4138J2046J4144p238m823
$$ -40272 -36411 -39776 -34653 -463 -23344 -24313 -22952 -36720 -12582 -536 13608 6370 1547
16432A547j5441J4229K124m7726j4800J1576J9287q708m049p490r804L0134L3256
$$ 1547 -13894 335 2459 -45267 -60067 -48491 -29204 -37912 -41961 -49451 -59255 -29121 4135
16419D135l3617p397K6539K6420N257p604l2883k4248J4160K0126k176K0285J695
$$ 4135 -29482 -36879 -10340 16080 21337 13733 -19150 -43398 -29238 -9112 -11288 8997 10692
16406A0692j6587k5486J9251L8661j757k6521l3661m0631N560L4934J9627r066
$$ 10692 -5895 -31381 -12130 26531 24774 -1747 -35408 -76039 -70479 -35545 -15918 -24984
16394b4984j7052m2885j0841L681o029M6892L1811K6006L4332P834P0112p792
$$ -24984 -42036 -84921 -95762 -92081 -98110 -51218 -19407 6599 40931 48765 118877 111085
16382A11085k7587n184o924m2685j2932K783k0785N174P567J338j4406j8616j5747
$$ 111085 83498 78314 71390 28705 15773 18556 -2229 2945 10512 11850 -2556 -21172 -36919
16369c6919K4686R158j8523j0593j5403J7859K5878K2519J1458j3528J2335K862
$$ -36919 -12233 -3075 -21598 -32191 -47594 -29735 -3857 18662 30120 16592 28927 31789
16357C1789j6923j072o695j0982Q551k4442m3518J3456J4155R21l476R632K3011
$$ 31789 14866 13794 7099 -3883 4668 -19774 -63292 -49836 -35681 -34760 -38236 -28604 -5593
16344e593j9287P092J0860J5890j6888N499k0288k5447j2064k800L1225j1112
$$ -5593 -24880 -17788 -6928 8962 -7926 -2427 -22715 -48162 -60226 -63026 -31801 -42913
16332d2913m605l213O13R349K847J593k3212j151P548K7936M6038K3l2241j9958
$$ -42913 -47518 -50731 -50118 -40769 -37922 -36329 -59541 -60692 -53144 -25208 20830 20853 -11388 -31346
16318c1346o462J6468r800j6183l115J8326K8991p902j151j7561J2080j6159r048
$$ -31346 -37808 -21340 -31140 -47323 -50438 -32112 -3121 -11023 -12174 -29735 -17655 -33814 -42862
16305d2862k3068n6484m229P697J8288J6861K1983K7760k4869j8891N547k3241
$$ -42862 -65930 -122414 -126643 -118946 -100658 -83797 -61814 -34054 -58923 -77814 -72267 -95508
16293i5508J8639M2646L9266J1863J5145m2430j4349K599O384n758m6886m377
$$ -95508 -76869 -34223 5043 16906 32051 -10379 -24728 -22129 -15745 -21503 -68389 -72766
16281g2766J0303p6k930k2160q876P12L0627q254L5520J3866N916k7847l2154
$$ -72766 -62463 -62539 -65469 -87629 -96505 -95793 -65166 -73420 -37900 -24034 -18118 -45965 -78119
16268g8119R758k0636J1530K3710j0962P726K2410L798k2322m749R404N947J4691
$$ -78119 -68361 -88997 -77467 -53757 -64719 -56993 -34583 -30785 -53107 -57856 -48452 -42505 -27814
16255b7814J1444j0541J2104O249j9170k0374j6201J6642Q220P752J2343j031
$$ -27814 -16370 -26911 -14807 -8558 -27728 -48102 -64303 -47661 -39441 -31689 -19346 -20377
16243b0377j0641k1345k7433k3124M282J8249L6120L4706j3412l9130K749K096
$$ -20377 -31018 -52363 -79796 -102920 -98638 -80389 -44269 -9563 -22975 -62105 -59356 -57260
16231e7260j0459j6230j959P230N9269j2481l9142p110K7865N092o357r486M92
$$ -57260 -67719 -83949 -85908 -78678 -19409 -31890 -71032 -78142 -50277 -45185 -51542 -61028 -60536
16218f0536k8074J271O389K2870j4644L3413k3j0218j1895J7528L2901k0963J5430
$$ -60536 -88610 -87339 -80950 -58080 -72724 -39311 -39334 -49552 -61447 -43919 -11018 -31981 -16551
16205a6551N33J7119L7312l4408j7119K6420K0489p797l1160j0677j3722l4473
$$ -16551 -16018 1101 38413 4005 -13114 13306 33795 25998 -5162 -15839 -29561 -64034
16193f4034P753O054k6621l965M2211J3404j4997j6193J4696K9168Q707j5397
$$ -64034 -56281 -50227 -76848 -80813 -38602 -25198 -40195 -56388 -41692 -12524 -3817 -19214
16181a9214j6616k8852N183Q736o038J0030J1209j4333j2510Q211j3916j2159
$$ -19214 -35830 -64682 -59499 -50763 -56801 -46771 -35562 -49895 -62405 -54194 -68110 -80269
16169h0269K1276k117J3431J2720l212j5086j8220J3538K9727J3430J5232j1572
$$ -80269 -58993 -61110 -47679 -34959 -38171 -53257 -71477 -57939 -28212 -14782 450 -11122
16157a1122j8122k6689J807L412J9467K3920j6181n383j3224k2526J3677J1398
$$ -11122 -29244 -55933 -54126 -50714 -31247 -7327 -23508 -28891 -42115 -64641 -50964 -39566
16145c9566J1003J7689j1890q12N723K3153k4199P576m57O635J136l9461k8702
$$ -39566 -28563 -10874 -22764 -23576 -17853 5300 -18899 -11323 -11780 -5145 -4009 -43470 -72172
16132g2172K2776m183p846J8409K0643o872Q911P722j7350k8910o957J5028M0520
$$ -72172 -49396 -53579 -61425 -43016 -22373 -29245 -20334 -12612 -29962 -58872 -65829 -50801 -10281
16119a0281M1664o811l0034n730O930M844M544J640j3318o692j4078k9549m066
$$ -10281 31383 24572 -5462 -11192 -4262 582 5126 6766 -6552 -13244 -27322 -56871 -60937
16106f0937K0633M2296m438j712j2345k4542j6714J778n147J2062J6442L2608
$$ -60937 -40304 1992 -2446 -4158 -16503 -41045 -57759 -55981 -61128 -49066 -32624 -16
16094a6N541M518r599L163m6256j2257N885L1172R139j281K5791j2170P055j5522
$$ -16 5525 10043 444 3607 -42649 -54906 -49021 -17849 -8710 -9991 15800 3630 10685 -4837
16080d837K7078j2000k8564j3378L6975J8111m5148n1238o330O0082P4723L9349
$$ -4837 22241 10241 -18323 -31701 5274 23385 -21763 -73001 -79331 -19249 55474 94823
16068I4823K2650J0059J093j4878m1429k0076k8066j8709k745J2721j1497q030
$$ 94823 117473 127532 128625 113747 72318 52242 24176 5467 2722 15443 3946 -4084
16056d084J8258p630L061j1409j7290j9255l061q162r886N3474J9557N016l2675
$$ -4084 14174 6544 9605 -1804 -19094 -38349 -41410 -49572 -59458 -5984 13573 18589 -14086
16043a4086l6227k0530J6727L8970L146j0768k0104Q235J0148K8651K9819k6505
$$ -14086 -50313 -70843 -54116 -15146 -12000 -22768 -42872 -34637 -24489 4162 33981 7476
16031G476j5677n701j8587R301N0829M616j2073j6559j3887Q342K1507l0416j801
$$ 7476 -8201 -13902 -32489 -23188 27641 32257 20184 3625 -10262 -1920 19587 -10829 -12630
16018a2630R576j6540l2287L052J8220m4566j1387Q854K9485K9490k7429o300
$$ -12630 -3054 -19594 -51881 -48829 -30609 -75175 -86562 -77708 -48223 -18733 -46162 -52462
16006e2462k357j8788j9577K3166Q435K8248J0953p376N537K3088J2870j199N026
$$ -52462 -54819 -73607 -93184 -70018 -61583 -33335 -22382 -29758 -24221 -1133 11737 10538 15564
15993A5564q022m2370m0218K9055L0070j6325l3284j5112J42m079j2464K4290
$$ 15564 7542 -34828 -75046 -45991 -15921 -32246 -65530 -80642 -80500 -84579 -97043 -72753
15981g2753J491j793L1998o865j1946J3711j7642O372J578P911K0114q252k4736
$$ -72753 -71262 -73055 -41057 -47922 -59868 -46157 -63799 -57427 -55849 -47938 -27824 -36076 -60812
15968f0812Q276M2627L8733m295l3678l3105m292j0009j0345j3144o741K3843
$$ -60812 -52536 -9909 28824 24529 -9149 -42254 -46546 -56555 -66900 -80044 -86785 -62942
15956f2942J8884J1828k146l515K2525j5419p414O469K7693J0901p0638o4425
$$ -62942 -44058 -32230 -34376 -37891 -15366 -30785 -38199 -31730 -4037 6864 -63774 -128199
15944a28199k3510L1526K5635N1771P734k3036R947J8651q716k0460m049l218
$$ -128199 -151709 -120183 -94548 -42777 -35043 -58079 -48132 -29481 -38197 -58657 -62706 -65924
15932f5924K3023L3264K2795k1564j4925k7973m243J9964P681j5665j7471K8675
$$ -65924 -42901 -9637 13158 -8406 -23331 -51304 -55547 -35583 -27902 -43567 -61038 -32363
15920c2363R837o68j1416j1480K6747K1839M88j4266L090K9584o721k5038k5860
$$ -32363 -22526 -23194 -34610 -46090 -19343 2496 2984 -11282 -8192 21392 14671 -10367 -36227
15907c6227j3340J1703k659m736J0936K6156Q050o391j9777j9772J5179M1998
$$ -36227 -49567 -37864 -40523 -45259 -34323 -8167 -117 -6508 -26285 -46057 -30878 11120
15895A1120J4443J6436K817j4940p167k8705J1574P999K883K0976J044l2415M648
$$ 11120 25563 41999 44816 29876 22709 -5996 5578 13577 16460 37436 38480 6065 10713
15882A0713o112k0363j3114l518Q617J4144O027R378j258n322j0040K4130n1017
$$ 10713 4601 -15762 -28876 -32394 -23777 -9633 -3606 5772 4514 -808 -10848 13282 -37735
15869c7735k5338L3793J0615R447J3782j2160j1144J033J6007k688K3634k7830
$$ -37735 -63073 -29280 -18665 -9218 4564 -7596 -18740 -17707 -1700 -4388 19246 -8584
15857h584M667K4209p12J0205j6839j884Q325O287p175J9733k9903j5379J1959
$$ -8584 -3917 20292 19580 29785 12946 11062 19387 25674 18499 38232 8329 -7050 4909
15844D909j5511q003J6792K612L3824K6394k2271j4430j8517l9142P932J4357
$$ 4909 -10602 -18605 -1813 799 34623 61017 38746 24316 5799 -33343 -25411 -11054
15832a1054R881J0007J0183q750j6359o168K5743P039N71k6494l772K057p604
$$ -11054 -1173 8834 19017 10267 -6092 -12260 13483 20522 21093 -5401 -9173 -7116 -14720
15819a4720j9901r991N020J4223j6573j1391K0217L7560P917k0321j8327l720
$$ -14720 -34621 -44612 -39592 -25369 -41942 -53333 -33116 4444 12361 -7960 -26287 -30007
15807c0007j4424j2060J2259q86L478K1992L6050O869m817M189j0937K8808N295
$$ -30007 -44431 -56491 -44232 -45118 -41640 -19648 16402 23271 18454 22643 11706 40514 45809
15794D5809j0552N346J9562k8553l1806o048K2336k9152k0915o570P934K7662
$$ 45809 35257 40603 60165 31612 -194 -6242 16094 -13058 -33973 -40543 -32609 -4947
15782d947k780j480J6583L606o027m79j6553R142k4538l7652k3966L4574K2436
$$ -4947 -7727 -9207 7376 10982 4955 4476 -12077 -2935 -27473 -65125 -89091 -54517 -32081
15769c2081j4981L3613j508l8661k6503K0201M6229p152k7805M156m186m2315
$$ -32081 -47062 -13449 -14957 -53618 -80121 -59920 -13691 -20843 -48648 -44492 -48678 -90993
15757i0993J72K4373L1213o411l126K2639j5103j2589J7925j7682l672L8150K3550
$$ -90993 -90821 -66448 -35235 -41646 -44772 -22133 -37236 -49825 -31900 -49582 -53254 -15104 8446
15744H446r061n360j3931K1241J6564l2089n154o39j6942K681j2610l9053K6546
$$ 8446 -615 -5975 -19906 1335 17899 -14190 -19344 -19983 -36925 -34244 -46854 -85907 -59361
15731e9361L8949J7101k2555k9922J430P0503K3364l2974j8495J6220R139K259
$$ -59361 -20412 -3311 -25866 -55788 -54358 16145 39509 6535 -11960 4260 13399 15658
15719A5658r347O880j4331j4700k2779j6872k9459j9297M140K1674K8212M218
$$ 15658 6311 13191 -1140 -15840 -38619 -55491 -84950 -104247 -100107 -78433 -50221 -46003
15707d6003m0277k557L5167K3352L0942J4386j5581l6983k665L6531J66l107J3813
$$ -46003 -86280 -88837 -53670 -30318 624 15010 -571 -37554 -40219 -3688 -3522 -6629 7184
15694G184k7839k6990j4213L124L0047M639p304k3222P776L2692M3987j7057j7372
$$ 7184 -20655 -47645 -61858 -58734 -28687 -24048 -31352 -54574 -46798 -14106 29881 12824 -4548
15681d548j1196N88N195j4370k0095k6552K8277J8077K0150j1169K592O1194O458
$$ -4548 -15744 -15156 -9961 -24331 -44426 -70978 -42701 -24624 -4474 -15643 -13051 48143 54601
15668E4601k8047J3055J623J8087j3981k1298j2980k5583J9641j6049k1925J1209
$$ 54601 26554 39609 41232 59319 45338 24040 11060 -14523 5118 -10931 -32856 -21647
15656b1647L7962q278l3808J6726q041k9296M1849K1611m1058j3777K4163P682
$$ -21647 16315 8037 -25771 -9045 -17086 -46382 -4533 17078 -23980 -37757 -13594 -5912
15644e912Q173q182J2997j3838O431R374K7568O536k5838j496L1995P035o4316
$$ -5912 2261 -5921 7076 -6762 -331 9043 36611 43147 17309 15813 47808 54843 -9473
15631i473n948L8575J381l1288l5832J3749j3183N712J3538k7970l1773J633L0850
$$ -9473 -15421 23154 24535 -6753 -42585 -28836 -42019 -36307 -22769 -50739 -82512 -80879 -50029
15618e0029J1044j1689J4586q303r471j0873j0789K4275R347j2266r186M408R578
$$ -50029 -38985 -50674 -36088 -44391 -53862 -64735 -75524 -51249 -41902 -54168 -63354 -58946 -49368
15605d9368p990p413K7395M87M705l335o269l1043M833J8748J3789N932L9037
$$ -49368 -57358 -64771 -37376 -36889 -32184 -35519 -41788 -72831 -67998 -49250 -35461 -29529 9508
15592I508j730o08o658l539O751j8871k8805J76J9137K071l338M100j0354k5615
$$ 9508 7778 7170 512 -3027 3724 -15147 -43952 -43776 -24639 -22568 -25906 -21806 -32160 -57775
15578e7775O978j5742l80J5477L2176K6475r313J6550j8751k8110j3538k0247
$$ -57775 -50797 -66539 -66919 -51442 -19266 7209 -2104 14446 -4305 -32415 -45953 -66200
15566f6200j5064J5471P614J604J4342L5628K585k6834k8674K5627K2132J7422
$$ -66200 -81264 -65793 -58179 -56575 -42233 -6605 -4020 -30854 -59528 -33901 -11769 5653
15554E653l461J562p762m694N911N730P060j974m0324j0977Q890K252M4608L9339
$$ 5653 2192 3754 -4008 -8702 -2791 2939 9999 8025 -32299 -43276 -34386 -32134 12474 51813
15540E1813r977k2854j1938j9677l9810K0701J3350o936J8130J9680K6659l4730
$$ 51813 41836 18982 7044 -12633 -52443 -31742 -18392 -25328 -7198 12482 39141 4411
15528D411m9083J5429J3447N350j684M8278K0090j5619p283j2016r386O159R503
$$ 4411 -44672 -29243 -15796 -10446 -12130 36148 56238 40619 33336 21320 11934 18093 27596
15515B7596M4278O0719Q1559R0830J82173J94206J85867J62579O4597o9368j25364
$$ 27596 71874 132593 214152 304982 487155 681361 867228 1029807 1094404 1025036 899672
15504H99672j60465j56849j50392p7096o5824n9531l5731n2786k8472j5930K1726
$$ 899672 739207 582358 431966 354870 289046 229515 193784 140998 112526 96596 118322
15493A18322l623r505q816l2783k8424k679k4926k0964l350j0725k0830j3847
$$ 118322 114699 105194 96378 63595 35171 32492 7566 -13398 -16748 -27473 -48303 -62150
15481f2150K0776J7437J4946K3433j521k942N651j3154j5168q698j1799j968k1282
$$ -62150 -41374 -23937 -8991 14442 12921 9979 15630 2476 -12692 -21390 -33189 -35157 -56439
15468e6439j5979l223M8105L8802L58O421k3183j7840M7q694Q352J3476J5001
$$ -56439 -72418 -75641 -27536 11266 11624 18045 -5138 -22978 -22931 -31625 -23273 -9797 5204
15455E204k21k0876k6888r192J3601K4382j422o967J1299K3349J2208m962P642
$$ 5204 4983 -15893 -42781 -51973 -38372 -13990 -15412 -22379 -11080 12269 24477 19515 27157
15442B7157r575l7189R680L4177n5151l7524J8157J8580O274L33n715k4003j6271
$$ 27157 17582 -19607 -9927 24250 -30901 -68425 -50268 -31688 -25414 -25081 -30796 -54799 -71070
15429g1070Q66N571j732O912M4494L5195l9506l1479M3103L2530j1530j1647j7397
$$ -71070 -70204 -64633 -66365 -59453 -14959 20236 -19270 -50749 -7646 24884 13354 1707 -15690
15416a5690j4182l9938j445K2834L3225O914K6779L23m4417r706l772L389L4151
$$ -15690 -29872 -69810 -71255 -48421 -15196 -8282 18497 18820 -25597 -35303 -39075 -35686 -1535
15403a535J0414j1672j3147j496l6884l6316J4580Q369p740K0394Q122O443m625
$$ -1535 8879 -2793 -15940 -17436 -54320 -90636 -76056 -67687 -75427 -55033 -46911 -40468 -45093
15390d5093K9275K6115j8883l2463J5949J8411j3392l5699j5813J0081L4411K1158
$$ -45093 -15818 10297 -8586 -41049 -25100 -6689 -20081 -55780 -71593 -61512 -27101 -5943
15378e943K8470j6641j9376J0050K2744J8925P00J4894L148L3202j0656j9281
$$ -5943 22527 5886 -13490 -3440 19304 38229 38929 53823 56971 90173 79517 60236
15366F0236n864o453l0474N485J4609K6392k5141j6030l0448k5549K6645J2280
$$ 60236 54372 47919 17445 22930 37539 63931 38790 22760 -7688 -33237 -6592 5688
15354E688k6127k6759J0963K7895r65l0534j2975r881K5684M5128n785m2084K0445
$$ 5688 -20439 -47198 -36235 -8340 -9305 -39839 -52814 -62695 -37011 8117 2332 -39752 -19307
15341a9307n359k9853l353k0956j4432J8446K0427J5900L2086J3152M726k79Q454
$$ -19307 -24666 -54519 -57872 -78828 -93260 -74814 -54387 -38487 -6401 6751 11477 11198 19652
15328A9652Q343k5922j6816p743j7120P522K2624l8134k2208k6650K1875L4917
$$ 19652 27995 2073 -14743 -22486 -39606 -32084 -9460 -47594 -69802 -96452 -74577 -39660
15316c9660m845n016L3475J289j8187j9919m008m578n790J646K7998o468J0210
$$ -39660 -44505 -49521 -16046 -14757 -32944 -52863 -56871 -61449 -67239 -65593 -37595 -44063 -33853
15303c3853l067K0522R426m780o194L958L922M5221M0126L3925O0793O1271O3920
$$ -33853 -36920 -16398 -6972 -11752 -17946 -13988 -10066 35155 75281 109206 169999 231270 295190
15290B95190J88423K72932K35461J38916p411r9296j51902j88256j55509j20135
$$ 295190 483613 756545 992006 1130922 1123511 1024215 872313 684057 528548 408413
15280D08413r1593n2834n1957k2914l4035l6129j773P106l6984l0927k5103N338
$$ 408413 316820 263986 212029 189115 155080 118951 117178 124284 87300 56373 31270 36608
15268C6608J3351l3538o2046j7902L1656O639j8288J2017j8975K4098J4680j960
$$ 36608 49959 16421 -45625 -63527 -31871 -25232 -43520 -31503 -50478 -26380 -11700 -13660
15256a3660k0549M385J0941p304J472j1630l757n096K315M0817K8596m091j9183
$$ -13660 -34209 -29824 -18883 -26187 -24715 -36345 -40102 -45198 -42883 -2066 26530 22439 3256
15243C256l3128j4636k968J0333J1154j146k3226K650j0172N487j4145j9259M4348
$$ 3256 -29872 -44508 -47476 -37143 -25989 -27135 -50361 -47711 -57883 -52396 -66541 -85800 -41452
15230d1452L1043k4861M138J9385j0353K1179K4116j7943l5820J9944J6536k5319
$$ -41452 -10409 -35270 -31132 -11747 -22100 -921 23195 5252 -30568 -10624 5912 -19407
15218a9407l6872q354K6215K7746j2167o641Q932k1036J0821R83L5155K1623k7603
$$ -19407 -56279 -64633 -38418 -10672 -22839 -29480 -20548 -41584 -30763 -29780 5375 26998 -605
15205f05m8878J6880L2676k7264q650J7921j1985K113m417k3013K493M4943l2163
$$ -605 -49483 -32603 73 -27191 -35841 -17920 -29905 -27792 -32209 -55222 -52729 -7786 -39949
15192c9949j5644N5010O334l3507J9043P274n713j3697k2169q8n804K8573J4873
$$ -39949 -55593 -583 5751 -27756 -8713 -1439 -7152 -20849 -43018 -43106 -48910 -20337 -5464
15179e464J558J3609p734k6814k6365P237l5266j4433K8278J3959p860K5476K7817
$$ -5464 -3906 9703 1969 -24845 -51210 -43973 -79239 -93672 -65394 -51435 -59295 -33819 -6002
15166f002N091m691j0093j1369K913p941J996J1129J9675n329j3533l754J3762
$$ -6002 -911 -5602 -15695 -27064 -24151 -32092 -30096 -18967 708 -4621 -18154 -21908 -8146
15153h146J1712j9446n553Q658N32m855J212j0802J6578J7414j7814l582j824
$$ -8146 3566 -15880 -21433 -12775 -12243 -17098 -15886 -26688 -10110 7304 -10510 -14092 -15916
15140a5916M229j387K0241j4222m2204p610J8176L3045j7926O249K9669K9065
$$ -15916 -11687 -13074 7167 -7055 -49259 -56869 -38693 -5648 -23574 -17325 12344 41409
15128D1409l3650J353K8263k3655m0203j573L4506R603j1124m868q669R399q403
$$ 41409 7759 9112 37375 13720 -26483 -28056 6450 16053 4929 61 -8608 791 -7612
15115g612j1730j0841p244L0946J2772k461o288k8151o176K1206O424Q184K4649
$$ -7612 -19342 -30183 -37427 -6481 6291 3830 -2458 -30609 -36785 -15579 -9155 -971 23678
15102B3678P796l0093l241Q418j1347j5031k8016j4248m340P605l1080k7877k6199
$$ 23678 31474 1381 -1860 6558 -4789 -19820 -47836 -62084 -66424 -58819 -89899 -117776 -143975
15089a43975O4422K3114j0393R254J0992r326m064L7570K051k5665J7189N5Q288
$$ -143975 -79553 -56439 -66832 -57578 -46586 -55912 -59976 -22406 -20355 -46020 -28831 -28776 -20488
15076b0488r353k415L3401K1283n56k0827k2155N240M34j3211M1368j8009m0988
$$ -20488 -29841 -32256 1145 22428 21872 1045 -21110 -15870 -15436 -28647 12721 -5288 -46276
15063d6276j9356N695k8510K987j11K1747K1872R381N23j8467J4822n939j3272
$$ -46276 -65632 -59937 -88447 -85460 -85571 -63824 -41952 -32571 -32048 -50515 -35693 -41632 -54904
15050e4904j5951J3683K442R899J2513K1914m928j0103K7019j3139j0178m35K6719
$$ -54904 -70855 -57172 -54730 -44831 -32318 -10404 -15332 -25435 1584 -11555 -21733 -22168 4551
15037D551J5517k7582k3662j9838p414K3320N6318L5744j9725m8029N22j163K266
$$ 4551 20068 -7514 -31176 -51014 -58428 -35108 21210 56954 37229 -10800 -10278 -11441 -9175
15024i175j759p876M2060j2608k6060L409M7043q693j0446m809q028J9800L087
$$ -9175 -10934 -18810 23250 10642 -15418 -12009 35034 26341 15895 11086 3058 22858 25945
15011B5945k7629j82L5867j0820m130r227j6338k2280k2858J5379J3593R280R37
$$ 25945 -1684 -1866 34001 23181 19051 9824 -6514 -28794 -51652 -36273 -22680 -13400 -12463
14998a2463J6420J0965J6276j2535K141k8035p323k111R491J8516j3144m265l0826
$$ -12463 3957 14922 31198 18663 20804 -7231 -14554 -16665 -7174 11342 -1802 -6067 -36893
14985c6893j7786k5284m00J9226K944K2852j5922r422K1258J1122j5172j4625
$$ -36893 -54679 -79963 -80363 -61137 -58193 -35341 -51263 -60685 -39427 -28305 -43477 -58102
14973e8102J1384J7215K7974k8874j6881J5336L2633Q587l916r216k903L8024
$$ -58102 -46718 -29503 -1529 -30403 -47284 -31948 685 9272 5356 -3860 -6763 31261
14961C1261P052p8577k5591K2832L5575j6483j527q068K1154R207j4770j8551
$$ 31261 38313 -40264 -65855 -43023 -7448 -23931 -25458 -33526 -12372 -3165 -17935 -36486
14949c6486L0176J044l0442k703k9728m480N233l742L54k822L4069K7816L4654
$$ -36486 -6310 -5266 -35708 -38411 -68139 -72619 -67386 -71128 -70774 -73596 -39527 -11711 22943
14936B2943J3189j2636k1927m900n875l8663N60R96j7477K9361J6793L0678K8330
$$ 22943 36132 23496 1569 -3331 -9206 -47869 -47309 -46313 -63790 -34429 -17636 13042 41372
14923D1372q824j2496k9615j4754K0419J8542J53J940j4257L161J5198J7011J0372
$$ 41372 32548 20052 -9563 -24317 -3898 14644 14797 16737 2480 5641 20839 37850 48222
14910D8222j5382k8152q475m6537k1564M8853J3238k1722L8776J9338j2417k5453
$$ 48222 32840 4688 -3787 -50324 -71888 -23035 -9797 -31519 7257 26595 14178 -11275
14898a1275K633j0677l1893j0945k7321M19L3709L816K305J2632k284L2804q706
$$ -11275 -8642 -19319 -51212 -62157 -89478 -89059 -55350 -51534 -49229 -36597 -38881 -6077 -14783
14885a4783k978O217Q271j0470j422j0474j9746J6281M0386j5270j109l3274m1495
$$ -14783 -17761 -11544 -3273 -13743 -15165 -25639 -45385 -29104 11282 -3988 -5097 -38371 -79866
14872g9866K245M1051J4664j6496r047k2426J4598j500j7003j2365j2060R929
$$ -79866 -77621 -36570 -21906 -38402 -47449 -69875 -55277 -56777 -73780 -86145 -98205 -88276
14860h8276J4813o936Q418K5127M0919L735k1943j8385R468j0202j5473k9862
$$ -88276 -73463 -80399 -71981 -46854 -5935 -2200 -24143 -42528 -33060 -43262 -58735 -88597
14848h8597K5215M5505L1528K172q15K7200m01J4097M162k8998k1901K2543L0009
$$ -88597 -63382 -17877 13651 15823 15008 42208 41807 55904 60066 31068 9167 31710 61719
14835F1719n198j9014M295j9671K041n792N179M037M2084l191m5522J1814K5432
$$ 61719 56521 37507 41802 22131 24172 18380 23559 27596 69680 66489 20967 32781 58213
14822E8213k903j6436k4192J9974Q841j5549r010k314j9853l4347J4741L1556
$$ 58213 55310 38874 14682 34656 43497 27948 18938 16624 -3229 -37576 -22835 8721
14810H721R120j8652j4592Q366j5003m507N902k446r979N480L9402k207j877k3409
$$ 8721 17841 -811 -15403 -7037 -22040 -26547 -20645 -23091 -33070 -27590 11812 9605 7728 -15681
14796a5681N000K721j0385j0064j07j5046N375K0376K2730K6073k6904o993K5211
$$ -15681 -10681 -7960 -18345 -28409 -28516 -43562 -38187 -17811 4919 30992 4088 -2905 22306
14783B2306J2777L65k5649o488R842r100K6568J9256k2855j6719j1065O298q665
$$ 22306 35083 35448 9799 3311 13153 4053 30621 49877 27022 10303 -762 5536 -3129
14770c129n275J314P233o106k1496j5868K3254J6535M127P565p198m1982j7477
$$ -3129 -8404 -7090 143 -5963 -27459 -43327 -20073 -3538 589 8154 956 -41026 -58503
14757e8503j1089j578K9013J7989o732j1176n728K7280J2150J4569L49j3660j2623
$$ -58503 -69592 -71170 -42157 -24168 -30900 -42076 -47804 -20524 -8374 6195 6544 -7116 -19739
14744a9739n1667O941M9333L6738J1683O190l4851k0167K683k250j796p750l651
$$ -19739 -71406 -64465 -15132 21606 33289 39479 4628 -15539 -12856 -15106 -16902 -24652 -28303
14731b8303J8194K944J8743K818q4j8745j5767o208j63J5615K2489k4233k6343
$$ -28303 -10109 -7165 11578 14396 14312 -4433 -20200 -26408 -26571 -10956 11533 -12700 -39043
14718c9043j5258r222J1393J3454M4944N192l8025k2214J5307K2731J6645o630
$$ -39043 -54301 -63523 -52130 -38676 6268 11460 -26565 -48779 -33472 -10741 5904 -726
14706g26M794K1545J8305R077m8407k7066K0505l905k1430k282K7237M550K2889
$$ -726 4068 25613 43918 52995 4588 -22478 -1973 -5878 -27308 -29590 -2353 2197 25086
14693B5086o584o2033k6247M9056J0231L6667K6915k9187J038L5781J0113r821
$$ 25086 18502 -43531 -69778 -20722 -10491 26176 53091 23904 24942 60723 70836 61015
14681F1015q134j2040l6200l344J0236j3549q837r52K7651j1632k1672L2890R025
$$ 61015 52881 40841 4641 1297 11533 -2016 -10853 -11805 15846 4214 -17458 15432 24457
14668B4457q926P637l6433q228J1397O386K1316j9719j1058j4963r553l4450k3917
$$ 24457 15531 23168 -13265 -21493 -10096 -3710 17606 -2113 -13171 -28134 -37687 -72137 -96054
14655i6054O456M6851K2381j6783j9927p318L690M6501K2705k9337Q290K2430
$$ -96054 -89598 -42747 -20366 -37149 -57076 -64394 -60704 -14203 8502 -20835 -12545 9885
14643I885J7658l3470j0731j5545n655o037l4733J3260M2521l1223j0240J5705
$$ 9885 27543 -5927 -16658 -32203 -37858 -43895 -78628 -65368 -22847 -54070 -64310 -48605
14631d8605J9269J6285q071j3522n988M411J1523K6971K2955j1469K2589K4279
$$ -48605 -29336 -13051 -21122 -34644 -40632 -36221 -24698 2273 25228 13759 36348 60627
14619F0627J1902J3861J2884m6271q394l2614L491J7256j7351J1391N848m304
$$ 60627 72529 86390 99274 53003 44609 11995 15486 32742 15391 26782 32630 28326
14607B8326k4544k631k5018q349J7768M2993J3047j6953p487j1087J6391q840
$$ 28326 3782 1151 -23867 -32216 -14448 28545 41592 24639 17152 6065 22456 13616
14595A3616j9252L074J4147L5195m2941J4906R501p395k826n331k0757n7718L877
$$ 13616 -5636 -2562 11585 46780 3839 18745 28246 20851 18025 12694 -8063 -65781 -61904
14582f1904L0270j2148K2948o708j2009L2798J7139L029j7700l5260j680l5200
$$ -61904 -31634 -43782 -20834 -27542 -39551 -6753 10386 13415 -4285 -39545 -41225 -76425
14570g6425K4553M6898l268L524J1838J0466R062L091K630j2644j8386l7236r994
$$ -76425 -51872 -4974 -8242 -4718 7120 17586 26648 29739 32369 19725 1339 -35897 -45891
14557d5891j0442j3088k9689J6606K4220l637L6072M7170j2405R267j0903J0343
$$ -45891 -56333 -69421 -99110 -82504 -58284 -61921 -25849 21321 8916 18183 7280 17623
14545A7623k857l0837p237k1725N403Q483Q312j9466P878K0866q102m438K5906
$$ 17623 14766 -16071 -23308 -45033 -39630 -31147 -22835 -42301 -34423 -13557 -21659 -26097 -191
14532a91K4443m1753J1748k405n4945n0154m07K5457M5254M0988K9101j0828k4560
$$ -191 24252 -17501 -5753 -8158 -63103 -113257 -113664 -88207 -42953 -1965 27136 16308 -8252
14519h252k3535J0999p53M257r848M436K2905J4276j7429J4482L0963R807j6273
$$ -8252 -31787 -20788 -21541 -17284 -27132 -22696 209 14485 -2944 11538 42501 52308 36035
14506C6035M997j7106q553M226L3660j3454K584K6352J6032K3699j2935l2191
$$ 36035 41032 23926 15373 19599 53259 39805 42389 68741 84773 108472 95537 63346
14494F3346j9908K0219M1737O240m1219o251j3889l8885q374o647M2968L740j4753
$$ 63346 43438 63657 105394 111634 70415 64164 50275 11390 3016 -3631 39337 43077 28324
14481B8324q818l523j037q116M2583o293n2107J4693L0250k410l5550q527j8197
$$ 28324 19506 15983 14946 6830 49413 43120 -8987 5706 35956 33546 -2004 -10531 -28728
14468b8728k0640J2420J1302K0585L0315M86k6746n361m092o914n742l674l7187
$$ -28728 -49368 -36948 -25646 -5061 25254 25740 -1006 -6367 -10459 -17373 -23115 -26789 -63976
14455f3976j9380J7789L0625L7908J327r773K9802o579r407J9010j0645k18K8420
$$ -63976 -83356 -65567 -34942 2966 4293 -5480 24322 17743 8336 27346 16701 16483 44903
14442D4903K1628l4210m4352L812K8979J3235m726J7110J3466O18k339m0965j4693
$$ 44903 66531 32321 -12031 -8219 20760 33995 29269 46379 59845 60463 58124 17159 2466
14429B466O450k2022L1052j7617Q586k073l108j6874j2679k0826j6327M6029K6060
$$ 2466 8916 -13106 17946 329 8915 6842 3734 -13140 -25819 -46645 -62972 -16943 9117
14416I117O552J5536M1922j2471j4948k4721N103J8903j4113k0852k839j566L1950
$$ 9117 15669 31205 73127 60656 45708 20987 26090 44993 30880 10028 7189 5623 37573
14403C7573J9073k9821j3678j3506l3086k6571j765L1237O259N9515L0755R41
$$ 37573 56646 26825 13147 -359 -33445 -60016 -61781 -30544 -24285 35230 65985 66926
14391F6926p550l4250k2633J3750R829j8761j5115R570M4888O06j1671m9418j2698
$$ 66926 59376 25126 2493 16243 26072 7311 -7804 1766 46654 47260 35589 -13829 -26527
14378b6527J5127K4545j5196k3614k1869Q161Q121J0467J6336n573m0699m8610
$$ -26527 -11400 13145 -2051 -25665 -47534 -39373 -31252 -20785 -4449 -10022 -50721 -99331
14366i9331J2730R050N2578L9575O230J695l2945k0246k4380N434L008L178L514
$$ -99331 -86601 -77551 -24973 14602 20832 22527 -10418 -30664 -55044 -49610 -46602 -43424 -39910
14353c9910p888J5304J7447k471k8678J2201K5598M531l626J9249J7559k1322
$$ -39910 -47798 -32494 -15047 -17518 -46196 -33995 -8397 -3866 -7492 11757 29316 7994
14341G994J2533L451J2120J9187m3310l1771K0451m005J2124j0836l4329K7039
$$ 7994 20527 23978 36098 55285 11975 -19796 655 -3350 8774 -2062 -36391 -9352
14329i352P91R855j0210n330j7344L348j7401m966P309k1494J5347J2200N274
$$ -9352 -8561 1294 -8916 -14246 -31590 -28242 -45643 -50609 -43300 -64794 -49447 -37247 -31973
14316c1973J9265L4025j223k1737j0828m1934l2740K5n578j656L3313K7967J8221
$$ -31973 -12708 21317 20094 -1643 -12471 -54405 -87145 -87120 -92698 -94354 -61041 -33074 -14853
14303a4853j2998lM016k3744j0074k121L4263L948k7419K0272Q099m444m247l1525
$$ -14853 -27851 -27854 -23838 -47582 -57656 -59777 -25514 -21566 -48985 -28713 -20614 -25058 -29305 -60830
14289f0830J1692L03J9047M7808K4789k9642O523r007J7165k2069N882j8603J4893
$$ -60830 -49138 -48835 -29788 18020 42809 13167 19690 10683 27848 5779 11661 -6942 7951
14276G951n56l5577k996N608J8072J3206O532k458N791j3264j7840r501q160L2107
$$ 7951 7395 -28182 -31178 -25570 -7498 5708 12240 9782 15573 2309 -15531 -25032 -33192 -1085
14262a085n00L2011J2335m0032l3773j1453J966J0279j1905N476r397j9631m545
$$ -1085 -1585 30426 42761 2729 -31044 -42497 -40531 -30252 -42157 -36681 -46078 -65709 -70254
14249g0254M3012J1001j9892J1200K4303L106n500k0493K9981J6163l3952j0009
$$ -70254 -27242 -16241 -36133 -24933 -630 2476 -3024 -23517 6464 22627 -11325 -21334
14237b1334K625J9195N447m423l5288k368M4940J8703n245k858j9288l9480j36
$$ -21334 -18709 486 5933 1510 -33778 -36146 8794 27497 22252 19394 106 -39374 -39510
14224c9510L1296J8769P686l4096j6894L7978O218j0954j7358m531j3459J0955
$$ -39510 -8214 10555 18241 -15855 -32749 5229 11447 493 -16865 -21396 -34855 -23900
14212b3900K7068k0105J0218q851j9876j036j522Q783J0166K2203J5671J0305
$$ -23900 3168 -16937 -6719 -15570 -35446 -36482 -38004 -29221 -19055 3148 18819 29124
14200B9124p609p794k115J0757Q357j5673J12r257K0552J5865k5197R996K3425
$$ 29124 21515 13721 11606 22363 30720 15047 15159 5902 26454 42319 17122 27118 50543
14187E0543n886J5119j9485l1650j271k5356K6994K5016l5735k6999M074K1804
$$ 50543 44657 59776 40291 8641 7370 -17986 9008 34024 -1711 -28710 -24636 -2832
14175b832k276j9635k396M3874L1863P224j8906j2389L263k5253m3897o562j7758
$$ -2832 -5108 -24743 -27139 16735 48598 55822 36916 24527 27790 2537 -41360 -47922 -65680
14162f5680L5069l474k0275L9189L8540j0369J3345k171L845K6178J7929j500
$$ -65680 -30611 -34085 -54360 -15171 23369 13000 26345 24174 28019 54197 72126 70626
14150G0626o288n661J8280J1162J9406K2732P653n568l9652m889L1737M6051N338
$$ 70626 64338 58677 76957 88119 107525 130257 137910 132342 92690 87801 119538 165589 170927
14137A70927q0653l6217p456k2825j180N83l0021l5338m318L9709O153p762J3055
$$ 170927 90274 54057 46601 23776 22596 23179 -6842 -42180 -46498 -6789 -636 -8398 4657
14124D657P296n822K11k4421k0112L158J6468L0741j4279M175Q396j3957k0484
$$ 4657 11953 6131 6342 -18079 -38191 -35033 -18565 12176 -2103 2072 10468 -3489 -23973
14111b3973O78R481J4544J2749R911O488l626L236J8914J4176J4714N851R37k3689
$$ -23973 -23295 -13814 730 13479 23390 29878 26252 29488 48402 62578 77292 83143 84080 60391
14097F0391k5428j0135K5559L9869m2354l4768L6980K4035k1852o246k3003q910
$$ 60391 34963 24828 50387 90256 47902 13134 50114 74149 52297 46051 23048 14138
14085A4138k9115J3077M3292R235j6962j1745l6274k8932J1729m960J4388K9191
$$ 14138 -14977 -1900 41392 50627 33665 21920 -14354 -43286 -31557 -36517 -22129 7062
14073G062J1931J088L5850k5856j9007o013M661k2637j2898J9975M5577r373m7038
$$ 7062 18993 20081 55931 30075 11068 5055 9716 -12921 -25819 -5844 39733 30360 -16678
14060a6678k4063j1816L2117p685j567M1902j3004o707O534q963k7077j9448k084
$$ -16678 -40741 -52557 -20440 -28125 -29692 12210 -794 -7501 -967 -9930 -37007 -56455 -58539
14047e8539J1715J5001K7605M039L759l144J9792J7950l229k2786p189M735r988
$$ -58539 -46824 -31823 -4218 -179 3580 436 20228 38178 34949 12163 4974 9709 -279
14034b79p595l515O197N416n841j0218r576J8396Q214O406k8702O581o39J7398
$$ -279 -7874 -11389 -5192 224 -5617 -15835 -25411 -7015 1199 7605 -21097 -14516 -15155 2243
14020B243M391l0410n243J2304K8079j2187k9693J2424j2394o605M418j446J5919
$$ 2243 6634 -23776 -29019 -16715 11364 -823 -30516 -18092 -30486 -37091 -32673 -34119 -18200
14007a8200r079q51J549k0713M818l992o223K2096O145o283j1097j4571N203J8535
$$ -18200 -27279 -28130 -26581 -47294 -42476 -46468 -52691 -30595 -24450 -30733 -41830 -56401 -51198 -32663
13993c2663K8l0011K3423J7366J5168r478j8682j1098J534J7545K687j6034K162
$$ -32663 -32635 -62646 -39223 -21857 -6689 -16167 -34849 -45947 -44413 -26868 -24181 -40215 -38053
13980c8053P126K7314K432Q042J5422n028o849j98k1300K331L838j1586n157M459
$$ -38053 -30927 -3613 -1181 6861 22283 17255 10406 10208 -11092 -8761 -4923 -16509 -21666 -17207
13966a7207K3086K2139q906l0250n336L224K8633K4306j7650J0497j9152j2657
$$ -17207 5879 28018 19112 -11138 -16474 -13250 15383 39689 22039 32536 13384 727
13954G27q700J0696J1245j2846k9777J2698m490K1449J5218l3537k9013J2026
$$ 727 -7973 2723 13968 1122 -28655 -15957 -20447 1002 16220 -17317 -46330 -34304
13942c4304J0097n3291Q803R374K2713J9003k3767q443n415j3181L9298j5840
$$ -34304 -24207 -77498 -68695 -59321 -36608 -17605 -41372 -49815 -55230 -68411 -29113 -44953
13930d4953N755O772J2830K1138J6391j7867J3077O564j2929L953o943M871n3305
$$ -44953 -39198 -32426 -19596 1542 17933 66 13143 19707 6778 10731 3788 8659 -44646
13917d4646m864k0019M717J9836R414j467j3310K731K379k1251j3547L2944J0428
$$ -44646 -49510 -69529 -64812 -44976 -35562 -37029 -50339 -47608 -45229 -66480 -80027 -47083 -36655
13904c6655K4116j8328k8988K0023M7165J6623n344n987j0212J3739L0933K44
$$ -36655 -12539 -30867 -59855 -39832 7333 23956 18612 12625 2413 16152 47085 47329
13892D7329l1089l9008j077J2344J3758O539l3082J1707K8743R791p422l1427
$$ 47329 16240 -22768 -23845 -11501 2257 8796 -24286 -12579 16164 25955 18533 -12894
13880a2894k1613j0825K2949K3359K8199j3597j6542j2257l3902o206K1917M7960
$$ -12894 -34507 -45332 -22383 976 29175 15578 -964 -13221 -47123 -53329 -31412 16548
13868A6548o777J4824Q381j7365l6672j7090r427N0663J3844p877J8764J4314
$$ 16548 9771 24595 32976 15611 -21061 -38151 -47578 3085 16929 9052 27816 42130
13856D2130m840j2590l9214m4361J2645J6866K5570K46K770j9730k6535j394J613
$$ 42130 37290 24700 -14514 -58875 -46230 -29364 -3794 -3548 -778 -20508 -47043 -48437 -46824
13843d6824J8095or258R810L9009L2820J7338k6479l0405n925m5499l9950q403
$$ -46824 -28729 -28735 -37993 -28183 10826 43646 60984 34505 4100 -1825 -47324 -87274 -95677
13830i5677K8540K2405k5260n186M7362L2418j9736j1484J2585L7291l100l2396
$$ -95677 -67137 -44732 -69992 -75178 -27816 4602 -15134 -26618 -14033 23258 20158 -12238
13818a2238l4080R102O0774K1023j805K7674j7920j0404k7432o368k2641J5223
$$ -12238 -46318 -37216 23558 44581 42776 70450 52530 42126 14694 8326 -14315 908
13806I08R739n135K776L0864k8033j1475p885M666R535j3849Q46r270j512j0006
$$ 908 10647 5512 8288 39152 11119 -356 -8241 -3575 5960 -7889 -7043 -16313 -17825 -27831
13792b7831j1848J734J6454J6018n277M7349J1022P035j1065k3602k8938j8870
$$ -27831 -39679 -37945 -21491 -5473 -10750 36599 47621 54656 43591 19989 -8949 -27819
13780b7819p411j646K7242P730j7598n014r89j4626l722L0194L2128J0919l767
$$ -27819 -35230 -36876 -9634 -1904 -19502 -24516 -25505 -40131 -43853 -13659 18469 29388 25621
13767B5621k7350L949J9076j6265j8348j8504j4381K2684L5801n701m6331J9248
$$ 25621 -1729 2220 21296 5031 -13317 -31821 -46202 -23518 12283 6582 -39749 -20501
13755b0501K8167k3770j0588P560j6922n290l5937o994M3829N943l6101N860J8610
$$ -20501 7666 -16104 -26692 -19132 -36054 -41344 -77281 -84275 -40446 -34503 -70604 -64744 -46134
13742d6134L2473K4025j4394k7229j5029L2828Q645k2866k3081K9515L9188n834
$$ -46134 -13661 10364 -4030 -31259 -46288 -13460 -4815 -27681 -50762 -21247 17941 12107
13730A2107m0923k0575K9419J0748k8835N922J0508J0610j9366L070J5436L619
$$ 12107 -28816 -49391 -19972 -9224 -38059 -32137 -21629 -11019 -30385 -27315 -11879 -8260
13718h260Q278Q318J2686J387P880k4360J6542K6251M27k7226l3659m5042k6720
$$ -8260 18 8336 21022 22409 30289 5929 22471 48722 49149 21923 -11736 -56778 -83498
13705h3498K6464K7480P042K1716J6167J0185Q760l1705J2820L2230p334q252
$$ -83498 -57034 -29554 -22512 -796 15371 25556 34316 2611 15431 47661 40327 32075
13693C2075J9346j5010r053R921l0341k8568j6615J1443j515j9603L504k334J8004
$$ 32075 51421 36411 27358 37279 6938 -21630 -38245 -26802 -28317 -47920 -44416 -46750 -28746
13680b8746l9084j6787K9052J9427P454r522p737K1235K2177K6604J9856k8390
$$ -28746 -67830 -84617 -55565 -36138 -28684 -38206 -45943 -24708 -2531 24073 43929 15539
13668A5539m9409j5655K7631L2704K1893K919j8091m0546m1029M5387J8427k8830
$$ 15539 -33870 -49525 -21894 10810 32703 35622 17531 -23015 -64044 -18657 -230 -29060
13656b9060j3318P868K5984N843r815j1594k5349j0890k234M0010N1910J6815
$$ -29060 -42378 -34510 -8526 -2683 -12498 -24092 -49441 -60331 -62565 -22555 29355 46170
13644D6170j1910N475P538q408j6770j7290J9061M7826l723j9522q453k0712k7473
$$ 46170 34260 39735 47273 38865 22095 4805 23866 71692 67969 48447 39994 19282 -8191
13631h191o388K6774Q710k2448O054K8909J5700l6869k1581K4185L4258M904k5064
$$ -8191 -14579 12195 20905 -1543 4511 33420 49120 12251 -9330 14855 49113 54017 28953
13618B8953l4378o4r525J343k3226L018M9803r688j7618k0488k146r672J8273
$$ 28953 -5425 -5489 -15014 -13671 -36897 -33879 15924 6236 -11382 -31870 -34016 -43688 -25415
13605b5415K8110k5336k60K7567j4675o912l321M9517j1681L026r335K3094j6564
$$ -25415 2695 -22641 -22901 4666 -10009 -16921 -20242 29275 17594 20620 11285 34379 17815
13592A7815j3773J4684j5709r997j9563j2372J8191o13k4727J490O712K3995r461
$$ 17815 4042 18726 3017 -6980 -26543 -38915 -20724 -21337 -46064 -44574 -37862 -13867 -23328
13579b3328J4211m395J3952j1645M609N557m7949o892J3096J1678K7416P5882
$$ -23328 -9117 -13512 440 -11205 -6596 -1039 -48988 -55880 -42784 -31106 -3690 72192
13567G2192o504n7810Q32r096k239J9679N356j6539l1404k802j1023J8191m748
$$ 72192 65688 7878 8710 -386 -2625 17054 22410 5871 -25533 -28335 -39358 -21167 -25915
13554b5915L1460J2263r981n609j6140j1056j1187j6729Q015K2713J6410r401
$$ -25915 5545 17808 7827 2218 -13922 -24978 -36165 -52894 -44879 -22166 -5756 -15157
13542a5157o216j0878r875M204k1025k1847O349K5009K1202o332p232K877j2800
$$ -15157 -21373 -32251 -42126 -37922 -58947 -80794 -74445 -49436 -28234 -34566 -41798 -38921 -51721
13529e1721m092J3233K0028L0655L4388k0957m6136J509P952J0163j6218k0213
$$ -51721 -55813 -42580 -22552 8103 42491 21534 -24602 -23093 -15141 -4978 -21196 -41409
13517d1409k4980R895K6000K1764K8390L0025K8596k9055m0889r853J8002J1736
$$ -41409 -66389 -56494 -30494 -8730 19660 49685 78281 49226 8337 -1516 16486 28222
13505B8222j2494q04m494K533k1743K0711j9767k7511L458Q156P389j6242J2683
$$ 28222 15728 14924 10430 12963 -8780 11931 -7836 -35347 -31889 -23733 -16344 -32586 -19903
13492a9903K6240J3361k3535M0L732k2091o169j3640Q29L7451n235j7877j3136
$$ -19903 6337 19698 -3837 -3797 -65 -22156 -28325 -41965 -41136 -3685 -8920 -26797 -39933
13479c9933O403K9513K7O935k506j5293L126M395J022m739J820j3559m347J2130
$$ -39933 -33530 -4017 -3990 2945 439 -14854 -11728 -7333 -6311 -11050 -9230 -22789 -27136 -15006
13465a5006L9926j829k6552p701O652K2678N178k2117j3373J9662J0795M141j0576
$$ -15006 24920 23091 -3461 -11162 -4510 18168 23346 1229 -12144 7518 18313 22454 11878
13452A1878r121j7441j8965J6069m628r873J9921M131j7375j2172l5999k266J2750
$$ 11878 2757 -14684 -33649 -17580 -22208 -32081 -12160 -8029 -25404 -37576 -73575 -75841 -63091
13439f3091j5799k933J8149J72N500L8138M543l7193K8125O225j555n236j6097
$$ -63091 -78890 -81823 -63674 -63502 -58002 -19864 -15321 -52514 -24389 -18164 -19719 -24955 -41052
13426d1052M235L3877k3821j7239M297N527O334k1033J3383K7732J6310k7043
$$ -41052 -36817 -2940 -26761 -44000 -39703 -34176 -27842 -48875 -35492 -7760 8550 -18493
13414a8493o758K2467L9791J3677J109j5695Q49r115Q51J3131l4067j6847K2595
$$ -18493 -25251 -2784 37007 50684 51793 36098 36947 27832 28683 41814 7747 -9100 13495
13401A3495L1470J5864j6786j4922l2854m6079J391K0760k1508L848k975K7779
$$ 13495 44965 60829 44043 29121 -3733 -49812 -48421 -27661 -49169 -45321 -48296 -20517
13389b0517J5825j9461O960K2797m049K238q109l5931J7156J0286L523k544J7785
$$ -20517 -4692 -24153 -17193 5604 1555 3793 -4316 -40247 -23091 -12805 -9282 -11826 5959
13376E959K105l259J3784J5363j2164k1117J5137L4410j4491l8779k4678L2965
$$ 5959 8064 4805 18589 33952 21788 671 15808 50218 35727 -3052 -27730 5235
13364E235J9804L138j4362j5458J694k8460j7373J0210n817k971J457j375Q660
$$ 5235 25039 28177 13815 -1643 51 -28409 -45782 -35572 -41389 -44360 -42903 -44278 -35618
13351c5618M8342M544j3881K3470l591J0883j7779k2098l304j1498Q204J7250
$$ -35618 12724 17268 3387 26857 23266 34149 16370 -5728 -9032 -20530 -12326 4924
13339D924K0217j9720Q1J4591k347j8383j549Q775j2347j1680K6390J5481r246
$$ 4924 25141 5421 5502 20093 17746 -637 -2186 6589 -5758 -17438 8952 24433 15187
13326A5187J0038q643P186K2213N854j1861l0393l3082K6486K6930N254j7592
$$ 15187 25225 16582 23768 45981 51835 39974 9581 -23501 2985 29915 35169 17577
13314A7577j4441k8211q371J8527k6348J9568M3999J8139o978j7940j1677L50
$$ 17577 3136 -25075 -33446 -14919 -41267 -21699 22300 40439 33461 15521 3844 4194
13302D194J6326J3713p707M5682K6782r746k2799j15J6209j7562J2248J0860l229
$$ 4194 20520 34233 26526 72208 98990 89244 66445 66330 82539 64977 77225 88085 84856
13289H4856j6412m0049m359K7992k656K9756J2696J661l878J7620K5439L5354
$$ 84856 68444 28395 24036 52028 49372 79128 91824 93485 89607 107227 132666 168020
13277A68020R8170J03846J58635K39674K45439J75038O3298j15738j34153j51499
$$ 168020 266190 370036 528671 768345 1013784 1188822 1252120 1136382 1002229 850730
13267H50730k04495j38727q6041n3329n7049l1207m547k2935l8663N272J1807
$$ 850730 646235 507508 421467 368138 311089 279882 275335 252400 213737 219009 230816
13256B30816j7605m4523k2515k7168N683M0325j3948J1720L5236K5845P298j2973
$$ 230816 213211 168688 146173 119005 124688 165013 151065 162785 198021 223866 231164 218191
13244B18191j7110l1040k0050J656n3842J751J9614j9665N946J055k464J0149
$$ 218191 201081 170041 149991 151647 97805 99556 119170 99505 105451 106506 104042 114191
13232A14191O274o858k8906j9283K687K1061O323k608R667L4103M9454N3267N8941
$$ 114191 120465 113607 84701 65418 68105 89166 95489 92881 102548 136651 186105 239372 298313
13219B98313L6794N0533L5236N913l9061j11000o1734P91n487j7565l5506l826
$$ 298313 335107 385640 420876 426789 387728 276728 214994 215785 210298 192733 157227 153401
13207A53401M242n3738j2345K489J2902k385k8269p515k90q450j2331l909J4579
$$ 153401 157643 103905 91560 94049 106951 104566 76297 68782 68492 60042 47711 43802 58381
13194E8381K2857j2488J0847L8093J6114K6329q709k6840m021J8643L9868L4193
$$ 58381 81238 68750 79597 117690 133804 160133 151424 124584 120563 139206 179074 213267
13182B13267L382l0973O648M1673O9983J04398J79131K51202K82209K09433K6000
$$ 213267 216649 185676 192324 233997 303980 408378 587509 838711 1120920 1330353 1356353
13171A356353o3732l8158q2423j45082j15948j16834j06951q8803o2558p3959
$$ 1356353 1292621 1254463 1172040 1026958 911010 794176 687225 598422 535864 461905
13161D61905p2588p7011l5314n0162j0637K7250q030o2366l5827r19j1608K464
$$ 461905 389317 312306 276992 226830 216193 243443 235413 173047 137220 136301 124693 127157
13149A27157J9953l61j2677r664J1397J450j2073k697m8698K1134L8849L3472
$$ 127157 147110 146749 134072 124408 135805 137255 125182 122485 73787 94921 133770 167242
13137A67242N2331M4277M6693M2914J19520J77179J73882K59212L04047J95597
$$ 167242 219573 263850 310543 353457 472977 650156 824038 1083250 1387297 1582894
13127A582894Q5616P6783O6432K2185r043j08961k02381k32451k41542k14646
$$ 1582894 1668510 1745293 1811725 1833910 1824867 1715906 1513525 1281074 1039532 824886
13117H24886j66652j26571l3356k7962n3563q4880r5459m8432P737J3587l5504
$$ 824886 658234 531663 498307 470345 416782 331902 236443 188011 195748 209335 173831
13106A73831j1753j5525j0266j2705Q220l9345q206J7857q689p630K2218J4579
$$ 173831 162078 146553 136287 123582 131802 92457 84251 102108 93419 85789 108007 122586
13094A22586O762M7349K5982o757L3798K5690L6697M8979O9371J36873J51900
$$ 122586 129348 176697 202679 195922 229720 255410 292107 341086 410457 547330 699230
13083F99230R4170J05795J14381J59318K21997J13538j00333j57805j90219j74718
$$ 699230 793400 899195 1013576 1172894 1394891 1508429 1408096 1250291 1060072 885354
13073H85354j82867j53675p0457k9648p7279n9447j7749o475q3884m7392n4180
$$ 885354 702487 548812 478355 448707 371428 311981 294232 287757 203873 156481 102301
13062A02301n9271K0297M1075k1821m2008j8628k6949r187J7125L8034J8042m310
$$ 102301 43030 63327 104402 82581 40573 21945 -5004 -14191 2934 40968 59010 54700
13050E4700J314K1959M069N469l518k7851j8527K3795P391N2812M0764J4430M265
$$ 54700 56014 77973 82042 87511 83993 56142 37615 61410 68801 121613 162377 176807 181072
13037A81072K7640Q5495P7011M9084L6293k9344p1956l7042l4917l3578l0522
$$ 181072 208712 294207 371218 420302 456595 427251 355295 318253 283336 249758 219236
13026B19236m8475n0800l6933j1943K5488l4805m0804J96M0948m483n0721O903
$$ 219236 170761 119961 83028 71085 96573 61768 20964 21160 62108 57625 6904 13807
13014A3807J0633O571K3613k291m9171l8727m9810j4404M3814L1931K540M677
$$ 13807 24440 31011 54624 52333 3162 -35565 -85375 -99779 -55965 -24034 -21494 -16817
13002a6817P882J874J8138L1522K277n086j1492l8980l138K2894L246j7743R220
$$ -16817 -8935 -7061 11077 42599 44876 39790 28298 -10682 -13820 9074 12320 -5423 3797
12989C797K6755j5987j0240l4182l879k542K0955M0623L159L05Q584J1537j9596
$$ 3797 30552 14565 4325 -29857 -33736 -36278 -15323 25300 28459 28764 37348 48885 29289
12976B9289l6538k025R105J1752j001k1643K993J4946o959m2989j0125L9390L4188
$$ 29289 -7249 -9274 -169 11583 10582 -11061 -8068 6878 -81 -43070 -53195 -13805 20383
12963B0383N1563j4214k8873J8379q935k5249k0748k0491q346q567p071M3620
$$ 20383 71946 57732 28859 47238 38303 13054 -7694 -28185 -36531 -45098 -52169 -8549
12951h549K1348j0409O289K5758J4808l7205l0030j519K0452j2345K3341N3189
$$ -8549 12799 2390 8679 34437 49245 12040 -17990 -19509 943 -11402 11939 65128
12939F5128k1532k7540Q496J4947k7369J9794O745m7480j4158J6645J3196j4232
$$ 65128 43596 16056 24552 39499 12130 31924 38669 -8811 -22969 -6324 6872 -7360
12927g360m2506n20J5198M4679K3178j8855l3721k5333J1794O354K5046O955p554
$$ -7360 -49866 -50386 -35188 9491 32669 13814 -19907 -45240 -33446 -27092 -2046 4909 -2645
12914b645j5509R382j3703o164p498k619J4592K8460j571L496J7567r044j8697
$$ -2645 -18154 -8772 -22475 -28639 -36137 -38756 -24164 4296 2725 6221 23788 14744 -3953
12901c953r024m600o269j3976l1789O787j534J1091J4581K6866j003J1668k9568
$$ -3953 -12977 -17577 -23846 -37822 -69611 -62824 -64358 -53267 -38686 -11820 -12823 -1155 -30723
12888c0723n725K767J3506K4427L315J3020K6378j6852n7024j13L0079J2231j6610
$$ -30723 -36448 -33681 -20175 4252 7567 20587 46965 30113 -26911 -27024 3055 15286 -1324
12875a324J0903J882m191J4155q577j8971k6108K1917K8887j1576L229m630J3644
$$ -1324 9579 11461 7270 21425 12848 -6123 -32231 -10314 18573 6997 10226 5596 19240
12862A9240l493J1815j5963l2393j3849K5362J7909J2335K5346J8860l0423r29
$$ 19240 15747 27562 11599 -20794 -34643 -9281 8628 20963 46309 65169 34746 33817
12850C3817k0830l5099k6503J8246J491r831M187J784J0268O075L936j6903j7712
$$ 33817 12987 -22112 -48615 -30369 -28878 -38709 -34522 -32738 -22470 -16395 -12459 -29362 -47074
12837d7074j4635n658O067O128o644j8558K2556K8706M7004J3484L1047r023m6438
$$ -47074 -61709 -67367 -61300 -55172 -61816 -80374 -57818 -29112 17892 31376 62423 53400 6962
12824F962j998j9938k8493J1475L893J2037P104J6550K3041j139K4407k0789j6212
$$ 6962 4964 -14974 -43467 -31992 -28099 -16062 -8958 7592 30633 29494 53901 33112 16900
12811A6900j4177k0855J9460J2289Q195r366n482J1014N750p686l3457k546j6296
$$ 16900 2723 -18132 1328 13617 21812 12446 6964 17978 23728 16042 -17415 -19961 -36257
12798c6257P270K1931J7796R84o160J9077k2809j4505Q2L4651p37J4547j1321
$$ -36257 -28987 -7056 10740 11724 5564 24641 1832 -12673 -12591 22060 21323 35870 24549
12785B4549k3985J7251n717j2504N335l6307k4518J2686R037j3199j1581L8496
$$ 24549 564 17815 12098 -406 4929 -31378 -55896 -43210 -34173 -47372 -58953 -20457
12773b0457L6307p576p90q071k3958o289j521J0708o270J5049K9428k1726J2804
$$ -20457 15850 8274 7484 -587 -24545 -30834 -32355 -21647 -27917 -12868 16560 -5166 7638
12760G638K9292J4711l3016k8775K1290K1387j3897j9931p001l8895j8532j4840
$$ 7638 36930 51641 18625 -10150 11140 32527 18630 -1301 -8302 -47197 -65729 -80569
12748h0569J7595M0694M7015J2964J1390N079j4287l8223k0826J7054L7161J3395
$$ -80569 -62974 -22280 24735 37699 49089 54168 39881 1658 -19168 -2114 35047 48442
12736D8442n984K294L6065k4784j7570j2524K0501j5864n0836K4003P470K2996
$$ 48442 42458 44752 80817 56033 38463 25939 46440 30576 -20260 3743 11213 34209
12724C4209N634r952m8095j8487M531m935K8358N3485n85l1838k3999j9529J9914
$$ 34209 39843 29891 -18204 -36691 -32160 -37095 -8737 44748 44163 12325 -11674 -31203 -11289
12711a1289M804J8032m7686j3519J5964L5308L7478n613j3727K5009L3367k9518
$$ -11289 -6485 11547 -36139 -49658 -33694 1614 39092 33479 19752 44761 78128 48610
12699D8610k3324j4575l8413J1724K0086L6169J5997j5973k1498k7845j761K9283
$$ 48610 25286 10711 -27702 -15978 4108 40277 56274 40301 18803 -9042 -10803 18480
12687A8480R335j4863K1208K6151K868k7428l2141K1764L4057K6441L465k3090
$$ 18480 27815 12952 34160 60311 63179 35751 3610 25374 59431 85872 89337 66247
12675F6247m1906l5810K7579K8116J4552l061m514J670j7619m3585k4345J6882
$$ 66247 24341 -11469 16110 44226 58778 55717 51203 52873 35254 -8331 -32676 -15794
12663a5794m03N401Q730j8641n93L9736K5564R567L196k851l6179o592j413J9398
$$ -15794 -16197 -10796 -2066 -20707 -21300 18436 44000 53567 56763 53912 17733 11141 9728 29126
12649B9126L073j0390J6651J2454k7156p890k2410q038r492K683J9197L6480M362
$$ 29126 32199 21809 38460 50914 23758 15868 -6542 -14580 -24072 -21389 -2192 34288 38650
12636C8650L504j3450j0981q003j4587K1339m7848J2429L6805n292j5347k8954
$$ 38650 42154 28704 17723 9720 -4867 16472 -31376 -18947 17858 12566 -2781 -31735
12624c1735J466J3098K0894j8395l326r807M0647j6504O157J6794j2655K744K2931
$$ -31735 -30269 -17171 3723 -14672 -17998 -27805 12842 -3662 2495 19289 6634 9378 32309
12611C2309j1543L2691J3280k8252j0113J4120L3500k0569n1221k054l2L310K1607
$$ 32309 20766 53457 66737 38485 28372 42492 75992 55423 4202 2148 2116 5426 27033
12598B7033K1082L258O960l1977R782j6337Q236j0465j7508J0914k368m333J0979
$$ 27033 48115 51373 58333 26356 36138 19801 28037 17572 64 10978 8610 4277 15256
12585A5256Q467j8668K3968L1475l766r988k4083r784J5033j0472k5719l992K1185
$$ 15256 23723 5055 29023 60498 56732 46744 22661 12877 27910 17438 -8281 -12273 8912
12572H912L651L5266J6114l67P422r104k1932n962J4075j903k3061R682K4629
$$ 8912 12563 47829 63943 63576 70998 61894 39962 34000 48075 46172 23111 32793 57422
12559E7422j6151j4870j1821K1479j9002l4187j3666K4355M6323K6045K0978K4472
$$ 57422 41271 26401 14580 36059 17057 -17130 -30796 -6441 39882 65927 86905 111377
12547A11377j1663k5210P401K472j1008O761L3753k4470j1157P61Q845K3022k029
$$ 111377 99714 74504 81905 84377 73369 80130 113883 89413 78256 79017 87862 110884 108855
12534A08855j0726M7379K7016J1982M0467J9416J0293p322J357O1013J09852J31799
$$ 108855 98129 145508 172524 184506 224973 244389 254682 247360 248717 309730 419582 551381
12522E51381K28132L62445N67915Q83330R97241L80170l16901m89513n47223o43985
$$ 551381 779513 1141958 1709873 2593203 3590444 3970614 3653713 3164200 2616977 1972992
12512A972992n72359l41021j59138r0076j04864j02275p4909q6926p0124m3560
$$ 1972992 1400633 1059612 900474 810398 705534 603259 528350 441424 371300 327740
12502C27740m6469l7941o308J4659m8328m4430l3107J1126K919n7069j2288K5064
$$ 327740 281271 243330 237022 251681 203353 158923 125816 136942 139861 82792 70504 95568
12490I5568m488K609l950J585m1348j6511M476J6690N5744P807l2479l312L541
$$ 95568 91080 93689 89739 91324 49976 33465 37941 54631 110375 118182 85703 82391 85932
12477H5932j7892k4408K5452m428r267k5795p628p383Q385q959J9820j6982Q9
$$ 85932 68040 43632 69084 64656 55389 29594 21966 14583 22968 14009 33829 16847 16936
12464A6936j923R212L1240M222Q398K195P907L5j5922j2158k4355j2601j778o895
$$ 16936 15013 24225 55465 59687 68085 70280 78187 78222 62300 50142 25787 13186 11408 4513
12450D513J6815J2918K973K872K3027j6204m3145J9237J0188j8627m607L3732
$$ 4513 21328 34246 37219 40091 63118 46914 3769 23006 33194 14567 9960 43692
12438D3692J1024O356l2311m4457K107L6901K2359J8111L3500J350m4486k8263
$$ 43692 54716 61072 28761 -15696 -13589 23312 45671 63782 97282 98632 54146 25883
12426B5883k8823k0986L2113M9880l0958r450j06j0436j2043J0456J4353n869
$$ 25883 -2940 -23926 8187 58067 27109 17659 17553 7117 -4926 5530 19883 14014
12414A4014j2710J9556J7364O467K989O14J5531L5902N586j1467j3848j1002j2030
$$ 14014 1304 20860 38224 44691 47680 48294 63825 99727 105313 93846 79998 68996 56966
12401E6966K856K0213k3772L3550K0007m6208K94L4866q683k5455l4973j4484
$$ 56966 59822 80035 56263 89813 109820 63612 63906 98772 90089 64634 29661 15177
12389A5177j1297n68K6114J3910L69L6336K0240L487J7433K9616M0399M6699O6755
$$ 15177 3880 3312 29426 43336 43705 80041 100281 103768 121201 150817 191216 237915 304670
12376C04670N6604J1574k4351J5226J6296k4845o2882o1941m0009m0442j9929
$$ 304670 361274 372848 348497 363723 380019 355174 292292 230351 190342 149900 129971
12365A29971J2502r347k1510j01J4575j1790j9900j7028o276j0544K6736J1048
$$ 129971 142473 133126 111616 111515 126090 114300 94400 77372 71096 60552 87288 98336
12353I8336R404J7681J2234j915j8744p123l6101j5529J7084k8729j1339L8659
$$ 98336 107740 125421 137655 135740 116996 109873 73772 58243 75327 46598 35259 73918
12341G3918K9679N861j7248P259r03J6776K9038P4249L7792J3124k551O1609N5052
$$ 73918 103597 109458 92210 99469 98566 115342 144380 218629 256421 269545 266994 328603 383655
12328C83655K9186l3304n5623l9066n0264l5128j7319m3001l1499M748K6332o339
$$ 383655 412841 379537 323914 284848 234584 199456 182137 139136 107637 112385 138717 132378
12316A32378j7589j4645n5903l3598J9501J7576M750l9334O13K8862J431j2487
$$ 132378 114789 100144 44241 10643 30144 47720 52470 13136 13749 42611 44042 31555
12304C1555K6345J9233k7140k1617J8504j0963m05N2703j4425m1536k0905M628
$$ 31555 57900 77133 49993 28376 46880 35917 35512 88215 73790 32254 11349 15977
12292A5977k5749J8416M86l8642o433M2968K4341J9118j9250k8434l7508M1171
$$ 15977 -9772 8644 9130 -29512 -35945 7023 31364 50482 31232 2798 -34710 6461
12280F461M4868K1444r528l5139J488k264J2378k2013K0235r27k5122J0724L740
$$ 6461 51329 72773 63245 28106 29594 27330 39708 17695 37930 37003 11881 22605 26345
12267B6345L4370J1694j8278J2747K0004N175l7403K577Q595j306j1900K259k538
$$ 26345 60715 72409 54131 66878 86882 92057 54654 57231 65826 64520 52620 54879 52341
12254E2341K769p806j1991K9494m185l0844K3989N3427m930k5902L518l6906J4279
$$ 52341 55110 47304 35313 64807 60622 29778 53767 107194 102264 76362 79880 42974 57253
12241E7253M7455r448k6365k8904m556J1021K8616J6760m907R315K0224k3626
$$ 57253 104708 95260 68895 39991 35435 46456 75072 91832 86925 96240 116464 92838
12229I2838j7927j0363J3907J012o380R070p727j1836j7451M621K0240J7296J8265
$$ 92838 74911 64548 78455 79467 73087 82157 74430 62594 45143 49764 70004 87300 105565
12216A05565k0801J3817k5607n1472P945Q827l8621p15K4990o304r855J331o596
$$ 105565 84764 98581 72974 21502 29447 38274 -347 -1062 23928 17624 7769 9100 2504
12203B504J4763m418n827l449J6632J8780K6840J1417q985L2883j1359k4473j2398
$$ 2504 17267 12849 7022 3573 20205 38985 65825 77242 68257 101140 89781 65308 52910
12190E2910K1182J642K8356Q148j1718m91K0510k2511j5502j1596K78K383j0785
$$ 52910 74092 75734 104090 112238 100520 100029 120539 98028 82526 70930 71208 73591 62806
12177F2806q092K1880l158j9222r520k1414k4993K2100K8201J1733k4303K519
$$ 62806 54714 76594 73436 54214 44694 23280 -1713 20387 48588 60321 36018 38537
12165C8537J1905K1497J964k4931j7324L3987K3125r123q472k8306J5289L5104
$$ 38537 50442 71939 73903 48972 31648 65635 88760 79637 71165 42859 58148 93252
12153I3252m571m4667l9471J1550L5028L5773K5227N026m9615l2824O370k7236
$$ 93252 88681 44014 4543 16093 51121 86894 112121 117147 67532 34708 41078 13842
12141A3842J2233L6472K49J0723j304o611N798J6363J5116L9723J1066j4383l3573
$$ 13842 26075 62547 62796 73519 72215 65604 71402 87765 102881 142604 153670 139287 105714
12128A05714m6023K239J6067J1485J5937k0866Q42J0105j3043k3021l024l142
$$ 105714 59691 61930 77997 89482 105419 84553 85395 95500 82457 59436 56412 53270
12116E3270j3661J4211R762k1261K859j9293K8367m2178k4739K2516J8990O84
$$ 53270 39609 53820 63582 42321 45180 25887 54254 12076 -12663 9853 28843 29527
12104B9527j7580L6044K1971M720M692j9076k6643M994J0651k4689K7687R004
$$ 29527 11947 47991 69962 74682 79374 60298 33655 38649 49300 24611 52298 61302
12092F1302n471J4215j1365p294K927K2252j4568j2902J7164k6590k4870J0722
$$ 61302 55831 70046 58681 51387 54314 76566 61998 49096 66260 39670 14800 25522
12080B5522K1160l248J8737l917p29o656l503J6750m038j4783l162Q209J2003
$$ 25522 46682 43434 62171 58254 57525 50869 47366 64116 60078 45295 42133 50342 62345
12067F2345k7239J75J0278J0608k980l547P470q286R190P025J7517k3543P441
$$ 62345 35106 35281 45559 56167 53187 49640 57110 48824 58014 65039 82556 59013 66454
12054F6454N879n469m7879k1015J2841N999J0199R666k8828k6888n014m085K6482
$$ 66454 72333 66864 18985 -2030 10811 16810 27009 36675 7847 -19041 -24055 -28140 -1658
12041a658J6465k121J0979o172j2521J4068p549L710q265M2632L6862k3881j7913
$$ -1658 14807 12686 23665 17493 4972 19040 11491 15201 6936 49568 86430 62549 44636
12028D4636k4792j2628K9324K706N202L2168j220o282P323O524j2618j9219j487
$$ 44636 19844 7216 36540 39246 44448 76616 75396 69114 76437 82961 70343 51124 49637
12015D9637n172P491K4009J9926j8123l2380K3869j245k1115k3560N225K0294
$$ 49637 44465 51956 75965 95891 77768 45388 69257 68012 46897 23337 28562 48856
12003D8856j8868k0293K7881N2734Q24j3263j3856j3199k3124j6117K745K9464
$$ 48856 29988 9695 37576 90310 91134 77871 64015 50816 27692 11575 14320 43784
11991D3784M4887k5254k0440j3276j2864J7485n320l721K2099p44k805r08k0141
$$ 43784 88671 63417 42977 29701 16837 34322 29002 25281 47380 46636 43831 42923 22782
11978B2782P940j936k1460l76k6055m800N9183K1558j1606J0079k1898q507n467
$$ 22782 30722 28786 7326 6950 -19105 -23905 35278 56836 45230 55309 33411 24904 19437
11965A9437j5245j5666m307m704J5997L8219K2107m8453k3638k0638M7600L2144
$$ 19437 4192 -11474 -15781 -20485 -4488 33731 55838 7385 -16253 -36891 10709 42853
11953D2853k6065J1464m206k4702J0658l734J4810M1232q081j3910n329j4679
$$ 42853 16788 28252 24046 -656 10002 6268 21078 62310 54229 40319 34990 20311
11941B0311p267r180P968K2437K0263L219l2379j6188K8192j6737j5696L0430
$$ 20311 13044 3864 11832 34269 54532 57751 25372 9184 37376 20639 4943 35373
11929C5373J3821K730k9834k0985L4156L5622k9040j2629L8672O921j4299J2519
$$ 35373 49194 51924 22090 1105 35261 70883 41843 29214 67886 74807 60508 73027
11917G3027J7836P645j7635m8849m8642N857J952J3844K3741J2079J4558j6219
$$ 73027 90863 98508 80873 32024 -16618 -10761 -8809 5035 28776 40855 55413 39194
11905C9194P86K2570n494j4463J1154j6431o608K5854m3401l4228L4785M7304
$$ 39194 39980 62550 57056 42593 53747 37316 30708 56562 13161 -21067 13718 61022
11893F1022Q145p503k6309m515L7070L5359j1645q468o015l6762k0810j7818l1826
$$ 61022 69167 61664 35355 30840 67910 103269 91624 83156 77141 40379 19569 1751 -30075
11880c0075N9111K7935k2997l287n412K563J7257J0314o566J4781l206j673l8920
$$ -30075 29036 56971 33974 30687 25275 27838 45095 55409 48843 63624 60418 58745 19825
11867A9825N393j0691o651j6073n4314K5971N9044N882j9477o637J2152K663j2727
$$ 19825 25218 14527 7876 -8197 -62511 -36540 22504 28386 8909 2272 14424 17087 4360
11854D360K396J9173k2244j3078L2572p141Q815j628j9664K8347J9890K9880L368
$$ 4360 6756 25929 3685 -9393 23179 16038 24853 23225 3561 31908 51798 81678 85046
11841H5046k3746j1454k704J0870J982j017K0225j6934k5190L406k0434j0835
$$ 85046 61300 49846 47142 58012 59994 58977 79202 62268 37078 40484 20050 9215
11829I215J7512K8304O15k9681j0123j9660K9868L0365K9163O299k8732k4927
$$ 9215 26727 55031 55646 25965 15842 -3818 26050 56415 85578 91877 63145 38218
11817C8218m620o435J2375K7212L8318q481k9889K3839r600n5450j0947R418J5387
$$ 38218 33598 27163 39538 66750 105068 96587 66698 90537 80937 25487 14540 23958 39345
11804C9345j1367k0408K807r703M786J5051Q376k1601r671j2272l186J2153Q103
$$ 39345 27978 7570 10377 674 5460 20511 28887 7286 -2385 -14657 -17843 -5690 2413
11791B413J0200L3910N0356l6048j7046J5072M4202R372n396j6718j8769K2694
$$ 2413 12613 46523 96879 60831 43785 58857 103059 112431 107035 90317 71548 94242
11779I4242j8317P379L286k3778j0187K0211m517N262P549m506j0346p949j9551
$$ 94242 75925 83304 86590 62812 52625 72836 68319 73581 81130 76624 66278 58329 38778
11766C8778J6319L90k3323K2393P724K0574J0316k9601k8011l3860J525J1857
$$ 38778 55097 55487 32164 54557 62281 82855 93171 63570 35559 1699 3224 15081
11754A5081L9812J1010L558J6195J2767j3955k4170Q309j3760m873q808K3716
$$ 15081 54893 65903 69461 85656 98423 84468 60298 68607 54847 49974 41166 64882
11742F4882M201J2018Q90P10L623j5250k3832J4411K3709K0458k190j8396k3334
$$ 64882 69083 81101 81991 82701 86324 71074 47242 61653 85362 105820 103630 85234 61900
11729F1900m2743p288L1805M3136K0990k3501j1974L6048k335m8269J1867j3796
$$ 61900 19157 11869 43674 86810 107800 84299 72325 108373 106038 57769 69636 55840
11717E5840l6276j1253m360j1491J8807r059J8433L4340j0670P787J2881J0219
$$ 55840 19564 8311 3951 -7540 11267 2208 20641 54981 44311 52098 64979 75198
11705G5198k425J6020k3617k321J8058j8681l07p159J0708k3008k2618L3279J0662
$$ 75198 72773 88793 65176 62855 80913 62232 61925 54766 65474 42466 19848 53127 63789
11692F3789k6883K0032N431J3029L2477j1558J4224J6170j5757j6567j073l2427
$$ 63789 36906 56938 62369 75398 107875 96317 110541 126711 110954 94387 93314 60887
11680F0887l1520l467J3899J2021P802o462J2256j3152j9916M354K7552J8948
$$ 60887 29367 25900 39799 51820 59622 53160 65416 52264 32348 36702 64254 83202
11668H3202M1250k7763k5631j9094K8003j6656k6412J7022l251O847M880j8077
$$ 83202 124452 96689 71058 51964 79967 63311 36899 53921 50670 57517 62397 44320
11656D4320K372j556K316K2202J9175j968Q37M256k2432j5134j3810K8834M2482
$$ 44320 46692 45136 47452 69654 88829 86861 87698 91954 69522 54388 40578 69412 111894
11643A11894k333j9679k7721k8221j4536J9742L1890j2072p156J8941j4549M169
$$ 111894 109561 89882 62161 33940 19404 39146 71036 58964 51808 70749 56200 60369
11631F0369J658j2752l6001J5091J1137K0602k2829M5972J9866k4874j3815n378
$$ 60369 62027 49275 13274 28365 39502 60104 37275 83247 103113 78239 64424 59046
11619E9046J2189R676m514K3179J8146j1503k0084l9957j0992N4176K26K828K086
$$ 59046 71235 80911 76397 99576 117722 106219 86135 46178 35186 89362 89588 92416 94502
11606I4502N924M712k2534n002n4049J398J9560J4592l27k2735k5958L3046J810
$$ 94502 100426 105138 82604 77602 23553 24951 44511 59103 58776 36041 10083 43129 44939
11593D4939k6682J0955J0086J2599k166L563J5942K4528k1093j0334J3665R797
$$ 44939 18257 29212 39298 51897 49731 53294 69236 93764 72671 62337 76002 85799
11581H5799J5997J888k5164J3689k407o115k0381R943K4488L6672K969J8064k2865
$$ 85799 101796 103684 78520 92209 89802 83687 63306 73249 97737 134409 137378 155442 132577
11568A32577n0376k8417K1161K4015N97K1284j2079p8139j1626N2514J2433l0917
$$ 132577 82201 53784 74945 98960 99557 120841 108762 30623 18997 71511 83944 53027
11556E3027j2556N391N4897j5110k9720j3973K4156r137l1708K1002M0243k3235
$$ 53027 40471 45862 100759 85649 55929 41956 66112 56975 25267 46269 86512 63277
11544F3277j8232M8322J7979l1526j4893j5592J8642j3001K2672J8090l7945n843
$$ 63277 45045 93367 111346 79820 64927 49335 67977 54976 77648 95738 57793 51950
11532E1950J25L3301R499k8847j4612m489R201j8181k6142N842M7265J0909k5576
$$ 51950 52075 85376 94875 66028 51416 46927 56128 37947 11805 17647 64912 75821 50245
11519E0245P959l882J4896J892K0665K0258J8878n66k1931j8578R328K255k0587
$$ 50245 58204 54322 69218 71110 91775 112033 130911 130345 108414 89836 99164 101419 80832
11506H0832R744m858j1364J2178K5414L772N142p918k2271K2092K9398k0001J7514
$$ 80832 90576 85718 74354 86532 111946 115718 120860 112942 90671 112763 142161 122160 139674
11493A39674N77j3576J2727L460L1546O40n7549k2623J6158j0793j3457k8224
$$ 139674 140251 126675 139402 142862 174408 175048 117499 94876 111034 100241 86784 58560
11481E8560K7249j534k2985O455Q587L1370L380k3225k007O029j0369J2280J734
$$ 58560 85809 84275 61290 67745 76332 107702 111082 87857 85850 91879 81510 93790 95524
11468I5524L1418J4634k9404O07j394j9119l1424j3739M196J9662J3649O728l6729
$$ 95524 126942 141576 112172 112779 111385 92266 60842 47103 51299 70961 84610 91338 54609
11455E4609r676L6307j4048k7714q262K6991L1664J3640J2088r125k1345R10p186
$$ 54609 44933 81240 67192 39478 31216 58207 89871 103511 115599 106474 85129 86039 78853
11442G8853j3104j1317K4198P026J4780l415l5874K813K3073k3267j1635J7959
$$ 78853 65749 54432 78630 85656 100436 97021 61147 63960 87033 63766 52131 70090
11430G0090M187P804J2090k8256J3188L7269j7444m2364j0885J3930j235J2148
$$ 70090 74277 82081 94171 65915 79103 116372 98928 56564 45679 59609 58374 70522
11418G0522J7364J6580K7358K2418j7479K8673R509j1638l3338j249j6083M942
$$ 70522 87886 104466 131824 154242 136763 165436 174945 163307 129969 128720 112637 117579
11406A17579K240k03l902n016n342J064p115j2179R154k4358P565L772l0173Q846
$$ 117579 119819 119616 115714 110698 105356 106420 99305 87126 96280 71922 79487 83259 53086 61932
11392F1932J0752J5506L0400j3121Q856J6849m3667m690K9318j1291n2607K282
$$ 61932 72684 88190 118590 105469 114325 131174 87507 82817 112135 100844 48237 50519
11380E0519J0186l528J5876L5504M810j3964k7414J1839M0586j4305l9176k6211
$$ 50519 60705 57177 73053 108557 113367 99403 71989 83828 124414 110109 70933 44722
11368D4722j5383k0871Q936J4825N532k4234k855L4359N4845p293l958J0518l7737
$$ 44722 29339 8468 17404 32229 37761 13527 10672 45031 99876 92583 88625 99143 61406
11355F1406n175L270K1057J9683J77j8900K8471k4260l0503J9424N4893k4151
$$ 61406 56231 59501 80558 100241 100418 81518 109989 85729 55226 74650 129543 105392
11343A05392j9317J948L5310L330j0816N603r380n676j7867K1428J781j0941l0212
$$ 105392 86075 88023 123333 126663 115847 121450 112070 106394 88527 109955 111736 100795 70583
11330G0583R457J0864J5337p482k8626J7379J8480K3590Q545k0599p415J1121
$$ 70583 80040 90904 106241 98759 70133 87512 105992 129582 138127 117528 110113 121234
11318A21234m669j8332j284K755k701P04J1273j417O875J5267j8760p733j0805
$$ 121234 116565 98233 96949 99704 97003 97707 108980 107563 114438 129705 110945 103212 92407
11305I2407k858J0472L2254L3556K6813l9136k6255L2819L4052P814l0355m0983
$$ 92407 89549 100021 132275 165831 192644 153508 127253 160072 194124 201938 171583 130600
11293A30600k1283l649j6220K0434J2595J1738q818P307L5073J4270K583l4492
$$ 130600 109317 105668 89448 109882 122477 134215 125397 132704 167777 182047 184630 150138
11281A50138P995m346k6323K645k8462k0905L5839P374M8903L6055p849j4956
$$ 150138 158133 153787 127464 130109 101647 80742 116581 123955 172858 208913 201064 186108
11269A86108p058l963j5037j7868k745M090K176l3225K3969L7857Q02K4009J4611
$$ 186108 179050 175087 160050 142182 139437 143527 145703 112478 136447 174304 175106 199115 213726
11256B13726l224L772R298N251J3220M875p772j3050k2109k2097j3197P063M9751
$$ 213726 210502 214274 223572 228823 242043 246918 239146 226096 203987 181890 168693 175756 225507
11243B25507O171k5609l2849j7163L553M5379K404m036Q808j1945j4062N282J1071
$$ 225507 231678 206069 173220 156057 159610 204989 207393 203357 212165 200220 186158 191440 202511
11230B02511p464j4179Q499M8884q777m0637l0912M4271k4965l7516j0590K4034
$$ 202511 195047 180868 189367 238251 229474 188837 157925 202196 177231 139715 129125 153159
11218A53159K2967Q651j0879J3674J8043J7003K3622R476L509L6166M7926j9807
$$ 153159 176126 184777 173898 187572 205615 222618 246240 255716 259225 295391 343317 323510
11206C23510j7269o506j2551n530j8896k4177J9656K821k6320J3047N1557K1921
$$ 323510 306241 299735 287184 281654 262758 238581 258237 261058 234738 247785 299342 321263
11194C21263J7508O7766J04629J87918K70448L53555M80132N61231L79938l9775
$$ 321263 338771 406537 511166 699084 969532 1323087 1803219 2364450 2744388 2704613
11184B704613k73774l48081l65238l08608k84260j91941j13489n5583n6514q2514
$$ 2704613 2430839 2082758 1717520 1408912 1124652 932711 819222 763639 707125 624611
11174F24611p8111m4257j2957l0288n2402l5957j7501j0486m427q410k6842k9821
$$ 624611 546500 502243 489286 458998 406596 370639 353138 342652 338225 329815 302973 273152
11162B73152J8592m1202R173j2441m2784k925j16L503p781k9720R916o982k2128
$$ 273152 291744 250542 259715 247274 204490 201565 201449 204952 197171 167451 177367 170385 148257
11149A48257l422L480k8201J2423P754j9326k5699N531J1661l0884Q366L6090
$$ 148257 144835 148315 120114 132537 140291 120965 95266 100797 112458 81574 89940 126030
11137A26030J844L7473k070n8994m5171K2010O1073O2655l7464n3554J2232K9365
$$ 126030 127874 165347 163277 104283 59112 81122 142195 204850 167386 113832 126064 155429
11125A55429J1739j1305q541k7569J0884J8400j1953Q902L832J8271M6116l012
$$ 155429 167168 155863 147322 119753 130637 149037 137084 145986 149818 168089 214205 211193
11113B11193K700m6724j4789K5990n556j5044K0020j0451j2217O22J7659j4229
$$ 211193 213893 167169 152380 178370 172814 157770 177790 167339 155122 155744 173403 159174
11101A59174r214L4522K7359k7766k1062l0796J4040L662R538J4974J4504j8666
$$ 159174 149960 184482 211841 184075 163013 132217 146257 149919 159457 174431 188935 170269
11089A70269k0115j6661j3386J0538l848k478J774j3467K7659L4534l899J9442
$$ 170269 150154 133493 120107 130645 126797 124319 126093 112626 140285 174819 170920 190362
11077A90362r950j0205J152K2671m497j3733M629M2379j2032k4868K3392O684
$$ 190362 180412 170207 171359 194030 189533 175800 180429 222808 210776 185908 209300 215984
11065B15984k0252j8283K3688J0956j8342j355k1032j9051K9035J7382k5959k833
$$ 215984 195732 177449 201137 212093 193751 192396 171364 152313 181348 198730 172771 169938
11053A69938K3557j4108N8037O4190K5815j615J3415K8900K4461K1110K4154m4346
$$ 169938 193495 179387 237424 301614 327429 325814 339229 368129 392590 413700 437854 393508
11041C93508k4250P570P6441l295N563K7543K0871j2051r9675n5636l1743k7884
$$ 393508 369258 376828 453269 449974 455537 483080 503951 491900 392225 336589 304846 276962
11029B76962l9772n3456k0694j601J0091L75N9189K4634J4835k1263N776j5089
$$ 276962 237190 183734 163040 161439 171530 171905 231094 255728 270563 249300 255076 239987
11017B39987k5073k0161J130L1482M2808M1537q074j6692L4213O785k859j7753
$$ 239987 214914 194753 195883 227365 270173 311710 303636 286944 321157 327942 325083 307330
11005C07330k4872Q613J0793J951j4139o472J7398J3305j9129J005m130J305K1141
$$ 307330 282458 291071 301864 303815 289676 283204 300602 313907 294778 295783 291653 292958 314099
10992C14099Q890l5357j4478j7389P341m350K7922m461k009m763J9693J6407N1694
$$ 314099 322989 287632 273154 255765 263106 258756 286678 282217 280208 275445 295138 311545 363239
10979C63239L219R312Q732k1022o307j0926l6939k541q386K2313R677L0859k1816
$$ 363239 366458 375770 384502 363480 357173 346247 309308 306767 298381 320694 330371 361230 339414
10966C39414j4617L1614j2616J2418j0848j8569j436L5146J6046P995k9495l0580
$$ 339414 324797 356411 343795 356213 345365 326796 325360 360506 376552 384547 355052 324472
10954C24472j8259L2310J6504J4597p555J7124J9362O834J1663M792k0212L831
$$ 324472 306213 338523 355027 369624 362069 379193 398555 405389 417052 421844 401632 405463
10942D05463K5334L8216L8258J0227j875q986R283J3058K3670J7167n9708l1508
$$ 405463 430797 469013 507271 517498 515623 506637 515920 528978 552648 569815 510107 478599
10930D78599k7852m8142J331J7423J5935L3924j1235l8363J7688L7981O2874K1606
$$ 478599 450747 402605 403936 421359 437294 471218 459983 421620 439308 477289 540163 561769
10918E61769J783K1651L0602n552j882n621k25n7421k3108j439k8065J8381M3932
$$ 561769 563552 585203 615805 610253 608371 602750 602525 545104 521996 520557 492492 510873 554805
10905E54805Q2101P6620M5394k7084k3985J1599r021l653k304n118j3855Q146
$$ 554805 636906 713526 758920 731836 707851 719450 710429 706776 704472 699354 685499 693645
10893F93645M2781O471k5479Q788J5890K0192R725K1380J1804j2482K0150K5493
$$ 693645 736426 742897 717418 726206 742096 762288 772013 793393 805197 792715 812865 838358
10881H38358P652m3544k0990J9560L8267J7374K1928j5071l5185j9958l9531l7062
$$ 838358 846010 802466 781476 801036 839303 856677 878605 863534 828349 808391 768860 731798
10869G31798J7621N1844K8009L7887J3278k062L9710k2088R28K9066k7536R872
$$ 731798 749419 801263 829272 867159 880437 878375 918085 895997 896925 925991 898455 908327
10857I08327K9371L9243J3190M2791N4797O9817K8778J3754M0740M6714N3739
$$ 908327 937698 976941 990131 1032922 1087719 1157536 1186314 1200068 1240808 1287522 1341261
10846A341261M489J8207N2292L5708J6689R234O3213L2027M3553J21064J08219
$$ 1341261 1345750 1363957 1416249 1451957 1468646 1477880 1541093 1573120 1616673 1737737 1845956
10835A845956J27068J28689J19098J20053J15683J63095K36616L05171M34234
$$ 1845956 1973024 2101713 2220811 2340864 2456547 2619642 2856258 3161429 3595663
10826C595663M88877K46315j5190r4034j26648q6883o1981Q555Q4174J41865J81932
$$ 3595663 4084540 4330855 4315665 4221631 4094983 4008100 3946119 3954674 4038848 4180713 4362645
10815D362645J61888J53030J59025J65111K24626L60981M68891O02686P84318
$$ 4362645 4524533 4677563 4836588 5001699 5226325 5587306 6056197 6658883 7443201
10806G443201R34915J157154J404008J475228J199842J001069J071955J304870
$$ 7443201 8378116 9535270 10939278 12414506 13614348 14615417 15687372 16992242
10798A6992242J594382K121694K818819L722285N078670P131723J0288137J5335472
$$ 16992242 18586624 20708318 23527137 27249422 32328092 39459815 49747952 65083424
10790F5083424K3655324L6469063N4940592Q0739860J08364253J03863419K8869038
$$ 65083424 88738748 125207811 180148403 260888263 369252516 473115935 501984973
10783E01984973l9195646n8978014o8469583p5183696o4614199m3477121k6518041
$$ 501984973 462789327 403811313 335341730 260158034 195543835 152066714 125548673
10776A25548673j6967268j4183551j3810110j2415521j0627851q970946p393894
$$ 125548673 108581405 94397854 80587744 68172223 57544372 48573426 41179532
10769D1179532n935432m784368l729482k869017k475445k466807k331906k043981
$$ 41179532 35244100 30459732 26730250 23861233 21385788 18918981 16587075 14543094
10761A4543094j823130j599907j285578j091141r84615r16344q43162p03300o26270
$$ 14543094 12719964 11120057 9834479 8743338 7758723 6842379 5999217 5295917 4669647
10752D669647n80419n12032l92867l44033l24505k40841k51711k49055j94459
$$ 4669647 4089228 3577196 3184329 2840296 2515791 2274950 2023239 1774184 1579725
10743A579725j54422j13464j24653r6834m9236p1311r6812j13899m4663n3984
$$ 1579725 1425303 1311839 1187186 1090352 1041116 969805 872993 759094 714431 660447
10733F60447m508M8371K5293p028l4626m0706l3160o1236k6663l1480l5149m0097
$$ 660447 655939 704310 729603 722575 687949 647243 614083 552847 526184 494704 459555 419458
10721D19458j1758l089k6665m535o832j0153K6335J1056m2096l7472l6625l6665
$$ 419458 407700 404611 377946 373411 366579 356426 382761 393817 351721 314249 277624 240959
10709B40959k1946k3962J8501J2407j9224M8522K8947r70K5958o142p289l1802
$$ 240959 219013 195051 213552 225959 206735 255257 284204 283234 309192 303050 295761 263959
10697B63959Q423L5867m886k5748n9985l8891l102k6738j5843j4968j4702L4508
$$ 263959 272382 308249 303363 277615 217630 178739 175637 148899 133056 118088 103386 137894
10685A37894J4102K209M2098j719k6167k1958r480m878k8290r965l979j4700l2647
$$ 137894 151996 154205 196303 194584 168417 146459 136979 132101 103811 93846 89867 75167 42520
10672D2520k4056Q344J7708M205k4433l8160j7557J4065K3117K932M0346J02824
$$ 42520 18464 26808 44516 48721 24288 -13872 -31429 -17364 5753 8685 49031 151855
10660A51855Q2334K7924Q3486R1955l1773j13980p3134o2021l9610j5238k2865
$$ 151855 234189 262113 345599 437554 405781 291801 218667 156646 117036 101798 78933
10649G8933j8255K7511j1721k0564R778K4950K664o684j7935l6422l9673O315
$$ 78933 60678 88189 76468 55904 65682 90632 93296 86612 68677 32255 -7418 -1103
10637a103k3747k2944J7725n480J964j1809J1235j2401M623o273J5609K8732M3676
$$ -1103 -24850 -47794 -30069 -35549 -33585 -45394 -34159 -46560 -41937 -48210 -32601 -3869 39807
10624C9807L7390n500m4227k9805J3817j0166k0117L2923J6192k6678k2592j25
$$ 39807 77197 71697 27470 -2335 11482 1316 -18801 14122 30314 3636 -18956 -19081
10612a9081J33K7446j0482K246K9660j3490l4791j207j364l2753Q19j6824N3194
$$ -19081 -18948 8498 -1984 262 29922 16432 -18359 -19566 -20930 -53683 -52864 -69688 -16494
10599a6494L9681R038n525m7236J8587j6542j2796M1987J3700J485L3100M0304
$$ -16494 23187 32225 26700 -20536 -1949 -18491 -31287 10700 24400 25885 58985 99289
10587I9289K6775K6948L7109L5783K342k2213o2001m2306M738k1533j7833l7667
$$ 99289 126064 153012 190121 225904 228246 206033 144032 101726 106464 84931 67098 29431
10575B9431n3396j0787M0319L3879L7133k2542j6853k2716O776M1439p22j2518
$$ 29431 -23965 -34752 5567 39446 76579 54037 37184 14468 21244 62683 61961 49443
10563D9443m3681J3093J4228j0723k2503j696L0706J7732K0942J1156k1697j2236
$$ 49443 5762 18855 33083 22360 -143 -1839 28867 46599 67541 78697 57000 44764
10551D4764J7600L258k6046k5485j0481J9103J9337k7119P914K3548J069N244
$$ 44764 62364 65622 39576 14091 3610 22713 42050 14931 22845 46393 47462 52706
10539E2706J1904j6512J0649J4931J0195k0829k9199J8128J2154J3570J8774K9811
$$ 52706 64610 48098 58747 73678 83873 63044 33845 51973 64127 77697 96471 126282
10527A26282K904n598j2482j3544j739k1875j4877K28o983k0178l064K0307L3522
$$ 126282 129186 123588 111106 97562 95823 73948 59071 59299 52316 32138 29074 49381 82903
10514H2903K256J2495J0334k0070k0623J6834Q0491N3954J5637j3324J420j7674
$$ 82903 85159 97654 107988 87918 67295 84129 164620 218574 234211 220887 222307 204633
10502B04633m1821l948j4835j1568o092j5867k6021M8629J3085J0218K6943k6468
$$ 204633 162812 158864 144029 132461 126369 110502 84481 133110 146195 156413 183356 156888
10490A56888l0000k5634l6028l2705K226J6873j3822l2231K1171K5770K2480q81
$$ 156888 126888 101254 65226 32521 34747 51620 37798 5567 26738 52508 74988 74107
10478G4107J090m54k329p610M498J542j277P018n26l2712j4301J311J9865L3507
$$ 74107 75197 74743 72414 64804 69302 70844 69567 76585 76059 43347 29046 30357 50222 83729
10464H3729M992l5967m436M4806M6760M241M47P4466J09694P7558J55071K39952
$$ 83729 88721 52754 48318 93124 139884 144125 144572 219038 328732 406290 561361 801313
10452H01313K40393J03849k6676r1317j51527j53536j43061j28163q4122o3996
$$ 801313 1041706 1145555 1118879 1027562 876035 722499 579438 451275 367153 303157
10442C03157j7279j3926j2127l0996l6310j2296m094j5381K6327J0777j2631p498
$$ 303157 285878 271952 259825 228829 192519 180223 176129 160748 187075 197852 185221 177723
10430A77723l3046m95L8743R965J8336k2460m7508m0637k0210K319j1493L638
$$ 177723 144677 144182 182925 192890 211226 188766 141258 100621 80411 82730 71237 74875
10418G4875J4063J945J3610k4001j0613j392j7773L0799L7350l2190k4968K7832
$$ 74875 88938 90883 104493 80492 69879 68487 50714 81513 118863 86673 61705 89537
10406H9537j057k5548L0837J5980k9561j1151J597L5232J2925m1077m2266J190
$$ 89537 88480 62932 93769 109749 80188 69037 70634 105866 118791 77714 35448 36638
10394C6638J5716M2149K1399O162L0207J2833K9145M4674P5588Q5162P5119J27062
$$ 36638 52354 94503 115902 122064 152271 165104 194249 238923 314511 399673 474792 601854
10382F01854K10860L15583M70174N91667M45195K0380k36123l15178l69645l91287
$$ 601854 812714 1128297 1598471 2190138 2635333 2655713 2419590 2104412 1734767 1343480
10372A343480l26760j95489j00820q0383q9686j03085o4755o6705p0117J1394
$$ 1343480 1016720 821231 720411 640028 550342 447257 382502 315797 245680 257074
10362B57074j0594k4199k4695j9016J063l4823q561p70J1824k8579m3230k9168
$$ 257074 246480 222281 197586 178570 179633 144810 136249 135479 147303 118724 75494 46326
10350D6326n523k3976Q296N427K6855L4518j4923k8412Q5J9612j7636J2198M3097
$$ 46326 40803 16827 25123 30550 57405 91923 77000 48588 48673 68285 50649 62847 105944
10337A05944L3150M371j7186j611j7185j516K6561J5964k4652j3948q222n691
$$ 105944 139094 143465 126279 124668 107483 105967 132528 148492 123840 109892 101670 95979
10325I5979L3382O215l5601n056j8274q885K175Q995N0551K4297O720J4232l1204
$$ 95979 129361 135576 99975 94919 76645 67760 69935 78930 129481 153778 160498 174730 143526
10312A43526q885L9348L441m099j6663p696J5633j3722j3987K0466R544m1335
$$ 143526 134641 173989 177430 173331 156668 148972 164605 150883 136896 157362 166906 125571
10300A25571k1361J7683Q786J668j3106R898K2273j185J4834L992L7431O5231
$$ 125571 104210 121893 130679 132347 119241 129139 151412 150227 165061 169053 206484 271715
10288B71715p653l1151P291l172L056N2003P103k6575j2144P942K938J1368L2314
$$ 271715 264062 232911 240202 237030 240086 292089 299192 272617 260473 268415 271353 282721 315035
10275C15035L7255J5385j453j5581j3713J4245k1203J00j4849l4281k6783p64
$$ 315035 352290 367675 366222 350641 336928 351173 329970 330070 315221 280940 254157 253393
10263B53393L9260k5772k1846k0448j5213j3159j601J7677K3911J4856q688l1486
$$ 253393 292653 266881 245035 224587 209374 196215 194614 212291 236202 251058 242370 210884
10251B10884k699L8792L5863J4376J8303l640k1745J7477Q541q542j0188j7420
$$ 210884 208185 246977 282840 297216 315519 311879 290134 307611 316152 307610 297422 280002
10239B80002L858r737P580j7865k0598l2508l447O364o690J1903K5260Q936J7654
$$ 280002 283860 274123 281703 263838 243240 210732 207285 213649 206959 218862 244122 253058 270712
10226B70712K8904J7583J4149j7147l4234n6161m1178m239o844l679Q248L6660
$$ 270712 299616 317199 331348 314201 279967 223806 182628 178389 171545 167866 176114 212774
10214B12774j1365j9115K5256K9351K8763q038O650j5536N6412J4144k3346j5634
$$ 212774 201409 182294 207550 236901 265664 257626 264276 248740 305152 319296 295950 280316
10202B80316k2680m3756L113R397n732k903l1368j4072J439q733j5907l390M610
$$ 280316 257636 213880 216993 226390 220658 217755 186387 172315 173754 165021 149114 145724 150334
10189A50334n955N415k9238o682M1178J7517j5239J0735l755l859k9729j2040
$$ 150334 144379 149794 120556 113874 155052 172569 157330 168065 164310 160451 130722 118682
10177A18682k7701L7676J5240k0542k2211m7050k8512Q573L5119q434l584M3867
$$ 118682 90981 128657 143897 123355 101144 54094 25582 34155 69274 60840 57256 101123
10165A01123J051j9209j5869l7195k4277L1221J2552O647J2590J981j7027J6555
$$ 101123 102174 82965 67096 29901 5624 36845 49397 56044 68634 70615 53588 70143
10153G0143R408M73L1666j8001j4448L9263M007k9655m5863m682M0360j7806l1465
$$ 70143 79551 80024 111690 93689 79241 118504 122511 92856 46993 42311 82671 64865 33400
10140C3400J4658r097j0665r25K3619j1271L4637K6297j4735k5115k4673l2156
$$ 33400 48058 38961 28296 27371 50990 39719 74356 100653 85918 60803 36130 3974
10128C974M0422J4088k5625q794K9638K2643l181k8151L6961L086l1322O017k8562
$$ 3974 44396 58484 32859 24065 53703 76346 73165 45014 81975 85061 53739 59756 31194
10115C1194j2329P852J3615J1459J4270K6556m327r826k0142J1556j1368l5204
$$ 31194 18865 26717 40332 51791 66061 92617 88290 78464 58322 69878 58510 23306
10103B3306K167K1185p554l6084K347K2201j3531L007J7181K0562P398l992J299
$$ 23306 25473 46658 39104 3020 5367 27568 14037 17044 34225 54787 62185 58193 59492
10090E9492k5774l227J598J770M8834J9067K8524L281K2333K4209O13J1630k6839
$$ 59492 33718 30491 32089 33859 82693 101760 130284 133565 155898 180107 180720 192350 165511
10077A65511l5416m0760n7351J4939L1970j2290J5330M919p169L6155k8736j0331
$$ 165511 130095 89335 31984 46923 78893 66603 81933 86852 79683 115838 87102 76771
10065G6771n270j3813k1623R895K1331n324O361K7227l4287k6628K2471J0883
$$ 76771 71501 57688 36065 45960 67291 61967 68328 95555 61268 34640 57111 67994
10053F7994M847L5085M0138J1492L5381J3056j7432l0943L164K795l5867N747
$$ 67994 72841 107926 148064 159556 194937 207993 190561 159618 162782 165577 129710 135457
10041A35457m341j82j9776j7438k5350j6367K8390k4399J3131N566K4514j401
$$ 135457 131116 130934 111158 93720 68370 52003 80393 55994 69125 74691 99205 97804
10029I7804L0501r004j6388J8178K6621n609j0443M12j0976J822j3448J1095L5491
$$ 97804 128305 119301 102913 121091 147712 142103 131660 132072 121096 122918 109470 120565 156056
10016A56056J4662l5292K4679N2111M7288J764k6175j9874O485J8958o542m0922
$$ 156056 170718 135426 160105 212216 259504 261268 235093 215219 221704 240662 234120 193198
10004A93198j5872M0133k127l2816k2193K1118K858k3889N268j1219j104J5288
$$ 193198 177326 217459 215332 182516 160323 181441 184299 160410 165678 154459 153355 168643
9992A68643Q628l872j9169K2278J4451m4141n9395k0983K534J5682r550o497N548
$$ 168643 177271 173399 154230 176508 190959 146818 87423 66440 68974 84656 75106 68609 74157
9979G4157J9152L4441j5157n517m172l2905K5760k0144k040M5390k1400j0415
$$ 74157 93309 127750 112593 107076 102904 69999 95759 75615 73575 118965 97565 87150
9967H7150K198L296j2276q398J4196k1842k1823L4620K9024M285k7462r736J4087
$$ 87150 89348 92644 80368 71970 86166 64324 42501 77121 106145 110430 82968 73232 87319
9954H7319P8o660j3899j6728K9256J3856Q41j0363k9165j4118J1571N826J2880
$$ 87319 87397 80737 66838 50110 79366 93222 94063 83700 54535 40417 51988 57814 70694
9941G0694N1626K0468p155k6066N448j4460j3473Q867j287K276j6215R89J811
$$ 70694 122320 142788 135633 109567 115015 100555 87082 95949 94662 96938 80723 81712 83523
9928H3523j7315n746J5008J0328o626K077J9428o543l542r930R059K551N112J9653
$$ 83523 66208 60462 75470 85798 79172 81249 100677 94134 90592 80662 89721 92272 97384 117037
9914A17037K8044m799K254O897R692j117R991M790p754L3279M216K1369K0986
$$ 117037 145081 140282 142536 149433 159125 158008 167999 172789 165035 198314 202530 223899 244885
9901B44885J7484K9800M3075N6165M5820N5322K3974J6132j182M8406K1936o2973
$$ 244885 262369 292169 335244 391409 437229 492551 516525 532657 531475 579881 601817 538844
9889E38844m6387o943m6560n6688n7394l0299o760m9644j0948J6870q20j3415
$$ 538844 492457 485514 438954 382266 324872 294573 287813 238169 227221 244091 243271 229856
9877B29856l8105n1911j2075o799j9539J4717J8973j1936M753p686J0301N464
$$ 229856 191751 139840 127765 120966 101427 116144 135117 123181 127934 120248 130549 136013
9865A36013k0377k0687l1683J1768K4605K0468J3233q694j1737q735J8043J786
$$ 136013 115636 94949 63266 75034 99639 120107 133340 124646 112909 104174 122217 124003
9853A24003l5061j5859M1448J1710j8036L085k1424r557P760J7950K9688k0285
$$ 124003 88942 73083 114531 126241 108205 111290 89866 80309 88069 106019 135707 115422
9841A15422j4714R010m9425m3016p601O0844J8403J7692j4044j044J6815j5122
$$ 115422 100708 109718 60293 17277 9676 70520 88923 106615 92571 91527 108342 93220
9829I3220m723K9216J543m3803J5105N302m718K8976l0331L938J5261O770K6610
$$ 93220 88497 117713 119256 75453 90558 95860 91142 120118 89787 93725 108986 115756 142366
9816A42366K6348K5481n003j6448j4205j3207l5570K706J5416L176k8092l8323
$$ 142366 168714 194195 189192 172744 158539 145332 109762 112468 127884 131060 102968 64645
9804F4645k0064K5339j0102j3431J7478J3696J8161j2269p840q80J346Q368j766
$$ 64645 44581 69920 59818 46387 63865 77561 95722 83453 75613 74733 76079 84447 82681
9791H2681J3349k8396l8964L692M327K1176J3432L059j594k8733R281L206J3709
$$ 82681 96030 67634 28670 32362 36689 57865 71297 74356 72762 44029 53310 56516 70225
9778G0225M0238Q413j6524l1397j2939j59j0991q186l665j0173K7958L660j169
$$ 70225 110463 118876 102352 70955 58016 57857 46866 38680 35015 24842 52800 56460 55291
9765E5291o643J3522K0168L0945Q826m125J0148M4657N8142k759K1556p320J7567
$$ 55291 48648 62170 82338 113283 122109 117984 128132 172789 230931 228172 249728 242408 259975
9752B59975k9186l5850L325J5201m2305k9011j4879o051j1250k0414j3106J5359
$$ 259975 230789 194939 198264 213465 171160 142149 127270 121219 109969 89555 76449 91808
9740I1808L433k756J3268j2629p042k6494O023L7024o314q894l0506M004L7504
$$ 91808 95241 92485 105753 93124 86082 59588 65611 102635 96321 87427 56921 60925 98429
9727I8429p835l8294j2440m953J0624K777J138K3828J0790J7866k707k1011J7452
$$ 98429 90594 52300 39860 34907 45531 48308 49446 73274 84064 101930 99223 78212 95664
9714I5664L4537m5746o1298j7924N106J0793J1260K8081J6861l842l7303N705
$$ 95664 130201 84455 23157 5233 10339 21132 32392 60473 77334 73492 36189 41894
9702D1894M277k6600K0538N612L5170J6183J9839k7696j6759J916O118j4693m8484
$$ 41894 46171 19571 40109 45721 80891 97074 116913 89217 72458 74374 80492 65799 17315
9689A7315k0596M0538K1251J1102J6955N4352K8598k1810K3093K3497l490M20
$$ 17315 -3281 37257 58508 69610 86565 140917 169515 147705 170798 194295 190805 191225
9677A91225O913K9264O925q462j1668P080l17m5974l5417q606L176p18K1536p539
$$ 191225 198138 227402 234327 225865 214197 221277 220960 174986 139569 130963 134139 133421 154957 147418
9663A47418k8017n440R320m55l5964l2113k4736p069p548J3553N849Q849P719
$$ 147418 119401 113961 123281 122826 86862 54749 30013 22944 15396 28949 34798 43647 51366
9650E1366m884P141l567p944N790j3010l6084J8313M8972k62k6540n942N383J4057
$$ 51366 46482 53623 50056 42112 47902 34892 -1192 17121 66093 65831 39291 33349 38732 52789
9636E2789J7944j3004l51J4417K6656P866K7141P596n81j4254j7600j5472j4663
$$ 52789 70733 57729 57378 71795 98451 106317 133458 141054 140473 126219 108619 93147 78484
9623G8484m804j3972J95Q447q905j820k9834J8530J4732L0517M2297K1630K3684
$$ 78484 73680 59708 59903 68350 59445 57625 27791 46321 61053 91570 133867 155497 179181
9610A79181J7005Q535J6118q610L5506L8687K9799q774j7228k1680j4359j4164
$$ 179181 196186 204721 220839 212229 247735 286422 316221 307447 290219 268539 254180 240016
9598B40016j7716l5282o2070l229L1220q748j8163K3651k2573q213J0446j5622
$$ 240016 222300 187018 124948 121719 152939 144191 126028 149679 127106 118893 129339 113717
9586A13717K802n2881k4539J5129n894L1567M439k4393j1327j906l2595K8864
$$ 113717 116519 63638 39099 54228 48334 79901 84340 59947 48620 46714 14119 42983
9574D2983K1319r700L1165N5287p050k1547k4535l3348k8591Q807K6114K173N265
$$ 42983 64302 54602 85767 141054 134004 112457 87922 54574 25983 34790 60904 63077 68342
9561F8342K079j5648k1529O869r424J0492r19N08J7732K3893l19n087k0816L8694
$$ 68342 70421 54773 33244 40113 30689 41181 40262 40770 58502 82395 82076 76989 56173 94867
9547I4867J9588k7897k5171k9950J2531M787j0465k4271j168J4933J3462K9344
$$ 94867 114455 86558 61387 31437 43968 48755 38290 14019 12851 27784 41246 70590
9535G0590j1263K986J715j8270J0846o718n859R878J89l3145M861J2059K3837
$$ 70590 59327 62313 64028 45758 56604 49886 44027 53905 54094 20949 25810 37869 61706
9522F1706J9439K5585L9376L2455j5962O418O8560M9968L0407J9233j218l1497
$$ 61706 81145 106730 146106 178561 162599 169017 237577 287545 317952 337185 335967 304470
9510C04470P927N381j7727k2166l1354j4820R073k9268l8132p6184l2418N474
$$ 304470 312397 317778 300051 277885 246531 231711 240784 211516 173384 97200 64782 70256
9498G0256P335K2656r967k3567K4204k257k764L823K1450L724j6604k592J7870
$$ 70256 77591 100247 90280 66713 90917 88660 85896 89719 111169 114893 98289 95697 113567
9485A13567K0429P885k2444l8915l8803J2331N6144J6453j0085n0003l9494M754
$$ 113567 133996 141881 119437 80522 41719 54050 110194 126647 116562 66559 27065 31819
9473C1819M44l2000r337Q480L1419N512J4009M593J3129q793J183L1538M0533
$$ 31819 32263 263 -9074 -594 30825 36337 50346 54939 68068 59275 60458 91996 132529
9460A32529k1651j2085k9075q332K6526N837j9695P346J7559L5158J9348K2835
$$ 132529 110878 98793 69718 61386 87912 93749 74054 81400 98959 134117 153465 176300
9448A76300K6724L1988L1363M3053O3352N5725O3327J7638k4074j3239j8392o0500
$$ 176300 203024 235012 266375 309428 372780 428505 491832 509470 485396 472157 453765 393265
9436C93265o3865l5073k6683P236N014m9736l2915j1115k7202J836n8828l3459
$$ 393265 329400 294327 267644 274880 279894 230158 197243 186128 158926 160762 101934 68475
9424F8475J2513J2409l2302k2199J3678l217m093l08N731L2217K837J3976j7250
$$ 68475 80988 93397 61095 38896 52574 49357 45264 44956 50687 82904 85741 99717 82467
9411H2467q906P362O668K6649k3667r105R619M437J0855N513l97p813j8809o370
$$ 82467 73561 80923 87591 114240 90573 81468 91087 95524 106379 111892 111495 103682 84873 78503
9397G8503K5646q417k1391l3293K0545L1293Q604j4797K2134j910R054J3167K0054
$$ 78503 104149 95732 74341 41048 61593 92886 101490 86693 108827 106917 115971 129138 149192
9384A49192k2234R537J2440j924K6093J7623l2834k0368J3726J4219k3676N668
$$ 149192 126958 136495 148935 147011 173104 190727 157893 137525 151251 165470 141794 147462
9372A47462J5451L383k1640k0600l8647L663K2942j0032k1869k2135J1622K504
$$ 147462 162913 166296 144656 124056 85409 89072 112014 101982 80113 57978 69600 72104
9360G2104P865m141j1603P448J4926p09o401J4883L991j1879j604K1072j8137
$$ 72104 79969 75828 64225 71673 86599 85890 79489 94372 98363 86484 84880 105952 87815
9347H7815J1327Q327j5941m106j4766K5649j1466R531l644L364l948m954J2643
$$ 87815 99142 107469 91528 87422 72656 98305 86839 96370 92726 96090 92142 87188 99831
9334I9831K0016Q770J8632L8603K2200J3110o392L430k1201r109R438K8115J710
$$ 99831 119847 128617 147249 185852 208052 221162 214770 218200 196999 187890 197328 225443 227153
9321B27153k5001l0721l521k381R069J8386J0003l3855k5287j3764o963j2301
$$ 227153 202152 171431 167910 165529 174598 192984 202987 169132 143845 130081 123118 110817
9309A10817p712k860J6385l6375k4703m2417N75K0618K9195Q817J64k4301P164
$$ 110817 103105 100245 116630 80255 55552 13135 13710 34328 63523 72340 72504 48203 55367
9296E5367P219J2508M3823J4292K154K2073L4294J8346j4980k286R483L0897K2170
$$ 55367 62586 75094 118917 133209 135363 157436 191730 210076 195096 192810 202293 233190 255360
9283B55360j1669j3898l515K6420R475j6166k5554k1694K3301K1715k2513k9762
$$ 255360 243691 229793 226278 252698 262173 246007 220453 198759 222060 243775 221262 191500
9271A91500R733N048O673J8642M92J5546K035j4946k9636l4469O724k644k2731
$$ 191500 201233 206281 212954 231596 232088 247634 249669 234723 205087 170618 177342 174698 151967
9258A51967j8845k999M2618K1016l9314J0222L9856k805k2736j6032j6354r256
$$ 151967 133122 130123 172741 193757 154443 164665 204521 201716 178980 162948 146594 137338
9246A37338K2629J5125m380J1294M860M365m74p821L5867K7129K690j4103k0326
$$ 137338 159967 175092 170712 182006 186866 191231 190757 182936 218803 245932 248622 234519 214193
9233B14193l7293P499L0914n279o437p777J5460k3072L874l91M252L3585K2892
$$ 214193 176900 184399 215313 210034 203597 195820 211280 188208 192082 191691 195943 229528 252420
9220B52420k963m636r779j796N756m290j7102j7254N999J0976j1923K6588o850
$$ 252420 249457 244821 235042 233246 239002 234712 217610 200356 206355 217331 205408 231996 225146
9207B25146j6629M0280K3439k009r375M6904J7930j6650N992O041k5838J3005
$$ 225146 208517 248797 272236 270227 260852 307756 325686 309036 315028 321069 295231 308236
9195C08236L6919K6375L2858L5264K9377k302l3184j2802k687L5217O5279R270
$$ 308236 345155 371530 404388 439652 469029 466727 433543 420741 418054 453271 518550 527820
9183E27820J667L682J8505M9746Q760M2370M4572N140M123K0479j4234j1046L9066
$$ 527820 529487 533169 551674 601420 610180 652550 697122 702262 706385 726864 712630 701584 740650
9170G40650L9018L0665L4555J8664N6497O3833j0965Q832N2947N4684N4486L0510
$$ 740650 779668 810333 844888 863552 920049 983882 972917 981749 1034696 1089380 1143866 1174376
9158A174376M0798N0930K9503N6254R1566Q8691K8031O4962O2405N3775J07292
$$ 1174376 1215174 1266104 1295607 1351861 1443427 1532118 1560149 1625111 1687516 1741291 1848583
9147A848583Q6060P6861Q2148L5880L7622Q8257J35325Q1009R4673P3397L5434
$$ 1848583 1934643 2011504 2093652 2129532 2167154 2255411 2390736 2471745 2566418 2639815 2675249
9136B675249K9950P242O00J5383k4965o090j3906j7594m9554k2437j4459k7362
$$ 2675249 2705199 2712441 2713041 2728424 2703459 2697369 2683463 2665869 2616315 2593878 2579419 2552057
9124B552057k5833o3381r8186p7190n3584o9193r3625q5239o3726m6021n3414
$$ 2552057 2526224 2462843 2364657 2287467 2233883 2164690 2071065 1985826 1922100 1876079 1822665
9113A822665o9759q7462o8443m2769m6420p2082j00255p0357n1992j8118m3422
$$ 1822665 1752906 1665444 1597001 1554232 1507812 1435730 1335475 1265118 1213126 1195008 1151586
9102A151586m2326k6994m9129m5246k898l3568j7676k840K6226J2902j3134J9232
$$ 1151586 1109260 1082266 1033137 987891 984993 951425 933749 930909 957135 970037 956903 976135
9090I76135P737j9146l7474l0770n6456n5482k3821j8103l7062L219k7317M17
$$ 976135 983872 964726 927252 896482 840026 784544 760723 742620 705558 708777 681460 681877
9078F81877j4106m4405k5856j0772J2664k8138j4728l5071k3127l2495n6176k8592
$$ 681877 667771 623366 597510 586738 599402 571264 556536 521465 498338 465843 409667 381075
9066C81075K2169K9258m331l9312j6300J0727l498l3605J4588K0881M9329m9404
$$ 381075 403244 432502 428171 388859 372559 383286 379788 346183 360771 381652 430981 381577
9054C81577r1746n7301k9761N258K2838j730M91K0401K639j2976j570j9965j7797
$$ 381577 289831 232530 202769 208027 230865 229135 229626 250027 252666 239690 238120 218155 200358
9041B00358k3773K9278N766m062L2134m160k5951o365q3l757l0766k0866J4788
$$ 200358 176585 205863 211629 207567 239701 235541 209590 203225 203142 199385 168619 147753 162541
9028A62541m90M1250J0620r072l0685l7844k7545K600K1162J2768K9948L96l9726
$$ 162541 162051 203301 213921 204849 174164 136320 108775 111375 132537 145305 175253 175649 135923
9015A35923l9710K0955M9650K5882k1943k8573l8953k1307J4713o477r668K790
$$ 135923 96213 117168 166818 192700 170757 142184 103231 81924 96637 90160 80492 83282
9003H3282r982K9655K1903N966J7809J65q460m507q301n398r174L6158J548k1088
$$ 83282 73300 102955 124858 130824 148633 148798 140338 135831 127530 122132 112958 149116 150664 129576
8989A29576l432l6366J2658L7326j7999k565M578k4440j6937J8612K1506k7096
$$ 129576 126144 89778 102436 139762 121763 119198 123776 99336 82399 101011 122517 95421
8977I5421Q01L1747J5002k898j1025L9779k1438p479k3589j8847j5846j7182p052
$$ 95421 96222 127969 142971 140073 129048 168827 147389 139910 116321 97474 81628 64446 57394
8964E7394M3763K5828K2969J7835p615j7239l5098j960K3405R155R610L514l1578
$$ 57394 101157 126985 149954 167789 160174 142935 107837 105877 129282 138437 148047 151561 119983
8951A19983j0850l204k2615R26k4473J1917M014j1648l3400m052M4355L3390J2643
$$ 119983 109133 105929 83314 84240 59767 71684 75698 64050 30650 26598 70953 104343 116986
8938A16986p172j7205P377j3649J9644l558j5196P560K8647q281k5460j64L2713
$$ 116986 109814 92609 99986 86337 105981 102423 87227 94787 123434 115153 89693 89529 122242
8925A22242P44j5695M2300L7929j0843J3010K090k2506k6900p937k3207j0347
$$ 122242 122986 107291 149591 187520 176677 189687 191777 169271 142371 134434 111227 100880
8913A00880j0803k3765r09m989j9263J0757O067k6364r980K1295J0626K0168K0908
$$ 100880 90077 66312 65403 60414 41151 51908 57975 31611 21631 42926 53552 73720 94628
8900I4628l0435q667J8091J3994r213J6676j8007L328K0112j0902J4257R827O30
$$ 94628 64193 55526 73617 87611 78398 95074 77067 80395 100507 89605 103862 113689 114319
8887A14319k5878m0250j3233m2692O952K7265K7074j4408R48N625J8538M707k212
$$ 114319 88441 48191 34958 -7734 -782 26483 53557 39149 40097 45722 64260 68967 66755
8874F6755k5444k7887K1449J7370O773J7961O640m799J2676K8420L3267p754m4603
$$ 66755 41311 13424 34873 52243 59016 76977 83617 78818 91494 119914 153181 145427 100824
8861A00824j7339J894r987j8027j4274r949m97J3752K5904J5658l2984l2127k1307
$$ 100824 83485 85379 75392 57365 43091 33142 32645 46397 72301 87959 54975 22848 1541
8848A541M039N8408J5384N919j9476j1129j554K127K5559j038K0617m84l1387
$$ 1541 5580 63988 79372 85291 65815 54686 53132 55259 80818 79780 100397 99913 68526
8835F8526r165n97m872k7661j7623J8035L6994L3724M228n0159k1536R95j4448
$$ 68526 59361 58764 53892 26231 8608 26643 63637 97361 101589 51430 29894 30889 16441
8822A6441j1583J6104R595L5775L5188k0850L819l3784R184j4456J0818J3641
$$ 16441 4858 20962 30557 66332 101520 80670 84489 50705 59889 45433 56251 69892
8810F9892R672l0774k1381J901K1882J4689J4831J1982o735k82J2073L6141K312
$$ 69892 79564 48790 27409 29310 51192 65881 80712 92694 85959 85677 97750 133891 136203
8797A36203r348K8773K9935M42N997J7151n222K5983N0220P2166J68566K50031
$$ 136203 126855 155628 185563 186005 192002 209153 203931 229914 280134 352300 520866 770897
8785G70897K86374L10259K21918M4826l6835n551N6245P6111P7628l3966j59144
$$ 770897 1057271 1367530 1589448 1634274 1597439 1591888 1648133 1724244 1801872 1767906 1608762
8774A608762j92512k36769k35634j63159j57702o8452n3019o0137p7530k1149
$$ 1608762 1416250 1179481 943847 780688 622986 554534 501515 441378 363848 342699
8764C42699l6251n4621k5723p946j9720l0911k600N1853r598K9305j3420o389
$$ 342699 306448 251827 226104 218158 198438 167527 164927 216780 207182 236487 223067 216678
8752B16678K5527J2087L9969M3445J7871L8956N8525R2061J29957J89254L07083
$$ 216678 242205 254292 294261 337706 355577 394533 453058 545119 675076 864330 1171413
8741A171413M40966N74820N89642L52547L335k1262K6674R9281J87011R2369k07037
$$ 1171413 1612379 2187199 2776841 3129388 3132723 3111461 3138135 3237416 3424427 3516796 3309759
8730C309759l85125m16208m45529m18189l31404k15539j39472j08882q1061n3681
$$ 3309759 2924634 2508426 2062897 1644708 1313304 1097765 958293 849411 768350 714669
8720G14669l0711m3781n2260n1741p2076o7981k8164m9806j1107k378m1228l8598
$$ 714669 683958 640177 587917 536176 464100 396119 367955 318149 307042 304664 263436 224838
8708B24838J0418J9276m155k8307j6857L6333Q363L1827L5741P1619J06462J71137
$$ 224838 235256 254532 250377 222070 205213 241546 249909 281736 317477 389096 495558 666695
8696F66695K39723K77855K65143J36207l156m4847K3761N3778J09088M2596j05520
$$ 666695 906418 1184273 1449416 1585623 1582467 1537620 1561381 1615159 1724247 1766843 1661323
8685A661323j95600k37961k53210j88251j35641r2545o0847o4998l4707k7865
$$ 1661323 1465723 1227762 974552 786301 650660 558115 497268 432270 397563 369698
8675C69698o279M7944P6571O2185k025p1574o5614l8796o8316m7966m8434N646
$$ 369698 363419 411363 487934 550119 548094 476520 410906 372110 303794 255828 207394 213040
8663B13040K240k5805j9068M115l4848k8417K3771j1452j3132j8540K2183J2428
$$ 213040 215280 189475 170407 174522 139674 111257 135028 123576 110444 91904 114087 126515
8651A26515O117l651j9953P990j0216J0174L7964K937l609M967n17L3019N056
$$ 126515 132632 128981 109028 117018 106802 116976 154940 157877 154268 159235 158718 191737 196793
8638A96793k1651p545l316K5733j0297m807j3071l5614o473L2329K0204M5357
$$ 196793 175142 167597 164281 190014 179717 174910 161839 126225 119752 152081 172285 217642
8626B17642L2414L3598L0188m173k2036N561j4252j1876k0985j7974L2207K2630
$$ 217642 250056 283654 313842 309669 287633 293194 278942 267066 246081 228107 260314 282944
8614B82944k3256N961J6467J0038O235K2564k2680m4915q7229m5716J8953N0678
$$ 282944 259688 265649 282116 292154 298389 320953 298273 253358 166129 120413 139366 190044
8602A90044L0828k646m885j776R081R173J8672j7217J680P1660N8961L884k8675
$$ 190044 220872 218226 213341 211565 220646 229819 248491 231274 232954 304614 363575 367459 338784
8589C38784m8744k1209J198j2571k1350l8538q700k1120l014k7735l5634N939
$$ 338784 290040 268831 270029 257458 236108 197570 188870 167750 164736 137001 101367 107306
8577A07306j0998n169o914K8773Q567L703j469j167j5067L236J1627m3103k1181
$$ 107306 96308 91139 84225 112998 121565 125268 123799 122632 107565 110801 122428 79325 58144
8564E8144j6279L062j2555M553J5281M103J0994J810K9990K3446j1601N94J6113
$$ 58144 41865 44927 32372 36925 52206 56309 67303 69113 99103 122549 110948 111542 127655
8551A27655M2496K5584j2865k0843k6412j9073l83J8243J505J3848K846J3639
$$ 127655 170151 195735 182870 162027 135615 116542 116159 134402 135907 149755 152601 166240
8539A66240l8790k7423R853K0460o268m4209l0389k371j8221M992L0232K01l821
$$ 166240 127450 100027 109880 130340 124072 79863 49474 47103 28882 33874 64106 64307 60486
8526F0486j490l3750m39N291P318k3439k9184j7476r914Q451K7411L470l111P514
$$ 60486 58996 25246 24807 30098 37416 13977 -15207 -32683 -42597 -34146 -6735 -3265 -6376 1138
8512A138R931j570J8401J717m467K202L338j7566j4738O26l460K0373Q383k0246
$$ 1138 11069 9499 27900 29617 25150 27352 30690 13124 -1614 -988 -4448 15925 24308 4062
8498D062L377K3295L2020R544q95k9976J6094M03P525m936n0079l3843L5601Q947
$$ 4062 7439 30734 62754 72298 71403 41427 57521 57924 65449 60513 10434 -23409 12192 21139
8484B1139L1455j0302j3340N600o418r269j1213O677J308r063j3776N557M2384
$$ 21139 52594 42292 28952 34552 28134 18865 7652 14329 15637 6574 -7202 -1645 40739
8471D0739K2235K8434m1191j7423j2581k2983j9860N957J0708R097L851J4076
$$ 40739 62974 91408 50217 32794 20213 -2770 -22630 -16673 -5965 3132 6983 21059
8459B1059J9775n948K6419N1488l745l5008J543p005K0006K943l0133k3967Q531
$$ 21059 40834 34886 61305 112793 109048 74040 75583 68578 88584 91527 61394 37427 45958
8446D5958K083Q340k3549p733J2165J2415j1597k0570n5637M115K7890L9833M664
$$ 45958 48041 56381 32832 25099 37264 49679 38082 17512 -38125 -34010 -6120 33713 38377
8433C8377j173k0934k8145j2603m854K5951M7234l765n155J9298j0092k3108j2376
$$ 38377 37204 16270 -11875 -24478 -29332 -3381 43853 40088 34933 54231 44139 21031 8655
8420H655Q325j5575N851m935o271j9462L4627R703m8895l8979J5905Q277J5508
$$ 8655 16980 1405 7256 2321 -3950 -23412 11215 20918 -27977 -66956 -51051 -42774 -27266
8407b7266L835K3134L865K0568K1658k57k2506j0581l6668L023J5816J8244j7320
$$ -27266 -23431 -297 3568 24136 45794 45537 23031 12450 -24218 -21195 -5379 12865 -4455
8394d455J2194K719n4374j7983m132O428J3657K2030R935K0225q867O64k3118
$$ -4455 7739 10458 -43916 -61899 -66031 -59603 -45946 -23916 -13981 6244 -2623 -1959 -25077
8381b5077m775j2939J0571j0490J5640R534O459j274m277o900k7575j6299J5580
$$ -25077 -29852 -42791 -32220 -42710 -27070 -17536 -11077 -12351 -16628 -23528 -51103 -67402 -51822
8368e1822P373J8333k8701L187J3069K4472q807K5584L86k7118k9812k4733k896
$$ -51822 -44449 -26116 -54817 -51630 -38561 -14089 -22896 2688 3074 -24044 -53856 -78589 -81485
8355h1485J0382Q784j2733M0566N1038o839k6974k8486o707J6749L5598P596J6144
$$ -81485 -71103 -62319 -75052 -34486 16552 9713 -17261 -45747 -52454 -35705 -107 7489 23633
8342B3633l3777j0346L6955k991J0425n705l016K4653k0542j7868j5360M729q07
$$ 23633 -10144 -20490 16465 13474 23899 18194 15178 39831 19289 1421 -13939 -9210 -10017
8329a0017L0654j1000J89l880K3834J4785o687K351K1495j5670k3229k383J2452
$$ -10017 20637 9637 9826 5946 29780 44565 37878 40229 61724 46054 22825 20442 32894
8316C2894k8485j8370L0792o051J541J6538J0715N028O645k5516j7707j921N743
$$ 32894 4409 -13961 16831 10780 12321 28859 39574 44602 51247 25731 8024 6103 11846
8303A1846j3030L652l2554k9599M387J078j916J9964J8740l566m0265p777J5875
$$ 11846 -1184 2468 -30086 -59685 -55298 -54220 -56136 -36172 -17432 -20998 -61263 -69040 -53165
8290e3165M9096j2670K4252M0201K174k2884r240p074o143k8477l0796J9351M4519
$$ -53165 -4069 -16739 7513 47714 49888 27004 17764 10690 4547 -23930 -54726 -35375 9144
8277I144M585j7174k785j8758l5282L9660M2781J7524R442k4162l402l4535j5377
$$ 9144 13729 -3445 -6230 -24988 -60270 -20610 22171 39695 49137 24975 21573 -12962 -28339
8264b8339N556K0473J678k72M880j5785J4052J6967j714j6733R727j4862l3251
$$ -28339 -22783 -2310 -632 -904 3976 -11809 2243 19210 17496 763 10490 -4372 -37623
8251c7623K211k1096M610K1158K1893K6359M625j005j0084M514j7884r116k199
$$ -37623 -35412 -56508 -51898 -30740 -8847 17512 22137 21132 11048 15562 -2322 -11438 -13637
8238a3637L357j2553n353r877K2615L456k0682j294O014J2310Q289j213l299J6310
$$ -13637 -10280 -22833 -28186 -38063 -15448 -11992 -32674 -33968 -27954 -15644 -7355 -8568 -11867 4443
8224D443J49k6112Q378P576j5736k2218l2126P033L4314J8986o149L547K3344
$$ 4443 4592 -21520 -13142 -5566 -21302 -43520 -75646 -68613 -34299 -15313 -21462 -17915 5429
8211E429J561k2198k207l587m4841J3403L5287J8347o271P249J4211J3317l451
$$ 5429 6990 -15208 -17415 -21002 -65843 -52440 -17153 1194 -5077 2172 16383 29700 26249
8198B6249J8493j2026l6592J7197r198o077J0646K1036j5265l1081L9213J5315
$$ 26249 44742 32716 -3876 13321 4123 -1954 8692 29728 14463 -16618 22595 37910
8186C7910j0018o257k1777K467j1234m129j038L2095k1745l7457M229K3781K0438
$$ 37910 27892 21635 -142 2325 -8909 -13038 -14076 18019 -3726 -41183 -36954 -13173 7265
8173G265J102l7777K1185p66j8278L2263L3131j4015m3422O853M730K3228o610
$$ 7265 8367 -29410 -8225 -8991 -27269 4994 38125 24110 -19312 -12459 -7729 15499 8889
8160H889k0296j899k458J6382L2516n347L807j2443k6192J5277J8406j9343R493
$$ 8889 -11407 -13306 -15764 618 33134 27787 31594 19151 -7041 8236 26642 7299 16792
8147A6792P956l2262J6162P338P799K3548r030r766j4928L279j040m4798l2150
$$ 16792 24748 -7514 8648 15986 23785 47333 38303 28537 13609 16888 15848 -28950 -61100
8134f1100O987K9885j5539J7237J7711j0919k3712m2076n898L9208J0377K0006
$$ -61100 -54113 -24228 -39767 -22530 -4819 -15738 -39450 -81526 -87424 -48216 -37839 -17833
8122a7833K9224J7917k655O963n908k0387j2559Q304K018J0610k1733m1651K5513
$$ -17833 11391 29308 26653 33616 27708 7321 -5238 3066 5084 15694 -6039 -47690 -22177
8109b2177J4911m908Q545k714K4832J9823j2238K7948j6084j3701N021K3436J4186
$$ -22177 -7266 -12174 -3629 -6343 18489 38312 26074 54022 37938 24237 29258 52694 66880
8096F6880j0252k7647j5131n16M104j2647P376J7061L06m992k9775j4768j9111
$$ 66880 56628 28981 13850 13334 17438 4791 12167 29228 29534 24542 -5233 -20001 -39112
8083c9112k1172K6980J6829p833j1360P665M84J6843N621j7873J4936L793P005
$$ -39112 -60284 -33304 -16475 -24308 -35668 -28003 -27519 -10676 -5055 -22928 -7992 -4199 2806
8070B806o60m167j6734J0859J5946K7302P56O17J8806k4647j1776R411Q692k69
$$ 2806 2146 -2021 -18755 -7896 8050 35352 36108 36725 55531 30884 19108 28519 37211 36942
8056C6942m635J8520m507j1578p168R340p943j123L0935M0031K9034N782J7928
$$ 36942 32307 50827 46320 34742 27574 36914 28971 27848 58783 98814 127848 133630 151558
8043A51558l21r845P052k24k3699k2954m4289r564J9671K394j2455l0193Jj489
$$ 151558 151237 141392 148444 148220 124521 101567 57278 47714 67385 69779 57324 27131 27132 25643
8029B5643j2k3146j7758K9170K855k1324K2758J6565J9529j8070l1240J5160N0703
$$ 25643 25631 2485 -15273 13897 16752 -4572 18186 34751 54280 36210 4970 20130 70833
8016G0833L5654l0886l2940Q206J208k7636J7590O1589P1128J9113K3765J246
$$ 70833 106487 75601 42661 50867 52075 24439 42029 103618 174746 193859 217624 218870
8004B18870J8306j9849k3354k7837J873j3065J506q668J649K3272k2988l3091
$$ 218870 237176 217327 193973 166136 168009 154944 156450 147782 149431 172703 149715 116624
7992A16624k7705l3435l2583k522O617p646K4138q377j0564j4068j7647K2378
$$ 116624 88919 55484 22901 20379 26996 19350 43488 35111 24547 10479 -7168 15210
7980A5210j1776R85j3891M21j2348M1367K1280o772K6846K3731j0207L4464j7222
$$ 15210 3434 4419 -9472 -9051 -21399 19968 41248 34476 61322 85053 74846 109310 92088
7967I2088l5702l3308R00L4185J4842J5725K2467J7609J781J6357p832j7636p856
$$ 92088 56386 23078 23978 58163 73005 88730 111197 128806 130587 146944 139112 121476 113620
7954A13620j1858j4258K3440J9524M7035j8514j1141m8253j1970O436k4782J1856
$$ 113620 101762 87504 110944 130468 177503 158989 147848 99595 87625 94061 69279 81135
7942H1135K2107j312L35J0005j4788l5409k8943J9557K935N387J6025k457j5573
$$ 81135 103242 101930 102265 112270 97482 62073 33130 52687 55622 61009 77034 74577 59004
7929E9004J1371N286J2186J4888n1685J8219K6015j652j4137j9500n833J921j3196
$$ 59004 70375 75661 87847 102735 51050 69269 95284 93632 79495 59995 54162 56083 42887
7916D2887p097k7822M6508k468J3790J5547k9150m504m692k680R111M4508J8809
$$ 42887 35790 7968 54476 52008 65798 81345 52195 47691 42999 40319 49430 93938 112747
7903A12747k3977n8750l3475K6868K5010R034J372m4199k3989j1724n188j216
$$ 112747 88770 30020 -3455 23413 48423 57457 58829 14630 -9359 -21083 -26271 -27487
7891b7487J1237J8925K5601j1818L145K531J5211r723j0270j6774l891L4783m1233
$$ -27487 -16250 2675 28276 16458 19603 22134 37345 27622 17352 578 -3313 31470 -9763
7878i763J872K1342j643O0O612N902j8778k1654j3767L1409K062k4684k5824r615
$$ -9763 -7891 13451 11808 11868 18480 24382 5604 -16050 -29817 1592 3654 -21030 -46854 -56469
7864e6469L6352L2138K4139o582Q556k6417l555j5510k3580J5906n822j9097P146
$$ -56469 -20117 12021 36160 29578 38134 11717 8162 -7348 -30928 -15022 -20844 -39941 -32795
7851c2795O065K7514n519K3814q835K0329O087q51p62J039l0190l6653q910K0439
$$ -32795 -26730 784 -4735 19079 10244 30573 36660 35809 35047 36086 5896 -30757 -39667 -19228
7837a9228J7174k3912P420q76l5407o672l5510j7023L0649J009J3287R563J3614
$$ -19228 -2054 -25966 -18546 -19422 -54829 -61501 -97011 -114034 -83385 -82376 -69089 -59526 -45912
7824d5912L4062K9036p708J0798j6431R489J6004R963J000j8536m775k2926n3802
$$ -45912 -11850 17186 9478 20276 3845 13334 29338 39301 40301 21765 16990 -5936 -59738
7811e9738k976L7021R884L456K1471J2700j5566k865k3508k3261k4427k839P690
$$ -59738 -62714 -25693 -15809 -12353 9118 21818 6252 3387 -20121 -43382 -67809 -70648 -62958
7798f2958K6194J8370M861j8074K3864M69Q106k0725o580r654K68k4339J8942
$$ -62958 -36764 -18394 -13533 -31607 -7743 -7274 832 -19893 -26473 -36127 -35859 -60198 -41256
7785d1256J233J2904J2830q586j8256J1839k8513K485J4147L72K8967j8259j8685
$$ -41256 -40023 -27119 -14289 -22875 -41131 -29292 -57805 -55320 -41173 -40801 -11834 -30093 -48778
7772d8778J6506J6450J8243k4975q775J668q398J2047m652j0638K9997R202J3637
$$ -48778 -32272 -15822 2421 -22554 -31329 -29661 -38059 -26012 -30664 -41302 -11305 -2103 11534
7759A1534J4178l6947k5759k8928k471L7803P297m754J4854k609o833J5595M346
$$ 11534 25712 -11235 -36994 -65922 -68393 -30590 -23293 -28047 -13193 -15802 -22635 -7040 -2694
7746b694j9057k2977N116P84q106M484m004q50L874K9365L622j7865l7412J0369
$$ -2694 -21751 -44728 -39612 -38828 -46934 -42450 -46454 -47304 -43430 -14065 -10443 -28308 -65720 -55351
7732e5351K0946k1717j2375J4032N4290L5987j4807m5277k1985N758R902r871
$$ -55351 -34405 -56122 -68497 -54465 -175 35812 21005 -24272 -46257 -40499 -30597 -40468
7720d0468J156R269J4531j2592m133J3895J7644o854j7404J1331N326j2749j1009
$$ -40468 -39312 -30043 -15512 -28104 -32237 -18342 -698 -7552 -24956 -13625 -8299 -21048 -32057
7707c2057J7131j4981N87K3794J3777l3652m5218P838J9493J9709j4573J4436
$$ -32057 -14926 -29907 -29320 -5526 8251 -25401 -70619 -62781 -43288 -23579 -38152 -23716
7695b3716J4419o085J030j2108n838R153m894j595p21N930K986m196k8132p194
$$ -23716 -9297 -15382 -14352 -26460 -32298 -23145 -28039 -29634 -30355 -24425 -21439 -25635 -53767 -60961
7681f0961J5892M0753n219J2912k527o011o945j213j6096J3409o316l17K1910
$$ -60961 -45069 -4316 -9535 3377 850 -5161 -12106 -13319 -29415 -16006 -22322 -22639 -729
7668g29K2358k6626k61J7024j4191j0327j7906M743J1392j2592J5024k2813j6449
$$ -729 21629 -4997 -5258 11766 -2425 -12752 -30658 -25915 -14523 -27115 -12091 -34904 -51353
7655e1353p763L073n566J2081K9888j161j8315q104J9506J0384l308j6894n985
$$ -51353 -59116 -56043 -61609 -49528 -19640 -20801 -39116 -47220 -27714 -17330 -20638 -37532 -43517
7642d3517K5221J1691J629k1881K0493j4736n575J2232k1713l731L867K1297J4393
$$ -43517 -18296 -6605 -4976 -26857 -6364 -21100 -26675 -14443 -36156 -39887 -36020 -14723 -330
7629c30p877Q088J5207M256n1936l0256l837l562Q863K0144k3978K4992L2380
$$ -330 -8207 -119 15088 19344 -32592 -62848 -66685 -70247 -61384 -41240 -65218 -40226 -7846
7616g846o277Q31p493L123J936J7674k6782k9676L4133M210L8704L0677m0672
$$ -7846 -14123 -13292 -20785 -17662 -15726 1948 -24834 -54510 -20377 -16167 22537 53214 12542
7603A2542l0267J0841j457J2398k286J7230Q518P383k2715n235L0058j1661n1994
$$ 12542 -17725 -6884 -8341 4057 1771 19001 27519 34902 12187 6952 37010 25349 -26645
7590b6645J2273K9034O0J0065l7478j7421J8208M036J0192K6646J0701M0J1477
$$ -26645 -14372 14662 14722 24787 -12691 -30112 -11904 -7868 2324 28970 39671 39711 51188
7577E1188p207j2809j1200n582l1959j3931n289J2720l2210l2738q861J5048K0235
$$ 51188 43981 31172 19972 14390 -17569 -31500 -36789 -24069 -56279 -89017 -97878 -82830 -62595
7564f2595K2528K391K405m090j9873J3354L4572Q422J7620p97l3473N241K4953
$$ -62595 -40067 -37676 -35271 -39361 -59234 -45880 -11308 -2886 14734 13937 -19536 -14295 10658
7551A0658L3648J0788r631n685n334l185k2336l776R89l4439k9539J5196L9393
$$ 10658 44306 55094 45463 39778 34444 31259 8923 5147 6136 -28303 -57842 -42646 -3253
7538c253k315K3075K1885J4750J1028J4302J7824k0625p971k5730k1460m1377
$$ -3253 -5568 17507 39392 54142 65170 79472 97296 76671 68700 42970 21510 -19867
7526a9867l7258o149J397n104J6280M7690K1697l1194N628K0860P321n445r83
$$ -19867 -57125 -63274 -61877 -66981 -50701 -3011 18686 -12508 -6880 13980 21301 15856 14873
7513A4873L1033l2397l4175l400j319m62n257j9693Q349L594n27K3901k863m078
$$ 14873 45906 13509 -20666 -24066 -25385 -25847 -31104 -50797 -42448 -38854 -39381 -15480 -18343 -22421
7499b2421p298k6703k5337n147J2003j330q937K3118K6079J1426L5258J3417O400
$$ -22421 -29719 -56422 -81759 -86906 -74903 -76233 -85170 -62052 -35973 -24547 10711 24128 30528
7486C0528j5680l1094j9511o347r422M64k6567M785L6099K5447P6p232k3605Q886
$$ 30528 14848 -16246 -35757 -42104 -51526 -51062 -77629 -72844 -36745 -11298 -11222 -18454 -42059 -33173
7472c3173j0832k0114j643K9463L6588j3120k1238J0043M3027j802k0601j5272
$$ -33173 -44005 -64119 -65762 -36299 289 -12831 -34069 -24026 19001 17199 -3402 -18674
7460a8674p099r980K377K6267k024r474K050M0038J9653J654l8661o001J0074
$$ -18674 -25773 -35753 -33376 -7109 -9133 -18607 -16557 23481 43134 44788 6127 126 10200
7447A0200j2310r124j2757j7131P403J795o10J6169L804l0010L2622J2232k000
$$ 10200 -2110 -11234 -23991 -41122 -33719 -31924 -32534 -16365 -12561 -42571 -9949 2283 283
7434B83N380J5471m739P368J7521j9455l1415l9881j7240L405n678L3296L1609
$$ 283 5663 21134 16395 23763 41284 21829 -9586 -49467 -66707 -63302 -68980 -35684 -4075
7421d075K6106k2995n5540O047Q701l39j5922P420N817J20J9123K6758j9412L910
$$ -4075 22031 -964 -56504 -50457 -41756 -42095 -58017 -50597 -44780 -44660 -25537 1221 -18191 -14281
7407a4281J6510K1903j3644K4902m4114k8624K9358n801k0190J1697j0251o244
$$ -14281 2229 24132 10488 35390 -8724 -37348 -7990 -13791 -33981 -22284 -32535 -38779
7395c8779Q295j7665K863K1092J1212k4716l2742O105J2791k1862R795l622J132
$$ -38779 -30484 -48149 -45286 -24194 -12982 -37698 -70440 -64335 -51544 -73406 -63611 -67233 -66101
7382f6101j5375n011J1666J3376L6628o563m85r283k9856l0770M7589L7788o152
$$ -66101 -81476 -86487 -74821 -61445 -24817 -31380 -31865 -41148 -71004 -101774 -54185 -16397 -22549
7369b2549j1506p136J8062j3334K4416Q837Q229L7679l6093n9731l4143L6794
$$ -22549 -34055 -41191 -23129 -36463 -12047 -3210 5019 42698 6605 -53126 -87269 -50475
7357e0475J9139K5525J346k1642J368M4864o833j659k5111k8565j8252J8964J2501
$$ -50475 -31336 -5811 -4465 -26107 -24739 20125 13292 11633 -13478 -42043 -60295 -41331 -28830
7344b8830M2528J0308k5233m1313k9098J4340L3237K2855j0253j2634K961Q946
$$ -28830 13698 24006 -1227 -42540 -71638 -57298 -24061 -1206 -11459 -24093 -21132 -12186
7332a2186j1780j3698j5886j0510q965J8888J1464j5610J853K8867J4963J4031
$$ -12186 -23966 -37664 -53550 -64060 -73025 -54137 -42673 -58283 -56430 -27563 -12600 1431
7320A431k635k8231k1532J0621K506J1426J5910j282J6184j4745j6240R545k0771
$$ 1431 -1204 -29435 -50967 -40346 -37840 -26414 -10504 -11786 4398 -10347 -26587 -17042 -37813
7307c7813O087K8607K5450q302K0970k3087k7926n654N474p239L1102K2389j2778
$$ -37813 -31726 -3119 22331 14029 34999 11912 -16014 -21668 -16194 -23433 7669 30058 17280
7294A7280J7877l1136l0866j1762p212K8380k5853O722M2009K3205k6803j4005
$$ 17280 35157 4021 -26845 -38607 -45819 -17439 -43292 -36570 5439 28644 1841 -12164
7282a2164Q675J5771l6064q745J1842j761N22j2831k153M262L735j8259J7292
$$ -12164 -3489 12282 -23782 -32527 -20685 -22446 -21924 -34755 -36908 -32646 -28911 -47170 -29878
7269b9878j947L674m790J2373j6213J7645L1597R92m4145N165J4306k2647m4447
$$ -29878 -31825 -28151 -32941 -20568 -36781 -19136 12461 13453 -30692 -25527 -11221 -33868 -78315
7256g8315j7952K4971J7005j3096J0186J1491K7761j5878L137J7263O261j0388
$$ -78315 -96267 -71296 -54291 -67387 -57201 -45710 -17949 -33827 -30690 -13427 -7166 -17554
7244a7554N738k0053J801M081l4284O271j957M3166P404k021N326n780k5321p880
$$ -17554 -11816 -31869 -30068 -25987 -60271 -54000 -55957 -12791 -5387 -7408 -2082 -7862 -33183 -41063
7230d1063L751Q923j8810O820p652J4278L6874P533M418L1207j0673p1506j7526
$$ -41063 -37312 -28389 -47199 -40379 -48031 -33753 3121 10654 15072 46279 35606 -35900 -53426
7217e3426L793K8232J5777L602P860j2824j5808K1718O737n1123k7284j0155K01
$$ -53426 -49633 -21401 -5624 -2022 5838 -6986 -22794 -1076 5661 -45462 -72746 -82901 -82700
7204h2700J8772M384J0798K5183J9610O51q208m299k6558O791M813r31r56J5155
$$ -82700 -63928 -59544 -48746 -23563 -3953 -3302 -11510 -15809 -42367 -35576 -30763 -31694 -32650 -17495
7190a7495L7795N228j7637N77J3587k1822m7386j1405r26j7001O434J3484m336
$$ -17495 20300 25528 7891 8468 22055 233 -47153 -58558 -59484 -76485 -70051 -56567 -60903
7177f0903m6675J6055J2861L4035N120j13l617p517P084J5250J4376l554K523
$$ -60903 -107578 -91523 -78662 -44627 -39507 -39620 -43237 -50754 -43670 -28420 -14044 -17598 -15075
7164a5075j9206L761N796j4082L8174L8089j5027k502K9704K9852j3179j3789
$$ -15075 -34281 -30520 -24724 -38806 -632 37457 22430 19928 49632 79484 66305 52516
7152E2516o7807l7369J6551l929L0606j9633J7357k7267J2L684j5203l123q335
$$ 52516 -15291 -52660 -36109 -40038 -9432 -29065 -11708 -38975 -38963 -35279 -50482 -53605 -61940
7139f1940J8263J2269L0090K5892l0561m7664K799J9794J7571R071l1296k4043
$$ -61940 -43677 -31408 -1318 24574 -5987 -53651 -50852 -31058 -13487 -4416 -35712 -59755
7127e9755J4806J4200L967K3209K9768K1790k528K262m182J2930k9693k1450l6814
$$ -59755 -44949 -30749 -26782 -3573 26195 47985 45457 47719 43537 56467 26774 5324 -31490
7114c1490L1629K1607j5338n5179K2274K9068j5726j1198k2556O690J5931J4585
$$ -31490 139 21746 6408 -48771 -26497 2571 -13155 -24353 -46909 -40219 -24288 -9703
7102i703J8991K9825j3055m5263j4052j2555k4734l028L6380M2775o454K572r84
$$ -9703 9288 39113 26058 -19205 -33257 -45812 -70546 -73574 -37194 5581 -873 1699 715
7089G15l0594M644P455r902j5026j4534p281K6653J0973j8661J4061N224J980
$$ 715 -29879 -25235 -17780 -27682 -42708 -57242 -64523 -37870 -26897 -45558 -31497 -26273 -24293
7076b4293J4678q742K3273J3390k5019k4536k5904j4768N768K6820L4575K0287
$$ -24293 -9615 -18357 4916 18306 -6713 -31249 -57153 -71921 -66153 -39333 -4758 15529
7064A5529l7340j7118K1915J7001J5865j0631L801J4973q660J035j7499J392L613
$$ 15529 -21811 -38929 -17014 -13 15852 5221 9022 23995 15335 16370 -1129 263 3876
7051C876L305j914m886p428k6000j1884P061M425J3593J0569l119j3761k1736
$$ 3876 7181 5267 381 -7047 -33047 -44931 -37870 -33445 -19852 -9283 -12402 -26163 -47899
7038d7899j4955k167p421k6440J9231j623J818K5531M0262J4536N083J0938j7038
$$ -47899 -62854 -65021 -72442 -98882 -79651 -81274 -79456 -53925 -13663 873 5956 16894 -144
7025a44p754k2316j0240J8417N349j87r976P4j2198n288L689J8463K3882Q680
$$ -144 -7898 -30214 -40454 -22037 -16688 -16875 -26851 -26777 -38975 -44263 -40574 -22111 1771 10451
7011A0451m253j497m65K1380o240m0873j2611j7526n132Q970R903M0491K211k5682
$$ 10451 6198 4701 4236 25616 19376 -21497 -34108 -51634 -56766 -47796 -37893 2598 4809 -20873
6997b0873k6721j9562L175M2886L0972l730m5019r977K9683L2006J321K2108n661
$$ -20873 -47594 -67156 -63981 -21095 9877 6147 -38872 -48849 -19166 12840 14161 36269 30608
6984C0608n8748k372m790j0440j6671M040J2123m345J8046K9064L8558J342j6245
$$ 30608 -28140 -30512 -35302 -45742 -62413 -58373 -46250 -50595 -32549 -3485 35073 36415 20170
6971B0170k4727j0959k072m8786J5674M2315J849r2k666j6539K0401k1219J3963
$$ 20170 -4557 -15516 -17588 -66374 -50700 -8385 -6536 -6628 -9294 -25833 -5432 -26651 -12688
6958a2688O3936R614k7688m157J787l1553k1268m838n057K2140p064J9697J8451
$$ -12688 51248 60862 33174 29017 30804 -749 -22017 -26855 -31912 -9772 -16836 2861 21312
6945B1312j6152l5152J2388j0248k3621J1805L4170k562k2732M557J0269L335
$$ 21312 5160 -29992 -17604 -27852 -51473 -39668 -5498 -8060 -30792 -26235 -15966 -12631
6933a2631J8064J8856J4250l0580j9576k6452j0874J0538K1920J9067n13p514
$$ -12631 5433 24289 38539 7959 -11617 -38069 -48943 -38405 -16485 2582 2069 -5445
6921e445j0670l247l5100n369J5981M9803K0595j1871l4578k5035K7313K9342
$$ -5445 -16115 -19362 -54462 -59831 -43850 5953 26548 14677 -19901 -44936 -17623 11719
6909A1719K629q36j0344q075P818J6035K8211l2973l3535k3714l2250j4030K4455
$$ 11719 14348 13512 3168 -4907 2911 18946 47157 14184 -19351 -43065 -75315 -89345 -64890
6896f4890M0277K7724M811J501O680k9829M877j0321j8108k2696J2956L1209J0074
$$ -64890 -24613 3111 7922 9423 16103 -13726 -8849 -19170 -37278 -59974 -47018 -15809 -5735
6883e735j5923l4470K26K2490J3423M679M637J8882P794j8536J2902O803k107
$$ -5735 -21658 -56128 -55902 -33412 -19989 -15310 -10673 8209 16003 -2533 10369 17172 15065
6870A5065n638q850p51K5281J6338K20Q805k6097M788j0798j6742j9985j1866
$$ 15065 9427 577 -174 25107 41445 41665 50470 24373 29161 18363 1621 -18364 -30230
6857c0230j605q778J265Q347L5404K1674k8088K653M5003p638k5834k3547m273
$$ -30230 -31835 -40613 -39348 -31001 4403 26077 -2011 642 45645 38007 12173 -11374 -15647
6844a5647L1535N382J8138l9804n0172j0486K4823L7246M583J7992O594J0814
$$ -15647 15888 21270 39408 -396 -50568 -61054 -36231 1015 5598 23590 30184 40998
6832D0998k1253k1717k0230K6834M1177j9350j3551J1193j1424k5102j9789J9984
$$ 40998 19745 -1972 -22202 4632 45809 26459 12908 24101 12677 -12425 -32214 -12230
6820a2230J4702l1030J6949n482n307j510M879L152K9956K1272J9211r386R209
$$ -12230 2472 -28558 -11609 -17091 -22398 -23908 -19029 -15877 14079 35351 54562 45176 54385
6807E4385o2113j9385L2963j6032K5097J0621j3704n483j8505r758J0204j5375
$$ 54385 -7728 -27113 5850 -10182 14915 25536 11832 6349 -12156 -21914 -11710 -27085
6795b7085k1699L1205L9230M963O195M520j3298p753O732j5137k3177k2989k4276
$$ -27085 -48784 -17579 21651 26614 32809 37329 24031 16278 23010 7873 -15304 -38293 -62569
6782f2569J7845L7899J8719j101j1857K7863j2807k1867L0088R621j389N804l5524
$$ -62569 -44724 -6825 11894 10793 -1064 26799 13992 -7875 22213 31834 30445 36249 725
6769G25l6177k5236l619O1402L3464K643j0305k1922M453r305r965j4501j1070
$$ 725 -35452 -60688 -64307 -2905 30559 33202 22897 975 5428 -3877 -13842 -28343 -39413
6756c9413L6181n259n258l8203J0778L1381j3593k2280o156k784J125J1436K0713
$$ -39413 -3232 -8491 -13749 -51952 -41174 -9793 -23386 -45666 -51822 -54606 -53481 -42045 -21332
6743b1332K7202K1760k843J429o295j7179M2751L8448l1456J099J0883j6864q450
$$ -21332 5870 27630 24787 26216 19921 2742 45493 83941 52485 53584 64467 47603 39153
6730C9153o091N54j8231J9816J0823n819J6420O914k1804J7722k3541k1094K829
$$ 39153 33062 33616 15385 35201 46024 40205 56625 63539 41735 59457 35916 14822 17651
6717A7651m2993J3254K3079K3486J3218j1933n180k350L784k495q80O433j2894
$$ 17651 -25342 -12088 10991 34477 47695 35762 30582 28232 32016 29521 28641 35074 22180
6704B2180k8042J0605k7780l238K689J8921J654k5753j6671j545K5604L1222K474
$$ 22180 -5862 4743 -23037 -26275 -23586 -4665 -3011 -28764 -45435 -46980 -21376 9846 12320
6691A2320K861J5552j2335m4143n0101k0112N7904N3470O904k005k484l2586L090
$$ 12320 15181 30733 18398 -25745 -75846 -95958 -38054 15416 22320 20315 17831 -14755 -11665
6678a1665j2292o578P439k1400k8279J7715K6231n618O98M3343K9981l2186k9980
$$ -11665 -23957 -30535 -23096 -44496 -72775 -55060 -28829 -34447 -33749 9594 39575 7389 -22591
6665b2591q582k1230L1594J3792p681m952k0221k4208j6202j3585K3656K1278
$$ -22591 -31173 -52403 -20809 -7017 -14698 -19650 -39871 -64079 -80281 -93866 -70210 -48932
6653d8932Qj4206p879n592K3770K5124J4848N2043J7067j6206j8527k4502j6336
$$ -48932 -48924 -63130 -71009 -76601 -52831 -27707 -12859 39184 56251 40045 21518 -2984 -19320
6640a9320l3947J9403L4887k996j5260J1675K9873j414K000r310M376K1193j7227
$$ -19320 -53267 -33864 1023 -1973 -17233 -5558 24315 22901 24901 15591 19967 41160 23933
6627B3933j2522j3775K103k959Q599j2506k6944K1183j1774J5446j4842j6811
$$ 23933 11411 -2364 -261 -3220 5379 -7127 -34071 -12888 -24662 -9216 -24058 -40869
6615d0869j402L9319J5089K4084l5897j1872l14k5834P281r22n206P315K8552
$$ -40869 -42271 -2952 12137 36221 324 -11548 -11862 -37696 -30415 -31337 -36543 -29228 -676
6602f76J416l1404N390Q242K391M5182j2366j1275j6810J2102J1377k0281K1739
$$ -676 740 -30664 -25274 -17032 -14641 30541 18175 6900 -9910 2192 13569 -6712 15027
6589A5027L7893q494m2295k902n143m4549o984L2693K7597j6608j02n7659j7945
$$ 15027 52920 44426 2131 -771 -5914 -50463 -57447 -24754 2843 -13765 -13867 -71526 -89471
6576h9471L6731J4655J3652m129J0922J7745q632k5521l2791K7376J1062m921
$$ -89471 -52740 -38085 -24433 -28562 -17640 105 -8527 -34048 -66839 -39463 -28401 -33322
6564c3322o738l540J4755L1314J3836P807J1105J0935k0065k3994l9242l9268
$$ -33322 -40060 -43600 -28845 2469 16305 24112 35217 46152 26087 2093 -37149 -76417
6552g6417K0726K6412Q993r766O812k0113L6K536M927K211O118M417l5090K4019
$$ -76417 -55691 -29279 -20286 -30052 -23240 -43353 -43317 -40781 -35854 -33643 -27525 -23108 -58198 -34179
6538c4179K4832j3763P42k1881k3290R51L1307J7929n0881k0035M1862M7272Q804
$$ -34179 -9347 -23110 -22368 -44249 -67539 -66588 -35281 -17352 -68233 -88268 -46406 866 9670
6525I670j6750l7371m177J3641J1034j0193L559r548J991K9244K6694K4352k6122
$$ 9670 -7080 -44451 -48628 -34987 -23953 -34146 -30587 -40135 -38144 -8900 17794 42146 16024
6512A6024n3312k2886J9432K2263Q688J2010j6455o621L185j0821p037k7358J75
$$ 16024 -37288 -60174 -40742 -18479 -9791 2219 -14236 -20857 -17672 -28493 -35530 -62888 -62713
6499f2713M4557K7741j8116j8929L01K660q458K0995o151k4897r151J315J5499
$$ -62713 -18156 9585 -8531 -27460 -27159 -24499 -32957 -11962 -18113 -43010 -52161 -50846 -35347
6486c5347L7479J7461k1964N433K889j0145k1857k5055J3374N0917K4791k4615
$$ -35347 2132 19593 -2371 3062 5951 -4194 -26051 -51106 -37732 13185 37976 13361
6474A3361l4380m121j9756j8441j3141j2895J940J5800J9972J4164M1K3458L181
$$ 13361 -21019 -25140 -44896 -63337 -76478 -89373 -87433 -71633 -51661 -37497 -37456 -13998 -10817
6461a0817P401j8989J4780L1015k3785l6864j0648n409o821J8776j653J9403J3348
$$ -10817 -3416 -22405 -7625 23390 -395 -37259 -47907 -53316 -60137 -41361 -43014 -23611 -10263
6448a0263J3501J9684l6858r440n221K288j44K6244J2372o834J3662q429L239
$$ -10263 3238 22922 -13936 -23376 -28597 -26309 -26453 -209 12163 5329 18991 10562 13801
6435A3801p504l2097m9839J4545O5893L3679n807j7304p25l566J6126j4898q471
$$ 13801 6297 -25800 -75639 -61094 4799 38478 32671 15367 14642 11076 27202 12304 3833
6422C833J3939l2883l1994j7653L525K0842L7603q787P289J5714J8221j0672k9377
$$ 3833 17772 -15111 -47105 -64758 -61233 -40391 -2788 -11575 -4286 11428 29649 18977 -10400
6409a0400r548P262k528o576K728K8965J6646J5078k3508l7904j0768K2824q38
$$ -10400 -19948 -12686 -15214 -21790 -19062 9903 26549 41627 18119 -19785 -30553 -7729 -8567
6396h567P697K2981K9647K3758m0883l8904l690K3577k0735l4620k2361J1273
$$ -8567 -870 22111 51758 75516 34633 -4271 -7961 15616 -5119 -39739 -62100 -50827
6384e0827k5372k6777L2222K9059K699j2038K2939Q711Q033J1139j1702j8814
$$ -50827 -76199 -102976 -70754 -41695 -38996 -51034 -28095 -19384 -11351 -212 -11914 -30728
6372c0728n5315j2818L3087L7014j451q087L611m069Q982n221M277J1044N6429
$$ -30728 -86043 -98861 -65774 -28760 -30211 -38298 -34687 -38756 -29774 -34995 -30718 -19674 36755
6359C6755K0216l2949k4371o967k3936q653j477J7812K1442N827J6998k0423k2493
$$ 36755 56971 24022 -349 -7316 -31252 -39905 -41382 -23570 -2128 3699 20697 274 -22219
6346b2219k3153m362J6770j8926n182K8674j57j5004J0175Q676j0989k9389k7529
$$ -22219 -45372 -49734 -32964 -51890 -57072 -28398 -28555 -43559 -33384 -24708 -35697 -65086 -92615
6333i2615J6859K0570J1190J3838j1089J7748L217L174J7088J4256k878o377M1692
$$ -92615 -75756 -55186 -43996 -30158 -41247 -23499 -20282 -17108 -20 14236 11358 4981 46673
6320D6673K897r964k498j3303m3680k1927K8460J2015J4214M910j148j8376J5547
$$ 46673 49570 39606 37108 23805 -19875 -41802 -13342 -1327 12887 17797 16649 -1727 13820
6307A3820L957m3099k1588R862L930J4140M0987o79l4497J4409K8449m4922k1081
$$ 13820 17777 -25322 -46910 -37048 -33118 -18978 22009 21330 -13167 1242 29691 -15231 -36312
6294c6312J2465N068j0762M890K2447n030m728k1620K4340M8079k0505J1338j4922
$$ -36312 -23847 -18779 -29541 -24651 -2204 -7234 -11962 -33582 -9242 38837 18332 29670 14748
6281A4748N574j893k0391j0954j2662q508J9856M626o781o744J8271K9253J9859
$$ 14748 20322 18429 -1962 -12916 -25578 -34086 -14230 -9604 -16385 -23129 -4858 24395 44254
6268D4254L752j4450l0790k0009q050J501L1445m072P059J6701p050k2370N886
$$ 44254 48006 33556 2766 -17243 -25293 -23792 7653 3581 10640 27341 20291 -2079 3807
6255C807l962j9547l1784J5850j564k4886M477P493J3961J9919K2919L1236J3817
$$ 3807 -155 -19702 -51486 -35636 -37200 -62086 -57609 -50116 -36155 -16236 6683 37919 51736
6242E1736k2359m794J7482O670k9406j6934M3952j8886l2705J652k8119Q172N490
$$ 51736 29377 24583 42065 48735 19329 2395 46347 27461 -5244 -3592 -31711 -23539 -18049
6229a8049O566k7156j1961l264J5851K2783K9937K4164J4451k1569q040q423k0257
$$ -18049 -11483 -38639 -50600 -53864 -38013 -15230 14707 38871 53322 31753 23713 15290 -4967
6216d967k3706K3790l934J3791j6659j5864r207j5946J2043l0866N126L1760k1966
$$ -4967 -28673 -4883 -8817 4974 -11685 -27549 -36756 -52702 -40659 -71525 -66399 -34639 -56605
6203e6605j8749J9067j3123j0649J7761M06J7520K38O500O533J4456J5022k7488
$$ -56605 -75354 -56287 -69410 -80059 -62298 -61892 -44372 -44134 -37634 -31101 -16645 -1623 -29111
6190b9111j3905q80L0801J9468K9014J137j7887l1120K4763L975m7205j8776J4954
$$ -29111 -43016 -43896 -13095 6373 35387 36524 18637 -12483 12280 16255 -30950 -49726 -34772
6177c4772L3653J1426R25J9702J0106j8364n83k882m761r879j6716l4539J5052
$$ -34772 -1119 10307 11232 30934 41040 22676 22093 19211 14450 4571 -12145 -46684 -31632
6164c1632O663J2455J5105L1747K628k1845j6821q161J5246J267n031l0247O205
$$ -31632 -24969 -12514 2591 34338 36966 15121 -1700 -9861 5385 6652 1621 -28626 -22421
6151b2421r315j0839J6714J3855o466O209j1148J0405K1063K57l6602P165K434
$$ -22421 -31736 -42575 -25861 -12006 -18472 -12263 -23411 -13006 8057 8314 -28288 -21123 -18689
6138a8689k5009l37O2731J0887k6513J5980O677m5560j603K7943L846m4049N7430
$$ -18689 -43698 -44035 18696 29583 3070 19050 25727 -19833 -21436 6507 10353 -33696 23734
6125B3734J2419n8102m6963j7344J5234l744M917N1403Q7K3824P232j2329k6109
$$ 23734 36153 -21949 -68912 -86256 -71022 -74766 -69849 -18446 -18359 5465 12697 368 -25741
6112b5741J4301J8568j0392n2475J4848k3636J517K5877m941J0325J2639k182
$$ -25741 -11440 7128 -3264 -55739 -40891 -64527 -63010 -37133 -42074 -31749 -19110 -21292
6100b1292l491q89L0440j2009j7280j5560J0801p861k7369r132j5721J3818N5517
$$ -21292 -24783 -25672 4768 -7241 -24521 -40081 -29280 -37141 -64510 -73642 -89363 -75545 -20028
6087b0028j8951o449L7674K9062J9538L726k2652j8941J3161l7068K2334N552
$$ -20028 -38979 -45428 -7754 21308 40846 44572 21920 2979 16140 -20928 1406 6958
6075F958l679K4630j0515k4332P290L25J9941j7380N691k4434j8925J8470K4738
$$ 6958 3279 27909 17394 -6938 352 677 20618 3238 8929 -15505 -34430 -15960 8778
6062H778m324O729k6994j2386J6107N931p588n587l7819l9359L8157L7633J9537
$$ 8778 4454 11183 -15811 -28197 -12090 -6159 -13747 -19334 -57153 -96512 -58355 -20722 -1185
6049a185L972j3289R039M6294J0873j6086k3632m2922K900K5695j5319l9045J3369
$$ -1185 2787 -10502 -1463 44831 55704 39618 15986 -26936 -24036 1659 -13660 -52705 -39336
6036c9336Q362K328k0834k6008J4458J8812M1103P004Q963j819r29l3427L721
$$ -39336 -30974 -28646 -49480 -75488 -61030 -42218 -1115 5889 14852 13033 12104 -21323 -17602
6023a7602l1397o118j6180M305K4104K2227J5344k2432Q903J9794L6395P085J6548
$$ -17602 -48999 -55117 -71297 -66992 -42888 -20661 -5317 -27749 -18846 948 37343 44428 60976
6010F0976k2708k528l109k7065k9781N58N079J2679l5869j2259L4556J8130N963
$$ 60976 38268 35740 32631 5566 -24215 -23657 -18578 -5899 -41768 -54027 -19471 -1341 4622
5997D622O791j0923k6761O979K8753O762j2181p68k576j563n479l6907k7123K6960
$$ 4622 11413 490 -26271 -19292 9461 16223 4042 3274 698 -865 -6344 -43251 -70374 -43414
5983d3414Q433o55J0499J0721J3690k771l7683k1285j953M658K4741K1363Q479
$$ -43414 -34981 -35636 -25137 -14416 -726 -3497 -41180 -62465 -64418 -59760 -35019 -13656 -5177
5970e177q917k4417j1697q958J683J8052o002o336J6901K726o622K9085K1175
$$ -5177 -14094 -38511 -50208 -59166 -57483 -39431 -45433 -51769 -34868 -32142 -38764 -9679 11496
5957A1496j4418p777j9543k4668M810l790q945j6153J7667J4905k4127r703J9365
$$ 11496 -2922 -10699 -30242 -54910 -50100 -53890 -62835 -78988 -61321 -46416 -70543 -80246 -60881
5944f0881P505K0300l898L4485j601j9958R341L1017r13M554k7707l5304K5153
$$ -60881 -53376 -33076 -36974 -2489 -4090 -24048 -14707 16310 15397 19951 -7756 -43060 -17907
5931a7907J9604K4200n374k3594N888r071l2169j1477l1273K0030L7983K9410
$$ -17907 1697 25897 20523 -3071 2817 -6254 -38423 -49900 -81173 -61143 -23160 6250
5919F250p316l2200J345N378J8294J1053K578l8179p2840j0008N3428M357L3415
$$ 6250 -1066 -33266 -31921 -26543 -8249 2804 5382 -32797 -105637 -115645 -62217 -57860 -24445
5906b4445K7079j9680n090l862r753j3165j6132k4067K8205R337J0832L467m382
$$ -24445 2634 -17046 -22136 -25998 -35751 -48916 -65048 -89115 -60910 -51573 -40741 -37274 -41656
5893d1656l136p994o758J4068L424J2956q322o1179L0446N2051M0020o831j856
$$ -41656 -44792 -52786 -59544 -45476 -42052 -29096 -37418 -98597 -68151 -16100 23920 17089 15233
5880A5233k843k8481j2419L2936N183J8006J0610j2498l7965q722M904K5202k6605
$$ 15233 12390 -16091 -28510 4426 9609 27615 38225 25727 -12238 -20960 -16056 9146 -17459
5867a7459L179J1630J0828j8876n999l5343j7780J1579J48M6231O921k8507J1736
$$ -17459 -14280 -2650 8178 -10698 -16697 -52040 -69820 -58241 -58093 -11862 -4941 -33448 -21712
5854b1712j0936J0247K1966O050J2031K6819J8208k6565m3541m770P906J2037
$$ -21712 -32648 -22401 -435 5615 17646 44465 62673 36108 -7433 -12203 -4297 7740
5842G740K4055m349j8095k791J858l0195k8341J1903L1463q81J1043K1423L4107
$$ 7740 31795 27446 9351 6560 8418 -21777 -50118 -38215 -6752 -7633 3410 24833 58940
5829E8940J3104l8497l7742j778l5818J7956M3934l263n3019k4733J8307Q798
$$ 58940 72044 33547 -4195 -5973 -41791 -23835 20099 16836 -36183 -60916 -42609 -33811
5817c3811j9523J2253P205J2617j0806j4220M1100L3588Q998J233j5195N772j9552
$$ -33811 -53334 -41081 -33876 -21259 -32065 -46285 -5185 28403 37401 38634 23439 29211 9659
5804I659p061k1570m593K8976K7165k6057m1677J737p770m931M9545M1472J0095
$$ 9659 2598 -18972 -23565 5411 32576 6519 -35158 -33421 -41191 -46122 3423 44895 54990
5791E4990k4752l1015j4127o201j8183L3158L9983j8682k7922m069j2472J1141
$$ 54990 30238 -777 -14904 -21105 -39288 -6130 33853 15171 -12751 -16820 -29292 -18151
5779a8151j8407q682R895L8253K9496M034j1266l424r589j5302j1455j4955J7911
$$ -18151 -36558 -45240 -35345 2908 32404 36438 25172 21748 12159 -3143 -14598 -29553 -11642
5766a1642j1098m791L262j4824J667n852j7760K8913K8659K1871l107k7756j7158
$$ -11642 -22740 -27531 -24269 -39093 -37426 -43278 -61038 -32125 -3466 18405 15298 -12458 -29616
5753b9616J4058K1107k3241o0884K3309N1048m564j1137J5105L817j45n749M100
$$ -29616 -15558 5549 -17692 -78576 -55267 -4219 -8783 -19920 -4815 -998 -1143 -6892 -2792
5740b792L856r177P388j7968j860K9752M5114N663j0888l3636l8321M279k203
$$ -2792 1064 -8113 -725 -18693 -20553 9199 54313 59976 49088 15452 -22869 -18590 -20793
5727b0793m4063m776M0499K5576k1251j3033j8565L0576L0788k0065k7489K7991
$$ -20793 -64856 -69632 -29133 -3557 -24808 -37841 -56406 -25830 4958 -15107 -42596 -14605
5715a4605J1167k2671m724K0797k4440J523L5005K9391k594k1j0086q669j6033
$$ -14605 -3438 -26109 -30833 -10036 -34476 -32953 2052 31443 28849 28828 18742 10073 -5960
5702e960L40K3852j1817l048l3037J2470l1050j6068K2988k209k7421L062N2691
$$ -5960 -5620 18232 6415 3367 -29670 -17200 -48250 -64318 -41330 -43539 -70960 -67898 -15207
5689a5207J2487N44K5228j0807m8816j6810k5170L323K0041J7442r063L034N880
$$ -15207 -2720 -2176 23052 12245 -36571 -53381 -78551 -75228 -55187 -37745 -46808 -43774 -37894
5676c7894M9692k917l2012J3996n187j2463n416J0276K1419K641l522p886k7462
$$ -37894 11798 8881 -23131 -9135 -14322 -26785 -32201 -21925 -506 2135 -1387 -9273 -36735
5663c6735R297k487N875k338K5688M224K5065K1021l1424m3021o747l302L5251
$$ -36735 -27438 -29925 -24050 -26388 -700 3524 28589 49610 18186 -24835 -31582 -34884 367
5650C67k045p744j35Q382K3318m3034l3999j313J6652j4017j265R510M807R758
$$ 367 -1678 -9422 -9557 -1175 22143 -20891 -54890 -56203 -39551 -53568 -54833 -45323 -40516 -30758
5636c0758J9063M812K0614n82k3611O932P913j081j9119q403j6448J3834J5525
$$ -30758 -11695 -6883 13731 13149 -10462 -3530 4383 3302 -15817 -24220 -40668 -26834 -11309
5623a1309L094r422j7635m406k586J5557K7183J763l0571n036J8165J9915k2972
$$ -11309 -8215 -17637 -35272 -39678 -42264 -26707 476 2239 -28332 -33368 -15203 4712 -18260
5610a8260j3784j3124K4797K4139k1155k9386J2395K3267l376j010k520k922J9065
$$ -18260 -32044 -45168 -20371 3768 -17387 -46773 -34378 -11111 -14487 -15497 -18017 -20939 -1874
5597a874M5519Q625k0485m2991k864n727l434P900Q141m918J2181K936k5894m178
$$ -1874 43645 52270 31785 -11206 -14070 -19797 -23231 -15331 -7190 -12108 73 3009 -22885 -27063
5583b7063p19M9354K7275j9363r261q391k9524L2736J8456r408J3810J3512J2225
$$ -27063 -27782 21572 48847 29484 20223 11832 -17692 15044 33500 24092 37902 51414 63639
5570F3639k408o164m0892m9599l2940J2730L3865k820k1100K306K8481k481j7905
$$ 63639 61231 55067 14175 -35424 -68364 -55634 -21769 -24589 -45689 -43383 -14902 -17383 -35288
5557c5288J4680J9811k5193j7144J2938L574n918m554K1372K9367R876k463L0627
$$ -35288 -20608 -797 -25990 -43134 -30196 -26622 -32540 -37094 -15722 13645 23521 21058 51685
5544E1685n151N311N664n652j8659k6040k2267q865k6818j4568J8375m294l949
$$ 51685 46534 51845 57509 51857 33198 7158 -15109 -23974 -50792 -65360 -46985 -51279 -55228
5531e5228K2537K1663L283j881l330n568k6532l267j989M6136k3111j4506K0672
$$ -55228 -32691 -11028 -7745 -9626 -12956 -18524 -45056 -48323 -50312 -4176 -27287 -41793 -21121
5518b1121j1375J726L4925q297o762O38L6520R314k7572m76j3568n653j21k17
$$ -21121 -32496 -30770 4155 -4142 -10904 -10266 26254 35568 7996 7520 -6048 -11701 -11822 -12039
5504a2039j5478j5663J8730K9270j8095p687j100m376J932j7015N252K6868L7805
$$ -12039 -27517 -43180 -24450 4820 -13275 -20962 -22062 -26438 -24506 -41521 -36269 -9401 28404
5491B8404J4384n667j3660j1968l7507J2485N3126J0062j6229o08K828L2388l8525
$$ 28404 42788 37121 23461 11493 -26014 -13529 39597 49659 33430 32822 35650 68038 29513
5478B9513l0578j8932r712K8330J4634j2425k7039m3043j2965J9596M9539J4476
$$ 29513 -1065 -19997 -29709 -1379 13255 830 -26209 -69252 -82217 -62621 -13082 1394
5466A394L9856k7018l5284r930J5137J1005K4136k300l3533N033R283J3366l5776
$$ 1394 41250 14232 -21052 -30982 -15845 -4840 19296 16996 -16537 -11504 -2221 11145 -24631
5453b4631j4817l162K873L0054L681J5092L243o51K0590K287l3809j6891k001
$$ -24631 -39448 -42610 -39737 -9683 -6002 9090 12333 11682 32272 34559 750 -16141 -18142
5440a8142j9261j4723K7549K1733M8K4022j311j3134J3355l718j2293j0143j5283
$$ -18142 -37403 -52126 -24577 -2844 -2796 21226 19915 6781 20136 16418 4125 -6018 -21301
5427b1301J5231j955k9076j0947R719j9881M061R018J2291l0868k5J4091J659
$$ -21301 -6070 -8025 -37101 -48048 -38329 -58210 -54149 -45131 -32840 -63708 -63733 -49642 -47983
5414d7983k411J4280J1634k300k2263J1861J6946K5745L9059J6442j9575p388
$$ -47983 -50394 -36114 -24480 -26780 -49043 -37182 -20236 5509 44568 61010 41435 34047
5402C4047j7242k215K4882R773j6841P618K9773l0336j5888j2135j8324k1328
$$ 34047 16805 14590 39472 49245 32404 40022 69795 39459 23571 11436 -6888 -28216
5390b8216l4386l522J3438K8098k970j5326J1656M974K453k2241K5332J996j220
$$ -28216 -62602 -66124 -52686 -24588 -27558 -42884 -31228 -26254 -23801 -46042 -20710 -18714 -19934
5377a9934K6428K3030j192j2633m6275j4394L0063J3693K9399l3126k4573L7563
$$ -19934 6494 29524 28332 15699 -30576 -44970 -14907 -1214 28185 -4941 -29514 8049
5365H049j9420j5409J7192P941L1n0316j3406K5493J1038L341K0863K2127j9404
$$ 8049 -11371 -26780 -9588 -1647 -1616 -51932 -65338 -39845 -28807 -25466 -4603 17524 -1880
5352a880k998l2813K129N690m95J7891K5821o043J8053P507J794j4970l6124J7
$$ -1880 -4878 -37691 -35562 -29872 -30367 -12476 13345 7302 25355 32862 34656 19686 -16438 -16421
5338a6421J3128J3644J5582J6849j2575k1304r015r437M021k3189m3522J1790
$$ -16421 -3293 10351 25933 42782 30207 8903 -112 -9549 -5528 -28717 -72239 -60449
5326f0449L1071K2228j6484j6277J1272M0923k858Q26p91J4331k5919r046m966
$$ -60449 -29378 -7150 -23634 -39911 -28639 12284 9426 10252 9461 23792 -2127 -11173 -16139
5313a6139o255k3098r204o934K0030O167K5557M52k4399k3183j5727L7115P890
$$ -16139 -22394 -45492 -54696 -61630 -41600 -35433 -9876 -9424 -33823 -57006 -72733 -35618 -27728
5300b7728k8563K2297J9185k1593J6125J7935J9245J3002K741j0267J2084k5004
$$ -27728 -56291 -33994 -14809 -36402 -20277 -2342 16903 29905 32646 22379 34463 9459
5288I459J0092K2897j8630J6573N252k6110k7911j8632j5051K7290K7788k8959
$$ 9459 19551 42448 23818 40391 45643 19533 -8378 -27010 -42061 -14771 13017 -15942
5276a5942K1831N007l1396o856J1882j8907k04K0020K7260M1425j0996q003L944
$$ -15942 5889 10896 -20500 -27356 -15474 -34381 -34585 -14565 12695 54120 43124 35121 39065
5263C9065J1883r62l630J38m3290j0965L8631K2791r952k2614n47L034k6330k649
$$ 39065 50948 49986 46356 46494 3204 -7761 30870 53661 43709 21095 20548 23582 -2748 -5397
5249e397m2590L4094m245l673k362j9371K3103P729J4569J5102l5608L0115j4339
$$ -5397 -47987 -13893 -18138 -21811 -24173 -43544 -20441 -12712 1857 16959 -18649 11466 -2873
5236b873j24L3312k9209L367o257k3749P906Q606Q093K4641p445k6524k2019k6166
$$ -2873 -2997 30315 1106 4473 -1784 -25533 -17627 -9021 -928 23713 16268 -10256 -32275 -58441
5222e8441J3646J9011L330P90J0071J6465J1955K5087J071m7602k5498n6671j5413
$$ -58441 -44795 -25784 -22454 -21664 -11593 4872 16827 41914 42985 -4617 -30115 -86786 -102199
5209a02199K7789J558j6797l569K9576L2638p27J1106P119J3309l2382q383J9513
$$ -102199 -74410 -72852 -89649 -93218 -63642 -31004 -31731 -20625 -13506 -197 -32579 -40962 -21449
5196b1449r089L4829K5624q782k3177J626K2575j0307l1156J6556K323L604k540
$$ -21449 -30538 4291 29915 21133 -2044 -418 22157 11850 -19306 -2750 -427 3177 637
5183F37j7486k7493L7874J5788k4169O987J1382l3583K687J6525K5395l0452k740
$$ 637 -16849 -44342 -6468 9320 -14849 -7862 3520 -30063 -27376 -10851 14544 -15908 -18648
5170a8648k4562j2424P957L6880M4860R22q939M066J5418l507k7736k1533j0093
$$ -18648 -43210 -55634 -47677 -10797 34063 34985 26046 30112 45530 42023 14287 -7246 -17339
5157a7339R039K1521q02n007M107P593J2664j7876l0107J5520J441k0567m868
$$ -17339 -8300 13221 12419 7412 11519 19112 31776 13900 -16207 -687 754 -19813 -24681
5144b4681k4336L503K8615L5313Q728r254j1257n134J0543j1058n231l273Q081
$$ -24681 -49017 -45514 -16899 18414 27142 17888 6631 1497 12040 982 -4249 -7522 559
5131E59o397k1709l8710R807L6395l862k5476Q499q859j5115M482M306K9009J7492
$$ 559 -5838 -27547 -66257 -56450 -20055 -23917 -49393 -40894 -49753 -64868 -60386 -56080 -27071 -9579
5117i579j896J2606j324k4637K9961R303l5781J9491K0593P198K2106n718k4277
$$ -9579 -11475 1131 -193 -24830 5131 14434 -21347 -1856 18737 25935 48041 42323 18046
5104A8046m117J9799J9602K1061j5002m3315k9621n53K1997L4541J1697j5465
$$ 18046 13929 33728 53330 74391 59389 16074 -13547 -14100 7897 42438 54135 38670
5092C8670Q619k8066j4703j3422k5793j8196O075K5106J9624J9559j2506N851
$$ 38670 47289 19223 4520 -8902 -34695 -52891 -46816 -21710 -2086 17473 4967 10818
5080A0818j8941m492p166j4L03J6931K476n682j7593j3310k759L024J6667o0M089
$$ 10818 -8123 -12615 -19781 -19795 -19492 -2561 -85 -5767 -23360 -36670 -39429 -36405 -19738 -19798 -15709
5065a5709O384o962J2167K3744j4940k3475M853O188o475J3374k2808L057J0210
$$ -15709 -9325 -16287 -4120 19624 4684 -18791 -13938 -7750 -14225 -851 -23659 -20602 -10392
5052a0392K401K5884J738P769l030m647j0909j4926m04K2155j3238O600J4354
$$ -10392 -7991 17893 19631 27400 24370 19723 8814 -6112 -6516 15639 2401 9001 23355
5039B3355k9348q103j9929k7782n169J0748J7467K8222J5265j6447L7997k867
$$ 23355 -5993 -14096 -34025 -61807 -66976 -56228 -38761 -10539 4726 -11721 26276 23409
5027B3409l896q146j9005J5350K1650k1132j6860K0156M829K1278m152m3014K3069
$$ 23409 19513 11367 -7638 7712 29362 8230 -8630 11526 16355 37633 33481 -9533 13536
5014A3536K1057o158J491k1065L5638L6589j1404r011k6477l0350M913K812k3042
$$ 13536 34593 28435 29926 8861 44499 81088 69684 60673 34196 3846 8759 11571 -11471
5001a1471j5697K1434j323k983K4567N531p8o44j3343q326K2034j3335j8067J0219
$$ -11471 -27168 -5734 -7057 -10040 14527 20058 19980 19336 5993 -2333 19701 6366 -11701 -1482
4987a482J0761j1792P136K151K5859k9264l8421J9161L53K1532r79J1250j6040
$$ -1482 9279 -2513 4623 6774 32633 3369 -35052 -15891 -15538 5994 5015 16265 225
4974B25m7840r959L084J4565M3156J6671l5672j8946J0524L4739J3891l2087k670
$$ 225 -47615 -57574 -54490 -39925 3231 19902 -15770 -34716 -24192 10547 24438 -7649 -10319
4961a0319J3407O690k6913p267K0774p545k6767J844J4197k060K5706L4660k3299
$$ -10319 3088 9778 -17135 -24402 -3628 -11173 -37940 -36096 -21899 -23959 1747 36407 13108
4948A3108k8257j3429M251K4052k0912r980j976J6325J2455j0796K164P542o846
$$ 13108 -15149 -28578 -24327 -275 -21187 -31167 -33143 -16818 -4363 -15159 -12995 -5453 -12299
4935a2299J7187L0735j3618p059l4977k4296K1936J9546O076L9438p546l2648
$$ -12299 4888 35623 22005 14946 -20031 -44327 -22391 -2845 3231 42669 35123 2475
4923B475j8552J824j7938k4239K6058p204R42j0241P300N0952J8764k2072m3418
$$ 2475 -16077 -14253 -32191 -56430 -30372 -37576 -36634 -46875 -39575 11377 30141 8069 -35349
4910c5349j6199K3283P271L3774K3111P438Q51J2136Q878J7631j4793J6832k9426
$$ -35349 -51548 -28265 -20994 12780 35891 43329 44180 56316 65194 82825 68032 84864 55438
4897E5438J810M431r958k9756k4527j8963j9556j6659J3878r039J4129K9752K9111
$$ 55438 57248 61679 51721 21965 -2562 -21525 -41081 -57740 -43862 -52901 -38772 -9020 20091
4884B0091J151j4338J5250N617j4594m7734j0713L997K1392R119K1251O973r595
$$ 20091 21242 6904 22154 27771 13177 -34557 -45270 -41273 -19881 -10762 10489 17462 7867
4871G867k6698k870j639M5551j769k4135j124K4235J0044l3912m0331L725L1072
$$ 7867 -18831 -21701 -23340 22211 20442 -3693 -4817 19418 29462 -4450 -44781 -41056 -9984
4858i984M3220j3075N674M775J3223O16k7910j2647J4305l7443k2167J4392P786
$$ -9984 33236 20161 25835 30610 43833 44449 16539 3892 18197 -19246 -41413 -27021 -19235
4845a9235K994O485o16J0382j9022q315k4683L3083k8860k3534J1181L042L5901
$$ -19235 -16241 -9756 -10372 10 -19012 -27327 -52010 -18927 -47787 -71321 -60140 -57098 -21197
4832b1197L2735q000p778l7971P476J7530m413M8753P665l0972L2264J9124J7813
$$ -21197 11538 3538 -4240 -42211 -34735 -17205 -21618 27135 34800 3828 36092 55216 73029
4819G3029j1595l2530l3087j1225l9867j5311M0836L9742r701j0097L1321J8018
$$ 73029 61434 28904 -4183 -15408 -55275 -70586 -29750 9992 291 -9806 21515 39533
4807C9533j8220j4782k9242K2728L6021l8667K850L382k7341R109J7417j1660
$$ 39533 21313 6531 -22711 17 36038 -2629 221 3603 -23738 -14629 2788 -8872
4795h872K983K568K6241o94j0120n962j8898J0567m256j7168J7602q523L424p365
$$ -8872 -5889 -3321 22920 22226 12106 6144 -12754 -2187 -6443 -23611 -6009 -14532 -11108 -18473
4781a8473q353M1748j1311k656M0584j7336l1365k5231j1912J8304k317K8223
$$ -18473 -26826 14922 3611 955 41539 24203 -7162 -32393 -44305 -26001 -28318 -95
$$ [...]
##END NTUPLES=NMR SPECTRUM
##END=
